##TITLE=NES1028_10332_9268290_OmHLmCDfxT
##JCAMPDX= 6.0         $$ Bruker NMR JCAMP-DX V2.0
##DATA TYPE= NMR SPECTRUM
##DATA CLASS= NTUPLES
##ORIGIN= BRUKER
##OWNER= Administrator
$$ 1.72 TOPSPIN		Version 2.1
$$ 2015-07-10 20:58:05.863 -0700  Administrator@X
$$ Compression mode = diff/dup
##.OBSERVE FREQUENCY= 400.02188249412
##.OBSERVE NUCLEUS= ^1H
##.ACQUISITION MODE= SIMULTANEOUS (DQD)
##.ACQUISITION SCHEME= undefined
##.AVERAGES= 64
##.DIGITISER RES= 22
##SPECTROMETER/DATA SYSTEM= spect
##.PULSE SEQUENCE= noesygpps1d.comp
##.SOLVENT NAME= COFFEE_meoh
##.SHIFT REFERENCE= INTERNAL, COFFEE_meoh, 1, 14.9634
##AUDIT TRAIL= $$ (NUMBER, WHEN, WHO, WHERE, PROCESS, VERSION, WHAT)
$$ ##TITLE= Audit trail, TOPSPIN		Version 2.1
$$ ##JCAMPDX= 5.01
$$ ##ORIGIN= Bruker BioSpin GmbH
$$ ##OWNER= Administrator
$$ $$ E:\/data/COFFEE/nmr/NES1028_10332_9268290_OmHLmCDfxT/12/pdata/1/auditp.txt
$$ ##AUDIT TRAIL=  $$ (NUMBER, WHEN, WHO, WHERE, PROCESS, VERSION, WHAT)
(   1,<2015-07-10 20:58:00.425 -0700>,<Administrator>,<X>,<go>,<TOPSPIN 2.1>,
      <created by zg
	started at 2015-07-10 20:46:30.956 -0700,
	POWCHK enabled, PULCHK disabled,
       configuration hash MD5:
       21 0F 79 D6 B3 7B B4 F6 88 20 88 DB 03 48 BD 9F
       data hash MD5: 64K
       31 DF 8C F7 AD 48 00 28 E7 F7 08 D9 BE B8 66 52>)
(   2,<2015-07-10 20:58:03.738 -0700>,<Administrator>,<X>,<proc1d>,<TOPSPIN 2.1>,
      <Start of raw data processing
       efp LB = 0.3 FT_mod = 6 PKNL = 1 PHC0 = 0 PHC1 = 0 SI = 128K 
       data hash MD5: 128K
       50 06 5A D1 58 32 35 77 D6 05 F0 B3 2A 64 6E 13>)
(   3,<2015-07-10 20:58:04.644 -0700>,<Administrator>,<X>,<proc1d>,<TOPSPIN 2.1>,
      <pk PHC0 = -85.14404 PHC1 = 0 
       data hash MD5: 128K
       66 82 F7 9F FA 5C 3C C7 DA 4D 53 18 C9 CB 4D C3>)
(   4,<2015-07-10 20:58:05.035 -0700>,<Administrator>,<X>,<proc1d>,<TOPSPIN 2.1>,
      <abs ABSG = 1 
       data hash MD5: 128K
       1C 56 4F C6 20 B4 E3 DD E8 69 34 18 AB 95 B3 AA>)
(   5,<2015-07-10 20:58:05.144 -0700>,<Administrator>,<X>,<proc1d>,<TOPSPIN 2.1>,
      <abs ABSG = 2 
       data hash MD5: 128K
       55 5B F9 13 D6 4E D5 E9 8A 63 A8 1F 92 D2 38 DB>)
(   6,<2015-07-10 20:58:05.222 -0700>,<Administrator>,<X>,<proc1d>,<TOPSPIN 2.1>,
      <abs ABSG = 3 
       data hash MD5: 128K
       73 5A 62 41 F8 7D DE 05 DC F5 35 A9 14 59 DE 4F>)
(   7,<2015-07-10 20:58:05.316 -0700>,<Administrator>,<X>,<proc1d>,<TOPSPIN 2.1>,
      <abs ABSG = 4 
       data hash MD5: 128K
       E9 11 E0 92 12 E3 81 2B D4 09 E7 EB E5 08 2C D0>)
(   8,<2015-07-10 20:58:05.410 -0700>,<Administrator>,<X>,<proc1d>,<TOPSPIN 2.1>,
      <abs ABSG = 5 
       data hash MD5: 128K
       6C 30 EF 86 90 BC FE A0 A2 FB 63 98 FD 3B 25 79>)
$$ ##END=
$$ 
$$ $$ hash MD5
$$ $$ AC 88 B1 C7 EE 5A C2 6F 74 9B B5 B9 04 A2 7A C0
##$RELAX= 
##$RELAX= 
##$RELAX= 
##$RELAX= 
##$RELAX= 
##$RELAX= 
##$RELAX= 
##$RELAX= 
$$ Bruker specific parameters
$$ --------------------------
##$DU= <E:\>
##$EXPNO= 12
$$ [...]
150 150 150 150 150 150 150 150
##$TP07= 0
##$TPNAME0= <>
##$TPNAME1= <>
##$TPNAME2= <>
##$TPNAME3= <>
##$TPNAME4= <>
##$TPNAME5= <>
##$TPNAME6= <>
##$TPNAME7= <>
##$TPOAL= (0..7)
0.5 0.5 0.5 0.5 0.5 0.5 0.5 0.5
##$TPOFFS= (0..7)
0 0 0 0 0 0 0 0
##$TUNHIN= 0
##$TUNHOUT= 0
##$TUNXOUT= 0
##$USERA1= <user>
##$USERA2= <user>
##$USERA3= <user>
##$USERA4= <user>
##$USERA5= <user>
##$V9= 5
##$VALIST= <valist>
##$VCLIST= <CCCCCCCCCCCCCCC>
##$VD= 0
##$VDLIST= <DDDDDDDDDDDDDDD>
##$VPLIST= <PPPPPPPPPPPPPPP>
##$VTLIST= <TTTTTTTTTTTTTTT>
##$WBST= 2048
##$WBSW= 25
##$XGAIN= (0..3)
0 0 0 0
##$XL= 0
##$YL= 0
##$YMAX_a= 6900226
##$YMIN_a= -14638756
##$ZGOPTNS= <>
##$ZL1= 120
##$ZL2= 120
##$ZL3= 120
##$ZL4= 120
##$ABSF1= 14.9634
##$ABSF2= -5.594782
##$ABSG= 5
##$ABSL= 3
##$ALPHA= 0
##$AQORDER= 0
##$ASSFAC= 0
##$ASSFACI= 0
##$ASSFACX= 0
##$ASSWID= 0
##$AUNMP= <proc_prof1d_extract.lims>
##$AXLEFT= 0
##$AXNAME= <>
##$AXNUC= <1H>
##$AXRIGHT= 0
##$AXTYPE= 0
##$AXUNIT= <>
##$AZFE= 0.1
##$AZFW= 0.1
##$BCFW= 0
##$BC_mod= 0
##$BYTORDP= 0
##$COROFFS= 0
##$CY= 15
##$DATMOD= 1
##$DC= 0
##$DFILT= <>
##$DTYPP= 0
##$F1P= 0
##$F2P= 0
##$FCOR= 0.5
##$FTSIZE= 131072
##$FT_mod= 6
##$GAMMA= 0
##$GB= 0
##$INTBC= 1
##$INTSCL= 1
##$ISEN= 128
##$LB= 0.3
##$LEV0= 0
##$LPBIN= 0
##$MAXI= 10000
##$MC2= 0
##$MEAN= 0
##$ME_mod= 0
##$MI= 0
##$NCOEF= 0
##$NC_proc= -2
##$NLEV= 6
##$NOISF1= 0
##$NOISF2= 0
##$NSP= 0
##$NTH_PI= 0
##$NZP= 0
##$OFFSET= 14.9634
##$PC= 1
##$PHC0= -85.14404
##$PHC1= 0
##$PH_mod= 1
##$PKNL= yes
##$PPARMOD= 0
##$PPDIAG= 0
##$PPIPTYP= 0
##$PPMPNUM= 2147483647
##$PPRESOL= 1
##$PSCAL= 4
##$PSIGN= 0
##$PYNMP= <proc.py>
##$REVERSE= no
##$SF= 400.020008676491
##$SI= 131072
##$SIGF1= 0
##$SIGF2= 0
##$SINO= 400
##$SIOLD= 131072
##$SPECTYP= <>
##$SREGLST= <1H.CDCl3>
##$SSB= 0
##$STSI= 131072
##$STSR= 0
##$SW_p= 8223.68421052631
##$SYMM= 0
##$S_DEV= 0
##$TDeff= 65536
##$TDoff= 0
##$TI= <>
##$TILT= no
##$TM1= 0
##$TM2= 0
##$TOPLEV= 0
##$USERP1= <user>
##$USERP2= <user>
##$USERP3= <user>
##$USERP4= <user>
##$USERP5= <user>
##$WDW= 1
##$XDIM= 131072
##$YMAX_p= 412934936
##$YMIN_p= -10734
##$CURPLOT= <Network HP LaserJet P1505>
##$CURPRIN= <$Network HP LaserJet P1505>
##$DFORMAT= <normdp>
##$LAYOUT= <+/1D_H.xwp>
##$LFORMAT= <normlp>
##$PFORMAT= <normpl>
##$SURQMSG= 1
$$ End of Bruker specific parameters
$$ ---------------------------------
##NTUPLES= NMR SPECTRUM
##VAR_NAME=  FREQUENCY,     SPECTRUM/REAL,   SPECTRUM/IMAG
##SYMBOL=    X,             R,               I
##VAR_TYPE=  INDEPENDENT,   DEPENDENT,       DEPENDENT
##VAR_FORM=  AFFN,          ASDF,            ASDF
##VAR_DIM=   131072,        131072,          131072
##UNITS=     HZ,            ARBITRARY UNITS, ARBITRARY UNITS
##FACTOR=    0.0627417313425164, 1,          1
##FIRST=     8223.62146879497, -902,         -48494
##LAST=      0,             1009,            -49480
##MIN=       0,             -10734,          0
##MAX=       8223.62146879497, 412934936,    0
$$ Real data points
##PAGE= N=1
##DATA TABLE= (X++(R..R)), XYDATA
$$ [...]
64616 65676 67172 68425 69193 69260 68544 67283 65954 64938 64366 64256 64498 64621 64013 62668 61417 61062 61564
64599 61564 62391 63310 64299 65036 65175 64977 64982 65143 64983 64565 64474 64769 64831 64442 64145 64161 63864 62904 62045 62120 62743
64578 62743 62869 62269 61685 61746 62359 63089 63536 63464 63010 62682 62785 63038 63096 63160 63641 64459 65138 65371 65126 64471
64558 64471 63741 63532 63993 64474 64401 64175 64562 65543 66510 67327 68251 68944 68582 67134 65675 65122 65276 65391 65044
64539 65044 64235 63217 62539 62707 63437 63725 62989 61728 60799 60474 60489 60580 60592 60417 60192 60242 60587 60816 60752 60807
64519 60807 61344 62051 62351 62153 61738 61210 60547 59990 59832 59894 59688 59130 58691 58780 59304 59879 60210 60208 59999 59876
64499 59876 60016 60180 59926 59151 58223 57589 57455 57858 58711 59636 60051 59765 59324 59457 60210 60904 60963 60510 60061
64480 60061 59862 59776 59642 59493 59405 59340 59184 58859 58416 58078 58056 58186 57901 56891 55677 55144 55483 56009 56178 56311
64460 56311 57056 58491 60062 61094 61073 59853 58055 56982 57513 59132 60516 61021 61157 61681 62759 64057
64444 64057 65084 65357 64737 63799 63426 63829 64357 64476 64445 64729 65226 65558 65782 66223 66743 66733 65928 64852 64242
64425 64242 64347 64889 65455 65672 65204 63992 62586 61905 62382 63444 64141 64200 64148 64383 64597 64382 63970 63939 64419
64406 64419 65016 65326 65130 64292 63025 62161 62459 63520 63971 62938 60896 58936 57735 57464 58090 59291 60448
64389 60448 61184 61707 62314 62890 63279 63770 64697 65802 66502 66646 66509 66184 65550 64856 64765 65608 66960 68042
64371 68042 68317 67710 66630 65802 65629 65644 65056 64003 63704 64999 67174 68779 69343 69666 70522 71724 72612
64354 72612 72868 72559 71825 70961 70507 70762 71321 71505 71236 71068 71383 71993 72623 73310 74053 74511 74442 74194 74371
64335 74371 75161 76315 77594 78863 79904 80640 81513 83097 85229 86977 87654 87508 87181 86852 86259 85338 84489
64318 84489 84205 84646 85552 86442 86944 86978 86655 86106 85545 85356 85745 86350 86543 86203 85803 85614 85245 84243 82795
64299 82795 81526 80883 81000 81876 83254 84598 85603 86575 87861 89118 89722 89825 90387 91947 93913 95347
64283 95347 96081 96698 97729 99308 101469 104248 107344 109997 111529 111934 111808 111665 111498 111062 110400 109816 109294
64266 109294 108296 106395 103954 101894 100762 100247 99662 98673 97490 96523 95982 95743 95447 94799 93858 93033 92731
64249 92731 93028 93668 94303 94701 94841 94925 95292 96184 97527 98976 100238 101441 103136 105766 109071 112122 114157
64232 114157 115335 116491 118230 120452 122709 124606 125757 125816 124982 124199 124324 125161 125774 125731 125474 125330 124815
64215 124815 123366 121312 119564 118560 118048 117737 117648 117853 118413 119553 121452 123824 126152 128347 130616 132687
64199 132687 133872 134144 134401 135263 136246 136687 136877 137518 138514 139149 139266 139404 139757 139776 138993 137657 136377 135592
64181 135592 135488 135866 135985 135115 133502 132261 132004 132025 131259 129661 128188 127613 127820 128243 128659 129395 130874
64164 130874 133094 135678 138483 141939 146521 152032 157737 163158 168412 173872 179975 187328 196427 207066
64150 207066 218441 229992 241749 253755 265603 276716 286576 294507 299784 302367 303043 302468 300495
64137 300495 296806 291679 285581 278395 269733 259822 249528 239601 230379 222063 214747 208193 202020 196137
64123 196137 190661 185514 180451 175414 170553 166009 162036 159146 157679 157289 157244 157120 156810 156140 155076 154251
64107 154251 154543 156006 157821 159462 161308 163780 166546 169129 171870 175539 180063 184332 187559 190380
64093 190380 194167 199385 205055 209983 214138 218423 223318 228257 232399 235457 237529 238598 238610 237711 235989
64078 235989 233297 229801 226382 223876 222016 219705 216289 212077 207681 203561 200185 197910 196409 194818
64064 194818 192793 190977 190088 190014 190175 190410 191057 192397 194404 196881 199520 201946 204062 206306 209316 213399
64048 213399 218434 224174 230458 237270 244715 252801 261121 268996 276134 282976 290125 297619 304999 311981
64034 311981 318709 325395 332005 338400 344592 350774 357162 363845 370745 377815 385268 393474 402507 411884
64020 411884 420858 428848 435487 440425 443364 444285 443504 441498 438772 435825 433018 430413 427851 425247 422835
64005 422835 421117 420536 421107 422368 423854 425618 428136 431699 436161 441382 447565 454893 463105 471824 481200
63990 481200 491820 504045 517740 532665 548777 566161 585079 606173 630132 656879 685456
63979 685456 715054 745881 778705 813872 851339 891490 935252 983296 1035601 1092100 1153339
63968 1153339 1220289 1293959 1375742 1467996 1573905 1696838 1840262 2008278 2205819 2438158
63958 2438158 2710414 3027547 3394234 3814098 4288681 4817067 5396336 6022412 6690726
63949 6690726 7396255 8132686 8890950 9657882 10415941 11144490 11822351 12430675 12954853
63940 12954853 13384794 13713967 13938025 14053530 14057083 13945543 13717743 13376820 12931525 12395766
63930 12395766 11787018 11124358 10426406 9709588 8987428 8270890 7569081 6889894 6240836
63921 6240836 5629588 5063266 4546577 4080800 3664687 3295925 2971402 2686777 2437016
63912 2437016 2217789 2025994 1858845 1712956 1584675 1471125 1370626 1282127 1204331 1135384
63902 1135384 1073356 1016980 965763 919344 876929 837473 800228 764860 731103 698597 667038
63891 667038 636323 606553 578010 551047 525840 502305 480336 459965 441161 423619 406996
63880 406996 391168 376113 361710 347918 334966 323095 312258 302330 293397 285525 278424 271745
63868 271745 265534 260007 254968 249891 244563 239255 234318 229970 226474 224071 222717 222122 222021 222136 222065
63853 222065 221695 221573 222304 223607 224520 224570 224123 223586 222945 222280 222002 222168 222061 220851 218270 214436 209583
63836 209583 204363 199859 196626 193982 190743 186468 181609 176733 172157 168181 165076 162723 160620 158390
63822 158390 156036 153676 151230 148458 145262 141950 139151 137271 135996 134572 132706 130930 129937 129788 129922
63807 129922 129684 128672 126913 124983 123726 123513 123912 124287 124472 124610 124652 124389 123761 122752 121146 118880 116539
63790 116539 115008 114551 114527 114076 112874 111213 109645 108602 108078 107615 106798 105798 105279 105681 106715 107590 107671
63773 107671 106958 105994 105302 104915 104531 104108 103978 104233 104332 103702 102541 101667 101639 102350 103394 104405 105054 105167
63755 105167 105053 105398 106545 108096 109403 110320 111206 112265 113234 113821 114283 115339 117492 120626 124286 128204
63739 128204 132447 137233 142854 149689 157964 167433 177503 187753 198168 208917 220142 231934 244068
63726 244068 255580 264988 271251 274344 274754 272811 268837 263591 257918 252002 245406 237913 229906 221803
63712 221803 213503 204687 195475 186491 178311 171075 164731 159415 155323 152230 149474 146633 143972 141922
63698 141922 140332 138736 137286 136795 137613 138974 139862 140210 140811 142263 144466 147062 150031 153742 158589
63683 158589 164607 171424 178751 186897 196510 207671 219611 231482 242986 253907 263460 270659 275156
63670 275156 277224 277051 274531 269720 263002 254716 244973 233975 222286 210745 200233 191358 184089
63657 184089 177767 171734 165909 160584 155937 152086 149377 148061 147730 147618 147515 147893 149016 150430 151597
63642 151597 152615 153958 155711 157480 159050 160939 164159 169437 176590 184674 192787 200737 208952 217919
63628 217919 227841 238698 250476 263342 277616 293370 309946 325990 340116 351434 359558 364521
63616 364521 366910 367646 367285 365790 363199 360110 357132 354409 352153 351109 351661 352825 353050 351971 350454
63601 350454 348893 346375 341831 335282 327570 319525 311798 304985 299327 294401 289401 283653 276925 269637
63587 269637 262816 257384 253373 250188 247574 245769 244682 243672 242453 241568 241609 242501 243973 246174 249352
63572 249352 253421 258314 264399 272030 281064 291305 303025 316447 331055 346011 361032 376177
63560 376177 390934 404179 415096 423625 429965 434184 436408 436962 436149 434292 432205 431294 432893 437444
63546 437444 444356 452539 461107 469702 478233 486377 493520 499182 503226 505509 505657 503434 499021 492568
63532 492568 483681 471814 457036 440041 421579 402350 383323 365513 349202 333763 318447 303140
63520 303140 288296 274467 262092 251460 242670 235679 230422 226775 224407 222877 221836 220955 219731
63507 219731 217751 215220 212912 211452 210883 210993 211720 213077 215004 217557 221055 225769 231627 238486 246550
63492 246550 256250 267748 280748 294700 309043 323362 337588 351925 366260 379626 390505 397762
63480 397762 401146 400929 397435 391118 382809 373521 363947 354225 344140 333508 322504 311761 302026
63467 302026 293548 285831 278131 270153 262134 254418 247196 240676 235162 230867 227836 226125 225862 226940
63453 226940 228805 230759 232482 234162 236217 238980 242651 247413 253514 261155 270285 280569 291688 303599
63439 303599 316439 330352 345640 362836 382220 403260 424904 446427 467524 487555 505366
63428 505366 520133 531814 540404 545317 546106 543474 538967 533865 528830 524266 520350 516828 513419 510307
63414 510307 507694 505005 501210 495836 488962 480330 469297 455851 440934 425532 410123 395158 381285
63401 381285 368687 356910 345800 335972 327837 320794 314034 307700 302603 299106 296870 295482 294758 294629
63387 294629 295246 297020 300130 304183 308846 314518 321821 330615 340152 350186 361294 374098 388717
63374 388717 405077 423180 442789 463221 483647 503291 521210 536298 547867 556071 561579 564933
63362 564933 566408 566307 565063 563043 560436 557488 554736 552748 551498 550132 547527 543041 536579 528158
63348 528158 517830 505966 493127 479520 465011 449838 434854 420784 407699 395503 384415
63337 384415 374455 364929 355151 345496 337027 330132 324202 318712 314003 310681 308711 307391 306012 304336
63323 304336 302645 301463 301105 301394 301919 302497 303203 304032 304841 305629 306628 308053 309930 312173 314569 316724
63307 316724 318265 319115 319393 319058 317946 316173 314295 312944 312372 312286 312064 311270 310158 309482 309637 310271 311039
63290 311039 312328 314594 317205 318757 318678 317883 317556 317905 318446 318947 319525 320127 320482 320462 320110 319402 318382 317492
63272 317492 317383 318228 319401 319932 319257 317597 315755 314546 314333 315054 316596 318859 321384 323291 323975 323826
63256 323826 323883 324751 326159 327677 329449 331879 334884 337985 341107 344744 349148 353779 357953 361715 365697
63241 365697 370316 375646 381882 389373 398116 407782 418312 429980 442770 456291 470523 485938 502499
63228 502499 519263 535557 551931 569176 586859 603803 619786 635805 652595 669800 686848
63217 686848 703844 721230 739127 757442 776176 795287 814556 833869 853260 872298 889657
63206 889657 903658 913153 917759 917399 911907 901059 884960 864409 840797 815425 789007 762042
63194 762042 735463 710421 687391 666013 646037 627977 612613 600199 590480 583229 578488 576421
63182 576421 577113 580397 585799 592850 601506 612025 624372 638060 652677 668212 684720 702053 720106
63169 720106 738923 758262 777342 795411 812383 828657 844489 859797 874332 887640 898920
63158 898920 907250 911995 912910 909873 902686 891069 874867 854493 831240 806862 782601 758728 735102
63145 735102 711847 689264 667494 646682 627328 610089 595273 582765 572296 563405 555301 547285
63133 547285 539515 533021 528679 526331 525113 524516 524785 526196 528275 530176 531752 533797 536974 540921 544786
63118 544786 548338 552015 556045 560186 564303 568524 572689 576319 579450 582859 587009 591248 594546 596625
63104 596625 597822 598234 597641 596130 594165 592060 589812 587465 585180 582937 580570 578191 576269 575194 574968
63089 574968 575328 575978 576781 577960 580066 583472 587885 592546 596825 600512 603673 606555 609524 612789 616234
63074 616234 619776 623752 628597 634229 640188 646402 653381 661505 670523 679975 689844 700453 711890 723822
63060 723822 735940 748443 761922 776734 792580 808893 825713 843910 864395 887306 912295
63049 912295 939368 969006 1001401 1036045 1072284 1109957 1149222 1189919 1231458 1273328 1315474
63038 1315474 1358006 1400636 1442631 1483427 1523243 1562966 1603427 1644882 1687149 1730017 1773382
63027 1773382 1816959 1859794 1900001 1935134 1963144 1982971 1994004 1995212 1985411 1964520 1933957 1895497
63015 1895497 1850154 1798570 1742028 1682546 1622188 1562679 1505444 1451516 1401530 1356110 1315971
63004 1315971 1281279 1251284 1225235 1203457 1186916 1175911 1169881 1168355 1171303 1178464 1189111 1202671
62992 1202671 1218967 1237619 1257900 1279456 1302519 1327024 1352076 1376761 1400957 1424845 1448086
62981 1448086 1470126 1490952 1510800 1529136 1544520 1555571 1561647 1562465 1557477 1545828 1526760 1499961
62969 1499961 1465700 1424844 1378755 1329077 1277490 1225431 1173849 1123185 1073612 1025386 979091
62958 979091 935629 895825 859828 827033 796793 769069 744029 721230 699818 679594 661251
62947 661251 645232 630869 617121 603766 591337 580123 569780 559864 550261 540990 531898 522665
62935 522665 513046 503159 493645 485299 478276 471862 465317 458776 452904 447842 442991 437937 433025 428771
62921 428771 425025 421079 416471 411458 406725 402834 399946 397896 396344 394817 392782 390069 387271 385452
62907 385452 385110 385557 385590 384721 383467 382477 381713 380595 378686 376121 373430 371001 368568 365323 360690 355005
62891 355005 349236 344128 339877 336481 333895 331736 329377 326696 324367 323041 322527 322216 322012 322235 322635
62876 322635 322202 320295 317531 315178 313903 313473 313462 313732 314148 314299 313847 312993 312268 311870 311472 310788 310129 310137
62858 310137 310987 312124 312943 313555 314662 316746 319626 322812 325946 328737 330794 331999 332957 334582 337056
62843 337056 339495 340899 341197 341112 341181 341301 341161 340704 339960 338762 336938 334685 332450 330430 328382 326028
62827 326028 323494 321175 319209 317276 315052 312730 310892 309838 309227 308517 307562 306644 306052 305877 306136 306818
62811 306818 307755 308763 309994 311876 314513 317394 319978 322424 325435 329421 334157 339292 344841 350929
62797 350929 357324 363591 369707 376187 383482 391469 399829 408779 419170 431777 446813 464226 484199
62784 484199 506995 532451 560087 589801 622189 658050 697895 742076 791143 845741 906275
62773 906275 972811 1045010 1121825 1201436 1281927 1361965 1440416 1515354 1584113 1644492 1695394
62762 1695394 1735976 1764716 1779945 1781074 1768735 1743935 1707707 1661517 1607269 1546644 1480925
62751 1480925 1411684 1341037 1270746 1201444 1133210 1066597 1002632 942045 885100 832096 783394
62740 783394 738891 697917 659863 624656 592548 563796 538499 516313 496283 477446 459797
62729 459797 444196 431115 419964 409863 400568 392248 384873 378383 373068 369104 365929 362828 360071
62716 360071 358776 359486 361465 363629 365744 368459 372543 378266 385282 392933 400993 410264 422128 437252
62702 437252 455019 474442 495407 518754 545361 575530 609210 646483 687631 732799 781681
62691 781681 833702 888561 946342 1006721 1068044 1127498 1182318 1230631 1271295 1303476 1326668
62680 1326668 1340705 1345401 1340394 1325584 1301480 1268896 1228692 1182189 1131460 1078668 1025140 971439
62668 971439 918159 866161 816158 768581 723895 682521 644446 609352 577251 548456 522746
62657 522746 499111 476715 455741 436854 420122 404969 391011 378360 367002 356394 345997
62646 345997 336002 327177 319981 314041 308578 303190 298079 293586 289669 285900 281863 277466 273004 269000
62632 269000 265836 263394 261126 258707 256514 255201 254818 254675 254179 253471 253019 252789 252167 250676 248561 246633
62616 246633 245606 245590 246115 246661 247249 248513 251104 255034 259616 264044 268023 271866 276103 281061 286914
62601 286914 294028 302964 313976 326716 340763 356291 373790 393257 414289 437166 463230 493658
62589 493658 528205 565636 605041 646042 687882 729123 768411 804905 837745 865714 887838
62578 887838 903884 913802 917028 912930 901803 884931 863656 838774 810859 780723 749344 717550
62566 717550 685907 654851 624817 596286 569659 544958 521731 499467 478118 457994 439146
62555 439146 421181 403838 387509 372868 359973 347982 335922 323687 312183 302438 294679 288321
62543 288321 282726 277727 273400 269656 266323 263448 261235 259691 258574 257692 257064 256804 257121 258413 261041
62528 261041 264863 269226 273616 278110 283064 288520 294210 300030 306251 313258 321330 330722 341772 354721
62514 354721 369509 385896 403830 423656 445887 470860 498573 528753 560867 594085 627403
62503 627403 659936 690995 719783 745182 765966 781246 790636 794144 792012 784572 772203 755491
62491 755491 735400 712935 688484 661922 633756 605770 579922 556706 535189 514604 495239
62480 495239 477691 461990 447811 435024 423611 413436 404403 396551 389696 383386 377507 372539 368827
62467 368827 366053 363807 362243 361575 361405 361295 361791 363940 367727 371747 374738 376894 379339 382719 386657
62452 386657 390311 393133 395165 396778 398104 398744 398102 395922 392268 387172 380688 373274 365624 357949 349843
62437 349843 341151 332635 325393 319743 314981 310257 305436 300961 297078 293493 289995 287151 285900 286378
62423 286378 287632 288907 290761 294342 299739 305756 311367 316711 322410 328483 334423 340005 345512 351220
62409 351220 356962 362275 366866 370922 374929 379040 382638 384724 384888 383770 382540 381979 381985 381762 380483 377992
62393 377992 374859 371604 368066 363917 359678 356576 355216 354940 354810 354788 355556 357576 360919 365807 372719
62378 372719 381845 392791 405015 418375 433204 450039 469405 491629 516645 543993 573204 604243
62366 604243 637442 672755 709155 745063 779421 812052 842791 870639 894141 912284 924660
62355 924660 931027 931367 926339 917134 904791 890098 873930 856974 838969 818949 796565 772640
62343 772640 748227 723760 699519 676249 654692 634921 616710 600243 585845 573282 561902
62332 561902 551301 541409 532177 523783 516968 512461 509990 508353 506604 504792 503511 503148 503656 504664
62318 504664 505598 505941 505583 504747 503521 501611 498593 494317 489037 483266 477429 471613 465732 460021 455104
62303 455104 451359 448479 445940 443734 442238 441529 441275 441237 441440 441775 441908 441752 441695 442115 442925 443857 445022
62286 445022 446931 449922 453764 457907 462103 466661 472009 478064 484258 490245 496372 503304 511388 520564
62272 520564 530757 542107 554926 569646 586772 606685 629495 655092 683237 713587 745916
62261 745916 780388 817144 855202 892041 924805 951987 973687 990417 1002185 1008756 1010338 1007689
62249 1007689 1001638 992581 980344 964591 945525 924117 901558 878610 855682 833304 812139 792599
62237 792599 774826 759010 745321 733529 723145 714103 706905 701782 697995 694342 690301 686407 683464
62224 683464 681650 680540 679799 679490 679656 679968 680106 680290 681034 682467 684348 686757 690180 694759 700001 705582
62208 705582 711943 719647 728522 737949 747782 758551 770942 785473 802422 821581 842219 863756
62196 863756 886420 910906 937512 965924 995578 1025733 1055246 1082713 1106887 1126838 1142028
62185 1142028 1152550 1159023 1161910 1161391 1158378 1155103 1153893 1155635 1160094 1167285 1177544 1190571 1205605
62172 1205605 1222677 1242599 1265455 1290012 1314815 1338908 1361191 1380239 1395460 1407735 1418278
62161 1418278 1427497 1435458 1442719 1449866 1456594 1461915 1465007 1465475 1463270 1459006 1454031 1449594 1446200 1444175
62147 1444175 1444392 1447674 1453673 1461065 1468879 1477156 1486297 1496295 1506767 1517482 1528740 1541262 1555552
62134 1555552 1571294 1587654 1604273 1621637 1640206 1659650 1679306 1699075 1719378 1740437 1762106
62123 1762106 1784243 1806880 1830095 1854064 1879057 1905026 1931285 1957026 1982071 2006889 2031961
62112 2031961 2057457 2083391 2109718 2136326 2163205 2190578 2218657 2247396 2276768 2307116 2338866
62101 2338866 2371988 2406076 2440959 2476968 2514681 2554686 2597560 2643760 2693315 2745665 2799698
62090 2799698 2853864 2906469 2956328 3003425 3049017 3094951 3142514 3191515 3240287 3286626 3328645
62079 3328645 3364699 3393093 3412821 3424772 3431571 3435932 3439482 3443045 3447097 3451438 3455125 3457302 3457616
62066 3457616 3455442 3449528 3439227 3425544 3410082 3393375 3375119 3355627 3335911 3316321 3296095 3274448
62054 3274448 3251339 3227042 3201677 3175508 3149146 3123316 3098778 3076438 3056909 3039865 3024434
62043 3024434 3010312 2997909 2987302 2977790 2968729 2960202 2952518 2945605 2939298 2933671 2928619 2923434 2917214
62030 2917214 2909428 2899817 2888114 2874297 2858919 2842761 2826283 2809596 2792679 2775238 2756581 2736072
62018 2736072 2713742 2690213 2666060 2641594 2617268 2593933 2572384 2552721 2534424 2517167 2501351
62007 2501351 2487627 2476003 2465836 2456688 2448625 2441337 2433453 2423347 2410287 2394195 2374542 2350390
61995 2350390 2321654 2289516 2255308 2219623 2182908 2146256 2110949 2077410 2045136 2013594 1982889
61984 1982889 1953579 1926086 1900309 1875742 1852042 1829403 1808125 1787872 1767702 1746949 1725789
61973 1725789 1704897 1684877 1666092 1648559 1631784 1615116 1598478 1582411 1567189 1552328 1537254
61962 1537254 1522025 1507072 1492654 1479038 1466856 1456730 1448678 1442286 1437272 1433510 1430865 1429568
61950 1429568 1430572 1434907 1442694 1453223 1465895 1480502 1496710 1513999 1532389 1552667 1575610 1601345
61938 1601345 1629714 1660832 1694913 1731807 1771091 1812471 1855880 1901338 1948993 1999193 2052389
61927 2052389 2109150 2170540 2238316 2314526 2401034 2499729 2613043 2743766 2894312 3066628
61917 3066628 3263144 3487600 3744580 4038406 4372798 4751362 5177616 5653730 6178849
61908 6178849 6748041 7351515 7973332 8590264 9172628 9687656 10103788 10394241 10540083
61899 10540083 10533509 10380141 10098039 9713070 9253318 8745316 8212384 7673684 7143491 6631320
61889 6631320 6143103 5682513 5251708 4851630 4482326 4143217 3833233 3551027 3295287
61880 3295287 3064755 2857839 2672398 2506144 2357203 2224149 2105605 2000035 1905880 1821725
61870 1821725 1746411 1679218 1619864 1568098 1523272 1484536 1451363 1423637 1401230 1383843 1371297
61859 1371297 1363588 1360467 1361262 1365295 1372258 1382039 1394403 1408967 1425162 1441975 1458015 1472158 1484053
61846 1484053 1493824 1501481 1506826 1509755 1510456 1509509 1507994 1507220 1508046 1510604 1514778 1520569 1527663 1535081 1541807
61831 1541807 1547587 1552623 1556696 1559149 1559632 1558276 1555188 1550389 1544445 1538668 1534417 1532381 1532568 1534740
61817 1534740 1538887 1545593 1555838 1570108 1587832 1608238 1631602 1659040 1691095 1727324 1767468 1812236
61805 1812236 1862513 1918412 1979682 2046629 2120134 2201087 2290273 2388570 2496797 2615538 2745611
61794 2745611 2888673 3047146 3223682 3420998 3642032 3889965 4168308 4481372 4834664
61785 4834664 5234641 5688203 6202603 6785521 7444531 8185952 9013525 9926866 10919345
61776 10919345 11975595 13069357 14162406 15205439 16141852 16914232 17472012 17778667 17817422
61767 17817422 17594163 17135742 16483635 15685885 14790609 13841803 12876437 11922813 11000959
61758 11000959 10124512 9302292 8538951 7835695 7191594 6604690 6072279 5590880 5156494
61749 5156494 4764979 4412363 4095188 3810692 3556337 3328993 3124903 2940654 2773984
61740 2773984 2623442 2487490 2364252 2252093 2150109 2057833 1974474 1898603 1828777 1764477
61730 1764477 1706185 1654270 1607945 1565632 1526186 1489323 1454823 1421944 1390013 1359186 1330062
61719 1330062 1302625 1276118 1250028 1224781 1201197 1179488 1159090 1139339 1120082 1101614 1084276
61708 1084276 1068168 1053176 1039164 1026115 1014055 1002819 992011 981407 971289 962125 953835 945736
61696 945736 937332 928849 920708 912734 904349 895373 886155 876935 867609 858267 849458 841573 834256 826770
61682 826770 818754 810351 801798 793215 784661 776140 767571 759042 750964 743748 737369 731537 726254 721831
61668 721831 718286 715078 711714 708475 706207 705335 705281 705046 704281 703588 703731 704795 706328 708065 710156 712667
61652 712667 715243 717409 718977 720001 720527 720538 720022 718935 717210 714898 712161 709093 705762 702453 699585
61637 699585 697220 694893 692140 689032 686060 683741 682475 682482 683542 685074 686742 688728 690994 692559 692083
61622 692083 689187 684744 679793 674582 668774 662148 654853 647242 639764 632902 626990 622057 617930 614422
61608 614422 611362 608585 606022 603770 601927 600351 598672 596642 594402 592296 590382 588358 586113 584168
61594 584168 583268 583538 584311 584801 584728 584277 583751 583396 583323 583520 584080 585376 587635 590388 592829 594919 597649
61577 597649 602003 608104 615642 624616 635167 647104 660151 674405 690102 707150 725371 744929
61565 744929 765960 787941 809976 831630 853005 874132 894825 915041 934878 954230 972947
61554 972947 991289 1009804 1028772 1048141 1067783 1087335 1106085 1123633 1140425 1156760 1171417
61543 1171417 1182294 1188535 1191112 1191098 1188432 1182858 1175040 1165892 1155479 1143512 1130507 1117604 1105371
61530 1105371 1093485 1081588 1069993 1059569 1051270 1045685 1042737 1041943 1043135 1046659 1052712 1060933 1071103
61517 1071103 1083873 1100314 1121052 1146346 1176740 1212943 1255176 1303257 1357409 1418569 1487869
61506 1487869 1566308 1654984 1755193 1868138 1994771 2135965 2292587 2465302 2654266 2858605
61496 2858605 3075560 3299999 3524873 3741993 3942291 4116174 4255071 4353391 4409091 4422733
61486 4422733 4396739 4335554 4245372 4132783 4003656 3863344 3717218 3570237 3426047 3286942
61476 3286942 3154631 3030694 2916378 2812402 2719105 2636663 2565117 2504344 2454065 2413928
61466 2413928 2383661 2363162 2352203 2349995 2355282 2367052 2384939 2408690 2437407 2469534 2503490 2538122
61454 2538122 2572720 2606919 2640512 2673139 2704242 2733608 2761841 2789963 2818644 2848224 2879401
61443 2879401 2913252 2950354 2990412 3033126 3078936 3128306 3180492 3233660 3286189 3337241 3385903
61432 3385903 3430382 3468506 3498756 3520452 3533191 3536532 3530156 3514012 3488411 3454419 3414136 3370078
61420 3370078 3324076 3277017 3229714 3183591 3140159 3100187 3063872 3031637 3004244 2982153 2965258
61409 2965258 2953373 2946531 2944583 2946869 2952505 2960636 2970143 2979501 2987435 2993506 2997626 2999237 2997587 2992800
61395 2992800 2985964 2978053 2969437 2960772 2953760 2950537 2952774 2961894 2979690 3007955 3047702 3099525 3164696
61382 3164696 3245188 3342557 3457517 3590771 3743462 3916313 4108764 4319224 4545412 4783670
61372 4783670 5028086 5270888 5503635 5717817 5905023 6057734 6170711 6241710 6271182 6261645
61362 6261645 6216955 6141118 6037159 5907186 5753518 5579318 5388118 5183345 4968790 4749094
61352 4749094 4529072 4312402 4101266 3897352 3702833 3520102 3350619 3194332 3050402
61343 3050402 2918435 2798944 2692714 2599911 2519814 2451153 2392660 2343613 2304058 2274342 2254248
61332 2254248 2242768 2238906 2242368 2253084 2270291 2292656 2319257 2349911 2384435 2422088 2461933 2503306
61320 2503306 2545583 2587838 2629162 2669151 2707679 2744167 2777402 2806199 2830122 2849518 2864998
61309 2864998 2877075 2886265 2893391 2899444 2905024 2909984 2913760 2915859 2915849 2913009 2906411 2895449 2880019 2860096
61295 2860096 2835434 2805901 2771944 2734451 2694144 2651300 2606112 2559297 2512225 2466408 2422838
61284 2422838 2381964 2344299 2310748 2282145 2258637 2239878 2225648 2215898 2210185 2207569 2207266 2209036
61272 2209036 2212639 2217033 2220358 2220632 2216369 2206727 2191443 2170848 2145958 2118425 2090165 2062861 2037824
61259 2037824 2016282 1999544 1988688 1984330 1986995 1997533 2016868 2045522 2083821 2132444 2192244 2263494
61247 2263494 2345678 2438021 2539737 2649710 2766304 2887407 3009918 3128864 3237570 3329160
61237 3329160 3397874 3439191 3449791 3428326 3376243 3297439 3197130 3080958 2954515 2822952
61227 2822952 2690775 2561900 2439455 2325268 2219805 2122754 2033465 1950944 1874197 1803009
61217 1803009 1737939 1679258 1626448 1579137 1537833 1503049 1474227 1450309 1431030 1416818 1407628
61206 1407628 1402606 1400780 1401265 1402845 1404141 1404329 1403129 1400127 1394844 1387548 1379310 1371069 1363164 1355759
61192 1355759 1348885 1341881 1333583 1323506 1312203 1300121 1286817 1271816 1255516 1238482 1220313 1200109
61180 1200109 1177922 1155062 1132949 1112253 1093038 1075090 1057925 1041086 1024795 1010061 997841
61169 997841 988250 980668 974461 969432 965735 963526 962652 962609 962850 963122 963256 962554 959664 953357 943376 930268
61153 930268 914520 896348 876465 856527 838230 822078 807578 794568 783737 775532 769248 763796
61141 763796 759057 755789 754277 753699 752944 751527 749543 747287 745245 744007 743700 743702 743273 742301 741112 739788
61125 739788 738165 736429 735168 734784 735291 736886 740104 745060 750911 756593 761856 766984 771542 774098 773404
61110 773404 769334 762385 752836 740906 727368 713326 699426 685733 672253 659053 645926 632606
61098 632606 619373 606942 595628 585219 575773 567800 561315 555455 549561 544024 539373 535047 529933
61085 529933 523914 517995 513014 508983 505700 503124 500959 498651 496253 494690 494696 495910 497522 499436 502209
61070 502209 506021 510300 514498 518747 523509 528796 534092 539004 543715 548689 554134 559990 566323 573424
61056 573424 581437 590185 599391 608829 618138 626860 634906 642718 650738 658967 667259 675743 684601 693708
61042 693708 702873 712134 721379 729875 736729 741756 745574 748930 752233 755494 758331 760277 761447 762588
61028 762588 763924 764409 762898 759812 756778 754821 753872 753988 755860 759766 764995 770912 777897 786745 797728
61013 797728 810728 825863 843513 864020 887589 914173 943415 975278 1010784 1051444 1097660
61002 1097660 1148287 1201808 1257286 1314228 1372840 1434871 1503135 1579520 1664315 1757879 1861582
60991 1861582 1976067 2099743 2230353 2367592 2513579 2672201 2849571 3054465 3297099
60982 3297099 3588691 3944073 4384403 4936867 5635131 6524425 7665011 9124539 10961344
60973 10961344 13206217 15835953 18727137 21614430 24118976 25883900 26752290 26855475
60965 26855475 26540065 26198494 26129877 26485714 27254661 28242058 29082350 29349413 28741965
60956 28741965 27222544 25008568 22437017 19815056 17344644 15123891 13179725 11498874
60948 11498874 10050602 8802074 7725190 6797013 5998901 5315844 4734452 4240645 3819934
60939 3819934 3459537 3148984 2879055 2641749 2431499 2245110 2080052 1933605 1803688
60930 1803688 1689262 1589370 1502339 1426170 1358850 1298004 1241064 1186306 1133245 1081761 1031625
60919 1031625 983329 938611 899184 865155 835309 808735 785505 765797 749036 734246 720899
60908 720899 709141 699328 691560 685668 681398 678463 676445 674796 672996 670665 667563 663670 659314 654881
60894 654881 650214 644525 637206 628574 619530 610644 601941 593388 585065 576832 568345 559570 550903 542623
60880 542623 534563 526562 518910 512074 506207 501174 496913 493565 491384 490584 491071 492269 493521 494912 497399
60865 497399 501849 508127 515373 522951 530790 539035 547874 557690 568919 581537 594880 608131 620898
60852 620898 633331 645838 658766 672222 686052 699925 713370 725859 737105 747458 757810
60841 757810 768788 779964 789934 797164 800829 801142 799148 796016 792226 787446 781334 774219 766591 758112
60827 758112 747748 735046 720828 706358 692173 678051 663868 650060 637313 626102 616541 608488
60815 608488 601725 596122 591596 587942 584919 582605 581443 581644 582744 584090 585641 587874 590882 594000
60801 594000 596516 598397 600048 601634 603055 604438 606207 608507 610897 612789 614047 615007 616120 617765
60787 617765 620301 623951 628534 633577 638835 644591 651285 658973 667300 675905 684663 693513 702335 711089
60773 711089 719888 728766 737476 745686 753313 760513 767329 773457 778352 781492 782691 782386 781576 781169 781197
60758 781197 780820 779242 776457 772932 768865 764127 758897 753850 749501 745601 741377 736142 729502 721228
60744 721228 711369 700410 689040 677659 666316 655116 644446 634782 626399 619235 612812 606395 599577
60731 599577 592781 586861 582176 578400 575230 572815 571280 570369 569916 570276 571783 574104 576695 579688 583704
60716 583704 588759 593928 598215 601355 603637 605304 606260 606035 603944 599600 593391 586219 578713 570906 562671
60701 562671 554034 545004 535496 525676 516033 506943 498428 490511 483463 477487 472442 468070 464218 460630
60687 460630 456895 452943 449381 447011 446063 446056 446256 446190 445940 446076 447047 448602 450151 451754 454211 457980 462616
60670 462616 467591 473076 479378 486221 493236 500707 509001 517613 525731 533511 541872 550995 560022 568437
60656 568437 576836 585939 595629 605468 615555 626251 637412 648453 658976 668961 678457 687422 695728
60643 695728 703130 709394 714632 719253 723386 726538 728074 727833 726068 723011 718723 713263 706776 699501
60629 699501 691716 683463 674283 663568 651423 638921 627259 616852 607413 598653 590598 583412 577246
60616 577246 572163 568025 564564 561751 559885 559092 558973 559128 559903 562288 566982 573812 582025 590939 600310
60601 600310 610295 621154 632925 645316 657807 669664 679887 687544 692428 695176 696551 696807 695973
60588 695973 694340 692146 689009 684341 678375 672178 666428 660666 654027 646284 637779 628744 619315 610019
60574 610019 601523 593710 585605 576619 567497 559536 552995 546806 539847 532083 524351 517505 511982 507797
60560 507797 504618 502083 500367 500143 501643 504049 506327 508419 511086 514700 518892 523374 528330 533734
60546 533734 539040 543982 549168 555386 562832 571578 582383 596305 613635 633986 657461 685162 718349
60533 718349 757560 802667 853084 907257 962049 1013192 1056658 1089706 1110882 1119546 1115854 1101105
60521 1101105 1077763 1048830 1017242 985724 956712 931822 911434 895186 882885 874491 869277 865722
60509 865722 862622 859890 857882 856391 854875 853410 852831 853990 857372 863403 872635 885555 902653 924795
60495 924795 953096 988258 1030329 1079248 1135110 1197408 1264215 1332639 1400245 1465926 1529649
60484 1529649 1592121 1655361 1723562 1802901 1900256 2022186 2174886 2364087 2593709 2863844
60474 2863844 3169407 3499593 3837510 4160621 4443504 4662522 4799750 4844535 4794040 4654138
60464 4654138 4439481 4170822 3870344 3557755 3248528 2953433 2678606 2426463 2197425
60455 2197425 1991321 1807680 1645381 1502591 1377213 1267426 1171811 1088975 1017151 954424
60445 954424 899464 851741 810842 775800 745387 718750 695413 674856 656583 640415 626231
60434 626231 613409 601067 588950 577701 568093 560321 554089 548965 544454 540031 535455 530979 527130
60421 527130 524292 522435 521131 519879 518678 518177 518947 520658 522357 523555 524595 525840 527025 527752 528247
60406 528247 529205 531025 533492 536078 538300 539913 541117 542524 544590 547043 549144 550591 551932 553942
60392 553942 556766 559857 562600 564765 566441 567860 569352 571179 573221 575045 576434 577553 578323 578089 576450
60377 576450 574197 572670 572212 571994 571475 571171 571564 572096 571891 570956 569964 569346 569272 570091 571958 574361 576806
60360 576806 579757 583939 588948 593593 597630 602051 607467 613275 618882 624742 631432 638527 645122 650973
60346 650973 656323 661067 664917 668177 671506 674852 677275 678040 677486 676664 676395 676837 677721 678794 680047 681588
60330 681588 683377 685184 686771 687941 688498 688438 688171 688217 688554 688544 687648 685893 683541 680655 677232 673406 669233
60313 669233 664530 659322 654211 649923 646532 643392 639810 635626 631314 627730 625632 625132 625615 626304 626837
60298 626837 627242 627585 627902 628316 628922 629559 629873 629648 629041 628533 628656 629520 630547 630852 630052 628588 627232 626502
60280 626502 626578 627420 628723 629984 630894 631601 632520 634042 636415 639635 643346 647208 651434 656619 662898 669729
60264 669729 676731 684286 693000 702957 713835 725334 737140 749041 761599 776181 793589 812987
60252 812987 832978 853463 875588 900085 926761 955770 988305 1025457 1067217 1113253 1164110
60241 1164110 1220871 1283930 1352857 1427468 1508410 1596484 1691650 1792805 1898210 2005896 2113778
60230 2113778 2219668 2321458 2417367 2505949 2585735 2655031 2712265 2756467 2787194 2804087 2806967
60219 2806967 2796512 2774498 2743154 2704510 2660530 2613504 2565772 2519167 2475110 2435254 2401540
60208 2401540 2375416 2357332 2347349 2346215 2355518 2376805 2410753 2457307 2516381 2588108 2672355 2768130
60196 2768130 2873513 2986020 3102931 3221323 3338001 3449597 3552886 3645121 3724161 3788300
60186 3788300 3836056 3866190 3877857 3870613 3844379 3799772 3738673 3664230 3580012 3489161 3394539
60175 3394539 3299470 3207841 3123181 3047842 2983165 2930206 2890053 2863609 2851438 2853856 2870907
60164 2870907 2902154 2946663 3003200 3070138 3144915 3223841 3302874 3378651 3448696 3510768 3562523
60153 3562523 3601977 3628055 3640467 3639283 3624906 3598424 3561800 3517730 3469354 3419923 3372480
60142 3372480 3329764 3294331 3268525 3254215 3252770 3265491 3293936 3339699 3404044 3487953 3592360
60131 3592360 3718145 3866167 4037533 4233574 4455125 4701923 4972854 5266447 5580587
60122 5580587 5911893 6255868 6607555 6961535 7311411 7650044 7970575 8266963 8533613
60113 8533613 8765165 8956844 9104627 9204926 9254680 9252018 9196598 9089346 8932594 8730819
60103 8730819 8490757 8220372 7927924 7621968 7311408 7004677 6708845 6429545 6171284
60094 6171284 5937420 5730248 5551523 5402667 5284253 5195782 5136511 5106164 5104423 5129942
60084 5129942 5180241 5252090 5341294 5442317 5548775 5654424 5753484 5840475 5910683 5961064 5990446
60073 5990446 5998828 5986826 5955593 5906687 5841613 5761571 5667500 5560130 5440100 5308434 5167016
60062 5167016 5018440 4865471 4710878 4557614 4408750 4267091 4134959 4014292 3906676
60053 3906676 3813260 3734769 3671649 3624246 3593026 3578691 3581842 3602507 3640325 3695195 3767164
60042 3767164 3855358 3957521 4070928 4193183 4321497 4451709 4578838 4698430 4806809 4900343
60032 4900343 4975512 5029874 5062303 5072068 5058303 5020558 4959393 4876263 4773304 4653541 4520983
60021 4520983 4380154 4235525 4091198 3950698 3816895 3692266 3579128 3479313 3393799 3323034
60011 3323034 3267553 3227901 3204174 3196249 3204529 3229883 3272890 3333734 3412960 3511572 3629988
60000 3629988 3767282 3921560 4090382 4270216 4455898 4641283 4820503 4988497 5140804
59991 5140804 5273492 5383439 5468346 5526435 5556285 5557018 5528483 5471173 5386054 5274884 5141115
59980 5141115 4990511 4830349 4667428 4506785 4352330 4208109 4078112 3964878 3869032 3790444
59970 3790444 3729397 3686454 3661840 3655435 3667150 3696892 3744235 3808340 3888050 3981793 4087357
59959 4087357 4201793 4321458 4442270 4560339 4672637 4777049 4871762 4954833 5024422 5079287
59949 5079287 5118984 5143819 5154809 5153744 5143154 5126152 5106120 5086485 5070970 5064083 5070928 5096110
59937 5096110 5142949 5214034 5312316 5441196 5603757 5802327 6038553 6313050 6624682 6970367
59927 6970367 7345353 7742925 8153572 8564818 8962003 9329024 9648888 9905236 10084916
59918 10084916 10179902 10187473 10109685 9953178 9728721 9449695 9130251 8784300 8425059 8064311
59908 8064311 7711503 7373558 7055560 6761550 6494819 6257616 6050787 5874045 5726991
59899 5726991 5609895 5523338 5467331 5441233 5444495 5476890 5537907 5626362 5740690 5878960 6038080
59888 6038080 6213127 6397515 6583452 6762003 6923277 7057320 7155298 7210434 7218695 7179240
59878 7179240 7094166 6967706 6805646 6615151 6404233 6180700 5951493 5722631 5498961 5283450
59868 5283450 5077113 4879955 4691804 4512226 4340329 4175253 4016655 3864614 3719540
59859 3719540 3582582 3455626 3340327 3237339 3146741 3068748 3003466 2950337 2908418 2876918
59849 2876918 2854716 2839308 2826835 2813345 2795839 2772330 2741688 2703852 2659916 2611613 2560584
59838 2560584 2508096 2455336 2403800 2355233 2311067 2271979 2238122 2209679 2186907 2169785 2158189
59827 2158189 2152610 2154318 2164568 2183953 2212627 2250629 2297454 2351522 2410456 2471846 2533716 2594695
59815 2594695 2654148 2711887 2767318 2818918 2864630 2902471 2930555 2947139 2951427 2944453 2928977 2908633
59803 2908633 2887230 2868242 2854122 2846004 2844505 2850888 2867212 2895524 2937456 2994745 3069755 3165384
59791 3165384 3284788 3431538 3609880 3824389 4078862 4375022 4711498 5082912 5478308
59782 5478308 5879203 6259129 6586662 6831642 6971995 6998605 6916980 6745139 6508106 6231456
59772 6231456 5937145 5642459 5360046 5097667 4858676 4644004 4454016 4288666 4146823
59763 4146823 4026578 3926187 3844302 3779528 3730369 3695597 3674274 3665553 3668793 3683766 3710462
59752 3710462 3748970 3799752 3863648 3941197 4032304 4136926 4255698 4389471 4538896 4705183
59742 4705183 4890750 5098229 5329110 5584350 5866172 6178170 6523413 6903190 7317662
59733 7317662 7766636 8248811 8760351 9294243 9840588 10387357 10921611 11430902 11904423
59724 11904423 12334112 12716170 13052257 13349103 13616860 13867812 14115776 14374980 14658186
59715 14658186 14975381 15333601 15736695 16184468 16672285 17191880 17732205 18279313 18816180
59706 18816180 19323853 19783657 20179225 20497800 20731129 20876053 20934599 20913589 20823900 20679391
59696 20679391 20495745 20289602 20077956 19877335 19702802 19567443 19482577 19458182 19503139 19625408
59686 19625408 19832187 20129721 20522829 21014610 21606387 22297224 23082585 23952489 24889753
59677 24889753 25868674 26854657 27805360 28673389 29410127 29970360 30317433 30428027 30295218
59668 30295218 29929119 29355275 28611259 27741959 26794448 25813399 24837437 23896228 23008364
59659 23008364 22180324 21406434 20669914 19945843 19206968 18431334 17608737 16742876 15848466
59650 15848466 14945327 14052851 13187163 12360609 11581630 10854296 10178748 9553170 8975692
59641 8975692 8444564 7957408 7511349 7103860 6732812 6395791 6090104 5813569 5564573
59632 5564573 5341155 5140718 4961031 4801012 4660085 4537137 4430509 4338679 4260473 4194709
59622 4194709 4140008 4094851 4057513 4025854 3997315 3969172 3938815 3903998 3863052 3814955 3759289
59611 3759289 3696235 3626523 3551091 3470719 3386238 3299244 3212339 3128286 3048804 2974261 2904523
59600 2904523 2839942 2781431 2729676 2684563 2645577 2612655 2586420 2567558 2556193 2551872 2553853 2561293
59588 2561293 2573406 2589611 2609373 2631794 2655574 2679489 2702665 2724448 2744438 2762835 2780365
59577 2780365 2797691 2815333 2834284 2856116 2882098 2912775 2948743 2991194 3041167 3098912 3164708
59566 3164708 3239738 3325336 3421870 3529378 3648944 3782447 3931068 4095049 4274688 4470374
59556 4470374 4681387 4905641 5140811 5384814 5634911 5887245 6137694 6382531 6618085
59547 6618085 6840670 7047376 7236402 7406420 7556317 7685802 7795058 7882930 7946045 7980717
59537 7980717 7985809 7963834 7920216 7862275 7798343 7736638 7684449 7648318 7634536 7648945 7696329
59526 7696329 7779978 7901119 8057926 8244913 8453427 8672542 8889555 9090503 9261336 9389274
59516 9389274 9463700 9476870 9424594 9306252 9124031 8882543 8589312 8254783 7890881 7509271
59506 7509271 7120869 6735965 6363525 6010064 5679509 5374123 5095137 4842717 4616083
59497 4616083 4414140 4235931 4080533 3946869 3833846 3740647 3666809 3612038 3575940 3558024
59487 3558024 3558012 3575960 3611861 3665290 3735916 3824250 3931366 4057682 4202544 4365086 4544925
59476 4544925 4741539 4953285 5177154 5408857 5642589 5871047 6086261 6280410 6445802
59467 6445802 6574790 6660715 6699268 6689012 6630993 6528238 6385273 6207562 6001288 5773557
59457 5773557 5532003 5283317 5032205 4782194 4537120 4301027 4076693 3865007 3666071
59448 3666071 3480366 3308581 3150809 3006374 2874364 2754097 2645106 2546915 2458882 2380344
59438 2380344 2310923 2250523 2198862 2155122 2118301 2087812 2063494 2045015 2031592 2022388 2016952 2015064
59426 2015064 2016220 2019487 2023926 2029195 2035715 2044297 2055605 2070008 2087856 2109594 2135202 2163242
59414 2163242 2190545 2213385 2229611 2240029 2247782 2256488 2269049 2287816 2314885 2351618 2398138 2453643
59402 2453643 2516787 2585295 2655847 2725649 2794617 2865728 2943277 3031181 3132675 3250501 3386797
59391 3386797 3543240 3721783 3925145 4156507 4419135 4716358 5051390 5426733 5843711
59382 5843711 6302178 6799711 7330572 7885695 8453871 9022878 9580082 10113539 10613825
59373 10613825 11075120 11494853 11873005 12211905 12515605 12788397 13033760 13254538 13452936
59364 13452936 13629236 13780573 13901402 13985005 14024437 14013027 13945441 13818962 13633844 13392845
59354 13392845 13100894 12764918 12393077 11993504 11573428 11139054 10695980 10249737 9806050
59345 9806050 9370452 8947680 8541706 8156302 7795053 7460638 7154434 6876836 6627429
59336 6627429 6404765 6206604 6030664 5874628 5735478 5609679 5494406 5387757 5287353
59327 5287353 5189734 5091909 4992777 4892215 4789552 4683993 4575991 4467027 4358220 4250148
59317 4250148 4143900 4041223 3943478 3851148 3764479 3683942 3610070 3543434 3484776 3434630 3392815
59306 3392815 3358760 3332202 3313029 3300711 3294670 3295216 3303388 3319814 3344344 3376915 3418102 3468691
59294 3468691 3529268 3600405 3682804 3777038 3883568 4003008 4135877 4281864 4439708 4607865
59284 4607865 4784789 4968322 5155118 5340854 5520678 5689339 5841326 5971466 6075561
59275 6075561 6150580 6194473 6206028 6184888 6131481 6046629 5931139 5786180 5614704 5422559
59265 5422559 5217637 5007507 4797886 4592966 4396069 4209333 4033368 3868044 3713569
59256 3713569 3570596 3439779 3321667 3216594 3124193 3043496 2973963 2915859 2869078 2832303
59246 2832303 2804229 2785156 2776451 2778816 2792081 2816496 2853143 2903126 2967391 3047475 3145613 3263917
59234 3263917 3404207 3568772 3760577 3982425 4236422 4524193 4846750 5203603 5591958
59225 5591958 6006344 6438161 6875453 7303746 7707475 8070791 8378080 8615406 8772315
59216 8772315 8842438 8823172 8716109 8527825 8269137 7953024 7593507 7205769 6805264 6405327
59206 6405327 6015773 5643796 5295089 4973420 4680012 4414426 4176045 3964403 3778604
59197 3778604 3617113 3477989 3358962 3257587 3171741 3099919 3040892 2993388 2956389 2929498
59187 2929498 2912708 2905847 2908271 2918854 2936232 2959326 2987642 3020810 3057817 3097072 3137147 3177003
59175 3177003 3215382 3250462 3280287 3303259 3318163 3324141 3320709 3307524 3284190 3250809 3208690 3159907
59163 3159907 3106054 3047971 2986759 2924358 2862693 2802711 2744653 2688961 2636557 2588374 2544938
59152 2544938 2506355 2472623 2443940 2420572 2402357 2388683 2379261 2374522 2374840 2379788 2388891 2402751
59140 2402751 2422476 2448069 2478319 2512414 2550773 2594182 2643070 2697975 2759725 2828496 2903240
59129 2903240 2982635 3066184 3154015 3245973 3341223 3438269 3535058 3629553 3720691 3808500 3893093
59118 3893093 3973903 4050172 4121728 4188944 4252281 4312163 4369127 4423964 4478060 4533652 4593320
59107 4593320 4659007 4731755 4812202 4900493 4995225 5092749 5187582 5273139 5342203 5387549 5402947
59096 5402947 5383826 5327529 5233770 5104999 4945786 4761683 4558952 4344755 4126153 3908363
59086 3908363 3694683 3488133 3292006 3108246 2936422 2775214 2624373 2484571 2355990
59077 2355990 2237917 2129396 2029624 1937967 1854126 1778058 1709364 1647030 1590013 1537728 1489777
59066 1489777 1445852 1406161 1371271 1341013 1314215 1289983 1268550 1250194 1234057 1218999 1205166
59055 1205166 1193673 1184851 1177650 1170797 1163840 1156936 1150183 1143405 1136290 1128573 1120173 1111143 1101582 1091909
59041 1091909 1083263 1077115 1074220 1074309 1076995 1082515 1091304 1103356 1118335 1135819 1154958 1174315 1192603
59028 1192603 1209307 1224215 1236719 1246097 1252267 1255837 1257622 1258461 1259230 1260629 1263070 1266924 1272526 1279724
59014 1279724 1287876 1296630 1306265 1316858 1327552 1337044 1344419 1349116 1350553 1348451 1343310 1335951 1326725
59001 1326725 1315548 1302557 1288305 1273385 1258218 1243190 1228786 1215604 1204211 1194827 1187248 1181391
58989 1181391 1177717 1176534 1177005 1177739 1178523 1180609 1184944 1190939 1197461 1204251 1211728 1220048 1229031 1238613 1248788
58974 1248788 1259578 1271482 1285421 1301706 1319600 1338427 1358530 1380582 1404505 1429739 1456070
58963 1456070 1483482 1511597 1539896 1568123 1595889 1622372 1647111 1670742 1694317 1718238 1742514
58952 1742514 1767645 1794550 1823867 1855892 1890892 1928941 1969796 2013523 2060882 2112492 2168004
58941 2168004 2226664 2288406 2353896 2423926 2499269 2580647 2668307 2762153 2862894 2972491 3092862
58930 3092862 3224761 3368626 3525777 3697853 3885629 4089482 4310706 4551505 4813989
58921 4813989 5100058 5411917 5751884 6122005 6524556 6962338 7437506 7950473 8500654
58912 8500654 9087288 9707974 10356552 11023408 11697162 12364404 13008077 13608019 14143784
58903 14143784 14596359 14948173 15184325 15295639 15280265 15142369 14890505 14537594 14100644
58894 14100644 13598522 13049371 12469702 11874515 11276969 10687700 10114681 9563556 9038137
58885 9038137 8540971 8073581 7636060 7226968 6844449 6487426 6155246 5846483 5559007
58876 5559007 5291124 5041776 4809722 4593547 4392612 4207050 4036618 3880341 3737284
58867 3737284 3606670 3487041 3376406 3273773 3179672 3094717 3018429 2949927 2888904 2835177
58857 2835177 2787916 2746147 2709735 2679247 2654904 2636146 2622129 2612394 2607084 2606660 2611385 2621081
58845 2621081 2635503 2654816 2679487 2709862 2746096 2788289 2836379 2890232 2950225 3017366 3092272
58834 3092272 3174474 3263494 3360331 3466991 3584724 3713637 3853992 4006918 4173710 4355355
58824 4355355 4553077 4768717 5004394 5262371 5545397 5856477 6198178 6572640 6982212
58815 6982212 7429211 7914858 8438853 8999753 9594583 10217585 10859780 11509631 12153213
58806 12153213 12773560 13350914 13864531 14294631 14623744 14838319 14930552 14898920 14747169 14483543
58796 14483543 14120743 13675064 13164120 12605010 12013929 11405970 10794091 10188415 9596756
58787 9596756 9025331 8478757 7960056 7471343 7014307 6589859 6197721 5836780 5505605
58778 5505605 5202518 4925415 4671598 4437597 4219442 4013774 3818866 3634352 3460240
58769 3460240 3296658 3143983 3002192 2870209 2746856 2632282 2527400 2431897 2343976 2262236
58759 2262236 2186630 2117377 2054216 1997230 1947138 1903935 1866198 1832544 1802980 1778002 1757040
58748 1757040 1738714 1722230 1707756 1695655 1685750 1676980 1667458 1655479 1640994 1625557 1610346 1594807
58736 1594807 1577824 1559573 1541352 1523856 1506423 1487927 1467802 1446119 1423080 1398627 1372483
58725 1372483 1344562 1315259 1285098 1254142 1222102 1189098 1155967 1123754 1093176 1064485 1037495
58714 1037495 1011783 987313 964651 944135 925113 906671 888905 872634 858078 844823 832992
58703 832992 823278 815525 808394 800863 793234 786230 779986 774371 769448 765061 760532 755275 749226 742459
58689 742459 735000 727225 719735 712578 705331 698179 692073 687590 684542 683023 683811 687132 691869 696626
58675 696626 700872 704576 707566 709926 712345 715493 719621 725223 733285 744251 757300 771133 784645
58662 784645 796234 803439 804415 799509 790703 779855 768073 756341 745831 737498 731654 727901 725422
58649 725422 723734 723236 724595 727733 732088 737810 745694 755814 767329 779977 794638 811960 831500
58636 831500 852863 876618 903326 932616 964058 998117 1035411 1075855 1119383 1166867 1219484
58625 1219484 1277862 1342665 1415333 1497350 1589390 1692016 1806596 1934551 2076195 2231158
58615 2231158 2399363 2580376 2771942 2969934 3169361 3364427 3547710 3710386 3843932
58606 3843932 3941798 4000043 4017192 3993751 3931895 3835831 3712132 3568715 3412778 3249824
58596 3249824 3084342 2920397 2761125 2608522 2464197 2329626 2205461 2091603 1988454
58587 1988454 1897096 1817684 1748704 1688574 1637026 1594085 1558550 1528394 1501926 1477732 1454324
58576 1454324 1430856 1407714 1385580 1364486 1344379 1325840 1309396 1294761 1281475 1269425 1257866
58565 1257866 1244718 1227916 1206959 1182333 1154233 1122951 1089950 1057343 1026457 997638 971065
58554 971065 946974 925433 906524 890319 876129 862438 848156 833385 818509 803370 787977
58543 787977 773084 759242 746065 733179 721034 710029 699759 689953 681202 673842 667074 660108
58531 660108 653191 646599 639682 632061 624645 618252 612231 605726 599339 594138 589970 586207 583259 581827
58517 581827 581456 581284 581511 582671 584288 585840 588219 592448 597529 601364 603364 604516 605391 605847 606315 607552
58501 607552 609291 610754 612287 614939 618721 622922 627880 634641 642940 651113 658069 663823 668185 670533
58487 670533 670993 670403 669007 666480 663079 659363 654900 648774 641340 633993 627233 620504 613952 608658 604833
58472 604833 601233 596750 591388 585469 579099 572643 566599 560840 555069 550135 547699 548347 550897 553681
58458 553681 555679 556570 556669 556758 557131 557052 556037 555150 555898 558217 560720 562563 563905 565026 566210 568053 570566
58441 570566 572531 573124 573499 575166 577386 577978 576286 573529 570531 567040 563144 559517 556188 552712 549546
58426 549546 547651 546849 546212 545838 546601 548364 550284 552660 556513 561444 565977 570116 575527 582901 591013
58411 591013 598669 605766 612102 616910 620027 622071 623265 623448 623101 622820 621979 619718 617027 615897 616489
58396 616489 617183 617339 617878 619113 620288 621441 623576 626704 629776 632764 636605 641005 644789 648812 655994
58381 655994 667632 681755 695783 708691 720006 728948 735538 740754 744913 747598 749494 752205 755820
58368 755820 758857 761104 764261 769107 774314 778822 783272 788291 793474 798802 805042 812049 818665 824819
58354 824819 831491 838191 842966 845540 847840 850595 852110 851503 850446 850347 850294 849318 848436 848878 850231 851833
58338 851833 854228 857985 862773 868640 876438 886093 896270 906479 917544 929425 940825 951587 963017
58325 963017 975128 986273 996350 1007538 1020710 1033907 1045655 1056972 1068713 1079724 1089251 1098493
58313 1098493 1108122 1116729 1123400 1129354 1135554 1141267 1146538 1153397 1162860 1173285 1183421 1194520 1207695
58300 1207695 1221792 1235754 1250583 1267123 1284327 1301403 1319171 1337642 1354986 1370631 1386795
58289 1386795 1405302 1425628 1447589 1472758 1501344 1530866 1560064 1591040 1625465 1661816 1698477
58278 1698477 1736264 1775546 1814166 1850716 1886602 1922396 1955448 1983869 2009693 2035485 2061087
58267 2061087 2086338 2113434 2143617 2174864 2205785 2238460 2274603 2312566 2351132 2392512 2438283
58256 2438283 2486137 2534081 2584112 2638228 2694688 2751943 2812397 2878454 2948638 3021395 3098723
58245 3098723 3182095 3269059 3358027 3452129 3553929 3660743 3769885 3884039 4006579 4136058
58235 4136058 4270465 4412408 4564824 4726115 4894845 5074535 5268349 5474007 5689671
58226 5689671 5919525 6167656 6432102 6711479 7011641 7338844 7692322 8070850 8480378
58217 8480378 8927560 9412502 9936215 10508286 11138611 11829170 12583396 13415518 14340624
58208 14340624 15364838 16497289 17762970 19191920 20806726 22635859 24730199 27153320
58200 27153320 29970776 33271208 37192150 41916182 47670509 54769174 63656854 74906000
58192 74906000 89212026 107426775 130530377 159417071 194535428 235476240 280456786
58185 280456786 325753625 365660006 393725160 405132361 398784087 377562091 346666125
58178 346666125 311395315 275753039 242164231 211783201 184913399 161391895 140887414
58171 140887414 123050194 107546945 94082642 82430100 72416949 63881907 56667899
58164 56667899 50652228 45751416 41896195 39033840 37160849 36322964 36568130 37906575
58156 37906575 40282164 43483665 47003481 50013323 51607618 51212847 48856068 45085373
58148 45085373 40636274 36116598 31886987 28104725 24805738 21958651 19500940 17370491
58140 17370491 15520206 13912261 12511673 11290541 10230676 9316244 8528095 7848193
58132 7848193 7263452 6760589 6322056 5931769 5580910 5263886 4972623 4699429 4442105
58123 4442105 4201622 3977419 3768817 3578019 3407223 3254822 3117939 2996299 2890052
58114 2890052 2796185 2710570 2631153 2555721 2479322 2398060 2313551 2230011 2148946 2070200 1995877
58103 1995877 1928788 1868368 1811903 1758661 1709295 1662457 1615698 1568892 1523486 1479252 1434876
58092 1434876 1390970 1349450 1310659 1273853 1239638 1209069 1181097 1153660 1126662 1101295 1077212
58081 1077212 1052993 1028663 1005218 982337 959116 936479 916308 898599 881677 864758 848193
58070 848193 831835 815382 799870 786728 775756 765783 756611 748576 741096 733631 727155 722618 718798
58057 718798 713703 707273 700590 693345 684428 674351 664778 656086 647493 639098 631716 625132 618492 612014
58043 612014 606501 601713 597126 593573 592077 591630 590381 588560 588027 589221 590769 592032 593866 596726 599798
58028 599798 602166 603375 602935 600780 597955 595447 592749 589032 585126 582509 580852 578494 575047 571654
58014 571654 568902 566389 564229 563082 562659 561911 560736 559913 559404 558281 556275 553813 550577 545548 538500
57999 538500 530034 520289 509020 496732 484256 471462 457864 444169 431621 420309 409963 402121
57987 402121 399314 401977 408106 416087 425953 437563 449541 460717 470984 480155 487480 492899 497408
57974 497408 501594 504960 507172 508811 510432 511978 513477 515201 516722 516860 514942 511267 506213 499931
57960 499931 493016 486343 479974 473281 466365 460304 455839 452833 451205 451285 453001 455725 459159 463525 468764
57945 468764 474423 480389 486760 492966 497973 501297 502836 501909 497747 490913 482952 474557 465266 454971
57931 454971 444278 433219 421061 407851 394878 383065 371993 361037 350488 341131 333566 328237
57919 328237 325247 323878 323179 323197 324721 327760 331343 334918 338825 343281 348189 354171 362438 373152 385048
57904 385048 396998 408759 419818 428980 435860 441571 447123 452161 456026 459001 461468 462629 461128
57891 461128 456564 449715 441690 433426 425592 418356 411450 404715 398285 392158 386167 380535 375847 372298
57877 372298 369570 367556 366610 366949 368498 371344 375565 380572 385504 390389 396011 402492 408994 415013 420911
57862 420911 426846 432153 436233 439160 441076 441901 441970 441947 441658 440020 436630 432491 428596 424781 420581 416332
57846 416332 412731 410073 408503 408220 408764 408918 408051 406900 406362 406164 405391 403687 401253 398252 394838 391262
57830 391262 387310 382189 375542 368018 360290 352122 343007 333157 323178 313308 303667 294808 287248 280758
57816 280758 274701 268868 263549 259057 255618 253346 251962 250862 249774 249016 248924 249580 251265 254424 258832
57801 258832 263554 268273 274019 282042 292524 304784 318007 331202 343127 352985 360829 366898 371218
57788 371218 374194 376709 378979 380099 379475 377893 376309 374304 370673 364968 357532 348625 338605 328487
57774 328487 319176 310378 301308 292245 284354 278085 272741 267571 262425 257381 252689 249114 247451 247522 248410
57759 248410 249741 252002 255411 259284 262779 265724 268465 271407 274924 279230 284083 288898 293246 296999
57745 296999 300054 302450 304814 308145 312844 318252 323329 327611 331367 335113 339179 343655 348573 353961
57731 353961 359689 365425 371056 377128 384410 392952 402057 411355 421336 432489 444494 456848 469786
57718 469786 483874 499052 514859 531454 549623 569731 591375 614272 638928 666199 696577
57707 696577 730228 767460 808932 855430 907579 965867 1031027 1104364 1187445 1281502 1387489
57696 1387489 1506736 1640909 1790922 1956275 2135725 2327831 2529961 2736948 2941403
57687 2941403 3135178 3310024 3457269 3568371 3636842 3660005 3639278 3579377 3487188 3370593
57677 3370593 3237524 3095592 2951964 2812967 2683756 2568781 2472593 2399847 2354310 2337845
57667 2337845 2349640 2385058 2434154 2481337 2507907 2497478 2442117 2345562 2220984 2084558 1949408
57656 1949408 1823493 1710816 1612972 1529741 1459702 1401434 1354346 1318337 1292956 1277170 1269907
57645 1269907 1270694 1279703 1297209 1323211 1357772 1401550 1455599 1520673 1597218 1686041 1788326 1904701
57633 1904701 2034801 2177990 2333699 2500365 2674357 2850369 3022182 3182423 3322338
57624 3322338 3433265 3508781 3545264 3541118 3496783 3415672 3304082 3169601 3019597 2860690
57614 2860690 2698347 2536355 2377159 2222966 2076067 1937990 1809033 1689074 1578363
57605 1578363 1477192 1385197 1301516 1225463 1156679 1094709 1038722 987751 941176 898962 861272
57594 861272 827753 797356 769041 742475 717768 694858 673574 654111 636793 621398 607243
57583 607243 594007 581975 571354 561803 552798 544101 535746 527927 521037 515509 511494 508891 507632
57570 507632 507614 508436 509756 511995 516165 522751 531040 539739 548000 555872 564126 573743 585215 598322
57556 598322 612848 629356 648681 670766 694752 720431 748908 781518 818725 860565 907577
57545 907577 960670 1020403 1087086 1161469 1244837 1338381 1442737 1557961 1683508 1818105 1959657
57534 1959657 2105093 2249994 2388492 2513851 2619410 2699317 2749096 2766231 2750528 2704018
57524 2704018 2630631 2535726 2425295 2304908 2179131 2051656 1925567 1803243 1686395 1576518
57514 1576518 1475138 1383334 1301127 1227588 1161468 1101685 1047547 998921 956170 919574 888780
57503 888780 862883 840979 822503 807221 795092 786157 780332 777404 777320 780430 787219 797748 811477
57490 811477 827772 846743 869589 897897 932345 972287 1016979 1067160 1124922 1192012 1268832
57479 1268832 1355273 1451735 1558656 1675395 1800251 1931211 2065737 2199566 2326358 2438966
57469 2438966 2530915 2596887 2632734 2636015 2606671 2547001 2461008 2353835 2231430 2099970 1965039
57458 1965039 1831010 1700936 1576701 1459289 1349101 1246248 1150648 1062126 980635 906419
57448 906419 839631 779716 725448 675814 630660 590230 554285 522095 493164 467422 444588
57437 444588 423854 404461 386214 369144 352980 337404 322589 309051 297057 286466 276999 268299
57425 268299 259858 251367 243122 235662 229013 222729 216667 211226 206628 202463 198146 193525 188824 184315
57411 184315 180263 176884 174059 171314 168399 165653 163544 162048 160776 159576 158598 157766 156598 154759 152587
57396 152587 150837 149918 149598 149502 149637 150115 150494 149927 148212 146258 145123 144879 144841 144628 144360 143967 143043 141502
57378 141502 139781 138247 136985 136229 136249 136515 135766 133560 131152 130160 130729 131726 132392 132956 133735 134499 134919
57361 134919 135051 135094 135099 135110 135227 135352 135166 134589 133997 133859 134323 135230 136291 137102 137302 136916 136411 136194 136211 136229
57341 136229 136356 136945 137974 138866 139114 138900 138845 139202 139622 139759 139753 139945 140453 141430 143443 147019 151859 157047
57323 157047 162115 167372 173048 178736 184091 189532 195707 202592 209741 217191 225501 234880 244834 254829
57309 254829 264943 275725 287640 300712 314586 329015 344342 361336 380290 400557 421327
57298 421327 442555 464672 487645 510959 534421 558159 581651 603405 621936 636579 647072
57287 647072 652904 653505 648676 638400 622600 601659 576919 550132 522461 494484 467033 441321
57275 441321 417971 396373 375431 354802 335177 317439 301824 287907 275207 263664 253551
57264 253551 245007 237739 231259 225379 220360 216471 213440 210538 207275 203928 201241 199591 198492 196927
57250 196927 194193 190593 187366 185751 185823 186278 185625 183594 181151 179273 178141 177546 177450 177772 178074 177960 177576
57233 177576 177258 176915 176224 175312 174730 174799 175413 176393 177561 178475 178699 178449 178483 179219 180506 182411 185560 190267
57215 190267 195817 201149 205996 210833 215933 221020 225820 230442 235106 239796 244332 248548 252292 255408
57201 255408 257853 259753 261269 262448 263289 263956 264833 266261 268189 270222 272146 274263 277002 280275 283510
57186 283510 286411 289414 293220 297988 303058 307493 310915 313895 317469 322145 327599 333539 340543 349581
57172 349581 360842 373668 387608 402922 419881 438158 457224 476749 496299 515187 533141
57161 533141 550788 568974 587915 607336 627138 647475 668534 690665 714409 739819 766031
57150 766031 792085 817976 844414 871818 900111 929263 959312 989946 1020788 1052104 1084562
57139 1084562 1118310 1152926 1188368 1225232 1263893 1304007 1345090 1387048 1429906 1473516 1517692
57128 1517692 1562149 1606167 1648962 1690639 1732287 1775031 1819641 1867197 1919152 1976104 2037248
57117 2037248 2101764 2170316 2244566 2325816 2414857 2512654 2620260 2738434 2868344 3012509
57107 3012509 3174160 3355786 3559379 3788302 4048034 4345022 4685976 5079247 5536660
57098 5536660 6073958 6710505 7469659 8379429 9472305 10784082 12351701 14209469 16383708
57089 16383708 18887644 21718091 24853750 28254647 31863370 35608409 39408622 43178890
57081 43178890 46837773 50313196 53536320 56420282 58840146 60640535 61678831 61878629
57073 61878629 61256461 59908049 57971956 55596426 52919351 50056489 47093459 44083658
57065 44083658 41054570 38019785 34991274 31987871 29038275 26178922 23448902 20884772
57057 20884772 18516738 16365961 14442841 12746786 11267657 9988364 8887954 7944498
57049 7944498 7136812 6444696 5848980 5332698 4882564 4488814 4143514 3839431 3570308
57040 3570308 3331131 3117523 2925290 2750879 2591781 2446072 2312022 2188433 2074787
57031 2074787 1970503 1874457 1785700 1704121 1629725 1561646 1498620 1440147 1386435 1337395 1292554
57020 1292554 1251861 1215596 1183247 1153277 1124443 1096820 1071299 1048621 1029175 1013177 1000666
57009 1000666 991820 987667 990162 1001404 1023465 1059465 1114215 1193263 1301639 1443099 1617355
56998 1617355 1813611 2005352 2154710 2227562 2209285 2109492 1953936 1771735 1586395 1412888
56988 1412888 1258599 1125867 1014626 924000 852438 797457 755931 724527 699590 677059 653446
56977 653446 627298 599482 571906 546135 523057 503054 485864 470515 455980 442090 429623
56966 429623 419523 412286 408116 407370 410556 417990 429664 445599 466138 491491 520622 550426 576198
56953 576198 593247 598603 591862 574976 551380 524840 498473 474185 452596 433339 415732 399590
56941 399590 385519 374368 366543 362096 361368 365113 373961 388127 407847 433715 466146 504240 544885
56928 544885 582672 611050 624653 621495 603376 574393 539161 501840 465549 431871 401146 373600
56916 373600 349810 329854 312643 296800 281949 268557 256820 246414 237195 229392 223049 217850
56904 217850 213618 210475 208382 206921 205705 204684 203998 203880 204728 206894 210311 214649 219881 226387 234549
56889 234549 244663 257232 272798 291313 311958 333568 354621 372701 384825 389098 385953 377513
56877 377513 365965 352823 339314 326696 315975 307619 301631 297787 295831 295724 297880 303208 312940
56864 312940 328337 350410 379780 416761 461362 512575 567142 618948 660271 684632 689510 677025
56852 677025 652212 620391 585659 551037 519019 491384 468748 450799 437121 427672 422708 422760
56840 422760 428810 442264 464651 497453 542079 599613 670235 752351 841362 928577 1001921 1049437
56828 1049437 1063993 1045917 1002056 942433 876618 811236 749464 692515 641517 597841 562010
56817 562010 533197 510244 492903 481903 478237 482804 496545 520554 555858 602872 660508 725251
56805 725251 790754 848313 888395 903411 890918 854951 803847 746105 687640 631754 580238
56794 580238 534011 493420 458552 429244 404916 384975 369549 359347 354737 355562 362004 374881
56782 374881 394700 420821 451560 484200 514479 537080 547740 544951 529653 504184 472085 437825
56770 437825 405190 375742 349371 325976 305843 288758 273845 260438 248400 237557 227556
56759 227556 218393 210439 203770 198041 193103 189117 185871 182630 179078 175905 173959 173048 172060 170201 167760
56744 167760 165547 163916 162557 161219 160193 159803 159640 158862 157265 155556 154325 153369 152350 151544 151323 151337
56728 151337 150936 150164 149594 149366 149182 149146 149748 150872 151629 151490 150908 150527 150351 150131 149973 150063 150205 150147 150016
56709 150016 149916 149415 148091 146394 145328 145216 145375 145178 144901 145204 146158 147201 147856 148094 148032 147678 147105 146604
56691 146604 146446 146546 146541 146164 145480 144800 144405 144331 144391 144447 144728 145682 147431 149447 150914 151360 150842 149685 148289
56672 148289 147068 146274 145747 145009 143677 141769 139633 137690 136146 134889 133738 132901 132914 133936 135352 136377
56656 136377 136856 137095 137163 136866 136234 135489 134591 133393 132203 131529 131212 130489 129101 127697 126886 126525 126278 126220
56638 126220 126448 126608 126324 125729 125085 124264 123079 121890 121373 121779 122726 123644 124213 124540 125071 126149 127613
56621 127613 129100 130668 132582 134494 135532 135445 135024 135063 135573 136327 137423 138750 139639 139763 139822 140603 141829
56604 141829 142697 143122 143604 144188 144416 144202 144000 144125 144521 145113 145831 146375 146422 146000 145296 144329 143278 142778 143325
56585 143325 144593 145902 147114 148519 150113 151645 153114 154607 155866 156657 157345 158470 159994 161619 163543
56570 163543 166072 168761 170871 172668 175346 179556 184732 189984 194934 199542 203883 208371 213649 219947
56556 219947 226873 233963 241091 248313 255576 262538 268434 272476 274757 276389 278180 279581 279596 278288 276492
56541 276492 274320 271043 266380 260934 255260 249342 243115 236700 230085 223334 217124 212230 208399 204618
56527 204618 200575 196953 194079 191332 188232 185216 182883 181127 179473 177690 175738 173693 172010 171259
56513 171259 171291 171146 170067 168127 165757 163286 161111 159654 158893 158419 158043 157785 157329 156258 154911 154101
56497 154101 153851 153352 152388 151777 151989 152402 152553 153144 154987 157722 160408 162807 165229 167635 169751 171808
56481 171808 174324 177295 180248 183007 185815 188767 191627 194255 196883 199872 203380 207279 211346 215582
56467 215582 220254 225397 230451 234784 238527 242368 246566 250677 254275 257345 259821 261322 261621 260944 259681
56452 259681 258173 256803 255747 254650 253096 251434 250483 250435 250814 251474 252744 254385 255474 255743 256151 257526
56436 257526 259271 259974 258752 255584 250964 245815 241237 237792 235167 232744 230099 226879 222893 218619
56422 218619 214973 212223 209713 206931 204192 201966 200163 198491 196906 195367 193755 192355 191739 191822 191707
56407 191707 190900 190018 189889 190533 191415 192074 192202 191791 191550 192377 194006 195056 194878 194456 194861 195798 196485 197093
56389 197093 198300 200004 201509 202619 203635 204507 204821 204556 204256 204456 205317 206679 208230 209833 211757 214190
56373 214190 216489 217628 217544 217299 217663 218376 219097 220102 221516 222805 223704 224803 226510 228178 229033 229284
56357 229284 229643 230389 231546 233257 235239 236569 236806 236730 237285 238425 239705 241257 243401 245997 249010 252989
56341 252989 258076 263264 267595 271448 275688 280244 284596 289002 293974 299036 303366 307399 312440 318656
56327 318656 324624 329014 331781 333539 334656 335225 335315 334955 334195 333206 332127 330932 329705 328754 328179 327700
56311 327700 327131 326539 325725 324221 322156 320447 319664 319355 319011 318912 319507 320714 322437 324948 328065 330796
56295 330796 332586 334127 336182 338420 340345 342583 346215 351432 357777 365010 372824 380409 387390 394635
56281 394635 403142 412747 422877 433883 446507 460582 475506 491509 509374 529295 551050 574881
56269 574881 601241 630128 661640 696687 736220 780351 829195 883862 945394 1013326 1086553
56258 1086553 1165126 1249975 1341307 1438404 1540403 1645797 1751620 1854553 1952724 2045299
56248 2045299 2130683 2206552 2271496 2325438 2368470 2400526 2422184 2434777 2439655 2437974 2430863 2418957
56236 2418957 2402157 2380611 2355347 2327015 2294675 2256884 2213319 2164171 2108723 2046022 1976582
56225 1976582 1902175 1824410 1744674 1664775 1586100 1508511 1431447 1355783 1283219 1214299 1148502
56214 1148502 1085992 1027826 974570 925991 881893 842105 805938 772757 742728 715938 691449
56203 691449 668392 647315 629122 613432 599402 587325 577779 569981 562833 556898 553357 551525 549501
56190 549501 546970 545370 545441 546525 548266 551140 555218 559949 565154 570878 576572 581836 587401 593702 599176
56175 599176 601939 602596 603370 604867 605877 605987 606086 606438 606526 606792 608376 611109 613827 616617 620652 625927
56159 625927 631333 636957 644080 652813 661951 671231 681567 692982 704574 716732 731189 748741 769039
56146 769039 792702 821404 855997 897085 947668 1012636 1095108 1195375 1313504 1450254 1604765
56135 1604765 1773460 1951389 2132334 2307545 2467576 2606832 2725097 2825069 2910936 2988788
56125 2988788 3064282 3137942 3204604 3258054 3294418 3311793 3310586 3295510 3274004 3250663 3224402
56114 3224402 3190836 3144445 3078333 2986164 2866866 2725674 2569762 2405271 2238866 2078252
56104 2078252 1928841 1792084 1668342 1558906 1463937 1381240 1308791 1246349 1193305 1147373
56094 1147373 1106824 1071878 1042680 1018089 997429 981037 968136 956674 946162 938064 932605 928120
56082 928120 924408 923430 925431 927693 928683 930199 933736 937937 941520 945661 951407 957564 963207 969652 977988
56067 977988 987176 996296 1006028 1016333 1025504 1033244 1041893 1052882 1064843 1076755 1089810 1104411 1118666
56054 1118666 1131828 1146010 1162417 1179132 1194770 1211068 1229586 1249089 1268453 1288966 1311369
56043 1311369 1333833 1355288 1377604 1402161 1427447 1452405 1478822 1507981 1538279 1568596 1600605
56032 1600605 1635210 1670134 1703583 1736921 1771336 1805544 1839262 1875068 1914090 1953694 1992102
56021 1992102 2031344 2072958 2115104 2156870 2201086 2249690 2300622 2352440 2407465 2467040 2528407
56010 2528407 2589834 2654190 2723825 2796740 2871420 2950441 3035442 3123798 3214340 3310952 3416225
55999 3416225 3527093 3641160 3761531 3890633 4025230 4162701 4306298 4458900 4617738
55990 4617738 4780799 4952231 5135799 5329545 5532711 5750956 5988509 6242429 6511181
55981 6511181 6801315 7118814 7461848 7829505 8229325 8668417 9145899 9662526 10228725
55972 10228725 10854445 11541031 12292515 13124522 14052367 15082211 16225265 17508711 18961541
55963 18961541 20604359 22467441 24605492 27082687 29963752 33341245 37360358 42209784
55955 42209784 48124845 55438105 64621355 76276155 91135191 110104112 134215938
55948 134215938 164382252 201015353 243601787 290134013 336499493 376540021 403561369
55941 403561369 412934936 404115214 380576368 347863062 311329067 274875582 240793912
55934 240793912 210120706 183070253 159424564 138820160 120880353 105249938 91624166
55927 91624166 79769991 69500067 60632763 52992704 46430849 40816443 36017040 31906489
55919 31906489 28384499 25370516 22785997 20558402 18634349 16972436 15528517 14260978
55911 14260978 13143620 12159707 11288275 10507588 9805884 9176689 8608070 8086871 7608652
55902 7608652 7173266 6774938 6405834 6064693 5752726 5465271 5196126 4945779 4716771
55893 4716771 4505077 4304458 4115380 3941369 3780090 3626127 3479367 3342823 3215115
55884 3215115 3092635 2976400 2869516 2770226 2674372 2582405 2497394 2418470 2342671 2271029 2206406
55873 2206406 2147133 2088807 2030564 1974028 1918181 1861095 1804911 1753447 1706488 1661722 1620460
55862 1620460 1585919 1557471 1532026 1509881 1494057 1485014 1480775 1480843 1484892 1488680 1486275 1475925 1459709
55849 1459709 1438605 1412138 1381726 1349866 1316642 1280867 1243697 1207361 1171506 1134612 1097821
55838 1097821 1063482 1031146 998931 967677 939795 915007 891099 867867 846595 826799 807395
55827 807395 790007 776993 767066 756782 745555 735223 725530 714319 701901 691125 683047 676150
55815 676150 669725 664486 659924 654582 649010 645112 642406 638103 631075 622842 614585 606044 597496 590006
55801 590006 583532 577207 571462 567478 564688 561180 556287 550580 543834 535416 526156 517356 508519 498582
55787 498582 488716 481282 476698 473966 473407 475639 478241 476709 468951 456358 440773 423259 405567
55774 405567 389719 375742 362193 348948 337098 326410 315639 305263 297100 291161 285487 279260
55762 279260 273410 268021 261895 255049 249076 244483 239936 234546 228755 222715 215973 209009 202915 197353
55748 197353 191142 185118 182068 183307 187456 192947 199507 206650 212944 217676 221535 224982 227453 228579
55734 228579 228669 227765 225758 223634 222902 223553 224090 223689 222753 221409 219217 216478 214085 211910 208954 205170
55718 205170 201568 198538 195711 193373 192297 192217 192212 192497 194108 196957 200098 203720 208893 215386 221833 228067
55702 228067 235236 243392 250958 256808 260942 263044 262353 259257 255083 250156 243918 236996 231045 226330
55688 226330 221476 215916 210490 205502 200383 195607 192718 191964 192034 192652 195097 199540 204155 207760 211195
55673 211195 215100 218416 220255 221432 222967 224726 226624 229596 234099 238998 242977 245950 248227 249510
55659 249510 249534 248576 246723 243795 240430 237838 235928 233081 228372 222572 216478 209849 202654 195796 189690
55644 189690 183592 177068 170749 164878 158628 151766 145559 141092 137918 135249 133129 131482 129300 125891
55630 125891 121932 118416 115503 113150 111793 111511 111501 111126 110624 110193 109369 107864 106016 103942 101352 98654
55614 98654 96916 96154 94972 92579 89844 87675 85739 83649 82045 81508 81521 81451 81482 81681 81305 79984 78550
55597 78550 77795 77404 76995 77100 78071 79033 79034 78415 78027 77853 77362 76534 75644 74638 73571 73018 73330 74037 74557
55578 74557 74771 74458 73074 70731 68484 66993 65771 64414 63585 63929 64897 65521 65641 65618 65588 65744 66596 68211
55560 68211 69820 70838 71529 72163 72369 72034 71899 72468 73058 72778 71839 71154 71172 71726 72486 73085 73380 73956 75647
55541 75647 78264 80625 82216 83831 86190 88986 91794 94826 98114 101018 103235 105330 107584 109296
55527 109296 109896 109804 109528 108847 107481 105572 102993 99317 95046 91555 89152 86601 83372 80776 79711
55512 79711 78820 76392 72846 69745 67311 64578 61317 58237 55759 53894 52840 52502 51963 50593 49108
55497 49108 48396 47985 46919 45485 44669 44385 43655 42246 40836 39819 39168 39185 40175 41525 42251 42345 42576 43084
55479 43084 43185 42455 41115 39464 37758 36426 35660 35041 34316 34063 34721 35484 35254 34300 33781 33875 33593 32402
55461 32402 30854 29546 28509 27843 28023 29214 30915 32537 33847 34766 35222 35308 35235 35124 35085 35307 35784 36243
55443 36243 36579 36978 37327 37077 36103 35131 34761 34651 34255 33815 33942 34662 35546 36284 36517 35679 33753 31713
55425 31713 30521 30090 29902 30016 30651 31317 31334 30852 30499 30394 30302 30447 31258 32566 33780 34659 35285 35640 35918
55406 35918 36768 38475 40228 40998 40739 40060 39178 38046 37019 36362 35466 33498 30729 28374 27208 27079
55390 27079 27520 28161 28715 29222 30052 31176 31890 31840 31737 32349 33314 33813 33810 33714 33336 32242 30721 29401 28268
55371 28268 27023 26026 25832 26153 26318 26429 26963 27550 27324 26387 25812 26259 27505 29229 31241 33049 34158
55354 34158 34760 35356 35853 35880 35667 35672 35593 34804 33527 32548 32042 31727 31869 32873 34100 34404 33852 33606 34091
55335 34091 34506 34281 33764 33279 32763 32557 33324 34779 35611 35115 33944 32913 32104 31628 32154 33955 36088
55318 36088 37236 36928 35607 33997 32696 31899 31271 30481 29931 30365 31724 33048 33624 33610 33392 32979 32178
55301 32178 30843 28937 26861 25580 25714 26582 26945 26636 26562 27131 27679 27665 27454 27569 27915 28154 28250 28315 28421
55282 28421 28707 29239 29763 30095 30598 31574 32373 32009 30616 29344 28731 28171 27160 26134 25705 25916 26555 27499
55264 27499 28458 29071 29464 30070 30791 31064 30862 30780 31048 31345 31730 32755 34354 35591 35932 35926 36229 36762 37183
55245 37183 37367 36998 35561 33269 31246 30251 29892 29527 29241 29395 29898 30491 31170 31818 32001 31675 31501 31899
55227 31899 32296 31894 30771 29719 29376 29942 31306 32927 34000 34231 34214 34629 35372 35846 35854 35779 36032 36623 37136
55208 37136 37022 36077 34735 33675 33154 32998 33095 33422 33687 33500 32893 32144 31174 29793 28447 27952 28410 29211
55190 29211 30175 31763 33923 35640 36123 35619 34628 33143 31241 29682 29134 29279 29394 29494 30194 31581 32849
55173 32849 33131 32383 31349 30777 30720 30689 30471 30482 31104 32141 33347 34954 36930 38236 37865 36355 35168
55156 35168 34666 33904 32461 31162 30684 30634 30535 30613 31007 31131 30502 29487 28709 28440 28950 30585 33020 35265
55138 35265 36907 38494 40295 41704 42561 44027 47246 51891 56805 61311 65104 67602 68439 68067 67065
55123 67065 65396 63084 60976 59797 58991 57467 55183 53099 51887 51573 52142 53501 54935 55482 54932 53863
55107 53863 52769 51681 50522 49231 47710 46126 45091 45016 45438 45475 44846 44076 43887 44687 46384 48317 49718
55090 49718 50557 51501 52732 53400 52819 51626 51076 51620 52836 54303 55728 56575 56498 56057 56238 57243 58328
55073 58328 58767 58443 57650 56878 56712 57420 58664 59972 61334 62904 64408 65375 65784 65958 65984 65720 65238 64804
55055 64804 64553 64510 64725 65012 64907 64358 64156 65118 67122 69418 71581 73604 75330 76473 77038 77145 76675
55038 76675 75612 74517 74000 73905 73636 73142 72954 73332 73999 74657 75199 75497 75536 75666 76145 76528 76048 74509 72272
55019 72272 69542 66437 63656 62132 61780 61322 59689 57108 54524 52459 50811 49326 47837 46248 44711
55004 44711 43745 43893 45134 46739 47738 47695 47092 46913 47726 49192 50463 50909 50450 49472 48616 48375 48724 49349
54986 49349 50283 51921 54183 56173 57134 57481 58321 60045 61870 62852 63000 63261 64567 66968 69689 72062
54970 72062 74245 76883 80317 84592 90141 97713 107427 118498 130141 142218 154680 167070 178996
54957 178996 190512 201436 210751 217187 220074 219242 214692 206976 197360 186924 175752 163650 151285
54944 151285 139906 130203 122067 115208 109289 103696 97936 92309 87562 83926 80992 78424 76233 74415
54930 74415 72876 71675 70889 70324 69860 70025 71711 75190 79823 84797 89931 95767 103130 112521 123733
54915 123733 136036 148676 160922 171680 179653 184178 185480 183936 179653 173045 165052 156312 146768
54902 146768 136598 126860 118490 111274 104521 98208 92670 87734 83060 78979 76052 74123 72572 71175
54888 71175 69894 68285 66076 63996 62991 62843 62583 62052 61947 62399 62664 62358 61923 61652 61190 60292 59311
54871 59311 58598 58012 57293 56426 55556 54956 55011 55744 56465 56433 55665 54512 52866 50628 48581 47762 48050 48395
54853 48395 48342 48280 48259 47799 47017 46734 47100 47159 46233 44802 43623 42831 42347 42291 42468 42215 41324 40545 40691 41738
54833 41738 43145 44494 45507 46032 46393 47201 48461 49381 49418 49025 49058 49876 51298 53022 54819 56680 58906
54816 58906 61762 65048 68465 72196 76482 80872 84829 88990 94831 102935 112580 123079 134353 145933
54802 145933 156734 166400 175647 184422 190833 192974 191032 186669 180985 174156 166515 158781 151332 144128
54788 144128 137286 131083 125473 120220 115405 111325 108033 105387 103367 101956 100926 100099 99601 99529 99698
54773 99698 100029 100845 102360 104300 106454 109215 113121 118195 124267 131646 140901 152217 165356 180030
54759 180030 195744 211493 226140 239040 249881 258058 262708 263419 260623 255300 248443 240576 231486
54746 231486 220591 207857 194246 181078 169065 158092 147685 137553 127916 119488 112821 107531
54734 107531 102552 97341 92427 88496 85497 83098 81483 80998 81201 81008 79839 78136 76655 75627 74787
54719 74787 73942 73230 72820 72534 71938 70853 69598 68547 67673 66793 66041 65689 65644 65615 65640 65937 66353 66623 67136
54700 67136 68615 70958 73181 74711 75893 76930 77292 76734 76117 76459 77659 78852 79578 79967 80176 80303
54684 80303 80545 80887 80854 80147 79245 78939 79481 80648 82335 84590 87309 90321 93540 96679 99186 100966
54668 100966 102783 105365 108393 110940 112666 114010 115391 116924 118824 121433 124760 128399 132013 135579
54654 135579 139189 142948 147048 151728 157202 163799 171986 182035 193864 207391 222679 239373 256221
54641 256221 271494 283702 291729 294743 292478 285476 274710 261141 245820 229929 214305 199257
54629 199257 185191 172960 162996 154562 146586 138980 132468 127311 123013 119194 115995 113501 111484 109917
54615 109917 109176 109401 110075 110574 110795 110928 110782 109749 107556 104847 102742 101696 101017 99755 97852 96023
54599 96023 94628 93321 91880 90684 90026 89557 88810 87781 86527 84767 82393 79931 77923 76257 74688
54584 74688 73579 73382 73733 73846 73631 73613 73834 73620 72514 70790 68937 67232 65930 65322 65371 65670 65875 65920
54566 65920 65790 65466 65195 65450 66487 68066 69669 70869 71566 72031 72559 73023 73063 72917 73588 75721 78620
54549 78620 80947 82194 82931 83739 84557 85232 86205 88332 92109 97127 102333 106998 111470 116733 123171 130238
54533 130238 137399 144714 152028 158209 161941 163005 162216 160360 157692 154237 149925 144601 138393 131932
54519 131932 125822 120172 114992 110555 106858 103299 99619 96611 95048 94339 93269 91729 90569 89953 89129
54504 89129 87910 87169 87493 88323 88813 88673 87864 86343 84581 83533 83524 83727 83253 82277 81657 81892 82846 84059
54486 84059 84963 85156 84866 84856 85578 86693 87585 87978 87900 87450 86872 86492 86335 86131 85834 85760 86021 86255 86151 85863
54466 85863 85671 85539 85278 84857 84358 83892 83671 83863 84231 84222 83538 82366 81017 79690 78638 78118 78044 78113 78401
54447 78401 79367 81057 82744 83608 83500 82854 82154 81657 81313 80814 80039 79447 79587 80154 80058 78717 76780 75329
54429 75329 74787 74916 75418 76142 76973 77873 78848 79634 79731 79006 78018 77479 77590 78125 78869 79741 80742 82075 84111
54410 84111 86961 90207 93222 95689 97703 99521 101305 102974 104287 105277 106470 108390 110898 113421 115751
54395 115751 118001 119781 120140 118715 116408 114510 113471 112835 111946 110347 107863 104812 101934 99703 97869
54380 97869 95977 94127 92825 92203 91778 90937 89427 87374 85117 83095 81730 81262 81578 82167 82407 82143
54364 82143 81926 82376 83368 84118 84064 83310 82221 81049 80043 79541 79774 80872 83033 86259 89902 93087 95760
54347 95760 98707 102282 105715 108170 109921 111855 114154 116132 117184 117253 116445 114775 112487 110151 108204
54332 108204 106557 104845 102919 100969 99191 97470 95543 93442 91538 90008 88508 86682 84771 83276
54318 83276 82109 80671 78832 77219 76315 75737 74742 73087 71101 69229 67758 66722 65860 64872 63841 63151
54302 63151 62882 62666 62217 61622 60977 60233 59545 59206 58979 58140 56587 55335 55324 56216 56964 57209 57456 58042 58600
54283 58600 58499 57420 55572 53699 52685 52754 53212 53304 53062 52924 52863 52530 52084 52213 53242 54671 55685 55858
54265 55858 55444 55310 56354 58541 60702 61755 61972 62440 63503 64552 65317 66389 68127 69893 70967 71597
54249 71597 72466 73548 74217 74219 73802 73009 71616 69873 68562 68020 67664 66874 65875 65251 64948 64398 63501 62844
54231 62844 62868 63356 63883 64283 64433 64107 63428 63101 63741 65144 66550 67521 68191 68817 69409 69755 69572 68780 67805
54212 67805 67362 67685 68254 68537 68628 68729 68511 67642 66593 66150 66308 66458 66491 66850 67492 67812 67759 68052 68900 69362
54192 69362 68528 66717 64978 63963 63702 63957 64304 64295 63976 63796 63693 62884 61019 58969 57840 57667 57678 57383
54174 57383 56694 55432 53631 52223 52519 54752 57694 59914 61038 61639 62264 62873 63118 62949 62794 63110 63895
54157 63895 64845 65856 67023 68206 69042 69435 69600 69562 69145 68516 68138 67998 67514 66408 65060 63748 62237
54140 62237 60528 59206 58577 58142 57500 57062 57217 57504 57422 57362 57818 58228 57688 56454 55596 55345 54905 53916 53033
54121 53033 52858 53179 53544 53879 54296 54782 55299 55721 55702 55094 54421 54323 54590 54453 53815 53425 53686 54078 54046 53760
54101 53760 53663 53851 54247 54900 55713 56293 56401 56236 56070 55952 55980 56436 57327 58143 58415 58244 57988 57686 57125 56289
54081 56289 55424 54737 54285 54099 54231 54675 55369 56201 56956 57314 57105 56553 56215 56524 57318 57916 57829 57406 57510
54062 57510 58557 60182 61825 63251 64295 64662 64405 64247 64886 66212 67655 69042 70585 72220 73599
54047 73599 74765 76244 78297 80518 82335 83635 84743 86024 87598 89357 91229 93450 96364 99850
54033 99850 103230 106025 108503 111256 114509 118178 122265 126723 131181 135286 139128 142854 146129 148500
54019 148500 150176 151931 154271 157093 159975 162406 163929 164615 165178 166105 166864 166550 165092 163203 161306
54004 161306 159200 156726 154011 151085 147921 144885 142497 140713 139055 137447 136227 135307 134028 132027
53990 132027 129674 127489 125634 124042 122518 120741 118682 116939 115981 115186 113469 110879 108666 107623 107195
53975 107195 106500 105368 104082 102882 102145 102312 103152 103703 103352 102491 101825 101643 101985 102844 103827 104288 104185 104186
53957 104186 104596 104868 104565 104079 103910 103935 103921 104046 104343 104317 103843 103774 104897 106803 108597 110197 112057 114050
53939 114050 115723 117522 120706 125845 132144 138438 144265 149759 154993 159673 163228 165144 165438 164836 164243
53924 164243 164018 163970 163974 164306 165375 167213 169302 170984 172225 173886 176850 180963 185270 189302 193488 198240
53908 198240 203387 208828 214877 221395 227300 231656 234726 237230 239113 239958 240159 240587 241141 240645 238416
53893 238416 235197 232302 230367 229088 227652 225199 221286 216130 210216 203738 196779 189923 184072 179517
53879 179517 175647 171783 167941 164552 161750 159190 156441 153353 150099 146911 143779 140495 137052 133752
53865 133752 130756 127734 124323 120764 117706 115392 113439 111450 109425 107499 105647 103855 102290 100994
53851 100994 99582 97632 95384 93739 93325 93764 94082 93731 92799 91362 89285 86985 85658 85991 87013 87114
53835 87114 86050 85056 84983 85316 85310 85035 84773 84208 82994 81596 80763 80528 80354 80015 79778 79973 80838 82477 84557
53816 84557 86396 87747 89061 90573 91695 91939 91873 92371 93447 94750 96739 100248 104968 109486 112936
53801 112936 115787 118846 122370 126335 130762 135390 139679 143438 147028 150708 154257 157359 159908 161806
53787 161806 162948 163544 163999 164395 164561 164733 165502 166908 168195 168734 168673 168396 167818 166593 164666 162303 159824
53770 159824 157515 155483 153429 150902 147935 145092 142710 140503 138115 135656 133384 131178 128659 125649
53756 125649 122310 119043 116301 114262 112534 110554 108401 106829 106311 106434 106465 106194 105911 105868 106072 106377 106519
53739 106519 106188 105292 104010 102559 101201 100502 101097 102894 104898 106067 106106 105199 103490 101245 99179 98007
53723 98007 97721 97765 97826 98103 98827 99904 101069 102120 102959 103576 104049 104427 104660 104702 104640 104613 104709 105021 105628 106442
53703 106442 107231 107883 108398 108568 108028 106920 106163 106650 108291 110267 112101 114068 116573 119527 122484 125065
53687 125065 127122 128677 129853 130804 131657 132553 133688 135171 136925 138832 140883 142965 144648 145576 146068
53672 146068 147012 148972 151569 153848 155088 155235 154824 154680 155462 157187 159202 160801 161833 162635 163448 164137
53656 164137 164525 164763 165255 166227 167429 168242 168135 167134 165906 165290 165657 166731 167963 168941 169426 169261 168522
53639 168522 167651 167177 167230 167492 167679 167865 168201 168496 168276 167275 165757 164359 163681 163972 165075 166578 168012
53622 168012 169011 169441 169536 169821 170704 172099 173523 174611 175424 176227 177135 178047 178808 179354 179782 180319 181159 182347
53604 182347 183936 186230 189590 193881 198295 201914 204408 206151 207801 209838 212350 215172 218313 222134
53590 222134 226833 231837 236194 239688 243036 246738 250300 253116 255662 259022 263402 267835 271446 274357
53576 274357 277207 280301 283514 286585 289189 291058 292338 293665 295614 298218 301115 303914 306212 307553
53562 307553 307770 307276 306713 306278 305689 304757 303677 302649 301490 299917 298066 296418 295188 294063 292693 291244
53546 291244 290197 289686 289261 288373 286909 285220 283811 283078 283109 283557 283728 283006 281293 279149 277504 277062 277788
53529 277788 278986 280070 281155 282719 284786 286865 288669 290517 292871 295834 299222 302811 306312 309428
53515 309428 312186 315034 318461 322756 328182 335048 343412 352956 363266 373963 384563 394690 404599
53502 404599 414979 426084 437558 449316 461915 475693 490207 504988 520255 536340 553120
53491 553120 570676 589819 611048 633536 656071 678614 701889 725817 749521 772726 795981
53480 795981 819462 842696 865639 888913 912665 936178 959011 981672 1004782 1028365 1052343
53469 1052343 1076873 1101701 1126003 1149437 1172606 1195824 1218100 1238167 1256095 1273058 1289749
53458 1289749 1305733 1320301 1333429 1345805 1358219 1370904 1383352 1394930 1405710 1416273 1426534
53447 1426534 1435216 1440857 1443022 1442287 1439493 1435344 1430296 1424239 1416385 1405905 1392686 1377359 1360867
53434 1360867 1344096 1327494 1310670 1292661 1272916 1251804 1229936 1207346 1183758 1159357 1134867
53423 1134867 1110929 1087704 1064954 1042340 1019850 998067 977785 959206 941827 925249 909703
53412 909703 895646 883251 872542 863500 855705 848422 841531 835966 832727 831836 832729 835228 839451 845153
53398 845153 851948 860068 870190 882429 896134 910769 926483 943663 962321 982133 1002792 1024264
53386 1024264 1046865 1071100 1097230 1124978 1153846 1183661 1214673 1247224 1281484 1317401 1354797
53375 1354797 1393679 1434530 1477957 1523884 1571466 1620108 1670158 1722183 1775883 1830216 1884361
53364 1884361 1938074 1991296 2043920 2095830 2146706 2195815 2242395 2286120 2326844 2364169 2397791
53353 2397791 2428143 2456099 2482084 2505947 2527582 2547052 2564114 2578241 2589228 2597227 2602002 2602621
53341 2602621 2598070 2587727 2571081 2547515 2516737 2479173 2435749 2387636 2336353 2283692 2231059
53330 2231059 2178943 2127250 2075988 2025376 1975494 1926178 1877375 1829366 1782494 1736707 1691453
53319 1691453 1646076 1600310 1554422 1509029 1464867 1422593 1382514 1344529 1308594 1275191 1244942
53308 1244942 1217809 1193180 1170879 1151386 1134640 1119321 1103992 1088587 1074085 1061021 1049070
53297 1049070 1037898 1027564 1018066 1009293 1001488 995036 989612 984249 978564 973286 969252 966469 964526
53284 964526 963398 963316 964250 966037 968839 973110 979303 987820 998892 1012117 1026483 1041392 1057464 1075787
53270 1075787 1096420 1118212 1140184 1162527 1185962 1210479 1235180 1259222 1282552 1305630 1328655
53259 1328655 1351238 1372664 1392338 1410053 1426057 1440909 1455089 1468643 1481285 1492867 1503489
53248 1503489 1513024 1520767 1525802 1527649 1526334 1521974 1514549 1504078 1490775 1474983 1457092 1437485 1416369
53235 1416369 1393681 1369316 1343430 1316373 1288382 1259579 1230379 1201682 1174531 1149470 1126220
53224 1126220 1104002 1082346 1061541 1042056 1023501 1004578 984331 963126 942037 921541 901250
53213 901250 880745 860101 839667 819825 801079 783920 768455 754424 741674 730270 720075
53202 720075 710558 701264 692203 683580 675295 666863 657749 647693 636803 625423 613849 602128 590165
53189 590165 577909 565399 552802 540538 529210 519141 510077 501450 492785 483690 473852 463436
53177 463436 453206 443683 434340 424130 412783 401049 389658 378599 367549 356526 345876 335903
53165 335903 326669 317926 309289 300791 293173 287158 282466 278036 273236 268263 263324 258171 252719 247504
53151 247504 243086 239459 236408 233961 232029 230012 227288 223887 220308 216884 213737 211055 208946 207142
53137 207142 205268 203283 201365 199463 197354 195040 192725 190455 188184 186165 184903 184584 184752 184742 184378
53122 184378 184160 184768 186307 188084 189227 189610 189990 191186 193297 195732 197721 198653 198264 196837 195076 193507
53106 193507 192053 190365 188404 186489 184837 183302 181517 179149 176144 172888 170066 168144 166965 165985
53092 165985 164790 163279 161464 159397 157277 155385 153822 152362 150709 148780 146658 144340 141664 138673
53078 138673 135895 133985 132992 132249 131166 129856 128743 127866 126991 126156 125523 124835 123680 122299 121469 121380 121276
53061 121276 120467 119136 117860 116951 116621 117128 118152 118576 117666 116148 115340 115435 115406 114530 113185 112019 111092
53044 111092 110166 109277 108603 108070 107471 106815 106316 106157 106352 106727 106931 106729 106373 106473 107285 108312 108801 108509
53026 108509 107764 106849 105613 103780 101529 99566 98588 98697 99444 100391 101495 102915 104536 105891 106526 106339
53010 106339 105551 104506 103557 103007 102985 103307 103580 103559 103342 103084 102600 101513 99868 98339 97540 97368 97283 97087
52992 97087 97049 97377 97998 98869 100011 101106 101556 101235 100848 101198 102264 103332 103921 104380 105483 107601 110295
52975 110295 112802 114969 117481 120871 124507 127135 128414 129339 130958 133233 135522 137598 139659 141662
52961 141662 143213 143992 143893 142901 141251 139585 138484 137865 137132 135881 134259 132756 131880 131806 132068 131780 130549
52944 130549 129001 128081 127983 128092 127788 126923 125721 124697 124549 125581 127197 128416 128951 129398 130351 131724 132986
52927 132986 133695 133734 133338 132987 132995 133202 133302 133350 133592 133947 134122 134240 134814 136002 137330 138283 138763 138864 138621
52908 138621 138155 137665 137158 136557 136178 136579 137727 138823 139304 139614 140575 142310 144201 145662 146580 147165 147697
52891 147697 148317 148826 148897 148753 149306 151220 154013 156535 158180 159228 160082 160730 161010 160982 160808 160578 160414 160509
52873 160509 160948 161618 162451 163528 164839 166123 167085 167684 168081 168391 168573 168539 168327 168222 168641 169768 171340
52856 171340 172994 174766 176923 179310 181291 182573 183759 185742 188830 192786 197380 202248 206393 208651
52842 208651 208920 208318 207777 206968 205054 202030 198728 195800 193349 191390 189955 188694 187003 184751 182427
52827 182427 180373 178356 176086 173689 171348 168909 166217 163559 161365 159651 158060 156283 154250 152095
52813 152095 150184 148934 148327 147836 147100 146393 146081 145871 145089 143582 141862 140459 139475 138748 138007 136904 135338
52796 135338 133784 132947 132950 133178 132970 132213 131259 130580 130485 130849 131039 130468 129210 127762 126283 124589 122991 122424
52778 122424 123281 124573 124834 123750 122386 121791 121803 121402 120000 118091 116619 115945 115626 115177 114651 114164 113174
52761 113174 110839 107220 103597 101249 100188 99443 98344 97107 96181 95450 94285 92259 89642 87169 85397
52746 85397 84303 83495 82705 81951 81354 80990 80952 81330 82049 82891 83742 84640 85576 86459 87362 88499 89765 90552
52728 90552 90350 89399 88432 87813 87227 86269 85010 83813 82772 81602 80059 78330 76981 76532 77003 77815 78171
52711 78171 77734 76966 76686 77238 78212 79077 79860 80965 82489 84142 85842 87970 90797 93979 96875 99059
52695 99059 100288 100322 99295 98089 97739 98368 99125 99239 98776 98261 97965 97772 97379 96391 94452 91662 88681
52678 88681 86255 84637 83596 82764 81799 80445 78693 76890 75454 74484 73724 72840 71657 70283 69100 68487
52662 68487 68351 68075 67166 65908 65081 65008 65135 64675 63553 62565 62563 63542 64587 64763 64046 63245 63084 63591 64460
52643 64460 65703 67595 70138 73009 76046 79347 82750 85566 87130 87416 86781 85333 82964 79893 76703
52628 76703 73749 70992 68579 67102 66907 67464 67857 67691 67175 66515 65800 65323 65373 65620 65296 64284 63523 63996
52610 63996 65645 67620 69293 70678 72062 73565 74958 75731 75523 74699 74271 75003 76769 78939 81017 82619
52594 82619 83247 82680 81451 80531 80588 81822 84208 87363 90333 92132 92615 92533 92739 93634 95142 96750 97717
52577 97717 97742 97413 97543 98145 98613 98822 99437 100980 103137 105093 106162 106089 105303 104907 105849 107874 109808 110905
52559 110905 111410 111742 111953 112195 112862 113839 114383 114282 114412 115464 116730 117001 116201 115280 114777 114422 114015 113754
52541 113754 113530 112756 111292 109974 109796 110866 112442 113779 114652 115181 115424 115213 114388 113137 111955 111198
52525 111198 110803 110539 110341 110292 110533 111343 113026 115337 117294 117991 117498 116637 116007 115637 115391 115183 114839 114295
52507 114295 114042 114760 116345 117754 118143 117759 117427 117514 117867 118425 119319 120321 120773 120305 119330 118541 118081 117542
52489 117542 116734 116164 116515 117807 119306 120252 120503 120379 120099 119584 118780 117952 117497 117541 117836 118115 118449 119050
52471 119050 119830 120372 120416 120067 119408 118196 116302 114229 112736 112019 111680 111483 111627 112207 112896 113442 114013 114711
52453 114711 115083 114566 113265 111962 111397 111668 112232 112352 111728 110818 110344 110385 110257 109409 108064 106743 105622
52436 105622 104748 104482 105159 106499 107815 108695 109063 108763 107718 106436 105790 106082 106791 107355 107886 108867 110443
52419 110443 112231 113715 114719 115505 116372 117143 117288 116707 116070 115999 116216 116074 115727 116019 117120 118043 117896 117038
52401 117038 116484 116629 117136 117813 118909 120503 122161 123438 124360 125223 126149 127095 128112 129337 130720 132069
52385 132069 133424 135141 137483 140277 143171 146053 148906 151335 152679 152731 152061 151468 151373 151895 153076 154652
52369 154652 155877 156102 155562 155198 155695 156953 158505 160065 161576 162981 164156 165022 165683 166512 167961 170106
52353 170106 172475 174515 176114 177344 177903 177379 176102 175205 175514 176714 177923 178811 179761 181101 182642 184024
52337 184024 185188 186299 187385 188257 188785 189115 189525 190106 190681 191090 191457 192113 193268 194871 196732 198721
52321 198721 200815 203019 205220 207180 208755 210166 211863 214057 216502 218910 221456 224637 228700 233395
52307 233395 238248 242838 246849 250179 253155 256391 260235 264484 268835 273514 279171 286114 293921 301949
52293 301949 309974 318074 326070 333575 340669 348028 356103 364519 372675 380634 388921 397699 406763 416246
52279 416246 426607 437809 449205 460473 472044 484289 496883 509342 521630 533760 545318
52268 545318 555990 566199 576586 587145 597456 607479 617499 627458 636959 645786 653884 660987
52256 660987 666967 672391 678005 683599 688077 690769 692148 693083 693957 694627 694709 693718 691440 688425 685725 683919
52240 683919 682715 681581 680358 679125 678015 677385 677827 679682 682788 686871 691894 697928 704972 713003 721875
52225 721875 731130 740323 749640 759735 770817 782293 793553 804661 816014 827681 839367 850747
52213 850747 861559 871584 880748 889052 896414 902832 908686 914363 919484 923042 924559 924653 924146 923111
52199 923111 921118 917971 913748 908442 902022 894698 886784 878489 870059 861880 854164 846806 839679 832774
52185 832774 825862 818483 810607 802878 795798 789064 782124 775006 768118 761570 755255 749368 744250 739834
52171 739834 735705 731626 727628 723673 719606 715306 710624 705450 700193 695807 692763 690267 687127 683235
52157 683235 679481 676383 673585 670744 668129 666063 664400 662923 661730 660858 659889 658326 656110 653492 650628
52142 650628 647581 644462 641275 637734 633557 628884 624248 620122 616565 613241 609717 605791 601655 597736
52128 597736 594326 591344 588371 584889 580617 575766 570879 566342 562191 558464 555406 552985 550457 546934
52114 546934 542433 537921 534290 531670 529860 528914 528914 529476 529898 529772 529195 528472 527959 528174 529703 532664 536386
52097 536386 539926 543054 546627 551830 559058 567631 576536 585282 594084 603473 613906 625626 638728
52084 638728 653250 669175 686207 703626 720646 737022 753205 769873 787509 806362 826378
52073 826378 846931 866965 885739 903288 920003 935976 951013 964973 977784 989325 999579
52062 999579 1008633 1016284 1021964 1025507 1027694 1029467 1030825 1031046 1029819 1027502 1024315 1020020 1014512 1008123
52048 1008123 1001077 993235 984721 976252 968418 960960 953199 944940 936616 928698 921290 914272 907619 901609
52034 901609 896751 893362 891199 889752 888929 889072 890120 891258 891809 892190 893535 896462 900628 905437 910646
52019 910646 916120 921387 925936 929940 934304 939741 945896 951675 956373 960178 963415 965804 966917 967044
52005 967044 966844 966168 963982 959716 954049 947848 940815 931863 920636 908004 895016 881846 867857
51992 867857 852348 835079 816366 796823 776874 756451 735273 713362 691035 668464 645584
51981 645584 622551 599901 578024 556745 535741 515208 495700 477350 459652 442164 425086
51970 425086 408957 393990 380018 366927 354780 343506 332817 322557 312927 304227 296560 289804
51958 289804 283684 277770 271793 266159 261809 259185 257491 255347 252057 247971 243853 240366 237992 236755
51944 236755 235936 234650 232920 231629 231182 230871 229985 228946 228553 228443 227210 224147 220168 216665 213996 211468
51928 211468 208481 205202 202172 199666 197548 195592 193820 192503 191795 191329 190305 188114 184944 181692 179215
51913 179215 177655 176484 175107 173384 171587 170016 168787 167935 167532 167603 167966 168261 168179 167629 166756 165833 165097
51896 165097 164602 164205 163692 162988 162241 161683 161394 161224 160970 160580 160073 159307 158031 156241 154343 152797 151761
51879 151761 151272 151560 152808 154593 155959 156263 155757 155181 155009 155228 155630 156023 156281 156506 157069 158269 159872
51862 159872 161261 162143 162901 164117 165841 167504 168583 169202 170024 171556 173633 175548 176649 176781 176212 175292
51846 175292 174212 173085 172194 172089 173288 175737 178640 181065 182761 184274 186167 188281 189910 190641 190855
51831 190855 191366 192653 194466 196140 197264 197971 198578 199083 199196 198793 198087 197376 196915 197083 198230 200079 201651
51814 201651 202202 202107 202375 203376 204529 205225 205571 206002 206599 207089 207312 207434 207870 209073 211137 213448 215105
51797 215105 215888 216479 217395 218205 218318 218119 218498 219420 219866 219368 218681 218623 219042 219540 220481 222432 225021 227225
51779 227225 228759 230392 232827 235907 238990 241529 243119 243509 242826 241472 239712 237689 235758 234215 232691
51764 232691 230536 227979 226140 225476 225021 223758 222072 221009 220661 220287 219725 219524 219630 219089 217516 216005
51748 216005 215929 217278 218743 219155 218384 217060 215898 215257 215006 214781 214427 214089 213794 213242 212217 211021 210181
51731 210181 209830 209609 209124 208249 207056 205661 204173 202610 200881 198913 196812 194790 192996 191467 190156
51716 190156 188896 187483 185941 184645 183963 183789 183604 183017 182097 181205 180638 180478 180598 180724 180605 180169 179454
51699 179454 178382 176802 174820 172899 171496 170704 170417 170666 171546 172847 174134 175367 177205 180445 185231
51684 185231 191032 197394 204485 212737 221942 230735 237081 239495 237961 233686 227962 221379 214091 206444
51670 206444 198957 191906 185370 179702 175463 172711 170729 168656 166184 163491 160861 158536 156669 155057
51656 155057 153192 150968 149148 148668 149456 150318 150170 149127 148260 148444 149607 150997 151999 152575 152965 153138
51640 153138 152798 151851 150588 149308 148060 146928 146255 146315 146898 147517 147823 147624 146722 145086 143190 141783 141306
51623 141306 141638 142352 142954 143016 142384 141338 140382 139930 140215 141241 142628 143720 144188 144389 144829 145466 145899 145983
51605 145983 145841 145487 144960 144703 145235 146492 148026 149717 151630 153223 153654 153140 153237 155165 158407 161466
51589 161466 163557 164947 165992 166611 166764 166884 167597 169216 171542 173982 175835 176635 176375 175464 174555 174272
51573 174272 174827 175837 176731 177416 178337 179848 181745 183546 185018 186357 187971 190088 192432 194372 195715
51558 195715 197196 199681 202894 205501 206638 206811 207053 207727 208530 209156 209457 209258 208501 207460 206432 205437
51542 205437 204457 203660 203054 202191 200706 198941 197596 196950 196834 197159 197925 198796 199248 199279 199509 200395 201655 202608
51524 202608 202891 202667 202330 202185 202355 202810 203385 203734 203510 202803 202343 202856 204127 205093 205046 204353 203721 203176 202264
51505 202264 200944 199677 198656 197578 196343 195542 195950 197645 199787 201272 201578 200995 200049 198842 197192
51490 197192 195323 193949 193549 193908 194545 195181 195571 195430 194959 194959 195889 197193 198156 199033 200628 203036 205659
51473 205659 208345 211540 215230 218581 220939 222491 223705 224775 225939 227540 229248 229842 228487 225897
51459 225897 223587 222256 221473 220617 219411 217607 214966 211707 208412 205248 201776 197792 193844 190530 187660
51444 187660 184637 181417 178541 176279 174359 172640 171492 171188 171337 171298 170864 170141 169042 167428 165658 164454
51428 164454 164123 164324 164631 164907 164964 164340 162695 160193 157280 154277 151357 148675 146327 144364 142913 142066
51412 142066 141577 140960 139925 138453 136462 133871 131082 128836 127370 126170 124788 123356 122038 120558 118684
51397 118684 116667 114767 112908 111222 110339 110492 110860 110542 109710 109091 108832 108739 109124 110244 111178 110551 108468
51380 108468 106622 106227 106820 107399 107633 107456 106443 104432 102232 100923 100683 100785 100569 100018 99558 99569 99974
51363 99974 100222 99877 99283 99276 100217 101645 102946 103891 104487 104815 105186 105958 107007 107825 108244 108580 108984 109262 109489
51344 109489 110153 111355 112524 113304 114113 115386 116833 117918 118564 118905 118825 118238 117396 116398 114871 112677 110406
51327 110406 108510 106469 103688 100881 99531 99957 100809 100598 99082 96985 95095 93864 93330 93031 92400 91485
51311 91485 90977 91261 91844 92001 91716 91594 91946 92364 92240 91471 90489 89695 89067 88378 87621 87015 86692 86603 86782
51292 86782 87402 88507 89878 91274 92566 93552 93966 93881 93820 94203 94884 95460 95868 96358 97002 97503 97477 96786 95670
51273 95670 94602 93844 93086 91803 90072 88640 87998 87780 87437 87109 87337 88181 89129 89759 90048 90102 90051 90148 90531
51254 90531 90872 90660 89872 89060 88729 88917 89414 90104 91018 92249 93797 95332 96266 96338 96064 96315 97486 99314
51236 99314 101331 103070 103989 103786 102904 102221 102069 101979 101580 101317 101925 103472 105327 106873 107951 108701 109300
51219 109300 109915 110581 111096 111175 110861 110623 110929 111780 112833 113852 114854 115784 116363 116459 116378 116488 116687 116658 116544
51200 116544 116889 117814 118725 119090 119101 119239 119559 119786 119825 119789 119686 119471 119265 119120 118730 117741 116280 114799 113476
51181 113476 112130 110721 109571 109030 109133 109517 109505 108483 106563 104710 103813 103696 103478 102792 102094 101811 101771
51164 101771 101700 101707 101943 102171 102040 101621 101316 101353 101593 101827 102032 102300 102529 102324 101341 99819 98481 97725 97198
51145 97198 96546 96286 97273 99347 101224 101976 102047 102384 102989 102863 101279 98665 96233 94963 94951 95548 95979 95888
51127 95888 95368 94680 94111 93967 94354 94985 95426 95605 95838 96370 97176 98209 99485 100807 101721 101966 101764 101528
51109 101528 101538 101934 102707 103547 104017 104092 104286 105022 106151 107312 108492 109899 111434 112705 113565 114429 115983
51092 115983 118609 122005 125326 127839 129524 130910 132332 133593 134375 134617 134340 133522 132430 131740 131942 132779
51076 132779 133622 134237 134886 135849 137140 138465 139153 138381 135990 132906 130322 128556 127197 126178 125943 126506
51060 126506 127127 127255 127191 127395 127616 127316 126604 126156 126274 126540 126459 126028 125576 125304 125079 124584 123674 122682 122229
51041 122229 122503 122876 122581 121647 120811 120551 120737 121285 122585 124892 127653 129921 131339 132435 134013 136470
51025 136470 139540 142447 144450 145585 146741 148712 151202 153145 153964 154207 154888 156588 159216 162257 165003
51010 165003 166911 168012 168893 170154 171990 174324 177056 180030 183020 185980 189123 192621 196412 200463
50996 200463 204973 210139 215920 222255 229299 237153 245561 254146 262866 271964 281629 291970 303198 315542
50982 315542 329064 343919 360719 380305 403068 428811 457362 489054 524416 563529 605845
50971 605845 650651 697698 747336 800033 855756 913868 973473 1033536 1092616 1148966 1201232
50960 1201232 1248889 1291685 1328916 1359709 1383873 1402028 1414731 1421871 1423114 1418794 1410211 1399061
50948 1399061 1386561 1373164 1359182 1345613 1333916 1324812 1317637 1311066 1304116 1296103 1286181 1273632
50936 1273632 1258478 1241127 1221369 1198225 1170824 1139025 1103226 1064099 1022513 979267 934807
50925 934807 889589 844601 800989 759200 719083 680830 645125 612272 581948 554065 529103
50914 529103 507191 487573 469535 453264 439176 426950 415946 406224 398358 392392 387699 383860
50902 383860 380990 379128 377865 376785 375876 375313 375139 375294 375715 376270 376824 377500 378701 380736 383534 386802
50886 386802 390365 394271 398616 403384 408472 413845 419598 425870 432761 440422 449072 458793 469467 481114
50872 481114 494113 508767 524789 541766 560090 580815 604392 630234 657964 688601 723885
50861 723885 764762 811197 863382 922460 989886 1066522 1152531 1247768 1351952 1464602 1584996
50850 1584996 1712222 1845161 1982321 2121585 2260079 2394398 2521074 2636752 2738059
50841 2738059 2821857 2886199 2931076 2957936 2968360 2963373 2944004 2912258 2871439 2825635 2778977
50830 2778977 2735185 2697335 2667491 2646206 2632445 2624291 2619741 2616757 2612714 2604393 2588887 2564457
50818 2564457 2530448 2486563 2432381 2367431 2291596 2205519 2110685 2009116 1903118 1795361 1688784
50807 1688784 1585790 1487556 1394522 1307515 1227789 1155904 1091301 1033263 981740 936927 898662
50796 898662 866690 840970 821203 806520 796148 790006 788159 790105 795126 802843 812862 824306
50784 824306 836315 848637 861013 872463 882045 889988 897126 903386 907764 909647 909078 905733 898747
50771 898747 887887 873943 857632 838992 818306 796775 775703 755615 736666 719212 703360
50760 703360 688511 674131 660745 649616 641594 636610 634080 633484 634856 639013 647001 659007 674150
50747 674150 691571 711324 733956 759930 790036 825715 868130 917089 971658 1031699 1098143
50736 1098143 1171875 1252927 1340604 1433550 1529562 1625975 1720528 1811454 1896718 1973702 2039784
50725 2039784 2092754 2130629 2151832 2156044 2144521 2119260 2082279 2036061 1984197 1930791 1879226
50714 1879226 1831802 1790255 1755895 1729055 1708989 1694634 1685208 1679839 1676915 1674201 1669514 1660970
50702 1660970 1646735 1625089 1595050 1556724 1510846 1458240 1400067 1338357 1275681 1214058 1154478
50691 1154478 1097598 1044480 996284 953456 915693 882600 854077 830128 810797 796382 787352
50680 787352 783789 785230 791248 802041 818176 839936 867106 899201 935530 975042 1016424 1058414
50668 1058414 1099840 1139370 1175593 1207551 1235017 1258123 1276948 1291706 1303118 1312134 1319168 1323774
50656 1323774 1325170 1322966 1317350 1308772 1297654 1284425 1269812 1254946 1240997 1228547 1217488 1207762
50644 1207762 1200203 1196385 1197557 1203875 1214661 1229048 1246213 1265309 1285574 1306522 1327796 1348839
50632 1348839 1368840 1387045 1402995 1416555 1427810 1436871 1443704 1448266 1450961 1452932 1455732 1460722 1468771
50619 1468771 1480212 1494782 1511731 1530273 1549827 1569453 1587182 1600534 1608080 1610191 1607998 1601947
50607 1601947 1591811 1577894 1561564 1544269 1526350 1507075 1485559 1461215 1433481 1401735 1365844
50596 1365844 1326477 1284538 1240507 1194741 1148114 1101803 1056366 1011684 967970 926242 887429
50585 887429 851558 818254 787561 759609 733898 709895 688310 670815 658075 648728 640791 633649
50573 633649 628159 625189 624694 626150 629302 634276 641275 650345 661350 674127 688744 705579 724966
50560 724966 746768 770443 795596 822235 850346 879347 908310 936782 965216 994441 1024846
50549 1024846 1056152 1087713 1118688 1148162 1175698 1201921 1228124 1255070 1282542 1310295 1338961
50538 1338961 1369495 1401980 1435526 1469288 1503146 1537539 1573115 1610631 1650718 1693634 1739470
50527 1739470 1788517 1841089 1896997 1955558 2016024 2077489 2138434 2196983 2251791 2302146 2347010
50516 2347010 2384514 2412743 2430611 2437690 2433691 2418613 2393103 2358273 2315293 2265383 2209911 2150168
50504 2150168 2087366 2023199 1960110 1900551 1846164 1797943 1756768 1723155 1696640 1676058 1660505
50493 1660505 1649578 1642883 1640002 1641111 1646937 1657658 1672168 1688643 1705358 1720458 1731257 1734545
50481 1734545 1727856 1710180 1681392 1641521 1591083 1532001 1467513 1400811 1333808 1267372 1202305
50470 1202305 1139619 1079973 1023502 970437 921437 876970 836731 800129 767184 738454 714051
50459 714051 693157 674670 658079 643537 631275 621224 613216 607321 603729 602313 602526 603909 606500
50446 606500 610502 615733 621783 628725 637171 647453 659171 671833 685608 701092 718601 738014
50434 738014 759089 781501 804710 828229 852111 876936 903299 931439 961200 992141 1023814
50423 1023814 1056199 1089751 1124798 1161082 1198135 1235891 1274572 1314255 1355046 1397456 1441945
50412 1441945 1488023 1534284 1579427 1622784 1663864 1701977 1736533 1767169 1793271 1813811 1828005
50401 1828005 1835770 1837158 1831731 1818899 1798592 1771152 1736676 1694984 1646214 1591192 1531246 1467934
50389 1467934 1402880 1337541 1273047 1210399 1150693 1094964 1043953 998250 958448 924756 896622
50378 896622 873317 854991 842660 836936 837200 842265 851402 864254 879962 896970 913718 929164
50366 929164 942451 952384 957476 956489 948949 935305 916655 894213 868938 841662 813385 785126
50354 785126 757435 730342 703899 678607 655103 633582 613742 595220 577934 562066 547891
50343 547891 535568 524972 515752 507671 500776 495119 490448 486405 482928 480269 478688 478432 479873 483260
50329 483260 488229 493898 499659 505666 512462 520406 529585 539971 551388 563496 576052 589127 602820
50316 602820 616944 631260 645949 661546 678329 695993 714000 732035 749872 766929 782358
50305 782358 795878 808364 821192 834791 848102 859715 869258 877348 884482 890659 896059 901266 906392
50292 906392 910531 912543 912052 909189 903653 894697 882063 866457 848930 830134 810297 789676 768808
50279 768808 748375 728849 710256 692294 674747 657748 641633 626698 613083 600664 588953
50268 588953 577397 565965 555221 545651 537185 529580 522850 516941 511317 505504 499873 495310 492009
50255 492009 489084 485626 481826 478930 478221 480069 483778 488283 493040 498110 503349 508005 511592 514813
50241 514813 518957 524420 530404 536114 541603 547234 552944 558338 563029 566575 568519 568939 568675 568601 568756
50226 568756 568448 567002 564193 560212 555567 550928 546730 542912 539145 535234 531234 527361 523956 521310
50212 521310 519336 517536 515527 513505 512051 511621 512351 514198 517020 520615 524819 529506 534469 539471 544583
50197 544583 550210 556592 563454 570399 577427 584706 591859 597871 601811 603476 603245 601469 598164 593246
50183 593246 586920 579671 571817 563198 553567 543259 533206 524195 516354 509456 503445 498396 494205 490706
50169 490706 488046 486592 486375 486806 487031 486512 485196 483216 480570 477220 473523 470272 468027 466460 464712
50154 464712 462404 459996 458064 456643 455453 454431 453717 453448 453818 455005 456642 457688 457332 455973 454893
50139 454893 455030 456442 458719 461375 463803 465491 466560 467738 469612 472176 475261 479010 483597 488692
50125 488692 493480 497220 499640 501030 502044 503207 504400 504951 504439 503321 502597 502940 504280 506154 508273
50110 508273 510790 514217 519125 525855 534449 544862 557188 571717 588931 609533 634379 664222
50098 664222 699560 740852 788789 844180 907454 978284 1055508 1137178 1220562 1302282 1378852
50087 1378852 1447461 1506625 1556382 1598141 1634375 1668189 1702603 1739621 1779630 1821503 1863125
50076 1863125 1901674 1933560 1954588 1960776 1949491 1920119 1873996 1813871 1743341 1666376 1586809
50065 1586809 1507788 1431430 1358964 1291277 1229310 1173851 1124988 1081954 1043676 1009495 979317
50054 979317 953093 930306 910049 891610 874885 860130 847346 836073 825863 816813 809369 803606
50042 803606 798903 794528 790472 787549 786623 787799 790342 793238 795766 797620 798733 799084 798654 797451 795574
50027 795574 793256 790785 788268 785499 782163 778199 773913 769719 765817 762167 758638 755159 751848 749084
50013 749084 747350 746889 747535 749006 751265 754502 758851 764231 770443 777270 784629 792790 802325 813522
49999 813522 825892 838591 851428 865085 880098 896002 911891 927677 944296 962583 982407
49988 982407 1003097 1024455 1047102 1072101 1100670 1134222 1174312 1222278 1279050 1345381 1422090
49977 1422090 1509834 1608455 1716391 1830450 1946118 2058448 2163364 2258673 2344141 2420824
49967 2420824 2490455 2555323 2618142 2681467 2746836 2814205 2881689 2945478 3000101 3039391 3057939
49956 3057939 3052314 3021622 2967458 2893216 2802838 2699706 2586592 2466437 2342595 2217922
49946 2217922 2093946 1971402 1851379 1735493 1625039 1520661 1422992 1332996 1251279 1177454
49936 1177454 1110615 1050207 996060 947813 904862 866819 833560 804735 779584 757330 737472
49925 737472 719632 703424 688545 674677 661222 647514 633413 619355 605555 591536 576783
49914 576783 561615 546930 533190 520066 507161 494732 483460 473635 464803 456286 448025 440756
49902 440756 435184 431065 427407 423596 419980 417138 415020 413164 411468 410209 409385 408644 407937 407742 408457
49887 408457 409921 411757 413778 415757 417151 417598 417618 418338 420364 423240 426194 429177 432875 437776 443605
49872 443605 449817 456379 463759 472234 481608 491759 503242 517119 534358 555494 580752 610292
49860 610292 644483 684204 730803 785449 848489 919457 997474 1081227 1168505 1256074 1340199
49849 1340199 1417343 1484628 1540348 1584538 1619156 1647532 1673384 1699939 1729347 1762302 1797797
49838 1797797 1832903 1862788 1881548 1883854 1866404 1828221 1770181 1694795 1606245 1509763 1410332
49827 1410332 1311832 1217196 1128707 1047715 974274 907515 846586 791312 742077 699164 662171
49816 662171 630102 602101 577943 557591 540457 525528 512175 500453 490470 481872 474060 466553
49804 466553 458973 451065 443059 435767 430033 426110 423498 421182 418066 413689 408672 404092 400248 396520
49790 396520 392567 389072 386824 385572 384313 382417 380005 377499 375293 373650 372395 370931 369009 367295
49776 367295 366685 367270 368439 369712 370790 371055 369950 367987 366549 366387 366902 367251 367502 368245 369543 370805
49760 370805 371518 371690 371757 372344 373941 376443 379122 381330 383139 385071 387337 389640 391628 393240 394582
49745 394582 395755 396881 398092 399394 400703 402080 403737 405617 407131 407639 407272 406996 407634 409002 410263
49730 410263 410989 411469 412027 412600 413157 414068 415596 417356 418729 419575 420079 420140 419574 418871 419054 420551 422701
49713 422701 424661 426316 428008 429725 431101 432042 432906 434049 435464 436887 438052 438791 439105 439202 439341 439532
49697 439532 439455 438751 437428 435947 434870 434403 434319 434233 433852 432978 431559 429852 428372 427438 426886 426377 425820 425242
49679 425242 424377 422805 420558 418235 416476 415536 415394 415922 416725 417150 416790 415921 415224 415104 415408 415773 416073
49662 416073 416488 417203 418145 419106 420080 421308 422887 424444 425409 425605 425479 425735 426779 428421 430050 431231
49646 431231 432153 433329 434805 436042 436776 437564 438945 440440 441061 440756 440665 441845 444282 447353 450608 453802
49630 453802 456636 458983 461119 463407 465888 468403 470942 473579 476240 478733 480898 482616 483885 485051
49616 485051 486678 488994 491595 493901 495703 497161 498554 500223 502496 505421 508828 512845 518027 524603
49602 524603 531836 538674 544974 551663 559606 568609 577668 585969 593580 601337 610174 620455 631850 643770
49588 643770 655851 668086 680712 694126 708708 724548 741351 758763 776782 795794 816254
49577 816254 838275 861523 885594 910610 937300 966252 997220 1029508 1062901 1097733 1134060
49566 1134060 1171408 1209499 1248599 1288849 1329882 1371575 1414663 1459919 1506970 1554477 1601255
49555 1601255 1646715 1690501 1732360 1772358 1810647 1846942 1880614 1911138 1938036 1960448 1977442
49544 1977442 1988842 1995373 1997924 1997014 1992862 1985438 1974468 1959923 1942588 1923673 1903825 1883062
49532 1883062 1861742 1840868 1821192 1802617 1784917 1768619 1754740 1743993 1736529 1732173 1730580 1731447
49520 1731447 1734883 1741286 1750653 1762368 1775977 1791784 1810354 1831750 1855539 1881049 1907232 1932837
49508 1932837 1957409 1981747 2006597 2031147 2053609 2073074 2089789 2103627 2113359 2117842 2117043 2111371
49496 2111371 2100777 2085165 2064989 2040621 2011570 1977304 1938666 1897562 1855147 1811115 1764934
49485 1764934 1717058 1668563 1620197 1572256 1524978 1478591 1433223 1389196 1347207 1307852 1271086
49474 1271086 1236467 1203706 1172624 1142823 1114007 1086683 1061950 1040307 1020996 1002755 984996
49463 984996 968020 952336 938072 924968 912675 901038 890247 880697 872612 865747 859562 853682
49451 853682 848189 843494 839939 837508 835928 835055 835037 835913 837195 838151 838597 839210 840910 844110 848672 854394
49435 854394 861341 869768 879886 891620 904391 917074 928256 936766 942255 945513 948100 951326 955506
49422 955506 960325 965791 972397 980328 989028 997883 1006993 1016942 1028089 1040386 1053626 1067508 1081650
49409 1081650 1095912 1110506 1125495 1140418 1154859 1169128 1183876 1199183 1214613 1230067 1245865
49398 1245865 1261938 1277591 1292298 1306163 1319348 1331576 1342569 1352571 1362031 1371133 1379918 1388448
49386 1388448 1396462 1403325 1408832 1413765 1419048 1424566 1429504 1433799 1438498 1444496 1451490 1458528 1465197 1471907
49372 1471907 1479218 1487257 1495761 1504458 1513347 1522659 1532600 1543201 1554464 1566478 1579203 1592305 1605562
49359 1605562 1619389 1634540 1651259 1669067 1687476 1706467 1726151 1746498 1767756 1790635 1815532
49348 1815532 1841866 1868803 1896496 1925983 1957916 1992023 2027923 2065831 2106143 2148797 2193394
49337 2193394 2239631 2287403 2336782 2388158 2441981 2497997 2555154 2612811 2671805 2733698 2798974
49326 2798974 2866444 2934443 3002133 3069467 3136319 3201929 3265100 3324778 3380493 3432296 3480248
49315 3480248 3523993 3562763 3595596 3621473 3639663 3650319 3654513 3653186 3646238 3633129 3614332 3591524
49303 3591524 3566291 3539168 3510142 3479539 3448080 3416408 3385027 3354563 3325821 3299572 3276274
49292 3276274 3255945 3238377 3223714 3212629 3205582 3202144 3201667 3204472 3211578 3223170 3238136 3255439
49280 3255439 3275161 3297810 3323324 3351223 3380970 3411526 3441225 3468901 3494645 3518732 3540374
49269 3540374 3558378 3572442 3582704 3588339 3587899 3581023 3568611 3551209 3528288 3499426 3465111 3425907
49257 3425907 3381758 3332769 3279978 3224731 3167782 3109588 3051030 2993155 2936397 2880501 2825033
49246 2825033 2769657 2714254 2659270 2605776 2554818 2506684 2460995 2417321 2375591 2336113 2299312
49235 2299312 2265245 2233271 2202597 2173253 2146136 2121817 2099775 2079119 2059728 2042281 2027448
49224 2027448 2015405 2005867 1998257 1992022 1987075 1983760 1982205 1982060 1983116 1985716 1990097 1995689 2001626 2007752
49210 2007752 2014623 2022612 2031532 2041092 2051293 2062302 2074216 2086903 2099886 2112545 2124720 2136882
49198 2136882 2149427 2162153 2174755 2187414 2200244 2212492 2223146 2232340 2241365 2251128 2261300 2271172
49186 2271172 2280654 2289985 2299016 2307343 2314912 2322025 2328849 2335178 2340671 2345207 2349100 2352970 2357160 2361371
49172 2361371 2365235 2369156 2374018 2379915 2385873 2391198 2396485 2402750 2410059 2417798 2425997 2435505 2446825 2459511
49158 2459511 2472944 2487082 2502126 2517921 2534129 2550746 2568082 2586323 2605370 2625010 2645063
49147 2645063 2665480 2686462 2708378 2731354 2754972 2778454 2801096 2822494 2842612 2861850 2880937
49136 2880937 2900440 2920265 2939692 2957931 2974632 2990100 3005128 3020430 3035923 3050618 3063415
49125 3063415 3074021 3082923 3090597 3097075 3102147 3105570 3107022 3106374 3104201 3101636 3099322 3096722 3092819 3087288
49111 3087288 3080669 3073530 3065928 3057718 3049064 3040464 3032429 3025208 3018751 3012943 3007889 3003828 3000692 2998049
49097 2998049 2995760 2994469 2995054 2997706 3001976 3007607 3014786 3023507 3033275 3043705 3054953 3067172 3079916
49084 3079916 3092515 3104803 3116995 3128941 3140016 3149810 3158500 3166381 3173340 3179014 3183234 3185949 3186874
49071 3186874 3185624 3182269 3177421 3171515 3164291 3155263 3144475 3132353 3118896 3103576 3086189 3067337
49059 3067337 3047783 3027746 3007078 2985709 2963508 2940073 2915206 2889376 2863208 2836740 2809660
49048 2809660 2781994 2753942 2725294 2695834 2666234 2637654 2610322 2583368 2556264 2529559 2503838
49037 2503838 2478887 2454504 2431316 2410020 2390293 2371304 2352926 2335685 2319676 2304317 2289155
49026 2289155 2274322 2260144 2246763 2234197 2222408 2211337 2201105 2192013 2184083 2176839 2169892 2163465
49014 2163465 2157974 2153415 2149610 2146654 2144554 2142787 2140979 2139716 2139825 2140995 2142080 2142815 2144145 2146604
49000 2146604 2149370 2151487 2153197 2155346 2158123 2161123 2164226 2167571 2170868 2173530 2175540 2177580 2180169 2183061
48986 2183061 2185646 2187634 2189297 2191296 2194263 2198331 2202975 2207595 2212230 2217455 2223473 2229646 2235154 2239911
48972 2239911 2244518 2249343 2254006 2257835 2260594 2262534 2263951 2265037 2266114 2267566 2269350 2270948 2272075 2273192
48958 2273192 2274919 2277031 2278466 2278286 2276368 2273168 2269206 2264967 2260989 2257736 2255336 2253457 2251423 2248625
48944 2248625 2245113 2241790 2239749 2239354 2240147 2241602 2243716 2246823 2251187 2256931 2264085 2272504 2281885 2292037
48930 2292037 2303053 2315135 2328427 2343035 2358983 2375987 2393534 2411413 2430063 2450223 2472340
48919 2472340 2496426 2522326 2549876 2578879 2609073 2640201 2672034 2704417 2737324 2770764 2804626
48908 2804626 2838781 2873427 2909146 2946405 2985161 3025156 3066437 3109313 3153840 3199668 3246499
48897 3246499 3294441 3343743 3394364 3446040 3498778 3553009 3609162 3667186 3726590 3786807 3847375
48886 3847375 3907895 3968095 4027976 4087626 4146740 4204557 4260407 4314115 4365605 4414258 4459062
48875 4459062 4499469 4535889 4569165 4599660 4626983 4650608 4670583 4687426 4701239 4711237 4716489 4717046
48863 4717046 4713913 4707785 4698247 4684359 4665691 4642548 4615625 4585802 4553907 4520254 4484609 4446882
48851 4446882 4407414 4366184 4322279 4274982 4225162 4174674 4124403 4073648 4021496 3968016 3913835
48840 3913835 3859307 3804556 3749959 3696195 3643948 3593613 3545024 3497580 3451098 3406534 3365265
48829 3365265 3327668 3293031 3260814 3231182 3204188 3179427 3156863 3137081 3120135 3104975 3090758
48818 3090758 3078103 3068224 3061327 3056646 3053712 3052711 3053861 3057273 3063346 3072545 3084739 3099330 3116003
48805 3116003 3134824 3155650 3177961 3201290 3225409 3250232 3275951 3303096 3331974 3362153 3393047
48794 3393047 3424865 3458337 3493491 3529285 3564598 3599195 3633656 3668779 3705078 3742484 3780464
48783 3780464 3818684 3857427 3896995 3936980 3976629 4015859 4055285 4095288 4135626 4175969 4216194
48772 4216194 4256043 4295044 4332939 4369767 4405484 4439953 4473270 4505472 4535866 4563318 4587383
48761 4587383 4608559 4627254 4643163 4655898 4665461 4671664 4673781 4671413 4665298 4656663 4646045 4633211
48749 4633211 4617983 4600631 4581592 4561154 4539289 4515529 4489221 4460207 4429027 4396209 4361598
48738 4361598 4324680 4285349 4244087 4201633 4158742 4115977 4073454 4031045 3989109 3948690 3910655
48727 3910655 3874926 3840890 3808218 3776964 3747283 3719599 3694757 3673420 3655422 3640181 3627548
48716 3627548 3617735 3610724 3606462 3605446 3608304 3614772 3623859 3635221 3649682 3668147 3690661 3716973 3747370
48703 3747370 3782342 3821745 3864902 3911419 3961443 4015124 4072181 4132006 4193926 4257301 4321619
48692 4321619 4386607 4452123 4517945 4583711 4649056 4713566 4776467 4836494 4892335 4943359 4989793
48681 4989793 5031972 5069378 5100615 5124300 5139803 5147154 5146657 5138887 5124715 5104902 5079828 5049952
48669 5049952 5016361 4980355 4942491 4902504 4860193 4815969 4770495 4724317 4678060 4632478 4587917
48658 4587917 4544053 4500527 4457633 4416049 4376005 4336954 4297878 4257704 4215727 4172059 4127581
48647 4127581 4083121 4038701 3993838 3948417 3902872 3857602 3812711 3768347 3724685 3681306 3637025
48636 3637025 3590789 3542614 3493343 3443672 3393770 3343638 3293326 3242759 3191800 3140678 3089949
48625 3089949 3039907 2990422 2941652 2894416 2849335 2805867 2762920 2720349 2679074 2639613 2601309
48614 2601309 2563505 2526812 2492391 2460364 2429770 2400073 2371925 2346265 2323342 2302932 2284985
48603 2284985 2269574 2256490 2245248 2235368 2226395 2217876 2209634 2201953 2195308 2189956 2185934 2183291 2182130
48590 2182130 2182543 2184646 2188524 2194017 2200736 2208497 2217494 2227790 2238872 2250070 2261327 2273223 2286225
48577 2286225 2300167 2314426 2328391 2341713 2354314 2366197 2377145 2386718 2394755 2401792 2408736 2416119
48565 2416119 2423806 2431363 2438483 2445162 2451840 2459344 2468315 2478482 2488733 2498024 2506096 2513261 2519789
48552 2519789 2525728 2531143 2536236 2541131 2545672 2549507 2552450 2554691 2556566 2558154 2559290 2560051 2560933 2562257
48538 2562257 2563650 2564487 2564799 2565374 2566985 2569902 2574154 2579810 2586829 2594982 2604223 2614989 2627992 2643832
48524 2643832 2662805 2684789 2709211 2735392 2763179 2793073 2825675 2861193 2899537 2940628 2984432
48513 2984432 3030885 3079848 3130892 3183136 3235746 3288672 3342488 3397205 3451637 3504243 3554152
48502 3554152 3601029 3644379 3683580 3718345 3748597 3774018 3794208 3809217 3819482 3825307 3826907 3824861
48490 3824861 3819962 3812521 3802266 3789115 3773772 3757469 3741361 3726078 3711389 3696251 3679647 3661565
48478 3661565 3642829 3623827 3603735 3581154 3555263 3526308 3495327 3463488 3431237 3397788 3361745
48467 3361745 3322478 3280728 3237794 3194582 3151619 3109477 3068609 3028962 2990281 2952822 2917434
48456 2917434 2884905 2855469 2828893 2804807 2782947 2763301 2746010 2730990 2717807 2706161 2696429
48445 2696429 2689357 2685187 2683350 2683183 2684649 2688153 2693781 2700955 2708890 2717229 2726150 2735996 2746938 2758974
48431 2758974 2771987 2785556 2798888 2811293 2822838 2834254 2846017 2857726 2868599 2878399 2887544 2896375
48419 2896375 2904688 2912117 2918710 2924872 2930817 2936314 2940971 2944619 2947321 2949169 2950246 2950783 2951151 2951537 2951628
48404 2951628 2950755 2948474 2944966 2940818 2936381 2931436 2925631 2919160 2912737 2906715 2900548 2893539 2885986 2879012
48390 2879012 2873133 2867547 2861207 2854116 2847005 2840046 2832581 2824165 2815332 2807161 2800416 2795146 2790793 2786609
48376 2786609 2782298 2778332 2775374 2773427 2771932 2770668 2770017 2770153 2770457 2770049 2768585 2766287 2763541 2760727 2758189
48361 2758189 2756010 2753940 2751749 2749518 2747490 2745857 2744790 2744348 2744098 2743103 2740630 2736734 2732004 2726876 2721310
48346 2721310 2714940 2707402 2698702 2689296 2679515 2668948 2656892 2643446 2629601 2616003 2602364 2588364
48334 2588364 2574378 2560712 2546755 2531773 2516075 2500547 2485277 2469567 2453194 2436834 2421222
48323 2421222 2406728 2393830 2383212 2375091 2369069 2364780 2362105 2360620 2359614 2359058 2359975 2363419 2369539 2377973
48309 2377973 2388617 2401503 2416260 2432273 2449244 2467220 2486186 2505932 2526086 2546018 2564806
48298 2564806 2581586 2595842 2607206 2615136 2618990 2618243 2612466 2601315 2584770 2563129 2536579 2505073
48286 2505073 2468898 2429020 2386430 2341414 2294064 2245372 2197076 2150172 2104110 2057838 2011285
48275 2011285 1965438 1921240 1878883 1838145 1798967 1761536 1726020 1692384 1660370 1629631 1600110
48264 1600110 1572340 1547119 1524720 1504582 1485999 1468882 1453576 1440096 1428021 1417075 1407392
48253 1407392 1399104 1392101 1386326 1381889 1378738 1376628 1375643 1376287 1378719 1382301 1386328 1390800 1395965 1401450
48239 1401450 1406536 1411192 1416153 1421950 1428405 1435135 1441991 1448822 1455258 1461027 1466246 1471268 1476394 1481690
48225 1481690 1486932 1491853 1496800 1502901 1511027 1520615 1530088 1538478 1546050 1553329 1560217 1566393 1571917 1576938
48211 1576938 1581229 1584526 1587011 1589067 1590743 1591836 1592284 1592190 1591665 1590963 1590554 1590654 1590719 1589731 1586965 1582384
48195 1582384 1576493 1570042 1563702 1557692 1551786 1545829 1540123 1535016 1530307 1525403 1520080 1514782 1510016 1505643
48181 1505643 1501039 1495966 1491058 1487190 1484357 1481575 1478107 1474501 1471949 1470796 1470216 1469381 1468378 1467778 1467795
48166 1467795 1468229 1468900 1469721 1470501 1470998 1471247 1471694 1472921 1475146 1477881 1480258 1481873 1483201 1484973 1487448 1490669
48150 1490669 1495017 1500778 1507328 1513629 1519674 1526779 1536424 1549626 1567501 1591512 1622915 1663061 1714736
48137 1714736 1782224 1869274 1977116 2103468 2240230 2370121 2468132 2511634 2492830 2422373
48127 2422373 2321369 2209902 2100928 2000661 1911401 1833750 1767529 1711704 1664246 1622934
48117 1622934 1586553 1554924 1527698 1503777 1482181 1462864 1446252 1432309 1420358 1409513 1399040
48106 1399040 1388643 1378717 1370163 1363695 1359355 1356638 1354827 1353230 1351461 1349630 1348041 1346823 1346127 1346529
48092 1346529 1348650 1352362 1356914 1361928 1367754 1374646 1382186 1389861 1397716 1406089 1415007 1424186 1433384 1442511
48078 1442511 1451661 1461276 1471939 1483636 1495432 1506237 1515856 1525083 1534925 1545920 1557956 1570431
48066 1570431 1582535 1593610 1603404 1612033 1619805 1626950 1633400 1638827 1643054 1646291 1648767 1650318 1650616 1649671
48052 1649671 1647676 1644477 1639723 1633535 1626504 1618959 1610748 1601872 1592721 1583463 1573737 1563312 1552588
48039 1552588 1542076 1531782 1521511 1511432 1501894 1492933 1484321 1475941 1467757 1459539 1450912 1441608 1431492
48026 1431492 1420525 1408873 1396882 1384809 1372723 1360700 1348666 1336034 1322016 1306600 1290734
48015 1290734 1275197 1259740 1243738 1227134 1210173 1192644 1174147 1154924 1135746 1117076 1098867
48004 1098867 1081127 1064004 1047307 1030519 1013482 996703 980866 966296 952851 940044 927349
47993 927349 914772 903024 892798 884023 876216 869324 863610 858853 854474 850535 847849 846780 846623 846531
47979 846531 846524 847067 848149 849359 850586 852091 853974 856099 858494 861367 864575 867374 868873 868747 867494
47964 867494 865999 864692 863124 860486 856560 851901 847080 842035 836335 829706 822065 813440 804221 795262
47950 795262 787217 779847 772372 764376 756077 747813 739754 732087 724966 718167 711244 704218 697775 692550
47936 692550 688459 684915 681431 677896 674481 671458 668862 666190 662807 658828 655248 652884 651544 650610
47922 650610 650027 650118 650743 651406 652227 654044 657288 661347 665410 669458 673973 679028 684150 688996 693749 698757
47906 698757 703975 708814 712494 714707 715948 716983 717944 718219 717324 715472 713050 709997 706066 701401 696325
47891 696325 690737 684263 676953 669349 661863 654481 647121 639852 632647 625346 618021 611155 605292 600708
47877 600708 597402 595138 593430 591881 590725 590771 592594 595891 599793 603653 607449 611605 616665 623039 630890
47862 630890 640131 650517 661786 673833 686748 700543 714792 728901 742910 757695 773960 791165
47850 791165 807899 823149 836769 848897 859583 869084 877842 885827 892296 896462 898112 897389 894380
47837 894380 889249 882562 875128 867494 859633 850984 840800 828764 815314 801257 787186 773496 760678
47824 760678 748987 737905 726597 714998 703877 693762 684514 676095 668864 662756 657041 651536 647316
47811 647316 645414 645338 645730 646126 647254 649685 653048 656583 659825 662691 665338 668081 671166 674677 678851
47796 678851 684149 690568 697265 703371 709022 715008 721702 728943 736706 745080 753626 761621 769121 777103
47782 777103 786302 796455 806941 817570 828406 839247 849725 859730 869461 879177 888944 898489
47770 898489 907319 915224 922576 929764 936438 941810 945709 948875 952042 955186 957852 959881 961520 963044
47756 963044 964364 964893 963869 961107 957387 953710 950223 946336 941825 937204 932895 928620 923912 918694
47742 918694 913063 906898 900103 892953 885844 878850 871743 864293 856377 847975 839158 829885 819866 808912
47728 808912 797347 785656 773761 761262 748463 736470 726040 717028 709340 703650 700482 699144
47716 699144 698380 697853 698333 700575 704670 710367 717409 725502 734485 744569 755966 768252 780553 792466
47702 792466 804372 816699 829233 841315 852413 862302 870869 877998 883615 887783 890694 892510 893128
47689 893128 892166 889264 884325 877423 868731 858733 848290 838193 828609 819138 809370 799320 789443 780403
47675 780403 772690 766206 760341 754652 749418 745378 743043 742453 743414 745637 748680 752140 756052 760926 767319
47660 767319 775425 785103 796112 808310 821641 836027 851304 867347 884169 901697 919527 937211
47648 937211 954825 972844 991311 1009517 1026808 1043319 1059546 1075506 1090753 1104962 1117974
47637 1117974 1129362 1138560 1145457 1150428 1153713 1155139 1154568 1152280 1148748 1144204 1138486 1131181 1121918 1110659
47623 1110659 1097609 1082747 1065679 1046251 1024999 1002611 979167 954447 928837 903349 878774
47612 878774 855358 833259 812617 793059 773880 755044 737455 721862 707995 695101 682765
47601 682765 670779 658714 646334 634175 623079 613210 603964 594757 585479 576283 567447 559427 552577
47588 552577 546648 540943 535096 529456 524532 520342 516525 512951 509904 507616 505825 504058 502354 501412
47574 501412 501811 503284 505144 507256 510009 513306 516292 518520 520811 524373 529375 534983 540550 546104
47560 546104 551711 557096 562025 566541 570533 573551 575278 575902 575837 575293 574237 572475 569630 565334 559639
47545 559639 553052 546063 538868 531563 524249 516819 509092 501372 494438 488662 483453 477906 471705 465057
47531 465057 458090 450888 443911 437800 432728 428350 424374 420814 417715 415055 412908 411273 409706 407578
47517 407578 404811 401944 399337 396764 393911 390822 387533 383752 379317 374624 370141 365679 360664 354957
47503 354957 348976 343116 337532 332463 328230 324770 321630 318659 316346 315152 314831 314674 314207 313353 312124
47488 312124 310626 309334 308959 309870 311786 314017 315758 316253 315256 313572 312732 313671 315824 317893 319309 320548
47472 320548 322150 324075 326093 328111 329835 330681 330581 330441 331213 332793 334470 336235 338807 342328 345832
47457 345832 348287 349597 350271 350690 351144 352086 353847 356339 359456 363434 368384 373773 378844 383431 387908
47442 387908 392526 397280 402258 407592 413093 418411 423516 428615 433652 438455 443406 449413 456995 465731
47428 465731 474738 483373 491430 499043 506549 514127 521490 528307 534996 542633 551810 561865 571442 579614
47414 579614 586431 592679 599220 606167 612606 617422 620480 622596 624368 625615 626153 626392 626703 626772 626151 625084
47398 625084 624226 623803 623586 623412 623133 622238 620161 616958 613227 609391 605494 601550 597560 593203 588049 582144
47382 582144 575946 569608 562812 555448 547952 540742 533705 526557 519448 512922 507406 502933 499294 496323
47368 496323 494077 492804 492656 493447 494788 496399 498154 499958 501864 504267 507676 512241 517705 523790 530389
47353 530389 537353 544368 551161 557657 563961 570342 577087 583978 589998 594094 596359 597985 599751 600964
47339 600964 600291 597313 592789 587559 581724 574994 567412 559458 551630 544164 537113 530418 523776 516612
47325 516612 508473 499536 490536 482025 473853 465522 456900 448347 440223 432593 425445 418883 413054 408050
47311 408050 403944 400686 397966 395358 392678 390023 387504 385176 383243 382037 381722 382147 383010 383925 384442
47296 384442 384392 384196 384393 384877 385115 385151 385716 387072 388447 389150 389621 390658 391988 392507 391788 390562 389587 388811
47278 388811 387899 386956 386266 385739 385002 383903 382676 381775 381719 382811 384771 386753 388008 388482 388712 389301 390685
47261 390685 393102 396479 400368 404305 408275 412655 417715 423312 429140 435107 441424 448410 456271 464892
47247 464892 473787 482319 490112 497296 504367 511861 520048 528709 537105 544359 550072 554523 558149 560963
47233 560963 562739 563602 564036 564278 564080 563273 562197 561256 560353 559126 557533 555768 553765 551336 548747 546555
47217 546555 544760 542669 539873 536856 534287 532174 530177 528340 526923 525796 524716 524124 524924 527313 530477
47202 530477 533712 537283 541746 546960 552337 557842 564080 571407 579464 587651 595594 602974 609359 614554
47188 614554 618883 622811 626402 629399 631661 633180 633749 633020 630960 627987 624582 620940 616982 612382 606625
47173 606625 599522 591878 585203 580385 576942 573881 570931 568464 566611 565211 564525 565209 567418 570589 574362
47158 574362 579094 585116 592043 599282 606880 615361 625096 636210 648809 662692 677034 690956 704457
47145 704457 718304 732958 747964 762437 775749 787665 798176 807351 815181 821459 825960 828734
47133 828734 830014 829918 828518 826117 823114 819612 815529 811053 806575 802107 797271 792008 786853 782200 777700
47118 777700 772813 767631 762735 758465 754768 751646 749171 747054 744697 741916 739253 737286 735936 734747
47104 734747 733707 733338 733920 735004 735971 736873 738401 740989 744242 747436 750401 753720 758120 763868 770646
47089 770646 777714 784144 789209 792798 795366 797272 798219 797483 794658 789939 783640 775684 765842 754362
47075 754362 742040 729586 717160 704699 692425 680718 669656 659051 648912 639382 630185 620711
47063 620711 610904 601604 593600 586799 580761 575701 572257 570426 569461 568824 568599 568858 569311 569901 571155 573514
47047 573514 576678 580031 583456 587364 592147 597941 604733 612314 620191 627811 634850 641196 646825 651906
47033 651906 656830 661876 666884 671399 675019 677624 679563 681696 684800 688682 692380 695604 699450 705064
47019 705064 712031 718919 725201 731694 739027 746733 754276 762094 770835 780053 788564 796016 803387 811722
47005 811722 820859 829676 837343 844058 850653 857649 864819 871627 877999 884505 891734 899612 907492 914914
46991 914914 922156 929926 938489 947190 954959 961334 966870 972419 978095 983106 986485 987832 987351 985459
46977 985459 982478 978595 973984 968981 964005 959191 954169 948452 942086 935749 930195 925795 922583 920415
46963 920415 918910 917491 915746 913780 912110 911368 912071 914476 918443 923491 929098 934875 940548 946074 951901
46948 951901 958839 967325 976847 986248 994561 1001539 1007556 1013180 1018699 1023862 1028093 1031095 1033171 1034902
46934 1034902 1036588 1038079 1039008 1039076 1038218 1036633 1034553 1031920 1028512 1024472 1020497 1017270 1014843 1012741 1010497
46919 1010497 1008001 1005596 1004063 1004200 1006072 1008850 1011737 1014795 1018464 1022607 1026699 1030889 1036111 1042878
46905 1042878 1050472 1057624 1063673 1068802 1073533 1078305 1083324 1088507 1093656 1098859 1104647 1111632 1120107 1129942
46891 1129942 1140614 1151332 1161558 1171586 1182249 1193858 1205785 1217280 1228252 1238792 1248312
46880 1248312 1255748 1260554 1263063 1263935 1263751 1263120 1262624 1262448 1262358 1262286 1262658 1263948 1266142 1268926 1272262 1276461
46864 1276461 1281575 1286979 1291838 1296091 1300652 1306350 1312739 1318369 1322349 1325186 1327833 1330391 1332291 1333492
46850 1333492 1334749 1336709 1339269 1342011 1344762 1347542 1350492 1354180 1359497 1366773 1375234 1383794 1392224 1401178
46836 1401178 1411190 1422064 1433207 1444107 1454472 1464247 1473602 1482668 1491199 1498738 1505083 1510317 1514362
46823 1514362 1516903 1517857 1517515 1516071 1513361 1509429 1505022 1501075 1497809 1494675 1491080 1486815 1481894 1476460
46809 1476460 1470984 1466245 1462893 1461148 1460898 1461868 1463693 1466146 1469408 1473869 1479648 1486592 1494737 1504397
46795 1504397 1515641 1528138 1541740 1556872 1574005 1592980 1613145 1633848 1654498 1674505 1693593
46784 1693593 1711945 1729589 1745881 1760049 1771999 1781989 1789762 1794770 1797151 1797658 1796468 1792895 1786669
46771 1786669 1778688 1769998 1760643 1750136 1738609 1726699 1714564 1701697 1687740 1672936 1657779 1642712
46759 1642712 1628168 1614500 1601695 1589463 1577663 1566387 1555644 1545268 1535206 1525617 1516634 1508275
46747 1508275 1500689 1494225 1489064 1484895 1481177 1477712 1474944 1473666 1474412 1477098 1481145 1485869 1490776 1495713
46733 1495713 1501014 1507407 1515417 1524767 1534638 1544493 1554358 1564252 1573887 1583137 1592337 1601716 1610891 1619330
46719 1619330 1627003 1634082 1640269 1644985 1648213 1650728 1653433 1656664 1659999 1662595 1663958 1664709 1666246 1669307
46705 1669307 1673248 1677210 1681496 1687063 1694006 1701592 1709656 1718866 1729404 1740331 1750656 1760244 1769235
46692 1769235 1777321 1784177 1790044 1795199 1799239 1801458 1801645 1800033 1796683 1791366 1783804 1773648 1760418 1743983
46678 1743983 1724975 1704296 1682294 1658789 1633857 1608176 1582495 1556982 1531291 1505240 1479347
46667 1479347 1454530 1431215 1408939 1387150 1366135 1346606 1328477 1310766 1292855 1275185 1258355
46656 1258355 1242223 1226410 1211133 1196982 1184184 1172583 1162002 1152214 1142946 1134480 1127911 1124189
46644 1124189 1123148 1124045 1126743 1131672 1138856 1147757 1158063 1169897 1183215 1197642 1212984 1229252 1246011
46631 1246011 1262358 1277764 1292406 1306339 1318881 1329155 1336909 1342456 1346154 1348297 1349192 1348936 1347299
46618 1347299 1344237 1340417 1336866 1334198 1332539 1332274 1334339 1339399 1346942 1355676 1364971 1375544 1388473 1403810
46604 1403810 1420579 1437992 1456098 1475189 1495094 1515246 1534992 1553507 1569914 1583929 1596077
46593 1596077 1606814 1615666 1621664 1624315 1623682 1619808 1612704 1602827 1590932 1577446 1562415 1546089 1528984
46580 1528984 1511390 1493336 1475093 1457200 1439828 1422599 1405239 1388083 1371716 1356399 1341902
46569 1341902 1327595 1312680 1296710 1280021 1263428 1247435 1232031 1217136 1202817 1189011 1175549
46558 1175549 1162577 1150553 1139690 1129746 1120474 1111898 1104054 1096888 1090483 1085025 1080425 1076397 1072973
46545 1072973 1070417 1068518 1066553 1064188 1061923 1060291 1059090 1057819 1056464 1055505 1055443 1056590 1058948 1061927 1064574
46530 1064574 1066548 1068613 1071783 1076179 1081154 1086280 1091784 1098082 1105314 1113345 1121989 1131200 1141161 1152082
46516 1152082 1163855 1176130 1188763 1201893 1215510 1229302 1243172 1257506 1272691 1288713 1305514
46505 1305514 1323360 1342527 1362924 1384275 1406376 1428872 1451205 1473156 1495083 1517238 1539246
46494 1539246 1560585 1581064 1600248 1617038 1630653 1641745 1651696 1660898 1668534 1673951 1677388 1679287
46482 1679287 1679783 1679169 1678097 1676918 1675244 1672531 1668691 1663922 1658447 1652677 1647170 1642006 1636527 1630055
46468 1630055 1622632 1614654 1606025 1596089 1584375 1571059 1556611 1541162 1524330 1505672 1485240 1463560
46456 1463560 1441006 1417422 1392578 1366830 1340933 1315261 1289642 1263999 1238725 1214305 1191019
46445 1191019 1169280 1149860 1133382 1119737 1108290 1098531 1090303 1083620 1078644 1075845 1075799 1078655 1083878
46432 1083878 1090652 1098432 1107005 1116088 1125131 1133714 1142001 1150438 1158949 1166818 1173577 1179698 1186002 1192588
46418 1192588 1198763 1203905 1207859 1210569 1211921 1212171 1212038 1212062 1212103 1211745 1210955 1210161 1209900 1210622 1212645 1216033 1220585
46401 1220585 1226127 1232794 1240990 1251208 1263906 1279371 1297544 1318087 1340692 1365306 1392076 1421291
46389 1421291 1453285 1488078 1525053 1563298 1602396 1642625 1684196 1726557 1768555 1809085 1847471
46378 1847471 1883542 1917510 1949468 1978737 2003905 2023736 2037870 2046494 2049682 2047441 2040179 2028780
46366 2028780 2014198 1997136 1977931 1956508 1932683 1906784 1879838 1852949 1826727 1801544 1777939
46355 1777939 1756269 1736223 1717298 1699729 1684449 1672244 1663472 1658521 1657751 1660764 1666426 1674025 1684023
46342 1684023 1697390 1714742 1736476 1763146 1794970 1831154 1870368 1911875 1955759 2002166 2050888
46331 2050888 2101696 2154401 2208329 2262138 2314456 2364410 2411331 2454308 2492384 2524969 2551716
46320 2551716 2572154 2585780 2592434 2592153 2584687 2569541 2546729 2517266 2482742 2444409 2402700 2357543
46308 2357543 2309152 2258636 2207828 2158359 2110851 2065110 2021076 1979304 1940483 1904781 1871946
46297 1871946 1841969 1815447 1793278 1776069 1763826 1756093 1752357 1752297 1755660 1762104 1771389 1783659 1799190
46284 1799190 1817778 1838686 1861354 1885836 1912253 1940129 1968705 1997789 2027833 2059096 2091121
46273 2091121 2123098 2154457 2184944 2214413 2242806 2270205 2296612 2321590 2344215 2363476 2378836
46262 2378836 2390421 2398586 2403242 2403782 2399798 2391725 2380518 2366813 2350696 2332239 2311913 2290428
46250 2290428 2268442 2246589 2225465 2205387 2186312 2168206 2151365 2136202 2122845 2111135 2101043
46239 2101043 2092947 2087335 2084174 2082610 2081538 2080619 2080568 2082225 2085431 2089091 2092245 2094730 2096845 2098817 2100628
46224 2100628 2101975 2102215 2100672 2097160 2091892 2084723 2074982 2062392 2047776 2032381 2016734 2000526 1983417
46211 1983417 1965425 1946659 1927251 1907676 1888737 1871019 1854617 1839444 1825516 1812682 1800290
46200 1800290 1787479 1773915 1760211 1747551 1736791 1727918 1720480 1714502 1710662 1709371 1709953 1711157 1712483
46187 1712483 1714693 1718981 1725851 1734826 1745019 1755935 1767812 1781238 1796323 1812432 1828847 1845446
46175 1845446 1862347 1879144 1895120 1910295 1925619 1941838 1958591 1974969 1990544 2005488 2020031
46164 2020031 2034327 2048616 2062948 2076828 2089628 2101409 2112871 2124435 2135864 2146901 2157777
46153 2157777 2168772 2179686 2190154 2200252 2210297 2220238 2229712 2238729 2247825 2257292 2266598 2274867 2281822
46140 2281822 2288043 2294279 2300694 2306748 2311687 2315060 2316852 2317311 2316787 2315681 2314275 2312523 2310151 2307145
46126 2307145 2303924 2300852 2297718 2294049 2289860 2285649 2281615 2277292 2272184 2266363 2260198 2253871 2247504 2241489
46112 2241489 2236198 2231421 2226487 2220978 2215090 2209383 2204422 2200522 2197376 2194007 2189499 2183866 2177894 2172124
46098 2172124 2166490 2160977 2156039 2151972 2148323 2144347 2139940 2135722 2132204 2129115 2125571 2120926 2115578 2110882
46084 2110882 2107949 2106432 2104851 2102213 2098985 2096308 2094779 2094357 2094963 2096560 2098855 2101502 2104574 2108329
$$ [...]
##END NTUPLES=NMR SPECTRUM
##END=
