##TITLE=NES1028_10332_9268290_OmHLmCDfxT
##JCAMPDX= 6.0         $$ Bruker NMR JCAMP-DX V2.0
##DATA TYPE= NMR SPECTRUM
##DATA CLASS= NTUPLES
##ORIGIN= BRUKER
##OWNER= Administrator
$$ 1.72 TOPSPIN		Version 2.1
$$ 2015-07-11 14:41:10.910 -0700  Administrator@X
$$ Compression mode = diff/dup
##.OBSERVE FREQUENCY= 400.02188249412
##.OBSERVE NUCLEUS= ^1H
##.ACQUISITION MODE= SIMULTANEOUS (DQD)
##.ACQUISITION SCHEME= undefined
##.AVERAGES= 8
##.DIGITISER RES= 22
##SPECTROMETER/DATA SYSTEM= spect
##.PULSE SEQUENCE= zg30
##.SOLVENT NAME= COFFEE_meoh
##.SHIFT REFERENCE= INTERNAL, COFFEE_meoh, 1, 14.98509
##AUDIT TRAIL= $$ (NUMBER, WHEN, WHO, WHERE, PROCESS, VERSION, WHAT)
$$ ##TITLE= Audit trail, TOPSPIN		Version 2.1
$$ ##JCAMPDX= 5.01
$$ ##ORIGIN= Bruker BioSpin GmbH
$$ ##OWNER= Administrator
$$ $$ E:\/data/COFFEE/nmr/NES1028_10332_9268290_OmHLmCDfxT/20/pdata/1/auditp.txt
$$ ##AUDIT TRAIL=  $$ (NUMBER, WHEN, WHO, WHERE, PROCESS, VERSION, WHAT)
(   1,<2015-07-11 14:41:03.550 -0700>,<Administrator>,<X>,<go>,<TOPSPIN 2.1>,
      <created by zg
	started at 2015-07-11 14:39:57.706 -0700,
	POWCHK enabled, PULCHK disabled,
       configuration hash MD5:
       21 0F 79 D6 B3 7B B4 F6 88 20 88 DB 03 48 BD 9F
       data hash MD5: 64K
       2D E2 5A 90 F2 E6 A7 F3 ED 3F 56 F7 04 80 8E D3>)
(   2,<2015-07-11 14:41:06.753 -0700>,<Administrator>,<X>,<proc1d>,<TOPSPIN 2.1>,
      <Start of raw data processing
       efp LB = 0 FT_mod = 6 PKNL = 1 PHC0 = 0 PHC1 = 0 SI = 32K 
       data hash MD5: 32K
       78 D7 7B 1A C3 36 0E 4B 3B D8 6E 2C 50 50 47 31>)
(   3,<2015-07-11 14:41:07.035 -0700>,<Administrator>,<X>,<proc1d>,<TOPSPIN 2.1>,
      <pk PHC0 = 93.49915 PHC1 = 0 
       data hash MD5: 32K
       7D AF 3A A6 EE 3C DA 63 4C C7 3C CB DA 0F F0 64>)
(   4,<2015-07-11 14:41:07.144 -0700>,<Administrator>,<X>,<proc1d>,<TOPSPIN 2.1>,
      <abs ABSG = 1 
       data hash MD5: 32K
       2D 70 AC C3 6E C2 85 23 D4 6F BA F4 B2 58 82 1D>)
(   5,<2015-07-11 14:41:07.206 -0700>,<Administrator>,<X>,<proc1d>,<TOPSPIN 2.1>,
      <abs ABSG = 2 
       data hash MD5: 32K
       8B 59 B1 51 D8 6E 42 24 43 07 3D 25 EF 9D A0 9D>)
(   6,<2015-07-11 14:41:07.269 -0700>,<Administrator>,<X>,<proc1d>,<TOPSPIN 2.1>,
      <abs ABSG = 3 
       data hash MD5: 32K
       A9 C8 B7 A1 9A B6 30 97 A6 C7 B3 E1 99 DA E7 E7>)
(   7,<2015-07-11 14:41:07.331 -0700>,<Administrator>,<X>,<proc1d>,<TOPSPIN 2.1>,
      <abs ABSG = 4 
       data hash MD5: 32K
       32 B3 E0 6B 91 FB B9 80 54 1C AB 07 58 A8 5D EE>)
(   8,<2015-07-11 14:41:07.394 -0700>,<Administrator>,<X>,<proc1d>,<TOPSPIN 2.1>,
      <abs ABSG = 5 
       data hash MD5: 32K
       88 BE AA 23 2A 91 3D A7 06 7A 6E CB 01 35 4B 0A>)
$$ ##END=
$$ 
$$ $$ hash MD5
$$ $$ AC D2 3B E5 2D FA C2 BC 3B EE 05 BA ED 12 FA B0
##$RELAX= 
##$RELAX= 
##$RELAX= 
##$RELAX= 
##$RELAX= 
##$RELAX= 
##$RELAX= 
$$ Bruker specific parameters
$$ --------------------------
##$DU= <E:\>
##$EXPNO= 20
##$NAME= <NES1028_10332_9268290_OmHLmCDfxT>
##$PROCNO= 1
$$ [...]
150 150 150 150 150 150 150 150
##$TP07= 0
##$TPNAME0= <>
##$TPNAME1= <>
##$TPNAME2= <>
##$TPNAME3= <>
##$TPNAME4= <>
##$TPNAME5= <>
##$TPNAME6= <>
##$TPNAME7= <>
##$TPOAL= (0..7)
0.5 0.5 0.5 0.5 0.5 0.5 0.5 0.5
##$TPOFFS= (0..7)
0 0 0 0 0 0 0 0
##$TUNHIN= 0
##$TUNHOUT= 0
##$TUNXOUT= 0
##$USERA1= <user>
##$USERA2= <user>
##$USERA3= <user>
##$USERA4= <user>
##$USERA5= <user>
##$V9= 5
##$VALIST= <valist>
##$VCLIST= <CCCCCCCCCCCCCCC>
##$VD= 0
##$VDLIST= <DDDDDDDDDDDDDDD>
##$VPLIST= <PPPPPPPPPPPPPPP>
##$VTLIST= <TTTTTTTTTTTTTTT>
##$WBST= 2048
##$WBSW= 25
##$XGAIN= (0..3)
0 0 0 0
##$XL= 0
##$YL= 0
##$YMAX_a= 622758
##$YMIN_a= -519122
##$ZGOPTNS= <>
##$ZL1= 120
##$ZL2= 120
##$ZL3= 120
##$ZL4= 120
##$ABSF1= 14.98509
##$ABSF2= -5.573092
##$ABSG= 5
##$ABSL= 3
##$ALPHA= 0
##$AQORDER= 0
##$ASSFAC= 0
##$ASSFACI= 0
##$ASSFACX= 0
##$ASSWID= 0
##$AUNMP= <proc_prof1d_extract_pilot.lims>
##$AXLEFT= 0
##$AXNAME= <>
##$AXNUC= <1H>
##$AXRIGHT= 0
##$AXTYPE= 0
##$AXUNIT= <>
##$AZFE= 0.1
##$AZFW= 0.1
##$BCFW= 0
##$BC_mod= 0
##$BYTORDP= 0
##$COROFFS= 0
##$CY= 15
##$DATMOD= 1
##$DC= 0
##$DFILT= <>
##$DTYPP= 0
##$F1P= 0
##$F2P= 0
##$FCOR= 0.5
##$FTSIZE= 32768
##$FT_mod= 6
##$GAMMA= 0
##$GB= 0
##$INTBC= 1
##$INTSCL= 1
##$ISEN= 128
##$LB= 0
##$LEV0= 0
##$LPBIN= 0
##$MAXI= 10000
##$MC2= 0
##$MEAN= 0
##$ME_mod= 0
##$MI= 0
##$NCOEF= 0
##$NC_proc= -8
##$NLEV= 6
##$NOISF1= 0
##$NOISF2= 0
##$NSP= 0
##$NTH_PI= 0
##$NZP= 0
##$OFFSET= 14.98509
##$PC= 1
##$PHC0= 93.49915
##$PHC1= 0
##$PH_mod= 1
##$PKNL= yes
##$PPARMOD= 0
##$PPDIAG= 0
##$PPIPTYP= 0
##$PPMPNUM= 2147483647
##$PPRESOL= 1
##$PSCAL= 4
##$PSIGN= 0
##$PYNMP= <proc.py>
##$REVERSE= no
##$SF= 400.02
##$SI= 32768
##$SIGF1= 0
##$SIGF2= 0
##$SINO= 400
##$SIOLD= 32768
##$SPECTYP= <>
##$SREGLST= <1H.CDCl3>
##$SSB= 0
##$STSI= 32768
##$STSR= 0
##$SW_p= 8223.68421052631
##$SYMM= 0
##$S_DEV= 0
##$TDeff= 65536
##$TDoff= 0
##$TI= <>
##$TILT= no
##$TM1= 0
##$TM2= 0
##$TOPLEV= 0
##$USERP1= <user>
##$USERP2= <user>
##$USERP3= <user>
##$USERP4= <user>
##$USERP5= <user>
##$WDW= 1
##$XDIM= 32768
##$YMAX_p= 444997614
##$YMIN_p= -713540
##$CURPLOT= <Network HP LaserJet P1505>
##$CURPRIN= <$Network HP LaserJet P1505>
##$DFORMAT= <normdp>
##$LAYOUT= <+/1D_H.xwp>
##$LFORMAT= <normlp>
##$PFORMAT= <normpl>
##$SURQMSG= 1
$$ End of Bruker specific parameters
$$ ---------------------------------
##NTUPLES= NMR SPECTRUM
##VAR_NAME=  FREQUENCY,     SPECTRUM/REAL,   SPECTRUM/IMAG
##SYMBOL=    X,             R,               I
##VAR_TYPE=  INDEPENDENT,   DEPENDENT,       DEPENDENT
##VAR_FORM=  AFFN,          ASDF,            ASDF
##VAR_DIM=   32768,         32768,           32768
##UNITS=     HZ,            ARBITRARY UNITS, ARBITRARY UNITS
##FACTOR=    0.250966925370066, 1,           1
##FIRST=     8223.43324360094, -161416,      -62852
##LAST=      0,             -20141,          -270664
##MIN=       0,             -713540,         0
##MAX=       8223.43324360094, 444997614,    0
$$ Real data points
##PAGE= N=1
##DATA TABLE= (X++(R..R)), XYDATA
$$ [...]
19472b41014F0479b29389M4528D7261b0244k8261D3336q53a8049l2615r497A10666
19459A5535c19177b7475B3648a33016o9298C904a86709C4768J62075a07833a6150
19447A64611D6289a78268P1943b0362C28220b57521C230a05668E1453a52053B04205
19435a29600d657k18698A7757b04243C47788a34815N8588j21763A33383a70027
19424c0652k00970Q0459e8843n444l45854g1233A89323b06831L33A03468b25603
19412g8245l1166l1833r7895A17206a08647K2109B11398a00071b4741k32648g3329
19400a22749C84790b14102a03662P864j76585a22184I1598d5809j54218B2650
19389g6982k29248B84363c16987B59405f7478B70317q1859c02618b9194A68304
$$ y = [-241014, 60479, -229389, -184861, 47261, -20244, -48505, 43336, 42483, -18049, -50664, -60161, 110666, 15535, -319177, -27475, 23648, -133016, -202314, 3904, -186709, 34768, 196843, -107833, -16150, 164611, 46289, -178268, -106325, -20362, 328220, -257521, 3230, -105668, 51453, -152053, 204205, -129600, -4657, -223355, 17757, -204243, 347788, -134815, -76227, -197990, 133383, -170027, -30652, -231622, -151163, -58843, -64287, -410141, -71233, 189323, -206831, -206498, 103468, -225603, -78245, -109411, -141244, -239139, 117206, -108647, -86538, 211398, -100071, -24741, -257389, -73329, -122749, 384790, -214102, -103662, -95798, -272383, -122184, 91598, -45809, -200027, 22650, -76982, -306230, 284363, -316987, 259405, -67478, 270317, 188458, -302618, -29194, 168304]
19378h7610b050k29858g5336o4030c0070l20713a41497J1539j1999p826p2214
19367b21997b2753A19574a8685G1727P5884o5772j447c03841B28328b65954f808
19355a21341A23122f7698l88915b0627D858a77823j30344a14687E4009a35473
19344a5898j7535B44278b3222l31266A23658A8057a20254e3500j64285C38604
19333c10543a3625p753j39522P4411j07100N0505B1729J6836K6002f55536L09592
19322c45944J19154b1716r5328j94381i5553A09526c73523a18143q3263L4784
19312a66622A22911a19678c5508A16112i2687B42120a73942B73825h8530L829
19302h4701j9977d7317j6824K9721J6728B20967A08967J34417a84165r1494k10447
$$ y = [-87610, -2050, -231908, -75336, -139366, -30070, -350783, -141497, -129958, -141957, -149783, -221997, -22753, 119574, -18685, 71727, 147611, 81839, 80392, -303841, 228328, -265954, -6808, -121341, 123122, -67698, -456613, -20627, 4858, -177823, -308167, -114687, 54009, -135473, -15898, -33433, 244278, -23222, -354488, 123658, 18057, -120254, -53500, -217785, 338604, -310543, -13625, -21378, -160900, -86489, -193589, -143084, 21729, 38565, 64567, -655536, -345944, -226790, -21716, -117044, -311425, -95553, 109526, -373523, -118143, -201406, -166622, 122911, -119678, -35508, 116112, -92687, 242120, -173942, 273825, -88530, -84701, -104678, -47317, -64141, -34420, -17692, 220967, 108967, 243384, -184165, -275659, -486106]
19291d86106A16756f3611A69631a50917j10467D2518a44747I7806c1143D7724
19280a91733M924e0434A35462a07792A3809a11799b178B1640N0855g6036E3620
19268A55600L2887f8444o0560L7121M364D2361b41572I0584a50974j28425C5574
19256c71194j9858a72089K2285D8166d0952Q148D3566h107D6081a72394J0833
19245a61561d6136k81687p7279f349k71849b5177p2267C66079d3513j65187d9002
19233b44822d3614b31j51757j28357B62752n4757J16607a07898k94115b4581r400
19222c3981A90500n2402c58264B8315a6526j14519A31914a32107A14841b23710
19211F9540b71840B26367i7495j3666A57531D7959j2272A2344c07372h6978l5781
$$ y = [-486106, 116756, -63611, 169631, -150917, -261384, 42518, -144747, 97806, -31143, 47724, -191733, -186809, -50434, 135462, -107792, 13809, -111799, -2178, 21640, 72495, -76036, 53620, 155600, 188487, -68444, -129004, -91883, -87519, 42361, -241572, 90584, -150974, -279399, 35574, -371194, -391052, -172089, -149804, 48166, -40952, -32804, 43566, -8107, 46081, -172394, -161561, -46136, -327823, -405102, -6349, -278198, -25177, -97444, 366079, -43513, -208700, -49002, -244822, -43614, -231, -151988, -280345, 262752, 207995, 324602, -107898, -402013, -24581, -33981, 190500, 138098, -358264, 28315, -16526, -131045, 131914, -132107, 114841, -223710, 69540, -271840, 226367, -97495, -111161, 157531, 47959, 35687, 12344, -307372, -86978, -122759]
19200a22759D0184Q9536b8412l27874Q7420O9438g3184k9458l5400l38463b6025
19188g4626b5506E3144b49766H3742k1287d99705b22514c7341m80401B79763a67801
19176b8794A78777p4719b68678H5065c45025f6500C30322j27467a21988I5461
19165a15216q7038f7973p1872A2787i6255d8017F4077a4570l40277A82632F0837
19153i4091o498B50963c21120e2283j33013A18755d5235A9320I339N1438a64774
19141A29680b33983a716D5103i6929B17106m6042b22723j70622J82006N3775A04405
19129b8129k35585h9193H5239D1402a02256M4166F9282a98645m1149N3464Q7233
19118i9097B51992c44779B14597r5893a77333B88882f7413j17882j57560J52885
$$ y = [-122759, 40184, 129720, -28412, -356286, -268866, -199428, -73184, -102642, -138042, -476505, -26025, -74626, -25506, 53144, -249766, 83742, 62455, -499705, -222514, -37341, -517742, 279763, -167801, -28794, 178777, 104058, -268678, 85065, -345025, -66500, 330322, 202855, -121988, 95461, -115216, -202254, -67973, -139845, 12787, -96255, -48017, 64077, -14570, -354847, 182632, 60837, -94091, -100589, 250963, -321120, -52283, -185296, 118755, -45235, 19320, 9339, 60777, -164774, 129680, -233983, -1716, 45103, -96929, 217106, 171064, -222723, -393345, -211339, -157564, 104405, -28129, -263714, -89193, 85239, 41402, -102256, -58090, 69282, -198645, -239794, -186330, -99097, 251992, -344779, 214597, 118704, -177333, 288882, -67413, -185295, -342855, -189970]
19108a89970A6292c68892B94056B3718i868j72325j2222j81498a10714g201r9489
19097a06690C9301K80837c01985I779a43905q2795f3235B74550H8279C4752J14975
19086A49727p4043a72474j27688J05478i4272k60673c8829m4846J6797b2059F7167
19074d2041C2427e6870q8656b383H6108a20714j71313a32782H2528k8465J8843
19063G2906C3282b29476g5760m1519C8760a43261j28465Q4362A47041L5525a78792
19051A4038K21362q9497g1690m12462K36346d7357j43093C2712a74182D3029a16162
19039a30074J7684j19555a29j03157b6896H5788i6301B69705j23276E1684P896
19028E9580K13271H7246L5756b39250f3701A22127a96284A47346a51641B12735
$$ y = [-189970, 16292, -368892, 294056, 23718, -9868, -182193, -194415, -375913, -110714, -7201, -106690, 39301, 320138, -301985, 9779, -143905, -226700, -63235, 274550, 88279, 34752, 149727, 75684, -172474, -300162, -194684, -94272, -354945, -38829, -83675, -66878, -22059, 67167, -42041, 32427, -56870, -145526, -2383, 86108, -120714, -292027, -132782, 82528, 54063, 72906, 33282, -229476, -75760, -117279, 38760, -143261, -271726, -187364, 147041, 182566, -178792, 14038, 235400, 145903, -71690, -484152, -247806, -47357, -190450, 32712, -174182, 43029, -116162, -130074, -112390, -231945, -129, -103286, -26896, 85788, -96301, 269705, 146429, 51684, 59580, 272851, 87246, 123002, -239250, -63701, 122127, -196284, 147346, -151641, 212735]
19017h9736k52720g0698p1098l8264A27275C5976g8265K1993A82532p6258B9240
19005f6702I7542h6884k24088B5060J18917a93073A11640a74065P2536B8825a53446
18993i4722j10154k36967F9863a05037r3923A31574A9994h5012A75330b9179j39206
18982a68385L3394j07484A79734b9932k581G9845b8563B63712a39130A90770k178
18971A88592M75919A69768d5981j88250B05510K3118a58163d1618C8383J34095
18961A72478a09763J9374l39714a87929C8296b2803l40126A10424m6026d4326
18950e3859j15004m7492R1477l09769J62342i1601c3422j2913m0951E4567M7233
18939A01800m6591L9111g4422H3197h2455n3736O1585B8405c09783J13813Q0131
$$ y = [-89736, -342456, -70698, -141796, -180060, 127275, 35976, -78265, -56272, 182532, 106274, 29240, -66702, 97542, -86884, -310972, 25060, 143977, -193073, 111640, -174065, -101529, 28825, -153446, -94722, -204876, -441843, 69863, -105037, -198960, 131574, 19994, -85012, 175330, -29179, -168385, -134991, -242475, 179734, -29932, -32513, 79845, -28563, 263712, -139130, 190770, 188592, 664511, 169768, -45981, -234231, 205510, 228628, -158163, -41618, 38383, 172478, -109763, -90389, -430103, -187929, 38296, -22803, -362929, 110424, 64398, -44326, -53859, -168863, -216355, -124878, -434647, -272305, -91601, -33422, -46335, -87286, 54567, 101800, 55209, 94320, -74422, 83197, -82455, -136191, -74606, 28405, -309783, -195970, -115839]
18928a15839B1831c91793a03169B02141e1992m2281B44479b76007B8052J67720
18918A95772a86039A97616b42696B15916M3434H6545a8356j0305C1565L68268
18908C99833J49839j72405A72132a80195B64895a62547l7481j0590j34826B6718
18897A22624d80528J86568D6135b19468i0283a2681j84679A86062i4718A58126
18886A89424f1401b8325J3201n1416A17686O5642B4478b36429c6144j16201k06461
18875c58806J52309B79171a96500k6574a4108A16424J31287b16827E1747O355
18865E8102k3003a80028G2720f5945j1529I5663K27683e5545k5829J5514C4305
18853E074M3884e9966r8877f632C3863J50003G2703b65612A43367a04915r026
$$ y = [-115839, 21831, -391793, -103169, 202141, -51992, -94273, 244479, -276007, 28052, 195772, -186039, 197616, -242696, 215916, 259350, 86545, -18356, -28661, 31565, 399833, 549672, 377267, 172132, -180195, 264895, -162547, -200028, -210618, -345444, 26718, 122624, -480528, -293960, 46135, -219468, -90283, -12681, -197360, 186062, -94718, 158126, 189424, -61401, -28325, -15124, -66540, 117686, 183328, 24478, -236429, -36144, -152345, -358806, -206497, 279171, -196500, -223074, -14108, 116424, 247711, -216827, 51747, 58102, 35099, -180028, 72720, -65945, -77474, 95663, 323346, -55545, -81374, -65860, 34305, 5074, 48958, -59966, -158843, -6632, 33863, 183866, 72703, -265612, 143367, -104915, -113941]
18842a13941c4202k82938C32135a0420l3334I8083B6585j0225J33959g7680c3413
18830a94338k1868e571C031g2159k26040J30424g6681l8866j18154e029m33460
18819d38489a35093b9035k18804B18999B0720a17901A55047n4984f4277p0449
18809a34726b1978A60413a50315C43016b06904E9765b4013D7793a56349g1254
18798G1488k2403A8324P0744a34685A49450j8075J57608d7481D297c01202A38856
18786b12772C5959a28731E7379C789a16945C6539c84056e2706D3600a23189D04790
18774A15079E1891d537k59513b9830j20784A88728O1012c19079C20335b2755j68000
18763a90755d5113B1830a2138o3910A30015a2645p3170c1349a4624A14131n2854
$$ y = [-113941, -34202, -317140, 332135, -10420, -43754, 98083, 26585, 16360, 150319, -77680, -33413, -194338, -216206, -5571, 3031, -72159, -298199, -167775, -76681, -115547, -233701, -5029, -438489, -135093, -29035, -247839, 218999, 20720, -117901, 155047, 100063, -64277, -134726, -21978, 160413, -150315, 343016, -206904, 59765, -24013, 47793, -156349, -71254, 71488, 49085, 18324, 89068, -134685, 149450, 131375, 288983, -47481, 4297, -301202, 138856, -212772, 35959, -128731, 57379, 3789, -116945, 36539, -384056, -52706, 43600, -123189, 404790, 115079, 51891, -4537, -264050, -29830, -150614, 188728, 249740, -319079, 320335, -22755, -190755, -45113, 21830, -12138, -76048, 130015, -12645, -85815, -31349, -14624, 114131, 61277]
18752F1277i2538M2285C06070H8642c61059L6355D0518a97821G5689J41648j06193
18741A11144A8512K88737b7403j03242k6325a3364j57475d8898M916j59241A08849
18729a94884Q1306a9503i188D883c5944A02460i6290c253j27111D9262C417c77525
18716E3709O9842C0736h4630J4769n9956A4635J99857E8192b09670E2824a00280
18704a12896k37873a34078B18196J4257a25563j68176J07782r7742i1496l0293
18694a21789j34171j49111A93599d66979i0070k27850I4406b38161D10508b39437
18683A19423r371d01603J25205e6105k1232E4888O0769j1973C4079D209a04110
18671A7945J38933a49317r4234M2667c8494J2765B60905E8519d25092h673j57416
$$ y = [61277, -92538, -50253, 306070, 88642, -361059, -324704, 40518, -197821, 75689, 217337, 111144, 18512, 307249, -27403, -130645, -156970, -13364, -170839, -48898, -43982, -203223, 108849, -194884, -113578, -19503, -9188, 4883, -35944, 102460, -96290, -3253, -130364, 49262, 3417, -377525, 53709, 123551, 30736, -84630, -69861, -129817, 14635, 214492, 58192, -209670, 52824, -100280, -112896, -350769, -134078, 218196, 232453, -125563, -293739, -185957, -283699, -91496, -121789, -255960, -405071, 193599, -466979, -90070, -317920, 94406, -238161, 410508, -239437, 119423, 110052, -401603, -276398, -56105, -77337, 54888, 115657, 103684, 34079, 4209, -104110, 17945, 156878, -149317, -243551, -200884, -38494, -25729, 260905, 58519, -425092, -8673, -166089]
18660a66089D0657a04764r0359B60108a30898C21881c7158n7489a457k27088A8792
18648c36562d8657i260l7841j77277g5042k0506n2596r3105j93882H5407e1496
18636h7103A94879a25922E5021b13354A69514D0227J29592A3041J90436a02760
18625i4680B0080g6851n7769E6715K4020c4337j255A67998i6180r8160c0398K10
18613c0188p3513m4286f0317D852a18209o594A7038a1734j80096N4175J0046K8804
18601i8805B54183E0139f2139d060A03390D3357a26484N9222m3905m9920M8658
18590a12429C4077a14823H133c80477B410K29989a01287C3415a59264g9268H171
18578A56454n3062R7307k4664a32711A31532b96166b9876F5350a23018j8165B44582
$$ y = [-166089, 40657, -104764, -195123, 260108, -130898, 321881, -37158, -94647, -1457, -228545, 18792, -336562, -48657, -9260, -47101, -224378, -75042, -95548, -148144, -241249, -435131, 85407, -51496, -87103, 194879, -125922, 55021, -213354, 169514, 40227, 169819, 13041, 203477, -102760, -94680, 20080, -76851, -134620, 56715, 80735, -34337, -35592, 167998, -96180, -194340, -30398, -30188, -103701, -147987, -60317, 4852, -118209, -124803, 17038, -11734, -191830, -137655, -127609, -98805, 254183, 50139, -62139, -4060, 103390, 43357, -126484, -67262, -111167, -161087, -112429, 34077, -114823, 8133, -380477, 2410, 232399, -101287, 33415, -159264, -79268, 8171, 156454, 103392, 200699, 176035, -132711, 131532, -296166, -29876, 65350, -123018, -141183, 244582]
18566a0581j6551D694a88816P0077j12354L801Q8444d2109C3550i1021j9502d2563
18553a63933e5222C61188a17525J6224j3975e5964k74336h8304k66320a26882
18542b38928i4365l26028i2084J9691C9383J17395N7111e6321A79808B3423K36542
18531B59965j04715h2794o5195j2145A47765J69310f428j04767j78507A75660
18520b85819J07181F9995a78962Q2823j8871l14577i3078k0032B67113b17552
18509e4265j26550j08744J06748l0383e0260A58206B9450K5482L0516b48405A33484
18497i1253A44682c13213F0546a77781f7287A32442f3718A87940F0945a52198
18486A63721c9083j91300j59613A45408a19629G3965R5783a72809J6830E2291
$$ y = [-10581, -27132, 4694, -188816, -118739, -231093, -227292, -138848, -42109, 33550, -91021, -110523, -42563, -163933, -55222, 361188, -117525, -101301, -115276, -55964, -330300, -88304, -354624, -126882, -238928, -94365, -420393, -92084, -72393, 39383, 156778, 213889, -56321, 179808, 23423, 259965, 155250, -82794, -147989, -160134, 147765, 317075, -6428, -111195, -289702, 175660, -285819, -178638, 69995, -178962, -96139, -115010, -429587, -93078, -113110, 267113, -217552, -54265, -180815, -289559, -182811, -213194, -50260, 158206, 29450, 54932, 85448, -248405, 133484, -91253, 144682, -313213, 60546, -177781, -67287, 132442, -63718, 187940, 60945, -152198, 163721, -39083, -230383, -389996, 145408, -119629, 73965, 169748, -172809, -155979, 52291]
18475B8401b7883D8866a81309k22820A17594a50417g0236o393c3060H8033g1683
18463a29672B8540e5391k933C5787h9673j03837e3319k12030A07861a01621b7925
18451C5310a2798A64584g409A56828h9940B7864M12073c34366A83241c18472A55125
18439B03564i9538A13616a41993g0441B01547J32550A46655K09532g7491C5491
18428c28390e1212A01289A7326a60619d4600D370d6581H1687Q6077c14316g5895
18416A03212a87773e8903R410j70753A23031R7515g8167k27377c8204a420p2607
18405g4027A25124l4335d2462C6882j4517a9404o8403A58001m3777h3543B44675
18393C8029c24778b9749p0177A2950L01225j03352h831A5758K98768a03622f346
$$ y = [28401, -27883, 48866, -181309, -404129, 117594, -150417, -70236, -76629, -33060, 88033, -71683, -129672, 28540, -55391, -58324, 35787, -89673, -193510, -53319, -265349, 107861, -101621, -27925, 35310, -12798, 164584, -7409, 156828, -89940, 27864, 439937, -334366, 183241, -318472, 155125, 203564, -99538, 113616, -141993, -70441, 201547, 334097, 146655, 356187, -77491, 35491, -328390, -51212, 101289, 17326, -160619, -44600, 4370, -46581, 81687, 167764, -314316, -75895, 103212, -187773, -58903, -49493, -220246, 123031, 220546, -78167, -305544, -38204, -1420, -74027, 125124, 90789, -42462, 36882, 22365, -19404, -87807, 158001, 114224, -83543, 244675, 38029, -324778, -29749, -99926, 12950, 314175, 210823, -8831, 15758, 314526, -103622, -6346]
18381a45630l2366I9163A7806a21500e2231E8473a75892A43180a55629C9588f93604
18369c69155A89100e03076a445I4931d07209B27674f8485A92835l278a16524J7406
18358i9118o029k015q7173H2375b4439F427a28584C5619g1660A01570a01386J8901
18346h2485j17081C0879N594b47761d7504k84262D01155a17002i040B21991b32860
18334b39199O2290b716A15769a84845A1909e133D4772b25515A74355A0934M4210
18323E5144d9415d443I6717l5210a19588k11594B36653a82453N2701e4271k41077
18312b95348h6644H6365q262b73358J01618f292H1236h9461E5417i5316k72441
18301c67757J37821I239P1357a95674j2006A53507i3208A13042e0589q348I9579
$$ y = [-145630, -177996, 99163, 17806, -121500, -52231, 58473, -175892, 143180, -155629, 39588, -693604, -369155, 189100, -503076, -1445, 94931, -407209, 227674, -68485, 192835, 189557, -116524, -99118, -105147, -107162, -194335, 82375, -24439, 6427, -128584, 35619, -71660, 101570, -101386, -82485, -199566, 30879, 36473, -247761, -47504, -331766, 401155, -117002, -9040, 221991, -232860, -239199, -176909, -2716, 115769, -184845, 11909, -5133, 44772, -225515, 174355, 10934, 55144, -49415, -4443, 96717, 61507, -119588, -331182, 236653, -182453, -129752, -54271, -295348, -86644, 86365, 78103, -273358, -171740, -6292, 81236, -89461, 55417, -95316, -367757, -229936, 9239, 80596, -195674, -207680, 153507, -93208, 113042, -50589, -58937, 99579]
18289a72384j4789p6747A33003b69777B2604J03652f7078m163j10651a2837A7628
18277A12947K53382A0811M5697a38568P619A23430b41042c0255A38020l1805d6290
18265a72308h5502B76625N2825a23182j73602D8047h2023j9516J2381A43832m0769
18254A03063C7830a71695M611l6846A32671b9180A51828b05729D7467a78959D0916
18242C25419b93629f4987k3223j71400f8399A00004d30947b13223C0232b8396
18231c28839a20544B53954b3880I7788k9552K42709a83626D7829G325M8091c45540
18219g4953G774a00015j4040e4030h668n5746m3436A18376d00391B11002j03352
18208A07650C0176b86976l4941e2613j79331M5224h378r688m06914D8491N0415
$$ y = [-172384, -187173, -263920, 133003, -269777, 22604, 126256, -67078, -71241, -181892, -12837, 17628, 112947, 366329, 10811, 56508, -138568, -130949, 123430, -241042, -30255, 138020, 106215, -46290, -172308, -85502, 276625, 329450, -123182, -296784, 48047, -82023, -101539, -89158, 143832, 103063, 37830, -171695, -167084, -203930, 132671, -29180, 151828, -205729, 47467, -178959, 40916, 325419, -293629, -64987, -88210, -259610, -68399, 100004, -430947, -213223, 30232, -28396, -328839, -120544, 253954, -23880, 97788, 68236, 310945, -183626, 47829, 7325, 55416, -345540, -74953, 7774, -100015, -114055, -54030, -8668, -64414, -107850, 118376, -400391, 211002, 107650, 30176, -286976, -321917, -52613, -231944, -186720, -8378, -18066, -424980, 48491, 98906]
18197I8906N6692J2802j3691m4354l5839O8406b10090B51279A21319D9354A5464
18185b56370C0813a43453j09122G2835c8976B79635e7222H6744J16841a43243
18174b38293G3928a93837j65797J27699H76d49867J40143N6412n2855A63756o1356
18163A02400i3508j37525i8863A16697a83789b0046j48952D8931a41587m7755
18153a89342E1908K39831A45267n4363a77253J3418A9994d3093e986C9428a77618
18141c2758h014l4581J1020A28772c83712J77448M4368b6445k9719j71706A77937
18129C90146i4567B6038c0673n6509G8152a19278j237r151C5073O1345D4068j1488
18117C2580R442a96615B26963f5139l66541i370m1608A52856a830B00485I1143
$$ y = [98906, 155598, 168400, 154709, 110355, 74516, 142922, -210090, 251279, 121319, 49354, 15464, -256370, 30813, -143453, -252575, 72835, -38976, 279635, -57222, 86744, 203585, -143243, -238293, 73928, -193837, -359634, -231935, 876, -449867, -309724, -253312, -306167, 163756, 102400, -93508, -231033, -98863, 116697, -183789, -20046, -168998, 48931, -141587, -189342, 51908, 291739, 145267, 90904, -177253, -163835, 19994, -43093, -5986, 39428, -177618, -32758, -8014, -42595, -31575, 128772, -383712, -206264, -161896, -26445, -56164, -227870, 177937, 390146, -94567, 26038, -30673, -87182, 78152, -119278, -120515, -129666, 35073, 96418, 44068, 32580, 42022, -196615, 226963, -65139, -431680, -9370, -50978, 152856, -1830, 200485, 91143]
18105I0883b93635J32888M2386j72467J38686A84158B7475J37614D491g6850A44975
18093c78262h8326a5927k3513o0909C969b78218C3246Q0402k2006d0715k38956
18082b79671B29731j10430a0589m9488l7105L9084m8060B41601G6960a38893j156
18071a40049N5121A0554Q037a53681a6830k0646m2528l1344J0718G1510e229C67616
18058A05077M2193h2070B7030K48642I8395m5a82889A45845c82015i8677A87160
18046C18676A55733J988F2780c39853A56221a62310m0433A3798J61778a48777
18035a2796D28424h9282J2775A72774a03297B2854a59425j73892A41345g8830
18024h1614B4284J01707c62A09805J41470A7637q021a68220G9389J29399h2427
$$ y = [90883, -293635, -160747, -118361, -290828, -152142, 184158, 27475, 165089, 4491, -76850, 144975, -378262, -88326, -15927, -39440, -100349, 3969, -278218, 33246, 113648, 91642, -40715, -279671, 229731, 119301, -10589, -60077, -97182, -58098, -106158, 241601, 76960, -138893, -140049, -84928, 10554, 18591, -153681, -16830, -37476, -80004, -111348, -100630, 71510, -5229, 367616, 105077, 147270, -82070, 27030, 275672, 98395, 98350, -182889, 145845, -382015, -98677, 187160, 318676, 155733, 157721, 62780, -339853, 156221, -162310, -202743, 13798, 175576, -148777, -12796, 428424, -89282, -76507, 172774, -103297, 22854, -159425, -333317, 141345, -78830, -81614, 24284, 125991, -362, 109805, 251275, 17637, 9616, -168220, 79389, 208788, -82427]
18012a6173A78492n8547B0769g8938k1949H5570A8717i1154O011M1801k3277A32137
17999A25245A6251E784e6230j32811B873K77879g6037H4399G427K23218c8298
17987f2535G4320J72552C84b2266l6332m73164c8977A68918K362a09783E03787
17975i9387i068o9438A13120B2447h0739C70276b3693q3985F3236j9107J00475
17964A44604a66140A82910d5460o5437B84089A7123b23272g5177B3658L11381
17954C35039F5974b94337c3355C9466Q8098k3450c0574B47162i6481B0185d3861
17942A32266d698p1040A72985a93533B079J4818O9399J13850B6806O3239a16812
17930b29582H4977a89336G8822K2101K0017K91099A76196p6988e2837m3652I340
$$ y = [-16173, 178492, 119945, 20769, -78938, -100887, 85570, 18717, -91154, -85143, -43342, -66619, 132137, 125245, 16251, 5784, -56230, -189041, 2873, 280752, -76037, 84399, 7427, 230645, -38298, -62535, 74320, 246872, 384, -22266, -58598, -531762, -38977, 168918, 171280, -109783, 503787, -99387, -9068, -78506, 113120, 22447, -80739, 370276, -23693, -107678, 63236, 44129, 144604, -166140, 182910, -45460, -110897, 284089, 17123, -223272, -75177, 23658, 335039, 65974, -294337, -33355, 39466, 127564, 104114, -30574, 247162, -96481, 20185, -43861, 132266, -4698, -75738, 172985, -193533, 2079, 16897, 86296, 200146, 26806, 90045, -116812, -229582, 84977, -189336, 78822, 100923, 120940, 412039, 176196, 99208, -52837, -96489, 9340]
17918B8299K40415b64284B76619A12939G024a30410M1689A40095n7296b31465
17907a43872C15382a42298B63729B8050L79725a8689j13803a5339m30145J46367
17897b99117A54346c11392a7099A38219a81689G1252b36453J5817P268B05704
17886C1791A0074i2225A76619D3837J62642a7728B10168I7343a37197f7552A02688
17874a93027m6111A842K03166J340h4247a7909k2442J747D33871j92786k7657
17863B13428k907b66726l918g7937A21097a01479M6718p2845A13554K6566C4181
17851a74211A95144a59000B43961G8008c1822q3865J6185O592F6909J02887Q8660
17840B58456d10500B00170J75843g42C6408B081K99647E0030J67483n0240d5485
$$ y = [28299, 268714, -264284, 276619, 112939, 7024, -130410, -88721, 140095, 82799, -231465, -143872, 315382, -142298, 263729, 28050, 407775, -18689, -132492, -15339, -445484, -299117, 154346, -311392, -17099, 138219, -181689, 71252, -236453, -220636, -213368, 205704, 31791, 10074, -92225, 176619, 43837, 206479, -17728, 210168, 97343, -137197, -67552, 102688, -193027, -239138, 1842, 205008, 206348, -84247, -17909, -40351, -38604, 433871, 241085, 213428, 210521, -266726, -270644, -77937, 121097, -101479, -54761, -127606, 113554, 140120, 34181, -174211, 195144, -159000, 243961, 78008, -31822, -115687, -99502, -92910, 66909, 169796, 258456, -410500, 200170, 376013, -742, 36408, 2081, 301728, 50030, 217513, 167273, -45485]
17828D2607L4435G090a2078A11040n5360L00866r0634g7650A13091f1546I1064
17816a62008H3714e2541p6762d6355j38806A13990M946R913J25547b91414h5318
17804A890M6032a59653A24017a08714k32674A86158c2532q1501C21362g3121A47652
17792C28086c0887j72708A47320c0179k85729b3074q7242a7890k7244A75135m2057
17781A33078b5228D4792a99384A62851l5628b2956A60256j761K50400A31426a09866
17769E3875N7796J1019c02297A45364K3663J03652a7538j60943C4213a09206j49511
17758b58717g422A63572E0382d5893C75303H6974O166e566B36083M3788j26312
17747A53559m6343a37662O3406E3846f0974m728I9970J44928A06623A5630c9575
$$ y = [42607, 77042, 7090, -12078, 111040, 55680, 356546, 265912, -77650, 113091, -61546, 91064, -162008, 83714, -52541, -129303, -46355, -185161, 113990, 118936, 128849, 254396, -291414, -85318, 1890, 47922, -159653, 124017, -108714, -341388, 186158, -32532, -114033, 321362, -73121, 147652, 328086, -30887, -203595, 147320, -30179, -315908, -23074, -110316, -17890, -45134, 175135, 133078, -25228, 44792, -199384, 162851, 127223, -22956, 160256, 158495, 408895, 131426, -109866, 53875, 111671, 122690, -302297, 145364, 169027, 272679, -17538, -178481, 34213, -109206, -258717, -7422, 163572, 50382, -45893, 375303, 86974, 93140, -5566, 236083, 279871, 153559, 107216, -137662, -74256, 53846, -60974, -65702, 99970, 244898, 106623, 15630, -39575]
17735C1209J43678e613j4762r3325m9198F6743K92798j77626B585O0593M0204
17724A03382P3053K80162G3474A8656a54152d2840A67266b4936A35740o1159d6405
17712B96859H2850J06990J2406r6438b41342c5164c894j92776A92313c77826J76422
17701b01404P8377D37327k11356C3450J33876c0620A36702g4398J407B30025m8418
17690A81607k9477c92507I3034b5103a0021j35206A18580B2254L80940j81260
17680B21934F1054J76207e885k56609B15296g0839B31444f4671C54469j14783
17670B39686j1289H3668L35729O343F7307a55272B51945H9170a74937D8267b62039
17658B04832r8946J09606l0171a16306H959L66017h9737F1058i408A65887Q345
$$ y = [31209, 174887, -5613, -20375, -113700, -162898, 66743, 359541, 181915, 2585, 63178, 103382, 176435, 456597, 73474, 18656, -154152, -42840, 167266, -24936, 135740, 74581, -46405, 296859, 82850, 189840, 202246, 105808, -241342, -35164, -3894, -196670, 192313, -377826, -201404, -123027, 437327, 225971, 33450, 167326, -30620, 136702, -74398, -72991, 230025, 181607, 152130, -392507, 93034, -25103, -10021, -145227, 118580, 22254, 403194, 221934, 61054, 237261, -5885, -262494, 215296, -70839, 231444, -64671, 354469, 239686, 228397, 83668, 419397, 425740, 67307, -155272, 251945, 89170, -174937, 48267, -262039, 204832, 105886, 215492, 185321, -116306, 8959, 374976, -89737, 61058, -9408, 165887, 174232]
17647A74232c7030J1242B45563p7883N9816A00944J45378o8469o9165k8017b50682
17635A84243j7798B5512a92476C88765D2790J54998c0607A00969E350g0596A94180
17623a46106E7154O2266Q8525a26526A37327Q197P3215K0731f120j56233d8520
17611b51649a5534A54298K80299G4699a6918A83831J17133l0773G7462Q0831m9089
17600A09204J6703J67489a39589F9271L28065A13087L00092A2377c1654B92335
17589b97515B02840J39519H9195R6386P9663F8498a30223A09737f2409j72242
17579b34651B58646c8599e298D80042B03219c5971A18797J33899J26630A45244
17568E5260Q4366L55365b7762A51743O9391C8558K48425q3686G359L57816a43920
$$ y = [174232, -37030, -25788, 245563, 167680, 227496, 100944, 246322, 177853, 108688, 80671, -250682, 184243, 166445, 25512, -192476, 388765, 42790, 197788, -30607, 100969, 5350, -70596, 194180, -146106, 57154, 119420, 207945, -126526, 137327, 145524, 218739, 239470, -6120, -162353, -48520, -251649, -15534, 154298, 434597, 74699, -16918, 183831, 300964, 270191, 77462, 158293, 109204, 125907, 293396, -139589, 69271, 397336, 113087, 413179, 12377, -31654, 292335, -297515, 202840, 342359, 89195, 185581, 265244, 68498, -130223, 109737, -62409, -234651, 258646, -38599, -5298, 480042, 203219, -35971, 118797, 252696, 379326, 145244, 55260, 139626, 494991, -27762, 151743, 221134, 38558, 286983, 203297, 7359, 365175, -143920]
17556C86799D7357P8096a27127A15981E7711D497J54249j8748J8867K885J63799
17545C25549j19105J73630A09234J30735O8321O4281b63338B71371H6800M3251
17535A30051a304H830J03874L11115J44652a1313B67588r9453K99797J47648J0507
17524F26087K60632k64188o0871K74968j69824n5244o1831k64822j11986M6551
17514B19472l0425L19039K91053k27494K83949L46131m41267q3358k84681K76983
17504F69402J13236C23696M5590E9885K67053j48327O9305Q4044l1631n8137K51224
17493D93416a11483B57364p2606J36619O00I7992d9807A22030C7028Q2941K07321
17482C27290j56675J68658j64494K04867J36986A65644M76847j46685j24864j19360
$$ y = [386799, 47357, 125453, -127127, 115981, 57711, 4497, 158746, 139998, 158865, 161750, 325549, 206444, 380074, 109234, 239969, 308290, 372571, -263338, 271371, 86800, 130051, -1304, 8830, 112704, 423819, 568471, -11313, 267588, 168135, 467932, 615580, 626087, 886719, 622531, 561660, 836628, 666804, 611560, 549729, 284907, 172921, 219472, 189047, 508086, 799139, 571645, 855594, 1201725, 760458, 677100, 392419, 669402, 782638, 323696, 369286, 59885, 326938, 178611, 247916, 331960, 300329, 242192, 493416, -111483, 257364, 184758, 321377, 321977, 97992, -49807, 122030, 37028, 119969, 327290, 170615, 339273, 174779, 379646, 516632, 165644, 642491, 495806, 370942, 251582]
17472B51582C2917f8910c1326D97117B47665M5792k393j14996Q1928A449L92157
17461C93606J31522B14035p303r5063J35869m633b5445C22047p3091F4261M7817
17450A12078J59592j2799I9653N79468B72332H2298h0895E27410J05056B47385
17439D55031q9326N44J65580A99012M25351l11954J3808p8501j3127L15345A43939
17427D12657N9226J23975B16693K32383A51784J56622J41840A60709L55796k22014
17417B94491J87302o5739l8882J90255k11481K1609L39767A55516K8308K87475
17407D71299k31862J22498J23325k30310A15309K04152P8258j30052a59419C06744
17396C75103N5787J797j50631J14434G9474Q9724L0760J70533j38416J23687m8131
$$ y = [251582, 32917, -68910, -31326, 497117, 247665, 293457, 291064, 176068, 257996, 1449, 393606, 525128, 214035, 206732, 111669, 247538, 242905, -25445, 322047, 248956, 64261, 112078, 271670, 258871, 99653, 679121, 272332, 82298, -80895, 527410, 632466, 247385, 455031, 365705, 366249, 531829, 199012, 624363, 312409, 326217, 247716, 234589, 549934, 143939, 412657, 471883, 595858, 216693, 449076, 151784, 308406, 450246, 160709, 516505, 294491, 481793, 416054, 377172, 567427, 355946, 377555, 717322, 155516, 183824, 471299, 239437, 361935, 485260, 254950, 115309, 319461, 397719, 267667, -159419, 306744, 375103, 430890, 432687, 282056, 396490, 79474, 169198, 199958, 370491, 232075, 355762, 307631]
17385C07631A51949K53352A109K66184N7004p7544r2413m8845J99380m1624l0763
17374B32488o1245H4943J65457N3470A23087E30M05371j32562R984o1122l6072
17363A86129a01924A13545K54849j1403n8392j2109A26064J43011H913a84782
17352B73832B3507J33405J32590K96461B42174N1383L1278k1747p7858J32937
17342C58167k6732j04132j7013J04671J08992B2245a0330j4269B82385n7199n2659
17331A72527N0394M7396N9759r3167j6219I2595N5655K7718m7242Q6133l5824
17320A79035N2928J89931L3523j6088j67404K16104B27846p5287J61288k5830
17310B88017O2598I0250J25446J34600K48241B72311J72643B17150K51636j17739
$$ y = [307631, 151949, 405301, 1109, 267293, 324297, 246753, 154340, 105495, 304875, 263251, 232488, 171243, 84943, 250400, 303870, 123087, 530, 405901, 273339, 283323, 222201, 186129, -101924, 113545, 368394, 356991, 298599, 286490, 126064, 269075, 8913, -184782, 273832, 23507, 156912, 289502, 585963, 242174, 293557, 324835, 303088, 225230, 358167, 331435, 227303, 210290, 314961, 423953, 22245, -10330, -24599, 282385, 225186, 172527, 222921, 270317, 330076, 236909, 220690, 92595, 148250, 175968, 128726, 214859, 179035, 231963, 421894, 455417, 439329, 271925, 488029, 227846, 152559, 313847, 288017, 350615, 90250, 215696, 350296, 598537, 272311, 444954, 217150, 468786, 351047]
17300C51047H2710J76474N7030H4159J13452J58135o3502J5979J10529k2942q144
17289C87666j26158J15933A18016K93884a77657B61827a72338A24642M17345k30775
17279C11212b9587D66680K6731B38739J74168J35901I9251K66829K94041a37517
17268G1577J31724I7866L95987J96683l26790A60264J10129o4005R1542K7792
17258C25722A48151J78347j38717J76932M9889J04535A98352M51932j91466L0379
17248D89197j86812J71431P062P7942j52949A70867A5856K96826N6252K95461
17238F64395A39627e0915B62493O5365J59192r6699A40526M41725j61773j60122
17228B60356J12038K64706j89853Q3358J1925H3126M76714j17265J20091B79463
$$ y = [351047, 82710, 259184, 316214, 84159, 197611, 355746, 292244, 308223, 418752, 395810, 387666, 261508, 377441, 118016, 411900, -177657, 261827, -172338, 124642, 541987, 311212, -29587, 466680, 493411, 238739, 412907, 548808, 99251, 366080, 660121, -137517, 71577, 203301, 97866, 493853, 690536, 363746, 160264, 270393, 206388, 297930, 325722, 148151, 326498, 187781, 364713, 414602, 519137, 198352, 650284, 458818, 489197, 302385, 473816, 480878, 558820, 405871, 170867, 15856, 312682, 368934, 664395, 139627, -50915, 262493, 327858, 487050, 390351, 140526, 582251, 420478, 260356, 372394, 637100, 447247, 530605, 542530, 83126, 559840, 442575, 562666, 279463]
17217C16493k8923K29976j36157j62091L2436L20321A97980P9986Q7148k7616
17207C37498P801J35404n932p1163R5289P5149L94080C34011L68244k55119J32520
17196E79656k71785K55699j89538j60723L04396n3518J40830r3782o4901J684
17186D48018P6775K28876C61266J40437m3966j56449R0411L64242l72241J91539
17176E75239k29368O5289K19757k17758J62606k22105L09057k45776j94455J70632
17166C93118j15368M04003B90597J20045K07765o0834J22329K91408m12925A72033
17155G49216K8262l22883K36629j16706k06590J186L18397j17391p8372r0847
17145D00901J53375k29639L90659l37920Q7117N35997k93607k03403B51115n652
$$ y = [316493, 287570, 517546, 381389, 219298, 251734, 572055, 197980, 277966, 365114, 337498, 345299, 480703, 474771, 403608, 498897, 574046, 968126, 334011, 702255, 447136, 579656, 307871, 563570, 374032, 213309, 517705, 464187, 605017, 511235, 446334, 448018, 524793, 753669, 361266, 501703, 457737, 301288, 391699, 755941, 383700, 575239, 345871, 411160, 630917, 413159, 575765, 353660, 662717, 416941, 222486, 393118, 277750, 681753, 290597, 410642, 618407, 557573, 679902, 971310, 558385, 172033, 749216, 777478, 454595, 691224, 574518, 367928, 369114, 687511, 570120, 491748, 400901, 554276, 324637, 715296, 377376, 464493, 1000490, 706883, 503480, 251115, 245463]
17135B45463L53408j39340n0851K96794j1264j86657J30047J40833j19503J21547
17125G80477l21092L46463l95481M9521m5870J59773j52425K60378k19220L36905
17115G99429j12796J33754K9463k98145k04009K60634P9984k8777J36097B98845
17104E34568J64509j18409O7619K91080k29918M6274L6412k25480L39377j40612
17094G65420o7044P0085n2203k42790K08600L77310k16477l64790J58819N93842
17084A230772k72405N3009l14315J64313j50187J48971K402j56766M5193J49107
17074I00094l57667M42888M4216j49009J5309J79201k28021k4277J84031J3653
17064A020418j87970L26192j32208j08428J61174k59798m5308J8299L34374k64430
$$ y = [245463, 598871, 459531, 408680, 705474, 694210, 507553, 637600, 778433, 658930, 780477, 459385, 805848, 410367, 459888, 414018, 573791, 421366, 681744, 462524, 799429, 686633, 820387, 849850, 551705, 347696, 608330, 688314, 659537, 795634, 298845, 534568, 699077, 580668, 648287, 939367, 709449, 755723, 792135, 566655, 906032, 765420, 698376, 768461, 716258, 473468, 682068, 1059378, 842901, 478111, 636930, 1230772, 958367, 1011376, 697061, 861374, 711187, 860158, 862560, 705794, 750987, 900094, 542427, 985315, 1029531, 880522, 895831, 1075032, 847011, 822734, 1006765, 1020418, 832448, 1158640, 1026432, 918004, 1079178, 819380, 774072, 792371, 1126745, 862315]
17054H62315n4681J10735J05212k08954J17545J48796K785j70735J11707o0348
17044I64377j45082r751J62307j72826K40273J37913k62757j95055M90954r1196
17034A119157k4006J22595j28939l12003J53596J43824k7514J17143j06171K9687
17024A087369K19645k26028m3864J76064K4577P7024l44591K29669o1959J28214
17014A266120l19030L35539J18932k94626n3031K10240N47309l88430l8015j5774
17004A369234m83977N64045Q083j3276j8023r9932M2525k0607j8115j50211N33895
16993A713641k25232K3826Q2843m8393J39992l03056K26858k2107M1790K18669
16983A848831k19810J0016J86059j44515q1472K74542k10222k24891R5965L5233
$$ y = [862315, 807634, 918369, 1023581, 814627, 932172, 1080968, 1083753, 913018, 1024725, 964377, 819295, 809544, 971851, 799025, 1039298, 1177211, 914454, 719399, 1210353, 1119157, 1095151, 1217746, 1088807, 776804, 930400, 1074224, 1046710, 1163853, 1057682, 1087369, 1307014, 1080986, 1037122, 1213186, 1237763, 1314787, 970196, 1199865, 1137906, 1266120, 947090, 1282629, 1401561, 1106935, 1053904, 1264144, 1811453, 1423023, 1385008, 1369234, 885257, 1449302, 1457385, 1444109, 1426086, 1326154, 1368679, 1348072, 1329957, 1179746, 1713641, 1488409, 1512235, 1595078, 1546685, 1686677, 1383621, 1610479, 1588372, 1630162, 1848831, 1629021, 1639037, 1825096, 1680581, 1599109, 1873651, 1663429, 1438538, 1534503, 1569736]
16973A569736j56559M58663k78861J55087l8061J16637L00173k6877m5576k58667
16963A795695j9495j85442N01551k34900J72477L8572j48523J00161k42788K40900
16953B018208K73471k86627L92439n31660J38722K98389j15411o1640J73638l33482
16943A966047M45983M6876l81849j5534L14824j92385K75629r545k06837K69736
16933B512945N573k62919J91276K54590j18542J45159m49694N22726k89042K70260
16923B782332j63905K19403M5368K379K4629j13675j44720Q6927N00510j96116
16913C043132J19199l44716J74564k43007J34791M59897n23773K68371K62606
16904C351064J15724m5755k13631K65321r2727J83424j54830j18892P6120L56579
$$ y = [1569736, 1413177, 1871840, 1592979, 1748066, 1710005, 1826642, 2126815, 2099938, 2054362, 1795695, 1776200, 1590758, 2092309, 1857409, 2029886, 2068458, 1919935, 2020096, 1777308, 2018208, 2291679, 2005052, 2397491, 1865831, 2004553, 2302942, 2187531, 2125891, 2299529, 1966047, 2412030, 2458906, 2077057, 2061523, 2376347, 2183962, 2459591, 2450046, 2243209, 2512945, 2518518, 2255599, 2446875, 2701465, 2582923, 2728082, 2278388, 2801114, 2512072, 2782332, 2618427, 2837830, 2883198, 2885577, 2910206, 2796531, 2651811, 2738738, 3239248, 3043132, 3162331, 2817615, 2992179, 2749172, 2883963, 3343860, 2820087, 3088458, 3351064, 3466788, 3421033, 3207402, 3472723, 3379996, 3563420, 3408590, 3289698, 3365818, 3722397]
16894C722397n1149J83999O4163P9605r3877J3687j80840N62889l10502L02162
16884D292534j08363q5043r7836J97520J78161Q8209K14774k43057K69846p3356
16874D633389J85900J93369l04013L64220o5149Q998J82374L18256l56169K90088
16864E451263P6942L13768l17016O8510Q2577K75366n2130K42828M3539J08646
16854F294293K88955J464L3143L54600j95022j65819K32179L45884J45594M38957
16844G774228j11509k1860l39761L87770L48718q7285j08465J70677N93852M6879
16834H653244J11961L29027L09502J16083J80299k48419N03853l42724M34300
16825A0047126J99395J51084L60742J17529R3253K99948L17118O9429K80576K8059
$$ y = [3722397, 3671248, 3855247, 3919410, 3999015, 3905138, 3918825, 3737985, 4300874, 3990372, 4292534, 4184171, 4099128, 4001292, 4198812, 4376973, 4465182, 4679956, 4436899, 4706745, 4633389, 4819289, 5012658, 4708645, 5072865, 5007716, 5016714, 5199088, 5517344, 5161175, 5451263, 5528205, 5841973, 5524957, 5593467, 5676044, 5951410, 5899280, 6142108, 6185647, 6294293, 6583248, 6584712, 6617855, 6972455, 6777433, 6611614, 6843793, 7189677, 7335271, 7774228, 7662719, 7640859, 7301098, 7688868, 8037586, 7950301, 7841836, 8012513, 8606365, 8653244, 8765205, 9094232, 9403734, 9519817, 9700116, 9451697, 9955550, 9612826, 10047126, 10246521, 10397605, 10758347, 10875876, 10969129, 11269077, 11586195, 11655624, 11936200, 11964259]
16815A1964259N39933k30086Q22306L19028j26199M21301L47691K68513M33388
16806A4760134n7280N91762L37026L48209J46637K07124L18580P20641J90838
16797A7563671N14719L22005O99740K89834N98543L88047N01147N57150M47091
16788B1881947M79387P21505O38642M13167N09099Q37303L65267Q94385P24293
16779B7464995M18244R11868Q66151Q27698Q38387J105331N63712J075255J071127
16770C5142768P27355P80696J320163O46187J184452J008978J316368J130304
16762D3257271J509957J171228J362285R00255J572920J451808J179831J366498
16754E3772053J503721J358370J762094J494561J832591J404896J604939J706841
$$ y = [11964259, 12504192, 12274106, 13096412, 13415440, 13289241, 13710542, 14058233, 14326746, 14760134, 14702854, 15294616, 15631642, 15979851, 16126488, 16333612, 16652192, 17372833, 17563671, 18078390, 18400395, 19100135, 19389969, 19988512, 20376559, 20877706, 21434856, 21881947, 22361334, 23082839, 23721481, 24134648, 24643747, 25481050, 25846317, 26740702, 27464995, 27883239, 28795107, 29661258, 30488956, 31327343, 32432674, 32996386, 34071641, 35142768, 35870123, 36650819, 37970982, 38617169, 39801621, 40810599, 42126967, 43257271, 44767228, 45938456, 47300741, 48200996, 49773916, 51225724, 52405555, 53772053, 55275774, 56634144, 58396238, 59890799, 61723390, 63128286, 64733225, 66440066]
16746F6440066J477254J508270J829572J670501J564325J329577J471921J417422
16738G8708908J491460J342325J408863J101526R44783J046223J005204Q17986
16730H7867278P25096O13844M59014K58297J77417N5167k0763k86274m25489l38174
16720H9085413q34514l49538j051363o56921j213960r68534j215968r76799j524566
16711H0293250j501844j321222j405400j744355j243742j663478j610527j589850
16703F8212832j625748j059279j969773j639164j276424j796648r70156j878065
16695E5997575j588004j417476j069567j411690j716386r91416j195288j022292
16687D5585456j299254r86217j514713o25087j330747r57910j165990j152699
$$ y = [66440066, 67917320, 69425590, 71255162, 72925663, 74489988, 75819565, 77291486, 78708908, 80200368, 81542693, 82951556, 84053082, 84997865, 86044088, 87049292, 87867278, 88592374, 89206218, 89665232, 89923529, 90100946, 90156113, 90135350, 89849076, 89423587, 89085413, 88250899, 87901361, 86849998, 86193077, 84979117, 84010583, 82794615, 81817816, 80293250, 78791406, 77470184, 76064784, 74320429, 73076687, 71413209, 69802682, 68212832, 66587084, 65527805, 63558032, 61918868, 60642444, 58845796, 57875640, 55997575, 54409571, 52992095, 51922528, 50510838, 48794452, 47803036, 46607748, 45585456, 44286202, 43299985, 41785272, 41160185, 39829438, 38871528, 37705538, 36552839]
16679C6552839n81886j173200j060324p54524p36102r69168o24489r07193n63285
16670B9182668n95223r69034m71605r13969l66582o07000o99235n32432m70927
16661B3556661l45345p96776m75003l52090o52309l80341n18313m09978m06128
16652A9220378n3739n95161n57054l1267o34638n73786k42479l26859R376l76826
16642A5837945m97442r7357l09831l95975l10895l6927n03187k06739k68753k37845
16632A2972994j89449l85879l68449p9069J92059l95286j80296J79779o48269
16623A1098135j92462k20509j25943R8407m75590J14662l83604J46340m32718
16614I626718j35427j34884n0859l15613K46246m02785m60242M04670m14674L20628
$$ y = [36552839, 35970953, 34797753, 33737429, 32982905, 32246803, 31277635, 30653146, 29745953, 29182668, 28587445, 27618411, 27146806, 26232837, 25866255, 25259255, 24560020, 24027588, 23556661, 23211316, 22414540, 21939537, 21587447, 20935138, 20554797, 20036484, 19626506, 19220378, 19166639, 18571478, 18014424, 17983157, 17348519, 16774733, 16532254, 16205395, 16214771, 15837945, 15340503, 15243146, 14933315, 14537340, 14226445, 14189518, 13686331, 13479592, 13210839, 12972994, 12783545, 12397666, 12029217, 11950148, 12142207, 11746921, 11566625, 11746404, 11098135, 10905673, 10685164, 10559221, 10657628, 10182038, 10296700, 9913096, 10059436, 9626718, 9491291, 9356407, 9305548, 8989935, 9236181, 8833396, 8373154, 8777824, 8363150, 8683778]
16604H683778l46447m1068n51993O9840k79147J5374j13635K33218l37771j31354
16594G200795j08397J31650k87201O0265k20179l02586J10017j66124K94824l14509
16584F398555m09095J98735j66894j11957l30178K62289M28320o01318Q0890p6742
16574E672605j26326R9893m23153Q1581k79028J52873O9932J13623L6628l51982
16564E046646o5378j19107J25049j08532k21677j75178Q1672J13321j39605j19153
16554D418058j1669J80586k99843L81098m57603J08969K26673l16520m25873K61217
16544D065093M63169n09606r6722J17602o366N2434l61105J63085r5606k0669
16534C771309k29308q5147M18442n14982j29334K67979m15024J58186L08477k0302
$$ y = [8683778, 8337331, 8296263, 7744270, 7814110, 7534963, 7550337, 7436702, 7669920, 7332149, 7200795, 7092398, 7224048, 6936847, 6997112, 6776933, 6474347, 6584364, 6418240, 6713064, 6398555, 5989460, 6188195, 6021301, 5909344, 5579166, 5841455, 6269775, 5668457, 5749347, 5672605, 5546279, 5646172, 5223019, 5304600, 5025572, 5178445, 5248377, 5362000, 5398628, 5046646, 4981268, 4862161, 4987210, 4878678, 4657001, 4481823, 4563495, 4676816, 4537211, 4418058, 4406389, 4586975, 4287132, 4668230, 4210627, 4319596, 4546269, 4229749, 3803876, 4065093, 4528262, 4018656, 3921934, 4039536, 4033170, 4085604, 3724499, 3887584, 3791978, 3771309, 3542001, 3456854, 3875296, 3360314, 3230980, 3498959, 3083935, 3242121, 3550598, 3530296]
16524C530296n12408J62813L00668l43237K54121l24596P6264k3948M3278Q1783
16514C245034K5964m01707K35213j22829r1270K13980n43182L18811k44127O0838
16504B696725K00372J20637l55187J45668K3611J13739l59k37145k1013k33484
16494B453564J01116L71627l13257j05041K16518J01080k36882k50006R3789j0664
16484B421844p9817K6218K78570j65337l24797j22433M60949k6062k57254K30556
16474B442437k33283R9590k91645m5862L41855k98796p1124J73715j76945L89033
16464B328975j62908j20779O5780k34885N609L28342k59152j3758O9018j05999
16454A900243J6469L2675p2259j1713j0985Q0971o9212K75828k71772q4343O8768
$$ y = [3530296, 3017888, 3180701, 3481369, 3138132, 3392253, 3067657, 3143921, 3119973, 3163251, 3245034, 3270998, 2869291, 3104504, 2981675, 2890405, 3104385, 2561203, 2880014, 2635887, 2696725, 2897097, 3017734, 2662547, 2808215, 2831826, 2945565, 2945206, 2708061, 2687048, 2453564, 2554680, 2926307, 2613050, 2508009, 2724527, 2825607, 2588725, 2338719, 2432508, 2421844, 2342027, 2368245, 2646815, 2481478, 2156681, 2034248, 2495197, 2469135, 2211881, 2442437, 2209154, 2308744, 2017099, 1971237, 2313092, 2014296, 1943172, 2116887, 1939942, 2328975, 2166067, 2045288, 2111068, 1876183, 1881792, 2210134, 1950982, 1937224, 2006242, 1900243, 1916712, 1949387, 1877128, 1865415, 1854430, 1935401, 1866189, 2142017, 1870245, 1785902, 1854670]
16443A854670J25254j07463k5936J81294l53649K50333M0230m89141M5774J05455
16433A626821k9590L47514n00361P8947j17483L29723k63559J01164R7051j25556
16423A544671j25485n7981P46516p01428K77652O7964R4072k73585j24118l6363
16413A411915L21279j83790k57418K99438n53766M80325m1907K73469l37918k37246
16403A174381M22219l40715L67681m9862j79253K38488k32860M9327K4894J97631
16393A671931k60561m3310n1494Q1682K44235k30711O1765k22509l4344r2588
16383A124096L03066j63911J97210m3699R0563l16599K64800J28345m50197J97673
16373A331347k53064J09640L11512l4086m20740K9238M15968o28080N68191j96003
$$ y = [1854670, 1979924, 1872461, 1846525, 2027819, 1674170, 1924503, 1964733, 1475592, 1521366, 1626821, 1597231, 1944745, 1444384, 1523331, 1405848, 1735571, 1472012, 1573176, 1670227, 1544671, 1419186, 1361205, 2107721, 1406293, 1683945, 1751909, 1845981, 1572396, 1448278, 1411915, 1733194, 1549404, 1291986, 1591424, 1037658, 1517983, 1476076, 1749545, 1411627, 1174381, 1596600, 1255885, 1623566, 1573704, 1394451, 1632939, 1400079, 1449406, 1474300, 1671931, 1411370, 1368060, 1316566, 1398248, 1642483, 1411772, 1473537, 1251028, 1216684, 1124096, 1427162, 1263251, 1460461, 1416762, 1507325, 1190726, 1455526, 1583871, 1133674, 1331347, 1078283, 1187923, 1499435, 1465349, 1044609, 1073847, 1489815, 861735, 1429926, 1233923]
16363A233923J87917l25638o082M4084K28136j85255J78836k16804M973l37203
16353H06887L12506q8456P7950L3722O4296o7642j76436K66384N3949p3550n06161
16342G03449N21364j40438j85860M8808J81781j70987k20480K22506k42511j8398
16332F99234L18482Q1590m55982L59308M0021L5928K9905r5743K46076k90541
16322I68278J37014j72633J79781p0645j65083p7168L16218k30767J21005l504
16312A002496J21011j89034J32361k05451J3415j13648K50928N3483k91629J27328
16302I01260l11573L10003p119K27837m68902J34941j9887J78911j52519q4856
16292G08096j15943K4228j0716K01420o7812J83677k81797L30507m4536k66548
$$ y = [1233923, 1421840, 1096202, 1090120, 1134204, 1362340, 1177085, 1355921, 1139117, 1144090, 806887, 1119393, 1030937, 1108887, 1142609, 1206905, 1139263, 962827, 1229211, 1283160, 1209610, 703449, 1224813, 1084375, 898515, 947323, 1129104, 958117, 737637, 960143, 717632, 699234, 1017716, 1099306, 643324, 1002632, 1042653, 1078581, 1108486, 1012743, 1258819, 968278, 1105292, 932659, 1112440, 1041795, 876712, 799544, 1115762, 884995, 1006000, 1002496, 1123507, 934473, 1066834, 861383, 874798, 761150, 1012078, 1065561, 773932, 901260, 589687, 899690, 892571, 1120408, 651506, 786447, 766560, 945471, 792952, 708096, 592153, 616381, 605665, 807085, 739273, 922950, 641153, 971660, 927124, 660576]
16282F60576k4810J99336l08875L91653j4674j9173j59738k8283k1087L9552m1305
16271F73172j68574L73670p7248k79955j43932N38283p4085D14262L36120m9862
16261G00520r2222L85996j49833p0037k0820j67129j53532L78527k08017R2479
16251F95932k22531J28975m510r487p8035K53674l6569m4580k19040K25890J47002
16240H36721r7785k04424P2341q0264J81743n9296j03090J5501j8719j16671B8451
16228D59896M5483J84668m5452l7105A18793M51496o5516l1221J33209r9690r1024
16217D16047K17599k80123Q7638R3404G2574J95824L92379n3949Q361r6824k6792
16206D91573L4270K28698o7984j75143B44623L20874K26786B33588Q8491O09375
$$ y = [660576, 635766, 835102, 526227, 917880, 903206, 884033, 724295, 696012, 674925, 714477, 673172, 504598, 878268, 801020, 521065, 377133, 915416, 841331, 414262, 750382, 700520, 608298, 994294, 844461, 774424, 753604, 586475, 432943, 811470, 603453, 695932, 473401, 602376, 597866, 588379, 510344, 764018, 727449, 682869, 463829, 689719, 836721, 738936, 534512, 606853, 526589, 708332, 649036, 545946, 561447, 542728, 426057, 28451, 459896, 505379, 690047, 644595, 607490, 118793, 570289, 504773, 473552, 606761, 507071, 416047, 633646, 353523, 441161, 534565, 72574, 268398, 660777, 606828, 615189, 518365, 491573, 525843, 754541, 686557, 511414, 244623, 565497, 792283, 233588, 322079, 931454]
16196I31454l74635B75622J08366Q2472J63320k20573m0987K03335j21636J13463
16186E63382k72643M15599C22220M3j02740L67922O2582j50950J18521n887M5611
16175F57322k19505J8450K02939k9170B87569K45358n4473n8055A53700N73974
16165G27674C23095M08496j73126j7665j4902H5124M82816k78097f7219C99634
16154C54720K16774k0323A40473K5616H0058J52353n5454K89523A97049L0345
16144B27394J48525n7643H7728L00690j9038C7739M52577A70953O5810L1993Q6731
16133C55487L1936j7117Q529d2890C34302m3518J53295b8035B90556q62j31488
16122A58206P1076m3676N0825n7570J92669q3002r0990R2655k4591O4544q8935
$$ y = [931454, 556819, 275622, 383988, 466460, 629780, 409207, 368220, 571555, 449919, 563382, 290739, 706338, 322220, 322263, 219523, 587445, 650027, 499077, 617598, 611711, 657322, 437817, 456267, 659206, 630036, 287569, 532927, 478454, 420399, 153700, 727674, 323095, 731591, 558465, 540800, 525898, 85124, 567940, 289843, -67219, 399634, 354720, 571494, 551171, 140473, 166089, 80058, 232411, 176957, 466480, 197049, 227394, 375919, 318276, 87728, 388418, 369380, 37739, 490316, 170953, 236763, 268756, 355487, 387423, 370306, 378835, -42890, 334302, 290784, 444079, -28035, 290556, 289694, 158206, 229282, 185606, 236431, 178861, 371530, 288528, 197538, 290193, 265602, 330146, 241211]
16111B41211H0055M29888j74742Q4595P1359B26569j10898J04734j05657J55584
16101B70332A6875M35416o2735J59633k64963R9135j70700J71250d3620C85674
16090C8154J52398C311d04B66803A15485m9583K53428k1785K41593k42205R7102
16079C94035J16959M4476k61259J0775J53271j19332n6512L8484A1668J91974
16069B03642n6719K13645Q9023A55187K71921j27501r8469L9384P0472C2895J50062
16058A82957a15015F22496B67129j01929h5222L7451C2218J68169N8962j4035
16048B45314b5402B43281m8612m5819A5381M61012B19288k8108J36202e4786G9819
16036d6367A92887O3336J87115j94527O8383J9753B245a1164j27971G1382J08667
$$ y = [241211, 80055, 509943, 335201, 419796, 491155, 226569, 115671, 220405, 114748, 270332, 16875, 452291, 389556, 549189, 284226, 383361, 212661, 383911, -43620, 385674, 38154, 190552, 3311, -404, 266803, 115485, 65902, 319330, 297545, 539138, 296933, 394035, 510994, 555470, 294211, 304986, 458257, 338925, 282413, 320897, 11668, 203642, 146923, 360568, 449591, 155187, 427108, 299607, 201138, 240522, 310994, 32895, 182957, -115015, 622496, 267129, 165200, -85222, -47771, 32218, 200387, 259349, 245314, -25402, 243281, 194669, 148850, 15381, 476393, 219288, 191180, 327382, -54786, 79819, -46367, 192887, 256223, 443338, 248811, 317194, 336947, 2245, -11164, -139135, 71382, 180049]
16025A80049J3319J5521L8083A6837J16248l3754g1416C65001A01806P3700H878
16013H786b9231A01517K01050A19342D0105P0680J03422c0699J1333A96229K63427
16002D59656j6688R049B15241m793m880E2564J56173B2629J00258J58676K78732
15991E60295A52032J81098J81977K60582J62174J94682l03873p4027r6994l12583
15981C45068K43909k28557j0458C7745g6863A68066A1293N8751Q3386K7975O9365
15970B50770a5098B0720K4104a39610B87581j15719O9941a38195O922A00051R4978
15959A95029G6792J08898b8772k6764a1196A14261h0356C47881n6880F1516f2538
15947D75692a71024b1156j14476A49298J21506d0831C38292A33833K06887a34577
$$ y = [180049, 193368, 208889, 246972, 16837, 133085, 99331, -71416, 365001, 101806, 175506, 8878, 8786, -29231, 101517, 302567, 119342, 40105, 110785, 214207, -30699, -19366, 196229, 459656, 442968, 452017, 215241, 210448, 205568, 52564, 208737, 22629, 122887, 281563, 560295, 152032, 333130, 515107, 775689, 937863, 1132545, 828672, 754645, 657651, 345068, 588977, 360420, 349962, 37745, -76863, 168066, 11293, 70044, 153430, 181405, 250770, -15098, 20720, 44824, -139610, 287581, 171862, 241803, -138195, -131273, 100051, 195029, 76792, 185690, -28772, -55536, -11196, 114261, -80356, 347881, 291001, 61516, -62538, 475692, -171024, -21156, -135632, 149298, 270804, -40831, 338292, 133833, 340720, -134577]
15936c4623G980P5006c3051m2978o7391J8316j02553b787m2797L814B6902L65820
15924C92722b6319A8109J52722b36393b0719B98713H9515b230A80367J34679a27998
15912D23213A4407R7370a2913B1603L8334M1676a45107J7941F0798J27842a16247
15900F2001j6702e3678j91565m0005A28417P7495a27403j0126F6861L0208c74848
15888A30707c200A15165a84104g403j39615m1762A16241i5463F9042J9450A389
15876G4024K36345a77904A1088N9174K87873J25280h9854o2200j33116I7750a07681
15864b2026D18491A03488a16609j18166B01624E191a42012N6793l0791m7615H9838
15852a59164C77966A82971a32787G9617a21241A26295B864d3127a2808N379k70919
$$ y = [-34623, 7980, 82986, -33051, -76029, -143420, -125104, -227657, -2787, -45584, -41770, 26902, 392722, -26319, 18109, 170831, -236393, -20719, 298713, 89515, -2230, 180367, 315046, -127998, 423213, 14407, 111777, -12913, 21603, 59937, 101613, -145107, -127166, 60798, 188640, -116247, 62001, 45299, -53678, -245243, -285248, 128417, 205912, -127403, -137529, 66861, 97069, -374848, 130707, -3200, 115165, -184104, -7403, -147018, -188780, 116241, -95463, 69042, 88492, 1389, 74024, 310369, -177904, 11088, 70262, 358135, 483415, -89854, -152054, -285170, 97750, -107681, -22026, 418491, 103488, -116609, -234775, 201624, 5191, -142012, -85219, -116010, -163625, 89838, -159164, 377966, 182971, -132787, 79617, -121241, 126295, 2864, -43127, -12808, -7429, -278348]
15841b78348g1032A64191j660R5552b1046A85669b44004C07364j00617o6916R8800
15830B38631L3674a35057I5798l6064K63358b63446o7573R5069B66440a23336
15819a91522c3785A8033b83975d2586P902I1980j5756c17238J40719P4121A50350
15807D3590d0879E3150M41540G88b00745b9496B2812a72645o810h4435A31327
15795F1811Q1334O13g2551C07560a43639e4357A49066m8898a07816a9012F5933
15783c2117A4238c00067a42001I9179k5407c4237B56604n7714a34587r121K6346
15772a17362A15917a09043A41025B5244a77778c3215C48952F1320J5743b9829
15761a74800A59705e9487j40354B67437n1389K9057m9323J84245A63302F5083
$$ y = [-278348, -71032, 164191, 162531, 258083, -21046, 185669, -244004, 307364, 206747, 139831, 238631, 272305, -135057, 95798, 59734, 323092, -263446, -331019, -235950, 266440, -123336, -191522, -33785, 18033, -283975, -42586, -34684, 91980, 76224, -317238, -176519, -102398, 150350, 43590, -40879, 53150, 494690, 788, -200745, -29496, 22812, -172645, -179455, -84435, 131327, 61811, 143145, 143758, -72551, 307560, -143639, -54357, 149066, 100168, -107816, -19012, 65933, -32117, 14238, -300067, -142001, 99179, 73772, -34237, 256604, 198890, -134587, -143708, -117362, 115917, -109043, 141025, 25244, -177778, -33215, 348952, 61320, 77063, -29829, -174800, 159705, -59487, -199841, 267437, 216048, 245105, 195782, 380027, 163302, 65083]
15750A87608A1620a2692k8705A76859j9474J73014g3842j07613N170B52756r9743
15739A53013D1902J92437E0402C490P0795R3121d4111B553a86152K0366F2093
15727I9789b20794e8473M788A33677L5347f348l1450G6893j5011J09080F9743
15715a09870r9365B17402B6884h5270p9177d193G4779b85417C1749a28724A09053
15703A07239m1379P253c47905q6038B90728a79553j68648F6134i5764D11672E466
15691F0434J9364o2J78172A14045n3460j7451a09760A07343b11761A39165h5364
15679A88866B6081a18785r6490n6792B2544m239a28428F7365J62877c21091G4489
15667b32362B63251H7579b04031A67278b30743D524a18509j21147l9153B19416
$$ y = [187608, 11620, -12692, -41397, 176859, 157385, 330399, -73842, -181455, -176285, 252756, 153013, 41902, 234339, 50402, 3490, 74285, 167406, -44111, 2553, -186152, -165786, 62093, 99789, -220794, -58473, -53685, 133677, 169024, -6348, -37798, 76893, 61882, 170962, 69743, -109870, -209235, 217402, 26884, -85270, -164447, -4193, 74779, -285417, 31749, -128724, 109053, 107239, 65860, 73113, -347905, -433943, 290728, -179553, -348201, 66134, -95764, 411672, 5466, 60434, 79798, 79736, 257908, 114045, 60585, 43134, -109760, 107343, -211761, 139165, -85364, 188866, 26081, -118785, -215275, -272067, 22544, 18305, -128428, 67365, 230242, -321091, 74489, -232362, 263251, 87579, -204031, 167278, -230743, 4524, -118509, -239656, -278809, 219416]
15656A82157e8340E0753K25766b78198g0229n4096c589l568l09121B6557J58165
15645A84722e8726C32955b97312A00023D1493e1917l7105E8026P6820h4470C04211
15633a28156I5532m3336g1771n4378A2197f4091A28247J03815D7908J07473b3143
15621h4779K8067k22905A72730m3500L5581g1261A00181b27156e4743B48727a48250
15609A91126a67683H4039l8877h065D8240J82978a08979A87378a08217C2805J6498
15598D9303f5023k90699A02161K10794j2725A11226b17722a2003B12895c28378
15587B98490j33727h6281A83369l723L0041j02722g9630B15321q340a01968A9434
15575e7716j79981R2867o5189E8747Q4005F1344a99002B04180b72143J6039a0383
$$ y = [182157, -58340, 50753, 276519, -278198, -70229, -124325, -3589, -7157, -316278, 26557, 184722, -58726, 332955, -297312, 100023, 41493, -51917, -89022, 58026, 134846, -84470, 304211, -128156, 95532, 52196, -71771, -126149, 12197, -64091, 128247, 232062, 47908, 155381, -23143, -84779, -56712, -279617, 172730, 129230, 164811, -71261, 100181, -227156, -54743, 248727, -148250, 191126, -167683, 84039, 45162, -8065, 48240, 231218, -108979, 187378, -108217, 32805, 49303, -65023, -355722, 102161, 312955, 300230, 111226, -217722, -12003, 212895, -328378, 298490, 164763, -86281, 183369, 179646, 209687, 106965, -79630, 215321, 206981, -101968, 19434, -57716, -237697, -144830, -210019, 58747, 142752, 61344, -199002, 204180, -272143, -256104, -10383]
15563G4109a4124j38698P2570k01004c3260j86816B80366a89645A5658G91d7853
15551B3232h0995J0655j04531I3288J46905o0913g4179B99117n9524b62722G1036
15539c77961a4870C4746J12018b7021A10036a05493A44584M3341q9798M3951n2155
15528H9923a3187j30787A14580O7496J28477K21414B48081j02163P9622A06442
15517a5826B4580J93065a04361G1543j0330a8113D47691k22211l1149G6211f4519
15505a65663d4141C983P8501b8784j04981b5524r1172A69648a95641i2607A21496
15493b08136I5072J55411J7717g5866B59008o7922J53171e606j85201B44717h9571
15481A87538o178J86837c2161B19248J03961L02571J77302l03203j39767A52878
$$ y = [74109, -14124, -152822, -80252, -281256, -33260, -220076, 280366, -189645, 15658, 791, -47853, 23232, -80995, -70340, -174871, 93288, 240193, 179280, -74179, 299117, 239593, -262722, 71036, -377961, -14870, 34746, 146764, -27021, 110036, -105493, 144584, 187925, 98127, 142078, 89923, -13187, -143974, 114580, 182076, 310553, 531967, 248081, 145918, 225540, 106442, -15826, 24580, 217645, -104361, 71543, 61213, -18113, 447691, 225480, 194331, 76211, -64519, -165663, -44141, 3983, 82484, -28784, -133765, -25524, -116696, 169648, -195641, -92607, 121496, -208136, 95072, 250483, 268200, -75866, 259008, 191086, 344257, -5606, -190807, 244717, -89571, 187538, 181360, 368197, -32161, 219248, 323209, 625780, 803082, 499879, 360112, 152878]
15470D00434A57730o3211b70848A70295a51584m8529B58819I8872A3844a81440
15459B04924a98329A14908g1425k6872J4094I0254J67087G9280a5898B45877f9924
15447B79766E7487L01195Q6676L05826L67540k36622k25128k78223H5632M01470
15437D87102F6431g1773B51973P7742B6886a03310B0565L19646q9248i066r5394
15426a04460N2107A51302l8163c50861A03723a71137O9655J3154R467J3247n92436
15415f58050h3521A78682b1079E1533M4851i7351B41183a49568r2871h2721j15808
15404a98529L9029G2227D640e5822A12263e24828O6813E6493a36170n1013B66319
15392A2539a83683B62150a13649B44797c15724J52079B08805i4122B58203b0429
$$ y = [400434, 157730, 94519, -270848, 170295, -151584, -200113, 258819, 98872, 13844, -181440, 204924, -198329, 114908, -71425, -98297, -84203, 90254, 257341, 79280, -15898, 245877, -69924, 279766, 57487, 358682, 445358, 751184, 1118724, 882102, 656974, 378751, 85632, 487102, 66431, -71773, 251973, 329715, 26886, -103310, 20565, 340211, 250963, -9066, -104460, -52353, 151302, 113139, -350861, 103723, -171137, -101482, -88328, -78861, -65614, -658050, -83521, 178682, -21079, 51533, 96384, -97351, 241183, -149568, -242439, -82721, -198529, -159500, 72227, 4640, -55822, 112263, -524828, -458015, 56493, -136170, -187183, 266319, 12539, -183683, 262150, -113649, 244797, -315724, -163645, 208805, -94122, 258203, -20429]
15381F6822Q6221m6780b55448f3157A56689a5882G4934J76665N0651J3086m9923
15370B65413E7594f7696C90258f8767A59568a57028f6647C17973A23123j5081
15360A08042B0513J6636A4405J12012L2671j236M8854K5400o2692O6038j08818
15349A26634K8866Q5758j16817R3916B2132K84550j36817C8015Q9878J46070j06153
15338A67810D214K72209e8823A51678m9791m4335J45601b68612A08708J14138
15328B22846r1925J99221j52656K18422j46699J34881A17415a82129B88300C637
15317b47440N8138a2469A52294O5751J46239J3916f8457A57707K85821A69724
15306C64924a58666g193B1384f2967n7153j23269d771m6946B5492J65051b2661
$$ y = [66822, 153043, 106263, -255448, -63157, 156689, -15882, 74934, 251599, 302250, 315336, 265413, 57594, -67696, 390258, -68767, 159568, -157028, -66647, 317973, 123123, 108042, 20513, 37149, 14405, 126417, 159088, 157852, 206706, 232106, 169414, 235452, 126634, 155500, 241258, 124441, 218357, 22132, 306682, 169865, 38015, 127893, 273963, 167810, 4214, 276423, -58823, 151678, 101887, 57552, 203153, -268612, 108708, 222846, 130921, 330142, 177486, 395908, 249209, 384090, 117415, -182129, 288300, 3637, -247440, -189302, -12469, 152294, 218045, 364284, 378200, -68457, 157707, 443528, 169724, 364924, -158666, -7193, 21384, -62967, -120120, -243389, -4771, -51717, 25492, 190543, -22661]
15294H7818h0108N940j61673e9444C01573E8130L49135B6222J49412b93296A4258
15282B20689q6851a09303l9477d4737H1102B5001K22826r407c75319a50528A03404
15270B98078d1033j33782A5120O6884a16751l6904k14612C44659e0024k08158
15260b58182B67383a54094A49239f3698A66806D6604a05272E596J87331i6723
15249a04749A44499O527e4365B29931j06254L95927O23819O14026k64454J96968
15239A689963R0128G63479A94767k2470R039L6236o813p5457E7239b18582f7678
15227B36855f4618A64934C2619K9025K08115j30514e9918H5845N820Q2319D1170
15215H1062O398B1860L30969G8646K15347G2610C4784A0947N5863p54a49861A90973
$$ y = [87818, -80108, -74168, -235841, -59444, 301573, 58130, 407265, 26222, 175634, -293296, 14258, 220689, 133838, -109303, -148780, -44737, 81102, 25001, 247827, 238420, -375319, -150528, 103404, 298078, -41033, -174815, 15120, 82004, -116751, -153655, -368267, 344659, -50024, -258182, 267383, -154094, 149239, -63698, 166806, 46604, -105272, 5596, 192927, -96723, -104749, 144499, 151026, -54365, 229931, 123677, 519604, 1143423, 1757449, 1492995, 1689963, 1780091, 763479, 194767, 172297, 181336, 217572, 210759, 135302, 57239, -218582, -67678, 236855, -64618, 164934, 32619, 61644, 269759, 139245, -59918, 85845, 91665, 173984, 41170, 81062, 87460, 21860, 352829, 78646, 293993, 72610, 34784, 10947, 66810, 66056, -149861, 190973]
15202h9674A50890K9574F8612A7441b64300E84787b32576D71494A47469K36316
15192C83785F7857b54095B48893C6697K06148R1485B4216J49060F5038a33797
15181E9188K62695C6300b46131F6466P7337a60310D69595C6310e26497E31543
15170A85907H9333f3429C85004j69434m5624b03047A61233a57518c3832D120K57005
15159B61125R9152b8963A82155g5180I4040J97434r3217g1582A25789J32653j27154
15148A31288d6527C53138A41921d1993C90534J9412I3006J44857a15596A30240
15137i8767B17229c16653A38548J16295l5069C1998L87831e6768C38507A5364
15126A36935J56046a5070A55552m7343J07742b08951A61599J0379K95677I4307
$$ y = [-89674, 150890, 180464, 68612, 17441, -264300, 584787, -232576, 471494, 147469, 383785, 67857, -254095, 248893, 36697, 242845, 334330, 24216, 173276, 65038, -133797, 59188, 321883, 36300, -246131, 66466, 143803, -160310, 469595, 36310, -526497, 531543, 185907, 89333, -63429, 385004, 215570, 169946, -203047, 161233, -157518, -33832, 4120, 261125, 360277, -28963, 182155, -75180, 94040, 291474, 198257, -71582, 125789, 258442, 131288, -46527, 353138, 141921, -41993, 390534, 409946, 93006, 237863, -115596, 130240, -98767, 217229, -316653, 138548, 254843, 219774, 31998, 419829, -56768, 338507, 15364, 136935, 292981, -15070, 155552, 108209, 215951, -208951, 161599, 171978, 467655, 94307]
15115A68493J24698a8964N990A63544K90844E9509M024c03829K5397J36284G1930
15103F0903k3674P5246C4030K29353H5347P2416J01329q4181p0389b778A80620
15091G1970K54553g8676a519B6486J28496a9060C49453j45065D7488O3780Q5081
15080A96349a29316k3615E5461a81620B60479F6234K42132a8374I2898b9395B85229
15068F3767J04685b3778B83081N4649A20774M90573i6594H6876J01830N1133j18299
15057A21540M03020q2078A47809f3643C00689j01742D2491a14236C61222A34033
15046D70479j04343j73260n8125P4907J06312j03948q6198K51703o4664O3506
15036C76369K8860A85647m0454J73870K99857L4921j14775J63052O295B68575
$$ y = [168493, 293191, -18964, -12974, 163544, 454388, 59509, 63533, -303829, -278432, -142148, 71930, 60903, 37229, 112475, 34030, 263383, 85347, 157763, 259092, 174911, 104522, -2778, 180620, 71970, 326523, -78676, -1519, 26486, 154982, -19060, 349453, 204388, 47488, 111268, 196349, -129316, -152931, 55461, -181620, 260479, 66234, 308366, -18374, 92898, -29395, 285229, 63767, 168452, -23778, 283081, 337730, 120774, 611347, -96594, 86876, 188706, 239839, 121540, 524560, 442482, 147809, -63643, 300689, 198947, 42491, -114236, 361222, 134033, 470479, 366136, 192876, 134751, 209658, 315970, 212022, 125824, 377527, 312863, 376369, 405229, 185647, 145193, 319063, 618920, 653841, 539066, 702118, 708413, 268575]
15025D65565o9774J086o7708j35621K32978o3150J60073j30354o1534J60033b9692
15013C66381j67024K19102j57871p5647N24652j83977M8711c2952C14503E5864
15002E51427k02460k4147J19991K71262k49703K64753j55578j68323J82851B91902
14991D71982B06515f5401B65088J11215o6621B6151O48930k43066j75314M05525
14981F62226j9987L16425C24859N45787l16826k11849J1585J76585B30002K85618
14971E15620J96847p4305n9700j5357j53297M0402k09847J1207L30648B80202
14960C18949M0064o8180A13741L40213j62554K91999B12192K209M61682l04804
14950C71279J22868A97016K20847O9823Q1845K90123j71571A41972J89421J11042
$$ y = [465565, 395791, 396877, 329169, 193548, 426526, 363376, 523449, 393095, 331561, 491594, -29692, 366381, 199357, 418459, 260588, 184941, 709593, 525616, 574327, -32952, 314503, 55864, 551427, 348967, 324820, 444811, 716073, 466370, 731123, 575545, 407222, 590073, 291902, 471982, 206515, -65401, 265088, 376303, 309682, 26151, 675081, 432015, 256701, 662226, 642239, 958664, 324859, 870646, 553820, 341971, 353556, 530141, 230002, 515620, 712467, 638162, 578462, 563105, 409808, 450210, 240363, 251570, 582218, 280202, 318949, 359013, 290833, 113741, 453954, 291400, 583399, 212192, 214401, 676083, 371279, 494147, 197016, 417863, 487686, 569531, 859654, 688083, 141972, 331393, 442435]
14940D42435j17402J10262r1160R5976K11311r2486J86184p1985J67709J38401
14930I79245j10952K3321r1565P89730k55056J23633o0398l3885k19127L39777
14920A484723N31360O8960M3730n8298o78669k95375L7282p7798j78144l95922
14910D81849k03450J26020A27961K93012A94652N20084a72668A53145L91089a10865
14899E27260A54668J17890j8808J32533K6418o3914L00209p2452j22384K14814
14889F68974B95125N4077J62947K47487j67702N34316l72311K12109D01700M44538
14879H46238l25922j15066J53953K94326B14607L1057N04000l38737M607K72474
14869F88008k81261L74903C73261L40887L4145j23742B49002K24087A83002L58837
$$ y = [442435, 325033, 435295, 344135, 440111, 651422, 558936, 745120, 673135, 840844, 979245, 868293, 891614, 800049, 1589779, 1334723, 1458356, 1397958, 1364073, 1144946, 1484723, 2016083, 2085043, 2128773, 2070475, 1391806, 1096431, 1133713, 1055915, 877771, 481849, 278399, 404419, 127961, 420973, 194652, 714736, -172668, 153145, 544234, -110865, 527260, 154668, 272558, 253750, 386283, 412701, 348787, 648996, 576544, 454160, 668974, 295125, 349202, 512149, 759636, 591934, 1126250, 753939, 966048, 401700, 846238, 520316, 405250, 559203, 853529, 214607, 245664, 749664, 410927, 415534, 688008, 406747, 781650, 373261, 714148, 748293, 624551, 249002, 473089, 183002, 541839]
14859E41839k09882J94283c4616C26227K87871A56589M7335J02521o1721J42895
14849C87619K49895k30130K36138J15272n6720M8825K99187j26430K16920j88170
14839I52406k00451L06914k12107K4453k13283L10968l30675p984j08662l4676
14829D86903J25451k50913R8710m4135J30628Q167j25280L99526k5818k50787
14819E52452j04550K54516m6067p2419k85195K43846j56419A52911L58793K41958
14809G53662C44218K66864N3725K65847J64883l39779K33827C07303K42482M2626
14799E92411J38677C16542N83648l18110N2351K9569A75750N34955q7926m9943
14789E72836Q6161M5240Q1413k00449j31835J83530K9988O7025r8004Q3262K28211
$$ y = [541839, 331957, 526240, -34616, 326227, 614098, 156589, 203924, 306445, 244724, 387619, 637514, 407384, 643522, 758794, 702074, 750899, 1050086, 923656, 1140576, 952406, 751955, 1058869, 846762, 871215, 657932, 968900, 638225, 630241, 521579, 486903, 612354, 361441, 460151, 416016, 546644, 554811, 429531, 829057, 803239, 552452, 447902, 702418, 656351, 583932, 298737, 542583, 386164, 152911, 511704, 753662, 344218, 611082, 664807, 930654, 1095537, 755758, 989585, 307303, 549785, 592411, 731088, 316542, 900190, 582080, 634431, 664000, 175750, 710705, 622779, 572836, 658997, 704237, 785650, 585201, 453366, 636896, 666884, 733909, 635905, 719167, 947378]
14778I47378C26185M51850k71229L462M47676l82316j18627K75377j85342j77454
14768C69582J2280K75116n4499B22814L30864J04837B38690M93838k05763l8711
14758D88054n8751J61962K25098k68238j30464K56453l0917k03045N6198K83400
14748G79750k68952J92755N6799m7334o0272K4396n9480J30259p9884Q2645j74475
14737E76207j9700l3383K75720k35347N56649l5792m31972M57683K56812j11301
14727A255576L13364p8043j50396j6961k57964j11435K24163m10752O3632j32456
14717F98728L17392m8202k79871L72988j97545p2115J11930L7432J7629k17875
14707G40491J46343k59454L65977Q752N24110j40884L87951k04919n49512L89799
$$ y = [947378, 326185, 778035, 506806, 510268, 957944, 575628, 457001, 732378, 547036, 369582, 381862, 656978, 602479, 222814, 553678, 658515, 238690, 732528, 526765, 488054, 429303, 591265, 816363, 548125, 417661, 674114, 643197, 440152, 496350, 779750, 510798, 703553, 760352, 713018, 652746, 677142, 617662, 747921, 668037, 750682, 576207, 556507, 523124, 798844, 563497, 1120146, 1084354, 652382, 1110065, 1366877, 1255576, 1568940, 1490897, 1340501, 1323540, 1065576, 954141, 1178304, 767552, 831184, 698728, 1016120, 967918, 688047, 1061035, 863490, 791375, 903305, 940737, 958366, 740491, 886834, 627380, 993357, 1002109, 1526219, 1385335, 1773286, 1568367, 1018855, 1408654]
14697A408654j12014k68182K976K0441j19782p1696J8039J82998j21521r6080
14687H43833j36950K16570K7914N1423j41006j41476j01910M43617k24972J64249
14677A001292j08110m1313p8808J5808p0288L27707l48251M18241k26902K70296
14667A159672j13546j0748l71705M07667D97021M84023k60902L07825l02356N01971
14657A227582j78073j32566J13092P1557N2325L19106n25269l7420J61921J2573
14647A084828r6905L024j39340p6435L41952k45391L70537K7185k48552j85529
14637H35374L96451L7841l13774P3231K62044p4962j61662n7157K72819J07213
14627A377418m22897R6561K61428l23773M63854O720J8849j45089L4576j4980
$$ y = [1408654, 1296640, 1028458, 1031434, 1051875, 932093, 860397, 878436, 1061434, 939913, 843833, 706883, 923453, 951367, 1002790, 861784, 720308, 618398, 1062015, 837043, 1001292, 893182, 851869, 773061, 788869, 718581, 1046288, 698037, 1116278, 889376, 1159672, 1046126, 1035378, 663673, 1071340, 497021, 981044, 720142, 1027967, 725611, 1227582, 1049509, 916943, 1030035, 1101592, 1153917, 1473023, 947754, 910334, 1072255, 1084828, 987923, 990947, 851607, 775172, 1117124, 871733, 1242270, 1269455, 1020903, 835374, 1231825, 1269666, 955892, 1029123, 1291167, 1216205, 1054543, 997386, 1270205, 1377418, 954521, 1051082, 1312510, 988737, 1452591, 1459311, 1478160, 1333071, 1367647, 1352667]
14617A352667j70231M31l5170K76793l46337J12172N5618M4474K90015k99896
14607A280536K45408q0435l23251O45494n26386N65326k51416j74697Q5069p525
14597A458123M8294j09031m3838R624P7300J06190Q598J37095L27161n77080j17722
14586A324714K96044L57111k43276J9804R0514k05518L92307k5603j79297j78664
14576A648136K58623J32202m73499L29537k28161K46407J50597j35218L87074
14567B315698o33353N78980p8938N57168l54872j38592o0622K66036M38018k27940
14557B661583K9554j22729M97054O7229J3985L34795R98081J256501K119720L994786
14547A1850559Q406880J6889966J844118A7062876G865955l225191j463909k70082
$$ y = [1352667, 1182436, 1182867, 1147697, 1424490, 1078153, 1190325, 1245943, 1290417, 1580432, 1280536, 1525944, 1445509, 1122258, 1767752, 1241366, 1806692, 1555276, 1380579, 1465648, 1458123, 1506417, 1397386, 1353548, 1363172, 1440472, 1546662, 1555260, 1692355, 2019516, 1442436, 1324714, 1620758, 1977869, 1734593, 1754397, 1844911, 1639393, 2031700, 2006097, 1826800, 1648136, 1906759, 2038961, 1565462, 1894999, 1666838, 1913245, 2063842, 1928624, 2315698, 1682345, 2261325, 2182387, 2739555, 2384683, 2246091, 2185469, 2451505, 2889523, 2661583, 2691137, 2568408, 3065462, 3132691, 3146676, 3481471, 4479552, 5736053, 7855773, 11850559, 20257439, 37147405, 38991523, 17062876, 7865955, 4640764, 3176855, 2906773]
14539B906773N48206J930582k050625o92969r03925J47788J43687j59071R0471
14530A960917J88301k35366L51444j93310J10982n61253K25818J49115J26549
14521B123197p0437J23918P4077K5746j45911K34452l20068K81196K53494p3903
14511B505761O8359J0402K39785k28601k4181L10962o2990L3511O0186k40778
14501B672416L70445m02396p3651J72956K53022J17718r3211p3240K22374k0172
14491C146261O268K57276n43843J29368J52914q745R8201N8933J69727r1069l5581
14480C339710L64787l23560N7312J62273k1339J11027K16203P5435r6986l35032
14470C549830N28307O7464j00957L09715m04114M28422k79500K75962r0788k21886
$$ y = [2906773, 3454979, 5385561, 3334936, 2641967, 1738042, 1885830, 2029517, 1870446, 1960917, 2149218, 1913852, 2265296, 2071986, 2182968, 1621715, 1847533, 1996648, 2123197, 2052760, 2176678, 2250755, 2276501, 2130590, 2365042, 2044974, 2326170, 2579664, 2505761, 2574120, 2584522, 2824307, 2595706, 2571525, 2882487, 2819497, 2853008, 2913194, 2672416, 3042861, 2640465, 2566814, 2739770, 2992792, 3110510, 3017299, 2944059, 3166433, 3146261, 3152529, 3409805, 2865962, 2995330, 3148244, 3139499, 3237700, 3296633, 3466360, 3375291, 3339710, 3704497, 3380937, 3438249, 3600522, 3579183, 3690210, 3906413, 3981848, 3884862, 3549830, 4078137, 4145601, 4044644, 4354359, 3950245, 4378667, 4099167, 4375129, 4284341, 4062455]
14460D062455M75214J78942J00897k91427r4945J81115n1575m247L01062k86071
14450D571420M08061j97162M93223R8344m19597J80932J88392p3647J03305j21813
14440E231458K71104N5892J45391J63736R5197k77841K44200O4898L20011M638
14430F318684L5761J44816j76678K49666R6954K83825M4922K92104P8445K22925
14420G591424k59616q0834L35819o490K91505L7272j62529K92806k42342M65182
14410H262197j6143M35093P6566M08213L52832k33595O8172J89443M62020n18325
14400I486473L06441q9775L62172P0279J57673L7806K03117M19763j00068L53716
14390A1207597N95653m41418L83920M75241K69691K67202r6058L55941M81482
$$ y = [4062455, 4537669, 4716611, 4817508, 4526081, 4431136, 4612251, 4560676, 4556429, 4857491, 4571420, 4979481, 4782319, 5275542, 5373886, 4954289, 5135221, 5323613, 5249966, 5353271, 5231458, 5502562, 5558454, 5703845, 5867581, 5962778, 5684937, 5929137, 5994035, 6314046, 6318684, 6354445, 6499261, 6322583, 6572249, 6669203, 6953028, 6997950, 7290054, 7368499, 7591424, 7331808, 7250974, 7586793, 7580303, 7871808, 7909080, 7746551, 8039357, 7797015, 8262197, 8246054, 8681147, 8757713, 9165926, 9518758, 9285163, 9353335, 9542778, 10004798, 9486473, 9792914, 9703139, 10065311, 10135590, 10293263, 10331069, 10534186, 10953949, 10853881, 11207597, 11803250, 11361832, 11745752, 12220993, 12490684, 12757886, 12661828, 13017769, 13499251]
14381A3499251K09224m78780R68034l37361M16549K96345J25794M28649J25984
14372A5253689M60406N01421K47421K70854M78829K09968N63993J48891L23862
14363A8459334N50733K31412O21509L61395K63635O11968M55229M41912M15473
14354B2412600R40121K21231M41880O58084N86562O04260O88893R50568N75016
14345B8079215J047402J12614J086709O29042J325293L92053J276395P79046J139635
14336C5867404J155513J035536Q53965J346860R29971J301947J604246J268391
14328D5363833J317354J798049J426852J754100J488330K098303J786728J857892
14320E8891441K018559K073244K332796K515308K496765K684849K998851L123082
$$ y = [13499251, 13708475, 13229695, 14197729, 13860368, 14276917, 14573262, 14699056, 15127705, 15253689, 15714095, 16215516, 16462937, 16733791, 17212620, 17422588, 17986581, 18135472, 18459334, 19010067, 19241479, 19862988, 20224383, 20488018, 21099986, 21555215, 21997127, 22412600, 23352721, 23573952, 24015832, 24673916, 25260478, 25864738, 26553631, 27504199, 28079215, 29126617, 29239231, 30325940, 30954982, 32280275, 32672328, 33948723, 34727769, 35867404, 37022917, 38058453, 38912418, 40259278, 41189249, 42491196, 44095442, 45363833, 46681187, 48479236, 49906088, 51660188, 53148518, 55246821, 57033549, 58891441, 60910000, 62983244, 65316040, 67831348, 70328113, 73012962, 76011813, 79134895]
14312G9134895K956550L080586L980946L613001M082525L932920M503972M808750
14304A10094145M795180N389685N644307N744656O251508P099572O887515P743990
14296A59650558P852278Q457342R189825R419214R926251J0658571J0890886J1875004
14288B37919929J2140011J2917964J3050020J4149085J4178318J4240157J4637008
14281C33232492J5279659J4613048J4526383J4213817J3478607J2333384J0751280
14274D28428670P541494K524204J344971J581061K009087J568127n611767l536550
14266D35849297n128611p718525r811716j1163748j2512548j3915607j4679505
14259C60919037j5358957j5583312j5214234j5246595j4655619j4039915j3888694
$$ y = [79134895, 82091445, 85172031, 89152977, 92765978, 96848503, 100781423, 105285395, 110094145, 114889325, 120279010, 125923317, 131667973, 137919481, 145019053, 151906568, 159650558, 167502836, 175960178, 185150003, 194569217, 204495468, 215154039, 226044925, 237919929, 250059940, 262977904, 276027924, 290177009, 304355327, 318595484, 333232492, 348512151, 363125199, 377651582, 391865399, 405344006, 417677390, 428428670, 435970164, 438494368, 439839339, 441420400, 443429487, 444997614, 439385847, 435849297, 430720686, 423002161, 413190445, 402026697, 389514149, 375598542, 360919037, 345560080, 329976768, 314762534, 299515939, 284860320, 270820405, 256931711]
14252B56931711j2833155j2687430j1980378j0603983r105187r868268r772069
14245A80081241q921423p851248p970348p641977o849457o419528o238629n470087
14237A22718544n447116n032679m924268m510715m727632l584439l244353l912691
14229H7334651l765987l321629k928800l431752k452003k683563k556406k254206
14221F3940305k003413k162969k127933j734090k298872j497327j514479j784252
14213D8816970q48749j690205j552153j656634j310746p89415r04040j390742
14205C8674286j210349r40652q44136j149921j003634m99429j089393j045783
14197C0890989o17059q78404q50911m45043p97310p10727n53072l97476p19426
$$ y = [256931711, 244098556, 231411126, 219430748, 208826765, 199721578, 189853310, 180081241, 171159818, 163308570, 155338222, 147696245, 140846788, 134427260, 128188631, 122718544, 117271428, 112238749, 107314481, 102803766, 98076134, 94491695, 91247342, 87334651, 83568664, 80247035, 77318235, 73886483, 71434480, 68750917, 66194511, 63940305, 61936892, 59773923, 57645990, 55911900, 53613028, 52115701, 50601222, 48816970, 47968221, 46278016, 44725863, 43069229, 41758483, 40969068, 40065028, 38674286, 37463937, 36523285, 35679149, 34529228, 33525594, 33026165, 31936772, 30890989, 30273930, 29395526, 28544615, 28099572, 27302262, 26591535, 26038463, 25640987, 24921561]
14188B4921561n12039o10756m79787n81180n42328m63079k46814p01255l94306
14179B0390017p04543O0276o60403r1305p48196j87319j75728o04429j42200l16724
14169A6819446o60237j40539l32030l34517j5504m31194j29233n93123k71114
14160A3911955j84796k17979k49335k20635Q2084m18562J2997n13192r9978k65185
14150A1837374l13279q9040k23630O9424k92940j17940m37237J2467k63891o8362
14140A0112946p452k79934k72634J1960k63699J6295l2712M4261n46999P6331
14130H858363k44726J2338m29503n2826j75676L31665j38951n33437k13396J58983
14120G572834J26977l56020K41870l10295Q4951m24280K32002o88734K56051j59821
$$ y = [24921561, 24409522, 23798766, 23318979, 22737799, 22195471, 21732392, 21485578, 20784323, 20390017, 19685474, 19745750, 19085347, 18994042, 18245846, 18058527, 17882799, 17278370, 17136170, 16819446, 16159209, 16018670, 15686640, 15352123, 15336619, 14905425, 14776192, 14183069, 13911955, 13727159, 13509180, 13259845, 13039210, 13121294, 12702732, 12715729, 12202537, 12102559, 11837374, 11524095, 11435055, 11211425, 11280849, 10987909, 10869969, 10432732, 10445199, 10181308, 10112946, 10105494, 9825560, 9552926, 9564886, 9301187, 9317482, 9284770, 9329031, 8782032, 8858363, 8613637, 8625975, 8196472, 8143646, 7967970, 8299635, 8160684, 7627247, 7413851, 7572834, 7699811, 7343791, 7585661, 7275366, 7360317, 6936037, 7168039, 6479305, 6735356, 6575535]
14110F575535j8860O6789l54178J85557k52147K9567j98311j55356K45434n89713
14100E534317K11413L3710K49855m46237O8509m0051p2536j93549M06880n19633
14090E232678J10145j13707j7446n47836M15266P6592k20846p2468l66646L30654
14080D826386j47833k88752K52800l60959K64872Q8357k91614j81643K13466j49964
14070D225116L02653j32250k58101j6671j56789K51889k15349K99205m73804J93922
14060D019821j06121k00637n3328q5409L32045k5321j5633l04140n4471M6640
14050C553446n4403K28884m40001J53180k05851J55687j08288j92961K8119L77361
14040C495173j14701l86522K39080l05547J49465m6636j38365L34184k9007m71964
$$ y = [6575535, 6556675, 6623464, 6269286, 6454843, 6202696, 6232263, 6033952, 5878596, 6124030, 5534317, 5745730, 5779440, 6029295, 5583058, 5651567, 5611516, 5538980, 5345431, 5752311, 5232678, 5342823, 5229116, 5211670, 4663834, 5079100, 5155692, 4934846, 4862378, 4495732, 4826386, 4678553, 4389801, 4642601, 4281642, 4546514, 4634871, 4343257, 4161614, 4375080, 4225116, 4527769, 4395519, 4137418, 4120747, 3963958, 4215847, 4000498, 4299703, 3825899, 4019821, 3913700, 3713063, 3659735, 3574326, 3906371, 3881050, 3865417, 3561277, 3506806, 3553446, 3499043, 3727927, 3287926, 3441106, 3235255, 3390942, 3282654, 3089693, 3117812, 3495173, 3380472, 2993950, 3233030, 2927483, 3076948, 3030312, 2891947, 3226131, 3197124, 2725160]
14030B725160K31498k03453L02691j66691j6470J03025l64229l01196J69673O0247
14020B540255K68738M9162m23884P3737K3737J15682j27074m66221L96693K19208
14010B670033j6732m51365L27465j73561P1485l78916L19451r4536k94365M87527
14000B466486l28228J12377r8881j25318J02424j45266J40452j48948J72986J56202
13990B304286N58989J306834K569248N891819J4841989J6553710j8367608j1453708
13982A4205559n695287k429228j217075o68210q46227l23910O827J77605m42155
13973B767899n6968r3313k50122J1202j93716J52788K33259l90335K27031n1299
13963B356426l593l08739J84050O3050j96708j68159L03033k33270j34958m0043
$$ y = [2725160, 2956658, 2753205, 3055896, 2889205, 2872735, 2975760, 2611531, 2310335, 2480008, 2540255, 2808993, 2858155, 2434271, 2508008, 2531745, 2647427, 2520353, 2054132, 2450825, 2670033, 2653301, 2201936, 2529401, 2355840, 2427325, 2048409, 2367860, 2273324, 1978959, 2466486, 2138258, 2250635, 2151754, 2026436, 2128860, 1983594, 2124046, 1975098, 2148084, 2304286, 2863275, 4170109, 6739357, 12631176, 27473165, 44026875, 25659267, 14205559, 8510272, 6081044, 4863969, 4195759, 3349532, 3025622, 3032449, 3210054, 2767899, 2710931, 2617618, 2367496, 2378698, 2184982, 2337770, 2571029, 2180694, 2407725, 2356426, 2352833, 2044094, 2228144, 2291194, 2094486, 1926327, 2229360, 1996090, 1861132, 1821089]
13953A821089J07979n0884J02463r8241r4205j40865P7122k47658K61773l789
13943A734784J62843J58930l25534L131o8557r0220K67620r0085J82865j44456
13933A791321m31094O17950m52587K32826r4539J8637K0509l03349J72650L0706
13923A603030P0039l03982K76658l48102K32749j09847k22902N01432l34544J31217
13913A495748J06186n1133L7441K09820m43396J07583j9795n6165j55376J35803
13903A366716N21153l02217k36341Q6806j53911j33024J39952Q3758k68052J31246
13893A236086k59311K52327R30j47953O59447l41714j55907j31755K22314o6395
13883A268069l665r5715j06996m57139N75897J71762k37491N9987l17531K46746
$$ y = [1821089, 1929068, 1878184, 1980647, 1882406, 1788201, 1647336, 1724458, 1476800, 1738573, 1734784, 1897627, 2056557, 1731023, 1734154, 1665597, 1575377, 1842997, 1752912, 1935777, 1791321, 1360227, 1978177, 1525590, 1758416, 1663877, 1682514, 1703023, 1399674, 1572324, 1603030, 1673069, 1369087, 1645745, 1297643, 1530392, 1420545, 1197643, 1699075, 1364531, 1495748, 1601934, 1550801, 1588242, 1798062, 1354666, 1462249, 1442454, 1386289, 1230913, 1366716, 1887869, 1585652, 1349311, 1436117, 1282206, 1149182, 1289134, 1372892, 1104840, 1236086, 976775, 1229102, 1230032, 1082079, 1741526, 1399812, 1243905, 1112150, 1334464, 1268069, 1264404, 1168689, 1061693, 604554, 1180451, 1352213, 1114722, 1174709, 857178, 1103924]
13873A103924M34394p7929o12890J76127M8090k80371J87631j27335K5787K81377
13863A158805J29228j83457J1770j38882k39268L24027k82155J9707J99499o6274
13853I33000J61895j46129j72402M00818l06648J33615o4369p5173N8301J69095
13843A092003j77743J71895n8984k04183P5351J93879l73603J87882l6568m9263
13833H20666J26142R746K5720j34754K93380l63807K25153l11308K78464l9009
13823I30393j0541k21264L1809J06561L038B93583M69517P2292j48505J71084
13813H57971o3102j65908L02171r7557J8807n0993q176J72883k16178K77752j09973
13802I17697j33865J6306l0697J72084j99090J6492k9173k33705J82180J08859
$$ y = [1103924, 1538318, 1460389, 847499, 1023626, 1071716, 791345, 978976, 851641, 877428, 1158805, 1288033, 1104576, 1116346, 977464, 738196, 1062223, 780068, 799775, 999274, 933000, 1094895, 948766, 776364, 1177182, 870534, 1004149, 939780, 864607, 922908, 1092003, 914260, 1086155, 1027171, 822988, 898339, 1092218, 718615, 906497, 869929, 820666, 946808, 956554, 982274, 847520, 1140900, 777093, 1002246, 690938, 969402, 930393, 919852, 698588, 730397, 836958, 839996, 293583, 763100, 835392, 686887, 857971, 794869, 628961, 931132, 833575, 852382, 801389, 793213, 966096, 749918, 1027670, 917697, 783832, 800138, 769441, 941525, 742435, 758927, 729754, 496049, 678229, 787088]
13792G87088O7290j30245K27981m06684M67538n05943K58989L07801n07929J41962
13782G07848r3784J93593n8627K45228l40216K13652j99456K03456j82295j28707
13772E60692R4064j1168J46434j04375J5207L0309p2033K38480j72310p6207m8758
13761F00335q4697M5262j37149L39283O8398Q6946l0356m9635l06594J1275N9243
13750F02311K65684k48385J27424j49748J92883k33356J30070o3252R2555l21911
13740C94275J96015K28929B65326m0246O39997j41549A93252M72939k91835M06860
13730G81216j25612k2514M028J92823N8664l99134O3915J29711j54348L28703
13720H57452l42214K45753k26197o8212J12600q1883J21753L9789q0714j95968
$$ y = [787088, 854378, 724133, 952114, 545430, 1012968, 507025, 766014, 1073815, 565886, 707848, 614064, 807657, 749030, 994258, 654042, 867694, 668238, 871694, 689399, 560692, 654756, 643588, 790022, 685647, 700854, 731163, 659130, 897610, 725300, 649093, 600335, 515638, 560900, 423751, 763034, 831432, 918378, 888022, 838387, 531793, 543068, 602311, 867995, 619610, 747034, 597286, 790169, 556813, 686883, 623631, 716186, 394275, 590290, 819219, 265326, 225080, 865077, 723528, 193252, 666191, 374356, 781216, 655604, 633090, 637118, 829941, 888605, 489471, 553386, 683097, 528749, 857452, 515238, 760991, 534794, 466582, 579182, 497299, 619052, 658841, 578127, 382159]
13710C82159O3258n4277K61901M5806p9731J17l1996n3913j44300O4169n4986
13699C98207L21805q2365m5423p8680K9753k14919L34106l27086M60846K0491
13689H16735m00719j65999p6994N76618k28760n6354B31395j6673K94106k5729
13679D83099l1673q9266J05084J18056j23248j4304q2241K16320j20303K6511
13669D88035L19814G5996L86400j16542j70506J75226M6950J13491N4438L01392
13659H66845k22976o2587o288j91644G2909L19661r2081R8096Q7887j20682L45702
13648G11492l55004A1324J87229K2389K84312M6718J21621A27058K30724J28693
13638D86475k3522q9671J24135j34112p9476K65828j40502K61566B72081J29074
$$ y = [382159, 445417, 391140, 653041, 698847, 619116, 619233, 587237, 533324, 389024, 453193, 398207, 720012, 637647, 592224, 513544, 543297, 328378, 662484, 335398, 796244, 816735, 416016, 250017, 173023, 749641, 520881, 464527, 231395, 214722, 508828, 483099, 451426, 362160, 467244, 585300, 462052, 447748, 365507, 581827, 461524, 488035, 807849, 75996, 462396, 345854, 175348, 350574, 397524, 511015, 565453, 866845, 643869, 581282, 574994, 383350, 72909, 392570, 300489, 398585, 486472, 365790, 711492, 356488, 11324, 198553, 220942, 505254, 551972, 673593, 127058, 357782, 486475, 462953, 373282, 497417, 363305, 283829, 549657, 409155, 670721, 272081, 401155]
13628D01155j19888M98260l19006l8826m9913P1748J47800j92845K7216n0228
13618C75473j27143J41046A90079J09389K7993j33657K07314j06675J59909k03369
13608B50983J10902J81573o5284j27001A37809P3537K96448J3612j85643J36982
13598D72745K60666B18559J15648P6067J29215j78682N4561j55693K78964B01480
13587E4826J36941J16881K34899k22914E4036M41093k42932J54825J59049C3421
13576C63876q3389j18249K97280k13443K4821Q2257L9705j63754L88032k79077
13566C38059A33890K04553M4992A42041K28129A29309K36743M9496K53113A82483
13555D51834A66377J19959p4351J05577q2220k943n4476K3446J66206R5440A80967
$$ y = [401155, 281267, 779527, 460521, 421695, 371782, 443530, 591330, 398485, 425701, 375473, 248330, 389376, 190079, 299468, 327461, 193804, 401118, 294443, 454352, 250983, 361885, 543458, 478174, 351173, 137809, 211346, 507794, 521406, 335763, 472745, 733411, 218559, 334207, 410274, 539489, 360807, 415368, 259675, 538639, 201480, 54826, 191767, 308648, 543547, 320633, 54036, 495129, 252197, 407022, 566071, 33421, 363876, 280487, 162238, 459518, 246075, 270896, 353153, 392858, 229104, 617136, 338059, 133890, 338443, 383435, 142041, 370170, 129309, 366052, 415548, 668661, 182483, 451834, 166377, 286336, 211985, 317562, 235342, 232399, 177923, 201369, 367575, 463015, 180967]
13543C41195N9166o1715l3349a30832D739d8127B80962I8151K22634j24209J0641
13532B07217M4124J5204J03792p9938a092D59429D1304K06034j17902L81668A67203
13520D20654J39325G7100M11942J221D624K77570K4140N1886J34414k34851P4430
13509C32213k9772L458m6475J25993F8215d0413D62914O86j7380A74826K4451
13498A99277L09634r6898A73915m69k9915m4045M5363M42213A45236L4536J83385
13487C63157H6739J61888J28770A31818m4035B6608L0713b38250B28757L1476
13477B60233J6333K30820J46364B55587J21720H0457J52053L26325B31334a5296
13466D7354J11896J61179B3865M14768A41360J37570j32910J65633j40144O4975
$$ y = [341195, 400361, 338646, 305297, -130832, 4739, -48127, 280962, 98151, 320785, 196576, 207217, 251341, 266545, 370337, 290399, -1092, 459429, 41304, 247338, 129436, 511104, 167203, 420654, 559979, 77100, 489042, 490263, 4624, 282194, 306334, 358220, 492634, 257783, 332213, 302441, 305899, 259424, 385417, 68215, -40413, 462914, 463600, 446220, 174826, 199277, 508911, 412013, 173915, 173446, 143531, 99486, 144849, 587062, 145236, 179772, 363157, 86739, 248627, 377397, 131818, 87783, 26608, 57321, -238250, 228757, 260233, 276566, 507386, 653750, 255587, 377307, 80457, 232510, 558835, 231334, -15296, 47354, 159250, 320429, 23865, 438633, 141360, 278930, 146020, 311653, 171509, 236484]
13456B36484A05752r281K47510a67340B8496N15172k30495p4461J05355A39172
13445a9625B39470H5348q984L87251K5186f9829j4036C74200f069B86129R5833
13434C81962j20197n4355F4520K26579o7088D7353J20995J87990O5067E1631J30373
13423A82004J71615B4705L87809a7495A78395p5628f1623B17130j0771Q1939L8274
13412C26572l6778m3164A8679K53455r7927f5436a8793B20211a0691B64005j25550
13401A38455B1699J82585b8572A60291J16818A4990R1400O11613F8205b030A36866
13389B48582A00291l6792L1322d9173a0874B01030m9608a07314C84919a3357F23729
13377G2256b29518B82790K07289a33080C93203a5209A75824B7490M08370i286
$$ y = [236484, 105752, 96471, 343981, -167340, 28496, 543668, 313173, 238712, 344067, 139172, -19625, 239470, 85348, 76364, 463615, 488801, -69829, -83865, 374200, -6069, 286129, 381962, 261765, 207410, 64520, 291099, 224011, 47353, 168348, 356338, 421405, 51631, 182004, 353619, 24705, 412514, -17495, 178395, 102767, -61623, 217130, 206359, 288298, 326572, 289794, 246630, 18679, 272134, 174207, -65436, -18793, 220211, -10691, 264005, 138455, 21699, 204284, -28572, 160291, 277109, 14990, 106390, 718003, 68205, -2030, 136866, 248582, 100291, 63499, 94821, -49173, -10874, 201030, 151422, -107314, 384919, -13357, 623729, 72256, -229518, 282790, 490079, -133080, 393203, -15209, 175824, 27490, 435860, -9286]
13366A63673J419j7408D3049K80214q1283l5065F0300a22051D16719a4574A55163
13354B11042L1647j19926R0777a39419A55790N2576K12605B01770K30482K9759
13344D62011r376D6070J64488n6919J29225m293r3349G494j096L77635M2165A58775
13331B89657J2159a7192D71048j59377J65958k13986K1618M2213j60803O6724
13321B33395J1019o6578K75152p2026j78444k2203J10224M3641n6656R0258i8956
13309H4135K92696q0394R0023B0713J53928Q2960O0331A09355J2843O8153J08548
13298B98899j42406Q0866C0763a53058B33200g9038G1022K26697F1613e750B69190
13286h1076B44483D8670L1975J34684a8326D35205d1451O427E3236N97585i969
$$ y = [163673, 165092, 147684, 43049, 323263, 241980, 206915, 60300, -122051, 416719, -14574, 155163, 211042, 242689, 122763, 213540, -139419, 155790, 208366, 420971, 201770, 432252, 462011, 452635, 46070, 210558, 153639, 282864, 278571, 185222, 7494, 6398, 384033, 426198, 158775, 289657, 301816, -17192, 471048, 311671, 477629, 263643, 285261, 327474, 166671, 233395, 244414, 177836, 452988, 380962, 202518, 180315, 290539, 334180, 277524, 367782, -98956, 84135, 376831, 296437, 386460, 20713, 174641, 257601, 317932, 109355, 122198, 190351, 298899, 156493, 237359, 30763, -153058, 233200, -79038, 71022, 297719, 61613, -5750, 269190, -81076, 244483, 48670, 80645, 215329, -18326, 435205, -41451, -35024, 53236, 650821, -9969]
13274a90748c8356B63977l6683k6169a15003B55166c6689B7686J51597e8468A93901
13262D7813L11552c8272A09679m6156k2911J81651P4694H3376k2372P5159k7982
13251A08181J29231c4279l9949A47100d0543I8347J12423m2608C9668K94411a58583
13239a8778q651C4649K49468j09048g8086A4486f8384j28860c4264j73794C30396
13227F4390K25699j00624c88458I6979K534c45232B2389K64524a31502G0819L28691
13216C99510A11987J82183a79247m1323A73310p4808B9830K78665h179H163J80927
13205A89090q4945j0467a27062B30040j11875I637K21632G920b09774G3999H923
13193A53942K44590G0612j2193f4235B71075o0948F0470g4204B3751L83859H3562
$$ y = [-190748, -38356, 263977, 227294, 201125, -115003, 255166, -36689, 27686, 179283, -58468, 193901, 47813, 359365, -38272, 109679, 63523, 40612, 222263, 296957, 83376, 61004, 136163, 108181, 237412, -34279, -74228, 147100, -40543, 98347, 210770, 168162, 39668, 334079, -158583, -18778, -27429, 34649, 284117, 175069, -78086, 14486, -68384, -197244, -34264, -208058, 330396, 64390, 290089, 189465, -388458, 96979, 99513, -345232, 22389, 286913, -131502, 70819, 399510, 111987, 294170, -179247, -220570, 173310, 98502, 29830, 308495, -8179, 8163, 189090, 104145, 93678, -127062, 230040, 118165, 9637, 231269, 7920, -209774, 73999, 8923, 153942, 398532, 70612, 58419, -64235, 271075, 210127, 60470, -74204, 23751, 407610, 83562]
13181B29555K65427A00469L02526a85813C71671r9325A5455a64802I4218K46103
13171C40321A50834D9600a8195r100J2661o3192A0819L65087A7241L72082j04538
13160B84785a66641q354B67240Q3624j5890c32276B69594F200J82016a22742B1812
13148a52653A06520L7097j7133m2628K6745J65732B9247N2653a18526G3029J07484
13137A80513h3280Q480o8158f8493A23616R9238L0227r1329b7887D05761d1105
13125D957P6444N59409A12357e6000J9977o3370A75297a20793B63899D0104R8340
13114A38444h6978A95682G2089O4189K0218p3904i4730l1973C35564c05466i3907
13102A99793k5746h410I8550n18M1174c14706C65428E3226K3761B5155b2267A12870
$$ y = [229555, 494982, 100469, 402995, -185813, 371671, 272346, 15455, -164802, 94218, 340321, 150834, 49600, -18195, -27295, -14634, -77826, 10819, 375906, 17241, 389323, 284785, -166641, -174995, 267240, 350864, 334974, -332276, 269594, 6200, 188216, -122742, 21812, -152653, 106520, 143617, 126484, 83856, 110601, 276333, 29247, 81900, -118526, 73029, 180513, -83280, -74800, -142958, -68493, 123616, 222854, 253081, 161752, -27887, 405761, -41105, 4957, 81401, 640810, 112357, -56000, -36023, -99393, 175297, -120793, 263899, 40104, 138444, -86978, 195682, 72089, 136278, 156496, 82592, -94730, -126703, 335564, -305466, -93907, 199793, 174047, -8410, 98550, 98032, 139206, -314706, 365428, 53226, 76987, 25155, -22267, 112870]
13089g6917A76072a0199A58281c0176p1265E41266B43087N0489Q2823J43190a43303
13077b7485A86742J42625l2932A44879J8465k191n2795a18071D7848A6695L43024
13066C59719G2611C333Q3450a51106p6762b9395m2455j77076Q8621q5519B21507
13054d0954B19226J8840d79792J76990A21368O4876b41151J03063B57872k5762
13044B32110J5476b01463A99462p9033a32267k5198C35031k1478q992j30044K2708
13033A97225J696H8048A8873K24820A19432J5968a36161E3868O5048c00731a01451
13021A0110f7458l3458p9447C83075J33230B47132l0517J43448j46682g5626F9790
13009D64500A35737k5971J19028i4550L5247a3996D8481A6421R631m331J11546
$$ y = [-76917, 176072, -10199, 158281, -30176, -101441, 541266, 243087, 293576, 376399, 519589, -143303, -27485, 186742, 329367, 296435, 144879, 163344, 161153, 108358, -118071, 47848, 16695, 359719, 72611, 3333, 86783, -151106, -227868, -29395, -71850, -248926, -160305, -245824, 221507, -40954, 219226, 238066, -479792, -302802, 121368, 186244, -241151, -138088, 257872, 232110, 247586, -201463, 199462, 120429, -132267, -157465, 335031, 313553, 304561, 174517, 197225, 198921, 88048, 18873, 243693, 119432, 135400, -136161, 53868, 118916, -300731, -101451, 10110, -67458, -100916, -180363, 383075, 516305, 247132, 216615, 360063, 213381, -75626, 69790, 464500, 135737, 109766, 228794, -94550, -59303, -13996, 48481, 16421, 26052, 21721, 133267]
12998A33267l1200h2065B9824b9200B7530M7446g3925b0732b961j57483C97039
12986C9315a12343A83866c89765A55834j4057m3672f0985j81369A80626K19624
12976D00250A43258J2019J42406q7373d2492E9312J65353b68709H4325J25010
12966B09335D5718A0719K72931C577c2479C35135a00221C20839I4009a60635a6972
12954a6007G8992e6540a0448I9155P6372h7581j3C11049A31535c47622D42298
12942C4635a6301C03273j2333m7695A17481b86859g2124q735b1064k10608I1853
12930B52253d4883F674b40988P9570A73207J136c05576A36079a78635G6147a65491
12918B48995j19750i5508H4503C0477b09699F8784a99079E8905i0811A66038R0321
$$ y = [133267, 102067, -82065, 29824, -29200, 27530, 74976, -73925, -20732, -2961, -160444, 397039, 39315, -112343, 183866, -389765, 155834, 141777, 98105, -60985, -242354, 180626, 400250, 143258, 155277, 297683, 210310, -42492, 59312, 224665, -268709, 84325, 209335, 45718, 10719, 283650, 3577, -32479, 335135, -100221, 320839, 94009, -160635, -16972, -16007, 78992, -56540, -10448, 99155, 175527, -87581, -87594, 311049, 131535, -347622, 442298, 34635, -16301, 303273, 290940, 243245, 117481, -286859, -72124, -80859, -21064, -231672, 91853, 252253, -44883, 6674, -240988, -161418, 173207, 174343, -305576, 136079, -178635, 76147, -165491, 248995, 129245, -95508, 84503, 30477, -209699, 68784, -199079, 58905, -90811, 166038, 256359]
12907B56359a57956o2157B84035b66780d2070C25802C4265N7646c31216A63813
12896A3991b73146i2629M3531B05410C8474J04799c32176j73694a66594L0352
12886a36242b9091n8561B84273b42354b1526H1586O2069Q8360j04523A3948e5240
12874A71387J64235a79006E6173K30228A32241b5574h174I2002J42041d3254A16597
12862a00479M2366k97188A10810P3247b45671f9026B44369A5723K10457A12532
12851b57153d0571p551j24908p6304a04602F3432A2650J03667D4400c99610A77656
12839d8376m1134A73492D1543L3805b07561A0888M336b5101E645R3025K06a31457
12826A76479e3511c727l0050k7563m2741j65799A11239a38493p6930A391J01550
$$ y = [256359, -157956, -220113, 284035, -266780, -42070, 325802, 34265, 91911, -331216, 163813, 13991, -273146, -92629, -49098, 205410, 38474, 143273, -332176, -505870, -166594, -136242, -29091, -87652, 284273, -242354, -21526, 81586, 143655, 232015, 127492, 13948, -55240, 171387, 335622, -179006, 56173, 286401, 132241, -25574, -8174, 92002, 234043, -43254, 116597, -100479, -58113, -355301, 110810, 184057, -245671, -69026, 244369, 15723, 226180, 112532, -257153, -40571, -48122, -173030, -249334, -104602, 63432, 12650, 116317, 44400, -399610, 177656, -48376, -89510, 173492, 41543, 75348, -207561, 10888, 15224, -25101, 5645, 98670, 98876, -131457, 176479, -53511, -3727, -33777, -61340, -104081, -269880, 111239, -138493, -215423, 1391, 102941]
12815A02941K80444a82160H4324d0510C03823m7042r2213C3056J50688b17201
12804f6061I0548a15997A91569a18029A59414a20904j34670i0259o7917k13198
12794c71374O9961e4623a5615k00404B34863H6077J3816c5841E4909L30582a71252
12782A7924d165I0504b13913B11441a97938Q5554C83961d2793j20223H1031h507
12770a0559G89M0151c8830k55239e1034A32435A446b11385c8061l22211c620j30406
12758a34026A27674K46646A63272b41467h66B6507e7791j50217O8476p9707A24039
12746A0219K65378e5362q2327E2620h1542B64198a58107G4543M0370a55358K3476
12735a31882p9786a353k580C93799A64777a22546p2518J5766m0954E645J50992
$$ y = [102941, 383385, -182160, 84324, -40510, 303823, 256781, 164568, 33056, 183744, -217201, -66061, 90548, -115997, 191569, -118029, 159414, -120904, -255574, -90259, -158176, -371374, -301413, -54623, -15615, -216019, 234863, 86077, 99893, -35841, 54909, 385491, -171252, 17924, -4165, 90504, -213913, 211441, -197938, -112384, 383961, -42793, -163016, 81031, -8507, -10559, 789, 40940, -38830, -294069, -51034, 132435, 1446, -211385, -38061, -360272, -3620, -134026, 127674, 374320, 163272, -241467, -866, 26507, -57791, -208008, -139532, -219239, 124039, 10219, 275597, -55362, -137689, 52620, -81542, 264198, -158107, 74543, 114913, -155358, -131882, -211668, -1353, -3933, 393799, 164777, -122546, -195064, -179298, -220252, 5645, 156637]
12724A56637e5212A12496K15937f8082B81523o4557m9803e1075D5224B0258Q1691
12713A01949f5991L2462D37282n9470j70119J23682a6867j0096E7279K12360k7274
12702B42365J58446j46183b29321R3163I0445P1231J0259N790D8622a69786p0856
12691b40642O3212N1703A0126a9887j17940f2715l12326B68736H7228B0276K87648
12680C07924R9017j42960A1942K30015b8563J3457A96063a02879A60144b06832
12669b39484B67367b7791l0118a2976A9481b66035K3835B67670a07483B17573
12658d6987a6624k7586j48387C9954K47565h5339a5660j4109D47669F2749L4930
12647I7679A5043R7716J60874L1114b37348P5239A8096K7006Q1960R0073j03378
$$ y = [156637, -55212, 112496, 328433, -68082, 281523, 216966, 167163, -51075, 45224, 20258, 101949, -65991, -33529, 437282, 377812, 207693, 331375, -16867, -26963, 57279, 269639, 242365, 400811, 254628, -229321, -136158, 90445, 161676, 171935, 177725, 48622, -169786, -240642, -177430, -125727, 10126, -19887, -137827, -62715, -375041, 268736, 87228, 20276, 307924, 406941, 263981, 11942, 241957, -28563, -15106, 196063, -102879, 160144, -206832, -239484, 267367, -27791, -57909, -12976, 19481, -266035, -242200, 267670, -107483, 217573, -46987, -16624, -44210, -192597, 39954, 287519, -85339, -15660, -29769, 447669, 62749, 97679, 15043, 112759, 273633, 304747, -237348, -162109, 18096, 45102, 127062, 217135, 113757]
12636A13757J57818E8240R0979a10834C9496a04044b5821A25029J98635c4533
12625B00537E9810L04173a20491B40349f1232B38200a03443A56097f2267A28414
12614b15726B36158b48358B22394l5843f056l18937d2878l643G0237e05580A08563
12602a44602B35908j7214I6057I190O7122J21066f5154A74811a19433F5780L3807
12591I9587J33585b97674J6192g2804j28771E2731a06504H3271e7595m0424B65904
12579b92522a29324H8673a66797d4128B10513d63038A36835d12079A61078o9858
12569I1220N2951n7684K09523j29240F7474f1536B5230b9441k47518J21678j09102
12558b64383G0650a2834B29009a12809G0101b04988A01750b89035A38150l9105
$$ y = [113757, 271575, 58240, 149219, -110834, 39496, -104044, -25821, 125029, 323664, -34533, 200537, 59810, 363983, -120491, 240349, -61232, 238200, -103443, 156097, -62267, 128414, -215726, 236158, -248358, 222394, 186551, -6056, -324993, -42878, -46521, 70237, -505580, 108563, -144602, 235908, 218694, 96057, 9190, 76312, 197378, -65154, 174811, -119433, 65780, 99587, 233172, -297674, -281482, -72804, -201575, 52731, -106504, 83271, -57595, -98019, 265904, -292522, -129324, 88673, -166797, -44128, 210513, -463038, 136835, -412079, 161078, 91220, 144171, 86487, 296010, 166770, 67474, -61536, 25230, -29441, -276959, -155281, -264383, 70650, -12834, 229009, -112809, 70101, -204988, 101750, -289035, 138150, 99045]
12548I9045c5642a0359k4531j48138A67648m1915J5818J79528F1128J49407d1061
12536c15893F6344K1339a77010L8820A32433E0111K95228M130j45321m725a68138
12524g6113a4385k44729B0765a54603B46153A2132K44711G9095b58832M246F6457
12512c8636k5789m5142A73117D1114f7814J9613A9250J9939P8124a47603r8921
12501b46524d2409A29845j6258J39329r3580n0739a10039K9197A86976b12418
12490b5973j80473B06361H5449J39392e855G888P6426j801a58456j98526A52990
12478e6943K3190j99444G3626a67110C17357b20063h7787C65557L02c42403B56053
12466A22871H03M333N97843k83491E9744N250K57803E5736a49789C88815A71156
$$ y = [99045, -35642, -10359, -34890, -183028, 167648, 125733, 141551, 321079, 61128, 210535, -41061, -315893, 66344, 87683, -177010, -138190, 132433, 50111, 345339, 349469, 204148, 199423, -168138, -76113, -14385, -259114, 20765, -154603, 246153, 12132, 256843, 79095, -258832, -254586, 66457, -38636, -64425, -109567, 173117, 41114, -67814, -48201, 19250, 39189, 117313, -147603, -246524, -42409, 129845, 113587, 252916, 159336, 108597, -110039, -80842, 186976, -212418, -25973, -206446, 206361, 85449, 224841, -5855, 7888, 84314, 82513, -158456, -356982, 152990, -56943, -33753, -233197, 73626, -167110, 317357, -220063, -87787, 365557, 365859, -342403, 256053, 122871, 803, 5136, 602979, 319488, 59744, 64994, 322797, 55736, -149789, 388815, 171156]
12454a9747B3949Q4406A5915L43673r8091H9907d8591J0315k22314A0689a10710
12442A2890M0125g0542k1569A29079a94141r7112J34753A69178F6440J42398a62657
12430D3117N42b28598n5989E3054J61778K73780A07962O3010h6910I6931a91917
12418d1046l9581C4382b42871Q648A55995a10828F121a41292N5791B1602J19018
12407A40620b39610B3399J91745i278B12452b92560A4695J39430G0892a34060
12396e9146A20847a04913j6649l1672B72286j0897b65938i9146A03399J2899a94085
12384G685L04614b34122j2718H7694a30846B36510m3515b43831A63764e6901C25951
12372E13335E6323N1017N104N3286b65095D9584b59711C25963A49329i2180C248
$$ y = [-19747, 23949, 108355, 15915, 359588, 261497, 89907, -48591, -38276, -260590, 10689, -110710, 12890, 53015, -70542, -92111, 129079, -194141, -291253, -156500, 169178, 66440, 208838, -162657, 43117, 43659, -228598, -284587, 53054, 214832, 488612, 107962, 170972, -86910, 96931, -191917, -41046, -80627, 34382, -242871, -234223, 155995, -110828, 6121, -141292, -85501, 21602, 140620, -239610, 23399, 215144, -9278, 212452, -292560, 14695, 154125, 70892, -134060, -59146, 120847, -104913, -121562, -153234, 272286, 261389, -265938, -99146, 103399, 116298, -194085, 7685, 312299, -234122, -246840, 87694, -130846, 236510, 192995, -243831, 163764, -56901, 325951, 513335, 56323, 107340, 112444, 165730, -265095, 49584, -259711, 325963, 149329, -92180, 3248]
12360d14260F3555a05470D8801O2635f5075A25741Q8123a54158k4028E5577i9887
12348A09737a05387e0422C97997b1975B61118c2389H3472j3263a73353A89099
12337f2670j95620P6036a973B04602B9335J77870j00186L8322b6126P16C92110
12325A45344B2034K4573M4404J81464p4516b93337C55683F1854f6325B90988A23201
12313A93609J24981q7905a41644F9562b1227j8638A20841a84237D20220B3406
12302a14228F887b1497G1319B1260L66721A70080E7576B1202i6120k7466F1545
12290C71372k0031a28880a8117D15947A34477B4740b81421F4351L51300j18341
12280B97310m5377A4382L06730m8047I8371N6621o9063j4432i3574C09881A27062
$$ y = [-414260, 63555, -105470, 48801, 111436, -65075, 125741, 213864, -154158, -178186, 55577, -99887, 109737, -105387, -50422, 397997, -21975, 261118, -32389, 83472, 70209, -173353, 189099, -62670, -258290, -182254, -1973, 204602, 29335, 207205, 107019, 145341, -26126, -25410, 392110, 145344, 22034, 46607, 91011, 272475, 197959, -293337, 355683, 61854, -66325, 290988, 123201, 193609, 318590, 230685, -141644, 69562, -21227, -39865, 120841, -184237, 420220, 23406, -114228, 6887, -21497, 71319, 21260, 387981, 170080, 57576, 21202, -96120, -123586, 61545, 371372, 351341, -128880, -18117, 415947, 134477, 24740, -281421, 64351, 415651, 297310, 251933, 14382, 321112, 273065, 98371, 154992, 85929, 71497, -93574, 309881, 127062]
12268D28948j28398D2524L51610h1114D6645J7736R5686n0073J5285d7530j31587
12257a79117B01861N5993G8828J80958o9331K19488A10912a67950A58233j1022
12247A47211a54716E872J41415l8608j4184j1340g8325B57425a08002a3925c97
12235A57081n2531B4147g8077F3155K40484A5992R5354N6910E6116K59015a53056
12223C35661A62954n5579a3739B6171J04006a45297I4037a03017R242I6542M7185
12212A43727P196L51694B31830Q0888O2194h4758B45171Q6709i1751q494C23080
12200A70714n7196C0857d972p7889B17647M1540D9222R4391K01303j16718j06507
12189A21691K42203a39614B14714p820E2310M35714A57709O0307m0813F6400c1076
$$ y = [428948, 300550, 42524, 394134, -81114, 46645, 64381, 160067, 109994, 125279, -47530, -179117, 201861, 257854, 78828, 259786, 190455, 409943, 110912, -167950, 158233, 147211, -154716, 5872, 147287, 108679, 94495, 83155, -78325, 257425, -108002, -13925, -397, 157081, 104550, 24147, -78077, 63155, 303639, 15992, 111346, 168256, 56116, 315131, -153056, 335661, 162954, 107375, -13739, 26171, 130177, -145297, 94037, -103017, -93775, 96542, 143727, 150923, 502617, 231830, 312718, 374912, -84758, 245171, 331880, -91751, -100245, 323080, 170714, 113518, 30857, -4972, -82861, 217647, 259187, 49222, 143613, 344916, 228198, 121691, 363894, -139614, 214714, 206894, 52310, 488024, 157709, 218016, 177203, 66400, -31076]
12177B04631H1128J75706L6677e3144C6802O5365Q055M48455B52971M27489k37271
12166D43189A32867M3085K22455A55875R3941J09800A57402G2887a48361g941
12155C27052c5871J2182A14746j7822l5812A2392M29120I9867a10824A03614b0538
12143C892L5181K63643c656k17437c5731q0755e6473B20536g1850E3588A1444
12131A30178a09282e722j2508A06041d3414C55725G0176P679K5429a66158C16946
12119a12863D01516j90077i4738G51502B21816J20282A4723f4855B97001p4148
12109B22853A03344a47481e7136D08120r0759q9373E1113J22797L6251F9464f7763
12097A33460Q3380b42870B51586K0565K4014A43288c32446A24160m6874J76157
$$ y = [204631, 81128, 256834, 293511, -53144, 36802, 102167, 110222, 558677, 252971, 680460, 443189, 132867, 175952, 398407, 155875, 249816, 359616, 157402, 72887, -148361, -7941, 327052, -35871, -23689, 114746, 96924, 61112, 12392, 441512, 99867, -110824, 103614, -20538, 3892, 39073, 302716, -3656, -221093, -35731, -116486, -56473, 220536, -71850, 53588, 11444, 130178, -109282, -5722, -18230, 106041, -43414, 355725, 70176, 77855, 103284, -166158, 316946, -112863, 401516, 211439, -94738, 751502, 221816, 342098, 14723, -64855, 297001, 222853, 103344, -147481, -57136, 408120, 317361, 227988, 51113, 173910, 210161, 69464, -67763, 133460, 216840, -242870, 251586, 272151, 296165, 143288, -332446, 124160, 77286, 253443]
12087B53443r5146f0940B26346b5174D5266M29394A03257L7138J04377K48496
12077D93268A37387F6989L84903j42927C0805L8247J62166A4107a46152B24974
12066A37315d6919k65430A10306M5340J01495H7457C628a85373A80245J11943
12056B92188j11806a15257M8220K0529j37619A15932p29m1499j8901a41527f7133
12044a5732j02674G6249N6830c44236A44561a32733A31438D7583j9226N20235
12034E48592C663g8469B41480a82091H18L13276d2065k68280a5204n5853l05620
12023c76677A16053j3118c017j64692A62183K57948e3608n0448C1143Q4080e8784
12011f0872j01415q352D5713a02507H193K33082f8163r390A09041b3292j85522
$$ y = [253443, 158297, -60940, 226346, -25174, 45266, 474660, 103257, 140395, 244772, 493268, 137387, 66989, 451892, 308965, 30805, 69052, 231218, 14107, -146152, 224974, 137315, -46919, -312349, 110306, 155646, 257141, 87457, 3628, -185373, 180245, 292188, 180382, -115257, -67037, -46508, -184127, 115932, 115203, 73704, 54803, -141527, -67133, -15732, -118406, 76249, 133079, -344236, 144561, -132733, 131438, 47583, 28357, 548592, 3663, -78469, 241480, -182091, 818, 314094, -42065, -310345, -15204, -71057, -376677, 116053, 102935, -3017, -167709, 162183, 420131, -53608, -104056, 31143, 115223, -58784, -60872, -162287, -170639, 45713, -102507, 8193, 241275, -68163, -77553, 109041, -23292, -208814]
12000b08814l9419a09665A15395J7139m7922C1790J02598a30756D25246A61329
11989B25173K46593A5715b38738c1542G5989b8429k71556f5107F3798J48764c00291
11977i8575o478j84933A19842J46940E826K3520g4111q5686G7813B246g9910k98808
11965c78718J61394M1575C2381M06866B18704A5564J86603J9867a40319L4826
11955a05493I1466d80118J24877A0787a1944B22162r2589D7097a10167l6084j23638
11944b69889B95043A29353n3886Q529b28250J4748e425A63241D9533a04861J4331
11933i0530H2623f0232j73991i3327F4770g7166J2290D8245L1973R3668D0222
11921a34771a9761B3386K28358d0764A59275A4389L2402a82075q6526B25J69418
$$ y = [-208814, -248233, -109665, 115395, 132534, 84612, 31790, 134388, -130756, 425246, 161329, 225173, 471766, 15715, -238738, -31542, 75989, -28429, -299985, -65107, 63798, 212562, -300291, -98575, -105053, -289986, 119842, 266782, 5826, 29346, -74111, -159797, 77813, 2246, -79910, -378718, -217324, -175749, 32381, 439247, 218704, 15564, 202167, 222034, -140319, -105493, 91466, -480118, -355241, 10787, -11944, 222162, 129573, 47097, -110167, -146251, -269889, 295043, 129353, 75467, 83996, -228250, -213502, -5425, 163241, 49533, -104861, -90530, 82623, -60232, -234223, -93327, 64770, -77166, -64876, 48245, 80218, 173886, 40222, -134771, -19761, 23386, 251744, -40764, 159275, 14389, 46791, -182075, -268601, 225, 169643]
11910A69643K6848c35880A64020f3900B49206K47968n0752a01510L1271G4731
11899a92472h2006A62248p6777J03825M6698A05767O7388b82539A26701b49941
11888d15001e4955j92981A96703D4164J97704g1728I3732J4475g8880A96169o37
11877A95532C2196K3401a92140P1146L9202a820j6879j40832G1277b70311B1494
11865a51197I8861a9740p3406I7891a82590A87872c27944a30342c2577o7133d8665
11853F5997L1978l0410a58018c1808B00226d1221j6206H1765i6091A5013J3365
11842B8378a25923d8071A48852B2377L10584A61444G252J17509C0948b26352A21338
11830B65620g9502m7448A94299a63384M5343l4109K1158J416I7868i2753L7690
$$ y = [169643, 196491, -335880, 164020, -63900, 249206, 497174, 446422, -101510, -70239, 74731, -192472, -82006, 162248, 85471, 189296, 235994, 105767, 173155, -282539, 126701, -249941, -415001, -54955, -247936, 196703, 44164, 241868, -71728, 93732, 108207, -78880, 196169, 195532, 32196, 55597, -192140, -120994, -81792, -1820, -18699, -159531, 71277, -270311, 21494, -151197, 98861, -19740, -93146, 97891, -182590, 187872, -327944, -130342, -32577, -99710, -48665, 65997, 97975, 67565, -158018, -31808, 200226, -41221, -57427, 81765, -96091, 15013, 28378, -125923, -48071, 148852, 22377, 332961, 161444, 7252, 124761, 30948, -226352, 121338, 265620, -79502, -126950, 194299, -163384, -118041, -152150, -130992, -129576, 97868, -92753, -55063]
11819e5063c328k85446j42065C40861F826A120g3983I2118K65232b06390g5962
11807b66204K8911a1330l6481k48037B74325a06423l16389a6783I0611J94778
11797B85389b9914A91145a08046j4205k30650R0684b3627j87535j44350A69556
11786B26020o1215a49393A50804R9073I2398c8699j77418k047c7378D01545i7778
11774A23344a07581M318A20620a26722l8847B3832b86977q3997B4718a61332E1949
11762b06663g1581A93023o4935b3977m2487l02768A41898J155d3864j580D0376
11750I7644f6615H3288f5898A03750N364e4452r6534a6545g573j6689C39485h5784
11737i4494m9003n8570G7066c36513A07357K23099f7301e197A15589b33100m4766
$$ y = [-55063, -3328, -288774, -430839, 340861, 6826, 1120, -73983, 92118, 357350, -206390, -75962, -266204, -237293, -11330, -47811, -295848, 274325, -106423, -422812, -16783, 90611, 285389, -29914, 191145, -108046, -122251, -352901, -262217, -23627, -211162, -355512, 169556, 226020, 164805, -149393, 150804, 249877, 92398, -38699, -216117, -218164, -37378, 401545, -97778, 123344, -107581, -103263, 120620, -126722, -165569, 23832, -286977, -370974, 24718, -161332, 51949, -206663, -71581, 193023, 128088, -23977, -66464, -369232, 141898, 143053, -43864, -45444, 40376, 97644, -66615, 83288, -65898, 103750, 109114, -54452, -150986, -16545, -7573, -24262, 339485, -85784, -94494, -143497, -202067, 77066, -336513, 107357, 330456, -67301, -5197, 115589, -233100, -277866]
11726b77866A8652a4670L672B28667b95810a0226B03303a29507N4389j13560I8364
11714A90794a05649B09538r9964J41549a36454E1116B036b09153A22589L9450
11704A62039a11258F2449N6651K24971A52935J0462E2710A8767J69159b7784j74791
11693b02575C48396h1365c134H6567L04524g5341o1563B38500Q6253A57934A4870
11681e683A28869a49474A96136b65207c6454A85289D8565J6192k275K936A4009
11669E0796d9012j5304a8012A96314B23a13763H575b36820A48509l4936M6780
11658A60353R3880b5462G9511J73525F6459j7711j0367b09372A75045a69474L3772
11647a35702J7735a8780O294j07405D4736c36044C7653b33051M3447k49398A22483
$$ y = [-277866, 18652, -14670, -10998, 228667, -295810, -10226, 203303, -129507, -75118, -188678, 98364, 190794, -105649, 209538, 109574, 251123, -136454, 51116, 2036, -209153, 122589, 162039, -111258, 62449, 119100, 344071, 152935, 163397, 52710, 18767, 187926, -27784, -202575, 348396, -81365, -3134, 86567, 391091, -75341, -136904, 238500, 324753, 157934, 14870, -5683, 128869, -149474, 196136, -265207, -36454, 185289, 48565, 64757, 62482, 65418, 14009, 50796, -49012, -64316, -18012, 196314, 223, -113763, 8575, -236820, 148509, 113573, 160353, 254233, -25462, 79511, 253036, 66459, 48748, 38381, -209372, 175045, -169474, -135702, -117967, -18780, -12486, -119891, 44736, -336044, 37653, -233051, -189604, -439002, 122483]
11635a51653o7086g0309k71423B47256r689a81433B74778a59835B06323c1192
11624E1684J13104B9346J58852Q9B8369L05580j41283p9674C7450c7624A12673
11612a04401D14996f9467D2460d7155j42050P6307c421j66941E7566f0650g147
11600c1270j3957d173A65352a88334A70551a68717F5370a14158I6513l2119L69457
11589D33851a8593A28388a8197F3846K0016q864B6442J24607K1387L56706A35227
11577a19500k75917B50398n0343a97328H8502P6141j5709E6935D365b99507C56522
11565B9086J54299q6853a54006A63758m3124P969Q209K18910A05942L7338e0339
11553a47910C17814a2347j36566o8172C81900A31831d5824l4114H8979R9113D7373
$$ y = [-151653, -218739, -70309, -341732, 247256, 237567, -181433, 274778, -159835, 206323, -31192, 51684, 164788, 29346, 188198, 188287, 28369, 333949, 192666, 112992, 37450, -37624, 112673, -104401, 414996, -69467, 42460, -47155, -189205, -112898, -3421, -170362, 57566, -60650, -7147, -31270, -45227, -4173, 165352, -188334, 170551, -168717, 65370, -114158, 96513, 64394, 433851, -18593, 128388, -18197, 63846, 83862, 74998, 26442, 151049, 172436, 529142, 135227, -119500, -395417, 250398, 200055, -197328, 88502, 164643, 148934, 56935, 4365, -299507, 356522, 29086, 183385, 96532, -154006, 163758, 120634, 128603, 136812, 355722, 105942, 143280, -50339, -147910, 317814, -12347, -148913, -217085, 381900, 131831, -45824, -79938, 88979, 188092, 47373]
11541E4032e7347j34429B63606H33K28502K7530b83100P0362J7290H7413K8945
11530A16358a22040C59564a87B50677C1928b53149A79674a09323B76695j22551
11520A54144m4396R0713b46287j45722A91939K6151I812m383J40591L4644G6731
11508B16091H0693k4080e3337C5832K48125n6617a31564E4502b32668D1035J50563
11497A91598n1921a18353D23851r0086G6256j615L2735f4275B6048J13924a17497
11485a14024B44801A15289L7192N0313O669h0877n0871M9324C29033e4670A05601
11473b05142A16039J37029i0645L6420j8175q2505F4042J89263a07675b4319H8032
11461C02436r9837b5861A13226k7657M9001b90269A53082a08144B53447j13433
$$ y = [54032, -57347, -191776, 263606, 833, 229335, 256865, -283100, -212738, -195448, 87413, 116358, -122040, 359564, -187, 250677, 31928, -253149, 179674, -109323, 276695, 154144, 109748, 200461, -246287, -392009, 191939, 218090, 9812, 5429, 146020, 180664, 76731, 216091, 80693, 56613, -53337, 35832, 283957, 227340, -131564, 54502, -232668, 41035, 191598, 139677, -118353, 423851, 333765, 76256, 74641, 107376, -64275, 26048, 139972, -117497, -114024, 244801, 115289, 152481, 202794, 209463, -80877, -131748, -82424, 329033, -54670, 105601, -205142, 116039, 253068, -90645, -54225, -72400, -154905, 64042, 253305, -107675, -24319, 88032, 302436, 202599, -25861, 113226, 85569, 134570, -290269, 153082, -108144, 253447, 140014]
11451A40014J1891J67535b22560p3792B94232A04228Q5814c4884A45874I42R8262
11440I9204c9683D4447b19404C1778b6434B87017b3733B32085a64254B11968G3516
11428a15415A71420a52682C48105b30621C09846a78265a5501A6933K14132o1242
11418A69823b82365A40744i5854m369l11736C92506a23475f1398D39249B0300
11407C9664a46611n7706j04301A42434D1573a28253M1560c4605j90679i49k30755
11396b31704h2899K0470A97412b82425a34628n8310G4298a07178B26494A12585
11385a65148B35422c083r3983j00727A6561e7228C6549J85626L5563g4209A3844
11373E618J90007f7244D1486e1569D38888b7426A2699J82496J21842G646g7811
$$ y = [140014, 151905, 319440, -222560, -296352, 294232, 104228, 190042, -34884, 145874, 942, 99204, -39683, 44447, -219404, 31778, -26434, 287017, -23733, 232085, -164254, 211968, 73516, -115415, 171420, -152682, 348105, -230621, 309846, -178265, -15501, 16933, 231065, 169823, -282365, 140744, -95854, -100223, -411959, 392506, -123475, -61398, 439249, 20300, 39664, -146611, -204317, -308618, 142434, 41573, -128253, -86693, -34605, -225284, -949, -231704, -82899, -62429, 197412, -282425, -134628, -192938, 74298, -107178, 226494, 112585, -165148, 235422, -3083, -97066, -197793, 16561, -57228, 36549, 222175, 257738, -74209, 13844, 5618, 195625, -67244, 41486, -51569, 438888, -27426, 12699, 195195, 317037, 7646, -77811]
11361I7225K07888j41960G1972R5237a49647g0498K5043k55282a3182o7843c4595
11349a95116P2782o4789n7142E0786a16207d0075A00577Q2105I1110a9132A57555
11337A44040k4780a73679M6016H8799a2613D32422a37326r5084Q2550A97141B6206
11325h6653b7693j18933E5517D846d610m747A81215f3352C19479C8254Q1796g6557
11312a20965c5604B281P5881k4692B3269g2938p9327c4462k22790J21874L1532
11301a03846k3476l2126M3073B90693a48320k85404g3340k59154a07020A76872
11290I5918a17C06305A18391A345d3458n516J5369R83r8889j07972a11711A44208
11277D9451a12117n4225A24041F221a20650F4090f2229n2955j2996D36760F2222
$$ y = [97225, 305113, 163153, 71972, 167209, -149647, -70498, -45455, -300737, -13182, -81025, -34595, -195116, -122334, -187123, -244265, 50786, -116207, -40075, 100577, 182682, 91110, -19132, 157555, 144040, 119260, -173679, -127663, 88799, -12613, 432422, -137326, -232410, -149860, 197141, 26206, -86653, -27693, -146626, 55517, 4846, -4610, -9357, 181215, -63352, 319479, 38254, 120050, -76557, -120965, -35604, 2281, 78162, 53470, 23269, -72938, -152265, -34462, -257252, -135378, -103846, -127322, -159448, -116375, 290693, -148320, -433724, -73340, -332494, -107020, 176872, 95918, -117, 306305, 118391, 1345, -43458, -48974, -33605, -32622, -131511, -239483, -111711, 144208, 49451, -112117, -166342, 124041, 6221, -120650, 64090, -62229, -115184, -128180, 436760, 62222]
11265a73891A7416b64883h7715a4454F9787c8082a5555k31947a02826M8324C6566
11253B31524C536e223A37818c00954d131j46959a9447h711B57699B897a93440
11241A39810E7013O6607b55690A00367b16979B44473M4218a73885l40233M828
11231e09290a30777j4983o1172I1531c16475b3417j4343B98987b28715B72399
11220B4119K72600e0774j07914k64559a77183G3562b40561e9810A30650d6214
11209a96971o9828h1399c0906C7615b58517b4969B23733a53958o3921N8633k0618
11198a79864k04558E6251b08997l67A18988a11903d5199p1774K4396a5512A40705
11186c64172j434F5728b40878J12796N4881n0559j85776R4923F5143a44037M0207
$$ y = [-173891, 17416, -264883, -87715, -14454, 69787, -38082, -15555, -247502, -102826, -54502, 36566, 231524, 3536, -5223, 137818, -300954, -4131, -151090, -19447, -8711, 257699, 2897, -193440, 139810, 57013, 123620, -255690, 100367, -216979, 244473, 288691, -173885, -514118, -509290, -130777, -145760, -206932, 91531, -316475, -23417, -37760, 298987, -228715, 272399, 24119, 296719, -50774, -158688, -423247, -177183, 73562, -240561, -59810, 130650, -46214, -196971, -266799, -81399, -30906, 37615, -258517, -24969, 223733, -153958, -217879, -159246, -179864, -384422, 56251, -208997, -209364, 118988, -111903, -45199, -116973, -92577, -15512, 140705, -364172, -365606, 65728, -240878, -128082, -73201, -123760, -309536, -214613, 65143, -144037, -103830]
11175a03830r3258j46165a22222k2009M9272b9872A98131a83587q3653e9359j09255
11164a68614K4828L6843M3610j20791g7364A2693c95873A44482n2343P6575h7937
11152D10681a63575b4484j64672B22034L7566e1146A01507J0868a97500j4554
11142b12054f7090q193A46220l8759k125a29267a576j01958A7470f8941q6865
11131a55806d2609j68986K9783c3032m0617C28383m1527b59824C3057M2481K03452
11120B78990j9843b54318J22661B94901b36792A40583c3264A34479b57035Q0417
11110a76618A03612a8906r1374M0008A41569K2134a12410o9483f6533l8624A99287
11098C76951j58013a27051B06662R5881G4474J50463I9781h732A26234a17291
$$ y = [-103830, -197088, -343253, -122222, -144231, -94959, -29872, 198131, -183587, -267240, -59359, -168614, -143786, -106943, -63333, -184124, -77364, 12693, -395873, 144482, 92139, 168714, -87937, 410681, -163575, -24484, -189156, 222034, 259600, -51146, 101507, 112375, -197500, -212054, -67090, -75283, 146220, 107461, 105336, -129267, -1576, -103534, 17470, -68941, -155806, -42609, -211595, -181812, -33032, -73649, 328383, 286856, -259824, 33057, 75538, 278990, 259147, -254318, -131657, 294901, -236792, 140583, -33264, 134479, -257035, -176618, 103612, -18906, -110280, -70272, 141569, 163703, -112410, -181893, -66533, -105157, 199287, 376951, 218938, -127051, 206662, 302543, 74474, 224937, 99781, -8732, 126234, -117291]
11087A74564M26514c6585B28862D1150N59221g5524B33643J04007A28751a82970
11076I7448K781K75265M6411J40877j57415A72034K38660j39114m8548q2392J04447
11065B45087a46303C44663j52817m1884p426L17626j32729J77976m6626j11066
11055C47717M5980J51826L6072n6066L71448l95443r2183p3494K92469B96537
11044F94297J73289p8991p7138P0042k49947n8807J15653J1134K20025l63753
11034D55804J74882K3744j21821n3368K86922k73734k08384J60825L28020l51024
11024D21866L00132K5039J11908C24957O49032k58450j48849J10447k31790J32651
11014E77998L9777K13493D09727J94679B98382K97264k19888q2492J77907J70322
$$ y = [174564, 601078, -36585, 228862, 41150, 600371, -75524, 233643, 337650, 128751, -182970, 97448, 100229, 375494, 421905, 562782, 405367, 172034, 410694, 271580, 223032, 140640, 245087, -146303, 344663, 191846, 149962, 142536, 460162, 327433, 505409, 458783, 347717, 393697, 545523, 581595, 525529, 896977, 501534, 409351, 335857, 628326, 296537, 694297, 867586, 788595, 711457, 781499, 531552, 472745, 588398, 599532, 819557, 455804, 630686, 654430, 532609, 479241, 766163, 492429, 284045, 444870, 772890, 421866, 721998, 747037, 858945, 324957, 973989, 715539, 566690, 677137, 445347, 577998, 617775, 831268, 409727, 604406, 298382, 595646, 375758, 293266, 471173, 641495]
11004F41495B63747L37161B19131L79750M4261j02971K34155l1069A79919N19223
10994F99142k1609j89444K06356j01083l3977j22087J30771j62017J32624k2217
10984E16459J45246J31566k77071K92130K8895l19420K57501J86764l9706r4396
10974H27968n6615N07770j47881M89144j28166q0052L39069K84449L69929q4358
10964B321257j10178L07032j15253N8166n4982n38899j09523J61193m07631j06534
10954A404648j16271R3561p8150L06341j48607j25626j72618o2779m9910L7480
10944A088069l14319j22772r8869r5422j39025j34093K17825j15414A37784a8773
10933a17128A25997l0232Q8263p0057J40585n0635a28093A9173J54232J262c10903
$$ y = [641495, 263747, 600908, 219131, 598881, 643142, 540171, 774326, 743257, 179919, 699142, 677533, 488089, 694445, 593362, 559385, 437298, 568069, 406052, 538676, 516459, 661705, 793271, 516200, 808330, 837225, 517805, 775306, 962070, 922364, 827968, 771353, 1279123, 1131242, 1620386, 1492220, 1412168, 1751237, 2035686, 2405615, 2321257, 2211079, 2518111, 2402858, 2461024, 2406042, 1867143, 1757620, 1918813, 1511182, 1404648, 1288377, 1381938, 1303788, 1610129, 1461522, 1335896, 1163278, 1100499, 1050589, 1088069, 773750, 650978, 552109, 456687, 317662, 183569, 401394, 285980, 137784, -18773, -117128, 125997, 95765, 184028, 113971, 254556, 203921, -128093, 19173, 173405, 174667, -310903]
10921C609b984A01656c5752A91830a16359A2911J55627a55530j05515B10969a2875
10909a28531A14960C0879d51826c4749q2908A07357b16275A62344C7236K34410
10899B71646F8244a46509A24150a75187A5551P7027R887a65456n807A26111G334
10887B05239g3269B37624a69690B0123a8768k19555h7515k37273e1841k77394
10877c29235g5153k79182A51586g68q4092c084l03869j06962J1101c8845H3612
10865H909a56776A60093F9200K24315D5362a57494b4189k37294A24009J58341
10855B82350N4800b17602b1842l9506I1328h6116o4547i127k13147N6210Q2364
10844h3700A83039m4542E3056f6581m3599B50052d0075Q557j02379k3115J5373
$$ y = [3609, -2984, 101656, -35752, 191830, -116359, 12911, 168538, -155530, -261045, 210969, -12875, -128531, 114960, 30879, -451826, -34749, -117657, 107357, -216275, 162344, 37236, 271646, 68244, -146509, 124150, -175187, 15551, 92578, 102465, -165456, -171263, 126111, 7334, 205239, -73269, 237624, -169690, 20123, -18768, -238323, -87515, -324788, -51841, -329235, -75153, -354335, 151586, -768, -84860, -3084, -306953, -413915, -402814, -38845, 83612, 8909, -156776, 160093, 69200, 293515, 45362, -157494, -24189, -261483, 124009, 282350, 337150, -217602, -21842, -61348, 91328, -86116, -150663, -9127, -222274, -166064, -83700, 183039, 138497, 53056, -66581, -110180, 250052, -40075, -31518, -133897, -157012, -141639]
10833a41639K2043B45776A0193M055L9609A6641h9203c2872A0960K83624f6410
10821b8524g151k91293a09822L0732K2723j80528g7386A24398c03785A14969c24159
10809c4243A29989b60423P847e165D04151C4580a9127p8687m568j00193Q3666
10798a18909o7392A47090g2229A40946f827j65207c6880k68976D7168b37663g9604
10786a94618r6509a03732D53254i6213l7140A75866a23682P290K9139n144n656
10775i8053C0117a08400D3488p816L97677a73692M1037E6983c17621a00176d4228
10763A72436c53060A36761B4999O1951a30604j6273d5073k70989A8694J77962
10753A96656G2412i2370r571A66246a31305A38239m3085d8548D2872b0117p1614
$$ y = [-141639, -119596, 245776, 10193, 14248, 53857, 16641, -89203, -32872, 10960, 294584, -66410, -28524, -7151, -298444, -109822, -79090, -56367, -236895, -77386, 124398, -303785, 114969, -324159, -34243, 129989, -260423, -252576, -5165, 404151, 34580, -19127, -97814, -102382, -202575, -118909, -186301, 147090, -72229, 140946, -6827, -172034, -36880, -305856, 47168, -237663, -79604, -194618, -291127, -103732, 453254, -96213, -133353, 175866, -123682, -116392, -87253, -92397, -98053, 30117, -108400, 43488, 35672, 433349, -173692, -132655, 56983, -317621, -100176, -44228, 172436, -353060, 136761, 24999, 86950, -130604, -146877, -45073, -316062, 18694, 196656, 72412, -92370, -101941, 166246, -131305, 138239, 95154, -48548, 42872, -20117, -91731]
10742i1731k43679A42979C43J916a61748q1178N7182l07873I6283f9458K2457
10731d7001I1017d45444i070k35877R5313k25377r3096E1764J31342a08388j12725
10720b21113l3801h1150j17545m7089J09615A13026b18733F3109a66253K4506
10710a41747B6279h1069j60103A7530i2981c1969r7509C9614L01400G4611l2628
10699D1983Q4930M5515j8800p1258J05872d2939o4821r6287B80578e60001C5651
10687A29301F0650a10724L9131A3292J52139J33720i8309a9006B96543n5059g6934
10675B65062a31184j07052A67752a32113B9751f7118B0950a21414o734b77j62668
10664a62945e2673j06192B3523i5189L6756l38177C2245A3299a24227l97292b09695
$$ y = [-91731, -335410, 142979, 343, 2259, -161748, -242926, -185744, -493617, 96283, -69458, -47001, 91017, -445444, -9070, -244947, -149634, -375011, -468107, 51764, 183106, -108388, -221113, -254914, -81150, -198695, -245784, -136169, 113026, -218733, 63109, -166253, -141747, 26279, -81069, -241172, 17530, -92981, -31969, -129478, 39614, 341014, 74611, 41983, 126913, 172428, 153628, 82370, 188242, -42939, -107760, -204047, 280578, -560001, 35651, 129301, 60650, -110724, -71593, 13292, 165431, 299151, -98309, -19006, 296543, 241484, -76934, 265062, -131184, -238236, 167752, -132113, 29751, -67118, 20950, -121414, -128148, -277, -162945, -52673, -158865, 23523, -95189, -58433, -396610, 32245, 13299, -124227, -521519, -209695]
10652b68315J09227r6257A49332e08316f1696k74868h1519J592A57579m6917a30023
10640c74707h0319k3882D60677b5143C3401e2943c475j39317P1140j29205F294
10628B78192F6128g2971j1400k72524a42483k28749e2714j56702j63800A30558
10617f3309j11173a808r0642j08459e7466j3701B28942a0333l05755e1317o6444
10606a17761E2699c34581R8290B15757A1329J3761M6892a99232h9254n2153O6138
10595g5269B11035g766B38728b86450f173f12l0902o2999q6278j2758f1440A11016
10582a03124I6797c23708a45877A72155c92999I5197a35623N8898J3242B86863
10571G2691K83993A34127E9999a36416o302A59348D1286d7479B05088a59229e4467
$$ y = [-268315, -159088, -255345, 149332, -508316, -61696, -336564, -81519, -79927, 157579, 110662, -130023, -374707, -80319, -104201, 460677, -25143, 33401, -52943, -3475, -142792, -71652, -200857, 6294, 278192, 66128, -72971, -84371, -356895, -142483, -371232, -52714, -209416, -373216, 130558, -63309, -174482, -1808, -92450, -200909, -57466, -71167, 228942, -10333, -316088, -51317, -117761, 52699, -334581, -236291, 215757, 11329, 25090, 71982, -199232, -89254, -141407, -75269, 211035, -7766, 238728, -286450, -6173, -612, -31514, -94513, -180791, -193549, -61440, 111016, -103124, 96797, -323708, -145877, 172155, -392999, 95197, -135623, -76725, -63483, 286863, 72691, 356684, 134127, 59999, -136416, -142718, 159348, 41286, -47479, 205088, -159229, -54467]
10559E7501b18748B81582I0650d8250l38878P5075A68722k372L3316H5346K1841
10548A07187N5134b5436B6282J24580c01404a48495j56106K4986A23663A3179
10537A73421p4668b69079C50200a98156g0113p6133A0682a91311J6784g4751A63983
10525a50679c6564I4384m998l5082a42094B82190a50194H6395e2414E8031P257
10514F5288b47154A63988b23295r9591B26953h1017E3063a07453B66578e4162
10503a6089q4625J8993c0893G9115g1789C0083i2249M5899D73939h2916B81729
10491a96174B75693c0653D3895b2189j51045D3051L30312b59320k65660d7619
10480d1348A50156a11911j4826k10124J47828a8664A64281A3712M50359k12585
$$ y = [57501, -218748, 281582, 90650, -48250, -387128, -312053, 168722, 166350, 199666, 85346, 107187, 162321, -25436, 26282, 150862, -301404, -148495, -304601, -279615, 123663, 13179, 173421, 98753, -269079, 350200, -198156, -70113, -146246, 10682, -191311, -174527, -74751, 163983, -150679, -36564, 94384, 89386, 54304, -142094, 282190, -150194, 86395, -52414, 58031, 65288, -247154, 163988, -223295, -322886, 226953, -81017, 53063, -107453, 266578, -54162, -16089, -100714, -81721, -30893, 79115, -71789, 30083, -92249, -46350, 473939, -82916, 281729, -196174, 275693, -30653, 43895, -22189, -173234, 43051, 373363, -259320, -524980, -47619, -41348, 150156, -111911, -126737, -336861, -189033, -18664, 164281, 13712, 464071, 251486]
10470B51486M76089B45407H1418P5415g4732A85787o6632j9336K80643B8837K0465
10459D9302e5767k65171O5141a12047B47963o2517A0496c72136A01838a70341
10448c51605D2362N1019b53121B1676a06798l5638n2067G6592b96724a8510j89446
10437b07956K8186j46041A06418J57211c35083l61092b87005d591k0077A37337
10426B02679A9758a98925n7584F6741L2438a87718D17875G9600J44295A01372
10415C56519A38286c39418a27791J8792d5068H6182b78369A43935a48981c9421
10404b63399a28293A88531E0850b50335B25345a706G3608f3560j09298N4299C2435
10392B52711d35041E1141a3343F0692d3055I11J74942Q453p9236a37181F6379
$$ y = [251486, 727575, 245407, 81418, 156833, -74732, 185787, 119155, 99819, 380462, 28837, 49302, -55767, -320938, -255797, -112047, 247963, 185446, 10496, -372136, 101838, -170341, -351605, 42362, 93381, -253121, 21676, -106798, -142436, -194503, 76592, -296724, -18510, -207956, -179770, -325811, 106418, 263629, -335083, -696175, -287005, -4591, -24668, 137337, 202679, 19758, -198925, -256509, 66741, 99179, -187718, 417875, 79600, 223895, 101372, 356519, 138286, -339418, -127791, -108999, -45068, 86182, -278369, 143935, -148981, -39421, -263399, -128293, 188531, 50850, -250335, 225345, -1706, 73608, -63560, -172858, -118559, 32435, 252711, -435041, 51141, -13343, 60692, -43055, 911, 175853, 184306, 105070, -137181, 66379]
10380A90623D4256g8200E5633J42488f0256n3955B17268r7799A2812Q1541K45742
10369C40095J61683c2251C09279J9856M6400J22272j19151a31855B44165Q740
10359B52905K440N1762d0844A13552K59118A10871R1602k0273l1652k3019N9913
10348A87442l8974l413K38365J48105N7299A92918F6869K19461R4661m5432B3154
10336B64194E8497k2865J6943a6022A37302K21519j71658I1299K23162a77600
10325a82523a1504A86474n6611D7492f7273A33349k251L44285B04891n3460J16801
10314B68232f1061E0996L375M63903j49019B8816a8799D5023J66818F343N1760
10303E8103b24349r3382F4142f1337C5853i242k84101e7067J7742l8911E9754
$$ y = [190623, 44256, -78200, 55633, 198121, -60256, -114211, 217268, 119469, 12812, 94353, 340095, 501778, -32251, 309279, 329135, 375535, 497807, 378656, -131855, 244165, 252905, 255345, 307107, -40844, 113552, 372670, 110871, 202473, 182200, 150548, 127529, 187442, 148468, 145055, 383420, 531525, 588824, 192918, 66869, 286330, 380991, 335559, 23154, 264194, 58497, 35632, 52575, -16022, 137302, 358821, 187163, 91299, 314461, -177600, -182523, -11504, 186474, 129863, 47492, -67273, 133349, 131098, 475383, 204891, 151431, 268232, -61061, 50996, 54371, 518274, 369255, 28816, -18799, 45023, 211841, 6343, 58103, -224349, -317731, 64142, -61337, 35853, -9242, -293343, -57067, -39325, -78236, 59754]
10291D8270a34389k28514J40504Q3359d315j28952A77148G208N4395a13627d4493
10279a12052A6234O0162J30421b76226A23607c13772A44284M0759i4445q928A013
10267b44115G6796q874J07067k0215b85675R3897c9059j58642N8661A19693A168
10255a02952H2462B5448a67495B95738K27231D2312K71440j39862M2161D4823
10244B85949G5783a96719j45989A90613i3122D00053f2362B15312I9330M3766
10234A43096J0008N0015b15397N1939j71644J58952E0097a06769i537j43908G7550
10222b9240m686j2584B18534a66399j50922f6332j84833q0073j27475F4718L3669
10211I8387a65530e1796j85980Q3735A67165a47754A60458c1317j66217i8305
$$ y = [48270, -134389, -362903, -222399, -139040, -4315, -133267, 177148, 7208, 61603, -113627, -44493, -112052, 16234, 76396, 206817, -276226, 123607, -313772, 144284, 185043, -94445, -103373, 1013, -244115, 76796, 67922, 174989, 154774, -285675, -191778, -39059, -197701, -139040, 119693, 1168, -102952, 82462, 25448, -167495, 295738, 522969, 42312, 313752, 173890, 216051, 44823, 285949, 75783, -196719, -342708, 190613, -93122, 400053, -62362, 215312, 99330, 143096, 153104, 203119, -215397, -163458, -335102, -176150, 50097, -106769, -9537, -153445, 77550, -29240, -33926, -46510, 218534, -166399, -317321, -66332, -251165, -331238, -458713, 64718, 98387, -165530, -51796, -237776, -154041, 167165, -147754, 160458, -31317, -197534, -98305]
10200a15914k05156a29247o7420A68878a78204a4095A1679b93022e2023J5030
10190c6993k23179p3785E3715k6352J67389a06189a0424l0903B33547a6672A21073
10178b33600j53538J51526c2514B73996i114B03715b82464a08804A27571F3619
10167A04455C3849O3505a79010k26603I8115a10857A92751H9454E232a60284r4124
10156b54408J1509f4727r2971F0985c3759j52782k9794K6308c8846A09020C0925
10144C07491a39024k59513R0063B11455o9813F3936L2626R953i3941H7363B3023
10132a79854A6670a3034j6944B38051G6021J32102b7772j26617o741N0036K1306
10121h9788k78860A64478g3717G716d2638q7250p6348B19405C4774b9252g95A9913
$$ y = [-115914, -321070, -129247, -196667, 168878, -178204, -14095, 11679, -293022, -52023, -36993, -260172, -333957, 53715, 27363, 194752, -106189, -10424, -41327, 233547, -16672, 121073, -233600, -387138, -235612, -32514, 273996, -9114, 203715, -282464, -108804, 127571, 63619, 104455, 33849, 97354, -179010, -405613, 98115, -110857, 192751, 89454, 5232, -160284, -254408, -242899, -64727, -157698, 60985, -33759, -186541, -216335, -190027, -38846, 109020, 30925, 307491, -139024, -398537, -308474, 211455, 141642, 63936, 96562, 106515, -93941, 87363, 23023, -179854, 16670, -13034, -29978, 238051, 76021, 208123, -27772, -154389, -161130, -111094, -89788, -368648, 164478, -73717, 7716, -42638, -129888, -206236, 219405, 34774, -29252, -795, 19913]
10108i3002J4863A61549a48456j11675j14900A23504Q4622g9932O312k08844j77740
10097d60204K09265a20751A36154E2775e521k817q2332D17329a08656A00571O0735
10086A61306b36752M1077j86982c7599p9159c4475m8477I0351f9733A3487M6129
10075E9616J52515p9757i0425A92586a57974q7077j08834A21174J24945b46996
10064b7200k0309J4523n2571A19633f0667A93616c96781I5737J2826J4128a04625
10052A67209c48901C2215g7878A855L41492d025j12244j39513E7714d42492A08640
10040i1444A82196e01785b16203A15417n1320d8729B46128b46747J04100j54369
10030b97016b7259j0499D5739a53512A94779a00218C1462a06336c7406l35060
$$ y = [-93002, -78139, 161549, -148456, -260131, -375031, 123504, 208126, -79932, -73620, -282464, -460204, -250939, -120751, 136154, 52775, -5521, -8338, -90670, 417329, -108656, 100571, 161306, -236752, -195675, -382657, -37599, -116758, -34475, -82952, 90351, -69733, 13487, 59616, 212131, 132374, -90425, 192586, -157974, -245051, -353885, 121174, 246119, -246996, -27200, -47509, -32986, -85557, 119633, -60667, 193616, -396781, 95737, 108563, 122691, -104625, 167209, -348901, 32215, -77878, 1855, 343347, -4025, -116269, -255782, 57714, -442492, 108640, -91444, 182196, -501785, -216203, 115417, 64097, -48729, 246128, -246747, -142647, -297016, -27259, -37758, 45739, -153512, 194779, -100218, 31462, -106336, -37406, -372466]
10020c72466F1362a34431I1923b13053C9953c48681a14774a4948l19535b1109
10009e351k24133A22577L04015b8555j20046j2004j80810N1563F1727L24675b3839
9997g5317A46210K37353D8169b49680D2650b65837Q9632F8378J00113C7427c78560
9985E2020K1945B8858J3790b20387C4482b13378e5752I082a8421l92428A83124
9973b23587c7098A28245b68342a19658A56400b02710B2863a3585k1462j71934
9963b06981J3002D440a66604a9378l49014A74090c15482D818b46789f8969k42635
9952c11604J2212B13176e70740H0167h6764p7620m67f2542J7968F5306e4186G3634
9939a19164p0170q5022c0142F1680k7141a98897N2635J0897A4394b38052c9969
$$ y = [-372466, 61362, -134431, 91923, -213053, 39953, -348681, -114774, -14948, -334483, -21109, -5351, -229484, 122577, 426592, -28555, -148601, -160605, -341415, -289852, 61727, 386402, -23839, -75317, 146210, 383563, 48169, -249680, 42650, -265837, -176205, 68378, 168491, 37427, -378560, 52020, 73965, 28858, 42648, -220387, 34482, -213378, -55752, 9082, -18421, -410849, 183124, -223587, -37098, 128245, -268342, -119658, 156400, -202710, 22863, -13585, -35047, -206981, -193979, 4440, -166604, -19378, -368392, 174090, -315482, 4818, -246789, -68969, -311604, -299392, 213176, -570740, 80167, -86764, -164384, -164851, -62542, -44574, 65306, -54186, 73634, -119164, -189334, -274356, -30142, 61680, 34539, -198897, -146262, -135365, 14394, -238052, -39969]
9927i3252r1381A28867a51187F3893a41300r798B53377d24633g6116a6849I5308
9915E1006e2061A98016e1913l6373I1241a3361k03446j774Q5780B51995E1844
9903a18997d931n0515B7077c00847b9348A70146d11446a18957A2830a92700g6985
9891c608j07681j03087a4133o2118m174j43483E3690R589K73895a86855H2092
9879b6821p5334A32708F2027a12756M1115A78263b4684J08G7181l0375a8769B03739
9866G1337c12091J14549L9195e697A48347i9573d1662j26884A24131a34116f3923
9854A1090f9078e461B89511c81467a74335G5429f7663K0469r1711j74456e8692
9842c08731d2874j3302r5160C6014c9988j2433l9835a4877k19407C30667h4654
$$ y = [-93252, -184633, 128867, -151187, 63893, -141300, -151098, 253377, -424633, -76116, -16849, 95308, 51006, -52061, 198016, -51913, -88286, 91241, -13361, -216807, -218581, -132801, 251995, 51844, -118997, -4931, -55446, 27077, -300847, -29348, 170146, -411446, -118957, 12830, -192700, -76985, -3608, -111289, -214376, -14133, -76251, -80425, -223908, 53690, 63279, 337174, -186855, 82092, -26821, -102155, 132708, 62027, -112756, -71641, 178263, -24684, -24576, 77181, 46806, -18769, 203739, 71337, -312091, -197542, -158347, -5697, 148347, -99573, -41662, -168546, 124131, -134116, -63923, 11090, -69078, -5461, 289511, -381467, -174335, 75429, -67663, -47194, -138905, -313361, -58692, -308731, -42874, -56176, -151336, 36014, -39988, -52421, -92256, -14877, -234284, 330667, -84654]
9830B16848e75752i8705L5150A5558a09899k08055a29269A31915a59983A25041
9819a0307j40510C4356a79865d8129j15931n0514F7624P2957j867A8039b62809
9807B91131A1216b08021C7392J16769a52o6385j94938j5486d5055k49684E3901
9795e438o6635B64942a64894B12672j1437c35920f3151a2712D0703L3504J86697
9784B60904g3089A6654a694m2290I6712l3939a1573A48721L1294H8083K5465m0041
9772G3507e8145j71766b3250k60405f0083r7951N2268C04661h4525g089A47707
9760f8618A42674a77752m5223m5084a32390G4144l6880f9014K9766j1339E3369
9748E0578M8540a08615C9731a79051k4333B39a69183j82102b3864p0626m2831
$$ y = [216848, -575752, -98705, -63555, 15558, -109899, -317954, -129269, 131915, -159983, 125041, -10307, -150817, 34356, -179865, -48129, -164060, -214574, 67624, 140581, 138714, 18039, -262809, 291131, 11216, -208021, 37392, 154161, -152, -66537, -261475, -276961, -45055, -294739, 53901, -5438, -72073, 264942, -164894, 212672, 201235, -335920, -63151, -12712, 40703, 74207, 260904, -73089, 16654, -1694, -43984, 96712, 62773, -11573, 148721, 180015, 88083, 113548, 73507, -58145, -229911, -23250, -283655, -60083, -158034, -105766, 304661, -84525, -7089, 147707, -68618, 142674, -177752, -222975, -268059, -132390, 74144, 37264, -69014, -39248, -50587, 53369, 50578, 99118, -108615, 39731, -179051, -203384, 239, -169183, -351285, -23864, -94490, -137321]
9737a37321O5921p040C2940J39391M2379b873p0388n5221q2263M8126A91308i2750
9724b2473j12440E900c41009G079M6340a12037m2053A06463b1381J565p564A64808
9711h3378J3507j1770n0468O5845j5907l2624E4201d44922a59997f4743A53595
9699A6029a31807B07790b01956c0495m7770F3544i6259A79466a88919D9282i656
9687A3633o455a62276K4177q4067K4238a4735g1k53323j4563j75230J53339C4593
9674c8863A64754A3722c0344j04785A03776m1744d20121b01048d9768k27919C10556
9662d9739b032G4421c6783j68858I4571b12381e8993A82668b89966h9226A53208
9650a63442j08419C470a91618i0924c5365k9091b7783A00739i3595B0327d01150
$$ y = [-137321, -71400, -78440, 32940, 172331, 214710, -2873, -73261, -128482, -210745, -162619, 191308, -92750, -22473, -134913, 5900, -341009, 7079, 53419, -112037, -154090, 106463, -21381, -19816, -27380, 164808, -83378, -69871, -81641, -132109, -66264, -82171, -114795, 54201, -444922, -159997, -64743, 153595, 16029, -131807, 207790, -201956, -30495, -78265, 63544, -96259, 179466, -188919, 49282, -9656, 13633, 7178, -162276, -138099, -222166, -197928, -14735, -71, -253394, -267957, -443187, -289848, 34593, -38863, 164754, 13722, -30344, -135129, 103776, 62032, -420121, -201048, -49768, -277687, 310556, -49739, -2032, 74421, -36783, -205641, 94571, -212381, -58993, 182668, -289966, -89226, 153208, -163442, -271861, 3470, -191618, -90924, -35365, -64456, -27783, 100739, -93595, 20327, -401150]
9638A40868c77608a12657A99845c48350a34107B32157d7257k091k21151b6789
9627E7899a79936n5981I7547j289a9883k2683A0508A575b65010A04671e2779b061
9614a50775r2191f2881k6120a9996q3307A2901a96678M515g7902A63063i3970
9602h0131A66662l9895a64540A73251b13304g977p755k0118h959q9774j47791
9591b46524i8747c9133m61464b23331H7463k0913J5229a45537B14854d7673l03135
9580c50808c4901A34532m604c46936B4057b48168J10876A30064h4877A19220a81895
9568F9528c8726H5631c50703g0668k34570j24686B23053c20439J18155P0036C4101
9556B03459b41949A83765b55883a26482j49210F3721P807e9063a298j51671G7080
$$ y = [140868, -377608, -112657, 199845, -348350, -134107, 232157, -47257, -49348, -270499, -26789, 57899, -179936, -235917, 97547, 96258, -19883, -42566, 10508, 1575, -265010, 104671, -52779, -2061, -150775, -242966, -62881, -89001, -19996, -103303, 12901, -196678, -192163, -77902, 163063, -93970, -80131, 166662, 126767, -164540, 173251, -213304, -7977, -15732, -35850, -8959, -98733, -246524, -98747, -39133, -500597, -223331, 87463, 66550, 81779, -145537, 214854, -47673, -350808, -34901, 134532, 129928, -346936, 24057, -248168, -137292, 130064, -84877, 119220, -181895, 69528, -38726, 85631, -350703, -70668, -305238, -429924, 223053, -320439, -202284, -132248, 34101, 203459, -241949, 183765, -255883, -126482, -275692, 63721, 71528, -59063, -1298, -152969, 77080]
9544a39260j15074A64243b9793A77548b1430l04207F4011a52306d949p8042A08407
9532A33544l4433c5819j36295C4303M1136b43145E4404a08047j14533i8395B97690
9520C8354e1826l24692F2031a03046m5848o8122k34958R1595J73373D538a36180
9508b8549k6111r2205A84037k7679a42093l33376b2207k49703a31801A75774K87214
9497D62988f0632k62944P8025b9424a2616F0527J71091a61612B24666d9008k33446
9486b82454a2764j46516A63102g0105a6505k33229K6395A03519m3640J15676a53335
9474B56419a2852l36618J08389A95226C1615a90183k12593F4864a66138f4816
9463b26087N6316d0827j48819a9597A63221p8177J51887o767q9555J33345c02835
$$ y = [-139260, -254334, 164243, -29793, 177548, -21430, -325637, 64011, -152306, -4949, -82991, 108407, 133544, 99111, -35819, -172114, 34303, 75439, -243145, 54404, -108047, -222580, -98395, 297690, 38354, -51826, -376518, 62031, -103046, -148894, -217016, -451974, -360379, -187006, 4538, -136180, -28549, -54660, -146865, 184037, 156358, -142093, -475469, -22207, -271910, -131801, 175774, 462988, -60632, -323576, -245551, -29424, -12616, 60527, 231618, -161612, 224666, -49008, -282454, -12764, -159280, 163102, -70105, -16505, -249734, -223339, 103519, 59879, 175555, -153335, 256419, -12852, -349470, -241081, 195226, 31615, -190183, -402776, 64864, -166138, -64816, -226087, -169771, -40827, -189646, -19597, 163221, 85044, 236931, 230164, 140609, 273954, -302835]
9451A15838b38553R3153A74757a00216p9676j08723a27592N5457C2146b26977
9440e4521B8218a05639b106j0078A8378J75101b15768C6924g8437A3828c21372
9428f6616A94915b42510H0235C8834J23022a41117A14765K0265a18720N8054A8156
9416c6528l0843A64543c3823q6721e1001A48251a02267q0507a5481A66988m8778
9405A18210b27936a09663E362J83101b15492d7678n7096k22714L4712L7502k1253
9394b76527M5169A25277l1963d5144N190k120j06673D2967J01147b25190C6109
9382b52176o3183e0990A29238c19902A06531j2537b526H0413h6095C942d0479
9370A3630b51825D077g6553l11444g7049l89982B58394a10628B56746a03442o6782
$$ y = [115838, -238553, -145400, 174757, -100216, -179892, -288615, -127592, -72135, 32146, -226977, -54521, 28218, -105639, -2106, -12184, 18378, 193479, -215768, 36924, -78437, 13828, -321372, -66616, 194915, -242510, 80235, 38834, 161856, -141117, 114765, 135030, -118720, -60666, 18156, -36528, -67371, 164543, -33823, -120544, -51001, 148251, -102267, -182774, -15481, 166988, 118210, -227936, -109663, 5362, 188463, -215492, -47678, -104774, -327488, -292776, -255274, -276527, -231358, 125277, 93314, -45144, -39954, -42074, -148747, 42967, 144114, -225190, 36109, -252176, -315359, -50990, 129238, -319902, 106531, 93994, -2526, 80413, -86095, 3942, -40479, 13630, -251825, 4077, -76553, -387997, -77049, -467031, 258394, -110628, 256746, -103442, -170224]
9359a70224N9682l8415N8847A71810K3950m2236i9335d3902l8948I5649I235c8095
9346I051L0553m550a80199p3868j5471P9682d7971j47622j45668B26402b3860
9334a88702A40701b48902C7424e3807B17365i6707j89121L3867B26455b56230
9323a90626A73430b8428m6046A03515B4224O9860J62346d2436q4453A58728d08573
9311b72060H2696c17157A21394a60953c3877o0975c2753A23827c28427J00121
9301b28306M386C5961a75873A1734c5441A22298A2978b44212N5105k08896a71274
9289E1276F283a38353B4579h948k22592B32585a26597A03946a18022K0608C07376
9277a7240A1473a82097Q0197A64510a32582B13712m8154F1413b38969R8653A37777
$$ y = [-170224, -110542, -148957, -90110, 171810, 195760, 153524, -99335, -43902, -82850, 95649, 9235, -38095, 9051, 39604, 35054, -180199, -254067, -269538, -189856, -47971, -195593, -341261, 226402, -23860, -188702, 140701, -248902, 37424, -53807, 217365, -96707, -285828, -251961, 226455, -256230, -190626, 173430, -28428, -74474, 103515, 24224, 94084, 256430, -42436, -126889, 158728, -408573, -272060, 82696, -317157, 121394, -160953, -33877, -94852, -32753, 123827, -328427, -228306, -223920, 35961, -175873, 11734, -35441, 122298, 12978, -244212, -189107, -398003, -171274, 51276, 6283, -138353, 24579, -8948, -231540, 232585, -126597, 103946, -118022, -97414, 307376, -17240, 11473, -182097, -101900, 164510, -132582, 213712, 165558, 61413, -238969, -140316, 137777]
9265a92059A90714h5822A18227h5052C9408j7792a0152E4890N2265D1528J59654
9254B01182H8262K5947a0281j51276P9005O579I4467Q359J32280c03519J4509
9243b89010e4111j76953j6381o01E873e5555G423d2963P574l20342n2936J69856
9231b38811D3012b41890A31316B9003j1527J20149i9683p5147P913A3820J09682
9220A23502J97367b7298j29042A16557K6990g8414K0453a4994F1504c19717d6939
9208c81192j2755J87347H7881b34109Q6004D5823a94062j42112o3907D6721a99377
9196E0479a42904H3622O8612g8222b0389A04796N1719b3004E9320a67953G6935
9184a25017k6546P0281k52775C80638A61567b20401A73746n7689M617b33227N0032
$$ y = [-192059, 190714, -85822, 118227, -85052, 39408, 21616, -10152, 54890, 107155, 41528, 201182, 88262, 114209, -10281, -161557, -82552, -75973, 94467, 102826, 235106, -303519, -289010, -54111, -231064, -247445, -248046, 5873, -55555, 7423, -42963, -35389, -355731, -408667, -238811, 43012, -241890, 131316, 29003, 17476, 137625, -99683, -174830, -166917, 13820, 123502, 320869, -27298, -156340, 116557, 143547, -78414, -57961, -14994, 61504, -319717, -46939, -381192, -393947, -206600, 87881, -234109, -148105, 45823, -194062, -336174, -400081, 46721, -199377, 50479, -142904, 83622, 152234, -78222, -20389, 104796, 156515, -23004, 59320, -167953, 76935, -125017, -151563, -81282, -334057, 380638, 161567, -220401, 173746, 116057, 120674, -233227, -183195]
9173a83195A55527h9312j91962a35320j13783c3566j30159g8479j65420d0788
9162B19811e2210A91008a59179n2796j3570M9759M7254L4593n5435F1843b1912
9150C84114A13920b18045J04593H0301j6283d5674j17944a507j19354p3306A55872
9138A46451c8832A23346I887M6040j3962e7440j68747F082P0578f9989j34895
9127b04884e5793p0867o6516j74777I0930b61741o7576f2026q6834j3177I9919
9115F2761Q4803d9720k17360R7710P0532j38873B15436a99053M0243b3221A44012
9103C2941R0555F1357a39256o8467h0887o3161B38550j3340F8246e17364b5624
9091A56893b62068A91292a74341k29806a37294A81674a98028g9274G7383a52650
$$ y = [-183195, 155527, -89312, -281274, -135320, -249103, -33566, -163725, -78479, -243899, -40788, 219811, -52210, 191008, -159179, -211975, -225545, -175786, -128532, -93939, -149374, 61843, -21912, 384114, 113920, -218045, -113452, 80301, 64018, -45674, -163618, -1507, -120861, -194167, 155872, 146451, -38832, 123346, 9887, 55927, 41965, -57440, -226187, 6082, 76660, -69989, -204884, -55793, -126660, -193176, -367953, 90930, -261741, -329317, -62026, -148860, -162037, 99919, 62761, 147564, -49720, -267080, -169370, -98838, -237711, 215436, -199053, -158810, -23221, 144012, 32941, 123496, 61357, -139256, -207723, -80887, -144048, 238550, 225210, 68246, -517364, -25624, 156893, -262068, 191292, -174341, -404147, -137294, 181674, -198028, -79274, 77383, -152650]
9080E312b72905I4327L04391b44912i491B07924m0264a88049l38881i0995I373
9068a90500B34406b51525I1100c29631P9091M4200p1061A85695d0665p8737b278
9056D4594a19027B85008c58035B67757a211H8056c2380k51496D4014K20479G579
9044A03368b8706k3967r1137c5553q1162n0323E3480f9173F2493R7687b06280
9032B3956b41696r8491E7044g7231J5123l51945d7752C90J44326b96716i9678
9020A62265h2843a7779k158A35015a45054o0501d7756J2284A37545c12807h6637
9008B71400a98130i4731k44653g6474F2365g7249k59887A97931r2500e9041I9777
8996A85853A83L3588J46415A2471P1793i9841j09663j70023I7390B6770c45281
$$ y = [5312, -272905, 94327, 398718, -244912, -9491, 207924, 167660, -188049, -526930, -90995, 9373, -190500, 234406, -251525, 91100, -329631, -250540, -206340, -277401, 185695, -40665, -119402, -2278, 44594, -119027, 285008, -358035, 267757, -1211, 88056, -32380, -283876, 44014, 264493, 7579, 103368, -28706, -52673, -143810, -35553, -116715, -167038, 53480, -69173, 62493, 160180, -206280, 23956, -241696, -340187, 57044, -77231, -62108, -414053, -47752, 390, 144716, -296716, -99678, 162265, -82843, -17779, -19937, 135015, -145054, -205555, -47756, -35472, 137545, -312807, -86637, 271400, -198130, -94731, -339384, -76474, 62365, -77249, -337136, 197931, 105431, -59041, 99777, 185853, 183, 33771, 180186, 12471, 84264, -99841, -209504, -379527, 97390, 26770, -345281]
8984b84515B39313h6304N915c6199m2168p7A6403b4352k57049A66025Q6283p1453
8972A80855a20194r9396M2106p3073j00047f7842o7264A09533E0609K5435O0796
8961A36840C5883b77396C14862g5572b8952D950e5187j65301N6017M215L1470
8950a28786j17922A31352P2372J21887A56104p71i8146A02853M2413a13141E5214
8938b07811h4711j49582A40119e32331A5968L0726b6474A14146m1783E620L6634
8927D2254b88942a21597B14188H7120c40810A9434O8342g5631B02620Q4264K17889
8916E04773G9033N4426e7435p7616K1276E0306c4866G6184b24334C2994K3126
8905E6120e6566A28118A0764L9299f4157B24716a90070O0272o1271A86508c36004
$$ y = [-284515, 239313, -86304, -80389, -36199, -78367, -78444, 16403, -24352, -281401, 166025, 252308, 180855, -120194, -219590, -177484, -250557, -350604, -67842, -135106, 109533, 50609, 76044, 136840, 35883, -277396, 314862, -75572, -28952, 4950, -55187, -220488, -164471, -160256, -128786, -246708, 131352, 203724, 325611, 156104, 155333, -98146, 102853, 145266, -113141, 55214, -207811, -84711, -234293, 140119, -532331, 15968, 46694, -26474, 114146, 72363, 5620, 42254, -288942, -121597, 214188, 87120, -340810, 19434, 87776, -75631, 202620, 286884, 504773, 79033, 133459, -57435, -135051, -113775, 50306, -34866, 76184, -224334, 32994, 56120, -56566, 128118, 10764, 50063, -64157, 224716, -190070, -129798, -191069, 186508, -336004]
8893a15782p4447d5500A63230d57377a99539A87726a06815j28756E40979a11836
8882B14489p5938a89399B8804a82355A47841b57758A47922a46010n7455q0516
8872b83981i1365C2655J27277E6142Q0054a36135q5562a06190B0448d17733a58249
8860B25029a18412C9101d274m92548J99556g9134D740A764N0268K55711b46407
8848D4160b56466B07013Q0874l5119d39017B14466I3111L4483c13963A21807a69294
$$ y = [-115782, -190229, -45500, 163230, -457377, -199539, 187726, -106815, -235571, 540979, -111836, 214489, 138551, -189399, 28804, -182355, 147841, -257758, 147922, -146010, -203465, -283981, -91365, 32655, 159932, 56142, 136196, -136135, -221697, -106190, 20448, -417733, -158249, 225029, -118412, 39101, -4274, -496822, -297266, -79134, 4740, 1764, 52032, 307743, -246407, 44160, -256466, 207013, 287887, 252768, -439017, 214466, 93111, 127594, -313963, 121807, -169294]
$$ [...]
##END NTUPLES=NMR SPECTRUM
##END=
