##TITLE=NES1028_10332_9268290_OmHLmCDfxT
##JCAMPDX= 6.0         $$ Bruker NMR JCAMP-DX V2.0
##DATA TYPE= NMR SPECTRUM
##DATA CLASS= NTUPLES
##ORIGIN= BRUKER
##OWNER= Administrator
$$ 1.72 TOPSPIN		Version 2.1
$$ 2015-07-11 14:54:14.972 -0700  Administrator@X
$$ Compression mode = diff/dup
##.OBSERVE FREQUENCY= 400.02188249412
##.OBSERVE NUCLEUS= ^1H
##.ACQUISITION MODE= SIMULTANEOUS (DQD)
##.ACQUISITION SCHEME= undefined
##.AVERAGES= 64
##.DIGITISER RES= 22
##SPECTROMETER/DATA SYSTEM= spect
##.PULSE SEQUENCE= noesygpps1d.comp
##.SOLVENT NAME= COFFEE_meoh
##.SHIFT REFERENCE= INTERNAL, COFFEE_meoh, 1, 14.96342
##AUDIT TRAIL= $$ (NUMBER, WHEN, WHO, WHERE, PROCESS, VERSION, WHAT)
$$ ##TITLE= Audit trail, TOPSPIN		Version 2.1
$$ ##JCAMPDX= 5.01
$$ ##ORIGIN= Bruker BioSpin GmbH
$$ ##OWNER= Administrator
$$ $$ E:\/data/COFFEE/nmr/NES1028_10332_9268290_OmHLmCDfxT/22/pdata/1/auditp.txt
$$ ##AUDIT TRAIL=  $$ (NUMBER, WHEN, WHO, WHERE, PROCESS, VERSION, WHAT)
(   1,<2015-07-11 14:54:09.394 -0700>,<Administrator>,<X>,<go>,<TOPSPIN 2.1>,
      <created by zg
	started at 2015-07-11 14:42:39.831 -0700,
	POWCHK enabled, PULCHK disabled,
       configuration hash MD5:
       21 0F 79 D6 B3 7B B4 F6 88 20 88 DB 03 48 BD 9F
       data hash MD5: 64K
       59 92 96 53 85 70 63 94 83 71 BA E6 5A 3D 8A 99>)
(   2,<2015-07-11 14:54:12.831 -0700>,<Administrator>,<X>,<proc1d>,<TOPSPIN 2.1>,
      <Start of raw data processing
       efp LB = 0.3 FT_mod = 6 PKNL = 1 PHC0 = 0 PHC1 = 0 SI = 128K 
       data hash MD5: 128K
       A2 0E BB DF 34 EF F0 31 65 93 73 39 E8 8B 99 BC>)
(   3,<2015-07-11 14:54:13.738 -0700>,<Administrator>,<X>,<proc1d>,<TOPSPIN 2.1>,
      <pk PHC0 = -85.04517 PHC1 = 0 
       data hash MD5: 128K
       63 32 3A 6F 4E A3 F3 5C C7 A2 10 94 5E 5F B7 39>)
(   4,<2015-07-11 14:54:14.128 -0700>,<Administrator>,<X>,<proc1d>,<TOPSPIN 2.1>,
      <abs ABSG = 1 
       data hash MD5: 128K
       13 1F A9 44 0F E7 81 50 E3 4D 1F A3 F5 C5 2E D4>)
(   5,<2015-07-11 14:54:14.222 -0700>,<Administrator>,<X>,<proc1d>,<TOPSPIN 2.1>,
      <abs ABSG = 2 
       data hash MD5: 128K
       00 3A 5C C5 CC 01 B2 05 51 56 BC 18 40 AE A6 81>)
(   6,<2015-07-11 14:54:14.300 -0700>,<Administrator>,<X>,<proc1d>,<TOPSPIN 2.1>,
      <abs ABSG = 3 
       data hash MD5: 128K
       00 0C 06 9D E5 FA F9 64 DE 2A 26 4F 9E FE C1 50>)
(   7,<2015-07-11 14:54:14.394 -0700>,<Administrator>,<X>,<proc1d>,<TOPSPIN 2.1>,
      <abs ABSG = 4 
       data hash MD5: 128K
       98 4B AF EC 8B 5B 69 9F 22 16 DE 09 37 F3 16 0C>)
(   8,<2015-07-11 14:54:14.488 -0700>,<Administrator>,<X>,<proc1d>,<TOPSPIN 2.1>,
      <abs ABSG = 5 
       data hash MD5: 128K
       75 53 78 9D CF 1F D8 28 D5 63 B2 D5 C1 BF D1 33>)
$$ ##END=
$$ 
$$ $$ hash MD5
$$ $$ A7 0D 83 11 33 BA AD B3 BE AD F4 01 E1 F2 98 65
##$RELAX= 
##$RELAX= 
##$RELAX= 
##$RELAX= 
##$RELAX= 
##$RELAX= 
##$RELAX= 
##$RELAX= 
$$ Bruker specific parameters
$$ --------------------------
##$DU= <E:\>
##$EXPNO= 22
$$ [...]
##$TP07= 0
##$TPNAME0= <>
##$TPNAME1= <>
##$TPNAME2= <>
##$TPNAME3= <>
##$TPNAME4= <>
##$TPNAME5= <>
##$TPNAME6= <>
##$TPNAME7= <>
##$TPOAL= (0..7)
0.5 0.5 0.5 0.5 0.5 0.5 0.5 0.5
##$TPOFFS= (0..7)
0 0 0 0 0 0 0 0
##$TUNHIN= 0
##$TUNHOUT= 0
##$TUNXOUT= 0
##$USERA1= <user>
##$USERA2= <user>
##$USERA3= <user>
##$USERA4= <user>
##$USERA5= <user>
##$V9= 5
##$VALIST= <valist>
##$VCLIST= <CCCCCCCCCCCCCCC>
##$VD= 0
##$VDLIST= <DDDDDDDDDDDDDDD>
##$VPLIST= <PPPPPPPPPPPPPPP>
##$VTLIST= <TTTTTTTTTTTTTTT>
##$WBST= 2048
##$WBSW= 25
##$XGAIN= (0..3)
0 0 0 0
##$XL= 0
##$YL= 0
##$YMAX_a= 7368214
##$YMIN_a= -15676117
##$ZGOPTNS= <>
##$ZL1= 120
##$ZL2= 120
##$ZL3= 120
##$ZL4= 120
##$ABSF1= 14.96342
##$ABSF2= -5.594762
##$ABSG= 5
##$ABSL= 3
##$ALPHA= 0
##$AQORDER= 0
##$ASSFAC= 0
##$ASSFACI= 0
##$ASSFACX= 0
##$ASSWID= 0
##$AUNMP= <proc_prof1d_extract.lims>
##$AXLEFT= 0
##$AXNAME= <>
##$AXNUC= <1H>
##$AXRIGHT= 0
##$AXTYPE= 0
##$AXUNIT= <>
##$AZFE= 0.1
##$AZFW= 0.1
##$BCFW= 0
##$BC_mod= 0
##$BYTORDP= 0
##$COROFFS= 0
##$CY= 15
##$DATMOD= 1
##$DC= 0
##$DFILT= <>
##$DTYPP= 0
##$F1P= 0
##$F2P= 0
##$FCOR= 0.5
##$FTSIZE= 131072
##$FT_mod= 6
##$GAMMA= 0
##$GB= 0
##$INTBC= 1
##$INTSCL= 1
##$ISEN= 128
##$LB= 0.3
##$LEV0= 0
##$LPBIN= 0
##$MAXI= 10000
##$MC2= 0
##$MEAN= 0
##$ME_mod= 0
##$MI= 0
##$NCOEF= 0
##$NC_proc= -2
##$NLEV= 6
##$NOISF1= 0
##$NOISF2= 0
##$NSP= 0
##$NTH_PI= 0
##$NZP= 0
##$OFFSET= 14.96342
##$PC= 1
##$PHC0= -85.04517
##$PHC1= 0
##$PH_mod= 1
##$PKNL= yes
##$PPARMOD= 0
##$PPDIAG= 0
##$PPIPTYP= 0
##$PPMPNUM= 2147483647
##$PPRESOL= 1
##$PSCAL= 4
##$PSIGN= 0
##$PYNMP= <proc.py>
##$REVERSE= no
##$SF= 400.020008670609
##$SI= 131072
##$SIGF1= 0
##$SIGF2= 0
##$SINO= 400
##$SIOLD= 131072
##$SPECTYP= <>
##$SREGLST= <1H.CDCl3>
##$SSB= 0
##$STSI= 131072
##$STSR= 0
##$SW_p= 8223.68421052631
##$SYMM= 0
##$S_DEV= 0
##$TDeff= 65536
##$TDoff= 0
##$TI= <>
##$TILT= no
##$TM1= 0
##$TM2= 0
##$TOPLEV= 0
##$USERP1= <user>
##$USERP2= <user>
##$USERP3= <user>
##$USERP4= <user>
##$USERP5= <user>
##$WDW= 1
##$XDIM= 131072
##$YMAX_p= 401796038
##$YMIN_p= -11118
##$CURPLOT= <Network HP LaserJet P1505>
##$CURPRIN= <$Network HP LaserJet P1505>
##$DFORMAT= <normdp>
##$LAYOUT= <+/1D_H.xwp>
##$LFORMAT= <normlp>
##$PFORMAT= <normpl>
##$SURQMSG= 1
$$ End of Bruker specific parameters
$$ ---------------------------------
##NTUPLES= NMR SPECTRUM
##VAR_NAME=  FREQUENCY,     SPECTRUM/REAL,   SPECTRUM/IMAG
##SYMBOL=    X,             R,               I
##VAR_TYPE=  INDEPENDENT,   DEPENDENT,       DEPENDENT
##VAR_FORM=  AFFN,          ASDF,            ASDF
##VAR_DIM=   131072,        131072,          131072
##UNITS=     HZ,            ARBITRARY UNITS, ARBITRARY UNITS
##FACTOR=    0.0627417313425164, 1,          1
##FIRST=     8223.62146879497, 91,           -52176
##LAST=      0,             2958,            -52445
##MIN=       0,             -11118,          0
##MAX=       8223.62146879497, 401796038,    0
$$ Real data points
##PAGE= N=1
##DATA TABLE= (X++(R..R)), XYDATA
$$ [...]
67448 116835 117463 117657 117384 116714 115839 115229 115248 115634 115727 115273 114657 114362 114564 115241 116298 117449 118339 118852 119070
67429 119070 118911 118245 117446 117347 118359 119858 120798 120822 120529 120678 121341 121886 121764 121194 120962 121603 123008 124813
67411 124813 126749 128384 129002 128320 127123 126634 127231 128220 128810 128826 128453 127836 127127 126550 126242 126273 126817 127949
67393 127949 129251 130094 130427 130818 131575 132264 132362 132002 131737 131815 131998 131991 131870 132112 133137 134652 135608 135173 133732
67374 133732 132483 132101 132329 132863 133922 135594 137295 138368 138840 139104 139202 138956 138591 138728 139766 141541 143496
67357 143496 145047 146049 146998 148511 150385 151611 151601 150992 150806 151200 151620 151853 152258 153067 154097 155212 156483
67340 156483 157803 158763 159117 159020 158708 158309 158079 158499 159783 161467 162763 163321 163553 164199 165625 167487 169012
67323 169012 169567 169009 167696 166290 165438 165405 166008 167050 168699 171090 173680 175504 176211 176376 176582 176670 176232
67306 176232 175424 174876 175082 176149 177776 179106 179126 177752 176299 176256 177800 179950 181844 183230 184018 184267
67290 184267 184563 185606 187265 188746 189763 190788 191940 192531 192163 191572 191756 192748 193867 194771 195595 196306
67274 196306 196660 196771 197149 198091 199448 201036 202858 204750 206246 207045 207445 208027 208980 209898 210315 210358 210803
67257 210803 212413 215121 217967 219958 221023 221982 223518 225364 226683 227193 227546 228441 229646 230334 230292 230281
67241 230281 231031 232340 233592 234782 236465 238768 241025 242523 243221 243565 243947 244584 245610 246989 248431
67226 248431 249549 250114 250186 250189 250776 252238 253923 254740 254498 254394 255715 258313 260881 262611 264016 265996 268655
67209 268655 271320 273412 274869 275919 276848 277991 279600 281591 283569 285191 286360 287011 287051 286726 286835 288116
67193 288116 290396 292695 294291 295427 296814 298803 301291 304117 307061 309604 311229 312095 313017 314584 316560
67178 316560 318330 319641 320684 321667 322646 323701 325003 326697 328870 331591 334755 337923 340505 342251 343517
67163 343517 345006 347235 350147 353136 355484 356965 358103 359751 362321 365443 368374 370689 372514 374174
67149 374174 375772 377214 378564 380178 382367 385031 387764 390315 392793 395396 398103 400771 403442 406317
67135 406317 409455 412689 415876 419021 421994 424340 425750 426749 428575 432068 436820 441610 445581 448763
67121 448763 451574 454243 456900 459866 463483 467689 471968 475746 478768 481141 483186 485247 487594 490429
67107 490429 493912 498025 502380 506341 509509 512017 514321 516792 519614 522903 526729 531048 535759 540808
67093 540808 546144 551625 557042 562214 567028 571493 575797 580166 584666 589285 594212 599717 605626 611217
67079 611217 615853 619497 622467 625100 627923 631746 636947 642858 648370 653121 657629 662405 667461 672681
67065 672681 678063 683472 688637 693564 698525 703505 708158 712526 717347 723273 730102 737079 743701 749981
67051 749981 756144 762344 768524 774401 779775 784959 790577 796799 803154 809313 815647 822627 830000 837010
67037 837010 843244 848853 854126 859301 864745 870910 878031 886046 894746 903787 912721 921311 929731 938191
67023 938191 946455 954076 961044 967879 975085 982818 991106 1000045 1009583 1019321 1028617 1036922 1044092 1050565
67009 1050565 1057141 1064352 1072066 1079866 1087750 1096187 1105453 1115154 1124540 1133256 1141742 1150884 1161116 1171855
66995 1171855 1182025 1191289 1200493 1210671 1221847 1233098 1243549 1252948 1261515 1269802 1278595 1288384 1298824
66982 1298824 1309107 1318945 1328762 1338932 1349327 1359704 1369995 1380045 1389620 1398931 1408698 1419290
66970 1419290 1430212 1440814 1451073 1461230 1471108 1480441 1489630 1499442 1509986 1520575 1530677 1540396
66958 1540396 1549915 1559072 1567831 1576691 1586165 1596118 1606022 1615659 1625214 1634833 1644531 1654463 1664805 1675246
66944 1675246 1685023 1693720 1701767 1709841 1718012 1725824 1733140 1740501 1748546 1757355 1766511 1775531 1784069 1791908
66930 1791908 1799035 1805613 1811715 1817212 1822171 1827223 1833124 1839929 1846951 1853609 1859959 1866185 1871930 1876587
66916 1876587 1880168 1883447 1887158 1891297 1895341 1898881 1901812 1904089 1905679 1906824 1908071 1909770 1911649 1913130
66902 1913130 1914050 1914755 1915434 1915691 1915064 1913737 1912400 1911473 1910786 1909978 1908817 1907092 1904658 1901771 1899023 1896597
66886 1896597 1893885 1890202 1885693 1881161 1877158 1873651 1870460 1867443 1864130 1859757 1854015 1847487 1840944 1834506
66872 1834506 1827873 1821228 1815212 1809906 1804411 1797887 1790681 1783886 1777893 1771957 1765339 1758268 1751354 1744413
66858 1744413 1736551 1727397 1717701 1708515 1700166 1692242 1684203 1675685 1666525 1656927 1647458 1638543 1630015 1621456
66844 1621456 1612794 1604114 1595035 1584972 1574131 1563599 1554057 1544887 1535058 1524499 1514031 1504147 1494543
66831 1494543 1484869 1475286 1466038 1456939 1447635 1438082 1428435 1418670 1408578 1398085 1387289 1376303 1365258
66818 1365258 1354423 1344144 1334642 1325938 1317821 1309803 1301253 1291899 1282127 1272532 1263208 1253736 1243857
66805 1243857 1233831 1224049 1214588 1205317 1196170 1187064 1177779 1168284 1159081 1150830 1143544 1136406 1128520 1119690
66791 1119690 1110380 1101130 1092171 1083474 1074939 1066551 1058457 1050826 1043552 1036203 1028477 1020622 1013133 1006042
66777 1006042 998824 991097 983079 975132 967178 958946 950630 942815 935689 928780 921622 914361 907458 901050
66763 901050 894905 888843 882894 877031 870985 864368 856943 848850 840698 833299 827113 821898 816983 811808
66749 811808 806168 800136 793950 787876 781955 775956 769735 763529 757679 752151 746584 740775 734913 729403
66735 729403 724640 720785 717431 713629 708714 703076 697632 692509 686855 680229 673535 668113 664193 660782
66721 660782 656893 652378 647638 643052 638821 635030 631531 627909 623736 618939 613901 609188 605094 601427
66707 601427 597795 594091 590544 587318 584267 581143 577815 574124 569752 564533 558852 553606 549673 547248
66693 547248 545502 543049 539173 534631 530807 528005 525094 521045 516147 511298 506762 502361 498412 495540
66679 495540 493631 491739 489138 485863 482238 478484 474896 471750 468874 465829 462619 459698 457201 454837
66665 454837 452682 451267 450497 449241 446602 443042 439639 436757 434133 431825 430122 428662 426593 423719
66651 423719 420736 418088 415316 411906 408212 405005 402430 399976 397392 395063 393363 392020 390400 388254
66637 388254 385922 383813 381854 379585 376632 373039 369249 365879 363426 361931 360916 359773 358237 356443
66623 356443 354646 353083 351981 351335 350621 349100 346587 343674 341072 338982 337238 335694 334163 332278 329846
66608 329846 327270 325214 323853 322757 321553 320451 319973 320335 321138 321593 321049 319413 317108 314670 312451
66593 312451 310649 309326 308282 307135 305723 304217 302706 300958 298936 297272 296738 297277 298010 298198 297801
66578 297801 297001 295674 293594 290893 288048 285544 283743 282881 282920 283441 283869 283831 283256 282250 280995 279713
66562 279713 278552 277447 276167 274611 273031 271885 271349 271020 270201 268581 266534 264722 263520 262832 262305
66547 262305 261577 260495 259261 258312 257866 257645 257189 256342 255246 253993 252508 250742 248749 246591 244371 242354
66531 242354 240836 239871 239225 238647 238034 237402 236803 236223 235450 234161 232329 230429 229014 228182 227664 227271 226921
66514 226921 226393 225503 224522 223967 223881 223653 222681 220926 218788 216784 215383 214710 214237 213132 211096 208595 206212
66497 206212 204190 202742 202176 202304 202214 201228 199840 199112 199277 199484 198945 197876 197103 197081 197457 197472 196708 195477
66479 195477 194487 194093 194038 193931 193675 193257 192480 191248 189867 188633 187391 185968 184844 184690 185265 185495 184881
66462 184881 184167 184199 184680 184632 183784 182830 182358 182145 181656 180763 179699 178616 177542 176642 176149 176006 175806 175262
66444 175262 174576 174151 174009 173722 173002 172220 172163 173268 175134 176758 177253 176415 174766 173076 171790 170870 170096
66427 170096 169371 168747 168320 168248 168748 169807 170905 171260 170549 169325 168532 168560 168872 168662 167819 167035 166976 167541 168082
66408 168082 168161 167783 167042 165909 164463 162984 161661 160445 159285 158226 157158 155837 154398 153491 153476 153749
66392 153749 153372 152265 151236 150901 151081 151338 151520 151521 150985 149726 148188 147041 146402 145823 144996 144084 143331 142741
66374 142741 142307 142276 142852 143724 144198 143856 142878 141712 140623 139732 139231 139249 139560 139695 139423 138929 138469 138039 137452
66355 137452 136556 135322 133896 132627 131832 131414 130928 130111 129224 128751 128973 129867 131130 132186 132518 132183 131768
66338 131768 131658 131672 131611 131682 132038 132286 131999 131334 130631 129756 128511 127388 127068 127276 127065 126326 126127 127212 128963
66319 128963 130264 130760 130762 130516 130161 129967 129996 129797 128978 127902 127282 127221 127145 126597 125722 125009 124895 125528 126583
66300 126583 127355 127303 126502 125375 124135 122754 121315 120101 119375 119246 119615 120060 120066 119677 119668 120569 121690 121683 120105
66281 120105 117979 116651 116519 116973 117226 116924 116247 115685 115584 115730 115509 114639 113587 113031 112949 112529 111135 109196
66263 109196 107897 107921 108775 109516 109944 110725 112396 114670 116823 118373 119158 119078 118152 116674 115056 113562 112332
66246 112332 111446 110784 110035 109084 108206 107641 107136 106174 104540 102506 100667 99763 100317 102077 104013 105224 105676
66229 105676 105825 105866 105725 105481 105270 105008 104691 104658 105016 105094 104235 102940 102386 102846 103446 103536 103389 103298 102987 102414
66209 102414 102307 103158 104284 104690 104441 104388 104807 105115 104928 104615 104587 104607 104118 102932 101352 99809 98650 98136
66191 98136 98355 99038 99635 99743 99505 99443 99844 100434 100751 100650 100290 99784 99166 98534 97965 97372 96763 96484 96803
66172 96803 97353 97452 96955 96246 95435 94217 92741 91938 92541 94109 95444 95761 95249 94711 94849 95671 96473 96664
66154 96664 96535 96851 97719 98455 98597 98349 97900 97089 96071 95470 95417 95240 94651 94407 95023 95672 95361 94525 94253
66135 94253 94431 93994 92815 91922 91744 91506 90775 90368 91008 91996 92092 91164 90209 90061 90725 91774 92802 93463
66117 93463 93482 92792 91660 90666 90451 91222 92516 93619 94181 94150 93397 91951 90508 90011 90555 91252 91337 90841
66099 90841 90034 88924 87724 87119 87492 88264 88583 88371 88190 88318 88503 88509 88402 88350 88515 89095 90128 91248 91942
66080 91942 92026 91694 91221 90816 90581 90344 89715 88620 87559 86991 86693 86219 85801 86089 87010 87606 87287 86605 86332
66061 86332 86313 85885 85075 84586 84645 84670 84309 84095 84595 85412 85649 85009 83867 82550 81287 80742 81581 83293 84297
66042 84297 83687 82194 80963 80155 79480 79330 80284 81835 82802 82998 83421 84625 85902 86459 86524 86747 87169 87363
66024 87363 87111 86465 85517 84572 84140 84326 84549 84313 83943 84102 84819 85440 85346 84400 82930 81659 81439 82601
66006 82601 84589 86509 87936 89016 90079 91409 93126 94946 96308 96995 97334 97528 97218 96132 94785
65991 94785 93915 93510 92942 91861 90406 88782 87280 86538 86991 88083 88714 88527 88099 87787 87217 86174 85190
65974 85190 84725 84318 83187 81376 79729 78898 78848 79281 80029 80955 81804 82339 82485 82281 81848 81487 81654 82606
65956 82606 84005 85060 85237 84803 84497 84690 85136 85555 86034 86624 86908 86383 85124 83681 82455 81534 81017
65939 81017 81053 81574 82412 83635 85358 87220 88501 88849 88435 87360 85528 83396 82195 82759 84375 85420
65923 85420 85121 84199 83705 83764 83780 83547 83603 84403 85588 86425 86742 86980 87390 87668 87556 87290 87097 86659 85631
65904 85631 84439 83919 84196 84504 84197 83451 82797 82451 82359 82541 83006 83500 83592 83050 82093 81328 81344 82132 83017 83426
65884 83426 83612 84201 85124 85534 84905 83740 82947 82926 83463 84110 84399 84025 83113 82106 81200 80254 79436 79493 80918
65865 80918 83115 84831 85260 84425 82759 80811 79258 78649 78919 79409 79473 79009 78394 78037 78033 78189 78361 78654
65847 78654 79163 79674 79909 79977 80175 80350 79989 79071 78267 78033 78077 78114 78538 79705 80988 81410 81082 81271 82896
65828 82896 85484 87752 88865 89056 89265 90178 91347 91395 89441 86242 83534 82394 82649 83666 85036 86464
65812 86464 87681 88734 89883 91035 91670 91514 90861 90073 89233 88445 87943 87583 86755 85291 84049 84061 85272
65795 85272 86629 87309 87372 87248 87105 86865 86525 86228 86146 86386 86953 87712 88417 88735 88326 87113 85583 84638 84896
65776 84896 86164 87752 89169 90340 91244 91659 91344 90296 88770 87177 85964 85390 85287 85136 84538 83615
65760 83615 82869 82641 82786 82879 82664 82148 81325 80033 78264 76485 75395 75302 75896 76649 77241 77543 77438 76903
65742 76903 76185 75677 75552 75597 75426 74867 74130 73628 73594 73922 74375 74812 75105 75041 74630 74405 74925 75855 76050 74908
65722 74908 73284 72505 72675 72596 71470 70068 69806 70994 72517 73200 73035 72892 73358 74234 75125 76037 77137
65705 77137 78159 78529 78110 77439 77026 76705 75908 74403 72484 70596 69055 68044 67571 67440 67522 68030 69231
65688 69231 70918 72447 73383 73850 74232 74835 75810 77038 77909 77694 76398 74968 74324 74402 74446 73997 73256 72658
65670 72658 72465 72651 72836 72478 71543 70854 71257 72464 73299 73174 72722 72708 72881 72383 70936 69191 68042 67975
65652 67975 68880 70128 70945 71072 71013 71309 71755 71741 71249 70974 71362 72011 72312 72301 72552 73376 74438 75137 75176 74748
65632 74748 74287 74072 74017 73844 73384 72705 72031 71643 71701 72043 72283 72348 72695 73716 75036 75819 75686 74889 73658
65613 73658 72063 70621 70238 71036 71825 71448 70255 69547 69811 70268 70148 69609 69158 68859 68485 68051 67746 67606
65595 67606 67567 67658 67828 67783 67327 66772 66671 67139 67673 67709 67202 66534 65986 65476 64896 64562 64972 66007 66672 66065
65575 66065 64524 63364 63389 64133 64733 65009 65272 65431 64963 63705 62148 60825 59827 59131 59037 59925 61648 63428
65557 63428 64430 64422 63911 63661 64049 64845 65556 65850 65617 64885 63925 63310 63475 64221 64945 65356 65630 65841 65726
65538 65726 65210 64702 64480 64127 63102 61662 60629 60304 60191 59903 59805 60484 61944 63674 65238 66495 67440
65521 67440 68141 68743 69314 69761 70109 70698 71860 73450 74915 75752 75774 75088 74079 73285 73008 73105 73389 74090
65503 74090 75540 77493 79207 80240 80752 80926 80630 79942 79587 80378 82391 84978 87447 89385 90520 90751
65487 90751 90384 90032 90173 90943 92289 93982 95423 95854 95049 93705 92890 93171 94423 96326 98700 101299
65471 101299 103664 105496 107079 108959 111195 113254 114759 116021 117510 119044 119907 119757 118998 118155 117219
65456 117219 115772 113521 110550 107246 104109 101480 99262 97020 94475 91784 89259 87035 85179 83913
65442 83913 83436 83550 83662 83200 82002 80371 78802 77552 76462 75324 74335 73863 73802 73561 72877 72207 72035
65425 72035 72144 71957 71267 70250 69063 67935 67413 67919 69159 70469 71686 73108 74692 75954 76768 77586
65409 77586 78598 79254 79006 78050 76945 75875 74804 74050 74119 75019 76205 77285 78409 79832 81404 82715
65393 82715 83651 84611 86093 88105 90048 91247 91577 91549 91825 92709 94050 95520 97049 99095 102450 107518
65377 107518 113765 120085 125773 131064 136741 143453 151362 160151 169151 177599 184928 190817 195014 197261
65363 197261 197420 195516 191698 186365 180275 174256 168702 163559 158766 154399 150341 146214 141856 137603
65349 137603 133852 130572 127453 124354 121407 118895 117139 116306 116070 115733 114904 113932 113428 113560 114060 114708
65333 114708 115442 116093 116382 116195 115566 114411 112575 110179 107624 105178 102690 99867 96712 93611 91066
65318 91066 89346 88312 87523 86562 85260 83672 81934 80235 78828 77887 77351 76965 76491 75832 74972 73857
65302 73857 72369 70533 68768 67788 68037 69203 70488 71308 71608 71534 71139 70480 69753 69194 68972 69133 69446 69387
65284 69387 68671 67772 67501 68039 68863 69707 70914 72603 74147 74994 75409 75788 75731 74567 72517 70564 69248
65267 69248 68285 67350 66564 66166 66252 66918 68099 69230 69647 69419 69228 69322 69215 68641 68153 68408 69318 70332 71170
65248 71170 71885 72531 73127 73770 74424 74821 74853 74858 75244 76023 76937 77758 78235 78060 77318 76711 76856 77447 77534 76628
65228 76628 75117 73641 72518 71889 71919 72493 72965 72587 71207 69388 67869 67053 66933 67200 67326 66835 65812
65211 65812 65042 65285 66315 67017 66609 65489 64614 64316 64139 63607 62680 61470 60082 58815 58115 58074 58351 58738
65193 58738 59440 60550 61615 62045 61779 61294 61130 61556 62406 63046 62832 61917 61262 61480 62017 61976 61507 61697 63067
65174 63067 64759 65406 64419 62320 60232 59213 59644 60890 61758 61631 61046 60972 61635 62302 62173 61210 60020
65157 60020 59117 58501 57925 57340 56920 56730 56682 56887 57741 59350 61059 61950 61795 61183 60692 60354 60075 60135 60849
65138 60849 61958 62820 63171 63368 63749 64097 63925 63120 62094 61404 61374 62071 63364 64880 66025 66317 65801 65053
65120 65053 64726 65089 66023 67292 68716 70204 71805 73717 76026 78402 80241 81270 81822 82370 82933 83212
65104 83212 83257 83647 84906 86992 89569 92522 95883 99383 102502 105103 107714 110919 114616 118118 120886
65089 120886 122972 124754 126479 128142 129650 130923 131837 132236 132095 131675 131379 131242 130622 128628 125017 120480
65073 120480 115897 111529 107168 102841 98905 95466 92219 89001 86051 83479 80887 77997 75380 73976
65059 73976 73865 74025 73504 72473 71802 71864 72081 71624 70244 68352 66529 65116 64174 63664 63594 64000 64737 65321
65041 65321 65170 64174 62923 62158 62039 62137 62105 62044 62155 62370 62523 62562 62336 61512 60075 58694 58079 58100 58040 57699
65021 57699 57644 58246 59072 59525 59631 59783 60010 59989 59585 58978 58301 57510 56625 55885 55572 55777 56323 56895 57410 58221
65001 58221 59645 61267 62147 62005 61709 62167 63124 63619 63428 63364 64117 65402 66414 66691 66331 65738 65389 65594
64983 65594 66300 67199 67978 68303 67770 66314 64632 63681 63617 63675 63223 62480 61974 61753 61478 60968 60335 59795 59649
64964 59649 60199 61393 62716 63651 64088 64127 63760 63035 62207 61465 60751 60140 60027 60562 61236 61482 61409 61420 61358 60712
64944 60712 59568 58665 58505 58980 59881 61059 61996 61974 61040 60159 60036 60310 60358 60281 60524 60989 61243 61365 61794
64925 61794 62483 62897 62878 62857 63080 63228 63056 62892 63214 64074 65208 66356 67177 67165 66045 64168 62232 60732
64907 60732 59841 59615 59924 60307 60242 59660 59023 58855 59297 60083 60761 60984 60784 60577 60721 61028 60902 60060 58996
64888 58996 58567 59133 60185 60881 60881 60586 60537 60741 60739 60253 59503 58849 58368 57935 57474 56925 56154 55251 54770 55296
64868 55296 56717 58229 59191 59713 60220 60698 60677 59893 58719 57834 57621 57941 58409 58751 58904 58948 59058 59402 59910
64849 59910 60195 60010 59786 60362 61966 63750 64596 64214 63202 62261 61743 61722 62019 62132 61649 60767 60058 59694
64831 59694 59402 59179 59449 60301 61177 61671 62102 62840 63536 63641 63361 63413 63948 64355 64124 63381 62515 61778 61335
64812 61335 61221 61102 60522 59592 59093 59656 61048 62422 63053 62791 62079 61711 62247 63461 64551 65033 65173 65438
64794 65438 65841 66154 66436 66923 67505 67732 67355 66608 65861 65284 64911 64848 65214 65922 66661 67129 67261 67177 66955 66566
64774 66566 66110 65920 66184 66542 66407 65748 65218 65322 65819 66192 66384 66654 66957 66964 66694 66600 66916 67362 67643 67836
64754 67836 68012 67858 67035 65733 64492 63617 63070 62838 62985 63355 63656 63915 64542 65709 66990 67855 68324 68847
64736 68847 69602 70204 70119 69233 67947 66810 66059 65486 64821 64231 64229 64987 66003 66719 67192 67791 68385 68386 67663 66888
64716 66888 66743 67154 67626 67993 68436 68954 69207 68888 68003 66823 65709 64954 64643 64697 65078 65756 66458 66801 66864
64697 66864 67250 68255 69352 69926 70175 70703 71471 71862 71693 71427 71314 71131 70949 71376 72592 73789 74131 73797
64679 73797 73557 73785 74418 75410 76473 76704 75374 73146 71684 71863 72945 73717 73839 73731 73678 73628 73623 73923 74624
64660 74624 75415 75811 75531 74710 73776 73104 72741 72496 72234 71926 71503 70903 70322 70114 70314 70436 69923 68687 67102
64641 67102 65657 64760 64687 65462 66745 68014 68851 69060 68618 67670 66546 65639 65187 65161 65341 65595 66170 67563
64623 67563 69847 72165 73259 72716 71400 70427 70006 69614 69071 68898 69543 70680 71492 71434 70590 69445 68515
64606 68515 68122 68349 69139 70297 71400 71918 71679 71145 70958 71239 71623 71947 72451 73160 73540 73088 72017 70950
64588 70950 70194 69671 69465 69879 70887 71900 72254 71714 70420 68658 66862 65576 65117 65336 65853 66476 67194
64571 67194 67909 68421 68747 69181 69924 70763 71317 71517 71696 72131 72732 73267 73743 74314 74831 74816 73960 72512 71025
64552 71025 69922 69401 69566 70397 71709 73240 74690 75576 75445 74493 73643 73507 73550 72882 71734 71322 72132 73157
64534 73157 73270 72644 72164 71952 71331 70119 69106 69029 69587 69789 69000 67392 65541 63849 62399 61315 61048
64517 61048 62028 63970 65831 66712 66683 66516 66803 67592 68598 69447 69813 69730 69691 70142 70984 71833 72569 73160 73168 72091
64497 72091 70221 68544 67637 67193 66829 66742 67209 67924 68328 68360 68443 68896 69650 70423 70907 70923 70606 70308 70158 69904
64477 69904 69389 68920 68928 69471 70329 71369 72454 73181 73144 72434 71580 71001 70746 70710 70724 70516 69908 69183 68960 69555
64457 69555 70627 71522 71831 71598 71209 71199 71952 73311 74541 74919 74449 73846 73669 73591 72789 71089 69378 68661
64439 68661 68962 69520 69912 70489 71627 73020 73968 74070 73431 72453 71679 71638 72545 74132 75846 77092 77358 76465
64421 76465 74837 73236 72098 71354 70910 70832 70926 70732 70282 70305 71201 72284 72625 72253 71794 71317 70358 69000
64403 69000 68076 68178 69087 70256 71244 71617 71123 70178 69611 69724 70113 70572 71457 72910 74393 75454 76376 77539
64385 77539 78656 79198 79210 79061 78716 77963 77195 77213 78127 79035 78996 77989 76743 75943 75728 75724 75344 74239 72658
64366 72658 71315 70809 71178 72026 72954 73802 74573 75294 76025 76918 78077 79333 80321 80958 81670 82897 84452
64349 84452 85673 86203 86297 86332 86444 86738 87472 88710 90089 91228 92215 93472 95272 97587 100183 102641 104519
64332 104519 105760 106739 107655 108126 107733 106684 105536 104414 103057 101488 100104 98988 97706 95983 94174
64317 94174 92761 91681 90446 88795 86994 85652 85337 86191 87710 89022 89569 89488 89295 89359 89770 90484 91328
64300 91328 91959 92111 91921 91856 92277 93130 94088 94845 95346 95856 96881 98866 101808 105161 108219 110586 112289
64283 112289 113566 114639 115709 116939 118360 119896 121510 123237 124915 126098 126460 126244 126077 126359 127017
64268 127017 127749 128106 127390 125009 121266 117455 114773 113305 112361 111537 111019 111020 111472 112306 113546 114893 115643
64251 115643 115312 114203 113114 112569 112524 112756 113345 114667 116896 119556 121763 123056 123846 124847 126184 127402
64235 127402 128303 129284 130676 132143 133091 133451 133712 134284 135189 136312 137610 138941 139913 140109 139378 137902 136072
64218 136072 134392 133348 133145 133504 133865 133948 134150 135281 137835 141530 145534 149018 151408 152396 152064 151016
64202 151016 150026 149347 148594 147502 146604 146795 148271 150221 151678 152398 152753 153011 153044 152747 152403 152420 152804 153098
64184 153098 152870 152202 151647 151716 152451 153472 154406 155206 155973 156587 156741 156488 156493 157452 159278 161222 162848 164538
64166 164538 166924 170160 174049 178557 183747 189407 195262 201557 208910 217419 226321 234892 243425 252932
64152 252932 263929 275828 287570 298633 309169 319169 327702 333338 335430 334664 332121 328076 322228
64139 322228 314892 307167 299669 291790 282734 272778 262930 253678 244838 236459 229017 222614 216733 211114
64125 211114 206214 202305 198725 194694 190568 187485 185761 184410 182539 180607 179821 180557 181899 182679 182568
64110 182568 182077 181872 182307 183411 184971 186615 188033 189262 190735 192951 196100 200018 204449 209229 214254
64095 214254 219418 224693 230179 235880 241432 246220 249880 252540 254516 255935 256825 257367 257712 257629 256668 254806
64079 254806 252556 250254 247564 243984 239656 235317 231583 228634 226481 225126 224356 223823 223502 223755 224724
64064 224724 225900 226623 226876 227317 228556 230644 233209 235879 238512 241213 244277 248064 252786 258308 264158
64049 264158 269849 275344 281148 287779 295194 302955 310946 319590 329201 339436 349660 359668 369736
64036 369736 380074 390507 400619 409936 418117 425337 432471 440452 449313 458164 466202 473451 480389
64023 480389 487218 493763 499777 504969 508850 510975 511325 510247 508030 504835 501047 497379 494424 492277
64009 492277 490749 489882 490083 491795 495124 499831 505591 512240 519791 528253 537510 547455 558271 570467
63995 570467 584519 600409 617606 635578 654359 674574 696928 721696 748693 777584 808228
63984 808228 840865 876098 914584 956569 1001799 1050120 1102140 1159033 1221684 1290359 1365427
63973 1365427 1448096 1540116 1642919 1757593 1885893 2031047 2197344 2388979 2609415 2861818
63963 2861818 3150037 3479072 3854400 4280530 4759949 5293052 5878487 6513068 7191562
63954 7191562 7907300 8653336 9422561 10206152 10991835 11763693 12503325 13191235 13808277
63945 13808277 14337718 14767212 15089081 15298731 15392996 15369757 15228310 14969665 14597088 14117440
63935 14117440 13542379 12888091 12173512 11418185 10640373 9855578 9076036 8311706 7571853
63926 7571853 6865534 6200711 5583360 5017511 4505441 4047298 3640823 3282111 2966860
63917 2966860 2690936 2450139 2240075 2056500 1895670 1754346 1629744 1519564 1421895 1334917
63907 1334917 1256761 1185734 1120656 1060976 1006515 956981 911548 868961 828228 789220 752464
63896 752464 718244 686049 654983 624604 595233 567464 541556 517346 494600 473210 453051
63885 453051 433919 415766 398818 383203 368647 354859 342099 330855 320951 311538 302233 293671
63873 293671 286471 280167 273790 267208 261148 256008 251416 247011 242965 239513 236564 234080 232318 231327
63859 231327 230634 229778 228831 228136 227871 228144 229048 230278 231120 231267 231290 231780 232341 232018 230437 227956 224902 221407
63841 221407 217902 214974 212528 209735 206112 202161 198641 195598 192414 188550 183991 179197 174795 171105
63827 171105 167825 164372 160617 157026 154034 151630 149675 148180 147045 145864 144410 143009 142133 141726 141206
63812 141206 140002 137926 135272 132816 131453 131445 132083 132386 132031 131361 130643 129693 128251 126388 124420 122591
63796 122591 120898 119206 117514 116097 115214 114618 113650 111999 110126 108700 107845 107224 106620 106025 105370 104661
63780 104661 104333 104953 106478 108217 109588 110552 111225 111518 111372 110986 110539 109956 109196 108523 108228 108240 108288 108362 108726
63761 108726 109478 110318 110834 110975 111165 111945 113419 115117 116459 117335 118084 119031 120364 122412 125601 129896
63745 129896 134606 139078 143418 148275 154086 160853 168524 177132 186511 196183 205764 215324 225217 235608
63731 235608 246246 256598 266087 274245 280677 284949 286596 285381 281602 276038 269504 262422 254810 246545
63717 246545 237605 228159 218584 209371 200871 193086 185800 178992 172945 167811 163199 158533 153844 149894
63703 149894 147341 146019 145304 144976 145340 146550 148278 150169 152293 154923 158035 161331 164639 168059 171717
63688 171717 175635 179916 184908 190992 198255 206522 215654 225583 235900 245737 254389 261975 269025 275380
63674 275380 279991 281977 281381 278564 273416 265830 256619 247117 237881 228464 218564 208742 199817 192132
63660 192132 185693 180415 175931 171702 167747 164808 163332 162686 161859 160662 159771 159889 161282 163866 167168
63645 167168 170424 173266 176245 180163 184993 189964 194667 199576 205470 212770 221455 231166 241385 251937
63631 251937 263294 275947 289507 302943 315734 328200 340586 352427 363061 372158 379343 383792
63619 383792 384865 383008 379594 375889 372406 369140 366150 363844 362722 362822 363500 363967 363910 363253 361374 357239
63603 357239 350650 342886 335678 329745 324634 319595 314171 308173 301686 295108 288841 282949 277426 272647
63589 272647 269098 266648 264543 262293 260255 259171 259418 260831 263008 265529 268067 270644 273781 278172
63575 278172 284085 291180 299001 307533 317125 327893 339479 351527 364155 377596 391505 404984
63563 404984 417295 428132 437082 443384 446672 447641 447527 447056 446301 445412 444927 445324 446760 449418 453712
63548 453712 459794 467071 474487 481236 487109 492332 497259 502011 506088 508309 507460 503152 495951 486550
63534 486550 475026 461145 445253 428399 411440 394390 376942 359395 342586 327016 312545
63523 312545 299051 286907 276510 267719 260094 253463 247847 243041 238698 234849 231988 230488 230083 230009
63509 230009 229600 228785 228129 228364 229778 232138 235162 238903 243602 249408 256418 264680 273927 283600 293506
63494 293506 304215 316405 329912 343808 357313 370205 382442 393842 404150 412913 419253 422264
63482 422264 421785 418473 413016 405694 396786 386862 376389 365428 354034 342643 331731 321383 311502
63469 311502 302215 293809 286380 279814 273982 268778 264123 260072 256747 254095 251979 250601 250457 251679
63455 251679 253774 256338 259650 264200 269971 276621 284082 292511 301870 312077 323444 336377 350729
63442 350729 365920 381729 398445 416237 434835 453869 472997 491618 508982 524723 538792
63431 538792 550628 558997 563057 563225 560672 556320 550753 544715 539006 533895 529160 524733 520909 517802
63417 517802 514922 511492 506904 500696 492347 481492 468397 453989 439261 424709 410471 396859
63405 396859 384486 373738 364354 355737 347578 339931 332907 326707 321940 319375 319011 319707 320144 320099 320511
63390 320511 322430 326191 331533 338095 345663 354232 363991 375103 387336 400085 412974 426359 441017
63377 441017 457337 474961 493197 511487 529336 546026 560733 572898 582299 588817 592471 593726
63365 593726 593349 591765 588852 584651 579971 575890 572834 570471 568272 565648 561732 555758 547816 538610
63351 538610 528327 516339 502357 487282 472403 458152 444214 430510 417446 405365 394361
63340 394361 384588 376219 369023 362458 356282 350749 346085 342125 338577 335371 332631 330507 329058 328134
63326 328134 327390 326624 326053 326037 326647 327808 329697 332497 335774 338662 340794 342580 344407 346066 347256 348196
63310 348196 349270 350331 350792 350233 348664 346348 343755 341530 340154 339569 339354 339246 339303 339617 340037 340200 339747
63293 339747 338639 337342 336535 336469 336707 336622 336042 335307 334900 335182 336225 337606 338539 338537 337895 337260 336823 336281 335606
63274 335606 335428 336361 338143 339698 340140 339614 339057 339216 340099 341419 343207 345586 348118 349978 350934 351715
63258 351715 353170 355432 358123 360942 363676 366037 367957 369897 372489 376049 380685 386394 392575 397948
63244 397948 401807 405249 410308 417756 426439 434908 443011 451597 461337 472322 484448 497645 511844
63231 511844 526982 542964 559554 576489 593710 611188 628529 645190 661192 677216 693793
63220 693793 710837 728081 745518 763071 780382 797377 814652 832776 851417 869571 886469
63209 886469 901747 914910 925133 931685 934169 932265 925565 913794 897098 876144 852090 826410
63197 826410 800516 775383 751528 729201 708552 689698 672709 657537 644134 632900 624883 620989
63185 620989 620898 623231 626974 632229 639340 648030 657948 669465 683099 698436 714436 730676 747476
63172 747476 764850 782136 798828 815061 831037 846617 861783 876877 891929 906115 918301
63161 918301 927830 934484 938067 938455 935838 930452 922165 910608 895635 877407 856206 832582 807604
63148 807604 782607 758527 735603 713763 693172 674299 657523 642767 629638 617963 608030 600114
63136 600114 593943 588938 584919 582127 580514 579560 578998 579126 580016 580930 581263 581753 583920 588254 593667 598899
63120 598899 603743 608550 613195 617264 620855 624456 628104 631302 633800 635863 637576 638514 638464 638053 638056 638325
63104 638325 637937 636387 634111 631777 629572 627462 625692 624610 624110 623658 622910 622070 621656 622015 623100 624576
63088 624576 626181 628019 630428 633490 636815 640033 643388 647570 652900 658868 664564 669542 674181 679301
63074 679301 685428 692406 699714 707085 714733 723011 732133 742256 753520 765716 778174 790401 802779
63061 802779 816281 831370 847514 863930 880605 898329 917790 938943 961411 985430 1012032
63050 1012032 1042009 1074857 1109177 1144232 1180588 1218944 1258832 1299068 1339229 1380011 1422088
63039 1422088 1465203 1508530 1551425 1593652 1635233 1676320 1717012 1757182 1796752 1836039 1875360
63028 1875360 1914087 1950467 1982593 2009238 2029667 2043103 2048683 2045602 2033097 2010732 1979016 1939402
63016 1939402 1893403 1842120 1786947 1730113 1673828 1619177 1566501 1516567 1470590 1429180 1392078
63005 1392078 1359104 1330692 1307309 1288966 1275584 1267254 1263736 1264166 1267740 1274421 1284574 1298123
62993 1298123 1314451 1332905 1352999 1374182 1395812 1417352 1438417 1458783 1478645 1498718 1519529
62982 1519529 1540534 1560216 1577128 1590595 1600357 1605976 1606750 1601957 1590952 1573249 1548784 1517957
62970 1517957 1481323 1439434 1393159 1343892 1293087 1241680 1190195 1139260 1089693 1042221 997447
62959 997447 955995 918236 883937 852573 824032 798530 775773 754732 734473 714793 695845
62948 695845 677681 660514 644991 631608 620033 609402 599114 589021 579133 569587 560637 552216
62936 552216 543713 534702 525699 517604 510540 503883 497390 491500 486375 481319 475505 468814 461733 454875
62922 454875 448764 443660 439285 435069 430807 426758 423035 419444 416070 413454 411853 410852 409985 409245 408633
62907 408633 407776 406474 405136 404171 403315 402091 400515 398789 396650 393705 390185 386737 383621 380668 377849
62892 377849 375253 372612 369484 365859 362076 358220 354177 350255 347096 344914 343301 341845 340399 338756
62878 338756 336715 334608 333142 332430 331698 330292 328566 327424 327259 327679 328058 328154 328255 328833 329925 330940
62862 330940 331345 331446 332103 333681 335737 337708 339412 340782 341745 342596 343996 346207 348748 351124 353456
62847 353456 356072 358879 361606 364249 366763 368589 369107 368464 367450 366602 365893 365210 364577 363789 362404 360367
62831 360367 358273 356659 355263 353358 350705 347814 345270 343138 341215 339607 338720 338764 339529 340625 341694
62816 341694 342401 342618 342760 343527 345061 346724 348086 349669 352141 355130 357656 359682 362379 366647 372151
62801 372151 378159 384579 391642 399137 406685 414534 423418 433729 445299 457960 471902 487506 505126
62788 505126 525051 547405 572137 599287 629179 662187 698526 738456 782448 830786 883189
62777 883189 939213 998891 1062604 1130326 1201314 1274431 1348440 1421946 1493412 1561306 1624037
62766 1624037 1679855 1727090 1764512 1791242 1806348 1808911 1798540 1775629 1741111 1696208 1642458
62755 1642458 1581810 1516499 1448743 1380254 1311761 1243186 1174655 1107291 1042714 981903 924894
62744 924894 871510 821884 776216 734438 696302 661488 629500 599811 572306 547338 525194
62733 525194 505703 488458 473183 459750 448080 438101 429510 421576 413624 405901 399526 395230 392554
62720 392554 390656 389510 389713 391319 393603 396077 399178 403657 409644 416669 424440 433305 443977 456920
62706 456920 472017 488781 506952 526888 549328 574794 603306 634610 668564 705344 745508
62695 745508 789792 838417 890454 944161 998169 1052095 1105763 1158145 1207543 1252569 1292271
62684 1292271 1325275 1349571 1363656 1367409 1361432 1345975 1321233 1288388 1249441 1205858 1158150 1107046
62672 1107046 1054305 1001714 949825 898415 847946 799826 755196 714119 676094 640886 608598
62661 608598 579306 552850 528795 506541 485706 466495 449311 433997 419862 406608 394689
62650 394689 384426 375267 366414 357844 350090 343170 336424 329508 322907 317201 312237 307382 302372 297555
62636 297555 293391 289910 286674 283231 279663 276685 274995 274470 274246 273665 272825 272011 271004 269431 267627
62621 267627 266568 266822 267942 269051 269751 270275 271024 272189 273778 275817 278545 282368 287477 293521 299906
62606 299906 306484 313678 321844 330878 340679 351646 364332 378871 395185 413568 434550 458202
62594 458202 484078 511926 541953 574272 608501 644132 680891 718380 755636 791382 824617
62583 824617 854761 881359 903784 921098 932148 936097 933083 924119 910195 891708 868946 842692
62571 842692 813976 783493 751759 719613 688075 657685 628361 599930 572518 546494 522327
62560 522327 500389 480555 462090 444326 427334 411621 397323 384227 372382 361939 352372 342738
62548 342738 333006 324374 317729 312448 307404 302612 299040 296963 295412 293351 290782 288455 286982 286512
62534 286512 286893 287868 289259 291182 293937 297585 301805 306277 311082 316599 323165 330926 339891 349929
62520 349929 360776 372236 384450 397912 413169 430511 449959 471477 495070 520599 547562
62509 547562 575272 603296 631630 660319 688986 716803 742792 766064 785843 801486 812484
62498 812484 818349 818527 812649 800998 784660 765108 743544 720601 696595 671959 647291 622998
62486 622998 599116 575718 553364 532832 514409 497773 482638 469121 457291 446747 437044 428281
62474 428281 420813 414565 409074 404187 400218 397388 395537 394518 394397 395031 395830 396299 396631 397439 399038 401264
62458 401264 403899 406937 410354 413887 417203 420195 422924 425220 426454 425876 423270 419162 414306 409044
62444 409044 403245 396699 389336 381208 372618 364237 356712 350054 343759 337644 332205 327971 324894 322697
62430 322697 321474 321454 322350 323492 324654 326408 329470 333955 339387 345259 351411 357971 365006 372254 379173
62415 379173 385301 390534 395078 399222 403167 406910 410190 412695 414398 415554 416266 416343 415715 414683 413513
62400 413513 412042 410059 407793 405554 403122 400067 396641 393733 391892 390966 390808 391705 393827 396881 400774
62385 400774 406113 413467 422425 432091 442368 454153 468195 484346 502147 521729 543759 568589
62373 568589 595818 624709 654874 686357 719004 751944 783985 814529 843798 871986 898403
62362 898403 921623 940300 953642 961342 963478 960538 953277 942473 928879 913283 896389 878605
62350 878605 860081 840895 821034 800340 778756 756713 735094 714741 696012 678753 662617
62339 662617 647493 633766 622042 612520 604726 597946 591721 585792 579942 574269 569410 565999 563962
62326 563962 562723 561965 561720 561718 561263 559896 557704 554804 551061 546602 542105 538114 534338 530052 524975 519349
62310 519349 513389 507133 500832 494984 489897 485538 481893 479169 477426 476299 475342 474558 474318 474754 475487
62295 475487 476122 476890 478566 481674 485947 490640 495179 499384 503342 507440 512370 518628 525870 533127 539872
62280 539872 546593 554190 563064 573043 583957 596047 609854 625852 644036 663797 684496 706386
62268 706386 730678 758323 788886 820965 853557 886560 919955 952949 984105 1011989 1035483
62257 1035483 1053774 1066416 1073465 1075421 1073033 1067149 1058547 1047663 1034475 1018842 1001096 982156
62245 982156 962901 943478 923486 902969 882964 864834 849160 835571 823538 812954 803920 796414
62233 796414 790393 785845 782397 779184 775517 771691 768809 767797 768736 770975 773622 775979 777977 780266
62219 780266 783612 788065 792960 797876 803279 809934 817891 826472 835293 844924 856273 869480 883740
62206 883740 898213 912925 928741 946650 967048 989379 1012416 1035236 1058216 1082737 1109635
62195 1109635 1138162 1166819 1194788 1221899 1247519 1270347 1289481 1304892 1316656 1324531 1328803 1330888
62183 1330888 1332473 1334431 1337141 1341406 1348349 1358566 1371950 1388238 1407231 1428634 1452173 1477785
62171 1477785 1505132 1532954 1559422 1583235 1604082 1622217 1638036 1652013 1664529 1675724 1685885
62160 1685885 1695791 1706076 1716244 1724976 1731580 1736638 1741130 1745596 1750440 1756345 1763800 1772534 1781956
62147 1781956 1791947 1802804 1814603 1827140 1840482 1855083 1871122 1887988 1904732 1921041 1937573
62136 1937573 1955208 1974113 1993750 2013757 2034439 2056237 2079085 2102662 2126952 2152137 2178120
62125 2178120 2204668 2231873 2259912 2288423 2316805 2345179 2374423 2404990 2436293 2467562 2498802
62114 2498802 2530550 2563099 2596339 2630025 2663828 2697418 2730890 2764904 2800087 2836504 2873926
62103 2873926 2912260 2951374 2990856 3030442 3070528 3111806 3154550 3198691 3244441 3292234 3341835
62092 3341835 3391835 3440227 3485421 3526814 3564696 3599763 3632616 3663612 3692968 3720585 3745531
62081 3745531 3765994 3780231 3787645 3788803 3784651 3776165 3764728 3752230 3740369 3729844 3720290 3710808
62069 3710808 3700432 3688380 3674241 3658140 3640615 3622247 3603430 3584442 3565528 3546673 3527347
62058 3527347 3506807 3484822 3461931 3438837 3415808 3392888 3370403 3348846 3328407 3309086 3291169
62047 3291169 3274987 3260171 3245724 3231100 3216666 3202810 3189037 3174403 3158473 3141426 3123400
62036 3123400 3104267 3083970 3062695 3040642 3017802 2993904 2968495 2941255 2912382 2882426 2851637
62025 2851637 2819833 2787146 2754497 2722883 2692445 2662687 2633402 2604874 2577342 2550877 2525784
62014 2525784 2502576 2481401 2461941 2444065 2428191 2414786 2403787 2394737 2387215 2380828 2374856 2368141
62002 2368141 2359392 2347587 2332110 2312628 2288943 2261137 2229807 2195989 2160695 2124657 2088551
61991 2088551 2053165 2019086 1986336 1954596 1923674 1893533 1864076 1835307 1807606 1781414 1756569
61980 1756569 1732379 1708491 1685370 1663623 1643117 1623146 1603406 1584441 1566886 1550474 1534146
61969 1534146 1517225 1500259 1484483 1470614 1458452 1447482 1437459 1428350 1420157 1413091 1407617 1404107
61957 1404107 1402618 1403146 1405857 1410882 1418200 1427932 1440402 1455685 1473387 1493212 1515415 1540338 1567787
61944 1567787 1597379 1629236 1663766 1700866 1739942 1780856 1824421 1871789 1923532 1979307 2038266
61933 2038266 2099986 2165232 2235701 2312789 2396915 2488448 2589020 2701409 2828367 2972158
61923 2972158 3135023 3319304 3527069 3760252 4021293 4312911 4637145 4995265 5388823
61914 5388823 5819883 6289418 6795604 7333674 7896255 8472393 9045727 9593886 10090008
61905 10090008 10505603 10813866 10993305 11031220 10926044 10687543 10334628 9891581 9384244
61896 9384244 8837338 8272841 7708706 7158137 6630097 6130696 5663985 5231843 4834120
61887 4834120 4469738 4137637 3836633 3564897 3320140 3100138 2902717 2725404 2565661
61878 2565661 2421607 2292283 2177147 2075417 1985834 1906800 1836707 1774273 1718733 1669755
61868 1669755 1627314 1591526 1562347 1539227 1521170 1507318 1497397 1491482 1489437 1490734 1494852 1501700
61856 1501700 1511529 1524256 1538873 1553754 1567721 1580681 1592944 1604227 1613745 1621202 1627059 1631775
61844 1631775 1635375 1637989 1640258 1642829 1645926 1649882 1655566 1663517 1672806 1681483 1688329 1693703 1698494 1702772
61830 1702772 1705847 1707325 1707619 1707348 1706647 1705350 1703778 1703033 1704422 1708732 1716235 1727209 1742094 1761114
61816 1761114 1784079 1810794 1841493 1876682 1916627 1961192 2010250 2064215 2124164 2191345 2266445
61805 2266445 2349406 2440054 2538834 2646815 2765225 2895375 3038997 3198162 3374743 3570352
61795 3570352 3787016 4027702 4296015 4595701 4930590 5304651 5721762 6185527 6699524
61786 6699524 7267524 7893338 8580554 9332301 10150360 11033353 11974940 12962807 13977827
61777 13977827 14992577 15970118 16865001 17627289 18208642 18569053 18682995 18543589 18163504
61768 18163504 17572230 16810648 15924495 14958506 13952668 12940728 11949852 11000366 10105768
61759 10105768 9273716 8507640 7807964 7172685 6597989 6079284 5612050 5191995 4814810
61750 4814810 4476187 4172137 3899075 3653468 3431623 3230182 3046897 2880596 2730197
61741 2730197 2593990 2470074 2357127 2254269 2160371 2074155 1995005 1923029 1858093 1799246
61731 1799246 1745347 1695795 1650320 1608439 1569553 1533290 1499331 1467078 1435899 1405604 1376396
61720 1376396 1348423 1321665 1296162 1272111 1249729 1229084 1209944 1191725 1173857 1156340 1139661
61709 1139661 1124070 1109278 1095115 1081985 1070289 1059724 1049632 1039711 1029879 1019739 1008836 997412
61697 997412 986253 975690 965280 954652 944163 934438 925525 916789 907516 897533 887300 877507 868487
61684 868487 859931 851218 841959 832244 822577 813644 805952 799459 793705 788427 783855 780200 777118 774044
61670 774044 770899 768217 766611 766343 767181 768410 769199 769322 769373 769955 770837 771327 771258 771173 771606 772645 774120 775759
61652 775759 777093 777596 777011 775302 772404 768293 763243 757666 751835 746031 740709 736111 731904 727731 723875
61637 723875 720819 718393 716132 714277 713509 713643 713624 713121 713127 714401 716128 716789 715812 713626 710563 706484 701253
61620 701253 694928 687605 679692 672256 666506 662863 660841 659723 658939 657907 656094 653494 650715 648429
61606 648429 646863 645830 645017 644103 642798 640943 638626 636149 633826 631692 629490 627074 624766 623006 621653
61591 621653 620018 617767 615411 613686 612801 612617 613199 614706 616970 619756 623401 628680 635933 644702 654359
61576 654359 664762 676078 688321 701368 715376 730865 748297 767577 788059 809046 830288
61565 830288 851984 874368 897421 920923 944518 967647 989687 1010395 1030143 1049513 1068762
61554 1068762 1087847 1106839 1126034 1145596 1165265 1184380 1202171 1218138 1232297 1244946 1256005
61543 1256005 1264690 1270051 1271773 1270266 1266105 1259665 1251264 1241345 1230381 1218787 1206976 1195399 1184491
61530 1184491 1174695 1166459 1160004 1155178 1151813 1150202 1150969 1154456 1160613 1169598 1182090 1198732 1219567
61517 1219567 1244359 1273319 1307203 1346787 1392537 1444714 1503497 1569046 1641830 1723057 1814449
61506 1814449 1917370 2032248 2158944 2297550 2448611 2612666 2789734 2979154 3179581
61497 3179581 3388779 3603142 3817320 4024355 4216406 4385655 4524929 4628148 4691070 4712220
61487 4712220 4693211 4638089 4552267 4441821 4313010 4171670 4022762 3870621 3719482 3573365
61477 3573365 3435244 3306621 3188106 3080308 2984073 2900077 2828422 2768559 2719558 2680606
61467 2680606 2651447 2632221 2622719 2621925 2628476 2641451 2660433 2684796 2713274 2744445 2777440 2811888
61455 2811888 2847178 2882105 2915501 2947073 2977332 3006711 3035156 3062757 3090343 3119021 3149368
61444 3149368 3181602 3216380 3254724 3296960 3342332 3389938 3439499 3490807 3542833 3593957 3642801
61433 3642801 3688233 3728664 3761979 3786365 3800902 3805293 3799383 3783186 3757244 3722829 3681753 3635892
61421 3635892 3586803 3535896 3484853 3435547 3389291 3346482 3307280 3272351 3242602 3218439 3199778
61410 3199778 3186618 3179049 3176681 3178566 3183823 3192002 3202741 3215330 3228705 3241664 3253167 3262792
61398 3262792 3270898 3278013 3284029 3288406 3291325 3294312 3299607 3309145 3324228 3345920 3375580 3415108 3466626
61385 3466626 3531728 3611106 3705123 3814607 3940742 4084310 4245456 4424056 4619575 4830348
61375 4830348 5053347 5284768 5520368 5754903 5981519 6191970 6377517 6530147 6643937
61366 6643937 6715937 6745750 6734459 6684276 6598899 6482971 6340471 6173968 5985796 5779488
61356 5779488 5559693 5331172 5098392 4865578 4636430 4413794 4199986 3997191 3807100
61347 3807100 3630366 3466971 3317034 3180871 3058500 2949636 2854186 2772184 2703110 2645718
61337 2645718 2598733 2561492 2533811 2515510 2506155 2505031 2511191 2523663 2541779 2565263 2593949 2627316
61325 2627316 2664249 2703214 2742881 2782756 2823160 2864399 2905909 2946156 2983231 3015565 3042392
61314 3042392 3063826 3080468 3092868 3101450 3107005 3110915 3114572 3118549 3122518 3125888 3128342 3129796 3129989
61301 3129989 3128211 3123414 3114576 3100974 3082119 3057695 3027829 2993319 2955183 2913969 2869861 2823504
61289 2823504 2776319 2729795 2684868 2642145 2602280 2565728 2532468 2502463 2476201 2454370 2437069
61278 2437069 2423762 2413943 2407479 2404192 2403323 2403481 2403074 2400824 2395938 2387842 2375931 2359991 2340840 2320122
61264 2320122 2299199 2278632 2258965 2241556 2228148 2219984 2217823 2222571 2235232 2256289 2285742 2323835
61252 2323835 2371257 2428413 2494893 2569894 2652968 2744108 2843166 2949250 3060578 3174705 3288642
61241 3288642 3398526 3499221 3584667 3649110 3688224 3699329 3681090 3633564 3558592 3459948 3342968
61230 3342968 3213771 3078232 2941138 2806104 2676044 2553197 2438503 2331519 2231528 2138618
61220 2138618 2053476 1976492 1907611 1846739 1793654 1747546 1707238 1671952 1641463 1615470 1593336
61209 1593336 1574621 1559455 1548022 1539804 1533423 1527202 1519899 1511160 1501396 1491150 1480592 1469648
61197 1469648 1458472 1447556 1437341 1427794 1418250 1407680 1395387 1381597 1367148 1352444 1337021 1320363
61185 1320363 1302792 1285130 1267705 1250139 1231972 1213121 1193896 1175009 1157472 1141966 1128265
61174 1128265 1115626 1103779 1093170 1084281 1077123 1071495 1067406 1065030 1064419 1065370 1067487 1070312 1073319 1075570
61160 1075570 1075467 1071331 1062573 1049983 1034676 1017220 998129 978576 959751 941796 924200 907236
61148 907236 892201 880115 870802 863379 857078 851431 846248 841631 837630 833789 829547 825189 821794 819923
61134 819923 818807 817188 814578 811383 808156 805133 802318 799650 797167 795262 794683 796044 799299 803739
61120 803739 808452 812763 816317 818806 819667 818186 814001 807377 798838 788712 777147 764396 750800
61107 750800 736672 722357 708198 694275 680515 667310 655511 645349 635825 625902 615899 606923
61095 606923 599161 591703 584053 576809 570608 565215 560063 555029 550214 545456 540607 536009 532325 529974
61081 529974 528900 528714 529008 529763 531362 533986 537201 540604 544620 549982 556479 563033 569151 575513 582846
61066 582846 590911 599024 606985 614998 623143 631383 639841 648640 657679 666839 676248 686134 696556 707351
61052 707351 718175 728558 738157 746944 754958 762110 768581 775085 782113 789138 795264 800500 805512 810194
61038 810194 813472 814729 814557 813837 812897 811840 810845 809723 808000 805869 804373 804234 805222 807053 810113 814767
61022 814767 820735 827770 836323 846968 859736 874605 892048 912504 935778 961484 989605 1020255
61010 1020255 1053485 1089800 1130295 1175796 1226427 1282285 1343716 1410406 1481025 1554481 1630898
60999 1630898 1711010 1795615 1886386 1986244 2097928 2222765 2361562 2515792 2687244 2877726
60989 2877726 3090653 3332361 3610825 3933700 4308491 4743564 5247711 5830327 6504888
60980 6504888 7293015 8224594 9335327 10666446 12264887 14175163 16416708 18949268
60972 18949268 21638713 24246641 26471759 28049156 28865452 29016694 28765522 28426465 28252235
60963 28252235 28369169 28756301 29246726 29559092 29382903 28503180 26895878 24727397 22261693
60954 22261693 19746941 17352061 15164971 13218477 11513388 10033841 8758918 7668805
60946 7668805 6744049 5963420 5305488 4751366 4284493 3889022 3550318 3256630 2999103
60937 2999103 2770697 2566105 2382072 2216513 2067384 1932954 1812522 1705868 1612113 1529640
60927 1529640 1456668 1391233 1331071 1274262 1219900 1167759 1117784 1070374 1026581 987324 952631
60916 952631 922106 895702 873465 854930 839354 826276 815364 805983 797387 789105 780889 772650
60904 772650 764711 757556 751021 744315 737199 730370 724111 717325 708705 698306 687186 676019 664894
60891 664894 654034 643718 633789 624054 614952 606932 599382 591142 582107 573541 566723 561902 558554 555966
60877 555966 553552 551307 550096 550933 553864 557990 562542 567395 572593 578165 584608 592844 603273 615182
60863 615182 627423 639478 651660 664429 677714 690868 703256 714836 726001 736898 747306
60852 747306 757344 767738 778945 790454 801550 812366 823443 834483 844399 852612 859498 865327
60840 865327 869419 870720 868821 864179 857688 850219 842253 833681 824092 813245 801165 787948 773837
60827 773837 759423 745329 731687 718259 705053 692547 681360 672056 665056 660262 656839 653894
60815 653894 651392 649930 649725 650398 651712 653785 656457 659153 661670 664457 667762 671003 673389 674757 675416
60800 675416 675619 675540 675506 675852 676764 678482 681241 684710 687955 690478 693010 696773 702149 708556 715464 722945
60784 722945 731200 740068 749220 758517 767928 777266 786185 794407 801911 808880 815476 821676 827412 832804
60770 832804 838047 843012 847219 850291 852266 853297 853245 851772 848737 844340 838983 833129 827159 821234 815339
60755 815339 809475 803563 797172 789745 781347 772884 765215 758233 751088 743029 733672 722808 710595 697891
60741 697891 685750 674450 663512 652823 643188 635514 629882 625813 623020 621421 620706 620480 620773 621900
60727 621900 623747 625716 627552 629827 633267 637823 642720 647269 651281 654738 657454 659181 659810 659218 657085
60712 657085 653131 647502 640731 633241 625068 616127 606565 596662 586494 575906 564923 554034 543999
60699 543999 535431 528501 522939 518212 513851 509728 506014 502850 500115 497545 494921 492138 489281 486760
60685 486760 485115 484466 484360 484461 485200 487311 490764 494692 498501 502579 507645 513807 520663 528012 535988
60670 535988 544587 553502 562496 571665 581266 591403 601861 612171 621993 631559 641536 652256 663320
60657 663320 674205 684996 696116 707567 718896 729818 740385 750558 760017 768392 775345 780556
60645 780556 784105 786685 788801 789797 788473 784781 780114 775555 770606 764140 755947 746668 736727 726125
60631 726125 715019 703786 692556 681265 670119 659527 649627 640299 631605 623825 617083 611359 606791
60618 606791 603572 601545 600315 599753 600075 601445 603859 607347 611896 617271 623327 630544 639701 650904
60604 650904 663342 676136 689078 702303 715663 728650 740659 751006 758953 764020 766223 765860
60592 765860 763182 758445 752087 744563 736014 726306 715498 704163 693129 682899 673375 664208 655333
60579 655333 646966 639091 631207 622796 613906 605093 596925 589672 583328 577654 572287 566946 561529 556019
60565 556019 550616 546118 543669 543610 544858 545962 546663 547818 549950 552646 555444 558562 562364 566622 570832
60550 570832 574931 579331 584433 590407 597385 605639 615605 627669 641703 656969 673005 690704 712059
60537 712059 738565 770260 806419 846601 890609 937869 987268 1037234 1085461 1128852 1164286
60526 1164286 1189443 1202825 1203718 1192870 1172979 1147621 1119558 1090422 1061748 1035391 1012699 993890
60514 993890 978533 966261 956830 949936 945297 942683 941710 941904 943120 945646 949747 955460 963025 973161
60500 973161 986703 1004215 1026203 1053369 1086400 1125757 1171988 1225894 1287851 1356979 1431306
60489 1431306 1508766 1587948 1668184 1749489 1832553 1918641 2009666 2108740 2220557 2350665 2504023
60478 2504023 2684195 2893545 3133116 3401191 3691435 3992075 4286519 4554847 4775990
60469 4775990 4930690 5004614 4990554 4889193 4708824 4464311 4174940 3861022 3540306 3225979
60459 3225979 2926964 2649326 2396989 2171428 1971725 1795783 1641642 1507485 1390910
60450 1390910 1289085 1199892 1122355 1055625 998070 947782 903612 865157 831934 803139 778098
60439 778098 756385 737406 720335 704630 690221 677044 664752 653111 642378 633010 625161 618557
60427 618557 612685 606965 601004 594954 589500 585268 582239 579865 577712 575931 575164 575965 578181 580895 583176
60412 583176 584846 586331 587837 589055 589763 590302 591210 592676 594568 596687 598811 600724 602496 604475 606823
60397 606823 609320 611827 614557 617559 620318 622339 623826 625284 626755 628065 629582 631936 634915 637388
60383 637388 638556 638747 638663 638400 637589 636155 634517 633146 632191 631440 630535 629436 628733 629195 630843 632787 634208
60366 634208 635224 636546 638572 641183 644247 647885 652300 657679 664167 671583 679133 685847 691550 697174
60352 697174 703818 711573 719476 726528 732537 737898 742856 747267 750927 753786 755740 756522 756035 754635 752873
60337 752873 751102 749578 748725 748878 749793 750787 751506 752191 753067 753818 753926 753334 752473 751773 751314 750840 749915 748194
60319 748194 745768 743168 740815 738521 735753 732354 728724 725288 722090 719033 716229 713861 711857 710024
60305 710024 708436 707354 706753 706276 705840 705904 706799 708124 709230 710098 711095 711929 711621 709806 707393 705432 703854
60288 703854 701961 699780 698136 697514 697591 697934 698503 699324 700281 701488 703418 706299 709745 713292 717126 721985
60272 721985 728460 736484 745368 754333 763170 772384 782502 793387 804601 816307 829249 843792 859594
60259 859594 876376 894487 914494 936745 961559 989239 1019603 1052135 1087039 1125527 1168525
60248 1168525 1215755 1266839 1322678 1384669 1452883 1526152 1603981 1687309 1777141 1873218 1974337
60237 1974337 2079104 2185878 2292709 2397964 2500626 2599399 2691887 2775244 2847551 2908100
60227 2908100 2956519 2992164 3014451 3023448 3020006 3005516 2981657 2950212 2912958 2871635 2827930 2783590
60215 2783590 2740723 2701877 2669448 2644863 2628601 2621122 2623399 2636405 2660523 2695866 2742846 2801905
60203 2801905 2872826 2954772 3046855 3148089 3256733 3370202 3485765 3600859 3712587 3817494
60193 3817494 3912297 3994606 4062644 4114664 4149168 4165551 4164052 4145062 4108908 4056390 3989316
60182 3989316 3910464 3823252 3731352 3638138 3546274 3458004 3375916 3303106 3242319 3195063 3161721
60171 3161721 3142446 3137737 3148203 3173898 3213926 3266541 3329518 3400389 3476430 3554680 3632214
60160 3632214 3706267 3774043 3832716 3880129 3915461 3938799 3950088 3949061 3936284 3913611 3883250
60149 3883250 3846926 3806422 3764516 3724678 3690019 3663011 3646034 3641476 3651279 3676872 3719685 3781276
60137 3781276 3862872 3965179 4088708 4233974 4401334 4591010 4803328 5038530 5296200 5575143
60127 5575143 5873748 6189921 6520437 6860728 7205515 7549345 7886446 8210563 8515397
60118 8515397 8795124 9044495 9258916 9434646 9568620 9657929 9699974 9693505 9639129 9538526
60108 9538526 9393651 9207327 8984327 8731241 8455311 8163804 7864235 7564366 7271535
60099 7271535 6992072 6731277 6493428 6281589 6097643 5942674 5817265 5721539 5655283 5618140
60089 5618140 5609409 5627541 5670045 5733961 5816134 5912708 6018561 6127536 6233397 6330593 6414363
60078 6414363 6480532 6525618 6547299 6544760 6518530 6469901 6400404 6311653 6205497 6084193 5950349
60067 5950349 5806588 5655180 5498047 5337237 5175396 5015709 4861385 4715178 4579225
60058 4579225 4455131 4344259 4248133 4168494 4106779 4063557 4038622 4031562 4042094 4070059 4115443
60047 4115443 4178200 4257508 4351298 4456935 4572306 4695401 4822706 4948889 5068634 5178212
60037 5178212 5274765 5354906 5415116 5453278 5468824 5461372 5430173 5375159 5297746 5200188 5084753
60026 5084753 4954106 4812120 4663654 4513478 4365604 4223434 4090016 3967990 3859470
60017 3859470 3766028 3688687 3627911 3583895 3557094 3548389 3558449 3586935 3632682 3694931 3774155
60006 3774155 3871276 3986161 4117290 4262859 4421453 4591245 4768904 4949777 5128809 5300807
59996 5300807 5460161 5601319 5720034 5813971 5881965 5923043 5936297 5921352 5878575 5808967 5714227
59985 5714227 5597110 5461593 5312554 5155227 4994931 4837048 4686677 4547805 4422814
59976 4422814 4313208 4220836 4147897 4095575 4063215 4049342 4053174 4074612 4113085 4167215 4235619
59965 4235619 4317341 4411176 4515004 4626034 4741333 4857791 4971957 5080406 5180255 5269217
59955 5269217 5345392 5407462 5455067 5488704 5509263 5517986 5516899 5508866 5496921 5483836 5472751 5468014
59943 5468014 5474715 5497081 5537719 5598719 5683044 5794214 5934826 6106044 6308496 6542914
59933 6542914 6809555 7107434 7434391 7787312 8161591 8550329 8944207 9331818 9699934
59924 9699934 10034011 10319439 10543002 10693910 10764724 10752519 10659436 10491833 10258913 9972143
59914 9972143 9645150 9292632 8928326 8563638 8207730 7868150 7550973 7260623 6999967
59905 6999967 6770767 6574159 6410810 6280680 6182744 6115378 6077287 6067988 6087252 6134319 6207733
59894 6207733 6305512 6425047 6563028 6715824 6879494 7048827 7216500 7373805 7512251 7624144
59884 7624144 7702255 7740280 7734442 7684369 7592214 7461324 7295960 7101770 6885746 6655410
59874 6655410 6417732 6178302 5941029 5708400 5481951 5262537 5050553 4846402 4650826
59865 4650826 4464700 4288671 4123320 3969475 3827950 3699073 3582891 3479770 3390282 3314485
59855 3314485 3251764 3201301 3162112 3132380 3109228 3089457 3070347 3049738 3025768 2996855 2961910
59844 2961910 2920670 2874033 2823910 2772352 2720859 2670701 2623441 2580449 2542145 2508506 2480278
59833 2480278 2458877 2445098 2438828 2440171 2449886 2468374 2495184 2530058 2573550 2625864 2685671 2750722
59821 2750722 2818983 2888426 2956343 3019959 3077610 3128648 3172445 3208317 3236231 3256661 3269640
59810 3269640 3274709 3272109 3263624 3252199 3241169 3233869 3233344 3242081 3262171 3295731 3344844 3411057 3495297
59797 3495297 3598457 3721905 3867435 4037050 4232936 4457398 4712541 4999621 5317818
59788 5317818 5662334 6022568 6381540 6716939 7003476 7216422 7336258 7353333 7270366 7101330
59778 7101330 6867230 6590954 6293335 5991403 5698236 5423286 5172616 4949382 4754653
59769 4754653 4588095 4448309 4333256 4240891 4169407 4116784 4080577 4058630 4049972 4054681 4072926
59758 4072926 4104395 4148573 4205207 4274382 4356418 4451871 4561631 4686902 4828981 4988937
59748 4988937 5167495 5365332 5583462 5823183 6085769 6372647 6685844 7027643 7399402
59739 7399402 7800992 8231655 8690819 9177318 9687808 10216298 10754961 11294769 11825429
59730 11825429 12335801 12815485 13256691 13655344 14011395 14328771 14615020 14880563 15137716
59721 15137716 15399556 15678540 15985122 16326916 16708664 17132435 17597354 18098916 18628762
59712 18628762 19175552 19726326 20267062 20782207 21254786 21668439 22010413 22273115 22453640
59703 22453640 22553041 22576583 22534053 22438918 22306888 22154943 22000670 21861209 21752212 21687506
59693 21687506 21679137 21737098 21869158 22081403 22378789 22764723 23240192 23803835 24452720 25182199
59683 25182199 25984328 26846126 27748768 28667390 29570992 30422805 31181947 31806503 32257635
59674 32257635 32504013 32525820 32317531 31888947 31263975 30477105 29568659 28580562 27553218
59665 27553218 26522351 25515132 24547009 23621086 22729915 21858357 20987402 20099616 19184964
59656 19184964 18243970 17286461 16327417 15382726 14466453 13589640 12759992 11981896 11256653
59647 11256653 10583334 9960190 9385648 8857975 8374390 7931198 7524991 7153464 6814961
59638 6814961 6507638 6229259 5977522 5750321 5545876 5362838 5200122 5056449 4930058
59629 4930058 4819051 4722022 4638238 4567053 4507093 4456012 4411164 4370405 4332066 4294233 4254537
59618 4254537 4210853 4161870 4106702 4044460 3974801 3898645 3817696 3733243 3645940 3556733 3467346
59607 3467346 3379703 3295383 3215838 3142520 3076366 3017417 2965317 2920009 2881762 2850779 2827115
59596 2827115 2810790 2801640 2799082 2802229 2810202 2822197 2837370 2854887 2874110 2894616 2916026 2937861
59584 2937861 2959550 2980568 3000721 3020446 3040826 3063243 3088883 3118446 3152265 3190780 3234977
59573 3234977 3286309 3346066 3414891 3492984 3580629 3678427 3787214 3907997 4041832 4189419
59563 4189419 4350819 4525866 4714847 4918440 5136832 5368979 5612698 5865267 6123893
59554 6123893 6385891 6648576 6908938 7163387 7407913 7638645 7852411 8047199 8222439
59545 8222439 8378701 8516652 8635943 8734998 8811767 8864821 8894474 8903763 8898531 8886099 8873502
59534 8873502 8866918 8872319 8895724 8942233 9014858 9114252 9238933 9385182 9546715 9714764 9878663
59523 9878663 10026616 10146565 10227207 10258992 10234844 10150582 10005048 9799858 9539028 9228835
59513 9228835 8877884 8496786 8097129 7690081 7285338 6890828 6513069 6157493 5828071
59504 5828071 5526589 5252790 5005781 4785301 4591415 4423306 4279096 4156994 4056137
59495 4056137 3976073 3915842 3873969 3849283 3841493 3850994 3878210 3923054 3984981 4063528 4158683 4270587
59483 4270587 4399055 4543641 4704060 4880115 5071084 5275308 5490222 5712364 5937219
59474 5937219 6159322 6372580 6570297 6745076 6889329 6996397 7061316 7080856 7053478 6979580
59464 6979580 6861574 6703580 6511190 6291301 6051412 5798425 5538102 5275630 5016148
59455 5016148 4764151 4522491 4292409 4074676 3870527 3681461 3508327 3350847 3208039
59446 3208039 3078936 2962696 2858168 2763917 2679003 2603403 2537242 2479899 2430372 2388293 2353866
59435 2353866 2326763 2305793 2289839 2278536 2271734 2268922 2269525 2273240 2279604 2287612 2296414 2306229 2318156
59422 2318156 2333157 2351569 2373453 2398884 2427604 2458397 2488972 2516784 2540536 2561218 2581661
59411 2581661 2605120 2634353 2671678 2718968 2777096 2845708 2923858 3010574 3104752 3205191 3311552
59400 3311552 3425195 3548822 3685484 3838231 4010252 4204646 4423956 4670233 4945443
59391 4945443 5251577 5590568 5964480 6375415 6824510 7310838 7831448 8381947 8955996
59382 8955996 9544038 10133449 10710903 11264900 11786456 12268632 12706685 13098908 13446572
59373 13446572 13752508 14019678 14250962 14449475 14618024 14757749 14867344 14943615 14982518 14979689
59363 14979689 14930725 14832070 14682314 14482844 14237500 13951932 13633146 13288904 12926703 12552763
59353 12552763 12171634 11786493 11399807 11013857 10630843 10252743 9881509 9519625 9170107
59344 9170107 8835530 8517163 8215290 7930003 7661066 7407218 7166385 6936747 6717131
59335 6717131 6506386 6303066 6105950 5914300 5727519 5545249 5368026 5197153 5033563
59326 5033563 4877320 4728481 4587650 4455288 4331307 4215916 4110215 4015169 3930573 3855689
59316 3855689 3790314 3734394 3687293 3648517 3618737 3598902 3588514 3585925 3590350 3602488 3623064 3651842
59304 3651842 3688409 3732881 3785367 3845571 3913414 3989319 4073457 4165398 4265048 4373187 4490354
59293 4490354 4615700 4747544 4884528 5025429 5168279 5310621 5450627 5587202 5718876
59284 5718876 5843157 5957001 6057316 6140865 6204345 6245091 6261665 6253601 6220865 6163737 6083037
59273 6083037 5980209 5857060 5715416 5556909 5383188 5196649 5001214 4802277 4605657
59264 4605657 4416259 4237292 4070274 3915628 3773474 3644176 3528204 3425612 3335883 3258438
59254 3258438 3193131 3140097 3099346 3070741 3054286 3050071 3057957 3077689 3109551 3154685 3214567 3290324
59242 3290324 3382794 3493092 3622894 3774185 3948904 4148770 4375205 4629354 4912159 5224178
59232 5224178 5565004 5932740 6324032 6734116 7156134 7580067 7992701 8379136 8724719
59223 8724719 9016121 9241556 9391114 9457604 9437584 9331977 9146026 8888780 8572370 8211043
59213 8211043 7819801 7412953 7003254 6601740 6217519 5857214 5524865 5222817 4952521
59204 4952521 4714211 4506318 4326157 4171385 4040313 3930961 3840766 3767594 3710339 3668011
59194 3668011 3638742 3620243 3610930 3610053 3616924 3630433 3649090 3671045 3694084 3715944 3734645 3748480
59182 3748480 3755992 3756270 3749062 3734268 3711424 3679905 3639452 3590316 3533254 3469783 3402152 3332473
59170 3332473 3261821 3190496 3119086 3048926 2981576 2918229 2859632 2806241 2758357 2716267 2680299
59159 2680299 2650528 2626574 2607938 2594579 2586939 2585353 2589604 2599072 2613198 2631801 2655049 2683140
59147 2683140 2716037 2753566 2795719 2842642 2894321 2950530 3011102 3075905 3144404 3215574 3288465
59136 3288465 3362546 3437302 3511768 3584704 3654967 3721502 3783322 3839770 3890585 3935570 3974636
59125 3974636 4008557 4039237 4068765 4098470 4129348 4163032 4201690 4247041 4299920 4360601 4428992
59114 4428992 4504624 4587035 4676142 4771697 4872383 4975910 5080014 5182722 5281311 5371314
59104 5371314 5446825 5501691 5530501 5528943 5493883 5423650 5318645 5181657 5017196 4830268 4625970
59093 4625970 4410082 4189089 3968818 3753302 3545400 3347907 3163079 2991328 2831501
59084 2831501 2682750 2545377 2419615 2304440 2198220 2100126 2010325 1928941 1855256 1787960
59074 1787960 1726011 1669227 1618029 1572530 1531946 1495077 1461234 1430430 1402750 1377979 1355967
59063 1355967 1336900 1320912 1307578 1296088 1285975 1277473 1270948 1265928 1260953 1254706 1247229 1239543 1232050
59050 1232050 1223865 1214018 1202775 1191333 1180612 1170971 1162800 1156730 1153192 1152242 1153850 1158134 1165416
59037 1165416 1176234 1190969 1209056 1228907 1249051 1269059 1288892 1307702 1323982 1336733 1345886
59026 1345886 1351794 1355065 1356785 1358194 1359966 1362270 1365331 1369359 1374093 1379182 1385037 1392532 1401852 1412273
59012 1412273 1423051 1433668 1443107 1449826 1452890 1452521 1449212 1442977 1433875 1422697 1410617 1398403 1386248
58999 1386248 1374035 1361568 1348910 1336744 1326108 1317622 1311261 1306879 1304472 1303856 1304665 1306868 1310839
58986 1310839 1316648 1323663 1331066 1338498 1346137 1354550 1364496 1376355 1389638 1403545 1418128 1434415 1453256
58973 1453256 1474588 1498012 1523477 1551087 1580724 1612218 1645529 1680459 1716459 1752868 1789068
58962 1789068 1824408 1858488 1891633 1924647 1957957 1991483 2025437 2060686 2098136 2138265 2181400
58951 2181400 2227875 2277720 2330808 2387564 2448930 2515358 2586433 2661831 2742090 2828073 2920304
58940 2920304 3019374 3126604 3243754 3372209 3512723 3665765 3831952 4012445 4208987 4423306
58930 4423306 4656577 4909895 5185089 5484264 5808602 6158525 6535217 6941015 7377953
58921 7377953 7846715 8347286 8879534 9442426 10033370 10648691 11283701 11931415 12581807
58912 12581807 13222813 13841121 14421286 14945376 15395174 15754878 16011448 16154015 16175302
58903 16175302 16074196 15856100 15530972 15111936 14615283 14059602 13463285 12842599 12211746
58894 12211746 11583489 10968789 10375965 9810630 9276335 8775146 8307765 7873373 7469776
58885 7469776 7094231 6744454 6418698 6114963 5830887 5564814 5316342 5085136 4869702
58876 4869702 4668150 4479875 4305560 4145503 3998713 3863797 3740059 3627337 3525187
58867 3525187 3432609 3348531 3272388 3204161 3143799 3090716 3044120 3003813 2970121 2942897 2921173
58856 2921173 2904185 2892284 2886292 2886289 2891534 2901358 2915719 2935101 2960308 2992136 3030884 3076387 3128743
58843 3128743 3188587 3256323 3331574 3413926 3503807 3602179 3709807 3827427 3956241 4097582
58833 4097582 4252355 4421383 4605928 4807271 5026158 5263562 5521711 5803531 6111060
58824 6111060 6445220 6807096 7198595 7621516 8076579 8563639 9082394 9632330 10211690
58815 10211690 10816211 11438553 12068913 12696087 13307568 13888732 14422771 14892013 15279329
58806 15279329 15568880 15747516 15807248 15746549 15569000 15281477 14894312 14422069 13882229 13292566
58796 13292566 12669804 12029531 11385469 10748390 10126479 9526551 8953977 8411790 7901254
58787 7901254 7423510 6979637 6569195 6190098 5840439 5519436 5226317 4959332 4716324
58778 4716324 4495249 4293378 4106724 3931015 3763035 3600885 3443764 3292071 3147209
58769 3147209 3010611 2882966 2764427 2655010 2554502 2462386 2378167 2301527 2232046 2169199
58759 2169199 2112764 2062815 2019185 1981286 1948522 1920451 1896473 1875858 1858180 1843321 1831006
58748 1831006 1820734 1812123 1804752 1797680 1789645 1779637 1766796 1750057 1728925 1704685 1679837 1655967
58736 1655967 1632833 1609628 1586167 1562480 1538193 1512928 1486638 1459099 1429775 1398695 1366786
58725 1366786 1334757 1302289 1268972 1235407 1202679 1171246 1141099 1112618 1086366 1062196 1039322
58714 1039322 1017262 996151 976212 957548 940569 926030 914301 904862 896691 889082 881994 875695
58702 875695 870174 864953 859477 853519 847025 839718 831136 821119 810006 798393 786948 776353 767092
58689 767092 759262 752829 747912 744535 742370 741294 741978 745193 750573 756879 763569 771201 779979 788835
58675 788835 796506 802914 808839 814868 821370 829107 839032 851484 866032 881936 898190 913186 924884
58662 924884 931581 932558 928165 919565 908264 895632 882800 870884 860906 853321 847907 844425 843163
58649 843163 844678 849292 857025 867721 880900 895830 912184 930496 951626 975871 1002988 1032956
58637 1032956 1066291 1103497 1144584 1189365 1238068 1291463 1350455 1415692 1487597 1566657 1653601
58626 1653601 1749364 1854953 1971262 2098832 2237760 2387958 2549355 2721457 2902520 3089405
58616 3089405 3278314 3465318 3645892 3814196 3963168 4085358 4173964 4223934 4232948 4201514
58606 4201514 4132213 4029271 3898803 3748457 3585713 3416391 3244842 3074827 2909515 2751143
58596 2751143 2601512 2462540 2335612 2220750 2117283 2025057 1944165 1873807 1812569 1759808
58586 1759808 1715656 1679465 1649148 1622359 1597596 1574076 1551420 1529726 1509216 1489483 1469749
58575 1469749 1450086 1431679 1415638 1402154 1390937 1381619 1373271 1364108 1352164 1335972 1314586 1287636
58563 1287636 1255752 1220489 1183531 1146287 1110173 1076584 1046319 1019464 995928 975624 958098
58552 958098 942554 928335 914840 901094 886134 869912 853144 836317 819562 803388 788547
58541 788547 775044 762236 750058 739198 729867 721408 713406 706124 699433 692396 684492 676390 668874
58528 668874 661827 654866 648262 642651 638388 635651 634431 634011 633212 631730 630546 630522 631252 631802 631875 631769
58512 631769 631849 632591 634451 637148 639750 641916 644323 647468 650961 654632 659369 665951 673834 682045 690620
58497 690620 700175 710535 720846 730799 740748 750615 759388 765805 769126 769372 767151 763178 757733 750752
58483 750752 742465 733536 724458 715278 705962 696503 686652 676307 666247 657660 650702 644426 638347 633123
58469 633123 629214 625913 622261 618072 613481 608354 602852 597822 593959 591167 589237 588435 588857 589929 591084
58454 591084 592235 593113 592891 591016 587791 583772 579335 575119 571868 569497 567376 565943 566685 569901 573792
58439 573792 576568 578231 579398 579735 578765 577044 575268 573117 570147 566938 564225 561805 559527 558435 559648
58424 559648 562822 566905 571630 577083 582635 587663 592701 598528 604738 610498 616159 622777 630432 638150
58410 638150 645045 650517 653897 655151 655437 655901 656372 656245 655969 656470 657710 659039 660477 662494 664994 667661
58394 667661 670771 674631 678751 682670 686973 692388 698490 704418 710195 716159 721734 726010 729026 731422
58380 731422 733512 735740 739156 744143 749368 753298 755986 758259 760116 761324 762574 764484 766334 767395
58366 767395 768626 771376 775299 779345 783919 790057 797165 803641 809320 815363 822099 828780 834998 840618
58352 840618 844801 847004 848405 850545 853090 854816 856069 858134 860862 863342 866485 872339 880828 889575
58338 889575 897173 904451 912383 920868 929871 939791 950360 960813 971292 982458 993886 1004577 1014858
58325 1014858 1025897 1037608 1048982 1060247 1072582 1085814 1098481 1110073 1121106 1131210 1139447
58314 1139447 1146477 1154133 1162742 1171070 1178932 1187646 1197850 1209053 1221317 1235168 1249872 1264138
58302 1264138 1278523 1294758 1312833 1331203 1349811 1370199 1392588 1415622 1439199 1464731 1492264
58291 1492264 1520188 1548314 1578542 1611861 1647277 1684198 1723321 1764691 1807426 1851793 1898928
58280 1898928 1948136 1997126 2045175 2093139 2139992 2182417 2218578 2249441 2276017 2298431 2318328
58269 2318328 2338921 2361646 2385574 2410721 2438874 2470562 2504499 2540819 2581587 2627293 2676094
58258 2676094 2727347 2782552 2842041 2904214 2968962 3038258 3112463 3189586 3269138 3353044 3441936
58247 3441936 3534405 3630780 3733465 3842524 3955238 4071203 4193550 4323903 4460698 4603821
58237 4603821 4756161 4918978 5090556 5271035 5463719 5669949 5887874 6118043 6364804
58228 6364804 6630239 6912300 7211081 7531223 7875978 8245037 8640659 9069645 9536586
58219 9536586 10041722 10588295 11185152 11839378 12553976 13336288 14201146 15162565 16231280
58210 16231280 17425014 18772819 20305779 22054518 24062619 26393948 29122932 32330402
58202 32330402 36115482 40595964 45882917 52062438 59211609 67427287 76845984 87672860
58194 87672860 100224721 114942355 132351542 153025125 177568418 206518957 240020392
58187 240020392 277290269 316105285 352634715 381945364 399292259 401796038 389590740
58180 389590740 365646150 334370015 299971403 265529907 232918538 203116933 176516799
58173 176516799 153152961 132890477 115527893 100810163 88434663 78096896 69526374
58166 69526374 62479575 56734613 52116010 48507500 45827432 44011050 43030173 42906493
58158 42906493 43671932 45292598 47590004 50171703 52417260 53608537 53205977 51099327
58150 51099327 47631350 43382705 38902883 34564302 30561132 26969475 23801050 21036144
58142 21036144 18642376 16583400 14821409 13318174 12036636 10942914 10008033 9207867
58134 9207867 8521139 7928164 7411581 6956595 6549713 6178999 5836436 5518020 5220470
58125 5220470 4939825 4674174 4425089 4194549 3982363 3787830 3611503 3453486 3312012
58116 3312012 3185342 3072959 2973189 2881648 2793894 2707931 2622852 2537398 2451782 2368861 2291294
58105 2291294 2219016 2151131 2088421 2031949 1980682 1932417 1885774 1839640 1792191 1742464 1691862
58094 1691862 1642507 1595019 1549147 1505281 1463881 1424469 1386502 1350205 1315553 1281715 1248515
58083 1248515 1217057 1187831 1159711 1131911 1105338 1080836 1057779 1035755 1016006 999540 985237
58072 985237 971378 957747 944770 931982 919036 907040 897133 888654 880196 871513 863013 854434 845530
58059 845530 837139 830018 823367 815829 807146 797633 787012 775158 763168 752294 742508 733335 725252
58046 725252 718988 714161 709839 705761 701890 697671 692933 688698 685844 683782 681693 680198 680410 682085
58032 682085 684165 686450 689232 691745 692587 691588 690047 689215 689373 690143 690843 690859 690347 690173 690625 690977 690919 691419
58014 691419 693230 695571 697395 699048 701354 703828 705151 704833 703125 699835 694555 687622 679545 669814
58000 669814 657505 642764 626649 609802 592348 574683 557195 539515 521232 503227 487317
57989 487317 474832 466429 462855 464643 471033 480136 490163 499916 508526 515714 522131 528575 535014 541019
57975 541019 546692 552408 558110 563727 569775 576461 582662 586929 589319 591165 593174 594786 595287 594617 593128
57960 593128 591445 590488 590812 591932 592945 593648 594368 595076 595477 595718 596077 596124 595004 592411 588545 583417 576973
57943 576973 569621 561671 552520 541331 528417 515066 502115 489603 477698 466977 457720 449712
57931 449712 442810 437021 432075 427550 423300 419219 414886 410148 405724 402382 399757 396866 393555 390510
57917 390510 388034 385933 384589 385144 388358 394013 401448 410026 419113 428431 438405 449380 460523 470314
57903 470314 478170 484839 491169 497154 502154 505379 506233 504955 502777 500722 498373 494589 489222 483107
57889 483107 476636 469566 462318 456246 452221 449940 448908 449155 450576 452537 454647 457227 460516 463983
57875 463983 466927 469262 471377 473593 475982 478286 479879 480255 479640 478621 477148 474513 470404 465362 460079
57860 460079 454872 449938 445485 441490 437960 435490 434836 435822 437441 439264 441882 445681 450040 454268 458536
57845 458536 463172 467568 470570 471780 471837 471439 470475 468194 464051 458262 451478 443980 435514 426120 416593
57830 416593 407568 398530 388458 377298 366057 355686 346679 339519 334413 330407 325853 320158 314270
57817 314270 309164 304740 300654 297273 295163 294248 294077 294527 295756 297949 301431 306554 313097 320360 328254
57802 328254 337689 349397 362946 377459 392714 408759 424732 438807 449287 455483 457792 457334
57790 457334 455241 451844 446590 438929 429012 417382 404507 390976 377686 365271 353564 342132
57778 342132 331084 320969 312088 304369 297770 292350 287989 284434 281627 279713 278766 278715 279534 281286 283951
57763 283951 287282 290877 294455 298131 302285 306935 311469 315352 318903 322912 327576 332438 337286 342427
57749 342427 347951 353515 359058 365030 371502 377790 383453 388995 395005 401149 406728 411821 417243 423613
57735 423613 431073 439582 448824 458029 466644 475160 484657 495596 507608 520520 534926 551455 569888
57722 569888 589392 609493 630706 654195 680814 710415 742167 775650 811565 851282 895854
57711 895854 945603 1000543 1060995 1127818 1202160 1285032 1377179 1479471 1593112 1719045 1857201
57700 1857201 2006859 2167827 2340663 2525367 2720109 2921269 3124069 3322686 3510132
57691 3510132 3678666 3820450 3928061 3995331 4018718 3998206 3936930 3840362 3715941 3572504
57681 3572504 3418747 3261647 3106323 2957016 2817671 2691715 2581885 2490404 2419112 2369525
57671 2369525 2343009 2340677 2362350 2404884 2460796 2517862 2560415 2573074 2546102 2479222 2380988
57660 2380988 2264410 2142253 2024525 1917884 1825882 1749533 1688292 1641193 1607703 1587895
57650 1587895 1581827 1588806 1607517 1637080 1677708 1730136 1794720 1871402 1960258 2061509 2175095
57639 2175095 2300608 2437637 2585733 2743865 2910004 3081080 3252804 3419331 3573292
57630 3573292 3706577 3811521 3881987 3913991 3905808 3857880 3772918 3655860 3513076 3351115
57620 3351115 3176235 2994804 2813129 2636057 2465970 2303709 2150314 2007388 1875983
57611 1875983 1755907 1646276 1546280 1455214 1372158 1296033 1226045 1162061 1104455 1053360 1007973
57600 1007973 966858 929141 895105 865292 839262 815644 793236 771738 751488 732911 716189
57589 716189 701088 687042 673569 660549 648085 636336 625709 616810 609876 604527 600466 597959
57577 597959 597117 597102 596917 596851 598302 602048 607466 613673 620730 629249 639386 650772 663260 677214 693053
57562 693053 710817 730319 751664 775479 802543 833221 867461 905365 947447 994244 1046115
57551 1046115 1103773 1168582 1241732 1323277 1412473 1508939 1613028 1725224 1845750 1974575
57541 1974575 2110997 2252914 2396804 2538394 2672909 2794784 2897926 2976750 3026952 3045660
57531 3045660 3031707 2986117 2911964 2813615 2696287 2565974 2428758 2289634 2152193 2019325
57521 2019325 1893525 1776282 1667845 1568040 1476958 1394689 1320974 1255496 1198050 1148117 1104724
57510 1104724 1067124 1035203 1008883 987583 970633 957750 948623 942485 938686 937445 939466 945057
57498 945057 954135 966949 984208 1006433 1033564 1065253 1101339 1142212 1188961 1243029 1305378 1376048
57486 1376048 1454730 1541547 1637005 1741332 1854193 1974807 2101862 2233254 2366016 2496308
57476 2496308 2619176 2728592 2818273 2882704 2917590 2920019 2889027 2826187 2735350 2621714 2491104
57465 2491104 2349505 2202357 2053971 1907699 1766501 1632886 1508324 1393233 1287682
57456 1287682 1191713 1104926 1026285 954733 889800 831346 778852 731289 687726 647888 612007
57445 612007 580107 551515 525202 500605 477930 457505 439075 421976 405894 391087 377768
57434 377768 365591 353946 342606 331828 321879 312680 304037 296001 288661 281695 274573 267451 261371
57421 261371 257030 253691 249983 245714 242038 239725 238141 236363 234417 232657 230692 227921 224850 222826
57407 222826 222436 222946 223337 223184 222474 221374 220333 219749 219341 218456 217177 216376 216395 216464 215903 215156 214949 215049
57389 215049 214722 214085 214035 214889 215993 216836 217785 219338 221232 222834 224091 225544 227520 229749 231881 233956
57373 233956 236112 238124 239607 240718 242252 244831 248146 251282 253714 255684 257615 259526 261253 262944
57359 262944 264933 267184 269255 270948 272742 275295 278597 281909 284628 286951 289411 291881 293477 293675
57345 293675 293177 293303 294530 296023 296649 296185 295404 295251 296170 298051 300576 303585 307328 312389 319238 327706
57329 327706 336958 346039 354544 362764 371181 379900 388688 397507 406731 416720 427397 438578 450501
57316 450501 463665 478113 493284 508746 524762 541942 560610 580696 601960 624005 646358
57305 646358 668978 692568 717996 745328 773768 802505 831233 859845 888118 915920 943203
57294 943203 969368 992953 1012476 1027456 1038117 1044193 1044679 1038950 1027641 1012175 993815 973436
57282 973436 951774 929356 906396 883247 860916 840722 823422 808995 797161 787659 780026 773644
57270 773644 768268 764222 761908 761360 762291 764293 766953 770184 774557 780805 788833 797634 806460 815527 825225
57255 825225 835217 844990 854885 865803 878015 890926 903982 917112 930196 942766 954587 966111
57243 966111 978064 990835 1004462 1018918 1034139 1049903 1065934 1082186 1099061 1117390 1137967
57232 1137967 1160797 1184857 1208905 1232436 1255641 1278651 1301351 1323935 1347031 1371019 1395596
57221 1395596 1420237 1444782 1469382 1494191 1519349 1545042 1571307 1597897 1624482 1650881 1677080
57210 1677080 1703279 1729944 1757486 1785680 1813724 1841155 1868532 1896989 1927145 1958511 1989858
57199 1989858 2020115 2049034 2077060 2104539 2131272 2157151 2182920 2209682 2237559 2265454 2292396
57188 2292396 2318652 2345188 2372453 2400194 2428226 2456913 2486860 2518388 2551343 2585394 2620555
57177 2620555 2657317 2696036 2736301 2777304 2818814 2861210 2904403 2947328 2988830 3028604 3066832
57166 3066832 3103331 3137592 3169427 3199121 3227019 3253312 3278148 3301678 3324087 3345652 3366516
57155 3366516 3386349 3404640 3421571 3438197 3455498 3473705 3492811 3513163 3535033 3558133 3582176
57144 3582176 3607603 3635104 3664677 3695732 3727905 3761090 3794845 3828342 3860853 3891720 3919937
57133 3919937 3944398 3964673 3981228 3994999 4007140 4018992 4031703 4045867 4061846 4080256 4101711
57122 4101711 4126342 4154059 4185080 4219738 4258101 4300464 4348016 4402366 4464692 4536208 4619361
57111 4619361 4717737 4834758 4973299 5136584 5328759 5554763 5821002 6137027 6516414 6976140
57101 6976140 7535767 8217140 9043643 10038786 11225150 12623834 14253593 16130551 18270369
57092 18270369 20691815 23417673 26471007 29869205 33618278 37705762 42087917 46669848
57084 46669848 51285766 55697136 59626585 62824103 65130566 66496835 66951280 66551804
57076 66551804 65362830 63461621 60948532 57942809 54569624 50950629 47199213 43415469
57068 43415469 39681555 36061863 32607562 29360183 26351456 23601330 21117264 18895810
57060 18895810 16925662 15190498 13670326 12342082 11181242 10164431 9270784 8481201
57052 8481201 7777598 7143996 6568376 6043089 5563701 5127485 4732145 4374783 4051639
57043 4051639 3758840 3493181 3251931 3032212 2831136 2646629 2477883 2324763 2186723
57034 2186723 2062135 1948665 1844396 1748531 1660851 1580774 1507368 1440119 1378958 1323396 1272247
57023 1272247 1224550 1180211 1139431 1102049 1067870 1037116 1009897 985605 963492 943774 927598
57012 927598 916039 909611 908636 913533 924806 943359 970993 1010204 1063488 1133212 1221976 1331920
57000 1331920 1462142 1605643 1748029 1869427 1949691 1975326 1944589 1867341 1759727 1637784
56990 1637784 1513873 1396318 1290088 1197389 1118484 1052753 999182 956150 921375 892444 867240
56979 867240 843853 820569 796366 771285 745994 721084 696994 674354 653821 635496 618884
56968 618884 603670 590294 579547 571774 566662 563728 562834 564295 568577 575878 585891 597948 611154
56955 611154 623971 633714 637190 632598 620807 604416 585601 565263 543996 523039 503755 486674
56943 486674 471652 458849 449029 442800 439978 439909 442265 447378 455944 468537 485344 506118 530166
56930 530166 556134 581625 603102 616690 619697 611744 594611 571052 543736 514897 486296 459107
56918 459107 433821 410523 389309 370462 354325 341121 330713 322415 315175 308269 301780 296261
56906 296261 291978 288707 286155 284177 282542 280910 279304 278303 278471 279705 281379 283079 285049 288084
56892 288084 293161 300921 311196 323110 335907 349620 364606 380392 395218 406808 413564 415118
56880 415118 412107 405631 396832 386793 376647 367516 360117 354436 350031 346739 345049 345807 349731 357239
56866 357239 368542 383719 402731 425610 452695 484519 521059 560785 600362 635428 661888
56855 661888 676862 679123 669302 649855 624363 596388 568718 543394 521936 505179 493143 485447
56843 485447 482038 483499 490725 504363 524528 551115 584525 626016 676872 736841 803214 871112
56831 871112 934134 984841 1015949 1022760 1005358 968510 919328 864658 809672 757545 709746 666800
56819 666800 629172 597515 572238 553160 539858 532330 531217 537351 551158 572586 601612 638388
56807 638388 682138 729524 774407 809739 829986 832280 816473 785108 743118 696336 649410 604908
56795 604908 564017 527496 495884 469386 448038 431826 420482 413435 410240 410978 416101 426014 440836
56782 440836 460372 484012 510363 536782 559293 573547 576630 568309 550611 526364 498250 468669
56770 468669 439599 412230 387086 364580 345068 328326 313515 300006 287889 277412 268317 260136
56758 260136 252834 246691 241666 237296 233231 229543 226439 223883 221565 219084 216155 212845 209646 207161
56744 207161 205574 204508 203462 202332 201398 200834 200356 199460 197938 196093 194431 193238 192423 191659 190665 189477
56728 189477 188459 187899 187617 187176 186541 186172 186319 186513 186091 185091 184289 184368 185287 186412 187054 186927 186243 185434
56710 185434 184760 184257 184008 184108 184298 184032 183156 182170 181521 181017 180344 179772 179778 180188 180294 179731 178678 177335 175812
56691 175812 174526 174055 174438 175077 175496 175741 176001 176263 176472 176600 176401 175538 174136 172871 172347 172608 173245 173679
56673 173679 173385 172289 171009 170301 170235 170276 170118 169936 169832 169621 169273 169010 168810 168372 167748 167467 167807 168438 168973
56654 168973 169341 169440 169013 168144 167331 166731 165901 164678 163713 163600 163961 163953 163337 162499 161780 161351 161495 162352 163452
56635 163452 164062 164056 164058 164665 165812 166971 167728 168075 168251 168368 168278 167811 167025 166091 165137 164406 164286 164762 165160 165008
56615 165008 164924 165859 167599 168936 169392 169755 170689 171811 172560 173020 173306 173058 172246 171677 171957 172632 173111 173640
56597 173640 174491 174993 174510 173796 174115 175310 176008 175606 174921 174818 175315 176238 177765 179946 182367 184551 186222
56580 186222 187152 187410 187780 189173 191509 193870 195906 198281 201527 205232 208775 212258 216263 221125 226818
56565 226818 233131 239640 245870 251814 257946 264468 270900 276738 282161 287699 293376 298612 302957 306615
56551 306615 310118 313500 315924 316317 314450 311201 307579 303800 299543 294782 289784 284508 278678 272454
56537 272454 266396 260614 254560 247927 241306 235616 231188 227685 224659 221931 219642 218082 217273 216625 215270
56522 215270 212903 209983 207001 203908 200548 197365 195202 194378 194262 193880 192818 191469 190445 189936 189755
56507 189755 189810 190188 190718 190893 190592 190534 191543 193503 195433 196560 196888 196801 196608 196576 196925 197563 198144 198538 199009
56488 199009 199843 201108 202880 205336 208389 211507 214176 216392 218500 220725 223079 225602 228364 231284
56474 231284 234148 236924 239923 243568 248027 253067 258221 263054 267332 271075 274459 277583 280269 282173
56460 282173 283156 283377 282925 281613 279400 276861 274820 273575 272875 272571 272827 273632 274618 275564 276678 278208
56444 278208 280109 282187 284189 285628 286042 285593 284972 284501 283760 282265 279966 276928 273131 268912 265007
56429 265007 261746 258762 255748 252859 249988 246487 242141 237651 233524 229260 224385 219515 215496 212193
56415 212193 209149 206732 205494 204926 204196 203702 204529 206565 208572 210049 211614 213392 214503 214579 214557 215335
56399 215335 216633 217798 218877 220265 221967 223749 225452 226734 227092 226587 226032 226016 226274 226395 226648 227620
56383 227620 229430 231724 234105 236221 237695 238338 238288 237771 236913 235872 234952 234519 234967 236574 239075 241539
56367 241539 243145 244024 244911 246194 247740 249421 251112 252382 252936 253206 253796 254524 254886 255294 256777 259449
56351 259449 262417 265375 269126 274083 279372 284045 288272 292713 297511 302552 308015 313895 319560 324499
56337 324499 329141 334264 339925 345433 350165 353985 357158 360186 363458 366719 369178 370365 370540 370150 369344
56322 369344 368259 367250 366510 365847 365069 364166 362969 361174 358982 357195 356344 356145 356060 355957 355988 356303 357087
56305 357087 358416 359869 360829 361400 362416 364347 366774 369207 371789 374860 378448 382580 387511 393246 399397
56290 399397 405955 413632 422937 433365 444015 454639 465698 477689 490850 505231 520771 537509
56278 537509 555864 576406 599279 624270 651513 681643 715224 752541 793981 839948 890322
56267 890322 944763 1003721 1068377 1139322 1216003 1297675 1384060 1474756 1568830 1665423 1763944
56256 1763944 1863130 1960543 2053504 2140048 2218755 2288413 2348400 2398749 2439384 2469844 2490117
56245 2490117 2501194 2504459 2501068 2492072 2478273 2459634 2435626 2406506 2373362 2336461 2294505 2246126
56233 2246126 2191312 2130803 2065024 1994391 1919953 1842931 1764133 1684340 1604596 1525532 1447138
56222 1447138 1369890 1295471 1225624 1160842 1100783 1045391 994920 949347 908358 871470 837809
56211 837809 806468 777526 751932 729823 709774 690379 671870 655419 641521 629781 619754
56200 619754 611236 604166 598790 595453 593815 592925 592414 592869 594584 596842 599032 601542 604865 608701 612649
56185 612649 616910 621533 625774 629040 631716 634294 636446 637766 638634 639523 640177 640321 640540 641613 643639
56170 643639 646493 650474 655786 662069 669071 677061 686103 695833 706428 718686 732587 747099 762142
56157 762142 779347 799910 823086 848022 875759 908107 945753 988934 1038891 1097179 1164513
56146 1164513 1241743 1331082 1434844 1553689 1687257 1835371 1996736 2166957 2339149 2505989
56136 2505989 2660504 2796763 2912301 3009575 3093534 3167976 3234772 3294580 3345876 3384258 3405366
56125 3405366 3408657 3397036 3373629 3340805 3301240 3256805 3205664 3142206 3060522 2957308 2832329
56114 2832329 2688364 2531206 2368200 2206021 2049910 1903970 1770689 1650524 1543221
56105 1543221 1449220 1368759 1300389 1241820 1191655 1149102 1112830 1081619 1055392 1034088 1016261
56094 1016261 1000413 986848 976524 968832 962254 956396 951519 946919 941853 937418 935435 935951 937740
56081 937740 940582 944941 950057 954623 958940 964331 970859 977731 985313 994424 1004109 1012572 1020068 1028505
56067 1028505 1038465 1048937 1059786 1071986 1085408 1098767 1111902 1125960 1141237 1156881 1172770
56056 1172770 1189675 1207638 1226089 1245382 1266245 1288016 1309433 1330818 1353419 1377118 1400992
56045 1400992 1425543 1451929 1479447 1506213 1532032 1558279 1585520 1613626 1643520 1676140 1710208
56034 1710208 1743683 1776748 1810628 1844459 1876557 1908086 1942042 1979052 2017566 2057716 2101306
56023 2101306 2148210 2196433 2245791 2298055 2353465 2410568 2469464 2531760 2597363 2664755 2734276
56012 2734276 2807670 2884735 2964084 3046761 3135119 3228563 3324480 3422957 3526265 3634150 3744291
56001 3744291 3857185 3975833 4100786 4230345 4365340 4508514 4659384 4815195 4977016
55992 4977016 5149416 5334126 5529778 5737776 5962198 6203744 6460253 6733623 7029659
55983 7029659 7350781 7695772 8067132 8471359 8911583 9387709 9904524 10471562 11094292
55974 11094292 11774362 12519713 13345545 14264461 15285995 16427856 17717791 19183514 20853300
55965 20853300 22770209 24995540 27597846 30653348 34260044 38533672 43580030 49482016
55957 49482016 56319424 64193400 73241930 83670128 95791528 110032474 126893423
55950 126893423 146924956 170720297 198802587 231289640 267378365 304853752 339926692
55943 339926692 367740290 383683393 385078188 372267276 348326073 317607550 284155136
55936 284155136 250867259 219473721 190850709 165319080 142873943 123361099 106564644
55929 106564644 92218560 80020749 69675970 60920456 53511664 47224441 41868447
55922 41868447 37292655 33366787 29972829 27017397 24435291 22173580 20182477 18423103
55914 18423103 16869407 15496202 14274651 13182101 12205505 11331536 10542772 9826546 9178047
55905 9178047 8591264 8055332 7562694 7112502 6702738 6326518 5978966 5660288 5369137
55896 5369137 5099867 4849116 4618368 4407232 4210538 4024825 3851573 3691364 3540737
55887 3540737 3397487 3263385 3138984 3021134 2908253 2802763 2705566 2613146 2523006 2437368
55877 2437368 2358703 2285886 2217195 2152879 2092242 2032319 1972012 1913929 1859989 1808932 1760125
55866 1760125 1715779 1677050 1641744 1608294 1578618 1554764 1536068 1521782 1513136 1510369 1510697 1511241
55854 1511241 1511063 1508423 1499299 1480975 1454538 1422054 1384126 1341972 1298703 1256196 1213351 1169506
55842 1169506 1126946 1087966 1051989 1017761 985976 957655 932144 908741 888270 871128 855812
55831 855812 841055 827460 815536 804340 793589 784804 778632 773295 767357 761767 757385 752851 746864
55818 746864 740464 734875 729036 721345 712196 702777 692897 681893 670308 659004 647952 637283 627966
55805 627966 620056 611991 603102 595057 589304 584852 580183 575504 571264 566260 559253 551069 543163 535424
55791 535424 527183 519120 512266 506317 500701 496253 494016 493268 492253 489860 485209 476835 464095 448546
55777 448546 432456 416705 401413 387461 375781 365937 356845 348222 340190 332457 325053 318868 314170
55764 314170 309629 304105 298372 293702 289726 285133 279544 273333 266419 258626 250427 242023 232445 220924
55750 220924 208494 197126 188009 181747 179234 180844 185365 190968 196701 202118 206384 209010 210712 212320
55736 212320 213496 213644 213376 213870 215308 216999 218471 219508 219713 219025 218078 217282 216186 214427 212472 210758
55720 210758 209133 207859 207970 209705 211814 213456 215580 219328 224324 229773 235930 243062 250149 256236
55706 256236 262023 268399 274362 278161 279784 280484 280387 278360 273990 268068 261277 253894 246664 240652 236220
55691 236220 233102 231216 230485 230369 230636 232141 235682 240476 244809 247741 249222 249162 247633 245533 243822
55676 243822 242425 240817 239222 238198 237568 236853 236245 236142 236313 236555 237440 239182 240491 239908 237723 235299
55660 235299 233091 230701 228292 226386 224666 222381 219594 216648 212915 207600 201390 195642 190203 183710
55646 183710 175959 168313 161692 155716 149971 144654 139750 134906 130354 126737 123873 120908 117830 115537
55632 115537 114194 112779 110643 108412 106928 106216 105806 105267 104204 102485 100655 99425 98732 97937 96717
55617 96717 95016 92527 89329 86690 85908 86481 86727 86152 85783 86115 86390 86305 86857 88650 90613 91302 90642
55600 90642 89564 88681 88113 88011 88402 88773 88389 86998 84927 82716 80763 79097 77489 75951 74964 74793
55584 74793 74873 74432 73486 72578 71764 70651 69338 68498 68456 68977 69928 71446 73337 75091 76558 77976 79264
55567 79264 79987 80111 80161 80520 81107 81733 82214 82223 81642 80973 80726 80529 79588 77955 76608 76316 77155 79025 81818
55548 81818 85029 88005 90663 93350 96101 98721 101392 104345 107038 108679 109486 110416 111630 112274 111977
55533 111977 111436 111265 111239 111084 111023 111038 110421 108634 106004 103159 100300 97416 94628 91967 89213 86221 83008
55516 83008 79477 75602 71917 69127 67159 65285 63287 61658 60501 59138 57268 55612 54786 54163 52562
55501 52562 49774 46831 44940 44521 45120 45982 46674 47262 47896 48464 48821 49012 48855 47724 45379 42725 40997
55484 40997 40380 40161 40054 40404 41104 41347 40713 39720 39034 38805 38913 39173 39109 38267 36934 35914 35437 35016 34492
55465 34492 34400 34996 35680 35809 35481 35214 35337 35960 36987 37980 38453 38479 38549 38852 39243 39784 40520 40819 39874 38005
55445 38005 36520 36070 36104 36187 36818 38371 40171 41305 41736 42063 42677 43610 44682 45398 45225 44357 43691 43735
55427 43735 44059 44121 44030 44167 44619 45324 46197 46846 46777 46201 46031 46703 47576 47825 47375 46679 46210 46414 47502 48945
55407 48945 49857 50150 50589 51483 52178 52215 52016 51828 50893 48444 44898 41390 38713 37265 37260 38189 38721 38067
55389 38067 36997 36773 37451 37988 37690 36778 35803 35190 35176 35600 35915 35858 35820 36181 36660 36790 36604 36282 35605 34386
55369 34386 33143 32617 32864 33393 33942 34553 35058 35098 34547 33541 32300 31288 31153 32049 33313 34300 35095 35902
55351 35902 36261 35697 34770 34577 35267 35892 35766 35249 34981 34972 34744 33980 32841 31866 31660 32425 33709 34793 35313
55332 35313 35442 35584 36073 36976 38009 38769 39225 39723 40331 40495 39700 38223 36897 36308 36504 37275 38341 39341
55314 39341 39948 39989 39411 38384 37507 37499 38328 39002 38565 37105 35487 34382 33886 33835 34080 34536 35227 36124 36782
55295 36782 36467 34918 32711 30610 28913 27729 27397 28034 28930 29103 28454 27866 27998 28457 28414 27788 27481 28359
55277 28359 30205 31935 32806 33045 33096 32794 31842 30779 30636 31626 32940 33969 34919 35975 36645 36434 35650
55260 35650 35038 35001 35468 36091 36303 35662 34460 33588 33565 34136 34896 35638 35932 35298 34190 33918 34981 36276
55242 36276 36634 36344 36360 36756 36972 37019 37339 37714 37365 36071 34389 32806 31419 30415 30158 30755 31994 33648
55224 33648 35370 36514 36581 35823 34981 34607 34937 36080 37847 39667 41174 42540 43786 44286 43595 42324
55208 42324 41405 40782 39668 37896 36201 35205 34844 34800 34867 34920 35015 35405 35998 36055 35061 33622 32824 32913 33277 33500
55188 33500 33657 33766 33745 33832 34268 34668 34509 34122 34341 35220 36050 36597 37272 37882 37393 35428 33121 31820 31611
55169 31611 31730 31868 32327 33172 33952 34290 34349 34626 35432 36571 37494 37781 37421 36599 35462 34278 33568 33713
55151 33713 34595 35898 37525 39368 40981 42013 42704 43485 44295 44915 45719 47397 49949 52595 54700 56342
55135 56342 58024 60334 63687 67804 71574 74020 75261 75883 75761 74389 72119 69960 68138 65950 63216
55120 63216 60742 59012 57514 55860 54599 54235 54285 54006 53387 52732 51894 50679 49576 49303 49958 51202 52931
55103 52931 55077 57032 58018 58031 57821 57903 58058 57869 57373 57042 57263 57915 58426 58367 58032 58165 59051 60160 60843
55084 60843 61052 61178 61433 61708 61796 61534 60873 60055 59552 59678 60371 61409 62571 63531 63990 64160 64751 66152
55066 66152 67884 69233 70155 71135 72253 72912 72657 71943 71833 72937 74814 76512 77617 78581 79925 81441
55050 81441 82521 83138 83996 85603 87589 89113 89662 89227 87999 86252 84382 82778 81620 80937 80806 81297
55034 81297 82222 83086 83423 83143 82533 81902 81333 80834 80528 80444 80172 79094 77041 74465 71883 69472 67354
55017 67354 65793 64846 64165 63484 62947 62651 62253 61495 60711 60311 60149 59948 59975 60548 61148 60901 59861 58962 58668
54998 58668 58445 57738 56740 55948 55586 55774 56753 58536 60675 62583 63940 64787 65562 66942 69244 72021 74646
54981 74646 77161 80028 83243 86393 89497 93065 97298 101972 107132 113119 119893 127213 135616 146205
54967 146205 159087 172922 186427 199424 211889 222955 231622 237719 241290 241672 238105 230880 221087
54954 221087 209529 196685 183419 170783 159059 147723 136429 125460 115304 106417 99513 95352
54942 95352 93824 93541 92790 90910 88637 87094 86563 86345 85787 85194 85442 86911 89173 91737 94607 98030
54926 98030 102215 107492 114317 122752 132229 142081 151981 161673 170552 177791 182678 184720 183770 180263 174988
54911 174988 168433 160645 151776 142314 132597 122724 113217 105209 99448 95468 92244 89288 86684 84455
54897 84455 82487 80914 80000 79658 79503 79281 78956 78469 77780 77100 76736 76669 76486 75729 74264 72477 71102 70603
54879 70603 70582 70091 68698 66923 65475 64397 63232 61717 59979 58255 56703 55336 54030 52734 51709
54864 51709 51248 51117 50753 50104 49766 50047 50466 50457 50105 49801 49669 49757 50329 51480 52782 53742 54303 54539 54249
54845 54249 53369 52407 51962 52036 52260 52505 52807 52980 52810 52507 52566 53290 54728 56772 58998 60743 61761 62548
54827 62548 63688 65205 66937 69064 71756 74687 77511 80555 84396 88993 93827 98776 104254 110586
54813 110586 117771 125809 134822 144862 155863 167566 179122 189068 196167 200121 201196 199548 195432
54800 195432 189631 183013 175847 168061 159873 151654 143523 135775 129309 124833 121804 118941 115689 112463
54786 112463 109643 107229 105431 104636 104628 104682 104686 105478 107761 111260 115260 119440 123924 128974 134933 142178 150875
54769 150875 160903 171993 183729 195620 207546 219876 232563 244356 253632 259947 264108 266771
54757 266771 267753 266717 263673 258569 251256 242207 232579 223147 213675 203583 192680 181014 168788
54744 168788 156891 146801 139312 133767 128995 124559 120578 116845 112857 108508 104137 100035 96395 93558
54730 93558 91755 90635 89499 88015 86327 84593 82831 81289 80469 80604 81339 82102 82577 82739 82660 82503 82608
54713 82608 83274 84387 85426 85969 86003 85606 84550 82652 80537 79517 80355 82414 84357 85454 85942 86389
54697 86389 87169 88408 89924 91215 91871 91968 91773 91215 90127 88925 88470 89167 90671 92523 94588 96693
54681 96693 98363 99255 99582 99927 100830 102664 105496 108880 112050 114551 116516 118274 120005 121925 124409
54666 124409 127620 131249 134904 138595 142638 147237 152364 157967 164051 170583 177396 184208 190760 197100
54652 197100 203822 211941 222328 235100 249364 263563 276328 287198 296373 303689 308080 308246 303601
54639 303601 294397 281384 265804 249350 233362 218107 203350 189504 177548 167790 159433 151583
54627 151583 144138 137451 131729 127095 123789 121841 120769 119919 118981 117997 117096 116418 116115 116232 116687 117397
54611 117397 118217 118793 118802 118320 117665 116810 115358 113177 110677 108368 106447 104962 103947 103248 102580 101905 101449
54594 101449 101157 100516 99110 97047 94638 92027 89396 87220 85896 85245 84604 83421 81687 79946 78874
54579 78874 78686 79002 79505 80500 82332 84292 84895 83478 81021 79006 77952 77440 77089 76934 77036 77252 77420
54562 77420 77515 77684 78247 79434 80965 82187 82863 83571 84994 87048 89050 90586 91839 93188 94905 97294
54546 97294 100761 105506 111242 117324 123159 128540 133648 138820 144267 150033 156079 162321 168552 174332
54532 174332 178869 181125 180380 176939 172033 166746 161207 154929 147667 139667 131525 124245 118995 116114
54518 116114 114514 112741 110462 108277 106308 103974 101195 98807 97403 96568 95696 94901 94599 94704 94732 94432
54502 94432 93962 93747 94295 95763 97551 98795 99281 99317 98754 97126 95002 94107 95317 97375 98453 98338 98190
54485 98190 98615 99128 99286 99322 99454 99345 98552 97133 95562 94277 93363 92508 91312 89774 88340 87342 86687
54468 86687 86200 85958 86043 86312 86681 87257 87900 88080 87563 86902 86827 87451 88404 89397 90230 90647 90634 90539 90486 90054 88963
54447 88963 87688 86843 86330 85729 85171 85127 85466 85462 84675 83330 81877 80660 79938 79733 79715 79574 79386 79321 79264 79115
54427 79115 79133 79480 79750 79606 79599 80679 82943 85512 87563 88944 89850 90519 91324 92625 94387 96244 97912
54410 97912 99310 100476 101674 103324 105499 107868 110450 113853 118131 122079 124527 125905 127490 129479
54396 129479 130962 131596 132000 132359 131946 130376 128269 126228 124150 121952 120027 118408 116379 113558 110585
54381 110585 108103 105793 103170 100631 98802 97371 95507 93203 91243 89944 88768 87306 85944 85332
54367 85332 85638 86524 87523 88315 88904 89640 90850 92346 93517 94038 94339 95172 96784 98665 100148 101099 101888
54350 101888 102830 103970 105402 107366 109812 112223 114196 115878 117457 118559 118674 117979 117078 116063 114474
54335 114474 112213 109837 107874 106458 105725 105834 106327 106123 104567 102012 99081 95914 92550 89453 87059
54320 87059 85143 83193 81142 79257 77562 75954 74699 74242 74505 74855 74837 74586 74390 74187 73683 72843 72075
54303 72075 71847 72124 72243 71515 69950 68221 66915 66065 65457 65072 65005 65180 65376 65398 65141 64663 64285 64370 64814
54284 64814 65035 64702 64257 64421 65330 66453 67254 67624 67658 67299 66373 64908 63340 62354 62414 63454 65013 66646
54266 66646 68133 69445 70674 72000 73489 74924 76032 76829 77582 78457 79427 80381 81071 81049 80072 78535 77108
54249 77108 76015 75104 74527 74694 75412 75789 75296 74376 73575 72649 71097 69151 67588 66751 66357 66235 66660 67824
54231 67824 69367 70646 71353 71775 72446 73504 74425 74559 73888 73004 72343 71815 71313 71062 71164 71293 71254 71542
54213 71542 72776 74723 76389 77056 76855 76322 75816 75458 75355 75668 76520 77805 79064 79704 79433 78393 76856
54196 76856 75104 73666 73179 73625 74065 73621 72487 71542 71131 70802 70206 69665 69691 70348 71279 72108 72620 72748
54178 72748 72507 71859 70700 69130 67624 66682 66368 66432 66788 67436 68018 67956 67258 66754 67186 68316 69253 69581
54160 69581 69734 70282 71145 71761 71814 71545 71324 71242 71287 71653 72510 73521 73995 73657 72882 72059 71102 69891 68828
54141 68828 68456 68675 68791 68379 67706 67291 67348 67778 68426 69140 69697 69822 69360 68488 67791 67850 68526 68823 67869 65966
54121 65966 64333 63767 63925 64019 63848 63859 64409 65319 66133 66615 66874 67112 67329 67344 67083 66722 66448 66132 65391 63993
54101 63993 62117 60250 58908 58354 58412 58538 58244 57542 56899 56722 56966 57240 57213 56892 56577 56635 57308 58646 60439
54082 60439 62094 62786 62101 60628 59607 59811 60947 62288 63503 64576 65300 65494 65586 66307 67587 68357 67813
54065 67813 66520 65864 66544 68033 69403 70241 70606 70528 69941 69079 68599 69101 70631 72760 75101 77525 79953
54048 79953 82224 84283 86202 87825 88706 88765 88883 90363 93707 98227 102882 107126 110875 114146 117198
54033 117198 120711 125345 131067 137239 143331 149199 154678 159357 163025 166073 169060 171991 174373 176018
54019 176018 177451 179312 181545 183417 184299 184253 183843 183519 183212 182420 180632 177780 174375 171208 168752 166794
54003 166794 164612 161625 157981 154513 152040 150665 149827 148983 148067 147194 146158 144503 142042 139105 136301
53988 136301 134189 133028 132583 132134 130966 128989 126765 124862 123399 122166 120944 119614 118206 117030 116524
53973 116524 116739 117106 116948 116140 115102 114233 113552 112844 111984 111102 110538 110600 111217 111866 111994 111549 111032 111007 111644
53954 111644 112713 113853 114771 115340 115678 116164 117190 118773 120485 121973 123477 125606 128597 132110 135894
53939 135894 140254 145504 151232 156621 161366 165769 169920 173329 175573 176849 177650 178213 178593 178997 179690
53924 179690 180713 181914 183121 184144 184861 185590 187162 190283 194821 199933 204864 209433 213845 218296 222884
53909 222884 227749 233144 239199 245536 251206 255309 257781 259345 260589 261329 261016 259577 257595 255724 254112
53894 254112 252358 249982 246950 243690 240488 237022 232736 227614 222187 216768 211138 205105 198926 192970
53880 192970 187375 182291 178013 174481 171055 167192 163096 159292 155841 152404 148893 145549 142517 139727
53866 139727 137140 134678 132019 128879 125501 122503 120181 118243 116225 113942 111550 109350 107501 105819
53852 105819 103963 101930 100125 98806 97801 96998 96663 96907 97228 97157 97006 97368 98082 98382 97974 97276 96624
53835 96624 95898 94993 94062 93161 92212 91460 91356 91817 92145 91935 91587 91661 92219 93114 94395 96026 97538 98430
53817 98430 98804 99304 100506 102499 104875 107009 108579 109976 111972 114838 118038 120911 123408 125941 128804
53802 128804 131969 135266 138544 141775 145064 148363 151234 153249 154737 156683 159638 163065 166087 168509
53788 168509 170755 173004 174879 175911 176015 175505 174892 174606 174714 174939 175004 174831 174345 173353 171857 170230 168795
53771 168795 167444 165934 164369 162957 161412 159103 155920 152575 149833 147719 145671 143297 140715 138288
53757 138288 136310 134903 133937 132970 131475 129326 126947 124781 122747 120446 117863 115512 113790 112518 111317
53742 111317 110151 109171 108269 107169 105878 104699 103844 103324 103119 103101 102869 102103 101149 100776 101264 102084 102627 102858
53724 102858 103039 103208 103241 103199 103304 103714 104544 105902 107672 109376 110466 110703 110201 109335 108689 108793 109607 110439
53706 110439 110651 110358 110197 110520 111089 111504 111682 111855 112324 113245 114623 116438 118728 121398 123998 125975 127303
53689 127303 128655 130684 133254 135535 136809 137041 136776 136735 137450 138992 140995 143043 145036 147096 149209
53674 149209 151204 153070 154989 156981 158799 160391 162229 164757 167599 169783 170991 172101 174083 176641
53660 176641 178556 179268 179436 179753 179907 179216 177836 176679 176324 176573 177012 177550 178336 179464 180699 181374 180815
53643 180815 179290 178176 178613 180169 181441 181815 181851 182018 181995 181487 180806 180167 179127 177392 175686 175111 175864
53626 175864 177090 177870 177954 177727 177833 178698 180102 181333 181967 182233 182459 182523 182215 181782 181668 181938 182403 183188
53608 183188 184711 187124 190082 193099 195905 198525 201170 204010 206990 210085 213652 218102 223020 227194
53594 227194 229878 231628 233528 236084 239331 243481 248670 254290 259372 263552 267095 270080 272275 273813
53580 273813 275297 277122 279276 281886 285370 289831 294709 299195 302585 304362 304567 304259 304880 306793 308937
53565 308937 310204 310583 310650 310568 310248 310033 310440 311326 311953 311875 311298 310509 309489 308221 306963 305959 305103 304061
53547 304061 302619 300819 298901 297224 296022 295155 294211 293014 291873 291213 291092 291272 291600 292037 292377 292324 291951
53530 291951 291762 292087 292740 293514 294723 296773 299370 301740 303734 306147 309647 313784 317489 320319 322833
53515 322833 325803 329471 333653 338273 343567 349787 356841 364396 372398 381316 391619 403083 414992
53502 414992 427068 439747 453370 467526 481637 495888 511099 527795 545807 564705 584128
53491 584128 603688 623051 642393 662464 683930 706724 730220 753934 777887 802252 826826
53480 826826 851075 874770 898377 922540 947225 971694 995453 1018901 1042809 1067413 1092311
53469 1092311 1117045 1141433 1165395 1188810 1211614 1233838 1255443 1276217 1295829 1313998 1330721
53458 1330721 1346380 1361434 1375953 1389679 1402588 1415037 1427202 1438758 1449427 1459443 1469010
53447 1469010 1477607 1484298 1488616 1490650 1490456 1487922 1483099 1476151 1466955 1455372 1441911 1427519 1412531
53434 1412531 1396401 1378683 1359789 1340458 1320872 1300676 1279520 1257219 1233664 1209025 1183960
53423 1183960 1159232 1135175 1111767 1089099 1067404 1046630 1026394 1006523 987429 969749 953758
53412 953758 939379 926624 915692 906559 898860 892455 887771 885147 884035 883524 883743 886005 891248 898877
53398 898877 907690 917417 928668 941711 956168 971853 989081 1007922 1027809 1048201 1069160 1090993
53386 1090993 1113802 1137682 1163021 1190208 1219278 1250127 1282828 1317416 1353605 1391132 1430306
53375 1430306 1471825 1515961 1562214 1609880 1658721 1708827 1759905 1811135 1861961 1912811 1964595
53364 1964595 2017473 2070553 2122901 2174320 2224741 2273329 2318866 2360855 2399671 2435672 2468802
53353 2468802 2499151 2527229 2553357 2577182 2598077 2615768 2630332 2641860 2650364 2655832 2658136 2656933
53341 2656933 2651676 2641578 2625631 2602990 2573475 2537543 2495791 2448811 2397555 2343439 2287902
53330 2287902 2232038 2176664 2122372 2069391 2017677 1967316 1918551 1871337 1825205 1779685 1734526
53319 1734526 1689434 1644046 1598512 1553747 1510687 1469494 1429787 1391504 1355166 1321351 1290227
53308 1290227 1261614 1235324 1211350 1189759 1170428 1152904 1136693 1121628 1107786 1095113 1083366
53297 1083366 1072470 1062585 1053716 1045556 1037855 1030707 1024336 1018828 1014238 1010700 1008238 1006658 1005854 1006027
53283 1006027 1007454 1010107 1013689 1018006 1023275 1030122 1039226 1050696 1063850 1077851 1092602 1108711 1126616
53270 1126616 1146081 1166649 1188083 1210192 1232636 1255253 1278275 1301839 1325467 1348330 1369987
53259 1369987 1390624 1410664 1430271 1449152 1466709 1482473 1496443 1508959 1520326 1530689 1540048
53248 1540048 1548074 1554002 1557112 1557291 1554769 1549466 1541166 1530217 1517289 1502352 1484681 1464165 1441778
53235 1441778 1418346 1393572 1366874 1338609 1309781 1280985 1252320 1224003 1196402 1169680 1143935
53224 1143935 1119500 1096574 1074815 1053720 1033144 1012934 992482 971299 949856 929163 909562
53213 909562 890502 871389 852161 833160 814954 798175 783075 769319 756602 745168 735221 726234
53201 726234 717557 709312 701791 694198 685106 674276 662983 652278 641847 630988 619867 609172
53189 609172 599138 589435 579635 569393 558551 547450 536764 526730 517001 507492 498768 491084 483561
53176 483561 474975 465056 454428 443532 432264 420583 408843 397404 386385 375891 366155 357318
53164 357318 349266 341773 334632 327647 320692 313830 307273 301178 295542 290217 284995 279771 274694 270055
53150 270055 265910 262002 258173 254687 251858 249501 246996 243929 240468 237061 233982 231247 228875 227048
53136 227048 225917 225277 224560 223367 221944 220980 220842 221181 221415 221414 221544 222081 222821 223277 223108 222306 221044 219517
53118 219517 217890 216261 214512 212267 209231 205683 202428 200080 198482 197021 195370 193609 191708 189362
53104 189362 186505 183660 181468 179951 178528 176700 174545 172510 170880 169535 168136 166464 164534 162471
53090 162471 160398 158409 156467 154309 151692 148915 146806 145886 145667 145145 143946 142582 141559 140731 139721
53075 139721 138578 137630 136921 136147 135082 133815 132565 131488 130665 130109 129752 129468 129078 128317 126981 125216
53059 125216 123503 122182 121185 120412 120199 120977 122455 123616 123761 123292 123089 123282 123074 121852 120107 118928
53043 118928 118814 119271 119513 119206 118518 117809 117430 117552 117874 117677 116438 114435 112511 111290 110760 110518 110204
53026 110204 109679 109090 108836 109322 110579 112151 113413 114031 114187 114416 115097 115983 116324 115658 114416 113519 113376
53009 113376 113568 113521 113186 112855 112610 112284 111899 111766 112025 112306 112113 111482 111027 111281 112180 113310 114467 115739
52991 115739 117241 119034 121223 123729 125983 127349 127967 128750 130307 132325 134276 136264 138656 141220 143259
52976 143259 144442 145037 145414 145839 146601 147758 148772 148981 148496 148066 147988 147682 146510 144412 141634 138443 135469
52959 135469 133690 133533 134343 135223 135986 136819 137387 137003 135623 134031 132955 132492 132468 132879 133671 134468 134841 134782
52941 134782 134656 134746 135026 135343 135665 136028 136324 136320 135926 135414 135247 135746 136909 138478 140087 141478 142699 143996
52923 143996 145365 146395 146808 146978 147511 148406 149127 149523 150126 151338 152814 154005 154861 155555 155887 155545 154830
52906 154830 154503 154845 155344 155453 155299 155452 156234 157474 158734 159599 159873 159756 159802 160475 161694 162894 163606 163915
52888 163915 164279 165026 166144 167495 168976 170391 171416 171886 171967 171879 171628 171283 171324 172238 173806 175227 176135
52871 176135 177007 178372 179992 181245 182121 183390 185771 189157 192678 195427 197178 198539 200312 202649 205034
52856 205034 207185 209661 213170 217472 221418 224167 225902 227167 227849 227260 225065 221731 217990 214216 210511
52841 210511 207105 204248 201793 199279 196518 193818 191515 189575 187842 186330 185029 183690 182102 180379
52827 180379 178670 176902 175168 174002 173725 173729 173092 171721 170261 168908 167171 164876 162524 160412 158241
52812 158241 156065 154782 154986 155926 156334 155884 155175 154642 154273 154182 154589 155244 155518 155153 154429 153579 152575 151469
52794 151469 150386 149091 147115 144572 142423 141628 142261 143564 144589 144638 143410 141116 138478 136432 135657
52779 135657 136174 137238 137744 137022 135248 133042 130800 128638 126745 125387 124534 123808 122834 121498 119868 118122
52763 118122 116519 115250 114252 113297 112203 110818 109008 106879 104905 103510 102600 101773 100897 100138 99558 99044
52747 99044 98630 98480 98524 98475 98278 98215 98507 99092 99838 100698 101571 102318 102916 103327 103278 102521 101338 100305 99448 98142
52727 98142 96032 93706 92096 91486 91331 90875 89768 88289 87134 86799 87089 87492 88037 89328 91571 94048
52711 94048 95974 97458 99142 101111 102714 103367 103074 102189 101067 100025 99299 98847 98383 97668 96661 95392
52695 95392 93961 92617 91597 90812 89928 88907 88206 88208 88568 88429 87304 85540 83871 82750 82207 82146 82399
52678 82399 82526 81942 80458 78544 76872 75721 74923 74154 73066 71347 69004 66565 64693 63568 62912 62570
52662 62570 62748 63640 65144 67026 69062 70898 72065 72393 72238 72122 72267 72566 72855 73103 73525 74555 76520
52645 76520 79250 82246 85307 88676 92343 95596 97591 98118 97507 96032 93869 91455 89346 87671 86131
52630 86131 84602 83349 82584 82177 81958 81900 81856 81491 80776 80203 80101 79980 79110 77688 76881 77505 79084 80511
52612 80511 81305 81826 82428 82915 82959 82661 82459 82665 83304 84255 85301 86077 86262 85944 85663 85999 87171 89010
52594 89010 91184 93335 95151 96496 97512 98512 99692 100988 102251 103436 104543 105483 106181 106794 107558
52579 107558 108385 108911 109114 109522 110441 111335 111500 111209 111466 112614 113971 115050 116290 118023 119501 119844 119519
52562 119519 119853 121232 122692 123368 123419 123295 122965 122337 121801 121783 122152 122566 123031 123662 124216 124383 124370 124649 125211
52543 125211 125500 125169 124538 124250 124614 125318 125653 125059 123664 122265 121712 122338 123937 125994 127774 128508 127887
52526 127887 126329 124636 123451 123124 123726 124846 125595 125352 124468 123932 124327 125426 126765 128165 129652 131187
52510 131187 132699 134143 135362 136053 136020 135397 134541 133752 133068 132266 131117 129771 128816 128724 129268 129722 129668 129358
52492 129358 129226 129367 129616 129944 130478 131276 132257 133348 134508 135632 136573 137308 137940 138524 138906 138871 138464 138037
52474 138037 137851 137678 137003 135701 134259 133122 131990 130175 127650 125371 124385 124776 125642 125943 125184 123456
52458 123456 121175 118861 117004 115893 115440 115215 114793 114200 113915 114295 115046 115427 114959 113759 112228 110719
52442 110719 109574 109106 109261 109515 109453 109315 109658 110523 111311 111566 111518 111704 112301 113094 113958 115037 116416 117770
52424 117770 118548 118495 117980 117746 118296 119491 120734 121487 121626 121464 121554 122344 123792 125345 126530 127475 128572
52407 128572 129661 130087 129721 129451 130192 131736 133132 133998 134830 135986 137076 137697 138263 139647 142167 145283
52391 145283 148195 150440 151978 152990 153689 154246 154806 155504 156341 157087 157517 157773 158252 159119 160171 161236 162320
52374 162320 163242 163531 163014 162239 161988 162595 164021 166247 169080 171827 173706 174645 175212 175826 176484 177244 178352
52357 178352 179661 180408 179972 178636 177338 176868 177452 178903 180845 182822 184438 185529 186235 186904 187827 188988
52341 188988 190124 191121 192197 193597 195320 197322 199707 202336 204543 205863 206911 208910 212236 215994
52327 215994 219112 221276 222647 223385 223821 224512 225614 226616 227225 228054 229860 232444 234973 237246 239876
52312 239876 243188 246585 249258 251113 252771 254932 257910 261532 265381 269247 273369 278011 282854 287223
52298 287223 291056 295273 300822 307608 314702 321551 328580 336468 345160 353876 361984 369575 377233 385490
52284 385490 394556 404186 413658 422249 430127 438522 448504 459731 470930 481583 492479 504416 516988
52271 516988 529061 540050 550304 560519 571169 582273 593344 603709 613202 622411 631943 641654
52259 641654 650947 659598 667871 675879 683278 689577 694488 698012 700571 702989 705989 709593 713246 716489
52245 716489 719182 721125 721945 721596 720662 719824 719147 718143 716598 715143 714809 716016 718176 720498 722996 726359
52229 726359 730908 736185 741750 747889 755181 763734 773247 783501 794266 805020 815349 825568 836346
52216 836346 847689 858827 869172 878947 888712 898696 908789 918821 928510 937333 944679 950182 953908
52203 953908 956333 958050 959244 959456 958088 955086 950935 946050 940516 934392 927853 920881 913145 904463
52189 904463 895176 885832 876613 867243 857507 847775 838902 831435 824931 818323 811117 803892 797393 791481
52175 791481 785467 779198 773186 767693 762383 756971 751709 746977 742792 738864 734816 730249 724954 719251
52161 719251 713761 708769 704166 700048 696825 694533 692561 690371 688036 685787 683450 680791 678007 675402
52147 675402 672817 669848 666457 662934 659404 655842 652481 649735 647605 645501 642800 639412 635778 632419
52133 632419 629482 626594 623192 619094 614681 610450 606560 602873 599228 595477 591422 586989 582379 577913
52119 577913 573789 570138 567133 564840 563042 561389 559661 557776 555714 553594 551713 550297 549278 548467
52105 548467 547839 547532 547687 548424 549845 551949 554725 558433 563489 569849 576746 583361 589588 595880 602639
52090 602639 610144 618871 629286 641253 654116 667441 681290 695712 710456 725446 741114 757876
52078 757876 775534 793512 811560 829854 848406 866753 884276 900633 915838 930208 944384
52067 944384 959045 974255 989189 1002849 1015057 1026365 1036943 1046004 1052668 1057087 1060286 1062950
52055 1062950 1064807 1065237 1064128 1061981 1059322 1056110 1051693 1045439 1037591 1029297 1021474 1013868 1005664 996841
52041 996841 988195 979981 971419 961965 952414 944116 937532 932188 927674 923938 920717 917450 914004 910981
52027 910981 909093 908515 908999 910306 912315 914854 917660 920548 923627 927303 931905 937255 942780 948121 953391
52012 953391 958723 963890 968604 972818 976399 978859 979917 980086 980069 979672 977939 974338 969258 963194 956100
51997 956100 947740 938080 926961 913908 898701 881837 863974 845179 825186 804188 782867 761599
51985 761599 740075 717782 694548 670536 646089 621793 598387 576230 554960 534011 513479
51974 513479 494095 476206 459212 442346 425754 410243 396046 382465 368956 356020 344563
51963 344563 334755 326047 318089 311005 304748 298775 292567 286180 280089 274771 270478 267157 264416 261766
51949 261766 259049 256497 254305 252354 250443 248598 247020 245827 244917 244004 242804 241278 239639 237963 235956
51934 235956 233363 230504 227981 225852 223546 220759 217903 215405 213035 210386 207728 205810 204869 204311 203422
51919 203422 202006 200215 198141 195824 193451 191284 189450 187957 186859 186195 185798 185370 184843 184474 184402 184215
51903 184215 183269 181477 179511 178043 177033 175981 174718 173563 172729 171923 170654 168815 166884 165627 165510
51888 165510 166173 166577 165963 164641 163496 162802 162027 160919 160158 160497 161647 162602 162862 162792 162817 162813 162515 162072 161936
51869 161936 162395 163503 165253 167590 170211 172581 174276 175341 176293 177701 179665 181667 183056 183711 184144
51854 184144 184905 185973 186850 187235 187458 188110 189327 190593 191307 191424 191362 191459 191749 192310 193406 195059 196698
51837 196698 197646 197955 198443 199734 201530 202979 203584 203518 203231 203038 203065 203314 203684 204132 204876 206197 207930 209423
51819 209423 210220 210589 211083 211778 212351 212811 213618 214933 216174 216634 216239 215498 214990 215134 216138 217734 219210
51802 219210 220084 220642 221411 222317 222901 223268 224094 225566 226949 227611 227942 228741 230070 231373 232551 234207 236671
51785 236671 239374 241574 243370 245565 248627 252130 255297 257746 259575 260891 261539 261273 260016 257932 255329
51770 255329 252522 249730 247100 244849 243254 242327 241622 240668 239605 238993 238891 238526 237215 235279 233668 232811
51754 232811 232250 231329 229895 228369 227382 227314 227794 227785 226557 224606 223212 222974 223174 222669 221066 218884 217011
51737 217011 216188 216580 217485 217750 216883 215633 215130 215535 215855 215059 213164 211118 209737 208857 207570 205290 202444
51720 202444 199948 198162 196688 195116 193561 192337 191432 190515 189219 187351 185089 183048 181746 180952 179978
51705 179978 178771 178145 178598 179458 179691 179178 178628 178572 178960 179527 179940 179821 179239 179123 180538 183540 187216 190764
51687 190764 193966 196788 199445 203039 209220 218481 229106 238197 243572 244594 241859 236653 230409 224062
51673 224062 217826 211781 206333 201820 197946 194143 190337 186908 183927 181017 178021 175366 173465 172094
51659 172094 170707 169163 167760 166570 165140 163101 160862 159347 158986 159276 159522 159720 160326 161269 161729 161032
51643 161032 159354 157292 155110 152831 150784 149505 149103 149150 149288 149528 149799 149631 148668 147297 146385 146373 146894
51626 146894 147328 147468 147531 147703 147883 147891 147739 147603 147579 147602 147678 148042 148911 150027 150697 150482 149748 149299 149476 149863
51606 149863 149957 149842 149997 150669 151727 153031 154607 156445 158373 160184 161715 162828 163557 164296 165525 167302
51590 167302 169324 171524 174118 176846 178768 179349 179445 180550 183106 186149 188548 189978 190580 190377 189490 188444
51574 188444 187758 187387 187029 186805 187271 188777 191115 193801 196515 199285 202387 205979 209700 212844 215150
51559 215150 217200 219597 221946 223211 223119 222631 222782 223522 224105 224205 224150 224212 224191 223771 222863 221455 219432 216826
51541 216826 214190 212489 212478 213966 215739 216415 215710 214733 214775 215883 216981 217329 217327 217677 218286 218462 217924 217139
51523 217139 216693 216736 216994 217020 216409 215108 213576 212371 211553 210746 209835 209201 209093 209098 208535 207287 206016 205615
51505 205615 206466 208054 209205 208896 207139 204972 203470 202803 202389 201725 200883 200271 200252 200980 202331 203878 205073
51488 205073 205593 205544 205308 205263 205598 206276 207113 207934 208651 209225 209595 209714 209673 209787 210502 212160 214713 217724 220728
51469 220728 223497 225900 227692 228769 229527 230588 232051 233355 233964 233864 233233 231995 230010 227364 224189
51454 224189 220482 216472 212845 210087 207736 204818 201004 196911 193239 190101 187324 184979 183325 182413
51440 182413 181994 181740 181529 181508 181864 182448 182784 182606 182185 181847 181429 180617 179618 178909 178359 177229 175198 172861
51422 172861 170897 169192 167078 164169 160645 156989 153671 150910 148545 146322 144370 143084 142430 141784 140724
51407 140724 139548 138655 137804 136468 134688 133071 132021 131375 130770 130023 129153 128352 127880 127699 127281 126063 124108
51390 124108 122097 120667 119979 119761 119470 118547 116913 115207 114192 113882 113638 113128 112775 113077 113870 114487 114449
51373 114449 113689 112332 110527 108453 106275 104153 102321 101079 100562 100624 101063 101849 102956 104099 104925 105501
51357 105501 106326 107698 109261 110378 110855 110999 110990 110628 109965 109826 111126 113642 115973 116986 117003 117283 118549
51340 118549 120410 122048 123033 123390 123254 122653 121523 119807 117614 115318 113364 111947 110920 110027 109111 108080
51324 108080 106843 105372 103727 101989 100275 98865 98195 98511 99526 100542 101054 101192 101447 101900 101904 100776
51308 100776 98742 96920 96305 96909 97973 98765 99062 99092 99251 99745 100358 100610 100312 99788 99505 99675 100323 101399
51290 101399 102584 103301 103328 103231 103734 104807 105781 106241 106367 106422 106385 106147 105663 104817 103538 102122 101046 100383
51272 100383 99827 99362 99389 99957 100393 100069 99188 98443 98175 98239 98445 98762 99202 99828 100723 101753 102578 103155 103906
51253 103906 105038 105945 105840 104832 103839 103420 103234 102801 102337 102537 103761 105706 107726 109298 110285 110940 111660
51236 111660 112604 113504 113861 113396 112373 111494 111399 112203 113587 115184 116717 117844 118278 118222 118249 118548 118678 118459
51218 118459 118684 120296 123048 125650 127282 128274 129190 129942 130262 130505 131400 133108 134990 136267 136638 136266
51202 136266 135481 134626 134009 133862 134242 134928 135449 135398 134758 133878 133097 132517 132058 131542 130731 129525 128155 126945
51184 126945 125853 124575 123125 121947 121300 120884 120252 119250 117809 115771 113326 111295 110458 110709 111323 111881
51168 111881 112482 113190 113858 114474 115115 115421 114747 113052 111187 109984 109404 108911 108334 107945 107863 107837 107605 107173
51150 107173 106723 106370 106000 105332 104270 103261 102952 103322 103487 102729 101444 100614 100550 100732 100851 101291 102331 103436
51132 103436 103853 103603 103400 103729 104430 105149 105709 105985 105823 105351 105092 105434 106119 106528 106476 106451 106988 108055 109197
51113 109197 110082 110685 111025 111031 110755 110578 111066 112644 115307 118487 121226 122797 123317 123583 124190 125053 125921 126990
51095 126990 128572 130392 131775 132511 133037 133695 134314 134771 135430 136561 137679 137969 137291 136316 135713 135609 135842
51078 135842 136364 137265 138601 140240 141762 142642 142790 142759 143038 143232 142435 140501 138374 136954 136145 135382 134596
51061 134596 134035 133466 132317 130633 129275 128975 129609 130533 131280 131737 132032 132483 133364 134437 135004 134737 134221
51044 134221 134279 134948 135612 136077 136937 138636 140671 142134 142824 143407 144572 146377 148427 150311 151767 152732
51028 152732 153489 154565 156212 158040 159388 160049 160450 161168 162403 163939 165420 166673 167962 169932 173054
51013 173054 176994 180747 183583 185722 187984 190899 194358 197903 201115 203874 206611 210226 215373 221734
50999 221734 228350 234765 241460 248978 257029 264917 272605 280831 290175 300499 311497 323405 336811
50986 336811 351927 368405 385891 404537 424981 447923 473785 502638 534453 569435 608022
50975 608022 650381 695982 743960 793950 846300 901219 957974 1015215 1071915 1127564 1181404
50964 1181404 1232062 1278270 1319639 1356281 1387795 1413127 1431573 1443579 1450288 1452464 1450183 1443555
50952 1443555 1433450 1421254 1408041 1394211 1379971 1365833 1352423 1339979 1328329 1317269 1306507
50941 1306507 1295196 1281995 1265944 1247014 1225547 1201486 1174448 1144251 1110854 1074074 1034026
50930 1034026 991807 949004 906419 863929 821738 780929 742295 705437 669828 636187 605805
50919 605805 578740 553803 530411 509402 491569 476302 462358 449383 437857 427914 419138 411440
50907 411440 405337 401103 398277 396331 395406 395977 398017 400772 403236 404696 405075 405033 405552 407067 409128 411112
50891 411112 413086 415616 418923 422721 426857 431570 437006 442995 449534 457007 465622 475080 485226 496567
50877 496567 509570 523760 538269 553195 569735 588885 610621 634543 660807 690150 723425
50866 723425 761349 804284 852087 904501 961980 1025744 1096843 1175566 1261953 1356283 1458591
50855 1458591 1568160 1683980 1805264 1930974 2059260 2188055 2315847 2441087 2560998
50846 2560998 2671836 2770266 2853871 2920594 2968947 2999151 3013097 3012680 2998875 2972991 2937973
50835 2937973 2897600 2854852 2811885 2771174 2735504 2706518 2683914 2666306 2652344 2640678 2629252
50824 2629252 2615222 2595707 2568613 2532878 2488152 2434339 2371375 2299312 2218468 2129573 2033973
50813 2033973 1933746 1831399 1729251 1629139 1532560 1440822 1354907 1275435 1202858 1137472
50803 1137472 1079189 1027680 982970 945486 915132 890725 870875 855261 844486 838745 837274 839177
50791 839177 844191 852306 863070 875688 889527 904091 918554 931727 942652 951033 957006 960645
50779 960645 961868 960724 957395 951679 942712 929684 912952 894110 874705 855170 835221 814962
50767 814962 795081 776104 758064 741005 725378 711672 700005 690353 682957 678240 676440 677575
50755 677575 681674 688801 698937 712033 728236 747898 771315 798582 829775 865148 905066 949761
50743 949761 999313 1053920 1114040 1180085 1251960 1329032 1410588 1496105 1584850 1675263 1764898
50732 1764898 1851002 1931136 2003334 2065912 2117207 2155503 2179350 2188107 2182265 2163307 2133304 2094675
50720 2094675 2050072 2002217 1953759 1907213 1864776 1827925 1797204 1772533 1753548 1739494 1728985
50709 1728985 1720298 1711911 1702483 1690356 1673548 1650470 1620445 1583442 1539633 1489483 1434109 1375271
50697 1375271 1314974 1255174 1197621 1143647 1093954 1048688 1007857 971713 940743 915288 895208
50686 895208 880034 869470 863610 862613 866401 874927 888468 907200 930496 957112 986209 1017827
50674 1017827 1052121 1088476 1125630 1162334 1197501 1229991 1258834 1283804 1305399 1324075 1339677
50663 1339677 1351719 1359985 1364668 1366098 1364600 1360543 1354271 1345944 1335634 1323687 1310814 1297715 1284819
50650 1284819 1272642 1262152 1254313 1249215 1246126 1244650 1245512 1249948 1258574 1271141 1287028 1305497 1325606
50637 1325606 1346443 1367498 1388462 1408650 1427025 1442858 1456052 1466833 1475548 1482810 1489397 1495813
50625 1495813 1502286 1509283 1517624 1527841 1539853 1553444 1568648 1585280 1602347 1618278 1631527 1640839
50613 1640839 1645326 1644719 1639291 1629230 1614484 1595636 1574468 1552900 1531368 1508817 1484197 1457292
50601 1457292 1428061 1396065 1361054 1323657 1284908 1245235 1204296 1161735 1117846 1073551 1029960
50590 1029960 987886 947586 909056 872714 839632 810768 786022 764375 744994 727959 713783
50579 713783 702603 694183 688450 685543 685269 686967 690185 695214 702626 712465 724230 737547 752423
50566 752423 768821 786371 804632 823335 842197 860904 879622 899271 920855 944572 969902
50555 969902 996529 1024642 1054226 1084574 1114996 1145759 1177688 1210729 1243498 1274661 1304451
50544 1304451 1334281 1365048 1396450 1428019 1460020 1492884 1526325 1559784 1593521 1628602 1665805
50533 1665805 1705114 1746304 1789459 1834719 1882002 1931279 1982742 2036397 2091578 2146972 2200930
50522 2200930 2251722 2297856 2338345 2372549 2399733 2418967 2429402 2430399 2421573 2403160 2376211 2341908
50510 2341908 2300734 2252922 2199635 2142922 2084462 2025310 1967119 1912532 1863682 1821073 1784504
50499 1784504 1754193 1730149 1711271 1696226 1684773 1677154 1672633 1669908 1668827 1670432 1675199 1682263 1690343
50486 1690343 1698180 1703632 1703564 1695442 1678510 1652973 1618731 1575600 1524299 1466598 1404727 1340963
50474 1340963 1277355 1215243 1155132 1097267 1042208 990685 943225 900147 861567 827167 796284
50463 796284 768512 743953 722641 704061 687584 673127 661094 651834 645356 641369 639293 638438 638472
50450 638472 639670 642561 647470 654352 662848 672415 682794 694459 708208 724077 741081 758371 776287
50437 776287 795811 817295 840234 864133 889080 915364 943011 971862 1001880 1033169 1065807
50426 1065807 1099778 1135022 1171402 1208578 1246062 1283629 1321736 1361240 1402479 1444826 1487438
50415 1487438 1530151 1573131 1615811 1656869 1695343 1731163 1764291 1793890 1818687 1837802 1850912
50404 1850912 1857964 1859062 1854275 1843203 1825031 1799378 1766787 1728059 1683464 1633081 1577658 1518588
50392 1518588 1457192 1394521 1331818 1270577 1211928 1156325 1104020 1055693 1012449 975258 944436
50381 944436 919615 900169 885627 875681 869948 868019 869741 875135 883947 895454 908686 922559 935814
50368 935814 947211 955868 961023 961545 956302 945239 929529 910380 888243 863455 836961 809796
50356 809796 782400 755022 728400 703364 680137 658621 639013 621414 605187 589596 575006
50345 575006 562583 552782 544913 538293 533063 529553 527498 526316 525780 526048 527224 529163 531620 534471
50331 534471 537834 542002 547197 553536 561256 570648 581561 593345 605588 618493 632227 646404 660839
50318 660839 676221 693180 711012 728339 744874 761509 778603 795271 810607 824692 838068
50307 838068 851061 863994 877222 890473 902845 913884 923987 933327 941135 946718 950514 953391
50295 953391 955383 955847 954467 951343 946296 938799 928433 914924 898012 877979 856147 834163 812714
50282 812714 791367 769649 747802 726559 706619 688405 671904 656698 642377 628881 616291
50271 616291 604572 593836 584542 576921 570378 564022 557647 551647 546076 540476 534740 529464 525155 521544
50257 521544 517973 514224 510777 508490 508160 509990 513262 516678 519243 520756 521607 522427 523938 526630 530335
50242 530335 534452 538757 543626 549209 554835 559680 563705 567423 570848 573369 574797 575963 577830 580283
50228 580283 582224 582773 582008 580520 578671 576541 574234 571812 569049 565672 561905 558368 555311 552317 549011
50213 549011 545711 543048 541157 539665 538372 537534 537461 538206 539677 541767 544333 547401 551511 557431 565211
50198 565211 573679 581276 587446 593017 599141 605959 612422 617389 620734 623228 625374 626635 625973 622897
50184 622897 617771 611290 604024 596448 589004 581929 575164 568571 562135 555923 550011 544456 539196 534101
50170 534101 529387 525861 524289 524363 524721 524248 523042 521783 520511 518558 515570 512050 508782 506052 503645
50155 503645 501383 499487 498415 498417 499271 500431 501430 502039 502101 501519 500600 500064 500320 500938 501268 501532 502752 505504
50137 505504 509228 513032 516696 520525 524524 528291 531641 534833 538096 541287 544158 546713 549149 551615
50123 551615 554162 556772 559281 561419 563149 564921 567429 571080 575820 581537 588485 597239 608265 621681
50109 621681 637437 655599 676416 700270 727702 759414 796065 838115 886022 940450 1001903
50098 1001903 1070003 1143392 1220438 1299721 1379561 1457428 1530349 1595981 1653129 1701510 1741656
50087 1741656 1775188 1804654 1832613 1860759 1889698 1918914 1946536 1969464 1984211 1987850 1978273 1954105
50075 1954105 1915056 1862496 1799324 1729025 1654784 1579289 1504842 1433308 1365985 1303677 1246868
50064 1246868 1195687 1149741 1108301 1070928 1037897 1009713 986073 965569 946633 928661 911997
50053 911997 897091 884077 872994 863717 855473 847065 838011 829189 821937 816759 813241 810922 809705
50040 809705 809556 810315 811829 813959 816448 819112 822054 825312 828422 830772 832393 833848 835280 836125 836013
50025 836013 835360 834710 833922 832544 830726 829174 828259 827718 827308 827272 827863 828745 829313 829617 830614 833345 837986
50008 837986 843883 850423 857634 865935 875644 886920 899952 914819 931209 948649 967110 987117
49996 987117 1009089 1032854 1058076 1085023 1114591 1147575 1184210 1224608 1269450 1320002 1377477
49985 1377477 1442587 1515718 1597280 1687663 1786937 1894628 2009296 2127854 2245506 2357208
49975 2357208 2459704 2552104 2634742 2708262 2774065 2834734 2892938 2949883 3005203 3057897 3106422
49964 3106422 3147738 3177064 3189227 3180383 3148855 3095105 3021289 2930490 2825962 2710912 2588616
49953 2588616 2462172 2334016 2205986 2079867 1957469 1840119 1728438 1622695 1523082 1429748
49943 1429748 1343043 1263753 1192528 1129039 1072186 1021246 976152 936521 901219 869341 840940
49932 840940 816212 794465 774523 755790 738279 721909 706403 691732 678029 665120 652569
49921 652569 640114 627649 614917 601721 588371 575430 563016 550800 538678 527096 516611
49910 516611 507417 499298 491774 484396 477207 470849 465859 461952 458404 455024 452180 449882 447532 444858
49896 444858 442587 441663 442085 442994 443804 444797 446469 448665 450636 451865 452613 453594 455397 458341 462637 468253
49880 468253 474617 480930 487014 493637 501799 511850 523497 536462 550905 567383 586615 609181
49868 609181 635257 664769 697994 735774 779025 828283 883891 946252 1015439 1090738 1170898
49857 1170898 1254588 1340153 1425021 1505855 1579413 1643214 1695885 1737630 1770459 1797442 1821353
49846 1821353 1844038 1866672 1889778 1912500 1932017 1943942 1943530 1926974 1892293 1839464 1769949 1686368
49834 1686368 1592629 1493695 1394282 1297500 1204965 1118043 1038342 966881 903382 846801 796308
49823 796308 751577 712391 678343 648900 623554 601828 583120 566654 551798 538517 527232
49812 527232 517995 510107 502820 496077 490157 484886 479787 474797 470200 465892 461395 456635 452108 448108
49798 448108 444328 440351 435990 431103 425654 420141 415367 411617 408586 406217 404808 404024 402709 400270
49784 400270 397597 395959 395471 395354 395211 395241 395505 395808 396230 397042 398046 398701 398940 399305 400123 401094 401857 402522
49766 402522 403372 404409 405461 406518 407699 409019 410364 411600 412626 413396 414020 414799 416068 417931 420097
49751 420097 421999 423202 423735 423966 424106 424019 423607 423195 423374 424539 426706 429615 432852 435972 438698 440979
49735 440979 442818 444179 445154 446042 447080 448234 449332 450292 451101 451757 452397 453296 454585 456079 457530 458860
49719 458860 460026 460918 461629 462593 464140 466023 467655 468721 469351 469857 470477 471195 471601 471214 470287 469929 470898
49702 470898 472451 473081 472356 471310 470828 470425 469114 466968 465048 463920 462981 461427 459346 457457 456052
49687 456052 454775 453411 452404 452215 452482 452296 451324 450216 449730 449800 449740 449129 448188 447357 446800 446309 445482 444037
49669 444037 442151 440452 439524 439433 439883 440720 442041 443891 446081 448357 450574 452701 454839 457191 459748
49654 459748 462006 463325 463703 463971 464999 466833 468815 470458 471941 473754 476051 478503 480714 482623 484481
49639 484481 486484 488520 490298 491711 493041 494825 497486 501090 505450 510327 515405 520143 523952 526693
49625 526693 528839 530930 533072 535153 537333 539885 542673 545250 547535 549952 552795 555871 558982 562364
49611 562364 566324 570753 575327 580021 585155 591070 597948 605731 614036 622443 631078 640602 651237 662145
49597 662145 672284 681713 691558 702784 715532 729594 744873 761132 777840 794751 812417 831755
49585 831755 853093 875934 899605 923922 949171 975684 1003661 1033290 1064714 1097763 1132011
49574 1132011 1167352 1204291 1243293 1283990 1325495 1367455 1410272 1454222 1499034 1544546 1591036
49563 1591036 1638394 1685532 1731364 1776001 1820210 1863931 1906019 1945396 1981630 2014293 2042574
49552 2042574 2065903 2084479 2098838 2109192 2115442 2117525 2115491 2109438 2099645 2086675 2071277 2054305
49540 2054305 2036627 2018733 2000437 1981325 1961675 1942685 1925590 1910780 1897812 1886095 1875529
49529 1875529 1866774 1860994 1859072 1860949 1865909 1873488 1883809 1897056 1913089 1931716 1952895 1976370
49517 1976370 2001414 2027269 2053605 2080258 2106737 2132304 2156470 2179081 2199961 2218621 2234266
49506 2234266 2245954 2252869 2254689 2251668 2244165 2232053 2214691 2191512 2162644 2128933 2091329 2050257
49494 2050257 2005686 1957918 1908099 1857703 1807535 1757523 1707482 1657726 1608867 1561342 1515358
49483 1515358 1471084 1428624 1387905 1348788 1311272 1275531 1241819 1210388 1181351 1154579 1129785
49472 1129785 1106713 1085127 1064762 1045543 1027809 1012007 998083 985497 973878 963305 953775
49461 953775 944816 935942 927263 919359 912692 907449 903781 901720 900765 899852 898105 895720 894033 894509 897477
49446 897477 901839 906105 909673 913024 916898 921606 927106 933374 940632 949383 960150 972768 985943
49433 985943 998016 1008296 1017254 1025317 1032075 1037075 1040934 1045081 1050602 1057758 1066369 1076128 1086658
49420 1086658 1097677 1109190 1121241 1133574 1145872 1158212 1170951 1184245 1198048 1212476 1227661
49409 1227661 1243247 1258586 1273573 1288861 1305029 1321896 1338882 1355662 1372136 1388082 1403302
49398 1403302 1417979 1432424 1446452 1459394 1470851 1481175 1491061 1500857 1510425 1519471 1527864 1535749
49386 1535749 1543560 1551787 1560498 1569164 1577169 1584444 1591405 1598394 1605577 1613291 1622010 1631775 1642040 1652320
49372 1652320 1662630 1673130 1683850 1695122 1707739 1722012 1737016 1751559 1765735 1780831 1797752
49361 1797752 1816382 1836542 1858633 1882879 1908601 1934854 1961376 1988538 2016741 2046326 2077755
49350 2077755 2111449 2147530 2185950 2226536 2268781 2312038 2356307 2402447 2451190 2502401 2555692
49339 2555692 2611270 2669494 2729960 2791905 2855363 2921050 2988960 3057838 3126371 3194353 3262273
49328 3262273 3330137 3397134 3462310 3525163 3585568 3643300 3697661 3747486 3791456 3828493 3858058
49317 3858058 3880307 3895912 3905440 3908784 3905452 3895522 3879988 3859981 3836003 3808268 3777430 3744516
49305 3744516 3710423 3676001 3642451 3610972 3581931 3554911 3529693 3506830 3487085 3470730 3457537
49294 3457537 3447267 3439989 3436106 3436081 3439969 3447332 3457852 3471881 3489919 3511530 3535308 3560075 3585739
49281 3585739 3612728 3640865 3669087 3696117 3721221 3744352 3765609 3784461 3799605 3809701 3814176
49270 3814176 3813060 3806239 3793382 3774509 3750095 3720424 3685294 3644554 3598545 3547826 3492900 3434540
49258 3434540 3374035 3312669 3251008 3188975 3126483 3063913 3002143 2942237 2884757 2829169 2774259
49247 2774259 2719497 2665808 2614714 2566896 2521960 2479338 2438920 2400825 2365089 2331760 2300941
49236 2300941 2272533 2246154 2221569 2199057 2179153 2162042 2147308 2134305 2122647 2112338 2103544
49225 2103544 2096423 2091142 2087878 2086635 2087105 2088889 2091862 2096216 2102146 2109621 2118441 2128337 2138995 2150167
49211 2150167 2161846 2174212 2187326 2200947 2214706 2228355 2241865 2255363 2269001 2282797 2296615
49200 2296615 2310345 2323976 2337354 2350053 2361767 2372740 2383483 2394122 2404412 2414368 2424288 2434033
49188 2434033 2442858 2450308 2456821 2463003 2468743 2473673 2478221 2483401 2489525 2495764 2501257 2506168 2511318 2517118
49174 2517118 2523308 2529567 2536019 2543019 2550694 2558767 2566835 2574760 2582881 2591834 2602140 2613846 2626499
49161 2626499 2639452 2652361 2665489 2679521 2694956 2711650 2728955 2746251 2763308 2780270 2797517
49150 2797517 2815581 2835038 2856332 2879532 2904170 2929273 2953743 2976903 2998692 3019288 3038683
49139 3038683 3056892 3074433 3092184 3110546 3129061 3147097 3164632 3181935 3198644 3213801 3226956
49128 3226956 3238664 3249541 3259270 3267149 3273269 3278425 3282917 3286213 3288035 3288914 3289179 3288107 3284857 3279896
49114 3279896 3274599 3269519 3263907 3257070 3249482 3242228 3235970 3230735 3226203 3221746 3216654 3210884 3205417 3201440
49100 3201440 3199245 3198239 3197786 3197708 3198076 3198998 3200622 3203154 3206834 3212027 3219103 3227915 3237539 3246866 3255423
49085 3255423 3263311 3270573 3277113 3283203 3289458 3296015 3302070 3306496 3308739 3308936 3307449 3304602 3300683 3295786
49071 3295786 3289561 3281344 3270714 3257924 3243763 3229014 3213943 3198229 3181309 3162856 3142969 3122076
49059 3122076 3100684 3079103 3057197 3034434 3010367 2985159 2959468 2933777 2907989 2881769 2855081
49048 2855081 2828221 2801457 2774864 2748453 2722219 2696012 2669592 2642911 2616223 2589866 2564058
49037 2564058 2538963 2514780 2491619 2469349 2447707 2426489 2405560 2384866 2364652 2345484 2327720
49026 2327720 2310997 2294597 2278396 2263075 2249235 2236653 2224683 2213131 2202332 2192558 2183752 2175856
49014 2175856 2169039 2163506 2159296 2156321 2154463 2153642 2153910 2155367 2157799 2160530 2162930 2164981 2167034 2169226
49000 2169226 2171564 2174481 2178628 2183956 2189539 2194584 2199198 2203904 2208885 2214046 2219372 2224715 2229543 2233445
48986 2233445 2236771 2240304 2244384 2248768 2253256 2258009 2263323 2269462 2276672 2284886 2293461 2301693 2309627 2317842
48972 2317842 2326302 2333995 2340058 2344863 2349558 2354814 2360463 2366114 2371603 2376740 2381199 2384946 2388514 2392452
48958 2392452 2396526 2399697 2400993 2400280 2398142 2395224 2391848 2388143 2384256 2380369 2376640 2373189 2370057 2367221
48944 2367221 2364763 2362987 2362144 2361974 2361838 2361433 2361262 2362323 2365472 2371078 2378877 2387987 2397472 2407312 2418562
48929 2418562 2432189 2447956 2464853 2482440 2501156 2521382 2542817 2565003 2588047 2612527 2638923
48918 2638923 2667325 2697482 2728980 2761478 2794849 2828988 2863552 2898183 2932956 2968308 3004503
48907 3004503 3041539 3079623 3119263 3160659 3203379 3246900 3291159 3336362 3382634 3430165 3479347
48896 3479347 3530301 3582522 3635469 3689347 3744864 3802342 3861466 3921803 3982985 4044371 4105089
48885 4105089 4164701 4223460 4281735 4339470 4396314 4451858 4505457 4556114 4602939 4645638 4684394
48874 4684394 4719485 4751197 4779850 4805518 4827829 4846355 4861084 4872209 4879608 4883005 4882637 4879187
48862 4879187 4872884 4863050 4848824 4830033 4807090 4780390 4750220 4717027 4681274 4643134 4602697 4560429
48850 4560429 4516919 4472170 4425616 4376975 4326631 4274963 4221806 4167033 4111341 4055943 4001591
48839 4001591 3948281 3895870 3844549 3794641 3746244 3699168 3653119 3607985 3564161 3522526 3483807
48828 3483807 3447962 3414457 3383109 3354346 3328584 3305738 3285463 3267583 3252076 3238917 3228200
48817 3228200 3220204 3215056 3212461 3211990 3213585 3217629 3224604 3234770 3248002 3263698 3281008 3299497 3319551
48804 3319551 3341834 3366298 3391999 3418035 3444455 3472092 3501623 3533014 3565780 3599469 3633831
48793 3633831 3668727 3704185 3740496 3777925 3816184 3854455 3892232 3929992 3968681 4008579 4049082
48782 4049082 4089696 4130702 4172524 4214834 4256893 4298653 4340904 4384113 4427518 4469641 4509557
48771 4509557 4547432 4583977 4619569 4653857 4686096 4715819 4743200 4768681 4792271 4813426 4831674
48760 4831674 4847132 4860171 4870781 4878479 4882804 4883624 4881039 4875299 4866834 4856058 4843053 4827676 4810095
48747 4810095 4790866 4770316 4748118 4723819 4697532 4669714 4640468 4609561 4576991 4542954 4507211
48736 4507211 4469175 4428905 4387454 4345852 4304294 4262873 4222567 4184578 4148970 4114871 4082041
48725 4082041 4051317 4023249 3997256 3972742 3950376 3931461 3916407 3904581 3895552 3889783 3888043 3890655
48713 3890655 3897459 3908095 3922233 3939821 3961205 3986745 4016370 4049812 4087221 4129039 4175202
48702 4175202 4224991 4277897 4334199 4394337 4458021 4524323 4592387 4661658 4731559 4801344 4870312
48691 4870312 4937897 5003543 5066692 5126867 5183551 5235897 5282723 5322868 5355561 5380609 5398365
48680 5398365 5409406 5414001 5411898 5402746 5386698 5364431 5336689 5304068 5267250 5227144 5184603 5140127
48668 5140127 5093983 5046556 4998490 4950562 4903447 4857515 4812798 4769150 4726416 4684473 4643236
48657 4643236 4602754 4563167 4524289 4485309 4445258 4403883 4361853 4319948 4278239 4236169 4193208
48646 4193208 4149289 4104753 4060079 4015574 3971093 3926128 3880258 3833435 3785801 3737436 3688378
48635 3688378 3638626 3587930 3535820 3482191 3427692 3373200 3319034 3265059 3211473 3159061 3108573
48624 3108573 3060161 3013487 2968044 2923372 2879386 2836675 2796134 2758092 2722026 2687290 2653846
48613 2653846 2622139 2592567 2565356 2540670 2518530 2498710 2480900 2464796 2449938 2435850 2422679
48602 2422679 2411396 2402854 2396702 2391651 2386761 2382160 2378625 2376857 2377128 2379152 2382247 2385966 2390589 2396629
48588 2396629 2403920 2411744 2419905 2428981 2439158 2449448 2458685 2466933 2475252 2484212 2493231 2501401 2508448
48575 2508448 2514709 2520551 2526020 2530919 2535142 2539059 2543458 2548842 2554860 2560810 2566682 2573285 2581207 2590115
$$ [...]
##END NTUPLES=NMR SPECTRUM
##END=
