##TITLE=NES1028_10332_9268290_OmHLmCDfxT
##JCAMPDX= 6.0         $$ Bruker NMR JCAMP-DX V2.0
##DATA TYPE= NMR SPECTRUM
##DATA CLASS= NTUPLES
##ORIGIN= BRUKER
##OWNER= Administrator
$$ 1.72 TOPSPIN		Version 2.1
$$ 2015-07-11 21:07:40.472 -0700  Administrator@X
$$ Compression mode = diff/dup
##.OBSERVE FREQUENCY= 400.02188249412
##.OBSERVE NUCLEUS= ^1H
##.ACQUISITION MODE= SIMULTANEOUS (DQD)
##.ACQUISITION SCHEME= undefined
##.AVERAGES= 8
##.DIGITISER RES= 22
##SPECTROMETER/DATA SYSTEM= spect
##.PULSE SEQUENCE= zg30
##.SOLVENT NAME= COFFEE_meoh
##.SHIFT REFERENCE= INTERNAL, COFFEE_meoh, 1, 14.98509
##AUDIT TRAIL= $$ (NUMBER, WHEN, WHO, WHERE, PROCESS, VERSION, WHAT)
$$ ##TITLE= Audit trail, TOPSPIN		Version 2.1
$$ ##JCAMPDX= 5.01
$$ ##ORIGIN= Bruker BioSpin GmbH
$$ ##OWNER= Administrator
$$ $$ E:\/data/COFFEE/nmr/NES1028_10332_9268290_OmHLmCDfxT/20/pdata/1/auditp.txt
$$ ##AUDIT TRAIL=  $$ (NUMBER, WHEN, WHO, WHERE, PROCESS, VERSION, WHAT)
(   1,<2015-07-11 21:07:32.988 -0700>,<Administrator>,<X>,<go>,<TOPSPIN 2.1>,
      <created by zg
	started at 2015-07-11 21:06:27.175 -0700,
	POWCHK enabled, PULCHK disabled,
       configuration hash MD5:
       21 0F 79 D6 B3 7B B4 F6 88 20 88 DB 03 48 BD 9F
       data hash MD5: 64K
       CE 96 32 EF 57 06 2A 57 BF C2 7F 56 90 D6 43 30>)
(   2,<2015-07-11 21:07:36.175 -0700>,<Administrator>,<X>,<proc1d>,<TOPSPIN 2.1>,
      <Start of raw data processing
       efp LB = 0 FT_mod = 6 PKNL = 1 PHC0 = 0 PHC1 = 0 SI = 32K 
       data hash MD5: 32K
       E9 6F 68 70 B2 3B 6B FC C8 E6 1E 5C D9 6C 35 E4>)
(   3,<2015-07-11 21:07:36.472 -0700>,<Administrator>,<X>,<proc1d>,<TOPSPIN 2.1>,
      <pk PHC0 = 92.78503 PHC1 = 0 
       data hash MD5: 32K
       F5 D6 54 AC 05 80 30 8D DE 33 77 A0 4A D5 94 72>)
(   4,<2015-07-11 21:07:36.581 -0700>,<Administrator>,<X>,<proc1d>,<TOPSPIN 2.1>,
      <abs ABSG = 1 
       data hash MD5: 32K
       F5 52 08 4C 56 16 EC BE 00 01 53 40 C8 44 96 5B>)
(   5,<2015-07-11 21:07:36.660 -0700>,<Administrator>,<X>,<proc1d>,<TOPSPIN 2.1>,
      <abs ABSG = 2 
       data hash MD5: 32K
       52 1B F6 E7 7A EE 54 2F DB B3 14 24 4D F8 E0 A5>)
(   6,<2015-07-11 21:07:36.722 -0700>,<Administrator>,<X>,<proc1d>,<TOPSPIN 2.1>,
      <abs ABSG = 3 
       data hash MD5: 32K
       94 80 C6 25 4C 95 3C 13 A6 F3 2D FB 8E 88 73 CF>)
(   7,<2015-07-11 21:07:36.800 -0700>,<Administrator>,<X>,<proc1d>,<TOPSPIN 2.1>,
      <abs ABSG = 4 
       data hash MD5: 32K
       9A 38 34 2D 52 FC 56 D4 43 2E 2B D0 47 FB 20 E8>)
(   8,<2015-07-11 21:07:36.863 -0700>,<Administrator>,<X>,<proc1d>,<TOPSPIN 2.1>,
      <abs ABSG = 5 
       data hash MD5: 32K
       78 43 B2 3F 50 68 FE 16 7C 19 90 2B 5E C7 A0 37>)
$$ ##END=
$$ 
$$ $$ hash MD5
$$ $$ 2A E8 93 7D E0 D0 3B 5F 1C 67 54 2E 61 7E 5D F2
##$RELAX= 
##$RELAX= 
##$RELAX= 
##$RELAX= 
##$RELAX= 
##$RELAX= 
##$RELAX= 
$$ Bruker specific parameters
$$ --------------------------
##$DU= <E:\>
##$EXPNO= 20
##$NAME= <NES1028_10332_9268290_OmHLmCDfxT>
##$PROCNO= 1
$$ [...]
##$TP= (0..7)
150 150 150 150 150 150 150 150
##$TP07= 0
##$TPNAME0= <>
##$TPNAME1= <>
##$TPNAME2= <>
##$TPNAME3= <>
##$TPNAME4= <>
##$TPNAME5= <>
##$TPNAME6= <>
##$TPNAME7= <>
##$TPOAL= (0..7)
0.5 0.5 0.5 0.5 0.5 0.5 0.5 0.5
##$TPOFFS= (0..7)
0 0 0 0 0 0 0 0
##$TUNHIN= 0
##$TUNHOUT= 0
##$TUNXOUT= 0
##$USERA1= <user>
##$USERA2= <user>
##$USERA3= <user>
##$USERA4= <user>
##$USERA5= <user>
##$V9= 5
##$VALIST= <valist>
##$VCLIST= <CCCCCCCCCCCCCCC>
##$VD= 0
##$VDLIST= <DDDDDDDDDDDDDDD>
##$VPLIST= <PPPPPPPPPPPPPPP>
##$VTLIST= <TTTTTTTTTTTTTTT>
##$WBST= 2048
##$WBSW= 25
##$XGAIN= (0..3)
0 0 0 0
##$XL= 0
##$YL= 0
##$YMAX_a= 590208
##$YMIN_a= -492638
##$ZGOPTNS= <>
##$ZL1= 120
##$ZL2= 120
##$ZL3= 120
##$ZL4= 120
##$ABSF1= 14.98509
##$ABSF2= -5.573092
##$ABSG= 5
##$ABSL= 3
##$ALPHA= 0
##$AQORDER= 0
##$ASSFAC= 0
##$ASSFACI= 0
##$ASSFACX= 0
##$ASSWID= 0
##$AUNMP= <proc_prof1d_extract_pilot.lims>
##$AXLEFT= 0
##$AXNAME= <>
##$AXNUC= <1H>
##$AXRIGHT= 0
##$AXTYPE= 0
##$AXUNIT= <>
##$AZFE= 0.1
##$AZFW= 0.1
##$BCFW= 0
##$BC_mod= 0
##$BYTORDP= 0
##$COROFFS= 0
##$CY= 15
##$DATMOD= 1
##$DC= 0
##$DFILT= <>
##$DTYPP= 0
##$F1P= 0
##$F2P= 0
##$FCOR= 0.5
##$FTSIZE= 32768
##$FT_mod= 6
##$GAMMA= 0
##$GB= 0
##$INTBC= 1
##$INTSCL= 1
##$ISEN= 128
##$LB= 0
##$LEV0= 0
##$LPBIN= 0
##$MAXI= 10000
##$MC2= 0
##$MEAN= 0
##$ME_mod= 0
##$MI= 0
##$NCOEF= 0
##$NC_proc= -8
##$NLEV= 6
##$NOISF1= 0
##$NOISF2= 0
##$NSP= 0
##$NTH_PI= 0
##$NZP= 0
##$OFFSET= 14.98509
##$PC= 1
##$PHC0= 92.78503
##$PHC1= 0
##$PH_mod= 1
##$PKNL= yes
##$PPARMOD= 0
##$PPDIAG= 0
##$PPIPTYP= 0
##$PPMPNUM= 2147483647
##$PPRESOL= 1
##$PSCAL= 4
##$PSIGN= 0
##$PYNMP= <proc.py>
##$REVERSE= no
##$SF= 400.02
##$SI= 32768
##$SIGF1= 0
##$SIGF2= 0
##$SINO= 400
##$SIOLD= 32768
##$SPECTYP= <>
##$SREGLST= <1H.CDCl3>
##$SSB= 0
##$STSI= 32768
##$STSR= 0
##$SW_p= 8223.68421052631
##$SYMM= 0
##$S_DEV= 0
##$TDeff= 65536
##$TDoff= 0
##$TI= <>
##$TILT= no
##$TM1= 0
##$TM2= 0
##$TOPLEV= 0
##$USERP1= <user>
##$USERP2= <user>
##$USERP3= <user>
##$USERP4= <user>
##$USERP5= <user>
##$WDW= 1
##$XDIM= 32768
##$YMAX_p= 449815764
##$YMIN_p= -752560
##$CURPLOT= <Network HP LaserJet P1505>
##$CURPRIN= <$Network HP LaserJet P1505>
##$DFORMAT= <normdp>
##$LAYOUT= <+/1D_H.xwp>
##$LFORMAT= <normlp>
##$PFORMAT= <normpl>
##$SURQMSG= 1
$$ End of Bruker specific parameters
$$ ---------------------------------
##NTUPLES= NMR SPECTRUM
##VAR_NAME=  FREQUENCY,     SPECTRUM/REAL,   SPECTRUM/IMAG
##SYMBOL=    X,             R,               I
##VAR_TYPE=  INDEPENDENT,   DEPENDENT,       DEPENDENT
##VAR_FORM=  AFFN,          ASDF,            ASDF
##VAR_DIM=   32768,         32768,           32768
##UNITS=     HZ,            ARBITRARY UNITS, ARBITRARY UNITS
##FACTOR=    0.250966925370066, 1,           1
##FIRST=     8223.43324360094, -150246,      28360
##LAST=      0,             166508,          51201
##MIN=       0,             -752560,         0
##MAX=       8223.43324360094, 449815764,    0
$$ Real data points
##PAGE= N=1
##DATA TABLE= (X++(R..R)), XYDATA
$$ [...]
19488c80283g8897j81578J00534b838k4866C35329A6118e7210B5860L44927e4268
19476a51896L0675m4780K6083l0k10737f3551o0537B8196b51860f9246G1367L1606
19464A02973b57133A4285b67292r448A16300l5057c16171f4711n4554l4550a9608
19452D5675a03790G7472b66848H0023g2249A30676b6592G5914a64711F3417J41650
19441B05067b68832A39995h5419A05234m0796h8852I1423a68245q986q8546l6154
19430c01931A34910b11367i2680l6364j01986e5924A96446a93909n5084j55702
19420d04695A42485m956l6362c6844F545a19495h991F9228c88623f8487k4498
19409i2985r03j50875a01450k020j02325A56549a33085A49403f6675j14607B23838
$$ plain form
19488 -380283 -78897 -260475 -159941 -2838 -27704 335329 16118 -57210 25860 370787 -54268
19476 -151896 -121221 -166001 -139918 -139948 -350685 -63551 -124088 28196 -251860 -69246 71367 102973
19464 102973 -257133 14285 -267292 -276740 116300 81243 -316171 -64711 -119265 -153815 -19608
19452 45675 -103790 77472 -266848 80023 -72249 130676 -26592 75914 -164711 63417 205067
19441 205067 -268832 139995 -85419 105234 64438 -88852 91423 -168245 -177231 -265777 -301931
19430 -301931 134910 -211367 -92680 -129044 -231030 -55924 196446 -193909 -248993 -404695
19420 -404695 142485 137529 101167 -36844 6545 -119495 -8991 69228 -388623 -68487 -92985
19409 -92985 -93888 -244763 -101450 -103470 -205795 156549 -133085 149403 -66675 -181282 223838
19397H5293R3054C6205N5822a46792C0957c93994B14721c75807a39134B1869b60891
19385b27464f6685F9088a45910K6711b8020I202c51885c8835H0269b8522k13355
19374b41877R9528p3013R2534j27193f0678q0839A54141a03250J8694b143m8685
19363e0828A93728P857a11703j94446d271D0369a56677a6553F52a74717B02526
19351C52306d30344K10938M5040g5642B01995m5730a47566m2184Q9683A26121
19340a51207j01935B61293E5362O6006b07442A39638C222b87903f0729n3463A62779
19328c93184f6275p5150F2975f4972r8072B74246a06938k59104G854e0933j42925
19317a93858J1707I5290b55192e9409k08433I5803a76470j57598a52610G1337
$$ plain form
19397 85293 178347 36205 92027 -146792 30957 -393994 214721 -375807 -139134 21869 -260891
19385 -227464 -66685 69088 -145910 -119199 -28020 9202 -351885 -38835 80269 -28522 -241877
19374 -241877 -142349 -215362 -122828 -250021 -60678 -141517 154141 -103250 -84556 -2143 -50828
19363 -50828 193728 201585 -111703 -306149 -4271 40369 -156677 -16553 652 -174717 202526
19351 352306 -430344 -219406 -174366 -75642 201995 156265 -147566 -189750 -100067 126121
19340 -151207 -253142 261293 55362 121368 -207442 139638 3222 -287903 -60729 -114192 162779
19328 -393184 -66275 -141425 62975 -64972 -163044 274246 -106938 -366042 7854 -50933 -193858
19317 -193858 -182151 95290 -255192 -59409 -267842 95803 -176470 -334068 -152610 71337
19306C4431a93781J439I5441a305G9773K12999E4414b85401p9797A8933J32001
19295A50934O614b78155G3043K34707a03122K867j09036O3177n1957c4398j12500
19284a46898M7588L7177A82186c316F1803J06105b85827G4489b75000C5325J16121
19273A51446c80741B485M6606h7827J5280A82387A6334f7680k35265J26554h3129
19261a21896k43791L5765H7554J18302H7313a09566H0905b00768I2220D0554a7542
19249a71195l4329E1859L669c36079H8368e4738a7441j49976k6368j18794a15293
19237h7575A13751C7932J86993e835j36594K0832B91360c89033B1458a61720P2513
19226h9207j62451j43293a5382o2567j90446A04146g887j10743N620l9767N4093
$$ plain form
19306 34431 -193781 -192342 95441 -1305 79773 292772 54414 -285401 -365198 18933 150934
19295 150934 157548 -278155 73043 307750 -103122 -100255 -209291 -146114 -198071 -34398 -146898
19284 -146898 -99310 -62133 182186 -3316 61803 167908 -285827 74489 -275000 35325 151446
19273 151446 -380741 2485 49091 -87827 -72547 182387 16334 -67680 -302945 -176391 -83129
19261 -121896 -365687 -329922 87554 205856 87313 -109566 80905 -200768 92220 40554 -17542
19249 -171195 -205524 51859 55528 -336079 88368 -54738 -17441 -167417 -193785 -312579 -115293
19237 -87575 113751 37932 224925 -5835 -142429 -121597 291360 -389033 21458 -161720 -89207
19226 -89207 -251658 -394951 -15382 -77949 -268395 104146 -7887 -118630 -113010 -152777 -98684
19215i8684b0149q7886b498k00138R3290K2939B20047r4793P224g0967p6095K1819
19203a25243l21587K00802d8354B69360a16094A24454b88627d3874k132m50120
19193d96126C2296J36171i1786I5342N5590a93742d4741j68472j06524k6202h221
19181a33188A92753b85241R1119f8256q5691J5948K7436i981A06137a94459J739
19170a92720m7173A25744l3668i2770D4266c5921D4133J36287b51545a13796F8538
19158a93058O1263l2035A66487b36214g646j02422M7541b1039j03196j34646j41655
19147d00536a63783C41038g2662k27814C7918K3223J8280a66939j10207e4555
19136A1750K64950d341A38750c1695E1037b0009j97403a8540k4160r2134O0396
$$ plain form
19215 -98684 -20149 -108035 -2498 -202636 -109346 -86407 220047 125254 132478 -70967 -147062 -125243
19203 -125243 -446830 -246028 -48354 269360 -116094 124454 -288627 -43874 -46006 -496126
19193 -496126 32296 168467 -91786 95342 150932 -193742 -44741 -213213 -319737 -345939 -8221
19181 -133188 192753 -285241 -194122 -68256 -153947 -137999 -110563 -9981 106137 -194459 -192720
19170 -192720 -239893 125744 92076 -92770 44266 -35921 44133 180420 -251545 -113796 68538
19158 -193058 -131795 -163830 166487 -236214 -7646 -110068 -62527 -21039 -124235 -258881 -400536
19147 -400536 -163783 341038 -72662 -300476 37918 61141 79421 -166939 -277146 -54555
19136 11750 276700 -4341 138750 -31695 51037 -20009 -217412 -18540 -42700 -134834 -74438
19125g4438J4479k99999J19700H3161J63938D9981f478C5876a08066A03441c0144
19113g2940A06488e0808k76786A15991k5328Q5760c90348C53993b94532f040j69505
19102a75545H7737b98150M0140a1521A44960b09378n2314f5178l6429b3553n5945
19091g9498A58437a49631c6019A25697c6478I2694J28800g2771n10104A5392M4641
19080F0033j1741h8171D22390c87909A23334a33579c6875k25987b4547A46361
19069c48099A07786b19071j13463c4708p8528B75537g5081o2158j46537J02332
19059a81444L2944H4780a2597j22853F3701b62497B5425O5564e4296D1677L3450
19048G5127d3724m11807A63234D9621b70315o7006D3730J23017E6872a53697C53532
$$ plain form
19125 -74438 -59959 -359958 -240258 83161 247099 49981 -6478 35876 -108066 103441 -30144
19113 -72940 106488 -50808 -327594 115991 90663 176423 -390348 353993 -294532 -6040 -175545
19102 -175545 87737 -298150 -258010 -11521 144960 -209378 -261692 -65178 -101607 -23553 -79498
19091 -79498 158437 -149631 -36019 125697 -36478 92694 221494 -72771 -582875 15392 60033
19080 60033 48292 -88171 422390 -387909 123334 -133579 -36875 -262862 -24547 146361
19069 -348099 107786 -219071 -332534 -34708 -113236 275537 -75081 -137239 -283776 -181444
19059 -181444 -148500 84780 -12597 -135450 63701 -262497 25425 90989 -54296 41677 75127
19048 75127 -43724 -455531 163234 49621 -270315 -337321 43730 166747 56872 -153697 353532
19036A99254a37856F5062e2841F6501g6742A4054a23334f445A17497D6180N8731
19025A04911a36118I0265h4132j8567C8144J83701k6375a33197n6279D3473f1789
19013g3003r4530B13386E3934a98264f1035H0973g2264j03294d7145G7539i891
19001a87285e5992C06675g9192A120a1881B06178i6618j76298j5837G1917L2445
18990A04362O4043a46418A41285J13045c4964j64170B8684a66891f0736b1883
18979c47418J38182K5842g192I199h7675A73128g1218E44864B62259J66403b21560
18967A70073f1107A0188c2987j46309g2475l1068a7171E6335J63752F7986B0251
18955A22483c51465a18860B9221O3886b37630B29604a65926a656q9439L4477j29568
$$ plain form
19036 199254 -137856 65062 -52841 66501 -76742 14054 -123334 -6445 117497 46180 104911
19025 104911 -136118 90265 -84132 -102699 38144 221845 195470 -133197 -189476 43473 -61789
19013 -73003 -167533 213386 53934 -198264 -61035 80973 -72264 -175558 -47145 77539 -9891
19001 -187285 -55992 306675 -79192 1120 -11881 206178 -96618 -272916 -288753 71917 104362
18990 104362 168405 -146418 141285 254330 -34964 -199134 28684 -166891 -60736 -21883
18979 -347418 -209236 -183394 -7192 9199 -87675 173128 -71218 544864 262259 428662 -221560
18967 170073 -61107 10188 -32987 -179296 -72475 -103543 -17171 56335 220087 67986 20251
18955 122483 -351465 -118860 29221 93107 -237630 229604 -165926 -1656 -91095 -56618 -186186
18944a86186A09643a31074F8598a18917m8991B90816a21947n41A86636e7027H6605
18932e2068m4409m4118B25028g2602o1350j57814A21995K00134A07129a03792
18921B11880b31694B16986b0100B8319a52711N0358B8875d7813A44718l457n5384
18910H5877k1600L92007j36389l354A55445J09609a60422I2968a26935A1847a09779
18898i7787A22318b44327A95486b14115J00066n842H3187J2129b73925c2409q2924
18887a15333A49590E4539i4551D3142j4336c22111J02754A37260b20348d1912
18876E4398O8760b00027r9968q1806c4030m3174k30251a53401A56565i7886l11324
18865d09210a24607D9796a24925A7822g1576o3062D8569a84839A63663i3987n2363
$$ plain form
18944 -186186 109643 -131074 68598 -118917 -167908 290816 -121947 -122488 186636 -57027 86605
18932 -52068 -96477 -140595 225028 -72602 -133952 -291766 121995 322129 107129 -103792
18921 211880 -231694 216986 -20100 28319 -152711 -102353 28875 -47813 144718 141261 85877
18910 85877 64277 456284 319895 316541 155445 265054 -160422 92968 -126935 11847 -109779
18898 -97787 122318 -244327 195486 -214115 -114049 -119891 83187 95316 -273925 -32409 -115333
18887 -115333 149590 54539 -94551 43142 28806 -322111 -219357 137260 -220348 -41912
18876 54398 123158 -200027 -299995 -381801 -34030 -77204 -307455 -153401 156565 -97886 -409210
18865 -409210 -124607 49796 -124925 17822 -71576 -134638 48569 -184839 163663 -93987 -146350
18854a46350K1895a9182j42652P6673j76603i3150A7996K17561a79608L5867a7182
18842c04288L8884E8715J49253F9949f0801A20321K9735K7576g0656q0063k58261
18831d08980g4102A48792F9531a38294o2302F1868b1918A10740b98725G3517a01872
18819C4536J18137J22435k7785B2344i5887l710C11938A31505k7621b01979r5588
18808b97567a20738I4224Q1902e3097B95931d2386p6532K7173H4397a3384A80541
18796I8744C8144a4455A06014h6300m61103A62391L65f4172A73077j1969g8098
18784a46457k4060q7434B15745b62268a03734k96722C2914h5479L772G2762P7760
18773A50522P1543c60778I1432a18773b3318k9929o1361j5076O2843n8608L2301
$$ plain form
18854 -146350 -124455 -19182 -161834 -85161 -261764 -93150 17996 235557 -179608 -143741 -17182
18842 -304288 -265404 58715 207968 69949 -60801 120321 150056 177632 -70656 -150719 -408980
18831 -408980 -74102 148792 69531 -138294 -200596 61868 -21918 110740 -298725 73517 -101872
18819 34536 152673 275108 247323 22344 -95887 -99597 311938 131505 103884 -201979 -297567
18808 -297567 -120738 94224 176126 -53097 295931 -42386 -118918 -91745 84397 -13384 180541
18796 98744 38144 -14455 106014 -86300 -547403 162391 162756 -64172 173077 161108 -78098
18784 -146457 -170517 -257951 215745 -262268 -103734 -400456 32914 -85479 -81707 72762 150522
18773 150522 222065 -360778 91432 -118773 -23318 -53247 -114608 -129684 -66841 -125449 -93148
18762i3148C77780b43592N4942R0193B67062b05185i3215B98169a28223j54197
18752b82420B64269a58686f7300A08713a23947N8746A39183n8534O1847g4413
18741a28007E984a86247A07518K2809l5928b50750c336A86335b7341I2576l8864
18730E3712J89418d6731l7926j31258b9587j4139l81822J88548e658r823E4520
18718C9457L5325l4966a71963n0698M8571G2086a466j83312E2078d8460k05947
18707b54407i9329d8742k412m8863k26811b2507A44156d5501A73115l9364k9083
18696A04668g324E8922b56764c9898H4776b92658C3490F407b1041j76845O8994
18685a28892r1632E9059a02858p4550b1040k95172A18489Q5815d8642p0815e9206
$$ plain form
18762 -93148 377780 -243592 -188650 -98457 267062 -205185 -93215 298169 -128223 -282420
18752 -282420 264269 -158686 -67300 108713 -123947 -65201 139183 80649 142496 -74413
18741 -128007 5984 -186247 107518 130327 94399 -250750 -3336 186335 -27341 92576 53712
18730 53712 243130 -46731 -84657 -215915 -29587 -43726 -425548 -237000 -5658 -15481 54520
18718 39457 74782 39816 -171963 -222661 -174090 72086 -1466 -184778 52078 -48460 -254407
18707 -254407 -99329 -48742 -51154 -100017 -326828 -22507 144156 -45501 173115 133751 104668
18696 104668 -7324 58922 -256764 -39898 84776 -292658 33490 6407 -21041 -197886 -128892
18685 -128892 -220524 59059 -102858 -177408 -21040 -316212 118489 204304 -48642 -119457 -59206
18673D6244f4555c1936j16112b040l29092J12411m2512A37549e084H3156b27386
18661a96213A28691j2706D2947a1404k85779e9323j64824e1374a9738B3600b09686
18649c15813o0986g4821j06921l6138P8528d0134j74935P3542H4274J79943c3811
18637b86510A36905J20726a53587n4058H4040a28901L2791F1604a35956C516P8755
18626H2271g3400l4507n1349G1216a52620A6048K9539f57A2388J30236F501a0902
18613E2214h0219B67377a75557j78647A34608a19006C0997A4311d430l8979A7591
18601c75570b9034o1517q3999A00713a49117A80443b95119A07219a53817M770
18591a49047C4547J11619b12136a9123F2853b27129a7769C12400Q880e5677k185
$$ plain form
18673 46244 -64555 -31936 -148048 -2040 -331132 -218721 -261233 137549 -5084 83156 -227386
18661 -196213 128691 115985 42947 -11404 -297183 -59323 -224147 -51374 -19738 23600 -209686
18649 -315813 -376799 -74821 -181742 -217880 -139352 -40134 -215069 -141527 84274 264217 -33811
18637 -286510 136905 257631 -153587 -207645 84040 -128901 -96110 61604 -135956 3516 82271
18626 82271 -73400 -107907 -159256 71216 -152620 16048 45587 -657 12388 142624 6501 -10902
18613 52214 -80219 267377 -175557 -354204 134608 -119006 30997 14311 -4430 -43409 17591
18601 -375570 -29034 -90551 -174550 100713 -149117 180443 -295119 107219 -153817 -149047
18591 -149047 34547 146166 -212136 -19123 62853 -227129 -17769 312400 321280 -55677 -57862
18580e7862j89506B7791J04188h4340b138A53345a309k05224A29055a58889j26928
18569b85817J07834f9222k3507j32657C8780b85884a03091B2129L0113b7157H4813
18557a22228C5371b44272N9699Q2819A72820a98837j3898h8949R115B31819H7824
18545B11762a41361M1258J348B17872b02940P409L6678D3938J64157C0072f571
18533B01469d9257r0120A50403C5463b09850C43955a15725j97423Q8044O555C6669
18521f9130m5979e0800q0587j74584c3381k4668A48934b8592A04043a89354g6962
18509F8500d36867b9519r185A87040A5398L4148g9094k4044k23954f0448k43738
18498c04186J10028J5653A24848e8282m9206l0045B14237d2380q4292j9265H8798
$$ plain form
18580 -57862 -247368 27791 131979 -84340 -2138 153345 -1309 -206533 129055 -158889 -285817
18569 -285817 -177983 -69222 -92729 -225386 38780 -285884 -103091 22129 52242 -27157 84813
18557 -122228 35371 -244272 -184573 -101754 172820 -198837 -212735 -88949 -79834 231819 87824
18545 211762 -141361 -100103 -98755 217872 -202940 -195531 -158853 43938 208095 30072 -6571
18533 201469 -49257 -139377 150403 35463 -209850 343955 -115725 -313148 -225104 -218549 36669
18521 -69130 -115109 -50800 -131387 -305971 -33381 -58049 148934 -28592 104043 -189354 -76962
18509 68500 -436867 -29519 -38704 187040 15398 49546 -79094 -103138 -327092 -60448 -304186
18498 -304186 -194158 -178505 124848 -58282 -107488 -137533 214237 -42380 -126672 -145937 88798
18486A28740M8583a00021M0198I0313a74717f5241A93621a01487I5925D3615a90980
18474b95629k98296c0619j03502A2595a59597A28706E4318H682e2460b4553a0257
18462d2710m03319a47087A897b344A63424D5416b27347d3925D3614K93346b45541
18450a02891l17165C7802M6514J70739E8928a07920j24622j4787A5423B053h6791
18438D6354f5199B73371n6983a01926A07332l5575a23638f075E8544K2396b15534
18426G8146a7487A30459F0422c2279A8703a04706G1583i1545I5619a81803E9387
18414A68457R9379c20456F0957K7789c9875A48095A5579c03794E6646N2936k9406
18403H0176b54101h7819A87688a47882l85283K25589m1490C2996G418J03731a65013
$$ plain form
18486 128740 177323 -100021 -59823 90313 -174717 -65241 193621 -101487 95925 43615 -190980
18474 -295629 -593925 -30619 -134121 12595 -159597 128706 54318 8682 -52460 -24553 -10257
18462 -42710 -446029 -147087 1897 -2344 163424 45416 -227347 -43925 43614 336960 -245541
18450 -102891 -420056 37802 84316 255055 58928 -107920 -232542 -247329 15423 2053 -86791
18438 46354 -65199 273371 216388 -101926 107332 71757 -123638 -6075 58544 80940 -215534
18426 78146 -17487 130459 60422 -32279 18703 -104706 71583 -91545 95619 -181803 59387
18414 168457 267836 -320456 60957 88746 -39875 148095 15579 -303794 56646 109582 80176
18403 80176 -254101 -87819 187688 -147882 -533165 -307576 -349066 32996 7418 111149 -165013
18391C46960a04566b4796F383K36206e5153A05738b03310P0405r9021A71600c00660
18379e6687I4726C7955b98161j0701f3403m68790b51285D5565A463L1321N7360
18368I0144J23007a27019A67990b40302B78003H2163h9183C47469f994A8025N6884
18357G4909a07083A337a67539A60069e18258a37092d9914H3812J9605J45766J78019
18346D27202i8858j7532G3798a10960k46253D0991i3240j80664D7721J3453J32097
18335A93271f3264j09838n5727N0117k3720f2173r6285A44784a40016C5511K2698
18324E8209f5977K1407a5l2333P453k16536m31589f5649j72153I0973e7655k16133
18312b73788E8497b33783H8843b3176A49745D350O879c2746j6134q2340k7463
$$ plain form
18391 346960 -104566 -24796 6383 242589 -55153 105738 -203310 -132905 -231926 171600 -300660
18379 -56687 94726 37955 -298161 -308862 -63403 -532193 -251285 45565 1463 32784 90144
18368 90144 213151 -127019 167990 -240302 278003 82163 -89183 347469 -6994 18025 74909
18357 74909 -107083 1337 -167539 160069 -518258 -137092 -49914 83812 103417 249183 427202
18346 427202 -98858 -116390 73798 -110960 -357213 40991 -93240 -273904 47721 61174 193271
18335 193271 -63264 -173102 -228829 -178712 -202432 -62173 -158458 144784 -140016 35511 58209
18324 58209 -65977 -44570 -15 -32348 -24895 -241431 -673020 -65649 -237802 90973 -57655 -273788
18312 -273788 58497 -233783 88843 -23176 149745 4350 11229 -32746 -48880 -131220 -158683
18301a58683A04669a48445d4334C1888K9966f2755B24290a30216K6458l5643N8863
18290h0538K36C9503c8124K457A24970J04940K59390A30960C9140c42669P4217
18279b68452J32893j33232D2607L3253h777A97548b29857B8094L56890H6068a56253
18267c47763a35644F2425J57506c46180J40449K4767K0759k5151b8741m904R645
18256b4000D9135J45327o7650a57133A88705E3757J29042n7628b19966a09428
18245A00673b06062k09584a21377D16528o7643c9947j9737A91233J36032b09818
18234B22637p1603i2278A71905J9829H4178C3445k360O093g832l05280C8609a80353
18221a0630k89726B6699a60509L5948l78078Q4433a74571o9162L3023H405L9026
$$ plain form
18301 -158683 104669 -148445 -44334 31888 61854 -62755 224290 -130216 -103758 -139401 -80538
18290 -80538 -80302 39503 -38124 -35667 124970 229910 489300 130960 39140 -342669 -268452
18279 -268452 -135559 -268791 42607 75860 -8777 197548 -229857 28094 384984 86068 -156253
18267 -347763 -135644 62425 219931 -346180 -205731 -180964 -160205 -185356 -28741 -33645 -24000
18256 -24000 49135 194462 126812 -157133 188705 53757 182799 125171 -219966 -109428
18245 100673 -206062 -415646 -121377 416528 348885 -39947 -59684 191233 327265 -209818
18234 222637 151034 -92278 171905 191734 84178 33445 31085 37178 -7832 -313112 38609 -180353
18221 -10630 -300356 26699 -160509 -124561 -502639 -418206 -174571 -243733 -210710 8405 47431
18210D7431a15949A80836h9556n2081n4210J8478K7210C95238i9063q2512P6468
18199a05107C16801a75134C35920b84770K9582P7255A80053C0698c29044b6380
18188B7708H013d0743j02392B03063c2575I4197b6773j62587j36319B57479J2894
18177B70373I5532c9917k30892g9344J0811b2175k1525k2480j31745B34158b10464
18165a36461k5679A30164c0123A48390a19286C64889i9723k40011G2250a84708
18154B21485a6768j96526A88230a74425O053B0181K4191I005J03371a79326a7782
18142A20639P1305m0078a56073o5503B21156B9177a87329b5630C6601J15559c31368
18130c7182A34454j3579b748A64127H0233c9485A39127a54575A81258b07299D48046
$$ plain form
18210 47431 -115949 180836 -89556 -141637 -195847 -177369 -150159 395238 -99063 -181575 -105107
18199 -105107 316801 -175134 335920 -284770 -255188 -177933 180053 30698 -329044 -26380
18188 27708 8013 -40743 -143135 203063 -32575 94197 -26773 -189360 -325679 257479 270373
18177 270373 95532 -39917 -270809 -79344 -68533 -22175 -43700 -66180 -197925 234158 -210464
18165 -136461 -162140 130164 -30123 148390 -119286 364889 -99723 -339734 72250 -184708
18154 221485 -16768 -213294 188230 -174425 -168372 20181 44372 9005 112376 -179326 -17782
18142 120639 191944 151866 -156073 -221576 221156 29177 -187329 -25630 36601 152160 -331368
18130 -37182 134454 120875 -2748 164127 80233 -39485 139127 -154575 181258 -207299 448046
18118e7588k4123c9254B46589d8780A771K52156B3897Q4710c908n9366J2991I5666
18105a22633A24829b54444a23086I5439d2053A28352g8845a4153j46406E6254
18094a35619C43885d0388p5304j1268p2387hk00022A04017d20666A33449c86003
18082c22134A43837A0478L78231A88171H5680J34816e0970D9032a23238A53812
18071H6662F290c51070J12897i3815C883f3191B50112A03988d9099C33401B6299
18059D704e5150E4936r820a61610d7194h273l091B96608a24534b9556j48623G473
18046a93366a9142A94751F2645a08942c6038k27858i3525A43500c90969a4171
18035A30076J24045i7570j75423k7235q9367b5519k02663C9040E709a85811b4412
$$ plain form
18118 -57588 -81711 -39254 246589 -48780 1771 253927 23897 108607 -3908 -63274 -50283 95666
18105 -122633 124829 -254444 -123086 95439 -42053 128352 -78845 -14153 -160559 56254
18094 -135619 343885 -40388 -115692 -126960 -199347 -8 -200030 104017 -420666 133449 -386003
18082 -322134 143837 10478 388709 188171 85680 220496 -50970 49032 -123238 153812
18071 86662 6290 -351070 -238173 -93815 3883 -63191 250112 103988 -49099 333401 26299
18059 4704 -55150 54936 45116 -161610 -47194 -8273 -11364 296608 -124534 -29556 -178179 7473
18046 -193366 -19142 194751 62645 -108942 -36038 -263896 -93525 143500 -390969 -14171
18035 130076 254121 -97570 -272993 -300228 -389595 -25519 -228182 39040 5709 -185811 -24412
18023b4225k01165A81390J0741F5707e3175J1708a4739r6887j53393J667b6265
18011G5608e4597j20272J8291p9717C6944c31586f2131J3187i792j45825c0524
17999B92526G5470a48220B03404m0643b766m7483M999l3010C0160M8185R2439
17988A70784l975N000f1455p3567k07852h2796C6693b14156q4331N1563A07609
17976a25667A96058A666f6884B31574m0364H3599b11852A81272b8296A31627d1285
17964I5340J93725b06571c5676A07366b30310M673M2942A31549k8287b24643A20401
17952a4021A43515K16652a08348B7716J97130b06844i7082B4809c7502j06951
17942a44453A40282C5424b7059D4485J67254a38411A6163K45656e177r9437L1081
$$ plain form
18023 -24225 -225390 181390 192131 65707 -53175 -41467 -14739 -111626 -265019 -263352 -26265
18011 75608 -54597 -174869 -156578 -236295 36944 -331586 -62131 -48944 -9792 -155617 -30524
17999 292526 75470 -148220 203404 162761 -2766 -50249 -45250 -78260 30160 78345 170784
17988 170784 166809 171809 -61455 -135022 -342874 -82796 36693 -214156 -298487 -246924 107609
17976 -125667 196058 1666 -66884 231574 191210 83599 -211852 181272 -28296 131627 -41285
17964 95340 289065 -206571 -35676 107366 -230310 -225637 -182695 131549 103262 -224643 120401
17952 -14021 143515 360167 -108348 27716 224846 -206844 -97082 24809 -37502 -144453
17942 -144453 140282 35424 -27059 44485 211739 -138411 16163 261819 -5177 -104614 -73533
17931g3533C26780H273c7355p4373p3261H976a32738K5898j24858B4208a76753
17919a5796R57G4763J85645j11065l367a14918H4421k4660K33617a59053d2471
17907a24268j3056C7315L88588a48536q8497K8171q9641d9598j28673k66009A06175
17895b4982q249m7363L263A31267O2261N4199J9906c24347I5838D104P4619Q4453
17883A63176a49719B87277A05507m4250a10495c294k4361A8923h1290r047c9404
17871B20704J71809a0301F7299A1641N2934a28423A48350m0337a46306A17384
17860B16503H9989C1960a46127c2783p360A2078O3957K58979b36497A19304a32970
17848G4239J88660I3560d7443F2813c27843a5839I629J61454e0401B03216k1833
$$ plain form
17931 -73533 326780 8273 -37355 -111728 -184989 8976 -132738 -106840 -231698 24208 -176753
17919 -15796 -14839 74763 260408 149343 145976 -114918 84421 59761 293378 -159053 -42471
17907 -124268 -137324 37315 425903 -148536 -237033 -208862 -298503 -49598 -178271 -444280 106175
17895 -24982 -33231 -80594 -77331 131267 193528 247727 267633 -324347 95838 4104 78723 163176
17883 163176 -149719 287277 105507 61257 -110495 -3294 -27655 18923 -81290 -90337 -39404
17871 220704 392513 -10301 67299 11641 64575 -128423 148350 108013 -146306 117384
17860 216503 89989 31960 -146127 -32783 -40143 12078 76035 335014 -236497 119304 -132970
17848 74239 262899 93560 -47443 62813 -327843 -15839 9629 171083 -50401 203216 181383
17837A81383h1215r27F2749M0542K77389d815A47619J42641g4173B52945a70433
17825i246A70841c4057B52853a26561B18776g0056F9101b62617F0025g4444E6166
17813A90960A1472g8576B08725p3847K12268b28122C39924a97606A79655D8262
17802b65539A67347J35817E196a7498k36024C2350K21371e2q0165b5874k2261
17791d8135A75566F2477P8103b52238f1239j26077A26089a06235a2050A0511a57248
17779B33988D7875a8359o4382H9509c6537B2287c1975C19495G7868a56035L1681
17768a24354D19268B3789J9372b83767A10774a70182C9097c4275r140k12625J27468
17757a28572C32868b9782A40883E9913O7778N4466C3584K00551J88180j43598
$$ plain form
17837 181383 -81215 -82142 62749 103291 380680 -4815 147619 290260 -74173 252945 -170433
17825 -9246 170841 -34057 252853 -126561 218776 -70056 69101 -262617 60025 -74444 56166
17813 190960 11472 -78576 208725 134878 347146 -228122 339924 -197606 179655 48262
17802 -265539 167347 303164 5196 -17498 -253522 32350 253721 -52 -80217 -25874 -48135
17791 -48135 175566 62477 140580 -252238 -61239 -187316 126089 -106235 -12050 10511 -157248
17779 233988 47875 -18359 -82741 89509 -36537 22287 -31975 319495 77868 -156035 -124354
17768 -124354 419268 23789 43161 -283767 110774 -170182 39097 -34275 -43415 -256040 -128572
17757 -128572 332868 -29782 140883 59913 127691 182157 33584 234135 422315 278717
17747B78717a44173B79015H6122a17921G18J1619L17225j58968k2606M5697d9880
17735C10206h939B27967H783L32454a16044e6586l0309a1272D013L1434c87874
17723F8938h5719B44453e7910a6055m7945L0892I9300b4972r3466N6474B9406
17711H5527M10652G4739j8389A2118a27294A02975a74084E0307a71829b9904A32278
17699a25104E9514b07268a00686L106b4890C5772a24637F0865c8467D38519A97939
17687h3159B29593I7258f9436B22734Q208M2406b7314j30969g8201L434J7480
17676e7287j325F0920p265K74939E4281a26916J9024B42712r0697a3674B12142
17664c8261l097n21421A91648H0706M6083a02485a4719B469K2985J61835a28099
$$ plain form
17747 278717 -144173 279015 86122 -117921 718 12337 329562 170594 147988 193685 -49880
17735 310206 -8939 227967 8783 341237 -116044 -56586 -86895 -11272 4013 35447 -387874
17723 68938 -85719 244453 -57910 -16055 -64000 -33108 99300 -24972 -118438 -61964 29406
17711 85527 496179 74739 56350 12118 -127294 102975 -174084 50307 -171829 -29904 132278
17699 -125104 59514 -207268 -100686 -97580 -24890 35772 -124637 60865 -38467 438519 197939
17687 -83159 229593 97258 -69436 222734 230942 273348 -27314 -158283 -78201 -74767 -57287
17676 -57287 -58612 60920 53655 328594 54281 -126916 -107892 242712 152015 -13674 212142
17664 -38261 -41358 -562779 191648 80706 126789 -102485 -14719 2469 25454 187289 -128099
17652e5622H7376a53611A6520m863L85371F0426J75766Q6312A12945C1374O6751
17641I8125d2889B0072d2823B49300b47794I6430l4788K30847C1729K55144b9010
17629B56361k0748F5754k0232J05689m0267J35145r1259h5080A38814K14403c2837
17617B08830a0423D3839J0528d304B20308F5500Q2005K62746E8192c0741p4797
17606a05538A79385k2086F3083P1208B9376c898A65209a607j00701L0552b8721
17594f7635B98293O4649b23974B83046A24580J16428H0624b01557B76413e3258
17583B8528d9150C4069K66895b5574B56601B0901K53084C7519K13116q7517c5242
17571C02335A42100Q2944J16741C035K55465A09190J34816L4290r6932a16631
$$ plain form
17652 -55622 87376 -153611 16520 11657 397028 60426 236192 322504 112945 31374 98125
17641 98125 -42889 20072 -42823 249300 -247794 96430 61642 292489 31729 286873 -29010
17629 256361 235613 65754 45522 151211 110944 246089 154830 -85080 138814 353217 -32837
17617 208830 -10423 43839 54367 -4304 220308 65500 147505 410251 58192 -30741 -105538
17606 -105538 179385 157299 63083 134291 29376 -3898 165209 -1607 -102308 -71756 -28721
17594 -67635 298293 362942 -223974 283046 124580 241008 80624 -201557 276413 -53258
17583 28528 -49150 34069 300964 -25574 256601 20901 273985 37519 250635 163118 -35242
17571 302335 142100 225044 341785 3035 258500 109190 244006 278296 181364 -116631
17560A55177P8102l5407K61182D6435a47435B45165A10956C3706L18081j55447
17550A96340K60671H1595i3100e287C03368k0709A20063n6522a3729A98543F5253
17538I5180R4418n9183a3120A3944K2523N6247J73878F5858d9774E63161j78071
17527C85090j18132K07525L6282L65304k70427O1905J41876k91466M4080j27220
17517D34817j70700r742a71451C69388l854l2500L9223J83536M30385l8779m45257
17506E02142J23478L4370B32436F4584K84372j27988J81739A20774L37348j88121
17496B70001l9554r240n7416K45077D3371L67467j24032K5113n7003o1503J1844
17485B05257K3924K12602j70771p4201r4190M88709B4350L02342L8098n7308R3453
$$ plain form
17560 155177 233279 197872 459054 46435 -147435 245165 110956 33706 351787 196340
17550 196340 457011 81595 -93100 -5287 303368 282659 120063 63541 -13729 198543 65253
17538 95180 189598 130415 -13120 13944 36467 92714 266592 65858 -49774 563161 385090
17527 385090 266958 474483 510765 876069 605642 667547 809423 517957 562037 434817
17517 434817 264117 254375 -171451 369388 365534 333034 372257 555793 986178 947399 502142
17506 502142 625620 659990 232436 64584 348956 220968 402707 120774 458122 270001
17496 270001 230447 221207 163791 408868 43371 410838 286806 311919 254916 193413 205257
17485 205257 229181 441783 271012 196811 102621 591330 24350 326692 364790 307482 400935
17474D00935K11062I2194K8736R2222M6770l3537n867E3174M9836c7824E7243
17462B27625R7990j14283I5368Q5096L9403K29278k17839K20846j80678K608J05761
17451C79843G0602N56084B46580R0263A40804K77398J20300k41545i9549B65845
17440A83984O6662J72603A97522O2020k1495K21355j00942K32166k47751J80419
17430E23294A18625L46885B16454K834J99625p78j84511K27462L682m6624p8235
17419C39909E0263L24051Q0119J58626B58069J41830j7200j26069M382C9360N20791
17408E60151A97529J40623O882j32500k19r424r9062J74557R763n3415i4958A83842
17395B46868K09190D9090K30428j03482a4076A90135K02812K21661B09834l0075
$$ plain form
17474 400935 611997 92194 120930 213152 259922 226385 220518 53174 103010 -37824 57243
17462 227625 325615 211332 95368 180464 219867 449145 231306 452152 271474 274082 379843
17451 379843 70602 626686 246580 336843 140804 418202 538502 296957 -99549 265845
17440 183984 250646 423249 197522 259542 238047 459402 358460 590626 342875 523294
17430 523294 118625 465510 216454 219288 418913 418135 233624 461086 464768 418144 339909
17419 339909 50263 374314 454433 613059 258069 399899 382699 256630 261012 39360 560151
17408 560151 197529 338152 345034 212534 212315 202891 103829 278386 288149 234734 -94958 183842
17395 246868 456058 49090 279518 176036 -14076 190135 392947 614608 209834 179759
17385A79759p3766L16691j09185e0158l2663A49329n6951K62763r7474D5893L26665
17374C72558j28777A14820K03161j50233L2047P3153q1325J1358r9350l2897h7974
17362g0232B16775H509L85710H2998k7999K96508O6040j11760A06730C2539a9854
17350E49670j96703D5772P0634l9880P8164n333J7017J88639r7308J81496j23998
17339C15203p150N1530A50109J38299A20346d1232E78915c9261D28650n3285A35771
17327A79209L5989E0979L10057D6974L57216j36170q7471K5803q0283K26931j54140
17316A98860O008J39242b26742C26273J45119j442B04408k9054K10363A12523
17305B48205N3750A25770L50326F4371Q6752J70214p1503I9319N6699j612g1232
$$ plain form
17385 179759 105993 422684 313499 -50158 -82821 149329 92378 355141 257667 45893 372558
17374 372558 243781 114820 317981 167748 199795 272948 191623 202981 103631 70734 -87974
17362 -70232 216775 8509 394219 82998 54999 351507 417547 305787 106730 32539 -19854
17350 549670 352967 45772 116406 76526 154690 149357 166374 355013 257705 439201 315203
17339 315203 308053 359583 150109 288408 120346 -41232 578915 -39261 428650 375365 135771
17327 179209 215198 50979 361036 46974 404190 268020 180549 206352 126069 353000 198860
17316 198860 204868 344110 -226742 326273 471392 469950 204408 175354 385717 112523
17305 248205 301955 125770 476096 64371 151123 321337 249834 99319 156018 154406 -71232
17293A34964N2882J80132N6275F2457J37059R9187p6163M9802H1134M31538A56667
17281E54508p5019q1028j26754G3020J44733K29361j1292j7787c9227C41206m7359
17270B93847k2900j09780c7034A96218M9238J42734r8506J12594C238K45370J85286
17259D33894k14883J51381A68704L02480j25823L08560k69691o1837O0439J5542
17249C98374A56079K8804K60281j48539j22261N4763Q3512j10723q564M95523
17239F88875B04262M9553E3300n406Q7592J83766P5422J14202a89509B22909J48221
17228C71130j31821F3030K48803H9472M1759L87203k42655J83200J94141B32158
17217A43618K51724j25497q072p1943J57004j10874K11022j851N3271J4515j26310
$$ plain form
17293 134964 187846 367978 424253 62457 199516 298703 222540 272342 81134 512672 156667
17281 554508 479489 398461 271707 73020 217753 447114 435822 418035 -39227 341206 293847
17270 293847 270947 161167 -37034 196218 245456 388190 289684 402278 3238 248608 433894
17259 433894 219011 370392 168704 471184 345361 653921 384230 322393 382832 398374
17249 398374 156079 184883 445164 296625 174364 229127 312639 201916 193352 688875
17239 688875 204262 253815 53300 47894 135486 319252 394674 508876 -189509 222909 371130
17228 371130 239309 63030 311833 89472 131231 518434 275779 458979 653120 232158
17217 143618 395342 269845 261773 189830 346834 235960 446982 445131 498402 512917 386607
17206C86607M1902j17338J55434K6143h929D41076A96012K89246j30222J49367
17196E04403J54997p3618A7967L01194J87755j12442l012j93761K51476j34235
17186C14942K87227k95273J66653J22353j04417j24215N8582l5554J18454j6689
17176D92063j80630K11444k10956K13693B29151L62157j73317m9082O7557E1697
17165A84492M46825j95065K08998n218k28389A63325J75044J28324Q3258l3844
17155E16107O6215B38977K91517j50632P1087j52897J36864r1653J96474j87734
17145C52003J33197j00191O0508j81177K29122K50156C56876k660J10394K8980
17135D93590J04024N871k88768K33106K08947k79375j12957K13137R5477G4482
$$ plain form
17206 386607 428509 311171 466605 492748 -8929 441076 196012 485258 355036 504403
17196 504403 659400 585782 17967 319161 506916 394474 391462 197701 449177 314942
17186 314942 602169 306896 473549 595902 491485 367270 425852 390298 508752 492063
17176 492063 311433 522877 311921 525614 229151 591308 417991 368909 436466 51697
17165 184492 631317 436252 645250 640032 411643 163325 338369 466693 549951 516107
17155 516107 582322 238977 530494 379862 450949 298052 434916 343263 539737 352003
17145 352003 485200 385009 445517 264340 493462 743618 356876 354216 464610 493590
17135 493590 597614 603485 314717 547823 756770 477395 364438 577575 673052 74482
17124E90712J61756l4414B74691M98277k44200K06922o5671j05390B46108O26677
17114H72785l09743k39487L22778j20703m423j44738J74299L8797J09452K3279
17104G22296m8956r915C07490M48320l68861K62765J69017r5301j02428K5910
17094F46912k4506J26564M1857m7592k90371M05733M1870k87769L0348J36264
17084G79310l03482L80450q0677k85417M33616k62564M01889J60345m61150r6120
17074F66200K39921j50498k42314M09358P0666k89564k17074M52851j52324K41522
17064A028744q9757j4958O4219r0084J3592L6690J34177E28566L55840K38458
17054A122864l18454k5622j01704P8416k91314O11149n6288k10782J20124K43689
$$ plain form
17124 590712 752468 718054 274691 772968 528768 735690 670019 564629 246108 872785
17114 872785 563042 323555 646333 525630 521207 376469 550768 589565 699017 722296
17104 722296 673340 663425 307490 755810 386949 649714 818731 723430 621002 646912
17094 646912 622406 748970 790827 743235 452864 858597 900467 612698 643046 779310
17084 779310 475828 856278 775601 490184 923800 661236 1063125 1223470 762320 666200
17074 666200 906121 755623 513309 922667 993333 703769 486695 939546 787222 1028744
17064 1028744 938987 924029 988248 898164 911756 948446 1082623 528566 884406 1122864
17054 1122864 804410 778788 677084 755500 464186 1075335 1019047 808265 928389 1172078
17044A172078m3362J2506M4268m47809J91179K66443k34193L5032K57790l84613
17034H69319p2606K06205k122m46532M90627k16851L44495k93116L25640l25582
17024H79477L60281J195k52628K30710q2402j10726P0119M9564p7345J11813l08507
17013H71551J60946J68377j02035M6423J00234k66712J90375l4701K08258k0659
17003A322057j98073J01866k59045L52603j49468L6166j00406n7191M38795m54235
16993A033069l9672L89425J28516l07798J63609J10102k3159q0886O0387p4273
16983A359320k13081L27960J97371l65871K22149k31278J20532r4187J5953Q5290
16973A424158N24049l45655l3383j06185m2381j69706J54500Q2763J17468J22408
$$ plain form
17044 1172078 1128716 1141222 1185490 737681 928860 1195303 961110 996142 1253932 869319
17034 869319 796713 1002918 1000796 554264 1044891 828040 1172535 879419 1205059 879477
17024 879477 1239758 1240953 988325 1219035 1136633 1025907 1096026 1145590 1068245 1180058 871551
17013 871551 1032497 1200874 1098839 1145262 1245496 978784 1169159 1134458 1342716 1322057
17003 1322057 1123984 1225850 966805 1319408 1169940 1206106 1105700 1048509 1487304 1033069
16993 1033069 993397 1382822 1511338 1203540 1367149 1477251 1454092 1373206 1433593 1359320
16983 1359320 1146239 1474199 1671570 1305699 1527848 1296570 1417102 1322915 1338868 1424158
16973 1424158 1948207 1602552 1569169 1462984 1420603 1250897 1405397 1488160 1605628 1728036
16963A728036J05635K4154j44606l15587M55179l31238K24579J74636j03197R3075
16953A910666m04705N6574L2581K91899j10571L47341k95772M80501m88646K61235
16943B081103J8082r4630p5140J64919J91815j87831J02097J97776k33326P2560
16933B237425m99780L46230P7732K72648m382j80412J06315O9190J2187k86551
16923B150602k8599L75036j2975J93607j23178l66284L2869K12082L36372q5927
16913B683605q4010J70683m1682J05817K13913j76640O174k46522O4840R0152
16903B786330J08087J95217J29061J31153n8761p1618j03203j87457L6245N9975
16893C025029M24790q9304k81753N23659j42636K82618j38982J87591J98001r6184
$$ plain form
16963 1728036 1833671 1857825 1713219 1397632 1852811 1521573 1746152 1920788 1817591 1910666
16953 1910666 1505961 1562535 1595116 1887015 1776444 2123785 1828013 2308514 1819868 2081103
16943 2081103 2099185 2004555 1929415 2094334 2286149 2098318 2200415 2398191 2164865 2237425
16933 2237425 1737645 2083875 2161607 2434255 2429873 2249461 2355776 2424966 2437153 2150602
16923 2150602 2122003 2497039 2484064 2677671 2554493 2188209 2221078 2433160 2769532 2683605
16913 2683605 2599595 2770278 2728596 2834413 3048326 2871686 2877860 2631338 2696178 2786330
16903 2786330 2894417 3089634 3218695 3349848 3291087 3219469 3116266 2928809 2965054 3025029
16893 3025029 3449819 3360515 3078762 3602421 3459785 3742403 3603421 3791012 3989013 3892829
16883C892829L9209j29980Q9305l59259N99085j61494L35314J4539n6967K67487
16873D530068j32225l41719K40413J86691j63602L26858N26824k16487k14733
16864D742088K61978j8115J16953J33555K13112k81395K29526N08640o88251L02997
16854E521088L73468q2547j15919L39106k69497M04803J61301J96428K00868j26050
16844F603049M20235J46101m38920M29894j24538L39366k57102L76872K42192
16835G737149O3129J89922K77503k46074L74823J64457j16219M71400p3367M11370
16825I254093M45463k37587K13122N2420L07149L82188R1976L3124M05576L6211
16815A0983735J11763O77310j86602L01408L20867K29756N54208k24592N96172
$$ plain form
16883 3892829 3932038 3802058 3891363 3532104 4131189 3969695 4305009 4319548 4262581 4530068
16873 4530068 4397843 4056124 4296537 4483228 4319626 4646484 5173308 4956821 4742088
16864 4742088 5004066 4985951 5102904 5236459 5449571 5168176 5397702 5906342 5218091 5521088
16854 5521088 5894556 5812009 5696090 6035196 5765699 6170502 6331803 6528231 6729099 6603049
16844 6603049 7023284 7169385 6730465 7160359 7035821 7375187 7118085 7494957 7737149
16835 7737149 7800278 7990200 8267703 8021629 8396452 8560909 8444690 8916090 8842723 9254093
16825 9254093 9699556 9461969 9675091 9727511 10034660 10416848 10508824 10541948 10947524 10983735
16815 10983735 11095498 11772808 11586206 11887614 12208481 12438237 12992445 12767853 13364025
16806A3364025L99240J85607N02970K8618J32611O40318J00068M95652L98766
16797A6247875l7335Q09168L55545J13540Q27600K52636L94014O10518P04907
16788B0278468L68279M10101L76261P03012L89497O57430Q25234M59446Q02161
16779B5269889Q57489N65149Q32052N48367P85402R65666O52726Q80393Q56907
16770C2214040Q44150J322928R09721P88280J418311O67958J005053J493724J228251
16761D1892416J214237J604465R91686J453333J150486J492906J277931J606804
16753E2684264J746772J362293J481621J483637J666475J825615K082981J377875
16745F5711533J232173J859927J750241J798791J484488J684960J499008J465153
$$ plain form
16806 13364025 13763265 13948872 14451842 14480460 14613071 15253389 15353457 15849109 16247875
16797 16247875 16210540 17019708 17375253 17488793 18316393 18569029 18963043 19573561 20278468
16788 20278468 20646747 21056848 21433109 22136121 22525618 23183048 24008282 24467728 25269889
16779 25269889 26127378 26692527 27524579 28072946 28858348 29824014 30476740 31357133 32214040
16770 32214040 33058190 34381118 35290839 36079119 37497430 38165388 39170441 40664165 41892416
16761 41892416 43106653 44711118 45702804 47156137 48306623 49799529 51077460 52684264
16753 52684264 54431036 55793329 57274950 58758587 60425062 62250677 64333658 65711533
16745 65711533 66943706 68803633 70553874 72352665 73837153 75522113 77021121 78486274
16737G8486274J484599J301574J180490J186883J205916Q91325N59182J387090
16729H7683333K03771Q69121M98081J31574l88149M80092n18684O6158o83480
16720H8341817p37869n80625o89444j004523r75104j327063j402114j305975j460258
16711G8858842j436138j744410j302361j372048j754936j724971j724088k023959
16703F5775931j043807j776655j775546j557660j533765j447837j543481j799059
16695E3298121j109118j025023j886191j429942j012209j176848j437742j165802
16687D3055246j046131j388445j029375j295239p40303j176888o19952j119569
16679C4639344j052413j129710n04299p18657j336703n90621o23007p06209p50546
$$ plain form
16737 78486274 79970873 81272447 82452937 83639820 84845736 85737061 86296243 87683333
16729 87683333 87887104 88756225 89254306 89385880 88997731 89477823 88959139 89025297 88341817
16720 88341817 87603948 87023323 86333879 85329356 84354252 83027189 81625075 80319100 78858842
16711 78858842 77422704 75678294 74375933 73003885 71248949 69523978 67799890 65775931
16703 65775931 64732124 62955469 61179923 59622263 58088498 56640661 55097180 53298121
16695 53298121 52189003 51163980 49277789 47847847 46835638 45658790 44221048 43055246
16687 43055246 42009115 40620670 39591295 38296056 37555753 36378865 35758913 34639344
16679 34639344 33586931 32457221 31952922 31234265 29897562 29306941 28683934 27977725 27227179
16670B7227179q99658m76927n58346l16724q74642n63865l96366o88334k87116
16661B2165201p84594n92657k87300k69566q16543n17783k15332k93331l77807
16652A8010288o21136j15045l31741n68946l30255k53760l36694m46741k89746
16643A4716224l08539k29356k66524m31408j22531m03921L0854j95246k90582
16634A2498971p6192l22336j99315m03693k40820R5428m22943k08717K7056j78641
16624A0568798l71431J3226m12783M1615k35628j47605O3350j54633k46598K6699
16614I145010o20096J84107j45347o1169k08962o09354m4805J12937K8831k66483
16604G514669j02515O0671o5566k61873N1241l88043J53121j27722q5372j91291
$$ plain form
16670 27227179 26327521 25850594 25292248 24975524 24100882 23537017 23140651 22452317 22165201
16661 22165201 21380607 20787950 20500650 20231084 19414541 18896758 18681426 18388095 18010288
16652 18010288 17389152 17274107 16942366 16373420 16043165 15789405 15452711 15005970 14716224
16643 14716224 14407685 14178329 13911805 13480397 13357866 12953945 12984799 12789553 12498971
16634 12498971 12422779 12100443 11901128 11497435 11256615 11352043 10929100 10720383 10747439 10568798
16624 10568798 10197367 10210593 9797810 9839425 9603797 9456192 9519542 9364909 9118311 9145010
16614 9145010 8524914 8709021 8563674 8502505 8293543 7684189 7639384 7752321 7781152 7514669
16604 7514669 7412154 7472825 7407259 7145386 7196627 6808584 6961705 6833983 6748611 6557320
16594F557320J08863k93776l7621l74421L36452j72287l47459J91094Q0159l66286
16584E682038l7573J03488m66078J29105j71637P4983K46749j04080k99685k4508
16574E132802k57774P4285k47303L14783m97580K25946k03916Q0477j59938P0002
16564D531784p8045K5012R2230l64575N0248J08504k53022L4147m3699K6094k21895
16553C906783J44125q8801j07646k28662J58809J56388l03680J69282n7839M6654
16543C795413k90316J61145j96560K95162j48075l36475J21765j84278m1205n7955
16533C118621J97029r4759K1060L5531O6521j83070l0246O9388j26367n9194j29814
16522B884700R8270J66092n28092O47753l12994j35350M6092K94941m05243J41556
$$ plain form
16594 6557320 6666183 6372407 6334786 5960365 6296817 6124530 5777071 5968165 6048324 5682038
16584 5682038 5644465 5747953 5281875 5410980 5239343 5314326 5561075 5456995 5157310 5132802
16574 5132802 4875028 4949313 4702010 5016793 4519213 4745159 4541243 4621720 4461782 4531784
16564 4531784 4453739 4478751 4570981 4206406 4256654 4365158 4112136 4146283 4102584 4128678 3906783
16553 3906783 4050908 3962107 3854461 3625799 3784608 3940996 3637316 3806598 3748759 3795413
16543 3795413 3505097 3666242 3469682 3764844 3616769 3280294 3402059 3217781 3176576 3118621
16533 3118621 3315650 3220891 3241951 3277482 3344003 3160933 3130687 3200075 3073708 3014514 2884700
16522 2884700 2982970 3149062 2620970 3268723 2955729 2820379 2866471 3161412 2756169 2897725
16512B897725k49247j11250K83565M1922j55917k74261J37416K05408l09116K80806
16502B747051j84274K59561K2609k70457l17889L42361j77648M839q5341r587
16492B331225J47809k20792J12964J68652n09786L87737j90791K7478j9345k07729
16482B027422K15680l72896L78980l48979J0094O2726J58222k08101N32860j10460
16472B345548k75425J35896j63127k71804M27230q3839r5534J78644j02907o3609
16462B031073j20302L07550k42161j22629P2448k94027J90487l6442j77012L39228
16452A948213j36061j62215K78177j62978J28818j57416K39139l0717o23804K81378
16442A602534M83981m22395J9560n062q4805K83594l38669K88817j51806M3687
$$ plain form
16512 2897725 2648478 2537228 2820793 2862715 2706798 2432537 2569953 2775361 2466245 2747051
16502 2747051 2562777 2822338 2844947 2574490 2256601 2598962 2421314 2426153 2340812 2331225
16492 2331225 2479034 2258242 2371206 2539858 2030072 2417809 2227018 2254496 2235151 2027422
16482 2027422 2243102 1870206 2249186 1900207 1910301 1973027 2131249 1923148 2456008 2345548
16472 2345548 2070123 2206019 2042892 1771088 2198318 2114479 2018945 2197589 2094682 2031073
16462 2031073 1910771 2218321 1976160 1853531 1925979 1631952 1822439 1785997 1608985 1948213
16452 1948213 1812152 1649937 1928114 1765136 1893954 1736538 1975677 1944960 1321156 1602534
16442 1602534 2086515 1664120 1683680 1678618 1593813 1877407 1538738 1827555 1675749 1719436
16432A719436Q6777m10233L53983j72917Q3515K38357l90243l75256N58314l8969
16422A652764J7294J7465j56416l9875k06690o8040j16583M17224K25289j50474
16412A591958j04081J54348j23562m41340M14253K73588k92962k1585K31028n59251
16402A122394M96854k81478J18750j89304j7672O69678o26508J68151l4645k34355
16392A191865L19130k83406j95001L37329j59499R7468j39084j78978j11657J51833
16382A030000L23309m40286J05719K69552J84366m85732N34961l34966l34887
16373H52036N01067k05585J6989N9556K61551l72628J69735j5458r3094j34289
16363A039880K36469l27119K21901n00511L54838M64410m90815j45866K75761
$$ plain form
16432 1719436 1806213 1395980 1749963 1577046 1660561 1898918 1508675 1133419 1691733 1652764
16422 1652764 1670058 1687523 1531107 1491232 1284542 1216502 1099919 1517143 1742432 1591958
16412 1591958 1487877 1642225 1518663 1077323 1491576 1765164 1472202 1450617 1681645 1122394
16402 1122394 1619248 1337770 1456520 1267216 1249544 1919222 1292714 1460865 1426220 1191865
16392 1191865 1510995 1227589 1032588 1369917 1210418 1307886 1168802 989824 878167 1030000
16382 1030000 1353309 913023 1018742 1288294 1472660 986928 1521889 1186923 852036
16373 852036 1353103 1147518 1164507 1224063 1485614 1112986 1282721 1267263 1174169 1039880
16363 1039880 1276349 949230 1171131 670620 1025458 1489868 999053 853187 1128948
16354A128948o6876J03228j25898l8933N89o4449M10600m21152l9938K50866k24895
16343I12090N6311P15m2592j7976p1288K03166l991o3922m58249L15899J23394
16332I53557j00883r0397K96364o9279j38329J80871j45836J11149K65139n88745
16322F73611j6887L52225k02752K06337k28165q9608J94645l09373O09959n65554
16312F24438K061K25334n2331R0676j4377J89190k62794R4867n679j75124O1030
16301G77291j97907L5008j45619J16898B73292O30837J15859j42891N128N4300
16291I36525l34538K22593J00035n4261j45696C59587L66362O2884j46968K20306
16281H62171k10079J58267J66102j93732M3822k05379J34234j06248J17119k46903
$$ plain form
16354 1128948 1062072 1165300 1039402 1000469 1001058 936609 1347209 926057 886119 1136985 912090
16343 912090 968401 969116 926524 908548 837260 1040426 1036435 972513 514264 830163 953557
16332 953557 852674 762277 1058641 989362 851033 1031904 886068 997217 1262356 673611
16322 673611 656724 1008949 806197 1012534 784369 694761 889406 580033 1189992 624438
16312 624438 626499 851833 799502 890178 875801 1064991 802197 897064 891385 716261 777291
16301 777291 579384 614392 468773 585671 273292 904129 1019988 877097 882225 936525
16291 936525 601987 824580 924615 870354 724658 359587 725949 788833 641865 862171
16281 862171 652092 810359 976461 782729 826551 621172 755406 649158 766277 519374
16271E19374J58288l03981R1454K11163J29846k73950J92912j34302K22996o7808
16261G45992j24597L8589J96355j71154J41081D05914K02938p559K89290k57063
16251F33520j30732L8917K08994k61392m7514K26961k30326M3747J63827J86997
16241H32999C35512j37199M74016J24560J50219C09431q3844K50495M5831k8188
16231D93725P2017k5704M6398j63718J99691p4704O148p7075J39990j0656j80384
16220D25728F2369O74989k67291k5565K97120B36371M73387J11319l7891L6306
16210H19492B46631K91472j79162M9034J72063p9784j58465J54107K3370m151
16200E15115l3142J09517R9248j96298J66274p0792k23323j60384L84187B92675
$$ plain form
16271 519374 677662 373681 465135 676298 806144 532194 725106 590804 813800 745992
16261 745992 621395 659984 856339 685185 826266 405914 608852 601293 890583 633520
16251 633520 502788 541705 750699 489307 441793 668754 438428 482175 646002 832999
16241 832999 335512 198313 672329 796889 947108 309431 225587 476082 521913 493725
16231 493725 565742 540038 586436 422718 622409 547705 553853 476778 616768 606112 425728
16220 425728 62369 737358 470067 444502 741622 236371 709758 821077 783186 819492
16210 819492 246631 538103 358941 407975 580038 500254 341789 495896 519266 515115
16200 515115 481973 591490 690738 494440 660714 589922 366599 206215 590402 292675
16189D16706K01505j97736j09382A21254L97967J62405j48327O247r287j03107
16179D27152A95781k012L06754j71558J2315P2464J27869p3168K82078C05840
16168C42972j04636E1034L31274K2930J41915o4663j35009K6513J42579k35448
16158B81125L1140k8334q401o9428K29070k12172H7115L34422N2182A57231L57073
16147E14304n5868j63869O9005j28079J51437A71204M67565C07647j29934L04725
16137D82438H1688J80695r3594L5684J65003A40742L45784j29527O3440j27387
16127B93052J82719A63441J21499J30530h0177I0374M92749A05856N0863m1980
16117A14739K3383J38510J19333k8725j67591J77133J46702A29908J38688j03362
$$ plain form
16189 416706 618211 420475 311093 121254 519221 681626 533299 539546 530259 427152
16179 427152 195781 193769 500523 328965 341280 413744 541613 468445 750523 305840
16168 342972 238336 51034 382308 405238 547153 482490 347481 373994 516573 281125
16158 281125 312265 283931 275530 206102 435172 223000 87115 421537 473719 157231 514304
16147 514304 458436 294567 363572 235493 386930 171204 638769 307647 177713 482438
16137 482438 81688 262383 168789 204473 369476 140742 486526 356999 420439 293052
16127 293052 475771 163441 284940 415470 -80177 90374 583123 105856 156719 114739
16117 114739 138122 276632 395965 367240 199649 376782 523484 129908 268596 165234
16107A65234K27279m2669n0644j41283K13722a09558B92132r2566M5869a51648
16096B54129M9453j36364L9295I3409K29429K53034k06051G3651j024g4065B65851
16084A98105K39532J53909B1726a32418B36112q8753J3944K35014J91498C1769
16073C02131J4945j38017j7091J03180a86451B76735K97658H0253L9544C1783
16062B11996K15417A45177J25432J54187b01811A86675J79104C7602M16108p753
16052D45957a44660E11380E6440R3082k283K59661G4706R6903D6206K61554B0968
16040D48612a52942A89008F0872K78283A10065a11136E8180P0229a9406B61237
16029A74802M4580i1725C71197a08814B94238J65501A52635O7416p4705K0635
$$ plain form
16107 165234 392513 349844 299200 157917 371639 -109558 292132 199566 245435 -151648
16096 254129 303582 167218 206513 93409 322838 575872 369821 73651 72627 -74065 265851
16084 198105 437637 591546 21726 -132418 236112 147359 161303 396317 587815 31769
16073 302131 317076 179059 161968 265148 -186451 276735 574393 80253 119797 31783
16062 211996 427413 145177 270609 424796 -201811 186675 365779 37602 453710 445957
16052 445957 -144660 511380 56440 149522 147239 406900 74706 171609 46206 307760 20968
16040 448612 -152942 189008 60872 339155 110065 -111136 58180 128409 -19406 261237
16029 174802 219382 -91725 371197 -108814 294238 459739 152635 220051 145346 165981
16019A65981J21644G5476N5884M56162B81214m8884J48233b20698B67512Q5338
16009C52850A49073L7186K69960b15286C36281A51851J0074c923H3518J94656
15999B78174j18210J12641j7098j22621m9638K53533r9706G0189J65798I8701
15988D46167j9455J34108O0789M42030o6108l39295n0087R3720l33701c4663B70564
15976A27062a388A49669a17851D1229h1894l57995B94047n6782I3261N8701G4991
15964c2279A11978C1759J94779a17994C68046J00668c26824a47657E2974J46186
15954A99160G4648f1078Q318I0378J69296l4790I4637a37743B16339f9951j69763
15943b39714B76998e2566B16614r8032J26825j16271N3957e9428B3917b29667
$$ plain form
16019 165981 287625 75476 131360 587522 281214 232330 380563 -220698 267512 352850
16009 352850 149073 186259 456219 -215286 336281 151851 161925 -3923 83518 278174
15999 278174 159964 272605 255507 132886 83248 336781 237075 70189 235987 98701
15988 446167 426712 560820 621609 1063639 997531 658236 608149 701869 368168 -34663 270564
15976 127062 -1388 149669 -117851 41229 -81894 -439889 294047 237265 93261 151962 74991
15964 -32279 111978 31759 226538 -117994 368046 468714 -326824 -147657 52974 199160
15954 199160 74648 -61078 -52760 90378 259674 224884 94637 -137743 216339 -69951 -239714
15943 -239714 276998 -52566 216614 118582 245407 129136 183093 -59428 23917 -229667
15932I2961J49591a39641b4465n9551L581C2166Q9805Q870L49361a03220c9401
15920f7097k40011d8003A40854D8175d4964A5162b28116E1157O2404J87499H9906
15908G0647J26173f6729k2963C29239A32167b96005h2598G8138c76701a18161
15897E0428g4800A19260A7634M7797a07936C70519B1537L36923c25545J15000
15887b10545A28193m1733b05212i3092H7059K0321a1034D85300F7301a2510l00421
15876c12931a39822f1589j12220B28776i3788A9918a08469A81505K6790c71141
15865B51862M209e5635I9946f1541A3509J35351a41834C10750i5257B33097I7894
15853G0270a98945A02808K94073g7681C37716F6096K30002a17906L7620j31703
$$ plain form
15932 92961 242552 -139641 -24465 -84016 -80435 32166 121971 130841 480202 -103220 -39401
15920 -67097 -307108 -48003 140854 48175 -44964 15162 -228116 51157 113561 301060 89906
15908 70647 196820 -66729 -89692 329239 132167 -296005 -82598 78138 -376701 -118161
15897 50428 -74800 119260 17634 65431 -107936 370519 21537 358460 -325545 -210545
15887 -210545 128193 86460 -205212 -93092 87059 107380 -11034 485300 67301 -12510 -312931
15876 -312931 -139822 -61589 -173809 228776 -93788 19918 -108469 181505 208295 -371141
15865 251862 256071 -55635 99946 -61541 13509 148860 -141834 310750 -95257 233097 97894
15853 70270 -198945 102808 396881 -77681 337716 66096 296098 -117906 -80286 -211989
15843b11989e4473B1613J67810b26080k59487A476e2794p008G4676d6153D6770
15831H3941g8208A38972g1821A31591P2870b34906M4186P6431d9033A19515G176
15819A25707C3848l299c68120i6828o2184G6295a115A83493q9118l1859b8668
15807h8375m481j10744A39828h1647l42778J87785H8744a01643G6369B365K00921
15796B03286a5635j38575C6279a07449E36755a30996N6518n0818B71296a1332
15785A08165K06511B0491e9896m372A10726a0892C00649j06945h7546H4041O2303
15774A46344E4217e7735A47446b19693c7075C41296c9097I550O2724d068I4382
15762A20738a02318D34593A45119C7355J97169K6371p631p0652G1449b12685i2030
$$ plain form
15843 -211989 -54473 21613 189423 -226080 -485567 1476 -52794 -59802 74676 -46153 46770
15831 83941 -78208 138972 -71821 131591 204461 -234906 -190720 -114289 -49033 119515 7176
15819 125707 33848 30549 -368120 -96828 -159012 76295 -1115 183493 94375 62516 -28668
15807 -88375 -92856 -203600 139828 -81647 -424425 -236640 88744 -101643 76369 2365 203286
15796 203286 -15635 -154210 36279 -107449 536755 -130996 -74478 -125296 271296 -11332
15785 108165 314676 20491 -59896 -64268 110726 -10892 300649 193704 -87546 84041 146344
15774 146344 54217 -57735 147446 -219693 -37075 341296 -39097 9550 72274 -4068 94382
15762 120738 -102318 434593 145119 37355 234524 260895 253264 182612 71449 -212685 -92030
15750a94814E718N1858a95668e619j14554c1401D9009e356B46163B7268L5435
15739F2703g4430D0378b30881m812B3358b28092L7344A90890e9329j6253k43092
15728c18674g2276n5941A47369b1920A34569a85443K1691M2248n6135d0707p4724
15717a15431H4535b1670k3038J4823j77724B19655l9973i9505o201l448k14571
15706c23725C4028M40555i8084E0744a9534A35547l2829m7172b22338C1511a2931
15694b9517l3579B44698A9451b25637d389l79979h3398B15061a87504B18121c5697
15682d2501B376d6240A53697N2693a54377B1782J92916C1458e1371p232B62820
15670a93299j24161A28399d5216A45131b31724J03244B37915r8939A8187J33546
$$ plain form
15750 -194814 5718 57576 -195668 -5619 -120173 -31401 49009 -5356 246163 27268 62703
15739 62703 -74430 40378 -230881 -235693 23358 -228092 -190748 190890 -59329 -75582 -318674
15728 -318674 -72276 -128217 147369 -21920 134569 -185443 -163752 -121504 -177639 -40707 -115431
15717 -115431 84535 -21670 -44708 -29885 -207609 219655 179682 -99505 -105706 -109154 -323725
15706 -323725 34028 474583 -98084 50744 -19534 135547 102718 55546 -222338 31511 -12931
15694 -29517 -63096 244698 19451 -225637 -4389 -384368 -83398 215061 -187504 218121 -35697
15682 -42501 2376 -46240 153697 206390 -154377 21782 214698 31458 -51371 -58603 262820
15670 -193299 -317460 128399 -45216 145131 -231724 -128480 237915 138976 18187 151733
15660A51733l8721C1109g4247k13449c0627k99477g4997B9755j4426a20029A35895
15648c09530d6725d307F5577q036e2471b2473G4644M5549e2535A12420a65621
15636B35256J11996J4092f0329k05626a25619c0953k52556A29929J36117D530
15625f9056B14762p5780O8336J047F5521i0756p2417M8677l00984F428P6268a92495
15612e2045B08615D4374b0747B51540H9626a50798G9130a28641j4330E8277J86933
15601B45210L6695a43067C51777a20141l7867j1998k9330b6326D551b66383B1786
15589C44096a52028B03863g7476D1506b30565f699B3992f3112B27900r8020m5751
15578H4129b0352F2582f9240R253j05807E0304A7571J7535J0485b20558A40437
$$ plain form
15660 151733 113012 31109 -74247 -287696 -30627 -330104 -74997 29755 15329 -120029 135895
15648 -309530 -46725 -4307 65577 57541 -52471 -22473 74644 120193 -52535 112420 -165621
15636 235256 347252 361344 -60329 -265955 -125619 -30953 -283509 129929 266046 4530
15625 -69056 214762 138982 207318 208365 65521 -90756 -163173 -114496 -415480 6428 82696 -192495
15612 -52045 208615 44374 -20747 251540 89626 -150798 79130 -128641 -142971 58277 245210
15601 245210 281905 -143067 351777 -120141 -158008 -170006 -199336 -26326 4551 -266383 21786
15589 344096 -152028 203863 -77476 41506 -230565 -6699 23992 -63112 227900 129880 84129
15578 84129 -20352 62582 -69240 -59987 -165794 50304 17571 35106 45591 -220558 140437
15566G0910a00632j22417f8254j71780A75576O3997a91944B7974P7468B3008f7760
15554b13859k01394a2382p9779L1509A18423a25902D98303b65438I1578J54723
15544B46301G3162a88313n8540A33975c8376B04029a13991C62290a83652H0690
15533h0380C6475P7207b8843k26011D1884K30665a30273o8097A15239r034a50745
15521C3965J8128A7801L98506A05632J18490J09710j22490f1959B40320B8080
15510A21578b18168B13809F7466k5119M0249J02477f736k60945a1110C64080j20686
15499B43394c58162J42340C16942B4989Q6534a63674N8995e525C9555A8801a73267
15487I068K3912a44712B87913c3930L977k09476A13295L8756J5753o3579K38956
$$ plain form
15566 70910 -100632 -223049 -68254 -240034 175576 239573 -191944 27974 105442 23008 -67760
15554 -213859 -415253 -12382 -92161 -60652 118423 -125902 498303 -265438 91578 246301
15544 246301 73162 -188313 -246853 133975 -38376 204029 -113991 362290 -183652 80690
15533 -80380 36475 113682 -28843 -254854 41884 272549 -130273 -198370 115239 106205 -150745
15521 33965 52093 17801 416307 105632 224122 333832 211342 -61959 240320 28080
15510 121578 -218168 213809 67466 42347 82596 185073 -6736 -267681 -11110 364080 243394
15499 243394 -358162 -215822 316942 24989 111523 -163674 -104679 -5525 39555 18801 -173267
15487 9068 32980 -144712 287913 -33930 -29953 -239429 113295 152051 167804 104225 343181
15476C43181m4047M3705j02670J25022g9405B60393J29798j37122G5327J6276
15466I1603c37410E2651P7769j5177b02775e4060E8235f9259b3062B32187b04685
15454E0296e9425k6223D7675A7758a77338F3407R2582R4733r0471L68110J59368
15443F87729J39177M24923m99025B96549K104b6142F4737d6775C01929C3507O7042
15432A00549K57567A4771J84274r2307R4666c03039A54405f4234m5956B93834
15421E9941K37536A11610i6815J3387B24759a13412A18842g3874A56177N4032
15411B10209d5423r3759B92153a61655d5441j9327a1553A90792h5089J364K6951
15400e6774q3398F2913a5709C9522e8599J1252a009G7559K10597J05777h005o5645
$$ plain form
15476 343181 299134 342839 240169 365191 -79405 260393 390191 253069 75327 91603
15466 91603 -337410 52651 130420 115243 -202775 -54060 58235 -69259 -23062 232187 -204685
15454 50296 -59425 -85648 47675 17758 -177338 63407 155989 250722 160251 528361 687729
15443 687729 826906 1251829 752804 296549 298653 -26142 64737 -46775 301929 33507 100549
15432 100549 358116 14771 199045 106738 201404 -303039 154405 -64234 -110190 293834
15421 59941 297477 111610 -96815 -83428 224759 -113412 118842 -73874 156177 210209
15411 210209 -45423 -139182 292153 -161655 -45441 -64768 -11553 190792 -85089 -83725 -56774
15400 -56774 -140172 62913 -15709 39522 -58599 -47347 -1009 77559 288156 393933 -8005 -73650
15388g3650A2778N9504a36184d423A73638q4321e5128b033j235D06121a47289
15376C6616a44466e4922b076C20294j16876n6829M5171L9721l7676j2337F3226
15364h2105p6568I1371j8494J3170D721M89968A45634a58844G932J16718k6974
15353I7676J69877g5751A44458J67803b8964j35204H497K12689J03071H4652N4134
15342A38786g5748C8523J9990a66693E3672L36338A62970a2530A29879a88161
15331H3161l8770J44712J25724a2876A41741Q8672f3854B23749D8060a37485H4125
15319e1655o0578E4108f7584C6966e1141A86458A2610J53064g0967B8875L24791
15308C53666A06700K85349b77782C8606a60961B71384a5280A62409m4618J20087
$$ plain form
15388 -73650 12778 72282 -136184 -4423 173638 89317 -55128 -2033 -3268 406121 -147289
15376 36616 -144466 -54922 -2076 320294 203418 146589 191760 231481 193805 181468 63226
15364 -82105 -158673 91371 72877 86047 4721 494689 145634 -158844 7932 124650 97676
15353 97676 267553 -75751 144458 312261 -28964 -164168 8497 221186 324257 84652 138786
15342 138786 -75748 38523 58513 -166693 53672 390010 162970 -12530 129879 -188161
15331 83161 44391 189103 314827 -12876 141741 230413 -63854 223749 48060 -137485 84125
15319 -51655 -112233 54108 -67584 36966 -51141 186458 12610 165674 -70967 28875 353666
15308 353666 106700 392049 -277782 38606 -160961 271384 -15280 162409 117791 237878
15298B37878B0481J2429K15352j01283K94600e8399E7249a19230j47591D0874
15287B67757E3887J05727F1322a81782i164A90543c12201J4404A87114k3323a3384
15275B18069D9191c46337B10257I1983j1634N3305a1089B2399e884k05689A82816
15263e8249A81046a95889Q0847A01387g2138B49099e1715B29356O0930a12918
15252a99429B73896q5522R8507A7562b21087B83735n1932M3956K35143R36652
15242A447554K67106l49030N62502p96000A43850o8768K08078n9433n3590A6344
15231C0693c8372a3448l62258B71115a7220k71335D78825B14494b12982H2983
15220D9372G00K8462K69890b35582B36393C5213K4160a04392j12614A8461K0660
$$ plain form
15298 237878 20481 32910 248262 146979 441579 -58399 57249 -119230 -266821 40874
15287 267757 53887 159614 61322 -181782 -9164 190543 -312201 -297797 187114 163791 -13384
15275 218069 49191 -346337 210257 91983 80349 133654 -11089 22399 -5884 -211573 182816
15263 -58249 181046 -195889 -115042 101387 -72138 249099 -51715 229356 290286 -112918
15252 -199429 273896 188374 286881 17562 -221087 283735 231803 275759 510902 1447554
15242 1447554 1714660 1365630 1928132 1132132 143850 75082 283160 223727 170137 16344
15231 30693 -38372 -13448 -375706 271115 -17220 -288555 478825 214494 -212982 82983
15220 49372 700 29162 299052 -235582 236393 35213 59373 -104392 -217006 18461 39121
15209C9121K3426g8513A29253a55866A9335a11351q3329P5426A23440C9266Q1899
15198A21165q138L2107B9059Q7893g0664G7130b1882A37435j1769O1471k9560
15187A57577b41888F7532J61569A5743K0561J74280b22859C08342q4195e8654
15176b05361f479B3026L93583i430C2078c4803l51989i8060G0387a18166A23120
15164a78918M414A699J93445b25845B35232I9565b28357B41896P6449j39232A4273
15152A86873C776g7018A69496A8826D505J76152H7839a9785H2704j6373M3992
15141A10323e1112M145l67458f5779A06864a83290B00322i7724B12158C8471a1329
15129a43169A70592j1695h9542L6079B63789a4261C67701j29369p4584K61815
$$ plain form
15209 39121 62547 -78513 129253 -155866 19335 -111351 -194680 -119254 123440 39266 121165
15198 121165 113027 145134 29059 116952 -70664 77130 -21882 137435 125666 187137 157577
15187 157577 -241888 67532 229101 15743 36304 210584 -222859 308342 224147 -58654
15176 -205361 -6479 23026 416609 -9430 32078 -34803 -386792 -98060 70387 -118166 123120
15164 -178918 -174504 1699 195144 -225845 235232 99565 -228357 241896 318345 179113 14273
15152 186873 3776 -77018 169496 18826 4505 180657 87839 -19785 82704 66331 110323
15141 110323 -51112 -46967 -414425 -65779 106864 -183290 200322 -97724 212158 38471 -11329
15129 -143169 170592 158897 -89542 -53463 263789 -14261 367701 238332 163748 425563
15119D25563A28472J28173j20875N30763D7152a0185A46118a09770B50855b8901
15108C57251A10669J83140a79278P618N8142f132A03996b06718C65759A80702
15097A03139a60077A645a79891C76195F4253b8952C58185A40651K13470A43586
15086b03466B72828d9947F7488k2479a26032F0343O5481O475C968K75917m7426
15075B32459J5102J19209a1180A32564n4980a23249A29062c69850A22524c0457
15064F8252a71586P7125j87664B36779m9312q8627C6398c6091G6750a84741B61739
15052A5672K06961K9849J5518J77926A93541J89334A47655N5286J67489j08763
15042B61667K46096B34981K75931B53257D5311J20103L17972Q0890j77287j46144
$$ plain form
15119 425563 128472 256645 135770 666533 47152 -10185 146118 -109770 250855 -28901
15108 357251 110669 293809 -179278 -171660 -113518 -6132 103996 -206718 365759 180702
15097 103139 -160077 1645 -179891 376195 64253 -28952 358185 140651 354121 143586
15086 -203466 272828 -49947 67488 45009 -126032 60343 125824 132299 3968 279885 232459
15075 232459 247561 366770 -11180 132564 77584 -123249 129062 -369850 122524 -30457
15064 68252 -171586 -94461 -282125 236779 187467 98840 36398 -36091 76750 -184741 261739
15052 15672 222633 252482 268000 445926 193541 382875 147655 202941 370430 261667
15042 261667 507763 234981 510912 253257 45311 165414 483386 564276 386989 240845
15032B40845K83777k33204L78359B25858L21500j03676O4886l1833B25701A8270
15021D97954A49934J64967p7370O67119l11658B07554J00014j20603M47050I3597
15010D7117J46442L52383B40275M5270K39259k38662j23328K14830o4151G2370
14999C77369p7135L06746J1620k13004J39208j29601J18791b8854C68663q5550
14989B83113K21678p9898J27641k38057N01590l28272B11725J20275N482L04981
14979F42463J01395O0345K2671k37925k19000J38164A76085J11044L75389k91355
14969C71163K04085A25075Q8311J98301A57626G2067J21678d3555B53950o4902
14959A89048J77033I4846L2332K50826j66807J16550O9901A15908K90319K30131
$$ plain form
15032 240845 524622 291418 669777 225858 547358 443682 508568 476735 225701 18270
15021 497954 149934 314901 237531 904650 592992 207554 307568 186965 634015 93597
15010 47117 193559 545942 240275 285545 524804 286142 162814 377644 313493 72370
14999 377369 300234 606980 618600 405596 544804 415203 533994 -28854 368663 283113
14989 283113 504791 424893 552534 314477 816067 487795 211725 332000 337482 642463
14979 642463 743858 804203 826874 588949 369949 508113 176085 287129 662518 371163
14969 371163 575248 125075 213386 411687 157626 72067 193745 -43555 253950 189048
14959 189048 366081 94846 127178 378004 211197 327747 397648 115908 406227 636358
14949F36358r2242A53667Q3077r2428P75150C51878H810Q6630K61966J56740B42408
14937E14696B38818j13205K43706L86248k16184J47857K95121j2113j22223M33545
14927A281570L5815j41023L09063m07492r9622L68993j50763j48930M84847M27893
14917A960351k52103m39956k91339K84784j86094k85269p4518o3279J42336l27223
14907D67690k12693K34950q5023A08760M19644H7606O5104J33086n1131J1833
14897B46498J26216A61973J85069m5368O6678o950J7470K73889l22565J63945
14887D94141k9714J06159L5963J2290q1683J30813B79240M24167j0205j39134
14877E54068k00614Q139K46555j87682o6325J08591n342K44435j96505K5895J87026
$$ plain form
14949 636358 544116 153667 236744 144316 919466 351878 8810 95440 357406 514146 242408
14937 514696 238818 125613 369319 755567 539383 687240 982361 970248 848025 1281570
14927 1281570 1317385 1176362 1485425 1077933 978311 1347304 1196541 1047611 1532458 1960351
14917 1960351 1708248 1268292 976953 1261737 1075643 790374 715856 652577 794913 467690
14907 467690 254997 489947 404924 108760 528404 87606 152710 285796 234665 246498
14897 246498 372714 161973 347042 301674 368352 361402 378872 652761 330196 494141
14887 494141 464427 570586 606549 618839 537156 667969 279240 703407 693202 554068
14877 554068 353454 361593 608148 420466 354141 462732 457390 701825 505320 531215 718241
14866G18241J67723k10954k01400j09489N0952j1591Q4198l7617J2458B06709
14855B88949j6231J514r9687M51979B49402J96780k0196n454J03434j83763M07399
14844G47602J08104L5877M4745q8533N1125J96805k46117k13984k58910K82874
14834F59588j1353N4162k25014M6313k04742J04682j56258J19329J92515J18k56418
14823C22922n5825K45638J21261L42990l58530k5603J12620l40662A68120L30230
14813D98350j62950p3559J7332Q3512J41906B11495M99253l4386R9896j96j72191
14802F03871K05499C24343K65372k21179j49335N64830k16757q1410O1413B34887
14791C12445K89068J38677A82044j1680L07244P7276l4231o3087K47422j6193
$$ plain form
14866 718241 885964 675010 473610 364121 415073 403482 487680 450063 462521 206709
14855 288949 272718 274232 174545 626524 249402 446182 425986 420532 523966 340203 747602
14844 747602 855706 891583 936328 847795 898920 1095725 849608 635624 376714 659588
14834 659588 648235 702397 477383 523696 318954 423636 267378 386707 579222 579340 322922
14823 322922 267097 512735 633996 976986 618456 592853 705473 364811 168120 498350
14813 498350 335400 261841 279173 362685 504591 211495 710748 676362 776258 776062 603871
14802 603871 809370 324343 589715 368536 219201 784031 567274 485864 547277 234887
14791 312445 601513 740190 182044 170364 477608 554884 520653 457566 704988 688795
14781F88795J25836B76129O12578l60881J40848J49315j74676k07867M72567m25061
14771D82952J34271K09841l06336J06962B97587L21686j91891M8624l5601N8982
14761D99387M26794k87504k91324L20648j10048j58937r3838L72538m717B24438
14750H22499D02395j37871m6307J73765j31593J09789O21888k12288k25854K6212
14740E80136j82759P6826M00049l98595M89284k11525l077j39465L9367K33164
14730H83405Q3234n3899L69550k23103K51338N2669k86984K60007k92725l69876
14720F73616K02857J56089D76174J78292L3259m2321k08015O04308D92147k01487
14710B90660L50015K54671p4828j71078K59580k8899L63241j43139l5385M33486
$$ plain form
14781 688795 814631 276129 888707 527826 668674 817989 643313 435446 908013 482952
14771 482952 617223 827064 520728 627690 297587 619273 427382 476006 440405 499387
14761 499387 926181 638677 347353 668001 557953 399016 305178 677716 672999 224438
14750 822499 402395 264524 218217 391982 260389 370178 992066 779778 553924 580136
14740 580136 397377 474203 874252 475657 964941 753416 750339 610874 650241 883405
14730 883405 966639 912740 1282290 1059187 1310525 1363194 1076210 1336217 1043492 673616
14720 673616 876473 1032562 476174 654466 687725 645404 437389 1041697 492147 290660
14710 290660 640675 895346 820518 649440 909020 880121 1243362 1100223 1064838 1498324
14700A498324O9554O9758j78956k08856l11920J4614P7568k1244m0284j41174
14690H27384l5905j38585J56882j11982K75315j72210p5147j10887M61883l40888
14680G35860J20691l83820L43143J65207j57092p5604j91299L62714n3587l5838
14670H30375m5055j05575J27845k72414N76101j44209l53608J72888n1290k87582
14660D47476N49132k74157L92824l31967K8956K17319p0646J45909j43347K45476
14650A206975j73599P5715j36278j81560K80010k83756J11816m8257J13933Q1630
14640A046629j5475l48325L51286p1153r4526L61548j96552k87607j14084N06090
14630A137831j48346k36100O49027m37495L43498l17316L67191j96994k5375M1859
$$ plain form
14700 1498324 1567878 1637636 1458680 1249824 937904 952518 1030086 1008842 968558 827384
14690 827384 791479 652894 809776 697794 973109 800899 725752 614865 1076748 735860
14680 735860 856551 472731 815874 981081 823989 748385 557086 919800 866213 830375
14670 830375 785320 679745 807590 535176 1111277 967068 613460 786348 735058 447476
14660 447476 996608 722451 1115275 783308 812264 1029583 958937 1104846 961499 1206975
14650 1206975 1033376 1109091 972813 791253 1071263 787507 899323 851066 964999 1046629
14640 1046629 1031154 682829 1034115 962962 868436 1229984 1033432 745825 631741 1137831
14630 1137831 989485 753385 1402412 964917 1308415 991099 1358290 1161296 1135921 1177780
14620A177780J90197k09317J03925p0403J1810J01853j47267k74562L37882j2642
14610A209256m6026k5893L03552m88529O85754k80520j76862o5006L60420j03667
14600A372479k83091M72125l94791J92044n0582K14882J62090j15718k94373J33352
14590A408417K9976l28937J49474M91774l4904m01397J79143j4724J92602l52224
14580A319200J59641J40062O9024k06466L3572L07561r7668n232J81372j78948
14570A722118j5630J50502j71142P2096m5355P5302K66769j7569N1326j24372
14560A964045K96166k09856M52156k74265J36115O13748O1441L63649k16434N94114
14550C780879P37347J693154L729526P876582J7758883M436647A7758824G290291
$$ plain form
14620 1177780 1367977 1158660 1262585 1192182 1203992 1305845 1158578 884016 1221898 1209256
14610 1209256 1163230 1137337 1440889 952360 1638114 1357594 1180732 1115726 1476146 1372479
14600 1372479 1089388 1561513 1166722 1358766 1308184 1523066 1685156 1569438 1275065 1408417
14590 1408417 1438393 1109456 1258930 1750704 1715800 1314403 1493546 1478822 1671424 1319200
14580 1319200 1478841 1618903 1687927 1481461 1515033 1822594 1724926 1719694 1901066 1722118
14570 1722118 1706488 1856990 1685848 1757944 1712589 1787891 2054660 2037091 2088417 1964045
14560 1964045 2260211 2050355 2502511 2228246 2364361 2978109 3039550 3403199 3186765 3780879
14550 3780879 4518226 6211380 9940906 17817488 35576371 40013018 17758824 7290291
14541C815397p67946J98325P00710Q70219j943855r49416j96290k36238J25709
14532A616615R4720M3978Q4628n6909j42036J28683J52394M4140j44682O6506
14522A888037N7123J41890r025n0303j4540K835k93475J88154Q6340K46691J20011
14511B363738l207k28846o6012O91940k07434k38001N8370O2993k80171J29971
14501B283341M7279K39903j77574J79250j69896L73847k39289L83331l14997M5376
14491B650571J0375Q5313J90544j57976Q5470L58183j11280m58326L83247k34778
14481B801343J0230K80255J31737m7829M5831J55380l3705J58510k53854J29492
14471C377390R1538j55386J59083k49092O29278k4612L9778M8387n5649j7330
$$ plain form
14541 3815397 3047451 3245776 3946486 4816705 2872850 1923434 1727144 1490906 1616615
14532 1616615 1711335 1755313 1839941 1783032 1640996 1769679 1922073 1966213 1821531 1888037
14522 1888037 1945160 2087050 2078025 2027722 2013182 2016017 1722542 1910696 1997036 2243727 2363738
14511 2363738 2360531 2131685 2065673 2757613 2550179 2312178 2370548 2433541 2153370 2283341
14501 2283341 2330620 2570523 2392949 2572199 2402303 2776150 2536861 2920192 2605195 2650571
14491 2650571 2660946 2746259 2936803 2778827 2864297 3222480 3111200 2652874 3036121 2801343
14481 2801343 2811573 3091828 3223565 3175736 3221567 3376947 3343242 3501752 3247898 3377390
14471 3377390 3468928 3313542 3472625 3223533 3852811 3828199 3867977 3916364 3860715 3843385
14461C843385l4410n2654O0688L65776L2829L188o25732N85079J50093p357j08739
14450D212146J40620J46381j00070N59158l67028P2450n4431L46866j93647K41057
14440E003502j16466K29389j99971K65126P1586k5002K07743k27415N06800k62761
14430E452531K11213J76298Q0816J38763j18795j39199O88003M54781l59089M87850
14420G073172k63318k08500L25676K4192J92250l4336K06967k60853L10401K14061
14410G579712J01640K3298K9843K45790M94706l06226l7202L51029l2585L39204
14400H789209l4776K34561L23396O7131K9884j49171M90055O6140K56437K06425
14390A0279291n2946K08728K45636J63082K01090K67460J52172M20781L96924
$$ plain form
14461 3843385 3808975 3756321 3817009 4182785 4215614 4218802 3593070 4178149 4328242 4320885 4212146
14450 4212146 4352766 4499147 4399077 4958235 4591207 4663657 4609226 4956092 4762445 5003502
14440 5003502 4887036 5116425 4916454 5181580 5253166 5228164 5435907 5208492 5715292 5452531
14430 5452531 5663744 5840042 5920858 6059621 5940826 5801627 6489630 6944411 6585322 7073172
14420 7073172 6809854 6601354 6927030 6951222 7143472 7109136 7316103 7055250 7365651 7579712
14410 7579712 7681352 7704650 7734493 7980283 8474989 8168763 8131561 8482590 8450005 8789209
14400 8789209 8754433 8988994 9312390 9379521 9409405 9260234 9750289 9816429 10072866 10279291
14390 10279291 10226345 10435073 10680709 10843791 11044881 11312341 11464513 11885294 12282218
14381A2282218q2306J73165L05699J87254J14320L24321j92835O06646O49005
14372A4367487N3590J80966N56876K34946N41143j1229L55913M17543Q3632O96812
14362A7477679k28012N04101O30236M87027K53547l6304P33992O02915N07156
14353B0932337L39356M62300O38909L06308P58729L95659Q16363P57188M04994
14344B5812143N30593N37540J024484P08082P67797Q43256Q32231N58901J003159
14335C2618186J217896P71976J149265J043711J027980J301244J708618J248076
14327D2086952J548064J057101J236568J879981J492698K258986J779715J961936
14319E5302001J673350K303061K095593K497019K613942K296960K854851L045944
$$ plain form
14381 12282218 12199912 12373077 12678776 12866030 12980350 13304671 13111836 13718482 14367487
14372 14367487 14421077 14602043 15158919 15393865 15935008 15923779 16279692 16697235 16780867 17477679
14362 17477679 17249667 17753768 18384004 18871031 19124578 19088274 19822266 20425181 20932337
14353 20932337 21271693 21733993 22372902 22679210 23437939 23833598 24649961 25407149 25812143
14344 25812143 26342736 26880276 27904760 28612842 29380639 30223895 31056126 31615027 32618186
14335 32618186 33836082 34608058 35757323 36801034 37829014 39130258 40838876 42086952
14327 42086952 43635016 44692117 45928685 47808666 49301364 51560350 53340065 55302001
14319 55302001 56975351 59278412 61374005 63871024 66484966 68781926 71636777 74682721
14311G4682721K940484L331988L901348L625352L697663M142193M593727M485174
14303A05400650M991194N161860N849403N993158O989469O457659P523539P736308
14295A56103240Q454402Q858942R218797R944637J0642867J1224326J1984056
14288B26431267J2566150J3303419J3291330J4875188J4705805J5394901J5595081
14281C26163141J6015253J5918006J5782143J5118197J4871673J3531673J1881540
14274D29281626J0591130O229625J251320J394281J067782m39854l790047n648283
14266D39937580o449190q878095j1194908j3070372j3672357j5812666j6220207
14259C54639785j6468778j6782016j5902422j5629069j5401770j4517770j3803845
$$ plain form
14311 74682721 77623205 80955193 84856541 88481893 92179556 96321749 100915476 105400650
14303 105400650 110391844 115553704 121403107 127396265 134385734 140843393 148366932 156103240
14295 156103240 164557642 173416584 182635381 192580018 203222885 214447211 226431267
14288 226431267 238997417 252300836 265592166 280467354 295173159 310568060 326163141
14281 326163141 342178394 358096400 373878543 388996740 403868413 417400086 429281626
14274 429281626 439872756 446102381 447353701 448747982 449815764 449375910 445585863 439937580
14266 439937580 433488390 424610295 413415387 400345015 386672658 370859992 354639785
14259 354639785 338171007 321388991 305486569 289857500 274455730 259937960 246134115
14252B46134115j3309309j2889463j1863204r569502j0312115j0250596r192350
14245A68747576q737332p830527p503930p484451o735624o250552n966928n307805
14237A12930427m717240n135156m648768m606287l847355l750343l206737l418568
14229G9599973l152333l451588k657093k595239k672837k471689k098607k260028
14221E8240559k069410j742233j876925j854918j692691j638588j574991j116128
14213D4674675j153310j484781j588667j232502j026269j120071o71195m90103
14205C5907777j943411j103512q46174n65711o94176p84970p43403p60667q56828
14196B7608925q76553l85611j165912k39020r62658l91422o40384m22951q88677
$$ plain form
14252 246134115 232824806 219935343 208072139 198502637 188190522 177939926 168747576
14245 168747576 160010244 152179717 144675787 137191336 130455712 124205160 118238232 112930427
14237 112930427 108213187 103078031 98429263 93822976 89975621 86225278 83018541 79599973
14229 79599973 76447640 72996052 70338959 67743720 65070883 62599194 60500587 58240559
14221 58240559 56171149 54428916 52551991 50697073 49004382 47365794 45790803 44674675
14213 44674675 43521365 42036584 40447917 39215415 38189146 37069075 36397880 35907777
14205 35907777 33964366 32860854 32014680 31448969 30754793 29969823 29226420 28465753 27608925
14196 27608925 26732372 26346761 25180849 24941829 23979171 23587749 22947365 22524414 21635737
14187B1635737n10184l70463l06446p32363m99492j37351k74476q92183J6128
14178A7928907n96057m15064k23953k81890m67890m81600l27089k79316J13047
14169A4969095n55334l29048l21273k54807K5825o58123j91834J61982l74962
14160A2471521k71768j71918l58214k02716k08667l74537J77026l13940k2623
14151A0724164l78994J38952j30842m02760k92196O9342k74033K2225j21604R8915
14141I453169k65505n20762K33901n31359L63712p45479q8150K65587l639l58412
14131G803063P3829l70505O9255j17236j74760N5461J0692j23612q8400k79317
14121F858470n2031j98956j68580k16474O7362J6447k84717J90333j60767o0796
$$ plain form
14187 21635737 21125553 20755090 20448644 19716281 19216789 19079438 18804962 17912779 17928907
14178 17928907 17332850 16917786 16693833 16411943 15944053 15462453 15135364 14856048 14969095
14169 14969095 14413761 14084713 13763440 13508633 13534458 12876335 12684501 12846483 12471521
14160 12471521 12199753 12027835 11669621 11466905 11258238 10883701 11060727 10746787 10724164
14151 10724164 10345170 10484122 10353280 9950520 9658324 9727666 9453633 9475858 9354254 9453169
14141 9453169 9187664 8666902 8900803 8369444 8733156 7987677 7899527 8165114 8161475 7803063
14131 7803063 7876892 7506387 7575642 7458406 7283646 7339107 7349799 7226187 7137787 6858470
14121 6858470 6806439 6607483 6438903 6222429 6289791 6306238 6021521 6211854 6051087 5990291
14111E990291M5763K31562l59029m93701K77670k03098L28280k83048K82005m83343
14101E333352j95330l32260P4615o6370M19878j52726k50985j07681J14727j28269
14091D708951K98720m17864m0215l32445L06969J39211l24134K6565K2556m2501
14081D345813K06100o55822N3283J82325k66302l4727j08337K19714p6060j59499
14071C706488M5292k06009J74479J1353N8591k26182J07265J80219k41844L12571
14061C922223l52626l8191M0413J00587l79243j76405K15492K25425m45345Q0547
14051C192877r7477R8080j33154l48157K73398K19291k77665N5921k97419K944
14041B688639K3747R8173k01269k7190K27992n6788l7778q3710K35230l08675
$$ plain form
14111 5990291 6036054 6267616 5908587 5414886 5692556 5489458 5817738 5534690 5816695 5333352
14101 5333352 5138022 4805762 4880377 4814007 5233885 5081159 4830174 4722493 4837220 4708951
14091 4708951 5007671 4589807 4549592 4217147 4524116 4663327 4339193 4365758 4388314 4345813
14081 4345813 4551913 3896091 3949374 4131699 3865397 3830670 3722333 3942047 3865987 3706488
14071 3706488 3751780 3545771 3720250 3731603 3790194 3564012 3671277 3851496 3609652 3922223
14061 3922223 3569597 3531406 3571819 3672406 3293163 3116758 3332250 3557675 3112330 3192877
14051 3192877 3095400 3193480 3060326 2712169 2985567 3204858 2927193 2983114 2685695 2688639
14041 2688639 2712386 2810559 2609290 2582100 2810092 2753304 2715526 2631816 2867046 2558371
14031B558371n1262L02941p3925m65411L72167M4665l35834k62185M90421k40377
14021B339571j79670L01842p607k91608K07594k22471K50116l63124L49860j67606
14011B216897K52149j58538j78120J41355k4661k17039j13495L00773n6537l00394
14001A862390K27141Q294k17868L9022j71089J47933K5290L8720j68836L3310
13991A824307N9851L07545J140496K387583N129608J5293841J7664650j7659605
13983B6148276j2876781n695743k292177r57989r91683J403o09669M6260J6523
13974B788420l91444r0468R4312j02849q0376j35366l4013k42766m1019L13244
13964B077675j9625k72415J74866j73426n2782K30463j98869K52381j71609l56777
$$ plain form
14031 2558371 2507109 2810050 2736125 2270714 2642881 2687546 2351712 2089527 2579948 2339571
14021 2339571 2159901 2461743 2454136 2162528 2370122 2147651 2397767 2034643 2384503 2216897
14011 2216897 2469046 2310508 2132388 2273743 2249082 2032043 1918548 2219321 2162784 1862390
14001 1862390 2089531 2097825 1879957 1918979 1747890 1895823 1921113 1959833 1790997 1824307
13991 1824307 1884158 2191703 3332199 5719782 10849390 26143231 43807881 26148276
13983 26148276 13271495 7575752 5283575 4325586 3333903 3335306 2725637 2771897 2788420
13974 2788420 2396976 2306508 2400820 2297971 2217595 2082229 2048216 1805450 1764431 2077675
13964 2077675 2058050 1785635 1960501 1787075 1734293 1964756 1765887 2018268 1846659 1489882
13954A489882q0427K27303N8451k44759J20493O5731k57807L22931o5843k60827
13944A375128L73743p1762k73933k5135P0904J71289k58505K16715j08575j44890
13934A324979j39083M46004k91280M1569o6705j944K02741j37982j6647O3971
13924A425623j00430j44881M09619l75345k7280N7698L944P1018K42400k46409
13914A315957j13065J11356L04402m83279J20199j58536p4955L17313j33860k04255
13904A001277l714l9955L98270k22234J01657k39994J62277n536k6096J26163
13894A252115j91593K04665p3450m02400M20323j7918q7352k16985K16339k3264
13884A080480m3203L01594n35261O22037m74213j16456L01309l12955J08280l86439
$$ plain form
13954 1489882 1409455 1636758 1695209 1450450 1570943 1636674 1378867 1701798 1635955 1375128
13944 1375128 1748871 1677109 1403176 1378041 1448945 1620234 1361729 1578444 1469869 1324979
13934 1324979 1185896 1631900 1340620 1382189 1315484 1313540 1516281 1378299 1361652 1425623
13924 1425623 1325193 1180312 1589931 1214586 1187306 1245004 1248948 1319966 1562366 1315957
13914 1315957 1202892 1314248 1618650 1135371 1255570 1097034 1022079 1339392 1205532 1001277
13904 1001277 997563 957608 1355878 1133644 1235301 995307 1157584 1152048 1125952 1252115
13894 1252115 1060522 1265187 1191737 789337 1209660 1191742 1104390 887405 1103744 1080480
13884 1080480 1037277 1338871 803610 1425647 951434 834978 1136287 823332 931612 545173
13874E45173P55273o27633J31219M33578k79399P500j47346K02270j15170K05538
13864A111003j41663M6600j61189P7126k6292k65500J52929j81529M17186L3376
13854A062047l61072K30730n4569j1965o8512k26882K32524J53979j07384J59584
13844A008480r8797R2886l01116L10911j7866k64452M1637J30327J22878l12619
13834G12269p7192M0828J78044J09084K02519l00634l1498j02427L25524j64008
13824H92509m9961j79918L20108j39004L3773j09402L42380m80579m9022J69818
13814G50702m9844k8098Q5665K13443k47281j75293J22911J49043k41874O6068
13804F45442J09529j59502K60365q0513j42825j3127J83408j11372J79588j81395
$$ plain form
13874 545173 1300446 672813 804032 1237610 958211 965711 818365 1020635 905465 1111003
13864 1111003 969340 1015940 854751 931877 905585 640085 793014 611485 1028671 1062047
13854 1062047 700975 931705 877136 865171 796659 569777 802301 956280 848896 1008480
13844 1008480 909683 1002569 701453 1012364 994498 730046 771683 902010 1024888 712269
13834 712269 635077 675905 853949 963033 1165552 864918 833420 730993 1056517 892509
13824 892509 842548 662630 982738 843734 877507 768105 1110485 629906 580884 750702
13814 750702 700858 672760 758425 971868 724587 549294 672205 821248 579374 645442
13804 645442 754971 595469 855834 775321 632496 619369 802777 691405 870993 689598
13794F89598R7108k41436r526j05753j46180L75476J01605J50497D52066L98557
13784H50623j9654C90873O3985J84897j71381K09650k20756K87115k02552J36143
13774F77974j9556j95713K92917k57870J68680l21999M8531J78656m0863J04784
13764F35541k08794J3370J54905m600j15109J91297j75812L46085C20988J64439
13754D85427p9078O7778j12544j9815N1134K52726r637j62645J64690A82256M08737
13743E90993K77945k59560k00503A54452P63759D17729J34234j109k0248q6022
13733D44584j6475q55j52434J97324m5827N3705P9371j941k08690J26870N6366
13722E31998P6643k57937J15564j95709K39351J17641K3633B60087L78418k49648
$$ plain form
13794 689598 786706 545270 535744 429991 283811 659287 760892 911389 452066 850623
13784 850623 830969 390873 454858 639755 468374 678024 457268 744383 541831 677974
13774 677974 658418 462705 755622 497752 666432 344433 392964 571620 530757 635541
13764 635541 426747 440117 595022 590422 475313 666610 490798 836883 320988 485427
13754 485427 406349 474127 361583 341768 392902 645628 635991 473346 638036 182256 590993
13743 590993 868938 609378 408875 154452 918211 417729 551963 550854 530606 444584
13733 444584 428109 427254 274820 472144 426317 480022 559393 557452 348762 475632 531998
13722 531998 608641 350704 466268 270559 509910 627551 651184 260087 638505 388857
13712C88857Q7375Q7910B18507K54284J37154B88342J02962k8535Q2387m4884
13702D00272J75298o8558J77747l21408N43F7583J14698L28748M36920l91356
13692E56593k06739J792P5590r3894J23147M2534Q7133J22571B98402M01791o0938
13681F39255B12524L33377k26645J92066I3521M1845K40221j54511Q5277J46939
13671D53292J29402k56658o9511p6903L28221k436j20079L017P2032o1750j58783
13660B39844J06193J9421O9936P4034j33717m7464j23006L85198j48690J39975
13650E81724j37110j96334N44699j66685j18197A99502f6018D98566j50180A16934
13639D82359j30033J93257B35420L9841J42940l5589j45139N8540N3426M9688
$$ plain form
13712 388857 476232 564142 218507 472791 609945 288342 391304 362769 445156 400272
13702 400272 575570 507012 684759 363351 363894 67583 182281 511029 947949 556593
13692 556593 349854 351646 427236 333342 456489 499023 586156 708727 298402 700193 639255
13681 639255 212524 545901 319256 511322 93521 135366 375587 221076 306353 453292
13671 453292 582694 326036 256525 179622 507843 505407 385328 388345 460377 398627 239844
13660 239844 346037 365458 435394 509428 375711 328247 205241 590439 441749 581724
13650 581724 444614 248280 792979 626294 508097 199502 -66018 498566 348386 116934
13639 482359 352326 545583 235420 275261 418201 382612 237473 296013 349439 399127
13629C99127C6348N29858k30847O8067j97148j9168L4745J77145L06726A32448
13618F38627A69499J99344j28357D6499K51901a70006E60390l8499A44987L87166
13608E32153A35695J85852R0853A09582J90736q8577l2416K01578F2812L06374
13598C69186K4569J11661k52487J86213Q5930j89357P6451J8252P7823A16349
13587D80627Q4150A4981L74981C2266K59391J59644J9O4412o7671I4783K88448
13576C83231r1968O0048P3458j637B06943K64967q0286r0132J90426I4719K54533
13565C49252P9206j31130P402l9428j3286k5797K63370j32784R4023A71892J58380
13554C30272A54832R2532N6174j10251K95999B04221N6006m9365J98883j99547
$$ plain form
13629 399127 36348 566206 335359 403426 206278 187110 221855 399000 705726 132448
13618 638627 169499 368843 240486 46499 298400 -170006 560390 521891 144987 532153
13608 532153 135695 321547 412400 109582 300318 211741 179325 380903 62812 369186
13598 369186 393755 505416 252929 439142 525072 335715 412166 430418 508241 116349
13587 480627 564777 14981 389962 32266 291657 451301 451320 515732 448061 94783 383231
13576 383231 291263 351311 424769 423132 206943 471910 391624 301492 491918 94719 349252
13565 349252 428458 297328 304730 265302 252016 226219 489589 356805 450828 171892 330272
13554 330272 154832 247364 303538 193287 489286 204221 260227 210862 409745 210198
13544B10198c9787j90434A38117P3509r9255Q4093P6133I7875A2754K31489K69208
13533E13451j92410R8857N0940B20160r0834n9742J50033L17311A81043d70C0643
13521D59923k22931j4153p7845j7011n1742Q5096N0233K5112j03783R5050C0253
13509D02974k01233K4069r3755d4621B69193A19591L10609c0178G5154K80835
13499C55989N5710A96479j6660C4873M18874A96462j4075K2155J10405A05937
13488C5137Q9384j5575M6783K05690J23681A03887J35305K53440e4173D220J69335
13477A73555P6996b3298A00954K08526A18234J23572Q5268A19376K89825L6455
13467D45656a118B1876C426M08065D6942R4207J28949f5681I4800c0484G7189
$$ plain form
13544 210198 -39787 -230221 138117 211626 112371 196464 272597 97875 12754 244243 513451
13533 513451 321041 419898 470838 220160 129326 69584 219617 536928 181043 -470 30643
13521 459923 236992 222839 144994 127983 76241 161337 211570 236682 132899 227949 30253
13509 402974 201741 225810 132055 -44621 269193 119591 430200 -30178 75154 355989
13499 355989 411699 196479 179819 34873 453747 196462 182387 204542 314947 105937
13488 35137 124521 108946 155729 361419 485100 103887 239192 492632 -54173 4220 173555
13477 173555 250551 -23298 100954 309480 118234 241806 327074 119376 409201 445656
13467 445656 -1118 21876 3426 411491 46942 141149 270098 -65681 94800 -30484 77189
13455b21613g2398H7220J31868A7607K90387A06750K50840j00315m6253l3293
13445A77729J15305O541r259J34412H0545J94298K82517k61034J09758D9337K0883
13434G0220J56237m8085j9693J7357L08692A25947K41343j15336E9587b7228B80935
13422C37716q1768K41917D488P3682J14340J5887f9194B65081b2214C54029c0571
13410E7359K25487c6757A68899b5908A12618b4674k43483A66174Q2972G0333K44448
13399C14781A7526J7134K33580F5827b84282B55101n0955d3726A87197o2781A4225
13387A37141N1825a74981h238b349A40801L11568j91051B2979b28209a12081C59530
13375A62761n4491A4838i6495E90048B37985q0784J22277o1893K77539j74064
$$ plain form
13455 -221613 -72398 87220 219088 17607 307994 106750 357590 257275 211022 177729
13445 177729 293034 299575 290316 424728 80545 274843 557360 296326 406084 49337 70220
13434 70220 226457 178372 158679 176036 484728 125947 367290 251954 59587 -27228 280935
13422 337716 255948 497865 4488 78170 192510 208397 -69194 265081 -22214 354029 -30571
13410 57359 282846 -36757 168899 -25908 112618 -24674 -268157 166174 249146 70333 314781
13399 314781 17526 34660 268240 65827 -284282 255101 204146 -43726 187197 124416 14225
13387 137141 188966 -174981 -8238 -2349 140801 452369 261318 22979 -228209 -112081 359530
13375 162761 108270 14838 -96495 590048 237985 157201 279478 217585 495124 321060
13365C21060K8592A45421K13320j40380j05061R1508J18488j06469E2705L64944
13355D17649H4534K9128K80014A82997J75300j52875L7426A20982f8663B46399
13344B60071J72910G691L79499M4564j6639j38543I7471K55532j14767J08842
13334C47078j06310h9646A73581K24956A71142O9391D4335N19972D9046B2797
13323A98425c24839B02735O004a8011C1074L03595o5562h6461E6788K41517m0569
13312B57736B1951a43568E4282K56637E8035K2904a95629C34217A6860K29241
13302B46101j8175N9045j4854n3923j03266a45600C42648F2805c5363A25860k0835
13291A05025h843A08816R9782C5710K29334d4878A95831K87260h6911b1277D7481
$$ plain form
13365 321060 349652 145421 358741 218361 113300 204808 323296 216827 52705 417649
13355 417649 84534 113662 393676 182997 358297 205422 242848 120982 -68663 246399
13344 260071 432981 7691 387190 431754 415115 276572 97471 353003 238236 347078
13334 347078 240768 -89646 173581 398537 171142 240533 44335 564307 49046 22797
13323 198425 -324839 202735 208739 -18011 31074 334669 269107 -86461 56788 298305 257736
13312 257736 21951 -143568 54282 310919 58035 80939 -195629 334217 16860 246101
13302 246101 227926 286971 272117 218194 114928 -145600 342648 62805 -35363 125860 105025
13291 105025 -8843 108816 208598 35710 265044 -44878 195831 483091 -86911 -21277 47481
13279D796Q2665M1418D3874K87875A37461j5720J0902L41322a43169C6271K51545
13268B87816F2104J55614A05912b59743f9891K4924n7925B41243f8979k21098
13258b90077C37972b19507b1604A41271J8020J37915k8328Q9769A14563M59479
13248E74042B49722h0994G0889b40471h5144B54633m2918E3171J7276K01223l9860
13237B31810I7878J77662j0851L06800B24624a06022A22061H684L7399J25933
13227A72016J03616c5331B01116b54714I7772L55615j87378j5916F1127Q6242
13217A47369O1435a68374K4858B69772D9618b0689G5825K07756b6714A81924n7814
13206A24110R6191a32283A67683i084q725q1081C8011a03652m9303E11274A48571
$$ plain form
13279 4796 87461 128879 43874 331749 137461 121741 132643 473965 -143169 36271 287816
13268 287816 62104 217718 105912 -259743 -69891 -44967 -102892 241243 -68979 -290077
13258 -290077 337972 -219507 -21604 141271 159291 297206 268878 358647 114563 574042
13248 574042 249722 -80994 70889 -240471 -85144 254633 211715 53171 70447 271670 231810
13237 231810 97878 275540 264689 571489 224624 -106022 122061 8684 46083 172016
13227 172016 275632 -35331 201116 -254714 97772 453387 266009 250093 61127 147369
13217 147369 208804 -168374 -143516 269772 49618 -20689 75825 283581 -26714 181924 124110
13206 124110 220301 -132283 167683 -9084 -17809 -98890 38011 -103652 -152955 511274 148571
13194d22029f1062A92702J56933A55270J28529a33545A02412d9564D7152a8300
13183a23436C3217J12398a85705G1042e014A45886O8010G6961J86751K541p952
13172B58301F1772M4955K88062A67056A7170a47496c2994F7321k2752j7810K5084
13161E1843J48923c07016B58959C1792l136J68802o0700P345b00304O1771A16355
13149a42655D9783Q2334g4510k60958A54614O0726G0082a81530F0620J19511b38211
13137B60049a08955B17359o7340m6438B7463a55701R390d5665j80536R3668G9723
13125b0566A17436J17686L6021b09100c1532l2398B11991g5872B02692a00108
13114D2811K05749j22068A1776J02651n1381B0654K5495J72787C0980O9162a39824
$$ plain form
13194 -422029 -61062 192702 349635 155270 283799 -133545 102412 -49564 47152 -18300
13183 -123436 33217 145615 -185705 71042 -5014 145886 213896 76961 263712 266253 258301
13172 258301 61772 106727 394789 167056 17170 -147496 -32994 67321 44569 26759 51843
13161 51843 200766 -307016 258959 31792 28656 197458 136758 144103 -200304 -138533 116355
13149 -142655 49783 132117 -74510 -335468 154614 215340 70082 -181530 60620 180131 -238211
13137 260049 -108955 217359 150019 103581 27463 -155701 -146311 -45665 -226201 -132533 79723
13125 -20566 117436 235122 271143 -209100 -31532 -63930 211991 -75872 202692 -100108
13114 42811 248560 126492 11776 114427 63046 20654 46149 218936 30980 100142 -139824
13102a02037A66322N252k5282a60226D83814F9520a65652J679B47071I6332O0440
13091A56772d1829C24867A33795i73j9835G5878h0596A39656B4158K62141q3570
13080B02729a03861A95553h3435i09p8639G6440a19033B4425a0203d926l10902
13069c15828B4252M92521H562M1419j9145M0971b4971B16693a52188M9174A64592
13057B74333d0711B1091P7756E413j32b6934j44857A51945f6535K8222A41147
13045a9669A46758a44058A85069B5878a55494f2815b8642E1685L04963j67356
13035A89292a87931b8067A82538L317B5822b62734g097A40436i4946D7033f9613
13023h4612A78885F9758a16992E2309b00954J7408B78368j02568b67125c032j49868
$$ plain form
13102 -102037 166322 171574 146292 -160226 483814 69520 -165652 -163973 247071 96332 156772
13091 156772 -41829 324867 133795 -973 -20808 75878 -80596 139656 24158 286299 202729
13080 202729 -103861 195553 -83435 -909 -79548 76440 -119033 24425 -10203 -4926 -315828
13069 -315828 24252 516773 8562 49981 30836 71807 -24971 216693 -152188 -103014 164592
13057 274333 -40711 21091 98847 5413 5281 -26934 -171791 151945 -66535 -38313 141147
13045 -19669 146758 -144058 185069 25878 -155494 -62815 -28642 51685 356648 189292
13035 189292 -187931 -28067 182538 185855 25822 -262734 -7097 140436 -94946 47033 -69613
13023 -84612 178885 69758 -116992 52309 -200954 -183546 278368 175800 -267125 -3032 -152900
13012a52900I8150J22756b89914D1811a89287B56738a70730A03010K80841a01885
13001A02791a14767O239I4789a94584C8707J54335d3474E45a0795k1626C8045
12989C48189F3480K67576A09370b34023E8894K15375F2119K34503r7147e4246
12978B65709h6931K3723B14477o0909b76347D46J98236E5720k1546c0563q7003
12967a17566c2318C04842D2913a14655r3401j56611J08757b6715j6809C04301
12956B7758j965M0245g1133B87700a47626A40643m1301a41508n716k16511A23786
12944I7649l1805N2746d009A96730r5102d45985a47043k35819B34862j6865a2924
12932D27828A68067l2962P9869E8971J63739b15162a9457j1944m2799C83005b42865
$$ plain form
13012 -152900 98150 220906 -289914 41811 -189287 256738 -170730 103010 383851 -101885
13001 102791 -114767 -108528 94789 -194584 38707 193042 -43474 545 -10795 -32421 38045
12989 348189 63480 331056 109370 -234023 58894 274269 62119 296622 199475 -54246
12978 265709 -86931 -63208 214477 153568 -276347 446 198682 55720 34174 -30563 -117566
12967 -117566 -32318 304842 42913 -114655 -208056 -364667 -255910 -26715 -43524 304301
12956 27758 25793 66038 -71133 287700 -147626 140643 99342 -141508 -147224 -363735 123786
12944 97649 65844 118590 -4009 196730 101628 -445985 -147043 -382862 234862 217997 -12924
12932 427828 168067 135105 214974 58971 222710 -215162 -19457 -31401 -74200 383005 -242865
12920a85688B40808a7658C18472d50294B05934D5749j7813a13440G9981R10R6014
12909A76905m8549b02415C58791a72443E8g1515J1243B05091A1247P0681e4139
12897C1025d0282l52152h6783A97402n0175F4905R0837a15263E360J08937d2310
12885h0685A2673b03520A78583R3821G5053J30656k3737C5502b75792a34637e405
12873a65433A85906m2465d711q9672B9750J01175a57300j26586N9264A71031c4589
12861a76125B60416b7301B45952A07615f736A07516a02384q2093c0345B6400b54207
12849C1976J47926a63805F3143b25396A89298a91690F3267J61519a3482k31797
12839b45279f2366A17571e7131B33114b13975d6449D03784b70024c0671j9941
$$ plain form
12920 -185688 240808 -17658 318472 -450294 205934 45749 27936 -113440 79981 80891 176905
12909 176905 128356 -202415 358791 -172443 58 -71515 -60272 205091 11247 81928 -54139
12897 31025 -40282 -392434 -86783 197402 147227 64905 155742 -115263 5360 114297 -42310
12885 -80685 12673 -203520 178583 272404 75053 205709 181972 35502 -275792 -134637 -5405
12873 -165433 185906 143441 -4711 -94383 29750 130925 -157300 -283886 -224622 171031 -34589
12861 -176125 260416 -27301 245952 107615 -6736 107516 -102384 -184477 -30345 26400 -254207
12849 31976 179902 -163805 63143 -225396 189298 -191690 63267 224786 -13482 -245279
12839 -245279 -62366 117571 -57131 233114 -213975 -46449 403784 -270024 -30671 -50612
12829e0612E0096L512g7056G7368a5533A47969C5660a92129A39903a29754A61626
12817c70194A25912m5066f3311A03927b40266r0895c5959k48831A53184d1420
12806G3454J03671J01996r9486a26935A76354a73223A0768J06300L9434a78815
12795b61692F3376C221h6672k30039a21712b7873l0491H9022O2801b16636d4891
12783A79954B5199J42812o7591e4741A20885k0131a09801A73866o7b4296A44739
12771c43483A57163a32332a1905j71171D7305f8930m2779B22217a6899k3706A97986
12759B01783h4985l6756J2250A81947a56435b904o9823A63727b64807E38126h2329
12747A35291f0650r9268l6175g8970c1805B22176H9207K9154N3963C653J38310
$$ plain form
12829 -50612 50096 53608 -77056 77368 -15533 147969 35660 -192129 139903 -129754 161626
12817 -370194 125912 80846 -63311 103927 -240266 -331161 -35959 -284790 153184 -41420
12806 73454 177125 279121 179635 -126935 176354 -173223 10768 117068 156502 -178815
12795 -261692 63376 3221 -86672 -316711 -121712 -27873 -58364 89022 151823 -216636 -44891
12783 179954 25199 168011 100420 -54741 120885 100754 -109801 173866 173799 -24296 144739
12771 -343483 157163 -132332 -11905 -183076 47305 -68930 -111709 222217 -16899 -40605 197986
12759 201783 -84985 -121741 -109491 181947 -156435 -2904 -72727 163727 -264807 538126 -82329
12747 135291 -60650 -159918 -196093 -78970 -31805 222176 89207 118361 172324 3653 141963
12736A41963A3894b97385G1305j0931b46301A83473d6463k48j17435j25007a2129
12724a5414A9715a67647P4478A07572a80939j198O6322A67572a73033A10674J7328
12713A28002K28415a72021H3204K25893a188C0545J81870L4092L332j2621m2984
12702A94234a360j00434g89k76571B33527A6513M8596k2394e2380A16247K5178
12691A41425a75048A38284A380K03560i9998C64070a2016j07080I8945K63216
12681C62161D6546M7182K34081C404a09341C4458J38420G0499J64665J9419C7946
12669A24991J58081D9983e9490l3011I6020Q7221H099b36532J8211M1634J645
12658a75042q6901D184K70993D9702i4811B86946c73237H296J24204k943l8970
$$ plain form
12736 141963 13894 -297385 71305 60374 -246301 183473 -46463 -46711 -164146 -289153 -12129
12724 -15414 19715 -167647 -93169 107572 -180939 -182137 -115815 167572 -173033 110674 128002
12713 128002 356417 -172021 83204 309097 -1188 30545 212415 246507 249839 237218 194234
12702 194234 -1360 -101794 -789 -277360 233527 16513 65109 42715 -52380 116247 141425
12691 141425 -175048 138284 1380 204940 -99998 364070 -12016 -119096 98945 362161
12681 362161 46546 93728 327809 3404 -109341 34458 172878 70499 235164 254583 37946
12669 124991 283072 49983 -59490 -92501 96020 183241 8099 -236532 -218321 -176687 -175042
12658 -175042 -261943 4184 275177 49702 -94811 286946 -373237 8296 132500 129557 90587
12647I0587O0173J14420i4504l48512B58358i5773k2923G3226g795B8885L1050
12636E9935K7810i4888F1425j37p475c7968B62014H5355a14270j6667B68704K2677
12624B91381b55688K7193G1943b69890A32844J14374a21897n1751B63469a62867
12613A11358A6335f7615J6408j19I6284m1467i913j7179j34707G9752a75354D98157
12600c8106A81913J0571p6285b09318e2469a2869A68380b66479g6357A82045C4415
12588b52073B82794j34968e6962B0019a93278j32750f0847M182m06120b1701M41
12577b1260B0052h985j62044B5172J06033a31263j38766M4178G1113b36581A73608
12565b24895j5562J04529e1647K3945A42968e6077D1294j7063a08654B5191c715
$$ plain form
12647 90587 150760 265180 -94504 -443016 258358 -95773 -118696 73226 -7795 28885 59935
12636 59935 87745 -94888 61425 61288 53813 -37968 262014 85355 -114270 -130937 268704 291381
12624 291381 -255688 -228495 71943 -269890 132844 247218 -121897 -173648 263469 -162867
12613 111358 16335 -67615 -51207 -51326 96284 54817 -9913 -27092 -161799 79752 -175354 498157
12600 -38106 181913 192484 116199 -209318 -52469 -12869 168380 -266479 -76357 182045 34415
12588 -252073 282794 147826 -56962 20019 -193278 -326028 -60847 -56665 -462785 -21701 -21260
12577 -21260 20052 -8985 -171029 25172 131205 -131263 -270029 -225851 71113 -236581 173608
12565 -224895 -240457 -135928 -51647 -27702 142968 -56077 41294 24231 -108654 25191 -3715
12553B38356a62039A44266a55917P3192d1103A51728i8069j13740A0917c0654
12542H2693A8971a23202e5147C2766b55605N460C4904J64706a7858F6447J30135
12531A96582E6377a14318p9939K1127A34374b37089B6795f2566A37669J40945
12521B78614j38560D5937A7923e014o5150A37049E3026b7164B13381G5208c69558
12509B07017b2917A67970O9699F1960k6896K23538a01403c5943G1554L9226c7219
12497b8869C45a34852j5184c6337A75568k7345l4988K31156q3830I8727m0544
12486E8183B496a36902B27606P6721j24531C4978J18378R3859a0829l22919G8825
12474b24533f9158k12273A4931c3683K809B69032A2584e9894A74236b48507A71495
$$ plain form
12553 238356 -162039 144266 -155917 -82725 -41103 151728 -98069 -211809 10917 -30654
12542 82693 18971 -123202 -55147 32766 -255605 -250145 34904 199610 -17858 66447 196582
12531 196582 56377 -114318 -194257 -173130 134374 -237089 26795 -62566 137669 278614
12521 278614 140054 45937 17923 -5014 -70164 137049 53026 -27164 213381 75208 -369558
12509 207017 -22917 167970 237669 61960 35064 258602 -101403 -35943 71554 110780 -37219
12497 -28869 345 -134852 -150036 -36337 175568 148223 113235 344391 260561 98727 58183
12486 58183 2496 -136902 227606 304327 179796 34978 153356 247215 -10829 -333748 78825
12474 -224533 -69158 -281431 14931 -33683 -30874 269032 12584 -59894 174236 -248507 171495
12462a70846A39885J6193j5332e5593p258A19436i8749l52453B88294H6295e0014
12450B05352r3830j0881i0888A68615J03442h5465I3783a74902I0863e2450A73896
12438f0926k00467e5015n463m7196K3447C8514i6744L4630A07054b29805A86949
12426A01146C0167b51148Q1803o6542Q1552Q659K6018I0992D373L2887a8350I3491
12413B12824C2869g2644j12692k55136b07665B0067b71334J14559e5057C72264
12402A4236K22584e6080C5923j3649K51146f5854i487B3070l468d8228A7675B814
12389A17386a71079A24666c0393F8481J43531J19331j43055F5349J75292E1631
12378G4350a9501k5546C61392c947j6109A55827G6860b10892C1683e038G3877
$$ plain form
12462 -170846 139885 156078 140746 -55593 -62851 119436 -98749 -451202 288294 86295 -50014
12450 205352 111522 100641 -90888 168615 272057 -85465 93783 -174902 90863 -52450 173896
12438 -60926 -261393 -55015 -60478 -107674 -84227 38514 -96744 -62114 107054 -229805 186949
12426 101146 30167 -251148 -169345 -235887 -154335 -145676 -119658 90992 4373 37260 -18350 93491
12413 212824 32869 -72644 -185336 -440472 -207665 20067 -271334 -156775 -55057 372264
12402 14236 236820 -56080 35923 22274 273420 -65854 -9487 23070 19602 -48228 17675 2814
12389 117386 -171079 124666 -30393 68481 212012 331343 188288 65349 240641 51631
12378 74350 -19501 -45047 361392 -3947 -20056 155827 76860 -210892 31683 -5038 73877
12366c7554A01525Q9223a90489q1714a1429k1377k63558E6260L6989c85645A632
12354a56081A85297H8841J23991a65136d6160C56169n3717g231j5229j45908H3269
12342c73199f8497A20789Q7950A02293F932Q7255Q9286c64243a72763A07892a22493
12330A97332B7530K55522J2735a09292A75973H6317K25620D1492b8518B14029
12319a44078L3309H5094J52232a3242A16549P1706D2466J80140q3090J59166R9798
12308C98480f5160r6572B64296h283j99739B4338L18220j64024K47528A46412
12297E4287Q3684J6362d0961B57970B1273L128J8060P278J9990a39749e737A90310
12284A36188D8040c5641o114B83584r3315N734a32320L9431B13791a21933a3976
$$ plain form
12366 -37554 101525 190748 -190489 -272203 -11429 -32806 -296364 56260 93249 -385645 1632
12354 -156081 185297 88841 212832 -165136 -46160 356169 302452 -7231 -22460 -168368 83269
12342 -373199 -68497 120789 208739 102293 6932 94187 183473 -364243 -172763 107892 -122493
12330 197332 27530 283052 295787 -109292 175973 86317 311937 41492 -28518 214029
12319 -144078 -110769 85094 237326 -13242 116549 188255 42466 222606 139516 298682 398480
12308 398480 -65160 -161732 264296 -8283 -208022 24338 342558 178534 426062 146412
12297 54287 137971 154333 -40961 257970 21273 24401 42461 49739 69729 -139749 -5737 190310
12284 136188 48040 -35641 -41755 283584 190269 196003 -132320 -92889 213791 -121933 -13976
12272c6463C7756a50985O4995A72976m6735o1821L2058g4402C12057q2046e183
12260b19918B04047I0860d5866b0356g978B260L34203a55591d664H2831e5958
12248A99773b57556O4199F2108d9456G8265L49491a9155j3325n0273D7219L3817
12237H1036J89452K8758a98851f3733j6613q4334B38957i4776F6755l89B9568
12225A41328L6791A734d3296j01680A7521P5379J99546J1399j07380E161N34160
12214E39321B14230n0927K48793j90834b7635j8615H822d2683A33272K66417j56365
12203B43324O6774o5633q4978N2280I7874J31836N4284R4721G4856O1899M8446
12192A85201Q13J90396j71842l2462K4934n0928J85265C5442L07357k0630Q2970
$$ plain form
12272 -36463 37756 -150985 -85990 172976 126241 64420 96478 -74402 312057 230011 -5183
12260 -219918 204047 90860 -45866 -20356 -7978 2260 336463 -155591 -4664 82831 -55958
12248 199773 -257556 -193357 62108 -49456 78265 427756 -19155 -32480 -82753 47219 81036
12237 81036 270488 299246 -198851 -63733 -80346 -164680 238957 -94776 66755 66366 29568
12225 141328 178119 1734 -43296 -144976 17521 92900 292446 303845 196465 5161 539321
12214 539321 214230 163303 412096 221262 -27635 -46250 8822 -42683 133272 399689 243324
12203 243324 310098 244465 159487 211767 97874 229710 283994 378715 74856 136755 185201
12192 185201 186014 376410 204568 172106 197040 146112 331377 35442 342799 322169 405139
12181D05139h974A27094Q4502b1739j6083B08376k3775K62087A52285B0797a55861
12169B75417k0754E3801J564K0285j665j6218K00607K24124E8821K31625N1260
12158C41706g0953C33485H0313a04161B75330P543j03579a8171n3843B76399a82517
12146G8530a23326L2037A61145o9341J90321i9661b4080A47022J45226g5532B2055
12134B6922J14618a25196h297K227A12916N8911a5737c069B72469h2736B48654
12122B66093J18263l9044A14938b81397B87350P4966j40831m5133b3900j47563
12112a71463O0948D92216A66231R6141D6027j0680J63948m534o3396n9333L7110
12101A09142J3252a32635j31162B79145c1892C75027A55110a07020B7828J91418
$$ plain form
12181 405139 -8974 127094 211596 -21739 -37822 208376 184601 446688 152285 20797 -155861
12169 275417 254663 53801 55365 75650 73985 57767 258374 482498 58821 290446 341706
12158 341706 -70953 333485 80313 -104161 275330 282873 179294 -18171 -72014 276399 -182517
12146 78530 -123326 -91289 161145 91804 282125 -99661 -24080 147022 292248 -75532 22055
12134 26922 141540 -125196 -8297 -6070 112916 171827 -15737 -3069 272469 -82736 248654
12122 266093 384356 345312 114938 -281397 287350 362316 221485 176352 -23900 -171463
12112 -171463 -110515 492216 166231 262372 46027 35347 199295 194761 131365 72032 109142
12101 109142 122394 -132635 -263797 279145 -31892 375027 155110 -107020 27828 219246
12091B19246d5788k8789K6753A52551C0075L35361A72426g9211B3770a35107d2954
12079H5215f8289A5667b87244J05505C00983l0040i4165B03826I8301h1133l15960
12068c97093A12193c7761A88199b06089e8764D45928a22216A77465n1674l2199
12058I3592a29333A41764n6817d2650G5189J18305m3340J12878m2364b40675G1242
12046a40967C30015j50255D0108c03656C6810J74728C5119i8714B42100k1711
12036B20389H6428l8714c6277G0459g4113B11347H1342A0023b27833h2872I9977
12024E1959E419d6284A90574a5057A39854d2243A48640e9932k2577B19804A05930
12012A23734b96575M8243G856a00019F2148a01430A34568J1775f6322q9389C14573
$$ plain form
12091 219246 -45788 -74577 -47824 152551 30075 365436 172426 -79211 23770 -135107 -42954
12079 85215 -68289 15667 -287244 -181739 300983 270943 -94165 203826 98301 -81133 -397093
12068 -397093 112193 -37761 188199 -206089 -58764 445928 -122216 177465 125791 93592
12058 93592 -129333 141764 84947 -42650 75189 193494 150154 263032 220668 -240675 71242
12046 -140967 330015 179760 40108 -303656 36810 211538 35119 -98714 242100 220389
12036 220389 86428 47714 -36277 70459 -74113 211347 81342 10023 -227833 -82872 99977
12024 51959 5419 -46284 190574 -15057 139854 -42243 148640 -59932 -82509 219804 105930
12012 123734 -296575 -248332 7856 -100019 62148 -101430 134568 146343 -66322 -155711 314573
12000D09691A34088M8211J96749b30430J5641d8328p2429j96833J45940j02116
11990b73766B76862I7329b9993l00582J1256a9796o8442B3863b44224f2422j39348
11979b01770C89394e4328B26756f8963J6178J3604G9238a43524L0571p4370f1227
11967a44535O4712B35138a48791n997d9571j95463P0298M7391a8445k90106B06268
11955G892L236O9054K8714a63973n9670c6874A31174K40550A17951C4707H042
11943i5017A9448d7324A33761C6811K41184K7302b53452C9439R8358a84640G129
11931a99963g3715B73967G7376b96100J13513C03548b04569B8582h3221E2725
11920d237B60964q4929o4063a06963E1480b75376A98641A7654c0751j09717q7922
$$ plain form
12000 409691 134088 182299 379048 -230430 -214789 -48328 -120757 -317590 -171650 -273766
11990 -273766 276862 97329 -29993 -330575 -319319 -19796 -88238 23863 -244224 -62422 -201770
11979 -201770 389394 -54328 226756 -68963 -52785 -39181 79238 -143524 -112953 -187323 -61227
11967 -144535 -79823 235138 -148791 -154788 -49571 -245034 -174736 -127345 -18445 -308551 206268
11955 7892 11128 80182 108896 -163973 -223643 -36874 131174 371724 117951 34707 8042
11943 -95017 19448 -47324 133761 36811 277995 305297 -253452 39439 137797 -184640 7129
11931 -199963 -73715 273967 77376 -296100 -182587 303548 -204569 28582 -83221 52725
11920 -4237 260964 176035 111972 -106963 51480 -275376 198641 17654 -30751 -140468 -228390
11909b28390I1500J81425d8393b1156n2053A38221b43668q0054B5342a20023F9221
11897G1038J12854e4290O264j38695F0598f7590A6974c69692E0024h4716a8868
11885a54826b7278j58610j02137A05712c5105g195B43985a44318H9796c820I2600
11873g076G5199R5421D8051B1585a07149B1127b55137i6789J0269a7181l9141
11862e6322B79261D9233A8831J16502b07514h6796A8235J20204J08298b41952
11851A21870r896n2799a4621k2489C15794d933m8426I0200d3674H5001c64793
11839G3707J08673p8293a8350j46527A24456N6427a92291P5789B49822b93563
11828D2518b28147j31140r576a33164A28813b2944k09251P4601n741H3548J06278
$$ plain form
11909 -228390 91500 272925 -48393 -21156 -73209 138221 -243668 -323722 25342 -120023 69221
11897 71038 183892 -54290 -48026 -186721 60598 -67590 16974 -369692 50024 -84716 -18868
11885 -154826 -27278 -185888 -288025 105712 -35105 -7195 243985 -144318 89796 -3820 92600
11873 -7076 75199 170620 48051 21585 -107149 21127 -255137 -96789 -86520 -17181 -56322
11862 -56322 279261 49233 18831 135333 -207514 -86796 18235 138439 246737 -241952
11851 121870 111974 59175 -14621 -37110 315794 -4933 -53359 90200 -43674 85001 -364793
11839 73707 182380 104087 -18350 -164877 124456 180883 -192291 -116502 249822 -293563
11828 42518 -228147 -359287 -368863 -133164 128813 -22944 -232195 -157594 -163335 83548 189826
11817A89826D8625a32294A5666L9520b13197j7794I3477f5539R567n2035I2954
11805a4516H857b57920B22150c92711J86627R0555p0220O2464l7045e1802b0056
11793B72410b3202m3142C84780h6325b2085k82329g3348j11906A23583j4018c1997
11781D206R4107K35393j23646c05829m8649D5839b92957A24867f7204A03212J46939
11770B50151j18305l7521a55574E0825a44270A22070g9733r776G9733h0289n4844
11759a35133l0370I7791a32856A19162J1570a36132A58059b30894A10601B1197
11748A63438f5947C6538K1605h0433A92367J23439a53849j83966A29206O5793
11738A94999P611f8538I9006g3931k1255F0934k479J6837g5701j92518A97548
$$ plain form
11817 189826 48625 -132294 15666 55186 -213197 -230991 93477 -65539 -55972 -108007 92954
11805 -14516 8857 -257920 222150 -392711 -206084 -115529 -185749 -123285 -160330 -51802 -20056
11793 272410 -23202 -66344 384780 -86325 -22085 -304414 -73348 -185254 123583 109565 -31997
11781 4206 98313 333706 210060 -305829 -354478 45839 -292957 124867 -67204 103212 250151
11770 250151 131846 94325 -155574 50825 -144270 122070 -79733 -89509 79733 -80289 -135133
11759 -135133 -165503 97791 -132856 119162 130732 -136132 158059 -230894 110601 21197
11748 163438 -65947 36538 58143 -80433 192367 315806 -153849 -337815 129206 194999
11738 194999 202610 -68538 99006 -73931 -95186 60934 58455 75292 -75701 -268219 197548
11726A13235a02975A75617e3323A94551K8416a9978G0317a56264M3020A42607
11715e0462A99687o4635J38100i6757A9094J21672d8682G2804I16c12638e0531
11703h2955D0537K1826L60L051d67219k7667f2019G2455L3941b34256c9880j74111
11691b13991F6892C351a59641C3731J12984a59090m8202I6396c1822C72547a65522
11679a26382G1855A0265a32794a1033A92168E9787j082b31919C042a85499b0857
11667B03986a9502m3431F3452a1161l11678B61730c75093h7045B4911A1827b28233
11655h8650j49171g5307G7232a27531j3187A4237K92961d23336A26609J26898
11645B53507p0081k9153i8956H3846b2105D9058m564a3984A26834a03232C0340
$$ plain form
11726 113235 -102975 175617 -53323 194551 222967 -19978 70317 -156264 -113244 142607
11715 -50462 199687 135052 273152 -96757 19094 140766 -48682 72804 916 -312638 -50531
11703 -82955 40537 62363 62723 65774 -467219 -494886 -62019 72455 106396 -234256 -39880 -213991
11691 -213991 66892 3351 -159641 33731 146715 -159090 -207292 96396 -31822 372547 -165522
11679 -126382 71855 10265 -132794 -11033 192168 59787 58705 -231919 3042 -185499 -20857
11667 203986 -19502 -62933 63452 -11161 -322839 261730 -375093 -87045 24911 11827 -228233
11655 -88650 -237821 -75307 77232 -127531 -140718 14237 307198 -423336 126609 253507
11645 253507 183426 154273 -98956 83846 -22105 49058 44494 -13984 126834 -103232 30340
11633e13006B17596A1404P1136a74313r1035P5285E1684G713b26871D0903g5503
11621d03323F1994A8876a10988B2307a64736a0844k0513D49311G2456A3689h4065
11609A58200E6921a0511I6377b15304K2485l4107R3341a6716j91911f8024D0892
11597c4507B79346H5620J60892n320e3651k3535E0338J9935a87271H6039K04699
11586B90738D146K85241d30570A46861B1395K95484A14099k5233a13892G4608
11575h1052J6632B82542A2264a07297G7547l832K234a75433d7115A961a95969
11563E9273J18095J67059h5853A76147G9139d44959a78197g552r118j69291B31152
11551G7036C0532Q4423B178b4122A35264e3528J9548k20898B6324L00504A22975
$$ plain form
11633 -513006 217596 11404 82540 -174313 -265348 -190063 51684 7713 -226871 40903 -75503
11621 -403323 61994 18876 -110988 22307 -164736 -10844 -31357 449311 72456 13689 -84065
11609 158200 56921 -10511 96377 -215304 -192819 -226926 -133585 -16716 -208627 -68024 40892
11597 -34507 279346 85620 246512 241192 -53651 -77186 50338 70273 -187271 86039 290738
11586 290738 4146 289387 -430570 146861 21395 316879 114099 88866 -113892 74608
11575 -81052 -64420 282542 12264 -107297 77547 73715 75949 -175433 -47115 1961 -195969
11563 59273 177368 344427 -85853 176147 79139 -444959 -178197 -7552 -16670 -185961 231152
11551 77036 30532 114955 2178 -24122 135264 -53528 -33980 -254878 26324 326828 122975
11539E7751e1126j4409C93196Q6655j86092A10323O1287R4896r7894C7207b22201
11527E884c9734j25412C31213a65954n0198c6756A78479K3778J07723a53205r6886
11516b50091a474j00246J4158I0205J53032j06362K48669F0884O0829K02687g9109
11504H1241c7734J6032A94382F2969M5365O417a01157B29929a64680a3543D7046
11492C61994e2614A09077P4193n1500J92608C3189N8975L09246b5459E505K01726
11481B07231L9484F353a15366C09494g8343A45960C9993f6496C76961I6979M37508
11470E34487C4017K9815J52981C6925L46622H2122J92917C8268e765D02558i6481
11458b27464O3871A64816a76782m3986I3853n611b40033A76884r044K03468g1564
$$ plain form
11539 57751 -51126 -65535 393196 479851 293759 110323 171610 266506 168612 37207 -222201
11527 5884 -39734 -165146 331213 -165954 -216152 -36756 178479 202257 309980 -153205 -250091
11516 -250091 -1474 -101720 -87562 90205 243237 136875 385544 60884 121713 324400 -79109
11504 81241 -37734 -21702 194382 62969 108334 114751 -101157 229929 -164680 -13543 47046
11492 361994 -52614 109077 183270 131770 324378 33189 92164 401410 -25459 5505 207231
11481 207231 246715 6353 -115366 309494 -78343 145960 39993 -66496 376961 96979 534487
11470 534487 34017 63832 216813 36925 383547 82122 275039 38268 -5765 402558 -96481
11458 -227464 -163593 164816 -176782 -220768 93853 88242 -240033 176884 167840 371308 -71564
11446B628a55524c5806A02298a2760A88173a46775A72040c6496k6523b9500j31082
11435a60582a9840F5666J3870a33427D72033b33801F0094P0052h6620M858A6848
11423I9766g5736m3302L82c3732j07857j33762H6b3087B71575A09187j9970b10126
11410C07252j30846m6240b4357R246m1158H8722P8479B9225a44853e2952j95178
11399b48130D2985h1049j51607A39243i2151C25685A19381a50134L6680L8393
11389g5061n1667H0958f9017A60573K71172D0604a82699c9387k59477d5034G8652
11377H2419i453l52083e3504K1971F0525J442g3575j0886B04127R8012j37469
11366A64670b41419F674c4257B42249a64926p5272G8079M4164f153l21889B13656
$$ plain form
11446 2628 -155524 -35806 102298 -12760 188173 -146775 172040 -36496 -63019 -29500 -160582
11435 -160582 -19840 65666 79536 -133427 472033 -233801 60094 130146 -86620 -81762 16848
11423 99766 -75736 -119038 -118656 -33732 -141589 -275351 86 -23087 271575 109187 89217 -210126
11410 307252 176406 130166 -24357 -15111 -56269 88722 167201 29225 -144853 -52952 -248130
11399 -248130 42985 -81049 -232656 139243 -92151 325685 119381 -150134 -113454 -75061
11389 -75061 -126728 80958 -69017 160573 431745 40604 -182699 -39387 -298864 -45034 78652
11377 82419 -9453 -361536 -53504 -31533 60525 61967 -73575 -84461 204127 302139 164670
11366 164670 -241419 6674 -34257 242249 -164926 -240198 78079 122243 -6153 -328042 213656
11354B29298b61639A03266B6822N009k580h7684j03524d8193j33772M4654e9988
11342b24646N6523H1449R5393J40713a85959N8262J5400r7369F0707A9888e16211
11330A68177d5862q2775H0234J80401c9827j371m3002j21331B41777a84718d4595
11318H2889K30977a49838A06573a33607a9387q9909q176B778g2704k77379A09926
11306a24381j23183b9408r5906D6665A7734d31774f4659k9372k74144A43526B985
11294H7889K9708j7703L1780H463L51664B4511b16072M6939m7639A1415a50206
11282a49086j43534m4691B34064a50768H5068K50356a04808k40465b3117A93076
11271A11448P7541b39315G2977d2790l7472D17431G5634a04236E9438J78122r5211
$$ plain form
11354 229298 -261639 103266 26822 31831 29251 -87684 -191208 -48193 -181965 -137311 -59988
11342 -224646 -168123 81449 176842 317555 -185959 -127697 -112297 -209666 60707 19888 -516211
11330 168177 -45862 -128637 80234 260635 -39827 -41198 -84200 -205531 241777 -184718 -44595
11318 82889 313866 -149838 106573 -133607 -19387 -109296 -117472 2778 -72704 -350083 109926
11306 -124381 -247564 -29408 -125314 46665 17734 -431774 -64659 -94031 -368175 143526 2985
11294 87889 117597 99894 131674 8463 360127 24511 -216072 -169133 -216772 11415 -150206
11282 -149086 -292620 -337311 234064 -150768 85068 335424 -104808 -345273 -23117 193076
11271 111448 188989 -239315 72977 -42790 -80262 417431 75634 -104236 59438 237560 142349
11260A42349f4135b20B3710g9565H4519a97097k4182j26555a45916b5143j32238
11249a57381e083D8566c6490M204H6812J6096b45839f5231l50205d1659a8726
11237a59835l3389N192k1653I714L4113a94582A57614p1520i4247J4415A7908
11225b61849A8105f9832B08130K65331A84523h2177K6335p5129B54069b67846
11214E1827a74005m4435D5509J16045E1386K889c71534D0408i6401A25225b82599
11202a62211k30031e1253o1639d6509j9365C00814a07790h664q4104j11740H4270
11190b81113g3569D700L2997a62232A69655c5026k4585C7483L322a67766c57j72738
11178a73095G1884g8520B56573a48581k02402G0653b18116m6891H7225a32698
$$ plain form
11260 142349 -64135 -220 23710 -79565 84519 -197097 -221279 -347834 -145916 -25143 -157381
11249 -157381 -5083 48566 -36490 -32286 86812 102908 -245839 -65231 -415436 -41659 -18726
11237 -159835 -193224 -188032 -209685 9714 43827 -194582 157614 86094 -94247 -79832 17908
11225 -261849 18105 -69832 208130 473461 184523 -82177 -55842 -130971 254069 -267846
11214 51827 -174005 -218440 45509 161554 51386 54275 -371534 40408 -96401 125225 -282599
11202 -162211 -392242 -51253 -112892 -46509 -65874 300814 -107790 -8664 -92768 -204508 84270
11190 -281113 -73569 4700 37697 -162232 169655 -35026 -59611 37483 40805 -167766 -357 -173095
11178 -173095 71884 -78520 256573 -148581 -350983 70653 -218116 -265007 87225 -132698
11167b26943f3375C6228d30444b03502l5915f6084a075H640a9847C5450b62546
11155A8075N039b80987B18862F0879a75195B782b82408P5283e5105E1436b68523
11143d2285q1428K984R700c6031D1735J4577a71603A54846a51702O0380B12270
11131D8608a85705k07898A10974C0634c7922r338j148B12004g6865B5956b67329
11119a48018A12943a30441B76368j11938d227C48346I8347J52776q0063J74797
11109C45857f7016A41345K212K7911D5834P3108C7062L08727b74084e0679k8021
11098g8700A37313J52734j23238J80723j23072E8281L3203L65069A63267c92A00313
11086A71830a27787A70810D4943Q2068K2268O47L20153k34425I4409J45343k2016
$$ plain form
11167 -226943 -63375 36228 -430444 -203502 -239417 -66084 -1075 8640 -19847 35450 -262546
11155 18075 23114 -280987 218862 60879 -175195 2782 -282408 -207125 -55105 51436 -268523
11143 -42285 -123713 -120729 -111029 -36031 41735 56312 -171603 154846 -151702 -91322 212270
11131 48608 -185705 -393603 110974 30634 -37922 -47260 -48408 212004 -76865 25956 -267329
11119 -148018 112943 -130441 276368 164430 -4227 348346 98347 251123 171060 345857
11109 345857 -67016 141345 143557 171468 45834 118942 37062 345789 -274084 -50679 -78700
11098 -78700 137313 290047 166809 347532 224460 58281 91484 456553 163267 -392 100313
11086 171830 -127787 170810 44943 127011 149279 149926 470079 235654 94409 239752 217736
11075B17736D0854Q1896J98322E8391J33108k1519J14070j7250I5215J68289D2128
11063B79548J73084A88723K18959G9744J74100J15979I0809K81235K54734C04761
11052D26089j30674L44590n3241P0477k18462J75822L6639J22134l11131N9895
11042E22138K00671l49657A71330L38623J30228J87219l65579r4651M79825l39711
11032E07284J81181J43744j49292j85716J41446B74239M30100j98980k11289j08697
11022A85373K98746K80526k88059J80003Q6473o0151B30323K63523r9797J43760
11012E37809J89417l53168N0410r5144L39731a35707F30731p2799o32L7879K41378
11001H36557k20031j39406K7939k9797J54564k26296L56981j32950k6037j36778
$$ plain form
11075 217736 40854 122750 321072 58391 191499 169980 284050 266800 95215 263504 42128
11063 279548 452632 188723 407682 79744 253844 369823 90809 372044 626778 304761
11052 426089 295415 640005 586764 657241 438779 614601 651240 773374 462243 522138
11042 522138 722809 373152 171330 509953 640181 827400 461821 367170 846995 507284
11032 507284 688465 832209 682917 497201 638647 274239 704339 505359 294070 185373
11022 185373 484119 764645 476586 656589 743062 682911 230323 493846 394049 537809
11012 537809 727226 374058 424468 329324 669055 -135707 630731 557932 557300 595179 836557
11001 836557 616526 477120 505059 475262 629826 403530 760511 627561 601524 464746
10991D64746J14468M7113r0783J36332j90031K56310j42215m8150L2470L6342
10981F16602K72086j466R2830k62808K15560j56406J4019L26045k40034J55231
10971A031659L03551R4693J0604P27550n0921J04340J08813J03255j9093J01486
10961B515937m43666j08227m14378k15565k03820J85766l77933N44193k91783
10952A190524j43500L26799j29880j5617R2797l56731l21375K14933L1210j31788
10942G57372k29767B57331m0692M15398l02075a4937K363A63216c4405B30200
10931h7631C49403g1431b4027E3967M1828b80178B6816d39360A31881b50034g3646
10919a27397k4510m3727c747A05149a18044E3366a20461p0543j34728B50865a74604
$$ plain form
10991 464746 579214 626327 535544 671876 481845 738155 595940 547790 580260 616602
10981 616602 888688 887222 980052 717244 932804 776398 790417 1116462 876428 1031659
10971 1031659 1335210 1429903 1440507 2168057 2117136 2221476 2330289 2433544 2414451 2515937
10961 2515937 2072271 1964044 1549666 1334101 1130281 1316047 938114 1482307 1190524
10952 1190524 1047024 1373823 1243943 1228326 1321123 964392 643017 857950 889160 757372
10942 757372 527605 257331 216639 632037 329962 -14937 -12574 163216 -34405 230200
10931 -87631 349403 -71431 -24027 53967 95795 -280178 26816 -439360 131881 -250034 -73646
10919 -127397 -151907 -195634 -3747 105149 -118044 53366 -120461 -191004 -325732 250865 -174604
10907A3385J0091A1408h0212j46669A45284E2176e3972C3321b1309r2180l19544
10896d33033H85i686o3692q038h36j71945A192J01501k677g6105A56851E2302
10883a3219F2588B8526b61236q041d0618D9011Q1248a86331b1417l4784C0468
10871f6880F4149N6062b45586h8197H7147B6153N0940b12871A5015n916f470C49279
10858A16725Q1522c17144a13163A0899L5904j3669K48867A07228b481l066j35982
10847a41529k7434B59925b09845a2172j89169i3446a3766A41340a86605j4649
10837b01254h3826C33458D3690J55732J08294c5888j23878A9637L70998G7698
10826C5659K20892A05440J03387a11868q4777a7392o0668F4301b89937a07095
$$ plain form
10907 13385 23476 11408 -80212 -226881 145284 52176 -53972 33321 -21309 -113489 -433033
10896 -433033 885 -9686 -73378 -81416 -836 -172781 1192 102693 100016 -76105 156851 52302
10883 -13219 62588 28526 -261236 -269277 -40618 49011 130259 -186331 -21417 -56201 30468
10871 -66880 64149 120211 -245586 -88197 87147 26153 77093 -212871 15015 9099 -6470 349279
10858 116725 198247 -317144 -113163 10899 46803 33134 282001 107228 -2481 -5547 -141529
10847 -141529 -168963 259925 -209845 -12172 -201341 -93446 -13766 141340 -186605 -201254
10837 -201254 -83826 333458 43690 199422 307716 -35888 -159766 19637 390635 77698
10826 35659 256551 105440 208827 -111868 -196645 -17392 -78060 64301 -289937 -107095
10815A72558K59461A8675J71979G7974h9453j9796P341l03B2825b1169I3359c52979
10802A19346b03239e6765n8416j83701q1382a17211l578C7187K20659b63951L8673
10791b25278g0918l83207A3520Q205a43015n4552j50610a29828d1756p9623B48007
10779d14474K9892C23660a01274k15013a29834m1597p6229R768n1825A87926a18958
10767a88125P4759I6034J35626d1958A30772b0261j79687M1319A47624o9750f4873
10755F6319g6897A72049a90106d133C2562g4287H4710a30005p3960B1087r733
10744A1354K33528L4716i7627C1520b82427n289A60738e1213A11487d47300A23734
10732a8665m7804l07507D0886b57076A17147E5211J45654b18472O2649q7825g7821
$$ plain form
10815 172558 432019 18675 190654 77974 -89453 -109249 -101908 -102211 22825 -21169 93359 -352979
10802 119346 -203239 -56765 -115181 -298882 -380264 -117211 -120789 37187 257846 -263951 -225278
10791 -225278 -70918 -454125 13520 21725 -143015 -197567 -348177 -129828 -41756 -121379 248007
10779 -414474 -384582 323660 -101274 -316287 -129834 -171431 -247660 -237892 -289717 187926 -118958
10767 -188125 -113366 96034 231660 -41958 130772 -20261 -199948 -158629 147624 77874 -64873
10755 66319 -76897 172049 -190106 -4133 32562 -74287 84710 -130005 -203965 21087 11354
10744 11354 244882 279598 -97627 31520 -282427 -287716 160738 -51213 111487 -447300 123734
10732 -18665 -66469 -373976 40886 -257076 117147 55211 200865 -218472 -155823 -243648 -77821
10720A13576a54447n1193A13131O9977b8090H1917e4520r5107J0668H9581a14805
10708i2452A57029g7941C657R4539a35135q6994R8371K8863j12816B10399b63707
10696E2810b82724a0264C5977b01217f6917J0536A88843b11207a02849A44157
10685a11321B0210a69242P5296a0992o8932k46323C608a43496g832F0977N3316
10674A14293b06059O5582B78879a32005e7286C9831A805b82201h3343m7203B25436
10662i3270j5370n9287F0323A8876L7941d32575e1742j00457p0944i5388L8711
10651e6677C1601a57707f9502K947k0427K6424A20159b2658m4432j36040N7783
10640a45347B0139b07958L0708j09754B71112m6166D8132J30103F1833R7976i4430
$$ plain form
10720 113576 -154447 -205640 113131 183108 -28090 81917 -54520 -149627 -138959 89581 -114805
10708 -92452 157029 -77941 3657 98196 -135135 -222129 -123758 -94895 -207711 210399 -263707
10696 52810 -282724 -10264 35977 -201217 -66917 -56381 188843 -211207 -102849 144157
10685 -111321 20210 -169242 -93946 -10992 -79924 -326247 3608 -143496 -7832 60977 114293
10674 114293 -206059 -140477 278879 -132005 -57286 39831 1805 -282201 -83343 -130546 225436
10662 -93270 -108640 -167927 60323 18876 56817 -432575 -51742 -152199 -223143 -95388 -56677
10651 -56677 31601 -157707 -69502 -66555 -86982 -60558 120159 -22658 -67090 -203130 -145347
10640 -145347 20139 -207958 -177250 -287004 271112 224946 48132 178235 61833 159809 -94430
10628g9901B96794a43605C25170A37359N7541a0383j65999G2708a65866A33453
10617b9662k00013B6237J53169b51150e5649j34654O1215j97198A55226E2373
10606a47661B90949b8870G2251d2749j53522n4800c9131a4761C043e7457J5561
10595d1896q7759o6378Q2500o3211d49k1003A404a40933j18206j91709G0131a85866
10582C5814g3796C791o56c62145g3201I1733b59671F0999b0529D3525K26536c59977
10569H7419b72798J10717f7211K3448j04948j6697B03076a48740A33196J46057
10559B79253a36394l3921j37569A22179E7770a7794j74173B914P2889J72665I7795
10547a02356B4645R7626a92025j2458K8647J6696B54633N7361b31896I939a74090
$$ plain form
10628 -79901 296794 -143605 325170 137359 194900 -10383 -176382 72708 -165866 133453
10617 -29662 -229675 26237 179406 -251150 -55649 -190303 -129088 -326286 155226 52373
10606 -147661 290949 -28870 72251 -42749 -196271 -251071 -39131 -14761 3043 -57457 -41896
10595 -41896 -129655 -196033 -113533 -176744 -449 -21452 1404 -140933 -259139 -450848 70131 -185866
10582 35814 -73796 3791 3135 -362145 -73201 91733 -259671 60999 -20529 43525 270061 -359977
10569 87419 -272798 -162081 -67211 -43763 -148711 -165408 203076 -148740 133196 279253
10559 279253 -136394 -170315 -307884 122179 57770 -17794 -191967 2914 75803 248468 97795
10547 -102356 24645 122271 -192025 -204483 -175836 -159140 254633 311994 -231896 9939 -174090
10535B4502a30639K8687l9073o2524A19796d8049k26135J16019n5622a00570D5225
10523a74567n6196H5802a57167B49740a30286N7307A97762h13A65746b17274j4993
10512b32267A296O1477a21773L1438n5199A70875b65344B48522G8570b6675B0413
10500a7890k94854J49149F408c53298E2638J31130f3240C6629a40835j8565b8125
10488f6552k59759B60317b85887f834j96119g8054F1195J35630c2324A70793a67266
10476F6569K92127A08995K09027O2896j86301J44094j00415L3466J57659d5977
10465a32445E9472K17141b17670k59490A15056k4014h2105k4788l7577A34834
10454b93084E46994b31577D18813a34332G0209i4574L1144n6761A03897a93728
$$ plain form
10535 24502 -130639 -101952 -141025 -203549 119796 -48049 -274184 -158165 -213787 -100570 45225
10523 -174567 -230763 85802 -157167 249740 -130286 -72979 197762 -813 165746 -217274 -232267
10512 -232267 1296 62773 -121773 -90335 -145534 170875 -265344 248522 78570 -26675 20413
10500 -17890 -312744 -163595 6408 -353298 52638 183768 -63240 36629 -140835 -159400 -28125
10488 -66552 -326311 260317 -285887 -6834 -202953 -78054 61195 196825 -32324 170793 -167266
10476 66569 358696 108995 318022 380918 194617 338711 238296 271762 429421 -45977
10465 -132445 59472 276613 -217670 -477160 115056 91042 -82105 -106893 -144470 134834
10454 -293084 546994 -231577 418813 -134332 70209 -94574 -63430 -120191 103897 -193728
10443a9160A23625b20400i3196G5242a58139E7187K50000d44465i9207F7621R3411
10432A61032a92854G4994J00441N0697c74096B13096B9470L1291d1878j1587r1489
10421a44954D8081f1671H3339a97645Q8457M8230l3152C0827N8080Q4392f845
10409i9581k72289f9264A32742Q8014D9234L6902a07582c6803j88470i9029I1595
10397a74570r8685A50450o1180O7705a11632F0393a14799d1632B23638J80932
10387D04570d6560B88820H1924K56633a34396e7772k813o7920I5503D3092J05712
10376A48804K83779B16234C2107J88000g1078B53707C4621L17414b70427A01411
10365D7328K71620e3968D47876D4635J88888K43812k30082o9340A1998J57634
$$ plain form
10443 -19160 123625 -220400 -93196 75242 -158139 57187 307187 -444465 -99207 67621 161032
10432 161032 -192854 74994 175435 226132 -374096 213096 29470 60761 -41878 -53465 -144954
10421 -144954 48081 -61671 83339 -197645 -109188 -60958 -94110 30827 88907 173299 -6845
10409 -99581 -371870 -69264 132742 220756 49234 86136 -107582 -36803 -225273 -99029 91595
10397 -174570 -273255 150450 89270 156975 -111632 60393 -114799 -41632 223638 404570
10387 404570 -46560 288820 81924 338557 -134396 -57772 -60585 -128505 95503 43092 148804
10376 148804 432583 216234 32107 220107 -71078 253707 34621 352035 -270427 101411
10365 47328 318948 -53968 447876 44635 233523 477335 247253 177913 11998 169632
10355A69632j1164J87053l2941A48584J76561E0466J4465J39958o8576K47354
10345C83667K35610B33117r5509J71267f5888A41863K36065C5950A5951Q8688
10335A04639J31266N0816e3196C50644j46313P2750m4857p5998M7416E8162d3640
10323B47648A13222m8015K38141G1247N5343J20858a5368I3318L9299J73880K0536
10312C27033F7177I142Q2756J162j4897J67109j4748a01450c9125a0285I7369
10300F5307O9104e279o9665l22553A61961a56265B60604b93225m998a15925C06885
10288A27599k6803L17645E1688A717J70823b24980c7603r0118H4480b36249l7632
10277b73881A4399b98286a48784j17263B2638d3282H3103b51053L964C5125b55986
$$ plain form
10355 169632 158468 345521 312580 148584 325145 50466 64931 204889 136313 383667
10345 383667 619277 233117 137608 308875 -65888 141863 377928 35950 15951 104639
10335 104639 235905 286721 -53196 350644 204331 277081 232224 156226 203642 58162 -43640
10323 247648 113222 65207 303348 71247 126590 247448 -15368 93318 132617 306497 327033
10312 327033 67177 9142 91898 93060 78163 245272 230524 -101450 -39125 -10285 97369
10300 65307 134411 -5279 -74944 -397497 161961 -156265 260604 -293225 -298223 -115925 306885
10288 127599 100796 418441 51688 1717 172540 -224980 -37603 -127721 84480 -236249 -273881
10277 -273881 14399 -298286 -148784 -266047 22638 -43282 83103 -251053 -247089 35125 -255986
10265E900a79846A03930g7247A39292d2660p2245q2181p1931d4876j37307C3621
10253B30174e9649B3482K07832C3924J45398a05810B50401q1019A3683K01716
10243B15399d4358G2873K89827a20650A20129j4258b85697j70798I8566C8325
10232c05807B41773b89400J42140d9013l3108A21398B609a76201j9451k85231
10222d80883b26625b4526m8144F4960I338K9498J12776b16023B21719b84917A05133
10210A87323c597I6392a86214d4643C40363q6787b41205A72452h2688n6037f3157
10198a09643j5469j8324K5457A58101d9663J3868B6540P9344a39667A934a0172
10186b0679A15563C9199d4341B90718j02298b91324i4080j5586L5237n0496M7158
$$ plain form
10265 5900 -179846 103930 -77247 139292 -42660 -114905 -197086 -269017 -44876 -182183 33621
10253 230174 -59649 23482 231314 33924 179322 -105810 250401 169382 13683 215399
10243 215399 -44358 72873 362700 -120650 120129 105871 -285697 -456495 98566 38325
10232 -305807 241773 -289400 -147260 -49013 -82121 121398 2609 -176201 -195652 -480883
10222 -480883 -226625 -24526 -72670 64960 9338 38836 151612 -216023 221719 -284917 105133
10210 187323 -3597 96392 -186214 -44643 340363 253576 -241205 172452 -82688 -138725 -63157
10198 -109643 -125112 -143436 -117979 158101 -49663 -35795 26540 105884 -139667 1934 -10172
10186 -20679 115563 39199 -44341 290718 188420 -291324 -94080 -109666 -74429 -124925 -77767
10175g7767r2520j54667I1386B5295b21478A95302d9640j13497o3302A05069N308
10164A10377i447k86034D85a77399c1040j50694A02893a70020o0290B4086J10310
10153A34396b40110n0435B7572d06614D6314c9743B61205a46570O4328l30216
10143d12458f0323E1337k4699R2068Q3845J13376b01916E4723K1167O3758i877
10131a62857P5892L5058j41941k22897d8553A3564c3096j78763A00320a36030
10120B54989j10561l479k3871K567b17042j92214a20490d3066p6388c1885I8782
10108C7118h3569j91210H0209b023q3254l9826I5500b73672b4659J730F4176k9395
10096C4781i6633M2353A09676a62793k6612B09011N2530d35725F2520a80825E0109
$$ plain form
10175 -77767 -170287 -324954 91386 25295 -221478 195302 -49640 -163137 -226439 105069 110377
10164 110377 -9447 -295481 485 -177399 -31040 -181734 102893 -170020 -230310 24086 134396
10153 134396 -240110 -290545 27572 -406614 46314 -39743 261205 -146570 -82242 -412458
10143 -412458 -60323 51337 26638 118706 202551 315927 -201916 54723 75890 139648 -9877
10131 -162857 -86965 -51907 -193848 -416745 -48553 13564 -33096 -211859 100320 -136030
10120 254989 144428 140949 117078 119645 -217042 -409256 -120490 -43066 -119454 -31885 98782
10108 37118 -83569 -274779 80209 -2023 -85277 -125103 95500 -273672 -24659 -22929 64176 34781
10096 34781 -96633 -54280 109676 -162793 -189405 209011 261541 -435725 62520 -180825 50109
10084a59239j03955h6608C3613b7167G6796F074b52788c5428l39085B74646A08847
10072B01345b90853M5211i7316C9947a40724D02K38555f0229k30458j26638a94344
10060a41754b0882B33586a83922c0570D6823a19522j28054P961R3783A97435b92199
10048a91842f1537B98002G5874a76329B55941a49525k36159B01951c02379A28053
10037a93427A04698i2392A47326a03050k0645j10764K2556e4041A54997B2655
10026c36750J40884c9588j5364K1962C4167c64383J38304Q6986j03246A97037
10015a96344A29640d2510A83016a15248A16405a02928e0241b5074j00553C19788
10004B09350F1662N991a2782m1448m64127b6329A12367a40546p9708A84366a12328
$$ plain form
10084 -159239 -263194 -86608 33613 -27167 76796 6074 -252788 -35428 -374513 274646 108847
10072 201345 -290853 -245642 -97316 39947 -140724 402 238957 -60229 -290687 -417325 -194344
10060 -141754 -20882 233586 -183922 -30570 46823 -119522 -247576 -239615 -145832 197435 -292199
10048 -191842 -61537 298002 75874 -176329 255941 -149525 -385684 201951 -302379 128053
10037 -193427 104698 -92392 147326 -103050 -123695 -234459 -211903 -54041 154997 22655
10026 -336750 -195866 -39588 -54952 -32990 34167 -364383 -226079 -139093 -242339 197037
10015 -196344 129640 -42510 183016 -115248 116405 -102928 -50241 -25074 -125627 319788
10004 209350 61662 67653 -12782 -54230 -518357 -26329 112367 -140546 -220254 184366 -112328
9992i7667q7492c5249B06161p7013J18864c94307c254l88729a67722M273P8349
9981h5100D640a4598k39748a03815N1857g714j65376Q5693k38548J46048a2017
9969a13233k48965a07184N2977C3797J81566h900m2385A02608k5573b89573A86033
9957A26600C35R7313b62859B82436b32942M7438Q1798j02828J8089O4594A91831
9945B46293J0045b20159j14791A03321I204N8891B8674a16991C8480b81584J28529
9934a53055N4718p8240A5479N3686J4354a05197l5561j57755a09624k6462a2059
9922A9994L26018e4237o1145F0869c11772A52964a28611j59203A02713Q3507a58848
9910A54532d2577j13306B40128a60421n7888o7774a02749j60318Q9809l1892B01935
$$ plain form
9992 -97667 -185159 -35249 206161 129148 248012 -394307 -3254 -391983 -167722 -163449 -85100
9981 -85100 4640 -14598 -254346 -103815 -51958 -7714 -173090 -87397 -325945 -179897 -12017
9969 -113233 -362198 -107184 -54207 33797 215363 -8900 -51285 102608 77035 -289573 186033
9957 126600 335 97648 -262859 282436 -232942 -185504 -103706 -206534 -188445 -123851 191831
9945 246293 256338 -220159 -334950 103321 9204 68095 28674 -116991 38480 -281584 -153055
9934 -153055 -98337 -176577 15479 69165 83519 -105197 -140758 -298513 -109624 -136086 -12059
9922 19994 346012 -54237 -115382 60869 -311772 152964 -128611 -287814 102713 186220 -158848
9910 154532 -42577 -155883 240128 -160421 -218309 -286083 -102749 -263067 -173258 -205150 201935
9898a89692C7642a42740A1263c06834c201n5525j37956a3140k6741C9818a40564
9886a38132O4688B22440b39575B55584a48800a9667B3821R7942a80112A3293b4154
9874b84975e5715F9475J08880f0187r4165C6301J25201A3769a54542g1402K2004
9863d9398o7986l243A60307b12299g7466K4625q5240N2871B1346f4866k90217
9852c55083c5816l3292I0547J7542R2570B4587L45573c53963n429f1651J2217
9841d9434G7570b74713D8525J08461g4180J1512B40379b60739N2460A57295b14171
9829d4170A07818a75921m285q1913B05585g4898A53053b3150j86972K0273C4720
9817H8416a08698o6943N2980A03218N1972c50690a5245B4610c04141J30697j94646
$$ plain form
9898 -189692 37642 -142740 11263 -306834 -3201 -58726 -196682 -13140 -39881 39818 -140564
9886 -138132 -73444 222440 -239575 255584 -148800 -19667 23821 121763 -180112 13293 -24154
9874 -284975 -55715 69475 178355 -60187 -154352 36301 161502 13769 -154542 -71402 -49398
9863 -49398 -117384 -120627 160307 -212299 -77466 -52841 -138081 -85210 21346 -64866 -355083
9852 -355083 -35816 -69108 90547 108089 200659 24587 370160 -353963 -359392 -61651 -49434
9841 -49434 77570 -274713 48525 156986 -74180 -62668 240379 -260739 -208279 157295 -214171
9829 -44170 107818 -175921 -180206 -262119 205585 -74898 153053 -23150 -210122 -189849 34720
9817 88416 -108698 -175641 -122661 103218 155190 -350690 -15245 24610 -304141 -173444 -368090
9806c68090J2076a64999l4267j56317I3075a85320e4067a7019k27326a18545F4010
9794a61229H5151M3694a56275A18753g1410k75169m668G7090J64640A00927K72251
9783C73178A79896k5665G6178B5187R5034b7199j60033Q8017A8857c3315H0395
9771A275b96677a8814k24392g8893G612a40846k4377N9251D2573K5286a41680
9759E8282i628k87126J14993J4082Q1136L7372r9293n7092B274a54635N5318j39903
9747b39220b4138A50257a51039B3664c43962c1538k0383k34286d3878j21892Q2270
9736h3500A43556b81096B925f838F8567H149L01697a70654j8345c7864k21514
9725b59378A3578b20808n8817g975A46366J62470q4930b7014B5843R983a52745
$$ plain form
9806 -368090 -356014 -164999 -199266 -355583 93075 -185320 -54067 -17019 -244345 -118545 64010
9794 -161229 85151 128845 -156275 118753 -71410 -346579 -351247 77090 241730 100927 373178
9783 373178 179896 154231 76178 25187 120221 -27199 -187232 -99215 18857 -33315 80395
9771 1275 -296677 -18814 -243206 -78893 7612 -140846 -165223 -105972 42573 67859 -141680
9759 58282 -9628 -296754 -181761 -167679 -86543 -49171 -148464 -205556 2274 -154635 -99317 -239220
9747 -239220 -24138 150257 -151039 23664 -343962 -31538 -51921 -286207 -43878 -165770 -83500
9736 -83500 143556 -281096 2925 -6838 68567 8149 309846 -170654 -188999 -37864 -259378
9725 -259378 13578 -220808 -279625 -7975 146366 308836 223906 -27014 25843 35826 -152745
9713c42726J29193R4920A1769a79472j21940A1431a44290G7035A488a04256k30143
9702c34399E4882M150j5461a89848C5788a29122r8033M2073A03361N0277a36349
9690d4789o2409G6192K85478B4559b40618J04990A8921a33546k75357i598k22082
9679b31680M3617N2908m07596K59978A33118L325a73511G1925b03688i5931j39149
9668b35080A28619g7511Q753k39454g5568c6680B26031a86531R0199M7174j66550
9657b15708M4351b5288G4560a69542C7416c06134D45Q6304J50717c65346a73784
9645H9864a55264d1619I4227b74964N1817A58354c15109k0080N5391H0510C7368
9633b98422P6356A14541k4965d79940b24849M8242L5296M4500I3471N329J5363
$$ plain form
9713 -342726 -213533 -118613 11769 -179472 -301412 11431 -144290 77035 1488 -104256 -334399
9702 -334399 54882 59032 43571 -189848 35788 -129122 -227155 -185082 103361 153638 -136349
9690 -44789 -107198 76192 361670 24559 -240618 -135628 18921 -133546 -408903 -9598 -231680
9679 -231680 -188063 -135155 -542751 -282773 133118 136443 -173511 71925 -203688 -95931 -235080
9668 -235080 128619 -77511 -68758 -308212 -75568 -36680 226031 -186531 -96332 -49158 -215708
9657 -215708 -171357 -25288 74560 -169542 37416 -306134 445 86749 237466 -365346 -173784
9645 89864 -155264 -41619 94227 -274964 -223147 158354 -315109 -335189 -279798 80510 37368
9633 -298422 -222066 114541 89576 -479940 -224849 -176607 -141311 -96811 93471 98800 114163
9622A14163B0155l993a4863k23565J13818G5169a21576j30018a7306n7191m8273
9611a22770D7441d202o0231n2228B14870D7M8942b64004m88556c10181N4556A24054
9598a92200A60627A6724J77145i3808a7048j2581H6686B4883c3566A6176b88481
9586c03610J41730M1168H4922J23193G6802h613G9957a21340C652M9792b04765
9574e4435b5727A83595a0443m19431A10015c46919F088J9210d16711b8066j31958
9563a60024A13511J6423a31087C9852J59629C0111J28563d6907C3456N0083a0721
9551f6306A9121h6995l8909n4100p8143a6477k74714b3652k33148b7481n0744
9540g8225j63783g8403l93678a52621H3902b75810d650C14692a53166q2258f7498
$$ plain form
9622 114163 20155 16162 -14863 -238428 -124610 75169 -121576 -251594 -17306 -74497 -122770
9611 -122770 47441 -4202 -64433 -116661 214870 47 48989 -264004 -752560 -310181 -255625 124054
9598 -192200 160627 16724 193869 -93808 -17048 -29629 86686 24883 -33566 16176 -288481
9586 -303610 -161880 -120712 84922 208115 76802 -8613 79957 -121340 3652 53444 -204765
9574 -54435 -25727 183595 -10443 -429874 110015 -346919 6088 25298 -416711 -28066 -160024
9563 -160024 113511 129934 -131087 39852 199481 30111 158674 -46907 33456 83539 -10721
9551 -66306 19121 -86995 -125904 -180004 -258147 -16477 -291191 -23652 -256800 -27481 -78225
9540 -78225 -242008 -78403 -472081 -152621 83902 -275810 -4650 314692 -153166 -235424 -67498
9528b02749m6411E3678P6586b9838j6835l3614A04922L5247D2712a47459A16428
9516b55879J04265J3234r3152e1811j433A02763P953E2452b31790O0488A62042
9504a22284l1406b9766D3707d5265j17750C75976c49474a20569o1595c0275k66346
9493b96621j41463D346a71533A7800J2209b0307G3587K31374c45584A05491b59340
9481c2365D9130c5335J0802j7116K189k09238e31n7252J1427k32607e5010A47409
9468c71054h3551m31148B71977b28102D3697J32401b24057B5232c09838a27543
9457a70322D0098f4852A87476b046j00155K5777D9146a30293K8353j74016c2461
9445A98642k9641G6474g5451C0390b37227J00959C4551q976a62681a7774j07255
$$ plain form
9528 -202749 -249160 53678 130264 -29838 -46673 -80287 104922 140169 42712 -147459 116428
9516 -255879 -151614 -138380 -231532 -51811 -53244 102763 110716 52452 -231790 -171302 162042
9504 -122284 -153690 -29766 43707 -45265 -163015 375976 -349474 -120569 -182164 -30275 -296621
9493 -296621 -438084 4346 -171533 17800 30009 -20307 73587 304961 -345584 105491 -259340
9481 -32365 49130 -35335 -24533 -41649 -39460 -248698 -531 -57783 -46356 -278963 -55010 147409
9468 -371054 -83551 -514699 271977 -228102 43697 176098 -224057 25232 -309838 -127543
9457 -170322 40098 -64852 187476 -2046 -102201 -76424 49146 -130293 -101940 -275956 -32461
9445 198642 169001 76474 -75451 30390 -237227 -136268 34551 25575 -162681 -17774 -125029
9434a25029I2320c23630e6284r8620q448O5358k1997k0846m3848F6530R0437b1495
9421C45237a07854d6886o6110j36160G2241Q074J29908a97141c4827j35946F5635
9409I6905b63198c8122H9028h8572b8280B15732a68867a2577A38239m7465O3996
9398A54770a11803A07449J1923b74942E3822a54334k62473a77868I8998a57278
9387d51288A21685c5974j47120P5616c4009j67035g5311F82834A08720b38762
9376c2900A06001c3504j35322A15341k5922b4873B52005b2037j35311k38455a43857
9364i6632j28288l529A2813a3844j00040k40191a5057j33180O077C8875c88619
9352a50390k824k86383C9187b26865A56390n6557b07064J059j83954J81150g6718
$$ plain form
9434 -125029 92320 -323630 -56284 -154904 -163352 -97994 -119991 -140837 -184685 66530 156967 -21495
9421 345237 -107854 -46886 -112996 -249156 72241 80315 210223 -197141 -34827 -170773 65635
9409 96905 -263198 -38122 89028 -88572 -28280 215732 -168867 -12577 138239 90774 154770
9398 154770 -111803 107449 119372 -274942 53822 -154334 -416807 -177868 98998 -157278
9387 -451288 121685 -35974 -183094 -107478 -34009 -201044 -75311 682834 108720 -238762
9376 -32900 106001 -33504 -168826 115341 89419 -24873 252005 -22037 -157348 -395803 -143857
9364 -96632 -224920 -228449 12813 -13844 -113884 -354075 -15057 -148237 -142160 38875 -388619
9352 -150390 -153214 -439597 39187 -226865 156390 99833 -207064 -206005 -389959 -208809 -76718
9340F8549d0626A70289A780J20103n2333i1867L5335j75470A88009p5751J328
9329A13586D793c03286N0117A35083a99763k0658j59639P0715B98982p0850a27717
9317a95600A9173b27649B50873G3555a80136a6681j7205j9774j09928L2354b4743
9305a23171M9681j3777j26396R7347j03602B97233a8168D6576c70927B12296f0321
9293b38984i8077A54023K3666k2869b78027C320O8984a37565k9273C8581b41170
9281a73857A05847k0688a59680c0908A23059L7632K8765q2828d0372K0000F1447
9269b81774F9619a54049N2606j82222A33890N0971E9617P732e0361c464k92239
9258b95703C57827j56699a95196p759C61564A50916p2755N4692o3015b48392d8693
$$ plain form
9340 68549 -40626 170289 1780 121883 69550 -91867 -56532 -232002 188009 112258 113586
9329 113586 4793 -303286 -253169 135083 -199763 -220421 -380060 -309345 298982 228132 -127717
9317 -195600 19173 -227649 250873 73555 -180136 -16681 -33886 -53660 -163588 -131234 -24743
9305 -123171 -73490 -87267 -213663 -116316 -219918 297233 -18168 46576 -370927 212296 -60321
9293 -238984 -98077 154023 177689 154820 -278027 3320 72304 -137565 -166838 38581 -241170
9281 -173857 105847 85159 -159680 -30908 123059 160691 189456 106628 -40372 -20372 61447
9269 -281774 69619 -154049 -101443 -283665 133890 184861 59617 67349 -50361 -3464 -295703
9258 -295703 357827 201128 -195196 -202955 361564 150916 78161 132853 69838 -248392 -48693
9246h239A86883l5601a20040j76450a21626N770j13985M8764P5969A08120B2665
9234A20063a23174K8157a6904n0653m174G0131a00455j70981j30450G8860g4472
9222a38671D0780N9721O5417F7592Q2488b1327j835j76738M9922A25284N8491
9211A83775c004D8778b84563a8407j47420D9803a72974C60331A5328d6861j06299
9200a53160M677k07135B64887A0573f19676A72547b70852L3597b6252K635k35394
9189b59011P1949d1807n24888A03397f0806j82786p6554F6593d047F7777l0720
9178C7057c25448h1586G972L0654B888b61981K7635A0894c4244m45721C08486
9166B19886a12246o6288j54824B8164P6837i2724E736a31462C21477D4758b78624
$$ plain form
9246 -8239 186883 151282 -120040 -296490 -121626 -115856 -229841 -181077 -105108 108120 22665
9234 120063 -123174 -95017 -16904 -67557 -71731 70131 -100455 -271436 -401886 78860 -74472
9222 -138671 40780 100501 165918 67592 150080 -21327 -23162 -199900 -149978 125284 183775
9211 183775 -3004 48778 -284563 -18407 -165827 49803 -172974 360331 15328 -46861 -153160
9200 -153160 -148483 -355618 264887 10573 -619676 172547 -270852 -237255 -26252 -23617 -259011
9189 -259011 -187062 -41807 -566695 103397 -60806 -243592 -320146 66593 -4047 67777 37057
9178 37057 -325448 -81586 7972 38626 2888 -261981 -234346 10894 -34244 -479965 308486
9166 219886 -112246 -178534 -333358 28164 105001 -92724 5736 -131462 321477 44758 -278624
9154f4268A26579a43323k1614H2142c13502a4529q1210l12631H5720i587B53155
9142G3204a82654j4877q818p9494k7442q9230E6977h5255j68108E4336j6401c10821
9129A20435a22004C474b9437l15249A16957L6917F4196J13457A9519N8517e2937
9117c58570J74417g1138L0972m8837M2430j65495e9702B906a24201j21656j3983
9106b59840e9694B4787J05166K98140I7655c23401i0449A17470b81971J39484
9096a42487B47554b1326C60186b54858q3473A83613D1725b18711A18649c04830
9085H6172d95490B79465b62673h2326j9641o5076L5315B64308j00668l1653b40406
9073a96961E8420J79437o5758g8057Q586a7890l43253J67846b7976A10204c2852
$$ plain form
9154 -64268 126579 -143323 -164937 82142 -313502 -14529 -95739 -408370 85720 -9587 253155
9142 73204 -182654 -197531 -206349 -285843 -313285 -402515 56977 -85255 -253363 54336 37935 -310821
9129 120435 -122004 3474 -29437 -344686 116957 153874 64196 177653 19519 78036 -52937
9117 -358570 -184153 -71138 -40166 -89003 -46573 -212068 -59702 2906 -124201 -245857 -259840
9106 -259840 -59694 24787 129953 428093 97655 -323401 -90449 117470 -281971 -142487
9096 -142487 247554 -21326 360186 -254858 -338331 183613 41725 -218711 118649 -304830
9085 86172 -495490 279465 -262673 -82326 -101967 -167043 -131728 264308 163640 131987 -240406
9073 -196961 58420 237857 172099 -78057 -69471 -17890 -361143 -193297 -27976 110204 -32852
9061b09665J00982p666E6980B2316a52595B68493J66999b260j34484M9576j36654
9050b23822B76005h4596I3439J00286c1007D9973c70979C66017g6883j95341J9222
9039b53002B12945a98877L8761O2213L3813p9566A93726b75652M2329C7173N1540
9028H8713a98185i0095A26635f8420D1999b03732C6693a81618l14234b7768E7725
9016g2326A55889c40929a05413d2352J6181F983i9389g109F3455J05875a0147
9004D0924A6401a8175k10528D5859J84482I6731d6071A04399J73128a05557A60484
8992h7517L2647A8434M3783J30993b19096c4958j6194I7669Q6321D662a30229
8980B27567E1228c8887m1585p3181N7866A936d9031j0536l17288J00012g601L744
$$ plain form
9061 -209665 -108683 -116349 56980 22316 -152595 268493 435492 -2260 -136744 -87168 -223822
9050 -223822 276005 -84596 93439 193725 -31007 49973 -370979 366017 -76883 -272224 -253002
9039 -253002 212945 -198877 -160116 -97903 -64090 -143656 193726 -275652 -233323 37173 88713
9028 88713 -198185 -90095 126635 -68420 41999 -203732 36693 -181618 -495852 -27768 57725
9016 -72326 155889 -340929 -105413 -42352 -26171 6983 -99389 -7109 63455 169330 -10147
9004 40924 16401 -18175 -228703 45859 230341 96731 -46071 104399 277527 -105557 160484
8992 -87517 -54870 18434 62217 193210 -219096 -34958 -51152 97669 183990 4662 -130229
8980 227567 51228 -38887 -80472 -153653 -95787 1936 -49031 -59567 -376855 -276843 -7601 -3857
8968c857B33415G7129a87966a5836A05852a77979A38808i5819A49144E2526J28696
8957A81222p6190d1205A34485e8784G7379c37860J15702F06J06229e6919A12029
8945c9434A760b79847a00861l1420A16326B013P7282M7912a17456r6055l5229
8934b48740B18448i9683a2530G00b77250c6902B23789o6034a91708A30898b27812
8922A61237c01610h9865j95149C33139N74170D10209A6344c3355r1818l02885
8912d28058a42460m4363D8581Q8912f3799n9690b7738j7442k65058N1868f4917
8900b63399e3197a4742p2343A24892b8867r7400C41814a25793a0792A74933a55818
8888a00325p6593c0502o8390l0297b2575A68202J72406c1254l42694A00083D8024
$$ plain form
8968 -3857 233415 77129 -187966 -15836 105852 -177979 138808 -95819 149144 52526 181222
8957 181222 105032 -41205 134485 -58784 77379 -337860 -222158 606 106835 -56919 112029
8945 -39434 1760 -279847 -100861 -132281 116326 2013 79295 127207 -117456 -213511 -248740
8934 -248740 218448 -99683 -12530 700 -277250 -36902 223789 157755 -191708 130898 -227812
8922 161237 -301610 -89865 -285014 333139 907309 410209 16344 -33355 -125173 -428058
8912 -428058 -142460 -186823 48581 137493 -63799 -123489 -27738 -45180 -310238 -258370 -64917
8900 -263399 -53197 -14742 -87085 124892 -28867 -126267 341814 -125793 -10792 174933 -155818
8888 -100325 -176918 -30502 -98892 -129189 -22575 168202 340608 -31254 -373948 100083 48024
8876b25325i8882M5824A88590a11074A48821B9972O15744B7450j3711K35247a02298
8864B04123r6570D5597R2429m4619f3957A3471b0082m93389a65302j48773g0638
8852a06370j85190a6178F8601a55106L5486c5721q8175B71932a96546A35826A9447
8840b98147a43897A04920c52058d4845j66599A96050d0616p9826B7324L1670b3318
8828c28523J38838q7688B951i4320M0976D3551a09844j06936Q4993p958A49206
$$ plain form
8876 -225325 -98882 -53058 188590 -111074 148821 29972 645716 27450 13739 248986 -102298
8864 204123 107553 45597 138026 93407 -63957 13471 -20082 -513471 -165302 -314075 -70638
8852 -106370 -291560 -16178 68601 -155106 -119620 -35721 -123896 271932 -196546 135826 19447
8840 -298147 -143897 104920 -352058 -44845 -211444 196050 -40616 -120442 27324 58994 -23318
8828 -328523 -189685 -277373 2951 -94320 -53344 43551 -109844 -216780 -131787 -139745 149206
$$ [...]
##END NTUPLES=NMR SPECTRUM
##END=
