##TITLE=NES1028_10332_9268290_OmHLmCDfxT
##JCAMPDX= 6.0         $$ Bruker NMR JCAMP-DX V2.0
##DATA TYPE= NMR SPECTRUM
##DATA CLASS= NTUPLES
##ORIGIN= BRUKER
##OWNER= Administrator
$$ 1.72 TOPSPIN		Version 2.1
$$ 2015-07-11 21:20:44.441 -0700  Administrator@X
$$ Compression mode = diff/dup
##.OBSERVE FREQUENCY= 400.02188249412
##.OBSERVE NUCLEUS= ^1H
##.ACQUISITION MODE= SIMULTANEOUS (DQD)
##.ACQUISITION SCHEME= undefined
##.AVERAGES= 64
##.DIGITISER RES= 22
##SPECTROMETER/DATA SYSTEM= spect
##.PULSE SEQUENCE= noesygpps1d.comp
##.SOLVENT NAME= COFFEE_meoh
##.SHIFT REFERENCE= INTERNAL, COFFEE_meoh, 1, 14.96332
##AUDIT TRAIL= $$ (NUMBER, WHEN, WHO, WHERE, PROCESS, VERSION, WHAT)
$$ ##TITLE= Audit trail, TOPSPIN		Version 2.1
$$ ##JCAMPDX= 5.01
$$ ##ORIGIN= Bruker BioSpin GmbH
$$ ##OWNER= Administrator
$$ $$ E:\/data/COFFEE/nmr/NES1028_10332_9268290_OmHLmCDfxT/22/pdata/1/auditp.txt
$$ ##AUDIT TRAIL=  $$ (NUMBER, WHEN, WHO, WHERE, PROCESS, VERSION, WHAT)
(   1,<2015-07-11 21:20:39.410 -0700>,<Administrator>,<X>,<go>,<TOPSPIN 2.1>,
      <created by zg
	started at 2015-07-11 21:09:09.738 -0700,
	POWCHK enabled, PULCHK disabled,
       configuration hash MD5:
       21 0F 79 D6 B3 7B B4 F6 88 20 88 DB 03 48 BD 9F
       data hash MD5: 64K
       85 97 96 61 4F 2B BE 70 12 4E B7 4B E7 BC 7E 4F>)
(   2,<2015-07-11 21:20:42.597 -0700>,<Administrator>,<X>,<proc1d>,<TOPSPIN 2.1>,
      <Start of raw data processing
       efp LB = 0.3 FT_mod = 6 PKNL = 1 PHC0 = 0 PHC1 = 0 SI = 128K 
       data hash MD5: 128K
       0E ED DE 16 39 B2 4F 18 A8 EE 20 CD 97 9F F2 D4>)
(   3,<2015-07-11 21:20:43.503 -0700>,<Administrator>,<X>,<proc1d>,<TOPSPIN 2.1>,
      <pk PHC0 = -85.46265 PHC1 = 0 
       data hash MD5: 128K
       9E F1 12 D3 8E 80 60 C6 58 74 1B 5B 00 94 7E 39>)
(   4,<2015-07-11 21:20:43.910 -0700>,<Administrator>,<X>,<proc1d>,<TOPSPIN 2.1>,
      <abs ABSG = 1 
       data hash MD5: 128K
       1E 0B CF C3 B1 DC D5 15 4F 5D F3 50 17 15 E7 44>)
(   5,<2015-07-11 21:20:44.019 -0700>,<Administrator>,<X>,<proc1d>,<TOPSPIN 2.1>,
      <abs ABSG = 2 
       data hash MD5: 128K
       DC 1B 0E E8 47 2C 18 ED 73 B6 40 FD ED 3C F3 F2>)
(   6,<2015-07-11 21:20:44.097 -0700>,<Administrator>,<X>,<proc1d>,<TOPSPIN 2.1>,
      <abs ABSG = 3 
       data hash MD5: 128K
       0D 86 F8 9A FA 6C 25 9B 8C D1 75 19 7E 70 0F 40>)
(   7,<2015-07-11 21:20:44.191 -0700>,<Administrator>,<X>,<proc1d>,<TOPSPIN 2.1>,
      <abs ABSG = 4 
       data hash MD5: 128K
       58 01 16 71 3D 63 77 60 8C 0D 10 19 C5 05 0A EB>)
(   8,<2015-07-11 21:20:44.269 -0700>,<Administrator>,<X>,<proc1d>,<TOPSPIN 2.1>,
      <abs ABSG = 5 
       data hash MD5: 128K
       2E AE 8F 38 69 04 E7 A8 E7 AD 61 6D 00 D4 4E 7E>)
$$ ##END=
$$ 
$$ $$ hash MD5
$$ $$ A2 21 A3 8C 0C 1D 0F CC 31 B9 C7 8E 83 9F 5B 2A
##$RELAX= 
##$RELAX= 
##$RELAX= 
##$RELAX= 
##$RELAX= 
##$RELAX= 
##$RELAX= 
##$RELAX= 
$$ Bruker specific parameters
$$ --------------------------
##$DU= <E:\>
##$EXPNO= 22
$$ [...]
##$TP07= 0
##$TPNAME0= <>
##$TPNAME1= <>
##$TPNAME2= <>
##$TPNAME3= <>
##$TPNAME4= <>
##$TPNAME5= <>
##$TPNAME6= <>
##$TPNAME7= <>
##$TPOAL= (0..7)
0.5 0.5 0.5 0.5 0.5 0.5 0.5 0.5
##$TPOFFS= (0..7)
0 0 0 0 0 0 0 0
##$TUNHIN= 0
##$TUNHOUT= 0
##$TUNXOUT= 0
##$USERA1= <user>
##$USERA2= <user>
##$USERA3= <user>
##$USERA4= <user>
##$USERA5= <user>
##$V9= 5
##$VALIST= <valist>
##$VCLIST= <CCCCCCCCCCCCCCC>
##$VD= 0
##$VDLIST= <DDDDDDDDDDDDDDD>
##$VPLIST= <PPPPPPPPPPPPPPP>
##$VTLIST= <TTTTTTTTTTTTTTT>
##$WBST= 2048
##$WBSW= 25
##$XGAIN= (0..3)
0 0 0 0
##$XL= 0
##$YL= 0
##$YMAX_a= 6689320
##$YMIN_a= -14236307
##$ZGOPTNS= <>
##$ZL1= 120
##$ZL2= 120
##$ZL3= 120
##$ZL4= 120
##$ABSF1= 14.96332
##$ABSF2= -5.594862
##$ABSG= 5
##$ABSL= 3
##$ALPHA= 0
##$AQORDER= 0
##$ASSFAC= 0
##$ASSFACI= 0
##$ASSFACX= 0
##$ASSWID= 0
##$AUNMP= <proc_prof1d_extract.lims>
##$AXLEFT= 0
##$AXNAME= <>
##$AXNUC= <1H>
##$AXRIGHT= 0
##$AXTYPE= 0
##$AXUNIT= <>
##$AZFE= 0.1
##$AZFW= 0.1
##$BCFW= 0
##$BC_mod= 0
##$BYTORDP= 0
##$COROFFS= 0
##$CY= 15
##$DATMOD= 1
##$DC= 0
##$DFILT= <>
##$DTYPP= 0
##$F1P= 0
##$F2P= 0
##$FCOR= 0.5
##$FTSIZE= 131072
##$FT_mod= 6
##$GAMMA= 0
##$GB= 0
##$INTBC= 1
##$INTSCL= 1
##$ISEN= 128
##$LB= 0.3
##$LEV0= 0
##$LPBIN= 0
##$MAXI= 10000
##$MC2= 0
##$MEAN= 0
##$ME_mod= 0
##$MI= 0
##$NCOEF= 0
##$NC_proc= -2
##$NLEV= 6
##$NOISF1= 0
##$NOISF2= 0
##$NSP= 0
##$NTH_PI= 0
##$NZP= 0
##$OFFSET= 14.96332
##$PC= 1
##$PHC0= -85.46265
##$PHC1= 0
##$PH_mod= 1
##$PKNL= yes
##$PPARMOD= 0
##$PPDIAG= 0
##$PPIPTYP= 0
##$PPMPNUM= 2147483647
##$PPRESOL= 1
##$PSCAL= 4
##$PSIGN= 0
##$PYNMP= <proc.py>
##$REVERSE= no
##$SF= 400.020008707862
##$SI= 131072
##$SIGF1= 0
##$SIGF2= 0
##$SINO= 400
##$SIOLD= 131072
##$SPECTYP= <>
##$SREGLST= <1H.CDCl3>
##$SSB= 0
##$STSI= 131072
##$STSR= 0
##$SW_p= 8223.68421052631
##$SYMM= 0
##$S_DEV= 0
##$TDeff= 65536
##$TDoff= 0
##$TI= <>
##$TILT= no
##$TM1= 0
##$TM2= 0
##$TOPLEV= 0
##$USERP1= <user>
##$USERP2= <user>
##$USERP3= <user>
##$USERP4= <user>
##$USERP5= <user>
##$WDW= 1
##$XDIM= 131072
##$YMAX_p= 399032393
##$YMIN_p= -10435
##$CURPLOT= <Network HP LaserJet P1505>
##$CURPRIN= <$Network HP LaserJet P1505>
##$DFORMAT= <normdp>
##$LAYOUT= <+/1D_H.xwp>
##$LFORMAT= <normlp>
##$PFORMAT= <normpl>
##$SURQMSG= 1
$$ End of Bruker specific parameters
$$ ---------------------------------
##NTUPLES= NMR SPECTRUM
##VAR_NAME=  FREQUENCY,     SPECTRUM/REAL,   SPECTRUM/IMAG
##SYMBOL=    X,             R,               I
##VAR_TYPE=  INDEPENDENT,   DEPENDENT,       DEPENDENT
##VAR_FORM=  AFFN,          ASDF,            ASDF
##VAR_DIM=   131072,        131072,          131072
##UNITS=     HZ,            ARBITRARY UNITS, ARBITRARY UNITS
##FACTOR=    0.0627417313425164, 1,          1
##FIRST=     8223.62146879497, 141,          -48330
##LAST=      0,             1929,            -48706
##MIN=       0,             -10435,          0
##MAX=       8223.62146879497, 399032393,    0
$$ Real data points
##PAGE= N=1
##DATA TABLE= (X++(R..R)), XYDATA
$$ [...]
63343D16397j4309j3282j1891j0660r819r021q091p363o930o258n130m300m406
$$ 416397 402088 388806 376915 366255 356436 347415 339324 331961 325031 318773 313643 309343 304937
63330C04937m795m293k862j543j007r87j103j247j136l92P18J311R82K90jL35
$$ 304937 300142 295849 292987 291444 290437 289450 288347 287100 285964 285572 286290 287601 288583 288873 288872 289207
63314B89207J201K429L541L753K784J361N72P95J409J459M95j050k255k548k178
$$ 289207 290408 292837 296378 300131 302915 304276 304848 305643 307052 308511 309006 307956 305701 303153 300975
63299C00975j746j501j314j104q73m94R2N80O90O94J038J500J413P15K15N51J425
$$ 300975 299229 297728 296414 295310 294437 293943 294035 294615 295305 295999 297037 298537 299950 300665 300880 301431 302856
63282C02856K072K079J524P89L63M96Q76R71P24N44N25L04k67p77q55n92j88K97
$$ 302856 304928 307007 308531 309320 309683 310179 311055 312026 312750 313294 313819 314123 313856 313079 312224 311632 311444 311741
63264C11741P06P83O89R85J767K348K163J539J181J274J566J932K391K794K978
$$ 311741 312447 313230 313919 314904 316671 319019 321182 322721 323902 325176 326742 328674 331065 333859 336837
63249C36837L039L108L092K987L128L752M529M998N303O005P294Q819J0274J1669
$$ 336837 339876 342984 346076 349063 352191 355943 360472 365470 370773 376778 384072 392891 403165 414834
63235D14834J2977J3907J4249J4261J4551J5552J7094J8452J8898J8280J7035
$$ 414834 427811 441718 455967 470228 484779 500331 517425 535877 554775 573055 590090
63224E90090J5746J4783J4394J4695J5459J6158J6420J6355J6332J6549J6901
$$ 590090 605836 620619 635013 649708 665167 681325 697745 714100 730432 746981 763882
63213G63882J7147J7141J6958J6664J5849J3692R918N424J361k350o790j2274
$$ 763882 781029 798170 815128 831792 847641 861333 871251 876675 878036 875686 868896 856622
63201H56622j7612k1503k3916k5559k6599k6658k5677k4076k2149j9866j7239
$$ 856622 839010 817507 793591 768032 741433 714775 689098 665022 642873 623007 605768
63190F05768j4514j1944r605p341m829j937Q87K989M416N981Q146J0371J1954
$$ 605768 591254 579310 569705 562364 557535 555598 556485 559474 563890 569871 578017 588388 600342
63177F00342J2969J3866J4656J5177J5703J6535J7238J7129J6391J5895J5932
$$ 600342 613311 627177 641833 657010 672713 689248 706486 723615 740006 755901 771833
63166G71833J5889J5326J4581J4025J3333J1881R495O451K974r66n460j0414j5346
$$ 771833 787722 803048 817629 831654 844987 856868 866363 872814 875788 874822 869362 858948 843602
63153H43602j9456k2057k3126k3242k3027k2729k2275k1508k0342j8881j7319
$$ 843602 824146 802089 778963 755721 732694 709965 687690 666182 645840 626959 609640
63142F09640j5688j3874j2014j0592r811r133p816n853l978k864k600k766k677
$$ 609640 593952 580078 568064 557472 547661 538528 530712 524859 520881 518017 515417 512651 509974
63129E09974j732K3J714K501K533K606L027L356L325L294L610M020M081L819L660
$$ 509974 508242 508265 509979 512480 515013 517619 520646 524002 527327 530621 534231 538251 542332 546151 549811
63114E49811L855M227M372M039L409K920K695K297J363K43m18o22q67j105o55
$$ 549811 553666 557893 562265 566304 569713 572633 575328 577625 578988 579231 578813 578191 577324 576219 575564
63099E75564N73J495J086k76j328j461j139r47r20r01r83j227j301p20N36J917
$$ 575564 576137 577632 578718 578442 577114 575653 574514 573567 572647 571746 570763 569536 568235 567515 568051 569968
63083E69968K815L097L125L336L889M637N342N827O073O165O216O285O448O901
$$ 569968 572783 575880 579005 582341 586230 590867 596209 602036 608109 614274 620490 626775 633223 640124
63069F40124P790Q866R547R486Q998Q757R148J0113J1358J2551J3424J4081J5105
$$ 640124 647914 656780 666327 675813 684811 693568 702716 712829 724187 736738 750162 764243 779348
63056G79348J6965J9300K1182K2223K3099K4744K7276K9974L2186L3951L5684
$$ 779348 796313 815613 836795 859018 882117 906861 934137 964111 996297 1030248 1065932
63045A065932L7521L9138M0182M0656M0777M0602M0037L9186L8483L8261L8409
$$ 1065932 1103453 1142591 1182773 1223429 1264206 1304808 1344845 1384031 1422514 1460775 1499184
63034A499184L8629L8852L9275L9959M0528M0291L8666L5611L1588K6872K1056
$$ 1499184 1537813 1576665 1615940 1655899 1696427 1736718 1775384 1810995 1842583 1869455 1890511
63023A890511J3554M548n029j4544k4108l3686m2394m9238n4039n7134n8485n7882
$$ 1890511 1904065 1908613 1903584 1889040 1864932 1831246 1788852 1739614 1685575 1628441 1569956 1512074
63011A512074n5659n2525m8752m4268l9447l4981l0901k6462k1220j5637j0366
$$ 1512074 1456415 1403890 1355138 1310870 1271423 1236442 1205541 1179079 1157859 1142222 1131856
63000A131856n587j210K741O327R738J2869J5322J7084J8702K0464K1867K2376
$$ 1131856 1126269 1125059 1127800 1134127 1143865 1156734 1172056 1189140 1207842 1228306 1250173 1272549
62988A272549K2287K2310K2561K2531K1897K0830J9564J8105J6442J4629J2442
$$ 1272549 1294836 1317146 1339707 1362238 1384135 1404965 1424529 1442634 1459076 1473705 1486147
62977A486147R192M217k468j0054j7545k4451l0854l6867m2242m6597m9776n1774
$$ 1486147 1495339 1499556 1497088 1487034 1469489 1445038 1414184 1377317 1335075 1288478 1238702 1186928
62965A186928n2450n1701m9796m7216m4239m0959l7638l4574l1694k8754k5921
$$ 1186928 1134478 1082777 1032981 985765 941526 900567 862929 828355 796661 767907 741986
62954G41986k3667k1964k0239j8283j6585j5448j4373j2812j1076r929r573r548
$$ 741986 718319 696355 676116 657833 641248 625800 611427 598615 587539 577610 568037 558489
62942E58489r484r370r217q900q356p626o758n967n700o221p100p574p350o745
$$ 558489 549005 539635 530418 521518 513162 505536 498778 492811 487111 480890 473790 466216 458866 452121
62928D52121o062n264m379l848m128n021n655n268l957k615k047k198k413k272
$$ 452121 446059 440795 436416 432568 428440 423419 417764 412496 408539 405924 403877 401679 399266 396994
62914C96994j946j713j589j539j612j635j205l54J43l66j500k298k451k427k535
$$ 396994 395048 393335 391746 390207 388595 386960 385755 385401 385544 385178 383678 381380 378929 376502 373967
62899C73967k489k106j777j970k662l533m338m780m426l267k089j786k283k651
$$ 373967 371478 369372 367595 365625 362963 359430 355092 350312 345886 342619 340530 338744 336461 333810
62885C33810k343j885k074k808l149k522j440q62j074j502j565j306j109j061
$$ 333810 331467 329582 327508 324700 321551 319029 317589 316727 315653 314151 312586 311280 310171 309110
62871C09110r52p31o20o65n48J0P80J247J176Q26O03P27J165J670J843J430P01
$$ 309110 308158 307427 306807 306142 305594 305604 306384 307631 308807 309633 310236 310963 312128 313798 315641 317071 317772
62854C17772L44P44J490J857J710J615K028K693K999K658J837Q36m8n24m66j19
$$ 317772 318116 318860 320350 322207 323917 325532 327560 330253 333252 335910 337747 338583 338535 338011 337545 337426
62838C37426Q9Kk11m14p14j243j872k314k413k309k262k366k439k231j724j186
$$ 337426 337515 337517 337306 336892 336178 334935 333063 330749 328336 326027 323765 321399 318960 316729 315005 313819
62822C13819q13n19r8M64R98J328J347J013M87J53L03Q54J492K005K295K272K007
$$ 313819 313006 312487 312389 312853 313851 315179 316526 317539 318026 318179 318482 319336 320828 322833 325128 327400 329407
62805C29407J940K569L855N163N881N983N912O053O353O512O489O737P743R346
$$ 329407 331347 333916 337771 342934 348815 354798 360710 366763 373116 379628 386117 392854 400597 409943
62791D09943J0920J2309J4103J6661J9294K1142K2548K4834K8646L3193L7243
$$ 409943 420863 433172 447275 463936 483230 504372 526920 551754 580400 613593 650836
62780F50836M0470M3510M7148N1629N6503O1010O4803O8232P1586P4192P4827
$$ 650836 691306 734816 781964 833593 890096 951106 1015909 1084141 1155727 1229919 1304746
62769A304746P3051O9465O4542N7893M9081L8500K6916J4583J449j1997k4705
$$ 1304746 1377797 1447262 1511804 1569697 1618778 1657278 1684194 1698777 1700226 1688229 1663524
62758A663524l5857m5359n3472o0252o5368o8433o9495o9190o8132o6337o3556
$$ 1663524 1627667 1582308 1528836 1468584 1403216 1334783 1265288 1196098 1127966 1061629 998073
62747I98073o0074n6573n3204m9506m5435m1651l8418l5038l1058k7284k4691
$$ 998073 937999 881426 828222 778716 733281 691630 653212 618174 587116 559832 535141
62736E35141k2867k0623j7811j5461j4137j3255j2157j0942r867q724p311n914
$$ 535141 512274 491651 473840 458379 444242 430987 418830 407888 398021 389297 381986 376072
62724C76072m864m080l367k740k132j250j20O41O43M02P85J971L464M887O258
$$ 376072 371208 367128 363761 361021 358889 357639 357519 358160 358803 359205 359990 361961 365425 370312 376570
62709C76570P599Q814J0032J1617J3714J6091J8449K0698K2914K5334K8342L2111
$$ 376570 384169 392983 403015 414632 428346 444437 462886 483584 506498 531832 560174 592285
62697E92285L6236M0062M3429M6688M9912N2558N4088N4573N4297N3169N0799
$$ 592285 628521 668583 712012 758700 808612 861170 915258 969831 1024128 1077297 1128096
62686A128096M6835M0939L2854K3075J2980L606n552j5590k6160l5288m1532m5417
$$ 1128096 1174931 1215870 1248724 1271799 1284779 1288385 1282833 1267243 1241083 1205795 1164263 1118846
62674A118846m8348n0866n2645n3455n3206n1505m8167m4046m0506l7922l5462
$$ 1118846 1070498 1019632 966987 913532 860326 808821 760654 716608 676102 638180 602718
62663F02718l2393k8996k5976k3581k1607j9833j8143j6486j4933j3612j2478
$$ 602718 570325 541329 515353 491772 470165 450332 432189 415703 400770 387158 374680
62652C74680j1390j0324r301q121o661n373m992n567o199n983m861l512k705k785
$$ 374680 363290 352966 343665 335544 328883 323510 318518 312951 306752 300769 295908 292396 289691 286906
62638B86906l447l909l684l169l077l346l181k295j416j282j742k180k311k086
$$ 286906 283459 279550 275866 272697 269620 266274 263093 260798 259382 258100 256358 254178 251867 249781
62624B49781j456o41k63o22j122r53j35O17R14J103J677K629L484L775L587L594
$$ 249781 248325 247684 247421 246799 245677 244724 244589 245206 246120 247223 248900 251529 255013 258788 262375 265969
62608B65969M333N470O108N970N789O321P516R006J0793J3002J5294J7252J9039
$$ 265969 270302 275772 281880 287850 293639 299960 307476 316482 327275 340277 355571 372823 391862
62595C91862K1109K3500K5963K8567L1513L4397L6388L7210L7384L7292L6519
$$ 391862 412971 436471 462434 491001 522514 556911 593299 630509 667893 705185 741704
62584G41704L4450L1089K6856K1870J5887Q985J957m325r720j4733j9596k3872
$$ 741704 776154 807243 834099 855969 871856 880841 882798 878473 868753 854020 834424 810552
62572H10552k7148k9654l1759l3120l3030l1522k9470k7589k5923k4393k3077
$$ 810552 783404 753750 721991 688871 655841 624319 594849 567260 541337 516944 493867
62561D93867k1774k0004j7840j6030j4960j4128j3121j2347j2212j2193j1569
$$ 493867 472093 452089 434249 418219 403259 389131 376010 363663 351451 339258 327689
62550C27689j0510r652q933p789o283n170m832m806m429l506k339j482j347j655
$$ 327689 317179 307527 298594 290805 284522 279352 274520 269714 265285 261779 259440 257958 256611 254956
62536B54956j500m05R79J707J745J765K061K423K875L746M936N855O200O315O677
$$ 254956 253456 253051 254030 255737 257482 259247 261308 263731 266606 270352 275288 281143 287343 293658 300335
62521C00335P508Q831J0480J2051J3275J4414J5864J7548J9172K0886K3054K5452
$$ 300335 307843 316674 327154 339205 352480 366894 382758 400306 419478 440364 463418 488870
62509D88870K7324K8317K8773K9046K9003K8256K6462K3436J9332J4652R673M126
$$ 488870 516194 544511 573284 602330 631333 659589 686051 709487 728819 743471 753144 757270
62497G57270k060p956j2421j5572j8614k2050k4942k6252k6204k5741k5198k4088
$$ 757270 755210 747254 734833 719261 700647 678597 653655 627403 601199 575458 550260 526172
62485E26172k2032j9428j7071j5341j3938j2527j1374j0942j0870j0076q164o073
$$ 526172 504140 484712 467641 452300 438362 425835 414461 403519 392649 382573 374409 368336
62473C68336m790m095l275k451k169k173j729r15m34k01O27K107L176L184K751
$$ 368336 363546 359451 356176 353725 351556 349383 347654 346739 346305 346104 346731 348838 352014 355198 357949
62458C57949K642K748K662K454K339K201J970J915K087J935R47p20k511m046n201
$$ 357949 360591 363339 366001 368455 370794 372995 374965 376880 378967 380902 381849 381129 378618 374572 369371
62443C69371o073o983q110q998q934p886o554n502m824m592m835m959m107k374
$$ 369371 363298 356315 348205 339207 330273 322387 315833 310331 305507 300915 296080 291121 287014 284640
62429B84640q80k69LN68J212J566J974K955M318N389N816N683N227M831M898N451
$$ 284640 283760 283491 283494 284062 285274 286840 288814 291769 296087 301476 307292 312975 318202 323033 327931 333382
62413C33382O124O726P286P513O872N470M141L322K559J469M38j24n11j118j718
$$ 333382 339506 346232 353518 361031 367903 373373 377514 380836 383395 384864 385302 385178 384667 383549 381831
62398C81831j980k146k572k998k934k431j993j929k163k441k415j816p13O49K254
$$ 381831 379851 377705 375133 372135 369201 366770 364777 362848 360685 358244 355829 354013 353300 353949 356203
62383C56203M081N609O325O742P984J0242J2600J4662J7115K0328K3489K5860
$$ 356203 360284 365893 372218 378960 386944 397186 409786 424448 441563 461891 485380 511240
62371E11240K7821K9947L2042L3804L5506L7148L7925L7359L6022L4204L0970
$$ 511240 539061 569008 601050 634854 670360 707508 745433 782792 818814 853018 883988
62360H83988K5625J9118J2770O496k24o501j0858j3392j5514j7771j9588k0932
$$ 883988 909613 928731 941501 947997 947773 941272 930414 917022 901508 883737 864149 843217
62348H43217k2602k4694k6254k6782k6830k6787k6179k4540k2109j9364j6613
$$ 843217 820615 795921 769667 742885 716055 689268 663089 638549 616440 597076 580463
62337E80463j4228j2460j0980r299p633o577o007n278m376l902l879l645k928
$$ 580463 566235 553775 542795 533496 525863 519286 513279 508001 503625 499723 495844 492199 489271
62324D89271k102j288k76O08O64J06m2L88L38p85k145k884l370m256n164n250
$$ 489271 487169 485881 485605 486213 486877 486983 486941 487329 487667 486882 484737 481853 478483 474227 469063 463813
62308D63813m524l805l637l921m237m072l022j325O3L17l73j037p91N49K355L604
$$ 463813 459289 455484 451847 447926 443689 439617 436595 435270 435333 435650 435277 434240 433449 433998 436353 439957
62292D39957L737L234K928K860K435J696J549K468L712M333M291M144M232M647
$$ 439957 443694 446928 449856 452716 455151 456847 458396 460864 464576 468909 473200 477344 481576 486223
62278D86223N603P180Q982J0474J1572J2596J3924J5893J8674K1933K4930K7229
$$ 486223 491826 499006 507988 518462 530034 542630 556554 572447 591121 613054 637984 665213
62266F65213K9073L0828L2398L3484L4043L4164L3590L1787K8441K3777J8398
$$ 665213 694286 725114 757512 790996 825039 859203 892793 924580 953021 976798 995196
62255I95196J2863P327J711l756q443j2044j5046j8037k0787k2611k3440k3851
$$ 995196 1008059 1015386 1017097 1013341 1004898 992854 977808 959771 938984 916373 892933 869082
62243H69082k4161k4154k3625k2550k0737j8113j5340j3307j1937j0318q101n914
$$ 869082 844921 820767 797142 774592 753855 735742 720402 707095 695158 684840 676739 670825
62231F70825m204k660j150k30j86l90j66L42O77Q04Q87R47J152J826K721L052
$$ 670825 666621 663961 662811 662581 662395 662005 661839 662181 662858 663662 664549 665496 666648 668474 671195 674247
62215F74247K661K377K789L529M300N539P260Q341Q127P854R152J1691J3775J4867
$$ 674247 676908 679285 682074 685603 689903 695442 702702 711043 719170 727024 736176 747867 761642 776509
62201G76509J6077J8152K0498K2417K4143K6069K7925K9183K9615K9122K7510
$$ 776509 792586 810738 831236 853653 877796 903865 931790 960973 990588 1019710 1047220
62190A047220K4869K1574J7724J3131Q156L948J421M00J77N40J727L653N779P781
$$ 1047220 1072089 1093663 1111387 1124518 1132674 1136622 1138043 1138443 1138620 1139160 1140887 1144540 1150319 1158100
62176A158100R996J2940J6538K0090K2915K4807K5651K4947K2273J8205J4176
$$ 1158100 1168096 1181036 1197574 1217664 1240579 1265386 1291037 1315984 1338257 1356462 1370638
62165A370638J1152Q923O907N163M055L424K677J529Q2j574l313m671n187m956
$$ 1370638 1381790 1390713 1397620 1402783 1406838 1410262 1412939 1414468 1414550 1412976 1409663 1404992 1399805 1394849
62151A394849m311l174j317Q48K543L739N201P261R202J0268J0642J1037J1764
$$ 1394849 1390538 1387364 1386047 1386895 1389438 1393177 1398378 1405639 1414841 1425109 1435751 1446788 1458552
62138A458552J2672J3623J4544J5233J5563J5800J6339J7156J7863J8336J8949
$$ 1458552 1471224 1484847 1499391 1514624 1530187 1545987 1562326 1579482 1597345 1615681 1634630
62127A634630K0076K1503K2547K2788K2526K2458K2936K3682K4239K4493K4588
$$ 1634630 1654706 1676209 1698756 1721544 1744070 1766528 1789464 1813146 1837385 1861878 1886466
62116A886466K4639K4715K5015K5648K6331K6663K6749K7233K8535L0198L1291
$$ 1886466 1911105 1935820 1960835 1986483 2012814 2039477 2066226 2093459 2121994 2152192 2183483
62105B183483L1346L0926L1140L2555L4532L5885L6361L7184L9765M3955M8036
$$ 2183483 2214829 2245755 2276895 2309450 2343982 2379867 2416228 2453412 2493177 2537132 2585168
62094B585168N0413N0842M9939M8202M5974M3978M3150M3808M5392M7032M8025
$$ 2585168 2635581 2686423 2736362 2784564 2830538 2874516 2917666 2961474 3006866 3053898 3101923
62083C101923M7654M4993L9470L1677K3405J6578J2093R588Q227P568P608Q118
$$ 3101923 3149577 3194570 3234040 3265717 3289122 3305700 3317793 3327381 3335608 3343176 3350784 3358902
62071C358902Q252P073M467J219j927n008q344j1649j4137j5613j6851j8624k0761
$$ 3358902 3367154 3374227 3378694 3379913 3377986 3372978 3364634 3352985 3338848 3323235 3306384 3287760 3266999
62058C266999k2487k3441k3937k4480k5328k6409k7212k6971k5404k3208k1329
$$ 3266999 3244512 3221071 3197134 3172654 3147326 3120917 3093705 3066734 3041330 3018122 2996793
62047B996793j9833j8054j5797j3728j2385j1425j0165q441o570m908l784l515
$$ 2996793 2976960 2958906 2943109 2929381 2916996 2905571 2895406 2886965 2880395 2875487 2871703 2868188
62035B868188m104n075n964o731p509q192q647r077r875j1146j2633j4013j5104
$$ 2868188 2864084 2859009 2853045 2846314 2838805 2830613 2821966 2812889 2803014 2791868 2779235 2765222 2750118
62022B750118j5928j6696j7558j8304j8597j8563j8758j9308j9525j8784j7382
$$ 2750118 2734190 2717494 2699936 2681632 2663035 2644472 2625714 2606406 2586881 2568097 2550715
62011B550715j6073j4983j3650j1980j0602j0034j0019r909r622r927j1711j5003
$$ 2550715 2534642 2519659 2506009 2494029 2483427 2473393 2463374 2453465 2443843 2433916 2422205 2407202
61999B407202j8943k2709k6308l0082l3700l6229l7232l7184l6623l5464l3554
$$ 2407202 2388259 2365550 2339242 2309160 2275460 2239231 2201999 2164815 2128192 2092728 2059174
61988B059174l1286k9265k7691k6511k5759k5236k4362k2826k1122j9905j9137
$$ 2059174 2027888 1998623 1970932 1944421 1918662 1893426 1869064 1846238 1825116 1805211 1786074
61977A786074j8395j7714j7403j7337j7127j6794j6666j6642j6325j5750j5300
$$ 1786074 1767679 1749965 1732562 1715225 1698098 1681304 1664638 1647996 1631671 1615921 1600621
61966A600621j4937j4260j3334j2648j2146j1143r522q244q026q152p261n066
$$ 1600621 1585684 1571424 1558090 1545442 1533296 1522153 1512631 1504387 1496361 1488209 1480948 1475882
61954A475882k632j001L5J634M595Q464J1968J4278J5656J6894J8384K0105K2137
$$ 1475882 1473250 1472249 1472284 1473918 1478513 1486977 1498945 1513223 1528879 1545773 1564157 1584262 1606399
61941A606399K4676K7551L0290L2725L5087L7436L9543M1477M3782M6769N0058
$$ 1606399 1631075 1658626 1688916 1721641 1756728 1794164 1833707 1875184 1918966 1965735 2015793
61930B015793N3197N6430O0575O6307P3857Q3209R4363J07473J22932J41178J62302
$$ 2015793 2068990 2125420 2185995 2252302 2326159 2409368 2503731 2611204 2734136 2875314 3037616
61919C037616J86023K12108K40704K72180L06824L44613L84965M26608M67929
$$ 3037616 3223639 3435747 3676451 3948631 4255455 4600068 4985033 5411641 5879570
61910E879570N07306N42425N68951N80436N70152N33238M67331L72390K51332
$$ 5879570 6386876 6929301 7498252 8078688 8648840 9182078 9649409 10021799 10273131
61901A0273131J11235l6930j80669l08910m13675m90546n38770n61083n62554
$$ 10273131 10384366 10347436 10166767 9857857 9444182 8953636 8414866 7853783 7291229
61892G291229n48621n23743m91496m55284m18153l81913l47000l13543k82200
$$ 7291229 6742608 6218865 5727369 5272085 4853932 4472019 4125019 3811476 3529276
61883C529276k53682k27944k04429j82925j63661j46624j31314j17230j04205
$$ 3529276 3275594 3047650 2843221 2660296 2496635 2350011 2218697 2101467 1997262
61874A997262r2248q1460p2112o4297n7482n0890m4381l8419l3080k7707k1922
$$ 1997262 1905014 1823554 1751442 1687145 1629663 1578773 1534392 1495973 1462893 1435186 1413264
61863A413264j6341j1762q058m461o90K892O107R252J2314J4510J5068J4206J2932
$$ 1413264 1396923 1385161 1377103 1372642 1371952 1374844 1380951 1390203 1402517 1417027 1432095 1446301 1459233
61850A459233J1854J0627Q720O401M483L251K180R48Q5K02R31J440J711K556M232
$$ 1459233 1471087 1481714 1490434 1496835 1501318 1504569 1506749 1507697 1507782 1507984 1508915 1510355 1512066 1514622 1518854
61835A518854N889O645O546O067N248L915K210L60j772m186o091o504n481l939
$$ 1518854 1524743 1531388 1537934 1544001 1549249 1553164 1555374 1555734 1553962 1549776 1543685 1537181 1531700 1527761
61821A527761k270J58L727P551J0368J2151J4180J7537K2004K6608L0807L4811
$$ 1527761 1525491 1525649 1529376 1536927 1547295 1559446 1573626 1591163 1613167 1639775 1670582 1705393
61809A705393L9025M3538M8296N3458N9310O5872P2792P9748Q6923R5001J04590
$$ 1705393 1744418 1787956 1836252 1889710 1949020 2014892 2087684 2167432 2254355 2349356 2453946
61798B453946J15677J27728J40518J54709J71432J91262K13923K39155K67501
$$ 2453946 2569623 2697351 2837869 2992578 3164010 3355272 3569195 3808350 4075851
61789D075851K99920L36934L78625M25346M77825N36451O00819O70050P42896
$$ 4075851 4375771 4712705 5091330 5516676 5994501 6530952 7131771 7801821 8544717
61780H544717Q17086Q88645R51978J000121J024441J014650R60353Q54107O94324
$$ 8544717 9361803 10250448 11202426 12202547 13226988 14241638 15201991 16056098 16750422
61771A6750422M86745K44142j5473k71742n05294p00754q48776r46716r97715
$$ 16750422 17237167 17481309 17465836 17194094 16688800 15988046 15139270 14192554 13194839
61762A3194839j008621r87736r43359q83209q14157p41910o70677o03069n40401
$$ 13194839 12186218 11198482 10255123 9371914 8557757 7815847 7145170 6542101 6001700
61753F001700m83237m31765l85788l44740l08060k75591k47286k22609k00621
$$ 6001700 5518463 5086698 4700910 4356170 4048110 3772519 3525233 3302624 3102003
61744C102003j80755j63072j47582j33792j21231j09994j00207r1352q2725p4501
$$ 3102003 2921248 2758176 2610594 2476802 2355571 2245577 2145370 2054018 1971293 1896792
61734A896792o7617o2473n8297n4003m9246m4374l9861l6142l3567l2023l0826
$$ 1896792 1829175 1766702 1708405 1654402 1605156 1560782 1520921 1484779 1451212 1419189 1388363
61723A388363k9415k8055k7328k7116k6654k5597k4417k3522k2606k1268j9804
$$ 1388363 1358948 1330893 1303565 1276449 1249795 1224198 1199781 1176259 1153653 1132385 1112581
61712A112581j8772j8079j7086j5562j3984j2803j1957j1250j0750j0516j0346
$$ 1112581 1093809 1075730 1058644 1043082 1029098 1016295 1004338 993088 982338 971822 961476
61701I61476j0069r833r722r384q483p392o994p626q569q799q072p133o882p474
$$ 961476 951407 941574 931852 922468 913985 906593 899599 891973 883404 874605 866533 859400 852518 845044
61687H45044q272q663q698q867r313r551r049p861o616n918n887o141o270o292
$$ 845044 836772 828109 819411 810544 801231 791680 782631 774770 768154 762236 756349 750208 743938 737646
61673G37646o520o834o484n009l131k071k011j989j524j324j965k637k157o71
$$ 737646 731126 724292 717808 712799 709668 707597 705586 703597 702073 700749 698784 696147 693990 693319
61659F93319O27J211J689K550L322L308K535J618J081R88R57M69n59j553j963
$$ 693319 693946 695157 696846 699396 702718 706026 708561 710179 711260 712248 713205 713674 713115 711562 709599
61644G09599k094k702l788m424l958k859k054j841j797j489r79n84m51l64p6K62
$$ 709599 707505 704803 701015 696591 692633 689774 687720 685879 684082 682593 681614 681030 680579 680215 680139 680401
61628F80401K55m5o2L51L53q38k698l995m506n162o476p697p966p407o653n913
$$ 680401 680656 680611 680549 680900 681253 680415 677717 673722 669216 664054 657578 649881 641915 634508 627855 621942
61612F21942n058m099l110k053j126q94j586k548k897k515j997j810j880j883
$$ 621942 616884 612785 609675 607622 606496 605602 604016 601468 598571 596056 594059 592249 590369 588486
61598E88486j672j410j375j560j592j240q83r95j277r94j21O03Q74J163J589J488
$$ 588486 586814 585404 584029 582469 580877 579637 578754 577759 576482 575488 575367 575970 576844 578007 579596 581084
61582E81084P19M54J767M096O098P447Q772J0185J1082J1350J1746J2827J4360
$$ 581084 581803 582257 584024 588120 594218 601665 610437 620622 631704 643054 654800 667627 681987
61569F81987J5928J7448J8835J9846K0513K1176K1823K1924K1235K0337J9988
$$ 681987 697915 715363 734198 754044 774557 795733 817556 839480 860715 881052 901040
61558I01040K0168K0153J9405J8171J7232J7146J7734J8270J8187J7484J6476
$$ 901040 921208 941361 960766 978937 996169 1013315 1031049 1049319 1067506 1084990 1101466
61547A101466J5395J4380J3545J2659J0995P896L546j069m972p791r729j1217
$$ 1101466 1116861 1131241 1144786 1157445 1168440 1176336 1179882 1178813 1173841 1166050 1156321 1145104
61535A145104j2460j3193j2972j1932j0865j0305r845q760p023n205l562j840
$$ 1145104 1132644 1119451 1106479 1094547 1083682 1073377 1063532 1054772 1047749 1042544 1038982 1037142
61523A037142J90K521N257Q581J2280J5797J8915K2055K5776L0199L5049M0059
$$ 1037142 1037332 1039853 1045110 1053691 1065971 1081768 1100683 1122738 1148514 1178713 1213762 1253821
61511A253821M5349N1513N9124O7976P7148Q6104R5468J06233J18550J31837J45743
$$ 1253821 1299170 1350683 1409807 1477783 1554931 1641035 1736503 1842736 1961286 2093123 2238866
61500B238866J60222J74824J88587K00577K09679K13979K11223K00202J81029
$$ 2238866 2399088 2573912 2762499 2963076 3172755 3386734 3597957 3798159 3979188
61491C979188J54118J19866P9716L6672n861m5229p9388j06579j26099j38896
$$ 3979188 4133306 4253172 4332888 4369560 4363699 4318470 4239082 4132503 4006404 3867508
61481C867508j46633j50291j49999j45920j38666j29139j18343j07125r5774q4125
$$ 3867508 3720875 3570584 3420585 3274665 3135999 3006860 2888517 2781392 2685618 2601493
61471B601493p2388o1353n1329m1465l0923k0299j1025l466L468J0766J8123K4538
$$ 2601493 2529105 2467752 2416423 2374958 2344035 2323736 2312711 2309245 2312713 2323479 2341602 2366140
61459B366140K9412L2714L4589L5219L4859L3797L2368L1040L0136K9458K8554
$$ 2366140 2395552 2428266 2462855 2498074 2532933 2566730 2599098 2630138 2660274 2689732 2718286
61448B718286K7473K6861K7245K8615L0786L3768L7355M0849M3583M5598M7426
$$ 2718286 2745759 2772620 2799865 2828480 2859266 2893034 2930389 2971238 3014821 3060419 3107845
61437C107845M9295N0820N1325N0187M6976M1584L4345K5840J6625P110k424j1851
$$ 3107845 3157140 3207960 3259285 3309472 3356448 3398032 3432377 3458217 3474842 3481952 3479528 3467677
61425C467677k1059k9635l6901m2511m6722m9741n1083n0113m7101m3107l8821
$$ 3467677 3446618 3416983 3380082 3337571 3290849 3241108 3190025 3139912 3092811 3049704 3010883
61414C010883l4130k8961k3792j8996j4294r392m643m55L473P518J1021J2723
$$ 3010883 2976753 2947792 2924000 2905004 2890710 2881318 2876675 2876220 2879693 2887211 2898232 2910955
61402B910955J2337J0870R194P126M260R71j998m362o089o738n679k842J433P213
$$ 2910955 2923292 2934162 2943356 2950482 2954742 2955713 2953715 2949353 2943264 2936526 2930847 2928005 2929438 2936651
61388B936651J5012K4919L6212M8174O0911P5012R0636J07247J24270J41608J59421
$$ 2936651 2951663 2976582 3012794 3060968 3121879 3196891 3287527 3394774 3519044 3660652 3820073
61377C820073J77489J94971K10667K23295K31497K33879K29277K16916J96286
$$ 3820073 3997562 4192533 4403200 4626495 4857992 5091871 5321148 5538064 5734350
61368E734350J67304J31071R0310M8461Q004l0068o5305r6998j24593j48405j69239
$$ 5734350 5901654 6032725 6123035 6171496 6179500 6149432 6084127 5987129 5862536 5714131 5544892
61357E544892j87411k02365k13217k19394k20987k18726k13558k06021j96157
$$ 5544892 5357481 5155116 4941899 4722505 4501518 4282792 4069234 3863213 3667056
61348C667056j84150j70824j57237j43889j30631j17270j03983r1162p9063o7694
$$ 3667056 3482906 3312082 3154845 3010956 2880325 2763055 2659072 2567910 2488847 2421153
61338B421153n7000m7053l7931k9326k0573j1511l072L617Q724J3630J9166K4750
$$ 2421153 2364153 2317100 2279169 2249843 2229270 2217759 2214687 2218304 2227028 2240658 2259824 2284574
61326B284574K9497L3387L6653L8940L9878M0005M0173M0333L9812L8463L6559
$$ 2284574 2314071 2347458 2384111 2423051 2462929 2502934 2543107 2583440 2623252 2661715 2698274
61315B698274L3813K9564K4047J8481J3713R670O322M205L579L782L933L643K801
$$ 2698274 2732087 2761651 2785698 2804179 2817892 2827562 2833884 2838089 2841668 2845450 2849383 2853026 2855827
61302B855827J212j092l807o997j1158j6279k1475k6078l0514l5391m0220m3873
$$ 2855827 2857039 2855947 2852140 2845143 2833985 2817706 2796231 2770153 2739639 2704248 2664028 2620155
61290B620155m5993m7079m7267m5980m3025l9340l6100l3424l0397k6356k1670
$$ 2620155 2574162 2527083 2479816 2433836 2390811 2351471 2315371 2281947 2251550 2225194 2203524
61279B203524j7163j3077r002m791j064J428K661L120K922J644j029m892r534
$$ 2203524 2186361 2173284 2164282 2159491 2158427 2159855 2162516 2165636 2168558 2170202 2169173 2164281 2154747
61266B154747j4525j9240k2889k4992k5544k4590k2027j7860j2361n777J723R818
$$ 2154747 2140222 2120982 2098093 2073101 2047557 2022967 2000940 1983080 1970719 1964942 1966665 1976483
61254A976483J8143K6754L6025M5928N5912O5626P5175Q4432R2786R9935J06229
$$ 1976483 1994626 2021380 2057405 2103333 2159245 2224871 2300046 2384478 2477264 2577199 2683428
61243B683428J11560J14453J12961J06222R4376P7475N5325K8525j144l1494o0574
$$ 2683428 2794988 2909441 3022402 3128624 3223000 3300475 3355800 3384325 3383181 3351687 3291113
61232C291113q6539j07680j23033j32620j36837j35901j30230j21135j10685j00719
$$ 3291113 3204574 3096894 2973861 2841241 2704404 2568503 2438273 2317138 2206453 2105734
61222B105734r2001q4313p7160p0318o3758n7368n1036m4910l9253l4024k8927
$$ 2105734 2013733 1929420 1852260 1781942 1718184 1660816 1609780 1564870 1525617 1491593 1462666
61211A462666k3938j9384j5318j1298p038k987Q2J759J968O88j832m749p118q599
$$ 1462666 1438728 1419344 1404026 1392728 1385690 1382703 1382785 1384544 1386512 1387200 1385368 1380619 1373501 1364902
61197A364902r354r430q792p835p276p427p927q373q867r829j1494j3680j5836
$$ 1364902 1355548 1346118 1337326 1329491 1322215 1314788 1306861 1298488 1289621 1279792 1268298 1254618 1238782
61184A238782j7349j8009j8186j8387j8752j9101j9293j9232j8714j7693j6571
$$ 1238782 1221433 1203424 1185238 1166851 1148099 1128998 1109705 1090473 1071759 1054066 1037495
61173A037495j5733j4887j3366j1114q811o945n307l575j938p80j08L40O46O12
$$ 1037495 1021762 1006875 993509 982395 973584 966639 961332 957757 955819 955039 954931 955271 955917 956529
61159I56529o5j738m645q555j2692j6241j8753k0049k0056j9008j7464j5811j3961
$$ 956529 956464 954726 950081 941526 928834 912593 893840 873791 853735 834727 817263 801452 787491
61146G87491j1855r873q322o797m748k566j297j155j122m10M39N03o5m14m76r32
$$ 787491 775636 765763 757441 750644 745896 743330 742033 740878 739756 739346 739785 740288 740223 739809 739333 738401
61130G38401j745j910j061l19p43j720j839q44L28J150K003L085L945M416M902
$$ 738401 736656 734746 733685 733366 732623 730903 729064 728220 728548 729698 731701 734786 738731 743147 748049
61115G48049N357M802K592n86l607o189q615j0795j2419j3658j4810j5545j5314
$$ 748049 753406 758208 760800 760214 756607 750418 741803 731008 718589 704931 690121 674576 659262
61102F59262j4356j3449j2806j2006j0968j0132r580q836p726o677n924n169m298
$$ 659262 644906 631457 618651 606645 595677 585545 575965 567129 559403 552726 546802 541633 537335
61089E37335l748l749l840l587l245l253l512l603l406k992k325j442o83k81j3
$$ 537335 533587 529838 525998 522411 519166 515913 512401 508798 505392 502400 500075 498633 497950 497669 497656
61074D97656M30J031J770K949M644O161O621O017N182M807M976N559O490P533
$$ 497656 498086 499117 500887 503836 508480 514641 521262 527279 532461 537268 542244 547803 554293 561826
61060E61826Q226Q305P976P673P651P842Q048Q217Q510Q932R034Q410P512P391
$$ 561826 570052 578357 586333 594006 601657 609499 617547 625764 634274 643206 652240 660650 668162 675553
61046F75553Q387R604J0114J0061J0003R738Q679P088N993N860O108N967N160
$$ 675553 683940 693544 703658 713719 723722 733460 742139 749227 755220 761080 767188 773155 778315
61033G78315L754K051P52M99J061J574J671J777K189K679L119L770M678N484O184
$$ 778315 782069 784120 784872 785371 786432 788006 789677 791454 793643 796322 799441 803211 807889 813373 819557
61018H19557P348R288J1683J4302J7337K0606K3326K5294K7487L0888L5282L9865
$$ 819557 826905 836193 847876 862178 879515 900121 923447 948741 976228 1007116 1042398 1082263
61006A082263M4284M8412N1851N4458N6776N9280O1957O5414P1348Q0710R2222
$$ 1082263 1126547 1174959 1226810 1281268 1338044 1397324 1459281 1524695 1596043 1676753 1768975
60995A768975J03985J15794J28352J41119J53020J65210J81377K05366K39993
$$ 1768975 1872960 1988754 2117106 2258225 2411245 2576455 2757832 2963198 3203191
60986C203191K87588L49254M23552N08623O06602P24313Q70367J055681J296866
$$ 3203191 3490779 3840033 4263585 4772208 5378810 6103123 6973490 8029171 9326037
60977I326037J609932J987935K377673K678727K771883K564922K039089J279472
$$ 9326037 10935969 12923904 15301577 17980304 20752187 23317109 25356198 26635670
60969B6635670M67201j80791n03926m67621j67135K25392N24942N79087L02924
$$ 26635670 27102871 26922080 26418154 25950533 25783398 26008790 26533732 27112819 27415743
60960B7415743k85954j054805j799662k337535k585982k573779k388437k116113
$$ 27415743 27129789 26074984 24275322 21937787 19351805 16778026 14389589 12273476
60952A2273476j816114j524956j263960j040985q53887o98063n70668m68855l88045
$$ 12273476 10457362 8932406 7668446 6627461 5773574 5075511 4504843 4035988 3647943
60943C647943l23754k73342k34813k05543j83027j65564j51464j38873j26970
$$ 3647943 3324189 3050847 2816034 2610491 2427464 2261900 2110436 1971563 1844593
60934A844593j16111j06131r5770q4499p3632o4761n8082n3126m9993m8770m8462
$$ 1844593 1728482 1622351 1526581 1442082 1368450 1303689 1245607 1192481 1142488 1093718 1045256
60923A045256m7626m5623m2582l8728l4434l0388k6956k3815k0758j8179j6217
$$ 1045256 997630 952007 909425 870697 836263 805875 778919 755104 734346 716167 699950
60912F99950j4168j1535q990p356o276m872l277k385k315k219j608r52p68q91
$$ 699950 685782 674247 665257 657901 651625 646753 643476 641091 638776 636557 634949 633997 633229 632338
60898F32338r18q49j038j765l024m471n627o250o479o617o941p762r120j0325
$$ 632338 631420 630571 629533 627768 624744 620273 614646 608396 601917 595300 588359 580597 571477 561152
60884E61152j0374r199p929p539p720p555o774n752m713l673k787k188j599o96
$$ 561152 550778 541579 533650 526111 518391 510836 504062 498310 493597 489924 487137 484949 483350 482654
60870D82654L64J221J857K454L023L687M864O627Q285R207R738J0548J1479J1831
$$ 482654 483018 484239 486096 488550 491573 495260 500124 506751 515036 524243 533981 544529 556008 567839
60856E67839J1617J1661J2451J3590J4441J4692J4400J3948J3882J4263J4340
$$ 567839 579456 591117 603568 617158 631599 646291 660691 674639 688521 702784 717124
60845G17124J3476J2112J1092J0273Q717O220L702J954Q30m5n86p44j006k035
$$ 717124 730600 742712 753804 764077 772794 779014 782716 784670 785500 785455 784869 784125 783119 781084
60831G81084m085p005j0353j3285j4931j5209j4933j4858j4896j4449j3189j1323
$$ 781084 776999 769994 759641 746356 731425 716216 701283 686425 671529 657080 643891 632568
60819F32568r370p869p006o360n337l918k732k228k142j914j295l93N88J444J985
$$ 632568 623198 615329 608323 601963 596626 592708 589976 587748 585606 583692 582397 582004 582592 584036 586021
60804E86021K155K057J835J615J526J563J529J314J113J131J222J141R57Q82Q82
$$ 586021 588176 590233 592068 593683 595209 596772 598301 599615 600728 601859 603081 604222 605179 606061 606943
60789F06943Q67J083J824K868L795M683N894P181P775P469O927O773P028P640
$$ 606943 607810 608893 610717 613585 617380 622063 627957 635138 642913 650382 657309 664082 671110 678750
60775F78750Q755J0049J0557R819Q665Q161Q145P534N908M006K650J858J200N31
$$ 678750 687505 697554 708111 717930 726595 734756 742901 750435 756343 760349 762999 764857 766057 766588
60761G66588J0k89m61o37j006j816l089m380n064m992m657m591m800m989n172
$$ 766588 766598 766309 765848 765211 764205 762389 759300 754920 749856 744864 740207 735616 730816 725827 720655
60746G20655n751p008q741j0397j1395j1452j0843j0310j0318j0501j0242r611
$$ 720655 714904 707896 699155 688758 677363 665911 655068 644758 634440 623939 613697 604086
60734F04086r132q654p412n353l594k969l001k829k489k339j933n00J676L386
$$ 604086 594954 586300 578888 573535 569941 566972 563971 561142 558653 556314 554381 553881 555557 558943
60720E58943L964L846L694L701L791L891L798L375K755K007P76j182l257m491
$$ 558943 562907 566753 570447 574148 577939 581830 585628 589003 591758 593765 594541 593359 590102 585611
60706E85611m785m948n576o508p371q056q600r052r436r478q641o954n445n003
$$ 585611 580826 575878 570302 563794 556423 548367 539767 530715 521279 511801 503160 496206 490761 485758
60692D85758n213n077m589m438m528m017k859j991j740j394o24j69n12r85q40
$$ 485758 480545 475468 470879 466441 461913 457896 455037 453046 451306 449912 449288 449119 448607 447622 446782
60677D46782k42M79J595L252M762N479N751O260O920P261P334P503P721P666P332
$$ 446782 446540 447019 448614 451866 456628 462107 467858 474118 481038 488299 495633 503136 510857 518523 525855
60662E25855O929O515O207O366P037P668P928Q305R284J0405J0858J0666J0469
$$ 525855 532784 539299 545506 551872 558909 566577 574505 582810 592094 602499 613357 624023 634492
60649F34492J0445J0186R508Q628P560O098M419L184K809K997L097K671J712N88
$$ 634492 644937 655123 664631 673259 680819 686917 691336 694520 697329 700326 703423 706094 707806 708394
60635G08394k56q14j674l446n968q327r638r823r610r804j0433j0772j0321r514
$$ 708394 708138 707324 705650 702204 696236 687909 678271 668448 658838 649034 638601 627829 617508 607994
60621F07994r060q848q175p011o187o095n938m765k643l63J513K894L840M529
$$ 607994 598934 590086 581911 574900 568713 562618 556680 551915 549272 548909 550422 553316 557156 561685
60607E61685N262O133O989P845Q959J0244J1155J1460J1537J1558J0892Q939O065
$$ 561685 566947 573080 580069 587914 596873 607117 618272 629732 641269 652827 663719 672658 678723
60594F78723L266J190o9o24q00j140j941k979l997n127o498p812q654q896q592
$$ 678723 681989 683179 683110 682486 681686 680546 678605 675626 671629 666502 660004 652192 643538 634642 626050
60579F26050p894p344p582q458r009q752q244q043p856p354o956o980o776n685
$$ 626050 618156 610812 603230 594772 585763 577011 568767 560724 552868 545514 538558 531578 524802 519117
60565E19117m248l452l211k671j696r15m97N6Q74J449J526J449J594K045K848
$$ 519117 514869 511417 508206 505535 503839 502924 502427 502483 503357 504806 506332 507781 509375 511420 514268
60550E14268L951M950N541O058O945P955Q691R676J1822J4927J7802K0017K2526
$$ 514268 518219 523169 528710 534768 541713 549668 558359 568035 579857 594784 612586 632603 655129
60537F55129K6231L0903L5873M0889M5662M9235N0505M9000M4663L7273K6748
$$ 655129 681360 712263 748136 789025 834687 883922 934427 983427 1028090 1065363 1092111
60526A092111J3894M01j1988k2089k9230l3029l3501l1333k7708k3556j9053j4158
$$ 1092111 1106005 1106406 1094418 1072329 1043099 1010070 976569 945236 917528 893972 874919 860761
60514H60761r494o121m329l247k032p87R9Q19J730K666L447M683P148J0659J4462
$$ 860761 851267 845146 840817 837570 835538 834751 834850 835669 837399 840065 843512 848195 855343 866002 880464
60499H80464J8464K3189K8671L4337M0069M6318N3038N9321O4361O8067P0492
$$ 880464 898928 922117 950788 985125 1025194 1071512 1124550 1183871 1248232 1316299 1386791
60488A386791P1413P0907O9997P0439P4128Q2657R6791J16281J40515J69315K02415
$$ 1386791 1458204 1529111 1599108 1669547 1743675 1826332 1923123 2039404 2179919 2349234 2551649
60477B551649K38003K72069K99158L13447L09567K83658K34485J63880P6736j8988
$$ 2551649 2789652 3061721 3360879 3674326 3983893 4267551 4502036 4665916 4742652 4723664
60467D723664j13136j95949k60859l04952l27741l30759l18130k95680k68457
$$ 4723664 4610528 4414579 4153720 3848768 3521027 3190268 2872138 2576458 2308001
60458B308001k39381k10191j82426j57087j34311j14167r7124q3300p1969o2330
$$ 2308001 2068620 1858429 1676003 1518916 1384605 1270438 1173314 1090014 1018045 955715
60448I55715n4184m7408m1436l5788l0581k6007k1921j8376j5940j4842j4352
$$ 955715 901531 854123 812687 776899 746318 720311 698390 680014 664074 649232 634880
60437F34880j3584j2475j1445j0611r928r595r646r461q360o505m684l482l053
$$ 634880 621296 608821 597376 586765 576837 567242 557596 548135 539775 533270 528586 525104 522051
60424E22051l346l936m030l222k081j359r31j70Q60J414J257J068J475K227K635
$$ 522051 518705 514769 510739 507517 505436 504077 503146 502976 503836 505250 506507 507575 509050 511277 513912
60409E13912K389J704R08K18k50m06j74N62J850L503N049N930N842N026M188L920
$$ 513912 516301 518005 518913 519131 518881 518475 518301 518863 520713 524216 529265 535195 541037 546063 550251 554171
60393E54171M106M030L146J650L04k18J68R25J333J158Q08P03O54K15m86q03n06
$$ 554171 558277 562307 565453 567103 567407 567189 567357 568282 569615 570773 571581 572284 572938 573153 572667 571864 571358
60376E71358j49k65o98r84j070j223j492j522r32K64J565K314K301J988K009K515
$$ 571358 571209 570944 570246 569262 568192 566969 565477 563955 563023 563287 564852 567166 569467 571455 573464 575979
60360E75979L217L944M703N351N699N895O232O587O604O426O579P052P176O605
$$ 575979 579196 583140 587843 593194 598893 604788 611020 617607 624211 630637 637216 644268 651444 658049
60346F58049N701M750L581K278J415J075M67p72j631j013N79J623J567J243J366
$$ 658049 663750 668500 672081 674359 675774 676849 677316 676544 674913 673900 674479 676102 677669 678912 680278
60331F80278J687J739J580J451J333J194J205J323J122K93q93j964k808l518l920
$$ 680278 681965 683704 685284 686735 688068 689262 690467 691790 692912 693205 692312 690348 687540 684022 680102
60316F80102l747l242l146l908n107n923n955n353m337l099k108j873k085j635
$$ 680102 676355 673113 669967 666059 660952 655029 649074 643721 639384 636285 634177 632304 630219 628584
60302F28584M7J975K664J905P98J36m01j319k397l041l002k390j426m72L5Qk31
$$ 628584 628631 630606 633270 635175 635973 636109 635708 634389 631992 628951 625949 623559 622133 621661 621696 621704 621473
60285F21473m37o25o73l17K98O51O59Q81J579K235K416K472K813L116L051L177
$$ 621473 621036 620411 619738 619421 619719 620370 621029 621910 623489 625724 628140 630612 633425 636541 639592 642769
60269F42769M263N947P068P193P035P302P946Q698R606J0735J1880J2894J3939
$$ 642769 647032 652979 660047 667240 674275 681577 689523 698221 707827 718562 730442 743336 757275
60256G57275J5074J6078J6912J8059J9988K2542K5224K7930L0932L4222L7407
$$ 757275 772349 788427 805339 823398 843386 865928 891152 919082 950014 984236 1021643
60245A021643M0436M3994M8745N4466O0395O6270P2424P8869Q4973R0333R5238
$$ 1021643 1062079 1106073 1154818 1209284 1269679 1335949 1408373 1487242 1572215 1662548 1757786
60234A757786R9765J03058J04239J03509J01453R7635R0966Q1433P0322N8630
$$ 1757786 1857551 1960609 2064848 2168357 2269810 2367445 2458411 2539844 2610166 2668796
60224B668796M6291L3234K0104P396n075j7217k7973l6384m2616m7159m9674m9507
$$ 2668796 2715087 2748321 2768425 2775821 2770746 2753529 2725556 2689172 2646556 2599397 2549723 2500216
60212B500216m6887m2633l7027k9883k1444j2289k480Q316J9905L1610M3252N5292
$$ 2500216 2453329 2410696 2373669 2343786 2322342 2310053 2307573 2315889 2335794 2367404 2410656 2465948
60200B465948O7743P9732R0392R9595J07449J13493J16831J16747J13030J05852
$$ 2465948 2533691 2613423 2703815 2803410 2910859 3024352 3141183 3257930 3370960 3476812
60190C476812R5626Q2837O7926N1365L3767J5716k486k0628l8199n4370o8390
$$ 3476812 3572438 3655275 3723201 3774566 3808333 3824049 3821563 3800935 3762736 3708366 3639976
60179C639976p9821q8399r3807r5643r3581q7713p8775o7833n5556m2077k7632
$$ 3639976 3560155 3471756 3377949 3282306 3188725 3101012 3022237 2954404 2898848 2856771 2829139
60168B829139j2976J184J4812K8169M0984N2474O2028O9450P4560P7013P6476
$$ 2829139 2816163 2817347 2832159 2860328 2901312 2953786 3015814 3085264 3159824 3236837 3313313
60157C313313P2743O5764N5911M4154L1518J8375M677r132k1901l2608m0962m6971
$$ 3313313 3386056 3451820 3507731 3551885 3583403 3601778 3606455 3597323 3575422 3542814 3501852 3454881
60145C454881n0237n0118m6447l9797l0930k0165p354P592K4289M2003O0106P8407
$$ 3454881 3404644 3354526 3308079 3268282 3237352 3217187 3209833 3217425 3241714 3283717 3343823 3422230
60133C422230R7157J16884J38000J60437J83602K06844K29768K51970K72727K91309
$$ 3422230 3519387 3636271 3774271 3934708 4118310 4325154 4554922 4806892 5079619 5370928
60123E370928L07366L20570L29979L34364L33074L26046L12938K93123K66774
$$ 5370928 5678294 5998864 6328843 6663207 6996281 7322327 7635265 7928388 8195162
60114H195162K35198J99673J60436J17352P1068K3036k5406p3474j20621j65930
$$ 8195162 8430360 8630033 8790469 8907821 8978889 9001925 8976519 8903045 8782424 8616494
60104H616494k07676k43480k71321k90568l01645l04787k99880k87598k69710
$$ 8616494 8408818 8165338 7894017 7603449 7301804 6997017 6697137 6409539 6139829
60095F139829k47709k22012j93044j62290j31397j00871p0644m1251j3442J2990
$$ 6139829 5892120 5670108 5477064 5314774 5183377 5082506 5011862 4970611 4957169 4970159
60085D970159L8673O2915Q3552R8775J08328J12662J11644J04642R1584P3571
$$ 4970159 5008832 5071747 5155299 5254074 5362402 5475064 5586708 5691350 5782934 5856505
60075E856505N2547L0379Q109j3846l4980n4609p2597q9457j05304j19289j30641
$$ 5856505 5909052 5939431 5947540 5933694 5898714 5844105 5771508 5682051 5576747 5457458 5326817
60064E326817j39703j47206j52985j56177j56413j53934j48704j40322j28826
$$ 5326817 5187114 5039908 4886923 4730746 4574333 4420399 4271695 4131373 4002547
60055D002547j14962r9594q3388o6890n0339l3499j6273P47J6975L2806M9023
$$ 4002547 3887585 3787991 3704603 3637713 3587374 3553875 3537602 3538349 3555324 3588130 3637153
60044C637153O5382Q0708R4245J06031J15776J22432J25203J24170J19512J10861
$$ 3637153 3702535 3783243 3877488 3983519 4099295 4221727 4346930 4471100 4590612 4701473
60034D701473R7878Q1041O1380L9782J6865o764l0463n3624p5644r5901j13753
$$ 4701473 4799351 4880392 4941772 4981554 4998419 4991655 4961192 4907568 4831924 4736023 4622270
60023D622270j28373j38830j44636j46092j43729j37750j28388j16493j03065
$$ 4622270 4493897 4355067 4210431 4064339 3920610 3782860 3654472 3537979 3434914
60014C434914q8448p2639n6172l9863k3788p380R460K6209M2780N9808P7603R5553
$$ 3434914 3346466 3273827 3217655 3177792 3154004 3146624 3156084 3182293 3225073 3284881 3362484 3458037
60002C458037J12916J29490J45161J59326J71125J79689J83878J82347J74342
$$ 3458037 3570953 3700443 3845604 4004930 4176055 4355744 4539622 4721969 4896311
59993D896311J60211J40987J17856R2071O4741L6357O899k3372n3522q2428j09081
$$ 4896311 5056522 5197509 5315365 5407436 5472177 5508534 5515433 5492061 5438539 5356111 5247030
59982E247030j32263j50454j62441j67786j66689j59870j48668j34594j18498
$$ 5247030 5114767 4964313 4801872 4634086 4467397 4307527 4158859 4024265 3905767
59973C905767j00614q1489o2260m3740k5790p971R706K7007M3906O0318P5682
$$ 3905767 3805153 3723664 3661404 3617664 3591874 3583903 3593609 3620616 3664522 3724840 3800522
59962C800522Q9220J00400J08900J14434J16849J16230J12605J05879R6201Q4176
$$ 3800522 3889742 3990142 4099042 4213476 4330325 4446555 4559160 4665039 4761240 4845416
59952D845416P0566N5988M0970K6085J1946o49j0732j7746k1964k3722k2254j6015
$$ 4845416 4915982 4971970 5012940 5039025 5050971 5050322 5039590 5021844 4999880 4976158 4953904 4937889
59940D937889m348J1848L1372N3954P9769J08401J38917J70768K03891K38041
$$ 4937889 4933541 4945389 4976761 5030715 5110484 5218885 5357802 5528570 5732461 5970502
59930E970502K72286L05203L35323L61241L81337L93331L94391L81941L54418
$$ 5970502 6242788 6547991 6883314 7244555 7625892 8019223 8413614 8795555 9149973
59921I149973L11195K52503J80216R8552J3048p1406j51097k22378k81356l25316
$$ 9149973 9461168 9713671 9893887 9992439 10005487 9934081 9782984 9560606 9279250 8953934
59911H953934l53862l68155l69620l59909l41443l17076k89099k58906k27412
$$ 8953934 8600072 8231917 7862297 7502388 7160945 6843869 6554770 6295864 6068452
59902F068452j95401j63497j32111j01456p1606m2567j4279J3487M0958O7818
$$ 6068452 5873051 5709554 5577443 5475987 5404381 5361814 5347535 5361022 5401980 5469798
59892E469798R3082J15909J36258J54138J68406J76999J78316J71698J56715J32919
$$ 5469798 5562880 5678789 5815047 5969185 6137591 6314590 6492906 6664604 6821319 6954238
59882F954238J00595O1125J6483l0940p8012j21345j58578j88669k10979k25015
$$ 6954238 7054833 7115958 7132441 7101501 7023489 6902144 6743566 6554897 6343918 6118903
59872F118903k31377k31942k28532k21969k12904k02749j93118j84755j77389
$$ 6118903 5887526 5655584 5427052 5205083 4992179 4789430 4596312 4411557 4234168
59863D234168j70260j62464j53385j43192j32460j21154j08681r5080q1361o8227
$$ 4234168 4063908 3901444 3748059 3604867 3472407 3351253 3242572 3147492 3066131 2997904
59853B997904n5460m3080l2203k3990j8466j5081j3841j5140j8960k4876l2296
$$ 2997904 2942444 2899364 2867161 2843171 2824705 2809624 2795783 2780643 2761683 2736807 2704511
59842B704511m0064m6529n0714n2932n3622n2345m8751m3829l8988l4285k8624
$$ 2704511 2664447 2617918 2567204 2514272 2460650 2408305 2359554 2315725 2276737 2242452 2213828
59831B213828k1581j4023o914k92O531J4254K3017L1965L9647M5306M9499N3055
$$ 2213828 2192247 2178224 2171310 2171018 2177549 2191803 2214820 2246785 2286432 2331738 2381237 2434292
59819B434292N5962N7878N9097N9962N9687N6900N1184M3141L3143K1250Q510
$$ 2434292 2490254 2548132 2607229 2667191 2726878 2783778 2834962 2878103 2911246 2932496 2941006
59808B941006k911j1403j6954k0047k0345j7229j1128l378N269J5375K7758M2133
$$ 2941006 2938095 2926692 2909738 2889691 2869346 2852117 2840989 2837611 2842880 2858255 2886013 2928146
59796B928146N7335P2980R0274J10770J34682J61151J89897K21561K56172K92088
$$ 2928146 2985481 3058461 3148735 3259505 3394187 3555338 3745235 3966796 4222968 4515056
59786D515056L26570L56032L74885L75298L49840K95060K13022J10788n04j07428
$$ 4515056 4841626 5197658 5572543 5947841 6297681 6592741 6805763 6916551 6916047 6808619
59776F808619j97777k64046l04217l20238l16554k99033k73259k43045k10766
$$ 6808619 6610842 6346796 6042579 5722341 5405787 5106754 4833495 4590450 4379684
59767D379684j78629j48714j21989r8388p7806o0153m4692l0449j7292n568N218
$$ 4379684 4201055 4052341 3930352 3831964 3754158 3694005 3649313 3618864 3601572 3596004 3601222
59756C601222J6241K7757L8974M9778O1288P4103Q7261R9757J12178J25916J41378
$$ 3601222 3617463 3645220 3684194 3733972 3795260 3869363 3956624 4056381 4168559 4294475 4435853
59745D435853J58005J75590J94627K15516K38193K62593K88915L17293L47513
$$ 4435853 4593858 4769448 4964075 5179591 5417784 5680377 5969292 6286585 6634098
59736F634098L79011M10920M42109M71268M96835N16738N28459N29602N18556
$$ 6634098 7013109 7424029 7866138 8337406 8834241 9350979 9879438 10409040 10927596
59727A0927596M94947M60023M16811L69614L23105K81795K49863K30576K25416
$$ 10927596 11422543 11882566 12299377 12668991 12992096 13273891 13523754 13754330 13979746
59718A3979746K34033K55104K86844L26604L70597M14613M54867M88010N10769
$$ 13979746 14213779 14468883 14755727 15082331 15452928 15867541 16322408 16810418 17321187
59709A7321187N20099N13696M90248M49549L92771L22627K43016J58503P4022
$$ 17321187 17841286 18354982 18845230 19294779 19687550 20010177 20253193 20411696 20485718
59700B0485718n367p5026j31333j71896j95456k01729j91118j64430j22893o8457
$$ 20485718 20480351 20405325 20273992 20102096 19906640 19704911 19513793 19349363 19226470 19158013
59690A9158013l694O8912J47704K31747L20098M11293N03455N94676O82879P65082
$$ 19158013 19154319 19223231 19370935 19602682 19922780 20334073 20837528 21432204 22115083 22880165
59680B2880165Q36698Q91710R23527R25713Q92162Q17566O98898N37271L38922
$$ 22880165 23716863 24608573 25532100 26457813 27349975 28167541 28866439 29403710 29742632
59671B9742632J14871j20397l50893n61420p39420q75865r65745j008831j010023
$$ 29742632 29857503 29737106 29386213 28824793 28085373 27209508 26243763 25234932 24224909
59662B4224909r78283r24763q61697q01992p57769p37320p42453p68329q05518
$$ 24224909 23246626 22321863 21460166 20658174 19900405 19163085 18420632 17652303 16846785
59653A6846785q42743q69568q78950q68817q41581q01855p54171p02028o48052
$$ 16846785 16004042 15134474 14255524 13386707 12545126 11743271 10989100 10287072 9639020
59644I639020n94425n42979m95005m50942m10367l72617l37643l05970k77663
$$ 9639020 9044595 8501616 8006611 7555669 7145302 6772685 6435042 6129072 5851409
59635E851409k51746k27115k03817j82671j63749j45975j28533j11873r6790q3224
$$ 5851409 5599663 5372548 5168731 4986060 4822311 4676336 4547803 4435930 4339140 4255916
59625D255916p0660n9224m9513m1668l5437l0908k8393k7651k8245l0569l5581
$$ 4255916 4185256 4126032 4076519 4034851 3999414 3968506 3940113 3912462 3884217 3853648 3818067
59614C818067m3260n2223o1023o9065p5991q1214q4421q5814q5459q3140p9211
$$ 3818067 3774807 3722584 3661561 3592496 3516505 3435291 3350870 3265056 3179597 3096457 3017246
59603C017246p4693p0071o4790n8430n1523m4609l7373k9497k1589j4394p716
$$ 3017246 2942553 2872482 2807692 2749262 2697739 2653130 2615757 2586260 2564671 2550277 2542561
59592B542561j102N008R768J3257J6356J9430K1947K3288K3302K2236K0623J9083
$$ 2542561 2541459 2546467 2556235 2569492 2585848 2605278 2627225 2650513 2673815 2696051 2716674 2735757
59580B735757J7783J6496J5530J5991J8479K2157K5946L0084L5582M2565N0200
$$ 2735757 2753540 2770036 2785566 2801557 2820036 2842193 2868139 2898223 2933805 2976370 3026570
59569C026570N8050O6521P5992Q6355R7328J08699J20346J32551J45934J60462
$$ 3026570 3084620 3151141 3227133 3313488 3410816 3519515 3639861 3772412 3918346 4078808
59559D078808J75017J88681K01800K14860K26818K35826K41292K43950K43956
$$ 4078808 4253825 4442506 4644306 4859166 5085984 5321810 5563102 5807052 6051008
59550F051008K40269K32101K19910K04655J87061J67867J47970J27758J06707
$$ 6051008 6291277 6523378 6743288 6947943 7135004 7302871 7450841 7578599 7685306
59541G685306Q3771N7995K9287m80k7508m8223o1444o7796o7605o0595m7260k8749
$$ 7685306 7769077 7827072 7856359 7855879 7828371 7780148 7718704 7650908 7583303 7522708 7475448 7446699
59529G446699n209K4084N8340R4441J29176J60886J88016K07286K14830K08678
$$ 7446699 7441490 7465574 7523914 7618355 7747531 7908417 8096433 8303719 8518549 8727227
59519H727227J89107J57042J13259N9128k790o9120j36303k00838k59435l09226
$$ 8727227 8916334 9073376 9186635 9245763 9242973 9173853 9037550 8836712 8577277 8268051
59509H268051l47995l74471l88529l91055l83522l67726l45649l19204k90075
$$ 8268051 7920056 7545585 7157056 6766001 6382479 6014753 5669104 5349900 5059825
59500E059825k59961k30625k03168j77542j53258j30365j09152q9203o9644n0295
$$ 5059825 4799864 4569239 4366071 4188529 4035271 3904906 3795754 3706551 3636907 3586612
59490C586612l1833j4647J741J8105L4888N2245P0009Q7658J04884J22147J39956
$$ 3586612 3554779 3540132 3541873 3559978 3594866 3647111 3717120 3804778 3909662 4031809 4171765
59479D171765J57680J73889J87958K00402K11360K19396K22187K17937K06047
$$ 4171765 4329445 4503334 4691292 4891694 5103054 5322450 5544637 5762574 5968621
59470E968621J86888J61075J28684Q9453M4242m084n2011r7326j38981j75625
$$ 5968621 6155509 6316584 6445268 6534721 6578963 6574879 6522868 6425542 6286561 6110936
59460F110936k05622k28415k44571k54358k57531k54684k47497k37311k24572
$$ 6110936 5905314 5676899 5432328 5177970 4920439 4665755 4418258 4180947 3956375
59451C956375k09962j94840j80025j65313j50666j36826j24228j12444j01249
$$ 3956375 3746413 3551573 3371548 3206235 3055569 2918743 2794515 2682071 2580822
59442B580822r1155q2286p3736o4835n6066m8023m0429l2997k6305k0931j6480
$$ 2580822 2489667 2407381 2333645 2268810 2212744 2164721 2124292 2091295 2064990 2044059 2027579
59431B027579j2301q468n195k129R59L434M820N901P833J0631J3536J6411J9686
$$ 2027579 2015278 2006810 2001615 1999486 2000445 2003879 2008699 2014600 2022433 2033064 2046600 2063011 2082697
59418B082697K3052K5217K5069K2487J8164J3281R390P922R507J3873K0343K8323
$$ 2082697 2105749 2130966 2156035 2178522 2196686 2209967 2219357 2227279 2236786 2250659 2271002 2299325
59406B299325L7475M7477N7321O5020O8675O8251O5924O4669O6799P3497Q4628
$$ 2299325 2336800 2384277 2441598 2506618 2575293 2643544 2709468 2774137 2840936 2914433 2999061
59395B999061R8707J14050J30455J49234J71260J95883K22089K49829K79703L12120
$$ 2999061 3097768 3211818 3342273 3491507 3662767 3858650 4080739 4330568 4610271 4922391
59385D922391L47273L85033M24233M62613M97835N27847N49999N61083N59125
$$ 4922391 5269664 5654697 6078930 6541543 7039378 7567225 8117224 8678307 9237432
59376I237432N44500N18847M84040M42799L98964L55796L14672K76287K42028
$$ 9237432 9781932 10300779 10784819 11227618 11626582 11982378 12297050 12573337 12815365
59367A2815365K12922J87905J64540J40895J15583Q6558N1471R328l9160r2673
$$ 12815365 13028287 13216192 13380732 13521627 13637210 13723768 13775239 13784567 13745407 13652734
59357A3652734j49710k08016k64651l16747l61861l98081m24719m42678m53364
$$ 13652734 13503024 13295008 13030357 12713610 12351749 11953668 11528949 11086271 10632907
59348A0632907m57422m55084m47122m34419m16970l94545l68153l39841l11038
$$ 10632907 10175485 9720401 9273279 8838860 8421890 8027345 7659192 7319351 7008313
59339G008313k82059k53240k25481j99538j75631j54027j35357j20123j08358
$$ 7008313 6726254 6473014 6247533 6047995 5872364 5718337 5582980 5462857 5354499
59330E354499r9897r4462r1487r0291r0568r2309r5272r8772j01985j04181j04893
$$ 5354499 5254602 5160140 5068653 4978362 4887794 4795485 4700213 4601441 4499456 4395275 4290382
59319D290382j04143j02325r9672r6031r1335q5804p9500p2259o4383n6716m9540
$$ 4290382 4186239 4083914 3984242 3888211 3796876 3711072 3631572 3559313 3494930 3438214 3388674
59308C388674m2154l4052k5834j8208j0870l268M228J0931J7215K4116L1911M0084
$$ 3388674 3346520 3312468 3286634 3268426 3257556 3254288 3258516 3269447 3286662 3310778 3342689 3382773
59296C382773M8559N7959O8597Q0049R1775J03529J15182J26759J38488J50256
$$ 3382773 3431332 3489291 3557888 3637937 3729712 3833241 3948423 4075182 4213670 4363926
59286D363926J61158J70119J76613J80254J80151J75445J66173J52794J35123
$$ 4363926 4525084 4695203 4871816 5052070 5232221 5407666 5573839 5726633 5861756
59277E861756J12604Q5388N4295J9944j7188n5869r4062j29692j60790j85223
$$ 5861756 5974360 6059748 6114043 6133987 6116799 6060930 5966868 5837176 5676386 5491163
59267E491163k01437k09649k11580k08971k02879j94228j83999j72717j60466
$$ 5491163 5289726 5080077 4868497 4659526 4456647 4262419 4078420 3905703 3745237
59258C745237j47637j35007j22985j11314r9735q8350p7234o6159n4949m3841
$$ 3745237 3597600 3462593 3339608 3228294 3128559 3040209 2962975 2896816 2841867 2798026
59248B798026l3230k3269j3775m412N035J4586K4486L5503M8294O2531P7372R2968
$$ 2798026 2764796 2741527 2727752 2723340 2728375 2742961 2767447 2802950 2851244 2913775 2991147 3084115
59236C084115J10623J31177J54100J78668K05098K33729K63971K94892L25945
$$ 3084115 3194738 3325915 3480015 3658683 3863781 4097510 4361481 4656373 4982318
59227D982318L56061L82639M02511M13477M14003M02031L75367L33097K75950
$$ 4982318 5338379 5721018 6123529 6537006 6951009 7353040 7728407 8061504 8337454
59218H337454K05647J24943L7867n1001j37469k17475k86780l42028l81782m05860
$$ 8337454 8543101 8668044 8705911 8654910 8517441 8299966 8013186 7671158 7289376 6883516
59208F883516m14444m08904l92600l69393l41595l10492k78053k46567k16888
$$ 6883516 6469072 6060168 5667568 5298175 4956580 4646088 4368035 4121468 3904580
59199C904580j88639j62025j38002j16857r8086q1583o7537n5188m3283l1890
$$ 3904580 3715941 3553916 3415914 3299057 3200971 3119388 3051851 2996663 2953380 2921490
59189B921490k2307j4861q166r89O395J3151J9109K4513K9364L3443L6391L7676
$$ 2921490 2899183 2884322 2876156 2875167 2881562 2894713 2913822 2938335 2967699 3001142 3037533 3075209
59177C075209L7082L5154L2422K8491K2741J5541P706q47j0566k0677k9637l7093
$$ 3075209 3112291 3147445 3179867 3208358 3231099 3246640 3254346 3253499 3242933 3222256 3192619 3155526
59165C155526m3973n0574n5982n9570o1574o2009o0467n7371n4011n0914m7367
$$ 3155526 3111553 3060979 3004997 2945427 2883853 2821844 2761377 2704006 2649995 2599081 2551714
59154B551714m2914l8065l3205k8071k2684j7654j3154q761m456n51L558Q938
$$ 2551714 2508800 2470735 2437530 2409459 2386775 2369121 2355967 2347206 2342750 2342199 2345757 2354695
59142B354695J5139K0278K3756K7226L2100L7663M2648M7255N2352N7864O3210
$$ 2354695 2369834 2390112 2413868 2441094 2473194 2510857 2553505 2600760 2653112 2710976 2774186
59131B774186O8455P3864P8992Q3254Q6802Q9924R2139R2758R1797Q9629Q6264
$$ 2774186 2842641 2916505 2995497 3078751 3165553 3255477 3347616 3440374 3532171 3621800 3708064
59120C708064Q1692P6431P1133O5977O0930N6141N1748M7840M4876M3532M3888
$$ 3708064 3789756 3866187 3937320 4003297 4064227 4120368 4172116 4219956 4264832 4308364 4352252
59109D352252M5485M8384N3275O0174O7904P5136Q1075Q4750Q4631P9386O8155
$$ 4352252 4397737 4446121 4499396 4559570 4627474 4702610 4783685 4868435 4953066 5032452 5100607
59098E100607M9952K4128q025m3295p8875j13507j45852j73332j93807k07349
$$ 5100607 5150559 5174687 5166662 5123367 5044492 4930985 4785133 4611801 4417994 4210645
59088D210645k15140k17451k13975k05536j94226j81989j69762j57690j45514
$$ 4210645 3995505 3778054 3564079 3358543 3164317 2982328 2812566 2654876 2509362
59079B509362j33133j21181j10642j01574r2974q4269p6076o9078o3041n7508
$$ 2509362 2376229 2255048 2144406 2042832 1949858 1865589 1789513 1720435 1657394 1599886
59069A599886n2463m7773m2974l8274l4622l2127k9490k5887k2201j9462j7262
$$ 1599886 1547423 1499650 1456676 1418402 1383780 1351653 1322163 1296276 1274075 1254613 1237351
59058A237351j4899j2903j1944j1146r138o191l860k906k920l532m593n569o119
$$ 1237351 1222452 1209549 1197605 1186459 1177321 1171130 1167270 1164364 1161444 1157912 1153319 1147750 1141631
59045A141631o998q974j1013j1049q669n650l525j827Q51M966R731J3967J6794
$$ 1141631 1134633 1125659 1114646 1103597 1094928 1089278 1085753 1083926 1084777 1089743 1099474 1113441 1130235
59032A130235J7949J7847J7108J5878J3874J0968P514M169J665M78L99O91R18
$$ 1130235 1148184 1166031 1183139 1199017 1212891 1223859 1231373 1235542 1237207 1237685 1238084 1238775 1239693
59019A239693J358K396L906N583P341Q982R971J0042R558Q783P361N038K357p4
$$ 1239693 1241051 1243447 1247353 1252936 1260277 1269259 1279230 1289272 1298830 1307613 1314974 1320012 1322369 1322295
59005A322295k525n558q895j1593j3124j3686j3662j3388j3114j2709j1649r851
$$ 1322295 1319770 1314212 1305317 1293724 1280600 1266914 1253252 1239864 1226750 1214041 1202392 1192541
58993A192541q131p230o752n691l728j414O80K326L477M328N355O771Q144R005
$$ 1192541 1184410 1177180 1170428 1164737 1161009 1159595 1160275 1162601 1166078 1170406 1175761 1182532 1190676 1199681
58979A199681R537J0115J0586J0600J0426J0750J1840J3436J5362J7690K0313
$$ 1199681 1209218 1219333 1229919 1240519 1250945 1261695 1273535 1286971 1302333 1320023 1340336
58968A340336K2774K4594K5637K6222K6918K7896K8594K8420K7763K7471K7341
$$ 1340336 1363110 1387704 1413341 1439563 1466481 1494377 1522971 1551391 1579154 1606625 1633966
58957A633966K6165K3690K1465K1089K2470K4598K7131L0230L3506L6398L9219
$$ 1633966 1660131 1683821 1705286 1726375 1748845 1773443 1800574 1830804 1864310 1900708 1939927
58946A939927M2760M6897N0546N3077N5014N7331O0589O4768O9530P4574Q0064
$$ 1939927 1982687 2029584 2080130 2133207 2188221 2245552 2306141 2370909 2440439 2515013 2595077
58935B595077Q6578R4435J03315J12749J22704J33474J45350J58578J73267J89095
$$ 2595077 2681655 2776090 2879405 2992154 3114858 3248332 3393682 3552260 3725527 3914622
58925C914622K05539K22597K40883K60984K83235L07971L35246L64251L94020
$$ 3914622 4120161 4342758 4583641 4844625 5127860 5435831 5771077 6135328 6529348
58916F529348M24839M57767M92479N26747N58484N86990O11361O28910O36206
$$ 6529348 6954187 7411954 7904433 8431180 8989664 9576654 10188015 10816925 11453131
58907A1453131O30748O10663N73720N18036M43459L51590K45139J28109N934j15591
$$ 11453131 12083879 12694542 13268262 13786298 14229757 14581347 14826486 14954595 14960529 14844938
58897A4844938k31231l35955m24959m95261n46718n80634n98095o00477n90640
$$ 14844938 14613707 14277752 13852793 13357532 12810814 12230180 11632085 11031608 10440968
58888A0440968n72142n47709n19298m88942m58301m27828l97541l68281l41285
$$ 10440968 9868826 9321117 8801819 8312877 7854576 7426748 7029207 6660926 6319641
58879F319641l16935k94818k74586k55953k38369k21624k06188j92112j78353
$$ 6319641 6002706 5707888 5433302 5177349 4938980 4717356 4511168 4319056 4140703
58870D140703j64175j50480j38482j27744j16916j05900r5862q7357p9769p2529
$$ 4140703 3976528 3826048 3687566 3559822 3442906 3337006 3241144 3153787 3074018 3001489
58860C001489o5637n8954n2144m5380l9242l3868k8855k3900j8877j3535p769
$$ 3001489 2935852 2876898 2824754 2779374 2740132 2706264 2677409 2653509 2634632 2621097 2613328
58849B613328j988L370Q321J2941J7110K1208K6195L2312L8468M3815M9004N4983
$$ 2613328 2611340 2614710 2623031 2635972 2653082 2674290 2700485 2732797 2771265 2815080 2864084 2919067
58837B919067O1517O8075P5161Q3421R2219J00616J09137J19116J30774J43408
$$ 2919067 2980584 3048659 3123820 3207241 3299460 3400076 3509213 3628329 3759103 3902511
58827C902511J56899J71612J87281K03608K21517K42256K65543K90220L16384
$$ 3902511 4059410 4231022 4418303 4621911 4843428 5085684 5351227 5641447 5957831
58818E957831L45187L76648M09441M42797M76903N11078N43087N70579N91959
$$ 5957831 6303018 6679666 7089107 7531904 8008807 8519885 9062972 9633551 10225510
58809A0225510O05474O08678N99125N74685N33089M72489L93000K97127J88702
$$ 10225510 10830984 11439662 12038787 12613472 13146561 13619050 14012050 14309177 14497879
58800A4497879P2122m7617j65260k75906l74870m57756n21967n67988n98086o13840
$$ 14497879 14570001 14522384 14357124 14081218 13706348 13248592 12726625 12158637 11560551 10946711
58790A0946711o15994o06152n87175n61777n31942m99529m66216m32715l99095
$$ 10946711 10330717 9724565 9137390 8575613 8043671 7544142 7077926 6645211 6246116
58781F246116l65988l34589l05600k79112k55293k34394k16314k01077j89130
$$ 6246116 5880128 5545539 5239939 4960827 4705534 4471140 4254826 4053749 3864619
58772C864619j80187j72405j63989j55025j46437j37867j28290j18090j08671
$$ 3864619 3684432 3512027 3348038 3193013 3046576 2908709 2780419 2662329 2553658
58763B553658j00266r1943q3630p6206o9597o2674n5284m8659m3454l8897l4294
$$ 2553658 2453392 2361449 2277819 2201613 2132016 2069342 2014058 1965399 1921945 1883048 1848754
58752A848754k9904k6054k2607j9569j7043j4496j1416q632p622q573j0405j2595
$$ 1848754 1818850 1792796 1770189 1750620 1733577 1719081 1707665 1699033 1691411 1682838 1672433 1659838
58740A659838j5347j8080j9571j9777j9919k0446k0556j9984j9627k0049k0823
$$ 1659838 1644491 1626411 1606840 1587063 1567144 1546698 1526142 1506158 1486531 1466482 1445659
58729A445659k1789k3412k5589k7474k8855l0352l1977l2923l3033l2974l2731
$$ 1445659 1423870 1400458 1374869 1347395 1318540 1288188 1256211 1223288 1190255 1157281 1124550
58718A124550l1465k9204k7193k6065k5113k3758k2309k0968j9406j7687j6318
$$ 1124550 1093085 1063881 1036688 1010623 985510 961752 939443 918475 899069 881382 865064
58707H65064j5109j3385j1441j0296r833q849p144n924n759n876n800n985o355
$$ 865064 849955 836570 825129 814833 805000 796151 789007 783083 777324 771448 765648 759663 753308
58694G53308n988m849m160m432m763m608m679n417o159o380o305n719l854j059
$$ 753308 747320 742471 738311 733879 729116 724508 719829 714412 708253 701873 695568 689849 685995 684936
58680F84936J133K158L109M629N858O143O071O029N502M614M694O318Q370R932
$$ 684936 686069 688227 691336 695965 701823 707966 714037 720066 725568 730182 734876 741194 749564 759496
58666G59496J1498J3368J4439J3652J1167P216J389n809j2223j6055j7454j7211
$$ 759496 770994 784362 798801 812453 823620 830836 832225 826416 814193 798138 780684 763473
58654G63473j5358j2106q750o299m314k067K04K095L940N939P514Q443R531J1437
$$ 763473 748115 736009 727259 720960 716646 714579 714783 716878 720818 726757 734271 742714 752245 763682
58640G63682J3832J6318J8976K1552K3469K5170K7949L1790L5077L7136L9324
$$ 763682 777514 793832 812808 834360 857829 882999 910948 942738 977815 1014951 1054275
58629A054275M2763M6779N0657N5138O1000O7668P4569Q2413R1928J02625J13852
$$ 1054275 1097038 1143817 1194474 1249612 1310612 1378280 1452849 1535262 1627190 1729815 1843667
58618A843667J25763J38162J49833J60088J69536J78190J84175J85316J80686
$$ 1843667 1969430 2107592 2257425 2417513 2587049 2765239 2949414 3134730 3315416
58609C315416J69684J51283J25370R3459N7028J6837k5074o4578r8227j25363
$$ 3315416 3485100 3636383 3761753 3855212 3912240 3929077 3904003 3839425 3741198 3615835
58599C615835j46418j60873j68381j70206j67845j61615j52070j41255j30819
$$ 3615835 3469417 3308544 3140163 2969957 2802112 2640497 2488427 2347172 2216353
58590B216353j20207j08362r5905q4080p2918o2152n2642m5093l8503l1608k4951
$$ 2216353 2096146 1987784 1891879 1807799 1734881 1672729 1620087 1574994 1536491 1504883 1479932
58579A479932j9881j6546j4390j3627j4559j6218j7183j7102j6280j4700j2585
$$ 1479932 1460051 1443505 1429115 1415488 1400929 1384711 1367528 1350426 1334146 1319446 1306861
58568A306861j0869j0077r873j0600j3712j9480k5825l0693l4081l6444l6969
$$ 1306861 1295992 1285915 1276042 1265442 1251730 1232250 1206425 1175732 1141651 1105207 1068238
58557A068238l5108l2167k9495k6624k2872j9267j7009j5545j4048j3368j4415
$$ 1068238 1033130 1000963 971468 944844 921972 902705 885696 870151 856103 842735 828320
58546H28320j6002j6353j5612j4908j4163j2877j1819j1740j1582j0139q449q284
$$ 828320 812318 795965 780353 765445 751282 738405 726586 714846 703264 693125 684676 676392
58534F76392r236r483q668p837p302o617o105o391p002p098o881o720n879l843
$$ 676392 667156 657673 649005 641168 633866 627249 621144 614753 607751 600653 593772 587052 581173 577330
58520E77330j813j104j133q00n45r98r77Q25L243M188L852L941M594M546L760
$$ 577330 575517 574413 573280 572480 571935 570937 569960 570785 574028 578216 582068 586009 590603 595149 598909
58505E98909L349L384L050K613K981L742L756L423M208O243Q259R630J0656J1156
$$ 598909 602258 605642 608692 611305 614286 618028 621784 625207 629415 635658 643917 653547 664203 675359
58491F75359J0535Q919O739L822L14k472l737m636o352p923q066p786q813j0493
$$ 675359 685894 694813 701552 705374 705688 703216 699479 694843 688491 680568 672502 664716 655903 645410
58477F45410j0769r475q237p772p611p812q603q956p821o265o093o952p052o089
$$ 645410 634641 625166 616929 609157 601546 593734 585131 576175 568354 562089 555996 549044 541992 535903
58463E35903n189m515l277j700q05n98m03l67p97r19k54k6j166k147j276K84N07
$$ 535903 530714 526199 522922 521222 520417 519819 519416 519049 518252 517333 517079 517053 515887 513740 512464 512748 513255
58446E13255J37J291L591M910N131N823O819O435M753L476K722J127j081k175
$$ 513255 513392 514683 518274 523184 528315 534138 540957 547392 552145 555621 558343 559470 558389 556214
58432E56214k017j992k060r06J066J885J310R74J329J328J202K461M828O153N807
$$ 556214 554197 552205 550145 549239 550305 552190 553500 554474 555803 557131 558333 560794 565622 571775 577582
58417E77582N481O178O996P268P460P667P368O872O910O872N587L564K211J318
$$ 577582 583063 589241 596237 603505 610965 618632 626000 632872 639782 646654 652241 655805 658016 659334
58403F59334k37j909k188j348q29m75Q16K402K787K649L801N755O507O183O609
$$ 659334 659097 657188 655000 653652 652823 652348 653164 655566 658353 661002 664803 670558 677065 683248 689857
58388F89857P689P673O675O361O443N015K304M92j38j337l200l911l195k548k027
$$ 689857 697546 705219 711894 718255 724698 729713 732017 732509 732371 731034 727834 723923 720728 718180 716153
58373G16153l59J817K480J935K325L550L568K630L083M838N316M187L922N138
$$ 716153 715794 717611 720091 722026 724351 727901 731469 734099 737182 742020 747336 751523 755445 760583
58359G60583N710N156N545P236P880O738N809N733M626K091L97M36L91m78m86
$$ 760583 766293 771449 776994 784230 792110 798848 804657 810390 815016 817107 817504 817940 818331 817853 817367
58344H17367Q93J865J796K229L585M400M707O254Q704R567Q705Q783J0446J1280
$$ 817367 818260 820125 821921 824150 827735 832135 836842 843096 851800 861367 870072 878855 889301 900581
58330I00581J0481J0160J0991J0945R590R277J0727J1720J1431J1772J3178J3410
$$ 900581 911062 921222 932213 943158 952748 962025 972752 984472 995903 1007675 1020853 1034263
58318A034263J1929J1078J1591J1297R522Q390Q490P814O248O446Q822J0441J0247
$$ 1034263 1046192 1057270 1068861 1080158 1089680 1098070 1106560 1114374 1120622 1127068 1135890 1146331 1156578
58305A156578J0652J2501J3467J2938J3438J5606J6780J6232J6643J8670J9397
$$ 1156578 1167230 1179731 1193198 1206136 1219574 1235180 1251960 1268192 1284835 1303505 1322902
58294A322902J8013J7689J9842K1783K2050K2732K4639K5657K5729K7832L2136
$$ 1322902 1340915 1358604 1378446 1400229 1422279 1445011 1469650 1495307 1521036 1548868 1581004
58283A581004L5046L5918L8428M3275M6151M5424M5091M7238M8201M5419M1502
$$ 1581004 1616050 1651968 1690396 1733671 1779822 1825246 1870337 1917575 1965776 2011195 2052697
58272B052697L8370L3874K7582K3404K2990K2954K1806K2944K7550L1548L3100
$$ 2052697 2091067 2124941 2152523 2175927 2198917 2221871 2243677 2266621 2294171 2325719 2358819
58261B358819L5969M1780M6431M7963N0398N5691N9621O0057O1386O6137P0198
$$ 2358819 2394788 2436568 2482999 2530962 2581360 2637051 2696672 2756729 2818115 2884252 2954450
58250B954450P1069P2798P7821Q2177Q3862Q7342R4522J00151J01835J05369J14119
$$ 2954450 3025519 3098317 3176138 3258315 3342177 3429519 3524041 3624192 3726027 3831396 3945515
58239C945515J22569J26916J32311J42637J52870J59074J66297J78739J91891
$$ 3945515 4068084 4195000 4327311 4469948 4622818 4781892 4948189 5126928 5318819
58230E318819K02295K15017K33203K50681K63651K78903L01400L24846L44235
$$ 5318819 5521114 5736131 5969334 6220015 6483666 6762569 7063969 7388815 7733050
58221G733050L66144L96405M29428M60628M97069N44318N95452O45302P02466
$$ 7733050 8099194 8495599 8925027 9385655 9882724 10427042 11022494 11667796 12370262
58212A2370262P74561Q55566R41340J042765J168950J313440J473204J664487
$$ 12370262 13144823 14000389 14941729 15984494 17153444 18466884 19940088 21604575
58204B1604575J902902K186878K521015K936981L470152M136616M955584N967875
$$ 21604575 23507477 25694355 28215370 31152351 34622503 38759119 43714703 49682578
58196D9682578P202809Q656604J0345103J2358595J4833205J7904956K1725732
$$ 49682578 56885387 65541991 75887094 88245689 103078894 120983850 142709582
58189A42709582K6417277L1801186L7051753M0649148M0790388L6049369K6012814
$$ 142709582 169126859 200928045 237979798 278628946 319419334 355468703 381481517
58182C81481517J1712625m401755j9209581l0164467l6242474l7941474l6525839
$$ 381481517 393194142 388792387 369582806 339418339 303175865 265234391 228708552
58175B28708552l3269221k9148370k4847487k0794374j7187707j4077950j1457413
$$ 228708552 195439331 166290961 141443474 120649100 103461393 89383443 77926030
58168G7926030r287628p494843n992400m710783l593020k573057j576711n46256
$$ 77926030 68638402 61143559 55151159 50440376 46847356 44274299 42697588 42151332
58160D2151332N26476J562724K376623K714367K360786J264276l87852k198019
$$ 42151332 42677808 44240532 46617155 49331522 51692308 52956584 52568732 50370713
58152E0370713l710291m620543m896505m712164m278314l737592l174819k652064
$$ 50370713 46660422 42039879 37143374 32431210 28152896 24415304 21240485 18588421
58144A8588421k203443j827520j512592j257947j060798r03391p69213o57653
$$ 18588421 16384978 14557458 13044866 11786919 10726121 9822730 9053517 8395864
58136H395864n70488m98530m33941l81972l47763l23373k99561k79081k66897
$$ 8395864 7825376 7326846 6892905 6510933 6163170 5839797 5540236 5261155 4994258
58127D994258k57646k44181k29043k16739k03380j84379j64257j48819j35090
$$ 4994258 4736612 4492431 4263388 4046649 3843269 3658890 3494633 3345814 3210724
58118C210724j18486j02653r2998q7318q1571p8334q0859q4955q5152q3107q2201
$$ 3210724 3092238 2989585 2896587 2809269 2727698 2649364 2568505 2483550 2398398 2315291 2233090
58107B233090p9894p3171o5740o1876n8658n1932m4617m1431m0536l7954l5413
$$ 2233090 2153196 2080025 2014285 1952409 1893751 1841819 1797202 1755771 1715235 1677281 1641868
58096A641868l6260l8192l7407l5730l6500l7553l5344l2048l1535l2069k9860
$$ 1641868 1605608 1567416 1530009 1494279 1457779 1420226 1384882 1352834 1321299 1289230 1259370
58085A259370k6384k5372k5845k4767k3421k4555k6231k4925k2146k1690k2838
$$ 1259370 1232986 1207614 1181769 1157002 1133581 1109026 1082795 1057870 1035724 1014034 991196
58074I91196k2259k0264j9372j8916j6757j4146j3479j3432j1448q825q204q380
$$ 991196 968937 948673 929301 910385 893628 879482 866003 852571 841123 832298 824094 815714
58062H15714o720m468m409n623n524n002o366q344q274p223p936r528r331q067
$$ 815714 808994 804526 800117 794494 788970 783968 777602 769258 760984 753761 745825 736297 726966 718899
58048G18899q220q964p743n336m469m825m196l105l562m611l814j878j252j368
$$ 718899 710679 701715 693972 688636 684167 679342 675146 672041 668479 663868 660054 658176 656924 655556
58034F55556J35K642L590L118L246L580K260J51l95M2q78k573k538j200j296k940
$$ 655556 655691 658333 661923 665041 668287 671867 674127 674278 673883 673925 673047 670474 667936 666736 665440 662500
58018F62500l654k928k656l240l250k679k833l285k537j259j282j998j397p6l86
$$ 662500 658846 655918 653262 650022 646772 644093 641260 637975 635438 634179 632897 630899 629502 629426 629040
58003F29040k147l140l420n178q425j0763j1568j2692j4737j6204j6678j7492
$$ 629040 626893 623753 620333 615155 606730 595967 584399 571707 556970 540766 524088 506596
57991E06596j8823j9167j8065j6442j4148j0056m760l52K670N583Q536J0156J0109
$$ 506596 487773 468606 450541 434099 419951 409895 405135 404783 407453 413036 421572 431728 441837
57978D41837R485Q684P348O185O326P108O947O053N741N619M208J871K81o44k373
$$ 441837 451322 460006 467354 473539 479865 486973 493920 499973 505714 511333 515541 517412 517693 517049 514676
57963E14676m710n984o086o433p051o576m989l607k515p79J082J668J470K209
$$ 514676 509966 503982 497896 491463 484412 477836 472847 469240 466725 465946 467028 468696 470166 472375
57949D72375L670M142L714L973M651L930K100J500K468K695J094q55k249m085
$$ 472375 476045 480187 483901 487874 492525 496455 498555 500055 502523 505218 506312 505457 503208 499123
57935D99123o609q354q789r182r905r623q040o885p048p136o028m612m006l999
$$ 499123 492514 484160 475371 466189 456284 446661 438621 431736 424688 417552 411524 406912 402906 398907
57921C98907m187m701n047m101j939J22J695L598N662O518O097O054P098Q055
$$ 398907 394720 390019 384972 380871 378932 379054 380749 384347 390009 396527 402624 408678 415776 423831
57907D23831Q265Q629R467R608Q524P411P064O618N363M023L135J893l48k852
$$ 423831 432096 440725 450192 459800 468324 475735 482799 489417 494780 498803 501938 503831 503483 500631
57893E00631m703n926o739o991o969p407q222q521q151p863p677o746n102l891
$$ 500631 495928 490002 483263 476272 469303 461896 453674 445153 437002 429139 421462 414716 409614 405723
57879D05723l484k940j749n02M96J684L003L770M112M878N904O117N553N443O000
$$ 405723 402239 399299 397550 397048 397544 399228 402231 406001 410113 414991 420895 427012 432565 438008 444008
57864D44008O016N084M244L955L312J875M68m81j650l227m268m309m019l791l273
$$ 444008 450024 455108 459352 463307 466619 468494 468962 468481 466831 463604 459336 455027 451008 447217 443944
57849D43944k705k905l527l147j588l49k16l37j89n09j524k240k278k569l460
$$ 443944 441239 438334 434807 431660 430072 429723 429507 429170 428981 428472 426948 424708 422430 419861 416401
57834D16401l975l754l878m841n615n659o042p488r027r714j0012j0361j0007
$$ 416401 412426 408672 404794 399953 394338 388679 382637 375149 366122 356408 346396 336035 326028
57821C26028q533p024o490o403n917n283m940m446l400k333j772j405q74k95N40
$$ 326028 317495 310471 303981 297578 291661 286378 281438 276992 273592 271259 269487 268082 267208 266913 267453
57806B67453K179M159N183N187N714P548R613J0940J1939J2887J2960J1803J0374
$$ 267453 269632 273791 278974 284161 289875 297423 307036 317976 329915 342802 355762 367565 377939
57793C77939R123P182M428K525K427K688J777M33n5l57j919m416o341p382q387
$$ 377939 387062 394244 398672 401197 403624 406312 408089 408522 408467 408110 406191 401775 395434 388052 379665
57778C79665r606j0561j1175j1592j1360j0100q482p452o875o019m818l730k850
$$ 379665 370059 359498 348323 336731 325371 315271 306789 299337 292462 286443 281625 277895 275045
57765B75045k046j434j059o11o2K43M91J447L047M190M500M957N927O155M850
$$ 275045 272999 271565 270506 269895 269833 270076 270567 272014 275061 279251 283751 288708 294635 300790 305640
57750C05640L339L265M295N018N139N297N542N468N227N134M901M289L847M006
$$ 305640 308979 312244 316539 321557 326696 331993 337535 343003 348230 353364 358265 362554 366401 370407
57736C70407M195L911L797M494N349N452N201N577O534P356P984Q828R819J0733
$$ 370407 374602 378513 382310 386804 392153 397605 402806 408383 414917 422273 430257 439085 448904 459637
57722D59637J1893J3511J4920J5462J5510J5754J6242J6975J8573K1129K3452
$$ 459637 471530 485041 499961 515423 530933 546687 562929 579904 598477 619606 643058
57711F43058K4666K5837K8622L2996L7609M1921M6596N2215N8753O6069P3916
$$ 643058 667724 693561 722183 755179 792788 834709 881305 933520 992273 1058342 1132258
57700A132258Q1938R0452J00553J12633J25528J38081J50574J63417J75417J84620
$$ 1132258 1214196 1304648 1405201 1517834 1643362 1781443 1932017 2095434 2270851 2455471
57690B455471J90019J90934J85585J72009J49985J20719Q5250M4847K538l7602
$$ 2455471 2645490 2836424 3022009 3194018 3344003 3464722 3549972 3594819 3597357 3559755
57680C559755p2746j01754j23689j37418j42699j40436j31858j18228j00906q0468
$$ 3559755 3487009 3385255 3261566 3124148 2981449 2841013 2709155 2590927 2490021 2409553
57670B409553n6278k8402K28K4542L9826M2384K9208j58m0664q2543j16234j36522
$$ 2409553 2353275 2324873 2325101 2349643 2389469 2431853 2461061 2460903 2420239 2337696 2221462 2084940
57658B084940j42780j37302j23998j07058q9416p2436n6876m3318l1671k1196
$$ 2084940 1942160 1804858 1680860 1573802 1484386 1411950 1355074 1311756 1280085 1258889
57648A258889j1425k493N524J3021K0569K8653L7514M6851N6035O5082P4890Q5913
$$ 1258889 1247464 1244971 1250495 1263516 1284085 1312738 1350252 1397103 1453138 1518220 1593110 1679023
57636A679023R7348J08482J19974J32572J45162J55448J62134J65086J63591J55972
$$ 1679023 1776371 1884853 2004827 2137399 2282561 2438009 2600143 2765229 2928820 3084792
57626C084792J40917J18146Q7997N1644J1813k8012o5179r8055j25123j45298
$$ 3084792 3225709 3343855 3431852 3483496 3495309 3467297 3402118 3304063 3178940 3033642
57616C033642j58869j66834j69441j66663j59876j51407j42301j32059j20699
$$ 3033642 2874773 2707939 2538498 2371835 2211959 2060552 1918251 1786192 1665493
57607A665493j09512r9374q9859q0620p2366o5711o0155n4859m9676m4850m0478
$$ 1665493 1555981 1456607 1366748 1286128 1213762 1148051 1087896 1033037 983361 938511 898033
57596H98033l6674l3552l0711k7522k4189k1686k0401j9583j8401j6727j4685
$$ 898033 861359 827807 797096 769574 745385 723699 703298 683715 665314 648587 633902
57585F33902j2396j0434r637r964j0290r753q610p522o679n984n366m629l504
$$ 633902 621506 611072 601435 591471 581181 571428 562818 555296 548617 542633 537267 532638 529134
57572E29134k113p83N45K099L449L887L666L933N225O977Q654J0349J2001J3099
$$ 529134 527021 526238 526783 528882 532331 536218 539884 543817 549042 556019 564673 575022 587023 600122
57558F00122J3663J4598J6471J8732K0724K2686K5257K8597L2551L7125M2231
$$ 600122 613785 628383 644854 663586 684310 706996 732253 760850 793401 830526 872757
57547H72757M7507N2762N8297O4435P1231P8804Q7344R6569J05703J14210J21910
$$ 872757 920264 973026 1031323 1095758 1166989 1245793 1333137 1429706 1535409 1649619 1771529
57536A771529J28281J32275J33019J29906J21845J07436Q6410O0186L0655p22
$$ 1771529 1899810 2032085 2165104 2295010 2416855 2524291 2610701 2670887 2701542 2700820
57526B700820l2247o1385q5823j04658j18023j26129j29318j28551j24896j18806
$$ 2700820 2668573 2607188 2521365 2416707 2298684 2172555 2043237 1914686 1789790 1670984
57516A670984j10414j00443r0193q0774p2524o5117n7985n0909m4357l8970l4589
$$ 1670984 1560570 1460127 1369934 1289160 1216636 1151519 1093534 1042625 998268 959298 924709
57505I24709l0297k5610k1073j7313j4054j0647p145m203j975K00K963O134R102
$$ 924709 894412 868802 847729 830416 816362 805715 798570 794367 792392 792592 795555 801689 810791
57492H10791J1742J4705J8626K3358K8274L3164L8413M4224N0380N6950O4526
$$ 810791 822533 837238 855864 879222 907496 940660 979073 1023297 1073677 1130627 1195153
57481A195153P3225Q2143R0434R8325J06268J13699J19559J23359J24555J21317
$$ 1195153 1268378 1350521 1440955 1539280 1645548 1759247 1878806 2002165 2126720 2248037
57471B248037J11460R4602P2257M5878J6205j5394m6424p4602r8634j17473j30115
$$ 2248037 2359497 2454099 2526356 2572234 2588439 2573045 2526621 2452019 2353385 2235912 2105797
57460B105797j36724j38771j37424j32731j24832j14966j04618r4539q5130p6826
$$ 2105797 1969073 1830302 1692878 1560147 1435315 1320349 1215731 1121192 1036062 959236
57450I59236o9599o2923n6775n1705m7527m3112l8159l3897l1142k8845k5727
$$ 959236 889637 826714 769939 718234 670707 627595 589436 555539 524397 495552 469825
57439D69825k2337k0128j9195j8387j7143j5855j4625j3013j1145r851r506r498
$$ 469825 447488 427360 408165 389778 372635 356780 342155 329142 317997 308146 298640 289142
57427B89142r171q580q158q058q018p638o727n588m765m393m069l563l221l360
$$ 289142 279971 271391 263233 255175 247157 239519 232792 227204 222439 218046 213977 210414 207193 203833
57413B03833l695l770l564l301l033k775k645k520j952q59J73O11N45K26l45r85
$$ 203833 200138 196368 192804 189503 186470 183695 181050 178530 176578 175719 175892 176503 177048 177274 176929 175944
57397A75944j159p90n55q47j099p86m06o58j209j223o91l40n25r96j504j874j821
$$ 175944 174785 173995 173440 172593 171494 170708 170302 169644 168435 167212 166521 166181 165656 164660 163156 161282 159461
57380A59461j342j084j541k286k632k689k955l359l567l846m588n328n340m919
$$ 159461 158119 157035 155494 153208 150576 147887 144932 141573 138006 134160 129572 124244 118904 113985
57366A13985m999n579n789n453n278n344m781l332k030j611j345k28J467K687
$$ 113985 108986 103407 97618 92165 86887 81543 76762 73430 71400 69789 68444 68216 69683 72370
57352G2370L061L006K854K664K699L237L935M125L702L284L385L872M346M662
$$ 72370 75431 78437 81291 83955 86654 89891 93826 97951 101653 104937 108322 112194 116540 121202
57338A21202M848M884M828M925N250N423M996M171L639L727M086M421M983N940
$$ 121202 126050 130934 135762 140687 145937 151360 156356 160527 164166 167893 171979 176400 181383 187323
57324A87323O747O819O498O574P062P378P551Q239R378R975R655R391J0041J1138
$$ 187323 194070 200889 207387 213961 221023 228401 235952 244191 253569 263544 273199 282590 292631 303769
57310C03769J1871J2403J3299J4291J4745J4890J5494J6611J7618J8423J9608
$$ 303769 315640 328043 341342 355633 370378 385268 400762 417373 434991 453414 473022
57299D73022K1298K2764K3327K3099K2573K2005K1247J9924J7715J4651J0919
$$ 473022 494320 517084 540411 563510 586083 608088 629335 649259 666974 681625 692544
57288F92544O232m3p636j4853k0069k3422k6232k9058l1251l2228l2206l1564
$$ 692544 698776 698733 691097 676244 656175 632753 606521 577463 546212 513984 481778 450214
57276D50214l0285k8236k5507k2372j9328j6973j5350j3720j1525r340q059p509
$$ 450214 419929 391693 366186 343814 324486 307513 292163 278443 266918 257578 249519 242010
57264B42010o755n584m666m318m133l890l790l628k775j296j73j1l31n32p35j198
$$ 242010 235255 229671 225005 220687 216554 212664 208874 205246 202471 201175 201002 200991 200660 200128 199393 198195
57248A98195j592j389o12K59P75O85Q0m52k82N00J158J225Q63L86ql2M28Q00M23
$$ 198195 196603 195214 194602 194861 195636 196321 196401 195949 195667 196167 197325 198550 199413 199799 199791 199759 200187 200987 201410
57229B01410l79o47k66r6l84k93N83J398J428J242J625K210K230J969K366L475
$$ 201410 201031 200384 200118 200022 199638 199345 199928 201326 202754 203996 205621 207831 210061 212030 214396 217871
57213B17871M331M317L835L665M133M920N348M941L940L005K386J821J413J798
$$ 217871 222202 226519 230354 234019 238152 243072 248420 253361 257301 260306 262692 264513 265926 267724
57199B67724L076M359M921N113N431N484M819M122M496N831O980P408P629Q063
$$ 267724 270800 275159 280080 285193 290624 296108 300927 305049 309545 315376 322356 329764 337393 345456
57185C45456Q531R041J0073J1683J3070J3547J3422J3497J4069J4851J5589J6330
$$ 345456 353987 363028 373101 384784 397854 411401 424823 438320 452389 467240 482829 499159
57173D99159J7210J8205J9150J9911K0516K1067K1532K1790K1915K2238K2902
$$ 499159 516369 534574 553724 573635 594151 615218 636750 658540 680455 702693 725595
57162G25595K3627K4060K4170K4109K3956K3877K4252K5205K6256K6800K6832
$$ 725595 749222 773282 797452 821561 845517 869394 893646 918851 945107 971907 998739
57151I98739K6824K6960K6969K6652K6260K6183K6579K7253K7894K8427K9161
$$ 998739 1025563 1052523 1079492 1106144 1132404 1158587 1185166 1212419 1240313 1268740 1297901
57140A297901L0448L2092L3471L4326L5085L6126L7215L7985L8679L9793M1242
$$ 1297901 1328349 1360441 1393912 1428238 1463323 1499449 1536664 1574649 1613328 1653121 1694363
57129A694363M2414M2973M3188M3355M3230M2228M0180L7996L7477M0031M5432
$$ 1694363 1736777 1779750 1822938 1866293 1909523 1951751 1991931 2029927 2067404 2107435 2152867
57118B152867N2144N8816O5017P0594P5403Q0151Q6570R5818J07311J19981J34189
$$ 2152867 2205011 2263827 2328844 2399438 2474841 2554992 2641562 2737380 2844691 2964672 3098861
57107C098861J51382J72238J96192K22795K52683K87292L28546L78918M41101
$$ 3098861 3250243 3422481 3618673 3841468 4094151 4381443 4709989 5088907 5530008
57098E530008N17642O11370P25764Q63858J026555J212396J418581J641424J876166
$$ 5530008 6047650 6659020 7384784 8248642 9275197 10487593 11906174 13547598 15423764
57089A5423764K117204K357733K587709K792258K953076L050846L066061K982128
$$ 15423764 17540968 19898701 22486410 25278668 28231744 31282590 34348651 37330779
57081C7330779K795376K523840K198813J839465J435662R61244M06733k02355
$$ 37330779 40126155 42649995 44848808 46688273 48123935 49085179 49491912 49289557
57073D9289557q18316j397754j915130k357422k713831k972517l124224l167038
$$ 49289557 48471241 47073487 45158357 42800935 40087104 37114587 33990363 30823325
57065C0823325l109065k967800k766021k526341k267989k006714j755263j522687
$$ 30823325 27714260 24746460 21980439 19454098 17186109 15179395 13424132 11901445
57057A1901445j313766j130126r71883q38043p26013o32057n52793m86079m30392
$$ 11901445 10587679 9457553 8485670 7647627 6921614 6289557 5736764 5250685 4820293
57048D820293l83769l43662l07789k74982k45312k19293j96953j77613j60535
$$ 4820293 4436524 4092862 3785073 3510091 3264779 3045486 2848533 2670920 2510385
57039B510385j45488j32494j21225j11045j01587r2937q5294p8673p2903o7628
$$ 2510385 2364897 2232403 2111178 2000133 1898546 1805609 1720315 1641642 1568739 1501111
57029A501111o2358n6898n1728m7551m4476m1955l9515l7140l4929l2891l1123
$$ 1501111 1438753 1381855 1330127 1282576 1238100 1196145 1156630 1119490 1084561 1051670 1020547
57018A020547k9647k7984k5487k2176j8561j4517r177k269N395J3392K2765L5031
$$ 1020547 990900 962916 937429 915253 896692 882175 872998 870729 876124 889516 912281 947312
57006I47312N0973P1157R6398J25716J53787J71538J69738J42316Q8577J5251
$$ 947312 998285 1069442 1165840 1291556 1445343 1616881 1786619 1928935 2017512 2032763
56996B032763o3226j29525j71667j87883j84221j68650j47307j24044j01083p9557
$$ 2032763 1969537 1840012 1668345 1480462 1296241 1127591 980284 856240 755157 675600
56986F75600o0051m2905k8031j5129m545K459M796K744k089p724j2610j6063j8395
$$ 675600 615549 572644 544613 529484 524939 527398 532194 534938 532849 525125 512515 496452 478057
56973D78057k0259k1589k1570j9766j6768j3506j0354p334m561k014O86L754O868
$$ 478057 457798 436209 414639 394873 378105 364599 354245 346911 342350 340336 341022 344776 351644
56960C51644R768J2908J6922K1546K5409K6661K3759J6198N137o866j7224k4541
$$ 351644 361412 374320 391242 412788 438197 464858 488617 504815 509952 503086 485862 461321
56948D61321k8562k9538k8063k5100k1509j7617j3440r248n495k341N17L613P353
$$ 461321 432759 403221 375158 350058 328549 310932 297492 288244 282749 280408 280925 284538 291891
56935B91891J1679J6126K0476K5202L0562L5297L6914L3574K5121J2519k588j7437
$$ 291891 303570 319696 340172 365374 395936 431233 468147 501721 526842 539361 536773 519336
56923E19336k8723l4800l6704l6321l4328l0732k6412k2691j9800j6969j3942
$$ 519336 490613 455813 419109 382788 348460 317728 291316 268625 248825 231856 217914
56912B17914j1263r175p318n538m161l392l061k984k961k604j760q86l36K66J276
$$ 217914 206651 197476 190158 184620 180459 177067 174006 171022 168061 165457 163697 162811 162475 162741 164017
56897A64017K117K213K267L392N218O353O666P583R882J2711J5245J7903K0926
$$ 164017 166134 168347 170614 174006 179224 185577 192243 199826 209708 222419 237664 255567 276493
56884B76493K2960K2065J7573J0284J605o765j3039j6281j6970j6164j4382j1736
$$ 276493 299453 321518 339091 349375 350980 344215 331176 314895 297925 281761 267379 255643
56872B55643q569n370k354M34K961N531Q779J2944J7704K3053K9606L7387M4924
$$ 255643 247074 241704 239350 239784 242745 248276 257055 269999 287703 310756 340362 377749 422673
56859D22673N0203N1956M9276M0887K6267P559j0929k5500l4899l9566m0220l7598
$$ 422673 472876 524832 574108 614995 641262 648821 637892 612392 577493 537927 497707 460109
56847D60109l2823k7086k1002j4578p764p84O078J2883K0077K8046L6754M6064
$$ 460109 427286 400200 379198 364620 356856 356072 362150 375033 395110 423156 459910 505974
56835E05974N6268O7565P8564Q5629Q4412P2266M9535J9389j2863m1115o0779
$$ 505974 562242 629807 708371 794000 878412 950678 1000213 1019602 1006739 965624 904845
56824I04845p0785p3126p0379o4019n4914m4455l4374k5686j8338j1731n275J450
$$ 904845 834060 760934 690555 626536 571622 527167 492793 467107 448769 437038 431763 433213
56812D33213Q665J6508K5286L5378M6501N6976O3999O4692N7097M0773J7368r155
$$ 433213 441878 458386 483672 519050 565551 622527 686526 751218 808315 849088 866456 857301
56800H57301l3556n1485o1163o3346o0200n4191m7401m0867l4464k7733k0887
$$ 857301 823745 772260 711097 647751 587551 533360 485959 445092 410628 382895 362008
56789C62008j4689r438m678N3M744R476J4897K1467K8365L3557L4980L1520K3244
$$ 362008 347319 337881 333203 333256 338000 347476 362373 383840 412205 445762 480742 512262 535506
56776E35506J1237k617j6086k7127l4373l7492l7197l4672l0807k6151k1460j7706
$$ 535506 546743 544126 528040 500913 466540 429048 391851 357179 326372 300221 278761 261055
56764B61055j5235j3418j1536r584p877o370m993m176m295m850m887m171l198
$$ 261055 245820 232402 220866 211282 203405 197035 192042 187866 183571 178721 173834 169663 166465
56751A66465k320j523j012j164j822k259k078j551j037o33m62o65r89r66o32n28
$$ 166465 164145 162622 161610 160446 158624 156365 154287 152736 151699 151066 150604 149939 148950 147984 147352 146824
56735A46824q46j175j260j367j650j752j323m80M03R71Q32j05j153j351o79j51
$$ 146824 145978 144803 143543 142176 140526 138774 137451 136971 137374 138345 139177 139072 137919 136568 135889 135738
56719A35738l75p45n41o7q7n87q83o54l04l28p99j410j754j597j099o12j77M70
$$ 135738 135363 134618 134077 134010 133923 133336 132453 131799 131495 131167 130368 128958 127204 125607 124508 123896 123719 124189
56701A24189J277J636J120J17n35m47N7M35M65L96O64J383K116K317J888J170
$$ 124189 125466 127102 128222 128339 127804 127357 127414 127849 128314 128710 129374 130757 132873 135190 137078 138248
56685A38248N56L34O38J181J268O09j99n01n34q47j190r60m76n78j068q42K18
$$ 138248 138804 139138 139776 140957 142225 142834 142635 142134 141600 140753 139563 138603 138127 137549 136481 135639 135857
56668A35857Q87N36O8L24P27M08l87r23j158j405j484j168p52m56J39J137J554
$$ 135857 136744 137280 137348 137672 138399 138807 138420 137497 136339 134934 133450 132282 131530 131074 131213 132350 133904
56651A33904M97j390k607k610j983j237l83M52Q77P28J80m50o57L0J259J856J219
$$ 133904 134401 133011 130404 127794 125811 124574 124191 124643 125520 126248 126428 125978 125321 125351 126610 128466 129685
56634A29685J94j03K45M33L26L67N30L64j08l77j61M44J251J829J526L42p46j031
$$ 129685 129879 129776 130021 130454 130780 131147 131677 132041 131933 131556 131395 131839 133090 134919 136445 136787 136041 135010
56616A35010j004j230j136k0J386J806J365J145J179N28p30j273n79L02M33P7
$$ 135010 134006 132776 131640 131620 133006 134812 136177 137322 138501 139029 138299 137026 136447 136749 137182 137259
56600A37259l31r83j818k048j361o26o18q08k56R75K034K472K493K348K156K047
$$ 137259 136928 135945 134127 132079 130718 130092 129474 128666 128410 129385 131419 133891 136384 138732 140888 142935
56584A42935K012J782J254P88P82J115J380J484J716K209K646K607K201K085K627
$$ 142935 144947 146729 147983 148771 149553 150668 152048 153532 155248 157457 160103 162710 164911 166996 169623
56569A69623L218K946K064J981L400N198N868N495N393O172P179P673P580P103
$$ 169623 172841 175787 177851 179832 183232 188430 194298 199793 205186 211358 218537 226210 233790 240893
56555B40893O425N880N667N442M754L827L159K579J549K52o08r63j444k292l176
$$ 240893 247318 253198 258865 264307 269061 272888 276047 278626 280175 280427 279819 278856 277412 275120 271944
56540B71944m051n133o055o154n728n782o361o385n495m727m799m977m493l896
$$ 271944 267893 262760 256705 250551 244823 239041 232680 226295 220800 216073 211274 206297 201804 197908
56526A97908l979m286l839k742j968j875j922j669j263r71q97j157j764k400k635
$$ 197908 193929 189643 185804 183062 181094 179219 177297 175628 174365 173394 172497 171340 169576 167176 164541
56511A64541k326j601o36K68P09O04M07N29P19L67o85j870k452k171j380o36j66
$$ 164541 162215 160614 159978 160246 160955 161559 161966 162495 163214 163581 162896 161026 158574 156403 155023 154387 154221
56494A54221K02O23R96J226J369J306P59J6J20J578L347L987L460K928K946L053
$$ 154221 154423 155046 156042 157268 158637 159943 160702 160718 160838 162416 165763 169750 173210 176138 179084 182137
56478A82137L051L335L807L713L035K818L553M255L960L164K870L056L126L272
$$ 182137 185188 188523 192330 196043 199078 201896 205449 209704 213664 216828 219698 222754 225880 229152
56464B29152M167N504N977M929L208K076J761J428K96j464k956l487l168k599
$$ 229152 233319 238823 244800 249729 252937 255013 256774 258202 258498 257034 254078 250591 247423 244824
56450B44824k195j918j479n82Q07K151K580J850P83L09L89M55M26M67J38j124
$$ 244824 242629 240711 239232 238650 239457 241608 244188 246038 246821 247130 247519 247974 248400 248867 249005 247881
56434B47881k693l147k191j140j194k129l075l634l705l096j976j128j151j799
$$ 247881 245188 242041 239850 238710 237516 235387 232312 228678 224973 221877 219901 218773 217622 215823
56420B15823k504l006l197k950k524k490k797k551j331j05q6j091j764j325l61
$$ 215823 213319 210313 207116 204166 201642 199152 196355 193804 192473 192368 192282 191191 189427 188102 187741
56405A87741J34J5m0M52J127J240P08K37L30O54O97N56N54N58L58L41Q88J472
$$ 187741 187875 187890 187850 188302 189429 190669 191377 191614 191944 192598 193295 193851 194405 194963 195321 195662 196550 198022
56387A98022J335Q15R75J911K538K183J357Q16P11Q87J163J159P20N66J509K966
$$ 198022 199357 200172 201147 203058 205596 207779 209136 209952 210663 211550 212713 213872 214592 215158 216667 219633
56371B19633L348K204Q74N81R78J087O93K38RL1K71N48O99R08J352J641J333Q51
$$ 219633 222981 225185 226059 226640 227618 228705 229398 229636 229645 229676 229947 230495 231194 232102 233454 235095 236428 237279
56353B37279R05J259J150P65R71J647J774J289J244J864K166J883K096L293M447
$$ 237279 238184 239443 240593 241358 242329 243976 245750 247039 248283 250147 252313 254196 256292 259585 264032
56338B64032M836N155N927O398O030N683O060O366N686M496L593K675J343L80
$$ 264032 268868 274023 279950 286348 292378 298061 304121 310487 316173 320669 324262 326937 328280 328660
56324C28660O24J404J505R56N95N03K07k13m12o99j466k138j849p96ML6m12q95
$$ 328660 329284 330688 332193 333149 333744 334247 334454 334241 333829 333130 331664 329526 327677 326881 326885 326921 326509 325614
56306C25614j047n91K01O27N95R27J975K851K698J967J608J772K086K490K998
$$ 325614 324567 323976 324177 324804 325399 326326 328301 331152 333850 335817 337425 339197 341283 343773 346771
56291C46771L359L684M611O176P368P535P352P671Q364R141J0340J2031J3383
$$ 346771 350130 353814 358425 364601 371969 379504 386856 394527 402891 412032 422372 434403 447786
56278D47786J4018J4920J6837J8834J9731K0058K1225K3516K6247K9230L2765
$$ 447786 461804 476724 493561 512395 532126 552184 573409 596925 623172 652402 685167
56267F85167L6686M0699M5202N0699N6787O2702O8443P4425Q0571Q6500R1991
$$ 685167 721853 762552 807754 858453 915240 977942 1046385 1120810 1201381 1287881 1379872
56256A379872R6524R9131R9548R8641R6859R3225Q6827P8363O9127N9377M8792
$$ 1379872 1476396 1575527 1675075 1773716 1870575 1963800 2050627 2128990 2198117 2257494 2306286
56245B306286L7737K6932J6646P212n40o382j1323j6153k0354k3471k6435l0354
$$ 2306286 2344023 2370955 2387601 2394813 2394273 2387891 2376568 2360415 2340061 2316590 2290155 2259801
56233B259801l4987l9740m5040n1390n7964o3559o8187p2463p6314p9342q1555
$$ 2259801 2224814 2185074 2140034 2088644 2030680 1967121 1898934 1826471 1750157 1670815 1589260
56222A589260q2653q1716p8803p5537p2846o9540o4492n8792n4012m9751m4825
$$ 1589260 1506607 1424891 1346088 1270551 1197705 1128165 1063673 1004881 950869 901118 856293
56211H56293l9663l5525l2277k8965k5714k3268k1379j9353j7300j5355j2737
$$ 856293 816630 781105 748828 719863 694149 670881 649502 630149 612849 597494 584757
56200E84757r257o478n505m927k941k88J140J382J766K302K248K289L587N407
$$ 584757 575500 569022 563517 558590 555649 555361 556501 557883 559649 561951 564199 566488 570075 575482
56186E75482O119N926O135O447N596M089L672M440M940M782M741M602L487K022
$$ 575482 581601 587527 593662 600109 605705 609794 613466 617906 622846 627628 632369 636971 640458 642480
56172F42480J710K361K517K180K600L632L880L440L950N731P250P677P793Q199
$$ 642480 644190 646551 649068 651248 653848 657480 661360 664800 668750 674481 681731 689408 697201 705400
56158G05400Q712R623J1577J4073J5909J7049J8406K0070K1609K3695K7468L2717
$$ 705400 714112 723735 735312 749385 765294 782343 800749 820819 842428 866123 893591 926308
56146I26308L8513M5053N2992O1699P0414Q0289R3024J08195J24130J40227J55593
$$ 926308 964821 1009874 1062866 1124565 1194979 1275268 1368292 1476487 1600617 1740844 1896437
56135A896437J66609J69112J62633J49804J32493J12001R2210P8331P1780O9007
$$ 1896437 2063046 2232158 2394791 2544595 2677088 2789089 2881299 2959630 3031410 3100417
56125C100417O5551N8621M6354K8350P568j1224k5464l5353m1387m4673m9222
$$ 3100417 3165968 3224589 3270943 3299293 3306861 3295637 3270173 3234820 3193433 3148760 3099538
56114C099538o0019p8049r9855j21754j41442j55990j62333j60537j53506j43105
$$ 3099538 3039519 2961470 2861615 2739861 2598419 2442429 2280096 2119559 1966053 1822948
56104A822948j29481j14046r9554q6801p4505o2702n3007m5441l8310l1405k6064
$$ 1822948 1693467 1579421 1479867 1393066 1318561 1255859 1202852 1157411 1119101 1087696 1061632
56093A061632k2032j7776j3777j1836j1161r063n636l666l717l448k173j672j992
$$ 1061632 1039600 1021824 1008047 996211 985050 975987 970351 966685 962968 959520 957347 955675 953683
56080I53683p94K215M526N256O246P896Q257P185P091Q499R075Q164Q009R424
$$ 953683 952889 955104 959630 964886 971132 979028 987285 994470 1001561 1010060 1019135 1027299 1035308 1044732
56066A044732J0496J0635J1604J3459J3891J2701J2474J3740J4038J2911J2979
$$ 1044732 1055228 1065863 1077467 1090926 1104817 1117518 1129992 1143732 1157770 1170681 1183660
56055A183660J4795J5629J4793J5129J7553J9167J8638J8447J9893K0846K0416
$$ 1183660 1198455 1214084 1228877 1244006 1261559 1280726 1299364 1317811 1337704 1358550 1378966
56044A378966K0950K3252K4761K4464K4811K6824K8201K8267K9680L3200L5960
$$ 1378966 1399916 1423168 1447929 1472393 1497204 1524028 1552229 1580496 1610176 1643376 1679336
56033A679336L6807L8093M0266M0395L8089L7139L9034M0668M0675M1848M4978
$$ 1679336 1716143 1754236 1794502 1834897 1872986 1910125 1949159 1989827 2030502 2072350 2117328
56022B117328M6679M6053M6982N0992N4352N5254N7074O1397O4713O5457O7323
$$ 2117328 2164007 2210060 2257042 2308034 2362386 2417640 2474714 2536111 2600824 2666281 2733604
56011B733604P1999P5628P6310P7979Q2915Q7572Q9844R3184R9432J05095J08794
$$ 2733604 2805603 2881231 2957541 3035520 3118435 3206007 3295851 3389035 3488467 3593562 3702356
56000C702356J14662J24046J31863J35677J40075J47634J54256J58191J64489
$$ 3702356 3817018 3941064 4072927 4208604 4348679 4496313 4650569 4808760 4973249
55991D973249J75401J85870J93836K05054K22055K38839K52524K69238K91989
$$ 4973249 5148650 5334520 5528356 5733410 5955465 6194304 6446828 6716066 7008055
55982G008055L14390L33597L57275L89771M23984M55499M91781N38204N88645
$$ 7008055 7322445 7656042 8013317 8403088 8827072 9282571 9774352 10312556 10901201
55973A0901201O39790P00522P76418Q60025R48141J052929J183424J332976J498954
$$ 10901201 11540991 12241513 13017931 13877956 14826097 15879026 17062450 18395426 19894380
55964A9894380J697078J941546K230983K572024K997148L541145M221781N061925
$$ 19894380 21591458 23533004 25763987 28336011 31333159 34874304 39096085 44158010
55956D4158010O102267P367603Q853693J0584257J2657875J5213999J8396899
$$ 44158010 50260277 57627880 66481573 77065830 89723705 104937704 123334603
55949A23334603K2377649K7283953L2890572L8265189M1766545M1519224L6116499
$$ 123334603 145712252 172996205 205886777 244151966 285918511 327437735 363554234
55942C63554234K5268093J0210066o394316k1305993l2020426l7674313l8931673
$$ 363554234 388822327 399032393 392638077 371332084 339311658 301637345 262705672
55935B62705672l7148918l3624504k9336114k4960875k0905464j7342656j4311348
$$ 262705672 225556754 191932250 162596136 137635261 116729797 99387141 85075793
55928H5075793j1803504r772913q132055o794834n709840m837665m126560l532894
$$ 85075793 73272289 63499376 55367321 48572487 42862647 38024982 33898422 30365528
55920C0365528l040808k640576k307566k019619j774709j573480j401430j244289
$$ 30365528 27324720 24684144 22376578 20356959 18582250 17008770 15607340 14363051
55912A4363051j104788r88733q88678p95573p12969o45905n87820n31274m80433
$$ 14363051 13258263 12269530 11380852 10585279 9872310 9226405 8638585 8107311 7626878
55903G626878m40799m06944l71943l39153l13860k92323k69404k48342k33128
$$ 7626878 7186079 6779135 6407192 6068039 5754179 5461856 5192452 4944110 4710982
55894D710982k19497k02778j86885j76559j68257j57264j46505j39888j34046
$$ 4710982 4491485 4288707 4101822 3925263 3757006 3599742 3453237 3313349 3179303
55885C179303j24886j15611j10311j05931r8346r0204q5309q1195p4542o8233
$$ 3179303 3054417 2938806 2828495 2722564 2624218 2534014 2448705 2367510 2292968 2224735
55875B224735o5862o4795o1531n8451n8422n8149n3784m8123m5390m3668l9265
$$ 2224735 2158873 2094078 2032547 1974096 1915674 1857525 1803741 1755618 1710228 1666560 1627295
55864A627295l3932l1081k9015k4406j8592j4415j0676n810l133o212j2414j6776
$$ 1627295 1593363 1562282 1533267 1508861 1490269 1475854 1465178 1459368 1456235 1450023 1437609 1420833
55852A420833j9076k1674k3773k3503k2710k4222k6928k8362k9371l1678l3833
$$ 1420833 1401757 1380083 1356310 1332807 1310097 1285875 1258947 1230585 1201214 1169536 1135703
55841A135703l4051l4020l5485l6227l3818l0157k7981k6245k3241k0857k1051
$$ 1135703 1101652 1067632 1032147 995920 962102 931945 903964 877719 854478 833621 812570
55830H12570k1471j9246j6040j4679j3956j1481q613p765p739o391n156o188p798
$$ 812570 791099 771853 755813 741134 727178 715697 707084 699319 691580 685189 680033 673845 666047
55817F66047p412o283o640o945m926k564l030n045n407m823o059q332q715p536
$$ 666047 658635 652352 645712 638767 633841 631277 628247 623202 617795 612972 606913 598581 589866 582330
55803E82330p362p980p254n643n307n828n201l992m291n680o314o708q408j0109
$$ 582330 574968 566988 559734 554091 548784 542956 537755 533763 529472 523792 517478 510770 502362 492253
55789D92253r260o454m238k776n74J585J456q01l334o125j0149j4127j5860j5864
$$ 492253 482993 476539 472301 469525 468951 470536 471992 471191 467857 461732 451583 437456 421596 405732
55775D05732j6120j6297j4787j2317j0876j0130q549o880o825p362o313m496m409
$$ 405732 389612 373315 358528 346211 335335 325205 316656 309776 302951 295589 289276 284780 280371
55762B80371n717n943m958m779n554n657n255o011p656q537r175j1495j4917j6789
$$ 280371 274654 268711 263753 258974 253420 247763 242508 236497 228841 220304 211129 199634 184717 167928
55748A67928j6540j5816j4748j1763p022k636O23L616O002O430N503N220N528
$$ 167928 151388 135572 120824 109061 102039 99403 100026 103642 109644 116074 121577 126797 132325
55735A32325M599K610J841K830L612L106K372K071J561P96N71N97k01j446j734
$$ 132325 136924 139534 141375 144205 147817 150923 153295 155366 156927 157723 158294 158891 158690 157244 155510
55720A55510j209j188j507r05K31K60o76p50M31J505K061L031M382N068N248O072
$$ 155510 154301 153113 151606 150701 150932 151192 150516 149766 150197 151702 153763 156794 161176 166244 171492 177564
55704A77564P303P666P290P265P107N476L080J961K014J157j000k701l257l779
$$ 177564 184867 192533 199823 207088 214195 219671 222751 224712 226726 227883 226883 224182 220925 217146
55690B17146m497m342l431l140l306k231J55J951K479L044M074M366L770L792
$$ 217146 212649 208307 204876 201736 198430 196199 196354 198305 200784 203828 207902 212268 216038 219830
55676B19830M748M968L701K318J816J437O37J71L88N20L41N82J199J244P69P70
$$ 219830 224578 229546 233247 235565 237381 238818 239455 239626 240014 240534 240875 241457 242656 243900 244669 245439
55660B45439R88L8j906k986k712k732l986n381n958o102o061n422m671n108o541
$$ 245439 246427 246465 244559 241573 238861 236129 232143 226762 220804 214702 208641 203219 198548 193440 186899
55645A86899p242o696o319o828p207o853o486o305n461m012l293l616l809l544
$$ 186899 179657 172961 166642 159814 152607 145754 139268 132963 127502 123490 120197 116581 112772 109228
55631A09228l786m390l792j930q91j669k649k477j956j906j508l20K94o08j751
$$ 109228 105442 101052 97260 95330 94439 92770 90121 87644 85688 83782 82274 81954 82248 81640 79889
55616G9889j669r03o74q46o72k05K67R38J576J244j02j095r37n07o48q87p98r65
$$ 79889 78220 77317 76643 75797 75125 74920 75187 76125 77701 78945 78843 77748 76811 76304 75656 74769 73971 73006
55598G3006j613j772r50k08m91j174j308j040q70o73l48k91m69k57K53J85m37
$$ 73006 71393 69621 68671 68463 67972 66798 65490 64450 63580 62907 62559 62268 61799 61542 61795 61980 61543
55581F1543n13N3o4j196j756p61O00J052J090J519J829J508J413K225K950K482
$$ 61543 61030 61083 61019 59823 58067 57306 57906 58958 60048 61567 63396 64904 66317 68542 71492 73974
55565G3974J482J125J078L12r92j823k014k096k158j983j827j979j997j376l65
$$ 73974 75456 76581 77659 77971 76979 75156 73142 71046 68888 66905 65078 63099 61102 59726 59361
55550E9361N65J532K687L556L641L118K362J447N85L57R12J606J857J733J431
$$ 59361 59926 61458 64145 67701 71342 74460 76822 78269 78854 79211 80123 81729 83586 85319 86750
55535H6750J027Q64J283J886K000J914K326K662J560p84k487k627k273k367k421
$$ 86750 87777 88641 89924 91810 93810 95724 98050 100712 102272 101488 99001 96374 94101 91734 89313
55520H9313k106k295l395m312m165l656l579l379k389j214p64r53j390k191l147
$$ 89313 87207 84912 81517 77205 73040 69384 65805 62426 60037 58823 58059 57106 55716 53525 50378
55505E0378l324k510j888k199k473j651l21L33L09L26N15O04N90L83l51j293j468
$$ 50378 47054 44544 42656 40457 37984 36333 36012 36345 36654 36980 37495 38099 38689 39072 38721 37428 35960
55488C5960q76p73j616k102j276j55l6n45p21o86q82p61J74R94N72n83j114p96
$$ 35960 35084 34311 32695 30593 29317 29162 29126 28581 27860 27174 26292 25531 25705 26699 27271 26688 25574 24778
55470B4778l98k09J2J68R9K06P60J132P37R8QK80K81O6k4k26q28j363j274q03
$$ 24778 24380 24171 24183 24351 24450 24656 25416 26548 27285 27383 27391 27671 27952 28018 27994 27768 26940 25577 24303 23500
55450B3500m22k4N47Q70O92N16O90O99J52l44j43M36Q39J127J289P29o57j807
$$ 23500 23078 23054 23601 24471 25163 25679 26369 27068 27220 26876 26733 27169 28008 29135 30424 31153 30496 28689
55432B8689j880j410j193r26j1J188J929K163K101J569O67J51L05L41k45q11q51
$$ 28689 26809 25399 24206 23280 23269 24457 26386 28549 30650 32219 32886 33037 33342 33683 33438 32627 31776
55415C1776q93j083l32J823L763L739K245R51L28j71m89k35J15j32o41p86r95
$$ 31776 30883 29800 29468 31291 35054 38793 41038 41989 42317 42146 41657 41422 41537 41405 40764 39978 38983
55398C8983j924l002l187k564j866j110j19M10j36r10p16R8L95K24M08P49L75
$$ 38983 37059 34057 30870 28306 26440 25330 25211 25621 25485 24575 23859 23957 24352 24576 24984 25733 26108
55381B6108m65o67j29K55K59M70R13R61N76K83N0n23j075q76k01l6n24r76j222
$$ 26108 25643 24976 24847 25102 25361 25831 26744 27705 28281 28564 28614 28091 27016 26140 25939 25903 25379 24403 23181
55362B3181j644k008j588n40J72K47L16O42O61o0j235k312k756k079l99J185J618
$$ 23181 21537 19529 17941 17401 17573 17820 18136 18778 19439 19379 18144 15832 13076 10997 10598 11783 13401
55345A3401J103O18O08Q16R84Q19o3j301j567k88J135J053j05o30r9M33M13L99
$$ 13401 14504 15122 15730 16546 17530 18349 18286 16985 15418 15130 16265 17318 17213 16583 16484 16917 17330 17729
55327A7729O42N59j70j036j415j064k6J225J797J346O46M23K68m03j048q14QN67
$$ 17729 18371 18930 18760 17724 16309 15245 15219 16444 18241 19587 20233 20656 20924 20521 19473 18659 18667 19234
55309A9234Q66J317J541J014K97K06K89l21j152j125n15m43p66l67O86J109N31
$$ 19234 20100 21417 22958 23972 24269 24475 24764 24443 23291 22166 21651 21208 20442 20075 20761 21870 22401
55292B2401j41n20j188k169k562j985j055k69K92K26p56j687j246K07J058Q85
$$ 22401 22260 21740 20552 18383 15821 13836 12781 12512 12804 13030 12274 10587 9341 9548 10606 11491
55276A1491Q06J302J488Q64J84P9K73N13R02J036K78q44j026k22K71M1K04J257
$$ 11491 12297 13599 15087 15951 16135 16214 16487 17000 17902 18938 19216 18372 17346 17124 17395 17436 17640 18897
55258A8897K085J790J055P81P34L61j86n95r65j178p44J81N95K8q70j394j463
$$ 18897 20982 22772 23827 24608 25342 25703 25517 24922 23957 22779 22035 22216 22811 22839 21969 20575 19112
55241A9112r48L45J634J523l6j412j502r67o78l78L06Q15O55L55M78O00K04k50
$$ 19112 18164 18509 20143 21666 21630 20218 18716 17749 17071 16693 16999 17814 18469 18824 19302 19902 20106 19856
55223A9856p7N38R58R82P29K48j63k2N12O13P1l82l35k72l80qR56J415O86k12
$$ 19856 19779 20317 21275 22257 22986 23234 23071 23049 23561 24174 24245 23863 23528 23256 22876 22868 23824 25239 25925 25713
55203B5713m4P75R36K18m35m34o3K70M42L66L4k76l36k99l97n55o78q46j019q95
$$ 25713 25669 26444 27380 27598 27163 26729 26666 26936 27378 27744 27778 27502 27166 26867 26470 25915 25237 24391 23372 22477
55183B2477m06P6K53K46J60r5m25n09l60l92p39j008r07n82k41L3M1k84m59M2
$$ 22477 22071 22147 22400 22646 22806 22711 22286 21777 21417 21025 20286 19278 18371 17789 17548 17581 17622 17338 16879 16921
55163A6921Q48J090O94L72L39J03m10o43n26o53j056r25L7J074J588J864K142
$$ 16921 17769 18859 19553 19925 20264 20367 19957 19314 18788 18135 17079 16154 16191 17265 18853 20717 22859
55146B2859K012J267L67l50r85j251m55J181K329K262J778J862K400K833L047
$$ 22859 24871 26138 26505 26155 25170 23919 23464 24645 26974 29236 31014 32876 35276 38109 41156
55131D1156L027K604K125K303K908K723J402J24k58m53j264k179k463k499k859
$$ 41156 44183 46787 48912 51215 54123 56846 58248 58372 58114 57661 56397 54218 51755 49256 46397
55116D6397l125k738k187k141k197j601n65K06O23Q75P57K18j16L0j11r77j546
$$ 46397 43272 40534 38347 36206 34009 32408 31843 32049 32672 33547 34304 34522 34406 34436 34325 33348 31802
55099C1802p82O11J213R80R03J141J018N09K51K42r5o46o18J42R62J467J874K177
$$ 31802 31020 31631 32844 33824 34727 35868 36886 37395 37646 37888 37793 37147 36529 36671 37633 39100 40974 43151
55081D3151K005J369O53n6q80j493j430r17n80m13O9P84J097Q51N45M44L52K60
$$ 43151 45156 46525 47178 47122 46242 44749 43319 42402 41822 41409 41478 42262 43359 44210 44755 45199 45551 45811
55063D5811M24P68R65J124J617K163J964R20p7l36j26N5L07R24J632J800J255
$$ 45811 46235 47003 47968 49092 50709 52872 54836 55756 55679 55343 55217 55272 55579 56503 58135 59935 61190
55046F1190N24K10M03P25Q22O89M93K88J08J43M04M43j01p67p73k32n8n09p64
$$ 61190 61714 61924 62327 63052 63874 64563 65056 65344 65452 65595 65999 66442 66341 65574 64801 64569 64511 64002 63238
55027F3238l24J21j10n45l69K16L89K4l25m57o99j167j555j665j593j402j043
$$ 63238 62914 63035 62925 62380 62011 62227 62616 62640 62315 61858 61159 59992 58437 56772 55179 53777 52734
55010E2734n59j23K0m49j580k701k852j938q87l35J26R38J620J545R82O29N30
$$ 52734 52175 52052 52072 51623 50043 47342 44490 42552 41665 41330 41456 42394 44014 45559 46541 47170 47700
54993D7700L12J12L64R36J236J090Q51P78Q10Q82R50R12Q27R55J247J206O90L82
$$ 47700 48012 48124 48488 49424 50660 51750 52601 53379 54189 55071 56021 56933 57760 58715 59962 61168 61858 62240
54975F2240R95K361L753M699N032M653L890L640M538O214P817Q934R658J0219
$$ 62240 63235 65596 69349 74048 79080 83733 87623 91263 95801 102015 109832 118766 128424 138643
54961A38643J0929J1947J2709J2255J0491Q375O315L391j047n896r446j1314j2236
$$ 138643 149572 161519 174228 186483 196974 205349 211664 215055 214008 208112 198666 187352 175116
54948A75116j2631j2491j2169j1990j1452r899p828o401n826n239m150k991k196
$$ 175116 162485 149994 137825 125835 114383 104484 96656 90255 84429 79190 75040 72049 69853
54935F9853j646j132o65k87k1N8J04N57J468K243K533K890L822M854N356N738
$$ 69853 68207 67075 66410 66123 66102 66160 66264 66821 68289 70532 73065 75955 79777 84631 89987 95725
54919I5725O809Q440R790J0486J0585R800P899N475L315J161j754n264q324j0299
$$ 95725 102534 110974 120764 131250 141835 151635 159534 165009 168324 169485 167731 162467 154143 143844
54905A43844j1140j0677r003p270o753p145p026n998n011m553l957k823j818j486
$$ 143844 132704 122027 113024 105754 99001 91856 84830 78832 73821 69268 65311 62488 60670 59184
54891E9184j374q90k14J59J21j52m18l09K96P78L72o35j157q16l29k75m24n36
$$ 59184 57810 56920 56706 56865 56986 56834 56416 56107 56403 57181 57553 56918 55761 54945 54616 54341 53917 53381
54873E3381q88j552j979j797j345j063r07o95m82k86N3M14L66j93p55q38m87P
$$ 53381 52493 50941 48962 47165 45820 44757 43850 43155 42673 42387 42440 42854 43220 43027 42272 41434 40947 40954
54855D0954M44O54M81k6o23j101j307j087n91l24n06o58k92L24O53P24Q44R23
$$ 40954 41398 42052 42533 42507 41884 40783 39476 38389 37798 37474 36968 36310 36018 36342 36995 37719 38563 39486
54837C9486Q25Q86J241J149P5j013o98P45J594J029Ql25J40J045K134K913K748
$$ 39486 40311 41197 42438 43587 43662 42649 41951 42696 44290 45319 45327 45002 45142 46187 48321 51234 53982
54820E3982J772R22Q87J580K746M084M934M779M207M341N382O599P721R047J0278
$$ 53982 55754 56676 57563 59143 61889 65973 70907 75686 79893 84234 89616 96215 103936 112983 123261
54805A23261J0627J0270J0201J0360R380O701L437N79k196n127p324q115q276
$$ 123261 133888 144158 154359 164719 174099 180800 184237 184816 182620 177493 170169 162054 153778
54792A53778q761r197q735p542o328n213l999l008k586k361j887j471j507j538
$$ 153778 145017 135820 127085 119543 113215 108002 104003 100995 98409 96048 94161 92690 91183 89645
54778H9645r57o8M04N23R33J795K728L462L882L818L526L960N725Q107R917J1026
$$ 89645 88688 88620 89024 89547 90480 92275 95003 98465 102347 106165 109691 113651 119376 127483 137400 148426
54762A48426J2165J3488J4213J3733J2300J0483Q526O341L799R65j761l846n230
$$ 148426 160591 174079 188292 202025 214325 224808 233334 239675 243474 244439 242678 238832 233602
54749B33602o440p848r099r697r804j0003j0497j0973j1103j0743r854q582p257
$$ 233602 227162 219314 210215 200518 190714 180711 170214 159241 148138 137395 127541 118959 111702
54736A11702o086m941l766k867k535k594k662k647k677k714k557k114j501r39
$$ 111702 105616 100675 96909 94042 91507 88913 86251 83604 80927 78213 75656 73542 72041 71102
54722G1102o66o91o80k88K55L29k73j059j456j344q66j95L95O67P52R41J082P42
$$ 71102 70436 69745 69065 68777 69032 69361 69088 68029 66573 65229 64363 64168 64563 65230 65982 66923 68005 68747
54704F8747Rm14j54L73O33N77L60j1m17n39l15o0O2K00L71L57K14K78N35N94M13
$$ 68747 68756 68342 68188 68561 69194 69771 70131 70120 69703 69164 68849 68789 68851 69051 69422 69779 69993 70271 70806 71400 71813
54683G1813M49Q32J118J081J044J219J431J714K361L113L203K534J964K032K281
$$ 71813 72262 73094 74212 75293 76337 77556 78987 80701 83062 86175 89378 91912 93876 95908 98189
54668I8189K300K405K701K523J555O51O75J300J772K131K718L214L131K820L016
$$ 98189 100489 102894 105595 108118 109673 110324 110999 112299 114071 116202 118920 122134 125265 128085 131101
54653A31101L735M479N110N828O650P642R197J1288J3017J3640J3652J3833J3793
$$ 131101 134836 139315 144425 150253 156903 164545 173742 185030 198047 211687 225339 239172 252965
54640B52965J2382R291N190O21m259q883j2316j4224j5117j5512j5459j4801j3494
$$ 252965 265347 274638 279828 280449 276190 267307 254991 240767 225650 210138 194679 179878 166384
54627A66384j1611r547p979p145o469n404m261l585l146k319j221n67n52o09l13
$$ 166384 154773 145226 137247 130102 123633 118229 113968 110383 107237 104918 103697 103130 102578 101969 101656
54612A01656J75N15M90n7j035j925k273k200k018j692j231j153j768k381k062
$$ 101656 101831 102346 102836 102779 101744 99819 97546 95346 93328 91636 90405 89252 87484 85103 83041
54597H3041j035m21p03j304j640j690j495r96n25o48j259j549j124n35l75m93
$$ 83041 82006 81585 80882 79578 77938 76248 74753 73757 73232 72584 71325 69776 68652 68117 67742 67249
54581F7249m64l91p25j505k166k094j217j06N54N80L67K83K87K04J12J31J51R
$$ 67249 66785 66394 65669 64164 61998 59904 58687 58581 59135 59715 60082 60365 60652 60856 60968 61099 61250 61259
54563F1259k29m48o19n84q2P62J369J444J288J134P58J87O4O97J399J487J404
$$ 61259 61030 60582 59963 59379 59297 60059 61428 62872 64160 65294 66052 66239 66303 67000 68399 69886 71290
54546G1290J941K861L272L005K691K688K887L337M222N260O015O640P442P926
$$ 71290 73231 76092 79364 82369 85060 87748 90635 93972 98194 103454 109469 116109 123551 131477
54532A31477P321N920M826M283L372J525o83k573m182n622o465o400n893n604
$$ 131477 138798 144718 149544 153827 157199 158724 158041 155468 151286 145664 139199 132799 126906 121302
54518A21302n559n319m632l641k750k463l018l901m190l475k248j193n29q3K67
$$ 121302 115743 110424 105792 102151 99401 96938 93920 90019 85829 82354 80106 78913 78384 78301 78568
54503G8568M48K60l71j036j000n1J001J209O34Q5o0n9j3L60R96J306R52K49l32
$$ 78568 79016 79276 78905 77869 76869 76818 77819 79028 79662 79747 79687 79628 79615 79975 80971 82277 83229 83478 83146
54484H3146o21n97k86N1R7r5k26k28j87O2O24J011O13l19r35j022j113j313j004
$$ 83146 82525 81928 81642 81693 81790 81695 81469 81241 81054 81116 81740 82751 83364 83045 82110 81088 79975 78662 77658
54465G7658LQ73Q90M11J65J45j65q54j413j367p29NJ80m42j292j505r36k49N2
$$ 77658 77661 78534 79424 79835 80000 80145 79980 79126 77713 76346 75617 75622 75802 75360 74068 72563 71627 71378 71430
54446G1430J69L51L46q3o16p91p20q75j317j561j222m77J69N00P88J284J668J315
$$ 71430 71599 71950 72296 72213 71597 70806 70086 69211 67894 66333 65111 64634 64803 65303 66091 67375 69043 70358
54428G0358K54n98m76K85Q44R09P33M15M3J97J326K682K884J696L89J2K54M39
$$ 70358 70612 70014 69538 69823 70667 71576 72309 72724 72767 72964 74290 76972 79856 81552 81941 81953 82207 82646
54410H2646P07J477K345K405J517N89N52J400K369K823K850K910L005K607J583
$$ 82646 83353 84830 87175 89580 91097 91686 92238 93638 96007 98830 101680 104590 107595 110202 111785
54395A11785P18P41J214J095J87p35j192j483j904k270k454k655k862k762k413
$$ 111785 112503 113244 114458 115553 115740 115005 113813 112330 110426 108156 105702 103047 100185 97423 95010
54380I5010k344k645k696k116j391j141j286j351j180r28p42o83p08n46p2K68
$$ 95010 92666 90021 87325 85209 83818 82677 81391 80040 78860 77932 77190 76507 75799 75253 75181 75449
54364G5449p1p81r59l98J84L89O80J310J692J387R14R08J217J499J998K846L311
$$ 75449 75378 74597 73638 73240 73424 73813 74493 75803 77495 78882 79796 80704 81921 83420 85418 88264 91575
54347I1575K665J454R88J667K603K773J925M76q86j542j363q03l65j55k34q49
$$ 91575 94240 95694 96682 98349 100952 103725 105650 106126 105240 103698 102335 101532 101167 101012 100778 99929
54331I9929j918k679k554j994j902k476l151l466l322k671j635q28q37j405j687
$$ 99929 98011 95332 92778 90784 88882 86406 83255 79789 76467 73796 72161 71333 70496 69091 67404
54316F7404j381r87r75j228j397j355j168r92j025j232j171n38K16L36j68m57
$$ 67404 66023 65036 64061 62833 61436 60081 58913 57921 56896 55664 54493 53955 54171 54507 54339 53882
54300E3882l8N31M22l97j160j209n85J06K18l83j149j294o40J55L27r7l80n0N01
$$ 53882 53844 54375 54797 54400 53240 52031 51446 51552 51770 51387 50238 48944 48304 48459 48786 48689 48309 48259 48760
54281D8760N81J60r2K18O39N00j62p06p69n59l33j6M90R70J159J069Q98P81P55
$$ 48760 49341 49501 49409 49627 50266 50766 50604 49898 49129 48570 48237 48221 48711 49681 50840 51909 52807 53588 54343
54262E4343Q08Q74Q71Q43Q52Q04O17M95O75R46Q27L12n3K0J22j60n30l65M00J175
$$ 54343 55151 56025 56896 57739 58591 59395 60012 60507 61182 62128 62955 63267 63214 63234 63356 63196 62666 62301 62701 63876
54242F3876J402J105P01M76L15n2n48p68o01n85j205k019k075j162j01K83m7o19
$$ 63876 65278 66383 67084 67560 67875 67823 67275 66507 65906 65321 64116 62097 60022 58860 58759 59042 58995 58376
54224E8376j022r63l70L22M65M9j95J70O39N17r3m39j5R92J931K172J567O59J78
$$ 58376 57354 56391 56021 56343 56808 56857 56662 56832 57471 57988 57895 57456 57441 58433 60364 62536 64103 64762 64940
54205F4940K58M72N69P09Q94P85K87k86p39j170j397j025l15k07r82j669j429
$$ 64940 65198 65670 66239 66948 67842 68627 68914 68628 67889 66719 65322 64297 63982 63775 62793 61124 59695
54188E9695p67o85j195j529j357r14l34L44P09L38l94o89l85n4m9r3J63O79J218
$$ 59695 58928 58243 57048 55519 54162 53248 52914 53258 53967 54305 53911 53222 52837 52783 52734 52641 52804 53483 54701
54169E4701J532J360O44k67r10j141j028n18L86J325J822J735J204M06l34n57
$$ 54701 56233 57593 58237 57970 57060 55919 54891 54373 54759 56084 57906 59641 60845 61251 60917 60360
54153F0360j96J32n4m03l30j9j14o78j147j199r95o13L5O70P05L9p23j051j027
$$ 60360 60164 60296 60242 59839 59509 59490 59376 58698 57551 56352 55357 54744 54779 55449 56154 56193 55470 54419 53392
54134E3392r67r09o83k48K46N70N56K63p5l11m90o27o13n42p58j286j585j208
$$ 53392 52425 51516 50833 50585 50831 51401 51957 52220 52145 51834 51344 50717 50104 49562 48804 47518 45933 44725
54116D4725l33O24J487K006J685N85k41M6P83P01k23q23n73j62j49j47J86L45
$$ 44725 44392 45016 46503 48509 50194 50779 50538 50584 51367 52068 51845 51022 50449 50287 50138 49991 50177 50522
54098E0522k49j234j665j130n7P51P26j8o90n75J63P32P19L64q4n91r06o70j55
$$ 50522 50273 49039 47374 46244 46187 46938 47664 47646 46956 46381 46544 47276 47995 48359 48275 47684 46778 46108 45953
54079D5953j09n55n41M63J685K152J971J814J719J312Q10P93J141J133O58M20
$$ 45953 45844 45289 44748 45211 46896 49048 51019 52833 54552 55864 56674 57467 58608 59741 60399 60819
54063F0819P18Q32R8j069j716j536r27j49Q79K016K687K608K227K185K493K568
$$ 60819 61537 62369 62467 61398 59682 58146 57219 57070 57949 59965 62652 65260 67487 69672 72165 74733
54047G4733K015J069L11J76P35J682K474K736K630K639K937L238L306L290L400
$$ 74733 76748 77817 78128 78304 79039 80721 83195 85931 88561 91200 94137 97375 100681 103971 107371
54032A07371L556L615L662L793L803L460K937K657K728K883K898K800K699K691
$$ 107371 110927 114542 118204 121997 125800 129260 132197 134854 137582 140465 143363 146163 148862 151553
54018A51553K836K981K689J711M78k39k73k26o28j289j798k235k994l952m346
$$ 151553 154389 157370 160059 161770 162248 162009 161736 161510 160882 159593 157795 155560 152566 148614 144268
54003A44268l687k467j656j611j808j658j251j105j430j926k143j861j244q48
$$ 144268 140581 138114 136458 134847 133039 131381 130130 129025 127595 125669 123526 121665 120421 119573
53989A19573j201k168k890k718j974j385j079p66o12j118k042k366j579k63P97
$$ 119573 118372 116204 113314 110596 108622 107237 106158 105392 104780 103662 101620 99254 97675 97412 98209
53974I8209J392J502R68N7m33j89J07q4k57K44R94J059L41m81j013j368j533j392
$$ 98209 99601 101103 102071 102128 101695 101506 101613 101529 101272 101516 102510 103569 103910 103429 102416 101048 99515 98123
53956I8123j171j189j233q70k01L69Q72J530J961J545N46OL67J016J351J576K112
$$ 98123 96952 95763 94530 93660 93459 93828 94700 96230 98191 99736 100282 100288 100655 101671 103022 104598 106710
53939A06710K898L647M338N074N746O097N965N381M554L750K982J975P37j20l7
$$ 106710 109608 113255 117593 122667 128413 134510 140475 145856 150410 154160 157142 159117 159854 159734 159697
53924A59697O57J109J061R92J184J319J202J307K158L475M363M283L700L527M049
$$ 159697 160354 161463 162524 163516 164700 166019 167221 168528 170686 174161 178524 182807 186507 190034 194083
53909A94083M606M552M243M466N089N128M317L538L271K658R27j141k238k306
$$ 194083 198689 203241 207484 211950 217039 222167 226484 230022 233293 235951 236878 235737 233499 231193
53895B31193k249k381k422k572l366m531n257n467n724n995n763n326n596o394
$$ 231193 228944 226563 224141 221569 218203 213672 208415 202948 197224 191229 185466 180140 174544 168150
53881A68150o320m840l238k860l409l682l221k501k009j838j892k064k323k752
$$ 168150 161830 156990 153752 150892 147483 143801 140580 138079 136070 134232 132340 130276 127953 125201
53867A25201l260l426l111k961l611m524m549l506k291j486q31j97M2k18n53p85
$$ 125201 121941 118515 115404 112443 108832 104308 99759 96253 93962 92476 91645 91448 91490 91272 90719 89934
53851H9934j047j082m67L14K98m15p38m70n92j351j614q33n5j27l57l8J35n53
$$ 89934 88887 87805 87338 87652 87950 87535 86797 86327 85735 84384 82770 81937 81882 81755 81398 81360 81495 80942
53833H0942j264r09j4J89j91j06N56R52P54L08k86j043j327m87R33J819K009K105
$$ 80942 79678 78769 78755 78944 78753 78647 79203 80155 80909 81217 80931 79888 78561 78074 79007 80826 82835 84940
53815H4940K059J353M08L92J463K450K581K356K428K623K599K561K803L115L168
$$ 84940 86999 88352 88760 89152 90615 93065 95646 98002 100430 103053 105652 108213 111016 114131 117299
53800A17299L060L181L780M745N572N581M557L075J865J052M46K37P31J582K027
$$ 117299 120359 123540 127320 132065 137637 143218 147775 150850 152715 153767 154213 154450 155181 156763 158790
53785A58790J842J423J017N75K34J88J16n34j562k036j497n39o3m33j434k585
$$ 158790 160632 162055 163072 163647 163881 164069 164185 163651 162089 160053 158556 158017 157954 157521 156087 153502
53769A53502l385l687l839m109m189l701k975k653k776k965l257l867m293l683
$$ 153502 150117 146430 142591 138482 134293 130592 127617 124964 122188 119223 115966 112099 107806 104123
53755A04123k227j127r73j105q81o03p24r75r14o34m04j78N1m3m58n39P4O60L06
$$ 104123 101896 100769 99796 98691 97810 97207 96483 95508 94594 93960 93556 93378 93429 93386 92928 92389 92463 93123 93429
53736I3429p37j342r47j21K68m4o34q92n69j02j37o33p57j9R59J226P94M68O20
$$ 93429 92692 91350 90403 90282 90550 90506 89872 88980 88411 88309 88172 87539 86782 86763 87722 88948 89742 90210 90830
53717I0830Q41Q13Q17J074J132M14q70j813j753r29j43O4j57k03L45J272J908
$$ 90830 91671 92484 93301 94375 95507 95921 95051 93238 91485 90556 90413 90477 90320 90117 90462 91734 93642
53700I3642J761R98L38M07J197K185K886L267L527L638L309K372J130J37k45o9
$$ 93642 95403 96401 96739 97146 98343 100528 103414 106681 110208 113846 117155 119527 120657 120794 120549 120480
53684A20480L76Q04J031J004Q83R64J397J959K288K304K239K210K107J936J928
$$ 120480 120856 121660 122691 123695 124578 125542 126939 128898 131186 133490 135729 137939 140046 141982 143910
53669A43910K130K203J983J841K078K244J749Q92N61Q90J068O29P8r0j90n69p90
$$ 143910 146040 148243 150226 152067 154145 156389 158138 159030 159591 160481 161549 162178 162256 162166 161976 161407 160617
53652A60617l70K03R2n70q24l67j1m89j432j850j255k6J045J362R01J67k45j56
$$ 160617 160247 160450 160542 159972 159148 158781 158770 158281 156849 154999 153744 153718 154763 156125 157026 157193 156948 156792
53634A56792J46K81J20j61k91j89q9k41n33o12l63j3K56N03P12P15N23L80L47
$$ 156792 156938 157219 157339 157178 156887 156698 156609 156368 155835 155223 154860 154847 155103 155606 156318 157033 157556 157936 158283
53615A58283K65K15N25J141J563J688K006K605K692J789P76Q84K085L221L508
$$ 158283 158548 158763 159288 160429 161992 163680 165686 168291 170983 172772 173548 174432 176517 179738 183246
53600A83246L161K709K485K696L253L627L437L048L044L317L324L043K952L196
$$ 183246 186407 189116 191601 194297 197550 201177 204614 207662 210706 214023 217347 220390 223342 226538
53586B26538L527L967M705N396N329M458L480K837K342J873J711J995K508L094
$$ 226538 230065 234032 238737 244133 249462 253920 257400 260237 262579 264452 266163 268158 270666 273760
53572B73760L647L649K579R70J23M17P66K68m71l40O04J278J024K03n22q14o61
$$ 273760 277407 281056 283635 284605 284728 285145 285911 286179 285708 285368 285972 287250 288274 288477 287955 287141 286480
53555B86480k83p2l73j157k024k475k219j411n88k41l61p14j345k278k913k408
$$ 286480 286197 286125 285752 284595 282571 280096 277877 276466 275878 275637 275276 274562 273217 270939 268026 265618
53539B65618r12L08L09n10j168j260r32k27P82J608J802J665J867K367K378J593
$$ 265618 264706 265014 265323 264813 263645 262385 261453 261226 262008 263616 265418 267083 268950 271317 273695 275288
53523B75288Q85J347K893M253M359L503K886L239M230N192N986O826P647Q179
$$ 275288 276173 277520 280413 284666 289025 292528 295414 298653 302883 308075 314061 320887 328534 336713
53509C36713Q440Q635Q699Q530Q582R510J1101J2279J2458J2299J2675J3487J4088
$$ 336713 345153 353788 362487 371017 379599 389109 400210 412489 424947 437246 449921 463408 477496
53496D77496J4416J5066J6286J7619J8532J9072J9671K0622K1799K2847K3529
$$ 477496 491912 506978 523264 540883 559415 578487 598158 618780 640579 663426 686955
53485F86955K3892K4055K3928K3369K2629K2208K2270K2451K2472K2571K3033
$$ 686955 710847 734902 758830 782199 804828 827036 849306 871757 894229 916800 939833
53474I39833K3636K3936K3984K4297K5078K5786K5699K4705K3400K2397K1674
$$ 939833 963469 987405 1011389 1035686 1060764 1086550 1112249 1136954 1160354 1182751 1204425
53463A204425K0685J9076J7108J5359J4180J3506J3064J2578J1900J1169J0685
$$ 1204425 1225110 1244186 1261294 1276653 1290833 1304339 1317403 1329981 1341881 1353050 1363735
53452A363735J0483J0181R429Q281O921N244L098O67j721l956n968p482q522r840
$$ 1363735 1374218 1384399 1393828 1402109 1409030 1414274 1417372 1418039 1416318 1412362 1406394 1398912 1390390 1380550
53438A380550j2082j4751j6696j7630j8326j9258j9987k0228k0603k1775k3363
$$ 1380550 1368468 1353717 1337021 1319391 1301065 1281807 1261820 1241592 1220989 1199214 1175851
53427A175851k4378k4364k3677k2935k2520k2421k2250k1661k0868k0368k0015
$$ 1175851 1151473 1127109 1103432 1080497 1057977 1035556 1013306 991645 970777 950409 930394
53416I30394j8942j6730j4115j2069j0663r361q068p152o569n652l925j763P7
$$ 930394 911452 894722 880607 868538 857875 848514 840446 833294 826725 821073 817148 815385 815462
53403H15462J348K572M340O529Q473R949J1572J3812J6046J7248J7525J8071J9563
$$ 815462 816810 819382 823722 830251 838724 848673 860245 874057 890103 907351 924876 942947 962510
53390I62510K1318K2379K2697K2850K3235K4027K5460K7537K9748L1530L2872
$$ 962510 983828 1006207 1028904 1051754 1074989 1099016 1124476 1152013 1181761 1213291 1246163
53379A246163L4157L5737L7804M0333M2929M5076M6745M8287M9665N0434N0687
$$ 1246163 1280320 1316057 1353861 1394194 1437123 1482199 1528944 1577231 1626896 1677330 1728017
53368A728017N1207N2250N2982N2700N1869N1213N0456M8859M6475M3858M0981
$$ 1728017 1779224 1831474 1884456 1937156 1989025 2040238 2090694 2139553 2186028 2229886 2270867
53357B270867L7433L3486K9948K7052K4436K2083K0277J8604J6128J2817R751
$$ 2270867 2308300 2341786 2371734 2398786 2423222 2445305 2465582 2484186 2500314 2513131 2522882
53346B522882P550N363K019k575p681j2884j8335k4234l0591l7259m3692m8925
$$ 2522882 2530432 2535795 2537814 2535239 2527558 2514674 2496339 2472105 2441514 2404255 2360563 2311638
53334B311638n2248n3867n4498n4496n3768n2389n0818m9391m8015m6526m5139
$$ 2311638 2259390 2205523 2151025 2096529 2042761 1990372 1939554 1890163 1842148 1795622 1750483
53323A750483m4271m4128m4546m5142m5450m5068m3903m2295m0647l8884l6588
$$ 1750483 1706212 1662084 1617538 1572396 1526946 1481878 1437975 1395680 1355033 1316149 1279561
53312A279561l3652l0580k7950k5835k3879k1723j9215j6553j4426j3507j3472
$$ 1279561 1245909 1215329 1187379 1161544 1137665 1115942 1096727 1080174 1065748 1052241 1038769
53301A038769j3032j1526r901r395r630r154p659o318n775n173l742k136j292
$$ 1038769 1025737 1014211 1004310 994915 985285 976131 968472 962154 956379 951206 947464 945328 944036
53288I44036r52l19N26Q98Q77J247K346L810N357O985Q520R755J1049J3039J5699
$$ 944036 943084 942765 943291 944189 945066 946313 948659 952469 957826 964811 973331 983086 994135 1007174 1022873
53273A022873J8287K0266K1629K2388K2431K2009K1760K1943K2160K2005K1620
$$ 1022873 1041160 1061426 1083055 1105443 1127874 1149883 1171643 1193586 1215746 1237751 1259371
53262A259371K1351K1184K0797K0000J8861J7531J6064J4443J2774J1312J0135
$$ 1259371 1280722 1301906 1322703 1342703 1361564 1379095 1395159 1409602 1422376 1433688 1443823
53251A443823Q852P042M990L489K669J584o54l836p154j0266j3257j6045j8546
$$ 1443823 1452675 1459717 1464707 1468196 1470865 1472449 1471795 1467959 1460805 1450539 1437282 1421237 1402691
53238A402691k1036k3655k5839k6972k7391k7897k8562k8841k8671k8465k8079
$$ 1402691 1381655 1358000 1332161 1305189 1277798 1249901 1221339 1192498 1163827 1135362 1107283
53227A107283k6866k4909k3155k2015k0875j9368j8154j7861j8137j8455j9030
$$ 1107283 1080417 1055508 1032353 1010338 989463 970095 951941 934080 915943 897488 878458
53216H78458k0044k0637j9831j8097j6965j7028j7310j6733j5323j3624j1716
$$ 878458 858414 837777 817946 799849 782884 765856 748546 731813 716490 702866 691150
53205F91150r505p493o432o360o557o594o763p309p785p714p480p926r144j0317
$$ 691150 681645 674152 667720 661360 654803 648209 641446 634137 626352 618638 611158 603232 594088 583771
53191E83771j0822j0870j0860j0727j0285r732r348r083q848q859r228r533r327
$$ 583771 572949 562079 551219 540492 530207 520475 511127 502044 493196 484337 475109 465576 456249
53178D56249q876q817r294r898j0329j0615j0752j0631j0288r864r367q804q347
$$ 456249 447373 438556 429262 419364 409035 398420 387668 377037 366749 356885 347518 338714 330367
53165C30367q068p761p359p149p111o656n551m639m714n179m906m097l992m741
$$ 330367 322299 314538 307179 300030 292919 286263 280712 276073 271359 266180 261274 257177 253185 248444
53151B48444n045m239l346l402l912l917l623l862m505m496l320j607l39j15j017
$$ 248444 243399 239160 235814 232412 228500 224583 220960 217098 212593 208097 204777 203170 202831 202716 201699
53136B01699k572l826m006l247k337j869j850k014k104j922j435q09k31K41N18
$$ 201699 199127 195301 191295 188048 185711 183842 181992 179978 177874 175952 174517 173708 173477 173718 174236
53121A74236M66K70M23J073J674J670J314J283J674J924J644J046M98R7j98m36
$$ 174236 174702 174972 175395 176468 178142 179812 181126 182409 184083 186007 187651 188697 189195 189292 189094 188658
53105A88658q08j511k316k627k263j873k189l020l442k961k120j727j907k152
$$ 188658 187850 186339 184023 181396 179133 177260 175071 172051 168609 165648 163528 161801 159894 157742
53091A57742k089j742j186m65J4m67k091l885m499l569k024j048r90j362j640
$$ 157742 155653 153911 152725 152260 152274 151807 149716 145831 141332 137763 135739 134691 133701 132339 130699
53076A30699j717j687j482j015n54n62r74j086n03J32l6p47r88o57p92j819k586
$$ 130699 128982 127295 125813 124798 124244 123682 122708 121622 121119 121251 121215 120468 119480 118823 118031 116212 113626
53059A13626j973n88J49K3j6M07O27K46k44l52l46o29j032j096o87j30K5n51j433
$$ 113626 111653 111065 111214 111237 111221 111628 112255 112501 112257 111905 111559 110930 109898 108802 108115 107985 108010 107459 106026
53040A06026j577n70M91J55j431k612k304j124l22l83r84j495j266j33J053J196
$$ 106026 104449 103879 104370 104525 103094 100482 98178 97054 96732 96349 95365 93870 92604 92471 93524 94720
53024I4720M26o1J70J59p01j445r59K43P88L54k14l93m27m32r5N13O84n4j176
$$ 94720 95146 95085 95255 95414 94713 93268 92309 92552 93340 93694 93480 93087 92660 92228 92133 92646 93330 93276 92100
53005I2100j645r73K98J111R17K31o6O1j33q88j335p19L98Q23K87l56k94M86J503
$$ 92100 90455 89482 89780 90891 91808 92039 91973 92034 91901 91013 89678 88959 89357 90180 90467 90111 89817 90303 91806
52986I1806K263K449K067J478J064R16R77J215J411J183N52J57M56J079J446J642
$$ 91806 94069 96518 98585 100063 101127 102043 103020 104235 105646 106829 107381 107538 107994 109073 110519 112161
52970A12161K130K826L189L092K919K895K847K648K352J924J351R68J073J244
$$ 112161 114291 117117 120306 123398 126317 129212 132059 134707 137059 138983 140334 141302 142375 143619
52956A43619O30q39k097k070q55M32P34j02j325k009j942j711j841k099j983j574
$$ 143619 144249 143410 141313 139243 138388 138820 139554 139452 138127 136118 134176 132465 130624 128525 126542 124968
52940A24968j320j126m61O07J246J011N25N38Q20N92k57j016j153r35q55q37l60
$$ 124968 123648 122522 122061 122668 123914 124925 125450 125988 126808 127400 127143 126127 124974 124039 123184 122347 121987
52923A21987O82J599J563O09l07l44L27Q67Q82Q04J124J642J816J577J356J311
$$ 121987 122669 124268 125831 126440 126133 125789 126116 126983 127865 128669 129793 131435 133251 134828 136184 137495
52907A37495R73o1j318j839j309m30K6Q2K48O67J003J010P50L61N9K86J318K634
$$ 137495 138468 138407 137089 135250 133941 133511 133537 133619 133867 134534 135537 136547 137297 137658 137717 138003 139321 141955
52889A41955L216K646J505O12K65L45O12O69J92n39p27m8Q68J225R22M18J34L03
$$ 141955 145171 147817 149322 149934 150199 150544 151156 151825 152017 151478 150751 150703 151571 152796 153718 154136 154270 154573
52871A54573R03J387J074J84j61N53J383J254M78R6K36K26mK03J001J738K061
$$ 154573 155476 156863 157937 158121 157960 158513 159896 161150 161628 161724 161960 162186 162182 162385 163386 165124 167185
52854A67185K314K649K668K358K504L571M799N006L958K467J388R21O83J78p84
$$ 167185 169499 172148 174816 177174 179678 183249 188048 193054 197012 199479 200867 201788 202471 202649 201865
52839B01865j846k475k566k455k331k029j529j226j441j966k325k306k055j871
$$ 201865 200019 197544 194978 192523 190192 188163 186634 185408 183967 182001 179676 177370 175315 173444
52825A73444k040k616l213l242k545j610j032r31j083j295j538j842k241k675
$$ 173444 171404 168788 165575 162333 159788 158178 157146 156215 155132 153837 152299 150457 148216 145541
52811A45541k900k698k185j678j225o21J8J70m12j226j602j381p73J10J060J428
$$ 145541 142641 139943 137758 136080 134855 134234 134252 134422 134010 132784 131182 129801 129028 129138 130198 131626
52795A31626O53q21j769j527o88k20l24n75q19j293j938k201j743r61m78m49o03
$$ 131626 132279 131458 129689 128162 127474 127254 126930 126355 125536 124243 122305 120104 118361 117400 116922 116473 115870
52778A15870p16o70l11L28Q22Q15N65M85L06o05k049k911k581j777j462j556j388
$$ 115870 115154 114484 114173 114501 115323 116138 116703 117188 117494 116889 114840 111929 109348 107571 106109 104553 103165
52761A03165r11p22j029j323j151o73l93o48j324j887j815j237q93j110j316r55
$$ 103165 102254 101532 100503 99180 98029 97356 96963 96315 94991 93104 91289 90052 89159 88049 86733 85778
52745H5778n09p84j532j662q30J04L98L26M13M88J30m77p01l04K97N05L3r36j837
$$ 85778 85269 84485 82953 81291 80461 80565 80963 81289 81702 82190 82320 81843 81142 80838 81135 81640 81673 80737 78900
52726G8900k048j413m10K23L6q58j791j942j074R1O04L74J46L95P27N83K8m54
$$ 78900 76852 75439 75029 75252 75288 74430 72639 70697 69623 69714 70318 70692 70838 71233 71960 72543 72571 72117
52708G2117n52k30M81J335J822J657J238J191J517J587R98J68r2N45J591K156
$$ 72117 71565 71335 71816 73151 74973 76630 77868 79059 80576 82163 83161 83329 83237 83782 85373 87529
52692H7529J765P30j59m40l17k59l84m79n47r46j854k792l077k633k090j972k106
$$ 87529 89294 90024 89865 89425 89108 88849 88465 87986 87439 86493 84639 81847 78770 76137 74047 72075 69969
52675F9969j991j483q48l44j26l21q21j116q51m50o18j269j523q95J97J177J898
$$ 69969 67978 66495 65647 65303 65177 64856 64035 62919 62068 61618 61000 59731 58208 57313 57510 58687 60585
52658F0585K171J593L20o65o44nN90J110J633J618P28k40l04K44M21K86Q09K086
$$ 60585 62756 64349 64669 64004 63360 63355 63945 65055 66688 68306 69034 68794 68490 68734 69155 69441 70250 72336
52640G2336K986K815K089J390N67m82j270j583j935k529k581j474K7N75j25j208
$$ 72336 75322 78137 80226 81616 82183 81701 80431 78848 76913 74384 71803 70329 70356 70931 70806 69598
52624F9598j857j937j596r33j25N50R75J184J165Q19K03l61m21J85R70J088K97
$$ 69598 67741 65804 64208 63275 63150 63700 64675 65859 67024 67843 68046 67685 67264 67449 68419 69507 69804
52607F9804n60m83M39J236J369J169R74O77L06K97Q31J454J702J622J375R25M40
$$ 69804 69244 68761 69200 70436 71805 72974 73948 74625 74931 75228 76059 77513 79215 80837 82212 83137 83577
52590H3577L78P43Q60L42k94l81o7R0k6j97l75n21k65O33J680K128J882J496J407
$$ 83577 83955 84698 85558 85900 85606 85225 85158 85248 85222 85025 84650 84129 83864 84497 86177 88305 90187 91683 93090
52571I3090J566J705J585J134O30N80J109J686J725J197M31l33q43p49m5P18J065
$$ 93090 94656 96361 97946 99080 99710 100290 101399 103085 104810 106007 106438 106105 105262 104513 104468 105186 106251
52554A06251J131J257J376J276J073Q86M67l68j175j366j030p38p34q35q88p99
$$ 106251 107382 108639 110015 111291 112364 113250 113717 113349 112174 110808 109778 109040 108306 107471 106583 105784
52538A05784l59M06R12O50m6m12l04k04l44m95n53o70p99o56l00j11j67j06K48
$$ 105784 105425 105831 106743 107393 107347 106935 106631 106427 106083 105588 105035 104365 103566 102910 102610 102499 102332 102226 102474
52519A02474O28P82Q34J036J418J799J830J201R1o90m93L52R35Q76N13J55k01
$$ 102474 103102 103884 104718 105754 107172 108971 110801 112002 112093 111403 110910 111262 112197 113073 113586 113741 113540
52502A13540m31k53J83L25J8k39q0K26K83J07j12l41n10l95l8J15j84n80o45m66
$$ 113540 113109 112856 113039 113364 113382 113143 113063 113289 113572 113679 113567 113226 112716 112321 112283 112398 112214 111634 110989 110523
52482A10523l09p3M46R58R10L27j34j43j80p34j353j063K46J470J578Q94M78N65
$$ 110523 110214 110141 110587 111545 112455 112782 112648 112505 112325 111591 110238 109175 109421 110891 112469 113363 113841 114406
52464A14406L97k79n76J80J164J050q1q55n45P8P5l54m54j29O4j78o06r01j064
$$ 114406 114803 114524 113948 114128 115292 116342 116261 115406 114861 114939 115014 114660 114206 114077 114141 113963 113357 112456 111392
52445A11392j203j320j376j390j416j439j355j071o44k64n3Q7K48K89N8k42k04
$$ 111392 110189 108869 107493 106103 104687 103248 101893 100822 100178 99914 99861 99948 100196 100485 100543 100301 100097
52428A00097K43O56N73ro95j093j041o63k18J80O60J305J817J759J131M94L44
$$ 100097 100340 100996 101569 101560 100865 99772 98731 98068 97850 98030 98690 99995 101812 103571 104702 105196 105540
52411A05540N72O14J47n41p87k46O73J159Q71K92J10M91J148J850K457K669K275
$$ 105540 106112 106726 106873 106332 105545 105299 105972 107131 108002 108294 108404 108895 110043 111893 114350 117019 119294
52394A19294J603J237J248J190R45R93J559K036J752R48M83P17J175J370J410
$$ 119294 120897 122134 123382 124572 125517 126510 128069 130105 131857 132805 133288 134005 135180 136550 137960
52379A37960J569J631J141J99l90j0R49J517J325R64J077J457J417Q02K33L07
$$ 137960 139529 141160 142301 142500 142110 142100 143049 144566 145891 146855 147932 149389 150806 151608 151841 152148
52363A52148Q77J275J036L08l27l25L59J278J907K080J974J799J679J685J798
$$ 152148 153025 154300 155336 155644 155317 154992 155351 156629 158536 160616 162590 164389 166068 167753 169551
52348A69551J846J633J223Q94Q13Q46P30M32K63N65J155J336P05j39j90O30J309
$$ 169551 171397 173030 174253 175147 175960 176806 177536 177968 178231 178796 179951 181287 181992 181853 181663 182293 183602
52331A83602J114M79J23p8n98j105p56M98J725K301K524K818K995K740K252J888
$$ 183602 184716 185195 185318 185240 184642 183537 182781 183279 185004 187305 189829 192647 195642 198382 200634 202522
52315B02522J658J462J528K148L100L810M044M151M528N088N355N028M412M142
$$ 202522 204180 205642 207170 209318 212418 216228 220272 224423 228951 234039 239394 244422 248834 252976
52301B52976M555N446O419P247P691P432O584O024O571P865Q666Q360P653P489
$$ 252976 257531 262977 269396 276643 284334 291766 298350 304374 310945 318810 327476 335836 343489 350978
52287C50978P930Q375Q558Q814R483J0472J1419J2032J2233J2106J1799J1451
$$ 350978 358908 367283 375841 384655 394138 404610 416029 428061 440294 452400 464199 475650
52275D75650J1167J0970J0753J0400J0081J0176J0728J1164J0892J0015R142Q583
$$ 475650 486817 497787 508540 518940 529021 539197 549925 561089 571981 581996 591138 599721
52263E99721Q118P481O721O035N512N023M247L009J840J715K740L542K807J148
$$ 599721 607839 615320 622041 628076 633588 638611 642858 645867 647707 649422 652162 655704 658511 659659
52249F59659L56Q48J086r3j770k386j967j842k553l189k747j359L7P79J020J426
$$ 659659 660015 660863 661949 661856 660086 657700 655733 653891 651338 648149 645402 644043 644080 644859 645879 647305
52233F47305K467L904N104N945P025Q720J0398J1043J0481R568R213R592J0255
$$ 647305 649772 653676 658780 664725 671750 680470 690868 701911 712392 721960 731173 740765 751020
52220G51020J0654J0543J0150R936J0038J0030R526Q800Q440Q384P808O135L905
$$ 751020 761674 772217 782367 792303 802341 812371 821897 830697 839137 847521 855329 861464 865369
52207H65369K284J794J789J238j66j834l174m237n330o296o682o562o649p453
$$ 865369 867653 869447 871236 872474 872308 870474 867300 863063 857733 851437 844755 838193 831544 824091
52193H24091q575r204r012q405p971p870p717o987n623m234l542l683m256m920
$$ 824091 815516 806312 797300 788895 780924 773054 765337 758350 752727 748493 744951 741268 737012 732092
52179G32092n515n751n350m641m401m813n136m774m219m331n056n443m835l593
$$ 732092 726577 720826 715476 710835 706434 701621 696485 691711 687492 683161 678105 672662 667827 664234
52165F64234k609k468l026l563l396k563j864j945k527k845k684k542k741k902
$$ 664234 661625 659157 656131 652568 649172 646609 644745 642800 640273 637428 634744 632202 629461 626559
52151F26559k506j743j367j741k389k660k601k807l451l940l748l155k799k831
$$ 626559 624053 622310 620943 619202 616813 614153 611552 608745 605294 601354 597606 594451 591652 588821
52137E88821l035l408m050m569m402l657l037k872k962l291m039m766m627l690
$$ 588821 585786 582378 578328 573759 569357 565700 562663 559791 556829 553538 549499 544733 540106 536416
52123E36416l064l269l458k932k356k542k961k657j955j942k584k747j977j000
$$ 536416 533352 530083 526625 523693 521337 518795 515834 513177 511222 509280 506696 503949 501972 500972
52109E00972l63K87J170J736J562J153J284K006K769L151L205L323L941N087O187
$$ 500972 500609 500896 502066 503802 505364 506517 507801 509807 512576 515727 518932 522255 526196 531283 537470
52094E37470O702O889P512Q795J0208J1360J2444J3596J4486J4859J5044J5499
$$ 537470 544172 551061 558573 567368 577576 588936 601380 614976 629462 644321 659365 674864
52082F74864J6195J6739J6913J6784J6590J6628J7017J7420J7286J6545J5729
$$ 674864 691059 707798 724711 741495 758085 774713 791730 809150 826436 842981 858710
52071H58710J5209J4706J3762J2394J0971R672Q433P190O017N009M235L624K853
$$ 858710 873919 888625 902387 914781 925752 935424 943857 951047 957064 962073 966308 969932 972785
52058I72785J511l96k330l731m547n131n766o454p032p393p575p690p714p496
$$ 972785 974296 973900 971570 967839 963292 958161 952395 945941 938909 931516 923941 916251 908537 901041
52044I01041p084o850p000p114o539n243l879l042k831l087l580l820l223j744
$$ 901041 893957 887107 880107 872993 866454 861211 857332 854290 851459 848372 844792 840972 837749 836005
52030H36005NJ426K475L352M065M515M735M841M967N297N813O011N411M397L959
$$ 836005 836010 837436 839911 843263 847328 851843 856578 861419 866386 871683 877496 883507 888918 893315 897274
52015H97274M283M362L505K474K384K935K745J265o78k205l416m744o134p323
$$ 897274 901557 905919 909424 911898 914282 917217 919962 921227 920549 918344 914928 910184 904050 896727
52001H96727q409r619j0839j1829j2689j3651j4630j5385j6036j6965j8147j8987
$$ 896727 888318 878699 867860 856031 843342 829691 815061 799676 783640 766675 748528 729541
51989G29541j9115j8944j9198k0024k0912k1402k1535k1557k1496k1220k0715
$$ 729541 710426 691482 672284 652260 631348 609946 588411 566854 545358 524138 503423
$$ [...]
##END NTUPLES=NMR SPECTRUM
##END=
