##TITLE=NES1029_Seabridge_9268384_OJRqjs6Mtp
##JCAMPDX= 6.0         $$ Bruker NMR JCAMP-DX V2.0
##DATA TYPE= NMR SPECTRUM
##DATA CLASS= NTUPLES
##ORIGIN= BRUKER
##OWNER= Administrator
$$ 1.72 TOPSPIN		Version 2.1
$$ 2015-07-10 18:20:08.988 -0700  Administrator@X
$$ Compression mode = diff/dup
##.OBSERVE FREQUENCY= 400.02188249412
##.OBSERVE NUCLEUS= ^1H
##.ACQUISITION MODE= SIMULTANEOUS (DQD)
##.ACQUISITION SCHEME= undefined
##.AVERAGES= 8
##.DIGITISER RES= 22
##SPECTROMETER/DATA SYSTEM= spect
##.PULSE SEQUENCE= zg30
##.SOLVENT NAME= COFFEE_meoh
##.SHIFT REFERENCE= INTERNAL, COFFEE_meoh, 1, 14.98509
##AUDIT TRAIL= $$ (NUMBER, WHEN, WHO, WHERE, PROCESS, VERSION, WHAT)
$$ ##TITLE= Audit trail, TOPSPIN		Version 2.1
$$ ##JCAMPDX= 5.01
$$ ##ORIGIN= Bruker BioSpin GmbH
$$ ##OWNER= Administrator
$$ $$ E:\/data/COFFEE/nmr/NES1029_Seabridge_9268384_OJRqjs6Mtp/10/pdata/1/auditp.txt
$$ ##AUDIT TRAIL=  $$ (NUMBER, WHEN, WHO, WHERE, PROCESS, VERSION, WHAT)
(   1,<2015-07-10 18:20:01.613 -0700>,<Administrator>,<X>,<go>,<TOPSPIN 2.1>,
      <created by zg
	started at 2015-07-10 18:18:55.456 -0700,
	POWCHK enabled, PULCHK disabled,
       configuration hash MD5:
       21 0F 79 D6 B3 7B B4 F6 88 20 88 DB 03 48 BD 9F
       data hash MD5: 64K
       53 61 3D D5 65 87 1A F9 61 14 E7 BC B3 00 9C E3>)
(   2,<2015-07-10 18:20:04.894 -0700>,<Administrator>,<X>,<proc1d>,<TOPSPIN 2.1>,
      <Start of raw data processing
       efp LB = 0 FT_mod = 6 PKNL = 1 PHC0 = 0 PHC1 = 0 SI = 32K 
       data hash MD5: 32K
       33 F6 FC 73 56 5C 76 13 BB 63 63 DE 0E 3B 80 82>)
(   3,<2015-07-10 18:20:05.175 -0700>,<Administrator>,<X>,<proc1d>,<TOPSPIN 2.1>,
      <pk PHC0 = 92.60376 PHC1 = 0 
       data hash MD5: 32K
       82 82 75 C5 CB C3 34 9E 2D B2 1B 49 4A AF 1D CA>)
(   4,<2015-07-10 18:20:05.285 -0700>,<Administrator>,<X>,<proc1d>,<TOPSPIN 2.1>,
      <abs ABSG = 1 
       data hash MD5: 32K
       79 23 1D C8 AA 35 1E 64 18 45 3C CA 2D B2 26 1D>)
(   5,<2015-07-10 18:20:05.347 -0700>,<Administrator>,<X>,<proc1d>,<TOPSPIN 2.1>,
      <abs ABSG = 2 
       data hash MD5: 32K
       A0 40 0E 35 20 87 5C DE B7 3A ED 34 E4 B5 A6 84>)
(   6,<2015-07-10 18:20:05.410 -0700>,<Administrator>,<X>,<proc1d>,<TOPSPIN 2.1>,
      <abs ABSG = 3 
       data hash MD5: 32K
       7F 48 8E 51 58 B6 27 21 7D E4 F5 1A 14 FE 54 87>)
(   7,<2015-07-10 18:20:05.472 -0700>,<Administrator>,<X>,<proc1d>,<TOPSPIN 2.1>,
      <abs ABSG = 4 
       data hash MD5: 32K
       42 4C 86 07 46 FC 2E AA 0B 7A 24 E5 33 DC 31 DF>)
(   8,<2015-07-10 18:20:05.535 -0700>,<Administrator>,<X>,<proc1d>,<TOPSPIN 2.1>,
      <abs ABSG = 5 
       data hash MD5: 32K
       E2 0D 93 66 33 CA 52 C2 96 E5 2E AD 90 16 CE 2E>)
$$ ##END=
$$ 
$$ $$ hash MD5
$$ $$ ED 81 DA A5 C8 77 99 FA 4A 68 02 78 5B 71 5C C3
##$RELAX= 
##$RELAX= 
##$RELAX= 
##$RELAX= 
##$RELAX= 
##$RELAX= 
##$RELAX= 
$$ Bruker specific parameters
$$ --------------------------
##$DU= <E:\>
##$EXPNO= 10
##$NAME= <NES1029_Seabridge_9268384_OJRqjs6Mtp>
$$ [...]
150 150 150 150 150 150 150 150
##$TP07= 0
##$TPNAME0= <>
##$TPNAME1= <>
##$TPNAME2= <>
##$TPNAME3= <>
##$TPNAME4= <>
##$TPNAME5= <>
##$TPNAME6= <>
##$TPNAME7= <>
##$TPOAL= (0..7)
0.5 0.5 0.5 0.5 0.5 0.5 0.5 0.5
##$TPOFFS= (0..7)
0 0 0 0 0 0 0 0
##$TUNHIN= 0
##$TUNHOUT= 0
##$TUNXOUT= 0
##$USERA1= <user>
##$USERA2= <user>
##$USERA3= <user>
##$USERA4= <user>
##$USERA5= <user>
##$V9= 5
##$VALIST= <valist>
##$VCLIST= <CCCCCCCCCCCCCCC>
##$VD= 0
##$VDLIST= <DDDDDDDDDDDDDDD>
##$VPLIST= <PPPPPPPPPPPPPPP>
##$VTLIST= <TTTTTTTTTTTTTTT>
##$WBST= 2048
##$WBSW= 25
##$XGAIN= (0..3)
0 0 0 0
##$XL= 0
##$YL= 0
##$YMAX_a= 617806
##$YMIN_a= -517669
##$ZGOPTNS= <>
##$ZL1= 120
##$ZL2= 120
##$ZL3= 120
##$ZL4= 120
##$ABSF1= 14.98509
##$ABSF2= -5.573092
##$ABSG= 5
##$ABSL= 3
##$ALPHA= 0
##$AQORDER= 0
##$ASSFAC= 0
##$ASSFACI= 0
##$ASSFACX= 0
##$ASSWID= 0
##$AUNMP= <proc_prof1d_extract_pilot.lims>
##$AXLEFT= 0
##$AXNAME= <>
##$AXNUC= <1H>
##$AXRIGHT= 0
##$AXTYPE= 0
##$AXUNIT= <>
##$AZFE= 0.1
##$AZFW= 0.1
##$BCFW= 0
##$BC_mod= 0
##$BYTORDP= 0
##$COROFFS= 0
##$CY= 15
##$DATMOD= 1
##$DC= 0
##$DFILT= <>
##$DTYPP= 0
##$F1P= 0
##$F2P= 0
##$FCOR= 0.5
##$FTSIZE= 32768
##$FT_mod= 6
##$GAMMA= 0
##$GB= 0
##$INTBC= 1
##$INTSCL= 1
##$ISEN= 128
##$LB= 0
##$LEV0= 0
##$LPBIN= 0
##$MAXI= 10000
##$MC2= 0
##$MEAN= 0
##$ME_mod= 0
##$MI= 0
##$NCOEF= 0
##$NC_proc= -8
##$NLEV= 6
##$NOISF1= 0
##$NOISF2= 0
##$NSP= 0
##$NTH_PI= 0
##$NZP= 0
##$OFFSET= 14.98509
##$PC= 1
##$PHC0= 92.60376
##$PHC1= 0
##$PH_mod= 1
##$PKNL= yes
##$PPARMOD= 0
##$PPDIAG= 0
##$PPIPTYP= 0
##$PPMPNUM= 2147483647
##$PPRESOL= 1
##$PSCAL= 4
##$PSIGN= 0
##$PYNMP= <proc.py>
##$REVERSE= no
##$SF= 400.02
##$SI= 32768
##$SIGF1= 0
##$SIGF2= 0
##$SINO= 400
##$SIOLD= 32768
##$SPECTYP= <>
##$SREGLST= <1H.CDCl3>
##$SSB= 0
##$STSI= 32768
##$STSR= 0
##$SW_p= 8223.68421052631
##$SYMM= 0
##$S_DEV= 0
##$TDeff= 65536
##$TDoff= 0
##$TI= <>
##$TILT= no
##$TM1= 0
##$TM2= 0
##$TOPLEV= 0
##$USERP1= <user>
##$USERP2= <user>
##$USERP3= <user>
##$USERP4= <user>
##$USERP5= <user>
##$WDW= 1
##$XDIM= 32768
##$YMAX_p= 448536283
##$YMIN_p= -757930
##$CURPLOT= <Network HP LaserJet P1505>
##$CURPRIN= <$Network HP LaserJet P1505>
##$DFORMAT= <normdp>
##$LAYOUT= <+/1D_H.xwp>
##$LFORMAT= <normlp>
##$PFORMAT= <normpl>
##$SURQMSG= 1
$$ End of Bruker specific parameters
$$ ---------------------------------
##NTUPLES= NMR SPECTRUM
##VAR_NAME=  FREQUENCY,     SPECTRUM/REAL,   SPECTRUM/IMAG
##SYMBOL=    X,             R,               I
##VAR_TYPE=  INDEPENDENT,   DEPENDENT,       DEPENDENT
##VAR_FORM=  AFFN,          ASDF,            ASDF
##VAR_DIM=   32768,         32768,           32768
##UNITS=     HZ,            ARBITRARY UNITS, ARBITRARY UNITS
##FACTOR=    0.250966925370066, 1,           1
##FIRST=     8223.43324360094, -33260,       -272853
##LAST=      0,             119379,          -274354
##MIN=       0,             -757930,         0
##MAX=       8223.43324360094, 448536283,    0
$$ Real data points
##PAGE= N=1
##DATA TABLE= (X++(R..R)), XYDATA
$$ [...]
19468i7845C41096b73037A13077c87785f728H8506J47352D2327g1027n7411f831
19456e04286A4513D317a66579j14577a21742H5553a10613j1342I2702a97588l854
19445b01442P2750A12104b6252q1887A98380a2235q7575o3589D4816e0506F2863
19433A2389e0835d271r8449B3893a0864C12917F1310e9593n1592D4913b452o2990
19421f5442l37637D3170O1660J4038b23886G2889b5862A76671B5131J08013a61454
19409a7063o3880k8491I3909J79920a14492A5302b10863P9723p0345D2660J52896
19398A95556a7436j24037r8415Q44h7654l6232n502B83572g9853J1702c1697k85555
19386c17252A65421f7383G0405b17975e2580N850j76073R0862G2152a54146A7841
$$ y = [-97845, 341096, -273037, 113077, -387785, -6728, 88506, 235858, 42327, -71027, -128438, -6831, -504286, 14513, 4317, -166579, -281156, -121742, 85553, -110613, -121955, 92702, -197588, -201442, -128692, 112104, -26252, -108139, 198380, -12235, -99810, -163399, 44816, -50506, 62863, 12389, -50835, -4271, -102720, 23893, -10864, 312917, 61310, -59593, -111185, 44913, -2452, -65442, -403079, 43170, 104830, 118868, -223886, 72889, -25862, 176671, 25131, 133144, -161454, -17063, -80943, -109434, 93909, 273829, -114492, 15302, -210863, -131140, -201485, 42660, 195556, -17436, -141473, -239888, -239044, -87654, -123886, -129388, 283572, -79853, -68151, -31697, -317252, 165421, -67383, 70405, -217975, -52580, -46730, -222803, -131941, 72152, -154146, 17841]
19374a74614C8614J427b82939a40043B269c148p2746m8425A79347a32558j9546
19363a52104k0658L8772B646c37020J13165k5245A0211J51655i7128p4075d7998
19351B58397F059b17499L473k4354B33238c5417A5140L02767j10814D8666a30046
19339h5634c9810j49084f275j94342A25408a49474b1523A87814a47222A53279
19328G9515C1104b8516l03112J2719a05095R574r1783A31385J77342a01949j34451
19317b36400A845a67163j12964R9823c6812k05097A4074b01240d4360A76939f7573
19305a99496e190m1482k9241j81660c8455r0667L8533I8799f9523j82734j38734
19294c90991A31468q95a59377P0650A01062b60101P9689B2665d8384D4078O5332
$$ y = [-174614, 38614, 40041, -282939, -140043, 2269, -3148, -75894, -124319, 179347, -132558, -152104, -172762, -133990, 2646, -337020, -223855, -249100, 10211, 161866, -97128, -171203, -47998, 258397, 6059, -217499, -214026, -238380, 233238, -35417, 15140, 317907, 207093, 48666, -130046, -85634, -39810, -188894, -6275, -200617, 125408, -149474, -21523, 187814, -147222, 153279, 79515, 31104, -28516, -331628, -318909, -105095, -95521, -187304, 131385, 308727, -101949, -236400, 1845, -167163, -280127, -180304, -36812, -241909, 14074, -201240, -44360, 176939, -67573, -199496, -5190, -46672, -75913, -257573, -38455, -129122, -90589, 98799, -69523, -252257, -390991, 131468, 130573, -159377, -88727, 101062, -260101, -180412, 22665, -48384, 44078, 109410]
19283A09410P5505C6329J39170d9829j55316P6878A40874q206C2507a76090h6199
19271c41693B54242c13705A79135K5503e6121A31282K43899F381a52088n7973
19261b10061N1396A33919F3278F78c00442L3349C44802g9242l13218a80356l399
19250a83755L1333k15281F6053J59492D187a89741j3878I529J55670P1430a84070
19238A26432J48793g9627j99704c5128j01888H8198a25105J2288p7321H5065b98515
19226D0375e7597o9120k2084c7582r6934H0740c22156i5012B49951d27441a35581
19214b10478F3220a48549L8738B02133p6083i9375c456j09801j17468b3847l3753
19203e7600B66635A1928L68815a94255p9180f084k2900L664q4543B05820a48078
$$ y = [109410, 184915, 36329, 175499, -49829, -205145, -128267, 140874, 132668, 32507, -176090, -86199, -341693, 254242, -313705, 179135, 204638, -56121, 131282, 375181, 6381, -152088, -210061, -158665, 133919, 63278, 678, -300442, -267093, 344802, -79242, -392460, -180356, -183755, -152422, -367703, 66053, 225545, 4187, -189741, -203619, 9529, 165199, 236629, -184070, 126432, 275225, -79627, -279331, -35128, -137016, 88198, -125105, -112817, -190138, 85065, -298515, 40375, -57597, -126717, -148801, -37582, -134516, 80740, -322156, -95012, 249951, -427441, -135581, -210478, 63220, -148549, -109811, 202133, 126050, -99375, -3456, -113257, -230725, -23847, -57600, 266635, 11928, 380743, -194255, -273435, -6084, -28984, -25320, -109863, 205820, -148078]
19191d6141m7277B7207A600b60500h2275r8717C29815A9447b82286e6738k76154
19180c32892b5044k97510A09561j4417a08984d6738J80A8197d3384k05818r5877
19169c45079J68355g4368B1614b76391c2652B77908i8194J5213K5202A86879a79122
19157A55170a84475A89291m2890c35108A4329a26403K2353B2573a04196k63422
19147c67618D4742J08057a90914M5483j0912E7295c74441B25919c9499A3977b62610
19135B93091j13317E4742d32431a94254B1698M8772j5917b09867C42245A50706
19124I6960b98489g8506C5013K1340b5486j91181j9833a12275F0326Q3832D8045
19112a87852I0601b90938A55731F9233a62486b7660j13344f8562j15463A73791
$$ y = [-46141, -93418, 27207, 1600, -260500, -82275, -180992, 329815, 19447, -282286, -56738, -332892, -25044, -322554, 109561, 95144, -108984, -46738, -46558, 18197, -43384, -249202, -345079, -176724, -74368, 21614, -276391, -32652, 277908, -98194, -82981, -57779, 186879, -179122, 155170, -184475, 189291, 146401, -335108, 14329, -126403, -104050, 22573, -104196, -367618, 44742, 152799, -190914, -145431, -156343, 57295, -374441, 225919, -39499, 13977, -262610, 293091, 179774, 54742, -432431, -194254, 21698, 70470, 54553, -209867, 342245, 150706, 96960, -298489, -78506, 35013, 56353, -25486, -216667, -236500, -112275, 60326, 144158, 48045, -187852, 90601, -290938, 155731, 69233, -162486, -27660, -141004, -68562, -184025, 173791]
19101G6476K6829f1950H8096R6710b37946d2801C39981j11602a12192d1328D9814
19089A9129a31396k16067d1930m02279g2903l90082A74158a33260L7455r1026
19079a86831d8791A77751a09991j34366H8381f6810o640J8136A01849K02267B2295
19067a67563C7571e6660a1451m7080o7714B1797c12345I938Q688h8070b4204j26154
19055a50358A33346b66063A23850E097M8319b34203f1943k4872o4208L7693G4514
19043G1826c45156h7678A44537J16096c87975i8404F5200L8530B0337b90902g9157
19031a61762D5556O9883K32932d0295C3317J26209k6288k5164h4916B95511e8125
19019A21693n3095h3381l7104j63139M0398n1334a748k8462j64423A53061Q8140
$$ y = [76476, 103305, -61950, 88096, 184806, -237946, -42801, 339981, 228379, -112192, -41328, 49814, 19129, -131396, -347463, -41930, -444209, -72903, -462985, 174158, -133260, -95805, -186831, -48791, 177751, -109991, -244357, 88381, -66810, -73450, -55314, 101849, 304116, 22295, -167563, 37571, -56660, -11451, -58531, -126245, 21797, -312345, 9938, 18626, -88070, -24204, -150358, 133346, -266063, 123850, 5097, 53416, -234203, -61943, -86815, -151023, -113330, 74514, 71826, -345156, -87678, 144537, 260633, -387975, -98404, 65200, 103730, 20337, -290902, -79157, -161762, 45556, 115439, 348371, -40295, 33317, 159526, 133238, 108074, -84916, 295511, -58125, 121693, 68598, -83381, -120485, -283624, -243226, -294560, -1748, -30210, -194633, 153061, 241201]
19008B41201c1185B61126B7194b27600A91828b03169L8476A67522K19148A4833
18997a97482B11057b88191B0228b72607g6979a1743j39188O553j00451b194n5486
18986e7680E601K4020b31415A23283L6465K42061A96579a61796A73947a9172j93939
18975b13111C12841j54343K13968q6734K0935M5063A17054b179B26280d5456k9120
18964g4576j95074C1897a00281A67755d14386f6684k66035A72619e0206A93037
18953A95613c9557j85939d8264o3283B97959b68555A26321a87556C54140C6764
18942H9708K36269a30232A52740g4778j93074A51050c98513D1942a70236A28318
18931E339K710O9793a88262H7233k1112N4675d6830r9143A59913a18042A48319
$$ y = [241201, -31185, 261126, 27194, -227600, 191828, -203169, -164693, 167522, 386670, 14833, -197482, 211057, -288191, 20228, -272607, -76979, -11743, -150931, -144378, -244829, -2194, -57680, 5601, 29621, -231415, 123283, 159748, 401809, 196579, -161796, 173947, -19172, -213111, 312841, 158498, 372466, 285732, 306667, 351730, 117054, -2179, 226280, -45456, -74576, -269650, 31897, -100281, 167755, -414386, -66684, -332719, 172619, -50206, 193037, 195613, -39557, -225496, -48264, -111547, 297959, -268555, 126321, -187556, 354140, 36764, 89708, 325977, -130232, 152740, -74778, -267852, 151050, -398513, 41942, -170236, 128318, 5339, 8049, 77842, -188262, 87233, 66121, 120796, -46830, -145973, 159913, -118042, 148319]
18919A17333i7720L6271B30020j08340E0031R9282p0301i5640A48059J53246L91965
18908F93270l00514i5619m4778J8313A02839b61137J24048K9890c9597r9737j02353
18897b41687A03660b89516L3193J25386B7849a83667M2927o1819M3132f3918A5150
18885f75771J83553g1876M129p2961c5342j17031o5828c2990j19854A44536D3272
18873b94995h735A6010N3862O4628M5223a22842a4983k09687i1805L6946p1203
18862a26062p6081J6877k8477A09220B6494b33589f3175F9642a87188d9143D9640
18850a55768L6612K5025j08574N8588k3004B37267c01396D963a4386o1914l91757
18839d68057K21622I5532f7447j36059H822b15846e4159A38167k7372a80049p4633
$$ y = [117333, -97720, -61449, 230020, 121680, 50031, 149313, 79012, -95640, 148059, 301305, 693270, 392756, -95619, -140397, -122084, 102839, -261137, -137089, -107199, -39597, -139334, -241687, 103660, -289516, -256323, -130937, 27849, -183667, -140740, -202559, -159427, -63918, 15150, -675771, -492218, -71876, -67747, -140708, -35342, -152373, -218201, -32990, -152844, 144536, 43272, -294995, -8735, 16010, 69872, 134500, 179723, -122842, -14983, -224670, -91805, -54859, -126062, -202143, -185266, -213743, 109220, 26494, -233589, -63175, 69642, -187188, -49143, 49640, -155768, -119156, -94131, -202705, -144117, -167121, 237267, -301396, 4963, -14386, -76300, -468057, -246435, 95532, -67447, -203506, 8822, -215846, -54159, 138167, 110795, -180049, -254682]
18828b54682c4974A59325e09041K02369e4402D2945a27922d3750E9359A1399g8398
18816c4688H710b32764a04151a8486q556A14403M6144A0775J38496J5024G7314
18804C96586E4580e6255j94692h7726q973m7376i445k34911D5518a02656a7861
18792a97728E6772k7116Q0715a01587K8837o419c394r3546A17417a09776A02310
18780a42901e0609G3529f1521j04038m456p8476C1340a71242a6060A41604a43799
18768g9517B98816i5990M7637A97234b3247j39666j3182Q7454j0132C8179b03209
18756b89542g8390k11097d8893B93881a10166A58688K5299A469a4862B05843K8312
18745B34155a76504K151E1565b10j9264j958k51569A55913i7056C5054a20438
$$ y = [-254682, -34974, 159325, -509041, -306672, -54402, 42945, -127922, -43750, 59359, 11399, -78398, -34688, 8710, -232764, -104151, -18486, -27042, 114403, 160547, 10775, 149271, 164295, 77314, 396586, 54580, -56255, -250947, -87726, -96699, -144075, -9445, -244356, 45518, -102656, -17861, -197728, 56772, 29656, 110371, -101587, -72750, -79169, -3394, -96940, 117417, -109776, 102310, -142901, -50609, 73529, -61521, -165559, -170015, -248491, 31340, -171242, -16060, 141604, -143799, -79517, 298816, -95990, -48353, 197234, -23247, -162913, -176095, -88641, -98773, 38179, -203209, -289542, -78390, -289487, -48893, 293881, -110166, 158688, 183987, 1469, -14862, 205843, 234155, -176504, -174353, 51565, -210, -19474, -21432, -273001, 155913, -97056, 35054, -120438]
18733B08967d34013B00423m5064L5723c40889R1688b9470A89973h7099J4293I6308
18721c66669f6857m846A09926f2494j69421c7900C2195n04a09327a5408m94345
18710e09753A92512A9016K6925a53995I9444m8917A2773a65696G7284a28425k33310
18699c61735A80712b32407J10781A41435A2563b27901a6217E2627b7380k72416
18689b99796L2804C18740E3671a12621m8303h332n2344j08949f8453a7164j39633
18678a56797A9265L3635J99119b88923k6953g1973D02892G7424a45638a1797D407
18666a85934A01230i7347I6942A8682K6984G237g6928p5419k11268C09330a08890
18654i5254k1894D8743i0870g650k20163h5697A9355h1741A24991J8181c88230
$$ y = [208967, -434013, 200423, 155359, 191082, -340889, -249201, -29470, 189973, -87099, -72806, 96308, -366669, -66857, -71703, 109926, -62494, -231915, -37900, 32195, 31691, -109327, -15408, -509753, 192512, 19016, 45941, -153995, 99444, 50527, 12773, -165696, 77284, -128425, -361735, 180712, -232407, -121626, 141435, 12563, -227901, -16217, 52627, -27380, -299796, -266992, 318740, 53671, -112621, -160924, -8332, -60676, -169625, -68453, -17164, -156797, 19265, 52900, 252019, -288923, -315876, -71973, 402892, 77424, -145638, -11797, 4407, -185934, 101230, -97347, 96942, 18682, 45666, 7237, -76928, -152347, -363615, 309330, -108890, -95254, -117148, 48743, -90870, -7650, -227813, -85697, 19355, -81741, 124991, 143172, -388230]
18642a74270a5140j03347j5191K2720K6451l8091D0571Q9476e260D7459c67984
18630b08797a5330d634j47136D2208a23991k1713a6965C0615Q7079a80328g0207
18618d21822j08981a07028N16q5813A67865k5307b06674Q6385J0914f995F8927
18606a68792d3943j83758i4886m1071q4829A72954e295A10204a12767G1449A6330
18594D791O0769a18954H6349c3188A30953J03861E795b90757f1475j18799q8257
18583b68531B68844e4511k06254A69137b54448A59032a65673B34379O383a15547
18572B037a76919m4339F1845M4158f812q9239F8164a13755N0493A35673C0872
18560H6773b8651e473B21993b25990n7417J20933O1299B6367c5653j52366c5722
$$ y = [-174270, -15140, -118487, -133678, -110958, -84507, -122598, 40571, 130047, -5260, 47459, -367984, -208797, -15330, -4634, -151770, 42208, -123991, -145704, -16965, 30615, 117694, -180328, -70207, -421822, -530803, -107028, -106512, -192325, 167865, 142558, -206674, -120289, -109375, -6995, 68927, -168792, -43943, -227701, -94886, -135957, -220786, 172954, -5295, 110204, -112767, 71449, 16330, 4791, 65560, -118954, 86349, -33188, 130953, 234814, 5795, -290757, -61475, -180274, -268531, 268844, -54511, -260765, 169137, -254448, 159032, -165673, 234379, 240762, -115547, 2037, -176919, -221258, 61845, 106003, -6812, -96051, 68164, -113755, -63262, 135673, 30872, 86773, -28651, -5473, 221993, -225990, -283407, -162474, -101175, 26367, -35653, -188019, -35722]
18548A28658j3093b01385r3932e0427j29502M7030n0619p7396A77983n9722a14826
18536b1223k24189m4361g4996j30568B53989a6597G4305c8859C6411J12393a72626
18524D1680M5520d6120B74307A26823b90753C03415d2820k77195Q9208h8357j00816
18513a89173A46379f2917A36856J8509g0886m0803L2186c8438e112A70131f4926
18501A66155f6770j83464F5829O0291E3607a18719q8660F5521a7012r2661G4517
18489b10579J1374I4207P2640g8044n365C0300q08R1555C8319b7361j4940l2849
18477g5150M33n7356J4455k16767b4425G6945i5318A37482K8183n2941r973b12494
18464B3711c9821I2574b7130A88232g0576J7795D3295c4169a1103j61851D2263
$$ y = [128658, 115565, -201385, -295317, -50427, -179929, -132899, -183518, -260914, 177983, 118261, -114826, -21223, -245412, -289773, -74996, -205564, 253989, -16597, 74305, -38859, 36411, 148804, -172626, 41680, 87200, -46120, 274307, 126823, -290753, 303415, -42820, -320015, -230807, -88357, -189173, 146379, -62917, 136856, 155365, -70886, -111689, -79503, -38438, -5112, 170131, -64926, 166155, -66770, -250234, 65829, 126120, 53607, -118719, -207379, 65521, -17012, -109673, 74517, -210579, -199205, 94207, 166847, -78044, -83409, 30300, 29492, 121047, 38319, -27361, -42301, -75150, -74717, -132073, -117618, -334385, -24425, 76945, -95318, 137482, 165665, 112724, 102751, -212494, 23711, -39821, 92574, -27130, 188232, -70576, -52781, 43295, -34169, -11103, -172954, 42263]
18452A36084g2750j4746C54569b16615I5315c24631g0880k97138h2279B92672
18441G6181d16217Q2459A75609a03073j0791A63036b41367C35002b27386a05178
18430A01092a21437j1794A55856a13607k67732J73862A84786a20224B51919d08454
18419c44559a09288K2042C7169d3587A09418D5303J55222a38477E1276c42122
18408f4069o0295J0961a15k9094A19385a13140A96578a77702B54027q9389A0741
18396b033l82595a71772C4224k302O4915a35246j45011B39840q8448P8398c8272
18384A26663D0026J3360a45481l1848I6450K76041j74961a99705J5496I5200h0961
18372h90j07300B85984D0618R1036i3893n4510C09595b50961e7964l5915m1643
$$ y = [136084, -72750, -87496, 354569, -216615, 95315, -324631, -70880, -368018, -82279, 292672, 76181, -416217, -333758, 175609, -103073, -113864, 163036, -241367, 335002, -227386, -105178, 101092, -121437, -133231, 155856, -113607, -381339, -207477, 184786, -120224, 251919, -408454, -344559, -109288, -87246, 37169, -43587, 109418, 45303, 200525, -138477, 51276, -342122, -64069, -124364, -113403, -115, -29209, 119385, -113140, 196578, -177702, 254027, 164638, 10741, -2033, -384628, -171772, 34224, 31922, 96837, -135246, -280257, 239840, 151392, 229790, -38272, 126663, 40026, 53386, -145481, -177329, 96450, 372491, 197530, -199705, -184209, 95200, -80961, -890, -108190, 285984, 40618, 131654, -93893, -148403, 309595, -250961, -57964, -93879, -135522]
18361a35522j04502K5042L7748a9275A64260a00700A81693a12579J6831F2177
18350C7011L12664g8042L4712F9055a14543e4414A9387J2683a99477h2526a064
18338b77237H5874M0292a15385A14892J2466b55471E2038a53107I0884a45352
18327c785j20690D3963a92826H1850C394L70604b94668A69191l4034h8701o659
18316i5360c9150E1933O950a89156A65630H2000k6036a76665B84975e8042j92016
18305b50058e0084p3936N1777a3888j48150L6392Q590D7822b58858a28419C36987
18293B00427B5012a18815Q87A41335a6983O402k26727O9333A46600b59824f2313
18281G4226i0848l7018I8161a28111r7409g4416A09369a83655a5329D36123a16374
$$ y = [-135522, -240024, -214982, -177234, -19275, 164260, -100700, 181693, -112579, -95748, 62177, 37011, 349675, -78042, -43330, 69055, -114543, -54414, 19387, 32070, -199477, -82526, -1064, -277237, 85874, 126166, -115385, 114892, 127358, -255471, 52038, -153107, 90884, -145352, -3785, -124475, 43963, -192826, 81850, 3394, 373998, -294668, 169191, 135157, -88701, -95360, -39150, 51933, 58883, -189156, 165630, 82000, 55964, -176665, 284975, -58042, -250058, -50084, -124020, -72243, -13888, -162038, -125646, -117056, 47822, -258858, -128419, 336987, 200427, 25012, -118815, -117928, 141335, -16983, -10581, -237308, -167975, 146600, -259824, -62313, 74226, -90848, -127866, 98161, -128111, -225520, -74416, 109369, -183655, -15329, 436123, -116374]
18269G5374n721i2608a721A07242k3108b46168B35701i5202j3645l1910m9385
18258a90142A38979c00106a9939A19732g7789A6959b25560B43175f5120j94465
18248b59585B47437k7345I7661K25708f1647m12724C3182J3788i4304B67923i2626
18236e6277A21147b70961J9823k13648a04825k47671B6751b48304J02696j97274
18226c42882P4866A85098D5491J37084r0282q136Q6402l2437K30944H4279d27886
18214a36584A00067a84393j13054A37016a32933D2542K06713i6869B58464j23526
18204A34938a67982L7459b9277q8322A3462J25564i808A6462J5514P6070A0745
18192B45983j21901j6372R437O7535k8914p6121a42213d3532A99180r1793a61887
$$ y = [75374, 69653, -92608, -1721, 107242, 84134, -246168, 235701, -95202, -108847, -140757, -190142, 138979, -300106, -19939, 119732, -77789, 16959, -225560, 243175, -65120, -259585, 247437, 220092, 97661, 323369, -61647, -474371, 33182, 46970, -94304, 267923, -92626, -56277, 121147, -270961, -251138, -464786, -104825, -352496, 26751, -248304, -145608, -342882, -268016, 185098, 45491, 182575, 92293, 84157, 170559, 138122, 369066, 84279, -427886, -136584, 100067, -184393, -297447, 137016, -132933, 42542, 249255, -96869, 258464, 134938, -167982, -130523, -29277, -117599, 13462, 139026, -9808, 16462, 31976, 108046, 10745, 245983, 124082, 107710, 117147, 184682, 155768, 79647, -142213, -43532, 199180, 107387, -161887]
18180a56244d8843I1943a30253I7052a40501f9464b8707C19593A44685J19323
18170B64008F6932c39211E0963a18829n8391e9639D3533A7760a63761N0225r0006
18159b03542A40139a07600j54674i4687l840A24006e5203E9860K2911b1046B02881
18147I3653a6913p4944b7542q8826C27535b24755C6862b8810A61330d07487A84389
18135a01948G4186h7881F6446c54354A18652b30357b640j30823M5611A63523F1360
18123b49648A82239d4212j27772c3806E6707k3537J39093C8930a14925H2879a45708
18111b20598D23085A84138J03790B1542a00818C28790a092C00093a08565N4160
18101e4405A57100c44325a35161l23594d4567H5405b29402a2949G3120h069m18510
$$ y = [-156244, -48843, 91943, -130253, 97052, -140501, -69464, -28707, 319593, 144685, 264008, 66932, -339211, 50963, -118829, -177220, -59639, 43533, 17760, -163761, -113536, -203542, 140139, -107600, -262274, -94687, -98527, 124006, -55203, 59860, 82771, -21046, 202881, 93653, -16913, -91857, -27542, -116368, 327535, -224755, 36862, -28810, 161330, -407487, 184389, -101948, 74186, -87881, 66446, -354354, 118652, -230357, -2640, -133463, -87852, 163523, 61360, -249648, 182239, -44212, -171984, -33806, 56707, 33170, 172263, 38930, -114925, 82879, -145708, -220598, 423085, 184138, 287928, 21542, -100818, 328790, -1092, 300093, -108565, -54405, 157100, -344325, -135161, -458755, -44567, 85405, -229402, -12949, 73120, -8069, -426579]
18090d26579f3975l248N065j3046C40804f2828I6498a17630J8473C4482j0865
18079B3617i6262j88168a26550M4038J9987B13777e8336J6348j81895A57990N8724
18068B16714a51050C9470J9960b75964c4346A95570e6142j00712L2455C9027b63611
18056a22653A00495P7977b4030o0977j73502j6099A46807a08293k7324E0877f2661
18044b21046B0692J7650a28369K3300C11317A18891a63195d0946A75241k0166
18034A55075n6040A992J0222b60736E1200L6191M1087L523b56312A3028M43068
18023D56096D303J6975L5171J88163b70911B28512o0869A7845P2280J89631c4756
18011a24860e7821R653j29610B2948e7672j1411I5947J76725j09702m4555D8584
$$ y = [-426579, -63975, -67223, -62158, -75204, 340804, -62828, 96498, -117630, -99157, 34482, 23617, -96262, -284430, -126550, -82512, -62525, 213777, -58336, -41988, -223883, 157990, 216714, -151050, 39470, 59430, -275964, -34346, 195570, -56142, -156854, -124399, 39027, -263611, -122653, 100495, 178472, -24030, -85007, -258509, -274608, 146807, -108293, -135617, 50877, -62661, -221046, 20692, 38342, -128369, -105069, 311317, 118891, -163195, -40946, 175241, 155075, 99035, 1992, 12214, -260736, 51200, 87391, 128478, 132001, -256312, 13028, 456096, 4303, 21278, 56449, 244612, -270911, 228512, 167643, 17845, 90125, 279756, -34756, -124860, -57821, -48168, -177778, 22948, -57672, -69083, 95947, 272672, 162970, 118415, 48584]
17999D0361a48695B51784m3069g2301k1840C4023a34199I7602L5074a8777B13678
17987A47173n5522b0308A35065b14097A28992j900c994j7886j00525B65461P1953
17976C37414g0159B47368c3325j40777D1811a75066B56893a78649D8614c1429
17965a29754K9222o9727A99340h9588k02971e8585j15603a3303A62675G2502g2722
17953H2368K86140L3493F6474b86402h8019A09333K5263o2098a93343a4905j83701
17942a98606B2849d9995I2797a76378b7488r5192f676C20740A18727c87786a69756
17930A5917N7804a4856A94294a02915k0888A5760R7905B1702Q7565H944K46132
17919B55076A09135C8517K9451b9584m0940j04699I8984c4458k2352j10215A89907
$$ y = [40361, -148695, 251784, 208715, -72301, -94141, 34023, -134199, 97602, 132676, -18777, 213678, 147173, 91651, -20308, 135065, -214097, 128992, 127092, -3994, -21880, -122405, 265461, 337414, -70159, 247368, -33325, -174102, 41811, -175066, 256893, -178649, 48614, -31429, -129754, -100532, -170259, 199340, -89588, -292559, -58585, -174188, -13303, 162675, 72502, -72722, 82368, 368508, 402001, 66474, -286402, -88019, 109333, 134596, 72498, -193343, -14905, -198606, 22849, -49995, 92797, -176378, -27488, -122680, -6676, 320740, 118727, -387786, -169756, 15917, 73721, -14856, 194294, -102915, -123803, 15760, 113665, 21702, 109267, 8944, 255076, 109135, 38517, 67968, -29584, -70524, -175223, 98984, -34458, -56810, -167025, 189907]
17907F3001b7059j00165C73347a23887A6987f5819a2822A64603a59560H0241K7037
17896A07278O7804b69866g7558M549A84812f6254B80609j12127n9232K1824b75091
17884b73677E7884J05033F8681I762L13794r3977A14652a02473j9615A19436e3330
17872a65585B85116r5132K14843j29505j14832C8317a32469f422C78557a46386
17861a0629j69209a7730B35381r1139c0564A8258J59152a6571G1259h4755j21695
17850b06450B34274A02894c07611B37107a68914d5934A5248Q2842J74890b18583
17839B9726J73747a90228A7567c3048k327a3786A52617j7624d07551C82624j20551
17828B62073I4131J18906o8031F0587j3982a48245F4378K9664J14700f8527A39760
$$ y = [63001, -27059, -127224, 373347, -123887, 16987, -65819, -12822, 164603, -159560, 80241, 107278, 175082, -269866, -77558, -73009, 184812, -66254, 280609, 168482, 109250, 131074, -275091, -273677, 57884, 162917, 68681, 9762, 323556, 229579, 114652, -102473, -122088, 119436, -53330, -165585, 285116, 189984, 404827, 275322, 160490, 38317, -132469, -6422, 378557, -146386, -10629, -179838, -17730, 235381, 144242, -30564, 18258, 177410, -16571, 71259, -84755, -206450, 234274, 102894, -307611, 237107, -168914, -45934, 15248, 98090, 272980, -218583, 29726, 203473, -190228, 17567, -33048, -35375, -13786, 152617, 134993, -407551, 382624, 262073, 94131, 213037, 145006, 60587, 46605, -148245, 64378, 94042, 208742, -68527, 139760]
17816B15295R9424h7182A0218b30786F9667J35368b47751A05160A5750a47188
17805a0801I3036J0889O2961b18620a9797o9309m9258B52567D8767j8465J25054
17794A55356k9036D5173J78705E4404d980I9192M5802K14434b33559f1817A47601
17782A5972K90118b79261A23151f0089A8728J07432f8127B52573b51280B96839
17771A49042J55961D9312K03516m7834J30746b19061c7826A42393p0813h1351
17760B63707M363a26284H5020J13319m0663E1522O1212a26538A8860a89622P6473
17749a13149k16710G2936O6197g5745A89667Q607d99596d792A78125b5435j34619
17738a60054j65562A63343h462G0022l58L7497J02735K5052D6561J74914k4667
$$ y = [215295, 314719, -87182, 10218, -230786, 69667, 205035, -247751, 105160, 15750, -147188, -10801, 93036, 103925, 166886, -218620, -19797, -89106, -138364, 252567, 48767, 30302, 155356, 126320, 45173, 223878, 54404, -4980, 99192, 144994, 359428, -233559, -61817, 147601, 15972, 306090, -279261, 123151, -60089, 18728, 126160, -68127, 252573, -251280, 296839, 149042, 305003, 49312, 252828, 204994, 335740, -219061, -37826, 142393, 71580, -81351, 263707, 268070, -126284, 85020, 198339, 157676, 51522, 112734, -126538, 18860, -189622, -113149, -329859, 72936, 139133, -75745, 189667, 198274, -499596, -4792, 178125, -25435, -160054, -325616, 163343, -8462, 70022, 69664, 107161, 209896, 234948, 46561, 221475, 196808]
17727A96808m7514J10544b75071I523c79981A49485Q9818a26604M172B69046a4604
17715b83741d536F0028J101a52433j1632L3884C52762d5903A24478a58177D30269
17703B03020N572B2981a76275B86954n0409J17358D8587P2991d0369B11571c40689
17691A17897A8223K85395r3727C3343J20322J02858J5892A5865P5429a89702B5454
17679D83936A41584M9743N2038A2903Q7323j4948J87421m3460a49476j81368C32680
17667G4870J59271R7915j9032e4343A04146J58400d3748I1285b27190A21018M9947
17656A70965N6321I3375l2491J76229g0945C00427b99546E1384J34313N9085j01120
17645A43662a46595m802I4982a09956c0154E998K11193B0919L28433P4252a43059
$$ y = [196808, 149294, 259838, -275071, 9523, -379981, 149485, 239303, -126604, -122432, 269046, -14604, -283741, -4536, 60028, 61129, -152433, -164065, -130181, 352762, -45903, 124478, -158177, 430269, 203020, 208592, 22981, -176275, 286954, 236545, 353903, 48587, 121578, -40369, 211571, -340689, 117897, 18223, 303618, 209891, 33343, 153665, 256523, 272415, 15865, 91294, -189702, 25454, 483936, 141584, 191327, 243365, 12903, 100226, 85278, 272699, 229239, -149476, -330844, 332680, 74870, 234141, 332056, 313024, -54343, 104146, 262546, -43748, 91285, -227190, 121018, 170965, 227286, 93375, 60884, 237113, -70945, 300427, -299546, 51384, 185697, 244782, 143662, -146595, -151397, 94982, -109956, -30154, 5998, 217191, 20919, 349352, 423604, -143059]
17633F3270d1461B30845d73A71230a42486C88512A34672K51017m2315O7859c9114
17621B18546J10123a8800G5082Q1231Q474J73160j21275a24888A53428m2908A5231
17609C67001E4858Q9133j2776J24926J54157H8459K63111b21715G9684a14976
17598A19682p739K46420a55057o6268B5495J51093l4974a15927K9840B62244k5147
17587B37097n3669m961E5814J08826C8286O0938J31027g5351C02150c8288C6683
17575b12849B34429q3399a19116B53927k9148j327N4405k6035R1022j42952q1402
17564A18490K4152D3031J71867P0536a07613A42158J68061j35894M8060J54789
17554C77174b542D13678a71664A49957o1985L87613F6828J09021J52048A32523
$$ y = [63270, -41461, 230845, -473, 171230, -142486, 388512, 134672, 385689, 343374, 411233, -39114, 218546, 328669, -18800, 75082, 156313, 164787, 337947, 216672, -124888, 153428, 110520, 15231, 367001, 54858, 143991, 131215, 256141, 410298, 88459, 351570, -221715, 79684, -114976, 119682, 111943, 358363, -155057, -221325, 25495, 176588, 141614, -115927, -86087, 262244, 237097, 183428, 178467, 55814, 164640, 38286, 99224, 230251, -75351, 302150, -38288, 36683, -212849, 234429, 151030, -119116, 253927, 224779, 223452, 277857, 251822, 342844, 199892, 118490, 142642, 43031, 214898, 285434, -107613, 142158, 310219, 174325, 222385, 377174, -2542, 413678, -171664, 149957, 87972, 475585, 66828, 175849, 327897, 132523]
17543B5592M63819A04212L27145J32881H2655M3359d8286B79196j29869o3528
17533H5799R3405M6819l0757p3694K86887q4225K65692J31129J6225J27059K18466
17522A082805j1278m08107n8764k22946L11906B85969j9835M7697q1424K57467
17512D89874j63389L62960J08113j35789m3375K38000l9152j89621j69740k06725
17502B51156A15492J75465j12669J44988I9239M33450j95977p6256l5228N6089
17492B81317K10582A37752P7818F0856J8618L87170j20772n6718J65931A08551
17481C07924K78401D4754K21279Q90J66943j68818K00860j58725d56B11186e7760
17469A63650J28190J39516n2865H2618K69405A42662b29710B8617J60804e4770
$$ y = [25592, 489411, 104212, 431357, 564238, 82655, 126014, -48286, 279196, 149327, 85799, 179204, 226023, 195266, 121572, 408459, 324234, 589926, 721055, 737280, 864339, 1082805, 1071527, 663420, 604656, 381710, 693616, 285969, 266134, 313831, 232407, 489874, 326485, 689445, 797558, 661769, 618394, 856394, 817242, 627621, 457881, 251156, 115492, 290957, 178288, 323276, 99239, 532689, 336712, 260456, 225228, 281317, 491899, 137752, 215570, 60856, 79474, 466644, 345872, 289154, 455085, 108551, 307924, 586325, 44754, 266033, 266923, 433866, 265048, 465908, 307183, -456, 211186, -57760, 163650, 291840, 431356, 378491, 82618, 352023, 142662, -229710, 28617, 189421, -54770]
17458h0057D46390j49326q1119j8562L06911j21786N0797A28443G632J56943n2114
17447A12461M63129L1366j21787j97630L0843Q2518H1787K62441j34269P3324
17437B83283K73047A58128K56578J02875o9171p6221j08961m8006j02139N00108
17427F13191A55070J71371O9671l0796K59017j81379L92520C85975J18771k12557
17417B92189I7540d8534C56370n715J74571j71720F2598M56403A55849m951J37178
17406B88076j10157L6707l9107J19721a31396A12816f4027A36797e6673F9342
17395C74971H7030K03659l7116A04620J69150J6565l9984K84194A42272P6298
17385B18570K21568k4815p5646A9647J43339k3844J53899o6172L12559B38816
$$ y = [-80057, 446390, 297064, 215945, 197383, 504294, 382508, 433305, 128443, 7632, 164575, 112461, 575590, 606956, 485169, 287539, 318382, 400900, 81787, 344228, 209959, 283283, 556330, 158128, 414706, 517581, 448410, 372189, 263228, 215222, 113083, 613191, 155070, 326441, 396112, 365316, 624333, 442954, 835474, 385975, 504746, 292189, 97540, -48534, 356370, 350655, 525226, 353506, 62598, 519001, 155849, 150898, 288076, 177919, 214626, 175519, 295240, -131396, 112816, -64027, 136797, -56673, 69342, 374971, 87030, 290689, 253573, 104620, 273770, 290335, 250351, 534545, 142272, 218570, 440138, 415323, 339677, 19647, 162986, 139142, 293041, 226869, 539428, 238816]
17374B61444m4811J68084n6679c2019D35738r9586j31048K881J38652j15392A07957
17362A62172K84684A58820J8045B2945M61481j30653m4360J99286k1311a3098
17351c7577A17277K15130j8345a35266F46649k62278A69539J72996J27252l2123
17341D37664j49637G2702L51979q7025j36027K52196j63166D5545i5012c988q994
17330a2982D05124M6354A25143C0879L04774J39181J4626I3942J39219r8898m1246
17319I3017J636J13746K87985j55203A707b3844A16801M76304k4448a06425B91696
17307A75694R0786K10204l0276j97656L20533c0511A89099P7739j14108O2006
17297B14736Q5782Q3408l0463j36561q6862J20372j913K58910F0700N25044j06261
$$ y = [261444, 216633, 384717, 328038, -32019, 435738, 336152, 205104, 207985, 346637, 231245, 107957, 162172, 446856, 158820, 176865, 22945, 484426, 353773, 309413, 508699, 487388, -13098, -37577, 117277, 332407, 314062, -135266, 646649, 384371, 169539, 342535, 469787, 437664, 288027, 72702, 424681, 337656, 201629, 453825, 290659, 45545, -95012, -3988, -12982, 405124, 451478, 125143, 30879, 335653, 474834, 489460, 93942, 233161, 134263, 93017, 94653, 208399, 496384, 341181, 1707, -23844, 116801, 593105, 568657, -106425, 291696, 175694, 266480, 476684, 446408, 248752, 569285, -30511, 189099, 266838, 152730, 214736, 300518, 383926, 353463, 216902, 130040, 250412, 248499, 507409, 60700, 585744, 479483]
17286D79483j7860j44500q6237o5363G4645M96034k04374J75431j07143J04030
17276E38623A70000J0402L17472A93938P9055K21154k39285j9138J34029A35911
17265F04842k22309P443Q2208R6638B60096j2629K51728M7083A17998j4263J10551
17254B14286J25253j3525J54596j84446K4233o5801l7174F0386M32164l4400P4063
17243E32213B02816J38324J77753k53390j01322M19862B80740K37121k19161o4331
17233B34369K73890M5685j31826j79044l2337N18834k74014A87049J24225J03527
17223D14801M2481O3168j78143n0053i1783D9330O51250j60084j15562J9002j83115
17212B60821K21304j27346J18706j12521J18874N2895B18179K67301o8866K29212
$$ y = [479483, 461623, 317123, 230886, 165523, 74645, 570679, 366305, 541736, 434593, 538623, 170000, 180402, 497874, 193938, 272993, 494147, 254862, 235724, 369753, 135911, 604842, 382533, 389976, 472184, 568822, 260096, 247467, 499195, 546278, 117998, 103735, 214286, 339539, 326014, 480610, 296164, 320397, 254596, 217422, 60386, 492550, 458150, 532213, 202816, 341140, 518893, 265503, 164181, 584043, 280740, 517861, 298700, 234369, 508259, 553944, 422118, 243074, 210737, 729571, 455557, 187049, 311274, 414801, 457282, 520450, 342307, 292254, -91783, 49330, 700580, 540496, 424934, 443936, 260821, 482125, 354779, 473485, 360964, 479838, 532733, 218179, 485480, 416614, 645826]
17202F45826A44983M01362J69803j70450J47266j42746p2570A94706K64951J72218
17192F31875m8956H6159K02380J82386N5274k53084L54886j72498J46331B68229
17181C79905K85815A39285N28914k09241o6977N927j68515K86472B08780K54368
17171D63148K80148k48341K590L6247J83771M85k45957j16097O0846A02303N12274
17160F14577B96269L79130j35960N7490B76402j1685L24618j58840Q7212j27450
17150C90257J21037M905o7145J16402K20392j87262j22288M49270B35167l2405
17140B02762Q48451l95691C23326Q6266K36113j30516o4681J56494j27816J05331
17130E84517K07694j43781k19975O7574J27372K12146j43011J13510k34832n1762
$$ y = [645826, 144983, 546345, 716148, 545698, 692964, 550218, 477648, 194706, 459657, 631875, 582919, 86159, 288539, 470925, 526199, 273115, 628001, 455503, 601834, 268229, 379905, 665720, 139285, 668199, 458958, 391981, 397908, 229393, 515865, 208780, 463148, 743296, 494955, 497545, 533792, 717563, 718048, 472091, 355994, 416840, 102303, 614577, 296269, 675399, 539439, 596929, 276402, 264717, 589335, 430495, 517707, 390257, 511294, 516199, 449054, 565456, 785848, 598586, 476298, 925568, 235167, 202762, 1051213, 655522, 323326, 409592, 645705, 515189, 450508, 607002, 479186, 584517, 792211, 648430, 428455, 496029, 623401, 835547, 692536, 806046, 571214, 519452]
17120E19452j66983K16769j25999L18095P1534l71650J66420J27701l23691L72556
17110H04204J23198o1863L5750J33156j45952m18803P2711J81390J10335k62860
17100E71266K58892k08740p337K35171l45959K19280J75724k54853N5502k2457
17090F76489k16457L11619Q5117p5596p8228J0386j8254r0713R7928j50873J24296
17079F75714C18569O49456j85132R8499k29901l5107N20928n07581J95848J90283
17069A015862k27608k5055P2172k41015J41536J74222l02373K91245J83071l61270
17059G20787r0463q6804J20637K34295k24470M61541k11746j54741L0536L39923
17049A139495l61796K57261k80059O9027M30059k58718P1027l07938J10793J15131
$$ y = [519452, 352469, 569238, 443239, 761334, 832868, 461218, 627638, 755339, 431648, 804204, 927402, 865539, 901289, 1034445, 888493, 469690, 542401, 723791, 834126, 571266, 830158, 621418, 614081, 849252, 503293, 722573, 898297, 643444, 698946, 676489, 460032, 771651, 856768, 781172, 702944, 713330, 695076, 604363, 702291, 551418, 675714, 318569, 968025, 782893, 881392, 651491, 616384, 1137312, 629731, 825579, 1015862, 788254, 763199, 835371, 594356, 735892, 910114, 607741, 898986, 1082057, 720787, 630324, 543520, 664157, 898452, 673982, 1135523, 923777, 769036, 799572, 1139495, 777699, 1034960, 754901, 823928, 1253987, 995269, 1066296, 758358, 869151, 984282]
17039I84282k44280L11117j48083k73j21024j3533M62815n08048K94939K76162
17029A294074j95987j42359J80822m13621M34416J73023k53351K12479j57103
17020A132393R2180n6393n4008L11189k44039j98125K47321p7567j96153M1136
17010I97934J03681R3585l3172L74181m99065Q5560o8484J33720M20813l22827
17000A285926n4712L65371k49882j1008N1923j14653k78099J07120L37231l06918
16990A132299M72248N3487j64744k73575L72992k69627J53765k4571j26347J31153
16980A457080k4767L13313o998k80194j583Q848L00301m12371K92089j35468n4172
16969A456078K21662l85982J16338K79211o7020L00489l15792K81682j51270J60617
$$ y = [984282, 740002, 1051119, 903036, 902763, 781739, 768206, 1231021, 722973, 1017912, 1294074, 1098087, 955728, 1136550, 722929, 1157345, 1330368, 1077017, 1289496, 1132393, 1224573, 1168180, 1114172, 1425361, 1181322, 983197, 1230518, 1152951, 956798, 997934, 1101615, 1195200, 1162028, 1536209, 1037144, 1122704, 1054220, 1187940, 1608753, 1285926, 1231214, 1596585, 1346703, 1335695, 1387618, 1272965, 994866, 1101986, 1439217, 1132299, 1604547, 1658034, 1493290, 1219715, 1592707, 1323080, 1476845, 1452274, 1325927, 1457080, 1432313, 1745626, 1738628, 1458434, 1456851, 1465699, 1766000, 1353629, 1645718, 1510250, 1456078, 1677740, 1291758, 1408096, 1687307, 1620287, 1920776, 1604984, 1886666, 1735396, 1896013]
16959A896013J93790m38174P3617R3111k80771N06595l74135M10732j57939j37734
16949A785105M76111j66719k1669M3602k9145j78487M08319n01383L43206o2265
16939B096675K72530n10532L95285j15804J35222K36031j17811j86909J48638
16930B353325N7243k53472L45810J15393k58092k55587N60124j62001J67513J50073
16920B820329l59488L27647m52578K60422p06j48093J04137J33427J15914q9325
16910B711686J02750K9960p0299R8344J29161r8153K65773j8716M6375M4596j61522
16899C079955P4766K32542j25979N4996O4157l30691J48680M25810k73314o112
16889C344810N10256l22090L05463m43413J70147k9569K54054K99547k84209L63782
$$ y = [1896013, 2089803, 1651629, 1725246, 1818357, 1537586, 2044181, 1670046, 2080778, 1922839, 1785105, 2261216, 2094497, 2072828, 2116430, 2087285, 1908798, 2317117, 1815734, 2158940, 2096675, 2369205, 1858673, 2253958, 2138154, 2273376, 2509407, 2391596, 2204687, 2353325, 2410568, 2157096, 2502906, 2618299, 2360207, 2104620, 2664744, 2502743, 2670256, 2820329, 2460841, 2788488, 2335910, 2596332, 2595626, 2447533, 2551670, 2685097, 2801011, 2711686, 2814436, 2844396, 2774097, 2872441, 3001602, 2903449, 3169222, 3150506, 3196881, 3241477, 3079955, 3154721, 3387263, 3261284, 3316280, 3380437, 3049746, 3198426, 3624236, 3350922, 3344810, 3855066, 3532976, 3838439, 3395026, 3565173, 3535604, 3789658, 4089205, 3804996, 4168778]
16879D168778k69810l1076J96526J40316L7192K045P3211l3645J82446K821j1842
16868D456962R968j5279L67401Q3466j07074R5537R4277J92432K45195J69644
16858E592529m28824k37629P74807k17481J11083j16412M38528j42490K2499N27740
16848F324350l60045L89137j13771J49373p2557M41620j37878J94302P6186J3791
16838F904508J80698L10260k72048K36341L10665L32755j74609j65998P39183
16829H401755k41899M69597r9150J13810L06684R0857J47078L87732o4965K05336
16819I716835M70637k15286M59168N5217K28436K02771L26986j17976N81964M0051
16809A1748803L27168m2165M08437M29553J18120M67086J63373M44573J10956
$$ y = [4168778, 3898968, 3867892, 4064418, 4204734, 4241926, 4243971, 4317182, 4283537, 4465983, 4468804, 4456962, 4466930, 4451651, 4819052, 4902518, 4795444, 4890981, 4985258, 5177690, 5422885, 5592529, 5163705, 4926076, 5700883, 5483402, 5594485, 5478073, 5916601, 5774111, 5796610, 6324350, 5964305, 6353442, 6239671, 6389044, 6316487, 6758107, 6620229, 6814531, 6890717, 6904508, 7085206, 7395466, 7123418, 7359759, 7670424, 8003179, 7828570, 7662572, 8401755, 8159856, 8629453, 8530303, 8644113, 8950797, 9041654, 9188732, 9576464, 9511499, 9716835, 10187472, 9972186, 10431354, 10486571, 10715007, 10917778, 11244764, 11126788, 11708752, 11748803, 12075971, 12033806, 12442243, 12871796, 12989916, 13457002, 13620375, 14064948, 14175904]
16800A4175904K13578O51407O39504k6400R2837P03031L28957L34697M88106M99834
16790A8101455N51290L84230P25560K73787M66871N10428N63154R08770K07788
16781B2693333P39062P33902M09185N59507Q53354Q10557Q26606O09346J094311
16772B9329163P40810Q52222Q96397P39400J227882R24189J067398J025430J152435
16763C7955326J284195J145711J127832J287934J280294J771623J356966J579608
16755D8789489J616265J574419K049909J252678J861110J595342K051136J681612
16747F2471960K011784K082224K094314J944779K161722J880373K262079J846959
16739G8756194J824332K169758K205001J903245K215537J786404J535950J769830
$$ y = [14175904, 14389482, 15040889, 15680393, 15653993, 15746830, 16449861, 16778818, 17113515, 17601621, 18101455, 18652745, 19036975, 19762535, 20036322, 20503193, 21013621, 21576775, 22485545, 22693333, 23432395, 24166297, 24575482, 25134989, 25988343, 26798900, 27625506, 28234852, 29329163, 30069973, 30922195, 31818592, 32557992, 33785874, 34710063, 35777461, 36802891, 37955326, 39239521, 40385232, 41513064, 42800998, 44081292, 45852915, 47209881, 48789489, 50405754, 51980173, 54030082, 55282760, 57143870, 58739212, 60790348, 62471960, 64483744, 66565968, 68660282, 70605061, 72766783, 74647156, 76909235, 78756194, 80580526, 82750284, 84955285, 86858530, 89074067, 90860471, 92396421, 94166251]
16731I4166251J477634J308616J044480J520849P16485Q30891O13459L05076K17888
16722A02201629o1139j48707n76241n98556o86659j042218j000618j476164j178787
16713I5432540j621779j691074k043185j626954j812582k185531j940515j940117
16705H0570803k732840j577343k142249j856911j834733k385634k059227j766213
16697F4215653j944083j704996k247970j670793j717706j699244j674269j239442
16689E0317150j912442j381101j580167j427942j101072j494771j418485p87650
16681C9213520j372542j025047j207159j008263q74960j037034r10767q50006
16673C0927742j050095r99762n97395q00393o59545q68033q46450n58036p44726
$$ y = [94166251, 95643885, 96952501, 97996981, 99517830, 100234315, 101065206, 101678665, 101983741, 102201629, 102140490, 101991783, 101415542, 100816986, 100130327, 99088109, 98087491, 96611327, 95432540, 93810761, 92119687, 90076502, 88449548, 86636966, 84451435, 82510920, 80570803, 77837963, 76260620, 74118371, 72261460, 70426727, 68041093, 65981866, 64215653, 62271570, 60566574, 58318604, 56647811, 54930105, 53230861, 51556592, 50317150, 48404708, 47023607, 45443440, 44015498, 42914426, 41419655, 40001170, 39213520, 37840978, 36815931, 35608772, 34600509, 33725549, 32688515, 31777748, 30927742, 29877647, 28877885, 28280490, 27480097, 26820552, 25952519, 25106069, 24548033, 23803307]
16664B3803307o27993j51827o12586p77650n40790r42039j59199k86716n11322
16655A9193185o78771k77616m01129m42006n86459j99657k22189p60257N8482
16646A5683583q42611j10651k74994l71211o9212l73230m98221j3640j18423m60137
16636A2551253o48598P2404k71108k65931l29869k6394j96190l32002K82808p16027
16626A0120346J40195o20140J94838k98726k72462K35360l16953j3591m06204
16617H762663j81437l47108j04668P20N4516k30624K00227o24036o2816K9994
16607G497431o96633M00296k11151m3779J7439k76803O9076M2665l22010k00255
16597F276276J95133j29161m83917j4724J46101j89087L6255n1691k83866K29369
$$ y = [23803307, 23175314, 23023487, 22410901, 21633251, 21092461, 20150422, 19991223, 19704507, 19193185, 18514414, 18236798, 17835669, 17393663, 16807204, 16607547, 16385358, 15625101, 15683583, 14840972, 14730321, 14455327, 14084116, 14014904, 13641674, 13143453, 13129813, 13011390, 12551253, 11902655, 11975059, 11703951, 11438020, 11108151, 11081757, 10885567, 10553565, 10836373, 10120346, 10260541, 9640401, 9835239, 9536513, 9264051, 9499411, 9182458, 9168867, 8762663, 8581226, 8234118, 8129450, 8130170, 8184686, 7954062, 8154289, 7530253, 7467437, 7497431, 6800798, 7201094, 6989943, 6946164, 6963603, 6686800, 6755876, 6798541, 6476531, 6276276, 6471409, 6342248, 5858331, 5843607, 5989708, 5800621, 5836876, 5785185, 5501319, 5730688]
16587E730688l12836k8915J53990j69211j96334j94935J60481j20317K0263j54262
16577D888612j16552L13712k06357n55933L28302m12881N16346k42633j96594
16568D316022k23725k88379L82665q4996j30544O7643j34555K20459J44474n19451
16558C749613N2447K28242q6953m95862M38046k65702l6207q8181k40499j12206
16548C142738M26659j30983q4951q9286j08052L10725j16910J97700l10177n19810
16538B717653L6846K50231k11432J68827j7904q4986J4405l46742J17624L31937
16528B976459m49641J86797K09665l36979N9126j74062J95060J48632k57735k42212
16518B315110P48885o51462j4902m735P7066k35216J59190l51705l3035K72120
$$ y = [5730688, 5417852, 5388937, 5542927, 5373716, 5177382, 4982447, 5142928, 5022611, 5042874, 4888612, 4772060, 5085772, 4879415, 4323482, 4651784, 4238903, 4755249, 4512616, 4316022, 4092297, 3803918, 4186583, 4101587, 3971043, 4038686, 3904131, 4124590, 4269064, 3749613, 3802060, 4030302, 3943349, 3447487, 3885533, 3619831, 3583624, 3495443, 3254944, 3142738, 3569397, 3438414, 3353463, 3264177, 3156125, 3466850, 3349940, 3547640, 3237463, 2717653, 2754499, 3004730, 2793298, 2962125, 2944221, 2859235, 2873640, 2526898, 2644522, 2976459, 2526818, 2713615, 2923280, 2586301, 2645427, 2471365, 2666425, 2815057, 2557322, 2315110, 3063995, 2412533, 2397631, 2392896, 2469962, 2234746, 2393936, 2042231, 2009196, 2281316]
16508B281316q6927Q0227j83329K35822j58881l2463K04095n52327M25372K5640
16498B238545k3979J7454L5415j84593O4143k61379r7261J22470M605K57495j82970
16487A989945l8606j87858j09058P4916N98142m44239k68203K3377O22763n61402
16477A699777J18365n1678n9014j16522J39400l59561Q5116L10562m3933N409
16467A727921r3619j68847N4708J26818j65515J61183j7491J45717k10333J43718
16457A704260j54774l08954K78118J12625j41686K39664K2430n06084L86944n09268
16447A123275L80253J79788m4699j90612j47281j19506k3023M4383J35512j47832
16437A190258K71300l30525K10061j8395j09863j08855j9030k31989N34497P4897
$$ y = [2281316, 2194389, 2274616, 2091287, 2327109, 2168228, 2135765, 2339860, 1787533, 2212905, 2238545, 2214566, 2232020, 2267435, 2082842, 2146985, 1885606, 1788345, 1910815, 1915420, 2172915, 1989945, 1951339, 1763481, 1654423, 1729339, 2327481, 1883242, 1615039, 1638416, 2261179, 1699777, 1818142, 1766464, 1707450, 1590928, 1730328, 1370767, 1455883, 1766445, 1722512, 1727921, 1634302, 1465455, 1520163, 1646981, 1481466, 1642649, 1625158, 1770875, 1560542, 1704260, 1549486, 1240532, 1518650, 1631275, 1489589, 1729253, 1751683, 1245599, 1632543, 1123275, 1503528, 1683316, 1638617, 1448005, 1300724, 1181218, 1158195, 1202578, 1338090, 1190258, 1461558, 1131033, 1341094, 1322699, 1212836, 1103981, 1084951, 852962, 1387459, 1462356]
16427A462356j98165O9281j54745Q0620J0380J51226l67037L28300l54324J29865
16417A157757J48324k28207K96392P7697j32367O6548k37310j34217J73408j51708
16407A036317L22582k70846Q197j03128k48485M37817J06438j79348j91378j58324
16397G59842N08323l40163o139P1589p4368O0945J15690o1974m06382K99454J85635
16386A112452J47035k69321m2521L39394l61332Q7032K64641j63004k31523k06001
16376F76852R6432J67733j1490k96929J42945J30683L35240m23912J88255m31444
16366E74365J48424N8160J66683l7767q4634r2747K93425k75584J21241j33863
16356G37703K80434k62333P7418k66284L61876l81188J71685J52443k07687K07894
$$ y = [1462356, 1264191, 1333472, 1178727, 1259347, 1269727, 1420953, 1053916, 1382216, 1027892, 1157757, 1306081, 1077874, 1374266, 1451963, 1319596, 1386144, 1148834, 1014617, 1188025, 1036317, 1358899, 1088053, 1096250, 993122, 744637, 1182454, 1288892, 1109544, 918166, 759842, 1268165, 928002, 921863, 993452, 919084, 980029, 1095719, 1033745, 627363, 926817, 1112452, 1259487, 990166, 947645, 1287039, 925707, 1012739, 1277380, 1114376, 882853, 676852, 773284, 941017, 929527, 632598, 775543, 906226, 1241466, 817554, 1005809, 574365, 722789, 780949, 947632, 909865, 825231, 732484, 1025909, 750325, 871566, 737703, 1018137, 755804, 833222, 566938, 928814, 547626, 719311, 871754, 664067, 871961]
16346H71961l43037K69983L55793l12310j87163j1488J57583q1270j31653L83229
16336I71628J03496l40807o6223k75442L62963l0990p2881l7880j22825K3309
16326E14348J50428L02768l09466k37660L27521j4223q9125K31015o5158D03228
16315A000518D73000M9211j34456M92716C97273J93038O009J01516j73078J73320
16305F98078k01131j21494M31363l20275o7629K12894j05007R6135j89246J3457
16295D47145L61038C86629Q088j04720J28779J11726Q2023L02662l53904j15650
16285D45633j26718K61725j70760L92816j77020k08179K3444L1297E9496L52758
16275D12254J87925B18545K61781K38811j91115N93502m06398j88666O1574k83415
$$ y = [871961, 528924, 798907, 1154700, 842390, 655227, 643739, 801322, 720052, 588399, 971628, 1075124, 734317, 668094, 392652, 755615, 724625, 651744, 613864, 491039, 514348, 664776, 967544, 658078, 420418, 747939, 733716, 644591, 875606, 810448, 403228, 1000518, 473000, 522211, 387755, 880471, 397273, 590311, 596320, 697836, 524758, 698078, 496947, 375453, 806816, 486541, 418912, 631806, 526799, 622934, 433688, 447145, 808183, 386629, 394717, 289997, 418776, 530502, 612525, 915187, 561283, 445633, 318915, 580640, 409880, 802696, 625676, 417497, 440941, 472238, 59496, 412254, 600179, 218545, 480326, 719137, 528022, 1121524, 715126, 526460, 588034, 304619]
16265C04619J48899j55323L23312j16512K14922C12947J75989j42062M4849A21579
16254D01550m9829J27601j20740J10256n587J13545j43820n0520M8275J50O9523
16243E00404j84022n0022j18069K84060j58931R370R4389J60122R020q091A89499
16231E00646B20413J68958K29594m7643j95640o4051L93631A55497K32295n2558
16221C35234l1786J38662l8504q8748r0921K56251k20275M03022A51041M15887
16211E66928A30616J05090J16449A47149L95968K6634r7124A6032M96399N593
16201E18024j08572G1174L21468q2654N9603J30692M1309j69231P7496j88736
16191B61121j02269L95387B01111J83701J41340k62982I0991J97588G6476O47897
$$ y = [304619, 453518, 298195, 621507, 504995, 719917, 312947, 488936, 346874, 391723, 121579, 401550, 351721, 479322, 358582, 468838, 463251, 576796, 432976, 382456, 430731, 430881, 500404, 316382, 266360, 148291, 432351, 273420, 282790, 377179, 537301, 546321, 538230, 189499, 500646, 220413, 389371, 618965, 571322, 375682, 311631, 705262, 155497, 387792, 335234, 303448, 442110, 403606, 314858, 223937, 480188, 259913, 662935, 151041, 566928, 130616, 235706, 352155, 147149, 543117, 569751, 472627, 16032, 512431, 518024, 409452, 71174, 392642, 309988, 369591, 500283, 541592, 372361, 449857, 261121, 158852, 554239, 201111, 384812, 526152, 263170, 90991, 288579, 76476, 724373]
16181G24373l53880j65388r8966J66273J76419l6954j40796O6378r6093p8575
16171A62791O0569m0525J86952n5156A34320e4013C30771B7767J24655G3281J31798
16160B05079G9354J48209Q5798o1102A22472J36083p7245P3317K61380D0466L1052
16149G1518L10734B5868N4568K62230G3612J76793j08349J68582A39414K90444
16139D29858J54631E7140L04718J5506j64120k9891p1170Q3628K29963B03279
16128B50015n3677l5894l792F0114K00272K3920K83324B76929M4223K986N8745
16117C82883n9917j3923j45294o0506L62668j56055L9400b12263C35454H4446
16106A81987l422c1336H8660D2514N1720j5327M8223r378L57159G1067J63353
$$ y = [724373, 370493, 205105, 106139, 272412, 448831, 411877, 271081, 337459, 241366, 162791, 223360, 182835, 369787, 314631, 134320, -54013, 330771, 27767, 152422, 73281, 205079, 79354, 227563, 313361, 252259, 122472, 258555, 181310, 254627, 516007, 40466, 71518, 382252, 25868, 80436, 342666, 73612, 250405, 142056, 310638, 139414, 429858, 584489, 57140, 361858, 377364, 213244, 183353, 112183, 195811, 425774, 203279, 250015, 196338, 160444, 156652, 60114, 260386, 284306, 567630, 276929, 321152, 324138, 382883, 322966, 309043, 163749, 103243, 465911, 309856, 349256, -212263, 335454, 84446, 181987, 178565, -31336, 88660, 42514, 94234, 78907, 127130, 117752, 474911, 71067, 234420]
16095B34420P948e400C46113p2580G3285k6438J93997P7861j15278J14248H5611
16083B7162L56217B8097b89344a22663A93782n5507l9119a04133r7516F6310J90926
16072B57236A01196J06960h3404C69183A47069C8988L59527j94955A2545O8533
16062H1078A0322L78794A36492n3163K6528P6468K32792a07336D61712j79126
16052B82586k1328j4891l6324C290K21299C8688N29608a71259B51749I8241J69874
16041B68115L6185I4364L11814j38561B5344L53715E7751K59454j55793d8377
16030B6855b60478B29300j04081K26503j62439a81824C4792K56929a28985o9415
16020a98400B0406L8330K44938f6673A16562J49224H8835R9108b85462B38500
$$ y = [234420, 242368, -5400, 346113, 273533, 73285, 46847, 240844, 318705, 203427, 317675, 85611, 27162, 383379, 28097, -289344, -122663, 193782, 138275, 99156, -104133, -201649, 66310, 257236, 101196, 208156, -83404, 369183, 147069, 38988, 398515, 203560, 12545, 81078, 10322, 389116, 136492, 83329, 109857, 186325, 419117, -107336, 461712, 282586, 261258, 246367, 210043, 3290, 224589, 38688, 568296, -171259, 251749, 98241, 268115, 304300, 94364, 406178, 267617, 25344, 379059, 57751, 317205, 161412, -48377, 26855, -260478, 229300, 125219, 351722, 189283, -181824, 34792, 291721, -128985, -198400, 20406, 58736, 303674, -66673, 116562, 265786, 88835, 187943, -285462, 238500]
16009B59538P625A4906L50910C5099J26198J98660H4469K7550j0766c3871j32264
15998a66135B31095o4867o5843K53937r5675J42394o2114p2222A20864L2949J99499
15987C53312L50596O3587J3676N73497F42397m2652I6653N7441L1146i73H4244
15975H0758k1326a03039B62269J51744r8687c4897k98037C51743j12445a68007
15964A62329h9538L8283J0838A42359l6595N4679c974B5694b17952a7979C1348
15952A21138a55531e7000B1116N7371C8970b29847C34869a90227A55997L13922
15942D69919E5458d4005A42082j8677b14235l2683N0552A90849q2439d2773l4220
15931g6993B55079q4710B4309f5072k54494B12185J7250e6109A6746L98380a50338
$$ y = [259538, 267163, 14906, 365816, 35099, 161297, 359957, 84469, 112019, 101253, -33871, -166135, 231095, 166228, 100385, 354322, 258647, 401041, 338927, 266705, 120864, 153813, 353312, 703908, 767495, 781171, 1354668, 642397, 599745, 96653, 154094, 185240, -973, 84244, 80758, 59432, -103039, 262269, 414013, 315326, -34897, -332934, 351743, 239298, -168007, 162329, -89538, -51255, -40417, 142359, 105764, 160443, -3974, 25694, -217952, -17979, 31348, 121138, -155531, -57000, 21116, 78487, 38970, -229847, 334869, -190227, 155997, 469919, 55458, -44005, 142082, 123405, -214235, -246918, -196366, 190849, 108410, -42773, -76993, 255079, 170369, 24309, -65072, -319566, 212185, 229435, -56109, 16746, 415126, -150338]
15919A2676N9805k7198c23429B18485J0380G076L7571K11799h7603A68431a998
15907c96176a58585P4607k45079l4325B32201F5199k7185J65667a08216F5789
15896a09341A54910g418A88362f0924j46101N6067A18426E2476N1419K43057j54093
15885A92859q0885d6446k09519A43036M85795F5290h6089c5911A44298a38879
15874A13110i1480A3150J94718a95719m345N66A15025C1000K73092c2525m4078
15863g6603k35154C9913a1516A23931K2908J28692J60832b78323L2812c7594E4747
15851d75139B00121n7157e326a847B78502j19834N2708b79595N1426B01862o8943
15840A32919a35110A37400i5511d5820B15128a23502K2157c4949B0462K5125b46883
$$ y = [12676, 72481, 45283, -323429, 218485, 228865, 7076, 44647, 256446, -87603, 168431, -1998, -396176, -158585, -83978, -329057, -363382, 232201, 65199, 38014, 203681, -108216, 65789, -109341, 154910, -7418, 188362, -60924, -207025, -150958, 118426, 52476, 103895, 346952, 192859, 111974, -46446, -255965, 143036, 628831, 65290, -86089, -35911, 144298, -138879, 113110, -91480, 13150, 207868, -195719, -200064, -199498, 115025, 31000, 304092, -32525, -76603, -311757, 39913, -11516, 123931, 146839, 275531, 436363, -278323, -245511, -37594, 54747, -475139, 200121, 142964, -5326, -1847, 278502, 158668, 211376, -279595, -228169, 201862, 132919, -135110, 137400, -95511, -45820, 215128, -123502, -101345, -34949, 20462, 45587, -246883]
15828D8108J01856a41355B84512I999b17348I9490m4038c01723G8091B1324b29096
15816b20475l7976m1168E5684b08483j13951J05933g2483j65920F7845j0041M503
15805F2307e2085B23221F9384c6118B37704a32615O4370K7069I5685n512a25438
15793E0342i9171j92790C00674j39299J3062B4197b87528D5949a85451F1007O7954
15782A28961a5143I0014B6903J5658a11724B13017b1136B33356i554C25636d6764
15770i6181j21077E6831f076o0684B32995I4751a61848B2414K3483L9506b25489
15758a37497F3481d3875j68750E7066j1660K0245J90438F5070K33509A16991h394
15746B09391I8839J90827c0671A93549O7598o948a96836K9504h0502E9854a97232
$$ y = [48108, 149964, -141355, 284512, 9999, -217348, 99490, 55452, -301723, 78091, 21324, -229096, -220475, -258451, -299619, 55684, -208483, -322434, -216501, -72483, -238403, 67845, 57804, 62307, -52085, 223221, 69384, -36118, 237704, -132615, -68245, -41176, 95685, 90173, -125438, 50342, -99171, -291961, 300674, 161375, 174437, 24197, -287528, 45949, -185451, 61007, 128961, -15143, 90014, 26903, 42561, -111724, 213017, -21136, 233356, -9554, 325636, -46764, -96181, -217258, 56831, -6076, -66760, 232995, 94751, -161848, 22414, 45897, 85403, -225489, -137497, 63481, -43875, -212625, 57066, 45406, 65651, 256089, 65070, 298579, 116991, -8394, 209391, 98839, 289666, -30671, 193549, 261147, 254199, -196836, -167332, -80502, 59854, -197232]
15734F3759b97798o0210g9938B99486j14611i2350A00211Q562a54509b4876j28250
15723a53126G6560J925K3499b18947F171R0759b3170B53248a65063P7216j74683
15712b62530a0689A77358a20455c53A83936E976a28365c2528p6968b5234j66196
15701a91430A92036c6458A18657f8151A0899a26613j16169A00402c2640A7131
15690A92438m1584k0073l0885Q2696f8356p6630A34453g0966A23319a49823B1746
15678A02821c9434F9435d592A80226O489B3069e1955Q780m9234j6110F1052b51755
15665b90109i4327A82882q9502f2151b4424q2176n0583j24798e9458m0384j74308
15654b74150g7715o7431A25644E9150a41719G626a15838A7748K51872p6143B4203
$$ y = [63759, -297798, -358008, -79938, 299486, 184875, -92350, 100211, 108773, -154509, -24876, -153126, 76560, 78485, 101984, -218947, 6171, 96930, -23170, 253248, -165063, -87847, -262530, -10689, 177358, -120455, -353, 183936, 5976, -128365, -32528, -109496, -25234, -191430, 192036, -36458, 118657, -68151, 10899, -126613, -242782, 100402, -32640, 17131, 192438, 150854, 130781, 99896, 182592, -68356, -144986, 134453, -70966, 123319, -149823, 21746, 102821, -39434, 69435, -4592, 180226, 186715, 23069, -51955, -43175, -92409, -108519, 61052, -251755, -290109, -94327, 182882, 93380, -62151, -24424, -106600, -157183, -281981, -59458, -99842, -274150, -77715, -145146, 125644, 59150, -141719, 7626, -115838, 17748, 269620, 193477, 24203]
15642C0115a07401G5554d187B32924q6599b0280l5695C40418j35022i2473j70687
15631b63160a19598A45864b76762a37248C84648B9624c8710j50942E426b01043
15620B74101a50680j14224G2570K29576a27908F510a36379B99994b65361J01641
15610a63720r7732A89670p8648g5747G8279O1214l2825O9462j8307l2786h1126
15598a1830I2535g251n6091o9234A01587n192m055b72218q8453H9450c11639J02300
15586b09339j68548b1828B20661F3002N9270a12596B22943E3091J14791c768p6827
15575h0595B73969h2190A52800a72076d769k0337j38934j81291H7139a95178h9628
15563A38168K23978c10813B37560a77236K4744D48707a4695C00935p8329I299
$$ y = [30115, -107401, 75554, -4187, 232924, 146325, -20280, -55975, 340418, 205396, -92473, -263160, -119598, 145864, -276762, -137248, 384648, 29624, -38710, -189652, 5426, -201043, 274101, -150680, -264904, 72570, 302146, -127908, 6510, -136379, 299994, -265361, -163720, -261452, 189670, 111022, -75747, 78279, 139493, 106668, 176130, 157823, 125037, -81126, -11830, 92535, -7251, -63342, -132576, 101587, 96395, 92340, -272218, -360671, 89450, -311639, -209339, -377887, -21828, 220661, 63002, 122272, -112596, 222943, 53091, 167882, -3768, -80595, 273969, -82190, 152800, -172076, -4769, -25106, -164040, -345331, 87139, -195178, -89628, 138168, 362146, -310813, 237560, -177236, -152492, 448707, -14695, 300935, 222606, 9299]
15552a00647L079D05051D6386Q1261c11188A39613C2318g638r6247p4154h3119
15540I50J76635K4278L3245c47560a3990j76162B06154a12997B37682A0461R3527
15529A03988a30539A50022J43345G0192b548j93922B81304F1030j2788J47956
15519A96198N5789i9513D53774A02452B3715L81336q6065L4816G4597P2386o1622
15508H5361a91382C26483A8218J99313O5386H6209K19406a35380B19917J6768
15498B36685I5369K65235A57635R411f2872P318E15760a26009B82322A12042B3339
15486I8661d5347A26833e678m3334A22900M121k9375d0121A03084J0288K03540
15475C16912J2434J17482K65199B22406Q1019h7606A65191a33126A86459g217
$$ y = [-100647, -97568, 405051, 46386, 127647, -311188, 139613, 32318, -7638, -103885, -178039, -83119, 950, 177585, 201863, 235108, -347560, -13990, -190152, 206154, -112997, 237682, 10461, 103988, -130539, 150022, 293367, 70192, -2548, -196470, 281304, 61030, 48242, 196198, 251987, -99513, 453774, 102452, 23715, 405051, 318986, 353802, 74597, 146983, 85361, -191382, 326483, 18218, 217531, 282917, 86209, 305615, -135380, 219917, 236685, 95369, 360604, 157635, 167046, -62872, -55554, 515760, -126009, 282322, 112042, 23339, 98661, -45347, 126833, -5678, -49012, 122900, 127021, 97646, -40121, 103084, 113372, 316912, 329346, 446828, 712027, 222406, 303425, -87606, 165191, -133126, 186459, -7217]
15464A17497I149L04558H3889h2225J1379k51638B45893q0069j5519e9945j37052
15453a96997N3363A06550R2375D4667a5580A31799A2684n960B408M99906j37419
15442C64895N45095K89083l23851r0153l24160Q0517I1177O427i697k73256H9425
15430a92562E33a50841j31085E8576P7445g2345A19439c35338g7331A63333a62315
15418A33357l9413O955b90855B09698a89059B95654j31598J06617b68033H3749
15407A51769Q4325c21462G1965j1963c9536p0890o2622e3905j03213B89335D9364
15395b21640B22b73320G8940a23904C24189a57063B08911M5250r378H8929A4310
15383A5635b31348j3553A5675b57558F9018R469b20432B82165Q729c669D03737
$$ y = [117497, 9149, 313707, 83889, -82225, -70846, -322484, 245893, 165824, 150305, -59945, -196997, -143634, 106550, 198925, 44667, -15580, 131799, 12684, 6724, 2408, 502314, 364895, 909990, 1199073, 875222, 785069, 460909, 541426, 91177, 97604, -9697, -282953, 89425, -192562, 533, -150841, -281926, 58576, 136021, -72345, 119439, -335338, -77331, 163333, -162315, 133357, 93944, 100899, -290855, 209698, -189059, 295654, 164056, 270673, -268033, 83749, 151769, 236094, -321462, 71965, 60002, -39536, -110426, -173048, -53905, -157118, 289335, 49364, -221640, 222, -273320, 78940, -123904, 324189, -157063, 208911, 254161, 244783, 88929, 14310, 15635, -231348, -244901, 15675, -257558, 69018, 78487, -220432, 282165, 290894, -3669, 403737]
15371A72434K75939A48928n8261C9243J68006E5855j6939J27381G1263J30837
15361B02100J59897G2906R6125j4640J40432h0395H4262b7213I8847g8283G9398
15349b7979k99082B89458B6788d3286H3879J67984R4152J8832M2184q9003l7908
15338B80120A19858J03265A08494l1190L20908B3558J91762J17388A17282B0020
15327e0825a9195c621D35577o0569A71713b16182B99866A35314E8619K9705M49552
15316E37876j66062a82059D0073J89802a73864F365a9419k65168C84895A66737
15305a06492D6868d4283k12674C4946J59821k6766C8142J634j7696J08834K4362
15294A55276A7016L70250a88769A97263p0809e2163o9981A17004J90446o8039
$$ y = [172434, 448373, 148928, 90667, 39243, 207249, 55855, 38916, 166297, 71263, 202100, 361997, 72906, 169031, 154391, 294823, -80395, 84262, -27213, 98847, -78283, 79398, -27979, -327061, 289458, 26788, -43286, 83879, 251863, 346015, 364847, 407031, 318028, 280120, 119858, 223123, 108494, 77304, 398212, 23558, 215320, 332708, 117282, 20020, -50825, -19195, -3621, 435577, 375008, 171713, -216182, 299866, 135314, 58619, 88324, 537876, 371814, -182059, 40073, 229875, -173864, 6365, -19419, -284587, 384895, 166737, -106492, 46868, -44283, -256957, 34946, 194767, 168001, 38142, 39776, 22080, 130914, 155276, 17016, 387266, -188769, 197263, 126454, -52163, -122144, 117004, 307450, 239411]
15284B39411j03005d6451j67483C4536J6849O6847B9313F194J15535m852N6567
15273A73444j9347e1096q2237C1940a46693K0639b5274B8782a7184j54764C2304
15261f7248G7142k9196b58431B75384j7022G8547M1622h1096A7551K48833j26660
15250A39724J44281q9083M0408F9724J4437L27791J96410Q86000q6188l21407
15240A086767P04172G30993l49030A03750A5472J19421j7549K32362A31361b20922
15229A73219a35225J5807A85987A4653J94164f4421I7997N6303a03111A73438
15218B89584K5474b67710A66593O5601r7847A1751M50580A29211l2100k6581O3452
15207A33982a53543P3610j3907B34827D6727K14674N9848D4025i4510D60112B6664
$$ y = [239411, 136406, -46451, -213934, 34536, 51385, 118232, 29313, 6194, 121729, 116877, 173444, 154097, -51096, -133333, 31940, -146693, -126054, -25274, 28782, -17184, -171948, 32304, -67248, 77142, 47946, -258431, 275384, 258362, 78547, 120169, -81096, 17551, 266384, 139724, 284005, 194922, 235330, 69724, 84161, 411952, 608362, 1494362, 1408174, 1086767, 1790939, 730993, 381963, 103750, 15472, 134893, 117344, 349706, 131361, -220922, 173219, -135225, -119418, 185987, 14653, 208817, -64421, 97997, 154300, -103111, 173438, 289584, 315058, -267710, 166593, 232194, 134347, 11751, 462331, 129211, 97111, 70530, 133982, -153543, -79933, -93840, 234827, 46727, 261401, 321249, 44025, -94510, 460112, 26664]
15195b1140m3006a0438A12813b33724B3080J32893d3796E57065F4086g4383m5527
15184a19910D51558e2662j8406j5531B6710h4727q8011d3164B02474q6824K00297
15173C15947j24217D8647K38308a97482A07543b02635f8168j44556B46950j00481
15163A46469n6395J01430L10027a78159A53412a93542B64732C2156K37397D0525
15152B59146a78636A04788D1046N3879j3253b10374m9094a07361J3826B81054
15141A62221K6096K5969O3016m5870E9188Q9675J65905Q3278j2839A89986l2393
15130A57593a96690C94348I2606L22893E781O2815K2492J44855K59846A74503
15119B83643J93286B30130N0887m4996G5258M15755A17703L2590b2594C50719
$$ y = [-21140, -64146, -10438, 112813, -233724, 23080, 155973, -43796, 557065, 64086, -74383, -119910, 451558, -52662, -71068, -86599, 26710, -84727, -172738, -43164, 202474, 115650, 315947, 191730, 48647, 286955, -197482, 107543, -202635, -68168, -212724, 246950, 146469, 90074, 191504, 501531, -178159, 153412, -193542, 264732, 32156, 269553, 40525, 259146, -178636, 104788, 41046, 94925, 81672, -210374, -259468, -107361, -93535, 281054, 162221, 188317, 214286, 277302, 231432, 59188, 148863, 314768, 398046, 385207, 189986, 157593, -196690, 394348, 92606, 415499, 5781, 68596, 91088, 235943, 495789, 174503, 283643, 476929, 230130, 281017, 236021, 75258, 491013, 117703, 150293, -22594, 350719]
15108H8178m1567J46832J9331J1953r1170B3310K14349n2145h5343k2875A62980
15096A10448c10015B98386c9954B08904Q397J03558a34539D32457n7430C3467
15085a61250C69197A69846d3872E1583L9487J04481J46716L0132A74817K193m7714
15074A29296B158J96308F279J51552K01386A53934C977D64b4840H7843L67729
15063D55572b8027D40590l8168E0871J18744a92362E92715I8685J67928a35795
15052b53827E9394J63038M3273A17508L74728j05278L9856j98347H66M44141J55981
15041F00988j95486A98242K66286J03264j90411H4594L36882A74837K01812n2896
15031C23753O3015J83791o8277M32484l45536r8870F5084K19276n2580L90545
$$ y = [88178, 46611, 193443, 212774, 224727, 133557, 23310, 237659, 185514, -85343, -108218, 162980, 110448, -310015, 298386, -39954, 208904, 217301, 320859, -134539, 432457, 375027, 33467, -161250, 369197, 169846, -43872, 51583, 91070, 195551, 342267, 372399, 174817, 177010, 129296, 2158, 198466, 6279, 157831, 359217, 153934, 3977, 464, -24840, 87843, 455572, -28027, 440590, 402422, 50871, 169615, -192362, 592715, 98685, 266613, -135795, -253827, 59394, 222432, 265705, 117508, 492236, 386958, 426814, 228467, 866, 445007, 600988, 405502, 198242, 464528, 567792, 377381, 84594, 421476, 174837, 376649, 323753, 386768, 570559, 502282, 934766, 589230, 490360, 65084, 284360, 231780, 622325]
15021F22325B20901K34745r4804O0205K14081A20500J88588J31434o4736j8743
15011C57043j59454P4066O6507j5288M7600J97127M9083k12112A49373F3505M68569
15000E32074k44842K81352k39561K01727k06770q6374k6316J93372D4594L39827
14990C84421M1793A88805K29348L59747k92209o4617k0440J46143O24036m06258
14980G64555j14495K50908D29096L26667C76740J06393j6888j90925K63030J88821
14970G27171k75725A78146L83927j95207K36392K19613C50722l9740D0898K52239
14960B93137K61610J17683H8187K52029Q6055f5609E38442k45938K97487k15774
14950C74217J94313k65768K67608j69825J10956L09159q2760J14580k43039j56297
$$ y = [622325, 220901, 455646, 360842, 421047, 635128, 120500, 309088, 440522, 375786, 357043, 197589, 271655, 338162, 322874, 370474, 567601, 616684, 404572, 149373, 63505, 532074, 287232, 568584, 329023, 530750, 323980, 237606, 211290, 404662, 44594, 384421, 426214, 188805, 418153, 777900, 485691, 421074, 400634, 546777, 1170813, 764555, 650060, 900968, 429096, 755763, 376740, 483133, 466245, 275320, 538350, 727171, 451446, 178146, 562073, 366866, 603258, 822871, 350722, 310982, 40898, 293137, 554747, 672430, 88187, 340216, 426271, -65609, 538442, 292504, 589991, 374217, 568530, 302762, 570370, 400545, 511501, 820660, 737900, 852480, 609441, 453144]
14940D53144L56290C46811N8884j1607j910n1223J89590m151q0046M11328j14104
14929G43572L70554Q6822j60530J37323O18638k07758m73249K30544J24100j28939
14919A341077J34792K81529M40024j3496n47974l00869j49030k63811j42151j39433
14909F40658J8610C19068R0552n2621L13676J35513l43807J17982k36304J61875
14899E05934L22421m09390j26823l743k5603M1956j18095J25913O1368N455J20660
14888E00053O8180K12812j52628J98882k18572M71061C44619L01316J0042K11900
14878H67877q7117j20450J5208K08460l56749j50673K59004k93836m7301K79922
14868E74345J49987Q7151N65L8268m04228L26124l20376k7215j42037P440L44844
$$ y = [453144, 809434, 346811, 405695, 394088, 392178, 340955, 530545, 526394, 446348, 857676, 743572, 1114126, 1200948, 1040418, 1177741, 1796379, 1588621, 1115372, 1345916, 1470016, 1341077, 1475869, 1757398, 2197422, 2183926, 1635952, 1335083, 1186053, 922242, 780091, 640658, 659268, 319068, 409620, 356999, 670675, 806188, 462381, 580363, 344059, 505934, 828355, 418965, 292142, 288399, 262796, 304752, 186657, 312570, 373938, 379393, 500053, 568233, 781045, 628417, 827299, 608727, 1079788, 344619, 645935, 655977, 867877, 780760, 660310, 675518, 883978, 527229, 376556, 635560, 341724, 294423, 574345, 724332, 811483, 812048, 850316, 446088, 772212, 451836, 424621, 282584, 290024, 634868]
14857F34868j50912r3024J81842o3403j22689J03917j57738J464K8896K46040
14847F09261j7285k88873K93538K30123J98502R0456J2423k22329L57047j17610
14837A145253E15929J80965l4788j74714K1658N6519j61277K17048J71740J14820
14827I07900q3104l02576K1014K14376k23679Q9534Q639j94827L70951l83575
14817D24653L94328N750l99784m9126K76659k8698P6283j45051j7870M50721l67007
14806F20858n6509K74648K97715n01835O389k74929N36281l77407R8185p3768
14796E49628j55588J21219o4546j55257M14354l47359L45509J0363l05317J3616
14786D26622n3126J38570K76099k81765o5473J84201P8787k977o7303K1434L58324
$$ y = [634868, 483956, 390932, 572774, 509371, 386682, 490599, 332861, 334325, 363221, 609261, 591976, 303103, 596641, 826764, 1025266, 1115722, 1128145, 905816, 1262863, 1145253, 515929, 696894, 662106, 487392, 509050, 565569, 404292, 621340, 793080, 907900, 824796, 522220, 543234, 757610, 533931, 623465, 632104, 437277, 808228, 424653, 818981, 824731, 424947, 375821, 652480, 623782, 700065, 555014, 537144, 987865, 620858, 564349, 838997, 1136712, 634877, 641266, 366337, 902618, 525211, 623396, 549628, 394040, 515259, 450713, 295456, 709810, 362451, 707960, 718323, 413006, 426622, 373496, 512066, 788165, 506400, 440927, 625128, 703915, 700938, 633635, 655069, 1013393]
14775A013393O3238k51133J13464r3705j48401J8956j83309K7700K30843k05282
14765E85764L7194j72142J85077M143j8901o5583J1337p1051J36799J90432l94961
14754D28108J65605k3158P9434n2313j64525J23600k7011K59004j03719J5438
14744G00463J78280k00840J49846j32430K9107j65686M59457j21330m938k13504
14734F78425L78724m37384J38544n4845N17540K2153Q5493K37721J48688j29270
14724A585789L72803q77413K31959m31640J87937J26023k78060p3131p1389J07591
14714H80469q1558j37692K73871r1623K51601D76133O70438m88310M52634k85164
14704H25731M92850m4168J31726P2347K49295k58512J39759m03155J8421j64918
$$ y = [1013393, 1076631, 825498, 938962, 845257, 696856, 715812, 532503, 560203, 791046, 585764, 622958, 450816, 635893, 640036, 621135, 555552, 566889, 495838, 632637, 823069, 428108, 593713, 570555, 649989, 597676, 433151, 556751, 529740, 788744, 685025, 700463, 878743, 677903, 827749, 695319, 724426, 558740, 1018197, 896867, 891929, 678425, 1057149, 619765, 758309, 703464, 1221004, 1243157, 1328650, 1566371, 1715059, 1585789, 1958592, 1081179, 1313138, 881498, 1069435, 1195458, 917398, 844267, 772878, 880469, 798911, 661219, 935090, 843467, 1095068, 476133, 1146571, 658261, 1110895, 825731, 1318581, 1274413, 1406139, 1478486, 1727781, 1469269, 1609028, 1205873, 1224294, 1059376]
14694A059376j15079M8723K0427J98070j09100r7055m9355n7050K12067k72276
14684H38748R2258l13401K96076j05711k51884L89291k80922J74497j00269J19406
14674H58089M18588r4666m21693J28134J49854k88967l4734J53166K4980J45143
14664A037894J2386J6084K4765r5890J51488o6857K7750n3262K3379J79208k06736
14653A050209J90755J01277L5337J53868n42095K90673k12945J40901M1906j47890
14643A101996L85910k00086o6218K1219k21101J26326K7395l2221j1816L1265
14633A162669J9372P7867J11705J04343q9921M4591o9670K13672j35183l34374
14623A105071K20448L3363k0841j18330L73319j75945j07762R9900l0520j20467
$$ y = [1059376, 944297, 993020, 1013447, 1211517, 1102417, 1005362, 956007, 898957, 1111024, 838748, 931006, 617605, 913681, 807970, 556086, 945377, 664455, 838952, 738683, 858089, 1276677, 1182011, 760318, 888452, 1038306, 749339, 714605, 867771, 892751, 1037894, 1050280, 1066364, 1091129, 995239, 1146727, 1079870, 1107620, 1054358, 1077737, 1256945, 1050209, 1240964, 1342241, 1377578, 1531446, 989351, 1280024, 1067079, 1207980, 1249886, 1101996, 1487906, 1287820, 1221602, 1242821, 1021720, 1148046, 1175441, 1143220, 1131404, 1162669, 1182041, 1259908, 1371613, 1475956, 1386035, 1430626, 1360956, 1574628, 1439445, 1105071, 1325519, 1358882, 1338041, 1219711, 1593030, 1417085, 1309323, 1409223, 1378703, 1258236]
14613A258236R6951K34740k74652k4483J34890l77112L11093l0842M65872j68488
14603A626205j32893Q9418O8526J14934k85736j2251O2227M1455j95614L66906
14593A743177l74526O4565K38306l01054J29310J28389k52846M82329l52641M40408
14583A945417k18661J54937k12562N0758p8493K13550q2359J84801j43967M943
14573A818364K95829k33166J60135j31833K47673o5988k30715M99396L0671j55886
14563B234480K02670j90540j56664K87471Q5016J88129k76789M85348M06132k91615
14553B973638M58137J24692P71057R13033J309791M155233R005929K1414421j2204
14544D1113727A7835445H086155D000949r12675K88134J768230j341591j323058
$$ y = [1258236, 1355187, 1589927, 1315275, 1290792, 1425682, 1048570, 1359663, 1328821, 1794693, 1626205, 1493312, 1582730, 1651256, 1766190, 1480454, 1468203, 1530430, 1571885, 1376271, 1743177, 1368651, 1433216, 1671522, 1370468, 1499778, 1628167, 1375321, 1857650, 1505009, 1945417, 1726756, 1881693, 1669131, 1719889, 1641396, 1854946, 1772587, 1957388, 1813421, 1818364, 2114193, 1881027, 2041162, 1909329, 2157002, 2091014, 1860299, 2359695, 2390366, 2234480, 2437150, 2246610, 2089946, 2377417, 2462433, 2650562, 2373773, 2859121, 3265253, 2973638, 3431775, 3556467, 4327524, 5240557, 6550348, 10705581, 19711510, 41125931, 41113727, 17835445, 8086155, 4000949, 3088274, 3376408, 5144638, 3803047, 2479989]
14536B479989m10873q8519k81063p4015N9961N69623l65987K07521k41721J34624
14526A989540K08954M3597J66262m9274j16691l09214M43599Q3666j10984m07127
14516A942328Q45621k58751k32634K08279L92271n57982K13469K27629j88389
14507B591841J30159j01893L59565m24287L83327K5526o0967J42885K89528l6256
14497C299428r1401R2984j83097k31051K5751K74331K15863q787j10951k47577
14487C035493M23476j78147M7442J75032j95728J86442Q885J32838r354K45431
14477C871810k13701K92439Q6678j00974l73544O36697n09843M24312j74162O2439
14467D002151J32215M7433m3576K31097K27464j64192j62645L90255j94618N9715
$$ y = [2479989, 2069116, 1980597, 1699534, 1625519, 1685480, 2255103, 1889116, 2096637, 1854916, 1989540, 2198494, 2242091, 2408353, 2359079, 2242388, 1933174, 2376773, 2460439, 2349455, 1942328, 2787949, 2529198, 2296564, 2504843, 2897114, 2339132, 2552601, 2780230, 2591841, 2722000, 2620107, 2979672, 2555385, 2938712, 2964238, 2903271, 3046156, 3335684, 3299428, 3208027, 3301011, 3117914, 2886863, 2912614, 3186945, 3402808, 3394021, 3283070, 3035493, 3458969, 3280822, 3328264, 3503296, 3307568, 3494010, 3502895, 3635733, 3626379, 3871810, 3658109, 3950548, 4037226, 3936252, 3562708, 4199405, 3689562, 4113874, 3939712, 4002151, 4134366, 4181799, 4138223, 4369320, 4596784, 4432592, 4269947, 4660202, 4465584, 4525299]
14457D525299J97231J43744j24158R2869J02438j73758K39891K21469k36731L58068
14447E346362M6022o9832j30018o8693L79907l1864l4854J10421K37568R9000
14437E884019N6207n1383L53701J19606J10170m8084n4070k5204Q0705M40719
14427F866386n24309O35039j65830K51932K08957L19577P632l5538M28400l59771
14417G632475J31678p9138N41205K0698j90386K27216m980L25799K47867j42934
14407H709500R2406L82054K27612k3044L14876j65831M12820l51613L32865M04210
14397A0335855k4201m1784M13132J51345K10261r1219K05110L97285K57034L25602
14387A2138420L03459J53530K85969J16294j44858P80241l1408N13490J02264
$$ y = [4525299, 4722530, 4866274, 4742116, 4834985, 4937423, 4763665, 5003556, 5225025, 4988294, 5346362, 5392384, 5322552, 5192534, 5123841, 5503748, 5471884, 5437030, 5547451, 5785019, 5884019, 5940226, 5888843, 6242544, 6362150, 6472320, 6424236, 6370166, 6344962, 6425667, 6866386, 6342077, 6977116, 6811286, 7063218, 7272175, 7591752, 7599384, 7563846, 7992246, 7632475, 7764153, 7685015, 8226220, 8246918, 8056532, 8283748, 8278768, 8604567, 8852434, 8709500, 8801906, 9183960, 9411572, 9388528, 9703404, 9537573, 9950393, 9598780, 9931645, 10335855, 10311654, 10269870, 10683002, 10834347, 11044608, 10953389, 11158499, 11555784, 11812818, 12138420, 12441879, 12595409, 12881378, 12997672, 12852814, 13633055, 13601647, 14115137, 14217401]
14378A4217401P8824K6645M21553J80484K60931K54032L53637M89444L28697P21687
14368A7333335K32192L01553J94136O32059L13394n5335N27894N06064M42075
14359B0427367N52837L36658K99025M06576O48669L45428N14875R65881M85113
14350B4982429O75513L46798J010508L10246M46955R84183J123879M75889O58396
14341C1014796P63217J249333N28675R59016R72052J499179P27517J357437J188893
14332D0260115O40420J582368J108046J934249J522853J196716J366086J902336
14324E1513189J867050J732819K025471J722072K295707K182048K045644K580265
14316F7964265K590146J980869L280805K737445L398705L473353L572351L263588
$$ y = [14217401, 14296225, 14322870, 14744423, 14924907, 15185838, 15439870, 15793507, 16282951, 16611648, 17333335, 17565527, 17867080, 18061216, 18693275, 19006669, 18951334, 19479228, 19985292, 20427367, 20980204, 21316862, 21615887, 22022463, 22671132, 23016560, 23531435, 24497316, 24982429, 25657942, 26004740, 27015248, 27325494, 27772449, 28756632, 29880511, 30356400, 31014796, 31778013, 33027346, 33556021, 34515037, 35487089, 36986268, 37713785, 39071222, 40260115, 40900535, 42482903, 43590949, 45525198, 47048051, 48244767, 49610853, 51513189, 53380239, 55113058, 57138529, 58860601, 61156308, 63338356, 65384000, 67964265, 70554411, 72535280, 75816085, 78553530, 81952235, 85425588, 88997939, 92261527]
14308I2261527M115359M262774M641355M629662M908275N534220N289457O073613
14300A31716242O332175O611810P276198P519410Q074181Q261986R059272R903465
14292A94754739J0049303J0635103J1253378J1857470J2606168J3008111J3559251
14285B77723523J4031132J4518408J4537115J4778813J4936896J4743146J4256759
14278C79525792J4088499J3086088J2159177J0941971R014815O678140K687862
14271D48182344L53939j96720k435659m420293l303718m352854p815699j0315409
14263D15695931j1922815j3434944j4522808j5076018j5475216j5436633j5314432
14256C14513065j4967626j4516809j4516556j3363178j3284621j2503603j1611333
$$ y = [92261527, 96376886, 100639660, 105281015, 109910677, 114818952, 120353172, 125642629, 131716242, 138048417, 144660227, 151936425, 159455835, 167530016, 175792002, 184851274, 194754739, 204804042, 215439145, 226692523, 238549993, 251156161, 264164272, 277723523, 291754655, 306273063, 320810178, 335588991, 350525887, 365269033, 379525792, 393614291, 406700379, 418859556, 429801527, 438816342, 445494482, 448182344, 448536283, 448339563, 445903904, 441483611, 438179893, 433827039, 426011340, 415695931, 403773116, 390338172, 375815364, 360739346, 345264130, 329827497, 314513065, 299545439, 285028630, 270512074, 257148896, 243864275, 231360672, 219749339]
14249B19749339r651123j0842308j0351324r267467q929793p856590p972183p289799
14241A47588752p208417o213522o512424n043753n615142n270804m969855m563525
14233A02191310m277590l729668l606520l662829l904816l042794l497039k638403
14225G3831651k819699k484458k611140k299201k129833j887400j915766k070675
14217E5613479k303944j619608j723310j324441r64090k055207j276074j704805
14209D2642000j164317j005279l10124j319653j343636j386827r16906p26015
14201C4469243j065820n80776j025930j351401m86107n98571m65305p21371o06501
14192B7567461o87594r05821p56605m12789o51933o57370m32064l85413o89487
$$ y = [219749339, 210098216, 199255908, 188904584, 179637117, 170707324, 162850734, 154878551, 147588752, 140380335, 134166813, 127654389, 122610636, 116995494, 111724690, 106754835, 102191310, 97913720, 94184052, 90577532, 86914703, 83009887, 79967093, 76470054, 73831651, 71011952, 68527494, 65916354, 63617153, 61487320, 59599920, 57684154, 55613479, 53309535, 51689927, 49966617, 48642176, 47678086, 45622879, 44346805, 42642000, 41477683, 40472404, 40162280, 38842627, 37498991, 36112164, 35195258, 34469243, 33403423, 32822647, 31796717, 30445316, 29959209, 29360638, 28895333, 28173962, 27567461, 26879867, 25974046, 25217441, 24804652, 24152719, 23495349, 23063285, 22677872, 21988385]
14183B1988385m23338l51197m11021j021801P4230o27379j87384n93775l54967
14174A8091753k81051l39882j45083m83416l58291l93294k20108n48554K0283
14165A5342357l61353o46798P375N0608o2682q20667k53068j86057k84469m78314
14155A2306932L24783k04492k26259m21012j2688q2632k52907l87729l40609r0279
14145A0613108k23531l0087j00524l66696J14253k54909m4579k07545k11281K29027
14135I517236n95427Q4797k7632k29083l38899q6055q4127J62773j20805n77362
14125G705416j24783L15656k19233j39968P409L24965p04131J08390k17086Q151
14115G064786m37672l7776K66902k28418J37656R288k20861j71479n2497k36967
$$ y = [21988385, 21565047, 21213850, 20802829, 19781028, 19855258, 19227879, 19040495, 18446720, 18091753, 17810702, 17470820, 17325737, 16842321, 16484030, 16090736, 15870628, 15322074, 15342357, 14981004, 14334206, 14341581, 14392189, 14329507, 13508840, 13255772, 13069715, 12785246, 12306932, 12631715, 12427223, 12200964, 11779952, 11767264, 11684632, 11431725, 11043996, 10703387, 10613108, 10389577, 10359490, 10258966, 9892270, 10006523, 9751614, 9707035, 9499490, 9288209, 9517236, 8921809, 9006606, 8978974, 8749891, 8410992, 8324937, 8240810, 8403583, 8282778, 7705416, 7580633, 7896289, 7677056, 7537088, 7544497, 7869462, 7165331, 7273721, 7056635, 7064786, 6627114, 6589338, 6856240, 6627822, 6765478, 6774766, 6553905, 6382426, 6329929, 6092962]
14105F092962L13483l95374j69337j54840q207K58099l01171o0942j44735J10822
14095E540760J11464j28429j37143r4299k64700J01584l8233l05153K67855l62989
14085D690717J49830j19134J55005q5088m8586L6820r9987p7575l95874M26588
14075D632716k94489l94819j0354K61364n05260M63604j55241L33017m08702O3455
14065C985291l58139M82338l66359J28906J29602m17625r0168P6566j44185L60629
14055C786856l99621N87412n25293l31701J70296j8644j93932Q0126l8810K91781
14045C408470k61091l2935L42496m52082K86157k33380J69472l81585L67907l04644
14035B908785k24184M4032Q9912L51328l12462K39344k07874j49350J30468k29619
$$ y = [6092962, 6406445, 6011071, 5841734, 5686894, 5678687, 5936786, 5635615, 5574673, 5429938, 5540760, 5652224, 5523795, 5386652, 5292353, 5027653, 5129237, 5091004, 4785851, 5053706, 4690717, 4840547, 4721413, 4876418, 4791330, 4742744, 4779564, 4679577, 4602002, 4206128, 4632716, 4338227, 3943408, 3933054, 4194418, 3689158, 4152762, 3997521, 4330538, 3921836, 3985291, 3627152, 4109490, 3743131, 3872037, 4001639, 3584014, 3493846, 3570412, 3426227, 3786856, 3387235, 3974647, 3449354, 3117653, 3287949, 3269305, 3075373, 3155499, 3116689, 3408470, 3147379, 3114444, 3456940, 3004858, 3291015, 3057635, 3227107, 2845522, 3213429, 2908785, 2684601, 2728633, 2818545, 3169873, 2857411, 3096755, 2888881, 2739531, 2869999, 2640380]
14025B640380J3679Q0158k07298J62453j3556k54510j2278J96547k82088L86343
14015B709830n83891J59492k5356J66710J0595o2290J36413q8617j32907r2563
14005B197416O2175O9082m39057L77763J3016m57647J32741L6157K3781j04743
13995A910684J89780k0058j82013R8740L3862J98676P24548K398095O564555J8876365
13985C0793234J5416457k0092561j2279854n816857k444190j013503o36122n07956
13977C418648l17376l3828j69240k84169n0809j34313J09372j48555j63709J09919
13967B335940J32536k68877k7004m1699L6144j19848k25625L15991K85350j26828
13957B296080n54792j53763J70143l0365m2291J78500M2456j90113J22010n8611
$$ y = [2640380, 2654059, 2734217, 2526919, 2689372, 2675816, 2421306, 2409028, 2605575, 2323487, 2709830, 2125939, 2285431, 2260075, 2426785, 2437380, 2375090, 2511503, 2422886, 2289979, 2197416, 2259591, 2328673, 1889616, 2267379, 2280395, 1822748, 1955489, 1991646, 2015427, 1910684, 2100464, 2080406, 1898393, 1997133, 2030995, 2229671, 2954219, 5352314, 11916869, 30793234, 46209691, 26117130, 13837276, 8020419, 5576229, 4562726, 3926604, 3418648, 3101272, 3067444, 2898204, 2614035, 2563226, 2428913, 2538285, 2389730, 2226021, 2335940, 2468476, 2199599, 2172595, 2130896, 2167040, 2047192, 1821567, 2137558, 2422908, 2296080, 1741288, 1587525, 1757668, 1727303, 1685012, 1863512, 1905968, 1715855, 1837865, 1779254]
13947A779254p630J38591n08973K71217j66932N56215j40503k95358M4748M8589
13937A719218q3160J21279j92013R6589j82173L41466m19875K09055m4439J63800
13927A729747k12184K07398k68177M1315j84985K27530k32874J14347n3627n7373
13917A311117K061K58207m58863r6339O59453m28406K54748m21900j00900M55056
13907A434234q6456l19795M49811o65j49856k3306j30612L18244l43708R7867
13897A245758q6193J14944J16188o5399J58729m49296J29260k42690J91590k46351
13887H66540k3153M16078P3810k38304J78759n05831M03041j57116K5091J85110
13877A224025k07934K96589J40538l60503P0912l32069K24156Q9380O9843J7056
$$ y = [1779254, 1771624, 1910215, 1401242, 1672459, 1505527, 2061742, 1921239, 1625881, 1670629, 1719218, 1636058, 1757337, 1565324, 1661913, 1479740, 1821206, 1401331, 1610386, 1565947, 1729747, 1517563, 1724961, 1456784, 1498099, 1313114, 1540644, 1307770, 1422117, 1368490, 1311117, 1313178, 1571385, 1112522, 1016183, 1675636, 1247230, 1501978, 1080078, 979178, 1434234, 1347778, 1027983, 1477794, 1477129, 1327273, 1303967, 1173355, 1491599, 1147891, 1245758, 1159565, 1274509, 1390697, 1325298, 1484027, 1034731, 1163991, 921301, 1112891, 866540, 843387, 1259465, 1333275, 1094971, 1273730, 767899, 1170940, 1013824, 1038915, 1224025, 1016091, 1312680, 1453218, 1092715, 1163627, 831558, 1055714, 1145094, 1214937, 1231993]
13867A231993N3975E67942M93249n0283n6726p6529K90558J03189j2361m30254
13857H28785j16808K8568J90071r7395J87636r8455K89152E70719N79784k44274
13847I06229q5917L72834l06889L18212l91548K58879m21129J78285M6698R3826
13837I69480P6592p8166l5031J35739l15281l5242Q7437L22989k25188K20614
13827A123943r7487R5430m96882L66013q6920R654k65105K03047k6995l9619j190
13816G83889q6119j13088M5704J57715M3513L79546n40188m2178J91806k18716
13806F01884K53942k86998K76265L45459D98631L57262k17661L36141D55381K0061
13796D75442J55914O7828L43817l36697j88344j6567K02209l0792K72056l64668
$$ y = [1231993, 1285968, 567942, 1061191, 1010908, 954182, 877653, 1168211, 1271400, 1259039, 828785, 711977, 740545, 930616, 833221, 1020857, 922402, 1211554, 570719, 1150503, 906229, 820312, 1193146, 886257, 1204469, 812921, 1071800, 650671, 828956, 875654, 969480, 1046072, 967906, 932875, 1068614, 753333, 718091, 805528, 1128517, 903329, 1123943, 1026456, 1121886, 625004, 991017, 904097, 913751, 648646, 851693, 824698, 785079, 783889, 697770, 584682, 630386, 788101, 831614, 1211160, 670972, 628794, 820600, 601884, 855826, 568828, 845093, 1190552, 498631, 855893, 638232, 974373, 455381, 475442, 631356, 699184, 1043001, 706304, 517960, 501393, 703602, 672810, 944866, 580198]
13786E80198J82855j24791K76925k43160J59070j05273Q943m2669r8867J0904
13776F04135L9358k20882K98984k02948O9456K27046O4832k60127L13796j88861
13766G44789j88233J01590j66378l9930K44619K1454j73927j92073J67309P2331
13756E91551J43353J34832B47297L41605l0215k36610L17852J88642J82154m34220
13746E76505J11254B08094K70059J67347K41166j30055j88540j2179J95167L14822
13736A065881C27561L72123k88483R6715J93667k8889j7910J78746k83237j35128
13726D15165L03879j93848j06671A98037O63938k17512o6889O6010j43780j2998
13716D86806K29347j31617j08361N2505N8988n063K69949D15608L18208C31536
$$ y = [580198, 763053, 638262, 915187, 672027, 831097, 725824, 734767, 692098, 593231, 604135, 643493, 422611, 721595, 518647, 588103, 815149, 879981, 619854, 933650, 744789, 556556, 658146, 491768, 451838, 696457, 717911, 543984, 351911, 519220, 591551, 734904, 869736, 247297, 588902, 558687, 322077, 639929, 828571, 1010725, 576505, 687759, 208094, 478153, 645500, 886666, 756611, 568071, 555892, 751059, 1065881, 327561, 699684, 411201, 507916, 701583, 672694, 654784, 833530, 550293, 415165, 719044, 525196, 418525, 198037, 861975, 644463, 577574, 643584, 499804, 486806, 716153, 584536, 476175, 528680, 587668, 582605, 852554, 415608, 733816, 331536]
13705F49167O24l11716J90011A89260J13423K52008k14380j8571K28361J89894
13695G39995B32873J86392q1826K59890k56146n6539K11463j28126K99521k75891
13685C91611J15047K2093o8212L29582l14104Q9405r413j31437O8205B25285K05382
13674D30667k2592R8643J01371l4845j57782o2319a8339D21173J06178j24910
13664D02441k7782r3080L2380J8239L5120o7589p4637K5587K80482K04775B28150
13652E96638k1756B54871K5532Q2466O269j06264K46964k00597J98882k27661
13642B80462K2309P457K21765k58367L85324A83575J49044K63648O8300A66571
13631F41865j29102A82858H282Q05960r0359B17897H3259J39884K30317O2910
$$ y = [649167, 649791, 338075, 528086, 189260, 302683, 554691, 340311, 321740, 550101, 739995, 232873, 419265, 337439, 597329, 341183, 284644, 496107, 367981, 667502, 391611, 506658, 528751, 460539, 790121, 476017, 565422, 556009, 424572, 492777, 225285, 430667, 408075, 506718, 608089, 573244, 415462, 353143, -18339, 421173, 527351, 402441, 374659, 281579, 313959, 332198, 367318, 299729, 225092, 250679, 531161, 735936, 228150, 596638, 574882, 254871, 280403, 362869, 369138, 262874, 509838, 309241, 508123, 280462, 302771, 310228, 531993, 273626, 658950, 183575, 332619, 596267, 664567, 166571, 641865, 512763, 182858, 8282, 814242, 723883, 217897, 83259, 223143, 453460, 516370]
13621E16370k14142M6144j21307K29902J99750A51750J61510l58p5599j12994
13611A24309J25047J19099M3245j36087M4026B2877K64756M6936P583N3213R1620
13600D86985A69359p8625K85968A52893D0267K17433L52730A81731j7200K550
13590A67081L06449j46211O0579m5675J27370L3259L3556B64426N326J76816R6676
13579E43244j93982A41626J79520q9330K74138A72009J40642A32003M08209G1778
13568B93568K97014B45428K91125j54116J40424B30190M7401a74272B73582f8361
13557e327A55190k7363M11555A32941Q2954J50251p5156N6866n40K9346R875A27292
13544B81852J68465j31784E6625M22702B28166L59224j80400k7618n3536C4799
$$ y = [516370, 302228, 348372, 227065, 456967, 656717, 151750, 313260, 312902, 237303, 124309, 249356, 368455, 411700, 275613, 319639, 22877, 287633, 334569, 342152, 395365, 486985, 169359, 90734, 376702, 152893, 40267, 257700, 610430, 181731, 164531, 167081, 473530, 327319, 387898, 342223, 469593, 502852, 536408, 264426, 269752, 446568, 543244, 349262, 141626, 321146, 231816, 505954, 172009, 312651, 132003, 540212, 71778, 293568, 590582, 245428, 536553, 382437, 522861, 230190, 277591, -174272, 273582, -68361, -5327, 155190, 127827, 539382, 132941, 215895, 366146, 290990, 347856, 347316, 376662, 386537, 127292, 281852, 450317, 318533, 56625, 479327, 228166, 587390, 406990, 379372, 325836, 34799]
13533D85653m9806b07216A1197J24553K7171K11516r7028j09450M19315r3465
13523D93809a10412A48620F8033B7815L06103G9004K83532q9137a5296B54356
13512B35623J69322A15524K35413J41563J665j91187b4247D74164B17243p8584
13502A38659K98778j95150L07448g530A77090e5349A76511n095b5541B41462P7516
13491C18978i4451B22192J88001G0154O9533J59579I7256L63656j51161J14995
13481D24746B09502a35322B40817L62611A17965J6087K06123B7315b0620G5363
13470E9920J93185n1591a79908B98764A29414J58411o8717l2682G8420K32468
13460C10888A48704D8799J86725h113B34954j11242Q5720b9862C08014j15343
$$ y = [485653, 435847, -207216, 11197, 135750, 162921, 374437, 277409, 167959, 587274, 493809, -110412, 148620, 68033, 27815, 333918, 79004, 362536, 273399, -15296, 254356, 235623, 404945, 115524, 350937, 492500, 494165, 302978, -24247, 474164, 217243, 138659, 437437, 242287, 549735, -7530, 177090, -55349, 176511, 171416, -25541, 241462, 318978, -94451, 222192, 410193, 70154, 139687, 299266, 97256, 460912, 309751, 424746, 209502, -135322, 240817, 603428, 117965, 134052, 340175, 27315, -20620, 75363, 59920, 253105, 201514, -179908, 298764, 129414, 287825, 219108, 186426, 78420, 310888, 148704, 48799, 235524, -8113, 234954, 123712, 209432, -29862, 308014, 192671]
13450A92671G633J33869E4776J25526L5895J38617A21788k7918J75429m3081L8373
13439B64591D0167O0551M94701B85191D9368K78654m7917A35017J91135F3199
13428D19444O2331G7478K66147j28259o2902R692K32247o9698e8034C22653b55144
13416A65108J91207h9230H6623N595j0079L47386A24843J8203A4764a3860B71274
13404C18900r5227j1564e6401R689H2245L12889A41299o0965g1070B47177b5203
13392G8052O0142n96J41641O0365C0831a1935A4282J20175P4651m0470k181M6743
13380B13200Q318O1074D880J87398o1832J58137K05014B34371M8066a45088A35169
13368A44559j4389J00046K14236j27822A41409o610L78638j50131g2658H1575
$$ y = [192671, 7633, 141502, 54776, 180302, 216197, 354814, 121788, 93870, 269299, 226218, 264591, 40167, 100718, 595419, 285191, 49368, 328022, 280105, 135017, 326152, 63199, 419444, 481775, 77478, 343625, 215366, 152464, 162156, 394403, 324705, -58034, 322653, -255144, 165108, 356315, -89230, 86623, 92218, 82139, 429525, 124843, 143046, 14764, -13860, 271274, 318900, 223673, 212109, -56401, -46712, 82245, 395134, 141299, 80334, -71070, 247177, -25203, 78052, 138194, 137598, 279239, 339604, 30831, -11935, 14282, 134457, 209108, 168638, 166457, 213200, 221518, 282592, 4880, 192278, 130446, 288583, 493597, 234371, 282437, -145088, 135169, 144559, 130170, 230216, 444452, 316630, 141409, 134799, 513437, 363306, -72658, 81575]
13357A89760n820a13231p7401C70690a73926A25838J2902F1036M12135P8611k67217
13346B84565a93691A32059B8361K92722J20685J10420I1957K0332h0589D20026
13335A56580p3152J98429j14949k1802K3839K614L2141M1940A12483J05095n9291
13324A58287R4998G8981R9348j4576L1421k8245O1485j9705N749F9177a63494
13312C57786j54276E6999J06863C0880a14262A28452P389o0975B1402M44561c832
13300F27970A32107a53389n0851A06028i5262B80588a15689B24290p1105j7178
13290A36007o6272P1222E978K03310n9783p4321a2669n1661E8372J51233N1812
13279B61417A02463b96270a42795B72384a5067q8369A29735A2785J30969J08023
$$ y = [189760, 183940, -113231, -190632, 370690, -173926, 125838, 138740, 61036, 473171, 551782, 284565, -193691, 132059, 28361, 321083, 441768, 552188, 91957, 112289, -80589, 420026, 156580, 83428, 281857, 166908, 145106, 168945, 171559, 203700, 245640, 112483, 217578, 158287, 253285, 78981, 178329, 163753, 195174, 166929, 228414, 208709, 214458, 69177, -163494, 357786, 203510, 56999, 163862, 30880, -114262, 128452, 135841, 74866, 21402, 465963, -3832, 627970, 132107, -153389, -204240, 106028, -95262, 280588, -115689, 224290, 153185, 136007, 69735, 140957, 5978, 209288, 149505, 75184, -12669, -64330, 58372, 209605, 261417, 102463, -296270, -142795, 272384, -15067, -103436, 129735, 12785, 143754, 251777]
13269B51777J38239D5415a12462B72056b43888b0884G9466b06250j8032l43068
13259e67350A03374P2800F1738K04087j09121e3694B56710G3060E52i945A86909
13247B63543B2831J51603k3648a22971q4828I1884j8321a46682O9817B74914A29037
13235e046A72326g0250C29058F2056a36036q1259M564H1632i6988B08273D6879
13223A7562K1902K29750J58308j91077I6410J8855J7908a48550B63091a37296
13212B84090A11760g4579A34638b54369C91098a05024B94299a48385A65602m5694
13202A19908J6506A8369b0484A23369K41690b4070A82902o4840d20838B4016c1523
13190B73887a54865q4538A20521E8314m772c4339A93624b63032B55791A7966N8515
$$ y = [251777, 390016, 45415, -112462, 272056, -243888, -20884, 79466, -206250, -224282, -567350, 103374, 176174, 61738, 265825, 156704, -53694, 256710, 73060, 552, -9945, 186909, 263543, 22831, 174434, 150786, -122971, -207799, 91884, 73563, -146682, -76865, 274914, 129037, -5046, 172326, -70250, 329058, 62056, -136036, -217295, -212731, 81632, -96988, 208273, 46879, 17562, 39464, 269214, 427522, 236445, 96410, 115265, 133173, -148550, 263091, -137296, 284090, 111760, -74579, 134638, -254369, 391098, -105024, 294299, -148385, 165602, 119908, 136414, 18369, -20484, 123369, 365059, -24070, 182902, 118062, -420838, 24016, -31523, 273887, -154865, -239403, 120521, 58314, 53542, -34339, 193624, -263032, 255791, 17966, 76481]
13179G6481a02438C4176d4464r3516D4863K10056J8151o2537r0148K38044C0880
13167A94631q6704J65778a26576H9579J0953l2682r405b40660E4926J91129I4458
13155A67146p6154L58916c24669c5496o404j422B35592k4436g9700J6656a9656
13143e5529n5649A9217J51600m1502E277c39610C12214j06755d7134E9236J0224
13132F9460I166K37694I9364C3239J98148p4158e8755A43568K4163L5360L59387
13121E62478F163J30566b97512B1584J7202L3746a9602B459M2058K33374Q3945
13110C61836g2044C06624b19469c190j88507A9746J09517M4507h5883j2234A22711
13098A16747L2896J25179A01862k9304g3412j7949H1384i3246B56238c45027B88777
$$ y = [76481, -102438, 34176, -44464, -137980, 44863, 254919, 273070, 210533, 120385, 358429, 30880, 194631, 107927, 273705, -126576, 89579, 100532, 67850, 58445, -240660, 54926, 246055, 94458, 167146, 90992, 449908, -324669, -35496, -41900, -43322, 235592, 211156, -79700, -63044, -19656, -55529, -111178, 19217, 170817, 129315, 5277, -339610, 312214, 205459, -47134, 59236, 69460, 9166, 246860, 99364, 33239, 231387, 157229, -58755, 143568, 167731, 203091, 562478, 6163, 136729, -297512, 21584, 38786, 72532, -19602, 2459, 44517, 277891, 361836, -72044, 306624, -219469, -3190, -191697, 19746, 129263, 173770, -85883, -98117, 122711, 116747, 149643, 274822, 101862, 72558, -73412, -91361, 81384, -93246, 256238, -345027, 288777]
13086c29688G1683K7584a55167q9194I0909m3548A3345m337a0978F123K19769
13075B25892o9742b2093D0138J27492m6223a69336E0009f6745A85510g0382B72689
13063a32549G2301J12831o0333K14628A8535L6398K97801F3972J63691a27415
13052g1878B32684h7833E6241J79956d5677E1729J14659a8279B55872b19338A8816
13040b324A87099m3151L9489J31739C0636a96966B05332J85767a16412e1893C5723
13028B41932E1839c1114k28269g5090j9699B26564j9633e0839m3974B81939f4196
13016B15348j4354G8769J8147g4417b3448B30502H2049H513L9232K31433l6663
13005B42515a49007A73516G4070g4619B49583j8870n2833C4873L6543l1387b66233
$$ y = [-329688, 71683, 99267, -155167, -244361, 90909, 47361, 13345, 9008, -10978, 6123, 225892, 156150, -22093, 40138, 167630, 121407, -169336, 50009, -66745, 185510, -70382, 272689, -132549, 72301, 185132, 124799, 339427, 18535, 54933, 352734, 63972, 227663, -127415, -71878, 232684, -87833, 56241, 236197, -45677, 51729, 166388, -18279, 255872, -219338, 18816, -2324, 187099, 143948, 183437, 315176, 30636, -196966, 205332, 391099, -116412, -51893, 35723, 241932, 51839, -31114, -259383, -75090, -94789, 226564, 206931, -50839, -94813, 281939, -64196, 215348, 200994, 78769, 96916, -74417, -23448, 230502, 82049, 8513, 47745, 279178, 242515, -149007, 173516, 74070, -74619, 249583, 230713, 177880, 34873, 71416, 40029, -266233]
12993a80769j3936o0550B30150a8655p9607A92058H2668j2078P5550C7187M3224
12982H0411a61554A05336L5690a34154b4610B38317L9101b68854o5171A52736
12971b53988J16951A77145E9644q028P5394N4338E8466J70473a02136n1838P739
12960a46235J8946A94630O092H0910a65316P8332B20637a61370D4555b33683A6215
12948a04949A21595D1998A5187K13443A0951a25085C14614A6011R9656a19255
12937F923K28054C8544b99963E6934K6440k211a09521H9511J1361L4225m4001
12926I1096a52769a9049B07659m5315G5978K37740g9436j43647A10263M7021J26419
12915B83703a13810k198A39125a34222A12521g0832D808J71363i4060A42969o902
$$ y = [-180769, -194705, -255255, 230150, -18655, -98262, 192058, 82668, 70590, 146140, 37187, 80411, -161554, 105336, 141026, -134154, -24610, 238317, 277418, -268854, -334025, 152736, -253988, -137037, 177145, 59644, 51616, 127010, 181348, 58466, 228939, -102136, -153974, -146235, -127289, 194630, 200722, 80910, -165316, -86984, 220637, -161370, 44555, -233683, 16215, -104949, 121595, 41998, 15187, 228630, 10951, -125085, 314614, 16011, 115667, -119255, 6923, 234977, 38544, -299963, 56934, 83374, 81163, -109521, 89511, 100872, 135097, 91096, -152769, -19049, 207659, 162344, 75978, 313718, -79436, -223083, 110263, 157284, 283703, -113810, -116008, 139125, -134222, 112521, -70832, 4808, 176171, -94060, 142969, 136067]
12904A36067d0303j33852b1199B21406d4556A08523L06467b24650A23087a26137
12893c42932a17223B6448a78867N5489G1620A5661c1247m3634n0834j22698A03488
12881b0036k6831H8007b88525I0325a40793C5772i1728A60252a42616L1455l927
12870a15088k8492B8251J19095k4809D4950j7068L27915h4045k01830A56417i5249
12858D4920a46107G3121a69845A62568e0337A62737A3088a47411I7146J02574
12848A99720g1315r3130a4898k06532R1770O087K1364d2074j46973G0570a64714
12836C3250L3775P2195K0819M3837J19333a02921k08743B75594G4504B9799a6759
12824h4582E679a69249c8012a6821A23517a45403L5542B7980h8708j18252L1821
$$ y = [136067, -40303, -174155, -21199, 221406, -44556, 108523, 414990, -224650, 123087, -126137, -342932, -117223, 26448, -178867, -123378, 71620, 15661, -31247, -74881, -125715, -248413, 103488, -20036, -46867, 88007, -288525, 90325, -140793, 35772, -91728, 160252, -142616, -111161, -115088, -143580, 28251, 147346, 122537, 44950, 27882, 355797, -84045, -285875, 156417, -95249, 44920, -146107, 73121, -169845, 162568, -50337, 162737, 13088, -147411, 97146, 199720, -71315, -164445, -14898, -221430, -129660, -123573, -102209, -42074, -189047, 70570, -164714, 33250, 67025, 139220, 160039, 203876, 323209, -102921, -311664, 275594, 74504, 29799, -16759, -84582, 5679, -169249, -38012, -16821, 123517, -145403, -109861, 27980, -88708, -206960, -175139]
12813a75139A7476K34831a11825m6758C603b87496b3008A94790G4771P7180b10227
12801A92996p7905c16068I5068A1369J24486b41370A54241k7131c57491B0506
12790f2546p2578B02303D5704a42210A15232b20108P0913B2525P2650c17253B49144
12778A13140N9145l2305a71461c3014j18072L8125b0634A10098i6958A157d4640
12766C016a96507L9656j06256F1578a75360h0716C10573D6517c41713A7972a28313
12754b04190C06291H5780c65081R8280A6891K4470J42513h4887B16377E1164L93362
12743D44526A60660k0812L7447E9575f7427l2040G5661K11351A37866O3331P8342
12732B79539e6670A46146L6116D876L05801c9749F1519b15446A40030j2133M7571
$$ y = [-175139, 17476, 252307, -111825, -158583, 3603, -287496, -23008, 194790, 74771, 151951, -210227, 192996, 115091, -316068, 95068, 11369, 135855, -241370, 154241, 127110, -357491, 20506, -62546, -135124, 202303, 45704, -142210, 115232, -220108, -149195, 22525, 95175, -317253, 249144, 113140, 172285, 139980, -171461, -33014, -151086, -112961, -20634, 110098, -96958, 1157, -44640, 3016, -196507, -156851, -263107, 61578, -175360, -80716, 310573, 46517, -341713, 17972, -128313, -204190, 306291, 85780, -365081, -266801, 16891, 41361, 183874, -84887, 216377, 51164, 444526, 160660, 139848, 177295, 59575, -67427, -99467, 75661, 287012, 137866, 201197, 279539, -56670, 146146, 182262, 4876, 310677, -39749, 61519, -215446, 140030, 127897, 175468]
12721A75468h4364A15164J41043b18333r6006b880j04301I2002b4443n7222B54823
12709F914L91597A55412o7894M1698E3887J37028i6271B57942b64449D17323a34641
12697B242a77124F2551a85695j52999A57711E2293J96724L6217f8200A61027m5556
12686A15471O0097i9295r7969A31220a22223j4548A59114M8054k4025A033c9978
12674B3261J990R0904k8503L8647a24109D0295g2520C92313A75443c08482J24287
12663a84195M528B25880j04729a47014e4620o4792A03758J33082B9555a15553
12652A46776m5942M30278a1364m6050g552r5287c6788M283l16925J45693L3813
12641a69924P2412A31776a24459A59210a6981B7443R0661A5883O338f2443K100
$$ y = [175468, -84364, 115164, 256207, -218333, -314339, -2880, -107181, 92002, -24443, -81665, 254823, 6914, 398511, 155412, 87518, 129216, 53887, 190915, -96271, 257942, -264449, 417323, -134641, 2242, -177124, 62551, -185695, -338694, 157711, 52293, 249017, 285234, -68200, 161027, 115471, 175568, -99295, -197264, 131220, -122223, -136771, 159114, 207168, 183143, 1033, -39978, 23261, 25251, 116155, 87652, 126299, -124109, 40295, -72520, 392313, 175443, -308482, -184195, -179667, 225880, 121151, -147014, -54620, -119412, 103758, 236840, 29555, -115553, 146776, 100834, 531112, -11364, -57414, -7552, -102839, -36788, -32505, -349430, -203737, -169924, -97512, 131776, -124459, 159210, -16981, 27443, 118104, 15883, 22221, -62443, -60343]
12630f0343j39897e2469A73590Q5875a15391A6878b48705m3093a09880E8805a14806
12618b377A77775j9577g1802j92232G2126J0434b92145G2603J39754G4736a96435
12606B10407B8855a53953O2816B39984D7886J85299a36675A77070B8590d3996
12595a03580M0385n9165l4840A01013R3315J33099A38578K9602a90341H7457F832
12583b33446R7776H5180a32382B338J2805i7316B231e459I0710h0112k3285k78311
12571c81708a67952e9519k30079B70039E2067b02950f95j0730k6063F7041P6662
12560A43703D9065a45586N2587q3083Q3405c4485G8025f7700j08045O4741q4316
12549a95320d1464n0830j01502B36162a27755k1982c5610A26091q42a3421C7923
$$ y = [-60343, -200240, -52469, 173590, 259465, -115391, 16878, -248705, -291798, -109880, 58805, -114806, -2377, 177775, 158198, -71802, -264034, 72126, 82560, -292145, 72603, 212357, 74736, -196435, 210407, 28855, -153953, -91137, 239984, 47886, 233185, -136675, 177070, 28590, -43996, -103580, -63195, -122360, -157200, 101013, 194328, 327427, 138578, 168180, -190341, 87457, 6832, -233446, -135670, 85180, -132382, 2338, 15143, -97316, 2231, -5459, 90710, -80112, -103397, -381708, -167952, -59519, -289598, 270039, 52067, -202950, -695, -11425, -37488, 67041, 143703, 49065, -145586, -92999, -176082, -92677, -34485, 78025, -67700, -175745, -111004, -195320, -41464, -92294, -193796, 236162, -127755, -149737, -35610, 126091, 125249, -13421, 37923]
12537h9639D16849h8205r611B8725d9117A84872F8752b93261A99110a49698K5147
12526a24551p1968i0497j09293Q9843D5722J78749a25662e3607I2040J19873C4098
12514f1523C86290A04687D8894k1613R4901a33112k4558A63065K76255g1160E1641
12502F6586e6839j6737H1175a89874k7867f8543A68084R5029p2041d0957B74217
12490h6085I1046h817j86756m0625h0168H6855h6104C12303j1561j19803a70628
12478I8423j9383a53170A56742O9040j497C0986b72160B34177F1369a7604j00929
12467a18533e8556c870o8637j9455j17421o7727B87451A23475B065c6252a3025
12455F2340P4657b62105a05198C5332a0631m5507B7736b26626D71198c3529B3438
$$ y = [-89639, 416849, -88205, -97816, 28725, -49117, 184872, 68752, -293261, 199110, -149698, -124551, -196519, -90497, -199790, -109947, 45722, 224471, -125662, -53607, 92040, 211913, 34098, -61523, 386290, 104687, 48894, 27281, 122182, -133112, -157670, 163065, 439320, -71160, 51641, 66586, -56839, -73576, 81175, -189874, -217741, -68543, 168084, 263113, 191072, -40957, 274217, -86085, 91046, -8817, -195573, -236198, -80168, 86855, -86104, 312303, 300742, 180939, -170628, 98423, 79040, -153170, 156742, 225782, 224285, 30986, -272160, 234177, 61369, -17604, -118533, -58556, -3870, -72507, -91962, -209383, -277110, 287451, 123475, 2065, -36252, -13025, 62340, 136997, -262105, -105198, 35332, -10631, -56138, 27736, -226626, 471198, -33529, 23438]
12443A34072F5796J32387F7792M8963k6198c00947A0169c9235n8223j738I3602
12431b27634A96651D4811J6514J55397i1543d791G1545l0563a72014N9924F2720
12419a28017A02141b42998a1669A00912g3313Q350n9655K8281p2290G8396b57209
12407e5746a0538j10478A93769K3358b35842k6832d3051B13572E3516a70145A33478
12395A52965h1155A52029a09736A1714a69222B14627E6675K11K98835b10049g4846
12383A344e3045l72699B01832a26325A84289A1554K80345K42226B61457h3762
12372B88368D2411R2349n4463b4239C82698H468J93497b24332p4874B4627a46707
12360a44935G3847b60056D8362j4187b9601k42042J09409g3324A20117A093J80868
$$ y = [134072, 65796, 198183, 67792, 116755, 90557, -300947, 10169, -39235, -97458, -99196, 93602, -227634, 196651, 44811, 61325, 216722, -91543, -4791, 71545, 40982, -172014, -112090, 62720, -128017, 102141, -242998, -11669, 100912, -73313, -64963, -124618, -96337, -168627, 78396, -257209, -55746, -10538, -121016, 193769, 217127, -235842, -262674, -43051, 213572, 53516, -170145, 133478, 152965, -81155, 152029, -109736, 11714, -169222, 214627, 56675, 56886, 355721, -210049, -74846, 1344, -53045, -425744, 201832, -126325, 184289, 11554, 291899, 534125, 261457, -83762, 288368, 42411, 134760, 80297, -24239, 382698, 8468, 201965, -224332, -299206, 24627, -146707, -144935, 73847, -260056, 48362, 34175, -29601, -271643, -162234, -73324, 120117, 1093, 181961]
12349A81961a78336a4420f168D8655c97253J79311F7380b65540A03930C795J54536
12338A58331b30886A20208J9656d8632o3336A07579L43319g5185A46426K49985
12328C96411A509c31109C49896j74861J24004a79543A41662d5256B10378J11631
12318C22009F4086B8603J01457b36148A27320K3807O2950A04732a84852C59711
12307B43229b1313j66407j4418A67365n7341k7509b21452A78049f5419A92513
12296F6646L006L6155J20427c3476A1377J56989h4552j14137A55015a39510H1274
12284B14362e9254A03453N9244a06406H7185K26053b5190G7837K4979J44000g6776
12272a2551j4989B0245M78421q3639a4258F8258L0376K17597q4393e1823A75549
$$ y = [181961, -178336, -14420, -6168, 48655, -397253, -217942, 67380, -265540, 103930, 3795, 158331, -230886, 120208, 139864, -48632, -111968, 107579, 450898, -75185, 146426, 396411, 1509, -331109, 349896, 175035, 299039, -179543, 141662, -45256, 210378, 322009, 64086, 28603, 130060, -236148, 127320, 151127, 214077, 104732, -184852, 359711, 243229, -21313, -187720, -202138, 167365, 110024, 82515, -221452, 178049, -65419, 192513, 66646, 69652, 105807, 226234, -33476, 11377, 168366, -84552, -198689, 155015, -139510, 81274, 214362, -59254, 103453, 162697, -106406, 87185, 313238, -25190, 77837, 102816, 246816, -76776, -12551, -27540, 20245, 498666, 415027, -14258, 68258, 98634, 316231, 231838, -51823, 175549]
12260C74148A44590K8415B7286L1736M68972B53248b31561c4718D07601a01567
12249B78853e2608C6576L40350F59J37242f2024A14422N6840D0508K68909j44000
12238A65417c65704D7037c8990k7495j709D6887a0737C14112G7936a24592C92803
12226I7882e7494j15895C08415H5049j7980g1178A97719P897A9368K87836r0558
12215B16646K72976G961K12069D3046k411K42105B8891A2472J48195k1713J01356
12204B40310J58231N1312c1095A89046e0356E38162B14010l9211j268j1564e3130
12192I0621a5292A3614K47193j2913K90461B36140M501K5823m2592O9436I46L27746
12180C28692b98201a47473n3921B38330f0850B53238M5795j40043P4573k2922
$$ y = [374148, 144590, 173005, 27286, 59022, 527994, 253248, -231561, -34718, 407601, -101567, 278853, -52608, 36576, 376926, 659, 137901, -62024, 114422, 171262, 40508, 309417, 165417, -365704, 47037, -38990, -66485, -68194, 46887, -10737, 314112, 77936, -124592, 392803, 97882, -57494, -173389, 308415, 85049, 67069, -71178, 197719, 205616, 19368, 307204, 216646, 489622, 7961, 220030, 43046, 40635, 282740, 28891, 12472, 160667, 138954, 240310, 398541, 449853, -31095, 189046, -50356, 538162, 214010, 174799, 173531, 161967, -53130, 90621, -15292, 13614, 260807, 247894, 538355, 236140, 240641, 266464, 223872, 293308, 946, 328692, -298201, -147473, -201394, 238330, -60850, 253238, 299033, 158990, 233563, 210641]
12170B10641G9485K9842i5959A19212K71453j53842K43024E4014b43920D10654
12159B15327n7781L6642H6467d4584A76450J15801b7392G2527J06134L6818J47714
12148C63193A40819K7342N976B0555f6042C8408R8274Q3334F0657d0053I5771
12136a40447B76817d3460H2956a84475A78012p3305J12148a66100h0580A89710
12125I8874i54q669o9287L0160J2482n935a7728D26858A93951h1461Q577A857
12112H0632g8323A16833A7194J21543c1591B50922A13595M437P507J23919a5663
12100a31999C57866a12532j01799D8412a00029A69664m9651p683R6060J64786
12090C73176A69125Q798p1344a79975a424q6819C67807G7273a75873D76702C8528
$$ y = [210641, 79485, 109327, -95959, 119212, 390665, 236823, 479847, 54014, -243920, 410654, 215327, 157546, 194188, 86467, -44584, 176450, 292251, -27392, 72527, 178661, 215479, 363193, 140819, 168161, 174137, 20555, -66042, 38408, 136682, 220016, 60657, -40053, 95771, -140447, 276817, -43460, 82956, -184475, 178012, 104707, 216855, -166100, -80580, 189710, 98874, -954, -9623, -78910, -48750, -36268, -42203, -17728, 426858, 193951, -81461, -72884, 1857, 80632, -78323, 116833, 17194, 138737, -31591, 250922, 113595, 118032, 125539, 249458, -15663, -131999, 357866, -112532, -214331, 48412, -100029, 169664, 120013, 112330, 208390, 373176, 169125, 177923, 106579, -179975, -1424, -88243, 367807, 77273, -175873, 476702, 38528]
12078A09032b76292Q1886C9100M3273J2917R1145b9763B82006R3417J131C805
12066g7714B16457a3893j97884E2243N9946a8197j37686m9819B8295o076b0493
12054A95583a35466A81907K03727H546c6921j31345l4175A48315g3652p9406L6014
12043a17044j39430R2821N9697d7249F7255i0955l3930A49226g6965A81019a88464
12031b527E6805i8641C41227j27204j02957R917b21863b0594B27261b12345A18212
12019i0128D40814a61984B77764C8226a20670A12582e9110A36108a7199B8842
12008C3218J2155K32469a10105A94355P4553d04402F7433J08780F0059a21800
11997f0587K7004A69838q1600a02776H5077Q9294D8699K29989d10453c7939J7972
$$ y = [109032, -276292, -194406, 39100, 82373, 95290, 186435, -29763, 282006, 375423, 376554, 3805, -77714, 216457, -13893, -211777, 52243, 112189, -18197, -155883, -205702, 28295, 22219, -20493, 195583, -135466, 181907, 385634, 8546, -36921, -168266, -202441, 148315, -73652, -153058, -117044, -256474, -163653, -103956, -47249, 67255, -90955, -124885, 149226, -76965, 181019, -188464, -2527, 56805, -98641, 341227, 214023, 111066, 120983, -221863, -20594, 227261, -212345, 118212, -90128, 440814, -161984, 277764, 38226, -120670, 112582, -59110, 136108, -17199, 28842, 33218, 45373, 277842, -110105, 194355, 268908, -404402, 67433, 176213, 60059, -121800, -60587, -33583, 169838, 88238, -102776, 85077, 174371, 48699, 278688, -410453, -37939, -19967]
11986a9967j52448A59292L3287a95110A18422a8720F4507B95b9697G0493P9754
11975A50247d07442C7736O8345a04727j79069h961B27986b04522L8890N6085j59172
11964b68719R3645c5547k42180d2630J6557o8506J8321A25826b2021B8518P0445
11953I8963b48807D4798b99151F7034c7138m73F3522b18169j859H7437K20546
11942C07983h3014H2761a85480A14268K0439d27309A21756b39904E441M1283d63644
11930A37841f5966R470j82793B05283O1262a6885B5808h4210c2290o4538q9737
11919a86565d560l08320b7281k67217H5136a67098A91558J1704e0074A75315B4068
11907i1082n2446p8544C1450N432K52642D7197a18960b512k38252h1449k04092
$$ y = [-19967, -172415, 159292, 192579, -195110, 118422, -18720, 64507, 295, -29697, 70493, 150247, -407442, 37736, 106081, -104727, -283796, -8961, 227986, -204522, -165632, -109547, -268719, -175074, -35547, -277727, -42630, -26073, -94579, -76258, 125826, -22021, 28518, 98963, -248807, 44798, -299151, 67034, -37138, -37611, 63522, -218169, -220028, 87437, 307983, -83014, 82761, -185480, 114268, 134707, -427309, 121756, -239904, 5441, 46724, -463644, 137841, -65966, -56496, -239289, 205283, 266545, -16885, 25808, -84210, -32290, -96828, -186565, -4560, -312880, -27281, -294498, 85136, -167098, 191558, 203262, -50074, 175315, 24068, -91082, -143528, -222072, 31450, 36882, 289524, 47197, -118960, -2512, -240764, -81449, -285541]
11896b85541H6120d86860a78536D9920h0593j81029c5887b880j18853B07275m584
11885B02691k2607o246n8352q665b58768i2387Q237p9483j03645O5489L4527L1875
11873a35387G2412R2371a47343f0966A93182a19410q1737D866J33751O229K38286
11862C83132c21649a7432G2095c9638B0137b54583H0781a42484O8120B7925C158
11850a16006P854K4884j4574j9073a3957A06547a6836A13782O9303J11673A7458
11838a83507N7390k65676a51063l8406A35500b64512R1693p9932F1771h2534j28571
11827b11105A62584g4469k06797A95715a55135D3286K88599b21884B8379d18018
11816E0634a26184b5927l66189f0201j34794e5000A69199N410B3495f71j85596
$$ y = [-285541, 86120, -486860, -178536, 49920, -80593, -261622, -35887, -2880, -121733, 207275, 202691, 180084, 173838, 115486, 106821, -258768, -92387, -84150, -163633, -267278, -201789, -167262, -135387, 72412, 164783, -147343, -60966, 193182, -119410, -201147, 4866, 138617, 144846, 383132, -321649, -17432, 72095, -39638, 20137, -254583, 80781, -142484, -74364, 27925, 3158, -116006, -108152, -83268, -97842, -116915, -13957, 106547, -16836, 113782, 183085, 294758, 17458, -183507, -126117, -391793, -151063, -189469, 135500, -264512, -172819, -252751, 61771, -82534, -211105, 162584, -74469, -281266, 195715, -155135, 43286, 331885, -221884, 28379, -418018, 50634, -126184, -25927, -392116, -60201, -194995, -55000, 169199, 174609, 23495, -671, -186267]
11805a86267B54734L1421r6697A0401J2244a42524d364C9324G259b3379j68235
11794a91614E6738e5126j67514J060h5229B4786b91883H3342I121O1187b35278
11782A05945b73688A48127a91322f5445A66676a79732A4075a77290m3156P5154
11772a45292p5015K3479O4231n563A04726B3226c1995o1274A02438a10848M101
11761a06747m00355a8881n6810H3646D0210L61027a45307d5857G7668E426L6357
11750D1783b7134A43167j8374B0511J2440a0100q2467I2942b53813i7271E3075
11738c4852k76642A90382H0263a78596A61659a42239m9145a459n7874f765j92686
11727a99451n3975a5165n0708A37308j3901d7729C53538j24444d15970a01597
$$ y = [-186267, 254734, 286155, 189458, 10401, 22645, -142524, -4364, 39324, 7259, -23379, -191614, 56738, -55126, -222640, -221580, -85229, 24786, -291883, 83342, 9121, 70308, -235278, 105945, -273688, 148127, -191322, -65445, 166676, -179732, 14075, -177290, -220446, -145292, -220307, -196828, -132597, -138160, 104726, 23226, -31995, -93269, 102438, -110848, -106747, -507102, -18881, -75691, 83646, 40210, 401237, -145307, -45857, 77668, 5426, 41783, -27134, 143167, 124793, 20511, 32951, -10100, -92567, 92942, -253813, -97271, 53075, -34852, -311494, 190382, 80263, -178596, 161659, -142239, -191384, -1459, -59333, -6765, -199451, -253426, -15165, -65873, 137308, 123407, -47729, 353538, 229094, -415970, -101597]
11716a68195l7535K3196A59917F8340a08428C939K42983K9057d00998B00155a34570
11704a27560A43994i6637p6929H6045l5554G988K73186j8726q5588F6905a57708
11692A28420a61968A7540c42791g987j28490A44393a86795A57681p6600f9665
11681d89498e1788A5454J59982D0733J69530a83107A82879c2386E1887A0249J93290
11670B03539B4180J81889M67a55465r6762C05289b9551p4655A35284A021K7243
11659B8264i4720A58296J31981A6007O1231J57005c88151J36259C55043a08752
11648a44974B57817b173j9674j47149A76903B4711J43917J15904A09708a11659
11637d13257A12060b05595F9244a83000P7144B37039c2625a4261k70261O7299
$$ y = [-168195, -205730, -182534, 159917, 68340, -108428, 3939, 246922, 275979, -400998, 200155, -134570, -127560, 143994, -96637, -173566, 86045, 50491, 7988, 281174, 262448, 176860, 66905, -157708, 128420, -161968, 17540, -342791, -7987, -136477, 144393, -186795, 157681, 81081, -69665, -489498, -51788, 15454, 175436, 40733, 210263, -183107, 182879, -32386, 51887, 10249, 203539, 24180, 206069, 206536, -155465, -252227, 305289, -29551, -104206, 135284, 1021, 28264, -94720, 158296, 290277, 16007, 77238, 234243, -388151, -251892, 355043, -108752, -144974, 257817, -2173, -21847, -168996, 176903, 24711, 168628, 284532, 109708, -111659, -413257, 112060, -205595, 69244, -183000, -105856, 237039, -32625, -14261, -284522, -217223]
11627b17223k9759A41077l6350a773A16509C5534N2831a06719B28184b02118L7007
11616a65111J329j90185c6634j84360A8174f0173q1272d9751m4783C16483Q87
11605C17370H9577a10134I1738b34847N7059j04799b9619A03126b60347A4459
11594B6755c9312B72392b39231A37475a7394A95006b31492Q1866A84971f1314
11583E6789b996A37714a09377B38563A12795h2727q9618p6494B69477j15656B0364
11571A85697P1069i1621j31524a00725n940N2928A55421Q7020p9079a6715A61188
11559B86300g7125E2976J5609O2012c5647j17522N6125j30934C5242b28085n3737
11548b81822e2538j66714A43049J73977A6921J32808c3541B7477M2329K27411
$$ y = [-217223, -246982, 141077, 104727, -1773, 116509, 35534, 88365, -106719, 228184, -202118, -165111, -163782, -353967, -36634, -220994, 18174, -60173, -141445, -49751, -94534, 316483, 317370, 89577, -110134, 91738, -234847, -177788, -282587, -29619, 103126, -260347, 14459, 26755, -39312, 272392, -239231, 137475, -17394, 195006, -231492, -149626, 184971, -61314, 56789, -2996, 137714, -109377, 238563, 112795, -82727, -172345, -248839, 269477, 153821, 20364, 185697, 256766, -91621, -223145, -100725, -106665, -53737, 155421, 242441, 163362, -16715, 161188, 286300, -77125, 52976, 68585, 130597, -35647, -153169, -97044, -227978, 35242, -228085, -281822, -52538, -219252, 143049, 317026, 16921, 149729, -33541, 27477, 69806, 297217]
11538B97217A37901D8242Q9617O7235l9310b15253G983a17445B92602N1143F7361
11526A50447F4819J17694B4598b00528A5362a17814M9605j57932P2214A09594
11515C24446A18330A5438R0281N6012D4332c70765i4840l1085A5191K60165c7428
11503I0681Q6696a40451D9731J28748b33015N2094C52648a49515N6187G3677J0588
11492H4265Q4259K549a13772A07509J07116f0721l28830A17503Q5540D6556J39093
11481A85649L1397K5895R2851a60217A53986i1612L2227B19936c8718A70187j3423
11470A56764O1190A08887J46055I0608K55628A62290o6769K56482E1443K55406
11460C06849b62123h408H8563i5545A36006J03023a10001B96908h810I8367m5901
$$ y = [297217, 137901, 48242, 137859, 205094, 165784, -215253, 7983, -117445, 292602, 343745, 67361, 150447, 64819, 182513, 24598, -200528, 15362, -117814, -68209, -226141, -153927, 109594, 324446, 118330, 15438, 105719, 161731, 44332, -370765, -94840, -125925, 15191, 275356, -37428, 90681, 177377, -140451, 49731, 178479, -233015, -180921, 352648, -149515, -93328, 73677, 84265, 168524, 171073, -113772, 107509, 214625, -60721, -389551, 117503, 203043, 46556, 185649, 217046, 242941, 335792, -160217, 153986, -91612, -59385, 219936, -38718, 170187, 156764, 217954, 108887, 254942, 90608, 346236, 162290, 95521, 352003, 51443, 306849, -262123, -8408, 88563, -95545, 136006, 239029, -110001, 296908, -8810, 98367, 52466]
11449E2466B4386a65300A42068N0044d4104j57397A70109j7662f5927p4694B36500
11437A24265b9331B16276O2648g3082D0321a6417A49751c9309k67351A5532e4971
11425H6280b65926A20029A8395Q036a31185E7702k3886K053O686m585m980d0722
11412a52713A5883b12614O9665A25912m1705d442A92837B3830b0627J545D9955
11400B9554J96796a46809c807n2475D6750a2519k12353J04689k86185J74558a00867
11388D9151a53930m9473B15596d40001a29218A6960J40986a04035q1301j31569
11378c16905C5145K01961A9423J6767J26099c9408j09215C24556A06455b16537
11367H7942c7889E0753J21884h2302L9949n0542a713r9423G01a98184j59828B0352
$$ y = [52466, 24386, -165300, 142068, 192112, -44104, -201501, 170109, 152447, -65927, -140621, 236500, 124265, -29331, 216276, 278924, -73082, 40321, -16417, 149751, -39309, -306660, 15532, -54971, 86280, -265926, 120029, 18395, 26431, -131185, 57702, 33816, 35869, 42555, 37970, 32990, -40722, -152713, 15883, -212614, -142949, 125912, 84207, -4442, 192837, 23830, -20627, -19082, 49955, 29554, 226350, -146809, -3807, -56282, 46750, -12519, -224872, -120183, -406368, -231810, -100867, 49151, -153930, -203403, 215596, -440001, -129218, 16960, 157946, -104035, -185336, -316905, 35145, 237106, 19423, 36190, 162289, -39408, -148623, 324556, 106455, -216537, 87942, -37889, 50753, 172637, -82302, -42353, -92895, -1713, -101136, 701, -198184, -358012, 20352]
11354A36138a50706i951o6686k99833a40545b2637j79818J3138e6749B1220b9449
11342A77586A313N01375H3654a84m6143A88944r849k0308m009a4082A90921m6104
11330A44817B270f586B9867c4243C50505A0192d45587a35662B6071b82674I1679
11318A95932J38107D8263j6961b22505A15060J80483f3426j59027A5003K5538
11308D0541e9071k89261C46216e6756B1733d1328F9835a45690M7793A37095J23339
11297B60434m4812c5525j79610d5518k053q8187L6012k42470a70472a698l09322
11286c11020h1226J9864n0942r598k1637A20107R1680o2711f1662j00662H5892
11274B2950d3086A69179B1927b21075a06444l82702F4350B2254a09759a2063I4838
$$ y = [136138, -150706, -9951, -76637, -376470, -140545, -22637, -202455, -189317, -56749, 21220, -29449, 177586, 1313, 502688, 83654, -184, -46327, 188944, 179095, 158787, 154778, -14082, 190921, 144817, 2270, -6586, 29867, -34243, 350505, 10192, -445587, -135662, 26071, -282674, 91679, 195932, 334039, 48263, 31302, -222505, 115060, 295543, -63426, -222453, 15003, 40541, -59071, -348332, 346216, -56756, 21733, -41328, 69835, -145690, -97897, 137095, 260434, 215622, -35525, -215135, -45518, -47571, -135758, -99746, -342216, -170472, -1698, -311020, -81226, -61362, -112304, -121902, -143539, 120107, 211787, 149076, -61662, -162324, 85892, 22950, -43086, 169179, 21927, -221075, -106444, -489146, 64350, 22254, -109759, -12063, 94838]
11262D9722O6757c7762A7397J2193b63850a27591l763l44891K36574B19383a2703
11250c75811B23509c63162G7407J58011i885A92041c65290k5525B05388b03500
11239C6280M4488d9737A15704b22145H7845i292l0111A33046a03446L1245D8943
11227C8075b24256f157n362C03298b51914Q0895A26676a51388e8674r5667A70736
11215b48500r028f0237B2525b14060j86095J78609h9462H833i3201j04870h5457
11203b17024f3255H992P0317j2211O7683a79765j37581b9750p0031A65435h6381
11191a52300B49022a3460j35096B8066a96310A4211L4722a73711C2474l98h4967
11179b49527B95951k6774b06057a8876j70827E1876J73703b904j07541B8016b64127
$$ y = [49722, 116479, -37762, 17397, 29590, -263850, -127591, -131354, -476245, -239671, 219383, -12703, -375811, 223509, -363162, 77407, 235418, -9885, 192041, -365290, -390815, 205388, -203500, 36280, 80768, -49737, 115704, -222145, 87845, -9292, -39403, 133046, -103446, -72201, 48943, 38075, -224256, -6157, -11519, 303298, -251914, -171019, 126676, -151388, -58674, -154341, 170736, -248500, -257528, -60237, 22525, -214060, -400155, -221546, -89462, 8833, -93201, -198071, -85457, -217024, -63255, 8992, 79309, 67098, 134781, -179765, -317346, -29750, -99781, 165435, -86381, -152300, 249022, -13460, -148556, 28066, -196310, 14211, 48933, -173711, 32474, 32076, -84967, -249527, 295951, 269177, -206057, -18876, -189703, 51876, 225579, -2904, -110445, 28016, -264127]
11167a13623a2247m8047A03853c39329a3117B55402a12271b3974H0130b71026
11156A34738E2497K90677a11372M3788j95483B77834a12120K8013A57035a58844
11145b51017a7751l39323F3259c20638A69258a39976A24999k3584a56930P1306
11135h5624k3810D455K68483d6187A9658a94789e88l0228k00085i973B4674L0416
11123E5090b907r4591B21453I8935r569C3829j3097a38026A36984e3424l7941
11112i1365A50923a52007B16917L40465E5248c3368q5186b9588H831L6220M1886
11101H6937K51275A577Q0220J53870a08750A03166Q4655P0813j05733K9688q838
11090A73751K39596j38209Q5392G8152M7507L85412c3533B17681H4685J30892
$$ y = [-113623, -12247, -60294, 103853, -339329, -13117, 255402, -112271, -23974, 80130, -271026, 134738, 52497, 343174, -111372, -67584, -263067, 277834, -112120, -84107, 157035, -158844, -251017, -17751, -357074, 63259, -320638, 169258, -139976, 124999, 101415, -156930, -85624, -109434, 4455, 272938, -46187, 19658, -194789, -588, -30816, -230901, -9973, 24674, 55090, -2907, -97498, 221453, 98935, 89366, 33829, 20732, -138026, 136984, -53424, -91365, 150923, -152007, 216917, 557382, 55248, -33368, -118554, -29588, 8831, 45051, 86937, 338212, 1577, 81797, 235667, -108750, 103166, 187821, 258634, 152901, 182589, 173751, 413347, 275138, 360530, 78152, 125659, 511071, -33533, 217681, 84685, 215577]
11080B15577m3203b2788A53636E7456K53235p7097K19040i1423A59019B1128L61334
11069C82462o4297r132A02714M24884B45892k5716J44800j30457j8000M31993
11059F48512a44154C19787k6307J05111m1755K01473j81003J45886L84035O8814
11049I76041l5123j78758L9624k5223m5594J03825n2322J2503l28214Q9166M11866
11038I67791k92852O0356k04438J502K701J35923j13882j8558k4853k5808J23399
11027F11281L6245k47686r334M24188k43947o0836J48215K08500k91840B74126
11016D71654B00700K30139J38827J84256k77239q1503Q2233j17364N3918O7429
11006D81396j13622K10508m2392L10599l44563M991K34427B43957L96561o7112
$$ y = [215577, 172374, -22788, 153636, 57456, 310691, 233594, 452634, -91423, 159019, 21128, 382462, 318165, 309033, 102714, 527598, 245892, 220176, 364976, 234519, 216519, 648512, -144154, 319787, 293480, 398591, 356836, 558309, 377306, 523192, 907227, 976041, 940918, 762160, 801784, 776561, 730967, 834792, 782470, 794973, 466759, 555925, 967791, 674939, 735295, 530857, 532359, 535060, 670983, 557101, 538543, 513690, 487882, 611281, 647526, 399840, 390506, 814694, 570747, 509911, 658126, 866626, 574786, 274126, 471654, 200700, 430839, 569666, 753922, 476683, 395180, 477413, 360049, 413967, 481396, 367774, 578282, 535890, 846489, 501926, 506917, 741344, 243957, 640518, 573406]
10996E73406K15885l44180M78402o3279q2910l41329K57579m7553o3498j65348
10986D17175M83274l46889L68153l80768L47159q0569M3128m16433L93624J20820
10976I48674k09896J72283L69874J7580k17343N15120K21862K19804p923K26581
10966B256616N07227m57862l7539K29772k17720m27289m0783l48839n18681J19993
10956A064895J72525K84459k49145O610J53821j38800l53485n7387M60768l45343
10946I98918j93526k35036j06249J02859k46686h1359E07311k43106K352j0135
10936B56422P7445G1908K40576b14615A50407M924b21675C8042j2799J3481J57702
10925A96426r0334J1902b2229k05232a1464A28375a38436p3333K6289O2600B65615
$$ y = [573406, 789291, 445111, 923513, 860234, 777324, 435995, 693574, 646021, 582523, 417175, 900449, 553560, 921713, 540945, 888104, 807535, 850663, 434230, 827854, 948674, 738778, 911061, 1280935, 1298515, 1081172, 1596292, 1818154, 2037958, 2030035, 2256616, 2763843, 2305981, 2268442, 2498214, 2280494, 1853205, 1812422, 1463583, 944902, 1064895, 1237420, 1521879, 1272734, 1279344, 1433165, 1294365, 940880, 883493, 1344261, 998918, 805392, 570356, 464107, 566966, 320280, -81359, 507311, 264205, 266557, 256422, 333867, 71908, 312484, -214615, 150407, 155331, -221675, 38042, 25243, 38724, 196426, 106092, 117994, -22229, -227461, -11464, 128375, -138436, -211769, -185480, -122880, 265615]
10913I9287C6137a40842h322A6598P5195a34345o68k10467E48842A57349J44804
10902C02153E4054B6736Q1081a17300b5519j79669c2931k07192P2095j62109H726
10890I6075a51953f2681j3506j93389e2775n2832j0191L4501E2343f8457K4675
10879d3782j64422q3646B96445g3674L0665I496b02231A38250n4866e3215o7017
10868a20232A23967D4726a21238c1975F0284P7980J11650a72440m7096P228g9341
10856a01284b5219I4618P5267a46141D2446c7887D2129K07231E1233Q243d62285
10844B66058b03373b7693l5856j36833A02430b9406a0020j83610A66649a51769
10833e0967q2521r8176m2942M1318a15662A5754J8845e2504B00031E9468P4360
$$ y = [99287, 36137, -140842, -8322, 16598, 91793, -134345, -135013, -345480, 548842, 157349, 302153, 54054, 26736, 107817, -117300, -25519, -205188, -32931, -240123, -168028, -330137, 8726, 96075, -151953, -62681, -76187, -269576, -52775, -105607, -115798, -81297, 52343, -68457, -43782, -208204, -291850, 296445, -73674, -43009, 9496, -202231, 138250, 83384, -53215, -120232, 123967, 44726, -121238, -31975, 60284, 138264, 249914, -172440, -219536, -212308, -79341, -101284, -25219, 94618, 169885, -146141, 42446, -37887, 42129, 249360, 51233, 59476, -462285, 266058, -203373, -27693, -63549, -200382, 102430, -29406, -10020, -193630, 166649, -151769, -50967, -133488, -231664, -274606, -233288, -115662, 15754, 34599, -52504, 200031, 59468, 133828]
10822A33828a66462A16042d9963j58509Q4526B05343a3222C8589C996J04128A0686
10810d74721D28266f2586F8536d8A87904a44811A18218K08144a80807D1509b87140
10798b14072C4248b22596Q6435d619j74080J292l2858l3984G5628A567b06828
10786H9024a99350C23d1699E9916h8102A12931m2445Q5885b66241D7943i4671
10774d1062k19517L2564B42507b88123A4311a56453j78386a20546K4814A62086
10763a28953A51201n1212a48952a6566j50794B94861d57125F8453b06163I670
10752c07257g4489B10166C6471a96096i5100j10623A07725a05603E7991P5825
10742A33816B291b83653C8736R7645J69790c4825l6398F1812O0476a91616J7415
$$ y = [133828, -166462, 116042, -49963, -208472, -123946, 205343, -13222, 38589, 3996, 108124, 10686, -474721, 428266, -62586, 68536, -48, 187904, -144811, 118218, 326362, -180807, 41509, -287140, -214072, 34248, -222596, -136161, -4619, -178699, -177407, -210265, -244249, 75628, 1567, -206828, 89024, -199350, 323, -41699, 59916, -88102, 112931, 70486, 156371, -266241, 47943, -94671, -41062, -260579, -228015, 242507, -288123, 14311, -156453, -334839, -120546, -95732, 162086, -128953, 151201, 99989, -148952, -16566, -167360, 294861, -457125, 68453, -206163, 9670, -307257, -74489, 210166, 36471, -196096, -95100, -205723, 107725, -105603, 57991, 133816, 2291, -283653, 38736, 136381, 306171, -34825, -71223, 61812, 122288, -191616, -174201]
10731a74201C00274b42851q6244g704p0292j04117K7239C4664R8695a837k30776
10720b32613F8890d3937k93882G3449C6135c43365c4839k15254E0545a03892O007
10709i7885Q441j11122l4177A03565A3447b25375d1318D6606a43215k5951K7063
10698a42103C24454i7097j7520F7504b18714e9950r2915A65343l6515g8884D3741
10686e25668b54246D441J66413a30167L0944H282l373a91119C06412b32175R3056
10675a39119k31374b9089k03424j60539A27927Q317E0096J46957g0065J6855l6804
10664i0014F587b633m0817B24572A6304i0862j75386c3393J0419q3569I7195e4005
10651F1625K13838d63561R3563i0200A40480F9188a72561B7603A331J15092d2483
$$ y = [-174201, 300274, -242851, -329095, -7704, -77996, -182113, -154874, 34664, 133359, -1837, -232613, 68890, -43937, -337819, 73449, 36135, -343365, -34839, -250093, 50545, -103892, -97885, -89444, -200566, -234743, 103565, 13447, -225375, -41318, 46606, -143215, -169166, -142103, 324454, -97097, -114617, 67504, -218714, -59950, -152865, 165343, 128828, -78884, 43741, -525668, -254246, 4441, 170854, -130167, -99223, 8282, 4909, -191119, 306412, -232175, -139119, -370493, -29089, -232513, -393052, 127927, 136244, 50096, 197053, -70065, -53210, -90014, 6587, -2633, -43450, 224572, 16304, -90862, -266248, -33393, -22974, -106543, 97195, -54005, 61625, 275463, -463561, -369998, -90200, 140480, 69188, -172561, 27603, 1331, 116423, -42483]
10639A90102G7675K0938a33839A02359a31593n4812F8231P4413b59972e9367j87593
10628b46960h0553r3429A22222b10055P1059O2394A65803J00977H990a61881n3264
10617b15145Q4717k247K1037j37603c7916j42955I0286a62180B22474b40959j82433
10606d23392a05254J2472a226l61576J27102m9692A70455c4895r9059D737K04212
10595B08949g0804o4494B74265a89250k09665A75197q6407a49366P382j73571
10585c15555c5712l77973A58716a19199l10790i7566j04091d8396a0954o6789
10575g7743D1835M776j7208j4270b03659g9097j57468H6239D2590a87074L2200
10564a54874k24361J44920B97897d41748J56650d0037A8803O4811b000k37228
$$ y = [190102, 77675, 98613, -133839, 102359, -131593, -186405, 68231, 142644, -259972, -59367, -246960, -80553, -173982, 122222, -210055, -138996, -76602, 165803, 266780, 8990, -161881, -215145, -130428, -132675, -111638, -249241, -37916, -180871, 90286, -162180, 222474, -240959, -423392, -105254, -92782, -1226, -362802, -235700, -285392, 170455, -34895, -133954, 4737, 208949, -70804, -135298, 274265, -189250, -398915, 175197, 88790, -149366, -141984, -315555, -35712, -413685, 158716, -119199, -429989, -97566, -201657, -48396, -10954, -77743, 41835, 46611, 29403, 15133, -203659, -79097, -236565, 86239, 42590, -187074, -154874, -379235, -234315, 297897, -441748, -285098, -40037, 18803, 83614, -2000, -239228]
10554b39228j84114a42798l0602d0695G7256a04246M783H2092K48983C549b7417
10542c438k12320j133h0775o6479A34581c5688F8850a88064A04174a42086d9670
10530c66223C45326i6831j33914E9481b3168k44338C5363b09121p438j48001o328
10519c70888B1369a86239A60355b62600R9398k4525Q7337j58814P5804j76702
10509c60102f1800j35761i2615j22845G13J700J59928f2085A63073D4528O8135
10498A12663b5876C2048d28533B9310g1414B05443a8766F7675a827m7521a2766
10486c578n3226H4673K68750e2355C1973a72585j37752a669C0424K60992q3288
10475B08128K02782d6791B28886a14451C71311A76462h6955G5701c13135a4858
$$ y = [-239228, -423342, -142798, -173400, -40695, 77256, -104246, -99463, 82092, 331075, 3549, -27417, -3438, -215758, -216891, -80775, -147254, 134581, -35688, 68850, -188064, 104174, -142086, -49670, -366223, 345326, -96831, -230745, 59481, -23168, -267506, 35363, -209121, -216559, -364560, -370888, 21369, -186239, 160355, -262600, -163202, -187727, -100390, -259204, -183400, -360102, -61800, -197561, -92615, -215460, 713, 2413, 162341, -62085, 163073, 44528, 112663, -25876, 32048, -428533, 29310, -71414, 205443, -18766, 67675, -1827, -49348, -12766, -3578, -56804, 84673, 353423, -52355, 31973, -172585, -310337, -1669, 30424, 291416, 208128, 410910, -46791, 228886, -114451, 371311, 176462, -86955, 75701, -313135, -14858]
10464a22170A40555p0001a2769j06947E0239c3781C19121G2991f7248A6738O3237
10453G9975J2503a22586e3041H6394J06452b09054a7525m4533k34102A19708b26285
10441a868B8512a20374a559j41351C2096L65906E6928b89159d9643C94211c7497
10429B23324c49465J58370G7301c42533E1641O5465a49880A56132J76109a08822
10418G905J35219b28407R7441A5807b73305J24301G2761a71077A67226b01761
10407D5253e7508A40630n4936b68972B00449A0546a14176b4942m2451A06881K89909
10396C96790a32961B0226C827O1237a22724A70674a5583A54245C0129L00650d5099
10384i3725C92097C8431a65497j1096D3746a59293e3901A58879J08975b54886
$$ y = [-122170, 140555, 70554, -12769, -119716, 50239, -33781, 319121, 72991, -67248, 16738, 79975, 92478, -122586, -53041, 86394, 192846, -209054, -17525, -62058, -296160, 119708, -226285, -1868, 28512, -120374, -1559, -142910, 32096, 398002, 56928, -289159, -49643, 394211, -37497, 223324, -349465, -191095, 77301, -342533, 51641, 117106, -149880, 156132, 332241, -108822, 7905, 143124, -228407, -130966, 15807, -273305, -149004, 72761, -171077, 167226, -201761, 45253, -57508, 140630, 85694, -268972, 200449, 10546, -114176, -24942, -67393, 106881, 396790, -132961, 20226, 3827, 65064, -122724, 170674, -15583, 154245, 30129, 330779, -45099, -93725, 392097, 38431, -165497, -176593, 43746, -159293, -53901, 158879, 267854, -254886]
10373F4616K57666j55279C7223K17749j02778G5455K24202D2813d087B71850P5974
10362C47824O9235j73081H7041K91637A14836c2084D67767a0075I6437K15546
10352C11983M1289j35080J82187A61154Q0695o2346M85419j71754B15303K9988
10342B45291o0024L7858M7307r6192K26146o4896A49053B1842K08608j9484G4409
10330A2686M4577h5132C23265B7332i9040k782B7654L09767d2907a8463o8472
10319h6935H7792J62000k589k7150J67941q5682h3058B36574A574K61395o7713
10308A95256g3281j90596G6460A9420a98298p7452G8246b57823A08078a23469
10297I833b33496K1786e6156B7999b3412l81285a64589e6274r8056G621e5509
$$ y = [64616, 322282, 167003, 37223, 254972, 152194, 75455, 299657, 42813, -4087, 271850, 347824, 417059, 243978, 87041, 378678, 114836, -32084, 467767, -10075, 96437, 311983, 353272, 218192, 400379, 161154, 241849, 179503, 664922, 493168, 215303, 245291, 185267, 223125, 270432, 174240, 400386, 335490, 149053, 21842, 230450, 210966, 74409, 12686, 57263, -85132, 323265, 27332, -99040, -101822, 27654, 337421, -42907, -18463, -86935, 87792, 249792, 247203, 220053, 387994, 302312, -83058, 236574, 1574, 262969, 195256, -73281, -263877, 76460, 19420, -198298, -275750, 78246, -257823, 108078, -123469, 9833, -233496, -211710, -56156, 27999, -23412, -404697, -164589, -56274, -154330, 7621, -55509]
10285B66992c9926A35746h124k82122a43243A70490a27855A53289a53022O7192
10275h5830r1913g2518q2618O1376A89260i6577l71424d1984j70494e0764p7912
10264a28676k63917a458D3310e1434j89770A1064C962b94325C3160J19382d1879
10252C4591M68078A07387m8684J51329O5809g3153J1460A0032b98408i7107d065
10240c6165n6628H5153J36915e9614k40986D0753J0762g2928j83472d9575a0863
10228G0526b3265A52918j9373a82624e6959A33121g4319A2728b97059N8801F2449
10216A13568J47565d34188f0276B53365Q453C6458a49238j2314j70877a17287
10205F0676B561b01152A99165E921M8564i1284M4122J7110l32655f8137A33477
$$ y = [266992, -39926, 135746, -8124, -290246, -143243, 170490, -127855, 153289, -153022, -85830, -177743, -72518, -155136, -93760, 189260, -96577, -468001, -41984, -212478, -50764, -128676, -392593, -1458, 43310, -51434, -241204, 11064, 3962, -294325, 33160, 152542, -41879, 34591, 502669, 107387, 58703, 210032, 275841, -73153, -61693, 10032, -298408, -97107, -4065, -36165, -92793, 85153, 222068, -59614, -300600, 40753, 51515, -72928, -256400, -49575, -10863, 70526, -23265, 152918, 133545, -182624, -56959, 133121, -74319, 12728, -297059, -238258, 62449, 113568, 261133, -434188, -60276, 253365, 261818, 36458, -149238, -161552, -332429, -117287, 60676, 2561, -201152, 199165, 5921, 54485, -91284, -47162, -30052, -362707, -68137, 133477]
10193E6607a10756A77372d3315j5950o3537B86692H4377b11554g3929n2291R653
10182a16567j72197N7387a14185A85594d44488J38026b9598E2030g2058L4284
10172c7774l29257A63090b22060k5823M7640b0553j95870O4144M1740o4050C9787
10160b22054E9627J3061i5038j05226A36449c25283F9087a37829e955A52181d5765
10148A57530n019c97803Q5130a07192a6949A27813d4236k48254C56447b70260
10137A4904M4804b72952n9766h9662E8887i9035B27976i1860L0608B14354e427
10125A34614h1862C49148E2322a98472B2011c80016J57846C10976j53426d2462
10114A93035a75730q0262F7747k9068b40166C930L9511P122q892b20218A01805
$$ y = [56607, -110756, 177372, -43315, -59265, -122802, 286692, 84377, -211554, -73929, -126220, -116567, -288764, -231377, -114185, 185594, -444488, -306462, -29598, 52030, -72058, -37774, -367031, 163090, -222060, -247883, -200243, -20553, -216423, -152279, -110539, -174589, 39787, -222054, 59627, 72688, -95038, -200264, 136449, -325283, 69087, -137829, -5955, 152181, -45765, 157530, 152511, -397803, -312673, -107192, -16949, 127813, -44236, -292490, 356447, -270260, 14904, 59708, -272952, -332718, -89662, 58887, -99035, 227976, -91860, -61252, 214354, -5427, 134614, -81862, 349148, 52322, -198472, 22011, -380016, -222170, 310976, 157550, -42462, 193035, -175730, -255992, 67747, 38679, -240166, 3930, 43441, 50563, 41671, -220218, 101805]
10102B82948K2672d82035D4369J0406c32535q0544i034m3185A4941J96787a22636
10090a43330k63466A18236i3453F0318f854A81919a09359A71857B361i4417j21509
10079b15926R5809C3005i9698M1058A79647i6443l06845C9706b86882a23985k71248
10068c95233F4181b3530C4413J28257b34363c9942j09404b9685l2129D06009b94519
10056F4221a14643j2058q9871b8991j77946O8126m3896q6493O4514B73576A38
10044c19079a17513a3122j35123A16231J56083a01583I1957q3b32973A59144E9082
10032A35150b34121A63263b69461J04007O2858A3434K7832a85842A21328a01329
10021b99939L5421b167o2463H9559b78026J00866E8766a94349h7483E6275c97096
$$ y = [282948, 305620, -482035, 44369, 54775, -332535, -413079, -9034, -52219, 14941, 211728, -122636, -143330, -406796, 118236, -93453, 60318, -6854, 181919, -109359, 171857, 2361, -94417, -215926, -120117, 33005, -99698, -58640, 179647, -96443, -403288, 39706, -286882, -123985, -395233, 64181, -23530, 34413, 162670, -234363, -39942, -149346, -29685, -61814, 406009, -294519, 64221, -114643, -126701, -216572, -28991, -206937, -138811, -182707, -269200, -204686, 273576, 138, -319079, -117513, -13122, -148245, 116231, 272314, -101583, 91957, 91874, -232973, 159144, 59082, 135150, -234121, 163263, -269461, -165454, -102596, 13434, 41266, -185842, 121328, -101329, -299939, -264518, -2167, -64630, 89559, -278026, -177160, 58766, -194349, -87483, 56275, -397096]
10009i1253l5223l5421D2396J12409a92758e1236j15473g5926j46592D7203G348
9997a70876L8256A2036a57806e9851q2687G1075b00464B51895m384b98248R9632
9986a98616D950b06874h458j95485Q6717M7830I4047A8796N0665b57031P8805
9975a78226l0747L8499A15272e85725C36115d52504A55297h7557j35022h2956
9964h4364J0579k51763A87106K9508B8326b24369g8706k3161l82780E6396K8422
9953H4818b00700l8543d4551j77273g9140j36579A22310e7489C09492a59706j37301
9942b97007d6602H6877b8992q9668e4255l21056e9994p5857H4700b0674A74971
9930a6383r8801k07362J44568A99768a50722j66350E1311e0184m0908k9j56795
$$ y = [-91253, -126476, -161897, 42396, 154805, -192758, -51236, -166709, -75926, -222518, 47203, 7348, -170876, -132620, 12036, -157806, -59851, -142538, 71075, -200464, 251895, 247511, -298248, -198616, 4950, -206874, -8458, -203943, -117226, -69396, 94047, 18796, 69461, -257031, -178226, -208973, -170474, 115272, -585725, 336115, -452504, 155297, -87557, -222579, -82956, -84364, -73785, -325548, 187106, 216614, 28326, -224369, -78706, -101867, -484647, 56396, 84818, -200700, -239243, -44551, -221824, -79140, -215719, 122310, -57489, 309492, -159706, -297007, -46602, 86877, -28992, -118660, -54255, -375311, -59994, -135851, 84700, -20674, 174971, -16383, -115184, -322546, -177978, 199768, -150722, -317072, 51311, -50184, -91092, -91121, -247916]
9919b47916b6065m18721A08560f3703k4416l56735b07563e599G6220b54449c3562
9907A97148b64140B14599c93611e5259E4782M9226n427a40613j382E6860b42816
9895a05258D4668N434a32352j99865P7168J23353m7501Q6338d5592k2630k16943
9884b85165E3700b86573a4468k50955C1019f9385j44382n1261G3278c26132p1368
9873c97500a03019a3319D9749R2367k0976c40j37039A91930A3320a15254A2132
9861b92990Q5643J1897A09648K546M9281h9698k64814I395J88266b91643C89774
9849a19602A98222f4030J3337H4935a8059B92321C2363a21259d3766B31073G6955
9837a30684l0565F3565b48781D7951f3409A44753M4877B4104Q7838J34064b54518
$$ y = [-247916, -26065, -444786, 108560, -63703, -88119, -444854, -207563, -5599, 76220, -254449, -33562, 197148, -264140, 214599, -393611, -55259, 54782, 104008, 98581, -140613, -141995, 56860, -242816, -105258, 44668, 50102, -132352, -332217, -255049, -131696, -179197, -92859, -45592, -68222, -285165, 53700, -286573, -14468, -265423, 31019, -69385, -213767, -265028, 73278, -326132, -397500, -103019, -13319, 49749, 142116, 121140, -340, -137379, 191930, 13320, -115254, 12132, -292990, -207347, -195450, 109648, 112194, 161475, -89698, -354512, 9395, 197661, -291643, 389774, -119602, 198222, -64030, -50693, 84935, -18059, 292321, 32363, -121259, -43766, 231073, 76955, -130684, -161249, 63565, -248781, 47951, -63409, 144753, 189630, 24104, 111942, 246006, -254518]
9825D3837b8588r724j74931j6438a1132I5595i6084k23259a8606A4875h3489j53319
9813b36808k272I7777R9861a84266j99827h936m0745m3809j9311k91718A69061
9801b15806I7694e25537J80914B37507k2474J8426a00123L0633G1942a13196L9440
9790g3756m9799j62160N2293o3992i581F0253a44943m5802n9193q2627a0726k25415
9778b36141m9909A31271c75268a07655j65050A8926q570J02694C7781R337f7901
9766c6143B03929I2874a12965D7180J44100o2903a1551B86847a18758k05720J59789
9755a64689k75082A9500a28932j30109h4734j16000e8171j6405K15A0461b80503
9743b52329O3032c8385k4154j96010L8058C1312a20127j06226j0709D4484b23849
$$ y = [43837, -28588, -38312, -213243, -229681, -11132, 95595, -96084, -319343, -18606, 14875, -83489, -236808, -239080, 97777, 197638, -184266, -384093, -8936, -49681, -93490, -112801, -404519, 169061, -215806, 97694, -525537, -344623, 237507, 215033, 233459, -100123, -69490, 71942, -113196, -73756, -123555, -285715, -233422, -297414, -9581, 60253, -144943, -190745, -249938, -332565, -10726, -236141, -286050, 131271, -375268, -107655, -272705, 18926, 10356, 113050, 37781, 47118, -67901, -36143, 203929, 92874, -112965, 47180, 191280, 128377, -11551, 286847, -118758, -324478, -164689, -439771, 19500, -128932, -259041, -84734, -200734, -58171, -74576, -74361, 10461, -280503, -252329, -189297, -38385, -62539, -258549, -220491, 31312, -120127, -226353, -237062, 44484, -223849]
9731C7399K40982a0575j12840A05278a66748j58935d9390B82220a62205A35180
9720a76394h6331q3550j21958b9562j00880I0483e7785p5442e3383G3244C0783
9708B08559d8357j15758c0492j07093c2888h688j31956B7789a23697N7814b0610
9696B79483D1645J27342A3967a80q6005q6109M4367A65624a40774c3308q6172
9685a19480B715b08313j1202J8305e7196J1011o4954d2061K0719B41440h6612
9673a0313p0758I1059L2252l7172l0281k5778b57970c4235k69532A78248D616
9661C5528f395l3898A12209m982O649h518o6987A25461d61707b667j62074A0931
9648B3739J40905g8495a034j15237j77859d6040D9648h8020j82432c3860k35032
$$ y = [37399, 278381, -10575, -123415, 105278, -166748, -325683, -49390, 282220, -162205, 135180, -176394, -86331, -169881, -291839, -29562, -130442, 90483, -57785, -133227, -53383, 73244, 30783, 208559, -48357, -164115, -30492, -137585, -32888, -8688, -140644, 27789, -123697, -65883, -20610, 279483, 41645, 168987, 13967, -180, -86185, -172294, -127927, 165624, -140774, -33308, -119480, 2715, -208313, -219515, -201210, -57196, -46185, -111139, -42061, -21342, 241440, -86612, -10313, -81071, 91059, 123311, 86139, 55858, 30080, -257970, -34235, -303767, 178248, 4616, 35528, -6395, -40293, 112209, 107227, 113876, -8518, -75505, 125461, -461707, -2667, -164741, 10931, 23739, 164644, -78495, -1034, -116271, -294130, -46040, 49648, -88020, -270452, -33860, -268892]
9637b68892f7821b8700A9393J4254J19374h6405c1177j60330E281J45488C7472
9625a41378A12618a05512F6846k281O5994a01871d865j9351A02273B8281b38372
9613c0766k50542J40343f0865K3153n3593a2903j36969q9454A11397a40865k61883
9602d02748J70566A5017K65433J3414f5446A6349b5935A04348m5185b34796C6036
9590a73624A40038d2707k16173b8463m45644A59050f93807f0150j2581B64613
9579a37407J8151L4210C30277A51076b52464J825I1073b64596B13648c30473d9016
9567B48066c01633a25230j22360A3334a1826p2820k50568B44147b26308a01823
9556I5589a29949j8785f7882D53631h7072n1903o3986i9836F4885b60962P4612
$$ y = [-268892, -67821, -28700, 19393, 33647, 153021, -86405, -31177, -191507, 5281, 150769, 37472, -141378, 112618, -105512, 66846, 64565, 130559, -101871, -4865, -24216, 102273, 28281, -238372, -30766, -281308, -140965, -60865, -37712, -91305, -12903, -149872, -239326, 111397, -140865, -402748, -232182, 15017, 280450, 293864, -65446, 16349, -25935, 104348, 59163, -234796, 36036, -173624, 140038, -42707, -258880, -28463, -474107, 159050, -693807, -60150, -72731, 264613, -137407, -119256, -85046, 330277, 151076, -252464, -250639, 91073, -264596, 213648, -330473, -49016, 248066, -301633, -125230, -247590, 13334, -11826, -84646, -335214, 244147, -226308, -101823, 95589, -129949, -148734, -67882, 453631, -87072, -138975, -202961, -99836, 64885, -260962, -186350]
9545a86350g1231o4423l1847e0436j37876b3469j71595j95944d4611j07109k377
9534a54097E1229B0217P3564c93801A02725a18544Q067A14049b04763H742a78776
9522B02639b15179B71672e5420k8494A06934b8906A23458D4363c94818D869i3224
9510B53022G0683h2174l11727A39910m225D5502h8957A14726e26j01020r5891
9499a97437Q7511J7030B6581F441a25505j95536N136J01896e4042A58024A5068
9487a9759j10716E7866a61465P7469L6950o1579j35247D81520A11961c04029a06537
9475f469n53385B28368A11189j5335b13313Q2105J8909k09518O0105C78123a92568
9463H0172a45656l0171L6233r044n1996A02429f9768k2789j92124f442G416c8201
$$ y = [-186350, -71231, -135654, -167501, -50436, -188312, -23469, -195064, -391008, -44611, -151720, -154097, 51229, 20217, 93781, -393801, 102725, -118544, -110477, 114049, -204763, 8742, -178776, 202639, -215179, 271672, -55420, -83914, 106934, -28906, 123458, 44363, -394818, 4869, -93224, 253022, 70683, -82174, -393901, 139910, 135685, 45502, -88957, 114726, -526, -101546, -197437, -109926, -92896, 26581, 6441, -125505, -321041, -315905, -214009, -54042, 158024, 15068, -19759, -130475, 57866, -161465, -83996, -47046, -108625, -243872, 481520, 111961, -304029, -106537, -6469, -559854, 228368, 111189, 95854, -213313, -131208, -112299, -321817, -261712, 378123, -192568, 80172, -145656, -175827, -139594, -148638, -200634, 102429, -69768, -92557, -284681, -6442, 7416, -38201]
9450B35152m0236h0698F2681a35063I0276K07725B7716J68350I5165b94299K6888
9439b67411E2089e987A88a67938f1290j92818h2498j28781E7413O2233l2576M8080
9427A35150i3858c1446A07532b9470H8315a59742A05263a29562k81734K8937A17274
9415a04340A7027b51961J05457B23234h773l12888O2302A7139b79712J9724J16280
9404a43708G8022c4783j48312Q2806B52798a58531A45302J5876c49419C10736
9393A0812h712k61894a01248C4700a17330A96758J51397h0444j70065a09858A6781
9381i8163r2482p8628D044L532J8241c3593A62142a0102k09460C0168N5788j95
9369H5761A9609J93116a57549B21380c8853B8491b52510A0050P5767e6412A13624
$$ y = [235152, 194916, -80698, 62681, -135063, 90276, 298001, 27716, 196066, 95165, -294299, -267411, 52089, -5987, 188, -167938, -61290, -254108, -82498, -211279, 57413, 119646, 87070, 135150, -93858, -31446, 107532, -29470, 88315, -159742, 105263, -129562, -411296, -382359, 117274, -104340, 17027, -251961, -146504, 223234, -8773, -321661, -259359, 17139, -279712, -259988, -143708, 78022, -34783, -183095, -100289, 252798, -158531, 145302, 161178, -349419, 310736, 10812, -8712, -270606, -101248, 34700, -117330, 196758, 348155, -80444, -250509, -109858, 16781, -98163, -190645, -269273, 4044, 7576, 25817, -33593, 162142, -10102, -219562, 30168, 85956, 85761, 19609, 212725, -157549, 221380, -38853, 28491, -252510, 10050, 85817, -56412, 113624]
9357B20123a41390A4875a38212C40810A61939h9809A3380a55281d7997B25582
9346B94904b37038b7413A0743K21104h5520j2649A31914d6854A1367d6745a4360
9334b12338j13991e0093j48517g634B25162d5310K2180n3662B71120a41923j4935
9323a56858k852M9982j91975c2537m1787I3574A479h0017A98256b01047i6240
9311A57753B3011a18246m2115D3611R2154b31940J08517j39678a10901j01805
9301b12706I5643A6566a79125A9104K31073h0716A55002c87190b6952q115r4304
9290a29371l3668I6059b47678a5172l16699I069C895J21796C5185b6590j37582
9279a64172E1387n449a47054L4756B03173g9018A70230d25684a08828C95910c8204
$$ y = [220123, -141390, 14875, -138212, 340810, 161939, -89809, 13380, -155281, -47997, 225582, 294904, -237038, -27413, 10743, 231847, -85520, -98169, 131914, -46854, 11367, -46745, -14360, -212338, -326329, -50093, -198610, -7634, 225162, -45310, -23130, -76792, 271120, -141923, -156858, -159710, -109728, -301703, -32537, -74324, 93574, 1479, -80017, 198256, -201047, -96240, 157753, 23011, -118246, -160361, 43611, 135765, -231940, -123423, -263101, -110901, -212706, 95643, 16566, -179125, 19104, 250177, -80716, 155002, -387190, -26952, -35067, -129371, -163039, 96059, -247678, -15172, -331871, 9069, 3895, 125691, 35185, -26590, -164172, 51387, 45938, -147054, -112298, 203173, -79018, 170230, -425684, -108828, 395910, -38204]
9267H2338c01243A16464b91339P3389A61977A7399a24510k84761D6534b03249
9256a17849G4684b61335B19717b06581A08394J02386k7016q5034h5132a7342m34245
9245d51587B54644a7975q8744M6059j85644M8288K3465c7211j62375B3007J91681
9234B14688D7803R303R1089b32065K5231g9098j27297p2838N9788R9119J9416
9223a00910k0249N6396K1825k41600C0343b27911C4333c33680A1203P7328b44139
9211a97159g2186l77576h4041E7261K05807g3479H2934a75489l8438i3248C72933
9199C9521a120j19338D8698Q9801d3068j90602N710n6244B4706M3837a76529A4296
9186a77162A43250a15162K2622j24954N1908M3360B08448a57843j9768N344K4992
$$ y = [82338, -301243, 116464, -291339, -217950, 161977, 17399, -124510, -409271, 46534, -203249, -117849, 74684, -261335, 219717, -206581, 108394, 210780, 183764, 98730, -85132, -17342, -451587, 254644, -17975, -106719, -60660, -246304, -198016, -174551, -37211, -199586, 23007, 214688, 47803, 57106, 148195, -232065, -206834, -79098, -206395, -279233, -219445, -120326, -100910, -121159, -64763, -42938, -284538, 30343, -227911, 34333, -333680, 11203, 88531, -244139, -197159, -72186, -449762, -84041, 57261, 263068, -73479, 82934, -175489, -213927, -93248, 372933, 39521, -1120, -120458, 48698, 138499, -43068, -233670, -227960, -284204, 24706, 68543, -176529, 14296, -177162, 143250, -115162, -92540, -217494, -165586, -122226, 208448, -157843, -177611, -172267, -147275]
9175a47275J4320B94921a53073p2265b3803A30355b96362a40989j14937F4207
9164g2415K2411j67994B07057a00631b0601E9540d8004c204A18096a79290m0016
9153b19306a05452D3662c33884C705J1150d24675J62954H2788g1289A89875c05
9141a63065O4453j24056A04008a35456F4637b85202d2656A54395d26593a08826
9130A23112C6274L8170c46217A8433K9925a09099G1270a59995N429I9681f3642
9118B18011a69535j37602A8516a54625K4655A98459b22269a09882j08371d864
9107c94959a07877L2309B3253a2027A38269a31470B3837a26321A00136e0368m2980
9096i3348l30411A63725b00904g4806L1882l55587a8073B32588a8187k05307Q6263
$$ y = [-147275, -132955, 294921, -153073, -225338, -23803, 130355, -296362, -140989, -255926, 64207, -72415, -50004, -217998, 207057, -100631, -20601, 59540, -48004, -3204, 118096, -179290, -219306, -105452, 43662, -333884, 3705, 14855, -424675, -261721, 82788, -71289, 189875, -305, -163065, -98612, -222668, 104008, -135456, 64637, -285202, -42656, 154395, -426593, -108826, 123112, 36274, 74444, -346217, 18433, 48358, -109099, 71270, -159995, -154566, 99681, -63642, 218011, -169535, -307137, 18516, -154625, -129970, 198459, -222269, -109882, -218253, -4864, -394959, -107877, -75568, 23253, -12027, 138269, -131470, 23837, -126321, 100136, -50368, -93348, -423759, 163725, -200904, -74806, -42924, -398511, -18073, 232588, -18187, -223494, -137231]
9085a37231B23969b77294B50174a24173I6670B570L8802P4915a78950e4221k27105
9074b81326R7276A26987a46025c2173C9166a82895d2163q423r2981b4822m69871
9063d94693F792Q151J34747b35772h9749d1760C09808C3523d118C02925A50390
9051a7859B6541O2890c1037m7619n2328P451o6090R3422o347j4347E1939i0320
9038a91785j06444e7552A79480k848D5501J15761A7147J79930p9898J10752c9984
9026b02129G0988l1188c3450I7347K92749b05754g9785A78569b671l93210a92723
9014a64981I5038c48446Q8626A06992D2645c85344a75858Q7263G568O5079j6259
9003E6388c40745D07438C272a6554A00721d03587A9731K64686H2379a18355E5242
$$ y = [-137231, 223969, -277294, 250174, -124173, 96670, 2570, 41372, 116287, -178950, -54221, -281326, -184050, 126987, -146025, -32173, 39166, -182895, -42163, -50586, -143567, -24822, -494693, 6792, 14943, 149690, -235772, -89749, -41760, 309808, 33523, -4118, 302925, 150390, -17859, 26541, 89431, -31037, -78656, -130984, -123533, -189623, -96201, -102548, -116895, 51939, -90320, -191785, -298229, -57552, 179480, 176632, 45501, 161262, 17147, 197077, 117179, 227931, -39984, -202129, 70988, 39800, -33450, 97347, 390096, -205754, -79785, 178569, -2671, -395881, -192723, -164981, 95038, -348446, -259820, 106992, 42645, -385344, -175858, -88595, 7568, 72647, 56388, -340745, 407438, 3272, -16554, 100721, -403587, 19731, 284417, 82379, -118355, 55242]
8991g0966l3419C9785D132J06643A0719R3020J3834n0228J89513b3454k31688
8980b55142a22801B3442a79070Q8705Q336j92165L6104R4594f6272j63987f8908
8968b74394a17651m8294J3627j54788R2607e7993j38986H9460d67493A3498M1406
8957E4904a94698Q3435D6992a97887f7149A04100f5271J0939B26805a28674j95717
8946c24391C13238c9267J9119L275n32981d5702F4305L17453a45333F5874K00382
8935B66256a40781j07282E9158d05060D5361a49296j94025b5740B26538b92458
8924A42643a82814O7306A10185h0777E8100M82949J89810B22209h28A29567d4794
8912d6674k03206A49570E5548d482A15722k6331b11137B74059b44869I5695m2778
$$ y = [-70966, -104385, 39785, 4132, 110775, 10719, 103739, 117573, 67345, 256858, -23454, -255142, -122801, 23442, -179070, -90365, -82029, -274194, -238090, -143496, -66272, -230259, -68908, -274394, -117651, -165945, -152318, -307106, -214499, -57993, -196979, 89460, -467493, 13498, 54904, -194698, -111263, 46992, -197887, -67149, 104100, -65271, -54332, 226805, -128674, -324391, 313238, -39267, -20148, -16873, -549854, -45702, 64305, 381758, -145333, 65874, 266256, -140781, -248063, 59158, -405060, 45361, -149296, -343321, -25740, 226538, -292458, 142643, -182814, -115508, 110185, -80777, 58100, 541049, 730859, 222209, -828, 129567, -44794, -46674, -249880, 149570, 55548, -4482, 115722, 89391, -211137, 274059, -244869, 95695, 52917]
8901E2917K7161b72335H7633d5303k30934m7891J08507k4202a424j28438l835
8890a33697A08885a72970o2712O1624F6082b21367A4293a35191C51815c2576k05913
8879b38489C5495L2265K77596c94707a43267J9990p8218B10153A7504J17001F5437
8867f3764l9216j87260i0364p07g512j55161k73023D0082b1010E1301J62843G5820
$$ y = [52917, 80078, -272335, 87633, -45303, -276237, -324128, -215621, -239823, -1424, -129862, -133697, 108885, -172970, -235682, -174058, 66082, -221367, 14293, -135191, 351815, -32576, -238489, 35495, 67760, 345356, -394707, -143267, -123277, -201495, 210153, 17504, 134505, 65437, -63764, -102980, -290240, -90364, -91071, -7512, -162673, -435696, 40082, -21010, 51301, 214144, 75820]
$$ [...]
##END NTUPLES=NMR SPECTRUM
##END=
