##TITLE=NES1029_Seabridge_9268384_OJRqjs6Mtp
##JCAMPDX= 6.0         $$ Bruker NMR JCAMP-DX V2.0
##DATA TYPE= NMR SPECTRUM
##DATA CLASS= NTUPLES
##ORIGIN= BRUKER
##OWNER= Administrator
$$ 1.72 TOPSPIN		Version 2.1
$$ 2015-07-10 18:33:14.878 -0700  Administrator@X
$$ Compression mode = diff/dup
##.OBSERVE FREQUENCY= 400.02188249412
##.OBSERVE NUCLEUS= ^1H
##.ACQUISITION MODE= SIMULTANEOUS (DQD)
##.ACQUISITION SCHEME= undefined
##.AVERAGES= 64
##.DIGITISER RES= 22
##SPECTROMETER/DATA SYSTEM= spect
##.PULSE SEQUENCE= noesygpps1d.comp
##.SOLVENT NAME= COFFEE_meoh
##.SHIFT REFERENCE= INTERNAL, COFFEE_meoh, 1, 14.96279
##AUDIT TRAIL= $$ (NUMBER, WHEN, WHO, WHERE, PROCESS, VERSION, WHAT)
$$ ##TITLE= Audit trail, TOPSPIN		Version 2.1
$$ ##JCAMPDX= 5.01
$$ ##ORIGIN= Bruker BioSpin GmbH
$$ ##OWNER= Administrator
$$ $$ E:\/data/COFFEE/nmr/NES1029_Seabridge_9268384_OJRqjs6Mtp/12/pdata/1/auditp.txt
$$ ##AUDIT TRAIL=  $$ (NUMBER, WHEN, WHO, WHERE, PROCESS, VERSION, WHAT)
(   1,<2015-07-10 18:33:09.706 -0700>,<Administrator>,<X>,<go>,<TOPSPIN 2.1>,
      <created by zg
	started at 2015-07-10 18:21:40.050 -0700,
	POWCHK enabled, PULCHK disabled,
       configuration hash MD5:
       21 0F 79 D6 B3 7B B4 F6 88 20 88 DB 03 48 BD 9F
       data hash MD5: 64K
       82 80 DD 46 05 01 4C 68 BB 3F 28 8F 43 84 A9 0D>)
(   2,<2015-07-10 18:33:13.003 -0700>,<Administrator>,<X>,<proc1d>,<TOPSPIN 2.1>,
      <Start of raw data processing
       efp LB = 0.3 FT_mod = 6 PKNL = 1 PHC0 = 0 PHC1 = 0 SI = 128K 
       data hash MD5: 128K
       97 E4 33 A6 0F 54 6E 47 C1 12 C8 D9 F9 DE AC 81>)
(   3,<2015-07-10 18:33:13.894 -0700>,<Administrator>,<X>,<proc1d>,<TOPSPIN 2.1>,
      <pk PHC0 = -85.63293 PHC1 = 0 
       data hash MD5: 128K
       4E 0E 95 88 E0 A5 17 A6 F3 F6 F2 BB 8C AF E7 45>)
(   4,<2015-07-10 18:33:14.316 -0700>,<Administrator>,<X>,<proc1d>,<TOPSPIN 2.1>,
      <abs ABSG = 1 
       data hash MD5: 128K
       FF B7 E5 C8 E0 6B 71 A7 7B 5F 50 DE 62 E0 30 C4>)
(   5,<2015-07-10 18:33:14.410 -0700>,<Administrator>,<X>,<proc1d>,<TOPSPIN 2.1>,
      <abs ABSG = 2 
       data hash MD5: 128K
       D3 1C 94 A0 B2 2F 42 5F 95 E1 75 98 23 2B 64 5C>)
(   6,<2015-07-10 18:33:14.488 -0700>,<Administrator>,<X>,<proc1d>,<TOPSPIN 2.1>,
      <abs ABSG = 3 
       data hash MD5: 128K
       AA 58 E8 F4 57 F9 1A 82 3F 63 FF C7 43 4B D1 EF>)
(   7,<2015-07-10 18:33:14.581 -0700>,<Administrator>,<X>,<proc1d>,<TOPSPIN 2.1>,
      <abs ABSG = 4 
       data hash MD5: 128K
       B3 9A 92 69 2B 68 CB AF AF 3E 6B 1D AA 35 0D 8B>)
(   8,<2015-07-10 18:33:14.660 -0700>,<Administrator>,<X>,<proc1d>,<TOPSPIN 2.1>,
      <abs ABSG = 5 
       data hash MD5: 128K
       EB ED F9 43 D5 16 27 0B EC FE D0 4F FB 08 DD 50>)
$$ ##END=
$$ 
$$ $$ hash MD5
$$ $$ BF EC FB 19 09 BD CA E5 B7 B9 21 0B 8B 32 81 DA
##$RELAX= 
##$RELAX= 
##$RELAX= 
##$RELAX= 
##$RELAX= 
##$RELAX= 
##$RELAX= 
##$RELAX= 
$$ Bruker specific parameters
$$ --------------------------
##$DU= <E:\>
##$EXPNO= 12
$$ [...]
##$TP07= 0
##$TPNAME0= <>
##$TPNAME1= <>
##$TPNAME2= <>
##$TPNAME3= <>
##$TPNAME4= <>
##$TPNAME5= <>
##$TPNAME6= <>
##$TPNAME7= <>
##$TPOAL= (0..7)
0.5 0.5 0.5 0.5 0.5 0.5 0.5 0.5
##$TPOFFS= (0..7)
0 0 0 0 0 0 0 0
##$TUNHIN= 0
##$TUNHOUT= 0
##$TUNXOUT= 0
##$USERA1= <user>
##$USERA2= <user>
##$USERA3= <user>
##$USERA4= <user>
##$USERA5= <user>
##$V9= 5
##$VALIST= <valist>
##$VCLIST= <CCCCCCCCCCCCCCC>
##$VD= 0
##$VDLIST= <DDDDDDDDDDDDDDD>
##$VPLIST= <PPPPPPPPPPPPPPP>
##$VTLIST= <TTTTTTTTTTTTTTT>
##$WBST= 2048
##$WBSW= 25
##$XGAIN= (0..3)
0 0 0 0
##$XL= 0
##$YL= 0
##$YMAX_a= 7445772
##$YMIN_a= -15627727
##$ZGOPTNS= <>
##$ZL1= 120
##$ZL2= 120
##$ZL3= 120
##$ZL4= 120
##$ABSF1= 14.96279
##$ABSF2= -5.595392
##$ABSG= 5
##$ABSL= 3
##$ALPHA= 0
##$AQORDER= 0
##$ASSFAC= 0
##$ASSFACI= 0
##$ASSFACX= 0
##$ASSWID= 0
##$AUNMP= <proc_prof1d_extract.lims>
##$AXLEFT= 0
##$AXNAME= <>
##$AXNUC= <1H>
##$AXRIGHT= 0
##$AXTYPE= 0
##$AXUNIT= <>
##$AZFE= 0.1
##$AZFW= 0.1
##$BCFW= 0
##$BC_mod= 0
##$BYTORDP= 0
##$COROFFS= 0
##$CY= 15
##$DATMOD= 1
##$DC= 0
##$DFILT= <>
##$DTYPP= 0
##$F1P= 0
##$F2P= 0
##$FCOR= 0.5
##$FTSIZE= 131072
##$FT_mod= 6
##$GAMMA= 0
##$GB= 0
##$INTBC= 1
##$INTSCL= 1
##$ISEN= 128
##$LB= 0.3
##$LEV0= 0
##$LPBIN= 0
##$MAXI= 10000
##$MC2= 0
##$MEAN= 0
##$ME_mod= 0
##$MI= 0
##$NCOEF= 0
##$NC_proc= -2
##$NLEV= 6
##$NOISF1= 0
##$NOISF2= 0
##$NSP= 0
##$NTH_PI= 0
##$NZP= 0
##$OFFSET= 14.96279
##$PC= 1
##$PHC0= -85.63293
##$PHC1= 0
##$PH_mod= 1
##$PKNL= yes
##$PPARMOD= 0
##$PPDIAG= 0
##$PPIPTYP= 0
##$PPMPNUM= 2147483647
##$PPRESOL= 1
##$PSCAL= 4
##$PSIGN= 0
##$PYNMP= <proc.py>
##$REVERSE= no
##$SF= 400.020008921086
##$SI= 131072
##$SIGF1= 0
##$SIGF2= 0
##$SINO= 400
##$SIOLD= 131072
##$SPECTYP= <>
##$SREGLST= <1H.CDCl3>
##$SSB= 0
##$STSI= 131072
##$STSR= 0
##$SW_p= 8223.68421052631
##$SYMM= 0
##$S_DEV= 0
##$TDeff= 65536
##$TDoff= 0
##$TI= <>
##$TILT= no
##$TM1= 0
##$TM2= 0
##$TOPLEV= 0
##$USERP1= <user>
##$USERP2= <user>
##$USERP3= <user>
##$USERP4= <user>
##$USERP5= <user>
##$WDW= 1
##$XDIM= 131072
##$YMAX_p= 444947223
##$YMIN_p= -13005
##$CURPLOT= <Network HP LaserJet P1505>
##$CURPRIN= <$Network HP LaserJet P1505>
##$DFORMAT= <normdp>
##$LAYOUT= <+/1D_H.xwp>
##$LFORMAT= <normlp>
##$PFORMAT= <normpl>
##$SURQMSG= 1
$$ End of Bruker specific parameters
$$ ---------------------------------
##NTUPLES= NMR SPECTRUM
##VAR_NAME=  FREQUENCY,     SPECTRUM/REAL,   SPECTRUM/IMAG
##SYMBOL=    X,             R,               I
##VAR_TYPE=  INDEPENDENT,   DEPENDENT,       DEPENDENT
##VAR_FORM=  AFFN,          ASDF,            ASDF
##VAR_DIM=   131072,        131072,          131072
##UNITS=     HZ,            ARBITRARY UNITS, ARBITRARY UNITS
##FACTOR=    0.0627417313425164, 1,          1
##FIRST=     8223.62146879497, 1862,         -49418
##LAST=      0,             2760,            -49442
##MIN=       0,             -13005,          0
##MAX=       8223.62146879497, 444947223,    0
$$ Real data points
##PAGE= N=1
##DATA TABLE= (X++(R..R)), XYDATA
$$ [...]
64553 70963 71926 72440 72572 72472 71755 70156 68432 67745 68281 69243 70063 70763 71205 71024 70565 70861 72200 73563
64535 73563 74044 74017 74167 74120 73035 71128 69580 68985 68819 68470 68019 67788 67804 67984 68398 69038 69616 69764 69262
64516 69262 68084 66542 65370 65242 66086 67148 67794 67934 67717 67310 67080 67464 68352 68965 68745 68109 68024 68950
64498 68950 70470 71804 72392 72073 71056 69854 69080 69064 69606 70098 70029 69442 68839 68592 68575 68483 68305 68212 68131 67822
64478 67822 67357 67136 67333 67684 67969 68353 69027 69788 70219 70155 69787 69517 69779 70745 71933 72330 71313 69370
64460 69370 67678 66993 67163 67622 67974 68087 67957 67750 67774 68164 68645 68795 68569 68366 68471 68588 68175 67244 66552
64441 66552 66818 67867 68780 68857 68250 67673 67667 68186 68755 68939 68720 68431 68300 68220 68139 68491 69802 71853 73592
64422 73592 74137 73632 72915 72561 72550 72725 73128 73732 74115 73726 72534 71195 70441 70335 70320 70004 69652 69746 70318
64403 70318 70982 71496 71864 71917 71267 69895 68435 67587 67473 67845 68670 70049 71625 72563 72328 71252 70131
64386 70131 69441 69170 69198 69475 69819 69882 69523 69015 68719 68716 68948 69503 70402 71191 71276 70736 70388 70766 71408 71458 70744
64365 70744 69928 69808 70730 72489 74485 76131 77408 78809 80459 81602 81444 80280 79185 78710 78534 78317
64349 78317 78161 78084 77796 77348 77401 78389 79821 80850 81182 81000 80334 79087 77580 76549 76537 77522 79147 81068
64331 81068 83097 85138 87072 88753 90276 92199 95150 99072 103146 106588 109226 111172 112347 112656 112278
64316 112278 111417 110042 108248 106561 105418 104533 103291 101660 100216 99284 98609 97940 97444 97320 97364 97147 96458
64299 96458 95478 94734 94953 96600 99296 101913 103464 103868 103703 103430 103089 102690 102573 103222 104858 107288 110119
64282 110119 113030 115899 118776 121736 124629 126977 128263 128463 128150 127965 128085 128348 128673 128992 128908 127897
64266 127897 126007 123936 122227 120676 118809 116681 114855 113668 112829 111788 110381 109063 108520 108970 109897
64251 109897 110555 110696 110597 110529 110552 110806 111504 112499 113343 114005 115086 117011 119374 121507 123304 125097 126987
64234 126987 128801 130539 132374 134349 136517 139186 142567 146217 149305 151394 152609 153135 153006 152349 151341
64219 151341 149897 147796 145181 142537 140200 138218 136653 135534 134532 133241 131921 131419 132168 133717 135447
64204 135447 137256 139237 141221 143108 145308 148317 151980 155595 158667 161212 163336 164882 165557 165243 164136
64189 164136 162715 161510 160708 159975 158775 156904 154650 152464 150596 149085 148007 147561 147799 148322 148515 148158
64173 148158 147629 147355 147312 147349 147743 148925 150719 152383 153519 154517 156003 158301 161565 165881 170892 175823
64157 175823 180388 185392 191930 200205 209608 219681 230349 241313 251943 261968 271671 281083 289446
64144 289446 295833 299936 301893 301700 299339 295288 290309 284651 277959 270123 261810 253873 246558 239578
64130 239578 232736 226048 219436 212763 206270 200528 195738 191411 187045 182924 179867 178212 177349 176375 174968
64115 174968 173480 172314 171466 170720 170194 170456 172013 174714 177805 180575 182805 184652 186394 188422 191240
64100 191240 195186 200213 206130 212887 220398 228212 235708 242609 249050 255190 261119 267144 273683 280607
64086 280607 287017 292008 295447 297700 298780 298261 296067 292875 289419 285632 280858 274901 268522 262707
64072 262707 257694 253038 248472 244305 240849 237932 235304 233248 232242 232076 231836 231011 230195 230366 231727
64057 231727 233682 235807 238361 241743 245841 250255 254921 260164 266158 272669 279459 286732 295027 304736
64043 304736 315841 327927 340297 352195 363212 373520 383495 393110 401946 409850 417271 424719 432123
64030 432123 438966 444954 450283 455344 460420 465680 471169 476644 481599 485639 488745 491033 492293 492007
64016 492007 489944 486594 482790 478949 474965 470913 467507 465549 465111 465621 466671 468315 470637 473538 477098
64001 477098 481802 488130 496131 505574 516236 527928 540473 553793 567786 582065 596268 610768
63989 610768 626654 644706 664802 686614 710411 736717 765566 796679 830162 866479 905831
63978 905831 948102 993314 1041727 1093591 1149206 1209167 1274179 1344826 1421871 1506596 1600470
63967 1600470 1704908 1822000 1955195 2108505 2285282 2488779 2723960 2997802 3317547
63958 3317547 3689355 4118589 4609893 5165752 5785188 6464382 7198258 7981200 8806857
63949 8806857 9667787 10554495 11453500 12345972 13208757 14017321 14748580 15382774 15904821
63940 15904821 16305063 16578500 16722560 16734864 16612548 16353681 15960056 15439703 14807491
63931 14807491 14083537 13290580 12451480 11587083 10714757 9848380 8999784 8180137 7399910
63922 7399910 6667907 5990610 5372126 4814210 4316315 3875993 3489479 3152035 2858189
63913 2858189 2602305 2379337 2185253 2016821 1870960 1744136 1632463 1532691 1443062 1362890
63903 1362890 1291280 1226648 1167455 1112793 1061987 1014270 969237 927151 888173 851641 816565
63892 816565 782512 749436 716921 684362 651881 620503 591231 564304 539305 515630 492877
63881 492877 471152 451018 432872 416421 401081 386709 373541 361547 350374 339894 330280 321518
63869 321518 313358 305857 299422 294120 289373 284616 279925 275779 272504 270133 268478 267146 265839 264847
63855 264847 264890 266142 267782 268917 269673 270911 273026 275553 277902 279879 281285 281550 280182 277418 274029
63840 274029 270531 266810 262476 257285 251182 244209 236542 228506 220451 212678 205532 199382 194325 190018
63826 190018 185921 181629 176930 171829 166781 162671 160087 158582 157026 154762 152118 149736 147800 146106
63812 146106 144499 142949 141438 140027 138868 137913 136791 135227 133422 131812 130585 129615 128742 127888 127034
63797 127034 126281 125764 125349 124590 123207 121482 119926 118724 117741 116906 116267 115735 115099 114296 113444 112622 111810
63780 111810 111060 110564 110504 110869 111284 111117 110069 108744 108221 108781 109439 109103 107876 106791 106480 106651 106691 106259
63762 106259 105333 104177 103315 103150 103564 104253 105295 106916 108811 110339 111458 112859 114946 117269 119267
63747 119267 121121 123458 126506 129913 133198 136078 138566 141061 144240 148620 154291 161178 169357 178848
63733 178848 189281 200131 211276 223057 235681 248700 261229 272582 282520 290805 296693 299229
63721 299229 298127 294103 288157 280793 272220 263028 254115 245939 238250 230680 223259 216241 209718 203519
63707 203519 197317 190813 184064 177631 172112 167498 163323 159437 156185 153759 151838 150116 148762 148037
63693 148037 147805 147780 147994 148666 149776 151139 152843 155329 159080 164366 171156 179054 187468 196168 205614
63678 205614 216470 228826 242078 255504 268612 280815 291069 298196 301634 301750 299293 294575 287398
63665 287398 277797 266553 254675 242621 230436 218565 207906 198870 190909 183344 176273 170287 165575
63652 165575 161799 158752 156594 155423 155007 155046 155360 155707 155783 155688 156168 157961 160886 163930 166419 168900 172571
63635 172571 177923 184309 190881 197522 204613 212313 220564 229613 239975 251895 265270 280051 296254
63622 296254 313550 331426 349798 368851 388053 405955 421253 433434 442092 446435 446270 442880
63610 442880 438025 432376 425805 418942 413336 409899 408080 406845 405660 404078 401159 395973 388452 379259
63596 379259 369141 358745 348723 339423 330610 321846 313124 304827 297201 290229 283955 278577 274175
63583 274175 270569 267480 264679 262034 259564 257405 255590 254001 252709 252195 253002 255247 258759 263545 269697
63568 269697 276924 284662 292862 302272 313717 327308 342612 359327 377455 396902 417208 437606
63556 437606 457090 474414 488339 498112 503803 506284 506926 507133 507854 509463 512158 516352 522467 530439
63542 530439 539713 549714 560021 570012 578711 585229 589093 589889 586891 579455 567708 552408 534098
63529 534098 512886 489196 464247 439349 414972 391018 367880 346618 327823 310933 295200
63518 295200 281051 269733 261530 254939 248068 240520 233481 228194 224811 222633 220871 218973 216664 214070
63504 214070 211700 210089 209469 209852 211278 213867 217750 222994 229451 236645 244091 251873 260711 271261
63490 271261 283546 297242 312258 328629 345946 363236 379459 393885 406004 415350 421553 424403
63478 424403 423802 419741 412412 402288 390101 376705 362836 348917 335133 321796 309482 298690
63466 298690 289476 281526 274507 268211 262563 257644 253563 250116 246793 243389 240407 238524 237721 237313 236781
63451 236781 236224 236085 236816 238828 242342 247144 252800 259192 266560 275036 284564 295391 308084 322735
63437 322735 338582 354871 371936 390928 412497 436143 460891 486270 512375 539109 565545
63426 565545 590129 611393 628420 640612 647335 648207 643847 636007 626649 616888 607004 597315 588646
63413 588646 581767 576542 571878 566468 559381 549965 537605 522012 503733 484010 463987 444276 425264
63400 425264 407436 391096 376029 361811 348336 335862 324691 315089 307349 301586 297575 295005
63388 295005 293736 293565 294005 294816 296530 299903 304875 310643 316838 324028 332903 343463 355335 368460
63374 368460 383091 399397 417418 437289 459241 483285 508848 534621 558911 580471 598928
63363 598928 614095 625108 630824 631113 627188 620539 612102 602623 593097 584330 576477 569440 563287 557839
63349 557839 552247 545466 536928 526400 513559 498226 480824 462140 442784 423287 404465 387103
63337 387103 371348 356885 343625 331756 321160 311332 301963 293212 285297 278166 271735 266152 261652
63324 261652 258289 255864 254005 252318 250656 249275 248552 248589 249183 250173 251586 253467 255752 258329 261107
63309 261107 263938 266565 268670 269985 270441 270233 269622 268632 267110 265105 263017 261271 260006 259144 258507 257806
63293 257806 256779 255517 254437 253826 253685 254075 255213 257032 259077 261088 263217 265354 266710 266677 265759 265059
63277 265059 265081 265598 266444 267742 269400 271099 272827 274840 277002 278743 279907 281091 282851 284912 286485
63262 286485 287176 287409 288095 289979 293142 297064 301231 305550 310023 314319 318138 321820 325977 330516 334601
63247 334601 337781 340633 344019 348200 353042 358685 365516 373640 382804 392846 403971 416514 430532
63234 430532 445632 461317 477633 495388 515378 537369 560144 582604 604405 625448 645321
63223 645321 663712 680978 697812 714487 730909 747287 764213 782020 800521 819482 838882
63212 838882 858372 876867 893077 906268 916116 921964 922803 918147 908440 894340 876007 853553 827892
63199 827892 800571 772812 745213 718366 693087 669825 648430 628886 611801 597742 586462
63188 586462 577330 570291 565872 564399 565712 569567 575843 584371 595014 607885 623004 639646 656428
63175 656428 672242 686901 700913 714947 729497 744679 760231 775869 791593 807336 822461
63164 822461 836068 847792 857791 865899 871370 873630 872759 868889 861580 850206 834701 815644 793897
63151 793897 770499 746627 723226 700709 679262 659266 641109 624726 609658 595561 582450
63140 582450 570480 559747 550331 542272 535445 529573 524388 519688 515269 510958 506749 502782 499171 495897
63126 495897 492904 490220 488012 486548 486064 486555 487671 488927 490151 491683 494045 497409 501507 506079 511175
63111 511175 516871 522895 528835 534676 540761 547171 553460 559092 563870 567828 571065 573846 576599 579600
63097 579600 582881 586484 590298 593522 595002 594668 594119 595071 597489 599882 601147 601397 601185 600811 600502 600550
63081 600550 601057 602013 603590 605798 607953 609355 610562 613059 617338 622209 626550 630892 636535 643689 651360
63066 651360 658784 666227 674485 684266 695989 709590 724474 740136 756956 776087 798537 824498
63054 824498 853408 884376 916732 950631 987081 1026950 1069859 1114369 1159329 1204792 1251492
63043 1251492 1299688 1348633 1397036 1443852 1488778 1532160 1574570 1616433 1657970 1699363 1740848
63032 1740848 1782591 1824399 1865504 1904701 1940758 1972613 1999042 2018422 2029129 2030225 2021493 2002871
63020 2002871 1974232 1935841 1888695 1834314 1774424 1710993 1646250 1582365 1521091 1463680 1410892
63009 1410892 1363037 1320241 1282790 1251031 1225038 1204729 1190307 1182118 1179906 1182748 1190000 1201842
62997 1201842 1218438 1238969 1262139 1287462 1315406 1346090 1378382 1410572 1441718 1472087 1502376
62986 1502376 1532800 1562974 1592324 1620275 1646043 1668627 1687166 1701018 1709321 1710863 1704761 1690995
62974 1690995 1669859 1641202 1604848 1561547 1512773 1459689 1403198 1345018 1287569 1232197 1178341
62963 1178341 1125175 1073489 1025242 981640 942437 906866 874543 845402 819309 795853 774345
62952 774345 754233 735726 719712 706627 695645 685403 675261 665478 656426 648257 641155 635268
62940 635268 630291 625569 620732 615920 611384 607157 603116 599048 594687 589942 585098 580543 576330 572199
62926 572199 567953 563639 559437 555517 551856 548069 543711 538914 534364 530357 526222 521123 515098 508844
62912 508844 502811 497087 491934 487743 484524 482019 480281 479504 479282 478693 477313 475617 474181 473028 471956
62897 471956 471020 470296 469469 468029 465732 462676 459118 455365 451698 448212 444791 441312 437727 434025 430269
62882 430269 426753 423846 421643 419959 418744 418245 418628 419579 420447 420711 420285 419451 418603 418046 417993 418683 420278
62865 420278 422594 425086 427266 429059 430707 432452 434402 436475 438338 439606 440224 440434 440242 439299 437536
62850 437536 435571 434136 433348 432876 432455 431847 430604 428431 425647 422841 420241 417851 415941 414816 414199
62835 414199 413475 412482 411539 410753 409845 408687 407455 406222 404932 403759 402952 402241 401024 399204 397301 395639
62819 395639 394024 392381 391051 390228 389643 389089 388682 388382 387910 387457 387869 389645 392279 395094 398167 401859
62803 401859 405876 409609 413184 417424 422815 429149 436185 444054 452839 462310 472372 483384 495781
62790 495781 509626 524836 541629 560406 581261 604005 628792 656438 687877 723403 762747
62779 762747 805837 853127 905062 961606 1022614 1088320 1158939 1233771 1311168 1389465 1467525
62768 1467525 1544146 1617270 1684130 1742207 1789888 1826270 1850467 1861297 1857816 1840216 1810049
62757 1810049 1769318 1719435 1661237 1595902 1525458 1452302 1378381 1304912 1232702 1162593 1095561
62746 1095561 1032326 972990 917304 865347 817576 774098 734303 697552 663808 633177 605264
62735 605264 579582 556235 535504 516961 499762 483670 469070 456073 444423 434267 426013 419272
62723 419272 412921 406652 401539 398562 397319 396819 396839 397700 399204 400727 402241 404564 408574 414525 422058
62708 422058 430573 439813 450302 463012 478362 495940 515487 537653 563318 592587 625039 660664
62696 660664 699907 742946 789478 839121 891505 946070 1002249 1059776 1118255 1176343 1231743
62685 1231743 1282046 1325297 1359942 1384744 1398949 1402310 1394934 1377340 1350539 1315716 1273898 1226188
62673 1226188 1174197 1119791 1064392 1008832 953814 900139 848505 799433 753433 710929 671997
62662 671997 636428 604010 574519 547539 522633 499651 478577 459212 441397 425373 411424
62651 411424 399236 388188 378223 369725 362410 355149 347277 339422 332429 326030 319296 312048 305040 298844
62637 298844 293353 288446 284376 281117 277949 274203 270096 266355 263213 260276 257329 254752 253004 252073
62623 252073 251667 251689 252230 253185 254156 254783 255077 255391 256118 257483 259607 262693 266888 271788 276348 279773 282578
62606 282578 286345 292179 299723 307940 316512 326080 337410 350808 366203 383306 401765 421616 443603
62593 443603 468610 496801 527714 561123 597217 635815 675998 716748 757485 797674 836320
62582 836320 872075 903489 928890 946560 955568 956261 949649 936523 917489 893503 865856 835679
62570 835679 803778 770816 737324 703662 670325 638220 608281 580828 555547 532098 510453
62559 510453 490649 472484 455645 439987 425566 412302 399708 387119 374375 362137 351215
62548 351215 341652 332814 324313 316344 309004 301905 294864 288511 283606 280058 277139 274566 272798 272186
62534 272186 272317 272461 272454 272904 274495 277186 280239 283126 286231 290380 295813 302060 308793 316207 324403 333069
62518 333069 342211 352666 365413 380769 398713 419457 442977 468359 494524 521512 550320 581420
62506 581420 614118 647309 680061 711278 739588 763999 784205 799925 810410 814945 813463 806326
62494 806326 793883 776616 755434 731437 705496 678352 650893 624045 598501 574740 552984
62483 552984 532856 513413 494166 475980 460357 447677 436690 426029 415732 406876 400072 394877
62471 394877 390545 386697 383188 379956 377265 375552 374683 373878 372932 373051 375635 380347 385210 388823 391822
62456 391822 395860 401762 409075 416908 424613 431837 438506 444831 451046 457053 462351 466221 467976 467239
62442 467239 464083 458736 451205 441495 430146 418086 405853 393474 381209 369826 359764 350612
62430 350612 341853 333672 326509 320272 314628 309775 306326 304608 304515 305841 308193 310847 313297 315874 319255
62415 319255 323506 328188 333338 339624 347407 356228 365368 374486 383465 392039 399805 406470 411940 416332
62401 416332 419884 422741 424848 426202 426971 427180 426518 424728 421897 418050 412872 406374 399513 393464 388380
62386 388380 383569 378893 375303 373810 374461 376535 379350 382738 387122 393278 401795 412725 425948 441674
62372 441674 460198 481409 505076 531529 561435 594903 631374 670389 711858 755511 800566
62361 800566 845998 890619 932876 971147 1004254 1031138 1050258 1060298 1061688 1056539 1046727 1032774
62349 1032774 1014879 993967 970923 945479 916821 885050 851399 817294 783829 751849 721785
62338 721785 693409 666351 640943 618076 598152 580545 564211 548633 534069 521040 509647
62327 509647 499417 489874 481150 473789 467959 463238 459288 456290 454424 453342 452558 452064 452110 452485 452445 451389
62311 451389 449292 446451 443053 439076 434471 429321 423824 418139 412321 406511 401133 396672 393280 390795
62297 390795 389108 388310 388462 389527 391584 394761 398930 403714 408850 414261 419777 425226 430874 437322 444713
62282 444713 452403 459631 466217 472454 478721 485448 493085 501779 511371 521904 533841 547489 562564
62269 562564 578690 596075 615332 636919 661116 688338 718984 753051 790208 830097 872108
62258 872108 914870 956320 994429 1027678 1054889 1074925 1086854 1090469 1086622 1076875 1062592 1044222
62246 1044222 1021538 994531 963910 930812 896345 861471 827013 793578 761651 731802 704567
62235 704567 680072 658133 638817 622536 609409 598859 590091 582709 576675 571874 567946 564397 560773
62222 560773 556942 553267 550205 547733 545465 543323 541631 540479 539568 538825 538587 538919 539432 540150 541903 545311
62206 545311 549909 554891 560316 566949 575276 585301 596986 610217 624568 639829 656628 675945
62194 675945 698127 722943 750327 780218 811655 842820 872117 898596 921330 939229 951809
62183 951809 959522 962996 962588 959135 954517 950775 948840 948665 950448 955196 964085 977737 996150 1018886
62169 1018886 1045002 1073028 1101270 1128165 1152253 1172165 1187042 1197068 1203276 1206663 1207660 1206447
62157 1206447 1203336 1198429 1191187 1180904 1167618 1152219 1135699 1118735 1101983 1086176 1071735 1058633
62145 1058633 1046839 1036500 1027542 1019494 1011967 1004947 998425 992082 985577 978839 971931 965089 959058
62132 959058 954877 952987 952917 954069 956301 959475 963137 967190 972346 979266 987712 997188 1007918 1020412
62118 1020412 1034401 1049113 1064394 1080715 1098089 1115863 1133696 1152053 1171524 1192252 1214211
62107 1214211 1237496 1262127 1287972 1315050 1343580 1373667 1405321 1438857 1474980 1514350 1557217
62096 1557217 1603206 1650988 1698292 1742930 1784161 1822939 1860992 1900048 1941689 1987116 2036658
62085 2036658 2089647 2144687 2199737 2252281 2300264 2343138 2381609 2416432 2447971 2476879 2504405
62074 2504405 2531723 2559485 2588173 2618287 2649799 2681936 2713854 2745121 2775281 2803497 2829159
62063 2829159 2852548 2874435 2895193 2914632 2932585 2949314 2965364 2981170 2996751 3011740 3025808
62052 3025808 3039091 3052028 3064903 3077856 3091261 3105589 3120809 3136402 3152195 3168728 3186506
62041 3186506 3205194 3223825 3241542 3257925 3272886 3286547 3298998 3309986 3319039 3326014 3331268 3335090
62029 3335090 3337299 3337564 3335802 3332020 3326102 3318123 3308618 3298274 3287468 3276412 3265480 3255136 3245675
62016 3245675 3237322 3230393 3225060 3221107 3218273 3216776 3217287 3220471 3226777 3236569 3250153 3267562 3288423
62003 3288423 3311990 3337270 3363216 3388876 3413234 3434877 3452095 3463523 3468576 3467296 3460137 3448140
61991 3448140 3432878 3415730 3397282 3377777 3357949 3338862 3320914 3303469 3285699 3267412 3248828
61980 3248828 3229846 3209927 3188694 3166323 3143238 3119528 3094780 3068460 3040450 3011243 2981667
61969 2981667 2952357 2923432 2894674 2866025 2837783 2810180 2782855 2755104 2726759 2698593 2671622
61958 2671622 2646240 2622266 2599705 2579002 2560491 2543952 2528904 2515232 2503373 2493946 2487271 2483216
61946 2483216 2481509 2482108 2485096 2490192 2496731 2504410 2513779 2525577 2539749 2555644 2573113 2592768 2615022
61933 2615022 2639386 2665092 2691921 2719979 2748908 2777887 2806434 2834889 2864192 2895625 2930966
61922 2930966 2972615 3023225 3085078 3159878 3249158 3354788 3479044 3624307 3792918 3987407
61912 3987407 4210745 4466376 4758246 5090898 5469324 5898349 6381933 6922408 7518971
61903 7518971 8165242 8847056 9541686 10218219 10838611 11360490 11743135 11955408 11982041 11825612
61893 11825612 11504503 11048442 10492887 9873374 9221309 8562009 7914584 7292756 6705941
61884 6705941 6160083 5658041 5200058 4784840 4410539 4074747 3774021 3504425 3262858
61875 3262858 3047401 2856150 2686313 2534832 2399418 2278572 2170971 2075326 1990606 1915878
61865 1915878 1849985 1791755 1740506 1696109 1658537 1627526 1602563 1583037 1568464 1558666 1553599 1552866
61853 1552866 1555554 1560647 1567450 1575406 1583674 1591056 1596401 1599138 1599554 1598492 1596484 1593251 1588354 1582261
61839 1582261 1576349 1571820 1569088 1568316 1569909 1574177 1580886 1589441 1599058 1608514 1616259 1621208 1623089 1621789
61825 1621789 1617020 1609167 1599821 1590655 1582059 1573694 1566096 1560735 1558430 1558543 1559965 1562161 1565020 1568461
61811 1568461 1572806 1579171 1588978 1603192 1622229 1646334 1675756 1710715 1751438 1798085 1850515 1908380
61799 1908380 1971717 2041297 2118207 2203242 2296905 2399805 2512776 2636849 2773503 2924965
61789 2924965 3093855 3282448 3492698 3727243 3990211 4286791 4622271 5001927 5431866
61780 5431866 5919536 6473181 7100969 7810747 8610071 9505378 10499901 11590963 12767198
61771 12767198 14005658 15269023 16504235 17644457 18615456 19345901 19779332 19884455 19660439
61762 19660439 19135517 18359811 17395359 16306620 15153186 13984966 12839791 11743699
61754 11743699 10713364 9758788 8884667 8090997 7374484 6730603 6154495 5640401 5181594
61745 5181594 4771734 4405873 4079546 3787582 3524944 3288554 3077252 2889697 2723065
61736 2723065 2573983 2439948 2319409 2211053 2113584 2025973 1947527 1877704 1815924 1761376
61726 1761376 1712977 1669701 1630771 1595177 1561268 1527504 1493704 1460896 1429855 1400420 1372407
61715 1372407 1346337 1322764 1301485 1281993 1264246 1248379 1234008 1220393 1207172 1194411 1182047
61704 1182047 1169705 1157075 1144171 1131141 1117977 1104394 1089978 1074606 1058676 1042718 1026873
61693 1026873 1011154 996073 982367 969970 957899 945416 932733 920335 908287 896637 885853
61682 885853 876270 867615 859628 852617 846695 841008 834661 828225 823452 821452 821714 822878 823836 824084 823695
61667 823695 823228 823267 823814 824309 824215 823413 822137 820890 820314 820705 821652 822431 822746 822840 822984 823094 822835 821832 819883
61648 819883 817116 813844 810091 805569 800304 794943 790147 785983 782313 779382 777519 776556 776151 776564 778537
61633 778537 782448 788090 795263 804092 814619 826437 838800 850888 862096 872286 881571 889591 895254
61620 895254 897650 897013 894373 890539 885899 880928 876083 871209 865677 859237 852187 844668 836409 827393
61606 827393 818208 809451 801116 792864 784623 776667 769200 762065 754827 747182 739281 731590 724395 717700
61592 717700 711710 706974 703731 701466 699521 697903 697012 696879 697181 697872 699272 701690 705429 710942 718375
61577 718375 727106 736332 746100 757210 770225 785226 802432 822163 843996 866675 889288 912124
61565 912124 936123 961765 988691 1016045 1043019 1069349 1095330 1121133 1146204 1169781 1191925
61554 1191925 1213541 1235318 1257067 1278150 1298062 1316573 1333733 1349798 1364718 1377645 1387420
61543 1387420 1393562 1396349 1395887 1391686 1383314 1371011 1355541 1337834 1318862 1299400 1279793 1260259
61531 1260259 1241426 1224190 1209095 1196251 1185733 1177497 1171041 1165830 1162122 1160702 1161841 1165229 1171001
61518 1171001 1180057 1193222 1210852 1233379 1261376 1294742 1332698 1375108 1423182 1478486 1541935
61507 1541935 1614211 1696466 1789958 1895534 2014078 2147058 2296102 2462311 2646305 2848361
61497 2848361 3067689 3301521 3544928 3791000 4030912 4254502 4451648 4613386 4732257
61488 4732257 4803023 4824134 4798313 4731148 4629257 4499753 4350243 4188007 4019110 3848715
61478 3848715 3681673 3521950 3371724 3231898 3103441 2987609 2885045 2795526 2718666 2654246
61468 2654246 2601724 2560102 2528587 2507025 2495472 2493612 2500727 2515946 2538399 2567220 2601556 2640539
61456 2640539 2683262 2728753 2775822 2823001 2868962 2913087 2955343 2995592 3033493 3069268 3104028
61445 3104028 3138994 3174753 3211549 3249859 3290245 3332972 3378156 3425871 3475668 3526335 3576525
61434 3576525 3625302 3671695 3714163 3751046 3781106 3803196 3815935 3818480 3811260 3795223 3770700 3737861
61422 3737861 3697995 3653386 3605928 3556701 3506811 3457683 3410401 3365653 3324547 3288658 3258909
61411 3258909 3235117 3216902 3204317 3197251 3194950 3196625 3201875 3209911 3218925 3226894 3232727 3236083 3236455
61398 3236455 3233108 3225733 3214619 3200320 3183783 3166725 3151227 3138868 3130719 3128282 3133784 3149351
61386 3149351 3176381 3216063 3270042 3340039 3427122 3531956 3655694 3800011 3966093 4153944
61376 4153944 4362726 4591161 4837053 5096501 5363672 5631029 5889430 6128491 6337748
61367 6337748 6508197 6633390 6709998 6738147 6721046 6663528 6570415 6446044 6294630 6120231
61357 6120231 5926331 5716097 5493236 5262072 5026675 4790415 4556431 4327915 4107683
61348 4107683 3897985 3700830 3517864 3349644 3195771 3056084 2931045 2820524 2723083 2637305
61338 2637305 2563223 2501527 2451738 2412193 2381746 2360519 2348836 2346152 2351326 2363421 2381963 2406678
61326 2406678 2437103 2472317 2511068 2552405 2595941 2641143 2686616 2730648 2772455 2812411 2851059
61315 2851059 2888273 2923364 2955513 2984060 3008769 3029927 3047926 3062772 3074306 3082789 3088801 3092562
61303 3092562 3093758 3092088 3087541 3080023 3069124 3054481 3036165 3014467 2989385 2960454 2927136 2889453
61291 2889453 2848195 2804292 2758097 2709779 2660514 2612517 2567392 2525098 2485206 2448622 2417126
61280 2417126 2391524 2371303 2355937 2345346 2338901 2335115 2332759 2331491 2331023 2330489 2329133 2326778 2322999
61267 2322999 2316502 2306002 2291200 2272354 2249592 2223499 2195872 2168840 2143524 2120555 2101761
61256 2101761 2090107 2087625 2094355 2109791 2134622 2170447 2218415 2278866 2351924 2437556 2534994 2642681
61244 2642681 2758835 2881574 3008312 3135359 3258138 3371299 3468438 3542478 3587171 3598590
61234 3598590 3575354 3518105 3429505 3314613 3180430 3034450 2883393 2732831 2587119 2449185
61224 2449185 2320601 2202171 2094345 1997008 1909200 1829500 1756778 1690555 1630727 1577090 1529161
61213 1529161 1486504 1449247 1418002 1392994 1373409 1358011 1346295 1338607 1335223 1335974 1340792 1349833
61201 1349833 1362584 1377370 1392253 1406147 1418790 1430146 1440239 1449207 1457042 1463546 1468821 1473327
61189 1473327 1477046 1479111 1478766 1476168 1471542 1464018 1452240 1435954 1416150 1393777 1369183 1342831 1315648
61176 1315648 1288394 1261322 1234709 1209046 1184424 1160327 1136470 1113434 1092095 1072699 1054828
61165 1054828 1037998 1021941 1006442 991265 976323 961791 948030 935395 923958 913237 902110
61154 902110 889086 872969 853589 831928 809265 786213 762874 739793 718135 698734 681572
61143 681572 666475 653669 643183 634351 626560 620084 615510 612738 611225 610846 611728 613549 615814 618729
61129 618729 622959 628649 635424 643238 652393 662673 673270 683735 694390 705689 717694 730177
61117 730177 742673 754467 765194 775386 785768 796075 805215 812437 817533 820026 819282 815653 810567
61104 810567 805140 799397 793059 786218 778972 771216 763181 755437 748027 740275 731845 723307 715296 707720
61090 707720 700164 692389 684138 675136 665646 656343 647253 637557 626918 616267 606661 597957 589255 580193
61076 580193 571261 563278 556988 552794 550417 549135 548630 549178 550791 552809 554609 556161 557585 558899 560507
61061 560507 563140 566813 570585 573848 577131 581050 585319 589510 594054 599610 605982 612460 618777 625007
61047 625007 630986 636708 642856 650108 658168 666143 673633 680864 688215 696313 706125 718071 731229 744088
61033 744088 755908 766845 777195 787209 797340 807941 818855 829769 840604 851106 860624 868922
61021 868922 876723 884851 893381 902295 912238 923797 936700 950699 966691 985940 1008747 1034940
61009 1034940 1065127 1100181 1139801 1182642 1227530 1273642 1320302 1368129 1419995 1479333 1547717
60998 1547717 1625335 1713158 1812804 1924616 2047823 2182606 2330367 2492647 2672506 2877359
60988 2877359 3118219 3406093 3751862 4170074 4679950 5302744 6062982 6994892 8144727
60979 8144727 9566056 11316135 13447384 15965144 18747267 21491952 23784744 25284925
60971 25284925 25903088 25829742 25409581 24986579 24823995 25077858 25748990 26622937 27297391
60962 27297391 27347337 26533634 24899434 22698247 20240333 17778300 15473894 13411018
60954 13411018 11615861 10076613 8764977 7651967 6711819 5920327 5255627 4699869 4237362
60945 4237362 3851627 3526152 3247497 3006074 2794332 2605747 2435477 2280586 2139204
60936 2139204 2010014 1892341 1785846 1689828 1603190 1524907 1453959 1388723 1326884 1266198 1205408
60925 1205408 1144748 1085860 1030903 981204 936647 896382 859822 826717 796695 769336 744601
60914 744601 722650 703197 685467 668875 653476 639606 627354 616464 606577 597526 589507 582935
60902 582935 577919 573896 570031 565986 562121 558963 556727 555351 554721 554698 555170 556188 557956 560584 564000
60887 564000 568138 573052 578767 585180 592197 599749 607494 614692 620571 624815 627579 629107 629445 628463 626052
60872 626052 622316 617631 612398 606680 600230 592996 585455 578310 571960 566432 561723 557928 555013 552647
60858 552647 550368 548052 546244 545904 547571 550763 554495 558430 563162 569288 576750 585397 595617 607749
60844 607749 621159 634562 647146 658750 669222 678449 687093 696436 707109 718568 730033 741291
60832 741291 752189 762022 770005 776008 780332 783152 784685 785603 786754 788574 791084 794148 797374 800060
60818 800060 801729 802504 802621 801887 800085 797524 794580 790937 785897 779291 771429 762314 751651 739672
60804 739672 727278 715199 703639 692837 683290 675114 667765 660787 654472 649415 645770 643341 642186
60791 642186 642707 645073 648810 652992 656923 660722 665163 670689 676646 681776 685466 688181 690642 693046
60777 693046 695218 697160 699111 701265 703669 706309 709184 712387 716083 720243 724546 728936 734256 741700
60763 741700 751397 761956 771731 780247 788113 795936 803790 811499 818840 825442 830956 835551 839989 844998
60749 844998 850626 856287 861374 865714 869405 872322 874036 874346 873735 873058 872807 872839 872717 872029 870402 867626
60733 867626 863827 859266 853835 847112 839040 830236 821404 812692 803796 794416 784430 773930 763331 753161
60719 753161 743446 733597 723190 712597 702467 692855 683358 673877 664720 656008 647593 639610 632587
60706 632587 626841 622291 619047 617631 618277 620494 623802 628531 635313 643954 653405 662751 671605 679571
60692 679571 686029 690743 694030 695872 695424 692006 686188 679187 671375 662219 651602 640339 629141 617872
60678 617872 606306 594957 584571 575281 566912 559730 554158 549971 546526 543723 542064 541696 542155 543229
60664 543229 545386 548948 553357 557710 561633 565176 568130 570072 571126 572261 574616 578607 583759 589344
60650 589344 595066 601018 606997 612156 615630 617455 618568 619944 622035 624930 628546 632550 636513 640478
60636 640478 645059 650810 657814 666051 675688 686581 697891 708792 719455 730720 742733 754344
60624 754344 764089 771504 777375 782892 788735 794710 800061 804077 806497 807444 807158 805895 803950 801530 798663
60609 798663 795405 792046 788858 785645 781911 777551 773058 768783 764215 758389 750912 742353 733650 725425
60595 725425 717920 711250 705456 700429 695996 692083 688796 686454 685584 686582 689140 692223 694986 697561 700647
60580 700647 704368 707995 710816 712793 714246 715351 716220 717038 717717 717659 716301 713747 710532 706939 702912
60565 702912 698444 693632 688352 682314 675543 668519 661788 655600 649934 644638 639601 635030 631579 629986
60551 629986 630540 632996 636864 641660 647122 653591 662106 673719 688745 706940 728367 753731 783941
60538 783941 819595 860647 905888 952507 996628 1034642 1064042 1083268 1091340 1087990 1073930 1050926
60526 1050926 1021735 989839 958653 930613 907036 888637 875818 868487 866111 868102 873786 882040
60514 882040 891460 901093 910631 919855 928428 936376 944221 952413 961158 971113 983656 1000065 1020905
60501 1020905 1046669 1078596 1118370 1167386 1226837 1298121 1382500 1480558 1592589 1719395 1862166
60490 1862166 2021905 2199875 2398856 2623300 2877686 3164348 3481663 3822196 4170940
60481 4170940 4505405 4798734 5024659 5161963 5197454 5127719 4959831 4710376 4402444 4061305
60471 4061305 3710143 3367104 3044172 2747676 2479783 2240257 2027824 1840802 1677101
60462 1677101 1534176 1409359 1300424 1205788 1124054 1053420 991730 937208 889013 846874 810243
60451 810243 778107 749611 724501 702775 684158 668124 654134 641545 629605 617952 606925
60440 606925 596926 587599 578116 568263 558687 549988 542007 534255 526705 519902 514431 510396 507328 504638
60426 504638 502254 500626 499923 499526 498801 498084 498297 499724 501876 504500 507873 511900 515781 519009 522036
60411 522036 525467 529183 532834 536662 541097 545831 549992 553188 555873 558632 561512 564157 566401 568591
60397 568591 571320 574866 579017 583572 588656 594119 598918 601931 603444 605046 607792 611191 614249 616678
60383 616678 618569 619695 619927 619814 619954 620127 619685 618512 616989 615318 613519 611821 610478 609432 608675 608635
60367 608635 609656 611363 613166 615040 617196 619371 621219 623145 625901 629517 633481 637845 643230 649667
60353 649667 656366 662788 669207 676011 683169 690611 698399 706225 713302 719042 723334 725994 726613 725290
60339 725290 722936 720415 717746 714562 710938 707419 704527 702590 701814 702189 703510 705723 709021 713410 718378
60324 718378 723217 727446 730736 732640 732706 730813 727302 722797 717913 712985 708099 703476 699625 696782 694338
60309 694338 691306 687393 683259 679697 676981 675045 673752 672800 671913 671389 672088 674430 677680 680539 682250
60294 682250 682899 682898 682504 681786 680823 679936 679734 680672 682484 684307 685545 686376 687269 688307 689313 690397 691986
60277 691986 694318 697104 699709 701592 702711 703677 705406 708432 712552 717164 721856 726665 732036 738742
60263 738742 747612 758932 772075 785932 799865 814181 829708 847091 866592 888395 912793 939914
60251 939914 969502 1001288 1035642 1073548 1115788 1162370 1213020 1268038 1328375 1394921 1468059
60240 1468059 1547935 1634812 1728911 1829951 1936848 2047837 2160890 2274124 2385808 2493985
60230 2493985 2596297 2690449 2774849 2848692 2911415 2962241 3000178 3024358 3034410 3030653 3013982
60219 3013982 2985668 2947401 2901486 2850693 2797799 2745463 2696464 2653427 2617953 2590377 2570808
60208 2570808 2560105 2559507 2569786 2591424 2625403 2673079 2735233 2811591 2901080 3001945 3111743
60197 3111743 3227950 3348679 3472171 3595483 3714297 3824286 3922236 4005800 4072939 4122133
60187 4122133 4152701 4164392 4156895 4130169 4085173 4023979 3949224 3863665 3770224 3672274 3573733
60176 3573733 3478586 3390018 3310026 3240095 3182174 3138727 3111857 3102641 3111155 3136645 3177643 3232326
60164 3232326 3298819 3374804 3456879 3540859 3622862 3699707 3768308 3825544 3869303 3899341 3916656
60153 3916656 3922159 3916138 3898741 3870655 3833460 3789665 3742353 3694641 3649458 3609618 3577715 3555695
60141 3555695 3544773 3545841 3559871 3588047 3631894 3693370 3774493 3876842 4001683 4150445 4324434
60130 4324434 4524013 4748589 4997615 5271009 5568244 5887429 6225483 6578657 6942454
60121 6942454 7311423 7679426 8039871 8385552 8708875 9002928 9262235 9482299 9658823
60112 9658823 9787823 9866064 9890920 9860255 9773302 9631813 9439976 9203414 8928799 8624320
60102 8624320 8299719 7965291 7630797 7305104 6996140 6710593 6453413 6227692 6035070
60093 6035070 5876417 5752196 5662189 5604998 5578122 5578765 5604478 5653079 5722216 5809009 5909576
60082 5909576 6018549 6129397 6235775 6332640 6415983 6482006 6527209 6549404 6548242 6524656 6479956
60071 6479956 6415395 6332119 6231264 6114087 5982115 5837132 5681199 5516841 5347120 5175308
60061 5175308 5004438 4837335 4676925 4526090 4386994 4260709 4147766 4049079 3966146 3900334
60051 3900334 3852205 3821809 3809481 3815950 3841588 3885972 3948456 4028697 4125953 4237962 4361061
60040 4361061 4491432 4625631 4759780 4888913 5007652 5111361 5196488 5260293 5300737 5316470
60030 5316470 5306631 5270816 5209713 5125628 5022047 4902646 4770903 4630475 4485457 4340073
60020 4340073 4198294 4063716 3939408 3827489 3728930 3643984 3572975 3516605 3475520 3449858
60010 3449858 3439485 3444645 3466113 3504665 3560765 3634946 3728058 3840686 3972385 4121749 4286936
59999 4286936 4465582 4654131 4847623 5040166 5225424 5396936 5548731 5676117 5775885 5845820
59989 5845820 5884274 5890097 5862697 5802305 5710658 5591509 5450148 5292417 5124340 4952217
59979 4952217 4782235 4619707 4469037 4334183 4218377 4123207 4048650 3994199 3959452 3943541
59969 3943541 3944826 3961761 3993701 4040541 4101883 4176814 4264012 4361672 4467484 4578807 4692595
59958 4692595 4805236 4913064 5013282 5104061 5183791 5250879 5304404 5344304 5370757 5384051 5385299
59947 5385299 5376589 5360283 5339047 5316947 5299486 5291853 5297823 5320900 5365568 5436396 5536550 5668173
59935 5668173 5833789 6036256 6277539 6558361 6878762 7237834 7632480 8056704 8501683
59926 8501683 8955687 9403933 9829393 10214233 10540849 10792791 10956593 11023948 10992655 10866279
59916 10866279 10653627 10368013 10025488 9642619 9235304 8818516 8405561 8006820 7629490
59907 7629490 7278702 6958610 6672472 6422327 6208940 6031988 5890416 5783112 5709437 5669030
59897 5669030 5661257 5685221 5740265 5825987 5941531 6084833 6252383 6439394 6640112 6847813
59887 6847813 7054225 7249067 7420907 7559058 7654708 7700637 7691339 7624699 7503296 7333302
59877 7333302 7122217 6878108 6610156 6328319 6041846 5758492 5484885 5226550 4987108
59868 4987108 4768021 4569537 4391498 4233055 4092044 3965139 3848737 3739803 3636184
59859 3636184 3536399 3439412 3345031 3254492 3170010 3093310 3024953 2965296 2915347 2875987 2846883
59848 2846883 2826911 2815130 2810311 2809715 2809307 2805260 2794701 2775503 2746592 2708691 2663915 2614424
59836 2614424 2561962 2508497 2456245 2406848 2361285 2320662 2286285 2258891 2238660 2226072 2221673
59825 2221673 2224648 2232678 2243879 2258266 2276892 2300460 2329492 2365181 2409039 2461611 2521809 2587120
59813 2587120 2654136 2719299 2779722 2833363 2878530 2913893 2939219 2955423 2963349 2963002 2954603 2940086
59801 2940086 2922920 2906518 2893161 2884179 2880527 2883134 2893175 2912335 2942765 2986724 3046182 3122673
59789 3122673 3217645 3333194 3472488 3639336 3837485 4070562 4342206 4655135 5009247 5400052
59779 5400052 5817527 6244343 6654286 7013958 7289288 7454044 7496062 7419146 7240947 6987728
59769 6987728 6687738 6366065 6042696 5732617 5445845 5187371 4958332 4758155 4585848
59760 4585848 4439878 4317996 4217853 4137552 4075374 4029381 3997878 3980236 3976853 3988169 4013935
59749 4013935 4053490 4106432 4172808 4252881 4347038 4455957 4580556 4721804 4880776 5058899
59739 5058899 5257869 5479306 5724814 5996484 6297024 6629233 6995532 7397902 7837674
59730 7837674 8315004 8828658 9376169 9953314 10552796 11163678 11772570 12365417 12928768
59721 12928768 13451214 13925681 14351215 14732654 15079063 15402648 15718059 16040940 16386011
59712 16386011 16765765 17189401 17661344 18180285 18739887 19330020 19936694 20541580 21123216
59703 21123216 21659560 22129846 22515652 22802700 22983061 23055855 23026521 22906373 22712288 22464606
59693 22464606 22183931 21889713 21601040 21336737 21113569 20944893 20841441 20812529 20866111 21008678
59683 21008678 21246074 21584036 22027452 22579423 23241105 24011199 24884115 25847844 26882646
59674 26882646 27960073 29042017 30081123 31023434 31812534 32394732 32725820 32778343 32546025
59665 32546025 32043446 31302634 30368888 29295818 28139366 26952329 25780794 24661670
59657 24661670 23620439 22670013 21811193 21033196 20313607 19620375 18918345 18178401 17384567
59648 17384567 16536381 15646871 14737448 13831512 12949378 12106178 11311911 10572018 9888365
59639 9888365 9260808 8688331 8168883 7699000 7274528 6891695 6547106 6237164 5958279
59630 5958279 5707571 5482900 5282294 5103782 4945623 4806258 4684194 4578297 4487901 4412116
59620 4412116 4349174 4296833 4253198 4216648 4185105 4155840 4125886 4092351 4052617 4004813 3948130
59609 3948130 3882516 3808324 3726601 3639363 3549000 3457355 3365598 3274823 3186478 3102377 3024420
59598 3024420 2953960 2891132 2835181 2785796 2743823 2710263 2684922 2666517 2653919 2646987 2646387 2652912
59586 2652912 2666521 2685637 2707732 2731017 2755220 2780336 2805282 2828491 2849429 2868653 2886651
59575 2886651 2903609 2920358 2938670 2960273 2986056 3016408 3051879 3093299 3141600 3197754 3262649
59564 3262649 3336925 3421081 3515795 3622100 3741386 3875282 4025276 4192101 4375611 4575357
59554 4575357 4791059 5022345 5268323 5527614 5798300 6077285 6359994 6641257 6916537
59545 6916537 7182118 7434504 7670382 7887324 8084121 8259992 8413158 8539946 8635673 8697374
59535 8697374 8726409 8728365 8710353 8678661 8638808 8596574 8558174 8529991 8518913 8532282 8576314
59524 8576314 8654360 8766921 8912526 9087208 9282920 9487440 9686438 9865650 10011671 10112176
59514 10112176 10156592 10137013 10048778 9890807 9665707 9379469 9040913 8661226 8253288 7830413
59504 7830413 7404846 6986794 6584185 6202926 5847476 5521265 5226362 4962785 4728841
59495 4728841 4522582 4342598 4187290 4054341 3941722 3848816 3775745 3721850 3685647 3666153
59485 3666153 3663540 3678448 3711220 3761794 3829856 3915067 4017571 4138310 4278499 4438823 4619250
59474 4619250 4819183 5037289 5271311 5518332 5774764 6035458 6293027 6538530 6762673
59465 6762673 6956158 7109813 7215771 7268959 7267239 7210530 7100629 6941784 6740596 6505053
59455 6505053 6243817 5965904 5679886 5392800 5109898 4835238 4572003 4322348 4087542
59446 4087542 3868451 3665694 3479497 3309737 3155953 3017092 2891672 2778650 2677783
59437 2677783 2588642 2509783 2439555 2377373 2323437 2277596 2239255 2208065 2183710 2165172 2151142
59426 2151142 2141114 2135250 2133296 2134560 2138957 2147058 2158900 2173569 2190242 2209100 2230994 2256518
59414 2256518 2284986 2313500 2337456 2353373 2361812 2366973 2373507 2384404 2401513 2426446 2460349 2503697
59402 2503697 2556580 2618060 2684852 2752134 2816996 2880894 2948306 3023693 3110278 3210689 3327384
59391 3327384 3462397 3617415 3794185 3994666 4221164 4476714 4765013 5089520 5452775
59382 5452775 5856677 6302653 6790649 7317790 7877931 8461895 9057692 9651281 10228509
59373 10228509 10777208 11288015 11754198 12171877 12540667 12863488 13145080 13390308 13603371
59364 13603371 13787695 13945482 14076676 14178303 14245240 14271912 14253299 14184669 14061613 13881634
59354 13881634 13645989 13359636 13029463 12662887 12267501 11850535 11417701 10972665 10517880
59345 10517880 10055717 9588927 9120839 8655648 8198265 7753450 7325124 6916595 6531066
59336 6531066 6171500 5839917 5536852 5261441 5012113 4787419 4586344 4407951 4251013
59327 4251013 4114177 3996213 3895798 3811278 3740959 3683511 3637887 3603201 3578954 3565041 3561128
59316 3561128 3566452 3580678 3604428 3638318 3681872 3734056 3794337 3862206 3936015 4013420 4092880
59305 4092880 4173586 4253797 4330340 4400086 4461117 4512258 4552436 4580982 4597898 4603491 4598438 4584609
59293 4584609 4565249 4543961 4523794 4507360 4497144 4495390 4504100 4525190 4560161 4609666 4674051 4754233
59281 4754233 4851160 4964198 5090711 5227260 5370265 5515191 5655809 5784601 5893580 5975374
59271 5975374 6025258 6043021 6032205 5997127 5941296 5868476 5783597 5691581 5596111 5500300 5407634
59260 5407634 5321315 5243287 5174618 5116185 5068123 5029207 4997686 4972341 4951961 4934297 4916503
59249 4916503 4896463 4872992 4845088 4811888 4773475 4731099 4686511 4641469 4597811 4557617 4523256
59238 4523256 4497471 4483304 4483689 4501298 4538883 4599528 4686367 4802314 4950165 5132492 5351170
59227 5351170 5607250 5901196 6232402 6597671 6990119 7399489 7812983 8215677 8590992
59218 8590992 8921866 9192144 9387634 9497188 9513928 9435843 9265586 9010230 8681150 8293143
59208 8293143 7862783 7406982 6941926 6481565 6036210 5612900 5217097 4853154 4522927
59199 4522927 4225134 3957029 3716351 3501462 3310586 3141791 2993164 2862243 2745772
59190 2745772 2640829 2546054 2461303 2386316 2320161 2261647 2209829 2164154 2124296 2089620 2058988
59179 2058988 2031609 2008058 1989645 1976676 1968153 1963335 1962555 1966177 1973815 1985142 2000370 2019265
59167 2019265 2040776 2064591 2092164 2125125 2163368 2205686 2251677 2301918 2356823 2416498 2481455
59156 2481455 2552285 2628631 2709363 2793707 2881454 2972101 3064426 3156911 3247979 3335809 3418259
59145 3418259 3492900 3557042 3608286 3645532 3669068 3679328 3676203 3660026 3632466 3595715 3551480
59134 3551480 3501645 3449286 3397898 3349742 3305777 3267005 3235074 3211725 3198340 3195860 3204555 3224162
59122 3224162 3254932 3298320 3356013 3428510 3515236 3615647 3729577 3856863 3997363 4151150
59112 4151150 4318051 4497290 4688081 4890186 5103308 5326483 5558711 5799365 6046680
59103 6046680 6295936 6539951 6770993 6981342 7162557 7305797 7403429 7450028 7442500 7380729
59093 7380729 7268319 7111583 6917300 6691778 6441718 6174599 5897634 5616792 5336862
59084 5336862 5061631 4793723 4534901 4286875 4051415 3829602 3621473 3426563 3244398
59075 3244398 3074444 2916120 2769078 2633233 2508494 2394619 2291128 2197050 2111053 2032282
59065 2032282 1960767 1896576 1838898 1786533 1738985 1696400 1658728 1625651 1597108 1573134 1553181
59054 1553181 1536261 1521606 1508509 1495680 1481569 1465450 1447635 1428650 1408846 1388777 1369248
59043 1369248 1350808 1333600 1317689 1303136 1289890 1278203 1269079 1263717 1262469 1264811 1270279 1278903
59031 1278903 1290781 1305794 1323700 1343903 1364917 1384488 1400583 1412320 1420105 1424986 1427624 1427767
59019 1427767 1425011 1420175 1415315 1412047 1410427 1409884 1410591 1413294 1418389 1425840 1435543 1446993 1458930 1469916
59005 1469916 1478908 1484834 1486389 1483141 1476252 1467145 1455979 1442347 1426872 1410851 1394705 1378122
58993 1378122 1361658 1346877 1334734 1324920 1317045 1311444 1308455 1307683 1308392 1310123 1312739 1316344 1321275 1327818
58979 1327818 1335912 1345396 1356255 1368230 1380582 1392912 1405882 1420454 1436674 1453874 1471835 1491072
58967 1491072 1512224 1535844 1562500 1592354 1624767 1658789 1693714 1728737 1762779 1795390 1827240
58956 1827240 1858862 1889576 1918588 1946567 1975058 2004893 2036299 2070029 2107147 2148099 2193122
58945 2193122 2243032 2298248 2357536 2419319 2484032 2553752 2629679 2711512 2799206 2893760 2996106
58934 2996106 3106747 3226784 3358034 3501905 3659265 3831471 4020241 4226409 4450147
58925 4450147 4692714 4956865 5245414 5560567 5904596 6279874 6688209 7131565 7613553
58916 7613553 8138558 8708877 9323832 9981539 10679495 11412460 12170877 12941696 13709175
58907 13709175 14453981 15152826 15780394 16311837 16724356 16999026 17123332 17092731 16910574
58898 16910574 16587840 16142648 15597745 14976745 14302301 13596465 12879898 12169362 11477012
58889 11477012 10812404 10183470 9594628 9045666 8534130 8058348 7617646 7210913 6836203
58880 6836203 6491129 6172869 5878416 5605485 5352532 5117615 4898236 4692902 4501794
58871 4501794 4325185 4161970 4010379 3869299 3738336 3617331 3506344 3405332 3313480 3229638
58861 3229638 3153557 3085618 3025216 2970804 2921900 2879524 2844023 2813969 2788062 2766736 2750852
58850 2750852 2740107 2733872 2732558 2737000 2747377 2763707 2786502 2815989 2851558 2892944 2941049 2996640
58838 2996640 3059159 3127842 3203156 3286070 3376681 3474713 3580764 3696089 3821688 3958496
58828 3958496 4107821 4270785 4448030 4640821 4851775 5083648 5338153 5616832 5922348
58819 5922348 6258001 6626651 7031094 7474730 7960585 8489865 9062144 9676305 10330155
58810 10330155 11019097 11735344 12467497 13199819 13912308 14582327 15186333 15700648 16102694
58801 16102694 16373734 16501369 16480242 16312113 16006394 15579532 15052316 14447070 13786320
58792 13786320 13091672 12381947 11672386 10975827 10303346 9662956 9058822 8492905 7966648
58783 7966648 7480533 7033470 6624159 6252361 5917826 5618827 5352638 5116061 4903776
58774 4903776 4706974 4515657 4322799 4126148 3927233 3729922 3538938 3357755 3187572
58765 3187572 3028778 2882561 2749935 2629988 2520559 2420361 2329306 2247198 2173387 2107492
58755 2107492 2049365 1998469 1954077 1915702 1882620 1853530 1827531 1804761 1785221 1767822 1751660
58744 1751660 1737385 1725913 1716420 1706982 1696677 1685683 1673777 1660281 1645304 1629654 1613604 1596893
58732 1596893 1579835 1563234 1547241 1531262 1514909 1498100 1480391 1461099 1439929 1416715 1390877
58721 1390877 1362053 1330982 1298867 1266148 1232744 1199150 1166469 1135619 1107165 1081429 1058004
58710 1058004 1035752 1014168 994152 976526 960453 944378 927955 911987 897033 883164 870521
58699 870521 859000 847918 837028 827224 819113 811621 803393 795014 788420 784513 782693 782308 783173 784944
58685 784944 787292 790451 794401 797886 799561 799777 799980 800792 802063 804410 809063 816292 825388 836164 849150
58670 849150 864530 882372 903934 931358 965829 1006901 1053109 1101526 1146570 1180901 1198531
58659 1198531 1197056 1177661 1144368 1103021 1059299 1016819 977373 942448 913358 890204 872048
58648 872048 858260 848803 843363 841240 842019 845427 850738 857350 865698 876695 890513 906879 926119
58635 926119 948788 974660 1003199 1034685 1069778 1108442 1150519 1196880 1248713 1306211 1369348
58624 1369348 1439482 1518638 1607689 1706939 1818153 1944149 2086368 2244491 2418364 2608400
58614 2608400 2813733 3031479 3257929 3488795 3717697 3935705 4132917 4299720 4426945
58605 4426945 4506847 4535154 4511900 4440522 4327104 4180092 4008955 3822263 3627280 3430662
58595 3430662 3238036 3052804 2876541 2710592 2556275 2413865 2282843 2163269 2055830
58586 2055830 1960599 1876831 1803812 1740863 1686728 1640078 1600316 1566811 1537898 1511898 1488634
58575 1488634 1468538 1450887 1434471 1419371 1406265 1394434 1382344 1369794 1357515 1344925 1330403
58564 1330403 1313697 1295930 1277178 1256214 1232907 1208897 1185478 1162729 1141107 1122026 1106317
58553 1106317 1093749 1084450 1078991 1076441 1073820 1068206 1058366 1044378 1027196 1008829 991319 975069
58541 975069 959279 944011 930387 918790 908357 898302 888281 877586 865565 852744 839984
58530 839984 826833 812449 797713 784331 772065 759130 745238 732005 720220 709051 698146
58519 698146 688211 679223 670365 662102 656044 652318 649279 646226 644113 643189 642281 641003 640363 640583 640627 640406
58503 640406 641144 642954 644505 645732 648362 652962 657996 662743 668581 676298 684593 692442 700533 709067
58489 709067 716517 722063 727182 733348 739999 746043 751470 756287 759777 762003 764287 767228 770128 773014
58475 773014 776883 780983 782470 780000 775219 769382 761179 749614 736487 723976 711951 699705 688326
58462 688326 679233 672024 665765 660773 657371 654431 650963 647656 645179 642466 638267 632987 627560 622091
58448 622091 617020 613911 613475 614322 615105 616341 618864 622317 626586 632814 641329 650370 658406 665925 673340
58433 673340 679083 681642 681751 680834 678959 676090 673603 672629 672492 672580 674241 679006 686361 694899 704165 713851
58417 713851 722853 730851 739269 749089 759217 768409 777047 785582 793110 799049 804237 808802 811036 810058
58403 810058 807456 804473 799876 792618 784373 777141 770412 762999 755721 749910 745082 740426 736857 735299
58389 735299 734663 733785 733676 735629 738812 741937 745586 750626 756060 760640 764910 769537 773495 776016 778397
58374 778397 781678 784578 786008 787490 790699 794784 798596 803227 809619 815975 820546 824878 831147 838284
58360 838284 843966 848644 854299 860872 867201 874060 882974 893205 902862 911784 920499 927769 932018 933951
58346 933951 935070 935034 933018 930099 927712 925417 922732 921233 922200 924343 926616 930946 939057 949027 958337
58331 958337 967987 979962 992909 1004284 1014757 1026499 1038878 1049916 1060478 1072968 1087187 1101184
58319 1101184 1114906 1129485 1144339 1158453 1172829 1188181 1202004 1211573 1218054 1224085 1229347 1232406
58307 1232406 1234775 1238984 1244541 1249837 1256062 1265098 1275613 1285522 1296235 1310114 1325849 1340774 1355558
58294 1355558 1372061 1388943 1404236 1419933 1438973 1459941 1479853 1499838 1522711 1547390 1571425
58283 1571425 1596826 1627443 1662551 1698831 1736603 1778104 1821728 1864256 1906717 1951556 1995855
58272 1995855 2034024 2065528 2093592 2118341 2138130 2155705 2175766 2197954 2219251 2241501 2269250
58261 2269250 2302051 2336568 2374450 2420125 2472434 2526589 2582838 2644829 2711090 2776973 2843711
58250 2843711 2916550 2995051 3074266 3154389 3239924 3330435 3421676 3514892 3615294 3722389 3831775
58239 3831775 3945332 4069257 4203179 4342005 4487236 4645130 4814884 4990657 5174281
58230 5174281 5373474 5588307 5812521 6047639 6302262 6577885 6869459 7179589 7517466
58221 7517466 7884099 8274072 8691711 9149246 9649158 10185666 10764004 11400347 12102522
58212 12102522 12869857 13712329 14649830 15692861 16846364 18133167 19590557 21244882
58204 21244882 23116986 25254012 27728859 30611546 33977952 37951495 42704964 48429107
58196 48429107 55352127 63800879 74202836 87038115 102861886 122385690 146465347
58189 146465347 175976386 211648898 253633247 300441703 347712079 388255335 414361328
58182 414361328 421237906 409046025 382120544 346418847 307287537 268559786 232574358
58175 232574358 200454052 172457367 148387827 127897994 110590568 96045530 83888800
58168 83888800 73835079 65644480 59083663 53963872 50176268 47654225 46338410 46204701
58160 46204701 47238976 49243700 51620717 53425654 53761645 52220213 49016087 44756156
58152 44756156 40085935 35474968 31195063 27379177 24064288 21218714 18781334 16696800
58144 16696800 14919659 13402459 12099053 10977587 10017692 9196723 8489482 7878630 7353138
58135 7353138 6897042 6490565 6121980 5787958 5482284 5194403 4919490 4660120 4416988
58126 4416988 4186985 3971059 3774616 3598552 3438104 3291681 3162555 3050493 2949725
58117 2949725 2856545 2771096 2690329 2607271 2519501 2431317 2345794 2261640 2179428 2103412 2034623
58106 2034623 1968703 1903026 1840059 1781683 1726152 1672740 1623547 1578623 1534777 1491130 1450574
58095 1450574 1414027 1378697 1343637 1311530 1283121 1255330 1226836 1200304 1177099 1154894 1132435
58084 1132435 1111539 1092349 1071683 1048374 1025447 1004782 984327 962801 942451 924651 907191
58073 907191 888457 870219 853911 838144 822260 808372 797459 787200 776073 766023 758752 752862
58061 752862 746954 742170 739305 736607 732667 728492 724615 719185 711018 701747 693098 684788 676724 670230
58047 670230 665391 660186 653982 648954 646320 644228 641064 637811 635417 632913 630127 629220 631410 634885
58033 634885 637913 641360 646161 650933 654148 656256 657867 658220 657130 656001 655229 653089 648748 643844 639466
58018 639466 634373 627986 622392 619298 617462 615124 612620 610581 607946 603861 599432 595666 591780 587369
58004 587369 584001 582757 582272 581066 579678 578627 576458 571914 566142 560784 555659 550074 544574 539611
57990 539611 534365 528676 524285 522454 522188 522410 523869 527173 530965 533907 536549 539486 541693 542472 543053
57975 543053 544273 544746 543399 541864 542097 543370 543770 543061 541896 539800 536137 531724 527509 523010 517928
57960 517928 513712 511488 509889 506919 502592 497904 492767 487031 482033 478994 477225 475880 475976 478542 482330
57945 482330 485622 488935 493542 498633 502504 505461 508899 512270 513475 511845 508496 504143 498629 492231
57931 492231 485551 478343 469921 460348 449971 438695 427032 416704 408705 401916 395339 390314 388516
57918 388516 389035 389700 390311 392217 395533 399152 402983 407916 413984 420647 428434 438249 449390 460160
57904 460160 470011 479191 486865 491752 494258 495939 497064 496723 494996 492912 490418 486472 481117 475464
57890 475464 469587 462404 453763 444808 436198 427802 420232 414736 411224 408197 405040 402718 401762 401278 400594
57875 400594 400447 401771 404438 407810 411634 415942 420913 427126 435123 444428 453734 462187 469769 476492
57861 476492 482094 486555 490088 492538 493535 493150 491685 488969 484675 479183 473386 467746 462216 456830 451695
57846 451695 446670 441633 436725 431873 426751 421808 418369 416808 415575 413143 409995 407438 405391 402845
57832 402845 399684 396377 392494 387291 381290 375517 369542 362133 353616 345678 338865 332123 324996 318411
57818 318411 312887 307697 302408 297762 294361 291639 288850 286115 283990 282766 282592 283564 285444 287939 291291
57803 291291 295939 301775 308582 316952 327651 340058 352173 362167 369124 372705 373378 372964 373672 376300
57789 376300 380157 384540 389232 393766 397504 400530 403352 405640 406297 404722 400967 394896 386498 376932
57775 376932 367856 359611 351325 342827 335071 328567 322836 317715 313747 310896 308235 305433 303349 302660
57761 302660 303061 304220 306360 309311 312204 314728 317660 321455 325290 328259 330717 333698 337585 342002
57747 342002 346521 350925 355097 359043 362781 366172 369216 372376 376020 379757 383001 385947 389109 392181
57733 392181 394501 396467 399261 403150 407351 411686 417031 423787 431239 438835 446916 455732 464951 474690
57719 474690 485846 498676 512128 525284 538574 552865 568247 584463 601789 620726 641418
57708 641418 664015 689056 716897 747276 779947 815344 854351 897972 947443 1004008 1068285
57697 1068285 1140465 1221299 1312180 1414220 1528230 1655901 1799846 1961834 2141667 2338103
57687 2338103 2549740 2774146 3006680 3240658 3467978 3679128 3863497 4010955 4113675
57678 4113675 4167191 4171230 4130335 4053190 3950700 3834520 3716506 3607681 3516758 3449750 3409840
57667 3409840 3394709 3392420 3381703 3339487 3250749 3113665 2938344 2741763 2541475 2350359
57657 2350359 2174985 2017767 1879522 1759965 1657576 1570625 1498135 1439265 1392571 1356630
57647 1356630 1330592 1313346 1303068 1298607 1300532 1309692 1325567 1347343 1375919 1413327 1460399 1516458
57635 1516458 1581329 1656298 1742909 1841979 1954161 2080489 2221805 2378100 2548607 2731784
57625 2731784 2924634 3122105 3317213 3501530 3665677 3800043 3895818 3946229 3947890 3901721
57615 3901721 3812449 3686859 3532422 3357208 3169781 2977916 2787294 2601755 2424423 2257897
57605 2257897 2103588 1961570 1831247 1711908 1602854 1503582 1413847 1333233 1260703 1194944
57595 1194944 1135062 1080689 1031504 986979 946555 909836 876634 846822 820050 795623 772970
57584 772970 752202 733769 717596 703017 689646 677636 666913 656847 647020 637689 629114 621112
57572 621112 613761 607881 604195 602433 601826 602037 603103 604970 607644 611347 615919 620601 625132 630658 638746
57557 638746 649691 662486 676260 691100 707516 725793 745911 767714 791112 816414 844357
57546 844357 875643 910699 950043 994444 1044428 1100184 1162414 1232809 1313014 1403484 1503839
57535 1503839 1614043 1734668 1866237 2008700 2160953 2320070 2481044 2637674 2783428
57526 2783428 2911162 3012921 3081377 3111906 3103282 3057042 2977047 2869339 2741276 2600172
57516 2600172 2452574 2304042 2158752 2019327 1887588 1765235 1653274 1551262 1458114 1373613
57506 1373613 1298433 1232710 1175393 1125146 1081224 1043284 1010884 983437 960333 940988 925048
57495 925048 912596 903942 899186 898129 900414 905597 913428 924325 939249 958783 982671 1010574 1042798
57482 1042798 1079875 1122031 1169734 1224301 1287195 1359088 1440372 1532185 1635895 1751691 1878470
57471 1878470 2014972 2159936 2310857 2463203 2610883 2746761 2862714 2950347 3002663 3015551
57461 3015551 2988275 2923354 2826007 2703006 2561467 2408406 2250545 2093472 1940809 1794653
57451 1794653 1656804 1528994 1412080 1305779 1209382 1122273 1043776 973129 909712 852938
57441 852938 801965 755989 714712 677977 645099 615153 587812 563251 541277 521276 503015
57430 503015 486730 472291 458965 446175 433901 422197 410937 400224 390480 381839 373907 366260
57418 366260 358826 351696 344973 338829 333244 327776 322124 316845 312876 310303 308243 305964 303448 300838
57404 300838 298139 295698 294205 293836 293941 293873 293586 293176 292411 291089 289445 287810 286261 284846 283853 283564
57388 283564 283959 284749 285460 285572 284979 284251 284005 284056 283707 282727 281436 279924 277962 275747 273892 272516 271128
57371 271128 269657 268816 269117 270200 271450 272639 273629 274154 274276 274508 275113 275889 276884 278581 281009 283456
57355 283456 285588 288113 291667 295633 298782 300645 301581 301917 301643 300738 299273 297424 295754 295090 295652 296680
57339 296680 297357 297754 298448 299692 301484 304004 307315 310957 314426 317827 321555 325590 329605 333459 337099
57324 337099 340283 343005 345910 349662 354162 358974 364262 370598 377933 385456 392466 398916 405207 412000
57310 412000 420098 429846 440605 451375 461941 472884 484563 496763 509468 523256 538618 555424
57298 555424 573386 592581 613128 634634 656463 678460 701105 724925 749931 775635 801505
57287 801505 827301 852872 877622 900354 919760 934918 945135 949580 947519 938964 924703 905577
57275 905577 882058 854749 825010 794708 765346 737592 711602 687490 665340 645035 626411
57264 626411 609624 595082 582897 572645 563843 556501 550960 547293 545117 543930 543370 543225 543485 544436
57250 544436 546411 549333 552653 555794 558551 561096 563785 566901 570446 574219 578185 582574 587479 592621
57236 592621 597771 603052 608526 613864 618980 624536 631037 637691 643102 647116 651055 655977 661614 667329
57222 667329 673264 680005 687780 696466 705905 715770 725614 735515 746221 758254 771215 784352 797475
57209 797475 811040 825676 841907 859795 878629 897395 915822 934435 953341 971773 989268
57198 989268 1006566 1024633 1043440 1062435 1081737 1101986 1123300 1145249 1167779 1191464 1216757
57187 1216757 1243610 1271887 1301712 1333251 1366404 1400811 1436155 1472548 1510543 1550410 1591404
57176 1591404 1632259 1672490 1712638 1753044 1793180 1832644 1872154 1912818 1954772 1997068 2038639
57165 2038639 2079051 2118722 2158808 2200490 2243958 2288489 2333773 2380470 2429056 2478891 2529173
57154 2529173 2580247 2633193 2688501 2745835 2804654 2864370 2924234 2983784 3043202 3102691 3161820
57143 3161820 3220009 3277267 3333981 3390501 3447478 3505950 3566334 3627829 3689615 3752173 3816815
57132 3816815 3884490 3955727 4030694 4107790 4182664 4250548 4310351 4365998 4423696 4488310 4561786
57121 4561786 4643560 4731770 4824543 4920722 5019760 5121639 5227398 5339440 5460868 5594766
57111 5594766 5744174 5911953 6100283 6311175 6548334 6818357 7130189 7494510 7923997
57102 7923997 8433060 9037115 9754321 10609973 11639311 12886532 14403431 16249831 18492498
57093 18492498 21200374 24439395 28268482 32732799 37854027 43625000 50011441 56952946
57085 56952946 64359032 72106034 80031113 87904382 95384356 102013863 107311378 110925038
57077 110925038 112737360 112843948 111444630 108746739 104933888 100178573 94658249 88560375
57069 88560375 82079113 75404959 68710383 62140119 55810197 49810491 44206441 39041741
57061 39041741 34342617 30119860 26368048 23066722 20185349 17687812 15534083 13682166
57053 13682166 12091960 10727692 9557031 8550013 7680156 6925572 6268061 5691956 5184355
57044 5184355 4735244 4336347 3980258 3660966 3374191 3116454 2884195 2674011 2483112
57035 2483112 2309334 2151304 2008516 1880406 1765189 1660347 1564205 1476228 1396003 1323029
57025 1323029 1257414 1199460 1148325 1102203 1060052 1022072 988361 958441 932517 911837 897116
57014 897116 887751 883347 885011 894439 912896 942170 985701 1047698 1132127 1243816 1388581 1567142
57002 1567142 1764829 1947725 2073430 2111332 2057078 1930615 1761885 1577256 1394650 1224843
56992 1224843 1073216 940861 826670 729552 648677 582582 529638 489425 462449 448171 443914
56981 443914 445507 448208 447445 440231 426446 408059 387056 364806 343042 323906 308470 296197
56969 296197 286317 278963 274581 273087 274108 277460 283074 291087 302261 317689 337893 362773 392275
56956 392275 425798 460308 490004 508883 513740 504943 485349 458985 429828 400728 373240 348347
56944 348347 326792 308633 293352 280865 271910 267160 266587 270103 278202 291561 310552 335673 367867
56931 367867 407594 453321 500759 543238 573237 584999 576989 552190 516118 474572 432457 393033
56919 393033 357312 324613 294339 267036 243641 224281 208186 194344 181966 170774 161039 152970
56907 152970 146019 139329 132951 127828 124389 121961 119890 118440 118095 118726 120074 122458 126350 131745 138529
56892 138529 147118 158154 171900 188366 207769 230387 256133 284355 313535 340805 362393 375322
56880 375322 378892 374493 364375 350757 335488 319966 305361 292869 283372 276835 272639 270745 272020
56867 272020 277318 286852 300865 320332 346578 380657 423356 475063 534635 598000 657896 705296
56855 705296 732270 735209 716298 681802 638667 592492 547496 506669 471522 442594 420512 405851
56843 405851 398187 396641 401717 415375 438932 472166 515132 569622 638013 721437 818915 925755
56831 925755 1030958 1117924 1170912 1182353 1154562 1096172 1018267 932093 846804 767541 695973
56820 695973 632625 578077 532491 495567 467349 448329 438704 438404 447894 468188 500001 543599
56808 543599 599268 666583 742180 818228 883335 925674 937088 916388 869640 806730 736906
56797 736906 666617 599886 539046 484956 437608 397157 364169 338927 320997 309579 304011 304124
56785 304124 310475 324048 345321 373773 408411 448012 489772 527926 554869 564569 555404 530419
56773 530419 495387 456126 416465 377990 341389 307608 277597 251603 229322 210396 194371
56762 194371 180574 168649 158801 151036 144601 138792 133859 130384 128182 126510 125025 123724 122273 120195
56748 120195 117620 115157 113187 111812 111212 111376 111779 111960 112071 112243 111869 110357 108169 106255 104793 103398
56732 103398 102147 101350 100577 99118 97273 96124 95995 96213 96345 96585 96845 96614 95964 95641 95829 95772 95004 94121
56714 94121 93883 94307 95012 95774 96280 95922 94335 91845 89121 86685 84802 83443 82301 81256 80737 81157
56698 81157 82122 82817 83087 83389 83778 83793 83493 83744 85095 86976 88323 88587 87976 87141 86752 86963 87315 87543
56680 87543 88320 90531 93927 97218 99525 100990 101866 101858 100695 98761 96821 95444 94816 94724 94698 94462 94176
56663 94176 93875 93064 91489 89982 89648 90368 90989 90948 90812 91171 91881 92556 92942 92691 91586 90194 89451 89437
56645 89437 89287 88525 87679 87346 87411 87479 87391 87101 86691 86635 87335 88305 88604 88203 88022 88466 88921 88983 89203 90054 91039
56624 91039 91383 90936 89916 88496 87158 86764 87658 89202 90593 91669 92568 93311 94154 95710 98076 100369
56608 100369 101707 102294 103053 104502 106400 108065 108731 107969 106233 104723 104332 104916 105695 106032 105649 104640
56592 104640 103492 102760 102500 102336 102140 102197 102683 103537 104869 106850 109063 110678 111499 112205 113335 114675 115879
56575 115879 116993 118096 119145 120510 122973 126748 131099 135332 139658 144680 150560 157055 163842 170472
56561 170472 176561 182429 189002 196634 204480 211452 217395 222906 228454 234106 239754 245144 249854 253534
56547 253534 255994 256994 256327 254235 251376 248208 244725 240808 236410 231405 225726 219738 213974 208520
56533 208520 203158 197999 193288 188675 183516 178021 173246 169723 166830 163813 160700 157858 155317 152895
56519 152895 150523 148111 145511 142771 140049 137296 134506 132144 130711 129981 129348 128740 128400 128027 127151 126247
56503 126247 126360 127533 128710 129272 129619 130089 130520 131026 132051 133360 134150 134422 135075 136357 137473 138112 138994
56486 138994 140422 141640 142306 143305 145350 147913 150308 152766 155599 158320 160400 162066 163662 165075 166419
56471 166419 168398 171369 174892 178674 183020 187881 192609 197123 202097 207416 211789 214664 217154 220222
56457 220222 223208 225164 226372 227487 228325 228638 228965 229615 229829 229125 228368 228393 228660 228512 228695 230203 232486
56440 232486 234231 235135 235646 235676 234878 233517 231852 229340 225664 221798 218816 216364 213542 210529 208067
56425 208067 206062 204065 202385 201281 199726 196519 192165 188229 185216 182461 179608 176818 173871 170505
56411 170505 167363 165332 164236 163373 162858 163114 163523 163094 162178 162059 162964 163912 164451 165161 166369 167590 168378
56394 168378 168740 168735 168547 168862 170227 172215 173975 175286 176239 176540 176189 176283 177820 180147 181893 183037 184647
56377 184647 186833 188504 189127 189324 189598 189768 189885 190529 191908 193557 195102 196567 197921 199058 200202 201624
56361 201624 203105 204353 205683 207507 209456 210890 211996 213506 215517 217411 218768 219614 220073 220449 221308
56346 221308 222812 224406 225767 227447 229872 232488 234803 237486 241450 246521 252023 257863 263897 269086
56332 269086 272635 275380 278737 282854 287074 291576 297108 303591 310344 317274 324581 331755 338222 344473
56318 344473 351211 357864 363312 367551 371290 374435 376504 378055 380071 382183 383018 382148 380343 378158 375596
56303 375596 372940 370645 368652 366892 365994 366318 366936 366873 366687 367498 369198 371164 373981 378761 385317 392625
56287 392625 400493 409148 417854 425780 433738 443276 454550 466791 480248 495802 513194 531565 551273
56274 551273 573330 597574 623317 651170 682286 716497 753400 794613 842497 897173 957293
56263 957293 1023306 1097355 1180209 1271079 1370416 1480050 1600216 1728934 1864633 2006877
56253 2006877 2154136 2303273 2451703 2597722 2738247 2868511 2984583 3084253 3165310 3225379
56243 3225379 3264105 3283412 3285166 3270559 3241943 3202836 3155509 3100668 3039880 2975962 2910386
56232 2910386 2842440 2771499 2698008 2621785 2541662 2457488 2370433 2280847 2188003 2092421 1996205
56221 1996205 1900521 1804986 1710142 1618107 1529998 1444889 1362210 1283122 1208828 1139536 1075770
56210 1075770 1018595 967809 921827 879865 842206 808009 775226 743391 714235 688853 666441
56199 666441 646390 629213 614688 601449 589199 579139 571500 564928 558953 554692 552348 550459 548415
56186 548415 547406 548095 549699 552072 556219 562010 567975 574124 582347 593086 604255 614413 624383 634742
56172 634742 644377 652711 660763 668818 675523 680368 684614 688795 691874 693762 695941 698558 699799 699245
56158 699245 698990 700236 701773 703136 706219 712177 719570 727148 735837 746600 759155 774224 794166
56145 794166 819872 849943 884422 926394 978468 1040824 1114263 1201780 1305026 1422080 1550266
56134 1550266 1687713 1829960 1968438 2095127 2206665 2302623 2383319 2451586 2513164 2572153
56124 2572153 2627838 2677287 2717939 2746105 2757176 2750601 2732030 2708051 2681173 2651333 2618036
56113 2618036 2577956 2524069 2450972 2359215 2252623 2134820 2010937 1888767 1774344 1668708
56103 1668708 1571643 1485405 1411700 1348181 1291443 1240938 1196955 1157705 1121665 1090146 1064425
56092 1064425 1042883 1023812 1008065 996049 985290 974125 964617 958560 953891 948500 944291 943675 945120
56079 945120 945977 946845 949360 952566 955253 959079 965637 973148 979642 986510 995388 1004658 1012746 1021709 1033562
56064 1033562 1046202 1056988 1067241 1079203 1091749 1103310 1115714 1130727 1145903 1158382 1169852
56053 1169852 1183424 1198631 1213815 1230247 1249355 1269021 1287236 1306326 1329049 1353699 1377584
56042 1377584 1402026 1429347 1458269 1486976 1517230 1550792 1585357 1618706 1652998 1690183 1727305
56031 1727305 1761459 1795125 1831305 1867831 1902003 1936319 1973755 2011965 2048199 2085311 2126758
56020 2126758 2170491 2214213 2261536 2315998 2374082 2431364 2490498 2555656 2624369 2692703 2763332
56009 2763332 2840316 2921120 3002177 3087036 3180302 3278907 3378355 3482013 3594891 3714052 3835055
55998 3835055 3962092 4101361 4250164 4403228 4563844 4737597 4921149 5108953 5305050
55989 5305050 5516261 5739896 5970653 6213256 6475438 6755328 7049287 7364902 7711793
55980 7711793 8087195 8485830 8916096 9390483 9908633 10467276 11078068 11757044 12505711
55971 12505711 13322664 14224503 15234466 16361142 17611733 19015819 20611979 22423890
55963 22423890 24477948 26833394 29568556 32755763 36486715 40910879 46219266 52619478
55955 52619478 60379541 69883375 81604355 96065147 113896545 135911333 163044753
55948 163044753 196212287 236101462 282526887 333115390 382208721 421629664 443747615
55941 443747615 444947223 426897723 394956269 355401107 313483295 272815560 235486472
55934 235486472 202376949 173576329 148804679 127662071 109700302 94468882 81578433
55927 81578433 70705578 61547748 53818259 47282227 41755827 37069836 33066459 29627308
55919 29627308 26669900 24115647 21887150 19931947 18219340 16713569 15373307 14174369
55911 14174369 13108370 12159541 11303960 10529514 9835284 9211874 8641627 8117205 7641474
55902 7641474 7209666 6808994 6435129 6092469 5778693 5484706 5209113 4957485 4727784
55893 4727784 4511013 4305782 4118066 3946942 3784239 3628198 3484194 3351873 3224322
55884 3224322 3100363 2985553 2880477 2779544 2681742 2591515 2508624 2427945 2349733 2279732
55874 2279732 2218615 2161106 2105695 2055447 2009085 1961117 1911254 1864452 1821408 1778267 1735864
55863 1735864 1699824 1670935 1644380 1618777 1596620 1575059 1545715 1505645 1460486 1415455 1371172
55852 1371172 1329411 1294575 1267319 1243696 1222268 1205489 1193062 1180797 1167188 1154461 1142257
55841 1142257 1126935 1108133 1089443 1071573 1051229 1027654 1003948 980990 956381 930304 906206
55830 906206 884734 863117 841359 822777 807541 792012 775580 761851 751683 741157 727984
55819 727984 714187 701033 687052 672585 660731 652224 644560 637444 633691 633474 633152 631220 630076
55806 630076 630470 629610 626397 623239 620910 616767 609910 603179 598187 593035 586580 580187 573620 564072 551157
55791 551157 538263 527165 515883 503640 493171 486073 480444 475337 473101 474830 477456 477657 474949
55778 474949 469069 458398 443286 427210 412379 397564 382076 368137 357225 347621 337744 328581
55766 328581 320838 313077 304742 297748 292931 288020 281202 273832 267685 262418 257538 254007 252003 249841
55752 249841 246744 244053 242215 239405 234664 229591 225446 221386 216952 213397 211065 208320 204553 201452
55738 201452 199914 198550 196569 195186 194774 193690 191423 189931 190264 190778 190182 189414 188994 187616 184947 182799
55722 182799 181808 180040 176583 173429 171854 170069 166654 163374 162216 162224 161727 161336 162352 164223 165778 167251
55706 167251 169375 172283 176667 183854 193263 202012 208498 214046 219764 224406 226964 228697 230744 232176
55692 232176 232192 231755 231259 229059 224284 218722 214026 209370 203765 198250 193862 189859 186062 184397 185805
55677 185805 187850 187854 186426 185591 185441 185030 184788 185590 186907 188047 189789 192843 196234 198985 201742 204940
55661 204940 207211 207566 207341 207998 208751 208452 208076 209094 210887 211918 212056 211710 210055 206235 201169 196254
55645 196254 191374 185861 180144 174839 169557 164060 159137 154844 149579 142592 135693 130712 126912 122700
55631 122700 118218 114310 110584 106503 102883 100393 98045 95051 92600 91860 91808 90962 89690 88810 87582
55616 87582 85286 83205 82734 82913 82107 80764 80156 79715 78139 76011 74894 74649 73987 72798 71755 70436
55600 70436 68090 65576 64446 64649 65026 65375 66154 66919 66921 66600 66738 66886 66240 65174 64340 63308 61805 61065
55582 61065 62033 63360 63188 61835 60702 59620 57581 55140 53787 53580 53581 53915 55192 56562 56560 55449 54633
55565 54633 54247 53380 52253 52083 53126 54734 56948 60149 63498 65592 66345 66547 66066 64362 62268 61314
55549 61314 61565 61885 61993 62501 63240 63384 62988 62886 63384 64498 66870 70798 74868 77301 78269 79268 80766
55532 80766 82123 83279 84739 86344 87748 89571 92392 95181 96438 96288 95737 94614 92219 89278 87097
55517 87097 85279 82433 78768 75807 73822 71740 69348 67373 65489 62458 58320 54434 51294 48293
55503 48293 45664 44491 44539 44076 42253 39929 37832 35657 33322 31434 30145 29005 28125 27991 28046 27110
55487 27110 25407 24544 25140 26011 25998 25258 24417 23748 23372 23139 22271 20349 18503 18268 19439 20483 20847 21201
55469 21201 21584 21175 20060 19432 19705 19985 19738 19465 19444 19299 19154 19778 21131 22064 21910 21181 20477 19795 19140
55450 19140 18732 18423 17912 17500 17619 17809 17321 16523 16413 16979 17398 17629 18356 19527 20455 21163 22062 22552 21664
55431 21664 19985 19136 19318 19228 18489 18200 18794 19248 18924 18456 18261 17804 16915 16361 16523 16873 17242 18208 19808
55412 19808 21197 22034 22923 24161 25368 26592 28335 30176 30902 30408 29950 30109 30047 29217 28185 27201 25624
55395 25624 23527 22339 22908 24173 24659 24232 23594 23055 22561 22115 21593 20889 20460 20825 21407 21089 20049 19676
55377 19676 20407 21120 21025 20612 20213 19224 17523 16182 15841 15691 15007 14504 15157 16641 17861 18262 17854 16805
55359 16805 15711 15521 16486 17790 18617 18894 18733 18057 17097 16314 15568 14406 13305 13330 14223 14224 12401 9920
55341 9920 8349 7933 8227 9126 10366 11092 10978 11030 12401 14988 17791 19980 21136 21205 20771 20710 21161 21494
55323 21494 21478 21550 21730 21359 20300 19378 19159 19292 19426 19765 20277 20431 20158 20065 20267 20070 19196 18242 17487 16455
55303 16455 15127 14367 14513 14708 14229 13436 12884 12560 12513 13079 13947 14202 13854 14068 15310 16566 17120 17691
55285 17691 18988 20417 21222 21678 22155 22106 21065 19744 19169 19421 19987 20448 20232 18764 16609 15372 15681
55268 15681 16379 16440 16420 17078 17933 18358 18844 19809 20133 18396 14946 11537 9504 9237 10649 13000 14928
55251 14928 15795 16497 18092 20345 22463 24379 26179 27093 26401 24799 23723 23647 23986 24199 24055 23334 22206
55234 22206 21454 21478 21601 21099 20372 20226 20628 21054 21454 21997 22378 22241 21770 21150 20114 18767 18075 18620 19603
55215 19603 20041 20203 20905 22045 22954 23612 24437 25346 25982 26396 26632 26227 25084 24180 24419 25319 25846 25907 25963
55196 25963 25758 24711 23138 21888 21026 19971 18671 17599 16829 16118 15737 16224 17468 18813 19937 20889
55180 20889 21519 21636 21501 21534 21728 21926 22237 22625 22542 21550 19903 18035 16142 14714 14562 15574 16357 15975
55162 15975 15240 15407 16490 17837 19329 20806 21216 19846 17802 16852 17232 17904 18454 19302 20411 21257 21907
55145 21907 22891 24080 24862 25234 25665 26060 25910 25213 24249 22908 21302 20520 21472 23348 24615 25192 26193
55128 26193 27769 28856 29074 29375 30502 32152 33981 36188 38698 40831 42205 43196 44215 45215 45952
55113 45952 46046 44936 42620 40299 39264 39220 38723 37225 35613 34707 34379 34264 34283 34190 33548 32454 31536 31087
55095 31087 30918 31071 31847 33098 34321 35479 36844 38087 38516 38289 38414 39355 40521 41326 41808 42017 41725
55078 41725 41124 41024 41943 43521 45100 46352 47183 47572 47705 47835 48004 48252 48929 50244 51712 52626 52939
55061 52939 53031 52929 52477 52024 52070 52412 52504 52448 52766 53316 53418 52943 52352 51727 50769 49750 49462 50064 50820 51055
55041 51055 50672 49782 48685 48098 48519 49412 49918 50180 50978 52224 52989 53009 52936 53065 53011 52769 52849 53153 52942 52240
55021 52240 52043 52761 53577 53871 54114 54794 55497 55749 55837 56047 55857 54636 52637 50681 49282 48471 47997 47417
55003 47417 46437 45440 45109 45396 45535 45165 44686 44361 43998 43780 44396 45828 46940 46936 46460 46593 47393 48139 48544
54984 48544 48949 49609 50361 50916 51177 51437 52284 53979 55873 57060 57637 58637 60451 62181 63048 63697 65414
54967 65414 68414 71637 74124 76113 78753 83022 89010 96204 104387 113902 124879 136761 149194 162950
54953 162950 178981 196524 213001 225899 234086 237308 235500 229102 219355 207653 194822 181232
54941 181232 167239 153284 139861 127527 116626 107039 98523 91219 85422 81063 77855 75662 74145
54928 74145 72406 69899 67476 66565 67344 68705 69990 71723 74463 77998 82051 86891 92869 100043 108545
54913 108545 118592 129884 141691 153762 166358 179106 190503 198858 203210 203251 199132 191614 181786
54900 181786 170466 158348 146536 136036 126715 117718 108934 101079 94351 88191 82576 78259 75280
54887 75280 72468 69017 65577 63176 61941 61404 61157 60655 59312 57388 55967 55470 55068 54109 53191 53022
54871 53022 53130 52552 51173 49552 48028 46727 45946 45714 45386 44368 42968 42013 41913 42444 43070 43118 42157
54854 42157 40588 39400 39066 39169 39260 39341 39296 38685 37520 36473 35927 35601 35440 35947 37109 37953 37781 37008
54836 37008 36208 35267 34246 34138 35763 38538 41172 43024 44059 44190 43571 43035 43300 44123 44955 45942 47483
54819 47483 49226 50322 50465 50098 49874 50446 52340 55425 58850 61984 65038 68431 72211 76546 82036
54804 82036 88945 96854 105786 116830 130741 146529 162365 177327 191270 203442 212401 217170 217691
54791 217691 214280 207416 198010 187176 175743 164320 153550 143860 135293 127987 122355 118339 115050
54778 115050 111689 108300 105160 102096 99108 96930 96134 96222 96440 97005 98618 101247 104267 107492 111228
54763 111228 115640 120920 127732 136690 147602 159904 173459 188230 203598 218805 233624 247778
54751 247778 260126 269405 275491 279056 280356 279313 276458 272702 268232 262604 255779 248113 239428 229126
54737 229126 217266 204699 192049 179370 166850 155082 144484 135091 126933 120052 114141 108742
54725 108742 103744 99256 95184 91518 88751 87301 86676 85886 84518 82773 80718 78310 75968 74276 73234
54710 73234 72510 72303 73081 74504 75486 75446 74813 74185 73693 73275 72971 72769 72638 72753 73283 74026 74682 75366 76372
54691 76372 77591 78640 79375 79805 79775 79230 78498 77865 77270 76924 77575 79405 81255 81949 81936 82597 84324 86481
54673 86481 88881 91932 95409 98451 101007 104061 108119 112565 116813 121005 125177 128731 131256 133096
54659 133096 134672 136029 137418 139506 142398 145170 146983 148166 149720 152144 155215 158558 161974 165469
54645 165469 169374 174382 181273 190530 202131 215469 229695 244492 260366 277767 296056 313683
54633 313683 329120 341147 348555 350381 346516 337588 324404 308027 290049 271899 253923 235874
54621 235874 218217 202165 188482 177106 167895 160834 155360 150469 145797 141884 139091 136991 135102
54608 135102 133543 132599 132169 131912 131486 130480 128588 126004 123213 120460 117855 115751 114280 112660 109868
54593 109868 106016 102146 98609 94648 89833 84869 80602 77114 74321 72564 71973 71827 71191 69775 67809
54578 67809 65558 63429 62041 61713 62106 62653 62994 62923 62365 61623 61153 60931 60557 60112 60198 60900 61434 61292 61069
54559 61069 61655 63012 64310 64937 64927 64607 64206 63727 63058 62366 62245 63108 64477 65471 65979 66732 68106 69578
54541 69578 70685 71809 73613 76204 79283 82756 86771 91432 96725 102556 108754 115343 122785 131536
54527 131536 141329 151320 160873 169636 176936 181858 184058 183846 181340 176275 168864 160107 150950 141742
54513 141742 132745 124472 117213 110811 105176 100423 96310 92289 88372 85249 83188 81544 79704 77723
54499 77723 75696 73336 70777 68969 68522 68765 68643 68016 67369 66764 65934 65118 64964 65685 66863 68026 68971
54482 68971 69610 69919 69964 69803 69455 69111 69063 69327 69662 70127 71123 72704 74317 75484 76310 77040 77488 77215 75912
54463 75912 73530 70465 67728 66282 65987 65761 64956 63953 63271 62902 62830 63313 64174 64635 64451 64393 64981 65472
54445 65472 64880 63385 61951 61110 60836 61056 61404 61004 59459 57707 57026 57367 57542 56881 55868 55252 55308 55973
54427 55973 56999 57908 58348 58551 59009 59779 60538 61197 61957 62871 63815 64796 65834 66674 67056 67165 67354 67589
54409 67589 67668 67880 68888 70906 73453 75970 78354 80892 83984 87954 92841 98296 103799 108940 113463
54394 113463 117257 120444 123288 125815 127720 128750 128967 128473 127170 124947 121939 118509 115219 112668 110897
54379 110897 108997 105970 102013 98304 95417 92872 90420 88753 88318 88316 87647 86142 84220 82082 80018
54364 80018 78836 78909 79283 78748 77495 76716 76832 77081 76783 76070 75341 74846 74988 76325 78999 82532 86244
54347 86244 89630 92543 95392 98945 103427 108067 111982 115190 118296 121556 124874 128303 131675 134072
54333 134072 134581 133500 131960 130346 127996 124549 120740 117490 114794 111877 108085 103462 98755 94931
54319 94931 92400 90658 88893 86746 84202 81105 77392 73585 70421 68015 65928 64013 62601 61820 61229
54304 61229 60271 58731 56807 55042 54065 54029 54397 54555 54377 53962 53253 52436 52201 52888 53747 53815 53248 52972 53254
54285 53254 53527 53467 53323 53178 52823 52415 52383 52589 52423 51829 51370 51141 50590 49702 49391 50233 51576 52476 52861
54266 52861 53250 53857 54513 55090 55553 55862 56185 56860 57930 59012 59830 60502 61155 61719 62278 63120 64160 64794
54248 64794 64617 63857 62852 61638 60379 59674 59885 60520 60793 60578 60392 60630 61189 61715 61923 61807 61707 61964
54230 61964 62338 62137 61180 60246 60151 60676 60903 60418 59679 59252 59200 59353 59714 60335 61064 61685 62189 62665 63013 63028
54210 63028 62843 62939 63517 64061 63887 63086 62499 62704 63390 63873 63777 63001 61469 59382 57423 56273 56005 56268
54192 56268 56827 57545 58078 58093 57696 57230 56756 56119 55359 54645 53940 53167 52588 52494 52631 52474 52034 51878 52292 52955
54172 52955 53453 53674 53639 53396 53177 53269 53643 54061 54527 55265 56277 57337 58379 59418 60155 60138 59360 58222
54154 58222 56959 55633 54613 54391 54838 55258 55319 55315 55401 55243 54721 54324 54437 54742 54740 54488 54372 54471 54515 54291 53788
54133 53788 53098 52369 51726 51101 50347 49551 48951 48531 48052 47577 47580 48359 49649 50933 51900 52496 52856 53232 53723
54114 53723 54060 53963 53610 53339 53044 52424 51792 51929 52982 54147 54663 54498 53891 52886 51728 51046 51134 51405
54096 51405 51050 49965 48714 47940 48055 49125 50675 51932 52557 52879 53238 53560 53774 54014 54036 53103 51064
54079 51064 49084 48561 49594 51162 52534 53761 54912 55684 55952 56072 56352 56616 56584 56332 56158 56242 56693 57743
54061 57743 59527 61660 63349 64122 64318 64614 65091 65086 64104 62574 61394 61008 61283 62145 63810 66346 69473
54044 69473 72850 76210 79163 81350 82943 84583 86658 88983 91336 93967 97293 101415 106169 111400
54030 111400 116967 122617 128055 133059 137539 141635 145735 150161 154843 159514 164053 168297 171792 174258
54016 174258 176111 177892 179282 179494 178669 177924 177811 177565 176315 174137 171426 168047 163851 159414 155459
54001 155459 152009 148780 145954 143727 141478 138331 134460 130993 128595 126814 124911 122674 120276 117924
53987 117924 115950 114856 114873 115609 116230 116035 114915 113412 112226 111548 110989 110273 109716 109783 110442 111274 112044 112814
53969 112814 113623 114394 115136 115935 116850 117958 119341 120774 121697 121807 121462 121128 120676 119692 118300 117092 116265
53952 116265 115359 114007 112577 111821 112132 113251 114549 115499 116083 116802 118130 119958 121811 123673 126354 130793
53936 130793 137023 143927 150044 154620 157917 160615 163080 165228 166862 167895 168297 168129 167673 167274 167026
53921 167026 166858 167004 168035 170282 173465 177038 180635 184044 187110 189955 193104 197083 202007 207642 213596
53906 213596 219234 223737 226654 228283 229195 229569 229308 228664 228214 228151 227938 226900 224910 222371 219682 216978
53890 216978 214345 212014 210136 208453 206408 203614 200044 195752 190769 185415 180331 175864 171663 167348
53876 167348 163252 159957 157217 154041 149937 145456 141350 137780 134608 131898 129735 127902 126096 124271
53862 124271 122547 120986 119595 118272 116646 114299 111310 108242 105483 102945 100533 98433 96723 95092
53848 95092 93264 91396 89872 88944 88678 88907 89165 89084 88901 89062 89288 88709 87111 85314 83964 82696 81051
53831 81051 79620 79498 80902 82921 84432 84898 84516 84020 84180 85147 86403 87372 87730 87121 85359 83177 82020
53814 82020 82572 84119 85847 87987 90950 94058 96144 97044 97548 98197 99077 100600 103455 107618 112176 116293
53798 116293 119851 123147 126552 130475 135069 139800 143738 146399 148089 149478 151174 153575 156723 160268
53784 160268 163756 166855 169210 170501 170954 171371 172219 173026 173097 172357 170972 168696 165361 161618 158366 155654
53768 155654 152970 150367 148372 146869 144996 142320 139332 136627 134271 132180 130521 129431 128786 128442 128305
53753 128305 128137 127678 127037 126522 126090 125421 124546 123949 124000 124699 125981 127797 129782 131241 131634 130902 129410
53736 129410 127815 126726 126059 124892 122394 118777 114954 111509 108524 106143 104604 103799 103432 103537 104270
53721 104270 105275 105950 106317 106982 108201 109614 110888 112003 112786 112836 112109 111149 110638 111076 112764 115540 118565
53704 118565 120976 122737 124366 125947 127120 127994 129328 131682 135048 139377 144686 150435 155475 159044
53690 159044 161383 163185 164839 166336 167558 168541 169737 171887 175179 178738 181466 183228 184558 185480 185508
53675 185508 184772 184194 184376 185081 185888 186620 187060 187079 187141 187874 189016 189690 189732 189770 189857 189176 187492 185754 184779
53656 184779 184332 184054 184247 184991 185450 184923 183891 183235 183051 182943 182837 182694 182017 180529 178928 178211 178527 179304
53638 179304 180084 180657 180870 180961 181626 183134 184768 185786 186414 187172 187824 187836 187471 187437 187737 187783 187469 187215 187055
53619 187055 186649 186210 186538 187963 189962 191982 193966 195856 197258 197997 198657 200198 203195 207442 212139
53604 212139 216469 220237 223920 227965 232227 236386 240627 245460 251027 257030 263212 269426 275304 280393
53590 280393 284679 288598 292480 296338 300213 304265 308445 312432 316058 319542 323164 326968 330906 335022
53576 335022 339283 343319 346563 348709 349982 350831 351410 351549 351424 351922 353816 356648 358937 359730 359480 359217
53560 359217 359336 359488 359289 358702 358044 357906 358753 360214 361062 360331 358263 355870 353839 352235 350961 350020 349400
53543 349400 349089 349121 349367 349416 348928 347916 346547 344995 343705 343317 343924 344814 345403 346050 347455 349613 351974
53526 351974 354263 356461 358274 359496 360893 363883 369080 375672 382430 388865 395257 402070 409619 418039
53512 418039 427299 437273 447829 458775 469960 481657 494520 508781 523733 538551 553498 569684
53500 569684 587662 606909 626724 647051 668145 689944 712142 734618 757560 781386 806547
53489 806547 833139 860606 888161 915576 943201 971111 998684 1025261 1050862 1075952 1100787
53478 1100787 1125371 1149862 1174633 1199915 1225612 1251474 1277260 1302746 1327700 1351966 1375428
53467 1375428 1397906 1419160 1439137 1458122 1476427 1493831 1509620 1523414 1535817 1547854 1559784
53456 1559784 1570878 1580379 1588191 1594412 1598806 1601111 1601433 1599756 1595444 1587921 1577679 1565902 1553082
53443 1553082 1538722 1522566 1505338 1487876 1470001 1450783 1429660 1406849 1382801 1357827 1332264
53432 1332264 1306618 1281236 1256009 1230580 1204790 1178828 1153069 1127980 1104117 1081950 1061548
53421 1061548 1042635 1025093 1009223 995327 983230 972505 962978 954578 946847 939235 932067 926661
53409 926661 924138 924402 926609 930342 935896 943577 953154 964069 976018 989226 1004208 1021205 1039874
53396 1039874 1059708 1080636 1102931 1126575 1151257 1177139 1205147 1236060 1269596 1304688 1340457
53385 1340457 1376691 1413702 1452144 1492822 1536284 1582508 1631045 1681323 1732764 1785008 1838242
53374 1838242 1893071 1949780 2007858 2066352 2124420 2181516 2237494 2292761 2347832 2402403 2455265
53363 2455265 2505425 2552783 2597316 2638196 2674492 2706376 2734853 2760391 2782481 2800521 2814488
53352 2814488 2824600 2830781 2832637 2829789 2822168 2810166 2794374 2774974 2751511 2723349 2690027 2651076
53340 2651076 2606094 2555549 2501164 2444934 2387938 2330506 2273129 2216566 2161300 2107481 2055295
53329 2055295 2004805 1955542 1906850 1858549 1810846 1763760 1717184 1671320 1626512 1582791 1540224
53318 1540224 1499554 1461820 1427376 1395921 1367422 1342239 1320203 1300323 1281650 1263935 1247187
53307 1247187 1231118 1215360 1200007 1185630 1172830 1161768 1152078 1143332 1135704 1129810 1125726 1122652
53295 1122652 1119934 1117833 1116700 1115999 1115065 1114397 1115105 1117296 1120114 1123436 1128362 1135791 1145458 1156697 1169318
53280 1169318 1183367 1198892 1216410 1236814 1260260 1285625 1311468 1337098 1362500 1387815 1413306
53269 1413306 1439227 1465337 1490913 1515518 1539224 1561903 1582907 1601822 1618913 1634443 1648140
53258 1648140 1659766 1669691 1678386 1685768 1691490 1695371 1697078 1695817 1691008 1683117 1673344 1662578 1650818
53245 1650818 1637356 1621272 1602040 1579938 1555648 1529495 1501487 1472144 1442552 1413289 1383986
53234 1383986 1354318 1324793 1296070 1268130 1240765 1214281 1189025 1164671 1140747 1117565 1095808
53223 1095808 1075363 1055281 1034861 1014177 993614 973467 953966 935184 917011 899653 883945
53212 883945 870471 858484 846488 834028 822202 812107 803423 794976 786175 777217 768061 757929
53200 757929 746101 732845 719168 705719 692328 678721 665279 652710 641152 630075 619035
53189 619035 607987 596762 584889 572278 559676 547863 536684 525273 513123 500462 487689
53178 487689 474942 462321 450165 438841 428318 418063 407493 396606 386185 377112 369432 362291
53166 362291 354869 347038 339029 330900 322668 314649 307159 300067 293126 286615 281175 276893 273061 269071
53152 269071 265187 262040 259543 256837 253389 249740 246722 244211 241220 237302 233213 229821 226905 223646
53138 223646 219962 216603 214070 212265 211203 211144 211692 211580 209926 207233 204664 202750 201283 200040 198988
53123 198988 198022 197079 196459 196635 197773 199685 202121 204809 207405 209778 212266 215327 218984 222845 226503
53108 226503 229636 231874 232879 232628 231426 229687 227754 225767 223559 220858 217707 214451 211210 207700
53094 207700 203772 199781 196110 192642 189052 185356 181777 178289 174736 171329 168537 166446 164546 162275
53080 162275 159511 156503 153492 150500 147456 144499 142080 140627 140082 139950 139783 139430 138838 137953 136936 136111
53064 136111 135517 134777 133594 132086 130522 128992 127549 126386 125764 125931 127091 129040 130850 131526 131102 130501
53048 130501 130147 129471 128133 126858 126398 126388 126051 125489 125342 125556 125476 125047 124968 125566 126327 126656 126467 125913 125127
53029 125127 124381 123954 123668 123058 122116 121337 120891 120304 119257 118210 117880 118399 119320 120235 121065 121809 122305 122349
53011 122349 122000 121718 122064 123129 124366 125115 125227 124983 124554 123799 122552 120929 119318 118173 117679 117537 117251
52994 117251 116784 116632 117014 117312 116746 115469 114490 114583 115652 117163 118745 120193 121261 121759 121799 121869 122561 124122
52976 124122 126150 127885 128929 129614 130668 132752 136262 141130 146612 151704 156138 160649 165937 171725
52962 171725 177238 182181 186679 190508 193147 194497 194980 194846 193890 191961 189377 186726 184463 182699 181138
52947 181138 179333 177257 175425 174119 172757 170532 167525 164690 162754 161593 160646 159514 158178 157012
52933 157012 156539 156814 157108 156582 155178 153466 151838 150388 149369 149118 149470 149850 149983 149999 149823 149100 147862
52916 147862 146701 146076 145937 146180 146948 148158 149169 149259 148265 146665 145268 144820 145489 146591 147147 146865 146302
52899 146302 146143 146705 148120 150353 152800 154399 154574 153840 153198 153134 153371 153320 152596 151299 149991 149308 149499
52882 149499 150400 151746 153230 154360 154695 154300 153693 153316 153335 153902 155190 157012 158739 159752 159835 159208 158414
52865 158414 158084 158455 159166 159815 160516 161522 162549 163145 163573 164605 166350 168062 169261 170340 171803 173559
52849 173559 175395 177531 180252 183332 186378 189502 193277 198117 203896 209976 215503 219841 222820 224412
52835 224412 224326 222361 219071 215538 212391 209549 206965 204932 203457 201983 200106 197987 195747 192979 189325
52820 189325 185117 181043 177498 174554 172224 170388 168803 167467 166637 166251 165746 164658 163003 160880 158250
52805 158250 155357 152807 150816 148932 146838 144856 143209 141486 139457 137781 137141 137177 137019 136500 135958 135234
52789 135234 133833 131937 130320 129189 128007 126573 125471 125140 125140 124762 123892 122909 121995 120900 119313 117321
52773 117321 115543 114690 114788 114999 114474 113232 111876 110683 109514 108497 108164 108683 109465 109759 109309 108272 106835
52756 106835 105195 103610 102226 100905 99437 97814 96172 94644 93364 92468 91905 91297 90198 88565 86925
52741 86925 85905 85555 85213 84213 82650 81233 80390 79874 79373 79069 79304 79978 80684 81286 81924 82535 82760 82370
52723 82370 81523 80546 79709 79192 79028 79065 79163 79325 79444 79079 77931 76483 75743 76130 76974 77306 76886 76261 76014
52704 76014 76296 77008 78132 79748 81843 84223 86653 89013 91306 93546 95735 97928 100256 102763 105255
52689 105255 107369 108867 109867 110708 111492 111823 111230 109928 108830 108465 108130 106566 103443 99709 96379 93519
52673 93519 90659 87720 85134 83214 81809 80490 78892 76964 75021 73416 72078 70665 69218 68286 68153
52658 68153 68356 68371 68384 68888 69764 70383 70597 70947 71699 72199 71535 69635 67384 65750 65021 64825 64665 64361 64107
52639 64107 64211 64801 65712 66652 67527 68581 70029 71527 72241 71683 70274 68846 67798 67113 66950 67563 68613
52622 68613 69154 68554 67031 65166 63376 62018 61406 61406 61476 61449 61797 62781 63835 64286 64258 64350 64746 65168 65365
52603 65365 65170 64435 63488 63250 64255 65831 67008 67914 69382 71329 72608 72615 72088 71934 72089 72085 71989 72117 72238
52584 72238 71860 71150 70944 71799 73495 75535 77710 79947 81904 83083 83415 83472 83888 84632 85092 84944 84663
52567 84663 84987 86089 87545 88959 90309 91706 93093 94271 95075 95574 96212 97577 99751 102006 103506
52552 103506 104245 104971 106167 107527 108528 109126 109594 109943 109919 109537 109312 109795 110985 112324 113234 113566 113539 113461
52534 113461 113615 114201 115145 116032 116508 116705 117037 117575 117982 118056 117947 117792 117517 117121 116740 116306 115569 114629 113959
52515 113959 113617 112952 111431 109361 107436 105965 104924 104318 104084 104070 104533 106081 108571 110681 111361 111218
52499 111218 111497 112080 111601 109515 106950 105365 105253 106442 108681 111416 113663 114697 114600 113900 113003 112192
52483 112192 111757 111842 112421 113549 115319 117500 119548 121078 121981 122145 121521 120487 119620 119017 118291 117348 116629
52466 116629 116483 116808 117450 118443 119665 120744 121519 122206 122910 123424 123601 123493 123023 122052 120920 120288 120293 120477
52448 120477 120807 121959 124153 126314 127034 125976 123847 121492 119589 118823 119557 121340 123204 124514 125285
52433 125285 125900 126738 127913 129163 130197 131250 132854 134872 136350 136689 136451 136499 136825 136884 136671 136697 137040
52416 137040 137154 136672 135858 135134 134514 133584 131834 129115 126019 123611 122450 122070 121662 120986 120269 119546 118667
52399 118667 117745 117029 116489 116058 116098 117000 118354 119221 119350 119529 120507 122057 123386 124114 124574 125348 126639 128037
52381 128037 128901 129124 129353 130190 131375 132192 132463 132618 132918 133248 133701 134648 136087 137582 139060 140987 143419
52364 143419 145575 146832 147622 148773 150439 152311 154505 157481 161197 165014 168386 171185 173445 175335
52350 175335 177315 179690 181987 183379 183873 184473 185962 188064 190087 191841 193495 194953 195952 196609 197412
52335 197412 198717 200527 202613 204595 206080 207053 208022 209507 211508 213723 216025 218359 220470 222214 223905
52320 223905 225773 227354 228198 229054 231352 235266 239332 242469 245465 249621 254681 259225 262815 266630 271876
52305 271876 278462 285507 292441 299257 306256 314014 323216 334033 345734 357216 367938 378240 388865
52292 388865 400292 412452 425005 437816 451048 464732 478503 492025 505546 519761 535115
52281 535115 551452 568282 585076 601377 616941 631867 646409 660651 674453 687622 699939
52270 699939 711227 721596 731425 740816 749311 756527 762807 768723 774146 778475 781634 784089 785812 786065
52256 786065 784505 781886 779266 776970 774707 772284 769879 767859 766581 765999 765369 763850 761739 760586 761663
52241 761663 764698 768517 772509 776943 782242 788606 796270 805431 815822 826722 837576 848453 859873
52228 859873 872253 885365 898245 909817 919816 928904 937735 946105 953193 958387 961671 963490 964510
52215 964510 965254 965694 965346 963893 961493 958305 954153 949015 943419 937828 931814 924432 915362 905252 894963
52200 894963 884917 875155 865611 856161 846721 837435 828603 820366 812607 805237 798426 792511 787701 783880
52186 783880 780660 777654 774689 771666 768378 764757 761257 758505 756429 754205 751322 748342 746182 744942
52172 744942 743869 742284 740156 737829 735535 733177 730451 727249 723964 721158 718853 716532 713965 711592
52158 711592 709815 708496 707560 707489 708532 709816 710046 708973 707469 706274 705379 704567 703770 702699 700769 697766
52142 697766 694180 690653 687377 684178 680829 677169 673210 669253 665623 662202 658515 654358 650026 645841
52128 645841 641790 637740 633752 630042 626796 624022 621425 618493 614995 611367 608358 606293 604937 603947
52114 603947 603087 602095 600832 599669 599310 600012 601269 602409 603313 604476 606610 610226 615406 621907 629626
52099 629626 638818 649588 661327 673120 684709 696652 709534 723404 738054 753386 769369 786017
52087 786017 803475 821768 840400 858653 876416 894208 912223 929823 946299 961658 976331
52076 976331 990427 1003680 1015799 1026464 1035198 1041712 1046311 1049712 1052434 1054502 1055614 1055407 1053747
52063 1053747 1050909 1047326 1043042 1037673 1031048 1023634 1016067 1008536 1000889 993095 985261 977394 969521 961920
52049 961920 954876 948269 941799 935609 930362 926636 924502 923714 923976 924970 926429 928341 930912 934185 937875
52034 937875 941709 945760 950298 955457 961249 967753 975020 982718 990105 996475 1001592 1005636 1008869 1011462
52020 1011462 1013479 1014868 1015480 1015287 1014550 1013570 1012235 1009945 1006092 1000513 993516 985602 977163 968168 958101
52005 958101 946405 933116 918867 904198 889166 873755 858204 842602 826500 809432 791673
51994 791673 773943 756466 738853 720940 703162 685831 668525 650538 631698 612422 593171
51983 593171 574220 555874 538511 522219 506597 491060 475371 459774 444626 430061 416088
51972 416088 402871 390672 379537 369272 359753 350975 342749 334730 326892 319692 313510 308239 303627
51959 303627 299644 296116 292426 288121 283611 279646 276277 272956 269536 266484 263981 261576 258974 256567
51945 256567 254794 253394 251699 249410 246761 244137 241798 239841 238222 236869 235804 234939 233852 232171
51931 232171 230246 228947 228555 228276 227196 225383 223635 222342 221072 219200 216639 213845 211364 209429 207931
51916 207931 206685 205696 205056 204678 204285 203652 202687 201322 199567 197699 196123 194957 194009 193180 192662 192623 192942
51899 192942 193297 193328 192798 191881 191244 191442 192164 192515 192099 191422 191175 191610 192700 194277 195750 196281 195709 194852
51881 194852 194494 194504 194372 194116 194045 194017 193688 193289 193416 194073 194646 194868 195187 195986 197022 197942 198903 200264 201898
51862 201898 203233 203913 204165 204490 205160 206068 207013 208063 209578 211860 214773 217701 219813 220527 219959 219039
51846 219039 218989 220407 222822 225157 226562 226828 226212 225048 223470 221468 219276 217567 216923 217099 217204 216796
51830 216796 216375 216550 217149 217565 217692 217937 218473 219043 219518 220125 220993 221928 222806 223786 224888 225709 225928 225875 226154
51811 226154 226775 227083 226720 226351 227071 229148 231654 233409 234052 234071 234053 234163 234231 234024 233387 232342 231112 229952
51793 229952 228979 228280 228011 228172 228431 228505 228585 229038 229813 230610 231484 232595 233350 232660 230488 228457 228288 230061
51775 230061 232513 234563 235869 236279 235729 234693 233945 233616 233013 231659 230094 229382 230049 231724 233636 235239
51759 235239 236454 237456 238364 239245 240425 242473 245588 249201 252477 255094 257161 258512 258623 257320 255142
51744 255142 252824 250658 248515 246228 243781 241360 239338 238049 237395 236882 236171 235430 234966 234671 234174 233484
51728 233484 233170 233727 234946 236080 236582 236478 236095 235630 235056 234197 232766 230545 227743 224974 222605 220287
51712 220287 217478 214314 211524 209520 208055 206847 205952 205278 204323 202822 201373 200878 201466 202260 202113 200406
51696 200406 197381 194058 191641 190664 190687 190968 191246 191761 192817 194674 197666 202038 207846 215230 224494 235364
51680 235364 246240 254666 258738 258104 253894 248055 242490 238233 235223 232965 231310 230483 230676 231959 234379
51665 234379 237661 240957 243347 244624 245231 245510 245383 244674 243304 241163 238190 234587 230644 226460 222124
51650 222124 218033 214536 211436 208342 205464 203413 202184 200943 198972 196258 192986 189108 184834 181012
51636 181012 178523 177437 177093 176802 176253 175480 174651 173832 172877 171743 170875 170845 171525 172071 171935 171448 171108 170808
51618 170808 170189 169432 169124 169482 170161 170780 171225 171466 171499 171548 172036 173076 174157 174534 173946 172881 172091 171899
51600 171899 172096 172524 173479 175284 177636 179743 181132 181947 182439 182677 182930 183889 186104 189355 192935 196351
51584 196351 199523 202516 205555 209212 214147 220416 227295 233898 239836 245112 249587 252845 254700 255595
51570 255595 256209 256607 256130 254307 251629 249074 247033 245142 243084 240998 239043 237128 235434 234670 235323
51555 235323 236916 238582 240248 242737 246631 251510 256475 261107 265608 270199 274697 278758 282366 285833
51541 285833 289287 292367 294633 296218 297672 299112 299892 299408 298005 296784 296612 297611 299431 301634 303841
51526 303841 305879 307872 309914 311603 312305 311960 311203 310457 309276 307008 303815 300470 297231 293516 288831
51511 288831 283533 278343 273508 268862 264434 260510 257147 254075 251103 248273 245537 242652 239549 236550
51497 236550 234083 232447 231836 232235 233071 233333 232393 230529 228478 226728 225489 224907 224862 224733 223951 222762 222060
51480 222060 222434 223718 225430 227243 228998 230667 232400 234319 236211 237769 239202 241175 244023 247359
51466 247359 250660 253873 257203 260638 264089 267752 271974 276790 281900 287033 292054 296713 300623 303564
51452 303564 305658 307144 308163 308854 309485 310214 310789 310693 309765 308529 307803 308009 308945 310114 311033 311283 310521
51435 310521 308571 305375 300841 294951 288107 281097 274560 268575 262763 256637 249851 242495 235256 228953
51421 228953 223743 219173 215127 212192 210734 210074 209119 207502 205647 204032 202976 202882 204054 206324 209324
51406 209324 212947 217045 220999 224271 227195 230467 233976 236942 239105 240807 241828 241245 238874 235860
51392 235860 233220 230482 226472 220873 214325 207446 200497 193807 187793 182555 177865 173493 169284 165097
51378 165097 160931 156966 153227 149438 145443 141502 137935 134796 132121 130110 128731 127516 126157 124888
51364 124888 123837 122458 120319 118189 117447 118370 119690 120102 119622 119135 119039 118802 117780 116133 114786 114518
51348 114518 115150 115708 115393 114319 113285 113029 113728 115026 116350 117346 118199 119432 121344 123743 126196 128315
51332 128315 129754 130313 130275 130323 130945 132157 133943 136530 139860 143266 146197 149054 152745 157476 162511 167080
51316 167080 171051 174590 177676 180156 181989 183140 183413 182630 180942 178737 176194 173053 169015 164365 159994
51301 159994 156590 153962 151332 148159 144432 140330 136096 132222 129261 127275 125874 124829 124187 123725 122976
51286 122976 122038 121716 122441 123611 124427 124814 124989 124749 123931 123121 123005 123274 123011 122060 121188 120884 120818 120565 120122
51267 120122 119505 118498 117126 115833 114884 114059 113195 112601 112580 112924 113251 113610 114372 115640 117053 118146 118731
51250 118731 118920 118869 118574 117966 117177 116523 116079 115457 114252 112567 110888 109596 108856 108799 109428 110406 111325 112098
51232 112098 112782 113113 112671 111453 109866 108235 106778 106018 106570 108303 110169 111165 111173 110703 110267 110277 111144 112986
51214 112986 115409 117851 120094 122199 124090 125515 126400 126967 127418 127589 127132 126057 124971 124509 124530 124211
51198 124211 123177 122198 122364 123730 125253 125996 125937 125498 124861 124053 123275 122786 122593 122565 122708 123095 123542 123628 123066
51179 123066 122023 120994 120358 120043 119750 119452 119484 120009 120670 121033 121172 121439 121807 121868 121454 120815 120139 119377 118696
51160 118696 118606 119288 120093 120065 118910 117139 115393 113876 112481 111214 110259 109677 109234 108660 107965 107277 106453
51143 106453 105262 104045 103712 104740 106519 108110 109333 110663 112330 114204 116354 118956 121600 123452
51129 123452 124339 124989 125843 126292 125555 123868 122142 120745 119258 117366 115446 114072 113337 112895 112522 112410
51113 112410 112826 113615 114163 113936 112960 111681 110509 109671 109382 109813 110860 112147 113323 114157 114501 114413 114314 114647
51095 114647 115355 116012 116484 117119 118208 119636 121168 122702 124052 124864 125028 124956 125137 125595 126002 126182 126260 126383
51077 126383 126537 126659 126791 127058 127542 128214 129028 130021 131121 131861 131627 130358 128748 127496 126632 125880 125267
51060 125267 124925 124644 124262 124281 125325 127054 128375 128843 129102 129842 131071 132612 134513 136591 138295 139490
51044 139490 140761 142466 144060 144872 144990 144853 144558 144223 144446 145532 146626 146529 145275 144128 144053 144925 146161
51027 146161 147315 147948 147723 147058 147128 148728 151449 154198 156274 157630 158448 158914 159343 160143 161491 163189
51011 163189 164875 166420 168081 170288 173181 176326 178952 180561 181386 182235 183829 186286 189327 192893 197306
50996 197306 202681 208516 214267 220108 226619 233817 241059 248011 255131 262890 271130 279658 289112 300608
50982 300608 314645 330816 348531 367653 388423 411204 436448 464649 496196 531269 569853
50971 569853 611766 656766 704658 755274 808295 863289 919936 978004 1036883 1095300 1151567
50960 1151567 1204064 1251581 1293528 1329891 1360711 1385495 1403510 1414711 1419974 1420256 1416049 1407914
50948 1407914 1396992 1384456 1370877 1356695 1343024 1331230 1321739 1313809 1306551 1299617 1292683 1284669
50936 1284669 1273948 1259337 1240745 1218763 1193636 1164830 1131733 1094588 1054319 1011580 966557
50925 966557 919869 872977 827304 783374 741203 701041 663217 627680 594360 563823 536916
50914 536916 513805 493778 475946 459821 445418 433166 423505 416145 409914 403830 398053 393375 390092
50901 390092 387964 386912 386894 387205 386812 385563 384389 384102 384561 385209 385806 386401 387036 387760 388628 389630 390948
50884 390948 393231 397106 402368 408150 413971 420102 426906 434442 442828 452284 462624 473413 484897
50871 484897 498048 513319 530100 547911 567433 589693 614817 642467 673108 707931 747655
50860 747655 792250 841904 897550 960282 1030793 1109519 1196745 1292304 1395599 1506230 1624231
50849 1624231 1749320 1880127 2014479 2150233 2285377 2417276 2542270 2656391 2756440
50840 2756440 2840214 2905957 2952222 2978687 2986828 2979301 2958646 2926925 2886594 2841175 2794687 2750607
50828 2750607 2711493 2679198 2654909 2638793 2629749 2625535 2623185 2619521 2611562 2596654 2572482 2537363
50816 2537363 2490691 2432793 2364177 2285092 2196006 2098243 1993947 1885607 1775926 1667726
50806 1667726 1563387 1464262 1370967 1284207 1204987 1133993 1071213 1016305 968981 928835 895222
50795 895222 867661 846146 830755 821086 816412 816221 820195 827673 837544 848762 860620 872435 883418
50782 883418 893073 901349 908026 912281 913371 911612 908094 903373 896929 888049 876802 863906 849971
50769 849971 835218 819660 803245 785981 768211 750689 734189 719150 705847 694715 686241 680650
50757 680650 677990 678408 682032 688631 697733 709151 723210 740392 760930 784762 811734 841730 874612
50744 874612 910058 947586 986974 1028763 1074145 1124255 1179740 1241043 1308739 1383218 1464169
50733 1464169 1550520 1640636 1732339 1823085 1910610 1993280 2069457 2136802 2192719 2235402 2263896
50722 2263896 2277313 2274745 2256325 2223916 2180453 2128966 2072441 2014147 1957435 1905028 1858613
50711 1858613 1819026 1786606 1761345 1742763 1729819 1721070 1714969 1709823 1703414 1693042 1676301 1651830
50699 1651830 1619118 1577938 1528425 1471702 1409909 1345505 1280667 1217161 1156280 1098813 1045376
50688 1045376 996811 953881 916672 884753 857931 836358 819878 807954 800514 798282 801857 810905
50676 810905 824762 843544 868067 898630 934256 973167 1013836 1055452 1097543 1139283 1179343
50665 1179343 1216479 1250074 1279997 1306193 1328813 1348477 1365850 1380863 1392894 1401766 1408085 1412462
50653 1412462 1414988 1415733 1415251 1414251 1413304 1413237 1415304 1420397 1428411 1438934 1452329 1469488 1490608 1514773
50639 1514773 1540819 1568053 1596013 1623885 1650527 1675011 1697022 1716720 1734182 1749020 1760670
50628 1760670 1769067 1774788 1778407 1780049 1779908 1779034 1779215 1782071 1788508 1798965 1813806 1833171 1856442 1881950
50614 1881950 1907340 1930337 1949254 1962859 1970056 1970152 1963439 1951187 1934809 1915154 1892530 1866851
50602 1866851 1837502 1803391 1763643 1718193 1667572 1612340 1553064 1490680 1426521 1361919 1297971
50591 1297971 1235601 1175582 1118445 1064461 1013802 966661 923268 883787 848132 815985 787167
50580 787167 761876 740270 721911 706063 692560 681887 674287 669287 666342 665399 666521 669483 674210
50567 674210 681150 690597 701968 714370 727742 742890 760523 780873 804174 830868 861168 894827
50555 894827 931534 971243 1013955 1059318 1106409 1153777 1199952 1244243 1286897 1328187 1367649
50544 1367649 1404726 1440005 1475117 1511353 1548934 1587707 1627889 1669817 1713451 1758547 1805070
50533 1805070 1853121 1902651 1953480 2005461 2058500 2112626 2168126 2225323 2284010 2343380 2402635
50522 2402635 2461369 2519053 2574409 2625696 2671474 2710710 2742204 2764373 2775790 2775768 2764193 2741079
50510 2741079 2706506 2661024 2605860 2542672 2473280 2399803 2324902 2251563 2182470 2119640 2064701
50499 2064701 2019147 1984045 1959450 1944313 1937080 1936328 1940958 1950063 1962908 1979071 1998318 2019969
50487 2019969 2042184 2061947 2075896 2081072 2074947 2055274 2020616 1971164 1908725 1835883 1755390 1670137
50475 1670137 1582958 1496119 1411271 1329887 1253141 1181246 1113738 1050874 994041 944200 900636
50464 900636 862081 828429 800216 776806 756440 738160 722504 710032 700326 693023 688752 688173
50452 688173 690731 695222 701200 708993 718640 729665 741806 755212 769861 785448 802027 820231
50440 820231 840598 863026 887055 912315 938500 965297 992634 1020745 1049681 1078941 1107932
50429 1107932 1136655 1165569 1194845 1224187 1253506 1283305 1314022 1345282 1376364 1407434 1439794
50418 1439794 1474631 1511830 1550412 1589994 1631246 1674728 1719633 1764067 1806476 1846441 1883943
50407 1883943 1918282 1948133 1972591 1991667 2005563 2013847 2015695 2010642 1998619 1979313 1952046 1916408
50395 1916408 1872579 1820998 1762204 1697341 1628354 1557225 1485129 1412601 1340380 1269867 1202946
50384 1202946 1141565 1087180 1040248 1000332 967020 940551 921395 909522 904430 905632 912646 924652
50372 924652 940568 959336 979682 999715 1017278 1030780 1039338 1042229 1038740 1028651 1012423 990810
50360 990810 964692 935412 904712 873974 843665 813751 784466 756502 730620 707206 686089
50349 686089 666701 648547 631621 616346 603147 592157 583155 575500 568311 561089 554272 548922 545764
50336 545764 544685 545091 546499 548781 552074 556500 561876 567857 574586 582882 593385 605626 618479 631392
50322 631392 644688 658706 673344 688628 705095 723271 743151 764390 786597 809238 831663
50311 831663 853555 875016 896063 916419 936066 955528 975181 994594 1012910 1029658 1044828
50300 1044828 1058384 1070093 1079795 1087541 1093507 1097881 1100779 1102185 1101955 1099738 1094652 1085310 1070800
50287 1070800 1051661 1029355 1004745 977782 948838 919341 890539 862403 834515 807370 781852
50276 781852 757819 734323 711146 689140 668930 650134 632202 615329 600181 587146 576124
50265 576124 566623 557842 549134 540760 533842 529251 526725 525327 524437 523955 523833 523923 524313 525381 527433 530469
50249 530469 534371 539041 544186 549221 553679 557658 561583 565481 568800 571106 572672 574077 575404 576175
50235 576175 576019 574975 573185 570721 567795 564656 561117 556627 551121 545358 540063 535147 530253 525739
50221 525739 522462 520698 519834 519171 518592 518371 518663 519355 520144 520778 521395 522592 524914 528328 532464 537193
50205 537193 542577 548359 553987 559147 563827 567872 571028 573567 576284 579567 582864 585403 587030 587933
50191 587933 587926 586623 584209 581477 578896 575903 571356 564580 555998 546779 537884 529358 520572 511177 501704
50176 501704 493150 486118 480544 476107 472612 469899 467655 465474 463094 460485 457717 454785 451544 447777
50162 447777 443308 438072 432139 425746 419353 413507 408540 404359 400608 397066 393826 391102 388897 386957
50148 386957 385042 383145 381327 379380 376905 373869 370871 368581 366943 365306 363446 362079 362023 363081 364205
50133 364205 364711 364900 365410 366450 368007 370455 374359 379628 385321 390486 394973 399298 403916 408825 413688
50118 413688 418154 422167 426148 430789 436405 442489 448064 452526 456003 458923 461366 462964 463423 463126 463057
50103 463057 463925 465416 466593 467077 467418 468148 468997 469521 470054 471278 473031 474446 475386 476954 480284 485443
50087 485443 491887 499334 507576 516017 524216 532646 542236 553170 564742 576379 588255 600804 614185
50074 614185 628358 643196 658241 672701 686015 698268 709850 720898 731273 740955 750255 759637
50062 759637 769446 779726 790286 801017 812116 823899 836332 849009 861718 874893 889312 905370
50050 905370 922785 941076 960227 980883 1003960 1030226 1060284 1094813 1134488 1179519 1229320
50039 1229320 1282753 1338478 1394961 1450235 1501960 1547821 1585947 1615225 1635631 1648402 1655756
50028 1655756 1660251 1664286 1669870 1678314 1689808 1703223 1716349 1726317 1729948 1724132 1706409 1675625 1632326
50015 1632326 1578610 1517437 1451745 1383957 1316102 1250137 1187897 1130648 1078799 1032080 990060
50004 990060 952573 919724 891467 867223 845979 826806 809122 792499 776490 760851 745632
49993 745632 730832 716152 701443 687188 674085 662083 650230 637620 624263 610965 598612
49982 598612 587656 577949 568886 559924 551109 542891 535393 528230 521255 515022 510128 506361 503060 500177
49968 500177 498428 498264 499198 500311 501047 501339 501361 501496 502255 503751 505387 506521 507385 508931 511693 515201
49952 515201 518628 521605 524181 526448 528681 531655 536267 542702 550265 558162 566271 575064 585045 596411
49938 596411 609174 623385 639220 656854 676364 697889 722027 749959 782973 821823 866593
49927 866593 917201 974021 1038051 1110446 1191629 1280533 1374615 1470536 1564747 1653755 1734685
49916 1734685 1806278 1869125 1924613 1973996 2018889 2062038 2106405 2153308 2202038 2251093 2298588
49905 2298588 2341178 2373861 2391931 2392912 2376268 2342137 2291328 2226197 2150406 2067506 1979964 1889307
49893 1889307 1796628 1703090 1610368 1520433 1434426 1352027 1272511 1196241 1124534 1058245 997171
49882 997171 940840 889155 842156 799744 761805 728102 697995 670790 646478 625546 607893
49871 607893 592482 578320 565212 553222 541917 530603 519027 507458 496251 485598 475555
49860 475555 466105 457324 449514 442887 437024 431072 424716 418647 413782 410272 407522 404910 402227 399576
49846 399576 397143 394949 392702 390088 387317 385052 383610 382588 381541 380662 380389 380659 381077 381631 382632
49831 382632 384002 385184 385934 386724 388124 390119 392313 394599 397319 400879 405451 411018 417442 424456 431815
49816 431815 439598 448289 458429 470252 483744 498977 516172 535495 557159 581917 611168 646193
49804 646193 687302 733971 785708 842496 904301 970382 1039022 1107579 1172746 1231243 1280781
49793 1280781 1320520 1350761 1372487 1387478 1398529 1409003 1421743 1438264 1458715 1482190 1506699
49782 1506699 1528756 1543438 1545592 1531673 1500740 1453943 1393487 1322274 1243979 1162559 1081264
49771 1081264 1002324 927554 858763 797224 743049 695399 653262 615894 582801 553739 528786
49760 528786 508077 491263 477292 464854 453189 442452 433271 425904 419914 414702 410118 406387 403600
49747 403600 401567 400105 399147 398547 398109 397890 398177 399055 400212 401315 402367 403549 404924 406484 408281 410274
49731 410274 412085 413126 413107 412378 411739 411761 412233 412336 411420 409532 407171 404792 402714 401240 400451 400003 399507
49714 399507 399028 398908 399148 399383 399437 399529 399912 400681 401918 403612 405367 406626 407313 407857 408549 409294 410057 411053
49696 411053 412306 413454 414204 414659 415088 415736 416903 418680 420531 421721 422325 423192 424663 426039 426699 427014
49680 427014 427600 428320 428735 428979 429400 429772 429734 429654 430120 430735 430435 429123 428048 428216 429168 429805 429901 430273 431718
49661 431718 434226 437171 439912 442103 443627 444463 444790 445144 446081 447527 448719 449065 448802 448552 448509 448462 448381
49644 448381 448439 448528 448308 447767 447352 447410 447845 448424 449141 450162 451607 453429 455388 457136 458478 459478 460179
49627 460179 460469 460448 460704 461845 463869 466384 469256 472562 475952 478669 480376 481573 482972 484800 486970
49612 486970 489620 493118 497546 502454 507329 512282 518118 525458 533909 542439 550647 559178 568662 578755
49598 578755 588716 598531 608891 620278 632694 646112 660520 675568 690739 705940 721417 737152
49586 737152 752997 769445 787528 807745 829645 852710 877061 902984 930307 958738 988421
49575 988421 1019757 1052875 1087664 1124119 1162327 1202210 1243518 1285962 1329240 1373115 1417680
49564 1417680 1463332 1510314 1558301 1606599 1654624 1702138 1749135 1795463 1840423 1882748 1921218
49553 1921218 1955281 1984905 2009973 2030194 2045524 2056136 2061856 2062056 2056335 2045035 2029076 2009625
49541 2009625 1987966 1965177 1941705 1917566 1893094 1869142 1846427 1825177 1805593 1788161 1773249
49530 1773249 1760897 1751305 1745116 1742797 1744074 1748353 1755371 1765144 1777690 1793211 1812196 1834819 1860507
49517 1860507 1888556 1918942 1952049 1987686 2024785 2061986 2098168 2132581 2164858 2194821 2222012
49506 2222012 2245566 2264763 2279385 2289144 2293107 2290257 2280446 2264137 2241346 2211541 2174726 2131999
49494 2131999 2084790 2034019 1980263 1924265 1866825 1808407 1749309 1690177 1632005 1575526 1520748
49483 1520748 1467277 1415049 1364572 1316389 1270482 1226470 1184339 1144616 1107715 1073409 1041113
49472 1041113 1010454 981353 953855 928127 904393 882582 862123 842385 823179 804709 787261
49461 787261 771109 756417 742928 730077 717746 706600 697297 689681 683165 677506 672519 667433 661411
49448 661411 654753 648771 644274 640801 637468 633989 630644 627852 626046 625424 625507 625423 624976 624991 626278 628706
49432 628706 631743 635609 641363 649822 660526 671580 680422 685226 686051 684593 682698 681280 680578 680835
49418 680835 682317 685061 688975 693957 699630 705368 711005 717219 724737 733509 743070 753345 764402 775682
49404 775682 786299 796136 806007 816648 828140 840343 853163 866121 878284 889129 899122 909048
49392 909048 919052 928680 937608 945938 953866 961409 968557 975553 982903 990985 999465 1007299 1013751 1019476
49378 1019476 1026152 1034874 1045314 1056628 1068609 1081485 1094999 1108477 1121787 1135672 1150965 1167771
49366 1167771 1185543 1203678 1222065 1241278 1262317 1285970 1312302 1340792 1370788 1401716 1433150
49355 1433150 1465101 1498135 1532767 1568768 1605551 1643256 1682873 1725113 1769605 1815560 1862852
49344 1862852 1912118 1964070 2019063 2077056 2137561 2199792 2263276 2328312 2395562 2465308 2537406
49333 2537406 2611794 2688529 2767267 2847143 2927292 3007175 3086275 3163889 3239480 3312951 3384195
49322 3384195 3452382 3515987 3573594 3624608 3669173 3707429 3738829 3762256 3776935 3783223 3782263 3774892
49310 3774892 3761278 3741818 3717943 3691429 3663021 3632405 3599703 3566414 3534476 3504787 3477245
49299 3477245 3451995 3429875 3411442 3396222 3383431 3373124 3366133 3363119 3364149 3369133 3378082 3390795
49287 3390795 3406772 3425685 3447699 3473108 3501904 3533815 3568477 3605308 3643473 3682202 3720925
49276 3720925 3758851 3794675 3827104 3855532 3879771 3899223 3912701 3919067 3917685 3908234 3890514 3864638
49264 3864638 3831123 3790628 3743736 3691039 3633226 3571035 3505333 3437232 3367813 3297667 3227054
49253 3227054 3156681 3087939 3022017 2959029 2898312 2839376 2782244 2727064 2673938 2623154 2575137
49242 2575137 2529914 2486964 2445932 2407326 2372175 2340889 2312701 2286328 2261030 2236886 2214191
49231 2214191 2192945 2173047 2154695 2138216 2123541 2110137 2097573 2085995 2075811 2067015 2058998 2051084
49219 2051084 2043128 2035451 2028275 2021366 2014391 2007449 2001012 1995258 1989719 1983765 1977285 1970690 1964329 1958130
49205 1958130 1951759 1944870 1937213 1928722 1919632 1910437 1901722 1894035 1887725 1882628 1877997 1873089 1867888 1863037
49191 1863037 1859085 1856126 1854180 1853466 1854022 1855371 1856922 1858567 1860564 1862975 1865590 1868408 1871931 1876816
49177 1876816 1883358 1891390 1900569 1910644 1921452 1932769 1944277 1955808 1967615 1980258 1994090 2008930
49165 2008930 2024331 2040103 2056427 2073452 2091092 2109459 2129385 2151997 2177506 2204723 2232243
49154 2232243 2260032 2289287 2320648 2353215 2385756 2418344 2452121 2487659 2524241 2560781 2596714
49143 2596714 2631807 2665722 2698235 2729550 2760008 2789671 2818455 2846562 2874420 2902141 2929181
49132 2929181 2954603 2977750 2998762 3018389 3037218 3055152 3071774 3087012 3101154 3114356 3126588
49121 3126588 3138006 3148944 3159478 3169387 3178581 3187207 3195322 3202930 3210338 3217874 3225217 3231677 3237428
49108 3237428 3243717 3251423 3259999 3268328 3276127 3283913 3292095 3300791 3310201 3320439 3331138 3341860 3352823
49095 3352823 3364661 3377580 3391231 3405300 3419718 3434411 3449435 3465251 3482243 3499916 3517149
49084 3517149 3533342 3548787 3563854 3578455 3592539 3606612 3621311 3636640 3651841 3665844 3677891
49073 3677891 3688037 3697142 3706104 3715022 3723293 3730431 3736448 3741438 3745298 3747928 3749267 3749000 3746640 3742063
49059 3742063 3735574 3727290 3716884 3704127 3689243 3672479 3653804 3633411 3612057 3590353 3567976 3544130
49047 3544130 3518674 3492279 3465549 3438520 3411150 3383865 3357390 3332294 3308835 3287002 3266489
49036 3266489 3246894 3228214 3211118 3196498 3184763 3175705 3168948 3164255 3161363 3159848 3159491 3160628 3163829
49023 3163829 3169188 3176169 3184207 3193249 3203581 3215302 3228142 3241664 3255549 3269704 3284163 3298781
49011 3298781 3312990 3326028 3337497 3347529 3356377 3364010 3370190 3374672 3377258 3377848 3376578 3373622 3368805
48998 3368805 3361768 3352593 3341752 3329219 3314196 3296247 3276157 3255128 3233556 3211289 3188681 3166424
48986 3166424 3144541 3122490 3100291 3078677 3058006 3037903 3018129 2998863 2979775 2959766 2938207
48975 2938207 2915660 2892767 2869216 2844623 2819777 2795905 2773057 2750319 2727515 2705604 2685139
48964 2685139 2665318 2645093 2624537 2604495 2585300 2566578 2548189 2530730 2514961 2501118 2489035
48953 2489035 2478635 2470036 2463204 2457787 2453319 2449443 2446011 2443226 2441792 2442635 2446183 2451990 2459228 2467405
48939 2467405 2476432 2486265 2496877 2508492 2521310 2534925 2548427 2561331 2574123 2587757 2602866 2619629
48927 2619629 2638037 2657897 2678707 2699909 2721350 2743384 2766496 2790831 2815997 2841327 2866509
48916 2866509 2892102 2919329 2949244 2982080 3017366 3054561 3093500 3134326 3177100 3221615 3267704
48905 3267704 3315681 3366157 3419294 3474486 3531012 3588713 3647718 3707842 3768709 3830194 3892237
48894 3892237 3954466 4016637 4079236 4142810 4206707 4269291 4329544 4387642 4443843 4497752 4549029
48883 4549029 4597859 4644122 4686981 4725990 4761827 4795125 4825241 4851198 4873300 4892676 4909484
48872 4909484 4922768 4932052 4937902 4940630 4939394 4933079 4921409 4904871 4884085 4859632 4831986 4801160
48860 4801160 4766709 4728413 4686753 4642521 4596237 4548041 4497833 4445342 4390455 4333742 4276319
48849 4276319 4218889 4161136 4102400 4042786 3983302 3925035 3868492 3813712 3760677 3709405 3659743
48838 3659743 3611348 3564076 3518330 3474808 3433835 3395231 3358990 3325790 3296385 3270651 3247680
48827 3247680 3226788 3207997 3191501 3177184 3164859 3154575 3146436 3140458 3136895 3136405 3139457 3145693 3154235
48814 3154235 3164594 3177004 3191938 3209583 3229839 3252454 3276945 3302559 3328637 3355083 3382300
48803 3382300 3410587 3439663 3468908 3497964 3526956 3556163 3585652 3615296 3644902 3674207 3702915
48792 3702915 3730925 3758439 3785748 3813036 3840535 3868708 3898002 3928414 3959510 3990915 4022645
48781 4022645 4054911 4087778 4121101 4154817 4189228 4224849 4261836 4299673 4337619 4375397 4413100
48770 4413100 4450408 4486462 4520736 4553538 4585118 4614615 4640429 4661528 4677827 4689402 4695937
48759 4695937 4697089 4692856 4683346 4668595 4648900 4625074 4598031 4568190 4535434 4499507 4460380 4418322
48747 4418322 4373748 4326935 4277820 4226165 4171945 4115542 4057639 3999067 3940669 3883141 3826967
48736 3826967 3772633 3720815 3672190 3627072 3585435 3547182 3512205 3480266 3451121 3424815 3401690
48725 3401690 3382117 3366286 3354114 3345157 3338774 3334688 3333236 3334689 3338445 3343288 3348395 3353783 3359862
48712 3359862 3367024 3375635 3385880 3397404 3409480 3421673 3434069 3446840 3459947 3473312 3486841 3500261
48700 3500261 3513358 3526492 3540289 3554653 3568664 3581809 3594876 3609312 3626076 3645493 3667705
48689 3667705 3692774 3720595 3751348 3785858 3825042 3868978 3916834 3967646 4020860 4076310 4134212
48678 4134212 4195268 4260354 4329825 4403148 4479231 4557000 4635656 4714544 4792966 4870219 4945745
48667 4945745 5019075 5089420 5155477 5215809 5269324 5315168 5352434 5380467 5399296 5409105 5409277 5398766
48655 5398766 5377665 5347640 5310336 5265969 5214132 5155398 5091268 5022811 4950191 4873523 4793516
48644 4793516 4711235 4627691 4543695 4459602 4375128 4289880 4204124 4118726 4034360 3951164 3869182
48633 3869182 3788744 3710329 3634329 3560989 3490332 3422226 3356803 3294632 3236111 3180841 3128044
48622 3128044 3077462 3029362 2983803 2940548 2899632 2861330 2825432 2791234 2758385 2727117 2697395
48611 2697395 2668573 2640271 2612921 2586891 2561576 2536047 2510289 2485167 2461365 2438906 2417562
48600 2417562 2397142 2377396 2358095 2339303 2321174 2303468 2285624 2267445 2249406 2232203 2216280
48589 2216280 2201777 2188636 2176610 2165423 2155042 2145672 2137395 2130065 2123653 2118432 2114615 2112009 2110317
48576 2110317 2109712 2110795 2113876 2118534 2124008 2129803 2135722 2141468 2146671 2151351 2156030 2161118 2166437 2171652
48562 2171652 2176953 2182958 2189971 2197761 2206131 2215257 2225256 2235702 2245890 2255383 2264117 2272172 2279702
48549 2279702 2287008 2294369 2301846 2309417 2317236 2325573 2334570 2344244 2354664 2365902 2377853 2390392 2403700
48536 2403700 2418153 2433772 2450016 2466336 2482743 2499601 2516907 2534034 2550262 2565349 2579401
48525 2579401 2592316 2603679 2613281 2621498 2628940 2635834 2641985 2647293 2652093 2657037 2662854 2670141 2679052
48512 2679052 2689089 2699541 2710342 2722282 2736201 2752263 2770221 2790094 2812136 2836280 2862045
48501 2862045 2889178 2918137 2949852 2985102 3024122 3066679 3112482 3161513 3213765 3268613 3324713
48490 3324713 3380836 3436652 3492374 3547827 3602236 3654767 3704662 3750844 3792008 3827419 3857173
48479 3857173 3881376 3899540 3911221 3916846 3917346 3913134 3904032 3890149 3872272 3851261 3827580 3801699
48467 3801699 3774548 3747106 3719628 3691647 3662783 3633274 3603592 3573676 3542767 3509972 3474791
48456 3474791 3437028 3396406 3352577 3305519 3255673 3203560 3149460 3093610 3036444 2978346 2919348
48445 2919348 2859429 2799138 2739540 2681446 2625039 2570389 2517987 2468443 2421860 2377845 2336096
48434 2336096 2296649 2259603 2224955 2192814 2163541 2137474 2114639 2094733 2077279 2061805 2048149
48423 2048149 2036723 2028129 2022289 2018172 2014776 2012246 2011596 2013371 2017035 2021850 2027851 2035566 2045014 2055457
48409 2055457 2066133 2076901 2088131 2100202 2113212 2126950 2140977 2154783 2168088 2181076 2194405
48398 2194405 2208864 2224793 2241700 2258514 2274310 2288776 2302088 2314616 2326813 2338960 2350642
48387 2350642 2360773 2368633 2374813 2380660 2386825 2392805 2397937 2402318 2406551 2411093 2416148 2421789 2427811 2433742
48373 2433742 2439371 2445110 2451578 2459003 2467251 2476199 2485724 2495554 2505490 2515615 2525971 2536223 2546107
48360 2546107 2556074 2566966 2578992 2591433 2603493 2615118 2626887 2639464 2653265 2668362 2684318
48349 2684318 2700253 2715303 2729159 2742240 2755390 2769306 2784081 2799276 2814447 2829467 2844284
48338 2844284 2858658 2872402 2885731 2899084 2912760 2926985 2942046 2957889 2973708 2988472 3001941
48327 3001941 3014757 3027587 3040573 3053627 3066688 3079560 3091963 3103884 3115466 3126478 3136423
48316 3136423 3145393 3154219 3163406 3172324 3179885 3185707 3190296 3194347 3198251 3201942 3204862 3206308 3206254 3205731 3206130
48301 3206130 3208178 3211686 3216005 3220491 3224926 3229844 3236207 3244491 3254348 3265453 3278220 3293210 3310252
48288 3310252 3328781 3348799 3370792 3394722 3419669 3444510 3468476 3491009 3511596 3529807 3545143
48277 3545143 3556795 3563967 3566488 3564663 3558422 3546980 3529501 3505857 3476670 3442862 3405211 3364097
48265 3364097 3319621 3272115 3222448 3171565 3119857 3067334 3014381 2961939 2910919 2861758 2814454
48254 2814454 2768596 2723397 2678271 2633576 2590376 2549245 2509651 2470697 2432115 2394299 2357633
48243 2357633 2322068 2287249 2252905 2219197 2186704 2155879 2126524 2098004 2069919 2042311 2015321
48232 2015321 1988987 1963372 1938440 1913782 1888900 1863862 1839277 1815540 1792496 1769933 1747798
48221 1747798 1725822 1703532 1681022 1659182 1638700 1619210 1599895 1580581 1561647 1543068 1524200
48210 1524200 1504536 1484240 1463775 1443348 1422869 1402270 1381697 1361425 1341573 1321940 1302209
48199 1302209 1282313 1262488 1243057 1224309 1206534 1189768 1173459 1156851 1139909 1123510 1108437
48188 1108437 1094524 1081114 1068047 1055685 1044123 1032851 1021352 1009782 998928 989554 981795 975161
48176 975161 969199 963985 959716 956012 952177 948314 945558 944841 945889 947879 950575 954153 958230 961938
48162 961938 965044 968341 972735 978413 985066 992425 1000269 1008265 1016208 1024267 1032748 1041667 1050799 1060071
48148 1060071 1069703 1079904 1090549 1101251 1111773 1122270 1133079 1144341 1155914 1167621 1179411
48137 1179411 1191232 1202978 1214636 1226346 1238177 1250030 1261857 1273801 1285939 1298055 1309933
48126 1309933 1321721 1333694 1345647 1356835 1366719 1375690 1384867 1395078 1406067 1416784 1426480 1435366
48114 1435366 1444106 1452893 1461303 1468966 1476001 1482763 1489492 1496282 1503202 1510388 1518213 1527253 1537714 1548981
48100 1548981 1560270 1571798 1584791 1600221 1618092 1638213 1661058 1687421 1717674 1751915 1790667
48089 1790667 1835077 1886645 1947053 2018228 2102496 2202249 2317683 2442266 2559800 2648735 2693144
48078 2693144 2691433 2654983 2599254 2536507 2474566 2418502 2371418 2334483 2307372 2288715 2276221
48067 2276221 2267419 2260973 2256909 2255292 2255276 2255734 2256197 2256691 2257183 2257621 2258172 2258929 2259600 2259723 2258868 2256527 2252258
48050 2252258 2246341 2239867 2233772 2227974 2221680 2214236 2205423 2195361 2184502 2173468 2162490 2151203 2139289
48037 2139289 2127127 2115456 2104536 2093854 2082520 2069832 2055702 2040809 2026044 2011531 1996330
48026 1996330 1979303 1960073 1938971 1916375 1892444 1867320 1841217 1814366 1787028 1759376 1731143
48015 1731143 1701696 1670854 1639465 1608766 1579134 1549844 1520111 1490101 1460840 1433312 1407756
48004 1407756 1383717 1360563 1337878 1315486 1293380 1271829 1251434 1232757 1215907 1200673 1186942
47993 1186942 1174564 1162819 1150623 1137619 1124751 1113355 1103870 1095675 1087951 1080379 1073092 1066295
47981 1066295 1059952 1053738 1047376 1041123 1035720 1031666 1028751 1026511 1024907 1024174 1024102 1023903 1022971 1021570 1020596
47966 1020596 1020625 1021281 1021536 1020695 1018982 1017075 1015201 1012898 1009588 1005060 999403 992849 985737 978237 969941
47951 969941 960126 948672 936387 924101 911810 899020 885614 871933 858236 844568 831048 817840
47939 817840 804878 792048 779651 768288 758245 749285 741065 733489 726606 720587 715785 712471 710339
47926 710339 708663 707206 706642 707723 710255 713334 716524 720317 725215 730844 736442 742020 748445 756241
47912 756241 764781 772988 780493 787706 794984 802234 809249 815873 821671 825870 827904 827870 826393 824276 822297
47897 822297 820874 819738 818194 815860 812830 809079 804268 798469 792603 787611 783415 779211 774632 770194
47883 770194 766625 764155 762476 761113 759782 758642 758208 758859 760508 762920 766155 770384 775328 780290 784795
47868 784795 788966 793213 797788 802734 808074 813836 819978 826370 832927 839752 847019 854543 861458 866616
47854 866616 869436 870328 870189 869647 868713 866959 864016 860124 856134 852558 848639 842920 834866 825368 815465
47839 815465 805334 795008 785310 777185 770469 764186 757848 751725 745981 740430 735132 730440 726238 721827
47825 721827 716792 711397 705964 700489 695096 690241 685979 681516 675993 669481 662875 657035 652289 648458
47811 648458 645043 641497 637638 633715 630013 626571 623398 620620 618236 616023 613891 612053 610603 609290
47797 609290 608009 607164 607084 607334 607126 606318 605577 605553 606349 607860 610168 613397 617492 622414 628341 635442 643501
47780 643501 652017 660661 669554 679108 689656 701223 713651 726927 741290 756923 773589 790807
47768 790807 808482 827108 847145 868302 889734 910913 932031 953464 975107 996392 1016715
47757 1016715 1035611 1052649 1067505 1080172 1090910 1099990 1107582 1113767 1118391 1120955 1120918 1118184 1113111
47744 1113111 1106082 1097324 1087098 1075729 1063399 1050225 1036592 1023057 1009833 996683 983537 970854
47732 970854 959160 948519 938663 929366 920474 911896 903858 896943 891567 887638 884923 883447 883269 884250
47718 884250 886407 890185 895862 902909 910356 917645 924755 931714 938474 945018 951107 956064 959367 961407
47704 961407 963125 964973 966671 967896 968562 968390 966796 963440 958456 952080 944507 936195 927781 919418 910555
47689 910555 900601 889562 877933 866275 855001 844287 834103 824558 816173 809409 803998 799221 794896
47676 794896 791595 789796 789313 789749 790974 793000 795839 799759 805189 812130 820092 828827 838660 849764
47662 849764 861635 873721 886166 899402 913305 927268 940945 954480 967985 981103 993079
47651 993079 1003168 1011178 1017724 1023686 1029241 1033645 1036172 1036863 1036179 1034290 1031082 1026557 1020893 1014321
47637 1014321 1007192 999864 992218 983727 974463 965751 959293 955814 954927 956045 958800 962713 967217 972201
47623 972201 978123 985376 993813 1002953 1012300 1021408 1029961 1037961 1045615 1052855 1059087 1063503 1065603 1065430
47609 1065430 1063387 1059838 1054737 1047643 1038121 1026052 1011545 994663 975392 953790 930124 904927
47597 904927 878898 852524 825852 798900 772271 746939 723312 700971 679513 659180 640372
47586 640372 623002 606792 591778 578049 565361 553537 542883 533562 524828 515687 506260 497750
47574 497750 490954 485371 479978 474393 469015 464398 460659 457389 454121 451029 448958 448471 449106 449998 450943
47559 450943 452320 454234 456490 459297 463163 468017 473191 478445 484231 490818 497936 505581 514253 523884
47545 523884 533348 541693 549227 556722 564152 571018 577335 583284 588130 590544 590073 587551 583986 579767
47531 579767 574989 569794 564090 557512 550038 542148 534151 525706 516349 506246 496164 486880 478703 471348
47517 471348 464121 456489 448612 441166 434679 429301 425138 422311 420557 419264 418171 417666 418094 419185 420459
47502 420459 421831 423371 424756 425429 425173 424097 422236 419668 416894 414533 412550 410225 407024 403126 398971
47487 398971 394666 389982 384639 378461 371600 364827 359226 355350 352838 350952 349236 347491 345607 343784
47473 343784 342647 342588 343129 343358 342955 342443 342397 342829 343391 343820 344009 343951 343854 344096 344845 345839 346752 347718 349248
47454 349248 351592 354365 356938 359058 360946 362866 364896 367171 369959 373208 376219 378237 379355 380409
47440 380409 381933 383670 385176 386436 387645 388854 390251 392358 395479 399156 402609 405505 407976 410268
47426 410268 412862 416570 421840 428117 434587 441384 449335 458627 468603 478937 490122 502539 515906
47413 515906 530072 545553 562728 581032 599469 617466 634840 651465 667568 683821 700435
47402 700435 716490 730848 743454 755065 765868 775069 781810 785863 787438 786847 784399 780136 773633
47389 773633 764521 753274 741001 728370 715177 701082 686322 671487 656965 642878 629372 616723
47377 616723 605219 594965 585739 577109 568965 561845 556455 552856 550445 548707 547673 547518 548137 549337
47363 549337 551151 553726 557028 560894 565273 570277 576041 582535 589384 595794 600946 604637 607464 610135
47349 610135 612627 614182 614105 612350 609318 605299 600406 594895 589098 582909 575688 567049 557515 547986 538714
47334 538714 529328 519795 510660 502105 493513 484429 475436 467450 460475 453688 446548 439243 432160 425523
47320 425523 419528 414261 409381 404408 399469 395315 392368 390182 388062 385964 384471 384041 384520 385320 385963
47305 385963 386459 387132 388054 388824 389077 389061 389397 390316 391408 392098 392097 391452 390463 389539 388881 388253 387340 386224 385182
47286 385182 384133 382740 381124 379993 379825 380261 380551 380388 380109 380277 381228 382927 385058 387270 389412 391543
47270 391543 393854 396628 400153 404454 409205 414120 419241 424695 430384 436204 442307 448693 454813 460152
47256 460152 465131 470825 477763 485571 493796 502335 510868 518595 525044 530727 536538 542751 548855 554104
47242 554104 557926 560180 561333 562232 563381 564564 565299 565354 564717 563309 560980 557622 553240 548170 543237
47227 543237 539302 536462 534051 531440 528473 525134 521464 518080 516020 515571 515783 515577 514842 513986 513031 511973
47211 511973 511527 512586 515083 518227 521800 526386 532208 538607 544979 551605 559053 567211 575384 583144
47197 583144 590641 598148 605600 612633 618860 623953 627503 629084 628709 627171 625483 623849 621510 617839
47183 617839 613216 608426 603556 598072 591854 585544 579825 574825 570370 566386 562925 560169 558547 558498 559917
47168 559917 562098 564460 567123 570644 575384 581287 588143 595839 604411 613961 624503 635930 648188
47155 648188 661349 675357 689864 704582 719674 735322 750919 765258 777784 789161 800217
47144 800217 810667 819350 825520 829376 831422 831934 831217 829855 828240 826107 822867 818327 812795 806575
47130 806575 799731 792434 785213 778703 773225 768697 764717 760659 755952 750594 745273 740753 737133 733920
47116 733920 730752 727811 725575 724440 724533 725586 726898 727824 728474 729736 732417 736517 741388 746423 751453
47101 751453 756660 762260 768155 773823 778701 782688 786087 788997 791046 791768 790913 788275 783633 777127 769331
47086 769331 760692 751185 740849 730231 719806 709174 697497 684716 671841 659940 649267 639467
47074 639467 630199 621257 612409 603513 594801 586861 580283 575278 571585 568696 566225 564063 562286 561090
47060 561090 560816 561774 563841 566470 569313 572677 577040 582212 587337 591740 595531 599334 603637 608459 613466
47045 613466 618263 622675 626824 630949 635176 639440 643465 646770 648991 650367 651765 653975 657074 660590
47031 660590 664065 667277 670199 673127 676661 681133 686151 691105 696036 701535 707765 714159 720296 726589
47017 726589 733719 741647 749545 756703 763193 769627 776427 783456 790380 797248 804506 812384 820559 828682
47003 828682 836975 845946 855590 865293 874564 883442 892089 900386 908195 915756 923472 931312 938672 944826
46989 944826 949426 952587 954616 955721 956021 955687 954928 953703 951685 948683 944979 941029 936934 932548 928081
46974 928081 924269 921775 920639 920426 920767 921614 923122 925431 928561 932388 936724 941437 946535 952128 958329
46959 958329 965105 972243 979560 987130 995096 1003197 1010792 1017558 1023953 1030631 1037557 1043907 1048842 1052186
46945 1052186 1054418 1056205 1057861 1059105 1059453 1058935 1058162 1057532 1056742 1055360 1053466 1051232 1048304 1044351 1039972
46930 1039972 1036238 1033319 1030407 1027168 1024427 1023020 1022695 1022680 1022782 1023369 1024621 1026366 1028490 1030980 1033769
46915 1033769 1036966 1041064 1046425 1052618 1058681 1064060 1068955 1073842 1079080 1085021 1092017 1100036 1108540 1117009
46901 1117009 1125420 1134018 1142841 1151779 1161001 1170890 1181358 1191524 1200386 1207673 1213739 1218782 1222625
46888 1222625 1225260 1227021 1227954 1227429 1224829 1220341 1214768 1208858 1203187 1198364 1194780 1192303 1190837 1191068 1193977
46873 1193977 1199543 1206498 1213555 1220447 1227642 1235604 1244534 1254383 1264698 1274665 1283574 1291151 1297455 1302772
46859 1302772 1307600 1312293 1316618 1319986 1322290 1324183 1326493 1329746 1334209 1339853 1346098 1352196 1358105 1364507
46845 1364507 1371758 1379392 1386986 1394899 1403737 1413591 1424236 1435510 1446946 1457487 1466276 1473519 1480009
46832 1480009 1486073 1491531 1496361 1500646 1503967 1505601 1505397 1503898 1501483 1497949 1493121 1487431 1481599 1475982
46818 1475982 1470484 1464993 1459806 1455559 1452691 1450971 1449714 1448560 1447811 1447948 1449157 1451619 1455783 1461990
46804 1461990 1470062 1479702 1491118 1504799 1520781 1538529 1557407 1576905 1596610 1616409 1636608 1657369
46792 1657369 1678032 1697441 1714892 1730360 1743790 1754669 1762487 1767313 1769800 1770726 1770503 1768907 1765370
46779 1765370 1759739 1752576 1744456 1735225 1724414 1712184 1699364 1686642 1674248 1662345 1651061 1640007
46767 1640007 1628351 1615669 1602462 1589682 1578025 1567699 1558433 1549613 1540720 1531802 1523290 1515373
46755 1515373 1507916 1500917 1494586 1488910 1483663 1478974 1475454 1473528 1472990 1473394 1474545 1476403 1478886 1482004
46741 1482004 1485966 1490991 1497185 1504599 1513101 1522161 1531212 1540316 1550070 1560672 1571533 1581965 1591848
46728 1591848 1601338 1610351 1618650 1626178 1632984 1639074 1644534 1649545 1654122 1658139 1661757 1665420 1669290 1673074
46714 1673074 1676645 1680297 1684099 1687493 1690012 1692092 1694761 1698827 1704673 1712371 1721469 1730994 1740273 1749504
46700 1749504 1759096 1768759 1777820 1786120 1793870 1800784 1806086 1809328 1810470 1809119 1804494 1796369 1785423 1772377
46686 1772377 1757361 1740438 1722114 1702760 1681882 1658601 1632846 1605746 1578825 1552980 1528147
46675 1528147 1503686 1479105 1454525 1430548 1407720 1386210 1365924 1346635 1327967 1309528 1291323
46664 1291323 1273849 1257610 1242581 1228330 1214582 1201486 1189301 1177979 1167163 1156602 1146468
46653 1146468 1137211 1129191 1122652 1118008 1115834 1116354 1119211 1124003 1130814 1139893 1151053 1163835 1178066
46640 1178066 1193653 1209895 1225683 1240549 1254889 1268875 1281800 1292963 1302604 1311276 1318707 1324042
46628 1324042 1327107 1328587 1328906 1327710 1324810 1321022 1317567 1314978 1313082 1311893 1311937 1313718 1317358 1323003 1331180
46613 1331180 1342319 1356060 1371445 1387894 1405660 1425063 1445614 1466315 1486674 1506836 1526683
46602 1526683 1545344 1561878 1575937 1587390 1595678 1600189 1601019 1598712 1593298 1584298 1571857 1557203 1541612
46589 1541612 1525374 1508125 1489814 1470873 1451698 1432512 1413636 1395405 1377800 1360521 1343460
46578 1343460 1326813 1310704 1295069 1280008 1265886 1252819 1240328 1227776 1215018 1202375 1189993
46567 1189993 1177531 1164647 1151621 1139239 1128014 1117712 1107795 1098178 1089285 1081461 1074633 1068614
46555 1068614 1063332 1058523 1053625 1048419 1043585 1040083 1038015 1036532 1034886 1033064 1031291 1029512 1027778 1026765
46541 1026765 1027339 1029656 1032992 1036512 1039974 1043748 1048375 1054041 1060339 1066569 1072417 1078262 1084698 1091962
46527 1091962 1100032 1109042 1119153 1130121 1141444 1152951 1164839 1177056 1189214 1201382 1214464 1229223
46515 1229223 1245227 1261345 1277231 1293740 1311829 1331610 1352656 1374642 1397234 1419785 1441759
46504 1441759 1463302 1484848 1506277 1527035 1547082 1567016 1586990 1606051 1623010 1637502 1649766
46493 1649766 1659782 1667269 1672415 1675989 1678634 1680410 1681038 1680280 1678078 1674730 1670913 1667192 1663533 1659603
46479 1659603 1655413 1651148 1646470 1640736 1633950 1626739 1619141 1610153 1598994 1586178 1572729 1558887 1544231
46466 1544231 1528637 1512259 1494789 1475575 1454504 1432104 1408713 1384161 1358331 1331505 1304068
46455 1304068 1276437 1249388 1223836 1200077 1177753 1156818 1137973 1121795 1107921 1095578 1084565
46444 1084565 1075280 1068060 1063048 1060502 1060652 1063169 1067272 1072525 1079246 1087934 1098416 1109770 1120991
46431 1120991 1131631 1141774 1151551 1160832 1169420 1177352 1184736 1191313 1196474 1199893 1201938 1203309 1204390
46418 1204390 1205093 1205203 1204623 1203401 1201772 1200245 1199433 1199689 1200971 1203121 1206184 1210380 1215940 1223043 1231869
46403 1231869 1242529 1254979 1269196 1285494 1304458 1326366 1350818 1377189 1405435 1436121 1469633
46392 1469633 1505656 1543589 1583108 1623967 1665435 1706416 1746243 1785058 1823216 1860350 1895105
46381 1895105 1925804 1951471 1972265 1988901 2001685 2010308 2014518 2014537 2010482 2001792 1987822 1969010 1947040
46368 1947040 1923724 1899994 1875885 1851103 1825535 1799565 1774093 1750067 1727905 1707539 1688950
46357 1688950 1672383 1658138 1646511 1637982 1633000 1631559 1633348 1638388 1647041 1659348 1674938 1693823
46345 1693823 1716655 1743779 1774594 1808438 1845655 1887064 1932600 1981230 2032132 2085145 2139902
46334 2139902 2195168 2249375 2301380 2350401 2395698 2436737 2473390 2505395 2531651 2550504 2560939
46323 2560939 2563212 2558242 2546611 2528369 2503577 2472705 2436454 2395506 2350665 2303049 2253839 2203781
46311 2203781 2153145 2102248 2051973 2003656 1958498 1917062 1879335 1845224 1814908 1788584 1765982
46300 1765982 1746475 1729860 1716798 1708205 1704386 1704980 1709565 1717869 1729469 1743780 1760500 1779753
46288 1779753 1801697 1826215 1852965 1881414 1910771 1940345 1970092 2000494 2031792 2063697 2095909
46277 2095909 2128315 2160368 2190836 2218731 2244209 2267986 2290089 2309691 2326050 2339045 2348744
46266 2348744 2354952 2357397 2356023 2350953 2342391 2330734 2316569 2300414 2282545 2263242 2243159 2223234
46254 2223234 2204080 2185519 2166967 2148437 2130948 2115680 2102925 2092238 2083432 2076752 2072038 2068541
46242 2068541 2065943 2064945 2066270 2069532 2073654 2077980 2082297 2086182 2089169 2091508 2093891 2096357 2098136 2098640
46228 2098640 2097836 2095465 2090715 2083181 2073536 2062772 2051159 2038430 2024579 2009837 1994123 1977197
46216 1977197 1959367 1941462 1924001 1906840 1889742 1872824 1856212 1839713 1823295 1807650 1793701
46205 1793701 1781520 1770188 1758936 1747988 1738034 1729249 1721334 1714334 1708865 1705457 1704156 1704908 1707809
46192 1707809 1712712 1718963 1725964 1733835 1743216 1754492 1767427 1781415 1795903 1810703 1825998 1841915
46180 1841915 1858064 1873816 1889134 1904589 1920301 1935481 1949552 1963233 1977684 1992841 2007420
46169 2007420 2020503 2032324 2043400 2053781 2063523 2073255 2083731 2095088 2106889 2118662 2130154 2141284
46157 2141284 2152087 2162610 2172841 2182931 2193344 2204327 2215250 2225051 2233580 2241952 2251291 2261577
46145 2261577 2272088 2282417 2292482 2301830 2309696 2315840 2320845 2325402 2329622 2333156 2335765 2337540 2338628
46132 2338628 2338947 2338260 2336567 2334280 2331870 2329423 2326705 2323594 2320198 2316583 2312689 2308578 2304514 2300678
46118 2300678 2297012 2293364 2289590 2285478 2280863 2275897 2270991 2266380 2261950 2257444 2252600 2247186 2241307 2235652
46104 2235652 2230907 2226840 2222542 2217710 2213098 2209421 2206425 2203429 2200233 2196922 2193358 2189512 2185955 2183194
$$ [...]
##END NTUPLES=NMR SPECTRUM
##END=
