##TITLE=NES1030_18715_9268428_lwIZUFAeM2
##JCAMPDX= 6.0         $$ Bruker NMR JCAMP-DX V2.0
##DATA TYPE= NMR SPECTRUM
##DATA CLASS= NTUPLES
##ORIGIN= BRUKER
##OWNER= Administrator
$$ 1.72 TOPSPIN		Version 2.1
$$ 2015-07-10 18:56:19.316 -0700  Administrator@X
$$ Compression mode = diff/dup
##.OBSERVE FREQUENCY= 400.02188249412
##.OBSERVE NUCLEUS= ^1H
##.ACQUISITION MODE= SIMULTANEOUS (DQD)
##.ACQUISITION SCHEME= undefined
##.AVERAGES= 8
##.DIGITISER RES= 22
##SPECTROMETER/DATA SYSTEM= spect
##.PULSE SEQUENCE= zg30
##.SOLVENT NAME= COFFEE_meoh
##.SHIFT REFERENCE= INTERNAL, COFFEE_meoh, 1, 14.98509
##AUDIT TRAIL= $$ (NUMBER, WHEN, WHO, WHERE, PROCESS, VERSION, WHAT)
$$ ##TITLE= Audit trail, TOPSPIN		Version 2.1
$$ ##JCAMPDX= 5.01
$$ ##ORIGIN= Bruker BioSpin GmbH
$$ ##OWNER= Administrator
$$ $$ E:\/data/COFFEE/nmr/NES1030_18715_9268428_lwIZUFAeM2/10/pdata/1/auditp.txt
$$ ##AUDIT TRAIL=  $$ (NUMBER, WHEN, WHO, WHERE, PROCESS, VERSION, WHAT)
(   1,<2015-07-10 18:56:12.097 -0700>,<Administrator>,<X>,<go>,<TOPSPIN 2.1>,
      <created by zg
	started at 2015-07-10 18:55:06.222 -0700,
	POWCHK enabled, PULCHK disabled,
       configuration hash MD5:
       21 0F 79 D6 B3 7B B4 F6 88 20 88 DB 03 48 BD 9F
       data hash MD5: 64K
       96 DC AA 0F AA 98 06 D4 E8 1E 80 B4 3E 6C CD 03>)
(   2,<2015-07-10 18:56:15.238 -0700>,<Administrator>,<X>,<proc1d>,<TOPSPIN 2.1>,
      <Start of raw data processing
       efp LB = 0 FT_mod = 6 PKNL = 1 PHC0 = 0 PHC1 = 0 SI = 32K 
       data hash MD5: 32K
       4D 78 28 7C 2C C3 97 5C CD D8 71 24 B3 CC 66 C0>)
(   3,<2015-07-10 18:56:15.503 -0700>,<Administrator>,<X>,<proc1d>,<TOPSPIN 2.1>,
      <pk PHC0 = 93.72437 PHC1 = 0 
       data hash MD5: 32K
       D5 20 39 F1 B3 EE BC B9 B0 C9 4D BD 5C 47 46 C0>)
(   4,<2015-07-10 18:56:15.613 -0700>,<Administrator>,<X>,<proc1d>,<TOPSPIN 2.1>,
      <abs ABSG = 1 
       data hash MD5: 32K
       0D 3A 55 3D 63 25 65 2A DE A7 DC 64 44 19 B4 E8>)
(   5,<2015-07-10 18:56:15.691 -0700>,<Administrator>,<X>,<proc1d>,<TOPSPIN 2.1>,
      <abs ABSG = 2 
       data hash MD5: 32K
       6C 7C 82 8B BD 7A 35 65 E8 2E B8 2A B9 07 2D 6C>)
(   6,<2015-07-10 18:56:15.753 -0700>,<Administrator>,<X>,<proc1d>,<TOPSPIN 2.1>,
      <abs ABSG = 3 
       data hash MD5: 32K
       E7 AB CE 4E F1 F6 3A 28 96 4F 03 A1 7C C4 ED 59>)
(   7,<2015-07-10 18:56:15.800 -0700>,<Administrator>,<X>,<proc1d>,<TOPSPIN 2.1>,
      <abs ABSG = 4 
       data hash MD5: 32K
       20 76 50 C9 C5 88 67 D8 24 86 B3 1D EC 54 45 08>)
(   8,<2015-07-10 18:56:15.863 -0700>,<Administrator>,<X>,<proc1d>,<TOPSPIN 2.1>,
      <abs ABSG = 5 
       data hash MD5: 32K
       12 38 D8 E2 F2 FB 0D FD D9 4E F8 18 33 EB B5 11>)
$$ ##END=
$$ 
$$ $$ hash MD5
$$ $$ E5 C6 E0 3D E5 3A 73 93 C6 7E 87 B0 E2 EB 6D 19
##$RELAX= 
##$RELAX= 
##$RELAX= 
##$RELAX= 
##$RELAX= 
##$RELAX= 
##$RELAX= 
$$ Bruker specific parameters
$$ --------------------------
##$DU= <E:\>
##$EXPNO= 10
##$NAME= <NES1030_18715_9268428_lwIZUFAeM2>
##$PROCNO= 1
$$ [...]
150 150 150 150 150 150 150 150
##$TP07= 0
##$TPNAME0= <>
##$TPNAME1= <>
##$TPNAME2= <>
##$TPNAME3= <>
##$TPNAME4= <>
##$TPNAME5= <>
##$TPNAME6= <>
##$TPNAME7= <>
##$TPOAL= (0..7)
0.5 0.5 0.5 0.5 0.5 0.5 0.5 0.5
##$TPOFFS= (0..7)
0 0 0 0 0 0 0 0
##$TUNHIN= 0
##$TUNHOUT= 0
##$TUNXOUT= 0
##$USERA1= <user>
##$USERA2= <user>
##$USERA3= <user>
##$USERA4= <user>
##$USERA5= <user>
##$V9= 5
##$VALIST= <valist>
##$VCLIST= <CCCCCCCCCCCCCCC>
##$VD= 0
##$VDLIST= <DDDDDDDDDDDDDDD>
##$VPLIST= <PPPPPPPPPPPPPPP>
##$VTLIST= <TTTTTTTTTTTTTTT>
##$WBST= 2048
##$WBSW= 25
##$XGAIN= (0..3)
0 0 0 0
##$XL= 0
##$YL= 0
##$YMAX_a= 582086
##$YMIN_a= -485070
##$ZGOPTNS= <>
##$ZL1= 120
##$ZL2= 120
##$ZL3= 120
##$ZL4= 120
##$ABSF1= 14.98509
##$ABSF2= -5.573092
##$ABSG= 5
##$ABSL= 3
##$ALPHA= 0
##$AQORDER= 0
##$ASSFAC= 0
##$ASSFACI= 0
##$ASSFACX= 0
##$ASSWID= 0
##$AUNMP= <proc_prof1d_extract_pilot.lims>
##$AXLEFT= 0
##$AXNAME= <>
##$AXNUC= <1H>
##$AXRIGHT= 0
##$AXTYPE= 0
##$AXUNIT= <>
##$AZFE= 0.1
##$AZFW= 0.1
##$BCFW= 0
##$BC_mod= 0
##$BYTORDP= 0
##$COROFFS= 0
##$CY= 15
##$DATMOD= 1
##$DC= 0
##$DFILT= <>
##$DTYPP= 0
##$F1P= 0
##$F2P= 0
##$FCOR= 0.5
##$FTSIZE= 32768
##$FT_mod= 6
##$GAMMA= 0
##$GB= 0
##$INTBC= 1
##$INTSCL= 1
##$ISEN= 128
##$LB= 0
##$LEV0= 0
##$LPBIN= 0
##$MAXI= 10000
##$MC2= 0
##$MEAN= 0
##$ME_mod= 0
##$MI= 0
##$NCOEF= 0
##$NC_proc= -8
##$NLEV= 6
##$NOISF1= 0
##$NOISF2= 0
##$NSP= 0
##$NTH_PI= 0
##$NZP= 0
##$OFFSET= 14.98509
##$PC= 1
##$PHC0= 93.72437
##$PHC1= 0
##$PH_mod= 1
##$PKNL= yes
##$PPARMOD= 0
##$PPDIAG= 0
##$PPIPTYP= 0
##$PPMPNUM= 2147483647
##$PPRESOL= 1
##$PSCAL= 4
##$PSIGN= 0
##$PYNMP= <proc.py>
##$REVERSE= no
##$SF= 400.02
##$SI= 32768
##$SIGF1= 0
##$SIGF2= 0
##$SINO= 400
##$SIOLD= 32768
##$SPECTYP= <>
##$SREGLST= <1H.CDCl3>
##$SSB= 0
##$STSI= 32768
##$STSR= 0
##$SW_p= 8223.68421052631
##$SYMM= 0
##$S_DEV= 0
##$TDeff= 65536
##$TDoff= 0
##$TI= <>
##$TILT= no
##$TM1= 0
##$TM2= 0
##$TOPLEV= 0
##$USERP1= <user>
##$USERP2= <user>
##$USERP3= <user>
##$USERP4= <user>
##$USERP5= <user>
##$WDW= 1
##$XDIM= 32768
##$YMAX_p= 409669031
##$YMIN_p= -687711
##$CURPLOT= <Network HP LaserJet P1505>
##$CURPRIN= <$Network HP LaserJet P1505>
##$DFORMAT= <normdp>
##$LAYOUT= <+/1D_H.xwp>
##$LFORMAT= <normlp>
##$PFORMAT= <normpl>
##$SURQMSG= 1
$$ End of Bruker specific parameters
$$ ---------------------------------
##NTUPLES= NMR SPECTRUM
##VAR_NAME=  FREQUENCY,     SPECTRUM/REAL,   SPECTRUM/IMAG
##SYMBOL=    X,             R,               I
##VAR_TYPE=  INDEPENDENT,   DEPENDENT,       DEPENDENT
##VAR_FORM=  AFFN,          ASDF,            ASDF
##VAR_DIM=   32768,         32768,           32768
##UNITS=     HZ,            ARBITRARY UNITS, ARBITRARY UNITS
##FACTOR=    0.250966925370066, 1,           1
##FIRST=     8223.43324360094, -41176,       -279314
##LAST=      0,             -326554,         -112862
##MIN=       0,             -687711,         0
##MAX=       8223.43324360094, 409669031,    0
$$ Real data points
##PAGE= N=1
##DATA TABLE= (X++(R..R)), XYDATA
$$ [...]
$$ plain form
19508 -83503 78930 125451 23584 -168929 227719 -175451 -26815 -190222 -254104 -98752 -19267
19496 -153271 65036 -120187 32534 31176 -110482 88560 -143013 -126381 -52807 -280445 -289384
19485 -289384 -30265 -7132 33863 -275125 207509 -206271 147967 -69666 -46994 19108 -90901
19473 -284284 -103020 -42760 410941 159740 -65828 128800 -279105 -354278 150544 236595
19463 236595 -321505 -96255 -173468 -285130 34749 47331 -34368 -169176 -507145 81603 -112129
19451 129839 -313915 69488 81502 -155556 -184382 178472 -207152 -377330 107177 9117
19440 -10223 37242 -135193 86715 15886 -84461 -206048 46468 -4917 -262694 -138871 -278020
19429 -278020 -334205 -233082 -84356 -272511 -234778 29689 -113398 58593 -10772 -110592 -110253
$$ packed form
19508h3503G8930M6521B3584a68929B27719a75451b6815j63407o3882i8752a9267
19496a53271F5036a20187C2534j358a10482H8560a43013J6632e2807k27638q939
19485b89384c0265g132C3863b75125B07509b06271A47967f9666K2672A9108i0901
19473b84284a03020d2760D10941A59740f5828A28800b79105p5173A50544Q6051
19463B36595c21505i6255p7213j11662C4749J2582c4368j34808l37969H1603a12129
19451A29839c13915F9488J2014a55556k8826A78472b07152j70178A07177I117
19440a0223C7242a35193H6715A5886h4461j21587D6468d917k57777J23823j39149
19429b78020n6185J01123h4356j88155L7733B9689a13398E8593a0772r9820L39
$$ plain form
19418 -110253 467057 32869 -66833 -233975 -149081 27498 -257363 -236948 114217 -332200
19407 251743 101983 -103964 -127750 -82582 -178280 -254497 -298187 166847 29416 -170482 21403
19395 -285322 197115 -167016 17032 74736 30197 100966 150471 210602 -156772 221457 -107182
19383 -147179 29293 -230249 44455 -202607 -207072 25295 10305 -127283 65810 28212 77465
19372 77465 213039 130668 121253 -41063 -253005 -30991 111897 189021 83863 64575 -175455
19360 -37748 -537095 -137260 -122909 -83496 51983 -91951 -92614 135956 -29069 -421453 -192348
19348 70136 -99206 -194017 -50467 -86806 -117502 138367 58841 -168933 -171394 -361620 95918
19336 -104842 -343574 -130787 151667 68736 3395 37876 98306 282488 39363 -172163 -47267
$$ packed form
19418a10253D67057C2869f6833j67142Q4894B7498b57363K0415A14217c32200
19407B51743A01983a03964k3786M5168r5698p6217m3690A66847B9416a70482B1403
19395b85322A97115a67016A7032N7704C0197P0769M9505O0131a56772B21457a07182
19383a47179B9293b30249D4455b02607m465B5295A0305a27283F5810B8212M9253
19372G7465J35574q2371r415d1063k11942c0991A11897P7124H3863j9288a75455
19360c7748m99347a37260J4351L9413E1983i1951o63A35956b9069l92384a92348
19348G0136i9206r4811e0467l6339l0696A38367E8841a68933k461j90226I5918
19336a04842k38732a30787A51667F8736C395L4481O0430J84182C9363a72163d7267
$$ plain form
19324 -289726 -490879 -170805 19992 -203341 117827 -135289 -167278 -11097 8032 -27427 -399501
19313 -399501 25212 -329165 -375641 26215 106285 3156 -109170 4736 -160896 12838 -221085
19301 -170368 -126099 -211080 68177 -196276 -120298 -148677 -140591 -47293 -165377 141010 -202636
19289 -84608 -77600 128451 -35766 -165740 -201841 -77112 -234997 -525777 303428 -535863 -268515
19278 -268515 -246011 -32358 -113519 12552 -237493 -126621 -35992 85821 214910 -230129 203499
19266 -155212 -314059 -130741 -140174 -128127 146087 77555 -220912 -167360 -28549 -124071 -186323
19255 -186323 98644 -79867 161072 12263 -71697 -369845 -267908 -171881 187220 33930 231137
19244 231137 -23955 97408 42120 -225783 -131038 -124783 89503 -135499 -148951 62873 -119637
$$ packed form
19324b89726k01153a70805A9992b03341A17827a35289l1989a1097H032b7427l72074
19313c99501B5212c29165m6476B6215Q0070C156a09170D736a60896A2838b21085
19301a70368M4269q4981F8177a96276P5978k8379Q086d7293j18084A41010b02636
19289h4608P008A28451c5766j29974l6101g7112j57885k90780C03428e35863K67348
19278b68515K2504c2358q1161A2552b37493J10872c5992H5821J29089b30129B03499
19266a55212j58847a30741r433J2047A46087o8532b20912N3552b8549r5522o2252
19255a86323I8644g9867A61072A2263g1697k98148J01937R6027A87220C3930J97207
19244B31137b3955I7408D2120b25783R4745O255H9503a35499j3452F2873a19637
$$ plain form
19232 -119591 -29690 124243 23506 -82453 -188857 378427 -83047 77187 -39352 153461 -95487
19220 -258428 -18581 -44519 -317593 -74293 42950 39258 16374 -130659 1973 -96895 123008
19208 -195754 150340 -72150 -516478 -61184 -419948 215486 3553 -312880 110577 -27969
19197 41328 23363 -81812 88125 74484 -237889 -293640 274751 -21218 -32496 -101684 66294
19185 -123497 -286979 -210788 362433 -181399 -23015 122639 -203886 53587 18604 156202
19175 156202 -234790 1477 -68609 81318 -16549 69291 -19091 -83806 60350 9448 -69913 250473
19162 12063 60166 -139704 -69729 -171817 113273 -375507 -13239 -15621 62332 -145241 141951
19150 -117695 -147100 133823 42392 -203489 49437 47073 98795 -385060 -168384 311551 -95743
$$ packed form
19232a19591b9690A24243B3506h2453j06404C78427h3047G7187c9352A53461i5487
19220b58428a8581k5938k73074g4293D2950l692A6374a30659A973i6895A23008
19208a95754A50340g2150m44328f1184l58764B15486C553c12880A10577b7969
19197D1328j7965h1812H8125j3641b37889n5751B74751b1218j1278o9188F6294
19185a23497j63482P6191C62433a81399b3015A22639b03886E3587A8604J37598
19175A56202b34790A477f8609H1318a6549F9291a9091o4715F0350I448f9913B50473
19162A2063M8103a39704f9729j02088A13273c75507a3239k382F2332a45241A41951
19150a17695k9405A33823D2392b03489D9437k364N1722c85060a68384C11551i5743
$$ plain form
19138 -238768 -47595 -264331 34260 104001 164825 -281487 91098 -116913 -110216 99549 -50047
19126 107436 1233 -47932 -146945 -107058 174582 135306 -224790 -86879 -72158 62337 -156791
19114 -111380 22274 285196 -162349 116286 156721 1389 -75790 177045 91652 -8078 -92977
19103 -92977 64197 -72825 -226159 -280075 99504 -112243 51959 -162644 -219630 276713 -262166
19091 -58206 -319902 -54318 -396726 180937 70352 -67330 25720 34661 -38396 -115478 -106081
19080 -106081 -194140 5947 -39686 224314 178809 284469 268704 -13152 -89922 17477 -7270
19068 -236733 91866 162898 135124 -181049 -166335 -87938 -131995 -123409 141815 -175342 -257332
19057 -257332 -489646 217041 -24863 10598 119802 187416 -17819 132528 85493 -379345
$$ packed form
19138b38768d7595k16736C4260O9741O0824b81487I1098a16913O697I9549e0047
19126A07436A233d7932r9013L9887A74582l9276b24790h6879J4721F2337a56791
19114a11380B2274K62922a62349A16286M0435A389g5790A77045q5393h078q4899
19103i2977F4197g2825j53334n3916I9504a12243E1959a62644n6986B76713b62166
19091e8206k61696e4318l42408A80937G0352f7330B5720Q941c8396p7082R397
19080a06081q8059E947c9686B24314m5505J05660j5765a3152p6770A7477g270
19068b36733I1866P1032k7774a81049J4714P8397m4057Q586A41815a75342q1990
19057b57332k32314B17041b4863A0598J09204O7614a7819A32528m7035c79345
$$ plain form
19046 292930 -57918 -274063 -37850 69634 -20513 -49859 -8952 318678 -8403 13184 96040
19035 96040 83662 72968 -46306 -51806 -282825 -70431 185527 -4147 99093 159518 209212 -95729
19022 10097 87155 -20932 -357849 115895 -116573 -253756 -106230 -123985 -51254 10958 198690
19011 198690 161422 195714 161056 -111850 -215453 20595 -48893 -187866 -179533 -11302 115406
18999 101457 91961 -263091 87089 258238 -180158 -45491 7033 -110867 -40390 268035 -254170
18987 26095 -54733 -121294 -284504 -125105 -174459 -99275 190270 -366666 45117 194307 -35750
18975 -142988 -126588 166764 -68122 -165044 -54348 -152805 -254719 76946 227327 489799 269986
18964 269986 -74791 -149563 -46242 -100890 116589 89327 -190737 -184125 186871 -85663 -241103
$$ packed form
19046B92930e7918k16145c7850F9634b0513k9346h952C18678h403A3184Q2856
19035I6040j2378j0694d6306n500k31019g0431A85527d147I9093O0425M9694i5729
19022A0097P7058b0932l36917A15895a16573j37183a06230j7755e1254A0958J87732
19011A98690l7268L4292l4658a11850j03603B0595d8893j38973Q333a1302A15406
18999A01457r496b63091H7089J71149a80158d5491G033a10867d0390B68035b54170
18987B6095e4733o6561j63210a25105m9354P5184A90270c66666D5117J49190c5750
18975a42988J6400A66764f8122r6922e4348r8457j01914G6946J50381K62472k19813
18964B69986g4791p4772d6242n4648A16589k7262a90737O612A86871h5663j55440
$$ plain form
18953 -241103 127337 384184 -228647 2592 -145148 -184242 -68248 -437458 -143910 -296531
18943 -296531 282817 -379215 -117657 -131658 49015 115313 -131503 -173962 -88006 -125694 95809
18931 -80898 -32610 -279701 -64121 28414 58618 61358 -49953 -209330 73493 -118828 165943
18919 -58512 39233 77152 91777 -57666 68894 -123648 91123 -247901 69690 -206251 -197834
18908 -197834 -167103 -140674 -158457 460389 124676 260099 38310 108435 214808 335138
18898 335138 -101955 7858 -231459 -104051 275174 -182510 -120511 179669 -382590 75528
18887 -150332 -109328 81798 -311713 -93382 -71641 -338229 -317641 -391905 -158626 -248888 80912
18875 237022 28625 117262 139192 74983 -180570 -147825 -240454 -44279 -153823 -84841 78708
$$ packed form
18953b41103A27337K56847b28647B592a45148l9094f8248l69210a43910j52621
18943b96531B82817c79215a17657j4001D9015O6298a31503m2459Q5956l7688I5809
18931h0898c2610k47091f4121B8414L0204K740d9953j59377G3493a18828A65943
18919e8512C9233L7919J4625e7666F8894a23648I1123b47901F9690b06251Q417
18908a97834L0731K6429j7783D60389A24676J35423C8310P0125J06373J20330
18898C35138a01955G858b31459a04051B75174a82510O1999A79669c82590G5528
18887a50332M1004H1798c11713i3382K1741k66588K0588p4264a58626r0262H0912
18875B37022B8625Q8637K1930o4209a80570L2745r2629d4279j09544O8982G8708
$$ plain form
18863 -112921 88382 -68777 -259143 -241776 -45874 -203223 164597 290878 -72756 70336 91680
18852 91680 -149654 -77810 360830 300327 138369 90268 230864 -111780 52094 -509891
18841 -404675 -99854 -160058 -95528 -91888 -73925 -37715 76737 125022 30175 3739 -247792 -239021
18829 -239021 198410 -47821 -95841 -156231 -190174 -54733 -179753 -305933 136003 128539 -16194
18817 176411 -110305 152762 74676 150781 171944 134140 179704 31420 27128 28840 -216930
18805 -16295 106065 5622 183785 -107482 -313416 -301939 -68810 195288 -513276 -226312
18794 -56093 -214484 26625 -152131 -249187 -118713 -64083 -40993 65450 -61259 -229140 -113063
18782 43709 -196520 -152707 -182834 122916 143085 -74083 426402 -229357 -228261 -169359 -342409
$$ packed form
18863a12921H8382f8777j90366J7367d5874j57349A64597J26281g2756G0336K1344
18852I1680a49654P1844C60830o0503A38369m8101J40596a11780E2094e09891
18841d04675i9854o0204O4530L640J7963L6210G6737M8285C0175C739b47792Q771
18829b39021A98410d7821m8020o0390l3943e4733j25020j26180A36003p464a6194
18817A76411a10305A52762G4676P6105K1163l7804M5564C1420m292J712b16930
18805a6295A06065E622J78163a07482k05934J1477f8810A95288e13276b26312
18794e6093j58391B6625a52131r7056a18713N4630K3090F5450f1259j67881a13063
18782D3709a96520M3813l0127A22916K0169g4083D26402b29357J096N8902j73050
$$ plain form
18771 -342409 -278824 46392 151560 -34164 155269 -137313 155025 -174011 -73797 -86 -135005
18760 -135005 -142268 315168 -316999 40205 -46030 -71444 73687 -224213 409201 26146 164683
18749 164683 86893 -219356 1876 12048 -251536 -393377 -259220 169751 170698 -121723 194888
18737 9100 -155901 -172391 50671 -94608 -15989 157761 -140211 17178 31784 -53535 25090
18725 161046 -57020 -276037 301037 -33710 102352 -187731 -139720 104963 -282565 20642
18714 -70746 43100 -142655 89148 -54368 -53003 146804 -173365 -235566 -93601 -123508 105651
18702 -249721 -339214 -119119 -59780 44960 -242892 394457 -217598 -12276 -27005 132996
18691 68785 -52330 -2200 146391 141255 -280089 121226 -87608 -42650 -479627 1492 -97142
$$ packed form
18771c42409O3585D6392J05168c4164A55269a37313A55025a74011g3797h6j34919
18760a35005p263C15168c16999D0205d6030k5414G3687b24213D09201B6146J38537
18749A64683p7790b19356A876J0172b51536j41841J34157A69751R47a21723A94888
18737I100a55901j6490E0671i4608a5989A57761a40211A7178J4606e3535B5090
18725A61046e7020k19017C01037c3710A02352a87731M8011A04963b82565B0642
18714g0746D3100a42655H9148e4368J365A46804a73365o2201i3601k9907A05651
18702b49721q9493a19119N9339D4960b42892C94457b17598a2276j4729A32996
18691F8785e2330b200A46391n136b80089A21226h7608d2650m36977A492i7142
$$ plain form
18679 9655 251702 64078 10209 -14078 -135762 67888 62337 93109 -27017 4352 360961 -16763
18666 -78165 -2761 213509 5699 -327577 -275765 161583 29198 97953 -36916 -21737 71257
18654 -286746 -23811 -194794 172501 -7369 -175251 8576 113246 -177432 168692 -147396
18643 -240059 219863 139416 -238803 140617 -114699 381307 46802 -158818 -226189 -178255
18633 -178255 -53323 -96836 25275 -138296 113632 24008 131415 -269254 -75300 8104 -69945
18621 -237489 138655 -352057 -246159 -192950 46345 -87428 -217257 -327227 24753 -108994
18610 57386 -307788 24195 -41202 -15700 156868 100332 -33912 55887 49959 47263 -53636 -3923
18597 8641 -146868 84675 -144615 -33051 -7358 -302695 -97868 94736 -44502 -273082 -10510
$$ packed form
18679I655K42047F4078A0209a4078j21684F7888n551L0772b7017D352L56609a6763
18666g8165b761B13509E699c27577N1812A61583B9198O8755c6916J5179G1257
18654b86746b3811j70983A72501g369j67882H576J04670a77432A68692a47396
18643b40059B19863q0447b38803A40617a14699C81307D6802a58818o7371M7934
18633a78255e3323m3513B5275a38296A13632B4008J07407b69254g5300H104f9945
18621b37489A38655c52057J05898N3209D6345h7428j29829j09970B4753a08994
18610E7386c07788B4195d1202a5700A56868n6536c3912E5887n928k696e3636c923
18597H641a46868H4675a44615c3051g358k95337i7868I4736d4502k28580a0510
$$ plain form
18585 278114 -204731 -186142 -55937 116906 97274 -168214 -281594 197151 205889 38489 -130784
18573 -65234 -144848 -263862 -423770 -239030 -368141 -277359 -188160 -139775 -332195 145881
18562 -5951 -21247 -35618 -181647 -73053 180217 203984 -63614 -74074 -109891 142359 -59947
18550 381738 -206890 -101702 -40791 -175721 81162 -75147 -156940 -39887 403456 83207 196963
18539 196963 41204 -57055 -110543 -31446 210294 -194338 -206069 -27835 -104155 -186116 51631
18527 -72533 -458333 -72901 -128072 -72989 39710 -134626 42096 -133367 -135607 -233651 281552
18515 -44817 55304 174240 -32160 -21387 -88772 153361 -47544 -71039 -257384 -109292 -144509
18504 -144509 849 264855 -74309 -381842 -202297 -263273 92817 -112409 12550 -211209 65450
$$ packed form
18585B78114b04731J8589e5937A16906j9632a68214j13380A97151Q738C8489a30784
18573f5234p9614j19014j59908J84740j29111R0782Q9199M8385j92420A45881
18562e951j5296j4371j46029g3053A80217K3767f3614j0460l5817A42359e9947
18550C81738b06890a01702d0791j34930H1162g5147q1793c9887D03456H3207J13756
18539A96963D1204e7055n3488c1446B10294a94338j1731b7835p6320q1961E1631
18527g2533l85800g2901n5171N5083C9710a34626D2096a33367k240r8044B81552
18515d4817E5304J18936c2160J0773o7385A53361d7544k3495j86345a09292l5217
18504a44509H49K64006g4309l07533J79545o0976I2817a12409A2550b11209F5450
$$ plain form
18492 -41521 -228011 100500 160801 227685 -403916 246651 236585 -175866 -216302 172299
18481 -61991 -2348 75381 -186368 -196866 -218889 -346580 275627 187678 -48139 122839 21299
18469 -110959 -182974 167912 -98359 -42559 -214631 208193 -10344 -28875 -194653 -161493 15800
18457 -39581 -313711 -70575 307403 167136 -191839 -300242 -128477 282268 18490 -17527
18446 366643 -354980 -244269 -232939 100329 20498 17575 -344435 108576 206131 -20496 -78597
18435 -78597 -6936 -195165 -71829 96448 17868 374719 164818 -120830 -98418 58280 -12649
18423 -61190 -94149 -380118 -195727 162766 271916 183898 -161481 49980 -228133 214806
18412 286760 1973 84591 18649 -177407 -261349 121096 -260240 311174 47847 62832 -17754
$$ packed form
18492d1521j86490A00500O0301O6884d03916B46651j0066a75866m0436A72299
18481f1991b348G5381a86368j0498k2023j27691B75627q7949d8139A22839B1299
18469a10959p2015A67912i8359d2559j72072B08193a0344j8531j65778L3160A5800
18457c9581k74130g0575C07403j40267a91839j08403a28477B82268A8490a7527
18446C66643c54980J10711J1330A00329B0498k923c44435A08576R7555b0496n8101
18435g8597f936j88229g1829I6448A7868L56851A64818a20830K2412E8280a2649
18423f1190l2959k85969J84391A62766J09150q8018a61481D9980b28133B14806
18412B86760A973Q2618A8649a77407q3942A21096b60240C11174D7847J4985a7754
$$ plain form
18400 -227919 33205 183328 94707 261857 -143335 119826 -158 -132078 -18019 -65596 -323884
18389 -323884 25733 -268659 -173643 -53016 16650 -180765 -111499 -65399 58625 97104 -105182
18377 169453 132835 -91593 199955 148637 49584 -391131 -263663 80308 -217006 83249 -338
18365 -190564 -53436 198235 -146057 -162824 -4979 -179978 -364116 92669 -318801 -154183
18354 231620 272669 -48937 -25375 -99288 -189193 149549 -62238 -230171 -23441 72551 -68487
18342 44306 31909 282899 -28831 91003 16128 133791 243337 -95782 -129542 330460 -89605
18330 -113744 -149471 71224 197990 160780 109572 -155556 -205732 85217 107701 -95480 203532
18318 139308 -94299 -359743 169756 -168504 -355105 -419 142113 -97707 -144257 -164132 -119218
$$ packed form
18400b27919C3205J50123q8621J67150a43335A19826a58j31920a8019m7577k58288
18389c23884B5733b68659R5016e3016A6650a80765O9266M6100E8625L8479a05182
18377A69453l6618i1593A99955n1318D9584c91131J27468H0308b17006H3249c38
18365a90564e3436A98235a46057j6767d979j74999j84138I2669c18801a54183
18354B31620M1049d8937K3562p3913q9905A49549f2238j67933b3441G2551f8487
18342D4306j2397K50990b8831I1003A6128J17663J09546i5782l3760C30460h9605
18330a13744l5727G1224J26766l7210n1208a55556n0176H5217K2484i5480B03532
18318A39308i4299k65444A69756a68504j86601d19A42113i7707m6550j9875M4914
$$ plain form
18307 -119218 -49578 -152033 3422 -197482 -314828 -309196 -270045 -61920 -86774 74657 -94684
18295 -85208 -240088 200451 -12259 -39908 104318 -11324 -9839 25928 31137 -212462 -131255
18284 -131255 24537 152327 -67576 -195661 -72465 -19069 129818 -162148 -208966 146923
18273 -401269 -215750 389986 -264783 -436 -261729 -239988 -59168 203937 79726 -68459 -58635
18262 -58635 -104317 -3200 2478 -99640 110529 -321660 111982 -144093 17119 -205864 14129
18250 64815 -88687 170755 227697 116847 -50653 7336 98299 158476 -169303 -48047 -289647
18239 -289647 -167378 33586 89751 -384033 171796 -22703 -250522 -214923 15624 -260183
18228 30744 477635 71850 -53256 -14694 207311 42057 -7613 -280411 -168267 109181 -224866
$$ packed form
18307a19218d9578j02455C422a97482j17346N632L9151f1920k4854G4657i4684
18295h5208j54880B00451a2259k7649A04318a1324J485B5928N209b12462Q1207
18284a31255B4537J27790f7576j28085g2465a9069A29818a62148m6818A46923
18273d01269J85519C89986b64783d36k61293K1741e9168B03937G9726f8459R824
18262e8635m5682c200B478i9640A10529c21660A11982a44093A7119b05864A4129
18250F4815h8687A70755N6942j10850e0653G336R0963O0177a69303d8047k41600
18239b89647J22269C3586N6165c84033A71796b2703k27819L5599A5624b60183
18228C0744M46891G1850e3256a4694B07311D2057g613k72798J12144A09181b24866
$$ plain form
18216 -105593 286912 206893 104463 -50654 -37431 -245816 -63440 221572 -326520 52476
18205 -157207 38358 111624 111989 120411 72581 43843 -196183 5955 136129 102483 -158718 168900
18192 52500 -248696 -261426 139086 16579 -286394 208263 -65501 31614 -126304 -335927
18182 -335927 -297157 -112508 -33109 -235612 -377904 -243345 -18909 65281 -156373 76618
18171 65365 -209435 -98348 -146745 390441 -374470 43605 -241169 253205 104034 -236766
18160 -68290 215093 -195847 -146083 -134475 91939 -88004 9200 -207094 113383 148538 4138
18148 55110 -86069 355674 -128565 -163673 -42059 28666 125677 -252637 193893 -42312 -92313
18137 -92313 -180160 -20893 -18235 84063 85315 -86551 -105875 210133 150686 -282756 -90440 -62766
$$ packed form
18216a05593B86912q0019j02430e0654J3223k08385f3440B21572c26520E2476
18205a57207C8358P3266L65Q422m7830k8738a96183E955J30174l3646a58718A68900
18192E2500b48696j2730A39086A6579b86394B08263f5501C1614a26304k09623
18182c35927L8770a12508c3109k02503j42292J34559a8909F5281a56373G6618
18171F5365b09435i8348m8397C90441c74470D3605b41169B53205A04034b36766
18160f8290B15093a95847M9764J1608I1939h8004I200b07094A13383L5155D138
18148E5110h6069C55674a28565l5108d2059B8666R7011b52637A93893d2312n0001
18137i2313q7847b0893K658H4063J252h6551j9324B10133n9447b82756i0440K7674
$$ plain form
18125 -62766 -61242 620 38246 278401 -287765 -25831 -16113 67038 -124611 -139870 -98698 52284
18112 332165 143004 150214 117674 -171211 -15827 341956 -507530 26496 7321 163178 15209
18100 103388 366355 74103 175652 60909 -240752 -9875 227872 55912 -65485 -62873 29609
18088 -310982 46077 -131082 164792 88973 -219377 -76357 121618 84705 -31426 15196 -300136
18076 -56067 -314978 -11738 -57883 -333466 59304 63273 -251776 85862 -168071 -154477 -396693
18065 -396693 -151734 -51126 -158960 78841 403934 46645 40675 -120210 -409567 -111407
18054 -125495 48490 247126 -128864 300955 227083 -96657 176844 -63409 -134665 372976
18043 42832 -46287 41322 15575 -207099 140478 47607 -53046 -60822 199785 75569 12241
$$ packed form
18125f2766J524F20L7626K40155b87765b5831R718F7038a24611j5259M1172E2284
18112C32165A43004P210l2540a71211a5827C41956e07530B6496G321J55857A5209
18100A03388K62967G4103J01549F0909b40752i875B27872E5912f5485K612B9609
18088c10982D6077a31082A64792p5819b19377g6357A21618l6913c1426A5196c00136
18076e6067k58911a1738m6145k75583E9304L969b51776H5862a68071J3594k42216
18065c96693a51734e1126j07834G8841L25093D6645n970a20210k89357a11407
18054a25495D8490J98636a28864C00955p3872i6657A76844f3409p1256C72976
18043D2832d6287D1322A5575b07099A40478D7607e3046p776A99785G5569A2241
$$ plain form
18031 107093 -12155 22415 239560 -132336 125582 197123 -436816 301640 -260668 -231611
18021 -231611 -170594 -166281 23626 -42630 22004 -238601 204659 55242 -99665 43025 -160397
18009 -62513 -48942 -93720 -108479 425255 186262 189557 -209025 9681 100838 98422 -85238 -57810
17997 -57810 143697 13916 -55315 -158610 37624 -128790 264679 -398212 -151741 150554
17986 -15061 -59351 -3650 131332 351842 52550 -45818 -46446 176569 63104 4118 -184741 -1460
17973 136043 -27412 -7067 78607 4407 -11889 -17641 -98946 -123211 -181717 158675 -165326 71606
17960 -134052 28244 -62963 62529 83696 99844 -106747 29697 105308 166025 -275330 -136464
17948 19927 -19026 69533 -55893 105959 -293650 -27898 6277 -290379 -189833 -151826 -43319
$$ packed form
18031A07093a2155B2415K17145a32336A25582P1541d36816C01640b60668K9057
18021b31611O1017M313B3626d2630B2004b38601B04659E5242i9665D3025a60397
18009f2513J3571m4778j4759D25255A86262L295b09025I681R1157k416h5238K7428
17997e7810A43697A3916e5315j03295C7624a28790B64679c98212a51741A50554
17986a5061m4290c650A31332K20510E2550d5818o28A76569F3104D118a84741a460
17973A36043b7412g067G8607D407a1889n752q1305k4265n8506A58675a65326G1606
17960a34052B8244f2963F2529K1167J6148a06747B9697P5611O0717b75330a36464
17948A9927a9026F9533e5893A05959b93650b7898F277b90379J00546L8007d3319
$$ plain form
17936 81906 53969 310351 -17595 -136406 -109627 -23029 -30050 -16500 -59331 108386 -17380
17924 -209231 49363 -19290 -299235 407434 62260 -203690 64420 107804 -135614 20376 -33772
17912 94092 -278947 24489 94057 -88567 96370 4249 82704 -74625 56774 -24754 178519
17900 86153 151819 111101 28360 3676 42194 -201570 96303 -8022 126949 -18420 66507 232160
17888 232160 61336 -195054 -263927 -79781 -120322 208079 235547 -28392 -42998 -98566 94368
17876 93044 17666 -176969 -35019 61041 207014 -167089 357234 -17213 -20399 -106323 -274053
17865 -274053 -20538 88002 32603 259151 -180249 -172188 66927 2657 -12358 -48193 -34438
17854 -34438 220212 191999 -128924 -160172 -55182 -153901 -37955 142514 -60807 -84636 443175
$$ packed form
17936H1906k7937K56382a7595j18811K6779b3029p021J3550m2831A08386a7380
17924b09231D9363a9290k79945D07434F2260b03690F4420M3384a35614B0376c3772
17912I4092b78947B4489O9568h8567I6370D249P8455g4625E6774b4754A78519
17900H6153O5666m0718B8360C676L8518b01570I6303h022A26949a8420F6507J65653
17888B32160F1336a95054o8873g9781m0541B08079K7468b8392j4606n5568I4368
17876I3044A7666a76969c5019F1041J45973a67089C57234a7213l186q5924j67730
17865b74053b0538H8002C2603K26548a80249Q061F6927B657a2358l5835J3755
17854c4438B20212k8213a28924l1248e5182r8719c7955A42514f0807k3829D43175
$$ plain form
17842 -2124 38790 -58364 -119543 -42919 264250 200053 102530 -242656 82033 -53053 199781
17830 26502 334912 -48090 205489 2753 293728 -205113 33314 -13521 -32086 220303 64209
17818 46284 49684 19776 -15561 -65042 34821 11917 -58455 -151483 -37221 -143142 48031 55827
17806 55827 -10484 -36821 108190 -82518 -50843 -11514 268946 -152983 167680 -293193 64877
17794 -64891 -94498 -44229 206342 178941 -73598 -222634 187619 19580 160385 279241 -578
17782 256275 154309 -129563 -207315 129029 -46274 -323250 -115266 448931 -228826 122108
17771 93813 82691 288251 -50710 -116859 -168707 -310686 -487509 -74714 -232720 -278694 105210
17759 -47335 39803 -275733 3863 88723 87783 114830 -229093 133609 201876 93782 -255194
$$ packed form
17842b124C8790e8364o1179d2919B64250o4197r7523b42656H2033e3053A99781
17830B6502L08410d8090B05489B753K90975b05113C3314a3521j8565B20303F4209
17818D6284L400A9776a5561m9481C4821A1917e8455r3028c7221j05921D8031P796
17806E5827a0484k6337A08190h2518L1675a1514B68946a52983A67680b93193F4877
17794f4891k9607d4229B06342k7401g3598j49036A87619A9580J40805J18856e78
17782B56275j01966a29563p7752A29029d6274k76976a15266D48931b28826A22108
17771I3813j1122K05560e0710o6149n1848j41979j76823g4714j58006m5974A05210
17759d7335C9803b75733C863Q4860r40K7047b29093A33609O8267I3782b55194
$$ plain form
17747 60487 4524 87848 226674 183221 69472 -47649 204831 -126832 27790 222604 26398
17735 -51442 119231 277362 360856 9513 16126 -172063 -226318 -28842 32957 58337 -79629
17723 -195775 158244 -87063 149710 -74675 133893 -30592 -41033 -22766 -237362 225168
17712 -2213 -98202 72059 84677 -28438 -69000 75795 -134020 5253 198540 -150663 174076
17700 -42082 249563 -126364 64107 -32362 153190 281014 150908 -17221 -56391 186473
17689 -5235 -27324 54008 161504 227180 279222 288492 -181074 -62338 16651 -43649 159801
17677 303393 145624 -78736 -136018 124925 109660 127569 -58348 305704 139738 215156 82777
17665 -176697 120538 50230 52869 526978 -197493 29670 175450 111178 -2415 87611 -287018
$$ packed form
17747F0487D524Q3324J38826m3453F9472d7649B04831a26832B7790J94814B6398
17735e1442A19231J58131Q3494I513O613a72063n4255b8842C2957K5380g9629
17723a95775A58244h7063A49710g4675A33893c0592j0441J8267k14596B25168
17712b213r5989G2059J2618b8438m0562G5795a34020E253J93287a50663A74076
17700d2082B49563a26364F4107c2362A53190J27824j30106a7221l9170A86473
17689e235k2089E4008J07496O5676N2042R270a81074f2338A6651d3649A59801
17677C03393A45624g8736n7282A24925j5265J7909e8348C05704A39738P5418H2777
17665a76697A20538E0230K639M74109a97493B9670J45780o4272b415H7611b87018
$$ plain form
17653 110698 -219170 -110068 -92074 306904 382377 330251 246273 200929 -202411 -124912 -245196
17642 -245196 102415 130771 145602 -60133 -25241 173561 -90220 280933 -4470 -60114 -188645
17631 -188645 -195865 91012 -180215 194340 143315 105027 -18155 -235522 105065 147602 -75172
17619 379096 94717 173593 -63659 -62239 133678 240897 44831 -108802 33216 184617 -127985
17607 99621 78843 -238 218404 190122 186378 164422 2200 147703 68286 -81059 349020 466519
17595 466519 215833 -93209 -27267 29279 235899 296820 181441 132249 389790 156334
17584 235141 -55818 10560 -33928 657272 -192054 10049 -38738 189334 180863 -27722 50654
17572 -89144 101191 79345 118748 456 207132 -52956 145730 -47379 404533 227236 27239
$$ packed form
17653A10698b19170J09102J7994C06904P5473n2126q3978m5344b02411P7499j20284
17642b45196A02415K8356J4831f0133b5241A73561i0220B80933d470n5644j28531
17631a88645p220I1012a80215A94340n1025l8288a8155k17367A05065M2537g5172
17619C79096I4717P8876f3659J420A33678J07219D4831a08802C3216J51401a27985
17607I9621k0778b38B18404k8282l744k1956B200J45503F8286h1059C49020J17499
17595D66519B15833i3209b7267B9279K06620O0921j15379m9192K57541A56334
17584B35141e5818A0560c3928F57272a92054A0049c8738A89334q471b7722E0654
17572h9144A01191k1846L9403D56K06676e2956A45730d7379D04533j77297B7239
$$ plain form
17560 329391 412482 221990 341980 28914 -89451 161209 125030 161581 254274 -88359 207367
17548 301264 -61482 127233 247095 -421 -4123 13845 -112548 135648 382094 538225 20692
17536 101613 49250 49571 164402 35891 28793 43486 372246 211970 126409 115875 249075
17525 249075 -82259 364337 568599 346229 243196 115695 373711 51097 280357 546323
17515 546323 338758 -74504 43429 235628 194302 243831 266169 348714 589613 504909 612974
17504 612974 417418 493926 460293 135878 324535 -229589 144846 131443 340303 -61759
17493 277034 171569 42797 395 114627 276661 453408 431929 404834 218005 231478 137979
17482 137979 383372 181169 68005 -10557 23294 406135 386727 105527 507595 609298
$$ packed form
17560C29391Q3091j90492J19990B8914h9451A61209l6179L6551R2693h8359B07367
17548C01264f1482A27233J19862d21l702A3845a12548A35648K46446J56131B0692
17536A01613D9250L21J14831C5891p098J4693L28760j60276q5561j0534J33200
17525B49075h2259C64337K04262k22370j03033A15695K58016E1097K29260K65966
17515E46323k07565g4504D3429J92199m1326M9529K2338Q2545K40899q4704J08065
17504F12974j95556P6508l3633A35878J88657b29589A44846j3403K08860f1759
17493B77034j05465D2797C95J14232J62034J76747k1479k7095j86829J3473r3499
17482A37979K45393A81169F8005a0557B3294L82841j9408A05527M02068J01703
$$ plain form
17472 609298 239022 207873 470940 432391 388822 118902 122779 34729 -8243 85637 288821
17461 288821 -98413 175740 -187128 376010 116256 36444 195659 239201 309515 398858
17451 398858 291755 403383 488721 613535 483319 107098 603515 432589 547578 493925
17441 493925 549970 131477 554184 207942 515146 338761 660561 178269 104539 138254
17431 138254 211528 121726 368255 170787 232343 206638 103319 173650 99404 479676 640511
17420 640511 429998 222992 460896 319804 637425 127908 346888 479389 369239 593894
17410 593894 440007 659238 -73196 495980 127610 238872 89840 -85786 249707 263304
17400 263304 443081 256646 130287 125093 -812 250279 380815 201198 198547 249692 304122
$$ packed form
17472F09298B39022l1149K63067l8549m3569A18902L877C4729h243H5637K03184
17461B88821i8413A75740a87128C76010A16256C6444J59215M3542P0314Q9343
17451C98858j07103J11628Q5338J24814j30216A07098M96417j70926J14989n3653
17441D93925N6045A31477M22707B07942L07204j76385L21800A78269p3730L3715
17431A38254P3274q9802K46529A70787O1556k5705A03319P0331p4246L80272J60835
17420F40511k10513k07006K37904j41092L17621A27908K18980J32501j10150K24655
17410E93894j53887K19231g3196D95980A27610J11262H9840h5786B49707J3597
17400B63304J79777j86435j26359n194h12B50279J30536j79617k651N1145N4430
$$ plain form
17389 304122 168314 166817 259740 398876 320935 313029 347677 316139 186839 442449 352158
17378 352158 -115778 267642 49595 397523 228791 294100 326031 379983 525721 589078
17368 589078 93114 266490 138676 368915 310391 144657 537498 388647 321718 389539
17358 389539 40756 -39545 229626 229493 340076 336890 428613 366622 282210 1877 282619 -47876
17345 -94013 4341 -3040 272064 113938 277898 119497 126593 153834 306874 240051 125038
17334 125038 239231 136376 221616 318252 215885 293223 477395 96362 371712 115769
17323 189761 140963 151985 -48356 297345 88548 456401 117969 466101 328695 45562
17312 178752 -51771 178134 -86905 227449 -25725 583688 449294 8871 386886 186708
$$ packed form
17389C04122j35808j497R2923J39136p7941p906L4648l1538j29300K55610r0291
17378C52158a15778B67642D9595L47928j68732O5309L1931N3952J45738O3357
17368E89078I3114J73376j27814K30239n8524A44657L92841j48851o6929O7821
17358C89539D0756c9545B29626j33J10583l186R1723o1991q4412A877K80742d7876
17345i4013D341c040B72064A13938J63960A19497P096K7241J53040o6823j15013
17334A25038J14193j02855Q5240R6636j02367P7338J84172I6362K75350A15769
17323A89761m8798J1022d8356B97345H8548L67853A17969L48132j37406D5562
17312A78752e1771A78134h6905B27449b5725E83688j34394H871L78015A86708
$$ plain form
17301 28193 527741 322907 88641 -211321 315220 224570 171224 416973 304407 383204
17291 383204 312156 413859 -48393 236427 132502 -116319 38435 497390 -91272 229920
17280 15631 306471 250083 -24469 339612 39170 451942 194745 406663 232100 243001
17270 243001 378039 99838 423895 288116 216604 119775 461625 420198 331622 228330
17260 228330 47356 335721 59893 58198 328208 737721 146107 357093 115990 171911
17250 171911 318689 365498 361744 332873 527534 237515 442361 404733 284090 328889 -129562
17238 141361 -40434 6605 388721 327081 273375 513295 189845 -45991 492024 464923 366705
17227 366705 551206 369829 350370 328954 554287 271283 385436 210552 278183 246514
$$ packed form
17301B8193M99548k04834H8641b11321C15220r0650n3346K45749j12566P8797
17291C83204p1048J01703d8393B36427j03925a16319C8435M58955i1272B29920
17280A5631K90840n6388b4469C39612C9170M12772A94745K11918j74563J0901
17270B43001J35038I9838L24057j35779p1512r6829L41850m1427q8576j03292
17260B28330D7356K88365E9893j695K70010M09513A46107K10986A15990N5921
17250A71911J46778M6809l754k8871J94661B37515K04846l7628j20643M4799a29562
17238A41361d0434F605L82116o1640n3706K39920A89845d5991D92024k7101r8218
17227C66705J84501j81377j9459k1416K25333B71283J14153j74884O7631l1669
$$ plain form
17217 246514 588053 482069 387690 119872 624777 192543 274524 539085 284453 227109
17207 227109 183637 497495 611864 679641 54488 365318 407182 290280 92810 338735
17197 338735 737861 405342 682675 336173 530462 299007 376159 547868 322734 463427
17187 463427 325780 374092 611646 257326 356265 191514 278225 605158 312127 444054
17177 444054 407403 320449 403392 308138 420999 515235 311008 248043 256177 410167 350437
17166 350437 592498 694165 349888 550909 377077 504680 426088 809603 588889 355295
17156 355295 349512 516200 553320 512479 302020 321832 406921 127043 567840 100560 200743
17145 200743 634620 399822 426865 376655 796380 782712 258354 319623 675029 437850
$$ packed form
17217B46514L41539j05984r4379A19872N04905A92543Q1981K64561k54632n7344
17207B27109m3472L13858J14369O7777E4488L10830M1864j16902I2810K45925
17197C38735L99126l32519K77333C36173J94289k31455P7152J71709k25134J40693
17187D63427j37647M8312K37554B57326R8939j64751Q6711L26933k93031J31927
17177D44054l6651q6954Q2943r5254J12861R4236k04227o2965Q134J53990n9730
17166C50437K42061J01667l44277K01021j73832J27603p8592L83515k20714k33594
17156C55295n783J66688L7120m0841k10459J9812Q5089A27043M40797A00560J00183
17145B00743M33877k34798K7043n0210M19725j3668B58354O1269L55406k37179
$$ plain form
17135 437850 338278 636154 507057 629178 411010 454086 605204 313767 420703 390829
17125 390829 401291 826225 853469 835737 698636 490035 465476 451603 609528 723996
17115 723996 645086 596508 417692 714289 585169 634931 603411 344973 795953 445132
17105 445132 702328 317813 612144 695680 418688 560301 644913 655009 686235 612021
17095 612021 545479 630453 693123 655637 608527 728529 862547 874642 632808 928056 775641
17084 775641 515038 805585 726311 869062 751187 197775 1008349 795193 392621 750309
17074 750309 788942 953250 538846 534867 454139 1106088 878751 651733 696476 644945 735151
17063 735151 762712 679529 918521 813802 887171 893811 628867 907852 693867 1044692
$$ packed form
17135D37850r9572K97876j29097J22121k18168M3076J51118k91437J06936k9874
17125C90829J0462M24934K7244j7732j37101k08601k4559j3873J57925J14468
17115G23996p8910m8578j78816K96597j29120M9762l1520k58438M50980l50821
17105D45132K57196C17813K94331Q3536k76992J41613Q4612J0096L1226p4214
17095F12021o6542Q4974O2670l7486m7110J20002J34018J2095k41834K95248j52415
17084G75641k60603K90547p9274J42751j17875A97775Q10574k13156C92621L57688
17074G50309L8633J64308m14404l979q0728O51949k27337k27018M4743n1531R0206
17063G35151K7561q3183K38992j04719P3369O640k64944K78985k13985L50825
$$ plain form
17053 1044692 1076612 1095020 819701 961198 974160 942884 610270 893669 1140410 1026324
17043 1026324 1010630 934920 840696 852702 950173 1384421 1213571 1161778 1301410 1468210
17033 1468210 981501 1215957 1178271 976261 1216147 1106575 1231413 1206516 875439 1130082
17023 1130082 994775 1221169 1413226 1261116 992272 1151571 1011440 1217795 1054651
17014 1054651 1129218 1054106 955053 1432370 1250581 1246038 1057322 1111631 1310767 1105568
17004 1105568 1436342 1225324 1087381 1699138 1200432 1347274 1392870 1149771 1092812 1294277
16994 1294277 1497539 1500054 1107926 1415269 1075649 1324604 1410448 1368622 1363770 1839228
16984 1839228 1287605 1487765 1379183 1296820 1263076 1673202 1630841 1667388 1370736 1456897
$$ packed form
17053A044692L1920J8408k75319J41497J2962l1276l32614K83399K46741j14086
17043A026324j5694p5710r4224J2006R7471M34248j70850n1793J39632J66800
17033A468210m86709K34456l7686k02010K39886j09572J24838k4897l31077K54643
17023A130082j35307K26394J92057j52110k68844J59299j40131K06355j63144
17014A054651P4567p5112r9053M77317j81789m543j88716N4309J99136k05199
17004A105568L30774k11018j37943O11757m98706J46842M5596k43099n6959K01465
16994A294277K03262K515l92128L07343l39620K48955Q5844m1826m852M75458
16984A839228n51623K00160j08582q2363l3744M10126m2361L6547k96652Q6161
$$ plain form
16974 1456897 1434281 1388148 1565745 1655552 1599440 1802652 1292199 1576297 1739970 1869958
16964 1869958 1698200 1692338 2036728 1874004 1736906 1682027 2141890 2079991 1645787 1812429
16954 1812429 2119542 1968671 2165091 2098424 1916745 2117932 2220706 1980740 1870463 2161758
16944 2161758 2361315 2079740 2191884 2148417 2533805 2304701 2159129 2631300 2701942 2468003
16934 2468003 2344083 2257612 2122186 2161402 2443239 2583523 2290005 2447398 2682514 2516381
16924 2516381 2659889 2698509 2614502 2430822 2603620 2756373 2876373 2808171 2917289 2735658
16914 2735658 3028649 2866930 2872355 3069808 3046547 3114511 2992700 2944166 3154605 3265681
16904 3265681 3307392 3143588 3358632 3469101 3396734 3414989 3540109 3758769 3473289 3643817
$$ packed form
16974A456897k2616m6133J77597Q9807n6112K03212n10453K84098J63673J29988
16964A869958j71758n862L44390j62724j37098n4879M59863o1899m34204J66642
16954A812429L07113j50871J96420o6667j81679K01187J02774k39966j10277K91295
16944B161758J99557k81575J12144m3467L85388k29104j45572M72171P0642k33939
16934B468003j23920q6471j35426L9216K81837J40284k93518J57393K35116j66133
16924B516381J43508L8620q4007j83680J72798J52753J20000o8202J09118j81631
16914B735658K92991j61719N425J97453k3261O7964j21811m8534K10439J11076
16904C265681M1711j63804K15044J10469p2367J8255J25120K18660k85480J70528
$$ plain form
16894 3643817 3932545 3814134 3776163 3645715 3866690 4111814 3899588 3812490 4008522 4141103
16884 4141103 3852751 4180568 4333259 4167247 4423775 4252541 4397917 3936917 4546308
16875 4546308 4507076 4506533 4906530 4984060 4919448 4980176 4886944 5092345 5422120 5344557 5240590
16864 5240590 5424703 5521635 5158637 5649545 5575734 5892338 6016916 5920734 6036876 6188715
16854 6188715 6735203 6282340 6219485 6177463 6550351 6878568 7024979 7031953 7036881 7244763
16844 7244763 7153031 7312594 7779086 7169253 7801706 7888486 8255795 8456476 8244549 8308025
16834 8308025 8747202 8717541 9135687 9121696 9233479 9628091 9377805 9804727 10298067 10157071
16824 10157071 10212665 10493351 10833631 10961783 11304008 11324476 11703741 12011713 12284854 12277421
$$ packed form
16894C643817K88728j18411l7971j30448K20975K45124k12226q7098J96032J32581
16884D141103k88352L27817J52691j66012K56528j71234J45376m61000O09391
16875D546308l9232n43L99997P7530o4612O0728r3232K05401L29775p7563j03967
16864E240590J84113R6932l62998M90908p3811L16604J24578r6182J16142J51839
16854F188715N46488m52863o2855m2022L72888L28217J46411O974M928K07882
16844G244763r1732J59563M66492o09833O32453Q6780L67309K00681k11927O3476
16834H308025M39177k9661M18146j3991J11783L94612k50286M26922M93340j40996
16824A0157071N5594K80686L40280J28152L42225K0468L79265L07972K73141p433
$$ plain form
16814 12277421 12462247 12515534 13161046 13143525 13548548 13988058 14137393 14364262 14837638 15086304
16804 15086304 15483921 15760942 16336493 16405775 16755149 17081991 17748530 18263155 18347295 19025919
16794 19025919 19186758 19628374 20309878 20931264 21374356 22112254 22328433 22807392 23730183
16785 23730183 24094673 24737921 25343867 25810827 26697514 27424634 28098042 28562663 29425175
16776 29425175 30126202 30869989 32167670 32555047 33776378 34758546 35505908 36480576 37748828
16767 37748828 38455037 39588380 40371375 41711474 42792620 43746109 45076034 46112961
16759 46112961 47425633 48607001 50074460 51516022 52849879 53998478 55521313 57145059
16751 57145059 58213425 59492811 60906501 62268620 63713983 64891520 66323879 67841521
$$ packed form
16814A2277421J84826N3287O45512j7521M05023M39510J49335K26869M73376K48666
16804A5086304L97617K77021N75551O9282L49374L26842O66539N14625Q4140O78624
16794A9025919J60839M41616O81504O21386M43092P37898K16179M78959R22791
16785B3730183L64490O43248O05946M66960Q86687P27120O73408M64621Q62512
16776B9425175P01027P43787J297681L87377J221331R82168P47362R74668J268252
16767C7748828P06209J133343P82995J340099J081146R53489J329925J036927
16759D6112961J312672J181368J467459J441562J333857J148599J522835J623746
16751E7145059J068366J279386J413690J362119J445363J177537J432359J517642
$$ plain form
16743 67841521 68924441 70230825 71548429 72786785 73862612 74946163 76167657 76874270
16735 76874270 77887073 78914903 79382163 79830655 80424526 80717622 81257130 81423706 81263767
16726 81263767 81784509 81367058 81147936 81119921 80677194 79783917 79217353 78930504 77628562
16717 77628562 76908480 75891741 75156548 73817976 72953851 71768470 70514624 69367442
16709 69367442 67985831 66743076 65335697 63958894 62741702 61439994 60037745 58788569
16701 58788569 57373289 55973132 54814606 53449356 52535795 50964329 49644941 48415252
16693 48415252 47218665 45832055 45235420 43942494 42796050 41838773 40448799 39669223
16685 39669223 38681953 37842717 37245615 36399786 35321477 34266154 33575987 32663230 31809261
$$ packed form
16743F7841521J082920J306384J317604J238356J075827J083551J221494P06613
16735G6874270J012803J027830M67260M48492N93871K93096N39508J66576j59939
16726H1263767N20742m17451k19122k8015m42727q93277n66564k86849j301942
16717G7628562p20082j016739p35193j338572q64125j185381j253846j147182
16709F9367442j381611j242755j407379j376803j217192j301708j402249j249176
16701E8788569j415280j400157j158526j365250r13561j571466j319388j229689
16693D8415252j196587j386610n96635j292926j146444r57277j389974p79576
16685C9669223r87270q39236n97102q45829j078309j055323o90167r12757q53969
$$ plain form
16676 31809261 31012739 30490227 29683460 28951761 28284031 27438668 26600340 26453050 25763288
16667 25763288 25429430 24653451 23933408 23664677 22928795 22361501 22033710 21480138 21019333
16658 21019333 20491522 20377344 19749983 19346801 18983582 18520358 18551538 17965046 17694412
16649 17694412 17118502 16841172 16385145 16259602 15901758 15965197 15237112 15288101 14738080 14476741
16639 14476741 14503651 13599043 13533154 13592305 13329736 12933637 12677219 12610313 12527722 12256802
16629 12256802 12274239 11906596 11551342 11610366 11374903 11046289 11007135 10772257 10478170 10548695
16619 10548695 10215018 9880565 9757123 9994595 9719999 9545826 9172924 8989389 8885550
16610 8885550 8586752 9057339 8477624 8563252 8296252 8510438 7905440 8073045 8087975 7651502
$$ packed form
16676C1809261p96522n22512q06767p31699o67730q45363q38328j47290o89762
16667B5763288l33858p75979p20043k68731p35882n67294l27791n53572m60805
16658B1019333n27811j14178o27361m03182l63219m63224L1180n86492k70634
16649A7694412n75910k77330m56027j25543l57844O3439p28085N0989n50021k61339
16639A4476741K6910r04608o5889N9151k62569l96099k56418o6906q2591k70920
16629A2256802J7437l67643l55254N9024k35463l28614l9154k34878k94087P0525
16619A0548695l33677l34453j23442K37472k74596j74173l72902j83535j03839
16610H885550k98798M70587n79715Q5628k67000K14186o04998J67605J4930m36473
$$ plain form
16600 7651502 7939401 7752156 7730426 7474010 7398948 7381363 7056550 7132133 7018250 6837875
16590 6837875 6573387 6615011 6724934 6273566 6541343 6542724 6409187 6132697 6397265 6184915
16580 6184915 5718120 6158980 5753353 5567892 5580331 5408941 5364862 5482841 5535596 5726140
16570 5726140 5698434 5308494 4805903 5005898 5053568 4976817 4980254 4983082 4726872 4942112 4797433
16559 4797433 4746085 4741726 4893460 4295316 4659504 4467874 4540562 4452795 4615160 4437462
16549 4437462 4183185 4484130 4000213 4463954 4142428 4171132 3731534 3641805 4067682 3782722
16539 3782722 3762310 3945794 3548115 4054652 3819227 3765092 3564039 3305097 3462483 3537795
16529 3537795 3506956 3280154 3615292 3513671 3539215 3520936 3204284 3497978 3235112 3241827
$$ packed form
16600G651502K87899j87245k1730k56416p5062j7585l24813P5583j13883j80375
16590F837875k64488M1624J09923m51368K67777J381j33537k76490K64568k12350
16580F184915m66795M40860m05627j85461J2439j71390m4079J17979N2755J90544
16570E726140k7706l89940n02591J99995M7670p6751L437K828k56210K15240j44679
16559D797433n1348m359J51734n98144L64188j91630P2688q7767J62365j77698
16549D437462k54277L00945m83917M63741l21526K8704m39598q9729M25877k84960
16539C782722k0412J83484l97679N06537k35425n4135k01053k58942J57386P5312
16529C537795l0839k26802L35138j01621K5544j8279l16652K93694k62866O715
$$ plain form
16519 3241827 3302358 3361470 3163196 3406343 3703447 3201317 3057747 2902214 3112677 2912929
16509 2912929 2879388 2803563 2658494 2888228 3178348 3173418 3126935 3099630 2982107 3086253
16499 3086253 2640318 2686430 2614652 3018524 2810477 2736039 2758781 2609671 2689849 2479616
16489 2479616 2411515 2074613 2799395 2469555 2447490 2567772 2464821 2472088 2616738 2413501
16479 2413501 2333349 2449290 2245879 2259975 2417478 2367271 2582418 2636854 2226075 2487340
16469 2487340 2008003 2215884 2356401 2333638 2214329 2393113 2039144 2233304 2202903 2232884
16459 2232884 2497768 2215506 1992122 2065808 2054588 2231465 1967281 1983794 2198889 2267978
16449 2267978 2042810 1882370 2013169 1799757 1780145 1848253 2333462 1949723 1818514 2391408
$$ packed form
16519C241827O0531N9112j98274K43147K97104n02130j43570j55533K10463j99748
16509B912929l3541p5825j45069K29734K90120m930m6483k7305j17523J04146
16499C086253m45935M6112p1778M03872k08047p4438K2742j49110Q0178k10233
16489B479616o8101l36902P24782l29840k2065J20282j02951P267J44650k03237
16479B413501q0152J15941k03411J4096J57503n0207K15147N4436m10779K61265
16469B487340m79337K07881J40517k2763j19309J78784l53969J94160l0401K9981
16459B232884K64884k82262k23384P3686j1220J76877k64184J6513K15095O9089
16449B267978k25168j60440J30799k13412j9612O8108M85209l83739j31209N72894
$$ plain form
16439 2391408 1514768 1713865 1814685 1734149 1911177 1422264 1880478 1891665 1452181 1926490
16429 1926490 1435786 1848609 1626757 1570423 2067729 1395012 1614496 1500630 1316124 1596300
16419 1596300 1803047 1493553 1360061 1282893 1263847 1582684 1539740 1475615 1511904 1943944
16409 1943944 839730 1805299 1685661 1475161 1459689 1463071 1455593 1490909 1424130 1552088 1419636
16398 1419636 1563402 1540129 1450557 1259513 1285903 1561670 1711120 1148471 1736398 1277849
16388 1277849 1782322 1818108 1438383 1395537 1205639 1265440 1360172 1395451 988137 1363600
16378 1363600 1170625 1347060 1324916 1394325 1085491 1351329 1235496 1474456 1354378 1141153
16368 1141153 951353 1264970 1323474 1334489 1364685 822626 1426445 991614 1198897 1059971
$$ packed form
16439B391408q76640J99097J00820q0536J77028m88913M58214J1187m39484M74309
16429A926490m90704M12823k21852n6334M97306o72717K19484j13866j84506K80176
16419A596300K06747l09494j33492p7168j9046L18837m2944o4125L6289M32040
16409A943944H39730R65569j19638k10500j5472L382p478L5316o6779J27958j32452
16398A419636J43766k3273q9572j91044K6390K75767J49450n62649N87927m58549
16388A277849N04473L5786l79725m2846j89898N9801R4732L5279m07314L75463
16378A363600j92975J76435k2144O9409l08834K65838j15833K38960j20078k13225
16368A141153j89800L13617N8504J1015L0196n42059O03819m34831K07283j38926
$$ plain form
16358 1059971 1543145 827782 1107039 1204434 1134319 820042 1011681 1241804 1446274 1118024
16348 1118024 1065514 868244 1176140 1037636 1379821 1194592 1157176 1183443 1092665 875075
16338 875075 773710 830389 1018632 1170072 1212614 1050153 1172384 1182799 1264265 1278862
16328 1278862 1122751 1095035 850072 992174 708504 861837 1199182 905366 904382 916090
16318 916090 820534 906163 1090550 1037855 913440 1002353 1152353 1106164 646389 927735
16308 927735 1041585 656013 1136284 830025 613634 670801 819148 678750 545685 773516
16298 773516 724975 672226 909664 880125 876353 996660 989987 945871 724684 965859 758487
16287 758487 874092 537258 1159772 743404 1085981 738595 879919 452357 779857 645865
$$ packed form
16358A059971M83174p15363K79257R7395p0115l14277J91639K30123K04470l28250
16348A118024n2510j97270L07896j38504L42185j85229l7416K6267r0778k17590
16338H75075j01365N6679J88243J51440M2542j62461J22231J0415Q1466J4597
16328A278862j56111k7716k44963J42102k83670J53333L37345k93816r84J1708
16318I16090r5556Q5629J84387n2695j24415Q8913J50000m6189m59775K81346
16308I27735J13850l85572M80271l06259k16391N7167J48347j40398j33065K27831
16298G73516m8541n2749K37438k9539l772J20307o673m4116k21187K41175k07372
16287G58487J15605l36834O22514m16368L42577l47386J41324m27562L27500j33992
$$ plain form
16277 645865 720220 837832 603129 709763 1071059 821223 811394 641911 717712 906205
16267 906205 754510 721528 730259 680999 1122113 501414 421268 828065 852802 727303 830721
16256 830721 621445 717996 874292 868384 938241 814842 692642 714610 869416 849175 922868
16245 922868 511416 755214 506818 668891 819448 834491 593092 825662 513700 493686
16235 493686 784560 752884 385250 387590 662270 510974 806203 796336 598103 479491
16225 479491 583093 746654 401313 747540 517585 443952 423450 514947 538194 547694 616816
16214 616816 551969 675892 509851 767483 790501 498212 502020 471896 563500 379311 597661
16203 597661 735696 460303 668264 601948 388600 435113 518691 505499 233745 207206
$$ packed form
16277F45865P4355J17612k34703J06634L61296k49836r829j69483P5801J88493
16267I06205j51695l2982Q731m9260M41114E01414q0146M06797K4737j25499J03418
16256H30721k09276R6551J56296n908O9857j23399j22200K1968J54806k0241P3693
16245I22868m11452K43798k48396J62073J50557J5043k41399K32570l11962k0014
16235D93686K90874l1676l67634K340K74680j51296K95229r867j98233j18612
16225D79491J03602J63561l45341L46227k29955p3633k0502R1497K3247R500O9122
16214F16816o4847J23923j66041K57632K3018k92289L808l0124R1604j84189K18350
16203E97661J38035k75393K07961o6316k13348M6513Q3578j3192B33745k6539
$$ plain form
16193 207206 526995 588822 520398 703999 715057 448016 479416 375561 523462 566505
16183 566505 610875 414624 768643 531036 369206 481360 657836 392906 626832 372959
16173 372959 509296 599974 275675 432542 402971 380581 48442 145545 565290 331954
16163 331954 473826 282531 526164 425377 126750 428058 369657 328650 270115 262742
16153 262742 208330 170157 430894 270401 424458 342207 465730 508071 341050 342975 568103
16142 568103 499301 160827 688693 346049 73504 599894 303000 336182 125953 465066
16132 465066 233130 274090 662986 93747 432742 622856 736399 492157 435373 281225
16122 281225 412856 437648 309986 241850 191993 303271 49689 -46819 349671 391434 671613
$$ packed form
16193B07206L19789O1827o8424J83601J1058k67041L1400j03855J47901M3043
16183E66505M4370j96251L54019k37607j61830J12154J76476k64930K33926k53873
16173C72959J36337R0678B75675J56867k9571k2390D8442R7103M19745k33336
16163C31954J41872j91295K43633j00787A26750L01308n8401m1007n8535p373
16153B62742n4412l8173K60737j60493J54057q2251J23523M2341j67021J925K25128
16142E68103o8802A60827N27866l42644G3504N26390k96894L3182A25953L39113
16132D65066k31936M0960L88896I3747L38995J90114J13543k44242n6784j54148
16122B81225J31631K4792j27662o8136m9857J11278D9689d6819C49671M1763K80179
$$ plain form
16111 671613 118385 124712 319383 281491 279270 463429 413105 418764 289964 208940 373973
16100 373973 283786 133538 137675 435443 250345 371709 482860 184909 -35382 635711
16089 371841 147277 140457 55351 355410 420946 332345 147936 456473 361748 430476 390256
16078 390256 198162 227540 175092 160369 334616 541202 317077 -85374 145573 84347
16068 84347 364471 14698 386566 1504 145066 765124 114257 -41345 190017 72412 62696
16057 62696 203317 78751 372061 100444 417879 278298 121087 78300 142657 49277
16046 343607 13419 204809 598274 -6702 201003 171310 -118083 128642 -52398 91587 11207
16034 113327 330097 226111 344709 161198 235360 201611 215973 388688 -220345 62258
$$ packed form
16111F71613A18385O327J94671l7892k221J84159n0324N659j28800q1024J65033
16100C73973r0187A33538M137K97768j85098J21364J11151A84909c5382F35711
16089C71841A47277o820E5351L00059O5536q8601A47936L08537r4725O8728m0220
16078C90256j92094K9378n2448j4723J74247K06586k24125h5374A45573o1226
16068H4347K80124A4698L71868A504J43562O20058A14257d1345A90017G2412r716
16057F2696J40621G8751K93310A00444L17435j39581A21087m2787O4357D9277
16046C43607A3419J91390L93465f702B01003k9693a18083A28642e2398I1587A1207
16034A13327K16770j03986J18598A61198P4162l3749J4362J72715b20345F2258
$$ plain form
16023 14179 266823 383684 282404 297915 59585 99327 129712 206781 -153279 213757 15873
16011 -11306 308103 3968 243659 193108 131268 368723 332926 -208460 324345 382194 452536
16000 452536 312971 358025 312246 281405 160731 265492 197243 286022 289766 89561 373292
15989 373292 272740 825719 665664 939373 306261 419667 375329 254381 280727 226822
15979 226822 241599 -34210 150859 104441 50699 -134204 247483 206107 -223396 270944
15968 108364 36591 261495 -69092 171825 214724 181121 323696 149664 122362 -121878
15957 189720 190193 -29250 -80935 -18224 -6935 279990 147956 262939 110977 116674 -245213
15945 91051 -14958 8728 146855 288837 305712 101688 -38722 72229 24829 104949 82049
$$ packed form
16023A4179K52644J16861j01280J5511E9585L9742L0385P7069a53279B13757A5873
16011a1306C08103C968K39691n0551o1840K37455l5797b08460C24345N7849P0342
16000D52536j39565M5054m5779l0841j20674J04761o8249Q8779L744H9561K83731
15989C73292j00552N52979j60055K73709C06261J13406m4338j20948K6346n3905
15979B26822J4777c4210A50859m6418E0699a34204B47483m1376b23396B70944
15968A08364C6591K24904f9092A71825M2899l3603J42575A49664k7302a21878
15957A89720M73b9250n1685a8224f935B79990j32034J14983A10977N697b45213
15945I1051a4958H728J38127J41982J6875A01688c8722G2229B4829Q0120k2900
$$ plain form
15934 82049 -153752 -96199 137308 203595 112659 212386 313044 -36623 -70496 85611 219007
15923 219007 197076 54544 151340 8185 229070 90649 -60168 140976 -13981 201832 225477
15912 225477 212957 26306 92135 79075 179105 143932 96032 65338 207040 325353 -98624
15900 351316 85511 102787 173853 183536 111520 180433 204198 22680 35608 317615 297401
15889 297401 -46916 134639 -229909 134783 53696 70119 -117456 -390281 121592 25068
15878 157156 56441 39146 -93133 156326 259070 -128341 -118665 37600 188520 372015 345184
15867 345184 -25000 9373 140858 131320 95354 53892 -209500 179103 -125778 239455 -28258
15855 51313 -288668 -72009 82032 -108167 112643 -82827 223381 164447 -193771 99512 280292
$$ packed form
15934H2049a53752N7553A37308O6287r0936R9727J00658c6623l3873H5611J33396
15923B19007k1931E4544R6796H185K20885I0649f0168A40976a3981B01832K3645
15912B25477j2520B6306O5829j3060J00030l5173m7900l0694J41702J18313i8624
15900C51316H5511J7276P1066R683p2016O8913K3765B2680J2928K82007k0214
15889B97401d6916A34639b29909A34783E3696J6423a17456k72825A21592B5068
15878A57156E6441j7295i3133A56326J02744a28341R676C7600J50920J83495k6831
15867C45184b5000I373J31485r538l5966m1462b09500A79103a25778B39455b8258
15855E1313b88668g2009H2032a08167A12643h2827B23381n8934a93771I9512J80780
$$ plain form
15844 280292 169961 -116161 -6389 293879 177873 -118734 4008 -88067 109133 -275935
15833 34541 -85679 -240330 223864 194218 3542 186669 111681 90725 77007 -53209 -49871
15822 -49871 -127965 -7207 199750 -228739 -143599 -115948 138953 -43791 -175569 170880 119055
15811 119055 -60653 -227383 290273 108080 187669 -142623 -78625 33207 -191672 116334
15800 355459 -37785 152417 103214 -57500 -45137 -120604 -69695 107588 29985 343679 365748
15789 365748 204100 204941 -77164 475291 -7431 408471 -62360 -2012 200381 93188 -25986
15777 -115866 275301 185536 -14673 22806 -270088 5404 -264711 385400 63527 -184721 316796
15765 303201 24684 -367432 -210392 90159 162465 -279998 6081 -490088 155858 59172 -101658
$$ packed form
15844B80292j10331a16161f389B93879j16006a18734D008h8067A09133b75935
15833C4541h5679j54651B23864k9646C542J83127p4988k0956j3718e3209L338
15822d9871p8094g207A99750b28739Q5140K7651A38953d3791j31778A70880n1825
15811A19055f0653j66730B90273A08080P9589a42623O3998C3207a91672A16334
15800C55459c7785A52417m9203e7500J2363p5467N0909A07588B9985L13694K2069
15789C65748j61648Q41g7164D75291g431D08471f2360b012B00381I3188b5986
15777a15866B75301q9765a4673B2806b70088E404b64711C85400F3527a84721C16796
15765C03201B4684c67432J57040I0159P2306b79998F081d90088A55858E9172a01658
$$ plain form
15753 191222 48861 145773 -112483 100047 -16315 -14678 87140 103805 155999 -293713 -27528
15741 130975 115171 -227237 246651 -43906 66291 125692 95866 -60097 95932 21243 -318954
15729 -75257 -278559 18931 122194 124174 -143800 109998 10677 -87664 -100624 -193274 50041
15717 -251691 -126342 -21703 84638 -123359 -167316 15229 46075 46211 59930 -256821 -318773
15706 -318773 -181393 281947 12350 215612 -283410 -5691 107161 -104545 -167857 -174714 115313
15694 145222 235882 461160 23092 131886 264450 162504 -199015 86243 17493 -327124
15683 -67799 -260704 66498 -100717 -238868 481628 103814 -197979 -12755 -75523 -367528
15673 -367528 -276028 -193568 252590 346721 235430 68189 253301 -215430 -231434 198913
$$ packed form
15753A91222D8861R6912a12483A00047a6315J637H7140J6665N2194b93713b7528
15741A30975j5804b27237B46651d3906F6291N9401k9826f0097I5932B1243c18954
15729g5257k03302A8931J03263J980a43800A09998A0677h7664j2960r2650E0041
15717b51691J25349b1703H4638a23359m3957A5229L0846J36J3719b56821o1952
15706c18773J37380B81947A2350K03262b83410e691A07161a04545o3312o857A15313
15694A45222R0660K25278B3092J08794J32564j01946a99015H6243A7493c27124
15683f7799j92905F6498a00717j38151D81628A03814a97979a2755o2768k92005
15673c67528R1500Q2460B52590R4131j11291F8189J85112b15430j6004A98913
$$ plain form
15662 24116 15835 125338 103668 82077 227798 22601 -314251 -216288 70401 36842 39333
15651 39333 -41926 262410 -118352 -90467 -211236 24254 5806 -60113 48333 -193641 -63158
15639 -3602 -9490 222889 -150952 238044 -58762 -193307 -217071 -85832 138435 76843 11656
15627 -20371 -184149 -249757 -368523 100952 -131877 -202322 129877 -36889 65439 -24422 -76510
15616 -76510 -23870 117551 -548592 150545 34814 -4680 -70634 83033 175272 -37756 222251
15604 361031 -361535 39721 -85869 -62881 -274512 12196 384447 -116171 -219146 -40239
15593 17520 -71055 -109190 -136928 482 -243821 -64845 -29051 53540 254227 135046 -399616
15581 167530 200169 -70153 278750 -82247 -14393 253084 -200558 197559 109479 -264547
$$ packed form
15662B4116q281J09503k1670k1591J45721B2601c14251R7963G0401l3559K491
15651C9333d1926B62410a18352K7885j20769B4254E806f0113D8333a93641f3158
15639c602n888B22889a50952B38044e8762j34545k3764h5832A38435o1592A1656
15627b0371j63778o5608j18766A00952a31877p0445A29877c6889F5439b4422n2088
15616g6510b3870A17551e48592A50545C4814d680o5954H3033R2239c7756B22251
15604C61031c61535C9721h5869K2988k11631A2196L72251a16171j02975d0239
15593A7520g1055l8135k7738D82b43821f4845b9051E3540K00687j19181c99616
15581A67530L2639g0153B78750h2247a4393B53084b00558A97559q8080b64547
$$ plain form
15570 -148144 -203915 -202430 158672 -245734 174658 522751 191292 159570 188064 204069 608
15558 -34742 -31174 -259846 173875 3141 11533 364738 122119 -141168 -126039 -146115 -5479
15546 97107 -290062 312007 183172 -36866 138960 -173824 -37345 125922 -1431 290759
15535 -425986 266575 185306 -64865 -64574 -84466 -175284 289195 -94930 -124841 67064 210325
15524 210325 -114547 134983 283247 120106 274288 -145832 58010 26481 -299996 -102852
15513 121600 -81213 -154840 -175276 -95492 79364 -254050 24872 -160746 86750 127127 252103
15502 252103 -324434 -37699 116077 162281 -94450 -45654 45529 -101580 -37639 176697 134221
15491 134221 -83504 -385509 -111588 164035 100474 114525 -491 130462 196302 407937 202531
$$ packed form
15570a48144n5771J485A58672b45734A74658L48093A91292l1722K8494J6005F08
15558c4742L568k28672A73875C141Q392L53205A22119a41168J5129k0076e479
15546I7107b90062C12007j28835c6866A38960a73824c7345A25922a431B90759
15535d25986B66575q1269f4865K91j9892r0818B89195i4930k9911F7064J43261
15524B10325a14547A34983J48264A20106J54182a45832E8010B6481b99996a02852
15513A21600h1213p3627k0436P9784G9364b54050B4872a60746H6750M0377J24976
15502B52103c24434c7699A16077M6204i4450d5654D5529a01580c7639A76697m2476
15491A34221h3504l02005a11588A64035o3561J4051d91A30462O5840K11635B02531
$$ plain form
15479 343483 14660 -258051 421113 455204 223464 375747 33567 37220 453587 326989
15469 326989 -25181 -26373 -104026 -171145 -152713 210559 7485 -146651 14323 300081 95845
15457 102222 -102542 -170905 44852 75384 49540 -38399 -25784 78755 -115136 75732 -45234
15445 210944 476879 469823 336842 335732 474911 173368 117842 1818 120211 -46561 -173025
15434 -173025 144388 108189 -72948 139223 -48625 -268006 205738 -184960 -170346 65711
15423 -116473 -34962 -149524 -23406 50556 211212 64865 294530 94738 128126 -167358 -243655
15412 -243655 -367663 -154123 122245 -76071 -427970 -311363 -375729 -165583 -133228 -163932
15402 -163932 70359 -167897 -89843 -114918 -74987 -63926 107664 14454 298421 144127 143765
$$ packed form
15479C43483A4660b58051D21113L4091B23464J52283C3567L653M16367j26598
15469C26989b5181j192p7653o7119J8432B10559G485a46651A4323K85758I5845
15457A02222a02542o8363D4852L0532k5844c8399J2615G8755a15136G5732d5234
15445B10944K65935p056j32981j110J39179A73368n5526A818J18393d6561j26464
15434a73025A44388l6199g2948A39223d8625k19381B05738a84960J4614F5711
15423a16473c4962j14562b3406E0556J60656F4865K29665I4738L3388a67358p6297
15412b43655j24008a54123A22245g6071l51899J16607o4366a65583L2355l0704
15402a63932G0359a67897P8054k5075L9931J1061A07664A4454K83967A44127l62
$$ plain form
15391 143765 17384 -103281 -232338 -237970 -44 -78896 77077 -244604 -33544 -143275 -93778
15380 -93778 -74733 77994 -78639 23289 -130979 137467 220790 230382 -27056 -147282 -47813
15368 81077 459066 114752 192333 36 57175 132790 49701 113844 -54526 44294 20833 93256
15356 93256 274263 480549 -11371 563523 171728 -65471 47740 -73706 -164519 -64620 -221052
15345 -221052 112014 144500 61859 -210312 352092 159809 -95696 116983 113117 -70212 -25896
15333 263298 81817 121529 21738 -194609 322103 244445 92042 127600 -32127 216231 180981
15322 180981 43266 -80280 47083 455582 158878 312241 -77247 -40696 217020 -26585 -197447
15311 -197447 -163059 427717 189001 -104011 92331 34506 68941 202388 40253 214138
$$ packed form
15391A43765A7384a03281j29057n632d4p8852G7077b44604c3544j09731M9497
15380i3778J9045G7994g8639B3289a30979A37467Q3323R592b7056j20226d7813
15368H1077L77989A14752P7581C6N7139P5615D9701O4143e4526D4294B0833P2423
15356I3256J81007K06286a1371E63523A71728f5471D7740g3706r0813f4620j56432
15345b21052A12014L2486F1859b10312C52092A59809i5696A16983l866g0212b5896
15333B63298H1817L9712B1738a94609C22103p7658I2042L5558c2127B16231l5250
15322A80981D3266h0280D7083M08499A58878J53363g7247L6551B17020b6585j70862
15311a97447L4388D27717A89001a04011I2331C4506L4435J33447D0253J73885
$$ plain form
15301 214138 -287755 179742 94887 -203185 86320 -27340 -111132 135475 149326 307777
15291 307777 -178665 -68742 -233464 35813 -125079 28412 75805 -118511 -14526 316283
15280 244438 -186945 192482 -57179 60220 164476 -296031 3163 -40202 144786 17461 68363
15269 68363 14558 -273231 10550 74563 95063 155797 -51753 94348 196223 130412 160877
15258 160877 326615 -122093 133070 16087 151098 208868 234808 200309 -118259 284571
15247 669723 1548806 2216677 1524257 1688153 1683088 651112 147236 529066 176095 -297919
15236 -133550 5894 238761 -229547 48038 -52149 119384 88725 77915 -150153 22765 83534
15225 83534 -53480 -396394 197500 -86807 86753 -106916 242983 -259686 102374 -160783
$$ packed form
15301B14138b87755A79742q4855b03185H6320b7340q3792A35475J3851J58451
15291C07777a78665f8742j64722C5813a25079B8412M7393a18511a4526C16283
15280B44438a86945A92482e7179F0220J04256b96031C163d0202A44786A7461N0902
15269F8363A4558b73231A0550O4013K0500O0734e1753I4348J01875o5811L0465
15258A60877J65738a22093A33070A6087J35011N7770K5940l4499a18259B84571
15247F69723Q79083O67871o92420J63896n065F51112A47236L81830A76095b97919
15236a33550E894K32867b29547D8038e2149A19384l0659j0810a50153B2765O0769
15225H3534e3480l42914A97500h6807H6753a06916B42983b59686A02374a60783
$$ plain form
15214 168704 134202 264786 -425658 325991 -39522 12900 42973 453854 215606 237994
15204 237994 3248 49854 142818 -143033 48456 -123885 -122533 190396 -38229 -55571 138842
15192 255772 -159213 -191771 122884 39504 -50681 58970 46133 71905 -56784 302836 202015
15181 202015 72859 264632 32749 -321792 -14209 -144716 145355 -78947 34069 -98586 65580
15169 90148 -24615 -186676 -79274 704722 -185165 488348 -295323 256739 126990 -129333
15158 -171474 -287164 258366 -20092 179185 -45126 128308 180424 -48155 81117 -89114 -156870
15147 -156870 -61189 -322922 166015 251563 310717 102988 25556 150106 225126 -177471
15136 -46193 183583 47643 -61706 -51168 484780 58160 228192 -238157 323397 -183075
$$ packed form
15214A68704l4502J30584d25658C25991c9522A2900L0073M10881B15606K2388
15204B37994C248M6606R2964a43033D8456a23885J352A90396c8229j7342A38842
15192B55772a59213l2558A22884C9504e0681E8970j2837K5772e6784C02836j00821
15181B02015G2859J91773C2749c21792a4209j30507A45355g8947C4069i8586F5580
15169I0148b4615j62061g9274G04722a85165D88348b95323B56739A26990a29333
15158a71474j15690B58366b0092A79185d5126A28308N2116d8155H1117h9114o7756
15147a56870f1189k61733A66015Q5548N9154A02988B5556J24550P5020a77471
15136d6193A83583D7643f1706J0538D84780E8160J70032b38157C23397a83075
$$ plain form
15125 220693 73571 -28379 -140590 281357 -262 95880 1475 -53587 190461 -181347 274391
15113 336486 239969 -173965 154473 -139435 83610 81950 98589 384300 -122768 141289
15102 -261867 94254 -30245 -295107 -439498 391259 -7307 -85835 121581 164620 79178 301945
15091 301945 -80757 333485 -59743 87240 144512 67281 20744 165641 -33624 435143 157335
15079 149079 220715 282063 -44325 18260 189101 82130 3311 80366 25079 296720 262939
15068 262939 226798 161381 87240 82425 -47974 165138 483004 -38463 466053 -107505 117385
15056 52660 166054 161869 -77330 379491 289632 75660 228459 72623 75404 129575 313805
15045 313805 359375 50033 76905 237079 289399 86618 133194 -152340 96783 -1897 217532
$$ packed form
15125B20693G3571b8379j12211B81357b62I5880A475e3587A90461a81347B74391
15113C36486r6517a73965A54473a39435H3610j660J6639K85711a22768A41289
15102b61867I4254c0245k64862j44391C91259g307p8528A21581M3039G9178K22767
15091C01945h0757C33485e9743H7240N7272F7281B0744J44897c3624D35143A57335
15079A49079P1636O1348d4325A8260J70841H2130C311P7055B5079K71641l3781
15068B62939l6141o5417p4141m815d7974A65138L17866c8463D66053a07505A17385
15056E2660J13394m185g7330C79491q9859G5660J52799G2623K781N4171J84230
15045C13805M5570E0033K6872J60174N2320H6618M6576a52340I6783a897B17532
$$ plain form
15033 74234 78497 219296 289451 419572 97336 193215 495236 650359 448474 539903 546016
15022 546016 130451 25941 386742 534851 684591 191907 309516 181465 212524 370250
15012 370250 150629 166357 305119 61528 106999 581477 351923 192426 234098 279378
15002 279378 411900 235732 82660 269010 35452 288029 271989 148326 257268 414623
14992 414623 303809 202369 192052 220893 320270 284789 106135 329877 359321 537511
14982 537511 97188 598128 201870 344147 502071 449379 226996 129933 317609 143041
14971 207496 269736 398574 82777 243725 498106 252705 250590 178442 290077 19182 10586
14960 10586 -101766 144245 -236852 55212 169947 686587 131831 275103 163358 307875
$$ packed form
15033G4234M263J40799P0155J30121I7336R5879L02021J55123k01885R1429O113
15022E46016A30451B5941L60801J48109J49740A91907J17609j28051L1059J57726
15012C70250A50629J5728J38762F1528M5471M74478k29554j59497M1672M5280
15002B79378J32522j76168H2660J86350C5452K52577j6040j23663J08942J57355
14992D14623j10814j01440j0317K8841R9377l5481A06135K23742K9444J78190
14982E37511I7188N00940B01870J42277J57924n2692k22383r7063J87676A43041
14971B07496O2240J28838H2777J60948K54381k45401k115p2148J11635A9182q596
14960A0586a01766A44245b36852E5212J14735N16640A31831J43272j11745J44517
$$ plain form
14950 307875 -2886 -25098 260030 400530 296954 235818 254408 223939 467424 474430 263977
14939 263977 44937 119046 413025 374736 150141 631633 389289 446131 364592 739786
14929 739786 633890 694980 841970 897337 1104177 889578 835656 872900 674583 1069082
14919 1069082 982089 1054235 1097106 863340 818569 804697 651245 699503 163881 639921
14909 639921 468128 271522 538181 498691 171273 447354 366750 183518 601339 299911
14898 174333 133736 478074 225306 369930 281338 498749 431412 445822 195273 251123
14888 251123 331908 500551 510381 850343 197999 398397 94543 503232 180191 494667
14878 494667 578030 485435 642961 193593 473001 304499 312380 548689 515285 444859 465249
$$ packed form
14950C07875b886k2212B60030J40500j03576o1136J8590l0469K43485P006k10453
14939B63977D4937P4109K93979l8289A50141M81492k42344N6842q1539L75194
14929G39786j05896O1090J46990N5367K06840k14599n3922L7244j98317L94499
14919A069082q6993P2146M2871k33766m4771j3872j53452M8258A63881M76040
14909F39921j71793j96606K66659l9490A71273K76081q0604j83232M17821B99911
14898A74333m0597L44338B25306J44624q8592K17411o7337J4410A95273N5850
14888B51123Q0785J68643R830L39962A97999K00398I4543M08689A80191L14476
14878D94667Q3363r2595J57526A93593K79408j68502P881K36309l3404p0426K0390
$$ plain form
14867 465249 452371 326340 430593 591868 97867 313102 36967 198009 359165 238089
14857 238089 602743 639074 295499 329418 531785 416122 151409 429323 469183 421816
14847 421816 588608 627711 181446 662217 961301 753585 723959 756690 821771 810261
14837 810261 579881 614668 469267 475498 186701 430462 632690 543804 205171 637136
14827 637136 148219 368984 290177 651328 167501 302828 600978 456742 566692 591657
14817 591657 517023 676623 123792 145178 567333 411578 394733 425960 598806 416154
14807 416154 314735 874860 938382 568082 436515 475643 1040387 778008 607814 443824
14797 443824 705478 181856 485038 579334 154992 286030 615640 521583 280741 555679
$$ packed form
14867D65249j2878j26031J04253J61275I7867K15235C6967J61042J61156j21076
14857B38089L64654L6331B95499L3919K02367j15663A51409K77914L9860m7367
14847D21816J66792L9103A81446M80771K99084k07716k9626L2731O5081j1510
14837H10261k30380L4787j45401O231A86701K43761K02228q8886B05171M31965
14827F37136A48219K20765p8807L61151A67501J35327K98150j44236J09950K4965
14817E91657p4634J59600A23792K1386M22155j55755j6845L1227J72846j82652
14807D16154j01419N60125O3522l70300j31567L9128N64744k62379j70194j63990
14797D43824K61654A81856L03182R4296A54992J31038L29610r4057k40842K74938
$$ plain form
14787 555679 538046 708095 550576 554651 329394 453128 501165 343480 651544 423715
14777 423715 687666 522872 420604 629951 522463 390611 565665 468406 786215 626015
14767 626015 464829 144147 476574 574800 656243 306467 426254 484005 405233 804275
14757 804275 422464 292178 590718 585702 476564 702757 812758 640902 795842 751676
14747 751676 324663 756085 468648 424079 681650 722935 447383 298744 379918 557409
14737 557409 551857 503253 563063 777190 694650 506802 661080 810196 603971 885736
14727 885736 970056 773905 1180739 906679 1207063 1274617 1037604 1272151 770503 669567
14717 669567 790054 882357 666704 741010 950195 621682 599138 720685 796247 710290
$$ packed form
14787E55679j7633J70049j57519M075k25257J23734M8037j57685L08064k27829
14777D23715K63951j64794j02268K09347j07488j31852J75054r7259L17809j60200
14767F26015j61186A44147L32427R8226Q1443C06467J19787N7751p8772L99042
14757H04275l81811j30286K98540n016j09138K26193J10001j71856J54940m4166
14747G51676C24663M31422k87437m4569K57571M1285k75552j48639Q1174J77491
14737E57409n552m8604N9810K14127q2540j87848J54278J49116k06225K81765
14727H85736Q4320j96151M06834k74060L00384O7554k37013K34547n01648j00936
14717F69567J20487R2303k15653P4306K09185l28513k2544J21547P5562q5957
$$ plain form
14707 710290 773488 899023 914231 1064121 463535 721341 895242 896879 820418 967220
14697 967220 1262023 1253484 791810 1304727 748135 809718 639433 987660 798116 674181
14687 674181 777715 699116 851200 1025941 517359 477646 864249 840936 780068 662840
14677 662840 600910 1078197 817342 684427 884883 1016923 1218743 933971 655934 1142759
14667 1142759 745657 466224 1134225 1237186 790233 866721 645273 1075663 895986 900816
14657 900816 928746 728814 825335 1095870 813051 872596 1160972 1042863 1191222 1259139
14647 1259139 956029 780042 1068603 929225 818995 1336666 1458081 990174 1039265 1133741
14637 1133741 1036187 1198976 920712 1032239 1103018 835388 1138711 894423 1207403 1125256
$$ packed form
14707G10290O3198J25535J5208J49890D63535K57806J73901J637p6461J46802
14697I67220K94803q539m61674N12917n56592O1583j70285L48227j89544j23935
14687F74181J03534p8599J52084J74741n08582l9713L86603k3313o0868j17228
14677F62840o1930M77287k60855j32915K00456J32040K01820k84772k78037M86825
14667A142759l97102k79433O68001J02961m46953P6488k21448M30390j79677M830
14657I00816K7930j99932R6521K70535k82819N9545K88376j18109J48359O7917
14647A259139l03110j75987K88561j39378j10230N17671J21415m67907M9091R4476
14637A133741r7554J62789k78264J11527P0779k67630L03323k44288L12980q2147
$$ plain form
14627 1125256 887788 1517037 1094767 951372 1340476 1424711 1307363 1250787 1039025 1445608
14617 1445608 1107306 1387394 994523 1215410 1066125 1231547 1264619 1187888 984757 1187578
14607 1187578 1238863 1338688 1336249 1155675 1161073 1267590 1317202 944225 1324068 1307459 1396808
14596 1396808 1102869 1578485 1321030 1392725 1310073 1507739 1684891 1783776 1532939 1357223
14586 1357223 1592718 1268407 1897348 1884555 1678778 1619384 1746152 1844420 1545594 1448305
14576 1448305 1719113 1655501 1847572 2221464 1774463 1964639 1937976 2274601 2085547 2291595
14566 2291595 2105200 2012529 2201769 2348105 1805252 2614162 2579592 2361055 2487193 2716502
14556 2716502 2858573 2838979 3276720 3433414 3796281 4284138 5458643 7424896 11719523
$$ packed form
14627A125256k37468O29249m22270j43395L89104Q4235j17348n6576k11762M06583
14617A445608l38302K80088l92871K20887j49285J65422L3072p6731k03131K02821
14607A187578N1285R9825k439j80574N398J06517M9612l72977L79843j6609Q9349
14596A396808k93939M75616k57455P1695q2652J97666J77152R8885k50837j75716
14586A357223K35495l24311O28941j2793k05777n9394J26768R8268k98826r7289
14576A448305K70808o3612J92071L73892m47001J90176k6663L36625j89054K06048
14566B291595j86395r2671J89240J46336n42853Q08910l4570k18537J26138K29309
14556B716502J42071j9594M37741J56694L62867M87857J174505J966253M294627
$$ plain form
14547 11719523 19891107 33492087 37040337 16888823 7890342 6958797 4846450 2386226
14538 1882989 1619982 1794385 1394587 1627825 1838812 1444841 1654845 1702199 1681475 1711000
14528 1711000 1740736 1865903 1897830 2179665 2099775 1972272 2051412 2175635 2232887 2216740
14518 2216740 2252161 2323963 1911849 2558792 2059650 2539931 2078809 2088675 2668037 2550002
14508 2550002 2466643 2330171 2598597 2127808 2309981 2132484 2764080 2586102 2739982 2745156
14498 2745156 2704320 2919783 2938710 2703804 2912553 2839178 2833089 2960559 2774506 2665459
14488 2665459 2989063 3173507 2554257 3166488 3146901 3401451 3379163 3316786 3302725 3027885
14478 3027885 3454918 3352500 3240950 3636893 3526947 3347944 3249749 3505607 3430683 3670879
$$ packed form
14547A1719523Q171584J3600980L548250A6888823G890342r31545k112347B386226
14538A882989k63007J74403l99798K33238K10987l93971K10004M7354k0724K9525
14528A711000K9736J25167L1927K81835p9890j27503P9140J24223N7252j6147
14518B216740L5421P1802m12114O46943m99142M80281m61122R866N79362j18035
14508B550002q3359j36472K68426m70789J82173j77497O31596j77978J53880N174
14498B745156m0836K15463J8927k34906K08749p3375o089J27470j86053j09047
14488B665459L23604J84444o19250O12231j9587K54550k2288o2377j4061k74840
14478C027885M27033j02418j11550L95943j09946j79003r8195K55858p4924K40196
$$ plain form
14468 3670879 3721205 3873997 3832634 3753011 4031922 3783043 3909613 4273569 4110743 4239661
14458 4239661 4371713 4212939 4276066 4470327 4294263 4593128 4532363 4364468 4811472 4466421
14448 4466421 4604921 4723270 4857472 5201768 4838938 4990366 5159182 5326464 4906827
14439 4906827 5114379 5312669 5211269 5648136 5521059 5711743 5464158 5807948 5729552 5949077
14429 5949077 6271777 6293675 5832015 6240969 6288975 6097252 6565734 6653797 6765726 6900849
14419 6900849 6982813 7168886 7333998 7139629 7398653 7572151 7866874 7665714 7427929 8006310
14409 8006310 7863895 8027617 8576427 8459670 8445054 8878754 9124511 8577767 9462380 9085493
14399 9085493 9247481 9385394 9430480 9723652 9664404 9949409 9988309 10655153 10577746 10847248
$$ packed form
14468C670879N0326J52792m1363p9623K78911k48879J26570L63956j62826J28918
14458D239661J32052j58774O3127J94261j76064K98865o0765j67895M47004l45051
14448D466421J38500J18349J34202L44296l62830J51428J68816J67282m19637
14439D906827K07552J98290j01400M36867j27077J90684k47585L43790p8396K19525
14429E949077L22700K1898m61660M08954M8006j91723M68482Q8063J11929J35123
14419F900849Q1964J86073J65112j94369K59024J73498K94723k01160k37785N78381
14409H006310j42415J63722N48810j16757j4616M33700K45757n46744Q84613l76887
14399I085493J61988J37913M5086K93172n9248K85005L8900O66844p7407K69502
$$ plain form
14389 10847248 10858421 10851145 11575792 11162962 11702866 11589083 12111459 12097253 13030720 13049107
14379 13049107 13139117 13035425 13505109 13806612 13653624 14201501 14636133 14611646 15248157 15155418
14369 15155418 15835156 16437985 16399842 16851058 17048294 17534258 17768071 17923990 18310518
14360 18310518 19024850 19486414 19948359 19954043 20656821 21222803 21723685 22303404 22972201 23227136
14350 23227136 24126278 24731933 25023859 25724576 26082938 26920271 27758506 28539927 28896360
14341 28896360 29800528 30928746 31526483 32386208 33225795 34344856 35259544 36250156 37277770
14332 37277770 38556795 39721572 40909033 42395801 43962934 45139627 46387805 47989768
14324 47989768 49761656 51613870 52888415 55231493 57456675 59090695 61425515 63536614
$$ packed form
14389A0847248J1173p276P24647m12830N39904j13783N22376j4206R33467J8387
14379A3049107R0010j03692M69684L01503j52988N47877M34632k4487O36511r2739
14369A5155418O79738O02829l8143M51216J97236M85964K33813J55919L86528
14360A8310518P14332M61564M61945N684P02778N65982N00882N79719O68797K54935
14350B3227136Q99142O05655K91926P00717L58362Q37333Q38235P81421L56433
14341B8896360R04168J128218N97737Q59725Q39587J119061R14688R90612J027614
14332C7277770J279025J164777J187461J486768J567133J176693J248178J601963
14324D7989768J771888J852214J274545K343078K225182J634020K334820K111099
$$ plain form
14316 63536614 66278360 68646530 71475152 74345194 77490586 80906652 84385803 87885075
14308 87885075 91542600 95679770 100215490 104534358 109189046 114525232 119549844 125208184
14300 125208184 131077731 137208033 143727232 150906860 158421803 166282194 174544299 183271043
14292 183271043 192646851 202865248 212880144 223908927 235172916 246947857 258891070
14285 258891070 271425230 284185238 296837721 309960959 323243356 336589843 349465892
14278 349465892 361724046 373090026 383872036 393181123 400744336 406312187 408405327
14271 408405327 408100958 407659497 409669031 409488684 406160364 399911040 391295094 381342685
14263 381342685 370112285 358416163 345225401 331667257 317583935 303150701 288890089
$$ packed form
14316F3536614K741746K368170K828622K870042L145392L416066L479151L499272
14308H7885075L657525M137170M535720M318868M654688N336186N024612N658340
14300A25208184N869547O130302O519199P179628P514943P860391Q262105Q726744
14292A83271043R375808J0218397J0014896J1028783J1263989J1774941J1943213
14285B58891070J2534160J2760008J2652483J3123238J3282397J3346487J2876049
14278C49465892J2258154J1365980J0782010R309087P563213N567851K093140
14271D08405327l04369m41461K009534j80347l328320o249324q615946r952409
14263C81342685j1230400j1696122j3190762j3558144j4083322j4433234j4260612
$$ plain form
14256 288890089 275355049 261792171 248735924 236665292 225351932 215020989 204069652
14249 204069652 193495646 183830384 174917239 166468827 158353795 151195392 143748126 136874538
14241 136874538 130643210 124538354 118892563 113975422 108952907 104194785 99543102 95274751
14233 95274751 91296075 87864719 84576857 80977643 77978154 75005122 71890534 69071032
14225 69071032 66849024 64308396 61971757 60040480 58016785 56041035 53870175 52383684
14217 52383684 50418707 49006355 47073509 45781356 44645752 43159245 41696076 40683388
14209 40683388 39352815 38331054 37905951 36403943 35050875 34177733 33650500 32632219
14201 32632219 31796576 30962285 30211751 29006529 28404507 27994575 26792410 26392435 25898919
$$ packed form
14256B88890089j3535040j3562878j3056247j2070632j1313360j0330943j0951337
14249B04069652j0574006r665262q913145q448412q115032p158403p447266o873588
14241A36874538o231328o104856n645791m917141n022515m758122m651683m268351
14233I5274751l978676l431356l287862l599214k999489k973032l114588k819502
14225F9071032k222008k540628k336639j931277k023695j975750k170860j486491
14217E2383684j964977j412352j932846j292153j135604j486507j463169j012688
14209D0683388j330573j021761m25103j502008j353068q73142n27233j018281
14201C2632219q35643q34291p50534j205222o02022m09932j202165l99975m93516
$$ plain form
14192 25898919 25027172 24302797 23946494 23720823 22768077 22480937 21625612 21076926 21091653
14183 21091653 20310657 19924513 19661042 19147650 18764890 18206875 17469549 17489496 17638234
14174 17638234 16715190 16468635 16392214 16232770 15840225 15293524 15100220 14800959 14773175 14382089
14164 14382089 13994883 13968823 13084911 13192883 12950483 12889233 12471162 12288368 12105933 12020279
14154 12020279 11643919 11649616 11477198 11037714 10960611 10714564 10370774 10503437 9946795 10173808
14144 10173808 9778048 9257611 9246468 9554150 9317582 9357163 9292887 8807868 8479095 8569695
14134 8569695 8392804 8328440 8329461 8277906 7786661 7907034 8063982 7794346 7696021 7459358
14124 7459358 7487765 7191566 7374744 7186902 6986033 7068848 6584512 6783117 6498930 6430641
$$ packed form
14192B5898919q71747p24375l56303k25671r52746k87140q55325n48686J4727
14183B1091653p80996l86144k63471n13392l82760n58015p37326J9947J48738
14174A7638234r23044k46555p6421j59444l92545n46701j93304k99261k7784l91086
14164A4382089l87206k6060q83912J07972k42400o1250m18071j82794j82435q5654
14154A2020279l76360N697j72418m39484p7103k46047l43790J32663n56642K27013
14144A0173808l95760n20437j1143L07682k36568L9581o4276m85019l28773R0600
14134H569695j76891o4364J021n1555m91245J20373J56948k69636r8325k36663
14124G459358K8407k96199J83178j87842k00869Q2815m84336J98605k84187o8289
$$ plain form
14114 6430641 6769392 6608076 6568176 6056268 6210598 5764950 6166527 5792572 5675131 5648565
14104 5648565 5676454 5725201 5533127 5497305 5446298 5385019 5396538 5432962 5233120 5032296 5457173
14093 5457173 5203133 4929257 4714423 4919729 4806859 5036745 4867409 4489556 4535570 4229591
14083 4229591 4501982 4568279 4282482 4103951 4287849 4404654 3958352 4213663 3896918 4006720
14073 4006720 3855477 4184511 3989519 3706621 3884462 3969890 3825618 3744342 3728980 3595140
14063 3595140 3741059 3511123 3375403 3580815 3775173 3869859 3523637 3516613 3027731 3602245
14053 3602245 3646217 3414591 2946230 3629718 3188779 3229981 3106757 3214950 3107322 3292372
14043 3292372 2684663 3040008 2813300 3041929 2349761 2981241 2802200 3106447 2919877
$$ packed form
14114F430641L38751j61316l9900n11908J54330m45648M01577l73955j17441k6566
14104E648565K7889M8747j92074l5822n1007o1279J1519L6424j99842k00824M24877
14093E457173k54040k73876k14834K05306j12870K29886j69336l77853M6014l05979
14083D229591K72391O6297k85797j78531J83898J16805m46302K55311l16745J09802
14073D006720j51243L29034j94992k82898J77841Q5428j44272q1276j5362j33840
14063C595140J45919k29936j35720K05412J94358R4686l46222p024m88882N74514
14053C602245M3972k31626m68361O83488m40939M1202j23224J08193j07628J85050
14043C292372o07709L55345k26708K28629o92168O31480j79041L04247j86570
$$ plain form
14034 2919877 3178744 2964073 3212513 2932061 2725462 2520918 2534053 2480406 2320123 2393172
14024 2393172 2419447 2779247 2547420 2522167 2421793 2879841 2470674 2574378 2279135 2219426
14014 2219426 1984704 2335250 2315006 2260875 2308129 2025784 1960859 2105802 2014135 2249742
14004 2249742 2331079 2009004 2313434 2215218 2161075 2193199 1847204 2062101 1864457 2059389
13994 2059389 2090768 2208328 2087445 2363924 2793936 3834634 6298617 12333028 25196299
13985 25196299 38913406 26012457 12394528 7566647 5295334 4064344 3698450 3281193
13977 3281193 2976753 2763352 2822127 2423814 2382072 2434882 2286349 2027411 2150354 2369657
13967 2369657 2027572 1946147 2432620 1762162 2131266 2170110 1788212 2089834 1729290 1912417
$$ packed form
14034B919877K58867k14671K48440k80452k06599k04544J3135n3647j60283P3049
14024B393172K6275L59800k31827k5253j00374M58048m09167J03704k95243n9709
14014B219426k34722L50546k0244n4131M7254k82345o4925J44943r1667K35607
14004B249742Q1337l22075L04430r8216n4143L2124l45995K14897j97644J94932
13994B059389L1379J17560j20883K76479M30012J040698K463983O034411J2863271
13985B5196299J3717107j2900949A2394528m827881k271313j230990l65894m17257
13977C281193l04440k13401N8775l98313m1742N2810j48533k58938J22943K19303
13967B369657l42085q1425M86473o70458L69104L8844l81898L01622l60544J83127
$$ plain form
13957 1912417 2291381 1611686 1941919 2222396 1726726 1960770 1701484 1618817 1688934 1490381
13947 1490381 1835072 1456888 1820914 1771765 1560497 1819185 1737562 1596802 1588917 1512913
13937 1512913 1803675 1423641 1288690 1637833 1373012 1535296 1397913 1401585 1243008 1432948
13927 1432948 1563488 1575675 1681594 1510458 1351838 1487512 1113946 928685 1105200 1185640
13917 1185640 1498516 1511061 1511750 1328464 1386839 1585533 1504613 1380763 1398096 1381561 1255465
13906 1255465 1361510 1293997 1132336 1124864 1186362 1079488 1132412 1101791 1109732 1414246 1197728
13895 1197728 1121681 1086762 976674 991017 1282088 1296266 1166143 1100195 968281 1047328
13885 1047328 1128326 1089219 721943 1121236 1267756 884924 1101914 1116267 1258598 570251
$$ packed form
13957A912417L78964o79695L30233K80477m95670K34044k59286q2667P0117j98553
13947A490381L44691l78184L64026m9149k11268K58688q1623j40760p885p6004
13937A512913K90762l80034j34951L49143k64821J62284j37383L672j58577J89940
13927A432948J30540J2187J05919j71136j58620J35674l73566j85261J76515Q0440
13917A185640L12876J2545O89j83286N8375J98694q0920j23850J7333j6535j26096
13906A255465J06045o7513j61661p472O1498j06874N2924l0621P941L04514k16518
13895A197728p6047l4919j10088J4343K91071J4178j30123o5948j31914P9047
13885A047328Q0998l9107l67276L99293J46520l82832K16990J4353J42331E70251
$$ plain form
13874 837000 1045838 1044014 785310 828757 1114938 1131400 782055 1211045 1011225 867071
13864 867071 1206653 1074505 1016363 1203722 1166075 948477 915493 969535 1061076 1104918 811161
13853 811161 1014959 1004666 825345 836944 915633 965862 678608 919819 992566 939647 925750
13842 925750 701344 948945 1084102 839751 998273 865147 892128 1036255 738092 684676
13832 684676 1063007 701766 1090060 1077669 795778 819095 874180 772425 945276 683388
13822 683388 919292 803420 963678 624417 670799 948646 894558 928642 539501 882294
13812 882294 481568 823164 1183722 828488 823625 701902 647583 690582 897330 729770
13802 729770 666884 582147 872960 566665 769736 717307 859855 471524 655780 365365
$$ packed form
13874H37000K08838j824k58704M3447K86181J6462l49345M28990j99820j44154
13864H67071L39582j32148n8142J87359l7647k17598l2984N4042R1541M3842k93757
13853H11161K03798j0293j79321J1599P8689N0229k87254K41211P2747n2919j3897
13842I25750k24406K47601J35157k44351J58522j33126K6981J44127k98163n3416
13832F84676L78331l61241L88294j2391k81891K3317N5085j01755J72851k61888
13822F83388K35904j15872J60258l39261M6382K77847n4088L4084l89141L42793
13812H82294m00726L41596L60558l55234m863j21723n4319M2999K06748j67560
13802G29770o2886q4737K90813l06295K03071n2429J42548l88331J84256k90415
$$ plain form
13792 365365 442121 681425 978389 435328 553253 676739 759479 816124 954366 591461
13782 591461 727563 739372 578963 943546 936742 458127 549454 533751 611322 764784 673348
13771 673348 410481 664024 697298 279360 401370 523965 369344 533298 1012998 737689
13761 737689 877368 724184 309415 712906 623686 380926 798628 485077 412481 380001
13751 380001 406663 536784 592016 454403 717408 497568 891767 778912 526158 587193
13741 587193 586165 751099 702194 818961 919140 420293 350898 190245 879410 732789
13731 732789 379758 299788 323687 677656 247868 579517 552608 553220 415818 414220 672653
13720 672653 756733 288011 264703 485287 326978 387671 356088 434958 571576 676346
$$ packed form
13792C65365P6756K39304K96964D35328J17925J23486Q2740N6645J38242l62905
13782E91461J36102J1809j60409L64583o804D58127R1327j5703P7571J53462r1436
13771F73348k62867K53543L3274B79360J22010J22595j54621J63954M79700k75309
13761G37689J39679j53184C09415M03491q9220k42760M17702l13551p2596l2480
13751C80001K6662J30121N5232j37613K63005k19840L94199j12855k52754O1035
13741E87193j028J64934m8905J16767J00179D20293o9395j60653O89165j46621
13731G32789l53031p9970K3899L53969B47868L31649k6909O12j37402j598K58433
13720F72653Q4080B88011k3308K20584j58309O0693l1583P8870J36618J04770
$$ plain form
13710 676346 131038 430864 562734 367703 590215 470132 556185 624002 732863 724976
13700 724976 508196 728876 521351 397374 343045 722722 384026 565946 631425 615941
13690 615941 673092 498044 376097 244857 339330 651451 530390 314026 585722 395339
13680 395339 242374 423363 453276 440363 638683 351918 371662 317261 368862 475511
13670 475511 429097 553237 452167 256797 378806 143188 372480 729803 470646 403515
13660 403515 628415 330206 245232 384384 272257 627963 359107 431522 418513 514437
13650 514437 388785 499539 343876 242279 338161 11895 242620 60089 474612 319740
13640 319740 70014 794641 620815 397420 380354 234773 377384 328274 338453 455634
$$ packed form
13710F76346A31038K99826J31870j95031K22512j20083Q6053O7817J08861p887
13700G24976k16780K20680k07525j23977n4329L79677l38696J81920O5479j5484
13690F15941N7151j75048j21947j31240R4473L12121j21061k16364K71696j90383
13680C95339j52965J80989K9913j2913J98320k86765J9744n4401N1601J06649
13670D75511m6414J24140j01070j95370J22009A43188K29292L57323k59157o7131
13660D03515K24900k98209q4974J39152j12127L55706k68856P2415j3009R5924
13650E14437j25652J10754j55663j01597R5882A1895K30725F0089M14523j54872
13640C19740G0014P24627j73826k23395j7066j45581J42611m9110J0179J17181
$$ plain form
13630 455634 359765 340918 743279 459586 373247 461253 363075 196768 262799 434215 445364
13619 445364 389272 509972 346933 85686 363280 573022 616454 108771 300752 137546
13608 7873 370941 599090 413530 286533 247342 330691 530616 276095 740959 313484
13597 210314 158486 549286 247399 380501 337854 490338 415916 43937 213603 442021
13587 442021 147702 505048 393724 289078 433324 330809 76919 90945 326517 490747
13577 490747 42977 346626 325012 295290 427054 323537 -185916 228948 154514 425609
13567 425609 190654 534125 560125 91227 407320 410488 559797 217182 116978 119185 414243
13556 414243 41645 351008 442673 259110 388 87716 300444 394844 -113210 323699 206912
$$ packed form
13630D55634r5869j8847M02361k83693q6339Q8006r8178j66307O6031J71416J1149
13619D45364n6092J20700j63039H5686K77594K09742M3432A08771J91981A37546
13608G873L63068K28149j85560j26997l9191Q3349J99925k54521M64864C13484
13597B10314n1828L90800B47399J33102m2647J52484p4422D3937J69666K28418
13587D42021A47702L57346j11324j04646J44246j02515G6919J4026K35572J64230
13577D90747D2977L03649k1614k9722J31764j03517a85916B28948p4434K71095
13567D25609A90654L43471K6000I1227L16093L168J49309B17182j00204K207K95058
13556D14243D1645L09363R1665j83563C88Q7328K12728R4400a13210C23699j16787
$$ plain form
13545 206912 574212 334523 573008 629028 157690 513431 410192 85113 277401 373360
13535 373360 320531 226107 -18942 163600 408957 238663 255942 254353 499455 297568 254092
13524 254092 196338 540450 251674 424140 207942 217247 212393 361755 335655 202308 568113
13513 568113 318693 334432 38896 230501 164063 27397 111257 242010 -100862 388186
13502 293830 349452 56733 -49070 237530 96320 386049 484595 357956 -63860 401705 98404
13490 501132 375165 241954 107553 276852 104690 117903 442260 -187575 273287 423547
13480 423547 17674 -134946 236875 15541 -36160 271590 362951 75387 76991 400113 126843
13468 -16305 120172 -145114 427045 -18933 360698 392230 323828 46967 96616 172490 318600
$$ packed form
13545B06912L67300k39689K38485N6020A57690L55741j03239H5113J92288R5959
13535C73360n2829r4424a8942A63600K45357j70294J7279j589K45102k01887m3476
13524B54092n7754L44112B51674J72466B07942R305m854J49362k6100j33347L65805
13513E68113k49420J5739C8896J91605o6438B7397Q3860J30753a00862C88186
13502B93830N5622E6733d9070B37530I6320K89729R8546j26639f3860D01705I8404
13490E01132j25967j33211A07553J69299A04690J3213L24357a87575B73287J50260
13480D23547A7674a34946B36875A5541c6160B71590R1361G5387J604L23122A26843
13468a6305A20172a45114D27045a8933C60698L1532o8402D6967M9649P5874J46110
$$ plain form
13457 318600 313222 162130 315155 194971 304498 344938 64304 200943 333183 530286
13447 530286 111806 89100 175264 174830 166955 63780 -21306 160336 60729 401148 10960
13435 133749 -37795 438273 315268 424415 56776 161134 402455 -7301 49663 332126
13425 332126 168579 325790 15037 254398 112903 -219032 464719 162236 60450 162264
13415 162264 287496 -55050 36288 233216 344389 54384 488007 184489 3419 103341 173876
13404 173876 176970 149948 175447 -155 342299 85447 223431 38771 -122117 216413 309885
13393 309885 395706 418311 117823 168946 -150511 295817 193645 7023 96844 -32188 168986
13381 50678 353649 98921 131575 408740 425049 132585 218882 -41770 30106 427506 271768
$$ packed form
13457C18600n378j51092J53025j20184J09527M0440F4304J36639J32240J97103
13447E30286A11806k2706Q6164m34p875F3780b1306A60336F0729L40419A0960
13435A33749c7795D38273j23005J09147E6776J04358K41321g301D9663K82463
13425C32126j63547J57211A5037K39361A12903b19032D64719A62236F0450J01814
13415A62264J25232e5050C6288J96928J11173E4384M33623A84489C419R9922P0535
13404A73876L094k7022K5499a55C42299H5447J37984C8771a22117B16413R3472
13393C09885Q5821K2605A17823N1123a50511B95817j02172G023Q9821c2188A68986
13381E0678L02971I8921L2654K77165J6309A32585Q6297d1770C0106L97400j55738
$$ plain form
13370 271768 376460 324404 354893 361307 367496 -5711 200930 384089 202137 472671 298871
13359 298871 423150 353661 129924 456955 108708 296894 461601 -64675 74809 -143216
13348 244309 330372 228896 259844 187189 188386 96285 150181 -23775 160070 357244 455487
13337 455487 298945 493460 511469 -157121 442196 128145 531472 359092 161435 -137
13326 166046 328056 100526 205391 167654 3777 172853 134165 63939 117116 -37761 296820
13314 17911 178944 375668 298145 92416 104111 133524 508913 373714 255312 384030
13304 384030 174279 -146594 89631 136011 86368 163889 259499 84602 109157 94624 -17052
13292 44368 303870 221884 140563 -62195 278839 83717 330294 191586 266487 430056 11740
$$ packed form
13370B71768J04692n2056L0489O414O189e711B00930J83159j81952K70534j73800
13359B98871J24279o9489A29924L27031A08708J88186J64707f4675G4809a43216
13348B44309Q6063j01476L0948p2655J197r2101N3896b3775A60070J97174R8243
13337D55487j56542J94515J8009a57121D42196A28145M03327j72380A61435a37
13326A66046J62010A00526J04865l7737C777J69076l8688F3939N3177c7761B96820
13314A7911J61033J96724p7523I2416J1695K9413L75389j35199j18402J28718
13304C84030A74279a46594H9631M6380m9643P7521R5610H4602K4555j4533a7052
13292D4368K59502q1986q1321f2195B78839H3717K46577j38708P4901J63569A1740
$$ plain form
13280 266091 113624 53070 -207850 -88624 48773 -42482 238019 243477 162431 -208594 92493
13268 46334 181169 146837 138341 14124 218749 291594 30819 -59528 238552 57809 361767
13257 361767 131743 268716 264722 23833 -83963 -3980 92968 250032 92786 103786 270211
13246 270211 98465 180325 16237 -34539 238934 170837 309739 172820 85117 122024 -58288
13234 58309 -119561 -136587 25986 164345 -56620 -24423 -80304 45592 114125 312333 -48502
13222 113117 228020 30189 83236 81211 99066 233300 -57972 171579 -88705 355077 213394
13211 213394 250473 -176289 -148463 -197064 40835 158112 215488 -3413 46479 5532 -263344
13199 -275990 174573 69993 127051 30787 -88359 161846 345955 309276 -35232 31742 -57174
$$ packed form
13280B66091A13624E3070b07850h8624D8773d2482B38019N458q1046b08594I2493
13268D6334J34835l4332q496A4124K04625P2845C0819e9528B38552E7809L03958
13257C61767A31743J36973l994B3833h3963c980I2968J57064I2786J1000J66425
13246B70211I8465Q1860A6237c4539B38934o8097J38902j36919H5117L6907e8288
13234E8309a19561j7026B5986J38359e6620b4423n5881D5592O8533J98208d8502
13222A13117J14903C0189N3047k025J7855J34234e7972A71579h8705C55077j41683
13211B13394L7079a76289K7826m8601D0835J17277N7376c413D6479E532b63344
13199b75990A74573F9993N7058C0787h8359A61846J84109l6679c5232C1742e7174
$$ plain form
13187 -894 180416 106317 248121 181 93643 231248 -34640 168310 94991 58371 310889
13176 310889 -182274 92805 -226951 -57451 -5171 -21895 -15720 169775 -48565 167555 -193777
13164 -28321 265980 -125300 124601 184985 54041 105058 -105018 315473 -88291 103388
13153 -168380 133443 161989 167969 -117344 245036 173654 135614 263362 192317 -191192 -71986
13141 -25493 591504 120683 -90602 224507 -186818 -189695 84770 332337 263006 -68875 194632
13129 146736 47266 95284 265444 -207893 151903 185706 294607 14902 -45401 -182449
13119 -182449 -16778 -96576 -40508 125401 33117 71345 123511 162632 46953 202489 356644
13108 356644 70230 -19503 -26237 121566 -76963 419093 212797 -23082 11227 240164 10291
$$ packed form
13187h94A80416p4099J41804A81R3462J37605c4640A68310p3319l6620K52518
13176C10889a82274I2805b26951e7451e171j6724O175A69775d8565A67555a93777
13164b8321B65980a25300A24601O0384E4041N1017a05018C15473h8291A03388
13153a68380A33443K8546N980a17344B45036p1382l8040J27748p1045a91192g1986
13141b5493E91504A20683i0602B24507a86818k877H4770K47567o9331f8875A94632
13129A46736D7266M8018J70160b07893A51903L3803J08901A4902d5401j37048
13119a82449a6778p9798d0508A25401C3117L8228N2166L9121D6953J55536J54155
13108C56644G0230a9503o734A21566g6963D19093k06296b3082A1227K28937A0291
$$ plain form
13096 -332311 154243 138418 25274 -83036 -29314 173056 -61553 -83336 211993 349917 -70944
13084 -12387 375311 247199 -46001 40113 -110810 148683 96292 36131 103229 324210 94795
13072 196711 127371 149841 41683 330078 -91179 -168605 87432 -54967 -19702 178599 33453
13060 -122654 326495 -22364 138815 -330766 71658 1134 -2805 -167627 211716 -64287 -128623
13049 -128623 323159 41422 -134661 -12359 94130 304508 -30265 451922 -71068 204097
13038 -310850 -133827 -193856 -18289 152952 189944 319450 -82520 -198382 -70774 -123300 361552
13026 -33424 10999 16123 235799 -121779 120803 39703 -235517 129699 130257 296320 240940
13015 240940 165712 178619 -300974 30715 129084 -202792 178759 129610 42072 -16363 -92121
$$ packed form
13096c32311A54243j5825B5274h3036b9314A73056f1553k1783B11993J37924g0944
13084a2387C75311j28112d6001D0113a10810A48683n2391C6131O7098K20981I4795
13072A96711o9340K2470D1683K88395i1179p7426H7432e4967a9702A78599C3453
13060a22654C26495b2364A38815c30766G1658A134b805j64822B11716f4287o4336
13049a28623C23159D1422a34661a2359I4130K10378c0265D51922g1068B04097
13038c10850a33827o0029a8289A52952L6992J29506h2520j15862g0774n2526C61552
13026c3424A0999N124K19676a21779A20803C9703b35517A29699N58J66063n5380
13015B40940p5228J2907c00974C0715R8369b02792A78759m9149D2072a6363p5758
$$ plain form
13004 -92121 168188 -293420 7213 214516 -303094 172287 325726 225631 -77457 13887
12993 70228 -125773 185405 107685 139635 -8908 -87742 129588 25918 -143288 -100553 332339
12981 -141611 -119765 97764 153507 -10518 -92145 105954 -121982 -269553 165738 350913
12971 350913 182165 -10832 189259 163203 -22985 -24987 107974 117790 -27290 -178656 251749
12959 -294658 -192544 -54560 -22648 111494 -126835 -48329 29996 131324 103501 158698 -290955
12947 -50843 115988 -283332 183280 122158 -33647 -232090 5123 182825 -269040 263121
12936 55493 161061 -25561 221525 -45177 389785 223237 365070 70971 127479 107704 -333401
12924 132430 24642 46471 -86076 -116463 -243813 -92337 -150723 154257 316490 5046 9196
$$ packed form
13004i2121A68188b93420G213K07303c03094A72287J53439j00095g7457A3887
12993G0228a25773A85405p7720L1950h908p8834A29588B5918a43288M2735C32339
12981a41611K1846I7764N5743a0518q1627A05954a21982j47571A65738J85175
12971C50913j68748a0832A89259k6056b2985k002A07974R816b7290j51366B51749
12959b94658J02114e4560b2648A11494a26835d8329B9996J01328k7823N5197b90955
12947e0843A15988b83332A83280o1122c3647j98443E123J77702b69040B63121
12936E5493J05568b5561B21525d5177C89785j66548J41833G0971N6508j9775c33401
12924A32430B4642K1829h6076l0387j27350i2337n8386A54257J62233E046M150
$$ plain form
12913 9196 -195400 269185 395165 -39006 42591 160809 319117 -86739 108117 -274264
12902 -78640 -78702 -115576 117489 -150075 -196686 113129 178873 154903 49729 27282 -94031 -38173
12889 -162444 14866 73282 -280483 80071 98918 80261 -135897 -220333 -82109 137318 -51256
12877 -109374 130496 -87180 -148986 98203 149684 -61009 316614 128850 106782 209213 -76560
12865 124990 -73948 -144121 -26361 -314292 -101714 -69508 -236265 9654 4766 -36511 -10886
12853 98905 274374 26925 333171 71001 237036 127037 -55162 42965 141646 101882 -319401
12841 28945 -99031 121209 -243018 3815 142675 -27410 -181661 -93854 -207552 172371 -113086
12829 -4485 -107041 -354182 -117832 77261 22934 -61075 185751 46148 39398 287703 83508
$$ packed form
12913I196a95400B69185J25980c9006D2591J18218J58308h6739A08117b74264
12902g8640o2l6874A17489a50075m6611A13129O5744k3970D9729k2447i4031c8173
12889a62444A4866N8416b80483H0071J8847j8657a35897q4436h2109A37318e1256
12877a09374A30496h7180o1806I8203N1481f1009C16614A28850k2068J02431g6560
12865A24990g3948p0173b6361k87931a01714L2206j66757I654D766c6511a0886
12853I8905J75469B6925L06246G1001J66035j09999e5162D2965R8681l9764c19401
12841B8945i9031A21209b43018C815J38860b7410j54251Q7807j13698A72371a13086
12829d485j02556k47141a17832G7261B2934f1075A85751D6148o750K48305H3508
$$ plain form
12817 -182959 99153 142866 -31789 191995 -167026 246042 -104266 -25825 114368 214942
12807 214942 -102834 212548 62026 -179365 239243 -350585 -137040 -3340 -61609 -72667
12797 -72667 79203 -434019 49705 -225338 16503 -76119 164561 146723 -121984 121112 -33079
12785 -313755 -10273 172574 68148 405811 -231266 12300 -172629 259421 -182963 -54865
12774 307819 254873 111567 -292060 124476 15740 113971 249580 -152841 -25762 104083
12763 121969 -36182 -62850 -187029 -57237 88414 138731 159664 -130329 127695 -228392 83066
12751 107489 354505 37066 17615 -100834 73617 13240 41772 77782 -302592 -164560 -135132
12740 -135132 22462 -72755 285157 -64715 -99380 23993 101821 -97075 203814 -194691 50121
$$ packed form
12817a82959I9153M3713c1789A91995a67026B46042a04266b5825A14368J00574
12807B14942a02834B12548F2026a79365B39243c50585a37040c340n8269j1058
12797g2667G9203d34019D9705b25338A6503g6119A64561j7838a21984A21112c3079
12785c13755a0273A72574F8148L37663b31266A2300a72629B59421a82963e4865
12774C07819n2946A11567b92060A24476A5740R8231J35609a52841b5762A04083
12763A21969c6182k6668j24179e7237H8414N0317K0933a30329A27695b28392H3066
12751A07489K47016C7066A7615a00834G3617A3240K8532L6010c02592J38032K9428
12740a35132B2462g2755B85157f4715l4665B3993P7828i7075B03814a94691E0121
$$ plain form
12728 151349 104693 -99018 -277887 175595 45759 179993 -71292 -73265 -153195 -23912 -192567
12717 -192567 337948 12526 190152 -27840 111660 8780 150449 54408 -30302 68267 -22725
12705 -52823 -166069 98924 135058 124310 -53127 225610 93648 452552 -198645 21987 397715
12694 397715 216746 -37997 -10678 320023 -26830 -308442 -278030 428322 168920 165123 65073
12682 -218827 122396 166176 -154510 149141 -160812 170500 -332201 87961 -189596 -154286
12672 -154286 -56070 -156674 3631 -104098 43737 382044 -287291 323356 487542 271082
12662 271082 -172364 112896 290897 453592 265101 99745 40863 -47584 -361988 134201
12651 62760 100232 56577 -109852 -253598 -133454 25596 340550 230303 -42563 36502 58628
$$ packed form
12728A51349m6656i9018j78869A75595D5759J34234g1292j973p9930b3912j68655
12717a92567C37948A2526J77626b7840A11660H780J41669E4408c0302F8267b2725
12705e2823j13246I8924L6134j0748e3127B25610I3648L58904a98645B1987L75728
12694C97715j80969c7997a0678C20023b6830k81612L0412D28322A68920l797F5073
12682b18827A22396M3780a54510A49141a60812A70500c32201H7961a89596L5310
12672a54286e6070j00604C631a04098D3737L38307b87291C23356J64186k16460
12662B71082a72364A12896J78001J62695j88491I9745D0863d7584l14404A34201
12651F2760L7472m3655a09852j43746J20144B5596L14954j10247d2563C6502K2126
$$ plain form
12640 58628 169102 41071 -19850 120307 -148704 -5792 207533 67143 146690 30672 287048
12629 287048 -127222 110889 -44012 71961 -22096 210145 -61047 -84348 325182 24982 -4926
12617 55717 51074 285543 -237272 -248726 -60451 49830 48360 -123315 -158619 123150 -21922
12605 219714 229722 86472 -154913 40196 107051 -9021 201106 -71895 168948 -46389 -68767
12594 -68767 168769 -87663 206574 -120039 25104 -311149 39883 145102 45965 17145 184706
12583 184706 -46383 -441261 277421 41316 27411 -89978 370467 -99182 116191 289441
12573 289441 90801 294257 9068 492142 185009 16341 11528 170881 -20423 -35551 -224812
12562 -224812 198745 -15819 -11161 74322 11702 -25371 75835 59192 -55794 -108915 53679
$$ packed form
12640E8628J10474D1071a9850A20307a48704e792B07533F7143P9547C0672K56376
12629B87048a27222A10889d4012G1961b2096B10145f1047k3301C25182B4982d926
12617E5717m643K34469b37272j1454f0451D9830j470a23315l5304A23150b1922
12605B19714J0008H6472a54913D0196O6855i021B01106g1895A68948d6389k2378
12594f8767A68769h7663B06574a20039B5104c11149C9883J05219D5965A7145J67561
12583A84706d6383l94878B77421D1316j3905h9978C70467i9182A16191J73250
12573B89441I0801K03456I068M83074A85009A6341m813J59353b0423j5128j89261
12562b24812A98745a5819M658G4322A1702b5371G5835j6643e5794n3121E3679
$$ plain form
12550 -55736 20718 145740 -21088 -9183 -106846 -99741 -224611 183054 -41871 70520 -163226
12538 180464 4142 224062 -48111 -81675 305951 328952 82617 -176637 130735 209302 -12976
12526 -247606 27702 223457 -67133 -79012 258187 37887 -24269 202039 201782 -49609 -430270
12515 -430270 109264 90171 363277 535472 119082 283099 332890 310217 374256 283921
12505 283921 -129466 96136 17375 55953 43230 80956 48132 -146287 -462451 290595 267167
12494 267167 -78007 28662 21020 -112922 -276784 -135406 -36783 -229057 -120347 236195
12483 317363 92686 200199 376952 205497 151328 355211 119044 208963 66536 -65890
12472 45423 -205034 -21111 -44469 176406 -552932 76896 92332 347126 -315836 -391046 -40218
$$ packed form
12550e5736B0718J25022b1088i183r7663P105j24870A83054d1871G0520a63226
12538A80464D142K19920d8111l3564C05951K3001H2617a76637A30735P8567a2976
12526b47606B7702J95755f7133j1879B58187C7887b4269B02039k57d9609l80661
12515d30270A09264j9093K73106J72195A19082J64017M9791k2673O4039r0335
12505B83921a29466I6136A7375L8578j2723L7726l2824a46287l16164B90595k3428
12494B67167g8007B8662p642a12922j63862a35406c6783j92274J08710B36195
12483C17363I2686J07513J76753j71455n4169K03883A19044Q9919F6536f5890
12472D5423b05034b1111k3358A76406e52932G6896J5436K54794c15836p5210d0218
$$ plain form
12460 -20086 -119982 379264 -69945 -23730 71542 265120 66440 -93399 -301072 -87001 -404748
12449 -404748 -113882 274520 121393 -149139 -23263 -223550 52760 62745 -175634 100943
12438 183605 194335 -61856 -243241 -60208 -355704 -23054 -376540 49951 -38005 210543 278278
12427 278278 -75201 -164101 -20711 -79038 -116337 68263 -43083 -313658 -332961 8221 -54589
12415 34868 200907 -79104 71283 -46122 -97503 -13592 85825 163678 14576 -300397 29328
12403 203529 188626 323647 33714 -56876 -166770 -34649 411797 -257960 -8775 141326 35189
12391 196579 -22495 236736 245862 -80661 -33292 100465 -90935 142728 -119404 25137 -176552
12379 -6199 -21789 -266191 150644 -261948 135455 30548 195864 136492 141452 -243676 -69603
$$ packed form
12460b0086r9896C79264f9945b3730G1542J93578F6440i3399k07673h7001l17747
12449d04748a13882B74520A21393a49139b3263k00287E2760R985a75634A00943
12438A83605J0730f1856j81385f0208k95496b3054l53486D9951c8005B10543O7735
12427B78278g5201q8900b0711n8327l7299F8263d3083k70575j9303H221e4589
12415C4868J66039g9104G1283d6122n1381a3592H5825P7853A4576c00397B9328
12403B03529j4903J35021C3714e6876j09894c4649D11797b57960h775A41326C5189
12391A96579b2495B36736R126h0661c3292A00465i0935A42728a19404B5137a76552
12379f199j5590k44402A50644b61948A35455C0548J65316n9372M960b43676f9603
$$ plain form
12367 -112161 64991 -20222 23197 -80229 -106981 -16152 -70276 -26553 240584 253217 -114857
12355 194699 163532 127176 -358449 -4238 178099 148283 49007 271198 -319349 -1005 63409
12343 210994 119079 -32633 18057 -150380 -99409 78520 -20053 -332706 159570 149898 187248
12332 187248 332144 222589 -9379 -234713 63409 89729 140578 132618 71318 89366 63121
12321 63121 83967 -65730 150537 -43275 308979 -212120 -68586 73577 134523 -21308 426244
12309 -325596 66278 288594 -76588 -12298 62577 221710 -184867 265363 81593 -166365
12298 272862 -97252 -38000 -148528 -6171 -31106 70251 -35001 -174754 -51011 15316 -148424
12286 186436 228020 15677 247289 71947 132106 280839 291200 -27430 515 232386 -138434
$$ packed form
12367a12161F4991b0222B3197h0229k6752a6152n4124b6553B40584J2633a14857
12355A94699l1167l6356c58449d238A78099k9816D9007K22191c19349a005F3409
12343B10994r1915c2633A8057a50380N0971G8520b0053l12653A59570r672L7350
12332A87248J44896j09555i379k25334F3409K6320N0849p960o1300J8048k6245
12321F3121K0846f5730A50537d3275C08979b12120f8586G3577O0946b1308D26244
12309c25596F6278K22316g6588a2298F2577J59133a84867B65363H1593a66365
12298B72862i7252c8000j10528f171k4935G0251c5001j39753e1011A5316a48424
12286A86436M1584A5677K31612G1947O0159J48733J0361b7430E15K31871a38434
$$ plain form
12274 189122 36727 577679 -72359 -2964 94708 -105201 9660 -69254 -15171 8082 144561
12263 144561 -17251 -101809 -134660 -48801 192617 -59628 63874 -95395 -74915 20473 -62029
12251 212512 209805 205980 134258 193797 -292685 -53021 150528 107200 359305 362708 375438
12240 375438 -174913 -175398 -156650 -59150 156462 78784 -151262 138035 100366 -192802 263129
12228 57440 -150443 65046 169498 -208743 120790 282205 453448 39339 386379 543663
12218 543663 447002 78843 332612 97396 315521 493795 -49183 -117761 137373 198470 201602
12207 201602 224203 78538 31620 293264 190518 112821 169646 -166049 -182459 68762 -34868
12195 283324 137611 121254 210861 510634 270551 15565 292573 195748 281199 -86610 132376
$$ packed form
12274A89122C6727N40952g2359b964I4708a05201I660f9254a5171H082J36479
12263A44561a7251q4558l2851d8801A92617e9628F3874i5395K0480B0473f2029
12251B12512k707l825p1722N9539b92685e3021A50528m3328K52105L403J2730
12240C75438a74913m85J8748e9150A56462p7678a51262A38035l7669a92802B63129
12228E7440a50443F5046J04452b08743A20790J61415J71243C9339L47040J57284
12218E43663r6661G8843K53769I7396K18125J78274d9183o8578A37373O1097L132
12207B01602K2601G8538C1620K61644j02746p7697N6825a66049j6410F8762c4868
12195B83324A37611j6357Q9607K99773k40083A5565K77008r6825Q5451h6610A32376
$$ plain form
12183 459775 276360 471522 441802 220180 209458 252839 209723 37465 90477 1942 75024
12172 75024 349843 -167886 79589 100844 386976 -56582 177301 -34986 70724 256932 -266570
12160 8730 121944 339682 177442 -135785 -65307 -153861 231011 -84701 192640 -80053 -287340
12149 -287340 -57170 123584 154548 -178983 368021 65721 561209 128244 8816 -148956
12138 215343 240184 83779 55462 28074 -125444 4190 245310 287408 226132 254673 -116570
12126 44781 123381 -71827 173134 -15202 -19904 198388 172051 151468 -16168 50174 -63563
12114 144107 162742 1294 161168 -74931 137898 -100717 -191191 -40433 -3243 133603 91243
12103 91243 211294 93921 -547 235078 -371 323207 271449 101991 -26314 -138816 -1215 -53942
$$ packed form
12183D59775j83415J95162k9720B20180j0722M3381m3116C7465N3012A942P3082
12172G5024K74819a67886G9589K1255K86132e6582A77301c4986G0724J86208b66570
12160H730J13214K17738j62240a35785f5307q8554B31011h4701A92640h0053k07287
12149b87340e7170A23584L0964a78983C68021F5721M95488A28244H816a48956
12138B15343K4841H3779k8317k7388a25444D190K41120M2098o1276K8541a16570
12126D4781P8600g1827A73134a5202m702A98388k6337k0583a6168E0174f3563
12114A44107J8635A294J59874g4931A37898a00717r0474d0433c243A33603m2360
12103I1243J20051I3921e47B35078c71C23207n1758A01991b6314j12502a215n2727
$$ plain form
12091 -53942 -262572 -19568 275446 41254 -97378 112289 218171 149723 -206156 -155983 -114225
12080 -114225 -186780 90893 277238 150003 -24535 -86056 -16636 -158617 -77521 177083 -277708
12068 48402 244740 -49364 -222763 -196013 216922 150236 93178 -113710 130445 -284161
12057 -267492 276378 -65336 145823 272654 81439 -127092 20134 141235 51116 -136555
12046 172846 174351 139629 129705 176431 -310825 -249346 -78545 -85489 -196383 190718 70601
12034 -130631 -148515 5409 182250 386196 -295592 -63218 277519 -49516 132895 249285
12024 249285 102536 -234888 68910 127884 -46382 169973 -290402 214281 152622 -50287
12013 -118693 -45809 3645 30898 178040 -67921 3396 -129831 105841 -104051 -50844 282593
$$ packed form
12091e3942k08630a9568B75446D1254i7378A12289J05882o8448b06156N0173M1758
12080a14225p2555I0893J86345j27235b4535o1521a6636j41981g7521A77083b77708
12068D8402J96338d9364j73399K6750B16922o6686n7058a13710A30445b84161
12057b67492B76378f5336A45823J26831H1439a27092B0134J21101E1116a36555
12046A72846J505l4722r924M6726c10825O1479g8545o944j10894A90718G0601
12034a30631j7884E409J76841K03946b95592f3218B77519d9516A32895J16390
12024B49285A02536b34888F8910N8974d6382A69973b90402B14281o1659e0287
12013a18693d5809C645K7253J47142f7921C396a29831A05841a04051e0844B82593
$$ plain form
12001 177543 97831 -78020 -158300 -62139 -154741 189303 -225097 40702 116139 -124941 63383
11989 53759 -71475 314619 -26807 89822 -96370 28328 -81198 185048 -506513 -151930 -89886
11978 -89886 52682 -260722 -86768 165281 116992 -87210 117202 136847 -18945 -137377 -343892
11967 -343892 -322616 -89626 -433107 -116179 34375 -131160 -292713 -9926 -65589 30838 -45956
11955 -103204 6193 -62218 -99146 -21395 -99458 296211 -73072 -77979 -164032 116707 -190671
11943 56433 139295 210229 -115957 30332 4189 41806 -171 204205 61038 -309798 -12455 -162641
11931 -162641 -96970 -190765 147241 -66263 -202188 65229 -188118 -158483 181632 398963
11921 398963 167032 -109231 -213954 65194 -188802 246350 33934 275929 -304306 -91031
$$ packed form
12001A77543p9712g8020q0280f2139r2602A89303b25097D0702P5437a24941F3383
11989E3759g1475C14619b6807H9822i6370B8328h1198A85048e06513a51930O2044
11978h9886E2682b60722h6768A65281m8289h7210A17202J9645a8945j18432k06515
11967c43892K1276h9626l43481a16179C4375a31160j61553i926n5663C0838d5956
11955a03204F193f2218l6928b1395p8063B96211g3072m907q6053A16707a90671
11943E6433Q2862P0934a15957C0332D189L7617a71B04205F1038c09798a2455j50186
11931a62641O5671r3795A47241f6263j35925F5229a88118K9635A81632K17331
11921C98963A67032a09231j04723F5194a88802B46350C3934K41995c04306i1031
$$ plain form
11910 213055 -156154 -406416 162127 225484 -463361 83136 -483351 215192 -65618 166577
11899 381472 -388988 -52926 -306751 -319809 -75314 148402 -179329 -277302 211838 -24108
11888 -261321 -107258 5778 132854 -387197 -324098 -62422 -264170 154853 -161140 -187045
11878 -187045 -113324 -14141 -125103 -213760 36457 117163 -198010 86915 -124701 -160829 22806
11866 -76728 114537 15127 70215 239623 33845 40797 -58745 -89465 256170 82695 -171893
11854 -90798 -327194 277386 -83444 -388390 -155364 24828 31788 245371 86703 -465802 8573
11842 1363 188240 -21298 -126054 -197281 154242 -380869 -72014 9115 -315923 -172160 261092
11830 -93522 147409 -102593 -21232 -252671 64343 149390 -189450 -225595 -152558 -124793 68032
$$ packed form
11910B13055a56154k50262A62127O3357d63361H3136d83351B15192f5618A66577
11899C81472c88988e2926k53825j3058g5314A48402a79329r7973B11838b4108
11888b61321a07258E778J27076c87197O3099f2422k01748A54853a61140k5905
11878a87045P3721a4141j10962q8657C6457Q0706a98010H6915a24701l6128B2806
11866g6728A14537A5127N5088J69408C3845O952e8745l0720B56170H2695a71893
11854i0798k36396B77386h3444l04946a55364B4828O960K13583H6703d65802H573
11842A363J86877b1298j04756p1227A54242c80869g2014I115c15923J43763B61092
11830i3522A47409a02593b1232k31439F4343Q5047a89450l6145P3037K7765F8032
$$ plain form
11818 -167145 209067 250087 -61526 -481387 267669 111576 24958 -235552 13157 81539
11808 81539 202720 -44551 -298845 -207678 -113465 -279150 -25265 47420 -39074 402592 -147007
11796 80731 83357 209516 -176983 -90744 171175 102408 -188473 -152424 -113019 -57291 -249895
11785 -249895 181934 134008 -14452 15717 32908 -102329 7846 95688 149080 83304 -114957
11773 -201353 44650 -20022 56775 56135 312083 -425443 -68126 -44497 -163925 149383 50909
11761 158886 -222508 29928 372734 -35249 -308055 -153370 -26794 248539 -283674 159596
11750 -250206 312082 -24941 78402 -145264 203016 133135 -8146 -62407 -7071 -241350 113347
11738 21596 -260627 10131 -10395 -38581 287433 -257093 -82672 -143912 -176749 47778 -44391
$$ packed form
11818a67145B09067M1020f1526m19861B67669A11576B4958b35552A3157O8382
11808H1539J21181d4551k54294R1167R4213j65685b5265D7420c9074D02592a47007
11796H0731K626J26159a76983Q6239A71175o8767a88473L6049L9405N5728j92604
11785b49895A81934m7926a4452A5717J7191a02329G846Q7842N3392o5776a14957
11773b01353D4650b0022E6775o40K55948d25443f8126K3629j19428A49383E0909
11761A58886b22508B9928L42806c5249k72806a53370b6794B48539b83674A59596
11750b50206C12082b4941G8402a45264B03016o9881h146n4261g071k34279A13347
11738B1596b60627A0131a0395k8186B87433b57093h2672o1240l2837D7778d4391
$$ plain form
11726 272063 132199 -91432 243370 1592 -344741 205891 -18895 184599 -200583 239830
11715 -105589 84731 72889 -2602 102925 -3774 114888 -74382 -79966 147213 15836 101046
11704 101046 -122447 122643 -347729 342399 50084 47275 58088 -96771 32951 -55767 189508
11692 -170117 -134597 125099 -63 -201706 51717 -242427 346531 338923 24601 -276286 -80611
11680 -239478 89640 -369154 148369 -23990 79180 -112130 52352 161376 -57372 22449 120911
11669 120911 266028 -129032 230248 367405 -413726 87322 -33079 -34746 -51046 -155882
11659 -155882 -223973 90939 -111016 60115 -184769 272097 -224341 -296174 -160738 -151945 -7552
11647 -290261 -265837 -46151 266534 -441688 144310 82002 -66751 211424 -156865 173650
$$ packed form
11726B72063A32199i1432B43370A592c44741B05891a8895A84599b00583B39830
11715a05589H4731j1842b602A02925c774A14888g4382n584A47213A5836Q5210
11704A01046a22447A22643c47729C42399E0084k809J0813i6771C2951e5767A89508
11692a70117L5520A25099f3k01643E1717b42427C46531p608B4601b76286h0611
11680b39478H9640c69154A48369b3990G9180a12130E2352J09024e7372B2449R8462
11669A20911J45117a29032B30248J37157d13726H7322c3079j667j6300j04836
11659a55882o8091I0939a11016F0115a84769B72097b24341p1833J35436Q793g552
11647b90261K4424d6151B66534d41688A44310o2308f6751B11424a56865A73650
$$ plain form
11636 51936 33583 -174024 66553 159877 -126294 65862 104092 78137 -96373 -69303 31353
11624 -1907 76611 -138312 -71921 115038 149082 -9780 -128446 70293 -2528 -86950 208712
11612 -66050 247103 99649 114162 55524 -196739 -229496 -216109 186545 -208148 3161 -90465
11600 -43150 -62323 -19479 -375842 -35129 204751 -101983 424108 353240 225632 176760 -52039
11588 36715 -318290 228147 257970 153698 -240095 -24749 31903 -4479 -1183 108377 4977
11576 46525 126157 39085 -67994 71935 318746 94639 157304 136084 -42555 -42672 -1916 -5051
11564 -5051 -353923 376683 -90925 220184 116956 17106 -266917 256584 5478 -11767 -97472
11553 -97472 -69161 -338202 -10851 45252 362918 246503 -119314 49315 247322 -181901
$$ packed form
11636E1936j8353a74024F6553R3324a26294F5862L8230k5955i6373K7070C1353
11624a907G6611a38312O6391A15038L4044i780j18666G0293b528q4422B08712
11612f6050B47103I9649J4513E5524a96739l2757J3387A86545b08148C161i0465
11600d3150j9173a9479l56363c5129B04751a01983D24108p0868j27608m8872e2039
11588C6715c18290B28147K9823j04272b40095b4749C1903d479a183A08377D977
11576D6525P9632C9085f7994G1935K46811I4639O2665k1220d2555j17a916l135
11564e051l48872C76683i0925B20184j03228A7106b66917B56584E478a1767q5705
11553i7472K8311k69041a0851D5252L17666j16415a19314D9315J98007a81901
$$ plain form
11542 173252 85389 111757 386206 98020 28118 -168474 -11452 -148180 1576 98508 34815
11530 -180339 -371744 -224854 -165972 -201133 25515 -221198 405401 32927 -121041 -117291 -171465
11519 -171465 -42754 211119 2584 114009 178187 -72215 149543 32811 -35283 -198724 209708
11507 -94974 156110 379225 57951 46699 106531 102570 177743 -112482 20571 -103025 33457
11495 40429 -140315 270077 -117105 141859 161617 -67267 146711 61167 -6280 273096 85408
11483 463548 91304 206418 500655 81357 75069 75001 163792 -50795 58872 32235 232210 -279551
11470 211557 53442 -49527 156852 145249 55738 228694 -42784 227329 9450 385383 123113
11458 171143 256015 191944 668796 91385 498416 -10403 -129181 120888 235067 188074
$$ packed form
11542A73252H5389K6368K74449I8020B8118a68474a1452j36728A576R6932C4815
11530a80339j91405J46890N8882l5161B5515b21198D05401C2927a21041L750n4174
11519a71465d2754B11119B584J11425O4178g2215A49543C2811c5283j63441B09708
11507i4974A56110K23115E7951j1252N9832l961P5173a12482B0571a03025C3457
11495D0429a40315B70077a17105A41859J9758f7267A46711F1167f280B73096H5408
11483D63548I1304J15114K94237H1357o288o8Q8791e0795E8872k6637J99975b79551
11470B11557E3442d9527A56852j1603E5738J72956d2784B27329I450L75933A23113
11458A71143Q4872o4071M76852I1385M07031a0403j18778A20888J14179m6993
$$ plain form
11448 188074 190232 -4973 -107970 -71792 51634 70928 -59755 -73616 -1258 50555 15105 76460
11436 76460 64288 -668 27997 358800 130920 175052 153173 62984 153806 -22463 43289 315507
11424 315507 265135 -311980 -13528 204572 -19031 10817 55142 -283050 49262 102776 -169090
11412 62559 -75210 58146 -64851 -45198 81453 292715 -66929 57175 99426 232341 121731
11401 121731 305041 141821 -914 98918 25560 294179 44147 123916 237368 -85207 15573
11389 218278 -320335 52039 40519 -97015 -207470 196716 -233688 46183 11366 150851
11379 150851 24906 -116937 -113263 -129372 352395 18140 98936 67626 -18548 -57169 32566
11367 -168389 -190788 -148781 -237454 101222 208014 -138650 -295867 40589 36614 -112160 144123
$$ packed form
11448A88074K158d973j02997L6178E1634J9294e9755j3861a258E0555A5105O1355
11436G6460j2172f68B7997L30803A30920M4132k1879F2984R0822b2463D3289K72218
11424C15507n0372c11980a3528B04572a9031A0817M4325b83050D9262N3514a69090
11412F2559g5210E8146f4851J9653H1453K11262f6929E7175M2251J32915j10610
11401A21731J83310A41821i14I8918B5560K68619D4147P9769J13452h5207A5573
11389B18278c20335E2039j1520i7015j10455A96716b33688D6183A1366J39485
11379A50851B4906a16937L674j6109C52395A8140Q0796l1310a8548l8621C2566
11367a68389k2399M2007q8673A01222J06792a38650j57217D0589l975a12160A44123
$$ plain form
11355 -171022 45108 371214 -75561 131731 24027 -101710 -185978 271718 -20837 202809
11344 242362 -12627 203048 -168758 -99367 42754 41738 99506 110827 -207704 171766 161114
11333 161114 -188903 -3860 31522 173316 3851 -303252 22606 8648 -49552 -153822 -185032
11322 -185032 168847 -134394 -61535 -136642 -45885 198091 -110828 179460 -477366 155923
11311 16127 -246421 63480 -58552 62469 -320491 -81095 -286744 131165 -118680 -24858 -78598
11300 -78598 -29573 -118626 -77470 -73779 -35717 -61374 6353 -46472 263606 -199293 -152428 -95641
11288 -95641 164642 -107703 174837 110164 -93625 185510 346700 -201919 -53421 -227326
11278 -227326 -78118 -66319 231880 -284435 -225837 126441 161914 24270 -307494 -158788
$$ packed form
11355a71022D5108L26106g5561A31731B4027a01710q4268B71718b0837B02809
11344B42362a2627B03048a68758O9391D2754j016N7768J1321b07704A71766j0652
11333A61114a88903c860C1522J41794C851c03252B2606H648d9552j04270l1210
11322a85032A68847a34394f1535p5107d5885A98091a10828A79460d77366A55923
11311A6127b46421F3480e8552F2469c20491h1095k05649A31165a18680b4858n3740
11300g8598b9573q9053M1156L691c5717k5657F353d6472B63606a99293M6865N6787
11288i5641A64642a07703A74837o4673i3625A85510J61190b01919e3421j73905
11278b27326g8118J1799B31880b84435N8598A26441L5473B4270c07494J48706
$$ plain form
11268 -158788 165663 56798 -266957 18890 -325945 74978 125552 31536 -109259 18291 114204
11257 114204 61102 37635 -207284 164193 -288819 -305946 127871 -16491 -157979 113840
11246 53645 -173095 127690 81201 -345087 -166316 167723 9625 -378986 -295375 183904
11235 -15520 253667 102852 -203220 178870 7748 -180593 -457651 91950 4286 -452259 -173432
11223 -165005 38141 112312 38637 168377 -124436 2595 49680 -34255 -71485 142443 -50337
11211 130142 -91578 -74405 -313500 -346087 -188728 196937 20069 -636448 -283697 32923
11200 202664 -10002 176736 -250254 -45530 -14149 -65182 -181127 32462 -195069 -317744
11190 -317744 -69484 135077 331388 -196403 -43721 -58142 272898 -243613 80399 193302
$$ packed form
11268a58788A65663E6798b66957A8890c25945G4978N0574C1536a09259A8291R5913
11257A14204n3102k3467b07284A64193b88819j7127A27871a6491j41488A13840
11246E3645a73095A27690m6489c45087a66316A67723I625c78986Q3611A83904
11235a5520B53667A02852b03220A78870G748a80593k77058I1950D286d52259a73432
11223a65005C8141P4171C8637J29740a24436B595M7085c4255l7230A42443e0337
11211A30142i1578J7173k39095l2587J57359A96937B0069f36448b83697C2923
11200B02664a0002A76736b50254d5530a4149n1033j15945C2462a95069j22675
11190c17744f9484A35077J96311a96403d3721j4421B72898b43613H0399J12903
$$ plain form
11180 193302 58016 -172302 40067 -235646 -226749 109651 105423 44280 420402 118222 -13392
11168 -108139 -296512 -48130 -167265 107381 155779 184024 6600 -363736 -139983 79137 -139312
11156 -100413 -116554 52045 -46867 -309517 152 134712 61805 -109897 101460 4938 -216484
11144 -299041 -26634 35197 28862 114015 -155731 -106757 12762 -381894 319209 -34679 -25461
11133 -25461 -297509 222850 309488 -89703 -83672 285946 194173 -146546 -49893 -24414 164172
11121 -135143 27368 115402 -31946 164966 66949 158630 228987 200142 310227 29169 -198581
11109 4066 37447 147442 444874 467607 -69417 18569 311441 290980 240199 378566 39914
11097 59360 96167 317052 43275 415749 88793 233693 25015 279362 354217 133307 163718
$$ packed form
11180A93302E8016a72302D0067b35646Q897A09651m228D4280L76122A18222a3392
11168a08139j88373d8130j19135A07381M8398K8245F600c63736a39983G9137a39312
11156a00413j6141E2045d6867k62650A52J34560F1805a09897A01460D938b16484
11144b99041b6634C5197o335Q5153a55731M8974A2762c81894C19209c4679R218
11133b5461k72048B22850Q6638h9703O031B85946r1773a46546d9893b4414A64172
11121a35143B7368Q8034c1946A64966F6949R1681P0357k8845J10085B9169a98581
11109D066L3381J09995K97432K2733f9417A8569K92872k0461n0781J38367C9914
11097E9360L6807K20885D3275L72474H8793J44900B5015K54347P4855A33307L0411
$$ plain form
11086 163718 36560 16799 -18835 147179 265307 65531 90708 281588 184516 161271 535449
11075 535449 166046 493511 -42318 354249 130218 570075 336532 210813 68162 619422
11065 619422 370671 316103 322574 509366 397621 313772 292137 472656 395789 711161 408333
11054 408333 547154 646495 862571 791639 729141 665789 908412 544102 876935 870950 1229030
11043 1229030 1187349 1200160 870188 805469 926965 1060041 800664 1006924 711438 357453
11033 357453 878823 1069672 948797 837886 893974 958464 607226 898113 845100 735406
11023 735406 860083 613912 783894 860014 795643 1019177 964582 634546 494577 563724
11013 563724 384795 886080 594134 745153 769185 936506 463980 868475 819146 923108
$$ packed form
11086A63718C6560A6799a8835A47179J18128F5531K5177J90880r7072k3245L74178
11075E35449A66046L27465d2318C54249A30218M39857k33543j25719F8162N51260
11065F19422k48751n4568O471J86792j11745q3849k1635J80519p6867L15372l02828
11054D08333J38821R9341K16076p0932o2498o3352K42623l64310L32833n985L58080
11043A229030m1681J2811l29972o4719J21496J33076k59377K06260k95486l53985
11033C57453N21370J90849j20875j10911N6088O4490l51238K90887n3013j09694
11023G35406J24677k46171J69982P6120o4371K23534n4595l30036j39969O9147
11013E63724j78929N01285k91946J51019K4032J67321D63980M04495m9329J03962
$$ plain form
11003 923108 872505 755210 671228 518749 681646 533329 479215 850148 660469 509751
10993 509751 723638 698442 418107 617341 402097 720251 1017634 824592 974027 978777
10983 978777 896649 1018002 1036174 530475 978009 1124016 962021 1163911 1180190 1347975
10973 1347975 1281386 1780766 1545009 2080602 2213760 2210946 2922417 3386359 3415607 3733096
10963 3733096 4098608 3562911 3455738 2838532 2316740 1722526 1195757 1346242 1556831
10954 1556831 1336216 1357239 1053951 1487190 780095 1009935 956401 1155551 636248 695221
10944 695221 450867 654979 256443 240349 533494 131141 73003 363317 241200 -34869
10933 143373 181351 14986 236824 251378 200683 -191766 -99552 231384 -203922 -180996 -101323
$$ packed form
11003I23108n0603j17295q3982j52479J62897j48317n4114L70933j89679j50718
10993E09751K13887k5196k80335J99234k15244L18154K97383j93042J49435M750
10983I78777q2128J21353J8172n05699M47534J46007j61995K01890J6279J67785
10973A347975o6589M99380k35757N35593J33158k814P11471M63942K9248L17489
10963C733096L65512n35697j07173o17206n21792n94214n26769J50485K10589
10954A556831k20615K1023l03288M33239p07095K29840n3534J99150n19303N8973
10944F95221k44354K04112B56443j6094K93145A31141n8138K90314j22117c4869
10933A43373L7978A4986K21838J4554n0695a91766R2214B31384b03922K2926P9673
$$ plain form
10922 -101323 -232183 -68190 -27905 194188 -21856 60527 40211 110878 92928 199821 -185661
10910 51088 -191357 -151550 -192922 211081 13066 -25543 14908 277288 -110334 -59958 -245787
10899 -245787 225098 56700 -173691 -16761 -59817 324663 -57799 83398 -191538 177820
10888 192580 -75323 -389542 56174 57633 -111483 129524 -219604 407188 -137313 -127589 4131
10876 -101556 -113962 -171140 163907 126066 -270072 -136710 -158339 -220178 -57674 -122925 99715
10864 22759 280937 41758 -321223 -2522 -69852 -63501 297305 -95528 -40423 226425 -350143
10852 142147 -40897 30532 84001 -66851 -268628 -274623 -25933 -130307 399489 -215626 -102823
10840 32348 -234636 198191 61861 55951 20580 6656 349861 1419 18134 98271 280884
$$ packed form
10922a01323j30860f8190b7905A94188b1856F0527k0316P0667j7950J06893a85661
10910E1088a91357L9807m1372B11081A3066b5543A4908K62380a10334N0376j85829
10899b45787B25098E6700a73691a6761m3056C24663e7799H3398a91538A77820
10888A92580g5323l14219E6174J459a11483A29524b19604D07188a37313R724D131
10876a01556j2406n7178A63907l7841b70072J33362k1629o1839e7674o5251I9715
10864B2759K58178D1758c21223b522o7330O351B97305i5528d0423B26425c50143
10852A42147d0897C0532N3469f6851k01777n995b5933j04374C99489b15626a02823
10840C2348b34636A98191F1861n910B0580F656L43205A419J6715Q0137J82613
$$ plain form
10829 280884 -196421 -155685 -211921 -22481 333671 -34407 89752 163210 -281695 96550 -40153
10817 75438 -4351 -166282 86174 118896 -15280 147 66172 79147 -190731 185904 -102338
10805 172927 -257559 -207828 205889 -167329 65984 -243601 -165084 136778 -328012 30253
10794 -454093 -45503 42534 62422 41433 5943 -13031 -173360 231964 94364 -222786 91290
10782 -4165 106321 -151055 -104262 -63452 42635 203370 -45466 195442 -29431 -188227 -44920
10770 -16376 192011 -245427 103975 -122845 71444 -147214 -141804 -21151 -322781 -274083 112963
10758 -139212 -33430 -126574 -63381 -274242 -5469 260257 -160024 189297 -400611 -64441 270998
10746 -6581 -210703 -327855 -112591 138793 200778 39928 -342185 -38761 51390 -18586 -286644
$$ packed form
10829B80884a96421M0736n6236b2481C33671c4407H9752P3458b81695I6550d0153
10817G5438d351j61931H6174L2722a5280A47O6025J2975a90731A85904a02338
10805A72927b57559M9731B05889a67329F5984b43601P8517A36778c28012C0253
10794d54093d5503D2534J9888k0989E943a3031j60329B31964I4364b22786I1290
10782d165A06321a51055M6793M0810D2635J60735d5466A95442b9431j58796d4920
10770a6376A92011b45427A03975a22845G1444a47214N410b1151l01630M8698A12963
10758a39212c3430r3144O3193k10861e469B60257a60024A89297d00611f4441B70998
10746f581k04122j17152a12591A38793O1985C9928c42185c8761E1390a8586k68058
$$ plain form
10735 -286644 37021 -50294 -54381 -25192 -144872 -214577 -359485 -4312 252511 -186717 167141
10723 -106019 183809 -107240 266170 -461581 -9817 236717 -10458 -163488 139666 -105473
10712 -330368 98676 -109154 -39282 -107906 -134690 -65576 -146026 -17099 -268667 296221 -515793
10700 -83061 -30470 71525 274962 -19576 -203908 -123525 119213 218048 -19246 58523 112940
10689 112940 69251 -66108 114587 -59000 -110047 -215982 -153248 -99788 -30976 -111434 13699
10677 -71550 -138213 -321135 21268 -90902 -325687 24343 134033 -172559 -103380 -167811 63509
10665 -85687 -290675 -124546 195618 -167212 -224159 -201582 -63977 -242972 -91130 -423697
10655 -423697 -185707 80521 -203598 65611 -43598 -160385 -180026 6630 8810 -284400 140178
$$ packed form
10735b86644C7021e0294m087b5192j19680o9705j44908d312B52511a86717A67141
10723a06019A83809a07240B66170d61581i817B36717a0458j53030A39666a05473
10712c30368I8676a09154c9282o8624k6784f5576q0450a7099k51568B96221e15793
10700h3061c0470G1525K03437a9576j84332Q0383A19213R8835a9246E8523N4417
10689A12940m3689f6108A14587e9000n1047j05935O2734N3460c0976q0458A3699
10677g1550o6663j82922B1268i0902k34785B4343J09690a72559O9179o4431F3509
10665h5687k04988a24546A95618a67212n6947K2577f3977j78995i1130l32567
10655d23697a85707H0521b03598F5611d3598j16787j9641F630K180b84400A40178
$$ plain form
10643 71209 -167123 -82211 -142634 -143104 -204759 24545 -287269 157444 85377 199692 208669
10632 208669 85797 30385 71270 -122169 -52867 43428 51704 -236211 49079 -101082 -1696
10620 33023 -242024 -173452 -20222 -198622 -281142 83697 2578 136837 -392368 157152 -151004
10608 440404 188035 -297084 118541 102378 -36419 81909 -77146 -100424 -87418 -149003 42021
10596 141401 -185911 65759 -66944 112500 -198800 -354012 124753 54247 260937 229554
10586 229554 232577 -211319 -3754 194732 17574 178675 58476 -176869 -118885 61857 349142
10575 349142 304480 384725 -25734 -76091 -154388 286477 128671 217782 -8303 -31704 64880
10563 -176397 38064 -117005 -35671 -345514 -61535 -71846 335651 -177356 -169456 28076 139148
$$ packed form
10643G1209a67123h2211o0423m70o1655B4545b87269A57444p2067J14315Q977
10632B08669H5797C0385M0885a22169e2867D3428Q276b36211D9079a01082a696
10620C3023b42024O8572b0222j78400q2520H3697B578J34259c92368A57152a51004
10608D40404A88035b97084A18541j6163c6419H1909g7146k3278J3006o1585D2021
10596A41401a85911F5759f6944A12500a98800j55212A24753E4247K06690l1383
10586B29554L023b11319c754A94732A7574J61101E8476a76869N7984F1857K87285
10575C49142m4662Q0245b5734n0357p8297B86477A28671Q9111h303k3401F4880
10563a76397C8064a17005c5671l09843f1535j0311C35651a77356P900B8076J11072
$$ plain form
10552 139148 -62227 -368622 10157 -8912 -164930 -28506 -56209 245375 -60943 -72436 43056
10540 -173721 -35474 140276 -167761 91187 -201964 -145138 -101819 -52237 -117725 -280231 -168852
10529 -168852 -208550 -313746 -441104 -273785 69886 26316 135468 -51654 -159573 150537
10518 -45825 169428 110347 -425957 500173 -206565 -242337 145563 -15151 194152 -209906
10507 80429 -217016 164359 105340 -382182 -96604 292155 104167 -339643 -18541 -260098
10497 -260098 430264 -311032 146393 251050 -274476 -301013 134224 -319467 -280900 21574
10486 -206365 220420 -250821 -6629 -14664 -205170 -41994 -288359 -100371 -40422 295289 245959
10475 245959 256467 138774 133510 284100 336765 264569 213144 118213 61057 104390 -41418
$$ packed form
10552A39148f2227l06395A0157h912j56018b8506k7703B45375f0943j1493D3056
10540a73721c5474A40276a67761I1187b01964N6826M3319M9582o5488j62506J11379
10529a68852l9698j05196j27358J67319F9886B6316J09152e1654j07919A50537
10518d5825A69428n9081d25957E00173b06565l5772A45563a5151A94152b09906
10507H0429b17016A64359n9019c82182i6604B92155A04167c39643a8541k41557
10497b60098D30264c11032A46393J04657b74476k6537A34224c19467L8567B1574
10486b06365B20420b50821f629q035j90506d1994k46365a00371d0422B95289m9330
10475B45959J0508j17693n264J50590N2665p2196n1425r4931n7156M3333d1418
$$ plain form
10463 62577 -6 3018 54492 256972 -172647 -68158 -161820 -88173 59489 -90215 -77366 147957
10450 -227391 -200536 104563 -360207 -2913 -16836 -49904 -110478 -101209 145066 -302128 -324049
10439 -324049 -273642 -223572 65260 -182364 -112341 -73914 72958 -303989 -218758 170358 -115779
10427 7620 -104439 15286 84115 27442 -136821 -51503 112081 -263838 2470 -209945 120217
10415 -116231 -16972 -131884 87344 -42120 -131514 19836 57163 -171703 -45017 6145 -305574
10403 93581 -238498 -273686 -128697 -219063 160996 -276636 -159316 41099 -189032 -14266
10392 86544 255338 215450 227497 92231 123560 189676 75869 12448 101139 -191176 122982
10380 249983 202843 241218 147505 140710 82688 104636 111158 349749 74092 96318 258959
$$ packed form
10463F2577fC018N1474K02480a72647f8158r3662P3647E9489i0215J2849A47957
10450b27391K6855A04563c60207b913j3923l3068o0574R269A45066c02128k1921
10439c24049N0407N0070F5260a82364P0023L8427G2958c03989Q5231A70358a15779
10427G620a04439A5286O8829B7442a36821e1503A12081b63838B470b09945A20217
10415a16231a6972j14912H7344d2120q9394A9836L7327a71703d5017F145c05574
10403I3581b38498l5188a28697r0366A60996b76636J17320D1099a89032a4266
10392H6544J68794l9888J2047I2231L1329O6116G5869A2448Q8691a91176A22982
10380B49983m7140L8375r3713o795n8022K1948O522K38591G4092K2226J62641
$$ plain form
10369 258959 315349 365884 198487 -25424 261504 48640 414384 474690 217450 395304
10359 395304 601772 757679 342555 351773 69819 361787 174987 -216539 -82020 443515
10348 217342 240443 196250 698668 572993 596791 340781 369283 6352 27835 79345 311713
10337 311713 241748 47840 168845 93426 202214 379999 379427 170567 9394 -91817 -78047
10326 -78047 346842 159281 138236 92117 50443 177265 -133301 23389 141815 165957 51017
10314 -20227 258764 61961 95813 -81479 308195 3740 168358 15491 67922 -143095 -120338
10303 -120338 -33522 -101217 -70421 57012 22766 48717 -154841 120179 -12756 -165660 -198417
10292 -198417 -207874 -104568 -90843 -25942 -160313 -54260 20342 -103280 74829 -39813 -123697
$$ packed form
10369B58959N6390N0535j67397b5424B61504D8640L65744O0306B17450J77854
10359C95304K06468J55907C42555R218F9819K91968A74987b16539h2020D43515
10348B17342K3101m4193N02418j25675K3798k56010K8502F352K1483N1510K32368
10337C11713o9965D7840J21005p5419J08788J77785n72A70567I394i1817J3770
10326g8047C46842A59281k1045m6119m1674J26822a33301B3389J18426K4142E1017
10314b0227B58764F1961L3852h1479C08195C740J64618A5491N2431a43095K2757
10303a20338c3522o7695L0796E7012B2766K5951a54841A20179a2756j52904l2757
10292a98417r457J03306J3725b5942j34371e4260B0342a03280G4829c9813q3884
$$ plain form
10281 -123697 183527 -8679 -69778 -103306 3036 -275802 -84562 16696 122288 86748 -340537
10269 -217412 76860 -169884 5711 43029 84711 214787 252373 7272 -89227 -344097 6017
10257 230306 21344 -211217 88486 112496 180301 78241 -103671 51923 225700 122595 140302
10246 140302 60171 -135594 -88346 -146556 155575 266702 91782 -112167 -174916 -382521
10236 -382521 420288 117447 268928 -21156 7295 -46378 49002 34234 263443 -269662 -29938
10224 13007 126721 -78428 138929 -134973 63542 127678 77189 -28253 -133661 85449 223285
10213 223285 -168124 -65747 -254047 -185276 55844 -325256 47356 -235418 -148840 -17335 -333608
10202 -333608 -81848 -111547 -137717 -213270 9468 18625 -85311 -93180 -313349 15223 -83593 -274525
$$ packed form
10281a23697A83527h679o1099l3528C036b75802h4562A6696J05592l5540c40537
10269b17412G6860a69884E711L7318M1682J30076L7586G272h9227k54870F017
10257B30306B1344b11217H8486K4010O7805G8241a03671E1923J73777j03105J7707
10246A40302F0171a35594M7248n8210A55575J11127I1782a12167o2749k07605
10236c82521D20288A17447J51481b1156G295d6378D9002j4768K29209b69662b9938
10224A3007J13714g8428A38929a34973F3542O4136n0489b8253j05408H5449J37836
10213B23285a68124f5747j88300O8771E5844c25256D7356b35418Q6578a7335l16273
10202c33608h1848k9699k6170p5553I468R157h5311p869k20169A5223h3593j90932
$$ plain form
10190 -274525 -352516 7720 225388 189964 -174535 -454667 -34605 56689 -21860 234858 327368
10179 327368 245605 -129143 114468 50264 -90151 220058 -129578 -208610 -56712 -393895
10169 -393895 -206438 83878 -159349 -294275 18678 -157170 -60526 -338736 -162284 -59300
10158 -79262 -23394 119398 -54565 -89917 -100104 -148895 -145530 24280 295682 58611 -174334
10146 -320784 71319 -119448 -139373 -293755 -137231 107972 -259475 -208654 283717 13837
10135 311734 87372 -108473 -58715 -164192 -139294 223582 146837 -236881 -283201 18530 249762
10124 249762 -207627 217305 -20915 -26939 128923 145872 202212 -102091 -296084 16343 -184630
10112 -225568 -72033 -322784 -332893 -94100 -101758 138494 19739 -265343 -317517 28564 -54963
$$ packed form
10190b74525p7991G720K17668l5424a74535k80132c4605E6689b1860B34858R2510
10179C27368q1763a29143A14468E0264i0151B20058a29578p9032e6712l37183
10169c93895J87457H3878a59349j34926A8678a57170f0526k78210a62284e9300
10158g9262b3394A19398e4565l5352j0187m8791L365B4280K71402E8611a74334
10146c20784G1319a19448j9925j54382a37231A07972b59475N0821B83717A3837
10135C11734H7372a08473M9758j05477K4898B23582p6745b36881m6320A8530K31232
10124B49762b07627B17305b0915o024A28923J6949N6340a02091j93993A6343a84630
10112b25568g2033k50751j0109i4100p658A38494A9739b65343n2174B8564e4963
$$ plain form
10100 11797 135864 1891 -97900 189714 91848 328086 -104328 159692 180167 -474264 -110094
10088 258688 30227 169977 -178156 -350531 63393 155075 161297 96755 -8300 -28872 -43042
10077 -43042 -159762 -443113 228902 158281 -44152 215154 -263710 -157647 -126275 -345151
10067 -345151 329653 369313 -358826 -147028 -217365 -159581 181404 -80490 267584 -137845
10056 -234706 -44554 159222 124739 21128 -55643 -108864 -129360 29808 -445472 -260421 36569
10044 -22194 227530 218215 72979 -19355 -53128 70764 40627 -126244 -44156 -385752 58350
10032 -97526 113385 -249215 -89152 154060 -334835 32654 -132716 -5755 -145718 -61892 -150776
10021 -150776 -37429 -189336 8931 -65475 -18456 -368209 -354223 -44911 81293 34414 -157827
$$ packed form
10100A1797J24067A891i7900A89714I1848K36238a04328A59692K0475d74264a10094
10088B58688C0227J39750a78156j72375F3393R1682O222o4542h300k0572j4170
10077d3042j16720k83351B28902p0621d4152B15154b63710J06063L1372k18876
10067c45151C29653L9660c58826a47028p0337N7784A81404h0490B67584a37845
10056b34706d4554A59222l4483B1128e5643n3221k0496B9808d45472J85051C6569
10044b2194B27530r315G2979a9355l3773G0764l0137a26244d4156l41596E8350
10032i7526A13385b49215h9152A54060c34835C2654a32716e755j39963f1892q8884
10021a50776c7429j51907H931f5475a8456l49753J3986d4911H1293C4414a57827
$$ plain form
10009 -51369 114686 -167661 48652 -268430 27339 -332447 -100777 249082 160217 90568
9999 90568 -101807 53716 -50093 -89940 -145350 37658 -283280 -57687 -160081 46498 -250008
9987 -104596 -259722 -153012 -34610 -291613 -215254 -51606 85273 150896 46459 -189361 93425
9975 38478 -147462 257398 -110796 -339407 -110185 -142026 -360086 -235960 -68590 4496 50052
9964 50052 108814 352648 -156687 -402232 -23811 -422861 84815 -1270 -91461 -416663 -303326
9953 -303326 -183093 -9126 -188180 -152656 -168304 179322 -282280 10934 -90723 -27673 -315219
9942 -315219 27723 75995 -289494 -20520 -282726 144947 32809 -172552 -364237 -237201
9932 -237201 -89370 -145225 -295264 -5291 110703 10941 -50873 -26123 -169885 76167 -111124
$$ packed form
10009e1369A14686a67661D8652b68430B7339c32447a00777B49082q8865o9649
9999I0568a01807E3716e0093l9847n5410C7658b83280e7687j02394D6498b50008
9987a04596j55126J06710c4610k57003P6359e1606H5273O5623D6459a89361I3425
9975C8478a47462B57398a10796k28611a10185l1841k18060J24126f8590D496M5556
9964E0052N8762K43834a56687k45545b3811l99050H4815a270r0191l25202J13337
9953c03326J20233i126j79054L5524j5648A79322b82280A0934i0723b7673k87546
9942c15219B7723M8272b89494b0520k62206A44947C2809a72552j91685J27036
9932b37201h9370n5855j50039e291A10703A0941e0873K4750j43762G6167a11124
$$ plain form
9920 -49475 -18828 134389 136628 -193062 -69175 237032 -92480 -350092 5987 95469 197449
9909 197449 102864 -43320 182944 23645 -9698 -5558 -27594 64227 290928 18164 -299564
9897 -22942 -143077 -268607 -15802 -375456 150899 -237839 37336 123039 -136372 -202931 43823
9885 -56364 -266083 -23012 311874 -23481 116561 21756 -118592 -412349 -94495 -12420 -257802
9874 -257802 347108 -121428 -418754 -348978 302693 326576 242763 -156624 87848 -3863 291202
9862 -185968 -61317 -79439 60314 55517 -87464 115342 -262807 -181380 87775 152216 -188968
9850 -400659 22760 -193429 84763 60837 144134 -155728 -348 -177726 -124102 164831 -138161
9838 -32746 -22535 316221 112727 -345125 -172570 -120745 -133260 -137667 -173277 338110 -89917
$$ packed form
9920d9475a8828A34389K239a93062f9175B37032i2480k57612E987Q9482J01980
9909A97449r4585d3320A82944B3645i698M140k2036F4227K26701A8164b99564
9897b2942j20135j25530a5802l59654A50899b37839C7336Q5703a36372o6559D3823
9885e6364k09719b3012C11874b3481A16561B1756a18592k93757i4495a2420k45382
9874b57802C47108a21428k97326O9776C02693K3883q3813a56624H7848c863B91202
9862a85968f1317j8122F0314m797h7464A15342b62807Q1427H7775O4441a88968
9850d00659B2760a93429H4763k3926Q3297a55728c48j77378N3624A64831a38161
9838c2746J0211C16221A12727c45125J72555N1825j2515m407l5610C38110h9917
$$ plain form
9826 -143979 4769 88869 -254243 -148637 -120334 -103422 -157923 -197590 -342933 80688 124475
9815 124475 -46337 -155198 -70249 -9840 174675 94951 346163 130485 327646 126926 -341984
9803 101455 -85550 -125896 -299595 2387 -127752 -445005 -192720 -113384 -18863 -15927 -74351
9792 -74351 315159 -333034 -376996 -115358 310226 -131501 -229538 -40494 -1464 -316825 -99492
9780 -147508 -30800 -44659 -61427 -162748 -108329 -75129 -36639 -219027 -7640 -81389 -127721
9769 -127721 -43007 165270 -215571 -154230 -157466 -4459 -309329 158115 24783 -72408 50401
9757 51026 287148 115367 73154 -113543 -117403 282259 9577 -170406 152911 -417 -288157
9746 -288157 -20328 -277500 160765 -96243 -25607 241371 55751 92594 -145541 -5114 -204015
$$ packed form
9826a43979D769Q4100b54243J05606K8303J6912n4501l9667j45343H0688M3787
9815A24475d6337j08861g0249i840A74675p9724K51212A30485J97161A26926c41984
9803A01455h5550m0346j73699B387a27752l17253a92720P9336a8863K936n8424
9792g4351C15159c33034m3962a15358C10226a31501r8037d0494a464l15361i9492
9780a47508c0800j3859j6768j01321N4419L3200c6639j82388g640p3749m6332
9769a27721d3007A65270b15571O1341l236d459l04870A58115B4783g2408E0401
9757E1026K36122A15367m2213a13543l860B82259I577a70406A52911d17k87740
9746b88157b0328k57172A60765i6243b5607B41371E5751L6843a45541e114j98901
$$ plain form
9735 -204015 -3376 -21375 6889 -474545 138189 -177385 41097 13611 -434866 71798 4163
9723 -190801 -81132 -141227 -260205 -245006 -310513 -172633 120368 291062 -50022 -9971 -28764
9712 -28764 -78930 -48202 -344597 -81423 -139870 -22190 -287609 -146750 314737 -285370 25389
9700 140405 -40866 117055 -101241 -283067 -128520 -66249 -270475 -199734 -117697 75312 -204622
9688 -16857 -56835 -157185 -42712 -207720 18334 89892 -107840 202321 148718 136711 -254703
9676 -323688 -74447 -100151 -30727 -99744 -11677 53236 -30835 -319897 -139190 -321699 -127145
9664 -290472 40759 -118354 -205477 -290092 -52862 -162215 -70731 -41336 8659 -281141 240079
9652 303693 176124 -251494 -100449 108924 -204053 -8387 -215662 -179311 -85802 130678
$$ packed form
9735b04015c376j7999F889d74545A38189a77385D1097A3611d34866G1798D163
9723a90801h1132o0095j18978J5199o5507J37880A20368J70694e0022i971j8793
9712b8764n0166L0728k96395h1423n8447b2190k65419J40859C14737b85370B5389
9700A40405d0866A17055a01241j81826a28520O2271k04226P0741Q2037G5312b04622
9688a6857l9978j00350d2712j65008A8334P1558a07840B02321n3603j2007b54703
9676c23688g4447k5704c0727o9017a1677E3236c0835k89062a39190j82509a27145
9664b90472D0759a18354q7123q4615e2862j09353g0731K9395H659b81141B40079
9652C03693j27569b51494a00449A08924b04053h387k07275L6351h5802A30678
$$ plain form
9641 -49052 5063 -259046 -74332 211794 -139939 276061 43894 -223683 -109436 56211 63198
9630 63198 235817 -14484 -152626 -118029 -43765 -34275 -181129 103779 299796 134415 -331005
9618 332182 -108659 187797 -21167 196782 -178064 -163283 -47158 46585 -321316 -34705 88462
9606 -259486 -35832 -14248 -84920 -73995 -118473 -105277 -156382 -84165 -163012 49863 -125235
9594 191493 76027 129244 -53600 191703 -240747 12225 -90328 -109497 -156496 -169890 226444
9582 265025 -121631 123525 -231861 151843 -21749 -568401 -109175 -42789 140722 -145171
9571 -120185 -261902 -36538 82675 14563 -187999 -35263 -65720 58924 -273022 -323409 11176
9559 -135969 -123217 -226830 -255871 502971 138607 2807 84680 351879 -123220 -58826 35675
$$ packed form
9641d9052E063b59046g4332B11794a39939B76061D3894b23683a09436E6211O987
9630F3198J72619a4484j38142L4597d3765R490j46854A03779J96017A34415c31005
9618C32182a08659A87797b1167A96782a78064J4781d7158D6585c21316c4705H8462
9606b59486c5832a4248p0672J0925m4478J3196n1105P2217p8847D9863a25235
9594A91493G6027N3217e3600A91703b40747A2225i0328j9169m6999j3394B26444
9582B65025a21631A23525b31861A51843b1749n46652a09175d2789A40722a45171
9571a20185j41717c6538H2675A4563a87999c5263l0457E8924b73022n0387A1176
9559a35969J2752j03613k9041E02971A38607B807Q1873K67199a23220e8826C5675
$$ plain form
9547 6398 -12344 -324305 -189082 -253372 -210003 -203456 13369 -144714 -231288 221081 210090
9536 210090 83178 -41460 -137502 -452787 156161 -410783 -214273 -38970 -17295 167855 68911
9524 -157036 -100108 108530 -133183 157504 -82957 42373 148058 -108862 -229387 -266200
9514 -266200 54903 276001 70129 -335572 -362376 -220652 -101963 234830 -188744 -60751
9503 226626 -182279 -195457 223536 -3364 77829 164247 -43847 79926 -239576 -174897 78308
9491 -25610 -204745 129975 1216 -422124 -291743 -27626 -332211 349849 -13473 -171438 -380046
9480 -380046 -32741 61354 -38978 -135984 -315026 13445 -21979 -240834 -125901 171280 29586
9468 65121 -241526 -192035 -15593 44670 -145681 -244854 -123617 57008 -230711 -198987 -61916
$$ packed form
9547F398a2344l11961J35223o4290M3369O547A3369a44714q6574B21081j0991
9536B10090H3178d1460r6042l15285A56161d10783J96510c8970a7295A67855F8911
9524a57036N6928A08530a33183A57504h2957D2373J05685a08862j20525l6813
9514b66200E4903K21098G0129c35572k6804J41724a01963B34830a88744f0751
9503B26626a82279j3178B23536c364G7829Q6418d3847G9926b39576O4679G8308
9491b5610j79135A29975A216d22124J30381b7626l04585C49849a3473j57965k08608
9480c80046c2741F1354c8978r7006j79042A3445b1979k18855J14933A71280B9586
9468F5121b41526M9491a5593D4670a45681r9173J21237E7008b30711L1724f1916
$$ plain form
9456 -120938 230204 372837 -155909 -252816 -140596 245388 -90882 -64081 215160 -99480
9445 -56090 -136497 -10657 45372 31065 106518 -325615 -153861 -30013 -5079 -104089 395862
9433 57303 -142906 -221884 14979 114558 131883 -401830 188042 -101041 92434 -94760 258224
9421 -254744 -295580 131120 25838 74384 -242351 -141696 -333489 42790 15321 39814 -401176
9409 39058 120145 -236055 -134115 103046 -144906 -143898 128131 -16852 -226802 79317 -150437
9397 64962 -59807 -45675 -7866 -251127 -11722 -24244 73076 -304559 3801 -331154 -232215 -372242
9385 -372242 56034 92258 12898 -259395 -227150 34120 144139 243994 -73595 -23756 -64901
9374 -64901 -20713 80951 -170568 -253423 47957 -359392 114251 27837 311044 44735 -233751
$$ packed form
9456a20938B30204J42633a55909r6907J12220B45388i0882K6801B15160i9480
9445e6090q0407a0657D5372j4307P5453c25615a53861c0013e079r9010C95862
9433E7303a42906p8978A4979R9579J7325d01830A88042a01041I2434i4760B58224
9421b54744m0836A31120B5838M8546b42351J00655j91793D2790A5321K4493d01176
9409C9058Q1087b36055J01940A03046a44906J008A28131a6852k09950G9317a50437
9397F4962e9807J4132g866k43261a1722j2522G3076c04559C801c31154R8939j40027
9385c72242E6034L6224A2898b59395L2245C4120J10019R9855g3595b3756m1145
9374f4901b0713H0951a70568q2855D7957c59392A14251B7837K83207D4735b33751
$$ plain form
9362 -171495 -132952 3091 -277123 -143037 -66300 197233 -183102 -387125 -166633 -18307 -119150
9351 -119150 -16064 -70481 -264847 110723 -50961 -40770 -91638 -128198 -160208 -30132 146303
9339 -67106 -23875 161744 -203234 214863 -118762 -395048 -361350 -394015 76191 -77487 -59526
9328 -59526 9872 205692 -156303 234890 199621 -575866 -82749 -201664 -110390 172032 57095
9316 58789 -345658 77812 -373661 176609 -247520 267451 -281529 -173848 -7087 24325 -86874
9304 409354 124700 14116 42259 -188702 -413624 85596 -190395 -9209 -72379 -77660 29084
9292 -337447 -148592 -11621 161770 -466375 -74980 -125954 -57153 -169223 -286939 128897
9281 -261547 17262 -35552 -194674 -110798 195737 192999 184131 61589 -224167 194291 -214149
$$ packed form
9362a71495L8543C091b77123J34086f6300A97233a83102k04023a66633a8307j00843
9351a19150a6064n4417j94366A10723e0961J0191n0868l6560l2010c0132A46303
9339f7106b3875A61744b03234B14863a18762k76286L3698l2665G6191g7487J7961
9328e9526I872J95820a56303B34890l5269e75866h2749j18915R1274A72032E7095
9316E8789c45658G7812c73661A76609b47520B67451b81529J07681g087B4325h6874
9304D09354A24700A4116K8143a88702k24922H5596a90395i209o3170n281B9084
9292c37447a48592a1621A61770d66375g4980n0974e7153j12070j17716A28897
9281b61547A7262c5552j59122Q3876A95737k738q868F1589b24167A94291b14149
$$ plain form
9269 -373528 -228781 16163 -31109 24233 -12589 -61545 -153749 65464 -94393 -92194 -68268 -80564
9257 -80564 -144594 138170 -62361 -24253 -227965 -6248 -64304 -187818 -41428 -126494 -21873
9245 33750 417145 -14983 -278211 29114 -224097 184957 57094 -309460 -74169 -74084 -58569
9234 -58569 -298045 105861 -208354 -185593 -71169 170974 -86151 -275110 -217447 152462 -159664
9222 -135470 52276 325822 277408 198308 -8679 -388489 -164216 42569 240432 60254 -499300
9210 184665 441529 -111150 310572 -317766 -278129 -139357 -63049 -48921 8794 -328852 -26843
9198 160111 -88890 87692 -143177 92504 -259533 -4432 -545522 -248722 -24940 -181028 78817
9186 -305140 8148 126895 55156 59225 -247701 -188952 64072 148240 308716 72112 -23150
$$ packed form
9269c73528J44747A6163c1109B4233a2589m8956r2204F5464i4393K199K3926j2296
9257h0564o4030A38170f2361b4253k03712f248n8056j23514d1428q5066b1873
9245C3750L83395a4983k63228B9114b24097A84957E7094c09460g4169Q5J5515
9234e8569k39476A05861b08354K2761g1169A70974h6151j88959N7663A52462a59664
9222a35470E2276K73546m8414p9100h679l79810a64216D2569J97863F0254d99300
9210A84665K56864a11150C10572c17766L9637J38772f3049J4128H794c28852b6843
9198A60111h8890H7692a43177I2504b59533d432n41090b48722b4940j56088G8817
9186c05140H148J18747E5156M069b47701N8749F4072Q4168J60476G2112b3150
$$ plain form
9174 104526 -140130 -32561 -248504 -314601 -45771 -244082 268607 84958 136971 -36841 89338
9162 327742 168048 20099 -79683 -60834 184679 -80718 -89452 -69960 72158 -291248 25138
9150 79467 -209219 -263885 231349 -398035 -288227 -58630 -22117 -76443 -20529 -57870 135900
9138 -281550 -78777 -102084 271815 -6168 224205 -171545 -153675 -91156 22069 -157309 21007
9126 -98983 25640 209610 89992 -276571 -68273 141311 192945 -156598 -286253 238145 -63599
9114 -188909 159255 -84969 -176625 -22935 -17317 -29923 176905 -412343 273758 -154396 -217643
9103 -217643 184273 81289 -8975 -42441 -367976 12549 -96514 -153481 -59981 274956 -43462
9091 -279215 -41354 94133 381468 -33625 225520 -410669 191204 -93681 -209735 -278301 -103384
$$ packed form
9174A04526a40130c2561k15943o6097d5771j98311B68607H4958N2013c6841H9338
9162C27742j59694B0099g9683J8849A84679h0718q734J9492G2158b91248B5138
9150G9467b09219n4666B31349c98035J09808e8630b2117n4326b0529l7341A35900
9138b81550g8777k3307B71815f168B24205a71545J7870O2519B2069a57309B1007
9126i8983B5640J83970H9992b76571f8273A41311N1634a56598j29655B38145f3599
9114a88909A59255h4969r1656b2935N618j2606A76905d12343B73758a54396o3247
9103b17643A84273H1289h975l3466l25535A2549i6514n6967e9981B74956d3462
9091b79215d1354I4133K87335c3625B25520d10669A91204i3681j16054o8566a03384
$$ plain form
9079 -330282 -342724 172039 -20024 -1667 -292114 -84326 60699 -166664 83616 353015 372911
9068 372911 -34852 -509733 -115126 90430 388254 146121 87228 222035 58324 -85273 237527
9056 29823 -146157 -148952 77820 -144953 -194113 -95642 50783 -48587 -90537 -31250 65589 59587
9044 59587 -122393 -5689 83248 -28325 -6731 20123 323 -416535 -292998 -210367 -143669 24378
9031 10418 -92733 -87556 -151242 -12597 -296824 -39186 89881 -184574 -38665 -248705 -393786
9020 -393786 -158666 270026 -40674 77633 -378276 -57838 -107523 -87098 -8089 -274502 122562
9008 226319 24122 -73848 40602 39424 -3614 34866 -37481 152738 267653 -87653 308064
8996 -246971 84510 -18520 110298 -271736 -292865 -184447 -400472 -195932 -526138 44548
$$ packed form
9079c30282j2442A72039b0024a667k90447h4326F0699a66664H3616K69399J9896
9068C72911c4852m74881a15126I0430K97824A46121n8893J34807E8324h5273B37527
9056B9823a46157k795G7820a44953m9160i5642E0783d8587m1950c1250F5589o002
9044E9587a22393e689H3248b8325f731B0123C23d16535J23537Q2631O6698B4378
9031A0418i2733N177o3686a2597k84227c9186H9881a84574c8665k10040j45081
9020c93786a58666B70026d0674G7633c78276e7838m9685K0425h089k66413A22562
9008B26319B4122g3848D0602j178c614C4866c7481A52738J14915h7653C08064
8996b46971H4510a8520A10298b71736k1129J08418k16025a95932l30206D4548
$$ plain form
8985 3806 102197 -333602 -227835 79675 -176462 190901 -79032 60283 95153 -98186 -33019
8973 -92974 -57751 12369 -205578 265556 71069 -155951 -25958 114074 97444 49070 55564
8962 55564 -66205 173590 -336433 -270684 -143593 -123817 212396 184798 165725 60822 26924
8950 -92622 353725 -118112 -458608 240155 35537 -182425 -444561 52236 -312111 -113182
8939 199512 105803 -132007 -201311 165468 -10190 74271 90876 36282 247980 -22856 -109825
8928 -109825 224564 -81882 31377 275017 -407350 -125294 -86002 -134773 162574 440358
8918 440358 382359 310079 -212737 205042 -232562 -143310 26773 240041 -155264 196680
8907 111714 -331255 -63370 -105278 39013 -108147 135497 -46061 -24120 -202267 126100 -280785
$$ packed form
8985C806R8391c33602J05767G9675a76462A90901g9032F0283L4870i8186c3019
8973i2974L5223A2369b05578B65556G1069a55951b5958A14074j6630m8374O494
8962E5564f6205A73590c36433O5749J27091J9776B12396k7598j9073F0822B6924
8950i2622C53725a18112l40496B40155C5537a82425k62136E2236c12111a13182
8939A99512r3709a32007o9304A65468a0190G4271J6605C6282K11698b2856q6969
8928a09825B24564h1882C1377K43640d07350a25294L9292m8771A62574K77784
8918D40358n7999p2280b12737B05042b32562Q9252B6773K13268a55264A96680
8907A11714c31255f3370m1908C9013a08147A35497d6061K1941j78147A26100b80785
$$ plain form
8895 -346875 -6956 6570 270453 -54861 -24878 -333368 -87409 98448 1205 -121190 -27014 -68403
8883 -68403 -250018 -177669 11362 -56382 15254 -53430 -67446 -4893 219358 104417 -335884
8871 -46489 -58583 59582 94358 -137019 166923 43710 99595 -64048 -526702 -49851 46936
8859 -125258 -252697 35054 -245207 113983 170504 88452 82279 -40622 -180229 182917 -247936
8847 -34582 244997 -45764 -12241 -119671 171844 298715 24493 106316 -241088 94302 -45675
$$ packed form
8895c46875f956F570K63883e4861b4878l08490h7409I8448A205a21190b7014m1389
8883f8403j81615P2349A1362e6382A5254e3430j4016d893B19358A04417c35884
8871d6489j2094E9582L4776a37019A66923D3710N5885f4048m62654d9851D6936
8859a25258j27439C5054b45207A13983N6521q2052o173d0622j39607A82917b47936
8847c4582B44997d5764a2241j07430A71844J26871B4493Q1823b41088I4302d5675
$$ [...]
##END NTUPLES=NMR SPECTRUM
##END=
