##TITLE=NES1030_18715_9268428_lwIZUFAeM2
##JCAMPDX= 6.0         $$ Bruker NMR JCAMP-DX V2.0
##DATA TYPE= NMR SPECTRUM
##DATA CLASS= NTUPLES
##ORIGIN= BRUKER
##OWNER= Administrator
$$ 1.72 TOPSPIN		Version 2.1
$$ 2015-07-10 19:09:22.878 -0700  Administrator@X
$$ Compression mode = diff/dup
##.OBSERVE FREQUENCY= 400.02188249412
##.OBSERVE NUCLEUS= ^1H
##.ACQUISITION MODE= SIMULTANEOUS (DQD)
##.ACQUISITION SCHEME= undefined
##.AVERAGES= 64
##.DIGITISER RES= 22
##SPECTROMETER/DATA SYSTEM= spect
##.PULSE SEQUENCE= noesygpps1d.comp
##.SOLVENT NAME= COFFEE_meoh
##.SHIFT REFERENCE= INTERNAL, COFFEE_meoh, 1, 14.96331
##AUDIT TRAIL= $$ (NUMBER, WHEN, WHO, WHERE, PROCESS, VERSION, WHAT)
$$ ##TITLE= Audit trail, TOPSPIN		Version 2.1
$$ ##JCAMPDX= 5.01
$$ ##ORIGIN= Bruker BioSpin GmbH
$$ ##OWNER= Administrator
$$ $$ E:\/data/COFFEE/nmr/NES1030_18715_9268428_lwIZUFAeM2/12/pdata/1/auditp.txt
$$ ##AUDIT TRAIL=  $$ (NUMBER, WHEN, WHO, WHERE, PROCESS, VERSION, WHAT)
(   1,<2015-07-10 19:09:17.503 -0700>,<Administrator>,<X>,<go>,<TOPSPIN 2.1>,
      <created by zg
	started at 2015-07-10 18:57:47.816 -0700,
	POWCHK enabled, PULCHK disabled,
       configuration hash MD5:
       21 0F 79 D6 B3 7B B4 F6 88 20 88 DB 03 48 BD 9F
       data hash MD5: 64K
       A1 AD BF 8B AA 80 3C 64 8C 1A 8A 82 2A 83 87 5A>)
(   2,<2015-07-10 19:09:20.769 -0700>,<Administrator>,<X>,<proc1d>,<TOPSPIN 2.1>,
      <Start of raw data processing
       efp LB = 0.3 FT_mod = 6 PKNL = 1 PHC0 = 0 PHC1 = 0 SI = 128K 
       data hash MD5: 128K
       9A 1D FD D3 1D 01 A2 F8 21 B7 5C 70 A2 81 8B 23>)
(   3,<2015-07-10 19:09:21.644 -0700>,<Administrator>,<X>,<proc1d>,<TOPSPIN 2.1>,
      <pk PHC0 = -85.48462 PHC1 = 0 
       data hash MD5: 128K
       52 10 01 67 88 BE 00 99 6A 8C EB DC C4 D3 22 A1>)
(   4,<2015-07-10 19:09:22.050 -0700>,<Administrator>,<X>,<proc1d>,<TOPSPIN 2.1>,
      <abs ABSG = 1 
       data hash MD5: 128K
       BD 5D 74 A9 49 34 3C 59 EE 0B 00 04 48 DB 51 25>)
(   5,<2015-07-10 19:09:22.144 -0700>,<Administrator>,<X>,<proc1d>,<TOPSPIN 2.1>,
      <abs ABSG = 2 
       data hash MD5: 128K
       5B 67 65 D0 AE A3 7B F9 46 D1 30 E1 A3 1B CA 9F>)
(   6,<2015-07-10 19:09:22.222 -0700>,<Administrator>,<X>,<proc1d>,<TOPSPIN 2.1>,
      <abs ABSG = 3 
       data hash MD5: 128K
       7E 64 8F DB C5 EF 30 8C EA 97 B0 AE 2D E1 68 24>)
(   7,<2015-07-10 19:09:22.316 -0700>,<Administrator>,<X>,<proc1d>,<TOPSPIN 2.1>,
      <abs ABSG = 4 
       data hash MD5: 128K
       4D 2F 2D 50 8E F0 DD 13 90 93 15 2C 5A C3 55 14>)
(   8,<2015-07-10 19:09:22.410 -0700>,<Administrator>,<X>,<proc1d>,<TOPSPIN 2.1>,
      <abs ABSG = 5 
       data hash MD5: 128K
       8B BA B0 7E 7D 15 34 07 62 20 15 11 4A 9B 5A B0>)
$$ ##END=
$$ 
$$ $$ hash MD5
$$ $$ 8F C4 80 BF D1 1B 89 54 71 4A 71 BF 66 29 E5 26
##$RELAX= 
##$RELAX= 
##$RELAX= 
##$RELAX= 
##$RELAX= 
##$RELAX= 
##$RELAX= 
##$RELAX= 
$$ Bruker specific parameters
$$ --------------------------
##$DU= <E:\>
##$EXPNO= 12
$$ [...]
##$TP07= 0
##$TPNAME0= <>
##$TPNAME1= <>
##$TPNAME2= <>
##$TPNAME3= <>
##$TPNAME4= <>
##$TPNAME5= <>
##$TPNAME6= <>
##$TPNAME7= <>
##$TPOAL= (0..7)
0.5 0.5 0.5 0.5 0.5 0.5 0.5 0.5
##$TPOFFS= (0..7)
0 0 0 0 0 0 0 0
##$TUNHIN= 0
##$TUNHOUT= 0
##$TUNXOUT= 0
##$USERA1= <user>
##$USERA2= <user>
##$USERA3= <user>
##$USERA4= <user>
##$USERA5= <user>
##$V9= 5
##$VALIST= <valist>
##$VCLIST= <CCCCCCCCCCCCCCC>
##$VD= 0
##$VDLIST= <DDDDDDDDDDDDDDD>
##$VPLIST= <PPPPPPPPPPPPPPP>
##$VTLIST= <TTTTTTTTTTTTTTT>
##$WBST= 2048
##$WBSW= 25
##$XGAIN= (0..3)
0 0 0 0
##$XL= 0
##$YL= 0
##$YMAX_a= 7905086
##$YMIN_a= -14575630
##$ZGOPTNS= <>
##$ZL1= 120
##$ZL2= 120
##$ZL3= 120
##$ZL4= 120
##$ABSF1= 14.96331
##$ABSF2= -5.594872
##$ABSG= 5
##$ABSL= 3
##$ALPHA= 0
##$AQORDER= 0
##$ASSFAC= 0
##$ASSFACI= 0
##$ASSFACX= 0
##$ASSWID= 0
##$AUNMP= <proc_prof1d_extract.lims>
##$AXLEFT= 0
##$AXNAME= <>
##$AXNUC= <1H>
##$AXRIGHT= 0
##$AXTYPE= 0
##$AXUNIT= <>
##$AZFE= 0.1
##$AZFW= 0.1
##$BCFW= 0
##$BC_mod= 0
##$BYTORDP= 0
##$COROFFS= 0
##$CY= 15
##$DATMOD= 1
##$DC= 0
##$DFILT= <>
##$DTYPP= 0
##$F1P= 0
##$F2P= 0
##$FCOR= 0.5
##$FTSIZE= 131072
##$FT_mod= 6
##$GAMMA= 0
##$GB= 0
##$INTBC= 1
##$INTSCL= 1
##$ISEN= 128
##$LB= 0.3
##$LEV0= 0
##$LPBIN= 0
##$MAXI= 10000
##$MC2= 0
##$MEAN= 0
##$ME_mod= 0
##$MI= 0
##$NCOEF= 0
##$NC_proc= -2
##$NLEV= 6
##$NOISF1= 0
##$NOISF2= 0
##$NSP= 0
##$NTH_PI= 0
##$NZP= 0
##$OFFSET= 14.96331
##$PC= 1
##$PHC0= -85.48462
##$PHC1= 0
##$PH_mod= 1
##$PKNL= yes
##$PPARMOD= 0
##$PPDIAG= 0
##$PPIPTYP= 0
##$PPMPNUM= 2147483647
##$PPRESOL= 1
##$PSCAL= 4
##$PSIGN= 0
##$PYNMP= <proc.py>
##$REVERSE= no
##$SF= 400.020008713254
##$SI= 131072
##$SIGF1= 0
##$SIGF2= 0
##$SINO= 400
##$SIOLD= 131072
##$SPECTYP= <>
##$SREGLST= <1H.CDCl3>
##$SSB= 0
##$STSI= 131072
##$STSR= 0
##$SW_p= 8223.68421052631
##$SYMM= 0
##$S_DEV= 0
##$TDeff= 65536
##$TDoff= 0
##$TI= <>
##$TILT= no
##$TM1= 0
##$TM2= 0
##$TOPLEV= 0
##$USERP1= <user>
##$USERP2= <user>
##$USERP3= <user>
##$USERP4= <user>
##$USERP5= <user>
##$WDW= 1
##$XDIM= 131072
##$YMAX_p= 402370830
##$YMIN_p= -10749
##$CURPLOT= <Network HP LaserJet P1505>
##$CURPRIN= <$Network HP LaserJet P1505>
##$DFORMAT= <normdp>
##$LAYOUT= <+/1D_H.xwp>
##$LFORMAT= <normlp>
##$PFORMAT= <normpl>
##$SURQMSG= 1
$$ End of Bruker specific parameters
$$ ---------------------------------
##NTUPLES= NMR SPECTRUM
##VAR_NAME=  FREQUENCY,     SPECTRUM/REAL,   SPECTRUM/IMAG
##SYMBOL=    X,             R,               I
##VAR_TYPE=  INDEPENDENT,   DEPENDENT,       DEPENDENT
##VAR_FORM=  AFFN,          ASDF,            ASDF
##VAR_DIM=   131072,        131072,          131072
##UNITS=     HZ,            ARBITRARY UNITS, ARBITRARY UNITS
##FACTOR=    0.0627417313425164, 1,          1
##FIRST=     8223.62146879497, 930,          -61279
##LAST=      0,             3701,            -60653
##MIN=       0,             -10749,          0
##MAX=       8223.62146879497, 402370830,    0
$$ Real data points
##PAGE= N=1
##DATA TABLE= (X++(R..R)), XYDATA
$$ [...]
61137D58722m696l326k268k033k081j708r00J95J889M292O685Q374R606J0878
61123D83629J1812J1637J0366Q558O189K762j454n317q086j0013j1417j1944j1225
61110D75497r739q451p781p312o451n153l955l382l360l292k742j906j271r29
61096D09773m94L86J574K529K777K378J921J958K443K898L122L384L886M436M813
61081D47784N064N235N250N227N524O160O666O811O974P411P680P408P123P599
61067E37916Q679R451R494R180Q792Q109O985N798N030M747M746M930N325N844
61053F35026O164N993N565N636O723Q436J0034J1483J3277J5194J6264J6335J6655
61040G72785J8203K0321K1836K2787K4008K5641K7274K9062L1512L4359L6794
$$ plain form
61137 458722 454026 450700 448432 446399 444318 442610 441710 441905 443794 448086 454771 463145 472751 483629
61123 483629 495441 507078 517444 526002 532191 534953 533499 528182 520096 510083 498666 486722 475497
61110 475497 465758 457307 449526 442214 435763 430610 426655 423273 419913 416621 413879 411973 410702 409773
61096 409773 409279 409665 411239 413768 416545 418923 420844 422802 425245 428143 431265 434649 438535 442971 447784
61081 447784 452848 458083 463333 468560 474084 480244 486910 493721 500695 508106 515786 523194 530317 537916
61067 537916 546595 556046 565540 574720 583512 591621 598606 604404 609434 614181 618927 623857 629182 635026
61053 635026 641190 647183 652748 658384 665107 673543 683577 695060 708337 723531 739795 756130 772785
61040 772785 790988 811309 833145 855932 879940 905581 932855 961917 993429 1027788 1064582
61029A064582L8703M0691M2933M5058M7090M9458N2133N4723N7402O0675O4259
61018A617707O7265O9669P2531P6675Q2230Q9601R9673J12702J27962J44833J63339
61007B724187J83426K04916K28699K57150K93158L39699M00393M78976N77677
60998E688281O97284Q39564J008525J208591J442295J710192K011433K340825
60990A6946990K678806K974767L135601L043508K616290J881047R98288J99568
60982C4474865l23819m99329l74837p3774K42740L98388K42595k79599j076643
60973C2730587j938154k638123l040538l134446k993312k711851k368325k016997
60965A1888841j690963j405089j161621r57904p90354o53881n42320m51262l78847
$$ plain form
61029 1064582 1103285 1143976 1186909 1231967 1279057 1328515 1380648 1435371 1492773 1553448 1617707
61018 1617707 1684972 1754641 1827172 1903847 1986077 2075678 2175351 2288053 2416015 2560848 2724187
61007 2724187 2907613 3112529 3341228 3598378 3891536 4231235 4631628 5110604 5688281
60998 5688281 6385565 7225129 8233654 9442245 10884540 12594732 14606165 16946990
60990 16946990 19625796 22600563 25736164 28779672 31395962 33277009 34275297 34474865
60982 34474865 34151046 33651717 33276880 33203106 33445846 33844234 34086829 33807230 32730587
60973 32730587 30792433 28154310 25113772 21979326 18986014 16274163 13905838 11888841
60965 11888841 10197878 8792789 7631168 6673264 5882910 5229029 4686709 4235447 3856600
60956C856600l23135k80373k46534k18999j95904j75335j56184j38760j23532
60947A997844j09897r6870q4339p3000o3553n6518n2210n0382n0065n0084m9552
60936A261374m7966m5497m3133m1742m0844l9095l6179l3299l1487l0354k9002
60925H42776k7398k6076k5101k4023k2660k1284k0263j9702j9284j8374j6651
60914F01960j4777j3825j3885j3840j2815j1212r975r378r042q594p851o776n722
60901D64268n318n624n773m958l439k142j540j446j557j665j528j040m89k20j32
60886D27397K04R52J832K472K729K680K493K261J978J665J436J203N53o87j827
60871D47341j926j028j50P9R6M85J084J465J643J846K064K369L163M527N787O296
$$ plain form
60956 3856600 3533465 3253092 3006558 2787559 2591655 2416320 2260136 2121376 1997844
60947 1997844 1887947 1791077 1706738 1633738 1570185 1513667 1461457 1411075 1361010 1310926 1261374
60936 1261374 1213408 1167911 1124778 1083036 1042192 1003097 966918 933619 902132 871778 842776
60925 842776 815378 789302 764201 740178 717518 696234 675971 656269 636985 618611 601960
60914 601960 587183 573358 559473 545633 532818 521606 511631 502253 493211 484617 476766 469990 464268
60901 464268 458950 453326 447553 442595 439156 437014 435474 434028 432471 430806 429278 428238 427749 427529 427397
60886 427397 427601 428553 430385 432857 435586 438266 440759 443020 444998 446663 448099 449302 449855 449168 447341
60871 447341 445415 444387 444237 444316 444412 444897 445981 447446 449089 450935 452999 455368 458531 463058 468845 475141
60855D75141O260O184N924M998L551K242J330N55j22l30N7N69N92j62j516k907
60839E02366l715l888m008m414m581l965l034k736l128l401l228l155l486l654
60825D51973l133k292j831j831j907j935k107k387k431k035j411r81r60j132r83
60810D24617k73O06R83P15K88J06L6j45k53j5L58L63r6n57n99l26j08p9q4k8j2
60789D25497m7J51P92J483J481O40k50l39J58K61m91j477j865j673j628k232l204
60772D17257l822l616k732j807j451j768k273k279j481k36O24N18k76q74p87m09
60756C94588k84k29L07J161J496R60J22n40j388k791m190m754m639m734n181n105
60740C64799l949k295j013k62J62Q9o61j599j998j899j959k308k321j700j146
$$ plain form
60855 475141 481401 487585 493509 498507 502058 504300 505630 506185 506063 505733 505790 506359 506951 506789 505273 502366
60839 502366 498651 494763 490755 486341 481760 477795 474761 472025 468897 465496 462268 459113 455627 451973
60825 451973 448840 446548 444717 442886 440979 439044 436937 434550 432119 430084 428673 427692 426732 425600 424617
60810 424617 424344 424950 425933 426648 426936 427042 427078 426933 426680 426665 427023 427386 427290 426733 426134 425808 425700 425621 425537 425509 425497
60789 425497 425450 425601 426393 427876 429357 429997 429747 429408 429566 429827 429336 427859 425994 424321 422693 420461 417257
60772 417257 413435 409819 407087 405280 403829 402061 399788 397509 396028 395792 396416 396934 396658 395784 394997 394588
60756 394588 394304 394075 394382 395543 397039 397999 398121 397581 396193 393402 389212 384458 379819 375085 369904 364799
60740 364799 360850 358555 357542 357280 357442 357531 356870 355271 353273 351374 349415 347107 344786 343086 341940
60725C41940j447k404l148l281l125l049l078l133l225l264l045k580k184k085
60711C02892k136k019j641j108n87k01qQ6K92O66J044J306J595K119K864L597
60695C08761M187M665N045N203N026M617M273M204M335M402M274M077L973L927
60681C70969L823L648L407K902J936P31j04k13J27M29O01R00J379J670J394O62
60665C94261L8K1O01J334J806J959J902J617J069N44M55P50P86P0j099k028k465
60648D01621k692k906k940k685k390k233j895r00O51K063K827L138L437L705L543
60633D02344K878K205K008K294K754L111L126K570J562O72L35K97J3o06j225j710
60617D22628k102k172j597p32m32q14r21j2J409K426K998L673M432M713M438M157
$$ plain form
60725 341940 340493 338089 334941 331660 328535 325486 322408 319275 316050 312786 309741 307161 304977 302892
60711 302892 300756 298737 297096 295988 295401 295200 295192 295278 295570 296236 297280 298586 300181 302300 305164 308761
60695 308761 312948 317613 322658 327861 332887 337504 341777 345981 350316 354718 358992 363069 367042 370969
60681 370969 374792 378440 381847 384749 386685 387416 387312 387099 387226 387655 388256 389156 390535 392205 393599 394261
60665 394261 394299 394320 394921 396255 398061 400020 401922 403539 404608 405152 405607 406357 407143 407213 406114 404086 401621
60648 401621 398929 396023 393083 390398 388008 385775 383880 382980 383631 385694 388521 391659 395096 398801 402344
60633 402344 405222 407427 409435 411729 414483 417594 420720 423290 424852 425524 425859 426156 426169 425563 424338 422628
60617 422628 420526 418354 416757 416025 415593 414779 413858 413846 415255 417681 420679 424352 428784 433497 437935 442092
60601D42092M123L971L467K859K235J257j71j588k745m033n619o738o649n878
60587D26583n558n703n155l464j796j429k099k583k406k113k065j917j386p92
60573C88117m86l54j86j11k19k51l5Q1k85q71j075p13j4Q89J887K534K408J826
60555C93142J538J618J386N80j26j21K88M56L14K06K41L82Q20J673K529K934L111
60538D10971L718M948O420P810R120J0371J1653J3364J5876J8831K1390K3232
60526E57704K4716K5868K5854K3882K0145J5428J0211M650q25n513r037j1467
60514F81616j2923j3481j3472j3435j3485j3099j1777r728p624n800m008j992
60502E60792N5J808L404N398Q084J1086J3794J6044J8108K0006K1133K0763J8823
$$ plain form
60601 442092 446215 450186 453653 456512 458747 460004 459833 458245 455500 451467 445848 439110 432461 426583
60587 426583 421025 415322 410167 406703 404907 403478 401379 398796 396390 394277 392212 390295 388909 388117
60573 388117 387631 387277 387091 386980 386761 386510 386475 386556 386271 385400 384325 383612 383598 384487 386374 388908 391316 393142
60555 393142 394680 396298 397684 398264 398138 398017 398305 398761 399075 399281 399522 399904 400724 402397 404926 407860 410971
60538 410971 414689 419637 426057 433867 442987 453358 465011 478375 494251 513082 534472 557704
60526 557704 582420 608288 634142 658024 678169 693597 703808 708458 707633 702120 693083 681616
60514 681616 668693 655212 641740 628305 614820 601721 589944 580216 572592 566792 562784 560792
60502 560792 560847 562655 566059 571457 579541 590627 604421 620465 638573 658579 679712 700475 719298
60489G19298J5944J2767R554O513M170L064L272M560O907J0422J4686J8762K2176
60476H52095K5492K9514L4287L9424M5104N2086O0712P0635Q1650R4152J08412
60465A493563J23825J39205J53325J64715J71186J70167J59535J38172J06182
60456B819875O5119J8001l1349p8980j21053j54064j75729j85899j86248j79082
60446A790591j66649j51208j34897j19079j04152r0234p7730o7043n8030n0205
60436G71364m3334l7533l2719k8500k4680k1613j9652j8401j6980j5030j3103
60425D99819j1863j1238j0658r774q630p330o005m940m270l644k699j705j163
60412D15900q74k26O23P34j25q31l07J166K574L490M087M456M699N205O095O721
$$ plain form
60489 719298 735242 748009 757563 764076 768246 771310 774582 779142 786049 796471 811157 829919 852095
60476 852095 877587 907101 941388 980812 1025916 1078002 1138714 1209349 1290999 1385151 1493563
60465 1493563 1617388 1756593 1909918 2074633 2245819 2415986 2575521 2713693 2819875
60456 2819875 2884994 2902995 2871646 2792666 2671613 2517549 2341820 2155921 1969673 1790591
60446 1790591 1623942 1472734 1337837 1218758 1114606 1024372 946642 879599 821569 771364
60436 771364 728030 690497 657778 629278 604598 582985 563333 544932 527952 512922 499819
60425 499819 487956 476718 466060 456286 447656 440326 434321 429381 425111 421467 418768 417063 415900
60412 415900 415026 414800 415423 416157 416032 415201 414894 416060 418634 422124 426211 430667 435366 440571 446666 453387
60396D53387O508N912N700N602M723L115J909J783K239K545K559K346J815J074
60382E01217N08J69k94q20p61R7R48R43K56l33n37o91j057j459j536j109l00M64
60364D95705P51N56K84L07P17J451K328K904K766K104J552J363J184P82M37L74
60348E15565K99q3n36o30l63q6r0n08j309k091k243j653r00n04l13N0N78J087
60330E06270J616K147K237J488K10r03j593k102k577k913l056l041k819k437k232
60315D90295k423k654k383j674j127j039j141j188j280j464j492j237j020j223
60301D68950j820k454k889l149l305l328l114k596j850j153q43r98j241r60N1
60286D39301J211J635J117M13L12O78Q12N23L27O09J197J877K675L403L551L002
$$ plain form
60396 453387 459895 465807 471507 477109 481832 484947 486856 488639 490878 493423 495982 498328 500143 501217
60382 501217 501725 501894 501600 500780 500019 500116 501064 502007 502263 501930 501393 500702 499645 498186 496650 495541 495241 495705
60364 495705 496456 497012 497296 497603 498320 499771 502099 505003 507769 509873 511425 512788 513972 514754 515191 515565
60348 515565 515864 515781 515245 514615 514252 514166 514076 513568 512259 510168 507925 506272 505372 504868 504555 504605 505183 506270
60330 506270 507886 510033 512270 513758 513968 513065 511472 509370 506793 503880 500824 497783 494964 492527 490295
60315 490295 487872 485218 482835 481161 480034 478995 477854 476666 475386 473922 472430 471193 470173 468950
60301 468950 467130 464676 461787 458638 455333 452005 448891 446295 444445 443292 442449 441451 440210 439250 439301
60286 439301 440512 442147 443264 443677 443989 444667 445479 446002 446329 446938 448135 450012 452687 456090 459641 462643
60270D62643K362K149K165K116K297L069M064M651M913N443O300O919P030P030
60256E23151P263P534P519P243P012P188Q082R665J1365J2534J3216J4069J5494
60243F51335J7163J8587J9815K1407K3856K7077L0435L3359L6030L9198M3161
60232I61423M7336N1192N5110N9622O4180O7595O9545P0741P1507P1123O8937
60221A658311O5255O0689N5259M8651M0883L2315K3403J4761O932k36p419j4585
60209A984219k0632k4694k7231k9045k9849k8779k5924k2233j7934j2169m524
60198A741205L965J1842J8734K5342L2413M0196M8554N6968O4502P0270P4116
60187B188107P6487P7521P6505P2617O6089N8289N0387M2140L2403K0721Q066
$$ plain form
60270 462643 465005 467154 469319 471435 473732 476801 480865 485516 490429 495872 502172 509091 516121 523151
60256 523151 530414 537948 545467 552710 559722 566910 574992 584657 596022 608556 621772 635841 651335
60243 651335 668498 687085 706900 728307 752163 779240 809675 843034 879064 918262 961423
60232 961423 1008759 1059951 1115061 1174683 1238863 1306458 1376003 1446744 1518251 1589374 1658311
60221 1658311 1723566 1784255 1839514 1888165 1929048 1961363 1984766 1999527 2006459 2006223 1998804 1984219
60209 1984219 1963587 1938893 1911662 1882617 1852768 1823989 1798065 1775832 1757898 1745729 1741205
60198 1741205 1745170 1757012 1775746 1801088 1833501 1873697 1922251 1979219 2043721 2113991 2188107
60187 2188107 2264594 2342115 2418620 2491237 2557326 2615615 2666002 2708142 2740545 2761266 2769332
60176B769332m080j4898k4383l2871m0767m8250n4702n8776n9638n7947n4965
60165B318055n0938m5189l7778k9990k2765j5538p220K189J1662K0356K8110L4977
60153B205931M0861M5417M7870M7271M3593L8268L2785K6872J9019Q868j845j1083
60141B543827j8332k4143k8604l1174l1573l0039k6757k1698j4996o979K177J2395
60129B324104K3371L4700M6286N8260P0583Q3123R6025J09478J23117J36128J48138
60118C253313J59529J70712J81427J90864J98149K02582K03712K01387J95557
60109D957232J85999J72500J55233J34656J11099Q4934N7052K8566o1k8989n7887
60098E800334q5513j10613j32733j51699j66939j77889j84523j87019j85288j79424
$$ plain form
60176 2769332 2765252 2750354 2725971 2693100 2652333 2604083 2549381 2490605 2430967 2373020 2318055
60165 2318055 2267117 2221928 2184150 2154160 2131395 2115857 2108637 2110826 2122488 2142844 2170954 2205931
60153 2205931 2246792 2292209 2340079 2387350 2430943 2469211 2501996 2528868 2547887 2556755 2554910 2543827
60141 2543827 2525495 2501352 2472748 2441574 2410001 2379962 2353205 2331507 2316511 2309532 2311709 2324104
60129 2324104 2347475 2382175 2428461 2486721 2557304 2640427 2736452 2845930 2969047 3105175 3253313
60118 3253313 3412842 3583554 3764981 3955845 4153994 4356576 4560288 4761675 4957232
60109 4957232 5143231 5315731 5470964 5605620 5716719 5801653 5858705 5887271 5887210 5858221 5800334
60098 5800334 5714821 5604208 5471475 5319776 5152837 4974948 4790425 4603406 4418118 4238694
60088D238694j70195j58450j44318j27658j09033q9560o9918n0197l0664j1991
60078C276710N291K1049L5202M7513N7628O4916O8478O7901O3914N7607M9210
60067C815419L8320K5218J1083l222j7670l2186m6058n8661p0006q0197q8826
60056C493214r5428j00020j02833j03917j03307j01090r7070r0950q3137p4736
60046B540726o6242n6958m6162l4270k2208j0272J610J3161K4114L4882M5865
60035B424246N6307O4909P1472P6858Q1284Q3599Q2565P8088P0850O1455N0256
60024C201889L7473K3162P535q514k3774l7813n1009o3301p3609q1003q5670q8166
60012B757200q8363q5912q1302p5521o8901o1084n2016m2186l1964k1413j0845
$$ plain form
60088 4238694 4068499 3910049 3765731 3638073 3529040 3439480 3369562 3319365 3288701 3276710
60078 3276710 3282001 3303050 3338252 3385765 3443393 3508309 3576787 3644688 3708602 3766209 3815419
60067 3815419 3853739 3878957 3890040 3886818 3869148 3836962 3790904 3732243 3662237 3582040 3493214
60056 3493214 3397786 3297766 3194933 3091016 2987709 2886619 2789549 2698599 2615462 2540726
60046 2540726 2474484 2417526 2371364 2337094 2314886 2304614 2306224 2319385 2343499 2378381 2424246
60035 2424246 2480553 2545462 2616934 2693792 2775076 2858675 2941240 3019328 3090178 3151633 3201889
60024 3201889 3239362 3262524 3270059 3261545 3237771 3199958 3148949 3085648 3012039 2931036 2845366 2757200
60012 2757200 2668837 2582925 2501623 2426102 2357201 2296117 2244101 2201915 2169951 2148538 2137693
60001B137693o98R306K0134L2193M4723N6817O8502Q0236R1821J02381J11201
59990B754309J17893J21837J22084J18047J10041R8978Q5744P0840N4377L6418
59980C690568J7488j392j9416l6536n2925o7963q0323q9229r5049r8495r9533
59969C067195r7575r2364q4351p4301o2972n1003l8758k6303j3795j715R610K0500
59957B554168L1358M1616N0055N6319O1422O6164O9614P0050O7233O2758N8019
59946C188776N2699M5782L7366K8611K0320J2555N581J48l547o247q282q474n225
59933C360063J610J0861K1834L4924N0421O7768Q6440J06538J27787J48790J68226
59922D185262J86295K03745K19774K32040K38789K39785K34803K22480K01553
$$ plain form
60001 2137693 2136995 2146301 2166435 2198628 2243351 2300168 2368670 2448906 2540727 2643108 2754309
59990 2754309 2872202 2994039 3116123 3234170 3344211 3443189 3528933 3599773 3654150 3690568
59980 3690568 3708056 3706664 3687248 3650712 3597787 3529824 3449501 3360272 3265223 3166728 3067195
59969 3067195 2969620 2877256 2792905 2718604 2655632 2604629 2565871 2539568 2525773 2524058 2533668 2554168
59957 2554168 2585526 2627142 2677197 2733516 2794938 2861102 2930716 3000766 3067999 3130757 3188776
59946 3188776 3241475 3287257 3324623 3353234 3373554 3386109 3391690 3391838 3388291 3382044 3373762 3365288 3360063
59933 3360063 3361673 3372534 3394368 3429292 3479713 3547481 3633921 3740459 3868246 4017036 4185262
59922 4185262 4371557 4575302 4795076 5027116 5265905 5505690 5740493 5962973 6164526
59913F164526J72426J36515R4649M7393l050n2588r7578j36743j70203j97266
59903E958081k16066k25396k26134k20500k10296j96209j78583j58321j36827
59894D189749j15268r4067p3097n2287l1891j2169P051K6196M5271O3575Q0329
59883D033392R5241J08086J17977J23694J24804J21841J15047J03550Q6370O3941
59873E093943L8044J0424j7968m6370p3600r8325j19685j37350j51233j61282
59863D336598j67430j69574j67732j62361j54412j44868j34211j22380j09246
59854C004384r5184q1118o8017n6381m6283l7833l1217k6293k2549j9649j7702
59843B502158j6718j6200j5667j5249j5378j6244j8049k1390k6462l2079l6274
$$ plain form
59913 6164526 6336952 6473467 6568116 6615509 6612459 6559871 6462293 6325550 6155347 5958081
59903 5958081 5742015 5516619 5290485 5069985 4859689 4663480 4484897 4326576 4189749
59894 4189749 4074481 3980414 3907317 3855030 3823139 3810970 3818021 3844217 3889488 3953063 4033392
59883 4033392 4128633 4236719 4354696 4478390 4603194 4725035 4840082 4943632 5030002 5093943
59873 5093943 5131987 5142411 5124443 5078073 5004473 4906148 4786463 4649113 4497880 4336598
59863 4336598 4169168 3999594 3831862 3669501 3515089 3370221 3236010 3113630 3004384
59854 3004384 2909200 2828082 2760065 2703684 2657401 2619568 2588351 2562058 2539509 2519860 2502158
59843 2502158 2485440 2469240 2453573 2438324 2422946 2406702 2388653 2367263 2340801 2308722 2272448
59832B272448l7953l7274l4576k9955k4119j8606j4592j2059j0542r841r422q014
59820B025495m689P9N182J0215J5241J9669K2442K3242K2613K0877J7806J3506
59808B191678Q777M336L76k808m409l854j411K323P230J3477K0886K9073L8155
59795B303829M8817O1615P6472R2964J10882J30324J51231J72777J93238K10458
59785C552607K22404K27024K21638K03007J68757J19347N8844o037o7813j19936
59775D579842j57951j80260j88181j84974j74235j58776j40580j21253j02079
59766C171553q3874o7193n2649m0615l0567k1324j2295m165K091O664J0968J6241
59754B894835K2433K8528L3784L8548M3910N0610N8331O6304P4493Q3834R5090
$$ plain form
59832 2272448 2234495 2197221 2162645 2132690 2108571 2089965 2075373 2063314 2052772 2042931 2033509 2025495
59820 2025495 2020806 2020885 2026067 2036282 2051523 2071192 2093634 2116876 2139489 2160366 2178172 2191678
59808 2191678 2200455 2204791 2205167 2202359 2197950 2194096 2192685 2195008 2202238 2215715 2236601 2265674 2303829
59795 2303829 2352646 2414261 2490733 2583697 2694579 2824903 2976134 3148911 3342149 3552607
59785 3552607 3775011 4002035 4223673 4426680 4595437 4714784 4773628 4767591 4699778 4579842
59775 4579842 4421891 4241631 4053450 3868476 3694241 3535465 3394885 3273632 3171553
59766 3171553 3087679 3020486 2967837 2927222 2896655 2875331 2863036 2858871 2860962 2867626 2878594 2894835
59754 2894835 2917268 2945796 2979580 3018128 3062038 3112648 3170979 3237283 3311776 3395610 3490700
59743C490700J07976J21700J35968J50963J66697J83117K00699K20107K41041
59734E018968K62022K81669K99608L15637L28407L35615L35541L28070L14207
59725G819744K95031K71455K44859K17640J92922J73656J61831J58189J62279
59716I697606J72676J87495K04969K23568K41566K56876K67617K72594K70891
59707A1795858K61375K43266K17271J85538J50355J13345P6010M0324Q253j8958
59697A3072637m0464n5074o1465n9177m8866l1445p267K3668O0968J03556J50018
59686A3107089J99066K49610L00510L50275L97026M38676M72994M97474N09276
59677A6521996N05541M83890M42714L81300L00165K01620R0110k8186j46354k57775
$$ plain form
59743 3490700 3598676 3720376 3856344 4007307 4174004 4357121 4557820 4777927 5018968
59734 5018968 5280990 5562659 5862267 6177904 6506311 6841926 7177467 7505537 7819744
59725 7819744 8114775 8386230 8631089 8848729 9041651 9215307 9377138 9535327 9697606
59716 9697606 9870282 10057777 10262746 10486314 10727880 10984756 11252373 11524967 11795858
59707 11795858 12057233 12300499 12517770 12703308 12853663 12967008 13043018 13083342 13091595 13072637
59697 13072637 13032173 12977099 12915634 12856457 12807591 12776146 12768879 12792547 12853515 12957071 13107089
59686 13107089 13306155 13555765 13856275 14206550 14603576 15042252 15515246 16012720 16521996
59677 16521996 17027537 17511427 17954141 18335441 18635606 18837226 18927336 18899150 18752796 18495021
59667A8495021l56608m38031m98708n37618n56345n58418n48349n31291n13162
59658A3956491n00090m96695n04395n21012n41777n60886n73041n74804n65396
59649I118395n46390n20433m90031m57145m23414l90325l58967l29737l02484
59640E299469k76882k52715k29945k08701j89266j71783j55940j41074j26748
59631C546415j13082j00349q8487p7276o6854n7632m9687m2559l5800k9486k4083
59620B861120k0118j7963j7605j8368j9288k0120k1785k5371l0744l6469m1081
59609B592208m4152m6139m7598m8688m9172m8682m7075m4555m1409l7666l3197
59598B103875k8120k2775j7292j1574n830p37L251O474R628J2869J5752J7846
$$ plain form
59667 18495021 18138413 17700382 17201674 16664056 16107711 15549293 15000944 14469653 13956491
59658 13956491 13456401 12959706 12455311 11934299 11392522 10831636 10258595 9683791 9118395
59649 9118395 8572005 8051572 7561541 7104396 6680982 6290657 5931690 5601953 5299469
59640 5299469 5022587 4769872 4539927 4331226 4141960 3970177 3814237 3673163 3546415
59631 3546415 3433333 3332984 3244497 3167221 3100367 3042735 2993048 2950489 2914689 2885203 2861120
59620 2861120 2841002 2823039 2805434 2787066 2767778 2747658 2725873 2700502 2669758 2633289 2592208
59609 2592208 2548056 2501917 2454319 2405631 2356459 2307777 2260702 2216147 2174738 2137072 2103875
59598 2103875 2075755 2052980 2035688 2024114 2018284 2017547 2020798 2027272 2036900 2049769 2065521 2083367
59586B083367J9022J9146J8030J5768J2838R754O941M947M359N204O816Q614J0834
59573B225640J4216J9112K5173L1754L8367M4957N1946N9853O8627P7507Q5848
59562B743000R3775J01724J09701J17457J25093J32680J39433J44149J46598J47637
59552D001247J47629J45620J40642J33207J24649J15296J03916Q8921O9655M6853
59542E117635K2445j130k2087m0006n5319o8265p8706q6580r1973r4702r4377
59531D506935r0843q4173p4300o1214m5489k8053r260J1258L3623N7124Q0815
59520D296423J04218J26967J48045J65804J78679J85678J86230J79705J65109
59511E736858J41451J08803O8998K4911k1094o7498j12409j52794j85661k09731
$$ plain form
59586 2083367 2102389 2121535 2139565 2155333 2168171 2177925 2184866 2189813 2194172 2199376 2206192 2214806 2225640
59573 2225640 2239856 2258968 2284141 2315895 2354262 2399219 2451165 2511018 2579645 2657152 2743000
59562 2743000 2836775 2938499 3048200 3165657 3290750 3423430 3562863 3707012 3853610 4001247
59552 4001247 4148876 4294496 4435138 4568345 4692994 4808290 4912206 5001127 5070782 5117635
59542 5117635 5140080 5138950 5116863 5076857 5021538 4953273 4874567 4787987 4696014 4601312 4506935
59531 4506935 4416092 4331919 4257619 4196405 4150916 4122863 4113603 4124861 4158484 4215608 4296423
59520 4296423 4400641 4527608 4675653 4841457 5020136 5205814 5392044 5571749 5736858
59511 5736858 5878309 5987112 6056110 6081021 6059927 5992429 5880020 5727226 5541565 5331834
59501E331834k25365k33138k33261k26367k14011j97931j79244j58714j37431
59492C526372j16690r7243p8994o1500m4456k7748j1365M531J9647L4000M8141
59481C194695O2602P7050R0293J01194J09361J14804J17283J16305J11559J02899
59471D198045R0121P3183N2667K9555M500k2136m9433p5596r8887j18510j34342
59460C949167j46252j54166j58463j59665j57873j53097j46108j38253j30261
59451B605029j21778j12386j02609r3484q5472p8257p1401o4713n8077n1403m4902
59440A720547l8998l3813k9033k4342j9729j5190j0498n624j090K564N571Q720
59428A559085J2269J5585J8086K0152K2660K5658K7972K8174K5776K1446J6469
$$ plain form
59501 5331834 5106469 4873331 4640070 4413703 4199692 4001761 3822517 3663803 3526372
59492 3526372 3409682 3312439 3233445 3171945 3127489 3099741 3088376 3092907 3112554 3146554 3194695
59481 3194695 3257297 3334347 3424640 3525834 3635195 3749999 3867282 3983587 4095146 4198045
59471 4198045 4288166 4361349 4414016 4443571 4448071 4425935 4376502 4300906 4202019 4083509 3949167
59460 3949167 3802915 3648749 3490286 3330621 3172748 3019651 2873543 2735290 2605029
59451 2605029 2483251 2370865 2268256 2174772 2089300 2011043 1939642 1874929 1816852 1765449 1720547
59440 1720547 1681549 1647736 1618703 1594361 1574632 1559442 1548944 1543320 1542230 1544794 1550365 1559085
59428 1559085 1571354 1586939 1605025 1625177 1647837 1673495 1701467 1729641 1755417 1776863 1793332
59417A793332J2207R773R716J1747J5080J9251K4397L0433L6085L9324L9082L6163
59405B076590L2329K8844K6344K5556K7206L1180L6550M2631M9412N6767O3980
59394B497389P0593P7090Q4179R1830R9732J08219J17910J28603J39464J50342
59384C565351J62051J75216J89608K04993K21943K41114K62122K83703L04865
59375E610966L25344L44882L62354L75797L83207L83326L75872L61291L40502
59366H863541L14968K86651K57552K29155K02310J77338J53860J30638J06047
59357A0722060P8746M7671J1652l0306p8096j30329j85176k40858k95054l44391
59347I555919l85248m15109m33028m39192m34527m20609l99518l73457l44488
$$ plain form
59417 1793332 1805539 1815312 1825028 1836775 1851855 1871106 1895503 1925936 1962021 2001345 2040427 2076590
59405 2076590 2108919 2137763 2164107 2189663 2216869 2248049 2284599 2327230 2376642 2433409 2497389
59394 2497389 2567982 2645072 2729251 2821081 2920813 3029032 3146942 3275545 3415009 3565351
59384 3565351 3727402 3902618 4092226 4297219 4519162 4760276 5022398 5306101 5610966
59375 5610966 5936310 6281192 6643546 7019343 7402550 7785876 8161748 8523039 8863541
59366 8863541 9178509 9465160 9722712 9951867 10154177 10331515 10485375 10616013 10722060
59357 10722060 10800806 10848477 10860129 10829823 10751727 10621398 10436222 10195364 9900310 9555919
59347 9555919 9170671 8755562 8322534 7883342 7448815 7028206 6628688 6255231 5910743
59338E910743l14377k84437k55573k28521k03895j81934j62424j45126j30057
59329D004399j17201j06198r6638q8556q2274p7790p4603p2175p0395o9460o9371
59318C079738o9559o9092o7381o4719o1938n9516n7241n4766n2117m9431m6411
59307B427567m2512l7636l2465k7897k4208k0664j6119j0177l736J951O837J2207
59295B233148J9136K7282L5567M3561N1586N9712O7324P3581P7684P8593P5304
59284B842478O7928N8241M8660M0580L3738K6953J9221J0182Pj0941k2268l3560
59272C081219m4304n3901o1784o7615p1371p3233p3376p1942o9230o5743o1898
59261B366822n7743n3153m8207m3145l8052l2872k7693k2625j7424j1704n626
$$ plain form
59338 5910743 5596366 5311929 5056356 4827835 4623940 4442006 4279582 4134456 4004399
59329 4004399 3887198 3781000 3684362 3595806 3513532 3435742 3361139 3288964 3218569 3149109 3079738
59318 3079738 3010179 2941087 2873706 2808987 2747049 2687533 2630292 2575526 2523409 2473978 2427567
59307 2427567 2385055 2347419 2314954 2287057 2262849 2242185 2226066 2215889 2212153 2214104 2220941 2233148
59295 2233148 2252284 2279566 2315133 2358694 2410280 2469992 2537316 2610897 2688581 2767174 2842478
59284 2842478 2910406 2968647 3017307 3057887 3091625 3118578 3137799 3147981 3147988 3137047 3114779 3081219
59272 3081219 3036915 2983014 2921230 2853615 2782244 2709011 2635635 2563693 2494463 2428720 2366822
59261 2366822 2309079 2255926 2207719 2164574 2126522 2093650 2065957 2043332 2025908 2014204 2008578
59250B008578jM525Q067J1129J4112J7393K1375K6017L0653L4816L8952M3860
59238B259476M9653N5781O1970O8579P6089Q4644R4115J04250J14829J26049J38536
59227C233971J52602J67575J82452J97000K11591K25972K38976K49553K57355
59218E117047K61940K62016K55894K42321K20556J90291J51970J06899N6558K217
59208F867709n4279j09808j60835k04948k41039k68230k85488k92544k90554k81416
59198D678568k66810k48218k27388k06182j85907j66984j49292j32618j16946
59189B978223j02533q9650p8159o7420n6935m7021l8498l1622k5741k0161j5127
59178B405356j1497r600q863q692r299j1307j4661j8300k1039k2649k3997k6129
$$ plain form
59250 2008578 2008577 2013102 2021169 2032298 2046410 2063803 2085178 2111195 2141848 2176664 2215616 2259476
59238 2259476 2309129 2364910 2426880 2495459 2571548 2656192 2750307 2854557 2969386 3095435 3233971
59227 3233971 3386573 3554148 3736600 3933600 4145191 4371163 4610139 4859692 5117047
59218 5117047 5378987 5641003 5896897 6139218 6359774 6550065 6702035 6808934 6865492 6867709
59208 6867709 6813430 6703622 6542787 6337839 6096800 5828570 5543082 5250538 4959984 4678568
59198 4678568 4411758 4163540 3936152 3729970 3544063 3377079 3227787 3095169 2978223
59189 2978223 2875690 2786040 2707881 2640461 2583526 2536505 2498007 2466385 2440644 2420483 2405356
59178 2405356 2393859 2384259 2375396 2366704 2357405 2346098 2331437 2313137 2292098 2269449 2245452 2219323
59166B219323k9229l2443l4663l5500l5463l5265l5119l4776l3970l2690l1003
59155A849202k8969k6793k4855k3432k2384k1304j9920j8278j6540j4764j2949
59144A619014j1138r347p445n292l029j097J06N89P49J115K114L936O391R023
59130A605689J1462J3694J5869J7894J9385K0075K0137K0068K0315K0994K1963
59119A807545K3075K4343K5771K7100K7777K7296K5511K2753J9781J7544J6619
59108B065115J6770J7352J8229J9961K2963K6913L1267L5858M0573M4875M8228
59097B388104N0741N2788N4325N5205N5805N6492N6645N5160N1910M7678M2559
59086B967412L5433K5366J2617k051j8069l4464m9589o2325p2925q1909q8627
$$ plain form
59166 2219323 2190094 2157651 2122988 2087488 2052025 2016760 1981641 1946865 1912895 1880205 1849202
59155 1849202 1820233 1793440 1768585 1745153 1722769 1701465 1681545 1663267 1646727 1631963 1619014
59144 1619014 1607876 1598529 1591084 1585792 1582763 1581666 1581772 1582361 1583110 1584225 1586339 1590275 1596666 1605689
59130 1605689 1617151 1630845 1646714 1664608 1683993 1704068 1724205 1744273 1764588 1785582 1807545
59119 1807545 1830620 1854963 1880734 1907834 1935611 1962907 1988418 2011171 2030952 2048496 2065115
59108 2065115 2081885 2099237 2117466 2137427 2160390 2187303 2218570 2254428 2295001 2339876 2388104
59097 2388104 2438845 2491633 2545958 2601163 2656968 2713460 2770105 2825265 2877175 2924853 2967412
59086 2967412 3002845 3028211 3040828 3038777 3020708 2986244 2936655 2874330 2801405 2719496 2630869
59075B630869r1858r1391q8270q3724p8525p3160o7935o2996n8612n5087n2055
59064A827256m8463m3838l8868l4045k8475k1159j2758m697L093J1947K1954L1155
59052A663102L7579M0723M0572L6642K8862J8377O472o395j9544l0843l7897m0280
59040A737370l9514l6961l2713k6642j9455j2215n507L24M456N861M295N89m170
59027A575718r333j4420j8576k0915k1338k0466j8672j5742j1773p772m777k722
59015A409212q06J224K865L666L613K677P11k020m850p377r602j1391j2429j2867
59001A362626j3451j4587j5867j6666j6818j6429j5545j4330j3057j1625r519
58990A204732o617l604j148Q87L008N227P149Q617R761J0535J0718J0357R870
$$ plain form
59075 2630869 2539011 2447620 2359350 2275626 2197101 2123941 2056006 1993010 1934398 1879311 1827256
59064 1827256 1778793 1734955 1696087 1662042 1633567 1612408 1599650 1594953 1598046 1609993 1631947 1663102
59052 1663102 1700681 1741404 1781976 1818618 1847480 1865857 1872329 1865934 1846390 1815547 1777650 1737370
59040 1737370 1697856 1660895 1628182 1601540 1582085 1569870 1564363 1564687 1569143 1575004 1579299 1579888 1575718
59027 1575718 1566385 1551965 1533389 1512474 1491136 1470670 1451998 1436256 1424483 1416711 1411934 1409212
59015 1409212 1408406 1409630 1412495 1416161 1419774 1422451 1423162 1421142 1416292 1408915 1399313 1387922 1375493 1362626
59001 1362626 1349175 1334588 1318721 1302055 1285237 1268808 1253263 1238933 1225876 1214251 1204732
58990 1204732 1198115 1194511 1193363 1194250 1197258 1202485 1209634 1218251 1228012 1238547 1249265 1259622 1269492
58977A269492R638R678R752R732R967J1155J3576J6518J8853K0299K1531K2967
58965A443158K3989K3802K2482K0673J8667J6318J3578J0607P551M671K457J136
58953A609089L20l87o78j5J308K267K265J642R46K50n14j004o21R29L475O697
58937A625969J0454J4729J9359K3870K7746L0852L3470L5870L8099M0309M2929
58926A943656M6351N0575N5457O1062O7473P4487Q1763Q9203R6916J05034J13788
58915B785765J23496J34145J45215J56196J67115J78196J89390K00736K12859
58906D293113K26316K40555K54266K66869K78949K91053L02694L12861L20870
58897F787546L26226L28132L25615L17815L03744K82149K52260K14558J70302
$$ plain form
58977 1269492 1279130 1288808 1298560 1308292 1318259 1329414 1342990 1359508 1378361 1398660 1420191 1443158
58965 1443158 1467147 1490949 1513431 1534104 1552771 1569089 1582667 1593274 1600825 1605496 1607953 1609089
58953 1609089 1609409 1609022 1608344 1608329 1609637 1611904 1614169 1615811 1616757 1617007 1616493 1615489 1614868 1615797 1619272 1625969
58937 1625969 1636423 1651152 1670511 1694381 1722127 1752979 1786449 1822319 1860418 1900727 1943656
58926 1943656 1990007 2040582 2096039 2157101 2224574 2299061 2380824 2470027 2566943 2671977 2785765
58915 2785765 2909261 3043406 3188621 3344817 3511932 3690128 3879518 4080254 4293113
58906 4293113 4519429 4759984 5014250 5281119 5560068 5851121 6153815 6466676 6787546
58897 6787546 7113772 7441904 7767519 8085334 8389078 8671227 8923487 9138045 9308347
58888I308347J20508O6057Q830m8095j01703j50233j92942k29347k59241k83059
58878H239122l01650l15578l25021l30194l31404l28752l22309l12723l01069
58869E370422k87883k72943k56352k39306k23073k07573j91806j75590j60106
58860C355790j46426j34336j23011j12271j02485r3573q4853p5925o7199n9355
58850B356356n2567m6448m0535l4631k8852k3499j8874j4962j1346p622l894o70
58838B072456J894M383P461J0990J4247J6991J9852K3468K7704L2102L6650M1698
58826B309896M7274N3052N8840O4726P0820P7234Q4168R1663R9388J07140J15329
58815C179530J24499J34585J45239J56744J69895J84917K01201K18101K35375
$$ plain form
58888 9308347 9428855 9494912 9503742 9455647 9353944 9203711 9010769 8781422 8522181 8239122
58878 8239122 7937472 7621894 7296873 6966679 6635275 6306523 5984214 5671491 5370422
58869 5370422 5082539 4809596 4553244 4313938 4090865 3883292 3691486 3515896 3355790
58860 3355790 3209364 3075028 2952017 2839746 2737261 2643688 2558835 2482910 2415711 2356356
58850 2356356 2303789 2257341 2216806 2182175 2153323 2129824 2110950 2095988 2084642 2077020 2073126 2072456
58838 2072456 2074350 2078733 2086194 2097184 2111431 2128422 2148274 2171742 2199446 2231548 2268198 2309896
58826 2309896 2357170 2410222 2469062 2533788 2604608 2681842 2766010 2857673 2957061 3064201 3179530
58815 3179530 3304029 3438614 3583853 3740597 3910492 4095409 4296610 4514711 4750086
58806D750086K52783K69904K86489L02352L16721L28354L36261L39598L36825
58797G519373L26113L06877K79964K45864K03888J53847R7622L8174k2060q0920
58787I068742j35661j83843k24722k58546k84774l02255l11254l14062l13362
58778F740263l10832l07338l03391k98852k92867k84567k73561k59849k43856
58769D165150k26651k09434j92643j76133j60155j45381j31827j18674j05513
58760B698739r2948q1474p0585n9643m8958l9107k9584j9160p511M396J5605K6147
58748B295917L6290M5305N1499N3266M9808M0975K7027Q895j1466l1458m8813
58737B517245o2289p1416p6019p6280p3226o8659o4267o0795n8049n5577n3289
$$ plain form
58806 4750086 5002869 5272773 5559262 5861614 6178335 6506689 6842950 7182548 7519373
58797 7519373 7845486 8152363 8432327 8678191 8882079 9035926 9133548 9171722 9149662 9068742
58787 9068742 8933081 8749238 8524516 8265970 7981196 7678941 7367687 7053625 6740263
58778 6740263 6429431 6122093 5818702 5519850 5226983 4942416 4668855 4409006 4165150
58769 4165150 3938499 3729065 3536422 3360289 3200134 3054753 2922926 2804252 2698739
58760 2698739 2605791 2524317 2453732 2394089 2345131 2306024 2276440 2257280 2249769 2254165 2269770 2295917
58748 2295917 2332207 2377512 2429011 2482277 2532085 2573060 2600087 2608982 2597516 2566058 2517245
58737 2517245 2454956 2383540 2307521 2231241 2158015 2089356 2025089 1964294 1906245 1850668 1797379
58726A797379n1491n0492n0248n0457n0893n1460n1934n1852n0982m9640m8293
58715A239637m6843m4662m1357l7255l3024k9060k5369k1948j8986j6623j4743
58704I09767j3108j1670j0602j0041r928j0160j0622j0875j0159q060n162k556
58692G96824o98Q69K684M762O939R313J2000J4814J7542K0193K2695K4589K5456
58679I57982K5531K5577K6277K7833K9972L2067L3451L3902L3693L3122L2169
58668A291576L0676K8373K4537J8105Q574l413j6597k9785m1790n1265n7267n9823
58656A141901n9495n6719n1931m6030m0050l4513k9485k5030k1120j7414j3626
58645G46488r998o964m637k967k016j515o24J106K871L592L498L805M965O257
$$ plain form
58726 1797379 1745888 1695396 1645148 1594691 1543798 1492338 1440404 1388552 1337570 1287930 1239637
58715 1239637 1192794 1148132 1106775 1069520 1036496 1007436 982067 960119 941133 924510 909767
58704 909767 896659 884989 874387 864346 854418 844258 833636 822761 812602 804542 799380 796824
58692 796824 796126 796995 799679 804441 811380 820693 832693 847507 865049 885242 907937 932526 957982
58679 957982 983513 1009090 1035367 1063200 1093172 1125239 1158690 1192592 1226285 1259407 1291576
58668 1291576 1322252 1350625 1375162 1393267 1401841 1398428 1381831 1352046 1310256 1258991 1201724 1141901
58656 1141901 1082406 1025687 973756 927726 887676 853163 823678 798648 777528 760114 746488
58645 746488 736490 729526 724889 721922 719906 718391 717767 718873 721744 725336 728834 732639 737604 743861
58631G43861P157Q084R455J0998J2456J4188J6458J8790K0597K2084K3929K6418
58619I34475K9373L2683L6352M0139M3700M7102N0886N5487O0795O6445P2272
58608A469709P8368Q4655R0626R5656R9543J02428J04162J04001J01087R4959
58598B425194Q5470P2605N6701L8654J9612O03j7312l2950m5512n4959o1505o4911
58586B421690o4698o0904n4243m5652l5945k5629j4775l284Q436J9553K9954M0722
58574B215225N2732O5235P6558Q5859R3184R7927R8174R1715P7101N3886K2858
58563C030454j3551n1662q7694j18418j41209j54480j58417j54737j45648j33314
58553A871324j19936j07351r6283q6555p8068p1056o5368o0297n5184m9815m4225
$$ plain form
58631 743861 751018 759102 768557 779555 792011 806199 822657 841447 862044 884128 908057 934475
58619 934475 963848 996531 1032883 1073022 1116722 1163824 1214710 1270197 1330992 1397437 1469709
58608 1469709 1548077 1632732 1723358 1819014 1918557 2020985 2125147 2229148 2330235 2425194
58598 2425194 2510664 2583269 2639970 2678624 2698236 2698839 2681527 2648577 2603065 2548106 2486601 2421690
58586 2421690 2356992 2296088 2241845 2196193 2160248 2134619 2119844 2116560 2124996 2144549 2174503 2215225
58574 2215225 2267957 2333192 2409750 2495609 2588793 2686720 2784894 2876609 2953710 3007596 3030454
58563 3030454 3016903 2965241 2877547 2759129 2617920 2463440 2305023 2150286 2004638 1871324
58553 1871324 1751388 1644037 1547754 1461199 1383131 1312075 1246707 1186410 1131226 1081411 1037186
58542A037186l8743l4098l0787k8351k5887k3229k0896j9094j7588j6354j5435
58531G66724j4292j2334j0125q913q865q836q090p003n907m472k757j625j325
58518F72180p90R44L450N767P754R773J1775J3525J5181J6968J8734K0430K2487
58505H18178K5247K8504L2123L6452M1616M7088N2499N8227O4521P0600P5272
58494A350327P7797P7607P3886O6277N5534M2740K8383J2918k507j6848l0289
58483A735825m3566n6384o7369p5351p9952q1134p9143p4862o9373o3111n6078
58472I89502m8894m2839l8589l5461l2271k8602k4985k1992j9500j6902j3965
58461F65502j1188r149p792o696n818n335m922l960k569j640j540j537q56K47
$$ plain form
58542 1037186 998443 964345 933558 905207 879320 856091 835195 816101 798513 782159 766724
58531 766724 752432 740098 729973 721060 712195 703359 695269 688266 682359 677887 675130 673505 672180
58518 672180 671390 672334 675784 681551 689305 699078 710853 724378 739559 756527 775261 795691 818178
58505 818178 843425 871929 904052 940504 982120 1029208 1081707 1139934 1204455 1275055 1350327
58494 1350327 1428124 1505731 1579617 1645894 1701428 1744168 1772551 1785469 1782962 1766114 1735825
58483 1735825 1692259 1635875 1568506 1493155 1413203 1332069 1252926 1178064 1108691 1045580 989502
58472 989502 940608 897769 859180 823719 791448 762846 737861 715869 696369 679467 665502
58461 665502 654314 645165 637373 630677 624859 619524 614602 610642 608073 606433 604893 603356 602500 602747
58447F02747R40P99M5p16p20M05K006K903K727K206J941J680J080L04n62j772
58431F16013l094l582k795j514o59k29J50N03R74K055L660M818N087N360O349
58416F33096P265P183O808P391Q454Q205O056L351J479M41m62j513k421k734k253
58401F80346j413j111j652k257k072j417j249j759k213k039j350n61n4r7n74r29
58385F59599q47o40o05m59O9O80J141J907L360M929N744N835N873O149O502O937
58369G06174P484P768P436O821O526O640O903P279P851Q529R322J0347J1182J0979
58355H21241R718Q516Q056P682O850O226O280N950M234K174J654K810M185N004
58341I00580N639O211O369O416P151Q530R739J0551J1419J2305J2689J2711J3137
$$ plain form
58447 602747 603687 604486 604531 603815 603095 603500 605506 608409 611136 613342 615283 616963 618043 618347 617785 616013
58431 616013 612919 609337 606542 605028 604369 604140 604290 604793 605767 607822 611482 616300 621387 626747 633096
58416 633096 640361 647544 654352 661743 670197 678402 684458 687809 689288 689729 689267 687754 685333 682599 680346
58401 680346 678933 677822 676170 673913 671841 670424 669175 667416 665203 663164 661814 661253 661199 661102 660528 659599
58385 659599 658752 658112 657507 657048 657117 657797 658938 660845 664205 669134 674878 680713 686586 692735 699237 706174
58369 706174 713658 721426 728862 735683 742209 748849 755752 763031 770882 779411 788733 799080 810262 821241
58355 821241 830959 839475 847531 855213 862063 868289 874569 880519 884753 886927 888581 891391 895576 900580
58341 900580 906219 912430 918799 925215 932366 940896 950635 961186 972605 984910 997599 1010310 1023447
58328A023447J4119J5055J5628J6009J6221J6317J6935J8498K0034K0047J8431
58317A210741J6468J5001J3821J2719J1964J1658J1648J2041J2958J4003J4842
58306A357864J5969J7947K0313K2232K3760K5412K7090K8575L0368L2786L4987
58295A637303L6435L8473M2647M8220N3319N8039O4198P2335Q1190R0129R9856
58284B322144J10474J20909J30565J39696J47709J52686J52838J46979J33779
58275C557779J12515Q4793N3807K1885r461l7436n8461p1169p6799p6371o9737
58264C431345n7876m3678k9464j5665k555Q747J7977K6445L5025M3032M9924N6520
58252C519777O3585P0607P6856Q2459Q7869R3333R9193J05533J11564J16658J21770
$$ plain form
58328 1023447 1037566 1052621 1068249 1084258 1100479 1116796 1133731 1152229 1172263 1192310 1210741
58317 1210741 1227209 1242210 1256031 1268750 1280714 1292372 1304020 1316061 1329019 1343022 1357864
58306 1357864 1373833 1391780 1412093 1434325 1458085 1483497 1510587 1539162 1569530 1602316 1637303
58295 1637303 1673738 1712211 1754858 1803078 1856397 1914436 1978634 2050969 2132159 2222288 2322144
58284 2322144 2432618 2553527 2684092 2823788 2971497 3124183 3277021 3424000 3557779
58275 3557779 3670294 3755087 3808894 3830779 3821318 3783882 3725421 3654252 3577453 3501082 3431345
58264 3431345 3373469 3329791 3300327 3284662 3282107 3290854 3308831 3335276 3370301 3413333 3463257 3519777
58252 3519777 3583362 3653969 3730825 3813284 3901153 3994486 4093679 4199212 4310776 4427434 4549204
58241D549204J28355J36279J44507J53261J63409J74281J84626J95248K07988
58232F037158K22531K37043K51692K68346K87084L06349L26533L49846L76511
58223H663093M04741M34652M68452N06475N47137N91192O41829P00068P64421
58214A3722060Q35622R17016J009860J113465J230679J367789J528253J712874
58206B3437618J927331K183083K489712K854275L290617L821593M470073N257330
58198D9731632O213641P379405Q790080J0471257J2454664J4782242J7475426
58191A27298347K0503194K3786144K7203385L0528953L3287373L4629929L3398994
58184C30636319K8505991J9558020P386668n979946j8049977k6887425l1740725
$$ plain form
58241 4549204 4677559 4813838 4958345 5111606 5275015 5449296 5633922 5829170 6037158
58232 6037158 6259689 6496732 6748424 7016770 7303854 7610203 7936736 8286582 8663093
58223 8663093 9067834 9502486 9970938 10477413 11024550 11615742 12257571 12957639 13722060
58214 13722060 14557682 15474698 16484558 17598023 18828702 20196491 21724744 23437618
58206 23437618 25364949 27548032 30037744 32892019 36182636 40004229 44474302 49731632
58198 49731632 55945273 63324678 72114758 82586015 95040679 109822921 127298347
58191 127298347 147801541 171587685 198791070 229320023 262607396 297237325 330636319
58184 330636319 359142310 378700330 386086998 380107052 362057075 335169650 303428925
58177C03428925l2958604l1461726k8250168k4167951j9853298j5770318j2287743
58170A38679117r737604q352076q101015q613778r322838r740558r649496r092554
58162F6069198q237562p253848o263014n340144m525183l830742l250699k770706
58154B4597300k375207k048760j776173j545122j348246j181324j040366r21767
58146A2360335q23483p43429o77518o21387n73134n32219m96486m62736m29515
58137G000428l96975l64729l32400l01590k74510k50826k28432k06996j88178
58128D455792j72566j59224j48333j41477j38783j38112j37498j36291j33606
58119C149902j28099j19910j10862j02110r3330q4464p6308o8940o1432n3534
$$ plain form
58177 303428925 270470321 239008595 210758427 186590476 166737178 150966860 138679117
58170 138679117 128941513 120589437 112488422 103874644 94551806 84811248 75161752 66069198
58162 66069198 57831636 50577788 44314774 38974630 34449447 30618705 27368006 24597300
58154 24597300 22222093 20173333 18397160 16852038 15503792 14322468 13282102 12360335
58146 12360335 11536852 10793423 10115905 9494518 8921384 8389165 7892679 7429943 7000428
58137 7000428 6603453 6238724 5906324 5604734 5330224 5079398 4850966 4643970 4455792
58128 4455792 4283226 4124002 3975669 3834192 3695409 3557297 3419799 3283508 3149902
58119 3149902 3021803 2901893 2791031 2688921 2595591 2511127 2434819 2365879 2304447 2250913
58109B250913m5970l8688l0693k1922j3565o105J096P785J2262J3335J1179N768
58097B145395l668j6874l1886m6737o0354p1377p7999p9962p9065p6807p2956
58086A527710o7279o1055n5659n1002m6539m2721m0174l8341l6081l3069k9727
58075A026063k6416k3499k1585k0892k0762k0298j9145j7372j5311j3656j2998
58064H14129j2860j2075j0368q748p936p462o701n924n751o384p827j0001j2110
58051F99982j2809j1647r654q053p129o670o597o548n821m403l319l245l561l410
58037F07116k914k585k251j527p49n24p28q29q88j403k338l012k920k158j046
58022E81244J92J434K708M227O142Q439J1100J4173J7520K0856K4081K7369L0808
$$ plain form
58109 2250913 2204943 2166255 2135562 2113640 2100075 2093970 2095066 2102851 2115113 2128448 2139627 2145395
58097 2145395 2141727 2124853 2092967 2046230 1985876 1914499 1836500 1756538 1677473 1600666 1527710
58086 1527710 1460431 1399376 1343717 1292715 1246176 1203455 1163281 1124940 1088859 1055790 1026063
58075 1026063 999647 976148 954563 933671 912909 892611 873466 856094 840783 827127 814129
58064 814129 801269 789194 778826 770078 762142 754680 747979 742055 736304 729920 722093 712092 699982
58051 699982 687173 675526 665872 657819 650690 644020 637423 630875 625054 620651 617332 614087 610526 607116
58037 607116 604202 601617 599366 597839 597090 596566 595838 595009 594121 592718 590380 587368 584448 582290 581244
58022 581244 581436 582870 585578 589805 595947 604386 615486 629659 647179 668035 692116 719485 750293
58009G50293L4342L7940M1336M3554M3351M0306L5007K8072J9606R780p12j1008
57997A071867k0324k7698l2252l4090l4295l3731l2485l0729k9269k8637k8299
57986G40058k7350k5538k3120k0204j6858j3412j0147p084m475k948k683k962
57974E83277l159l678n162p230q768r283r165q729p803o296m561k939j386L19
57960E05437K269M410O531Q224R140R409R594J0040J0414R992Q504O516M813L386
57946F08679J470j272m100o158p702r554j1619j2871j2854j2167j1349j0216q761
57933E01526p692p372p085o196n405n877p593r506j1034j2389j3522j3819j3088
57920C80948j1931j0883r687p840n348k594J78K808M967O329O952P177P164O797
$$ plain form
58009 750293 784635 822575 863911 907465 950816 991122 1026129 1054201 1073807 1083587 1082875 1071867
57997 1071867 1051543 1023845 991593 957503 923208 889477 856992 826263 796994 768357 740058
57986 740058 712708 687170 664050 643846 626988 613576 603429 596345 591870 588922 586239 583277
57974 583277 580118 576440 571278 564048 555280 545997 536832 528103 520300 514004 509443 506504 505118 505437
57960 505437 507706 512116 518647 526871 536011 545420 555014 565054 575468 585460 593964 600480 605293 608679
57946 608679 610149 608877 604777 598619 590917 581363 569744 556873 544019 531852 520503 510287 501526
57933 501526 493834 486462 479377 473181 467776 461899 454306 444800 433766 421377 407855 394036 380948
57920 380948 369017 358134 348447 340607 335259 332665 332843 335651 340618 346947 353899 361076 368240 375037
57906C75037O111N538N495N708N239L425O84j797l191l682l999m570n216n507
57892C79275n253m636l955l319k627j818r36J31J631L495N195O377P295Q313R179
57877C98347R379Q939Q343P798P164O480N850M937L321J441K66j55r97l104n838
57862D52171p965r085r704j0374j1275j2181j2437j1391r242p088n735m880l740
57849C37074j959L80L036N381O571O569O381O702O942O320N243M523L804K085
57835C99052m33k368l150l734m984o498p558q299r148r828r739q868p664o334
57821C10447m843l380k193j139P0J350K539L999O299R276J2102J4297J6049J7349
57807C82222J7602J6603J5257J4657J4688J4352J3269J2111J1428J0787R448P349
$$ plain form
57906 375037 381148 386686 392181 397889 403128 406553 407237 405440 402249 398567 394568 389998 384782 379275
57892 379275 374022 369386 365431 362112 359485 357667 356731 356862 358493 361988 367183 373560 380855 389168 398347
57877 398347 407726 416665 425008 432806 439970 446450 452300 457237 460558 461999 462265 462110 461113 458009 452171
57862 452171 444206 435121 425417 415043 403768 391587 379150 367759 358517 351429 345694 340814 337074
57849 337074 335115 335495 338531 343912 350483 357052 363433 370135 377077 383397 388640 393163 396967 399052
57835 399052 398619 396251 393101 389367 384383 377885 370327 362028 352880 343052 333313 324445 316781 310447
57821 310447 305604 302224 300031 298892 298962 300312 302851 306850 313149 322425 334527 348824 364873 382222
57807 382222 399824 416427 431684 446341 461029 475381 488650 500761 512189 522976 532424 539773
57795E39773M986K699N49j397l085m682o382q125r790j1428j3027j4268j4948
57782D60875j5434j6165j6840j6691j5574j4211j3226j2421j1264r701q184p086
57770C04078o335n596m728m016l856m132m162l490k487j853j812k124k560k865
57756B54062k555j493l74M1N5N99J771K741L164L662M611N433N615N555N731N792
57740B94410N234M389L993M088M143M012M058M421M743M749M721N216O418P827
57726C62422Q624Q533Q201Q422R125R564R406Q985Q526P946P507P742Q461Q785
57712D82249Q542Q695R788J1028J1685J2403J4057J6154J7659J8866K1011K4255
57700F56392K7454K9996L2663L6429M1441M7454N4337O1679O8706P5051Q1055
$$ plain form
57795 539773 544759 547458 548007 546610 543525 538843 532461 524336 514546 503118 490091 475823 460875
57782 460875 445441 429276 412436 395745 380171 365960 352734 340313 329049 319348 311164 304078
57770 304078 297743 292147 287419 283403 279547 275415 271253 267763 265276 263423 261611 259487 256927 254062
57756 254062 251507 250014 249640 249681 249736 250335 252106 254847 258011 261673 266284 271717 277332 282887 288618 294410
57740 294410 299644 304033 308026 312114 316257 320269 324327 328748 333491 338240 342961 348177 354595 362422
57726 362422 371046 379579 387780 396202 405327 414891 424297 433282 441808 449754 457261 465003 473464 482249
57712 482249 490791 499486 509274 520302 531987 544390 558447 574601 592260 611126 632137 656392
57700 656392 683846 713842 746505 782934 824375 871829 926166 987845 1056551 1131602 1212657
57689A212657Q6961R2389R6921J00615J03389J04283J01931R5731Q6154P3953
57679B154984N9458M2788K4689O945q272j9468k6241k8757k7198k1859j3511l694
57667B139864M924Q426K825j3623l8965o8344r6028j17034j28268j29459j22978
57656A441340j11963r8600q4199p0146n7707m7133l7836k9457k2147j5963j0720
57645H55469o358k777N99M451Q806J3245J7666K2234K6760L1035L5572M1102M7300
57632A095104N2995N7751O2357O7513P2898P7806Q1742Q4117Q4166Q1712P7201
57621A895362P0547O0649M6720K9522J0696q609k7768m5860o1580p3999q2941
57610A812739q8656r1546r2065r0660q7730q3726p9031p3750o7892o1826n6197
$$ plain form
57689 1212657 1299618 1392007 1488928 1589543 1692932 1797215 1899146 1994877 2081031 2154984
57679 2154984 2214442 2257230 2281919 2288864 2280592 2261124 2234883 2206126 2178928 2157069 2143558 2139864
57667 2139864 2144788 2153214 2156039 2142416 2103451 2035107 1939079 1822045 1693777 1564318 1441340
57656 1441340 1329377 1230777 1146578 1076432 1018725 971592 933756 904299 882152 866189 855469
57645 855469 849111 846334 846933 851384 860190 873435 891101 913335 940095 971130 1006702 1047804 1095104
57632 1095104 1148099 1205850 1268207 1335720 1408618 1486424 1568166 1652283 1736449 1818161 1895362
57621 1895362 1965909 2026558 2073278 2102800 2113496 2104887 2077119 2031259 1969679 1895680 1812739
57610 1812739 1724083 1632537 1540472 1449812 1362082 1278356 1199325 1125575 1057683 995857 939660
57599I39660n1277m6767m2401l8339l4842l1931k9541k7588k5750k3576k1065
57588E66583j8733j6900j5317j3683j2185j1178j0644j0181r368q048o550n531
57576D28265n308n310m726l569k536j888j259o09l75m50LJ228K319K616K768L618
57560D14787M789N430N796O901Q857J0562J1110J0686J0041R869J0726J2824J5540
57547E37918J7740J8970K0038K2154K5605K9501L2811L5476L8414M2328M6819
57536H67774N0942N4478N8060O2011O5711O8323O9480O8950O6273O1206N3920
57525A547128M4391L2258J7929L042j0999k4335l7572m9927n9615o5796o9066
57514A327438p0105o9037o6215o2463n8240n3440m8328m3712l9820l5927l1645
$$ plain form
57599 939660 888383 841616 799215 760876 726034 694103 664562 636974 611224 587648 566583
57588 566583 547850 530950 515633 501950 489765 478587 467943 457762 448394 440346 433796 428265
57576 428265 422957 417647 412921 409352 406816 404928 403669 403060 402685 402235 402238 403466 405785 408401 411169 414787
57560 414787 419576 425006 430802 437703 446560 457122 468232 478918 488959 498828 509554 522378 537918
57547 537918 555658 574628 594666 616820 642425 671926 704737 740213 778627 820955 867774
57536 867774 918716 973194 1031254 1093265 1158976 1227299 1296779 1365729 1432002 1493208 1547128
57525 1547128 1591519 1623777 1641706 1644748 1633749 1609414 1571842 1521915 1462300 1396504 1327438
57514 1327438 1257333 1188296 1122081 1059618 1001378 947938 899610 855898 816078 780151 748506
57503G48506k7781k5152k3244k0830j7620j4423j1771r220o206l082q41J19O43
57490E89098K056M756P815J0076J1404J2592J4328J6724J9636K2874K6098K9058
57478G66515L2115L5963M0625M5230M9092N2436N5789N8995O1343O2338O1826
57467A322267N9488N4737M7191L6989K4601J0580m419j9494l3542m5601n5278
57456A397519o2795o8483p2225p3612p2610o9820o5999o1654n7143n2831m8835
57445F91512m4862m0571l6063l1877k8535k6158k4369k2511k0120j7376j4959
57434C84111j3367j2534j2096j1770j1306j0388q923p354o350o101o113n746m922
57421B67141m217m206m783n193m919m283m002m229m385l955l070k219j695j521
$$ plain form
57503 748506 720725 695573 672329 651499 633879 619456 607685 598465 592259 589177 588336 588455 589098
57490 589098 591154 595910 603725 613801 625205 637797 652125 668849 688485 711359 737457 766515
57478 766515 798630 834593 875218 920448 969540 1021976 1077765 1136760 1198103 1260441 1322267
57467 1322267 1381755 1436492 1483683 1520672 1545273 1555853 1551434 1531940 1498398 1452797 1397519
57456 1397519 1334724 1266241 1194016 1120404 1047794 977974 911975 850321 793178 740347 691512
57445 691512 646650 606079 570016 538139 509604 483446 459077 436566 416446 399070 384111
57434 384111 370744 358210 346114 334344 323038 312650 303727 296373 290023 283922 277809 272063 267141
57421 267141 262924 258718 253935 248742 243823 239540 235538 231309 226924 222969 219899 217680 215985 214464
57407B14464j607j771j796j657j517j380j007l79Q0L6k60l86m05o74j067r75j65
57390A99534P49J021O42K37K18L61K49r6k65l1K56N4p11j486j662j179m68M8K77
57371A97748L25K37l5m06n47j55N40Q23K71o47j055p57l65k69n2P87J961K814
57353B01218L284L775M201L939K927K118K338L173L504K949K184J891K020K230
57339B41751K595L444M701N778O159N926N606N616N891O092O116O210O538O854
57325C19277O880O942P683R031J0004R895R270R199R801J0225J0012R687R855
57312D37761J0459J1217J2120J3063J3577J3468J3333J3783J4517J4813J4619
57301E82730J4399J4102J3194J1641R986Q281N815K300j456m547p090r753j2535
$$ plain form
57407 214464 212857 211086 209290 207633 206116 204736 203729 203350 203430 203466 203206 202820 202415 201741 200674 199699 199534
57390 199534 200283 201304 201946 202183 202401 202762 203011 202915 202650 202619 202875 202929 202218 200732 199070 197891 197423 197471 197748
57371 197748 198073 198310 198275 197869 197322 197167 197707 198530 198801 198154 197099 196342 195977 195708 195656 196443 198404 201218
57353 201218 204502 208277 212478 216417 219344 221462 223800 226973 230477 233426 235610 237501 239521 241751
57339 241751 244346 247790 252491 258269 264428 270354 275960 281576 287467 293559 299675 305885 312423 319277
57325 319277 326157 333099 340782 349813 359817 369712 378982 388181 397982 408207 418219 427906 437761
57312 437761 448220 459437 471557 484620 498197 511665 524998 538781 553298 568111 582730
57301 582730 597129 611231 624425 636066 646052 654333 660148 662448 660992 656445 649355 639602 627067
57288F27067j4623j5317j4713j3557j2714j2530j2522j1831j0258q515p190n903
57276D87394l906j288R96K181K336K008J698J727K290L366M730O045O991P508
57262E24076P992Q919J0140J0902J0968J1173J2385J4254J5747J6622J7535J8638
57250F79351J9133J8615J7982J8417J9866K1314K2194K2863K3756K4738K5531
57239I13760K6342K7722K9893L2398L4364L5120L4669L3645L2938L3329L5307
57228A269487L8856M3276M7430N0555N2748N4528N5933N6420N5614N3838N1687
57217A830372M9419M7094M5024M3586M2618M1621M0722M0808M2254M4004M4647
57206B312169M4132M3615M3663M3553M2607M1307M0417L9718L8383L6300L4245
$$ plain form
57288 627067 612444 597127 582414 568857 556143 543613 531091 519260 509002 500487 493297 487394
57276 487394 483488 482200 483196 485377 487713 489721 491419 493146 495436 498802 503532 509577 516568 524076
57262 524076 532068 540987 551127 562029 572997 584170 596555 610809 626556 643178 660713 679351
57250 679351 698484 717099 735081 753498 773364 794678 816872 839735 863491 888229 913760
57239 913760 940102 967824 997717 1030115 1064479 1099599 1134268 1167913 1200851 1234180 1269487
57228 1269487 1308343 1351619 1399049 1449604 1502352 1556880 1612813 1669233 1724847 1778685 1830372
57217 1830372 1879791 1926885 1971909 2015495 2058113 2099734 2140456 2181264 2223518 2267522 2312169
57206 2312169 2356301 2399916 2443579 2487132 2529739 2571046 2611463 2651181 2689564 2725864 2760109
57195B760109L2847L2092L1795L1916L2419L3311L4752L6582L7838L7544L6085
57184C137290L5021L5234L5884L5714L4723L3907L3716L3598L3039L2375L2247
57173C512748L2657L3021L3043L3151L3892L5116L6198L6910L7562L8157L8121
57162C900576L7353L6849L7501L8647L8783L7526L5838L4406L2930L1157K9435
57151D291001K7907K6185K4198K2204J9744J6140J2526J1219J1780J0228M970
57140D478102J653P901K2929L6303L8688L1024K1155J4169R200M070r54m563o581
57127D653096p409o913n056k597j64K676O596J1393J6424K1592K7335L3865M1077
57114D791915M8859N7102O5574P4283Q3757R4663J07463J22690J41248J63958
$$ plain form
57195 2760109 2792956 2825048 2856843 2888759 2921178 2954489 2989241 3025823 3063661 3101205 3137290
57184 3137290 3172311 3207545 3243429 3279143 3313866 3347773 3381489 3415087 3448126 3480501 3512748
57173 3512748 3545405 3578426 3611469 3644620 3678512 3713628 3749826 3786736 3824298 3862455 3900576
57162 3900576 3937929 3974778 4012279 4050926 4089709 4127235 4163073 4197479 4230409 4261566 4291001
57151 4291001 4318908 4345093 4369291 4391495 4411239 4427379 4439905 4451124 4462904 4473132 4478102
57140 4478102 4479755 4487656 4510585 4546888 4585576 4616600 4637755 4651924 4661124 4665194 4664240 4659677 4653096
57127 4653096 4645687 4638774 4633718 4631121 4630957 4633633 4640229 4651622 4668046 4689638 4716973 4750838 4791915
57114 4791915 4840774 4897876 4963450 5037733 5121490 5216153 5323616 5446306 5587554 5751512
57104E751512J91187K23444K62238L09983L69353M43170N34628O46962P82855
57095I515332R44450J133413J350163J592910J857660K138593K427443K712703
57087B3672667K980700L217948L412245L551919L625235L620189L523241L318486
57079E0922630K992047K541552J982397J343615O56876n1271p59395j447313k092982
57070E6088156k671001l153305l513846l736230l819058l775388l627971l404055
57062B8387302l131000k832662k527663k230031j950281j695244j467798j268168
57054A1284455j095783r49540q27039p24706o39114n67740n08598m59611m18490
57045E093834l82883l50765l20948k93165k67359k43181k20300j98865j79122
$$ plain form
57104 5751512 5942699 6166143 6428381 6738364 7107717 7550887 8085515 8732477 9515332
57095 9515332 10459782 11593195 12943358 14536268 16393928 18532521 20959964 23672667
57087 23672667 26653367 29871315 33283560 36835479 40460714 44080903 47604144 50922630
57079 50922630 53914677 56456229 58438626 59782241 60439117 60387846 59628451 58181138 56088156
57070 56088156 53417155 50263850 46750004 43013774 39194716 35419328 31791357 28387302
57062 28387302 25256302 22423640 19895977 17665946 15715665 14020421 12552623 11284455
57054 11284455 10188672 9239132 8412093 7687387 7048273 6480533 5971935 5512324 5093834
57045 5093834 4710951 4360186 4039238 3746073 3478714 3235533 3015233 2816368 2637246
57036B637246j60884j43865j28206j14253j02036r1429q2450p4859o7710n9999
57026A611555n1511m2644l3583k4229j4550m330P109K0299L5092N1463P0133R1093
57014A715897J11556J26450J30715J20240R1489M3374j8913q3278j36143j69266
57004A932121j82050j79024j66295j49182j30965j12917r5580p9817o6376n5136
56994G14779m5494l7178l0015k3327j6430r578l771L74L121N159P102R189J0870
56981E84801J0896Q370L660j999p554j2331j5657j7131j7179j6706j6034j4697
56969D88439j2297r140o015l613k105r07J008M127P836J1175J3860J6157J8023
56956E26548J8972J8597J6500J1931M448m897j3723k0027k3319k4127k3081k0743
$$ plain form
57036 2637246 2476362 2332497 2204291 2090038 1988002 1896573 1814123 1739264 1671554 1611555
57026 1611555 1560044 1517400 1483817 1459588 1445038 1440708 1447817 1468116 1503208 1554671 1624804 1715897
57014 1715897 1827453 1953903 2084618 2204858 2296347 2339721 2320808 2237530 2101387 1932121
57004 1932121 1750071 1571047 1404752 1255570 1124605 1011688 916108 836291 769915 714779
56994 714779 669285 632107 602092 578765 562335 552757 548986 549360 552481 557640 564742 573931 584801
56981 584801 595697 604067 607727 605728 598174 585843 570186 553055 535876 519170 503136 488439
56969 488439 476142 467002 460987 457374 455269 454362 455370 459497 467333 478508 492368 508525 526548
56956 526548 545520 564117 580617 592548 596996 592099 578376 558349 535030 510903 487822 467079
56944D67079j7696j4329j0817p395m259j105K656O982J1045J4286J7149K0282
56932D83878K3514K6059K7277K6740K3742J7507Q001l630j5412k5257l1732l4582
56920E26105l4560l2567k9192k5136k1497j9007j7202j5033j2268r661p705o034
56908B96243m331l133l005l338k830j141O43J383J136P35O56Q98J534K735M208
56893B92393N295N818O399P658R452J1193J2584J3687J4447J4536J3547J1115
56881D18124O988J414m513r302j2034j2828j2291j0792q441n481k432L74L102
56868C51888O127R479J2900J6427K0531K5335L0069L3786L6421L8403L9191L6950
56856F57507L0106J8837M964r119k1046k8922l2112l1575k8887k4995k0117j4441
$$ plain form
56944 467079 449383 435054 424237 416842 412583 411478 414134 421116 432161 446447 463596 483878
56932 483878 507392 533451 560728 587468 611210 628717 636718 633088 617676 592419 560687 526105
56920 526105 491545 458978 429786 404650 383153 364146 346944 331911 319643 309982 302277 296243
56908 296243 291912 288779 285774 282436 279606 278465 279108 280491 281627 282362 283018 283916 285450 288185 292393
56893 292393 297688 303506 309905 317563 327015 338208 350792 364479 378926 393462 407009 418124
56881 418124 425112 426526 422013 412711 400677 387849 375558 364766 356325 350844 348412 348786 351888
56868 351888 358015 367494 380394 396821 417352 442687 472756 506542 542963 581366 620557 657507
56856 657507 687613 706450 711414 702295 681249 652327 620215 588640 559753 534758 514641 500200
56844E00200q328k004M463J0953J7547K4658L2478M0405M7673N4243O0362O5178
56832H47828O6471O1896N0248L1829Q613j5826l7440n3483o3143o6719o4940n9198
56820G06136n1457m3189l4763k6206j7990j0535l456L959J1765J9508K7032L4442
56808F15246M1184M5885M7252M4638L7513K5134P626j2738l1955m6456n4790n7406
56796F61133n5480n0392m3778l7070l0683k4155j7298j0772n190k47M810J0107
56784D00985J5041J9052K2016K3975K4835K4232K1344J5238N886n190j5722k4097
56772E27595k9773l2711l3146l1719k9202k6002k2400j9039j6566j4818j3055
56761B59164j1061r348q203p240o080m913m133l840l868l822l118j541J04N80
$$ plain form
56844 500200 491872 489868 494331 505284 522831 547489 579967 620372 668045 722288 782650 847828
56832 847828 914299 976195 1026443 1058272 1066885 1051059 1013619 960136 896993 830274 765334 706136
56820 706136 654679 611490 576727 550521 532531 521996 518540 522499 534264 553772 580804 615246
56808 615246 656430 702315 749567 794205 831718 856852 864478 851740 819785 773329 718539 661133
56796 661133 605653 555261 511483 474413 443730 419575 402277 391505 386315 386068 390878 400985
56784 400985 416026 435078 457094 481069 505904 530136 551480 566718 572604 567414 551692 527595
56772 527595 497822 465111 431965 400246 371044 345042 322642 303603 287037 272219 259164
56761 259164 248103 238755 230552 223312 217232 212319 208186 204346 200478 196656 193538 191997 192101 192681
56747A92681l94j773k408k072j249n08k52n39r10q91p39j008j461j209j04Q95
56731A78059J060O86K07m77j239j273k87O92N84k39o20k82J17K16K30K48J12j8
56713A77776J72N18N44L01L46R14J661K251K633K714K346J695J173Q99O27K42
56697A96812k2K3K74N38P37P99N44j32r59j192j44J918L594L614K248R04L44Q6
56679B09986k90l35K40O45N0j040j436q58j13L9n65j811l272m105l779k839k230
56662A88287k027j570o82O2K38l0m89r86j238j104r56j183j441j135n00k98n65
56645A74383n76r7K96L25M60R49J299J159Q73P39M04m29j294j550j229q54p41
56628A74117q69j065j071p87o56j307k489k968j916pJ403J792J670J672J965K412
$$ plain form
56747 192681 192287 190514 188106 186034 184785 184277 184025 183486 182576 181685 180946 179938 178477 177268 177164 178059
56731 178059 179119 179805 180012 179535 178296 177023 176736 177428 178012 177773 177153 176871 176988 177204 177434 177682 177794 177776
56713 177776 177948 178466 179010 179311 179657 180571 182232 184483 187116 189830 192176 193871 195044 195943 196570 196812
56697 196812 196790 196813 197087 197625 198362 199161 199705 199573 198614 197422 197278 199196 202790 206404 208652 209556 209900 209986
56679 209986 209696 209361 209601 210246 210296 209256 207820 206962 206849 206888 206323 204512 201240 197135 193356 190517 188287
56662 188287 186260 184690 184008 184070 184308 184278 183789 182803 181565 180461 179505 178322 176881 175746 175246 174948 174383
56645 174383 173807 173710 174006 174331 174791 175740 177039 178198 179071 179810 180214 179785 178491 176941 175712 174858 174117
56628 174117 173248 172183 171112 170325 169669 168362 165873 162905 160989 160982 162385 164177 165847 167519 169484 171896
56612A71896K770K804K512K178J991J752J232N94J27j30k04R1Q23J441J220J63
56596A91260r02j238q72l41p2j41l70m00R9J058J854J799Q71j93o13k75L86J021
56578A92931J574J923J765J085M68N55J272J907J946J640J623K088K465K020Q02
56563B16064j98m8J052K040K217J803J227N63n3j06O06J373J253J83j017j634
56547B25325j585j224j072j501k313k814k657k301k225k134j609j089j339k165
56533A99297k526j926r18j52K69L79J00m06p45q89j255j969k587k724k475k096
56517A79377j771j734k088k443k279j809j752k176k262j535o18k74l63k34K25
56502A58264N48M50J92K56Q44J633J915J228j4q31o67J51R70J423J447J165Q90
$$ plain form
56612 171896 174666 177470 179982 182160 184151 185903 187135 187729 187856 187726 187522 187613 188436 189877 191097 191260
56596 191260 190358 189120 188248 187907 187835 187694 187324 186924 187023 188081 189935 191734 192605 192412 191799 191524 191910 192931
56578 192931 194505 196428 198193 199278 199746 200301 201573 203480 205426 207066 208689 210777 213242 215262 216064
56563 216064 215866 215818 216870 218910 221127 222930 224157 224720 224667 224561 225167 226540 227793 227976 226959 225325
56547 225325 223740 222516 221444 219943 217630 214816 212159 209858 207633 205499 203890 202801 201462 199297
56533 199297 196771 194845 193927 193775 194044 194423 194523 194117 193372 192483 191228 189259 186672 183948 181473 179377
56517 179377 177606 175872 173784 171341 169062 167253 165501 163325 161063 159528 158910 158636 158273 158039 158264
56502 158264 158812 159262 159454 159710 160554 162187 164102 165330 165316 164485 163818 163969 164939 166362 167809 168974 169864
56485A69864R19J158J218R38N35K10M9K35R55J964K704K852K522J978J563J670
56469A91334K230K424J616M02o0K96M36r6n06r3O92J041Q84O88P06Q36Q14K59
56451B03903q89j900j874j007m10n07n23M1M79M0q65j368j317j071p49l91k76
56434A91316l90j49O76J378J264O66L40L22J60k50p64j379j914j744o43O23J235
56417A90747J365J584J861J912J939K091J818Q00k4M25J608K013J308N59L40J9
56401B10365q29j555j472q45l41j96k87m60m68j53J68j1n81q94p42n88p24q24
56383A99563n32P2P75J459J848J613R60N23N50O62O12O03P35P54O11P03J176J608
56365B14295J674J583J493J143M87L8J08K16p1k96J87R72J068M16M8N58J322J526
$$ plain form
56485 169864 170783 171941 173159 174097 174632 174842 174891 175126 176081 178045 180749 183601 186123 188101 189664 191334
56469 191334 193564 195988 197604 198006 197946 198242 198678 198582 198076 197983 198675 199716 200600 201288 201994 202830 203644 203903
56451 203903 203014 201114 199240 198233 197823 197316 196793 196834 197313 197353 196488 195120 193803 192732 191983 191592 191316
56434 191316 190926 190777 191453 192831 194095 194761 195101 195423 195583 195333 194569 193190 191276 189532 188889 189512 190747
56417 190747 192112 193696 195557 197469 199408 201499 203317 204117 204093 204518 206126 208139 209447 210006 210346 210365
56401 210365 209536 207981 206509 205664 205323 205127 204840 204380 203912 203759 203927 203916 203335 202441 201699 201111 200387 199563
56383 199563 199031 199103 199878 201337 203185 204798 205758 206281 206831 207493 208105 208708 209443 210197 210808 211511 212687 214295
56365 214295 215969 217552 219045 220188 220675 220713 220821 221037 220966 220670 220857 221829 222897 223313 223361 223919 225241 226767
56347B26767J305J299J650K023K278K503K478J856R48O54J349K325K677K333J816
56332B54261J322O97J1m02m76m27k30L12R40R86K97m21m68Q8P45J201J341J083
56314B60860O18N27J162K115K619K321J411L13m39l53N56J619K112J928J472J095
56298B79936R20R62J184J507J958K566L028K851K024J211J009J318J634J618J205
56283C04931N97L95J194K737L956M241M146M436N044N537O015O783P485P478O919
56268C71894O758P557Q943J0242J1201J1983J2808J3747J4705J5670J6919J8694
56256E21121K0641K2075K2940K3905K5230K6239K6437K6327K6454K6303K5075
56245G92747K3044K1116J9338J6946J3775J0525P508M087k66n082r398j2745j5306
$$ plain form
56347 226767 228072 229371 231021 233044 235322 237825 240303 242159 243107 243761 245110 247435 250112 252445 254261
56332 254261 255583 256280 256291 255889 255413 254986 254756 255068 256008 256994 257291 256870 256402 256490 257235 258436 259777 260860
56314 260860 261478 262005 263167 265282 267901 270222 271633 271946 271507 271154 271710 273329 275441 277369 278841 279936
56298 279936 280856 281818 283002 284509 286467 289033 292061 294912 296936 298147 299156 300474 302108 303726 304931
56283 304931 305528 305923 307117 309854 313810 318051 322197 326633 331677 337214 343229 350012 357497 364975 371894
56268 371894 378652 386209 395152 405394 416595 428578 441386 455133 469838 485508 502427 521121
56256 521121 541762 563837 586777 610682 635912 662151 688588 714915 741369 767672 792747
56245 792747 815791 836907 856245 873191 886966 897491 904999 909086 908820 903738 894340 881595 866289
56232H66289j7463j9418k1122k2454k3523k4576k5449k5443k4112k1984k0033
56221F20712j8669j7617j6548j5336j3896j2228j0540q990p513o085m894l939
56209D84457k901j756r82p79o34k28j18p90j565j449n40K78P92J479K319K667
56193D80250K416K270K665L254L690M168M865N454N562N396N579O468P745Q697
56179E48479Q964R000R454J0210J0660J0926J1893J3626J4892J4974J4944J6088
56167F94110J7986J9397K0343K1823K3964K6049K8174L1313L5594M0041M4357
56156A003151M9657N6993O6247P7144R0257J06335J25226J46198J68843J92940
56146B082991K17441K39815K56499K64085K60428K45096K19404J86862J53306
$$ plain form
56232 866289 848826 829408 808286 785832 762309 737733 712284 686841 662729 640745 620712
56221 620712 602043 584426 567878 552542 538646 526418 515878 506888 499375 493290 488396 484457
56209 484457 481556 479800 478818 478039 477405 477177 477059 476269 474704 473255 472715 472993 473785 475264 477583 480250
56193 480250 482666 484936 487601 490855 494545 498713 503578 509032 514594 519990 525569 532037 539782 548479
56179 548479 557443 566443 575897 586107 596767 607693 619586 633212 648104 663078 678022 694110
56167 694110 712096 731493 751836 773659 797623 823672 851846 883159 918753 958794 1003151
56156 1003151 1052808 1109801 1176048 1253192 1343449 1449784 1575010 1721208 1890051 2082991
56146 2082991 2300432 2540247 2796746 3060831 3321259 3566355 3785759 3972621 4125927
56137D125927J25039J05502R3610Q5453P6850O4271M5245J9887q247l4157n4429
56126D644951o8345p7465q5686r8589j20352j50513j84419k16364k41573k56372
56116C145273k58920k50213k33132k10318j83870j56524j31267j09478r0730p4533
56106A446288o1099n0402m1853l5119l0229k6784k4071k1882k0278j8826j7124
56095A098621j5691j5065j4476j2869j0714r215q149o292l761j905r94J0J333
56082A000833K067K210K988M717O275P131Q127R641J0808J1156J1386J1897J2107
56069A101343J1765J1513J1600J1580J1599J2372J3526J3756J3070J3052J4373
56058A239549J5901J6849J7935J9538K0637K0574K0293K0780K1711K2466K3239
$$ plain form
56137 4125927 4250966 4356468 4450078 4535531 4612381 4676652 4721897 4741784 4733537 4699380 4644951
56126 4644951 4576606 4499141 4413455 4314866 4194514 4044001 3859582 3643218 3401645 3145273
56116 3145273 2886353 2636140 2403008 2192690 2008820 1852296 1721029 1611551 1520821 1446288
56106 1446288 1385189 1334787 1292934 1257815 1227586 1200802 1176731 1154849 1134571 1115745 1098621
56095 1098621 1082930 1067865 1053389 1040520 1029806 1020591 1012442 1006150 1002389 1000484 999490 999500 1000833
56082 1000833 1002900 1005110 1008098 1012815 1019090 1026221 1034348 1043989 1054797 1065953 1077339 1089236 1101343
56069 1101343 1113108 1124621 1136221 1147801 1159400 1171772 1185298 1199054 1212124 1225176 1239549
56058 1239549 1255450 1272299 1290234 1309772 1330409 1350983 1371276 1392056 1413767 1436233 1459472
56047A459472K4266K5259K6160K7339K8616K9372K9898L1143L3036L4644L6089
56036A785294L8415M1440M3780M5202M6729M8179M8017M6168M4543M4169M4233
56025B276169M4570M6422M9860N3088N5352N8009O1705O5020O7149O9303P2296
56014B918943P5166P7438Q0263Q4095Q7798R1173R5721J01686J07175J11536J16644
56003C947638J23404J29968J35115J40392J47138J54332J61285J69488J79833
55994E288593J90893K01815K13989K28032K42211K55832K70898K88513L06943
55985G487719L25325L45812L69975L96649M25470M58660M97047N38540N82901
55976A1428098O33714O93095P59143Q31393R13712J008826J115554J235001J373663
$$ plain form
56047 1459472 1483738 1508997 1535157 1562496 1591112 1620484 1650382 1681525 1714561 1749205 1785294
56036 1785294 1823709 1865149 1908929 1954131 2000860 2049039 2097056 2143224 2187767 2231936 2276169
56025 2276169 2320739 2367161 2417021 2470109 2525461 2583470 2645175 2710195 2777344 2846647 2918943
56014 2918943 2994109 3071547 3151810 3235905 3323703 3414876 3510597 3612283 3719458 3830994 3947638
56003 3947638 4071042 4201010 4336125 4476517 4623655 4777987 4939272 5108760 5288593
55994 5288593 5479486 5681301 5895290 6123322 6365533 6621365 6892263 7180776 7487719
55985 7487719 7813044 8158856 8528831 8925480 9350950 9809610 10306657 10845197 11428098
55976 11428098 12061812 12754907 13514050 14345443 15259155 16267981 17383535 18618536 19992199
55967A9992199J536817J725214J942925K201820K513632K885221L327999L864843
55959C9990670M521701N321360O293462P480678Q924267J0653255J2699891J5111744
55951A10997028J7922943K1111107K4594249K8248196L1853503L4934858L6601558
55944C06263442L5594410L0688854K1376435Q447689o006758j9339497k9418571
55937C47606004l5329988l7347613l6409257l3587165k9805920k5751757k1859680
55930A27514624j8351074j5309693j2746100j0624725q881387p450392o280178
55923D7871075n326008m543332l896035l361362k920518k552368k240577j977965
55915B1052910j758287j570609j405920j262155j137976j027751r26956q36619
$$ plain form
55967 19992199 21529016 23254230 25197155 27398975 29912607 32797828 36125827 39990670
55959 39990670 44512371 49833731 56127193 63607871 72532138 83185393 95885284 110997028
55951 110997028 128919971 150031078 174625327 202873523 234727026 269661884 306263442
55944 306263442 341857852 372546706 393923141 402370830 396364072 377024575 347606004
55937 347606004 312276016 274928403 238519146 204931981 175126061 149374304 127514624
55930 127514624 109163550 93853857 81107757 70483032 61601645 54151253 47871075
55923 47871075 42545067 38001735 34105700 30744338 27823820 25271452 23030875 21052910
55915 21052910 19294623 17724014 16318094 15055939 13917963 12890212 11963256 11126637
55907A1126637p57960o87743o22837n64581n14594m70503m29483l92133l59505
55898F327298l30017l02484k78648k59583k42857k26136k10516j97520j85823
55889D093714j73711j62015j52029j42969j33832j25380j18134j10867j03054
55880B871723r6398r1884q7773q2374p6486p1166o5578n9010n2776m8039m3934
55869B096305l9803l7340l8551m3175m9594n6470o2167o4645o3614o1002n8006
55858A521938n3630m7307m0577l4677k8826k2531j7276j4067j1468q123n245m433
55846A233778m924n160n568p495j0695j3883j6707j9339k1287k2406k3969k6931
55834A055414l0096l1580l1228l0174k8976k7619k6366k5170k3206k0300j7796
$$ plain form
55907 11126637 10368677 9680934 9058097 8493516 7978922 7508419 7078936 6686803 6327298
55898 6327298 5997281 5694797 5416149 5156566 4913709 4687573 4477057 4279537 4093714
55889 4093714 3920003 3757988 3605959 3462990 3329158 3203778 3085644 2974777 2871723
55880 2871723 2775325 2683441 2595668 2513294 2436808 2365642 2300064 2241054 2188278 2140239 2096305
55869 2096305 2056502 2019162 1980611 1937436 1887842 1831372 1769205 1704560 1640946 1579944 1521938
55858 1521938 1468308 1421001 1380424 1345747 1316921 1294390 1277114 1263047 1251579 1243456 1238211 1233778
55846 1233778 1228854 1223694 1218126 1210631 1199936 1186053 1169346 1150007 1128720 1106314 1082345 1055414
55834 1055414 1025318 993738 962510 932336 903360 875741 849375 824205 800999 780699 762903
55823G62903j6670j5945j4361j2508j1740j1927j1861j1201j0496r857q969p939
55811F19429p087o272n343m656m389m089l538l252l458l567l323l273l445k875
55797E60862j306k3P8j33L80J149J269Q09q2k167n629q847j0225j0323j0641j1245
55781E03926j1172j0446j0057j0423j1175j2059j2877j3138j2816j2741j3197
55770C73825j2999j1134q532o905o500o336n948n510m872l793k712k098j518n35
55756B94433J94p8o62l92L74J46j546l664n237o270p193q285r465j0053r152p018
55740B26132n298n094n515n186m305l928l969l465k393j666j584j578j483j764
55726A78904k489l121l318l125k572j878j741k460l175k845j615l03Q54J927K391
$$ plain form
55823 762903 746233 730288 715927 703419 691679 679752 667891 656690 646194 636337 627368 619429
55811 619429 612342 606070 600727 596071 591682 587593 584055 580803 577345 573778 570455 567182 563737 560862
55797 560862 559556 559533 559611 559478 559858 561007 562276 563085 563003 560836 555207 546360 536135 525812 515171 503926
55781 503926 492754 482308 472251 461828 450653 438594 425717 412579 399763 387022 373825
55770 373825 360826 349692 341160 334255 327755 321419 315471 309961 305089 301296 298584 296486 294968 294433
55756 294433 294627 294549 293887 293495 293869 294015 292469 288805 283568 277298 270105 261820 252355 242302 233150 226132
55740 226132 220834 215740 210225 205039 200734 196806 192837 189372 186979 185313 183729 182151 180668 178904
55726 178904 176415 173294 169976 166851 164279 162401 160660 158200 155025 152180 150565 150262 151116 153043 155434
55711A55434J866J279J898L495M771N380O081P046P561P477P483P690P269N935
55697B30665M598M086M168M154L594K112n18l667o047p038p226p327p284o760
55683B07510n924n232m857m652m423l997l222k075p55L35P47M19K5M38J665K869
55667A78871L653M538N744O448O082N573O127P383P879P044N555L979K268M94
55653B51638r39j959k775l184k857k264k281k852l012k402j761j641j617j208
55639B20886q38j214k291l428m367n505p194r010r976r622q646q140q212p971
55625A34472o979n963n647n686n330m532l714l002k381k099k211k229j949j925
55611H0825k443k715k059j141r18j038n67K54M44O2J1K68j10j204j997k067k049
$$ plain form
55711 155434 157300 158579 160477 163972 168743 174123 180204 187250 194811 202288 209771 217461 224730 230665
55697 230665 235263 239349 243517 247671 251265 253377 252859 249192 243145 236107 228881 221554 214270 207510
55683 207510 201586 196354 191497 186845 182422 178425 175203 173128 172373 172708 173455 173874 173899 174337 176002 178871
55667 178871 182524 187062 192806 199254 205336 210909 217036 224419 232298 239342 244897 248876 251144 251638
55653 251638 250699 248740 245965 242781 239924 237660 235379 232527 229515 227113 225352 223711 222094 220886
55639 220886 220048 218834 216543 213115 208748 203243 196049 187039 177063 167441 158795 150655 142443 134472
55625 134472 127493 121530 115883 110197 104867 100335 96621 93619 91238 89139 86928 84699 82750 80825
55611 80825 78382 75667 73608 72467 71549 70511 69944 70198 70642 70704 70715 70983 70873 69669 67672 65605 63556
55594F3556k202j941j222r44j426j782j402r06r06r27m27P0j43p05p30j06N93
55577D8450J117J627J999J793R96K49K37J014J897K028J158p3p97q39p24r00j296
55560E7936j574j476r44k86j38q32j911k635k878k954k789j891j87J660K838K912
55544D4851J902L81o29m95K82P29O94Q97J678K453K568K110J693J824K532L350
55528F6820L663L462L435M020M693M736M368M326M682M853M626M316L980L287
55514A25267K131P41p04k011k785l057l641n076o578p088o894o961p059o125m379
55499F5781l358l589l799l018j980j733k081k286k238k122j769j196r81j383j763
55484C2485j553j131j077j192j006o70n96o88n75k78q3o2j37l41n79n41j98J5
$$ plain form
55594 63556 61354 59413 58191 57247 55821 54039 52637 51731 50825 49898 49471 49541 49398 48693 47963 47857 48450
55577 48450 49567 51194 53193 54986 55982 56231 56468 57482 59379 61407 62565 62492 61695 60856 60132 59232 57936
55560 57936 56362 54886 53942 53656 53518 52686 50775 48140 45262 42308 39519 37628 37441 39101 41939 44851
55544 44851 46753 47134 46505 46010 46292 47021 47715 48612 50290 52743 55311 57421 59114 60938 63470 66820
55528 66820 70483 73945 77380 81400 86093 90829 95197 99523 104205 109058 113684 118000 121980 125267
55514 125267 127398 128139 127435 125424 122639 119582 115941 110865 104287 97199 90305 83344 76285 70160 65781
55499 65781 62423 58834 55035 52017 50037 48304 46223 43937 41699 39577 37808 36612 35631 34248 32485
55484 32485 30932 29801 28724 27532 26526 25856 25260 24572 23997 23719 23636 23574 23437 23096 22517 21976 21778 21793
55466B1793k17o28q36q34p61n94k15L58R54J161M87q52j682j141jL60j5P1P11
55447A8119N84p72j959j814j077r07j014m12Q68K077K981L611L407J869k68j569
55431B3724j452m20R06K033K278J276k44j030p10m8K04Jl08m54l35q9k4k11k86
55412B4811J3L96L50k00q77j240j030l35L01L18j37l77j83l4j85k08J86N81N57
55393B2707K38j41n78q05l14O60J053M58j83m6L28J50k16ON05L43n38j398j859
55374B0370k044j874j275p13o12n13J96J129J416J068P28M20k64r56q34j46j08
55357A5988j052j903j781j037l22L73J181J701J539R32L23k44q36j139p46K48
55341A3225J221J572J129K51m50o18m27k64l01n21q82j171j022l86K81O38Q92
$$ plain form
55466 21793 21576 20948 20112 19278 18517 17923 17708 18066 19020 20181 20668 19816 18134 16993 16992 17352 17337 17408 18119
55447 18119 18703 17931 15972 14158 13081 12174 11160 10748 11616 13693 16674 20285 23692 25561 25293 23724
55431 23724 22272 21852 22758 24791 27069 28345 28101 27071 26361 26313 26517 26518 26210 25756 25421 25332 25308 25097 24811
55412 24811 24824 25220 25570 25370 24493 23253 22223 21888 22189 22507 22370 21993 21810 21776 21591 21383 21569 22150 22707
55393 22707 22945 22804 22226 21421 21107 21767 22820 23278 23095 23049 23377 23527 23311 23317 23822 24165 23627 22229 20370
55374 20370 18326 16452 15177 14464 13852 13339 13535 14664 16080 17148 17876 18296 18032 17076 16242 16096 15988
55357 15988 14936 13033 11252 10215 9893 10266 11447 13148 14687 15619 15942 15698 14862 13723 12977 13225
55341 13225 14446 16018 17147 17398 16948 16330 15903 15639 15338 14817 13935 12764 11742 11356 11637 12275 13167
55324A3167J205J175N16j78j05N98J074R38N17J17k25l95l36l83p62j032p42l78
55306A4771p05j388j313k53Q45J302J355J207N47n27j163q99l49k37m19m05k41
55289A2128k35l02j43J89L53J44l44p09l85P13J666J354j32j490j852j618j381
55272G956r32N0J078J443J189Q00L34l66r00o20M24J436J758J278J92j044j634
55255A2442j084J4N15J45k03R0M47L5q36j076l64M39N54K51J71K88J27k76l66
55236A1313L1N00P94J122J491J419P13k9k07j1J20L15Q01J073M06r08j746j567
55218A5630q60j50O10J374J552P47n42j384j359p65j70L7p7n6L64P60M75l91j008
55199A4787r21n69m97o15o03n13n64o48o46p57j106j224n35P10J544J466J023
$$ plain form
55324 13167 14372 15547 16063 15885 15780 16378 17452 18390 18907 19024 18799 18404 18068 17685 16923 15891 15149 14771
55306 14771 14066 12678 11365 11112 11957 13259 14614 15821 16368 15841 14678 13779 13430 13193 12774 12369 12128
55289 12128 11893 11591 11448 11637 11990 12134 11790 11081 10696 11409 13075 14429 14297 12807 10955 9337 7956
55272 7956 7024 7074 8152 9595 10784 11584 11918 11552 10652 10032 10456 11892 13650 14928 15120 14076 12442
55255 12442 11358 11372 11887 12032 11829 11919 12366 12401 11565 10489 10125 10564 11118 11369 11540 11828 11955 11679 11313
55236 11313 11344 11844 12638 13760 15251 16670 17383 17354 17147 17136 17256 17571 18372 19445 19851 18943 17197 15630
55218 15630 14770 14620 15230 16604 18156 18903 18361 16977 15618 14853 14683 14720 14643 14587 14951 15711 16186 15795 14787
55199 14787 13866 13297 12800 12185 11582 11069 10505 9857 9211 8454 7348 6124 5589 6299 7843 9309 10332
55182A0332R96J379J492R84L29J68M40M54j72j009j328q81oP92J119Q11J60j78
55164A5882J03N20M41Mr1L40O85M45j21m50l98j93L5L67Q70J392J578J149L12
55145B2870k90k67J6l9l32k28L58O88L11j43K16J215J752J244M19L88J267K162
55127C1607K480K685L446M462M784M152L262K638K013J125L56J7l01r78j597j661
55111E8490j591k076k834l013k558k149j991j697j300j330j751j878j475j004
55097C1843o54j10N24O12J29j34J15J78l52q11n78n0J58J22J25P4M5N71J594J996
55077C5397J103j30m10P3J94k76n84l74l8J56K57J10l79o04P9J122J308N35KL55
55057C7896P74M32j09K45J463K386K170J110J35j10L54J022J372J293J122J264
$$ plain form
55182 10332 11328 12707 14199 15183 15512 15680 16120 16574 16402 15393 14065 13184 13178 13970 15089 15900 16060 15882
55164 15882 15985 16505 16946 16950 16859 17199 17884 18329 18208 17758 17360 17167 17202 17569 18439 19831 21409 22558 22870
55145 22870 22580 22313 22329 22290 21958 21730 22088 22776 23087 22944 23160 24375 26127 27371 27790 28178 29445 31607
55127 31607 34087 36772 40218 44680 49464 53616 56878 59516 61529 62654 63010 63027 62726 61748 60151 58490
55111 58490 56899 54823 51989 48976 46418 44269 42278 40581 39281 37951 36200 34322 32847 31843
55097 31843 31189 31079 31603 32215 32344 32210 32325 32503 32151 31340 30762 30712 30870 30992 31117 31191 31236 31807 33401 35397
55077 35397 36500 36370 35960 36033 36227 35951 35367 34993 34955 35111 35368 35478 35099 34495 34574 35696 37004 37539 37541 37896
55057 37896 38670 39102 38993 39238 40701 43087 45257 46367 46502 46392 46746 47768 49140 50433 51555 52819
55041E2819J806K471K888K868K585K358K307K232J907J359P84K98j18n47j043
55026G4974j473j468p99J60O63M19j85p14j182j712k171k408k508k524k337j979
55010E4756j669j365q28l67p49j919k603j938q07o03j218j375o19J94L68K32K56
54993C9746L62L89N39R22J279J416J392J172O58J91L88J229J956K134K144K288
54977E8205K153J393N75O08J559K693L484M119M987O077O926P105O776O748P732
54962A21140R499J1097J1865J1838J1120R526P152M625K332j26l095n972p819
54949A83182q687r490j0644j1588j1786j1403j0695r396p326n137l803l499l533
54936G6195l391l189l014k469j276O5Q09R23J036J486K013K467L154M246N303
$$ plain form
55041 52819 54625 57096 59984 62852 65437 67795 70102 72334 74241 75600 76384 76682 76564 76017 74974
55026 74974 73501 72033 71234 71394 72057 72476 72291 71577 70395 68683 66512 64104 61596 59072 56735 54756
55010 54756 53087 51722 50894 50527 49778 47859 45256 43318 42511 41908 40690 39315 38696 38890 39258 39490 39746
54993 39746 40108 40497 41036 41958 43237 44653 46045 47217 47875 48066 48454 49683 51639 53773 55917 58205
54977 58205 60358 61751 62326 62934 64493 67186 70670 74789 79776 85853 92779 99884 106660 113408 121140
54962 121140 130639 141736 153601 165439 176559 186085 193237 197862 200194 200068 196973 191001 183182
54949 183182 174495 165005 154361 142773 130987 119584 108889 99493 92167 87030 83227 79728 76195
54936 76195 72804 69615 66601 64132 62856 62921 63730 64653 65689 67175 69188 71655 74809 79055 84358
54921H4358N882O194O757P574Q104P978P251O167M943L707K223j36l569p102r252
54906A31079r527q821q225p980p742p316o689n810m702l609k697j828r43l85n31
54891E4274j225j925k281k217j648n38O58J131N60l70o16M3P41N70l51j125j254
54874D4427j122j197j287j032p44r96j562j540o85J34J46k81l63j15j32n00o55
54857C2496k89K82O97R42R83O33k0m89m94l47m48p12q04o68m63j51M01J005J202
54838C3756P87K4o82j060r42k93O24J335J594J512J302J108J138J572K123K157
54822D6055J532J020J338K123K470K348K642L683M562M447L942M399O171Q223
54808I4955R485R895R944R795R227Q155O733N011K847K10k588n054o850p839p993
$$ plain form
54921 84358 90240 96434 103191 110765 118869 126847 134098 140265 145208 148915 151138 151002 147433 140331 131079
54906 131079 121552 112731 104506 96526 88784 81468 74779 68969 64267 60658 57961 56133 55190 54805 54274
54891 54274 53049 51124 48843 46626 44978 44440 45098 46229 46789 46419 45803 45846 46587 47157 46806 45681 44427
54874 44427 43305 42108 40821 39789 39045 38049 36487 34947 34262 34396 34542 34261 33898 33783 33651 33151 32496
54857 32496 32207 32489 33186 34128 35111 35744 35724 35235 34741 34394 33946 33234 32430 31762 31299 31148 31549 32554 33756
54838 33756 34543 34567 33885 32825 31883 31590 32214 33549 35143 36655 37957 39065 40203 41775 43898 46055
54822 46055 47587 48607 49945 52068 54538 56886 59528 63211 67773 72220 76162 80561 86732 94955
54808 94955 104440 114335 124279 134074 143301 151456 158189 163200 166047 166257 163669 158615 151765 143926 135933
54793A35933p400o372n373m701m307l984l673l416l135k621j798q37n2K64K1m39
54777H8110m28M74J904L118L890M576N406O191O898P922R422J0876J1773J2378
54763A72510J3288J4504J5436J5598J4704J2368Q410L511j121m929q335j1685
54751B44259j4504j6105j6493j6173j5316j3738j1570r543q346p912p523o588
54739A00448n194l960l405l554m018m304m056l228k153j273p22l07K6l1o14j256
54723F2399j334q61m31m16n97o36n16l53j28K03M65M44K01O2K19M28K49l46p28
54704E8324k58Q26J495J128K39k34k9L95O29O21M36K15K82Q26J451J549J028L01
54686F9224l22o66k96J082K791L515K890K010K010K704L115K858K351K019J880
$$ plain form
54793 135933 128533 122161 116788 112087 107780 103796 100123 96707 93572 90951 89153 88316 88264 88528 88549 88110
54777 88110 87682 88156 90060 93178 97068 101644 107050 113241 120139 128061 137483 148359 160132 172510
54763 172510 185798 200302 215738 231336 246040 258408 266818 270329 269208 264279 255944 244259
54751 244259 229755 213650 197157 180984 165668 151930 140360 130817 122471 114559 107036 100448
54739 100448 95254 91294 87889 84335 80317 76013 71957 68729 66576 65303 64581 64274 64300 64269 63655 62399
54723 62399 61065 60204 59773 59357 58760 58124 57608 57255 57127 57330 57795 58239 58440 58502 58721 59149 59398 59052 58324
54704 58324 58066 58892 60387 61515 61754 61520 61491 61886 62515 63136 63572 63787 64069 64895 66346 67895 68923 69224
54686 69224 68902 68236 67940 69022 71813 75328 78218 80228 82238 84942 88057 90915 93266 95285 97165
54671I7165J849J922K089K251K266J982J443J128J620K817L969M702N494O814
54657A37511Q281R290J0022J1120J2611J3920J4780J5480J6176J6584J6396J5392
54645B97563J3141R275M248q29n304r338j3010j5757j7119j7468j7425j7061j6130
54632A94786j4762j3253j1503r340p200n727m791l648k207j295j443k080k456
54619A15081k623k907k914k040p02j02o35j409j618j565j849k209j944j071l42
54604I1151k09m67p68r43q10l02J69J13k24j12M38M65n13j632j790j105n19l78
54586H2564k47M3J02k42n75o30o65q62q58l23M31Q02O27J84k63n71n60k31Rk30
54566G8505o35m54M73J318J206K75m90l92L00Q03P40M51N30J142J882K267K264
$$ plain form
54671 97165 99014 100936 103025 105276 107542 109524 110967 112095 113715 116532 120501 125203 130697 137511
54657 137511 145792 155082 165104 176224 188835 202755 217535 233015 249191 265775 282171 297563
54645 297563 310704 319979 324227 323398 318094 308756 295746 279989 262870 245402 227977 210916 194786
54632 194786 180024 166771 155268 145928 138728 133001 128210 124562 122355 121060 119617 117537 115081
54619 115081 112458 109551 106637 104597 103895 103793 103158 101749 100131 98566 96717 94508 92564 91493 91151
54604 91151 90942 90475 89707 88764 87954 87652 87821 87934 87710 87598 88036 88501 87988 86356 84566 83461 82942 82564
54586 82564 82317 82360 82462 82220 81645 81015 80350 79488 78630 78307 78738 79540 80167 80351 80088 79517 78957 78726 78735 78505
54566 78505 77870 77416 77889 79207 80413 80688 80198 79806 80106 80909 81649 82100 82630 83772 85654 87921 90185
54549I0185K319K853L895N164O377P330P821P791P502P452P941Q753R313R175
54535A83871Q323P076N643L842J336j745m638o633p755q500q931q524p156n708
54521A50501n238n702o030n499m542m022m043l883l022j810j018r56j271j604
54507A01861k021k632l013k510j193J3L49P9k1L04O84Q16P54N71K96J99N56J003
54489I6095P40l38j242j102l11Q1j65l27O3O00P57N93L65l6q03j620j932j682
54471H9736j299r41l10N96J107O75k25n51k5N34K76o59j423j429p60J64R33J278
54453H7677J150P71L65n6n19p59m20L87J015R69N13M22J068J962K183J340n4j127
54435I6887j517j489j359j122p63m73l24n4M50P22L06m94r46q81p82q35o41L4
$$ plain form
54549 90185 92504 95357 99252 104416 110793 118123 125944 133735 141237 148689 156630 165383 174696 183871
54535 183871 192194 199270 204913 208755 210091 208346 203708 197075 189320 180820 171889 163365 156209 150501
54521 150501 145263 139561 133531 128032 123490 119468 115425 111542 108520 106710 105692 104736 103465 101861
54507 101861 99840 97208 94195 91685 90492 90505 90854 90933 90912 91216 91900 92716 93470 94041 94337 94536 95092 96095
54489 96095 96835 96497 95255 94153 93842 93923 93758 93431 93494 94094 94851 95444 95809 95773 94970 93350 91418 89736
54471 89736 88437 87496 87186 87782 88889 89564 89339 88788 88763 89297 89573 88914 87491 86062 85302 85466 86399 87677
54453 87677 88827 89598 89963 89907 89388 88629 88209 88596 89611 90580 91093 91515 92583 94545 96728 98068 98014 96887
54435 96887 95370 93881 92522 91400 90637 90164 89840 89786 90236 90958 91264 90770 89824 88943 88161 87326 86685 86719
54417H6719Q32J403J838K143J842P16n04q20j32Q52J690K406K780K265R08l64
54401A04574q84j075j591k084j604j57J005Q05m97j836k494k414j875j319j153
54386H7401j232q57J57Q16J62j162j562p39j52q11j762j499o4J263J780J806J619
54369H5164J096M01N1J78L93N35Q31J292J511J333J096J088J246J479J717J627
54353A01038R17J6k72J16M48L93M00O10L09r12k241k636k185j798j943k346k576
54336H7338k407j806j083p56q54p81k71N7l52j029j190r48r68j246j238r83j139
54319G0344j809k280k119j703j426j107n52m9J14J25K50L40J51j67k91k26k02
54302E9393l16n24q12j083j008l98L52N73J18m60o51n81o49p94n99n0K39j24o60
$$ plain form
54417 86719 87551 88954 90792 92935 94777 95493 94989 94169 94037 94889 96579 98985 101765 104030 104938 104574
54401 104574 103690 102615 101024 98940 97336 97179 98184 98989 98492 96656 94162 91748 89873 88554 87401
54386 87401 86169 85312 85469 86285 86447 85285 83723 82984 82832 82021 80259 78760 78696 79959 81739 83545 85164
54369 85164 86260 86661 86712 86890 87283 87818 88649 89941 91452 92785 93881 94969 96215 97694 99411 101038
54353 101038 101955 101971 101699 101815 102263 102656 103056 103666 103975 103063 100822 98186 96001 94203 92260 89914 87338
54336 87338 84931 83125 82042 81286 80432 79651 79380 79437 79085 78056 76866 75918 74950 73704 72466 71483 70344
54319 70344 68535 66255 64136 62433 61007 59900 59348 59299 59413 59538 59788 60128 60279 60112 59821 59595 59393
54302 59393 59077 58553 57741 56658 55650 55252 55604 56177 56295 55835 55184 54603 53954 53160 52561 52511 52750 52626 51966
54283E1966o15nM65L88R2M3K85N53N56Q5o95j044l34R51J557J031K93K93Q02J052
54263E7719Q63N21J29k01l0P42J327J027L83M77J318J879J583Q39J02n57r37o42
54245F6542J63P06O03K77J67K05K29K65J54l95j126j261n67K08K97k00p47j119
54227F4401j310j211p90l33j05r5k56o09r40q51l61L8P0l5j49m80q85o96K74J221
54207E6898J411J200J259J390R32Kn35k93K45N57O35O14M33N3l82p34r64j056
54189F1665j040j044j114j075q45o78p67q24n47k51n34j323j822j536p93j55K27
54172D7544N03P32Q86R49Q15K88n69j310j488j102m97K5L69N46N89N47M12J10
54154D9349l72q50j010o89p7L51J53o69j580j850j155J20J190J540J271Q05L66
$$ plain form
54283 51966 51351 51346 51811 52199 52291 52334 52619 53172 53728 53813 53118 52074 51740 52691 54248 55279 55572 55865 56667 57719
54263 57719 58582 59103 59232 59031 59001 59743 61070 62097 62480 62957 64275 66154 67737 68576 68678 68121 67184 66542
54245 66542 66705 67411 68014 68291 68458 68663 68892 69157 69311 68916 67790 66529 65962 66170 66467 66267 65520 64401
54227 64401 63091 61880 61090 60757 60652 60557 60301 59692 58752 57901 57540 57578 57648 57613 57464 56984 56099 55403 55677 56898
54207 56898 58309 59509 60768 62158 63090 63092 62557 62264 62509 63066 63701 64315 64748 64801 64419 63685 62721 61665
54189 61665 60625 59581 58467 57392 56547 55869 55102 54278 53731 53480 52946 51623 49801 48265 47472 47317 47544
54172 47544 48047 48779 49665 50614 51429 51717 51148 49838 48350 47248 46751 46776 47145 47691 48280 48827 49239 49349
54154 49349 48977 48127 47117 46428 46351 46702 46855 46186 44606 42756 41601 41721 42911 44451 45722 46527 46893
54137D6893p1l95k75L46R61J013N93K57K37K30n3n11q60r30o29MO45R36R99J252
54117E0642J637J522O97j33k41M3k25j278k285k352j457l23L37M02K60K30J20
54100D7596m66j361j763j172oR54J402J457J161N05k09n90o49o74o82m33J14O59
54082D5843Q76O25ro15o46l8N87P61Q22J251J727J589R74N84M44n9q36q86J49
54063E3143J183J136M04J05M36O51M20L15R17K004K795K699J865J105J116J635
54047G1929J756J230Q34J089J324Q28K83R49K626L753L591L134L408M001L957
54032A04692L361L023L165L297L218L273L612L843L551K780J889J271J121J209
54018A43305R96L37j00L28J150J144j08j647k331k098j750j856k325k781l025
$$ plain form
54137 46893 46822 46427 46152 46498 47459 48472 49065 49322 49559 49789 49736 49225 48365 47435 46806 46810 47455 48391 49390 50642
54117 50642 52279 53801 54498 54365 54124 54167 53942 52664 50379 48027 46570 46247 46584 46986 47246 47476 47596
54100 47596 47130 45769 44006 42834 42828 43782 45184 46641 47802 48307 48098 47508 46859 46185 45503 45070 45184 45843
54082 45843 46719 47344 47335 46720 46074 46036 46623 47384 48206 49457 51184 52773 53747 54331 54775 54716 53880 52994 53143
54063 53143 54326 55462 55866 55971 56407 57058 57478 57793 58710 60714 63509 66208 68073 69178 70294 71929
54047 71929 73685 74915 75749 76838 78162 78990 79273 80222 82848 86601 90192 93326 96734 100735 104692
54032 104692 108053 111076 114241 117538 120756 124029 127641 131484 135035 137815 139704 140975 142096 143305
54018 143305 144301 144638 144538 144866 146016 147160 147052 145405 143074 140976 139226 137370 135045 132264 129239
54003A29239l134l276l370l003k021j067j076k048k835k488j333l88j50m60j157
53988A01433k134k943l010k316j408p20l04k33p01j578k257k194j434n00N5pm19
53971G9330n96l19q5m85j291j585q88L07J145J172M82m41r11n40K77P52P07P17
53953G7748J113J520J616J771K339K827K509J612J184J777K862L646L967M112
53939A10603M193M075L780L683M108M862N238M626L081J270q5n82j66Q94K010
53924A51590K543K308J727J403J638K313L035L400L320L115L123L292L430L669
53910A89906M228M851N017M710M325L807K681J135J72J58J09q66k044k033q36
53895B15320M2m63j857l003l453l567l788m124m218l834l360l514m431n283n268
$$ plain form
54003 129239 126105 122829 119459 116456 114435 113368 112292 110244 107409 104921 103588 103200 103050 102590 101433
53988 101433 99299 96356 93346 91030 89622 88902 88598 88365 87664 86086 83829 81635 80201 79701 79756 79749 79330
53971 79330 78734 78415 78330 77845 76554 74969 74081 74388 75533 76705 77187 76746 75835 75295 75572 76324 77031 77748
53953 77748 78861 80381 81997 83768 86107 88934 91443 93055 94239 96016 98878 102524 106491 110603
53939 110603 114796 118871 122651 126334 130442 135304 140542 145168 148249 149519 149434 148852 148686 149580 151590
53924 151590 154133 156441 158168 159571 161209 163522 166557 169957 173277 176392 179515 182807 186237 189906
53910 189906 194134 198985 204002 208712 213037 216844 219525 220660 220832 220990 221099 220233 218189 216156 215320
53895 215320 215362 214899 213042 210039 206586 203019 199231 195107 190889 187055 183695 180181 175750 170467 165199
53880A65199m600m037l801l602l497l858m474m534l710k650k126k201k469k622
53866A17018k527k149j699j533j728j981k036j905j631j216q42p60q29n98K1N22
53850I6127M35j63q27j127p96NN23nj312k226k031j280r16j076j186q85l44J22
53832H3038L39K85J76L64Q99J337J207N95J4j51J15O34J132J302J011M34j09l97
53814I2225l58j22rj98k84L49J647K721K903K495K185K185K437L104M174M901
53798A20355M503L375K746L064L491L294K910L106L598L378K136O95lJ39N87Q42
53782A58216O46j03j188k000k050j591j400j818k337k312j864j689k138k831l186
53767A32355l004k492j987j776j890k030j869j519j418j648j746j378q35n97o50
$$ plain form
53880 165199 160599 156562 152761 149159 145662 141804 137330 132796 129086 126436 124310 122109 119640 117018
53866 117018 114491 112342 110643 109110 107382 105401 103365 101460 99829 98613 97771 97011 96182 95584 95605 96127
53850 96127 96562 96399 95572 94445 93649 93654 94177 94172 92860 90634 88603 87323 86407 85331 84145 83260 82916 83038
53832 83038 83377 83662 83838 84202 85101 86438 87645 88240 88254 88103 88218 88852 89984 91286 92297 92731 92622 92225
53814 92225 91867 91745 91736 91538 91254 91603 93250 95971 98874 101369 103554 105739 108176 111280 115454 120355
53798 120355 124858 128233 130979 134043 137534 140828 143738 146844 150442 153820 155956 156651 156648 156787 157374 158216
53782 158216 158862 158759 157571 155571 153521 151930 150530 148712 146375 144063 142199 140510 138372 135541 132355
53767 132355 129351 126859 124872 123096 121206 119176 117307 115788 114370 112722 110976 109598 108763 108166 107516
53752A07516o77o83r67j480j687j301p20n80r98j468j425p43K25R47J047N40k44
53735I7302r03j261j386j418j393j281j142j018p55j31O84J096P76K18K19Q70
53719I0477J503J667J617J620J358M71n78q71j73P18R76O50M26P16J232J412J091
53702A04312P11Q78J732K752L242K943K249J837K137K990L778L987L712L462L443
53687A44165L353K944K495K403K600K714K668K684K808K858K862L087L509L736
53673A84886L613L514L752M061M027L750L600L521L128K476K172K527L003K871
53659B30901K104J265P06L07k2j13Q7K33K4l12k76J51L74r3j035j810k051j880
53641B28560j484r35m84o46j577k532k482j409m92p09j623k056j664j152j066
$$ plain form
53752 107516 106839 106156 105189 103709 102022 100721 100001 99421 98423 96955 95530 94787 95012 95959 97006 97546 97302
53735 97302 96399 95138 93752 92334 90941 89660 88518 87500 86745 86614 87298 88394 89170 89388 89607 90477
53719 90477 91980 93647 95264 96884 98242 98713 98135 97264 97091 97809 98785 99435 99861 100577 101809 103221 104312
53702 104312 105023 105901 107633 110385 113627 116570 118819 120656 122793 125783 129561 133548 137260 140722 144165
53687 144165 147518 150462 152957 155360 157960 160674 163342 166026 168834 171692 174554 177641 181150 184886
53673 184886 188499 192013 195765 199826 203853 207603 211203 214724 217852 220328 222500 225027 228030 230901
53659 230901 233005 234270 234976 235283 235261 235148 235235 235468 235492 235180 234904 235055 235429 235336 234301 232491 230440 228560
53641 228560 227076 226141 225657 225011 223434 220902 218420 217011 216519 215810 214187 212131 210467 209315 208249
53626B08249j094q16m97n98r74j074p24k16K29O62J111J470J666J690J511J213
53610B11808J047J127J243J228J283J624K056K402K976M081N213N501M937M439
53596B50965M595N021N167M979M572L927L341L433M210M723M305L628L804M832
53582C11502N717N868N548N047M247L282K875L572M989O171O495N985N006L919
53568C80223K998K350J862J241L02p94j622j860j601j242j131j480k409l724m701
53553C68412m575l430k261j927k356k953l366l536l426l232l445m178m649m022
53539C21056k629j658j612j800j522r99p69p80o33l25j18J26Q34J916K644K534
53523C16265J929J425J118Q04O28R62J728K385K727L215M198N307O045O584P441
$$ plain form
53626 208249 207155 206339 205842 205244 204270 203196 202472 202256 202485 203147 204258 205728 207394 209084 210595 211808
53610 211808 212855 213982 215225 216453 217736 219360 221416 223818 226794 230875 236088 241589 246526 250965
53596 250965 255560 260581 265748 270727 275299 279226 282567 286000 290210 294933 299238 302866 306670 311502
53582 311502 317219 323087 328635 333682 337929 341211 344086 347658 352647 358818 365313 371298 376304 380223
53568 380223 383221 385571 387433 388674 388976 388182 386560 384700 383099 381857 380726 379246 376837 373113 368412
53553 368412 363837 360407 358146 356219 353863 350910 347544 344008 340582 337350 333905 329727 325078 321056
53539 321056 318427 316769 315157 313357 311835 310836 310067 309287 308654 308329 308211 308337 309171 311087 313731 316265
53523 316265 318194 319619 320737 321541 322169 323131 324859 327244 329971 333186 337384 342691 348736 355320 362761
53508C62761Q626R702J0591J1630J2803J3673J4189J4890J5988J6976J7546J8233
53496E27608J9591K1179K2066K2096K2072K2790K4390K6479K8502L0047L1089
53485G97909L1890L2458L2455L1873L1332L1338L1658L1968L2660L4316L6746
53474A156603L9266M1676M4102M6054M6610M5594M3743M1549L8684L4862L0505
53463A609248K6313K2751K0207J8980J8787J8852J8912J9621K1586K4379K6895
53452A846531K8288K8330K7228K5478K3494K1148J7976J4038J0058O357K311k653
53440B048584p982j2546j5999j8912k1749k4342k6440k8220l0124l2448l5089
53429A794733l7514l8991l9193l8560l7916l7718l7906l8291l8839l9548m0276
$$ plain form
53508 362761 371387 381089 391680 403310 416113 429786 443975 458865 474853 491829 509375 527608
53496 527608 547199 568378 590444 612540 634612 657402 681792 708271 736773 766820 797909
53485 797909 829799 862257 894712 926585 957917 989255 1020913 1052881 1085541 1119857 1156603
53474 1156603 1195869 1237545 1281647 1327701 1374311 1419905 1463648 1505197 1543881 1578743 1609248
53463 1609248 1635561 1658312 1678519 1697499 1716286 1735138 1754050 1773671 1795257 1819636 1846531
53452 1846531 1874819 1903149 1930377 1955855 1979349 2000497 2018473 2032511 2042569 2048926 2051237 2048584
53440 2048584 2040602 2028056 2012057 1993145 1971396 1947054 1920614 1892394 1862270 1829822 1794733
53429 1794733 1757219 1718228 1679035 1640475 1602559 1564841 1526935 1488644 1449805 1410257 1369981
53418A369981m0675m0233l8500l5433l1525k7473k3812k0787j8372j6276j4137
53407A062758j1782r113n833j692K899P003J0125J2682J5287J7975K0494K2853
53395A143656K5148K7218K8914L0378L1623L2232L2138L2236L3523L5793L7985
53384A490844L9695M1498M3877M6730N0043N4198N9182O4223O8561P2048P4709
53373B105608P6451P7636P9238Q1749Q4372Q6015Q6717Q7371Q8307Q8832Q8162
53362C030458Q6071Q2731P8521P4195P0621O8101O6304O4988O4386O4669O5478
53351C816523O6239O6584O6234O4718O1605N6683M9620L9637K5935Q553j1368
53340D310963l1974n1240o7534q0169q9453r5907r9674j01036j01182j01643j02820
$$ plain form
53418 1369981 1329306 1289073 1250573 1215140 1183615 1156142 1132330 1111543 1093171 1076895 1062758
53407 1062758 1050976 1041863 1036030 1034338 1037237 1044240 1054365 1067047 1082334 1100309 1120803 1143656
53395 1143656 1168804 1196022 1224936 1255314 1286937 1319169 1351307 1383543 1417066 1452859 1490844
53384 1490844 1530539 1572037 1615914 1662644 1712687 1766885 1826067 1890290 1958851 2030899 2105608
53373 2105608 2182059 2259695 2338933 2420682 2505054 2591069 2677786 2765157 2853464 2942296 3030458
53362 3030458 3116529 3199260 3277781 3351976 3422597 3490698 3557002 3621990 3686376 3751045 3816523
53351 3816523 3882762 3949346 4015580 4080298 4141903 4198586 4248206 4287843 4313778 4322331 4310963
53340 4310963 4278989 4227749 4160215 4080046 3990593 3894686 3795012 3693976 3592794 3491151 3388331
53329C388331j03729j03467j02245j00776r9309r7901r7066r7236r7832r7715
53319B391055r6501r4712r2630q9798q5869q1189p6149p0690o4824n9138n4080
53308A525475m9206m3758l7743l1879k6636k2003j8139j5526j4251j3605j2634
53297A240095j0881q489n975m041l221l375l645l206k024o96L40J285K619M442
53283A203228O317P845R211J0888J2857J4565J5887J7575K0266K3342K5581K6743
53271A394305K7842K9634L1770L3698L5653L8039M0392M1774M2029M1804M1474
53260A798414M0827L9952L9662M0597M2378M4078M5095M5135M3680M0161L4785
53249B254764K8645K2731J7023J0749L427m647j2888k1019k8987l6494m2996m8329
$$ plain form
53329 3388331 3284602 3181135 3078890 2978114 2878805 2780904 2683838 2586602 2488770 2391055
53319 2391055 2294554 2199842 2107212 2017414 1931545 1850356 1774207 1703517 1638693 1579555 1525475
53308 1525475 1476269 1432511 1394768 1362889 1336253 1314250 1296111 1280585 1266334 1252729 1240095
53297 1240095 1229214 1220725 1214750 1210709 1207488 1204113 1200468 1197262 1195238 1194542 1194882 1196167 1198786 1203228
53283 1203228 1209545 1217390 1226601 1237489 1250346 1264911 1280798 1298373 1318639 1341981 1367562 1394305
53271 1394305 1422147 1451781 1483551 1517249 1552902 1590941 1631333 1673107 1715136 1756940 1798414
53260 1798414 1839241 1879193 1918855 1959452 2001830 2045908 2091003 2136138 2179818 2219979 2254764
53249 2254764 2283409 2306140 2323163 2333912 2337339 2332692 2319804 2298785 2269798 2233304 2190308 2141979
53237B141979n2868n6914o0130o1957o2425o2098o1237n9457n6453n2699m9134
53226A506607m6339m4275m2726m1803m1983m3737m6871n0251n2503n3145n2877
53215I90097n2541n2114n0937m8635m5324m1145l6155l0778k5863k2060j9336
53204E65209j7118j4810j2212r740q204q061q857r676j0114j0432j0832j1110
53192D34043j1144j1147j1241j1174j0778j0340j0124r981r676r300q948q343
53180C11847p294o282o047o688p626q336q676q608q140p560p239p103o663n688
53166B09897m482l483k942k979l470l836l449k488j899k174k636k327j290m27
53152A72015l11o80j099j590k269k850k803j987q45L9L99K83j88q76j543j908
$$ plain form
53237 2141979 2089111 2032197 1972067 1910110 1847685 1785587 1724350 1664893 1608440 1555741 1506607
53226 1506607 1460268 1415993 1373267 1331464 1289481 1245744 1198873 1148622 1096119 1042974 990097
53215 990097 937556 885442 834505 785870 740546 699401 663246 632468 606605 584545 565209
53204 565209 548091 533281 521069 511329 503125 495064 486207 476531 466417 455985 445153 434043
53192 434043 422899 411752 400511 389337 378559 368219 358095 348114 338438 329138 320190 311847
53180 311847 304553 298271 292224 285536 277910 269574 260898 252290 244150 236590 229351 222248 215585 209897
53166 209897 205415 201932 198990 196011 192541 188705 185256 182768 180869 178695 176059 173732 172442 172015
53152 172015 171704 171024 169925 168335 166066 163216 160413 158426 157581 157620 158019 158302 158114 157238 155695 153787
53136A53787j861j540j159q50o59n84n92o67q30j022j036q05o41r01j389j566
53120A37685j415j525k095k355j595k50O18P25P02R66J207J064O83L83K93N17
53104A35608J117J796K006J693J409J419J202K08j255k337k600k273j799j519
53090A34675j597j889j943j501r28q26j280j742j679j097l73K48Q80J744K744
53075A25436L334L008J911P91K34J41N0k44n33o01n72q42j637k571k847k099r67
53058A21992m02n27o12k40J19o2m90n16j25N4l56j063j546j593j347j106j099
53041A11081j298j432j303j031r13j063j283j272q90l75k25o98j423j743j466
53026I4666j021q11p99q31r91j369j676j509q83l03k93q82j420j130m3P87M46
$$ plain form
53136 153787 151926 150386 149227 148377 147718 147134 146542 145875 145045 144023 142987 142182 141541 140640 139251 137685
53120 137685 136270 134745 132650 130295 128700 128450 129068 129793 130495 131461 132668 133732 134415 134798 135091 135608
53104 135608 136725 138521 140527 142220 143629 145048 146250 146458 145203 142866 140266 137993 136194 134675
53090 134675 133078 131189 129246 127745 126817 125991 124711 122969 121290 120193 119820 120068 120948 122692 125436
53075 125436 128770 131778 133689 134480 134714 134855 134905 134661 134128 133527 132955 132113 130476 127905 125058 122959 121992
53058 121992 121590 121063 120451 120211 120330 120268 119778 119262 119137 119191 118835 117772 116226 114633 113286 112180 111081
53041 111081 109783 108351 107048 106017 105104 104041 102758 101486 100596 100221 99996 99298 97875 96132 94666
53026 94666 93645 92834 92035 91204 90213 88844 87168 85659 84776 84473 84180 83298 81878 80748 80705 81492 81938
53009H1938o05j104p09l33o17j000q55n98r00j452j403o73O0M15N59N80M58N38
52991G4299J218K109K322J663Q47L77Ln12p61l39L55N71K42J14P95J921K490J991
52973H9705J009M66M72K97m09j029q96k30L22N80O64M26k09o70l41M23P09L84
52955I1673J60L89O92P88Q58R07O07O2p7M74J220J719K024K078J441J45q61p53
52937A03546J73J080J650K088K495K799L009L091K853K314J907J947K196K277
52923A33425K137J817J169K38m80n82k91k0J84L65K41l62j012j236j221j429j668
52906A31275j366n78l7j28m90o68o78p15p98q87j020j145j084p66l15J52N63P85
52888A22100P70P46R01Q90J89r90j641j121k3N11J52l35j67M80P97L89k87n51
$$ plain form
53009 81938 81333 80229 79520 79187 78570 77570 76715 76117 75217 73765 72362 71689 71749 72164 72723 73303 73761 74299
52991 74299 75517 77626 79948 81611 82458 82835 82838 82326 81565 81226 81581 82152 82394 82508 83303 85224 87714 89705
52973 89705 90714 91180 91652 91949 91540 90511 89615 89385 89707 90287 90951 91377 91168 90498 90157 90580 91289 91673
52955 91673 91833 92222 92914 93702 94560 95467 96074 96136 96059 96533 97753 99472 101496 103574 105015 105160 104299 103546
52937 103546 103719 104799 106449 108537 111032 113831 116840 119931 122784 125098 127005 128952 131148 133425
52923 133425 135562 137379 138548 138786 138306 137724 137433 137413 137597 137962 138203 137841 136829 135593 134372 132943 131275
52906 131275 129909 129331 129294 129166 128676 128008 127330 126615 125817 124930 123910 122765 121681 120915 120600 120752 121315 122100
52888 122100 122870 123616 124517 125407 125596 124606 122965 121844 121821 122332 122484 122149 121982 122462 123259 123648 123361 122810
52870A22810k34L62R38J332J418J211J107J539K287K561J958J005M97O24R86J146
52854A41547Q42J7j004j591j459j017q31r32j066j263j655j971j818j369j225
52839A25205j472j555j126n46l09l66l48j10J94L79L28m7p53j615k260k223j290
52822A12086R6R35N92m27j051r11n72n11n08k67l9j02j42L17J074J487J428J374
52804A14859J539J464P43l17j029j060n61J32O29M77m97j888l011l525l519l078
52788A01358k131q66J38M28J42k83o37r38j128j108r59q07n89k78j99o79j351
52771I0113j404o25J91J84n92j387j702j662j620j733j870j787j422j011p99o19
52755G2255j07O47J013O72J31P6M92Q27P47L73q4m59m98o3N06N98Oq67j501j698
$$ plain form
52870 122810 122576 122938 123876 125208 126626 127837 128944 130483 132770 135331 137289 138294 138791 139415 140401 141547
52854 141547 142389 142406 141402 139811 138352 137335 136504 135572 134506 133243 131588 129617 127799 126430 125205
52839 125205 123733 122178 121052 120506 120197 119831 119483 119373 119567 119946 120274 120227 119474 117859 115599 113376 112086
52822 112086 112182 113117 113709 113282 112231 111320 110748 110237 109729 109462 109423 109321 109179 109496 110570 112057 113485 114859
52804 114859 116398 117862 118605 118288 117259 116199 115638 115770 116399 116876 116379 114491 111480 107955 104436 101358
52788 101358 99227 98361 98499 98927 99069 98786 98149 97211 96083 94975 94016 93209 92620 92342 92143 91464 90113
52771 90113 88709 88084 88275 88459 87867 86480 84778 83116 81496 79763 77893 76106 74684 73673 72874 72255
52755 72255 72148 72795 73808 74480 74611 74687 75179 76006 76753 77126 77042 76583 76085 76022 76528 77126 77132 76265 74764 73066
52735G3066j571j328j187j230j266j023n46j95k03m20n51n23m83n39o27o58o64
52718F0052o95o35k90K10L63l2m19j46M77M39n08j328j035K4P22O06J89K9J49
52699E8172K94K58Mj95J28J005J723J605Q67K28j35n40q67n33M92J410J569J204
52681F6689Q67P12O61P55J015J164R75N74K33Jj22J8N18J130J533J733J976K310
52663H2742K445K079J234L40l7L69J280K113K501K487K389K510K909L311L361
52648A12033L103K912K847K413J242l04j689k890m019m664m430l863l889m383
52634I4419m265l105j681p06k0N68O07j80j144j446j046m10J64M96L68J8J46Q68
52616H3651J288P93O2%L19J79l15l79k7l2n57q99p02m19l56k47nj9l53m35Q0P82
$$ plain form
52735 73066 71495 70167 68980 67750 66484 65461 64915 64720 64517 64097 63546 63023 62540 62001 61374 60716 60052
52718 60052 59357 58722 58432 58642 59005 58973 58554 58408 58885 59324 58816 57488 56453 56477 57199 57805 57994 58023 58172
52699 58172 58466 58724 58728 58533 58661 59666 61389 62994 63861 64089 63954 63414 62547 62014 62506 63916 65485 66689
52681 66689 67556 68268 68929 69684 70699 71863 72838 73412 73645 73646 73524 73542 74060 75190 76723 78456 80432 82742
52663 82742 85187 87266 88500 88840 88803 89172 90452 92565 95066 97553 99942 102452 105361 108672 112033
52648 112033 115136 118048 120895 123308 124550 124246 122557 119667 115648 110984 106554 102691 98802 94419
52634 94419 90154 87049 85368 84662 84642 85210 85817 85637 84493 83047 82001 81591 81755 82251 82619 82637 82783 83651
52616 83651 84939 85732 85794 85794 86113 86292 85977 85598 85571 85539 84982 84083 83381 82962 82606 82359 82354 82335 81982 81547 81627 82409
52594H2409J174J259J175Q69M50K89M18L72Nj28L77J046J196Q62N56M80M72M78
52576I3759N63O83P81R16R68N26n02j434j505p93p3J46j8k49l46k11J00L29L08
52557I3948J85Q4j40m71l86M33J298J211K71m39m34l40n81n12L69J221Q52m70
52539I6099j259q08N4L53J78O5j6l83q54r77p72n96l78J91Q01O64k12p08o3R61
52519I2340J076K16n32n22k27k53m90o16p24r37q95k08P96J335J093M87M6o5Q3
52500I2003L29L89lp13j251j304j058q38o55k90K55O28N38J69O7M56Q43N38l04
52481H9799n83M82K185L014K384J184M55J91j75o54p05k12L12N46Q31J483K093
52464A02630J951J008j0m38l36k42m62q00q98o52k65j1K4lJ40N10Q74R38O86M88
$$ plain form
52594 82409 83583 84842 86017 86886 87336 87625 88043 88415 88420 88292 88669 89715 90911 91773 92329 92809 93281 93759
52576 93759 94322 95005 95786 96702 97670 98196 97694 96260 94755 93962 93889 94035 94017 93768 93422 93211 93311 93640 93948
52557 93948 94133 94217 94077 93606 93220 93653 94951 96162 96433 95994 95560 95220 94639 94127 94496 95717 96569 96099
52539 96099 94840 94032 94086 94439 94617 94682 94666 94283 93429 92452 91680 91084 90706 90897 91698 92362 92150 91442 91379 92340
52519 92340 93416 93632 93100 92578 92351 92098 91608 90992 90268 89331 88436 88228 89024 90359 91452 91939 91985 91920 92003
52500 92003 92332 92721 92718 92005 90754 89450 88392 87554 86899 86609 86864 87492 88030 88199 88266 88722 89565 90103 89799
52481 89799 89216 89698 91883 94897 97281 98465 98920 99111 98936 98282 97577 97365 97677 98223 99054 100537 102630
52464 102630 104581 105589 105579 105141 104805 104563 104101 103301 102403 101751 101486 101475 101499 101496 101636 102146 103020 103958 104644 105132
52444A05132P13J259J538J046o9j059j220m94N18J094R66L99j37l26j59J53L06
52427A09660K06J79O07J308J495O95n05j092q64n32n44m40K69J185J526J215Q14
52410A15182N25j8r89j935k309k016j256k82N25P64N09L36N72Q17N77M7j65J11
52392A10995M64N81N38M37K05o9k2N35J222J477J155N99J41j50l02k10J91O78
52374A18465Q75O92M48M75P57J080J360J569J483Q90O3l56p6N22R28J071J085
52357A31331R99Q78R73J292J331P06j39m06k4L60M32N72J042J457J447J326J578
52340A45155J995J849Q81k58o15J87J599K521K204R55j66m18k3L49M16L02O5l52
52322A56646p78q29l38N00J361J998K251K168K061K138K107J539O50L13J090K549
$$ plain form
52444 105132 105845 107104 108642 109688 109619 108560 107340 106846 107364 108458 109424 109823 109686 109360 109201 109354 109660
52427 109660 109866 110045 110652 111960 113455 114150 113645 112553 111689 111157 110613 110173 110442 111627 113153 114368 115182
52410 115182 115707 115689 114700 112765 110456 108440 107184 106902 107427 108191 108700 109036 109608 110425 111002 111049 110884 110995
52392 110995 111459 112040 112578 113015 113220 113151 113129 113664 114886 116363 117518 118117 118258 118108 117806 117596 117787 118465
52374 118465 119340 120032 120480 120955 121712 122792 124152 125721 127204 128094 128157 127801 127725 128247 129175 130246 131331
52357 131331 132330 133208 134181 135473 136804 137510 137371 136965 136941 137301 137733 138305 139347 140804 142251 143577 145155
52340 145155 147150 148999 149880 149622 149007 149194 150793 153314 155518 156473 156307 155889 155866 156215 156631 156933 156998 156646
52322 156646 155868 155039 154701 155201 156562 158560 160811 162979 165040 167178 169285 170824 171474 171787 172877 175426
52306A75426L771M253M158L927L978M554N554O548P171P429P466P221O663O215
52292B54334O386P032P472P469P624Q451R548J0114J0069J0055J0452J0945J1135
52279C71086J1067J0929J0638J0204J0025J0478J1241J1550J1172J0701J0777
52268D89868J1254J1444J0978J0208R695R563R406Q787P721O635N929N598N260
52255F02346M574L605K759K278J869J006l30j453j687j159n82l84l70k65j22j1
52239F12074K56Q31J565K276L055L977M757N101N244N748O788P947Q788R229R484
52224F87120R772J0176J0568J0725J0632J0519J0414R970R045Q088P519O985N880
52211H07413M446L571L441L245K368J168K39m89j438k687m021n257o133o383o238
$$ plain form
52306 175426 179197 183450 187608 191535 195513 200067 205621 212169 219340 226769 234235 241456 248119 254334
52292 254334 260720 267752 275224 282693 290317 298768 308316 318430 328499 338554 349006 359951 371086
52279 371086 382153 393082 403720 413924 423949 434427 445668 457218 468390 479091 489868
52268 489868 501122 512566 523544 533752 543447 553010 562416 571203 578924 585559 591488 597086 602346
52255 602346 606920 610525 613284 615562 617431 618437 618107 616654 614967 613808 613226 612842 612472 612207 612085 612074
52239 612074 612330 613161 614726 617002 620057 624034 628791 633892 639136 644884 651672 659619 668407 677636 687120
52224 687120 696892 707068 717636 728361 738993 749512 759926 769896 778941 787029 794548 801533 807413
52211 807413 811859 815430 818871 822116 824484 825652 825891 825402 823964 821277 817256 811999 805866 799483 793245
52196G93245o438p244p969q012p818q167q905r218q886q428q100p612o895o355
52182F83198o175o040n758n554n473n111m322l658l676m171m490m332l930l614
52168F16894l485l405l080k341j478j035j179j510j687j823k040k034j517p96
52154E89484m52n74p20o10m83p56j605k835l941m349l915l116k570k465k671l150
52138E55272l819m200l803k927k512l040l990m634m859m915m797m397l963l928
52124D99488m309m663m586m012l128k350k181k705l282l183k459j732j229o33
52110D59036J10N17M18M14R95J722J940J885K347L417M354M776N176N976O801
52095D99884P104P127P605Q671R714J0317J0864J1861J3054J3635J3395J3195
$$ plain form
52196 793245 786807 779563 771594 763582 755764 747597 738692 729474 720588 712160 704060 696448 689553 683198
52182 683198 677023 670983 665225 659671 654198 649087 644765 641107 637431 633260 628770 624438 620508 616894
52168 616894 613409 610004 606924 604583 603105 602070 600891 599381 597694 595871 593831 591797 590280 589484
52154 589484 589032 588458 587738 587128 586645 585889 584284 581449 577508 573159 569244 566128 563558 561093 558422 555272
52138 555272 551453 547253 543450 540523 538011 534971 530981 526347 521488 516573 511776 507379 503416 499488
52124 499488 495179 490516 485930 481918 478790 476440 474259 471554 468272 465089 462630 460898 459669 459036
52110 459036 459146 459663 460081 460495 461490 463212 465152 467037 469384 472801 477155 481931 487107 493083 499884
52095 499884 506988 514115 521720 530391 540105 550422 561286 573147 586201 599836 613231 626426
52083F26426J3970J5508J6645J6709J6230J6009J6057J5873J5381J4931J4491
52072G98230J3595J2179J0894J0269J0044R587Q616P274N826M534L489K389P76
52059H97702j270l000l877m256m822n713o527o987p148p173p304p809q510q648
52045H14658p760o501n955o217o349n806n120m828m474l285j413J96J017J450
52031G59613K055K835L481L967M528N196N708N842N701N596N744O139O586O795
52017H29786O529N810M904M059L319K700K314K102J642O29n47j185j332j981l939
52002H54810o875r747j1835j2992j3346j3316j3690j5007j6807j8021j8251j8230
51990F86693j8811j9915k0735k0716k0007j9087j8344j8017j8190j8677j8944
$$ plain form
52083 626426 640396 655904 672549 689258 705488 721497 737554 753427 768808 783739 798230
52072 798230 811825 824004 834898 845167 855211 864798 873414 880688 886514 891048 894537 896926 897702
52059 897702 896432 893432 889555 885299 880477 874764 868237 861250 854102 846929 839625 831816 823306 814658
52045 814658 806898 800397 794442 788225 781876 776070 770950 766122 761648 758363 756950 757146 758163 759613
52031 759613 761668 764503 767984 771951 776479 781675 787383 793225 798926 804522 810266 816405 822991 829786
52017 829786 836315 842125 847029 851088 854407 857107 859421 861523 863165 863794 863247 862062 860730 858749 854810
52002 854810 847935 838188 826353 813361 800015 786699 773009 758002 741195 723174 704923 686693
51990 686693 667882 647967 627232 606516 586509 567422 549078 531061 512871 494194 475250
51979D75250j8502j7421j6333j5795j5722j5572j4948j3803j2254j0551r172q477
51967C06700q226p857p352p240p566p505o414m762l470k741k185j729j647j831
51953B36175j803j434j105j030j055j097j321j715k034k237k530k878k971k797
51939B10168k788l199l715l901l698l332k999k834k858k901k828k892l434m204
51925A64585m406l621k359j542j653k421l066k836j761p95q56j658k079j602p88
51910A33142l10k13l99r60j641j742j097n81r54j730j845j084j31M89Q12R17P08
51893A23381K19k95o76r10r14o38k49N3K73L77M1r22k032k490k075j324q95r43
51875A09981j103q30J06J250J791J486J032J173J772K125J908J393R41P86J062
$$ plain form
51979 475250 456748 439327 422994 407199 391477 375905 360957 347154 334900 324349 315177 306700
51967 306700 298474 290617 283265 276025 268459 260954 254540 249778 246308 243567 241382 239653 238006 236175
51953 236175 234372 232938 231833 230803 229748 228651 227330 225615 223581 221344 218814 215936 212965 210168
51939 210168 207380 204181 200466 196565 192867 189535 186536 183702 180844 177943 175115 172223 168789 164585
51925 164585 160179 156558 154199 152657 151004 148583 145517 142681 140920 140125 139269 137611 135532 133930 133142
51910 133142 132832 132619 132220 131260 129619 127877 126780 126199 125245 123515 121670 120586 120455 120944 121756 122673 123381
51893 123381 123600 123305 122629 121719 120805 120167 119918 119971 120244 120621 120662 119740 117708 115218 113143 111819 110924 109981
51875 109981 108878 108048 108154 109404 111195 112681 113713 114886 116658 118783 120691 122084 123025 123811 124873
51860A24873J604J844J460Q42N59N67N98R56K120L731M869N342N799O504O971
51845A68639P126P748R231J0689J1129J0793J0555J0386R367O988L691Q6l603
51832B62825p173j0087j1842j2428j2254j1782j1229j0476r280p694o261n463
51820A46856n132m677l894l202k989l053k887k278j459p40k34J03L15L53J41k72
51804A16951o96r46j046j154j263j129n84J55O15M66k11r75j327j014k85K19K3
51787A07799o63j118r40n12m79r16j240r83l66Qj69o45r20o86m9N70P94N92K35
51768A00312m6k40m04m96m62l60k82k12j15k7pn2j42k67l77l64j93M8L09O03Q52
51747I8078Q71O50M24L65L97M99Q86J565K028J760R43K12k01n58r09q35j73N37
$$ plain form
51860 124873 126477 128321 129781 130623 131182 131749 132347 133303 135423 139154 144023 149365 155164 161668 168639
51845 168639 175765 183513 192744 203433 214562 225355 235910 246296 255663 262651 266342 266428 262825
51832 262825 255652 245565 233723 221295 209041 197259 186030 175554 166274 158580 152319 146856
51820 146856 141724 137047 133153 129951 126962 123909 121022 118744 117285 116545 116311 116414 116729 117082 117223 116951
51804 116951 116255 115309 114263 113109 111846 110717 110133 110288 110903 111369 111158 110183 108856 107842 107557 107776 107799
51787 107799 107136 106018 105078 104566 104087 103171 101931 100948 100582 100590 100421 99776 98856 98170 98121 98691 99485 100077 100312
51768 100312 100266 100026 99622 99126 98664 98304 98022 97810 97695 97668 97661 97609 97467 97200 96823 96459 96266 96314 96623 97226 98078
51747 98078 98949 99599 100023 100388 100785 101284 102170 103735 105763 107523 108466 108678 108477 107919 107010 106175 106002 106539
51729A06539O85L56J03J78L20K11k32r45j780k385k360j655o94K7K78Q8l85q19
51711I7530q44m61k43p42j671k061j397k67L82L68K73M74O82N40K23J47L42N29
51693I3804O19Q74J423J909J849J315R69J268J724J362nj396j845j598j578j983
51677I8711k121j640j029p14m09J28M15J8n62n13P5M29L34L40P07R89R03Q84J351
51658I8296J966K074J605J063O93J93p47j826k351j986j167n91m15k22K60P69
51642I7614J070J430K094K597K236J170M17O21J324J722J662J597J767J902J668
51627A20891J142P42P41R35R63Q27Q56R55M16j085k637k959j985r23o33p19n26
51610A17001k37m37j071j508j405r95o27m91p00j220j691j723j331q60n11k67
$$ plain form
51729 106539 107224 107580 107683 107861 108181 108392 108160 107215 105435 103050 100690 99035 98341 98368 98646 98734 98349 97530
51711 97530 96686 96225 95982 95240 93569 91508 90111 89844 90226 90594 90867 91341 92023 92563 92786 92933 93275 93804
51693 93804 94423 95297 96720 98629 100478 101793 102762 104030 105754 107116 107111 105715 103870 102272 100694 98711
51677 98711 96590 94950 93921 93207 92798 92926 93341 93359 92797 92284 92359 92788 93122 93462 94169 95158 96061 96945 98296
51658 98296 100262 102336 103941 105004 105697 105890 105143 103317 100966 98980 97813 97222 96807 96585 96845 97614
51642 97614 98684 100114 102208 104805 107041 108211 108628 109249 110573 112295 113957 115554 117321 119223 120891
51627 120891 122033 122775 123516 124451 125414 126241 127097 128052 128468 127383 124746 121787 119802 118879 118246 117527 117001
51610 117001 116764 116327 115256 113748 112343 111348 110721 110230 109530 108310 106619 104896 103565 102705 102194 101927
51594A01927j89m29q68j124j020q02p77r30j041r37n18K40J054J333P04m14j042
51577I5167o42K83O97P2j143j997j834p86L93R66Q67P10J060J768K195J962J248
51560A00986M32j53j61N87J652K150J699Q44K74K3k10k88J68J001J535J418R96
51543A12953P86R37J293J677J954K052J974J653R92J76k14J96J026J494J265O58
51527A30872J18j17l8Q7j83q53j206p00J03K21l02m68J02N97L35k83n57m96l93
51508A26839n5P84J612J524M02q21j145m17O69J183O40o44j823k303k183j902
51492A22360j689j517j377j380j591j886j932j475p76n51j127j842j775r35j24
51477A02383K18L15K11m14j326j633j031l64l43n29k87P1p0m81n69n34r86j724
$$ plain form
51594 101927 101738 101309 100441 99317 98297 97495 96718 95788 94747 93810 93292 93532 94586 95919 96623 96209 95167
51577 95167 94525 94808 95505 95577 94434 92437 90603 89817 90210 91176 92043 92753 93813 95581 97776 99738 100986
51560 100986 101418 101265 101104 101691 103343 105493 107192 108036 108310 108333 108123 107835 108003 109004 110539 111957 112953
51543 112953 113739 114676 115969 117646 119600 121652 123626 125279 126271 126447 126233 126429 127455 128949 130214 130872
51527 130872 130990 130873 130835 130922 130739 129886 128680 127980 128083 128304 128002 127534 127636 128233 128568 128285 127728 127232 126839
51508 126839 126784 127568 129180 130704 131106 130285 129140 128723 129392 130575 131215 130571 128748 126445 124262 122360
51492 122360 120671 119154 117777 116397 114806 112920 110988 109513 108737 108186 107059 105217 103442 102507 102383
51477 102383 102601 102916 103127 102713 101387 99754 98723 98359 98016 97487 97200 97271 97201 96720 96151 95617 94631 92907
51459I2907j937j552j250j226q84M2R81J346J145N35m20j293j341m85L50L36k58
51442H6996o19m44K7N88J139J399J118N43J98K30L42L55M51P12Q33N21K2j38J02
51423I4375K26r5m49k13N82J198J082L93k98n44j90O20J386J577J151N87K90K14
51405A01892J14k10r02j843k384j937r54o23j235j670j009P1L05l80r62q84m89
51388H6900j37J87L58P2n48r73j051j159j512j862j917j564p43M08J212R88n0
51371G8609r12r71m59P3K38j76r71j288m03J160K030J646P61J44l00q63j294j315
51353G5709j167j094q50j95M98P36N48K79O1j10j64j98m40p70p11k44j7l05m24
51334G1142J59Q45P50J42M6O95J280J203P41L82J81L0J1J63L01K33j4l51p60j187
$$ plain form
51459 92907 90970 89418 88168 86942 86058 86100 87081 88427 89572 90107 89687 88394 87053 86568 86918 87254 86996
51442 86996 86377 85933 85960 86548 87687 89086 90204 90747 90945 91175 91517 91872 92323 93035 93868 94389 94411 94273 94375
51423 94375 94601 94506 94057 93844 94426 95624 96706 97099 96801 96257 96067 96687 98073 99650 100801 101388 101678 101892
51405 101892 102006 101796 100894 99051 96667 94730 93776 93153 91918 90248 89239 89310 89615 89235 88273 87389 86900
51388 86900 86763 86950 87308 87380 86832 85859 84808 83649 82137 80275 78358 76794 76051 76459 77671 78659 78609
51371 78609 77697 76726 76267 76340 76578 76402 75431 74143 73740 74900 76930 78576 79337 79481 79181 78318 77024 75709
51353 75709 74542 73448 72598 72403 72901 73637 74185 74464 74525 74415 74251 74053 73613 72843 72132 71888 71871 71566 71142
51334 71142 71301 72146 72896 73038 73084 73779 75059 76262 77003 77385 77566 77596 77607 77770 78071 78304 78290 77939 77179 75992
51314G5992j463j408j006m58r5j19l21k67K19Q62J310J329P30m78j661j887r89
51297G0290J44P33J009J445J705J094k21j262j424r03p2Q44J439J275N42L4K31
51280G6903Q29J329J575J586J312Q39M35K43J62J54K84M57N12O11J065J671J779
51263I1746J200M57q9o94j480j830j206j32L57L8l33j02O05J261J531J407J135
51246I3871J025J094J000O12L60O38J080J024N94N05Q81J050P39N12O99P59M09
51229A06852M48J469K456J900Q8j149r50l76m77p81m53K04M23L31N10P35L35m45
51211A11120o92l24k12o95j024o52r0Pj74j50j6j44m50n74m44k48n4R2o7o45j272
51190A03292j481j264r20o40n22o72q82n99L38J211J290Q62P42J001R58M22N8
$$ plain form
51314 75992 74529 73121 72115 71657 71562 71443 71122 70855 71074 71936 73246 74575 75305 74827 73166 71279 70290
51297 70290 70434 71167 72176 73621 75326 76420 76199 74937 73513 72610 72538 73382 74821 76096 76638 76672 76903
51280 76903 77732 79061 80636 82222 83534 84373 84808 85051 85213 85367 85651 86108 86620 87231 88296 89967 91746
51263 91746 92946 93403 93314 92620 91140 89310 88104 87972 88329 88367 88034 87932 88537 89798 91329 92736 93871
51246 93871 94896 95990 96990 97602 97962 98600 99680 100704 101298 101803 102684 103734 104473 104985 105684 106443 106852
51229 106852 107300 108769 111225 113125 113213 112064 111114 110738 110261 109480 109027 109231 109654 109985 110495 111230 111565 111120
51211 111120 110428 110104 109892 109197 108173 107521 107431 107438 107264 107114 107098 106954 106504 105930 105486 105238 105184 105276 105209 104564 103292
51190 103292 101811 100547 99627 98987 98465 97793 96911 96312 96650 97861 99151 100013 100755 101756 102714 103136 103194
51173A03194K80N93M58K03M52J034J131M48l41m36K03R36J276J269J163R45M63
51156A13271j37m32l02k44q08j811k471k270j504q60o52o53n46l98m83p99r45
51139I7956o40j74q4l61m40P0Q57J388J512J445J367J297J146O81k38j180j278
51122A03324l28O92P30R4K0Q87J718J611R50O82R91J254J061O57M06L62M48P11
51104A16270J140J430J234O27J51K37P06J001Q26L29k60q56j245j049k32O13R15
51087A21837P51M97J43m70r16m79P19J630J534Q66M91O13Q71J021J089J070Q94
51070A32161O25L41Jl09k74K24P70J015J351K338L622M035L087J737J222J596
51054A53542J961J886J882K355K711K085O55l78k67L28L02l55n72J64R06M57r43
$$ plain form
51173 103194 103474 104067 104525 104728 105180 106214 107345 107793 107452 107016 107219 108155 109431 110700 111863 112808 113271
51156 113271 113134 112702 112400 112156 111348 109537 107066 104796 103292 102432 101780 101127 100581 100183 99700 98901 97956
51139 97956 97316 97142 97058 96697 96257 96327 97184 98572 100084 101529 102896 104193 105339 106020 105782 104602 103324
51122 103324 102996 103688 104418 104512 104532 105419 107137 108748 109698 110380 111371 112625 113686 114343 114749 115111 115559 116270
51104 116270 117410 118840 120074 120701 120852 121089 121795 122796 123622 123951 123691 122835 121590 120541 120309 120922 121837
51087 121837 122588 123085 123228 122758 121842 121363 122082 123712 125246 126112 126603 127216 128087 129108 130197 131267 132161
51070 132161 132786 133127 133128 132819 132545 132769 133539 134554 135905 138243 141865 145900 148987 150724 151946 153542
51054 153542 155503 157389 159271 161626 164337 166422 167077 166699 166432 166760 167062 166707 166135 166299 167205 167662 166719
51037A66719j838j409m27j37o92j197j017m67j91k94l16J12Q43J379J404J155
51021A63627J172J672K258K443K289K225K338K246J775J288J161J328J618K141
51007A89581K948L691M120M564N359O065O005N463N467O305P146P397P611Q531
50993B70253R923J1086J1999J3198J4790J6335J7706J9392K1844K4938K8139L0959
50981D90562L3216L5129L7165L9555M2085M4436M6507M8156M9049M9103M8731
50970I63694M8067M6337M2713L7595L2273K7353K2321J6781J1181O036J178l679
50958A251850q184j1781j4453j6494j7780j7893j6885j5420j4120j3078j2076
50947A093686j1088j0435j0592j1713j3382j4894j5983j7123j8986k1735k4908
$$ plain form
51037 166719 164881 163472 163045 162908 162216 161019 160002 159535 159344 159050 158734 158846 159689 161068 162472 163627
51021 163627 164799 166471 168729 171172 173461 175686 178024 180270 182045 183333 184494 185822 187440 189581
51007 189581 192529 196220 200340 204904 210263 216328 222333 227796 233263 239568 246714 254111 261722 270253
50993 270253 280176 291262 303261 316459 331249 347584 365290 384682 406526 431464 459603 490562
50981 490562 523778 558907 596072 635627 677712 722148 768655 816811 865860 914963 963694
50970 963694 1011761 1058098 1100811 1138406 1170679 1198032 1220353 1237134 1248315 1254351 1255529 1251850
50958 1251850 1243666 1231885 1217432 1200938 1183158 1165265 1148380 1132960 1118840 1105762 1093686
50947 1093686 1082598 1072163 1061571 1049858 1036476 1021582 1005599 988476 969490 947755 922847
50936I22847k7844l0077l1508l2470l3443l4478l4913l3901l1347k8146k5469
50925E79251k3808k2727k1416j9463j7166j5121j3570j2186j0524q528o587n113
50913D03042m189l628l247k976k683k151j338n90k90l13j86K22N71P55J239K258
50897C86496L128K963J922J137J411K554L935N099N780N893N798O081O875P713
50883D46785Q321R033J0219J1722J3188J4640J6267J8036J9886K2064K4790K7790
50871F42741L0675L3695L7584M2581M8108N3575N9118O5259P2090P9206Q6315
50860A250947R3493J00676J07154J11942J14634J15650J15516J14039J10297J03274
50850B337622R2578P8727O3013M6832L1028J5839J480j1595k3092l2931m0599
$$ plain form
50936 922847 895003 864926 833418 800948 767505 733027 698114 664213 632866 604720 579251
50925 579251 555443 532716 511300 491837 474671 459550 445980 433794 423270 414742 408155 403042
50913 403042 398853 395225 391978 389002 386319 384168 382830 382240 381950 381637 381451 381673 382244 382999 384238 386496
50897 386496 389624 392587 394509 395646 397057 399611 403546 408645 414425 420318 426116 432197 439072 446785
50883 446785 455106 464139 474358 486080 499268 513908 530175 548211 568097 590161 614951 642741
50871 642741 673416 707111 744695 787276 835384 888959 948077 1013336 1085426 1164632 1250947
50860 1250947 1344440 1445116 1552270 1664212 1778846 1894496 2010012 2124051 2234348 2337622
50850 2337622 2430200 2508927 2571940 2618772 2649800 2665639 2667119 2655524 2632432 2599501 2558902
50839B558902m4959m5407m2896l9074l4586k9059k2697j6944j3243j1919j2658
50828B245460j5416k0336k7144l5153m3659n2063n9868o6891p3179p8551q2458
50817A690742q4514q4818q3571q0788p6615p1563o6094o0327n4356m8423m2540
50806I37133l6310k9562k2776j6596j1156o213j562K929P342J1454J4830J7442
50794H66955J9684K1497K2100K1046J8980J6792J4503J1651Q302M889J427k278
50782A025548n882q767j1002j3220j5588j7630j9164k0675k2502k4214k5059k4722
50770H17123k3435k1620j9612j7598j5704j4051j2552j0685p980m795k087o9K188
50757F69123N357Q802J1697J4469J8132K2700K7351L1871L6743M2034M7399N3116
$$ plain form
50839 2558902 2513943 2468536 2425640 2386566 2351980 2322921 2300224 2283280 2270037 2258118 2245460
50828 2245460 2230044 2209708 2182564 2147411 2103752 2051689 1991821 1924930 1851751 1773200 1690742
50817 1690742 1606228 1521410 1437839 1357051 1280436 1208873 1142779 1082452 1028096 979673 937133
50806 937133 900823 871261 848485 831889 820733 814520 812958 815887 823229 834683 849513 866955
50794 866955 886639 908136 930236 951282 970262 987054 1001557 1013208 1021510 1026399 1027826 1025548
50782 1025548 1019666 1010899 999897 986677 971089 953459 934295 913620 891118 866904 841845 817123
50770 817123 793688 772068 752456 734858 719154 705103 692551 681866 673886 669091 667004 666935 669123
50757 669123 674480 683282 694979 709448 727580 750280 777631 809502 846245 888279 935678 988794
50745I88794N9798O7007P3448P8739Q3703Q8522R1895R2578R0639Q6496P9934
50734A881553P0943O0532M9590L7630K3714Q151p518k1774l3584m2251m7810n1192
50722A927984n3114n3043n0193m5168l9657l4663l0004k5465k1532j8772j7446
50711A538927j7883k0447k4778k9698l4286l8553m2806m6753m9635n0974n0887
50700A132227m9712m7583m4378m0119l5369l0914k6889k2578j7505j2279p781
50689G97120l846N10N608J0761J5499K0324K5761L1417L6505M0919M5120M9272
50677A074970N2919N5441N6422N5653N3184M9358M4606L9130L2946K6070J8624
50666A559323J0943L790j859n683q520j1712j5824k0294k4214k7109k8909k9659
$$ plain form
50745 988794 1048592 1115599 1189047 1267786 1351489 1440011 1531906 1624484 1715123 1801619 1881553
50734 1881553 1952496 2013028 2062618 2100248 2123962 2132113 2124595 2102821 2069237 2026986 1979176 1927984
50722 1927984 1874870 1821827 1771634 1726466 1686809 1652146 1622142 1596677 1575145 1556373 1538927
50711 1538927 1521044 1500597 1475819 1446121 1411835 1373282 1330476 1283723 1234088 1183114 1132227
50700 1132227 1082515 1034932 990554 950435 915066 884152 857263 834685 817180 804901 797120
50689 797120 793274 793784 799392 810153 825652 845976 871737 903154 939659 980578 1025698 1074970
50677 1074970 1127889 1183330 1239752 1295405 1348589 1397947 1442553 1481683 1514629 1540699 1559323
50666 1559323 1570266 1574056 1572197 1566514 1557994 1546282 1530458 1510164 1485950 1458841 1429932 1400273
50654A400273k9516k8755k7448k5249k1819j7438j2923q829m987r71L144O742
50642A232224R291J0860J1851J2468J2555J1996J1108J0493J0450J0663J0637
50631A354596J0456J0810J2235J4510J7092J9794K2706K5500K7420K8032K7522
50620A570673K6025K3101J8260J1683M050m099j2332j9848k5715k9739l2624l5051
50608A494384l6965l7952l8020l7685l7508l7769l8439l9159l9471l9321l9247
50597A072848l9633m0010l9509l8038l6402l5057l3353l0522k7001k4084k2310
50586G06929k0866j8703j5760j2820j0582r195q252o987m785j936M32J493J687
50573F00655K146L430N277P333R536J1828J4100J6579J9700K3487K7425L1082
$$ plain form
50654 1400273 1370757 1342002 1314554 1289305 1267486 1250048 1237125 1228296 1223309 1222338 1225482 1232224
50642 1232224 1241515 1252375 1264226 1276694 1289249 1301245 1312353 1322846 1333296 1343959 1354596
50631 1354596 1365052 1375862 1388097 1402607 1419699 1439493 1462199 1487699 1515119 1543151 1570673
50620 1570673 1596698 1619799 1638059 1649742 1653792 1649693 1637361 1617513 1591798 1562059 1529435 1494384
50608 1494384 1457419 1419467 1381447 1343762 1306254 1268485 1230046 1190887 1151416 1112095 1072848
50597 1072848 1033215 993205 953696 915658 879256 844199 810846 780324 753323 729239 706929
50586 706929 686063 667360 651600 638780 628198 619003 610751 603764 598979 597043 597475 598968 600655
50573 600655 602801 606231 611508 618841 628377 640205 654305 670884 690584 714071 741496 772578
50561G72578L4399L7337L9687M1422M2642M3067M2170M0192L8333L7384L6697
50550A205908L5170L2829L0730K9519K8978K8931K9695L1235L2570L2663L1624
50539A549852L0613L0665L1933L4025L6628L9530M2307M4421M5704M6456M6848
50528A978982M6459M4718M1588L7427L2318K6071J8900J1433L847m383j3497k2720
50516B201143l1019l8119m4297m9499n3278n5362n5726n4328n1327m7282m2677
50505A678229l7435l1551k5889k1615j8886j6879j5030j3488j2265j0846q928
50494A465417o742m341j317K228N082N909M469J355l075q914j6073k3979l1909
50481A388110l9254m5521n0338n3424n4521n3614n1396m9029m7099m5065m2180
$$ plain form
50561 772578 806977 844314 884001 925423 968065 1011132 1053302 1093494 1131827 1169211 1205908
50550 1205908 1241078 1273907 1304637 1334156 1363134 1392065 1421760 1452995 1485565 1518228 1549852
50539 1549852 1580465 1611130 1643063 1677088 1713716 1753246 1795553 1839974 1885678 1932134 1978982
50528 1978982 2025441 2070159 2111747 2149174 2181492 2207563 2226463 2237896 2241743 2237360 2223863 2201143
50516 2201143 2170124 2132005 2087708 2038209 1984931 1929569 1873843 1819515 1768188 1720906 1678229
50505 1678229 1640794 1609243 1583354 1561739 1542853 1525974 1510944 1497456 1485191 1474345 1465417
50494 1465417 1458675 1454334 1453017 1455245 1460327 1466236 1470705 1472060 1468985 1460071 1443998 1420019 1388110
50481 1388110 1348856 1303335 1252997 1199573 1145052 1091438 1040042 991013 943914 898849 856669
50470H56669l8597l5128l2130k9270k6297k3477k1053j8747j6070j3000j0082
50459E92818p916o651n992n540n022m172k724p74J077K347L349M729O377P482
50445E79388P868Q476J0124J2468J4804J7222K0122K3103K5415K7294K9757L2983
50433H09024L5999L8212M0251M2769M5326M7199M8616N0248N1915N2733N2505
50422A314797N2060N2015N1934N1078M9479M7764M6169M4169M1141L6944L1802
50411A819352K5832J9039J1719M427k568r674j7432k5656l3454m0150m5828n0870
50399A654737n5248n8671o1126o2882o4027o4310o3498o1568n8561n4589n0003
50388A000254m5206m0195l4726k9099k4275k0740j7594j3459q218l179N80L364
$$ plain form
50470 856669 818072 782944 750814 721544 695247 671770 650717 631970 615900 602900 592818
50459 592818 584902 578251 572259 566719 561697 557525 554801 554027 555104 557451 560800 565529 571906 579388
50445 579388 587256 595732 605856 618324 633128 650350 670472 693575 718990 746284 776041 809024
50433 809024 845023 883235 923486 966255 1011581 1058780 1107396 1157644 1209559 1262292 1314797
50422 1314797 1366857 1418872 1470806 1521884 1571363 1619127 1665296 1709465 1750606 1787550 1819352
50411 1819352 1845184 1864223 1875942 1880369 1877801 1868127 1850695 1825039 1791585 1751435 1705607 1654737
50399 1654737 1599489 1540818 1479692 1416810 1352783 1288473 1224975 1163407 1104846 1050257 1000254
50388 1000254 955048 914853 880127 851028 826753 806013 788419 774960 766742 763563 764143 767507
50376G67507O101Q991J1458J2970J3332J2371J0023O759L353N9l581p912j2505
50363H28926j6507j9380k1125k2031k2347k2098k1118j9519j7948j7039j6549
50352F13265j5593j3815j1861j0405r320q188p100o344n706m741l503k380j355
50339E12954j03J224K058K322K603L204L651L521L234L634M961O618P882Q624
50325E66387R376J0819J3114J5812J8420K0882K3202K4947K5663K5662K5741K6079
50313H06104K6113K5626K5202K5193K4913K3484K1003J8221J5407J2228Q634N070
50301A037198J839j234m248o814q534r719j1389j4333j8206k1750k4088k5670
50289H93052k7509k9598l0708k9965k7917k5671k3584k1466j9432j7768j6193
$$ plain form
50376 767507 773608 782599 794057 807027 820359 832730 842753 849512 852865 852924 849343 841431 828926
50363 828926 812419 793039 771914 749883 727536 705438 684320 664801 646853 629814 613265
50352 613265 597672 583857 571996 561591 552271 544083 536983 530639 524933 520192 516689 514309 512954
50339 512954 512851 514075 516133 518455 521058 524262 527913 531434 534668 538302 543263 549881 557763 566387
50325 566387 575763 586582 599696 615508 633928 654810 678012 702959 728622 754284 780025 806104
50313 806104 832217 857843 883045 908238 933151 956635 977638 995859 1011266 1023494 1032128 1037198
50301 1037198 1039037 1037803 1033555 1026741 1018207 1008488 997099 982766 964560 942810 918722 893052
50289 893052 865543 835945 805237 775272 747355 721684 698100 676634 657202 639434 623241
50278F23241j4215j2129j0805j0422j0160r348q237p355o749o190n608n002m272
50265E12749l494k982k765k387j520n05J01K54M15R20J681K360K756K958L224
50250E13765L597L783L716L969N110O634P264O568N616N620O476P135O963O128
50236E92344N037M014L390L269L342L306L350L746M219M252L936L873M372N240
50222F47690O362P789R179R932J0066J0334J1192J2186J2767J3176J3991J5262
50210G79926J6719J8472K0819K3367K5146K5867K6482K8076L0499L2624L3755
50199A061752L4359L5244L6557L7934L9386M1504M4741M8884N3447N8305O3730
50188A555843P0121P7988Q7951J00314J14652J30148J46315J63080J80112J96443
$$ plain form
50278 623241 609026 596897 586092 575670 565510 556162 547925 540570 533821 527631 522023 517021 512749
50265 512749 509255 506273 503508 501121 499601 499096 499197 499451 499866 500786 502467 504827 507583 510541 513765
50250 513765 517362 521145 524861 528830 533940 540574 547838 554406 560022 565642 572118 579253 586216 592344
50236 592344 597381 601395 604785 608054 611396 614702 618052 621798 626017 630269 634205 638078 642450 647690
50222 647690 654052 661841 671020 680952 691018 701352 712544 724730 737497 750673 764664 779926
50210 779926 796645 815117 835936 859303 884449 910316 936798 964874 995373 1027997 1061752
50199 1061752 1096111 1131355 1167912 1205846 1245232 1286736 1331477 1380361 1433808 1492113 1555843
50188 1555843 1625964 1703952 1791903 1892217 2006869 2137017 2283332 2446412 2626524 2822967
50178B822967K10647K20998K25489K22275K10709J91952J68497J43154J18364
50169D535052R5870P6505O0179M5990L2191J6249m344l0762o2394r7670j34732
50158D532134j71032k02986k27205k42274k48848k48151k40992k28347k11951
50149B510348j93743j75068j56804j39766j24412j10450r7412q5519p5396o7015
50139A284763n9561n2484m6033m0540l5775l1459k7853k5270k3310k1233j8907
50128I02338j6812j5132j3480j1561r563p716o014m543l628l302l071k444j412
50115H03660j61J278K834M191N243O380P913R532J0791J1812J3050J4502J5795
50102I06820J6915J8212J9757K1251K2637K4161K5728K6845K7416K8070K9368
$$ plain form
50178 2822967 3033614 3254612 3480101 3702376 3913085 4105037 4273534 4416688 4535052
50169 4535052 4630922 4707427 4767606 4813596 4845787 4862036 4857692 4826930 4764536 4666866 4532134
50158 4532134 4361102 4158116 3930911 3688637 3439789 3191638 2950646 2722299 2510348
50149 2510348 2316605 2141537 1984733 1844967 1720555 1610105 1512693 1427174 1351778 1284763
50139 1284763 1225202 1172718 1126685 1086145 1050370 1018911 991058 965788 942478 921245 902338
50128 902338 885526 870394 856914 845353 835790 828074 822060 817517 813889 810587 807516 805072 803660
50115 803660 803499 804777 807611 811802 817045 823425 831338 840870 851661 863473 876523 891025 906820
50102 906820 923735 941947 961704 982955 1005592 1029753 1055481 1082326 1109742 1137812 1167180
50091A167180L1144L2876L4328L5521L6489L7462L8965M1272M3956M6396M8573
50080A594162N1101N4519N8981O4496P1197P9231Q8659R9586J12303J27191J44547
50069B545973J64480J87010K12160K39831K69463K99938L29910L58004L82349
50060D989118M00203M08668M06092L92694L70072L40720L07987K75545K46026
50051H137125K19954J95921J71449J43553J09255O6398J4373m5687j10969j77221
50041H724151k39732k94763l40135l74607l97552m09648m13033m09852m00837
50032E443992l85986l66289l43770l19894k94814k68480k41753k16106j92606
50023B814294j71543j52719j35795j20552j07034r5376q5443p6820o9087o1996
$$ plain form
50091 1167180 1198324 1231200 1265528 1301049 1337538 1375000 1413965 1455237 1499193 1545589 1594162
50080 1594162 1645263 1699782 1758763 1823259 1894456 1973687 2062346 2161932 2274235 2401426 2545973
50069 2545973 2710453 2897463 3109623 3349454 3618917 3918855 4248765 4606769 4989118
50060 4989118 5389321 5797989 6204081 6596775 6966847 7307567 7615554 7891099 8137125
50051 8137125 8357079 8553000 8724449 8868002 8977257 9043655 9058028 9012341 8901372 8724151
50041 8724151 8484419 8189656 7849521 7474914 7077362 6667714 6254681 5844829 5443992
50032 5443992 5058006 4691717 4347947 4028053 3733239 3464759 3223006 3006900 2814294
50023 2814294 2642751 2490032 2354237 2233685 2126651 2031275 1945832 1869012 1799925 1737929
50013A737929n5527m9966m5802m3043m0848l8298l5460l3221l1998l1207l0147
50002A302412k8820k7627k6654k5700k4688k3726k2808k1745k0330j8533j6561
49991A045220j4773j3436j2522j1852j1326j0824j0118r120q187p692p371o569
49979I21430n152l665k490j416k08R06J690K371L229M054M458M554M946O116Q080
49964I48903J0537J3127J5654J8259K1281K4803K8581L2474L6788M1894M7861
49953A240162N4639O2375P1279Q1439R3072J06619J22285J39647J58110J77497
49943B307124J97603K17335K34804K48349K56966K59592K54670K40968K18892
49934D436303J90830J60282J30672J04455Q2694O5008M9803L4585J6356p711l9274
$$ plain form
50013 1737929 1682402 1632436 1586634 1543591 1502743 1464445 1428985 1395764 1363766 1332559 1302412
50002 1302412 1273592 1245965 1219311 1193611 1168923 1145197 1122389 1100644 1080314 1061781 1045220
49991 1045220 1030447 1017011 1004489 992637 981311 970487 960369 951249 943062 935370 927999 921430
49979 921430 916278 912613 910123 908707 908499 909405 911095 913466 916695 920749 925207 929761 934707 940823 948903
49964 948903 959440 972567 988221 1006480 1027761 1052564 1081145 1113619 1150407 1192301 1240162
49953 1240162 1294801 1357176 1428455 1509894 1602966 1709585 1831870 1971517 2129627 2307124
49943 2307124 2504727 2722062 2956866 3205215 3462181 3721773 3976443 4217411 4436303
49934 4436303 4627133 4787415 4918087 5022542 5105236 5170244 5220047 5254632 5270988 5263277 5224003
49923E224003p8058j21877j67319k10578k47939k76215k93376k99109k94682k82193
49913B952657k63910k42126k19071j96399j74798j54345j35289j18185j03317
49904A345217r0425p9116o9338o1169n4344m8289m2622l7486l3304l0191k7672
49893G71261k5122k2425k0077j8451j7334j6305j5273j4287j3204j2030j1292
49882E85461j1408j1794j1459j0389r505r177q741p754o782o360o100n540n034
49869D75418n028n024m315l274k877l192l391l123k833k758k601k302k312k744
49855D29644l101l048k814k530j987j330j228j865k430k203j596j465j865k161
49841D00021k055j822j696j612j557j609j585j103j72O36P36Q7q25j388j201k91
$$ plain form
49923 5224003 5145945 5024068 4856749 4646171 4398232 4122017 3828641 3529532 3234850 2952657
49913 2952657 2688747 2446621 2227550 2031151 1856353 1702008 1566719 1448534 1345217
49904 1345217 1254792 1175676 1106338 1045169 990825 942536 899914 862428 829124 798933 771261
49893 771261 746139 723714 703637 685186 667852 651547 636274 621987 608783 596753 585461
49882 585461 574053 562259 550800 540411 530906 521729 512988 505234 498452 492092 485992 480452 475418
49869 475418 470390 465366 461051 457777 454900 451708 448317 445194 442361 439603 437002 434700 432388 429644
49855 429644 426543 423495 420681 418151 416164 414834 413606 411741 409311 407108 405512 404047 402182 400021
49841 400021 397966 396144 394448 392836 391279 389670 388085 386982 386810 387446 388182 388269 387444 386056 384855 384564
49825C84564Q32J471J313P34M73Q15J246J039J73n77o36l32k44k82Q8Q05J161
49808C92643Q02J24n38j399k540l370l367k881k614k616k436k045j891k037j963
49793C63872j368o91n57j052j709k007j690r01j29J10k62q07j035q46m84j96J8
49776C50266K80O17Q52P96M89Q6m14j078j653j644r33k5N55Q27R83R26N57K21
49758C51708K61L75O3m03k07P47J581J640J263J025Q55M66R0J73N58O62L39Q6
49740C61282L07Q24J135R71M66j5k17k17k24k28o2J74J16k44m51l50m20q71r79
49721C60997m2J311J713R30J99M91J311J640J305Q23M68J85J08M59R70J013L96
49704C74277l59n80m5J037K283L263L596L161K307J671J663K065K295K097J832
$$ plain form
49825 384564 385396 386867 388180 388914 389387 390202 391448 392487 392660 392083 391447 391115 390871 390589 390677 391482 392643
49808 392643 393445 393569 393031 391632 389092 385722 382355 379474 376860 374244 371808 369763 367872 365835 363872
49793 363872 362504 361813 361256 360204 358495 356488 354798 353897 353768 353878 353616 352809 351774 350928 350444 350248 350266
49776 350266 350546 351163 352015 352811 353300 353386 352972 351894 350241 348597 347664 347639 348194 349021 350004 350930 351487 351708
49758 351708 351969 352344 352407 352004 351797 352544 354125 355765 357028 358053 358908 359374 359464 359637 360195 360857 361196 361282
49740 361282 361589 362413 363548 364519 364985 364970 364753 364536 364312 364084 364022 364196 364312 364068 363617 363267 362847 361976 360997
49721 360997 360955 362266 363979 364909 365108 365599 366910 368550 369855 370678 371146 371331 371439 371898 372868 373881 374277
49704 374277 373918 373338 373293 374330 376613 379876 383472 386633 388940 390611 392274 394339 396634 398731 400563
49689D00563J849J932J753J591J977K693K959K681K631L088L228K517J764J921
49675D33147K495K300J369R41J611K687L413L819M050L877L281K757K609K605
49661D70961K578K775L234L503L347L158L261L420L402L369L394L178K730K588
49647E14898K911L080K740K508K877L310L281L396M418N705N973N195M529M507
49633E69328M623M641M932N315M885L521K441K620L558M176M264M306M509M609
49619F27728M270L371K221J739K772M963O917P747P847P870P833P711P994Q860
49605G09843R516R269Q677Q775R611J0387J0738J0873J0796J0331R816R851J0378
49592H38861J0800J0991J1354J1926J2280J2382J2644J3046J3075J2815J3078
$$ plain form
49689 400563 402412 404344 406097 407688 409665 412358 415317 417998 420629 423717 426945 429462 431226 433147
49675 433147 435642 437942 439311 440252 441863 444550 447963 451782 455832 459709 462990 465747 468356 470961
49661 470961 473539 476314 479548 483051 486398 489556 492817 496237 499639 503008 506402 509580 512310 514898
49647 514898 517809 520889 523629 526137 529014 532324 535605 539001 543419 549124 555097 560292 564821 569328
49633 569328 573951 578592 583524 588839 593724 597245 599686 602306 605864 610040 614304 618610 623119 627728
49619 627728 631998 635369 637590 639329 642101 647064 653981 661728 669575 677445 685278 692989 700983 709843
49605 709843 719359 728628 737305 746080 755691 766078 776816 787689 798485 808816 818632 828483 838861
49592 838861 849661 860652 872006 883932 896212 908594 921238 934284 947359 960174 973252
49581I73252J4051J4703J4226J3268J2940J3183J3049J2283J1654J1753J2245
49570A116607J2549J2561J2389J1870J0796R466Q617Q739R601J0441J0628J0126
$$ plain form
49581 973252 987303 1002006 1016232 1029500 1042440 1055623 1068672 1080955 1092609 1104362 1116607
49570 1116607 1129156 1141717 1154106 1165976 1176772 1186238 1194855 1203594 1213195 1223636 1234264 1244390
$$ [...]
##END NTUPLES=NMR SPECTRUM
##END=
