##TITLE=NES1030_18715_9268428_lwIZUFAeM2
##JCAMPDX= 6.0         $$ Bruker NMR JCAMP-DX V2.0
##DATA TYPE= NMR SPECTRUM
##DATA CLASS= NTUPLES
##ORIGIN= BRUKER
##OWNER= Administrator
$$ 1.72 TOPSPIN		Version 2.1
$$ 2015-08-24 21:08:52.655 -0700  Administrator@X
$$ Compression mode = diff/dup
##.OBSERVE FREQUENCY= 400.02188249412
##.OBSERVE NUCLEUS= ^1H
##.ACQUISITION MODE= SIMULTANEOUS (DQD)
##.ACQUISITION SCHEME= undefined
##.AVERAGES= 8
##.DIGITISER RES= 22
##SPECTROMETER/DATA SYSTEM= spect
##.PULSE SEQUENCE= zg30
##.SOLVENT NAME= COFFEE_meoh
##.SHIFT REFERENCE= INTERNAL, COFFEE_meoh, 1, 14.98509
##AUDIT TRAIL= $$ (NUMBER, WHEN, WHO, WHERE, PROCESS, VERSION, WHAT)
$$ ##TITLE= Audit trail, TOPSPIN		Version 2.1
$$ ##JCAMPDX= 5.01
$$ ##ORIGIN= Bruker BioSpin GmbH
$$ ##OWNER= Administrator
$$ $$ E:\/data/COFFEE/nmr/NES1030_18715_9268428_lwIZUFAeM2/20/pdata/1/auditp.txt
$$ ##AUDIT TRAIL=  $$ (NUMBER, WHEN, WHO, WHERE, PROCESS, VERSION, WHAT)
(   1,<2015-08-24 21:08:45.326 -0700>,<Administrator>,<X>,<go>,<TOPSPIN 2.1>,
      <created by zg
	started at 2015-08-24 21:07:39.483 -0700,
	POWCHK enabled, PULCHK disabled,
       configuration hash MD5:
       21 0F 79 D6 B3 7B B4 F6 88 20 88 DB 03 48 BD 9F
       data hash MD5: 64K
       7C 5D AC 47 48 30 65 F1 3D FD 32 91 21 20 20 32>)
(   2,<2015-08-24 21:08:48.498 -0700>,<Administrator>,<X>,<proc1d>,<TOPSPIN 2.1>,
      <Start of raw data processing
       efp LB = 0 FT_mod = 6 PKNL = 1 PHC0 = 0 PHC1 = 0 SI = 32K 
       data hash MD5: 32K
       FD 8B 1D 54 99 D1 B4 DE D0 3E 5C 6E 37 76 BA 68>)
(   3,<2015-08-24 21:08:48.780 -0700>,<Administrator>,<X>,<proc1d>,<TOPSPIN 2.1>,
      <pk PHC0 = 92.60376 PHC1 = 0 
       data hash MD5: 32K
       A0 71 4D 3E 38 3C F2 D4 D4 C6 B1 F5 66 5C 12 3F>)
(   4,<2015-08-24 21:08:48.905 -0700>,<Administrator>,<X>,<proc1d>,<TOPSPIN 2.1>,
      <abs ABSG = 1 
       data hash MD5: 32K
       A5 C6 0A AF A2 A8 BC 36 0F B6 82 ED B0 03 63 24>)
(   5,<2015-08-24 21:08:48.967 -0700>,<Administrator>,<X>,<proc1d>,<TOPSPIN 2.1>,
      <abs ABSG = 2 
       data hash MD5: 32K
       7F 5D 5C A2 DD 5A E0 10 57 D4 05 7A DB A5 3D 31>)
(   6,<2015-08-24 21:08:49.030 -0700>,<Administrator>,<X>,<proc1d>,<TOPSPIN 2.1>,
      <abs ABSG = 3 
       data hash MD5: 32K
       4E CF AE DE F0 B8 A7 4C DE 10 83 2C 98 1B A1 11>)
(   7,<2015-08-24 21:08:49.092 -0700>,<Administrator>,<X>,<proc1d>,<TOPSPIN 2.1>,
      <abs ABSG = 4 
       data hash MD5: 32K
       DD 6C 00 57 D8 5B 18 30 D3 75 B0 F2 D6 3F E3 03>)
(   8,<2015-08-24 21:08:49.155 -0700>,<Administrator>,<X>,<proc1d>,<TOPSPIN 2.1>,
      <abs ABSG = 5 
       data hash MD5: 32K
       01 6B DE 81 72 38 D5 72 D9 48 74 BF 93 5A 31 87>)
$$ ##END=
$$ 
$$ $$ hash MD5
$$ $$ FF 92 82 FE 71 CD 19 95 2F 4B 72 DE 55 48 34 70
##$RELAX= 
##$RELAX= 
##$RELAX= 
##$RELAX= 
##$RELAX= 
##$RELAX= 
##$RELAX= 
$$ Bruker specific parameters
$$ --------------------------
##$DU= <E:\>
##$EXPNO= 20
##$NAME= <NES1030_18715_9268428_lwIZUFAeM2>
##$PROCNO= 1
$$ [...]
##$TP= (0..7)
150 150 150 150 150 150 150 150
##$TP07= 0
##$TPNAME0= <>
##$TPNAME1= <>
##$TPNAME2= <>
##$TPNAME3= <>
##$TPNAME4= <>
##$TPNAME5= <>
##$TPNAME6= <>
##$TPNAME7= <>
##$TPOAL= (0..7)
0.5 0.5 0.5 0.5 0.5 0.5 0.5 0.5
##$TPOFFS= (0..7)
0 0 0 0 0 0 0 0
##$TUNHIN= 0
##$TUNHOUT= 0
##$TUNXOUT= 0
##$USERA1= <user>
##$USERA2= <user>
##$USERA3= <user>
##$USERA4= <user>
##$USERA5= <user>
##$V9= 5
##$VALIST= <valist>
##$VCLIST= <CCCCCCCCCCCCCCC>
##$VD= 0
##$VDLIST= <DDDDDDDDDDDDDDD>
##$VPLIST= <PPPPPPPPPPPPPPP>
##$VTLIST= <TTTTTTTTTTTTTTT>
##$WBST= 2048
##$WBSW= 25
##$XGAIN= (0..3)
0 0 0 0
##$XL= 0
##$YL= 0
##$YMAX_a= 608874
##$YMIN_a= -509131
##$ZGOPTNS= <>
##$ZL1= 120
##$ZL2= 120
##$ZL3= 120
##$ZL4= 120
##$ABSF1= 14.98509
##$ABSF2= -5.573092
##$ABSG= 5
##$ABSL= 3
##$ALPHA= 0
##$AQORDER= 0
##$ASSFAC= 0
##$ASSFACI= 0
##$ASSFACX= 0
##$ASSWID= 0
##$AUNMP= <proc_prof1d_extract_pilot.lims>
##$AXLEFT= 0
##$AXNAME= <>
##$AXNUC= <1H>
##$AXRIGHT= 0
##$AXTYPE= 0
##$AXUNIT= <>
##$AZFE= 0.1
##$AZFW= 0.1
##$BCFW= 0
##$BC_mod= 0
##$BYTORDP= 0
##$COROFFS= 0
##$CY= 15
##$DATMOD= 1
##$DC= 0
##$DFILT= <>
##$DTYPP= 0
##$F1P= 0
##$F2P= 0
##$FCOR= 0.5
##$FTSIZE= 32768
##$FT_mod= 6
##$GAMMA= 0
##$GB= 0
##$INTBC= 1
##$INTSCL= 1
##$ISEN= 128
##$LB= 0
##$LEV0= 0
##$LPBIN= 0
##$MAXI= 10000
##$MC2= 0
##$MEAN= 0
##$ME_mod= 0
##$MI= 0
##$NCOEF= 0
##$NC_proc= -8
##$NLEV= 6
##$NOISF1= 0
##$NOISF2= 0
##$NSP= 0
##$NTH_PI= 0
##$NZP= 0
##$OFFSET= 14.98509
##$PC= 1
##$PHC0= 92.60376
##$PHC1= 0
##$PH_mod= 1
##$PKNL= yes
##$PPARMOD= 0
##$PPDIAG= 0
##$PPIPTYP= 0
##$PPMPNUM= 2147483647
##$PPRESOL= 1
##$PSCAL= 4
##$PSIGN= 0
##$PYNMP= <proc.py>
##$REVERSE= no
##$SF= 400.02
##$SI= 32768
##$SIGF1= 0
##$SIGF2= 0
##$SINO= 400
##$SIOLD= 32768
##$SPECTYP= <>
##$SREGLST= <1H.CDCl3>
##$SSB= 0
##$STSI= 32768
##$STSR= 0
##$SW_p= 8223.68421052631
##$SYMM= 0
##$S_DEV= 0
##$TDeff= 65536
##$TDoff= 0
##$TI= <>
##$TILT= no
##$TM1= 0
##$TM2= 0
##$TOPLEV= 0
##$USERP1= <user>
##$USERP2= <user>
##$USERP3= <user>
##$USERP4= <user>
##$USERP5= <user>
##$WDW= 1
##$XDIM= 32768
##$YMAX_p= 439583887
##$YMIN_p= -947575
##$CURPLOT= <Network HP LaserJet P1505>
##$CURPRIN= <$Network HP LaserJet P1505>
##$DFORMAT= <normdp>
##$LAYOUT= <+/1D_H.xwp>
##$LFORMAT= <normlp>
##$PFORMAT= <normpl>
##$SURQMSG= 1
$$ End of Bruker specific parameters
$$ ---------------------------------
##NTUPLES= NMR SPECTRUM
##VAR_NAME=  FREQUENCY,     SPECTRUM/REAL,   SPECTRUM/IMAG
##SYMBOL=    X,             R,               I
##VAR_TYPE=  INDEPENDENT,   DEPENDENT,       DEPENDENT
##VAR_FORM=  AFFN,          ASDF,            ASDF
##VAR_DIM=   32768,         32768,           32768
##UNITS=     HZ,            ARBITRARY UNITS, ARBITRARY UNITS
##FACTOR=    0.250966925370066, 1,           1
##FIRST=     8223.43324360094, 41309,        36187
##LAST=      0,             -89142,          -25320
##MIN=       0,             -947575,         0
##MAX=       8223.43324360094, 439583887,    0
$$ Real data points
##PAGE= N=1
##DATA TABLE= (X++(R..R)), XYDATA
$$ [...]
19503f6637E2564c88858P9078f4784A61033F6212b9745k23605M2906f6336j19259
19492a85595d7301j12458A3488d8112B0813J92410p4445i3266A22217B2111b62652
19480b07000G3474e482A91441l527f2182j50946j27403A51910o6678K839b03542
19468B17399e8592n7974A19746l3269O5868A7976b95234n50B9855d5438A04524
19456a99029C9782c23009J21467C5071P4134a75252O7225r3736a8960j64250G7688
19444B26552c16107J26106R1160I2091a77645d2497j47799e1025D6867a91476
19433I2068f8399i041j14733c5148k66498P5089D7470a24139j4869K4825c6777
19421c44319C3057a43494I4528M8880a79075c3051k57148J12118A47439a78520
$$ y = [-66637, 52564, -388858, -309780, -64784, 161033, 66212, -29745, -253350, -210444, -66336, -185595, -47301, -159759, 13488, -48112, 20813, 213223, 138778, -93266, 122217, 22111, -262652, -207000, 73474, -5482, 191441, 187914, -62182, -213128, -340531, 151910, 85232, 88071, -203542, 217399, -58592, -116566, 119746, 86477, 152345, 17976, -295234, -295784, 29855, -45438, 104524, -199029, 39782, -323009, -201542, 35071, 109205, -175252, -108027, -201763, -18960, -183210, 77688, 226552, -316107, -190001, -98841, 92091, -177645, -42497, -190296, -51025, 46867, -191476, 92068, -68399, -9041, -123774, -35148, -301646, -226557, 47470, -124139, -139008, -114183, -36777, -344319, 33057, -143494, 94528, 143408, -179075, -33051, -290199, -178081, 147439, -178520]
19410A18293h4313n6652d8230G4697h9483p3552O819G3178d2643j73044e1902
19398B24297d52614B25192i2994A38501C2653a2894H5506l990a79808e8251p305
19387f5556A47497a24267J4787o5356A05406i1387p7461J8063j4199C53906H8885
19375a50630B8577b5445l69671f2359j25814j14779N146E7361a66225j05965J24286
19364a47904p1850a05216k51032q774K8259h9019j58909A061J1561J87256c93468
19352e4466E5435a12647n7488C9564b08162i6771c5635k14304J23087A56440b3276
19340A31489K876j4368N8078a47681a2089D4554j8910c16131H1087a69320G2831
19328b26912m3315A76512H7103E473g2175a2675A31342a0117q1083G1464e2281
$$ y = [118293, -84313, -140965, -48230, 74697, -89483, -163035, -156216, 73178, -42643, -215687, -51902, 224297, -452614, 225192, -92994, 138501, 32653, -12894, 85506, 81516, -179808, -58251, -65556, 147497, -124267, -109480, -174836, 105406, -91387, -168848, -150785, -164984, 353906, 88885, -150630, 28577, -25445, -395116, -62359, -188173, -302952, -297806, 57361, -166225, -272190, -147904, -219754, -105216, -356248, -365022, -336763, -89019, -247928, 1061, 12622, 199878, -393468, -54466, 55435, -112647, -170135, 39564, -208162, -96771, -35635, -249939, -126852, 156440, -23276, 131489, 134365, 119997, 178075, -147681, -12089, 44554, 25644, -316131, 81087, -169320, 72831, -226912, -270227, 176512, 87103, 5473, -72175, -12675, 131342, -10117, -91200, 71464, -52281]
19316a23157q3057K5971a4387l55816i6489F186J3747a43992c3829j18513N2715
19305i9627L5277j06077j73039F2063c05884D3956N813b48412q4624A8243a78697
19293a00231C22429A56053A0519a29454r8484R0484c203k45986N6752j23458A35118
19281H6630K1154g6626L752B7006c35336A46682a12055J9353B9784a6533o4800
19270h1333P6o3096J5800D6711b40062N4070d279A86827c35241b1705G8279J08804
19258A87083b10627b3914m5248A97589J6215a80647g081C994a20090o4158h9972
19246b31304f4479l22127A99484c31621J57036D0606J70026r7322C0872b21363
19235i6850d2357n4430A55515b0280j22738k21814d0828C117R9889B3077b36515
$$ y = [-123157, -206214, -180243, -14387, -370203, -96489, 6186, 19933, -143992, -33829, -152342, -99627, -64350, -170427, -343466, 62063, -305884, 43956, 49769, -248412, -333036, 18243, -178697, -100231, 322429, 156053, 10519, -129454, -227938, -137454, -3203, -249189, -192437, -315895, 135118, 86630, 107784, -76626, -72874, 27006, -335336, 146682, -112055, -92702, 29784, -16533, -81333, -81257, -144353, -128553, 46711, -240062, -185992, -4279, 186827, -335241, -21705, 78279, 187083, -210627, -23914, -69162, 197589, 213804, -180647, -7081, 3994, -120090, -184248, -89972, -231304, -64479, -386606, 199484, -331621, -174585, 40606, 210632, 113310, 30872, -221363, -96850, -42357, -96787, 155515, -20280, -143018, -364832, -40828, 3117, 103006, 23077, -236515]
19223B10428o9467a16579E44O0610N5970J27365p9417d8839A17087d30998i8028
19211a91427G5871b652D3969a17796E3734i96j9362k23662A05877b36950a6901
19199a84324h8766a9419j24216j1923j12155O5814I1296M5490Q0256B0576c05911
19187B10303d68558a88229l761C4755b81818J5890E5962J68580J03629g4356j37400
19176b11756R0597D5087N7500d62387g5114j78371k04158G9744c74001l7386g0465
19164e1640B07585H1714f9914k26655A66885E5452a63152A73010c8225p1079n5772
19153a65076F4256d06663a85101j9040E8409J2928c9413J6545j33059j29062N5740
19142b29249C38301a26932N9990k37968Q3244M1269G9321a82571c358j54226B32672
$$ y = [210428, 140961, -116579, 544, 61154, 117124, 244489, 165072, -48839, 117087, -430998, -98028, -191427, 75871, -2652, 43969, -117796, 53734, -996, -20358, -244020, 105877, -236950, -16901, -184324, -88766, -19419, -143635, -155558, -267713, -201899, 91296, 136786, 217042, 20576, -305911, 210303, -468558, -188229, -191990, 34755, -281818, -265928, 55962, 224542, 328171, -74356, -211756, -121159, 45087, 102587, -462387, -75114, -253485, -457643, 79744, -374001, -411387, -70465, -51640, 207585, 81714, -69914, -296569, 166885, 55452, -163152, 173010, -38225, -109304, -165076, 64256, -406663, -185101, -204141, 58409, 71337, -39413, -22868, -155927, -284989, -229249, 338301, -126932, -66942, -304910, -221666, -180397, 79321, -182571, -3358, -157584, 232672]
19130a97055B7926d7522l2512j20334I1390J9375D795h170j42040A30681b22506
19118a99868N0768l00221Q966a31627p7758P3694d8857A43067a31858j88749D6130
19106c5623A72407a52708j90509D7789d23043a86004B82179j00390i3503k05345
19096b98848i458l69082f3869b1819E4381b75074P6230B38343i3337B59580f7740
19084C84045a66907A40337g5989j60196M3755R2818L7059B39031a15496l7191
19074a52687A08619C6551J03311c25347C47641d5231l02685g275A4573a34111
19063D6829c0052l1517J0482p5857k4330A24851g5337l5536e0878C4295a01301
19051e4872j33026q5198c5426j10106k75056c9389q7173m6564c4968F0028b86457
$$ y = [-197055, 27926, -47522, -80034, -200368, 91390, 110765, 4795, -8170, -150210, 130681, -222506, -199868, -149100, -449321, -440355, -131627, -209385, -135691, -48857, 143067, -131858, -320607, 46130, -35623, 172407, -152708, -343217, 47789, -423043, -186004, 282179, 181789, -93503, -298848, -9458, -378540, -63869, -21819, 54381, -275074, -198844, 238343, -93337, 259580, -67740, 384045, -166907, 140337, -75989, -236185, -192430, -99612, -62553, 239031, -115496, -152687, 108619, 36551, 139862, -325347, 347641, -45231, -347916, -7275, 14573, -134111, 46829, -30052, -61569, -51087, -126944, -151274, 124851, -75337, -110873, -50878, 34295, -101301, -54872, -187898, -273096, -35426, -145532, -420588, -39389, -126562, -173126, -34968, 60028, -286457]
19039F3268c92605A71793e8872B49266a69934C1108e4993A70320b16058A33702
19028A33705b08188j099A11836a80492A53296a4676A62151J03499a09114c1743
19017B64146A28220b31524h3863G3309h4610A03554O4047l7275C2128R7256k3453
19006A05931h8988E5806a92243f6619a1680k09358L306B98660q4758c25333A7596
18994E3195B1431b38760B2338K22185p7899N620A8782f5087j11291k7958A62560
18982B2603J64506P3756j09972b88268A58391J14854B7926a73763E8535K8190
18972H6725K70749J10809k11126K855R219M3140c6868F4506a1011B14063d17519
18960a19575G1149c83454B47748d3485C3319J2919e9190n2623A53430f4423I9571
$$ y = [63268, -392605, 171793, -58872, 249266, -169934, 31108, -54993, 170320, -216058, 133702, 133705, -208188, -209287, 111836, -180492, 153296, -14676, 162151, 265650, -109114, -31743, 264146, 128220, -231524, -83863, 73309, -84610, 103554, 167601, 130326, 32128, 129384, 105931, -88988, 55806, -192243, -66619, -11680, -221038, -217732, 298660, 213902, -325333, 17596, 53195, 21431, -238760, 22338, 244523, 166624, 172244, 18782, -65087, -176378, -204336, 162560, 22603, 187109, 260865, 150893, -288268, 158391, 273245, 27926, -173763, 58535, 86725, 357474, 468283, 257157, 260012, 269231, 312371, -36868, 64506, -11011, 214063, -417519, -119575, 71149, -383454, 247748, -43485, 33319, 46238, -59190, -111813, 153430, -64423, 99571]
18948a22961I3471e8259j37384a5706C34503b20659l3591H0527b19917b9586n3369
18937h2955l4452J1270K235C01663a86116B18038a73015f5355l882k26130D9795
18925b12810A87197g3044m5303B00782G1937k8895A2261L25354b00846A5268C832
18913c2756C10954j18925J57257f8349C80462n2588A28749K76270E2760b80440
18902f0769I759K05947N0659g0646j65569h6115l15504C3059b33126C5182A4120
18890E0077K36623b37141j00138b3645q7595d4192a5180j34037A66914E6366c84621
18878a38102k23881a21630E1350a85310k3495N3393M7131a5722k21047A49011
18867i2389A05433D0115i8607L7020B26243D1219a18366b0128B58742h5343m1450
$$ y = [-122961, 93471, -58259, -195643, -15706, 334503, -220659, -254250, 80527, -219917, -29586, -82955, -117407, -106137, -103902, 301663, -186116, 218038, -173015, -65355, -69237, -295367, 49795, -212810, 187197, -73044, -118347, 200782, 71937, 43042, 12261, 337615, -200846, 15268, 3832, -32756, 310954, 192029, 349286, -68349, 380462, 327874, 128749, 405019, 52760, -280440, -60769, 9759, 215706, 266365, -70646, -236215, -86115, -401619, 33059, -233126, 35182, 14120, 50077, 286700, -237141, -337279, -23645, -111240, -44192, -15180, -149217, 166914, 56366, -384621, -138102, -361983, -121630, 51350, -185310, -208805, -155412, -108281, -15722, -236769, 149011, -92389, 105433, 40115, -98607, -61587, 226243, 41219, -118366, -20128, 258742, -85343, -126793]
18856a26793e3947a5602k77085H4121e4405k52199a13866A65020a99998A24786
18845f9655l25059d3611A14004l7375c3382r6605l6009A56950E3362J6212B3192
18833c49780c8194j8480k30868d4573I6350M7512B5356a78961O3947C94628A69159
18821b81377j06965f4122q9213E8697a54576p8816c0061B27197H8820d00815e5546
18809I1219m852J71020A04118P8788B4339J1475Q2068b64579K2242f8437k12720
18798b81157f8194J1167C5289K16666h6321j15865k4188a8040f035C17576D2672
18786A50791C7817h8978k65203A54856J97492a99014h0574A98529D3200O577b60394
18774h5030C5982b27719F6345d16249R9859g1565I5492a55472C7408M38804a26229
$$ y = [-126793, -53947, -15602, -292687, 84121, -54405, -306604, -113866, 165020, -199998, 124786, -69655, -394714, -43611, 114004, 76629, -33382, -129987, -165996, 156950, 53362, 69574, 23192, -349780, -38194, -56674, -287542, -44573, 96350, 143862, 25356, -178961, -115014, 394628, 169159, -281377, -388342, -64122, -153335, 58697, -154576, -233392, -30061, 227197, 88820, -400815, -55546, 91219, 86367, 257387, 104118, 182906, 24339, 35814, 117882, -264579, -242337, -68437, -281157, -68194, -57027, 35289, 251955, -86321, -202186, -226374, -18040, -6035, 317576, 42672, 150791, 37817, -88978, -354181, 154856, 352348, -199014, -80574, 198529, 43200, 49777, -260394, -85030, 35982, -227719, 66345, -416249, -316390, -71565, 95492, -155472, 37408, 476212, -126229]
18762A64873e5866A52125c72308A42100a40556I5195a31823A70622B786a23348
18751c9130j06134G0389b14767j7825E3616b35475d0807A727a19483e059q152
18740a3211F8190A5778J50269b90971c7656D690K20979b93394a12745B36389B237
18728a29378K4007l98604e5361C08489a0808k67234B8361b19378D7426o003b22747
18716B85053o756a31221I3282a08140K1061j4691E8890M7195J27896a91580d5401
18704B34874O2431h7366k42625I015K05976a79100A90082h4866G8110g4255F8290
18692G6803A3251h569E8915g7756A36524f05207C8633a49141A55121a96250B5892
18680a31042A62113C0682i549B43850P583a7316A02241Q031J13671m1674E8434
$$ y = [164873, -55866, 152125, -372308, 142100, -140556, 95195, -131823, 170622, 2786, -123348, -39130, -145264, 70389, -214767, -232592, 53616, -235475, -40807, 1727, -119483, -5059, -13211, 68190, 15778, 166047, -290971, -37656, 4690, 225669, -293394, -112745, 236389, 2237, -129378, -105371, -503975, -55361, 308489, -10808, -278042, 28361, -219378, 47426, 41423, -222747, 285053, 278297, -131221, 93282, -108140, -87079, -101770, 58890, 106085, 233981, -191580, -45401, 234874, 297305, -87366, -329991, 9015, 214991, -179100, 190082, -84866, 78110, -74255, 68290, 76803, 13251, -8569, 58915, -77756, 136524, -605207, 38633, -149141, 155121, -196250, 25892, -131042, 162113, 30682, -9549, 243850, 251433, -17316, 102241, 110272, 223943, 182269, 58434]
18668H3909l9893D049b24848g1856G5093a00187d2083i010D18736a73103C5002
18656F4067P909K32675b67679H4955c90151A55204a27324c202j20986m3912c5275
18644F8542c8183n22817d749j39075j9663d5037j28688N7193j70613a18832c1472
18632a15284M511A4505K31199b90717A55239a0614F7059J3838g7940C29J08287
18621A08616e1480k70619a55604j32337a00231B97167e07352Bd29999A22531f3062
18609A51894G2272b18926J4529B61231F6245O652a64023C16f1273j49572j22i1150
18596a14952N1140j19825Q6429d3746i59k33385j0014J00582A67876q1516g3836
18584A1353c8519k74666a87j23970j74008f2186K416m5993d6889m7053K2780B62004
$$ y = [83909, 44016, 4049, -224848, -71856, 75093, -100187, -42083, -9010, 418736, -173103, 35002, 64067, 71976, 304651, -267679, 84955, -390151, 155204, -127324, -3202, -124188, -168100, -35275, 68542, -38183, -561000, -4749, -143824, -163487, -45037, -173725, -116532, -287145, -118832, -31472, -115284, -110773, 14505, 245704, -290717, 155239, -10614, 67059, 80897, -77940, 329, 108616, -51480, -322099, -155604, -287941, -100231, 297167, -507352, 2, -429999, 122531, -63062, 151894, 72272, -218926, -204397, 261231, 66245, 72897, -164023, 316, -61273, -210845, -210967, -91150, -114952, -63812, -183637, -97208, -43746, -959, -234344, -244358, -143776, 167876, 86360, -73836, 11353, -38519, -313185, -187, -124157, -298165, -62186, -59770, -105763, -46889, -93942, -71162, 262004]
18571F4100f4038D3837d11264a9499k57938J17353N5008j1049j9413b0373k2241
18560d2614G890c05596A0982a04557I2439b87006R9776m303A26415f3099m8562
18549a11661C13276a7177H5983P4805a15825b2677A0036J52366f1151j76236c4311
18537e359l6976C40741A3169a50385M5660e0329j86605L3580j49584e1277j89302
18526b40579i567j22531c6656A7028a20237k01651D220b00813B35413A15786K63966
18515C79752b15089A22850a36000q050A63933K00911A45220a28957b7312j54119
18505a81431j58452c6128j95429c5440q8846L3208k2287A16706k8320d439A45079
18493g1805K3149j80331e2358C15956A41649a4819H8972P0490b0240j01819A13248
$$ y = [64100, -64038, 43837, -411264, -19499, -277437, -160084, -105076, -116125, -135538, -20373, -42614, 7890, -305596, 10982, -104557, 92439, -287006, -187230, -191533, 126415, -63099, -111661, 313276, -17177, 85983, 160788, -115825, -22677, 10036, 162402, -61151, -237387, -34311, -5359, -42335, 340741, 13169, -150385, -104725, -50329, -236934, -203354, -352938, -51277, -240579, -9567, -132098, -36656, 17028, -120237, -321888, 4220, -200813, 235413, 115786, 379752, -215089, 122850, -136000, -144050, 163933, 364844, 145220, -128957, -27312, -181431, -339883, -36128, -231557, -35440, -124286, -91078, -113365, 116706, 88386, -4439, 145079, -71805, -48656, -228987, -52358, 315956, 141649, -14819, 88972, 159462, -20240, -122059, 113248]
18481f3522C3519i0084A96166a96346A73083E4554J30396d4505k02957P0853A08206
18469a7785k85930H5754A7406L9047b44262I3010J6559D1385J5116b44348Q9532
18458a54816A81111e6700a4782l14133h1349j23742A04288C2812K70216b2535
18447e1924j87561i6078A14667a81519Q3571k42073A82316J24407b39892H6914
18436b91439D4408a14644j91890a06233l2886G531K20015P0273E8066L18495c558
18424g4557B00359m814n7626c7422p6085N602N1611A47989e3421D0452d09750
18412I4145a13587C19451j48904P1344D1512a91153l2913D3092b15288a1211B9358
18400d7675J9942A40109g6206L2117H329a53903a487j12250J7184B53672j13297
$$ y = [-63522, 33519, -90084, 196166, -196346, 173083, 54554, 184950, -44505, -247462, -176609, 108206, -17785, -303715, 85754, 17406, 56453, -244262, 93010, 109569, 41385, 56501, -244348, -154816, 181111, -56700, -14782, -328915, -81349, -205091, 104288, 32812, 303028, -22535, -51924, -239485, -96078, 114667, -181519, -97948, -340021, 182316, 306723, -239892, 86914, -291439, 44408, -114644, -306534, -106233, -139119, 7531, 227546, 297819, 58066, 376561, -3558, -74557, 200359, 195545, 137919, -37422, -113507, -107905, -56294, 147989, -53421, 40452, -409750, 94145, -113587, 319451, 170547, 241891, 41512, -191153, -224066, 43092, -215288, -11211, 29358, -47675, -27733, 140109, -76206, -44089, 8329, -153903, -1487, -113737, -96553, 253672, 140375]
18389A40375B3306O4013R5243D6269j0013i4476E5524c3183j12391G5373j2689
18378F2684h0222l42540H9549l962c6394G7847b74958I7644a79938B13183m4047
18367A69136b59816M9405N1721A35381R1966B4283b1774C80672b03919G3623l6346
18356C7277L9563K3570N672J62515b26238k142j36566D0042b441A72772G3598
18344b61470J07327F3431g4976A76799c38565e342j19757c2848A22765f0373A11122
18332C6634a38199I0470e3824H2634b35389D5176c0584A88770a85958A46324l5140
18321A11184b86725j0759L2138F7343K65484A664a01605l61093C9591K8780P2043
18310A40414a11417B13050f8101l5004A87455f3596j38510k6904M9594L6626A6515
$$ y = [140375, 23306, 87319, 182562, 46269, 36256, -94476, 55524, -33183, -145574, 75373, 62684, -80222, -422762, 89549, 85587, -36394, 77847, -274958, 97644, -179938, 213183, 169136, -259816, -210411, -158690, 135381, 227347, 24283, -21774, 380672, -203919, 73623, 37277, 76840, 100410, 106082, 268597, -226238, -228380, -364946, 40042, -2441, 172772, 73598, -261470, -154143, 63431, -74976, 176799, -338565, -5342, -125099, -32848, 122765, -60373, 111122, 36634, -138199, 90470, -53824, 82634, -235389, 45176, -30584, 188770, -185958, 146324, 111184, -286725, -297484, -265346, 67343, 332827, 1664, -101605, -462698, 39591, 68371, 140414, -111417, 213050, -68101, -103105, 187455, -63596, -202106, -229010, -179416, -142790, 16515]
18298B65321j32241c00559A38007m4529a0239k31156H1396a07702A85948e7634
18287f1812D4176a27117n8411d0585B83544h346A09387P2873C3558a18354E3659
18275b9910I7552J53065c9345I52R9064a65725D2779c01165a303k59110A54202
18263f2136D5613L7897m1431d81669A42753p1365g1176A45585h715B10125b2242
18251a3895l12780A3794a62033A13217g11648a70713j93025C8812e0952B1946
18240A48199d9754K1833C52315a65354P0701B349P1481R4124g8245q7438H9546
18228D1597b2764m8286j58513F5134c9202o1356A43848e3227F5951h336o8379
18217g6715L7849j51776A09310A6712a1584l0219J264B60117J13590A67882b29265
$$ y = [265321, 133080, -300559, 138007, 93478, -10239, -241395, 81396, -107702, 185948, -57634, -61812, 44176, -127117, -185528, -40585, 283544, -8346, 109387, 182260, 33558, -118354, 53659, -29910, 97552, 250617, -39345, 952, 100016, -165725, 42779, -301165, -1303, -260413, 154202, -62136, 45613, 83510, 42079, -481669, 142753, 71388, -71176, 145585, -8715, 210125, -22242, -13895, -326675, 13794, -162033, 113217, -711648, -170713, -363738, 38812, -50952, 21946, 148199, -49754, -27921, 352315, -165354, -94653, 2349, 73830, 167954, -78245, -165683, 89546, 41597, -22764, -71050, -229563, 65134, -39202, -100558, 143848, -53227, 65951, -8336, -76715, -38866, -190642, 109310, 16712, -11584, -41803, -40539, 260117, 373707, 167882, -229265]
18205b41388k3000f9183K1765l8648q385B54092n8730a80775M0307a1582n9817
18194g1399p213B66731F8480b03878G8506P6598J98435A5234b28170B09705c01140
18182a78912A34395j6815C7982L0455J46757E1607a38501O3458F6534F758a37784
18170C185b87005A25044Q9005O459b74575i3337j83309f3281E5240K4254b42286
18158a64227A09803L2188o231E3542c53164C18947d8349F3158a60044e59l50582
18147c51141a25896m9463D0340a6597B65396q833j02823b02330c5834k1909B03799
18135F6479a16509C7954A8143L2695j4873g3284A10885P8875Q2900b29780e3071
18123G6327c3885k09512h115A37133J18618a63547A23054m0246i6078k43838B7529
$$ y = [-241388, -264388, -69183, -47418, -86066, -94451, 254092, 195362, -180775, -140468, -11582, -71399, -78612, 266731, 68480, -203878, 78506, 155104, 353539, 15234, -228170, 209705, -301140, -178912, 134395, 117580, 37982, 68437, 215194, 51607, -138501, -75043, 66534, 6758, -137784, 3185, -287005, 125044, 214049, 220508, -274575, -93337, -276646, -63281, 55240, 79494, -242286, -164227, 109803, 141991, 135760, 53542, -353164, 318947, -48349, 63158, -160044, -559, -351141, -125896, -175359, 40340, -16597, 265396, 256563, 153740, -202330, -35834, -57743, 203799, 66479, -116509, 37954, 18143, 50838, 35965, -73284, 110885, 189760, 272660, -229780, -53071, 76327, -33885, -243397, -8115, 137133, 255751, -163547, 123054, 82808, -96078, -339916, 27529]
18111D88929B4610m86K22910h5920C3046c2678k05221L3901D3253a83955A2395
18099a45621G9979a674p0643j84934I78a46588E9853b4429A17026K06955j25771
18088A98210J2129L4702I973K57386h1421j42245a11383A46011K167h6589B97096
18076C81729c55554J57075D5087O3039N4977L1627d6002C3510j4480M0885a8171
18064B1624a28187K5096j01789d6550q0604j8194I8420C1050d9531k34367B6224
18052b93056J16487K7160B45987B6198i3448d6639G4242J70515F745J35752H253
18040H0488c11622A92811F5817Q5962m6850a19957E2894K1150k5665b0814l2275
18029e3089A74420i0488q2133D4780Q0779d8420j56764R1835A22501m3803J01746
$$ y = [488929, 24610, 24124, 247034, -85920, 33046, -32678, -237899, -203998, 43253, -183955, 12395, -145621, 79979, -1674, -72317, -257251, 978, -146588, 59853, -24429, 117026, 323981, 198210, 210339, 245041, 9973, 267359, -81421, -223666, -111383, 146011, 148178, -86589, 297096, 381729, -355554, -198479, 45087, 108126, 163103, 194730, -46002, 33510, 19030, 59915, -18171, 21624, -128187, -103091, -204880, -46550, -127154, -145348, 98420, 31050, -49531, -283898, 26224, -293056, -176569, -149409, 245987, 26198, -93448, -46639, 74242, 244757, 6745, 142497, 8253, 80488, -311622, 192811, 65817, 151779, 104929, -119957, 52894, 74044, 48379, -20814, -53089, 174420, -90488, -172621, 44780, 125559, -48420, -205184, -113349, 122501, 78698, 180444]
18018A80444c65795A23926b62405C7b0254A11800O560Q7523a48934F5414Q7893
18007A53307A214a06663c6953C6401L6264a9858o8560j1614q958K5600A55435
17995a44784A11618c86138N7791C41996A25476H594a08595k32775D34508b74735
17984f635C85001F7248L130N0683a06831I6067a79833G1545c42534F3721f416
17972A37466a27214H8671b07200M6172f938D2618J07936D4126b43582h8274C78643
17960A340J1400J10208O4123a76726n5228i3670A8169J50277l3363b7431j27914
17949a55345C47693A8449J00250K33290b08927a8389B34552G8662l4651a18100
17938B25887N452R6762A31557c4297D4740P2029f8783A53000h122n6057r0882
$$ y = [180444, -365795, 123926, -262405, 37, -20254, 111800, 118360, 205883, -148934, 65414, 153307, 1214, -106663, -36953, 36401, 72665, -19858, -88418, -100032, -108990, -83390, 155435, -144784, 111618, -386138, -328347, 341996, 125476, 8594, -108595, -341370, 434508, -274735, -6635, 385001, 67248, 70378, 121061, -106831, 96067, -179833, 71545, -342534, 63721, -6416, 137466, -127214, 88671, -207200, -161028, -6938, 42618, 150554, 44126, -243582, -88274, 378643, 1340, 12740, 122948, 187071, -176726, -231954, -93670, 18169, 168446, 135083, -27431, -155345, 347693, 18449, 118699, 351989, -208927, -18389, 234552, 78662, 44011, -118100, 225887, 231339, 328101, 131557, -34297, 44740, 116769, -68783, 153000, -8122, -64179, -155061]
17927a55061A21847D0489M0603i722F9155q636c96587g9191j27230P2562A58457
17915f320B931J19586l7420F760b60006d575A54091b0990C8301J48973b80567
17903h330A5666a99682M0674B4510J50721L5391N4094p6928a76887a0895C21601
17891A08273l3950P0743F8893c7158A59811a4986q3979B57233A14272J00163a04567
17879b55751N7908k6465F3465c1363B52577e8425H4320c03717C20641l0355H4534
17867i3163j05222A1218K80629j16777p7708F853B865g3049j7427C97484a6231
17855A90406A1320J48018B8801e3537r5611C7743O372b78392A52907i0247A13760
17843A79695A8153R7627K70384d9338j11506A47752b7388E7991k8684K7839b65954
$$ y = [-155061, 121847, 40489, 81092, -9722, 69155, 60519, -396587, -79191, -206421, -133859, 158457, -6320, 2931, 122517, 85097, 6760, -260006, -4575, 154091, -20990, 38301, 187274, -280567, -8330, 15666, -199682, -159008, 24510, 175231, 210622, 264716, 187788, -176887, -10895, 321601, 108273, 74323, 145066, 68893, -37158, 159811, -14986, -98965, 257233, 114272, 214435, -104567, -255751, -197843, -224308, 63465, -31363, 252577, -58425, 84320, -303717, 320641, 290286, 84534, -93163, -198385, 11218, 291847, 175070, 97362, 6853, 2865, -73049, -90476, 397484, -16231, 190406, 11320, 159338, 28801, -53537, -149148, 37743, 44115, -278392, 152907, -90247, 113760, 179695, 18153, 115780, 386164, -49338, -160844, 147752, -27388, 57991, 29307, 57146, -265954]
17831a26629a5474j99961i2832C3834F415e3731n6578C38563j03116q7488l6863
17820A11096m3227q605J37296q7001l8927b51788a06824H0924j1392B2957c31586
17808a02322A38307K534H592J1121a75321B07103a52606c0501A02100K36242H3453
17796C65087a56354C6466h424A94907h8067A17629A6688c22200a15081L1676A17210
17784g8679B8349a38645A37010b48338B88311B45c2776q3420n3024d8096J6808
17773c1288H0041j3674a1868k6309I7537K22636C0435a3709B76230j13327Q938
17762A71841B5183L005P5139a58633c4816C3786a2550B65770n4116a25680A05132
17750H9948c6881A63044C6719R569P5629A3930M07596g5914E4273N38651B03874
$$ y = [-126629, -15474, -215435, -92832, 33834, 6415, -53731, -110309, 338563, 235447, 147959, 111096, 67869, 59264, 196560, 109559, 70632, -251788, -106824, 80924, 69532, 22957, -331586, -102322, 138307, 140841, 8592, 19713, -175321, 207103, -152606, -30501, 102100, 338342, 83453, 365087, -156354, 36466, -8424, 194907, -88067, 117629, 16688, -322200, -115081, -83405, 117210, -78679, 28349, -138645, 137010, -248338, 288311, 245, -32776, -116196, -169220, -48096, -31288, 80041, 66367, -11868, -38177, 97537, 320173, 30435, -13709, 276230, 162903, 171841, 25183, 28188, 103327, -158633, -34816, 33786, -12550, 265770, 211654, -125680, 105132, 89948, -36881, 163044, 36719, 46288, 121917, 13930, 421526, -75914, 54273, 592924, 203874]
17738C4183a4615j13445B75763A4671J67648j138K05893a38631b8367r7425L6390
17727h9402r3929A00206K42322A63974h4022H7949h563F0045B4816Q0539J57022
17716B62377A12233J15866g0922H1623l3624P7853k5902K93579G2581R4397K66751
17705D33729B15970M9541b72330A7751L67367M7752j60523A2668J57510q315c7162
17693b51000E3355j202a30964B55191a52716A19627b75970A63378C7398f2960
17682B42398A01427a7177F430L85604g7766K9026B07644q3385a25070A56658a05989
17670C24265c3594B2198M27432G3194j2193O2610J7856o0639B3222c2789A64249
17658a90574A68913a19304E5042O8387k9287e4297P615j10084A60100a42171G8789
$$ y = [34183, -14615, -128060, 275763, 14671, 182319, 181181, 387074, -138631, -28367, -125792, -89402, -183331, 100206, 342528, 163974, -84022, 87949, -8563, 60045, 24816, 105355, 262377, 112233, 228099, -70922, 81623, 47999, 125852, 99950, 393529, 72581, 166978, 433729, 215970, 265511, -272330, 17751, 385118, 432870, 272347, 12668, 170178, 161863, -37162, -251000, 53355, 52153, -130964, 255191, -152716, 119627, -275970, 163378, 37398, -62960, 242398, 101427, -17177, 6430, 392034, -77766, -48740, 207644, 124259, -125070, 156658, -105989, 324265, -33594, 22198, 449630, 73194, 61001, 123611, 141467, 80828, 23222, -32789, 164249, -190574, 168913, -119304, 55042, 123429, 94142, -54297, -46682, -156766, 160100, -142171, 78789]
17646A17011m473M1431C3148K29553B9487a54365c6370A21708L8150O4872R116
17635B33846G6824B8328d6641k5492n8417C20437A36833a29934B8467b33171C02487
17623B24430c0011E5415a770F4451J30475n3139L3943f6802G5774b11789G4305
17611c4247B60849K49485A82930O1411A3056a13628C56341H6641J29371J32635
17601C48647r9348r8217a43560E03240G9920m143j7287K21294j02290r05J88880
17590C65469A67738R8748A22340C9501L02802K6671A9590L28534F3504L59295
17580D22799r8239C9203a49354B8253a3431D0037J85536o565b28617e3153A26916
17568a80129A85031L9767A6543P9873M7352J24976q0227H945K56879K5602a54830
$$ y = [117011, 112538, 153969, 33148, 262701, 29487, -154365, -36370, 121708, 159858, 224730, 233846, 76824, 28328, -46641, -72133, -130550, 320437, 136833, -129934, 28467, -233171, 302487, 224430, -30011, 55415, -1770, 64451, 194926, 141787, 175730, -66802, 75774, -211789, 74305, -34247, 260849, 510334, 182930, 244341, 13056, -113628, 356341, 86641, 216012, 348647, 249299, 151082, -143560, 503240, 79920, 75777, 58490, 279784, 177494, 176589, 365469, 167738, 266486, 122340, 39501, 342303, 368974, 19590, 348124, 63504, 422799, 324560, 39203, -149354, 28253, -13431, 40037, 225573, 219008, -228617, -53153, 126916, -180129, 185031, 224798, 16543, 96416, 143768, 268744, 188517, 8945, 265824, 291426, -154830]
17556B20363j03118P5135l1924A7164K3277M5952J67177K44378j39723f5274B41740
17544F8215L76221A12994N5639K10451j06882J96669q6204J1174J54715B05059
17533B68950j21904M69533B78012P2005G3270K62643K59882n2504K99990m6444
17523G96837K84620m07906P3946K9185j70497B20787M19P2504j00305J89605j24794
17512B58216L21435k2559M15314p4804J16324k10430j7785j51534k74876l5420
17502C23881J3166G3408L7148M55769n7537H4208M35151j59738o101F886N33081
17491E39967A56029K04140A75143J64326r3564o8643P1937L28477h4381D53294
17480B14839i789I3046J01362J88297q1414J57848j5896g2397D10294G5748J57251
$$ y = [220363, 117245, 192380, 160456, 17164, 40441, 86393, 253570, 497948, 358225, -65274, 241740, 68215, 444436, 112994, 168633, 379084, 272202, 468871, 382667, 393841, 548556, 205059, 268950, 147046, 616579, 278012, 350017, 73270, 335913, 595795, 543291, 843281, 796837, 1081457, 673551, 747497, 776682, 606185, 220787, 221206, 293710, 193405, 383010, 258216, 579651, 557092, 972406, 897602, 1013926, 803496, 785711, 634177, 359301, 323881, 337047, 73408, 110556, 566325, 508788, 84208, 519359, 359621, 353520, 6886, 539967, 156029, 360169, 175143, 339469, 245905, 177262, 249199, 577676, -84381, 453294, 214839, -9789, 93046, 194408, 382705, 301291, 459139, 443243, -72397, 410294, 75748, 232999]
17469B32999B6836J98667J68218p0548A14633L07738h6774r0856Q8196F7154g0679
17457D07040l5216A50280K7773P5180g7733J7993B08292Q6997H5720K79836L288
17446C68844K64622N9816B16216M22752J6138j70990H417K72658J70900j93902
17436B58073K6151J44645j82447J84539G1126K82903M9853j45571A22301M00184
17426E22485A70448O7014p1660L80090j0369B46575o9096M81188B79111J22341
17416D01452J37883B69472N3331j35665L88623j36483a8642E36826j78866C8353
17405D70302A10674L35269j88897O1973C7617P1228j2989J45959N0625j11969
17395A80471J13585O9470k2327d3627E05796j70038b9477C84851J51940j15172
$$ y = [232999, 26836, 225503, 393721, 323173, 114633, 422371, -86774, -177630, -89434, 67154, -70679, 407040, 371824, 150280, 178053, 253233, -77733, -59740, 208292, 295289, 85720, 365556, 368844, 633466, 693282, 216216, 638968, 655106, 484116, 8417, 281075, 451975, 258073, 284224, 428869, 246422, 430961, 71126, 354029, 403882, 258311, 122301, 522485, 170448, 237462, 165802, 545892, 535523, 246575, 177479, 658667, 279111, 401452, 539335, 269472, 322803, 187138, 575761, 439278, -18642, 536826, 357960, 38353, 470302, 110674, 445943, 257046, 319019, 37617, 108845, 95856, 241815, 292440, 180471, 294056, 363526, 341199, -43627, 505796, 335758, -29477, 384851, 536791, 421619]
17385D21619j77949g057A53459R1916C0198f3290B72230I0509K67662r2304H9315
17373A76016J01174j11501m7166J30865N978J4169A34565K79546A22902M22163
17363E45065j92352C6414P3655M26064B26877j10344K98331q8383A25486K75954
17353D01440A26752m3584L0928R4830J79383A86049p5912J49518B5629N77069
17343F02698B14238J29936m0303o1520L7310n0837J64393F5268L64546H3663M2725
17332A26388a1011C82251o2766o1393J13322H3908H385K02383J6332L3878K82272
17321E43250j22759e0725B33593m0941L56500k31449Q7529E5369M73589j06909
17311D22049j70613J61444Q5199G3659J00767a721E69881j88917K94974B16775
$$ y = [421619, 243670, -7057, 153459, 245375, 30198, -63290, 272230, 90509, 358171, 265867, 89315, 176016, 277190, 165689, 118523, 249388, 255366, 269535, 134565, 414111, 122902, 545065, 352713, 36414, 110069, 536133, 226877, 116533, 414864, 326481, 125486, 401440, 126752, 83168, 114096, 208926, 388309, 186049, 110137, 259655, 25629, 602698, 214238, 344174, 303871, 242351, 279661, 228824, 393217, 65268, 429814, 83663, 126388, -11011, 382251, 319485, 258092, 371414, 83908, 8385, 210768, 227100, 260978, 543250, 420491, -50725, 233593, 192652, 549152, 317703, 405232, 55369, 528958, 422049, 251436, 412880, 498079, 73659, 174426, -1721, 569881, 380964, 675938, 216775]
17300C51679J06930k25170A03379J75080J97978q0891k4658j25780L53218k33748
17290C64578j55254l2600L17751B10196J62355J4023m2033L4619N4132j40414
17280B92878K55842B22242J46033A42933F4751K1629L6985M1094M53196r1640
17270E26015R450p4759j06652F2883L6527d3765B72014K91500E8229M97823n2085
17259E03967k02512K94210j85287j09033A47725c5175E37805j58932A45910L43793
17249D89703P6556K4981k11040K10612k05511j06631I3424N47439M032C09958
17238D52751J42888p9491r6253q9652J4543I3541L66033A49206K91987k6998Q036
17227D22231O1863A58052N22813q9332B94257J87093j96077B2737J53581K00798
$$ y = [351679, 458609, 233439, 103379, 278459, 476437, 395546, 370888, 245108, 598326, 364578, 209324, 176724, 494475, 210196, 372551, 386574, 344541, 379160, 433292, 292878, 548720, 222242, 368275, 142933, 64751, 86380, 123365, 164459, 617655, 526015, 535465, 460706, 354054, 62883, 99410, -43765, 272014, 563514, 58229, 556052, 503967, 301455, 595665, 410378, 301345, 147725, -35175, 537805, 378873, 145910, 489703, 566259, 591240, 380200, 590812, 385301, 278670, 93424, 640863, 644895, 309958, 452751, 595639, 516148, 419895, 330243, 344786, 93541, 459574, 149206, 441193, 414195, 422231, 484094, 158052, 680865, 591533, 294257, 481350, 285273, 22737, 176318, 377116]
17217C77116M6266N6980A9595M99570j03344A72628l4816J01300M8484k5995L58712
17206F20313k47509K79085B86048g223F34388k61864J83716o5776j25526P9526
17196D44464J72781k32911L42180k67497j2491k10224K35729m2181J39621K01058
17186G70529l58623L30494C65762O3823J40525k51165L76144l04945K84354l13833
17176C60665J94983m3683A77611M63570j50878J4843J08749k43245n717J48001
17166E12934l2358p8966j59951L38761L9418o096j54598K82533k73567A90569
17155F33921l04176K63524j94520M8264K42493m2272M5087j46335J23877L0065
17145F99928C45134K48734p3020B60264L87985k88167K51000B33891M72263q2583
$$ y = [377116, 423382, 480362, 19595, 519165, 415821, 172628, 137812, 239112, 287596, 261601, 620313, 372804, 651889, 286048, -7223, 634388, 372524, 556240, 490464, 364938, 444464, 617245, 384334, 726514, 459017, 446526, 236302, 472031, 429850, 569471, 770529, 411906, 742400, 365762, 429585, 570110, 318945, 695089, 390144, 674498, 360665, 555648, 511965, 177611, 641181, 490303, 505146, 613895, 370650, 364933, 512934, 480576, 401610, 241659, 580420, 619838, 613742, 459144, 741677, 468110, 190569, 633921, 329745, 593269, 398749, 447013, 689506, 647234, 692321, 545986, 669863, 699928, 345134, 593868, 520848, 260264, 648249, 360082, 611082, 233891, 706154, 623571]
17135F23571R5087j29868N2015j7532q3145B68900J7452K6397N2854J70760O2928
17124E99291k14965K72430l08446L61456j99079M38963l85725J36418K8122J41923
17114H70388j08882L8415j4499Q1147j16148j35510K39712k73691J82571M01407
17104A164910m13925K87534m36394M706J26497l65780M81531k05744K04075L1710
17094H79120j10531j91815N08747l41895J20707l4986J4798o1799j2026k57689
17084E12631L70375m3993L0277k05574J3683M65584m77065j89466M58776l44992
17074E90236L48126k37331K93525m06250L57316o8105O0610R7449N7974J24091
17064A217641n05248L79891j74652l5679K87225m41992L0026J49988J43960j53591
$$ y = [623571, 718658, 588790, 640805, 623273, 540128, 268900, 286352, 312749, 365603, 536363, 599291, 384326, 656756, 348310, 709766, 510687, 949650, 563925, 700343, 728465, 870388, 761506, 799921, 785422, 866569, 750421, 614911, 854623, 580932, 763503, 1164910, 750985, 1038519, 602125, 606831, 733328, 367548, 849079, 643335, 847410, 879120, 768589, 576774, 1085521, 743626, 864333, 829347, 844145, 782346, 770320, 512631, 883006, 839013, 869290, 663716, 677399, 1142983, 665918, 476452, 935228, 590236, 938362, 701031, 994556, 588306, 945622, 877517, 938127, 1035576, 1093550, 1217641, 712393, 1092284, 917632, 881953, 1169178, 727186, 757212, 907200, 1051160, 897569]
17054H97569J99716l36132L5868j1436J97674J10227j97954p7090R7470P9126
17044I95038M9071l8232p1861K99110j19725k35573K11907p1366D84294O08628
17034A092922o0225Q5092l1727j49671J90827l1128j31518J1147n3677J70307
17024A092349J83119J63208j58271j73059K1803n5484N49330k80763j54504k17352
17014I70376M25274m57082M09322j36638k01544J19117l9643L01349j42824L5010
17004A282717l63882K5408O04520j13171o5028P9358j40680J75481n17046M16639
16994A384316m26162L77044K02901N1435j87068K60171j86173J31643m2671j64392
16984A401044J88355l07197J98428M1407j87224P4631J14310o2450O5714m2207
$$ y = [897569, 1097285, 761153, 797021, 785585, 983259, 1093486, 895532, 818442, 915912, 995038, 1044109, 1005877, 934016, 1233126, 1113401, 877828, 1089735, 1018369, 484294, 1092922, 1032697, 1117789, 1086062, 936391, 1127218, 1096090, 964572, 975719, 922042, 1092349, 1275468, 1438676, 1280405, 1107346, 1129149, 1073665, 1622995, 1342232, 1187728, 970376, 1395650, 938568, 1347890, 1211252, 1009708, 1128825, 1089182, 1390531, 1247707, 1282717, 918835, 944243, 1548763, 1435592, 1370564, 1449922, 1309242, 1484723, 967677, 1384316, 958154, 1335198, 1538099, 1589534, 1402466, 1662637, 1476464, 1608107, 1565436, 1401044, 1589399, 1282202, 1480630, 1522037, 1334813, 1409444, 1523754, 1461304, 1527018, 1484811]
16974A484811k33873K71511q6955K91794k92114K59205K63388j23985Q4619l41369
16964A577032L32966O1440k4721m3183l09891O41525k67656j31317j61379L38003
16954B012819k88098L36921k33053K65004K02745j20748p4094n7944J89154k91339
16944A941367J97467j78143J64998m2869J56833J6957j93231N9233K29814J37943
16934B490369K43436k52116j52956L07453J05735o33363N13890m88803O31695
16925B765340k01881j03576K27645k62870K47001m04601M26653O2405K54715j76716
16915B834115m15948J80088J74382K26293j13819Q0868j57331m2246K00162Q590
16905B975154Q5564J52650l23130P1792L99563R7540j90843q122O0832j078k4135
$$ y = [1484811, 1250938, 1522449, 1435494, 1727288, 1435174, 1694379, 1957767, 1833782, 1918401, 1577032, 1909998, 1971438, 1946717, 1903534, 1593643, 2235168, 1967512, 1836195, 1674816, 2012819, 1724721, 2061642, 1828589, 2093593, 2296338, 2175590, 2101496, 2043552, 2232706, 1941367, 2138834, 1960691, 2125689, 2082820, 2239653, 2256610, 2063379, 2122612, 2352426, 2490369, 2733805, 2481689, 2328733, 2636186, 2741921, 2108558, 2622448, 2133645, 2765340, 2563459, 2459883, 2687528, 2424658, 2671659, 2267058, 2693711, 2756116, 3010831, 2834115, 2418167, 2598255, 2772637, 2998930, 2885111, 2965979, 2808648, 2766402, 2966564, 2975154, 3060718, 3213368, 2890238, 2962030, 3361593, 3459133, 3268290, 3260168, 3321000, 3319922, 3295787]
16894C295787J42641K33696l19125M27806p522j20535J38283l29249J98858K15402
16884C876042N5848J87775m7779Q6664j28309J94641M6593J30237M2974r0462
16874D354224j18715K41955R3273L67908k79980K65823k35382L587j21485J33155
16864D704363M56946j96286J15141J24312M24084o2145k34398K78010j86132K01208
16854E625103K83937q4832R4499J77665J57677q2630M37275r6173l019L89013
16844F898515K21684k85348k70572L56965N07438P1010k48651L2371K23075N34269
16834H040756j79651J50156J80746N17707k11944J79137n2462L13318K25553R866
16824I173182O14644q9768m0087J56896N85653J88653L4079K7944O24265n7113
$$ y = [3295787, 3438428, 3672124, 3352999, 3780805, 3773283, 3652748, 3791031, 3461782, 3660640, 3876042, 3931890, 4119665, 4071886, 4158550, 4030241, 4224882, 4271475, 4401712, 4444686, 4354224, 4235509, 4477464, 4570737, 4938645, 4658665, 4924488, 4689106, 4692693, 4571208, 4704363, 5161309, 4965023, 5080164, 5204476, 5628560, 5566415, 5332017, 5610027, 5423895, 5625103, 5909040, 5824208, 5918707, 6096372, 6254049, 6171419, 6608694, 6512521, 6509502, 6898515, 7120199, 6834851, 6564279, 6921244, 7428682, 7499692, 7251041, 7283412, 7506487, 8040756, 7861105, 8011261, 8192007, 8709714, 8497770, 8676907, 8624445, 8937763, 9163316, 9173182, 9787826, 9698058, 9657971, 9814867, 10400520, 10589173, 10623252, 10651196, 11275461, 11218348]
16814A1218348N9846L44364J51350P32879j55912N76239J02194L9941J00492N83924
16804A3753665J84250L69103J80293N11454J82998P85532p8672N59535K15955
16795A6664113J40154J011070J09712O50470J52380O11043M94135M55834L38087
16786B0626998M51053R69980J73579J016716J60605Q39805P59676M25364N81605
16777B6005381Q79165O48229N91334J044229O97501J291706L56222J078899R75039
16768C3567705P20510J403862R93444J376614R97085R82914J253967J168192J221341
16759D3685634J559717J311263J545566J160755J745898J295633J738964J584784
16751E5628214J694904J916656J457643J957919K158256J666262J824257J788274
$$ y = [11218348, 11278194, 11622558, 11773908, 12506787, 12350875, 12927114, 13029308, 13069249, 13169741, 13753665, 13937915, 14307018, 14487311, 14998765, 15181763, 15967295, 15888623, 16448158, 16664113, 16804267, 17815337, 17925049, 18575519, 18727899, 19338942, 19833077, 20288911, 20626998, 21078051, 22048031, 22221610, 23238326, 23398931, 24238736, 24998412, 25423776, 26005381, 26884546, 27532775, 28124109, 29168338, 29865839, 31157545, 31513767, 32592666, 33567705, 34288215, 35692077, 36685521, 38062135, 39059220, 40042134, 41296101, 42464293, 43685634, 45245351, 46556614, 48102180, 49262935, 51008833, 52304466, 54043430, 55628214, 57323118, 59239774, 60697417, 62655336, 64813592, 66479854, 68304111, 70092385]
16743G0092385K069919J647450K127910J642383J944279K039553J445495J703810
16735H4713184J587153J744240J835435J162238J204160J565244O09764R52054
16727I5373472O34419M75620N22232L86734k82038q3746k04070o27640m58665
16718I5736318j046320q80127q14494j506968j151242j554451j662378j182458
16710H5937880j925459j721702j900259j972923j849065j739446j993263j866129
16702G0969634k179242j564881k153174j623376j588658j788700k093151j528795
16694E6449657j895850j371411j717879j426022j434708j305826j567350j262666
16686D4467945j365580j307631j563972r95689r24613j277335j005954j439092
$$ y = [70092385, 72162304, 73809754, 75937664, 77580047, 79524326, 81563879, 83009374, 84713184, 86300337, 88044577, 89880012, 91042250, 92246410, 93811654, 94421418, 95373472, 96007891, 96483511, 97005743, 97392477, 97110439, 97026693, 96822623, 96194983, 95736318, 94689998, 93809871, 92995377, 91488409, 90337167, 88782716, 87120338, 85937880, 84012421, 82290719, 80390460, 78417537, 76568472, 74829026, 72835763, 70969634, 68790392, 67225511, 65072337, 63448961, 61860303, 60071603, 57978452, 56449657, 54553807, 53182396, 51464517, 50038495, 48603787, 47297961, 45730611, 44467945, 43102365, 41794734, 40230762, 39235073, 38310460, 37033125, 36027171, 34588079]
16678C4588079n84726r19361p56143j039793j055582m90031q32293q79971r56268
16669B7073911l48812r03639o12424p30080o68379o22906j042402n5920m44024
16660B1645325q08120R0799j511460q8927N4046j139389m26783m1659o99791j92924
16650A6881117n14531l40656k82118n18299O8773m05658l09808j54288o24034
16641A3800498k70262k98313k49892k98868j88717j62665l78295k45471m21883
16632A1286132k45265K95669l90196m15970k00696J799j14149j32084n36721m1705
16622I506814J9900m3211m46901p051m001k01251k78569l14756J8887j90144j12740
16611G946977n01500J27868K43226k29803j45585l57478j23301j38044N8369N8438
$$ y = [34588079, 34003353, 33083992, 32327849, 31288056, 30232474, 29742443, 28910150, 28030179, 27073911, 26725099, 25821460, 25209036, 24478956, 23810577, 23187671, 22145269, 22089349, 21645325, 20837205, 20928004, 19416544, 19327617, 19381663, 18242274, 17815491, 17773832, 17074041, 16881117, 16366586, 16025930, 15743812, 15225513, 15294286, 14888628, 14578820, 14424532, 13800498, 13530236, 13231923, 12982031, 12683163, 12494446, 12331781, 11953486, 11708015, 11286132, 11040867, 11336536, 10946340, 10530370, 10329674, 10331473, 10217324, 10085240, 9548519, 9506814, 9526714, 9483503, 9036602, 9029551, 9025550, 8824299, 8545730, 8230974, 8249861, 8059717, 7946977, 7445477, 7573345, 7816571, 7586768, 7441183, 7083705, 6960404, 6822360, 6880729, 6939167]
16601F939167n9496m40123j31906q6821L2135K45391m21894n60698L05392j79566
16591E641581M3979k2618L6760n21569j03453L52644k96675L2636j59064M39323
16581E443544m18444l49765L62329j55661o1063j68982J17122k80402K0253M710
16571D513641j97444J35637J37425l63165l5806j70304K17629k81843J57862k79671
16561C833961K01524m33849L27479m70434K74033J57875J4351j81940k92932L15324
16551C745392o08680l1634J42036J57411k52860O3643M36387m68543j87r2736
16541C090229N7718k67474J59040j79468M63252m29700j5005j7598K1995m8267
16531B834722J38281m76898L45772j53184O4874r6154o2472K42404k36326K44028
$$ y = [6939167, 6879671, 6439548, 6307642, 6220821, 6252956, 6498347, 6076453, 5515755, 5821147, 5641581, 5685560, 5662942, 5699702, 5178133, 5074680, 5427324, 5130649, 5163285, 5004221, 5443544, 5025100, 4675335, 5037664, 4882003, 4820940, 4651958, 4769080, 4488678, 4508931, 4513641, 4316197, 4451834, 4589259, 4226094, 4190288, 4019984, 4237613, 3955770, 4113632, 3833961, 4035485, 3601636, 3929115, 3458681, 3732714, 3890589, 3904940, 3723000, 3430068, 3745392, 3136712, 3105078, 3247114, 3404525, 3151665, 3215308, 3651695, 3183152, 3182965, 3090229, 3147947, 2880473, 3039513, 2860045, 3323297, 2893597, 2878592, 2860994, 2882989, 2834722, 2973003, 2496105, 2841877, 2688693, 2753567, 2657413, 2594941, 2837345, 2601019, 2845047]
16521B845047m69046J31183j7943J08751L2914k8554j78093j7641j28091O2837
16511B341364P9763k91248M8375J43908q4983j2696j47560j15084J93508O3176
16501B218523j33332j80227K2765j48903K17939J40339k28788l2550K43659j17629
16491B001796m01912L23350k88091K68811Q436J03182o6399j56481j4771J02235
16481A880156P6913j58398m5507k57538O25138l33188K33001n57907K98838J70221
16471A931729n93292J71951k84484M09117j11860J71849J8422k5481l26858J87955
16461A549048N5559m123J79242m51572M25474k20364k75845Q078K17012j65222
16451A317287l09447N82220o3281k74097m2653L88654j02225q530R4565n91160
$$ y = [2845047, 2376001, 2507184, 2489241, 2597992, 2630906, 2602352, 2424259, 2406618, 2278527, 2341364, 2421127, 2129879, 2178254, 2322162, 2237179, 2224483, 2076923, 1961839, 2155347, 2218523, 2085191, 1904964, 1927729, 1778826, 1996765, 2137104, 1908316, 1875766, 2119425, 2001796, 1599884, 1923234, 1635143, 1903954, 1912390, 2015572, 1949173, 1792692, 1777921, 1880156, 1957069, 1798671, 1753164, 1495626, 2120764, 1787576, 2020577, 1462670, 1761508, 1931729, 1338437, 1510388, 1225904, 1635021, 1523161, 1695010, 1713432, 1687951, 1361093, 1549048, 1604607, 1600484, 1779726, 1328154, 1753628, 1533264, 1257419, 1265497, 1482509, 1317287, 1007840, 1590060, 1526779, 1252682, 1210029, 1598683, 1496458, 1487928, 1582493, 991333]
16441I91333K38016L11720l83180J06508n1849k1514J79954o9927m01615N17681
16431A417127l42284n8746K66168j41226N54447m82312K78266m34041N9741j34798
16421I82342L54225j44252J64591j21568L2601j53437j6419p4278J92090J3434
16411A229329j6774N5861l05767q9696J55179M65554p26903L27668n2285O4767
16401A106933j82963j02736R9972L96472j99312k30034P3598j47025n5432j4151
16391G45322J15842O1695k80886L34284j0749j15080L14042n5239l97272P2983
16381G84942K88444j06218L01609l24077J62625j10255j46828l4072K72723k48470
16371H40423k13262L02563j40549j7617j27459L29579p3211J05662l70712M53091
$$ y = [991333, 1229349, 1541069, 1157889, 1264397, 1212548, 1191034, 1370988, 1301061, 899446, 1417127, 1074843, 1016097, 1282265, 1141039, 1695486, 1213174, 1491440, 1057399, 1117140, 982342, 1336567, 1192315, 1356906, 1235338, 1267939, 1114502, 1098083, 1023805, 1215895, 1229329, 1212555, 1268416, 962649, 872953, 1028132, 1493686, 766783, 1094451, 1042166, 1106933, 923970, 821234, 921206, 1317678, 1118366, 888332, 961930, 814905, 759473, 745322, 861164, 922859, 641973, 976257, 965508, 850428, 1164470, 1109231, 711959, 784942, 1073386, 967168, 1268777, 944700, 1107325, 997070, 850242, 816170, 1088893, 840423, 627161, 929724, 789175, 771558, 644099, 973678, 900467, 1006129, 635417, 1088508]
16361A088508l84095j1816K02482K429l65330J93170r0277M373K60284p2762k64150
16350E62816L53817j27930j34429o5059J50476o9774J64717j14077j81072J71339
16340G10824o8990M9659P1406k61278K55387j62037r7274M9354P1693L5412J17377
16329G71533r3806K76844D47027K19435k55625J13997O2585p8323l5884k32627
16319B40585N94882j81023B95542L52982k14389K71659k3841j51129J45388P2625
16309G48837J53295l73337K97850k41111J84852p2622j06195r1679l5952r8544
16299C65394K52224M6841k06970K58622k82896M4319J41204j39019N6517j56033
16289C80203K34769j38606L96946C21094R0402J38557P8923C04909N4379K97896
$$ y = [1088508, 704413, 692597, 895079, 897508, 532178, 725348, 635071, 639444, 899728, 826966, 562816, 916633, 788703, 654274, 589215, 739691, 669917, 834634, 720557, 539485, 710824, 641834, 691493, 762899, 501621, 757008, 594971, 497697, 547051, 618744, 654156, 771533, 677727, 954571, 447027, 666462, 410837, 524834, 587419, 509096, 473212, 240585, 835467, 654444, 295542, 648524, 434135, 705794, 681953, 530824, 676212, 748837, 902132, 528795, 826645, 585534, 770386, 697764, 591569, 499890, 463938, 365394, 617618, 664459, 457489, 716111, 433215, 477534, 618738, 479719, 536236, 380203, 614972, 476366, 873312, 321094, 411496, 550053, 628976, 304909, 359288, 657184]
16279F57184l26433K17972j13306L23426C65891p9746J2988j7894n8183M04497
16269F27553j78050j75732J86017L8222j34328J87593M6315j11876l7017B17843
16258B86477J82332j13033A7682N41859B73805P2782M4665j04667J16706J94099
16248E97390B81886j32965Q2810K6412K14458A22317N32860j45693J51870j11372
16238E49982m7292k2723j54428L3031r5153R0633J01205j65108A44498K15552
16228C60050N1135G8671M61272A66409L08607B02928H7714J51212L3161m7360
16218B24727o859M6707q3046J65714J6016R3776N6695A28309M13584k08946j24052
16207B08895K27260A52111N6640K70002B12912I2126L77786j59914N7706K970
$$ y = [657184, 330751, 548723, 435417, 758843, 365891, 286145, 299133, 281239, 223056, 627553, 449503, 273771, 459788, 498010, 363682, 551275, 597590, 485714, 448697, 217843, 286477, 468809, 355776, 17682, 559541, 273805, 346587, 391252, 286585, 403291, 597390, 281886, 148921, 231731, 258143, 472601, 122317, 655177, 509484, 661354, 549982, 502690, 479967, 325539, 358570, 263417, 354050, 455255, 290147, 144498, 360050, 411185, 78671, 539943, 166409, 475016, 202928, 87714, 238926, 272087, 224727, 217868, 264575, 181529, 347243, 363259, 457035, 513730, 128309, 541893, 332947, 208895, 436155, 152111, 208751, 478753, 212912, 92126, 469912, 309998, 367704, 370674]
16197C70674j08413N5942F8408N54733A22958J35497H5863M81K37709E1452M9032
16186A00484J1068O2374M9040m1875L44513B39680J23141J55086A45847J85743
16176C31590i812A13044K09749A08916J46136N9286l8666l0428b19654A02986
16165a9450E18323A09632J73332N6991P1284j12330K64060A49422p291J10324
16155B52455J09050E4421e527C03685M3843A26859n3240L07309A6172L50707g4895
16143f5901k33200B57164L5723j08016f7996B6536K33951A05334B5889J28693
16133A54582F4065J3603b00170A31502N38235B69900p8363D953K39832C8129J23052
16122A61181J69464j13703J33280P6559j53361b57432B50430J92089b08941A61737
$$ y = [370674, 262261, 318203, 68408, 623141, 122958, 258455, 85863, 86344, 324053, 51452, 100484, 111552, 173926, 222966, 181091, 525604, 239680, 362821, 517907, 145847, 331590, -9812, 113044, 322793, 108916, 255052, 314338, 275672, 245244, -219654, 102986, -19450, 518323, 109632, 282964, 339955, 411239, 298909, 562969, 149422, 142131, 252455, 361505, 54421, -5527, 303685, 347528, 126859, 73619, 380928, 16172, 366879, -74895, -65901, -299101, 257164, 292887, 184871, -67996, 26536, 260487, 105334, 25889, 154582, 64065, 77668, -200170, 131502, 669737, 269900, 191537, 4953, 244785, 38129, 161181, 330645, 216942, 350222, 426781, 273420, -257432, 250430, 442519, -208941, 161737]
16111D80185b04030I7532J977K55214q2447F9695C2783J31579n8300N7745K14162
16100C77969M2946r0476F147J25403K70170r8109a35461A78222K08543j73934
16090B12831l4201r313o7782I546K61888q3502d6716C29938n3866j03250L7061
16079B09883J16874J09276B14985B6564J56074K4324I727L27955f4446A54336
16068A81384o7869L56987A07360L49109a25563E7999K18848e4563A10190J00304
16058B10494G3478K52871j43758K5771j7724C4148e4231B0136Q5562J48557i9677
16046A06636P1468J00525e5233A74068M904l184J39730d6212E19804c22508O3896
16035b58612C67168o1213J80136b8577J2850j06012i92A82111H2254K20915A30336
$$ y = [480185, -204030, 97532, 99509, 354723, 272276, 69695, 32783, 164362, 106062, 163807, 377969, 420915, 330439, 6147, 131550, 401720, 303611, -135461, 178222, 386765, 212831, 178630, 169317, 101535, 9546, 271434, 187932, -46716, 329938, 276072, 172822, 209883, 326757, 436033, 214985, 26564, 182638, 206962, 9727, 337682, -64446, 154336, 181384, 113515, 470502, 107360, 456469, -125563, 57999, 276847, -54563, 110190, 210494, 73478, 326349, 182591, 208362, 190638, 34148, -54231, 20136, 105698, 254255, -99677, 106636, 178104, 278629, -55233, 174068, 178972, 175788, 315518, -46212, 519804, -322508, -258612, 367168, 305955, 486091, -28577, -15727, -121739, -992, 182111, 82254, 303169, 130336]
16023h4455I2396J98834A43792N0019Q3843R7587B3316O7345A2588L7061L36896
16012C86545h6511A09907b2963A39302P7788a26471C11239b77879f5494A87005
16001c4886D6041J08344a02867B15319a7943C07515L2835j34507m3340p2318o943
15990H3242K49448j9743n307p1048K63008K65158K92339j63701r1638C76842p2862
15979C03980P8587A083a54823A22216J4606N374j957K8653E8945a23784C87988
15967A99803H9917a4316C73899G3403c6496o4674L8395B5029a2640j43031B7364
15955B04705a4015A32949i7637I5307M19764A76818o415B0658J10631K38745I5102
15943b66385B12907f7447o2068j06530B4168a42381A3899K49004c89173d23B1055
$$ y = [-84455, 92396, 291230, 143792, 193811, 277654, 375241, 23316, 90661, 12588, 49649, 386545, -86511, 109907, -22963, 139302, 217090, -126471, 311239, -277879, -65494, 187005, -34886, 46041, 154385, -102867, 215319, -17943, 307515, 340350, 205843, 162503, 90185, 83242, 332690, 312947, 307640, 236592, 499600, 764758, 1057097, 893396, 801758, 376842, 303980, 382567, 1083, -154823, 122216, 136822, 142196, 140239, 168892, 58945, -123784, 387988, 199803, 89917, -14316, 373899, 73403, -36496, -101170, -62775, 25029, -12640, -155671, 27364, 204705, -14015, 132949, -97637, 95307, 515071, 176818, 170403, 20658, 131289, 370034, 95102, -266385, 212907, -67447, -129515, -236045, 24168, -142381, 13899, 262903, -389173, -423, 21055]
15931B99044F3018a58970D0073j2339O4909N0291a07725A39184a61264I7838J59797
15920B57635f086j18530A69727B4668b21413C99371j90818a46991A02183J19452
15910B21635b21150G8665d6675j10467L6744b1102o7244J2113B7951A3838i6624
15898H732g8197b7694F6733a65801j26833K858A77924a62587A17726C2793b50581
15886a00379C52210i3827A8881a42928C3266K21011r5843b3562A18894q887L9968
15875A49975c37293N7475a12345k30609A06988A461a32893L4163C8242j87a81086
15863a65350A46082a16917j2087D4347c13782b2393A32359N3541J35503J48613
15853D70016A5654a5945j14640B14546a12585B93675R4405B5502L16306I1266
$$ y = [299044, 63018, -158970, 40073, 27734, 92643, 142934, -107725, 139184, -161264, 97838, 257635, -6086, -124616, 169727, 24668, -221413, 399371, 208553, -146991, 102183, 221635, -221150, 78665, -46675, -157142, -120398, -21102, -88346, -76233, 27951, 13838, -96624, 8732, -78197, -27694, 66733, -165801, -292634, -289776, 177924, -162587, 117726, 32793, -250581, -100379, 352210, -93827, 18881, -142928, 33266, 254277, 158434, -23562, 118894, 110007, 149975, -337293, -279818, -112345, -342954, 106988, 1461, -132893, -98730, 38242, 38055, -181086, -165350, 146082, -116917, -129004, 44347, -313782, -22393, 132359, 185900, 321403, 470016, 15654, -15945, -130585, 214546, -112585, 293675, 388080, 25502, 341808, 91266]
15842a53098A26526O9608A2302a11339C94292e878j53437B76005a59749B724a25521
15830c4138k7929k03427D6033O496d3627m52779b1324G8586h4651J6515k144i617
15817A9518a62878c5445E8653j534b5442B0585b49622J06153k4837A54738a59397
15805B5206c0493A32538A2032c17566b6359A57923J60231o6035g6971j35499J943
15794b10527i2878D0447J45707b25321a0635C0632a70559h209C9922b17397Q6742
15783a30655l8448b3538m2108I9141b2270k40612e0482J87K3588A92023N6123
15772B48146j00085P8386c8991r1212D764c8734J1193E6086c02628c0234C1226
15760A37826n2905C9088P5629b10816A28986K9305a04753F8725R5050a7923C29033
$$ y = [-153098, 126526, 196134, 12302, -111339, 394292, -5878, -159315, 276005, -159749, 2724, -125521, -34138, -62067, -265494, 46033, 52529, -43627, -496406, -21324, 78586, -84651, -68136, -70280, -9617, 19518, -162878, -35445, 58653, 57119, -25442, 20585, -249622, -143469, -168306, 154738, -159397, 25206, -30493, 132538, 12032, -317566, -26359, 157923, 318154, 252119, -76971, -212470, -210527, -92878, 40447, 186154, -225321, -10635, 30632, -170559, -8209, 39922, -217397, -130655, -169103, -23538, -65646, 99141, -22270, -262882, -50482, -50295, -26707, 192023, 248146, 148061, 226447, -38991, -130203, 4764, -38734, -27541, 56086, -302628, -30234, 31226, 137826, 84921, 39088, 114717, -210816, 128986, 158291, -104753, 68725, 163775, -17923, 329033]
15748D9233e8601J8861k2226B18153L8252j02168o4488b12775r0108A47808a42744
15736a53550A65605a58496A34579C9128J81719c5116A45005A5501a25765d2356
15725B45657I4269O4671j3342a38768j92588f6288C14244G3423a33149j17431
15715b50580l8929j0912a26292B28659e6593k4295c4184J6232B49765J06117b47802
15703B59682E5605b9347A24123C2222b23240A41985f6833j50513g0376A45164
15692b02063O3147A30845n0217l6889K28270G087P3568a09926I7153K24968G2364
15680a81716A27615a36859j49761b3527j31574f8590G6614f7982A60910g7592
15669B96817b02549C53277a09566c9137j02654L1280D49669C5578a73180E3338
$$ y = [49233, -58601, -39740, -61966, 218153, 256405, 154237, 89749, -212775, -302883, 147808, -142744, -153550, 165605, -158496, 134579, 39128, 220847, -35116, 145005, 15501, -125765, -42356, 245657, 94269, 158940, 145598, -138768, -331356, -66288, 314244, 73423, -133149, -250580, -289509, -300421, -126292, 228659, -56593, -80888, -34184, -17952, 249765, 355882, -247802, 259682, 55605, -29347, 124123, 32222, -223240, 141985, -66833, -217346, -70376, 145164, -202063, -138916, 130845, 80628, 43739, 272009, 7087, 80655, -109926, 97153, 322121, 72364, -181716, 127615, -136859, -286620, -23527, -155101, -68590, 76614, -67982, 160910, -77592, 296817, -202549, 353277, -109566, -39137, -141791, -110511, 449669, 35578, -173180, 53338]
15658g9741o8732E4401b0978A37648k4307c70576g7903A03814L3625h851j6655
15647b5506F2038h5957b2625q0213A9174J96905A00869a66680g3485l1755j15899
15636b21139B1981J7901J10205L515a35422A8551q196O5366b2415o1796k66744
15625c50955B1344J33920h1105q7539l918G1342a02523D080e206q2906k5064A8697
15612h6230C91271E9172Q7179f9155p9791M7310B1365a42350O5386D44974a92439
15600a23473e5100j28000C7852i1037F7266K0983e9284o8354A53560b43079I5343
15588a951j54503p781A05481a10680A94748k4806b31268A8471a0486k42322H6243
15576A09585b04057B89835a81454f1248B2474L5593d0795A99698a14775j99140
$$ y = [-79741, -148473, 54401, -20978, 137648, 113341, -370576, -77903, 103814, 137439, -8851, -25506, 62038, -85957, -22625, -102838, 19174, 216079, 100869, -166680, -73485, -105240, -221139, 21981, 39882, 150087, 153602, -135422, 18551, 10355, 75721, -22415, -84211, -350955, 21344, 155264, -81105, -168644, -172562, 71342, -102523, 4080, -5206, -88112, -113176, 18697, -86230, 391271, 59172, 146351, -69155, -148946, -101636, 21365, -142350, -76964, 444974, -192439, -123473, -55100, -183100, 37852, -91037, 67266, 88249, -59284, -127638, 153560, -243079, 95343, -1951, -156454, -164235, 105481, -110680, 194748, 169942, -231268, 18471, -10486, -252808, 86243, 109585, -204057, 289835, -181454, -61248, 22474, 58067, -40795, 199698, -114775, -313915]
15566c13915a7235B238e6723P372I0226N9421a90702C26088b7392j43759r17c9774
15553F0241K47853b25745e7818j2148a4968O606j12017A00953k678j3588J93936
15542B78623A37452q214a50021G3406J87459A06190J5225e69856i3882I3825c47433
15530A79279m6073K7840m6380n4927g4300B45618B3020L9707b9272j45753I2438
15518H8476a74523B04866r9562A467L02348R9828b866A56714Q3967g0359E7883
15506g3729C36483j13210a4718A73408k6403l8850c4827C27060A07803K02082
15496C09885G9181A833K46898B1163d4490D09465A00338a51299k9289c0377B87072
15484A00255K1685L13256a43539H5853b10600B2381J07666K91418p6810L54181
$$ y = [-313915, -17235, 2238, -56723, -49351, 90226, 149647, -190702, 326088, -27392, -171151, -172068, -39774, 60241, 308094, -225745, -57818, -69966, -14968, -8362, -120379, 100953, 98275, 84687, 278623, 137452, 129238, -150021, 73406, 260865, 106190, 121415, -569856, -93882, 93825, -347433, 179279, 133206, 161046, 114666, 59739, -74300, 245618, 23020, 62727, -29272, -175025, 92438, 88476, -174523, 204866, 105304, 1467, 303815, 403643, -2866, 156714, 240681, -70359, 57883, -73729, 336483, 223273, -14718, 173408, 147005, 108155, -34827, 327060, 107803, 309885, 79181, 1833, 248731, 21163, -44490, 409465, 100338, -151299, -180588, -30377, 287072, 100255, 121940, 435196, -143539, 85853, -210600, 22381, 130047, 421465, 344655, 698836]
15474F98836p2765k18269K32280C192L92382b9923F1410d6894j04750B18652a82251
15462b3629A60953G4130K38930B54h017A68900E3932a55104k7447M4038A31506
15450C91334j6216I0964Q1138h5518E50314B13638n7149M90336K63702M01614
15440A312141n70024k68597h5149C63710C9015J34970d530l30381F00a19326A51419
15428a80752L9569a1432A17884h7514B22898O051o4060a78346h9123A39452c22763
15416B06592e0148E3114c27953J15430j25465a37678a7744k43288I9775M0214
15406A39989O8687b28214C04987H6596a8338B87714r9028a76149H5570A9248a99407
15394a25150c8515A68313b6513A74267C4839b2000B20577I6568a20957N4669a8912
$$ y = [698836, 626071, 407802, 640082, 3192, 395574, -29923, 61410, -46894, -151644, 218652, -182251, -23629, 160953, 74130, 313060, 254, -8017, 168900, 53932, -155104, -182551, -138513, 131506, 391334, 375118, 90964, 172102, -85518, 550314, 213638, 156489, 646825, 910527, 1312141, 742117, 473520, -85149, 363710, 39015, 173985, -4530, -334911, 600, -119326, 151419, -180752, -141183, -11432, 117884, -87514, 222898, 228949, 164889, -178346, -89123, 139452, -322763, 206592, -50148, 53114, -327953, -212523, -337988, -137678, -17744, -261032, 99775, 139989, 208676, -228214, 304987, 86596, -18338, 287714, 188686, -176149, 85570, 19248, -199407, -125150, -38515, 168313, -26513, 174267, 34839, -22000, 220577, 96568, -120957, -66288, -18912]
15382b01538A88872b15905g6104D78403A96536o6733P430J19829j22315K14J44151
15371B79112L2232p9670a26978B17496b2888C42814q8328J31323e7856A67298
15360C20244b797D72017G5999K69806a29972C18836j56396R7040D8896J23521
15350A72417n7355J57689K79853B1994c2336B17736G2804J36097M6266J35779
15340C90946p2009Q1044n4661A67291L4518r0864f5307A88581a36160B8900J97815
15329B26715h9543A05013a06163B70917a6800A63478J40829r6360j7598R1872
15319B82221J13600j08968j01115D3345o654c3950A40758M854G0353K29403P227
15308C06983O6248G942M2791a09381I0350L5860J53025F3390e1608i653B68665
$$ y = [-201538, 188872, -215905, -76104, 478403, 196536, 129803, 137233, 257062, 134747, 134961, 279112, 311344, 231674, -126978, 217496, -22888, 342814, 254486, 385809, -57856, 167298, 320244, -2797, 472017, 75999, 345805, -129972, 318836, 162440, 259480, 48896, 172417, 115062, 272751, 552604, 21994, -32336, 217736, 72804, 208901, 255167, 390946, 318937, 399981, 345320, 167291, 201809, 110945, -65307, 188581, -136160, 28900, 226715, -89543, 105013, -106163, 270917, -16800, 163478, 304307, 207947, 190349, 282221, 395821, 286853, 185738, 43345, 36691, -33950, 140758, 145612, 70353, 299756, 306983, 373231, 7942, 50733, -109381, 90350, 126210, 279235, 63390, -51608, -9653, 268665]
15296b11495D14740c33008J59073B4105R5893e4190A20648O8567k9485n9694N613
15285A05649j9668K4080Q0184a62178g9958A60309b52438B60160A00154A9428
15274A82364c0829A99196I4941d41p4628H6145P4894K5473o6612d8222m3593l18577
15262d10392A57626J95444j39210H6125P0089A3178K00180B5748g0266k66734
15252c37000A6870K70183r875A36675n6292a47A40077J18338c3262E67414P88634
15241A356048M03846o73985M73563p65875A50545N6110P3098h0265L0516p5360
15231a25109A49275J862a13853e4824A9233a61714A45341b0759D59455B01560
15220C04139a4661A6176J57262o1695b7147n618A39062a22725j20368B01690B4971
$$ y = [-211495, 414740, -333008, -173935, 24105, 119998, -54190, 120648, 189215, 159730, 100036, 105649, 85981, 110061, 190245, -162178, -79958, 160309, -252438, 260160, 100154, 19428, 182364, -30829, 199196, 94941, -441, -75069, 86145, 161039, 186512, 119900, -48222, -91815, -410392, 157626, 353070, 213860, 86125, 156214, 13178, 213358, 25748, -70266, -337000, 16870, 287053, 277178, 136675, 80383, -147, 140077, 258415, -33262, 567414, 1356048, 1759894, 1085909, 1559472, 793597, 150545, 206655, 279753, -80265, -49749, -125109, 149275, 151137, -113853, -54824, 19233, -161714, 145341, -20759, 459455, 201560, 304139, -14661, 16176, 173438, 111743, -27147, -32765, 139062, -122725, -243093, 201690, 24971]
15208H078K22671J32907i8292k30305P8934C8564a39171A78571C2011J408J21063
15197A54482l0442b43595L2419A99116r3834K13248E2949a9858C575J61460m6127
15186A18908n4187J53662a871A21824E8407J12490M9661g4866q0864P1979C67640
15174i7658E5867O8346K45215A42401a0454A40250B5560J17715R7641H0743a20268
15162B71678o1686a35331N4124B6037J16276J43527o4230E9869M6472a26258e5509
15150B51897I942J23168L369b28943A65241J68504C5861M3123l5887b7773m701
15139c2474B16247E8381L6640P5786J7231J06535a02087B98114G8983J53614A4269
15127E0023K95590i9760G7445d1905I988a38296A08203g6745C78478j63567L63145
$$ y = [8078, 230749, 363656, -98292, -328597, -249663, 38564, -139171, 178571, 32011, 33419, 154482, 124040, -243595, -211176, 199116, 105282, 318530, 52949, -19858, 3575, 165035, 118908, 64721, 218383, -1871, 121824, 58407, 170897, 220558, -74866, -155730, -83751, 367640, -97658, 55867, 124213, 369428, 142401, -10454, 140250, 25560, 143275, 240916, 80743, -120268, 271678, 209992, -135331, -81207, 26037, 142313, 285840, 221610, 59869, 106341, -126258, -55509, 251897, 9942, 133110, 136479, -228943, 165241, 333745, 35861, 78984, 43097, -27773, -32474, 216247, 58381, 95021, 170807, 188038, 294573, -102087, 298114, 78983, 232597, 14269, 50023, 345613, -99760, 77445, -41905, 9988, -138296, 108203, -76745, 378478, 214911, 578056]
15116E78056B81222n618I1004J37500a19278C01045D2887j3884K36667R2537d5774
15104a02681A35055Q7005l5327k2829m011J8230k5545C2125P464d0310a4284C0996
15091A35593L43744b23058B25100P5745a60279C14411a22117b8921E1926J48590
15081B00516k0507O9527N8312J40328A12061j6027K92916m0185M4752c7094B828
15069C8980e3099C80993A04744c0772A21577a10641D57108j94998m6774L6133
15059B51469M07637b3493C30212A45433J12492J34769a37689C34193j45689C9
15048G8621J49170l9280L46720A57245A9840K2085J99631N3644J9181J94534j19126
15037C89789P9507B09291J44942P3356o4199J15900P3434O2885j70565M50617
$$ y = [578056, 281222, 275604, 91004, 228504, -119278, 301045, 42887, 29003, 265670, 358207, -45774, -102681, 135055, 222060, 186733, 163904, 159893, 178123, 152578, 32125, 39589, -40310, -14284, 30996, 135593, 479337, -223058, 225100, 300845, -160279, 314411, -122117, -28921, 51926, 200516, 180009, 249536, 307848, 448176, 112061, 96034, 388950, 348765, 393517, -37094, 2828, 38980, -53099, 380993, 104744, -30772, 121577, -110641, 457108, 262110, 215336, 251469, 659106, -23493, 330212, 145433, 257925, 392694, -137689, 334193, 188504, 39, 78621, 227791, 188511, 535231, 157245, 19840, 41925, 241556, 295200, 314381, 508915, 389789, 469296, 209291, 354233, 427589, 363390, 479290, 552724, 615609, 445044, 895661]
15027H95661j53442k79806j41499J00018n7921J45918m1760j94655M34129l25695
15017C80948L84683I4785K98877R0079j16721M6501F7452K66523J54702R4036
15007E82713j73361j85148r2485O1934J58023M3251a98725D06068j87502O7814
14997B86380K79918A95175J84365L6910Q8254B12693J52145I2195N14912B91576
14986E47878q0656e1934G18199j65732j93219L92763j73844M5214K6779o2527
14976E87633B71537J03712o2777K22846p4480J83871j8570O9582j10117k41795
14966C43809O1290K24665k87920j9734j26753K88573J27606B22691F0204J31043
14956A91247K82842k28687k7195K6526K17359E2316J74210o4407L75566B06907
$$ y = [895661, 742219, 462413, 320914, 420932, 363011, 508929, 467169, 272514, 706643, 380948, 765631, 94785, 393662, 483741, 367020, 413521, 67452, 333975, 488677, 582713, 409352, 224204, 131719, 193653, 351676, 394927, -198725, 406068, 218566, 286380, 566298, 195175, 379540, 416450, 504704, 212693, 364838, 92195, 607107, 291576, 547878, 467222, -51934, 718199, 552467, 359248, 752011, 578167, 623381, 650160, 587633, 271537, 375249, 312472, 535318, 460838, 644709, 626139, 695721, 585604, 343809, 405099, 629764, 341844, 322110, 195357, 483930, 611536, 222691, 60204, 191247, 474089, 245402, 218207, 244733, 462092, 52316, 226526, 162119, 537685, 206907]
14945F62695l0859j4541J42181k44908J26903B19399J35665A21485K47273J86009
14935E54767o9129J08288j2902O7823J94004j57141J74474J09151O62964k49405
14925A382894M0531J70651j84779m55397R2853N37520k6216M68221p1701M0308
14915A994885p05828J26026j1777r4059E76009A69517K73204N9470j11602K0963
14905D11552M3096j09699K41190J22013C23254K29674Q0919j53688o3219J5136
14895D32076D3981N18019j65276A52164J82697J76999k27027O6062L80819p4160
14885F57554K53598M6688m05834o4979M54556m68799K23766P9500q0063k61567
14875D34420J9736j03520J12800j42381J37304p8833K15733l5197p098o8657M25408
$$ y = [662695, 631836, 617295, 759476, 514568, 641471, 219399, 355064, 121485, 368758, 554767, 485638, 593926, 581024, 648847, 842851, 685710, 860184, 969335, 1632299, 1382894, 1423425, 1594076, 1409297, 953900, 1046753, 1584273, 1558057, 2026278, 1954577, 1994885, 1289057, 1415083, 1403306, 1309247, 576009, 169517, 442721, 502191, 390589, 411552, 454648, 344949, 586139, 708152, 323254, 552928, 633847, 480159, 416940, 432076, 43981, 562000, 396724, 152164, 334861, 511860, 284833, 350895, 731714, 657554, 911152, 957840, 552006, 487027, 941583, 472784, 696550, 776050, 695987, 434420, 454156, 350636, 463436, 321055, 458359, 379526, 595259, 560062, 552964, 484307, 909715]
14864I09715l43783k10192K89691k45164L40677H6604J05442M58365k78147R9802
14854D72066k17106K12018m4199R0527L8821M8632Q5860n4321j21545L89327Q9942
14843I90022l61519O22796j85752M1400k44584J99079l27427J41358j55488j35182
14833E84703j16476A93531K82798q2184J84412J16046r5255k6433k6354j98942
14823C47619J66760q9326J12075J19834J63928j64980Q401n9043B52585J08236
14813C60821M48282k99711K68999j3515k42880M47997l76352J7964L35247J1125
14803I57977j80737j18011J80822C85424K67585j60288J49273m4735O4183o3655
14793E97787n0488j80185L82080k8178O8614k51085p2622L21211j84384p6106
$$ y = [909715, 565932, 355740, 645431, 400267, 740944, 86604, 192046, 650411, 372264, 472066, 254960, 466978, 422779, 513306, 552127, 600759, 686619, 632298, 510753, 900080, 990022, 628503, 1251299, 1065547, 1106947, 862363, 1061442, 734015, 875373, 719885, 584703, 468227, 193531, 476329, 394145, 578557, 694603, 599348, 572915, 546561, 347619, 514379, 425053, 537128, 656962, 820890, 655910, 664311, 605268, 252585, 360821, 809103, 509392, 778391, 764876, 521996, 969993, 593641, 611605, 946852, 957977, 777240, 659229, 840051, 385424, 653009, 492721, 641994, 597259, 661442, 597787, 547299, 367114, 749194, 721016, 789630, 538545, 465923, 787134, 602750, 526644]
14783E26644P6142R9908k66809K054L7258J55957R4692L61271l36743J68137j79130
14772G39381K2415P0517j81041l00248N6394J77240j49900J30764L1555r6083
14762E00994J93547B82815K08006j34694K61664m4026Q2708J09070K6613k33535
14752E58621P9570k1329j10439K7707K31832k08111J34898Q7084l47091L27254
14742G59996L2489k70055K92375p0286j09479R3739o5051R0043L9637j02028L14105
14731A005485J36269k24457P2169J57943L40001J73156J79769n65366l47468M23685
14721A351186k18375j82390k57080k38357M36223k00682K96588o2935n8920K90230
14711A155488m75564m2913M0597J42962N43370k90760K453j26002M10287J87670
$$ y = [526644, 602786, 702694, 435885, 437939, 475197, 631154, 725846, 1087117, 750374, 918511, 739381, 761796, 832313, 651272, 351024, 407418, 584658, 434758, 565522, 597077, 500994, 694541, 282815, 490821, 356127, 617791, 573765, 656473, 765543, 792156, 558621, 638191, 616862, 506423, 534130, 765962, 557851, 692749, 779833, 432742, 759996, 792485, 522430, 814805, 744519, 635040, 728779, 663728, 753771, 793408, 691380, 1005485, 1141754, 917297, 989466, 1147409, 1487410, 1660566, 1840335, 1274969, 927501, 1351186, 1132811, 950421, 693341, 454984, 891207, 690525, 987113, 924178, 865258, 1155488, 679924, 637011, 677608, 820570, 1363940, 1073180, 1075633, 949631, 1359918, 1547588]
14701A547588j8114K87530j75821m94132K72620l00474L4390k54058q8635k7104
14691G83790K54739k66609l39254O70661o5487J1713R676k68828m7906K25661
14681I68156R3128k97279R3106K22447m45410J02897J03207L56485m39253k3942
14671G33542j14612J81675R949J5498R3761j91247K38473o9340O0136j66593K93986
14660A085228j65644q1283J12560J00192N9009p455o3936L58313k44520j0098
14650A142366l80386N02897Q695j38658j26767r9959J96413N4062j70044J33699
14640A122318P8354p8836J23175j59077P7430j42532j08130N61007l27672k08276
14630I37761L37235J92835l32792O7927n937J19605n5810q2480J39249n95978
$$ y = [1547588, 1529474, 1817004, 1641183, 1147051, 1419671, 1119197, 1153587, 899529, 810894, 783790, 1038529, 771920, 432666, 1103327, 1037840, 1049553, 1059229, 790401, 742495, 968156, 1061284, 764005, 857111, 1079558, 634148, 737045, 840252, 1196737, 757484, 733542, 618930, 800605, 810554, 826052, 919813, 728566, 967039, 897699, 957835, 791242, 1085228, 919584, 838301, 950861, 1051053, 1110062, 1102607, 1038671, 1396984, 1152464, 1142366, 761980, 1264877, 1273572, 1134914, 1008147, 908188, 1104601, 1158663, 988619, 1122318, 1200672, 1121836, 1245011, 1085934, 1163364, 1020832, 912702, 1473709, 1146037, 937761, 1274996, 1467831, 1135039, 1202966, 1197029, 1316634, 1260824, 1178344, 1317593, 721615]
14620G21615O21043j19464R2629O9352J0743k94996L77465L8896o28169M70044
14610A359158j32919L36400j20623K32479j22849r4679L0159K54596k81691J23678
14600A583709k25465L09183n00770N08358j74574J49323l51455L08297l24897
14591A281709L51927j80145k0619K93776j39907j97332M71207k28894P7749l40802
14581A368669O12270m26158j0548L33167Q9406k94191L5688j2009K11140J27306
14571B034740p9130p7076J03157k60890R7054K57234J02906J2936p6044k568N3580
14560B165899R1293K8619K12263r4504K689O21116J32473K02178K91435M50117
14550D103578P94891J766278M474447R501404K0120301J752554A6423102G030324
$$ y = [721615, 1342658, 1223194, 1315823, 1385175, 1395918, 1100922, 1478387, 1517283, 889114, 1359158, 1226239, 1562639, 1442016, 1674495, 1551646, 1456967, 1487126, 1741722, 1460031, 1583709, 1358244, 1667427, 1166657, 1675015, 1500441, 1649764, 1298309, 1606606, 1281709, 1633636, 1453491, 1432872, 1726648, 1586741, 1389409, 1860616, 1631722, 1709471, 1368669, 1980939, 1554781, 1544233, 1877400, 1966806, 1672615, 1708303, 1696294, 1907434, 2034740, 1955610, 1878534, 1981691, 1720801, 1817855, 2075089, 2177995, 2190931, 2114887, 2112319, 2165899, 2257192, 2285811, 2498074, 2403570, 2406259, 3027375, 3159848, 3362026, 3653461, 4103578, 4898469, 6664747, 11139194, 20640598, 40760899, 42513453, 16423102, 7030324]
14541C327437o48148q4099N76817J138477l61327j417749q72312J02290M36964
14532B198350k91183J86408j75832K73060k83054O4289J72452q1058m21333L97494
14522B039593K88792l40955K87813J51074j40527K2914L94199l70225k1837L59477
14512B670318m664l66598M29628k532p6945p3847K4233j22337K26042p1152M28109
14501C060255l16244P2749L7812K40691K337l46998L17078J23791k95476J22691
14491C018686J55548l3048J2812O8389P6447m5856K1982j48142M15446J70124
14481C712388l42980M66607l13836L97296k04153j70644M55032k34000L23220
14472D088930l69626L00648J32858j26293R4508m8399j4664k60343j4785M44373
$$ y = [3327437, 2679289, 2595190, 3172007, 4310484, 3949157, 2531408, 1659096, 1761386, 2198350, 1907167, 2093575, 1917743, 2190803, 1907749, 1972038, 2144490, 2063432, 1642099, 2039593, 2328385, 1987430, 2275243, 2426317, 2285790, 2308704, 2702903, 2332678, 2310841, 2670318, 2665654, 2299056, 2728684, 2726152, 2649207, 2575360, 2599593, 2477256, 2703298, 2632146, 3060255, 2744011, 2816760, 2854572, 3095263, 3097600, 2750602, 3067680, 3191471, 2895995, 3018686, 3174234, 3141186, 3153998, 3222387, 3298834, 3252978, 3274960, 3126818, 3542264, 3712388, 3369408, 3836015, 3522179, 3919475, 3715322, 3544678, 3999710, 3765710, 4088930, 3719304, 4019952, 4152810, 4026517, 4121025, 4072626, 4057962, 3797619, 3782834, 4227207]
14462D227207K74929k85577J81927M6588L83749j64528k76018L64193l7015l22668
14452D392787K75728L07010k56251M69383j20893M58572J16105m00526R1110p094
14442E325931J98305l90279O11054j62975J74358J3983K73838k34696J00872L51782
14432F262173p8241J70152K22087m02472M51340K03345k48872K35082L4193N82569
14422G431356k46121L72841J50222m56795M71867K76422k70882M97831m6196j64040
14412H016505Q4223j06186O07274R8923K41033q4935K94004K11489J8755J74601
14402I555686L33488K41632n86359J33736K80384J54151L36525j47335K86962
14393A0588870M48046r7200L3841O91659K14848m35937P45061j31055L49200K98585
$$ y = [4227207, 4502136, 4216559, 4398486, 4445074, 4828823, 4664295, 4388277, 4752470, 4715455, 4392787, 4668515, 4975525, 4719274, 5188657, 5067764, 5526336, 5642441, 5241915, 5333025, 5325931, 5524236, 5133957, 5745011, 5582036, 5756394, 5770377, 6044215, 5809519, 5910391, 6262173, 6183932, 6354084, 6576171, 6173699, 6625039, 6828384, 6579512, 6814594, 6848787, 7431356, 7185235, 7558076, 7708298, 7251503, 7723370, 7999792, 7728910, 8226741, 8180545, 8016505, 8100728, 7994542, 8601816, 8700739, 8941772, 8856837, 9150841, 9362330, 9381085, 9555686, 9889174, 10130806, 9544447, 9678183, 9958567, 10112718, 10449243, 10301908, 10588870, 11036916, 10939716, 10973557, 11665216, 11880064, 11444127, 12189188, 12058133, 12407333, 12705918]
14383A2705918Q4965L28607M8071N79903J34696K65635L98080m8886K25642L51277
14373A5073908K90885L17360N28129K52283M04539K34757N12111K06912K71298
14364A8092182J3738O84979P925N39870P50134M80340M31447O40760J21189O08777
14354B2371341N73786J98244O10733O02792M85847J033425N65147O22394N23819
14345B7587528J116382O60847P28694N68379R62969P10856R75953J043269O77847
14336C5032724J192230Q95395J413832J259207P02936J621100J158108J261634
14328D4537166J800181Q98535J759456J772989J837300J653473J785124J883905
14320E7928129K156690K292652K156468K046860K348090K894892K784645L006421
$$ y = [12705918, 12790883, 13119490, 13167561, 13747464, 13882160, 14147795, 14545875, 14496989, 14722631, 15073908, 15364793, 15682153, 16210282, 16462565, 16867104, 17101861, 17613972, 17820884, 18092182, 18105920, 18790899, 18798824, 19338694, 20088828, 20569168, 21000615, 21641375, 21762564, 22371341, 22945127, 23143371, 23754104, 24356896, 24842743, 25876168, 26441315, 27063709, 27587528, 28703910, 29364757, 30093451, 30661830, 31624799, 32335655, 33311608, 34354877, 35032724, 36224954, 37120349, 38534181, 39793388, 40496324, 42117424, 43275532, 44537166, 46337347, 47235882, 48995338, 50768327, 52605627, 54259100, 56044224, 57928129, 60084819, 62377471, 64533939, 66580799, 68928889, 71823781, 74608426, 77614847]
14312G7614847L078929L242807L175673L722905L894631M257335M481297M269453
14304A07737877M640027N362707N613907N536900O337149O918015O778526P569219
14296A56494327P823409Q448783R133512R374113R869919J1151449J1073253J1782255
14288B35151020J2438615J2789189J3259549J4246202J4363533J4302515J4704516
14281C31255139J5148674J4567286J4598410J3983949J2964268J1667166J0544421
14274D24729313Q348960N111040J365782K8792p53156q55128l845409k206316
14266D31923878n470784q150303j0036585j2149399j3861266j4528295j4864532
14259C52862714j5144259j4959863j4890072j4630768j4210132j3665229j3590625
$$ y = [77614847, 80693776, 83936583, 87112256, 90835161, 94729792, 98987127, 103468424, 107737877, 112377904, 117740611, 123354518, 128891418, 135228567, 142146582, 148925108, 156494327, 164317736, 172766519, 181900031, 191274144, 201144063, 212295512, 223368765, 235151020, 247589635, 260378824, 273638373, 287884575, 302248108, 316550623, 331255139, 346403813, 360971099, 375569509, 389553458, 402517726, 414184892, 424729313, 433078273, 438189313, 439555095, 439583887, 438830731, 437975603, 434130194, 431923878, 426453094, 418302791, 408266206, 396116807, 382255541, 367727246, 352862714, 337718455, 322758592, 307868520, 293237752, 279027620, 265362391, 251771766]
14252B51771766j2732600j1984282j1731754j0487975q922119r881452r482370
14245A76549214q586286p935146p427945p410531o905416o557258n972525n040258
14237A20713849n454463n016199m985683m601815m669450l284875l710463l692054
14229H5298847l244578l353878l240877k693529k620072k969289k323104k242284
14221F2611236k421401j646638k063374k179567j666848j852351j290762j757223
14213D7733072j387487j590162j435688j209461j255382j065816q96963r16070
14205C7976043j414065j160716r28176r68165n18189o07757j069699j162228o86631
14196B9460417p44113r72719j98642p84297q08656k64510n44222o14934o58721
$$ y = [251771766, 239039166, 227054884, 215323130, 204835155, 195913036, 186031584, 176549214, 167962928, 160027782, 152599837, 145189306, 138283890, 131726632, 125754107, 120713849, 115259386, 110243187, 105257504, 100655689, 95986239, 92701364, 88990901, 85298847, 82054269, 78700391, 75459514, 72765985, 70145913, 67176624, 64853520, 62611236, 60189835, 58543197, 56479823, 54300256, 52633408, 50781057, 49490295, 47733072, 46345585, 44755423, 43319735, 42110274, 40854892, 39789076, 38892113, 37976043, 36561978, 35401262, 34473086, 33504921, 32986732, 32378975, 31309276, 30147048, 29460417, 28716304, 27743585, 27544943, 26760646, 25951990, 25687480, 25143258, 24528324, 23869603]
14187B3869603o80720q02497l63538j79133p63360k66218n40966m99739k44882
14178A9528550n45773o8351q09816j86661j05608m69517l66335m56329n97688
14169A5922472j47419j72483k45286j54322m73361p8975n55039J21566o92779
14160A3524374J0632m80818l25831m8094m44272n1628j41205J19202n56148j00672
14150A1505540j19776k4230m29887k27960K6197l73336N4599k90904o3976k79481
14140I776786j91774j74616k6575o1505j22742j50580j89428l66691K09632j75841
14130H526666l8477j28210m57993j40450J7663j74900J59949m45121Q2435j19845
14120G281717j00990R7927m16228q5177J08756L67500r42297K68020M6537Q1680
$$ y = [23869603, 23188883, 22386386, 22022848, 21843715, 21080355, 20814137, 20273171, 19773432, 19528550, 18982777, 18914426, 18104610, 17917949, 17812341, 17342824, 16976489, 16520160, 15922472, 15775053, 15602570, 15357284, 15202962, 14729601, 14650626, 14095587, 14217153, 13524374, 13535006, 13054188, 12728357, 12680263, 12235991, 12184363, 12043158, 12162360, 11606212, 11505540, 11385764, 11361534, 10931647, 10703687, 10729884, 10356548, 10411147, 10120243, 10056267, 9776786, 9585012, 9410396, 9383821, 9322316, 9199574, 9048994, 8859566, 8492875, 8702507, 8526666, 8488189, 8359979, 7901986, 7761536, 7779199, 7604299, 7764248, 7319127, 7401562, 7281717, 7180727, 7278654, 6862426, 6777249, 6886005, 7253505, 6311208, 6579228, 6625765, 6707445]
14110F707445m83182N7831P287l37606J10764j50008k56550j557j0194j25016
14100E519214j47841R0531n167k82862j19487J80731J48966k19307L417p5621
14090E092574o8304J0414M2397j35895l50384j4821J93991J17547q9388j78309
14080D619822m3144l11439J77806k56663j32622K78812j92732L25400k80728j63476
14070D021036j09698k01207K29621k62986K63559J44603n1938J60644n64479J34403
14060C763558J185J0658r1000k0644j11208K2899j08185K00080o4099k01538j98594
14049C203112J39079k647k72896L27746j45632j97121q7120J85107o0579l80367
14039B708682J78018j1458J90958J52239l29066J4917M71221n55884K90520j19725
$$ y = [6707445, 6224263, 6282094, 6289381, 5951775, 6062539, 5912531, 5655981, 5654424, 5644230, 5519214, 5371373, 5461904, 5456737, 5173875, 5054388, 5235119, 5384085, 5164778, 5168195, 5092574, 5024270, 5034684, 5077081, 4941186, 4590802, 4575981, 4769972, 4887519, 4798131, 4619822, 4576678, 4265239, 4443045, 4186382, 4053760, 4332572, 4139840, 4465240, 4184512, 4021036, 3911338, 3710131, 3939752, 3676766, 3940325, 4084928, 4032990, 4193634, 3629155, 3763558, 3764743, 3775401, 3684401, 3663757, 3552549, 3575448, 3467263, 3667343, 3603244, 3401706, 3203112, 3342191, 3339544, 3066648, 3394394, 3248762, 3051641, 2964521, 3149628, 3089049, 2708682, 2886700, 2875242, 3066200, 3218439, 2889373, 2904290, 3375511, 2819627, 3110147, 2990422]
14029B990422J75707n11159N094K85324k7776n25633K88229k12000o9395J89213
14019B588026J75623l84480j3398O3807j87698K75011j10147R1928k22143K83663
14009B560192o11534K53912j31355k12187J1328K25000l7176j65999M7449K85868
13999B225498l12156j37787L60507j43356j41427L3508R43Q7283k11756O12921
13989B374178P67346K181875P709441J7727372J6808132k1926938A2507495n121419
13981G386076k354544p09145n66799m10840m33607j38878J49950O9319n41175
13972B450357J42762k31445Q9491n7682k55759R1026l0106l21056J64693m4552
13962A997729J57167j20033L11445l49297J41971l58922k0631N98497n28228L22960
$$ y = [2990422, 3166129, 2654970, 2660064, 2945388, 2917612, 2391979, 2680208, 2468208, 2398813, 2588026, 2763649, 2379169, 2365771, 2429578, 2241880, 2516891, 2406744, 2498672, 2276529, 2560192, 1948658, 2202570, 2071215, 1859028, 1870356, 2095356, 2058180, 1892181, 1939630, 2225498, 1913342, 1775555, 2136062, 1992706, 1851279, 1884787, 1885730, 1973013, 1761257, 2374178, 3141524, 5323399, 13032840, 30760212, 47568344, 25641406, 12507495, 7386076, 5031532, 4322387, 3755588, 3344748, 2911141, 2772263, 2922213, 2991532, 2450357, 2593119, 2361674, 2451165, 2393483, 2137724, 2228750, 2198644, 1877588, 2042281, 1997729, 2154896, 2034863, 2346308, 1997011, 2138982, 1780060, 1759429, 2357926, 1829698, 2152658]
13952B152658k76907j91535J56529j2633P7815j13509M5616k81734o3300K88651
13942A781651J36881k74943J83753j10850k56096J33341k00355J36498K4155M0651
13932A594686q7415l6941p8057K31243j93223R4499J01809k0134l66451P8404
13922A318420r3449j317J77660k08606M56305m00909L31999k14897K22511j33477
13912A454240j06166n8177J09590J78512k48025k8205J46695j34412%P735N7357
13901A379144l58862R2788l9395K06583R192l68402O2690K70838K1636j89095
13891A087117K29881q355r5782p1221o9478k53187K69858j6682J53396j4800k30604
13880I80143j9811j63992N15732l95655J57963o5777K54747l28609j9564R0897
$$ y = [2152658, 1875751, 1684216, 1840745, 1828112, 1905927, 1792418, 1838034, 1556300, 1493000, 1781651, 1918532, 1643589, 1827342, 1716492, 1460396, 1593737, 1393382, 1529880, 1554035, 1594686, 1507271, 1470330, 1392273, 1623516, 1430293, 1524792, 1626601, 1606467, 1240016, 1318420, 1224971, 1223654, 1401314, 1192708, 1649013, 1248104, 1580103, 1365206, 1587717, 1454240, 1348074, 1289897, 1399487, 1577999, 1329974, 1301769, 1448464, 1314052, 1314052, 1321787, 1379144, 1020282, 1113070, 1073675, 1280258, 1289450, 921048, 983738, 1254576, 1276212, 1087117, 1316998, 1308643, 1212861, 1141640, 1072162, 818975, 1088833, 1072151, 1225547, 1210747, 980143, 960332, 796340, 1312072, 916417, 1074380, 1008603, 1263350, 934741, 915177, 1006074]
13870A006074L4640k20901J92723J49927k46277k64906K87744J85454j94656j82016
13860G47806L9101R2979J63494j60576L24283k66025k42662N02205k02373j63257
13850H34975k08241L91583j05664O4116p878K27903l50319J24115K99100m05950
13840H63740q009J63385Q98p9864J18502k53896J04615L4832P333k35347L48401
13829A064590l23888j12987K97566k39668L84709m54651K02894j03936k82128
13820D32501M26574k29207r1863R9959O4683k84373M64359k32102K35381k04855
13810F81057j38095L64584J37427k61327o6836O1902l01782L79980K02144j52799
13800I06255l00845L08449j16549j62396q8711L89457k20244q6691K84505k96032
$$ y = [1006074, 1040714, 819813, 1012536, 1162463, 916186, 651280, 939024, 1124478, 929822, 747806, 786907, 879886, 1043380, 882804, 1207087, 941062, 698400, 1200605, 998232, 834975, 626734, 1018317, 912653, 976769, 968891, 1196794, 846475, 970590, 1269690, 863740, 855731, 1019116, 1020014, 940150, 1058652, 804756, 909371, 944203, 951536, 716189, 1064590, 740702, 627715, 925281, 685613, 1070322, 615671, 818565, 714629, 432501, 859075, 629868, 538005, 637964, 702647, 418274, 882633, 650531, 885912, 681057, 542962, 907546, 1044973, 783646, 716810, 778712, 476930, 856910, 1059054, 906255, 605410, 913859, 797310, 634914, 546203, 935660, 715416, 628725, 913230, 617198]
13790F17198Q3143O2805K8356K6768l6088j6527J26176l33958O2023J68543k03527
13779E84912J54984k85176J79232l4570J9492j65772K03449L30610k35756M4534
13769G95939k37570K97565l02034j43150J98722j93155J07147K80410B61611m6914
13759B14697N25427q1487L07491j74316k83674L52647D27850L56740j84204j82114
13749D18272J29742R8929k52880K79120k51279M44928C99656R1546k9913L08979
13739G70268l77727J01393P002K29878j05443J43284C64306M32804k89114K45455
13729G53451k62808j13644J86269p6813J08590J14443j26743J74536l06565J56526
13719F07242p3746J79777j23686k2980O800m2221K1606j86424J46565J21795j93402
$$ y = [617198, 700341, 763146, 791502, 818270, 782182, 765655, 891831, 557873, 619896, 788439, 584912, 739896, 454720, 633952, 599382, 618874, 453102, 656551, 987161, 751405, 795939, 558369, 855934, 553900, 410750, 609472, 416317, 523464, 803874, 261611, 214697, 740124, 658637, 966128, 791812, 508138, 860785, 427850, 784590, 600386, 418272, 548014, 646943, 394063, 673183, 421904, 866832, 399656, 491202, 461289, 770268, 392541, 493934, 500936, 730814, 625371, 768655, 364306, 797110, 507996, 753451, 490643, 376999, 563268, 486455, 595045, 709488, 582745, 757281, 450716, 607242, 533496, 713273, 589587, 566607, 573407, 531186, 552792, 366368, 512933, 634728, 441326]
13708D41326p8329J5581m5395N8454K26691k06972K423M03946C74689q7043K45517
13697E33163B64264o7613M8461P4521J75769J13055k76433J64659q7495K72875
13687F82063l08542K42855j46961L6683r3449J88521B49529J17171m8751j41917
13677A76032N43944P2903B84823L73642k18177C8148O30295l15627o5859N9139
13667C46096P8936j93331K45374j20612l8280j8733K25979j54614A60147N91104
13657G51251k23427j9217Q5994A43621K12742l3351k6168K57863B39297L82289
13647F21586j21096j50981o5609J12631K36106j31822k30355P9337j6871J17937
13637D50863A89900J61841P0468j11005O2892R9781j39515J99561D1659L05847
$$ y = [441326, 362997, 378578, 333183, 391637, 618328, 411356, 413779, 817725, 374689, 287646, 533163, 264264, 196651, 245112, 319633, 495402, 608457, 332024, 496683, 409188, 682063, 373521, 616376, 469415, 506098, 412649, 601170, 249529, 366700, 317949, 176032, 719976, 792879, 284823, 658465, 440288, 38148, 668443, 352816, 286957, 346096, 425032, 231701, 477075, 356463, 318183, 299450, 525429, 370815, 160147, 751251, 527824, 508607, 594601, 143621, 356363, 323012, 296844, 554707, 239297, 621586, 500490, 349509, 283900, 396531, 632637, 500815, 270460, 349797, 332926, 450863, 189900, 351741, 422209, 311204, 374096, 473877, 334362, 533923, 41659, 347506]
13627C47506K25201k84730j03292K00959m8902r3880J33032p7446J22959J15212
13617E36619A68529K81897j76959J83337j00073j74892l5741Q8953r0783p0591
13607G3677K0039K20281K72775k76316K87254A66465K36821j14775K42273j86243
13597C44541q741r2662K5201J30339J51206k46922M6319j02162j7518M6173J07005
13586C82779N4962O3725k15570j09384l630K29345K0370k08467a0262B22501J58461
13575C80962A76332J15820l3343n8287L39290B20252O9203K66499k09148H3897
13564D17351m9358j73402q3359Q1595N3449K42166k05874N0259j3656p1652J56877
13553D04396M6340j32734m5474K53628k61232J00997J5209l2533F2094g4255A1463
$$ y = [347506, 572707, 287977, 184685, 385644, 336742, 242862, 375894, 298448, 421407, 536619, 168529, 450426, 273467, 456804, 356731, 181839, 146098, 235051, 144268, 73677, 93716, 313997, 586772, 310456, 597710, 166465, 403286, 288511, 530784, 344541, 335800, 243138, 268339, 398678, 549884, 302962, 349281, 247119, 229601, 275774, 382779, 437741, 501466, 285896, 176512, 172882, 402227, 422597, 214130, -10262, 222501, 380962, 176332, 292152, 258809, 200522, 539812, 220252, 289455, 555954, 346806, 83897, 417351, 367993, 194591, 111232, 192827, 246276, 488442, 282568, 332827, 319171, 247519, 404396, 450736, 318002, 272528, 526156, 264924, 365921, 381130, 348597, 62094, -74255, 11463]
13541B66829O2902A53532M35973A3470K70345I3055K16746r6189K53564d1733
13530B12651K26222j76322A19915C7666L91894j30658N1430D5988J39608K20571
13520D06167A19611D869L13063A48758L20702k00883k9239F3856J81899e72B00675
13508C14190A15655K11810d0701B13177J34078c2313A68000k0125K71042A67018
13497B09344c1993o5292E28126p6168o5012q2571G7334K45978j41786K01150A26612
13485A84440O7494F4982B3612L00788J1437D097R7189R88L3587J82336j00598
13474B17599E4674J64452l6401K03333j18983n2112k5903L4858J88652K01j70443
13463B42328C1297a13021B39033j03705j6064K17369N2219j41890A18201N6717
$$ y = [266829, 329731, 153532, 589505, 13470, 283815, 93055, 309801, 213612, 467176, -41733, 212651, 438873, 262551, 119915, 37666, 429560, 298902, 350332, 45988, 185596, 406167, 119611, 4869, 317932, 148758, 469460, 268577, 239338, 63856, 245755, -572, 200675, 314190, 115655, 327465, -40701, 213177, 347255, -32313, 168000, 147875, 418917, 167018, 209344, -31993, -97285, 528126, 451958, 386946, 304375, 77334, 323312, 181526, 382676, 126612, 184440, 251934, 64982, 23612, 324400, 335837, 4097, 101286, 102274, 135861, 318197, 217599, 54674, 219126, 182725, 386058, 267075, 214963, 189060, 223918, 412570, 412771, 242328, 31297, -113021, 239033, 135328, 119264, 336633, 388852, 246962, 118201, 174918]
13453A74918m2213K24504A77980J02159Q3900a4394A39895K72516k03669o6433
13443A42309J58353C771L25323k0716k4972a9520o6650C79069C6228K7085K86543
13432C49856n0883a8216G8377K04063m5960L5338K27325A02030J65585J79341
13422D46956j33325j53576N4679A0414h3526C40616d3414b0473A68724H1438J9653
13411A01091O0458J52089A37670J20a13699B87971j38514C0895K93535j47379
13401A77051J12213a16497C36332A60418Q5619N8618I4489b58917A26694j5054
13391A11640J42609A6221M02056E1434b18196H6822K03747q0595a77589g3127
13380B14402C2112b4648B90804k0041H6201O3565O7924R8896j37698d4765D09900
$$ y = [174918, 132705, 357209, 177980, 280139, 364039, -14394, 139895, 412411, 208742, 142309, 300662, 3771, 329094, 308378, 283406, -19520, -86170, 379069, 36228, 63313, 349856, 298973, -18216, 78377, 282440, 236480, 271818, 499143, 102030, 267615, 446956, 313631, 160055, 214734, 10414, -83526, 340616, -43414, -20473, 168724, 81438, 101091, 161549, 313638, 137670, 137790, -113699, 287971, 149457, 30895, 324430, 177051, 289264, -116497, 336332, 160418, 246037, 304655, 94489, -258917, 126694, 111640, 254249, 16221, 418277, 51434, -218196, 86822, 290569, 209974, -177589, -73127, 214402, 32112, -24648, 290804, 270763, 86201, 149766, 217690, 316586, 178888, -44765, 409900]
13368B23722J18025H2640N1545J35539F1567O0061B4180K12216N0352A33420K18086
13357C51506A33925m1442o894d8592B91124J14067A57356h5749c8541C26859j55648
13346A71211L86657B74083A0654M34559F0974L57377A84614J9738l3997J64336
13336C34691p3349K75710K6262j34605a25287B30812Q5449J09103A79503m9881
13326A29622K74223h5701B76635J25867F2351K4042D550K07403J22542j04071
13316B30424o1038H0473a18740A58428E359K94594r087K41032B16484j02008O0182
13305A74658K34960J67193d8872k3487D4640J10982b0853B63114m1573I4332J40839
13294B35171A9733J46820q196j3518J40782K8276A12885K63661j3782e4665A17585
$$ y = [223722, 341747, 82640, 134185, 269724, 61567, 121628, 24180, 236396, 286748, 133420, 351506, 133925, 92483, 85589, -48592, 291124, 405191, 157356, -85749, -38541, 326859, 171211, 557868, 274083, 10654, 445213, 60974, 418351, 184614, 204352, 170355, 334691, 261342, 537052, 563314, 428709, -125287, 230812, 316261, 425364, 179503, 129622, 403845, -85701, 276635, 402502, 62351, 86393, 4550, 211953, 334495, 230424, 169386, 80473, -118740, 158428, 5359, 299953, 290866, 531898, 216484, 114476, 174658, 409618, 576811, -48872, -72359, 44640, 155622, -20853, 263114, 221541, 94332, 235171, 19733, 166553, 158357, 144839, 285621, 313897, 112885, 376546, 362764, -54665, 117585]
13282a61882B85641k3638M7143a900G6759K583J09302b59960l0087B17537I0035
13270B45792H2017C4043a1530B5207d01675B8580f6027B17863P2569A22228J06954
13259B29182h440k06240B61209H0779a54221F4648p571O7845M8646d71841G8982
13247A80272a51250I6525b05553G3934J94344e6593E2999a04443J6335A47531
13236I1848N039J46331b10648B0344K77547b20294E3065e2989m0566k7783j1205
13225a32543A85816B4133b9199B24626c6035p8854A3047M20839A49231a28768
13214E7023J10577o7265m4937J29475q5141B3499J40531K66997G4993a71584d9981
13202a64509c5898A00400a8999j93915C34227a99155f7958A88858d5876A49737
$$ y = [-161882, 285641, 262003, 309146, -1900, 76759, 79342, 188644, -259960, -290047, 217537, 90035, 245792, 82017, 34043, -11530, 25207, -401675, 28580, -66027, 217863, 290432, 122228, 229182, -8440, -214680, 261209, 80779, -154221, 64648, 57077, 124922, 173568, -471841, 78982, 180272, -151250, 96525, -205553, 73934, 268278, -56593, 52999, -104443, -88108, 147531, 91848, 96887, 243218, -210648, 20344, 297891, -220294, 53065, -52989, -93555, -121338, -132543, 185816, 24133, -29199, 224626, -36035, -114889, 13047, 433886, 149231, -128768, 57023, 167600, 100335, 55398, 184873, 99732, 23499, 164030, 431027, 74993, -171584, -49981, -164509, -35898, 100400, -18999, -212914, 334227, -199155, -67958, 188858, -45876, 149737]
13191C41598m4358H9047f4545k8602D68918A42518L4998a00727k3323A49879o1564
13180H8315b8234A2830L7527a18792A76786g1796B52883a00991A77319b99089
13169b50010B15191a38509C05983m8918j25029O5377D203J45475a23426p422B05140
13157A5082J6240a08952n6801E0222h0892L3605j0474D5613j1082M8097A7701
13145A76755N5360r5288R1613l8450C5879K0817a31108k1219b0736E03749b4935
13133C48671m2750D9497b2420E4481o709J43259O2425D046J50558j5663E4391
13121G3715b8221E6647B5743a88656C36837j12787b66459F1274A2207a23894l1398
13110a55292B34107n0478g8260H1415a01823c1519F8165J69634M6922A13555J39601
$$ y = [341598, 297240, 89047, -64545, -93147, 468918, 142518, 177516, -100727, -124050, 149879, 88315, -28234, 12830, 50357, -118792, 176786, -71796, 252883, -100991, 177319, -299089, -250010, 215191, -138509, 305983, 257065, 132036, 197413, 4203, 149678, -123426, -130848, 205140, 15082, 31322, -108952, -165753, 50222, -80892, -47287, -57761, 45613, 34531, 82628, 17701, 176755, 232115, 136827, 228440, 189990, 35879, 56696, -131108, -152327, -20736, 503749, -24935, 348671, 305921, 49497, -22420, 54481, 47772, 191031, 253456, 4046, 154604, 138941, 54391, 73715, -28221, 56647, 25743, -188656, 336837, 224050, -266459, 61274, 12207, -123894, -155292, 234107, 183629, -78260, 81415, -101823, -31519, 68165, 237799, 284721, 113555, 253156]
13099B53156H5357m0373J26156K26720B4595N248J64440a67178k45959B76890
13088A65903b07269e5125m2068A19773n7180b28854H6790p417a58077A21311D6965
13076f2719r0227c2293j21832d0590A16940E6716J72996d97344a50720D0355J95343
13065B35698N9843F2864l705J95290a26005A89760f8984a4037B45674A0908J3860
13054B4768N07823k54746j22660a26458J6296J225C9190a4856F6006a73453C50331
13042g4938G3831k1466c6607j02809A18136K59959o9346A19534C5885J63481I5045
13030a33265r8390B22235j05651D0071J89189f557l14633B31514p9164M55512
13020F07862f5340A52491A8667J16744F6916O379c29363C076J76713C2520J68185
$$ y = [253156, 85357, 44984, 171140, 397860, 24595, 29843, 194283, -167178, -413137, 276890, 165903, -207269, -55125, -97193, 119773, 62593, -228854, 86790, 79373, -158077, 121311, 46965, -62719, -152946, -32293, -154125, -40590, 116940, 56716, 229712, -497344, -150720, 40355, 235698, 295541, 62864, 59159, 254449, -126005, 189760, -68984, -14037, 245674, 10908, 24768, 532591, 277845, 155185, -126458, -110162, -108937, 39190, -14856, 66006, -173453, 350331, -74938, 73831, 52365, -36607, -139416, 118136, 378095, 308749, 119534, 35885, 199366, 95045, -133265, -231655, 222235, 116584, 40071, 229260, -6557, -321190, 231514, 152350, 607862, -65340, 152491, 18667, 135411, 66916, 73295, -329363, 3076, 179789, 32520, 200705]
13009B00705q9085l0217l9543J9917M3252l1731J50850J40381A25848M0024m8449
12998A17423a20810A06472b0778A35547N7127a58940j44656A10079d6529j6887
12988f3416m1374B15015a3937A31349d1460B54949D2518M17778G0652L49031f6837
12976a07883j18804Q8817A74455J1086H8479a43160d7369D6929J59937b97539
12965H6227L1477d1082r4799K4695C8733L05147H8644D0045i4784a6125j36523
12954a52648B24680D1161b4751F0805A4635h8358A10978b31346d5438B39858j9885
12943B19973J158m6904R5294O851g9789A71675O1466b90923a4302A93237b0790
12931A38977o8530i760k20047D3748b26788p6303h4200C50080a8824p0890F8389
$$ y = [200705, 111620, 81403, 41860, 61777, 105029, 73298, 224148, 364529, 125848, 165872, 117423, -120810, 106472, -20778, 135547, 192674, -158940, -303596, 110079, -46529, -63416, -104790, 215015, -13937, 131349, -41460, 254949, 42518, 460296, 70652, 419683, -66837, -107883, -226687, -137870, 174455, 185541, 88479, -143160, -47369, 46929, 206866, -297539, 86227, 117704, -41082, -135881, -111186, 38733, 343880, 88644, 40045, -94784, -16125, -152648, 224680, 41161, -24751, 60805, 14635, -88358, 110978, -231346, -45438, 239858, 219973, 221131, 174227, 269521, 276372, -79789, 171675, 233141, -290923, -14302, 193237, -20790, 138977, 70447, -9760, -229807, 43748, -226788, -303091, -84200, 350080, -18824, -89714, 68389]
12919e6390E8677a52356G5784d04823B60932b26857B59606c76907B4769b11766
12908a73300A11145a2687k30509a02278q7483r5168P15e8648C7349L81822c2129
12896G2804d5780l719a8193A58602a27177A5708g5713G8867C878i416n1178m640
12884f5234P425B58007O0943j42226J33855D100N1236p346o984b87453a40937
12872b11414N3611p2536E4299J16098a72831m5046G9746f9950q8771j1491A1495
12860B26156f246k08645A3809K00842b21754R5512H8311a17058A36718l3175a16366
12848A52134a89679A90926b55869k7350B03616c06783B27150F1994a44916A00835
12837c28554a04010A2352K12477h4913A04678J3780l4450J82114h0646n700q2458
$$ y = [-56390, 58677, -152356, 75784, -404823, 260932, -226857, 259606, -376907, 24769, -211766, -173300, 111145, -12687, -243196, -102278, -189761, -284929, -284214, -58648, 37349, 419171, -32129, 72804, -45780, -49499, -18193, 158602, -127177, 15708, -75713, 78867, 3878, -9416, -60594, -65234, -57809, 258007, 318950, 176724, 310579, 4100, 55336, 47990, 41006, -287453, -140937, -211414, -157803, -230339, 54299, 170397, -172831, -217877, 79746, -69950, -158721, -170212, 11495, 226156, -6246, -214891, 13809, 214651, -221754, -126242, 88311, -117058, 136718, 103543, -116366, 152134, -189679, 190926, -255869, -283219, 203616, -306783, 227150, 61994, -144916, 100835, -328554, -104010, 12352, 224829, -84913, 104678, 118458, 84008, 266122, -80646, -86346, -168804]
12826a68804E2962e9292I7308A3265J19871a43737A97453f0714m2300A52261E3216
12814A798M6439J3060j0005J64753i3085L6178A98784a81327a6263j07840G0710
12802a07205k65111F8763a37594a0819B8720K55808a98241B57246K02632D1879
12791I9696f6944C3286J26274G3298A3962b31783B10463a6761E6319R310K46380
12780C12009j37921C7713b40543J01774A02879c62796A80625h0274k01591m5902
12770c27767h4821b461A21363a92205N0608j22536C1800O1330P2349a62277A00149
12758G2096O3611K4380h11B9842e885j43445G5751c64524A97294J1924D8406O8736
12746A17142a91514L3090r6140g668B27129G4905A4953K22830d30114g1796l65877
$$ y = [-168804, 52962, -59292, 97308, 13265, 133136, -143737, 197453, -60714, -103014, 152261, 53216, 1798, 48237, 61297, 51292, 216045, -93085, -56907, 198784, -181327, -16263, -124103, 70710, -107205, -372316, 68763, -137594, -10819, 28720, 284528, -198241, 257246, 459878, 41879, 99696, -66944, 33286, 159560, 73298, 13962, -231783, 210463, -16761, 56319, 65629, 312009, 174088, 37713, -240543, -138769, 102879, -362796, 180625, -80274, -281865, -327767, -84821, -2461, 121363, -192205, -141597, -264133, 31800, 93130, 165479, -162277, 100149, 72096, 135707, 160087, -811, 29842, -5885, -149330, 75751, -364524, 197294, 209218, 48406, 117142, -191514, -158424, -254564, -7668, 227129, 74905, 14953, 237783, -430114, -71796, -437673]
12735d37673A58843a10426p2689N4106a5425j32951G1469J76043b49332a07923
12724D482a6069k17100A19080A1733J30997b88048B67316b44613J06078e394k35961
12713b41355i7268C15171I2825K42569G2385J56055K22692f3754b4607A9956b4871
12701c7908B68333F1718a52748C28030a32737M9433A00790a97112K1421A05754
12690B40086L0082l6359A04271C0806J20037j6593P746K05952A12200a82892C56340
12678I950L37915a21421A70394e8755j0407m5821D09609d9743C2249J37714d25
12666B00992b1686B22589G249P6357a14476G4917N4125L3993L87464a69667B09070
12654F3250a07342C28920b21619F8774a52615g1711B07691g1907C62f5483A0390
$$ y = [-437673, 158843, -110426, -183115, -129009, -15425, -148376, 71469, 247512, -249332, -107923, 4482, -16069, -233169, 119080, 11733, 142730, -288048, 267316, -244613, -138535, -5394, -241355, -97268, 315171, 92825, 335394, 72385, 228440, 451132, -63754, -24607, 19956, -24871, -37908, 268333, 61718, -152748, 328030, -132737, -83304, 100790, -197112, -175691, 105754, 240086, 270168, 233809, 104271, 30806, 150843, 134250, 141996, 347948, 112200, -182892, 356340, 9950, 347865, -121421, 170394, -58755, -69162, -114983, 409609, -49743, 32249, 169963, -425, 200992, -21686, 222589, 7249, 83606, -114476, 74917, 129042, 163035, 550499, -169667, 209070, 63250, -107342, 328920, -221619, 68774, -152615, -71711, 207691, -71907, 362, -65483, 10390]
12642b18255A85124b7403r2004c2551l6202A06735l1196J23855r6232M6312h94
12630a78564I0737a4727l4866q3374a5121B65763q5705i9306C80226h0364J1578
12619f8786A47218J2716i0214M3641E5575a10695j03033A10777f8506B45112q7948
12608A57164d7268n877m3276A42332A1301g0482j01107B06657G9544J10083J0192
12597A99819E3403b2705m8704C597K5127R4018f1005E4616L1631b57902g7562
12585E3327b03361J00770B9597b1647f749j04716A63838L1856J60266J25506e9379
12573e9775j56615A22293A3684e0778E5679J16496c28740a63305A11461a98299
12562D26407B6431J36280a66332b713k9356A88723p1630J42942f8431B51841F5427
$$ y = [-218255, 185124, -27403, -119407, -32551, -68753, 106735, 75539, 199394, 103162, 149474, -894, -178564, 90737, -14727, -49593, -132967, -15121, 265763, 180058, -99306, 380226, -80364, -68786, 147218, 159934, -90214, -46573, 55575, -110695, -213728, 110777, -68506, 245112, 157164, -47268, -53145, -96421, 142332, 11301, -70482, -171589, 206657, 79544, 189627, 199819, 53403, -22705, -71409, 3597, 28724, 122742, -61005, 54616, 86247, -257902, -77562, 53327, -203361, -102591, 29597, -21647, -6749, -111465, 163838, 195694, 355960, 481466, -59379, -59775, -216390, 122293, 13684, -50778, 55679, 172175, -328740, -163305, 111461, -198299, 426407, 26431, 162711, -166332, -2713, -32069, 188723, 117093, 260035, -68431, 251841, 65427]
12550A78621b9250k93310i8363I0951f5979k366A50002J1561c22573A50036d8138
12538A82763D7426N6754c0103n9556A61786a59903G358a47666B64829F0780J86809
12527B47589a86717n2397I8389a07755M934L6948d160E5272R2047c961m9230l46332
12515c99523B34253h637F9621a81239H9963a00736A10681L26701h3409k63948
12505c47357C79992d7513A62221Q4482A07898l9609b11276j24699A33654h490
12494i4565B72558a21629I854Q5023a58051D32383a49526q7168k6561A42452M1251
12483A83703g2634J5906B41380a2909D9750L58511c39938a3255o8192A05557b26563
12471A60482N1336b96431a18521A88299l2288a32496p3625D0795a18993M0745
$$ y = [178621, -29250, -322560, -98363, 90951, -65979, -68345, 150002, 161563, -322573, 150036, -48138, 182763, 47426, 104180, -30103, -89659, 161786, -159903, 7358, -147666, 264829, 60780, 247589, -186717, -239114, 98389, -107755, -102821, -65873, -4160, 55272, 147319, -3961, -53191, -399523, 234253, -8637, 69621, -181239, 89963, -100736, 110681, 437382, -83409, -347357, 379992, -47513, 162221, 246703, 107898, 68289, -211276, -335975, 133654, -8490, -94565, 272558, -121629, 9854, 94877, -158051, 432383, -149526, -236694, -263255, 142452, 183703, -72634, -56728, 241380, -12909, 49750, 408261, -339938, -13255, -81447, 105557, -226563, 160482, 211818, -296431, -118521, 188299, 156011, -132496, -206121, 40795, -118993, -78248]
12461g8248F9515e0048a1914I8675a6722B48222b72835B24491B798h6768n3702
12450a40470B04841n8787a76471C95902b18760f9732a8688k13669A38742J3204
12440A51946e9741j12967b4247G5457P2980n1996J58074i2498j26654b9482l6323
12429f5805A70267p4362i2920m0229C5553H925g7583j98206R9694Q4742b771A03047
12416e9253j42036a6718q2175Q711B85163a49081E1440R4651B0511a11049k19119
12405c30168A41726D2238K21022h9478i151k82794D188K35471p1655a3194H6714
12393b55674r6283A63978j0031a34674b0773B42504G0187p166f4382p5036A75755
12381I2678G44J44416b31452O6029C26641j39888a27348G2198k7555e3493g455
$$ y = [-78248, 69515, -50048, -11914, 98675, -16722, 248222, -272835, 224491, 2798, -86768, -140470, 204841, 146054, -176471, 395902, -218760, -69732, -18688, -232357, 138742, 151946, -59741, -172708, -24247, 75457, 148437, 96441, 254515, -92498, -219152, -29482, -65805, 170267, 95905, -92920, -133149, 35553, 8925, -77583, -275789, -176095, -91353, -2771, 103047, -59253, -201289, -16718, -98893, -90182, 285163, -149081, 51440, 146091, 20511, -111049, -330168, 141726, 42238, 263260, -89478, -9151, -291945, 4188, 239659, 168004, -13194, 86714, -255674, -351957, 163978, 153947, -134674, -20773, 242504, 70187, 63021, -64382, -139418, 175755, 92678, 744, 145160, -231452, -165423, 326641, 186753, -127348, 72198, 44643, -53493, -7455]
12369a44431A69559h901B92375A30101d34964A48b82353c8479k7607B25159A03762
12357A97006E3409j1829h6123j31502q6128F1262c39385g6011L6278E7422a05371
12345B10197I3607N4694K08319F9530K8042e928E3430J80281b7398r555j19430
12334a56383A90096o1355m3524B0174J78356K5508n8727k8894K31667g9086C6056
12322D65222A61283h7042j16427F6454A1652K67260a98523d5783E3379b3763k0889
12311d4652C1946a36311I570J28924P8230a97063A83477H6050i1917B88826i7091
12299F4773b8094B50289J08951A61768B0107J207J59033n2972a27024c2526C50641
12287B28251o6244d2187B20368j09145J69540h0343B34075a09711A58250G602
$$ y = [-144431, 169559, -8901, 292375, 130101, -434964, 148, -282353, -38479, -66086, 225159, 103762, 197006, 53409, 41580, -86123, -217625, -303753, 61262, -339385, -76011, -39733, 57422, -105371, 210197, 93607, 148301, 356620, 69530, 97572, -5928, 53430, 233711, -27398, -36953, -156383, 190096, 128741, 85217, 20174, 198530, 224038, 165311, 136417, 368084, -79086, 36056, 465222, 161283, -87042, -203469, 66454, 11652, 278912, -198523, -45783, 53379, -23763, -44652, 31946, -136311, 9570, 138494, 216724, -197063, 183477, 86050, -91917, 288826, -97091, 64773, -28094, 250289, 359240, 161768, 20107, 21314, 180347, 127375, -127024, -32526, 350641, 228251, 162007, -42187, 220368, 111223, 280763, -80343, 234075, -109711, 158250, 7602]
12276f9990H3370K70306j56515K0325h702H4936l4229P8729P6915M0533j06299
12265A40585K56286b2401A84176P5147a9859q6632B021K8346c0470B86455a2410
12253A68077k6924F636f2180A17373g128F7179M17669F3612J36228N4893C8363
12241a72591A02144M7588E4458c0138F0695q376L1649J77805N2063H6982f0316
12229D8755J13233n5203C520J83984J805q8406I363c3557A40708O6299J74278
12218C81285F0573K52222j0048A18756Q9843P6018r8958J97962G6831J99283G1852
12206B50340C6215O5601C1221i9774n1089P3849N376A13737M73310a97770C82409
12194A78398K54849d3023A81963K65040A81731J39696e518B79346A37950R2292
$$ y = [-69990, 83370, 353676, 197161, 217486, -8702, 84936, 50707, 129436, 206351, 246884, 140585, 396871, -22401, 184176, 259323, -19859, -106491, 2021, 30367, -30470, 286455, -12410, 168077, 141153, 6636, -62180, 117373, -7128, 67179, 484848, 63612, 199840, 254733, 38363, -172591, 102144, 149732, 54458, -30138, 60695, 52319, 83968, 261773, 313836, 86982, -60316, 48755, 161988, 106785, 3520, 187504, 189309, 100903, 9363, -33557, 140708, 207007, 381285, 60573, 312795, 302747, 118756, 208599, 284617, 185659, 383621, 76831, 276114, 71852, 250340, 36215, 101816, 31221, -99774, -150863, -77014, -71638, 113737, 587047, -197770, 382409, 178398, 433247, -43023, 181963, 447003, 181731, 321427, -5518, 279346, 137950, 230242]
12184B30242H9926D3894M36135B9754K6080M5081M9196P5657a22587B34267G1460
12172H0804L6883N7508c8234B98328A23253J77175K34176B62911j10330F896N7351
12161F4247J46838J00403J3744j26897p9808A6369p918Q0198O0764Q6597r3286
12150A42724c0561k040B3601N6081J4224d1391D55154E5762m441J51074A5130
12138d1918j28897I6110J92626p5025I8344i0237A61852C3826L230i4508B1996
12126A70919B3295h4341N059D4239K35920J52955e9121G7500K5096J437L425K19311
12114C26769I2640c89131E846K94938b8644E0298A4647f3480A15456G924J31388
12103A39312d0658B35869I139K31735H9775i4642C6649Q001F065J73642H6404
$$ y = [230242, 89926, 43894, 480029, 29754, 55834, 100915, 150111, 225768, -122587, 234267, 71460, 80804, 117687, 175195, -38234, 298328, 123253, 300428, 534604, 262911, 152581, 6896, 64247, 211085, 311488, 325232, 198335, 118527, 16369, 8451, 88649, 149413, 236010, 142724, -30561, -32601, 23601, 79682, 93906, -41391, 455154, 55762, 51321, 202395, 15130, -41918, -170815, 96110, 288736, 213711, 98344, -90237, 161852, 33826, 37056, -94508, 21996, 170919, 23295, -84341, -79282, 44239, 280159, 433114, -59121, 77500, 102596, 104033, 107458, 326769, 92640, -389131, 5846, 300784, -28644, 50298, 14647, -63480, 115456, 7924, 139312, -40658, 235869, 9139, 240874, 89775, -94642, 36649, 44650, 6065, 179707, 86404]
12091A53959d9256D5392J23791J39344I2832J2890J25277N5367q1923M5723K865
12080B53031A10080O1095e5608l5783C3774c35049B37294A08190K10338a01520
12069a2193A44123J41462C3766a663j12776b6711j6142H3002f5551B31602a88247
12057B07655E3003d4640n499a1778j73873j0356Q8801r818k23240M4730E3147
12045B02486J64439b52811A42564a62772g1825n9919C64909d9038A63174p8898
12035H4276J24088q9262a81454A66145b7883j03033H3283C0062J0967Q9872K7077
12024A57978K3980b82312e7729A68806e7562n409q7619A68674a47156M8235G7716
12012A29849C5602L9366K02809j36715N9979H0580a4516m8100D5186a5589A21187
$$ y = [153959, -49256, 45392, 169183, 308527, 92832, 105722, 230999, 286366, 204443, 250166, 253031, 110080, 171175, -55608, -91391, 33774, -335049, 237294, 108190, 318528, -101520, -12193, 144123, 285585, 33766, -1663, -114439, -26711, -42853, 83002, -65551, 231602, -188247, 207655, 53003, -44640, -50139, -11778, -185651, -196007, -107206, -117024, -340264, -295534, 53147, 202486, 366925, -252811, 142564, -162772, -71825, -131744, 364909, -49038, 163174, 84276, 208364, 119102, -181454, 166145, -27883, -130916, 83283, 30062, 41029, 130901, 157978, 181958, -282312, -57729, 168806, -57562, -62971, -150590, 168674, -147156, -98921, 77716, 129849, 35602, 74968, 277777, 141062, 201041, 80580, -14516, -62616, 45186, -15589, 121187]
12000d0199F2010R7772b24577D6649b18073i2346r109j66795N1947f3132a4096
11988c5944A88131m4724a30829A19789a63109g2244n8607d5284l676j3788b7636
11976i153p7509k7901a2704A90621q3992a69588g2049B60766a26115b1163k51816
11965b72979a14290A33235a57220I8436C9052a94804c2686k13164e6623A9191
11954a8549C007J73031A7343L12660a67343B08034b40439A43672A077b8966k1673
11943e0639l2379A319e5706g98q1658r9583D81251E5031i3699C2426K11178F4906
11930f2668c611r6328j12444B12322P2299i2902A84220D9696P5080R9116b12713
11918b95712A56367b1404A57733a56849m9786p8122A38751d4632r414j28293B71774
$$ y = [-40199, 62010, 159782, -224577, 46649, -218073, -92346, -101455, -268250, -216303, -63132, -14096, -35944, 188131, 143407, -130829, 119789, -163109, -72244, -130851, -45284, -48960, -62748, -27636, -9153, -86662, -114563, -12704, 190621, 106629, -169588, -72049, 260766, -126115, -21163, -272979, -114290, 133235, -157220, 98436, 39052, -194804, -32686, -245850, -56623, 19191, -18549, 3007, 176038, 17343, 330003, -167343, 208034, -240439, 143672, 1077, -28966, -50639, -83018, 1319, -55706, -798, -82456, -182039, 481251, 55031, -93699, 32426, 243604, 64906, -62668, -3611, -99939, -212383, 212322, 284621, -92902, 184220, 49696, 124776, 223892, -212713, -295712, 156367, -21404, 157733, -156849, -206635, -284757, 138751, -44632, -54046, -182339, 271774]
11906c34554C4438a37474C57427A58544J14089A35048b24939L1447O6360J9378
11896a07754C02549D3380d5952B00039h4380H1633c7304H6524a0470A01781a78495
11884f6670o3476D7020J43328a25072C76376h8707J1097B139d6893B2327a86347
11872a00222M410A6704d5343C295J19878a43256e0722A07061b16014L740F072
11860H1506i5489m1335O974A38545a40174N4933j58573l4170J00367l4207B71010
11848a25502f1307k4491C7803a85422f1857o4798m3501A08650f2837l6055A8680
11836b60357D0012J01219c91817J76812R5263H3540K23151d5183j23303A55953
11825b89171P8836q8864g3443A65060A1162Q727f871r8739B5020N1985a32950
$$ y = [-334554, 34438, -137474, 357427, 158544, 272633, 135048, -224939, -193492, -127132, -107754, 302549, 43380, -45952, 200039, -84380, 81633, -37304, 86524, -10470, 101781, -178495, -66670, -130146, 47020, 190348, -125072, 376376, -88707, -77610, 2139, -46893, 22327, -186347, -100222, -95812, 16704, -45343, 3295, 123173, -143256, -50722, 107061, -216014, -212274, 6072, 81506, -95489, -136824, -129850, 138545, -140174, -85241, -243814, -277984, -177617, -211824, 271010, -125502, -61307, -85798, 37803, -185422, -61857, -126655, -170156, 108650, -62837, -98892, 18680, -260357, 40012, 141231, -391817, -215005, -119742, 83540, 306691, -45183, -168486, 155953, -289171, -210335, -299199, -73443, 165060, 11162, 19889, -6871, -105610, 25020, 77005, -132950]
11813i6456B059a1029N496A31043a11185B61072c30961A7046f5273A13072J730
11802A14802J36032b2154C9838J80748b53768K3550d771B27110J22188a81452
11791b51814a22537k6974q7396B22147b25992A83963c3139k51483J6246N6922
11781b11454A0948b2644A73207H3629P1903k6220c5983j48065j55715B5289K4254
11770D9543b85775e5139j25688Q0354A1391b28569O5948c9318k5904A75160a89215
11758i8208j87672c7900H9965a79275B44548i5440B3761J41997b25101o1309E4324
11746d87158G0987A2942J41079C6558K3119K36276C1382J0368O8413K99167d3734
11734D948K18083c31135B39551j6450b93128H0335J5485k9673J27770a64952O3142
$$ y = [-96456, 2059, -11029, -5533, 131043, -111185, 261072, -330961, 17046, -65273, 113072, 114802, 250834, -22154, 39838, 220586, -253768, -230218, -4771, 227110, 349298, -181452, -251814, -122537, -149511, -236907, 222147, -225992, 183963, -33139, -284622, -268376, -211454, 10948, -22644, 173207, 83629, 155532, 129312, -35983, -184048, -339763, 25289, 49543, -285775, -55139, -180827, -100473, 11391, -228569, -162621, -39318, -65222, 175160, -189215, -98208, -285880, -37900, 89965, -179275, 244548, -95440, 23761, 165758, -225101, -286410, 54324, -487158, 70987, 12942, 154021, 36558, 59677, 295953, 31382, 41750, 110163, 409330, -43734, 4948, 223031, -331135, 239551, 223101, -293128, 80335, 95820, 66147, 193917, -164952, -101810]
11723a01810D385J74009M360g2121J2104j99603f8952j7900k14521a07426A7603
11711d4933A6594b22019B15852K40555b55781A55876a19781q5418B15038a22658
11700A66107a91639R4478A13160l3198J86400e4151A68455B5433R53b95631q1916
11689c77547C1693M10486a91397K024g8090B63680i9226g233C1358a50422e5132
11677B7859f1863B47750I2420m2302i4870n283j94496B70674A22658K0399k7712
11666A15345N2511b11316D6995c5522o4142H7096h0984b998l2092j0352C20269
11654d1957J8291m2386r5604e9958j10600C49798f771j75463A23358C2676O1704
11643I4380J33311a26703B07080a18578r163j32002e8106F9874c07335a22013
$$ y = [-101810, 4385, 178394, 182754, -72121, -60017, -259620, -68952, -86852, -301373, -107426, 17603, -44933, 16594, -222019, 215852, 456407, -255781, 155876, -119781, -205199, 215038, -122658, 166107, -191639, -97161, 113160, 79962, 266362, -54151, 168455, 25433, 26386, -295631, -377547, 31693, 442179, -191397, -189373, -78090, 263680, -99226, -7233, 31358, -150422, -55132, 27859, -61863, 247750, 92420, 50118, -94870, -100153, -294649, 270674, 122658, 143057, 115345, 167856, -211316, 46995, -35522, -99664, 87096, -80984, -2998, -35090, -45442, 320269, -41957, -23666, -66052, -161656, -59958, -170558, 349798, -6771, -182234, 123358, 32676, 94380, 227691, -126703, 207080, -118578, -127741, -259743, -58106, 69874, -307335, -122013]
11632b25893Q9180C5685a28940o8401L5625d2001o1695B82542a35687n8830B08259
11620A08978J4238i0924j19592O4880j38122h9624C87719g8629K8866A28217b95536
11608D1650J12923b988r689l0732B22137h2536A13101K65002b06194C2097J26338
11597A58435a25709j54115d2228m106C658a17148M401d4018a7125H2547a38472
11585h1532A25338M4857i2719k38727C74068A25862J29657A7019J07829a44083
11574A84093o9454b9746B02779g6109j78935C02890j02245L2391G8243L2168b4404
11562I8492c50410A63918J64813B6949c0053j28121r8929A05029e2003l81958
11552d33961i5577A46003J079c4573a716G9056C3931a12650i46j53795A49865
$$ y = [-225893, -136713, 35685, -128940, -197341, -161716, -42001, -103696, 282542, -135687, -194517, 208259, 108978, 123216, -90924, -210516, -145636, -283758, -89624, 387719, -78629, -49763, 128217, -295536, 41650, 154573, -2988, -12677, -43409, 222137, -82536, 113101, 378103, -206194, 32097, 158435, -125709, -279824, -42228, -46334, 3658, -117148, -112747, -44018, -17125, 82547, -138472, -81532, 125338, 170195, -92719, -331446, 374068, 125862, 255519, 17019, 124848, -144083, 184093, 114639, -29746, 202779, -76109, -255044, 302890, 200645, 233036, 78243, 110411, -24404, 98492, -350410, 163918, 328731, 26949, -30053, -158174, -257103, 105029, -52003, -433961, -95577, 146003, 147082, -34573, -1716, 79056, 33931, -112650, -946, -154741, 149865]
11540A50746G4735h0819J8274B12618D2816b35034I4939i6598m3349A01391e1576
11528D3362d740A7729J09076J94894A09604J05283q4896o3904b51064O6333F2658
11516C7111b00422g8327j51801G5879K41636j6948a44468C32881J27307A1019
11505E8413a20442l1308A99433J06458e2055J6794A13613l5600J71641g3801C2919
11493B198M45250C1954P2531M37360B11605f5335A04079J73053L10405B39691
11482B2857J19712B4920c46523D48824a25068D4766J90122m3423H3874M4365J43425
11471B71664H1294B2982K60455l0919B146J59588J78048e4366C41023A62328J27006
11460B89334K36260G1405K69322a2708B98082a03738e0796B18899g8906A86262
$$ y = [150746, 74735, -80819, -62545, 212618, 42816, -235034, 94939, -96598, -139947, 101391, -51576, 43362, -4740, 17729, 126805, 321699, 109604, 214887, 129991, 66087, -251064, -184731, 62658, 37111, -200422, -78327, -230128, 75879, 317515, 300567, -144468, 332881, 460188, 11019, 58413, -120442, -151750, 199433, 305891, -52055, -35261, 113613, 78013, 249654, -73801, 32919, 2198, 447448, 31954, 104485, 541845, 211605, -65335, 104079, 277132, 587537, 239691, 22857, 142569, 24920, -346523, 448824, -125068, 44766, 234888, 191465, 83874, 128239, 271664, 81294, 22982, 283437, 252518, 2146, 161734, 339782, -54366, 341023, 162328, 289334, 525594, 71405, 340727, -12708, 298082, -103738, -50796, 218899, -78906, 186262]
11449a27494A74216B1405h1492b3108j19183K1363e8797j25959d535G042a23118
11437E0009r205J90735L7545f0083A87917R2548I4797C0593K65478B1524a21220
11425F0629O5839f8726C46132A6325b01129A46757b20352a7261l41467D7200J04215
11414A51415M9096D3206B978c34683A2736b66920c5118o6237C7756h3313A2699
11402B6018J36326Q0207h8493A63290B7448a35114L9780D9760b02246G7897c1467
11390i0859a3816F352b45174J20955K8355A36573k5566B6085J50601H0051A4660
11378h4899C4039A0387P5093h0852k7981B11065E6032i7179j58824i0450a7052
11366a78489C5097a25149b9667A90151c19423a55268j08013d6952k02965a11838
$$ y = [-127494, 174216, 21405, -81492, -23108, -142291, -120928, -58797, -184756, -4535, 7042, -123118, 50009, 40804, 231539, 269084, -60083, 187917, 280465, 94797, 30593, 296071, 21524, -121220, 60629, 126468, -68726, 346132, 16325, -201129, 146757, -220352, -17261, -358728, 47200, 151415, 200511, 43206, 2978, -334683, 12736, -266920, -35118, -101355, 37756, -83313, 12699, 26018, 162344, 242551, -88493, 163290, 27448, -135114, -95334, 49760, -202246, 77897, -31467, -90859, -13816, 6352, -245174, -124219, -95864, 136573, 111007, 26085, 176686, 80051, 14660, -84899, 34039, 10387, 85480, -80852, -108833, 211065, 56032, -97179, -256003, -90450, -17052, -178489, 35097, -125149, -29667, 190151, -319423, -155268, -263281, -46952, -249917, -111838]
11355a87253A83347C4603b97156C97815a09207B8695a10900L5627B63350a79194
11344D0760g4359A92796b01402p2488A97372a18799B50083a76932j0955g190l115
11333a0305j94371M7281j69912o8107c2110n423o4719c6382R862B86666a1554
11321B00093O5143B144b38012C7202J84911g5497A23964d55288A13466a67856
11310C77082A7946h7520A82103h0778k13164C4432c9692a7964j74000A28356b88046
11298a48226d0365m7319B01428a74469G9503c11460A0811c59904a45135E7252
11287d4448I4625k5237a1356k54780d5671F1442N8621f8237c3293l217I5250a80113
11274g4418H335b0165j4402A781L17159a48812r1724B05456a29852A05171k3618
$$ y = [-187253, 183347, 34603, -297156, 397815, -109207, 28695, -110900, -75273, 263350, -179194, 40760, -74359, 192796, -201402, -273890, 197372, -118799, 250083, -176932, -187887, -7190, -10305, -204676, -157395, -327307, -395414, -32110, -37533, -102252, -36382, -26520, 286666, -11554, 200093, 265236, 2144, -238012, 37202, 222113, -75497, 123964, -455288, 113466, -167856, 377082, 17946, -87520, 182103, -80778, -293942, 34432, -39692, -17964, -191964, 128356, -288046, -148226, -40365, -87684, 201428, -174469, 79503, -311460, 10811, -359904, -145135, 57252, -44448, 94625, 69388, -11356, -266136, -45671, 61442, 120063, -68237, -33293, -36510, 95250, -180113, -74418, 8335, -20165, -34567, 1781, 318940, -148812, -240536, 205456, -129852, 105171, 81553]
11263H1553b59076c677k20490B1044K15659c4012j11899I8922L8674c5756j01240
11252a36996A59290E7202a77385G5379a86295k25305a50906A00818D6291h0817
11241a75966g3493a2159A49965b35050A57563b46811R3040g5121E8001a36973
11230a08294C190O5986b57579A30553c1351r8511j00003a14366d9030A42302E8614
11218a06283D0086L9371g7019F0561g3529H0919L8356a59007e3346C5209a13696
11206A03330J33545a87805F2647L16231b547j49983k5255A07919b85058I5440
11195a06823G9705a78692M7978A88900J52422A44487J13231c9681R177A57096
11184e094l72927R8383J6515d3197l41516A1967a42294E7517F313a73705B7227
$$ y = [81553, -259076, -3677, -224167, 21044, 236703, -34012, -145911, 98922, 137596, -35756, -136996, 159290, 57202, -177385, 75379, -186295, -411600, -150906, 100818, 46291, -80817, -175966, -73493, -12159, 149965, -235050, 157563, -246811, -153771, -75121, 58001, -136973, -108294, 3190, 69176, -257579, 130553, -31351, -129862, -229865, -114366, -49030, 142302, 58614, -106283, 40086, 79457, -77019, 60561, -73529, 80919, 119275, -159007, -53346, 35209, -113696, 103330, 236875, -187805, 62647, 378878, -2547, -152530, -177785, 107919, -285058, 95440, -106823, 79705, -178692, -130714, 188900, 341322, 144487, 257718, -39681, -30504, 157096, -5094, -378021, -279638, -263123, -43197, -384713, 11967, -142294, 57517, 6313, -173705, 27227]
11172a99698h8697I6360c19724g0996j5911E8623f1829p5984I2432K8737O8979
11161A90148b9324C3477a37862q0572H0486b13348d5148j91252g8616p3459B26617
11149A665b74837p796F3874b26201R7978d3542j3516A89498c11548a04373i44
11137A25815c2915l70775A0446d1659m2471K0520A00001M2697A5524K47383D3142
11125a21G3178J48665n8430f0956j72695I0699R4407A9790J26201k9973a7448
11113D9169J30835J03448q9409C7943M0234g7032B15809L44J62479i8414B12522
11101a75675a2185B43619F9546a3087H6604i787F5824J06623L7002J63803j62293
11090B10959N6945j8299F186N0541K85501A39951J43662M8314o4273c0025A65651
$$ y = [-199698, -88697, 96360, -319724, -70996, -86907, 58623, -61829, -137813, 92432, 121169, 190148, -29324, 33477, -137862, -218434, 80486, -213348, -45148, -236400, -78616, -152075, 226617, 1665, -274837, -282633, 63874, -226201, -128223, -43542, -57058, 189498, -311548, -104373, -944, 125815, -32915, -403690, 10446, -41659, -84130, -63610, 100001, 142698, 15524, 262907, 43142, -121, 73178, 221843, 163413, -60956, -233651, 90699, 185106, 19790, 145991, 116018, -17448, 49169, 180004, 283452, 194043, 37943, 78177, -77032, 215809, 216153, 378632, -98414, 212522, -175675, -12185, 243619, 69546, -13087, 86604, -9787, 65824, 172447, 209449, 373252, 210959, 267904, 249605, 6186, 56727, 342228, 139951, 283613, 331927, 267654, -30025, 165651]
11078G0071J57929k0986c79677A35890J30526J07255p097a33389B37199R8804
11068C36003D0931L79410O5556j30252K8187r5355J46259j8302I1703P9983L36435
11057E08121l3979K6513j17081J3237J23266B18418L13944J22978p6862p6582
11047E01896L80682j03995m7455j47466L35027j12679r2068J6853K66260l83638
11037F13417M78753k19552P3653j69445o7051j07011P3264n8938K10049j47871
11027F79268K3669k27707M0462m7325J35201l4134M67385l16414K72857l40719
11017F52543J70823j56250J02778C84816K79009J89942C23369L17524L7991l17241
11007C61643J72329K28607K63385D26227j7900J62808k02465J63203m4598L05460
$$ y = [70071, 228000, 207014, -379677, 135890, 266416, 373671, 366574, -133389, 237199, 336003, 40931, 420341, 485897, 355645, 383832, 288477, 434736, 416434, 91703, 171686, 508121, 474142, 500655, 383574, 396811, 520077, 218418, 532362, 655340, 578478, 501896, 882578, 778583, 731128, 583662, 918689, 806010, 713942, 730795, 997055, 613417, 1092170, 872618, 946271, 776826, 709775, 602764, 676028, 617090, 827139, 679268, 702937, 475230, 515692, 468367, 603568, 569434, 1036819, 720405, 993262, 652543, 823366, 667116, 769894, 384816, 663825, 853767, 323369, 640893, 678884, 361643, 533972, 762579, 1025964, 426227, 408327, 571135, 368670, 531873, 487275, 792735]
10997G92735l47506L39265M4591j98944j81986O1744L25829m12835M15646l13768
10987E24771L49017l74549L05658L1242j58322n8476N69786E81417J90066M43744
10977A215227m42319L60547j80358J06111J82351n8954N96588J43131K63671J69510
10967B355505K33635L03583R9749J54669r5333j49348k06762n50865L0717p19177
10957A456373Q478j51280R1256J73221n7073l11648K02897j64577P9622j99914
10947A127355M0125k36511K7436k00700k18542n9704j99895M06261C29283j37841
10937A91442n4872r290J24336k6563C6484i428C5619J03612J3409k01L65298j72023
10925C45714o9499B0574B774L5824a21772B42659F3539i7256L2523B5854b52163
$$ y = [792735, 445229, 784494, 829085, 630141, 448155, 509899, 835728, 422893, 838539, 524771, 873788, 499239, 804897, 836139, 677817, 619341, 1189127, 581417, 771483, 1215227, 772908, 1133455, 953097, 1059208, 1241559, 1182605, 1779193, 1922324, 2185995, 2355505, 2589140, 2892723, 2992472, 3147141, 3051808, 2902460, 2695698, 2144833, 2175550, 1456373, 1464851, 1313571, 1404827, 1578048, 1520975, 1209327, 1412224, 1247647, 1327269, 1127355, 1167480, 930969, 958405, 757705, 539163, 479459, 279564, 685825, 329283, 191442, 136570, 127280, 251616, 225053, 36484, -9428, 35619, 139231, 152640, 152439, 517737, 345714, 276215, 20574, 2774, 38598, -121772, 242659, 63539, -97256, -64733, 25854, -252163]
10913G8403b08094A08527J05509b2542A75659b01485g4145r2821A67295J00470
10903B67765J19459a67221f467l31130C6401K48509n2024b35417B3566f6172k1941
10892h8113l1826e5642I9630B8327a07645A6599K7157i1516A16596d2353j61717
10881b04070K7639a9463p209j80753A90622L0502A9850M0803b0038E3555d08643
10869A172c02386i1069B85865I9880f3633G5166k8694c42119C4146a95327K3669
10858a71658f9222A25860A4275e0835m6644k48281A83541J62940H4572R7216L2455
10847B14243c53526f4290l8065j64034B89282j35244I212M6323J67815b29863
10836a0395m17234g5972D3583J71063a43553f8301A50406O4011j01202c986j39788
$$ y = [78403, -208094, 108527, 214036, -22542, 175659, -201485, -74145, -166966, 167295, 267765, 387224, -167221, -6467, -337597, 36401, 284910, 232886, -235417, 23566, -66172, -88113, -119939, -55642, 99630, 28327, -107645, 16599, 43756, -91516, 116596, -42353, -204070, -176431, -19463, -26672, -207425, 190622, 221124, 19850, 60653, -20038, 53555, -408643, 1172, -302386, -91069, 285865, 99880, -63633, 75166, 46472, -342119, 34146, -195327, -171658, -69222, 125860, 14275, -50835, -97479, -345760, 183541, 346481, 84572, 181788, 214243, -353526, -64290, -102355, -266389, 289282, 154038, 9212, 55535, 223350, -229863, -10395, -427629, -75972, 43583, 214646, -143553, -68301, 150406, 214417, 113215, -3986, -143774]
10825a43774e642p4145a2097A36981d7510n3820A8206N0399b28062Q4829l8433
10814a81666b8833j21618H4716d9291a3059k98186D1830b1695j54061G5459c92934
10802g9801r6370p8952C9526a51567D1646A8251a08949o9310q0898f6457b8400
10790a32096j63217C45320B6551c10161g9032R320G3199j9392a42318k34330E7464
10778a23040j3407j22779J01484j31988Q0616i6748A90087a19372B02335j6384
10768A85951a42014A29187F2824K4082L1526b35879F3900a24958m364A3627b75156
10756b43848N8327k40662B08489c25132i2426A37531F5806h0512n0461k3030J607
10745a52396f6872A89068p9448d9935A05216k2951a10483A40942L3080c82275
$$ y = [-143774, -5642, -79787, -12097, 136981, -47510, -101330, 18206, 68605, -228062, -143233, -181666, -28833, -150451, 84716, -49291, -13059, -311245, 41830, -21695, -175756, 75459, -392934, -79801, -176171, -255123, 39526, -151567, 41646, 18251, -108949, -178259, -259157, -66457, -28400, -132096, -295313, 345320, 26551, -310161, -79032, -69712, 73199, 53807, -142318, -376648, 57464, -123040, -136447, -259226, -157742, -289730, -209114, -96748, 190087, -119372, 202335, 185951, -142014, 129187, 62824, 86906, 118432, -235879, 63900, -124958, -129322, 13627, -275156, -243848, -185521, -426183, 208489, -325132, -92426, 137531, 65806, -80512, -130973, -154003, -152396, -66872, 189068, 109620, -49935, 105216, 82265, -110483, 140942, 174022, -382275]
10734A54982b00074g0776G2056b65842A26269k212a27610A44333a90101A2034
10723c34698a1530j70940F6639J15796C7854M00522A64164a38515A1406l599b62309
10711G8781b26818c5526B05408G6833h0633k03796i014j27379b0628j4204j34354
10700a69186B3815e4483A7851c7606k19960l79J021C89907a09770m727j3999E1038
10687A22004c10605o2281A37213a21848B14476K9903a17672n0854A74090L8791
10677B12881f1148C24082b53473q1865a15334F989a5566j30706E1798b62068A39270
10665a34376A2443R2973B0828J31542A4173L32929A5674J18407m2013c1585j45273
10654a76858A1039J40957a7854m2765m3826d023r4195A37513A5382a87026A1364
$$ y = [154982, -200074, -70776, 72056, -265842, 126269, 124057, -127610, 144333, -190101, 12034, -334698, -11530, -182470, 66639, 182435, 37854, 438376, 164164, -138515, 11406, 7807, -262309, 78781, -226818, -35526, 205408, 76833, -80633, -284429, -9014, -136393, -20628, -34832, -169186, 23815, -54483, 17851, -37606, -257566, -257945, -256924, 389907, -109770, -114497, -128496, 51038, 122004, -310605, -372886, 137213, -121848, 214476, 244379, -117672, -168526, 174090, 212881, -61148, 324082, -253473, -335338, -115334, 6989, -15566, -146272, 51798, -262068, 139270, -134376, 12443, 105416, 20828, 152370, 14173, 347102, 15674, 134081, 92068, -31585, -176858, 11039, 151996, -17854, -60619, -104445, -4023, -98218, 137513, 15382, -187026, 11364]
10642c94624a90019G1626N7666J21936a742l38194D1156J10531h9845B44358j10787
10631A33571l4001L27361a89363O142b8823l212j55831J0539j71541g6738j86522
10620b63260E7358b60485A02921m1873f9344A09489a86110C5408a76406O9690
10610a06716J8881l23449A34228c5480A39704a27035a6915B81409b5130D5235
10599A59870d18878a13762c6467q1016Q871j70611F8354a21608a4452j9620D3446
10587A03958m7315J26549c88127g8955K5231n524m7184B3837J41822j2890d62347
10575A14933a33239B53939i2071k1257G7422C8219J00215b05991p0022b1785l40960
10564c62745B3018A0369l584a56871L95A56891B0993b2904B82J70217M0095R1697
$$ y = [-394624, -190019, 71626, 129292, 251228, -1742, -339936, 41156, 151687, -89845, 244358, 133571, 99570, 426931, -189363, -183221, -28823, -32035, -187866, -177327, -348868, -76738, -263260, 57358, -260485, 102921, 61048, -69344, 109489, -186110, 35408, -176406, -106716, -87835, -411284, 134228, -35480, 139704, -127035, -16915, 281409, -25130, 45235, 159870, -418878, -113762, -36467, -117483, -108612, -279223, 68354, -121608, -14452, -34072, 43446, 103958, 56643, 183192, -388127, -78955, -53724, -59248, -106432, 23837, 165659, 152769, -462347, 114933, -133239, 253939, -92071, -113328, 77422, 38219, 138434, -205991, -276013, -21785, -362745, 23018, 10369, 6785, -156871, -156476, 156891, 20993, -22904, 282, 170499, 210594, 302291]
10552C02291b33807K8650J1459L9296D0992b68701J01327o4936O2114c3078G2943
10540C94415A80897c24917k10932A63458a43611r8858A79132C163e901j24230
10530a30131C0958a53831A64512b21419R6335l4801A26781C9091J4155L480d1977
10518c9755A81891a25342b0266A88074a47535K9913a6405A09743b6219q8805j82024
10507b97048O1076P8270b8675r6138I801N6391P6197d7074m10491d375B4363c08680
10494A5497J17304i5122C13611C0261b52797B22303r8978j2274g1232l51532a03213
10482A80748a66781D7925a19491e4441A73897a35502A83453j4580k5741L91743
10472E34875j25083A46927E5178J41213b78877A169a84802B04175c6315o365A39055
$$ y = [302291, -233807, -205157, -193698, -154402, 40992, -268701, -167374, -232310, -170196, -33078, 72943, 394415, 180897, -324917, -535849, 163458, -143611, -242469, 179132, 3163, -5901, -130131, 30958, -153831, 164512, -221419, -125084, -159885, 126781, 39091, 53246, 56726, -41977, -39755, 181891, -125342, -20266, 188074, -147535, -117622, -16405, 109743, -26219, -115024, -297048, -235972, -157702, -28675, -124813, 9801, 66192, 142389, -47074, -457565, -4375, 24363, -308680, 15497, 132801, -95122, 313611, 30261, -252797, 222303, 123325, 111051, -71232, -422764, -103213, 180748, -166781, 47925, -119491, -54441, 173897, -135502, 183453, 168873, 143132, 534875, 409792, 146927, 55178, 196391, -278877, 1169, -184802, 204175, -36315, -42680, 139055]
10460b28958b662j56529K1515A6292a44793A4274O8449F379N706b40694G2259
10448a66050D7146L1599L42627h7293p8994B3700h1725K436A81422d58374H3924
10436D9287J89777b34186Q9230B2607j47I998c5034k30323C08356h7128j30457
10425b17585K4448m5292j1859R9419r9950A31920a49709G3312J10910B7306c41749
10413D5331J03882Q1230A00679m6075K06187a50698L0730L0982a3894K920k2558
10402c3532A19391a35348L1660m01445a76217A16123J18798C2306J30427J85439
10392C48172e3094a435A52225D2546b28623A69887B0615K2758J8332a01982A0998
10380b52750H2869i8547A57958K15400E5296O9483L78E7248J52695j8352J87383
$$ y = [-228958, -2662, -159191, -137676, 16292, -144793, 14274, 82723, 6379, 12085, -240694, 72259, -166050, 47146, 78745, 421372, -87293, -166287, 23700, -81725, -79289, 181422, -458374, 83924, 49287, 239064, -234186, -144956, 22607, 22460, 9998, -35034, -265357, 308356, -87128, -217585, -193137, -238429, -250288, -150869, -250819, 131920, -149709, 73312, 184222, 27306, -341749, 45331, 149213, 230443, 100679, 54604, 260791, -150698, -119968, -88986, -13894, -10974, -33532, 119391, -135348, -103688, -505133, -176217, 116123, 234921, 32306, 162733, 348172, -53094, -1435, 152225, 42546, -228623, 169887, 20615, 43373, 61705, -101982, 10998, -252750, 82869, -98547, 157958, 373358, 55296, 124779, 125157, 57248, 209943, 191591, 378974]
10369C78974j18829H9255J61978J47128q8293J37689j8881N6745j64628J64854
10359D85847J55115k22535K2868j05778j00048p9176P6002C5693a8071d154B00657
10347A15089M06150j80081L49417k84263k1404A60028K03055n1729m3775J6477
10337B84056J0382P5759j00920m0866a4625B66848Q3445r7968n3145m5252D139
10325a36704C86821A19906O2673o6604N1789J20467B0415M23015l5787j14985
10315B92658F9834K11035A30294J13783J04334B1959K18076a32435J1056H4826
10304b43371B78525B4464b04962K7804C4173k050b51065A43231C4795c73691J57420
10293b16271c6337J7538G2276K79457a64896d9359I7942D4429i6403k3633L4360
$$ y = [378974, 260145, 89255, 251233, 398361, 310068, 447757, 428876, 485621, 320993, 485847, 640962, 418427, 441295, 335517, 235469, 156293, 232295, 35693, -18071, -4154, 200657, 115089, 521239, 341158, 690575, 406312, 384908, 160028, 363083, 311354, 267579, 284056, 294438, 370197, 269277, 228411, -14625, 266848, 350293, 252325, 199180, 153928, 4139, -136704, 386821, 119906, 182579, 115975, 167764, 288231, 20415, 443430, 407643, 292658, 69834, 280869, 130294, 244077, 348411, 21959, 240035, -132435, -121379, 84826, -243371, 278525, 24464, -204962, -177158, 34173, 32123, -251065, 143231, 34795, -373691, -216271, -36337, -18799, 72276, 351733, -164896, -49359, 97942, 44429, -96403, -120036, -85676]
10282h5676G7452b58301A41303b75661P0297i7679j19603H4031b18346g8013k11836
10271b89849J03050d8015m359D5386a45153J9278B76524h6520N682j62181A28254
10259A66360c867B49003J16651e3938l9791H0620Q4532b1902A46882R8673J82799
10248D28354A4847i9629A18646g6680B11668m3785o0764b44545B50189g4766H7026
10236a54084A03874Q5054a38393d2171J6606l32956h8429B23523b47028A25532
10225i8750l56851B01933f0103B04658a32847M2577j51832C37109F4456b05704
10214b69766A45327i0722P137Q259q7702E5613a3800j1457p9339a4507k85479
10203b99986g0971G9019k7806d54709b01546N9508C0683i0600a3865o9467j01314
$$ y = [-85676, 77452, -258301, 141303, -275661, -205364, -97679, -217282, 84031, -218346, -78013, -289849, -186799, -48015, -52374, 45386, -145153, -125875, 276524, -86520, -80838, -243019, 128254, 166360, -3867, 249003, 365654, -53938, -93729, 80620, 165152, -21902, 146882, 245555, 428354, 14847, -99629, 118646, -76680, 211668, 167883, 107119, -244545, 250189, -74766, 87026, -154084, 103874, 188928, -138393, -42171, -25565, -358521, -88429, 223523, -247028, 125532, -98750, -455601, 201933, -60103, 204658, -132847, -90270, -242102, 337109, 64456, -205704, -269766, 145327, -90722, -83585, -75326, -163028, 55613, -13800, -25257, -104596, -14507, -299986, -70971, 79019, 51213, -454709, -201546, -142038, 30683, -90600, -13865, -83332, -184646]
10192a84646Q3055k88650J22508A8435b09701j31779r448f4503j04411C1454b83068
10180b12022I7046b05391d9651I2547a79314j87425J07092R1888c5605D51948
10169a64050A4523b51092C5295b23784a3145E8311b65553h015B34633f5730j17499
10158a83229Q8048L3730A88848A8210a47152r9467a03390f400l28593B0011J10674
10147A30685j9567a37159O4229K0434b4192C57306j60796d7864j564C29685a60976
10135b53172E0361J37309a07222D5959M5131b13146a3813j58046b746A43249M6744
10124A89993e9073C73497f0320B48433g3247I176a22946k39908G9496c58535I7333
10112B7552c78497G4527P7587b19469D7035e2048m20741a9204j22729c4236k278
$$ y = [-184646, -101591, -390241, -267733, 18435, -209701, -341480, -350928, -64503, -168914, 31454, -283068, -212022, 97046, -205391, -49651, 92547, -179314, -366739, -259647, -167759, -35605, 451948, -164050, 14523, -251092, 35295, -223784, -13145, 58311, -265553, -8015, 234633, -65730, -183229, -95181, -61451, 188848, 18210, -147152, -246619, -103390, -6400, -334993, 20011, 130685, 111118, -137159, -72930, -52496, -24192, 357306, 196510, -47864, -49428, 329685, -160976, -253172, 50361, 187670, -107222, 45959, 91090, -213146, -13813, -171859, -2746, 143249, 189993, -59073, 373497, -60320, 248433, -73247, 9176, -122946, -362854, 79496, -358535, 97333, 27552, -378497, 74527, 152114, -219469, 47035, -52048, -472789, -19204, -141933, -34236, -36514]
10101c6514B39075A6374b72766J08418A10769a02483H9273a55198m7650q8608
10091b91456c6751j58510Q8858C5210b46318a08512l86806a61074A26758a42510
10080C629O870h9414j51750I3809e4244k56742R3694A57688C5324f0886m3190
10069a04076K8037j3486a7159j31017c6885k8933b4640o4357b1077c349n3995
10058e7344A78715a78457G9532Q8500O2819C3003J84253a35398L0361D8032b6257
10046B8947H584a79630b4346j22332D0795f5845G8388a12478N5807p5161A03214
10034c54407A62952e10300b33025j62397a86657j64840c3007k2070q5197e691
10023A11135K0397a1961D1009a25259B02914a20578K7331o7778A05733b7823r6540
$$ y = [-36514, 239075, 16374, -272766, -164348, 110769, -102483, 89273, -155198, -202848, -291456, -36751, -195261, -106403, 35210, -246318, -108512, -495318, -161074, 126758, -142510, 3629, 10499, -89414, -241164, 93809, -54244, -310986, -217292, 157688, 35324, -60886, -104076, -76039, -89525, -17159, -148176, -36885, -65818, -24640, -88997, -21077, -3349, -57344, 178715, -178457, 79532, 168032, 230851, 33003, 217256, -135398, -105037, 48032, -26257, 28947, 8584, -179630, -24346, -146678, 40795, -65845, 78388, -112478, -56671, -131832, 103214, -354407, 162952, -510300, -233025, -395422, -186657, -351497, -33007, -55077, -140274, -5691, 111135, 131532, -11961, 41009, -125259, 202914, -120578, -93247, -161025, 105733, -27823, -124363]
10012a24363L2143G2626b43077e8269k0310B20919c8667G7412O7832a58006D3109
10000G3723h0359A24131i5537a3556A5052f8744G0131a38409k05073f4426o9304
9989a33730q6963R70A37363a99035P6792C80795F5875J25688e0154k25914Q1141
9978a94927C4752A3049a20237a8197G2281b03901N500M0366M0071K6198k1310
9967a13076N3811C1992e22698a49910f8308k2530H2734B1078b14009E3828a16749
9955f7500M191k41367B2595Q7470b54253A08658a99340p4760d5099M099I9336
9943b22436i0451i448r5716n4911a0951j12898q6553c5916E6706c82102g1072
9931a29651F65J52492f4238k17165q6794H9595a28247k514A349a52988G1871a79255
$$ y = [-124363, -92220, 72626, -243077, -58269, -78579, 220919, -38667, 77412, 145244, -158006, 43109, 73723, -80359, 124131, -95537, -13556, 15052, -68744, 70131, -138409, -343482, -64426, -133730, -220693, -219723, 137363, -199035, -122243, 380795, 65875, 191563, -50154, -276068, -194927, 34752, 13049, -120237, -18197, 72281, -203901, -198401, -158035, -117964, -91766, -113076, -59265, 31992, -522698, -149910, -68308, -90838, 82734, 21078, -214009, 53828, -116749, -67500, -63309, -304676, 22595, 110065, -254253, 108658, -199340, -274100, -45099, -41000, 99336, -222436, -90451, -9448, -105164, -160075, -10951, -123849, -210402, -35916, 56706, -382102, -71072, -129651, 665, 153157, -64238, -281403, -368197, 89595, -128247, -130761, 1349, -152988, 71871, -179255]
9918B8325p968e652k22199C77931a40377G4280b3644A552a16677a5444E1080g6001
9905C01965d4981A0812b09401H1117e3934A8740R1390k8234b59604f7639j21093
9894a88732A58597a85308N140F2123b0508l5059l3058A20442d29063A6207a14097
9882A5231N1866a26832N5608i291l2573m67972A7761K14717a40273o3903j23041
9871c27217b4060k284l05679M2886f925D7650f83l3025j14222d1983E3722J22793
9859A76515f763n7021m0504q7879c5030k07447A47947a50884j70533A0512a90168
9847g1902k3773B09629i978F0796O2701J51396a27857L3564H5231d49898a82084
9835E8522a57741E8908B0601b05082i319r5587o0280a3037j92806A01029a67287
$$ y = [28325, 20357, -5652, -227851, 377931, -140377, 74280, -23644, 1552, -116677, -15444, 51080, -76001, 301965, -44981, 10812, -209401, 81117, -53934, 18740, 110130, 81896, -259604, -67639, -188732, 158597, -185308, -180168, 62123, -20508, -55567, -88625, 120442, -429063, 16207, -114097, 15231, 67097, -126832, -71224, -9291, -41864, -509836, 17761, 232478, -140273, -204176, -327217, -24060, -26344, -332023, -289137, -6925, 47650, -683, -33708, -147930, -41983, 53722, 176515, -6763, -63784, -104288, -192167, -35030, -242477, 147947, -150884, -321417, 10512, -190168, -71902, -95675, 209629, -9978, 60796, 123497, 274893, -127857, -94293, 85231, -449898, -182084, 58522, -157741, 58908, 20601, -205082, -9319, -104906, -165186, -13037, -205843, 101029, -167287]
9823d31011i0714l37560A48720L1917a73352k9989o681M6615J7831B28710a76175
9811b95218B59393F3973c46656B48416a94827F3769j5162a00583k08813J36800
9801a72596l5234C7517B917a12960L7343j34199f0218b5710m98736q818d5088
9789a78377j22885E6556e0977k76256m4193A39580a01861k36900a0924q4208n4141
9778a49273N2359L8922a4963m4799A83830a16925l9301C78368b579j8188j39834
9767a60601A11408P458Q2293b98654j50572A19009c16563K4602g0847D2837b44814
9755H8827L33854f543A9915L0962K66859d2453l11977a38375f6936j39406B9340
9743b43687E4447c778j74720C16128G8747m531l0204I767O2479b53636A04348
$$ y = [-431011, -90714, -428274, 148720, 180637, -173352, -203341, -210022, -163407, -145576, 228710, -176175, -295218, 259393, 63973, -346656, 248416, -194827, 63769, 48607, -100583, -309396, -172596, -207830, 37517, 2917, -112960, -75617, -209816, -60218, -25710, -524446, -533264, -45088, -178377, -301262, 56556, -50977, -327233, -371426, 139580, -101861, -338761, -10924, -95132, -149273, -96914, -57992, -14963, -59762, 183830, -116925, -156226, 378368, -2579, -20767, -160601, 111408, 118866, 201159, -298654, -449226, 119009, -316563, -291961, -70847, 42837, -244814, 88827, 422681, -6543, 19915, 50877, 317736, -42453, -354430, -138375, -66936, -206342, 29340, -243687, 54447, -3778, -178498, 316128, 78747, 74216, 44012, 9767, 72246, -253636, 104348]
9731e6188A40829a5771k67323k05880J65484c5992r1562l7160D1738c10061A81359
9719h2502n9544l0647d4814j50804A65845a99882G0733M284o349J11491c06491
9707B48270j1173b9180A9608a77592B299R055b6032a2199o5984r3225h1453h875
9694b94530B4755a74281A57504a48076h073k00777B19911a48519M7595L4959C3324
9682c59408h3440j01909j46768M735J56911Q0159k13585A07259B9252g9836J2396
9671f7440b194F9565J17358b83911R9192o4744P1341A09155b46945e3556E0752
9659b42447c4334A36536d0480l16216A36078n0778i7955m2632I4600C0751a67856
9647G0698J0239b99158A97633d7199D0348a21095O439C0487K1429c7023A18603
$$ y = [-56188, 140829, -15771, -283094, -488974, -323490, -35992, -127554, -164714, 41738, -310061, 181359, -82502, -142046, -172693, -44814, -195618, 165845, -199882, 70733, 75017, 68668, 180159, -306491, 248270, 237097, -29180, 19608, -177592, 2299, 11354, -26032, -12199, -78183, -171408, -81453, -8875, -294530, 24755, -174281, 157504, -148076, -8073, -208850, 219911, -148519, -100924, -65965, 33324, -359408, -83440, -185349, -332117, -327382, -170471, -90312, -303897, 107259, 29252, -79836, -67440, -2194, 69565, 186923, -283911, -184719, -249463, -178122, 109155, -246945, -53556, 50752, -242447, -34334, 136536, -40480, -356696, 136078, 85300, -97955, -140587, 94600, 30751, -167856, 70698, 80937, -299158, 197633, -47199, 40348, -121095, -114656, 30487, 51916, -37023, 118603]
9635B05293e1922a8119k53086E5015a02927b2450r5955a332j15300H2850c33778
9623b88928h3993L5032l9984o5481B1385a32757j55574i0463A44094f6528c3258
9611B09025d9266k06128J6793m6764L2252A26886b96679B10762D0346i7291k57801
9600c55092A85504b07626A72959a38368m9418k638B0639d57804A2074b63035p6688
9589c39723A40801L3961D5355J2839J01652k1415c07631d3858B68304a59321f7023
9577c4820j69081p373H7986a72958Q6021m568m0874D2259b339k69982L1915a15780
9564D6941B3325a52582A94693a89828h2302B11897b16406B2006a49764k13401
9554c63165b1000j94920e4129G2264l2391M06N4821b08014H9183c74978a31105
$$ y = [205293, -51922, -18119, -271205, 55015, -102927, -22450, -118405, -1332, -116632, 82850, -333778, -288928, -83993, -48961, -88945, -154426, 21385, -132757, -288331, -90463, 144094, -66528, -33258, 209025, -49266, -255394, -238601, -285365, -253113, 126886, -296679, 210762, 40346, -97291, -355092, 185504, -207626, 172959, -138368, -187786, -190424, 20639, -457804, 12074, -263035, -339723, 140801, 174762, 45355, 58194, 159846, 138431, -307631, -43858, 268304, -159321, -67023, -34820, -203901, -211274, 87986, -172958, -86937, -91505, -132379, 42259, -2339, -272321, -240406, -115780, 46941, 23325, -152582, 194693, -189828, -82302, 211897, -216406, 22006, -149764, -363165, -21000, -215920, -54129, 72264, 39873, 40279, 95100, -208014, 89183, -374978, -131105]
9542A03533M1404J85153b14604B28129j770b53466E7428i5945k960J9107R686
9531g0112m06134E8782N9754a41007k370A60955G7389l4746h6077B63767B0185
9519f5990n8382q3090O1691f4309A87788a97601C17617g8065I881i8940H4447
9507a84746B4695k01q594h2766A96171b1624A6792a55418M8844n0803R204k7408
9495a75581A1237a47789B26406a69976k0990B64345a66055f1550f364j727k16174
9484b24265i8258G9074c427p2077A39469a74241A81999p6008B6347a68689d337
9472d965j93871O0968j8675J298k79896F3422f3347k56784a23650e1571A62610
9460G1181h3041j41792g3860k8398B8417K1038d1498k05572A3269b27298J0875
$$ y = [103533, 144937, 330090, -214604, 228129, 226359, -253466, 57428, -95945, -98905, -79798, -70112, -476246, 58782, 118536, -141007, -143377, 160955, 77389, 42643, -86077, 263767, 20185, -65990, -124372, -207462, -145771, -64309, 187788, -197601, 317617, -78065, 9881, -98940, 84447, -184746, 24695, 24494, 15900, -82766, 196171, -21624, 16792, -155418, -106574, -157377, -148173, -175581, 11237, -147789, 226406, -169976, -190966, 264345, -166055, -61550, -6364, -8091, -224265, -98258, 79074, -3427, -75504, 139469, -174241, 181999, 105991, 26347, -168689, -4337, -4965, -198836, -137868, -156543, -155245, -435141, 63422, -63347, -320131, -123650, -51571, 162610, 71181, -83041, -224833, -73860, -102258, 28417, 49455, -41498, -247070, 13269, -227298, -216423]
9449b16423l0002a3565G550J08929C5614b7647l01616J56377c4121G7260g2606
9437a12754m3200B14378m9001G5840b01707e56C3625i7578j46964a0060k8367
9426c8427j69881R1107N1792J1008H7641b39958C0618a89802B3229a97475A44953
9414a5235o3549B85985a12986E767J77946k1564D9430h2585c8437J639B7322a63742
9401e8193j33199B1624d350A39339a4383A56908a32899j94487l5454Q8436q75
9390b75279a00582k10406i2445B50884e7037n107k33350A15396a32454A1708b5513
9378c86183c3404E8284d861j35414C8027a20995B2394b68822G2133a380q5868
9367h7248J5093A22827a56928A16092g1300B30959b13675h3313A03044a71318
$$ y = [-216423, -246425, -13565, 7550, 116479, 35614, -27647, -329263, -172886, -34121, 77260, -72606, -112754, -155954, 214378, 165377, 75840, -201707, -556, 33625, -97578, -244542, -10060, -38427, -208308, -117201, -65409, -54401, 87641, -239958, 30618, -189802, 23229, -197475, 144953, -15235, -78784, 285985, -112986, 5767, 183713, 162149, 49430, -82585, -38437, -36798, 27322, -163742, -58193, -191392, 21624, -4350, 139339, -14383, 156908, -132899, -327386, -362840, -274404, -275279, -100582, -310988, -92445, 250884, -57037, -62144, -295494, 115396, -132454, 11708, -25513, -386183, -33404, 58284, -4861, -140275, 38027, -120995, 22394, -268822, 72133, -1380, -87248, -72155, 122827, -156928, 116092, -71300, 230959, -213675, -83313, 103044, -171318]
9356A15518J87054a36370a9182r4955j43204O0738C9890b92421i4893B5557b35641
9344A28114a50717e5210P308I53R8161C444J02689e4504I2685a2243p9624D37559
9331a02733j18898c4056C41335c88341A7973b52300A72406g8210a3006j89775
9321b02781L9287E2377b16483A27596b40670q1868a47466j09497J13052B50914
9310C3257a47077A06174a16106b98A78648c0749l66741J93414C1484M9633c45709
9298d885j78316P2968D0805J83775h619j26641k64086h2029n586k88634I1680
9286b4763P567j3687A48954f9121j70497D8666b953F591i7439B0140a56013A82098
9273B3774L5167a49195J1605k693f832j492j26677L6779a8768l54640a57339f5362
$$ y = [115518, 302572, -136370, -19182, -114137, -257341, -196603, 39890, -292421, -94893, 25557, -235641, 128114, -150717, -55210, -47902, 953, 99114, 3444, 106133, -54504, 92685, -12243, -91867, 437559, -102733, -221631, -34056, 341335, -388341, 17973, -252300, 172406, -78210, -13006, -202781, -163494, 52377, -216483, 127596, -240670, -322538, -147466, -256963, -143911, 250914, 33257, -147077, 106174, -116106, -298, 178648, -30749, -397490, -204076, 31484, 81117, -345709, -4885, -183201, -110233, 40805, 224580, -8619, -135260, -399346, -82029, -87615, -376249, 91680, -24763, -17196, -30883, 148954, -69121, -239618, 48666, -2953, 6591, -97439, 20140, -156013, 182098, 23774, 58941, -149195, -137590, -140283, -6832, -8324, -135001, -98222, -18768, -373408, -157339, -65362]
9260b67705c5376A19372c17166a28867P084k50894C48129A66513p0334c117F2709
9248b98143M1635K3396A167b27976e0014r7945C3728O3401a71474g6412A42015
9236A14632J2460j2074R4601p1311b5760j0965k5715l15336E2093J05297j8243
9225A39147G00c37466B21581C0601d12765J35619B98230f710j31322m7691P7400
9214a08323B11500j00469b46835h1817j89798B83706A0375b5735B30137a01078
9203D522d1882j27679k15234O6185J30454k774B87376b6751j48802F2772b42992
9191A35612n872E5016a17079I6620C9685i8565G0834g103l6145j35895Q6483l6397
9179a29057A21836O1515b74338h2443M0527A09816h7235F330b6907A565a85353
$$ y = [-267705, -35376, 119372, -317166, -128867, -121783, -372677, 348129, 166513, 96179, -3117, 62709, -298143, -256508, -233112, 1167, -227976, -50014, -147959, 33728, 97129, -171474, -76412, 142015, 114632, 127092, 115018, 209619, 138308, -25760, -36725, -62440, -377776, 52093, 157390, 139147, 700, -337466, 221581, 30601, -412765, -277146, 298230, -6710, -138032, -185723, -108323, 211500, 111031, -246835, -81817, -271615, 283706, 10375, -25735, 230137, -101078, 4522, -41882, -169561, -384795, -318610, -188156, -190930, 287376, -26751, -175553, 62772, -242992, 135612, 129740, 55016, -117079, 96620, 39685, -98565, 70834, -7103, -43248, -179143, -92660, -129057, 121836, 183351, -274338, -82443, -41916, 109816, -87235, 6330, -26907, 1565, -185353]
9167a87620A26869c5621A3020e4114A42521b63788h1730j64298d47l86795A90237
9155a81834d0732p8425D8286a51783B25057b79744j82121a23076K7432a0389C5175
9143b28324J06369P983B70981a3640j11448A10960J9968O8877c54494J41385R6361
9132a16748m9389j73576C7948N9636a71812e3452B05717a98465a561n3483j30629
9121a85673E1715b38091A754N22431a0738A05895C7957i2439A68811b62174a4017
9109A17663l0423N1579e7559m7071l7494M1433A43721F6082b41061C28854H401
9097a87629d4141A09974k6920b98038R9899A6487J26376e5185K1094j18659J1650
9086a41100j66068A9009b00234N62O7895j01400J12546A29852C3176b24060Q8569
$$ y = [-187620, 126869, -35621, 13020, -54114, 142521, -263788, -81730, -246028, -447, -387242, 190237, -181834, -40732, -119157, 48286, -151783, 225057, -279744, -461865, -123076, -95644, -10389, 35175, -228324, -121955, -113972, 270981, -13640, -125088, 110960, 130928, 199805, -354494, -213109, -116748, -166137, -339713, 37948, 97584, -171812, -53452, 205717, -198465, -1561, -55044, -185673, 51715, -238091, 1754, 524185, -10738, 105895, 37957, -92439, 168811, -262174, -14017, 117663, 87240, 138819, -57559, -104630, -142124, -100691, 143721, 66082, -241061, 328854, 8401, -187629, -44141, 109974, 83054, -298038, -198139, 16487, 142863, -55185, -34091, -152750, -141100, -307168, 19009, -200234, -199672, -131777, -233177, -120631, 129852, 33176, -224060, -135491]
9075a35491H0894k8619g8202j32261B26694c44668G1020B9216c18959i1110c9226
9063a94919Q6559L6461A64683h3844D7287c79776R7120M0077J18687o1918B19743
9051i83A35922J5653G81R3617g7521j14287i4246p7585l5215O5296M0035G415
9038b5817A34057b58810N2867g1507k97643G9904d89911a10476a074B36850b4741
9026b28516A96636b16612a3303D11682A06871b06300C4321J83769B0454i5255
9015A10387b472F0252d5866B6338a50164C4966c45262c0228C249J4562m603c71808
9002c01502I7110L5966a01483A50686b85661A94898F2646a91777G453a75523m7836
8991b23359B6977J32879b37969A31824c47281a44674r9402e6064a1407E0157P260
$$ y = [-135491, 80894, 52275, -78202, -210463, 226694, -344668, 71020, 29216, -318959, -91110, -39226, -194919, -108360, -71899, 164683, -83844, 47287, -379776, -282656, -242579, -123892, -185810, 219743, -983, 135922, 151575, 781, 94398, -77521, -191808, -94246, -171831, -207046, -141750, -101715, 7415, -25817, 134057, -258810, -205943, -71507, -369150, 79904, -489911, -110476, -1074, 236850, -24741, -228516, 196636, -216612, -13303, 411682, 106871, -206300, 34321, 218090, 20454, -95255, 110387, -2472, 60252, -45866, 26338, -150164, 34966, -345262, -30228, 3249, 17811, 13208, -371808, -301502, 97110, 133076, -101483, 150686, -285661, 194898, 62646, -191777, 7453, -175523, -223359, 26977, 159856, -237969, 131824, -347281, -144674, -244076, -56064, -11407, 50157, 57417]
8980E7417a97208i4548k07476J25008A897b13047b9258E009J95926c66128P4282
8969b91846R4134a5675K97j46179A05039J96864b66027B14075e0727j80585c7459
8957e5613m8428a013A62814h5522B17111b4057q6813M1952J3711k4343c6013k69204
8945c05217P6873A82058a60397B06503H5396O5204a98288b866j18452A8485a39714
8933A42481D6792c14145b0301p5799A97422E0505c06621J3958q7272A76912a30423
8921C04538j28823K33869R71117K629549j739104D09677H4587a57066o8875H7304
8910d0349l112l29513B07002B4883J61397b82388A39308a81602k6753B07986I1510
8898F9122B3308J98399n7175b09105b0993j4672N137j65807G8634h2866E0397
$$ y = [57417, -197208, -94548, -302024, -177016, 1897, -213047, -29258, 5009, 200935, -366128, -291846, -197712, -15675, -15378, -161557, 105039, 301903, -266027, 214075, -50727, -231312, -37459, -55613, -104041, -1013, 162814, -85522, 217111, -24057, -110870, -68918, -55207, -79550, -36013, -305217, -228344, 182058, -160397, 206503, 85396, 150600, -198288, -2866, -121318, 18485, -139714, 142481, 46792, -314145, -20301, -96100, 197422, 50505, -306621, -292663, -379935, 176912, -130423, 304538, 175715, 409584, 1380701, 4010250, 2271146, 409677, 84587, -157066, -225941, 87304, -40349, -43461, -372974, 207002, 24883, 186280, -282388, 139308, -181602, -208355, 207986, 91510, 69122, 23308, 221707, 164532, -209105, -20993, -35665, -30528, -196335, 78634, -82866, 50397]
8886b87426C6977O6650B3263f5900j1439n483n1670F3314c55369a03171a7572
8874a2568j11627a7749j79636D8365J2789b34153A22532C7599f2174k4205M2082
8863d4297j25548P7496A7101O367a23443j39319C75691c40214c739G046J23266
8852A30312b62286M7385j24549R9988a14837H8792a14720k16739J32359c8415
8841i3226j29436r0051e7776q833f392n9978j77637A03913M5751c35888G7843
$$ y = [-287426, 36977, 103627, 23263, -65900, -77339, -82822, -134492, 63314, -355369, -103171, -17572, -12568, -124195, -17749, -197385, 48365, 61154, -234153, 122532, 37599, -62174, -86379, -44297, -169845, -92349, 17101, 23468, -123443, -262762, 375691, -340214, -3739, 7046, 130312, -262286, -214901, -339450, -239462, -114837, 88792, -114720, -331459, -199100, -38415, -93226, -222662, -312713, -57776, -66609, -6392, -66370, -244007, 103913, 149664, -335888, 77843]
$$ [...]
##END NTUPLES=NMR SPECTRUM
##END=
