##TITLE=NES1030_18715_9268428_lwIZUFAeM2
##JCAMPDX= 6.0         $$ Bruker NMR JCAMP-DX V2.0
##DATA TYPE= NMR SPECTRUM
##DATA CLASS= NTUPLES
##ORIGIN= BRUKER
##OWNER= Administrator
$$ 1.72 TOPSPIN		Version 2.1
$$ 2015-08-24 21:21:57.233 -0700  Administrator@X
$$ Compression mode = diff/dup
##.OBSERVE FREQUENCY= 400.02188249412
##.OBSERVE NUCLEUS= ^1H
##.ACQUISITION MODE= SIMULTANEOUS (DQD)
##.ACQUISITION SCHEME= undefined
##.AVERAGES= 64
##.DIGITISER RES= 22
##SPECTROMETER/DATA SYSTEM= spect
##.PULSE SEQUENCE= noesygpps1d.comp
##.SOLVENT NAME= COFFEE_meoh
##.SHIFT REFERENCE= INTERNAL, COFFEE_meoh, 1, 14.9632
##AUDIT TRAIL= $$ (NUMBER, WHEN, WHO, WHERE, PROCESS, VERSION, WHAT)
$$ ##TITLE= Audit trail, TOPSPIN		Version 2.1
$$ ##JCAMPDX= 5.01
$$ ##ORIGIN= Bruker BioSpin GmbH
$$ ##OWNER= Administrator
$$ $$ E:\/data/COFFEE/nmr/NES1030_18715_9268428_lwIZUFAeM2/22/pdata/1/auditp.txt
$$ ##AUDIT TRAIL=  $$ (NUMBER, WHEN, WHO, WHERE, PROCESS, VERSION, WHAT)
(   1,<2015-08-24 21:21:51.592 -0700>,<Administrator>,<X>,<go>,<TOPSPIN 2.1>,
      <created by zg
	started at 2015-08-24 21:10:21.842 -0700,
	POWCHK enabled, PULCHK disabled,
       configuration hash MD5:
       21 0F 79 D6 B3 7B B4 F6 88 20 88 DB 03 48 BD 9F
       data hash MD5: 64K
       90 46 2F D1 E6 99 71 A2 05 5F F2 62 F7 F5 3B 6E>)
(   2,<2015-08-24 21:21:55.108 -0700>,<Administrator>,<X>,<proc1d>,<TOPSPIN 2.1>,
      <Start of raw data processing
       efp LB = 0.3 FT_mod = 6 PKNL = 1 PHC0 = 0 PHC1 = 0 SI = 128K 
       data hash MD5: 128K
       63 EE 51 56 97 54 13 4E C1 23 5D 53 84 66 6E BB>)
(   3,<2015-08-24 21:21:55.998 -0700>,<Administrator>,<X>,<proc1d>,<TOPSPIN 2.1>,
      <pk PHC0 = -85.08362 PHC1 = 0 
       data hash MD5: 128K
       07 DF EB 38 16 4F A9 35 3F E1 0C 38 5E 36 E7 55>)
(   4,<2015-08-24 21:21:56.389 -0700>,<Administrator>,<X>,<proc1d>,<TOPSPIN 2.1>,
      <abs ABSG = 1 
       data hash MD5: 128K
       4F 44 D3 34 C7 BE 20 06 F5 C8 95 D7 A0 33 A3 28>)
(   5,<2015-08-24 21:21:56.498 -0700>,<Administrator>,<X>,<proc1d>,<TOPSPIN 2.1>,
      <abs ABSG = 2 
       data hash MD5: 128K
       52 A5 65 88 13 D0 1F 81 F2 85 84 98 B9 5E 74 A9>)
(   6,<2015-08-24 21:21:56.592 -0700>,<Administrator>,<X>,<proc1d>,<TOPSPIN 2.1>,
      <abs ABSG = 3 
       data hash MD5: 128K
       7C DB 17 02 E6 E6 5D F9 0C 26 DC 2A 22 60 51 13>)
(   7,<2015-08-24 21:21:56.686 -0700>,<Administrator>,<X>,<proc1d>,<TOPSPIN 2.1>,
      <abs ABSG = 4 
       data hash MD5: 128K
       64 51 F4 08 88 50 5C F5 C1 30 63 14 85 A8 36 CA>)
(   8,<2015-08-24 21:21:56.795 -0700>,<Administrator>,<X>,<proc1d>,<TOPSPIN 2.1>,
      <abs ABSG = 5 
       data hash MD5: 128K
       E8 B1 FD EB D9 99 FA 01 EA 15 6E B1 C6 D7 B7 4A>)
$$ ##END=
$$ 
$$ $$ hash MD5
$$ $$ 98 B7 8C E7 89 FF 38 BE 19 86 02 DA 93 23 AF B0
##$RELAX= 
##$RELAX= 
##$RELAX= 
##$RELAX= 
##$RELAX= 
##$RELAX= 
##$RELAX= 
##$RELAX= 
$$ Bruker specific parameters
$$ --------------------------
##$DU= <E:\>
##$EXPNO= 22
$$ [...]
150 150 150 150 150 150 150 150
##$TP07= 0
##$TPNAME0= <>
##$TPNAME1= <>
##$TPNAME2= <>
##$TPNAME3= <>
##$TPNAME4= <>
##$TPNAME5= <>
##$TPNAME6= <>
##$TPNAME7= <>
##$TPOAL= (0..7)
0.5 0.5 0.5 0.5 0.5 0.5 0.5 0.5
##$TPOFFS= (0..7)
0 0 0 0 0 0 0 0
##$TUNHIN= 0
##$TUNHOUT= 0
##$TUNXOUT= 0
##$USERA1= <user>
##$USERA2= <user>
##$USERA3= <user>
##$USERA4= <user>
##$USERA5= <user>
##$V9= 5
##$VALIST= <valist>
##$VCLIST= <CCCCCCCCCCCCCCC>
##$VD= 0
##$VDLIST= <DDDDDDDDDDDDDDD>
##$VPLIST= <PPPPPPPPPPPPPPP>
##$VTLIST= <TTTTTTTTTTTTTTT>
##$WBST= 2048
##$WBSW= 25
##$XGAIN= (0..3)
0 0 0 0
##$XL= 0
##$YL= 0
##$YMAX_a= 7768315
##$YMIN_a= -16489411
##$ZGOPTNS= <>
##$ZL1= 120
##$ZL2= 120
##$ZL3= 120
##$ZL4= 120
##$ABSF1= 14.9632
##$ABSF2= -5.594982
##$ABSG= 5
##$ABSL= 3
##$ALPHA= 0
##$AQORDER= 0
##$ASSFAC= 0
##$ASSFACI= 0
##$ASSFACX= 0
##$ASSWID= 0
##$AUNMP= <proc_prof1d_extract.lims>
##$AXLEFT= 0
##$AXNAME= <>
##$AXNUC= <1H>
##$AXRIGHT= 0
##$AXTYPE= 0
##$AXUNIT= <>
##$AZFE= 0.1
##$AZFW= 0.1
##$BCFW= 0
##$BC_mod= 0
##$BYTORDP= 0
##$COROFFS= 0
##$CY= 15
##$DATMOD= 1
##$DC= 0
##$DFILT= <>
##$DTYPP= 0
##$F1P= 0
##$F2P= 0
##$FCOR= 0.5
##$FTSIZE= 131072
##$FT_mod= 6
##$GAMMA= 0
##$GB= 0
##$INTBC= 1
##$INTSCL= 1
##$ISEN= 128
##$LB= 0.3
##$LEV0= 0
##$LPBIN= 0
##$MAXI= 10000
##$MC2= 0
##$MEAN= 0
##$ME_mod= 0
##$MI= 0
##$NCOEF= 0
##$NC_proc= -2
##$NLEV= 6
##$NOISF1= 0
##$NOISF2= 0
##$NSP= 0
##$NTH_PI= 0
##$NZP= 0
##$OFFSET= 14.9632
##$PC= 1
##$PHC0= -85.08362
##$PHC1= 0
##$PH_mod= 1
##$PKNL= yes
##$PPARMOD= 0
##$PPDIAG= 0
##$PPIPTYP= 0
##$PPMPNUM= 2147483647
##$PPRESOL= 1
##$PSCAL= 4
##$PSIGN= 0
##$PYNMP= <proc.py>
##$REVERSE= no
##$SF= 400.020008754919
##$SI= 131072
##$SIGF1= 0
##$SIGF2= 0
##$SINO= 400
##$SIOLD= 131072
##$SPECTYP= <>
##$SREGLST= <1H.CDCl3>
##$SSB= 0
##$STSI= 131072
##$STSR= 0
##$SW_p= 8223.68421052631
##$SYMM= 0
##$S_DEV= 0
##$TDeff= 65536
##$TDoff= 0
##$TI= <>
##$TILT= no
##$TM1= 0
##$TM2= 0
##$TOPLEV= 0
##$USERP1= <user>
##$USERP2= <user>
##$USERP3= <user>
##$USERP4= <user>
##$USERP5= <user>
##$WDW= 1
##$XDIM= 131072
##$YMAX_p= 434072420
##$YMIN_p= -10029
##$CURPLOT= <Network HP LaserJet P1505>
##$CURPRIN= <$Network HP LaserJet P1505>
##$DFORMAT= <normdp>
##$LAYOUT= <+/1D_H.xwp>
##$LFORMAT= <normlp>
##$PFORMAT= <normpl>
##$SURQMSG= 1
$$ End of Bruker specific parameters
$$ ---------------------------------
##NTUPLES= NMR SPECTRUM
##VAR_NAME=  FREQUENCY,     SPECTRUM/REAL,   SPECTRUM/IMAG
##SYMBOL=    X,             R,               I
##VAR_TYPE=  INDEPENDENT,   DEPENDENT,       DEPENDENT
##VAR_FORM=  AFFN,          ASDF,            ASDF
##VAR_DIM=   131072,        131072,          131072
##UNITS=     HZ,            ARBITRARY UNITS, ARBITRARY UNITS
##FACTOR=    0.0627417313425164, 1,          1
##FIRST=     8223.62146879497, -1088,        -54176
##LAST=      0,             -311,            -55281
##MIN=       0,             -10029,          0
##MAX=       8223.62146879497, 434072420,    0
$$ Real data points
##PAGE= N=1
##DATA TABLE= (X++(R..R)), XYDATA
$$ [...]
$$ plain form
63253 313169 314833 317150 320446 324595 328783 332148 334671 337192 340405 344204 348258 352833 358529 365426
63239 365426 373095 381384 390671 401353 413563 427383 442870 459806 477863 497029 517395 538520
63227 538520 559491 579721 599315 618621 637788 656814 675577 693763 711146 727930 744472
63216 744472 760743 776540 792184 808413 825458 842680 859118 873893 886090 894861 899847 901059
63204 901059 898278 891011 879074 862737 842294 818117 791201 763076 735031 707892 682487 659576
63192 659576 639171 620717 604153 590091 578758 569667 562715 558784 558620 561734 567001 573812 582073
63179 582073 591624 602354 614531 628356 643420 659096 675203 691783 708556 725193 741930 759311
63167 759311 777330 795267 812304 827974 842042 854288 864434 872135 877110 879302 878664 874774 867072
$$ packed form
63253C13169J664K317L296M149M188L365K523K521L213L799M054M575N696O897
63239C65426P669Q289R287J0682J2210J3820J5487J6936J8057J9166K0366K1125
63227E38520K0971K0230J9594J9306J9167J9026J8763J8186J7383J6784J6542
63216G44472J6271J5797J5644J6229J7045J7222J6438J4775J2197Q771M986J212
63204I01059k781p267j1937j6337k0443k4177k6916k8125k8045k7139k5405k2911
63192F59576k0405j8454j6564j4062j1333r091o952l931j64L114N267O811Q261
63179E82073R551J0730J2177J3825J5064J5676J6107J6580J6773J6637J6737J7381
63167G59311J8019J7937J7037J5670J4068J2246J0146P701M975K192o38l890p702
$$ plain form
63154 867072 855639 841195 824135 804152 781323 757037 733155 710462 688611 667404 647460
63143 647460 629520 613617 599133 585342 571858 558823 546829 536473 527896 520794 514762 509479
63131 509479 504682 500252 496441 493799 492658 492621 492622 491728 490019 488632 488763 490723 494055 498298 503248 508638
63115 508638 514071 519397 524777 530345 536151 542445 549529 557202 564736 571563 577632 583013 587617 591511
63101 591511 595109 598771 602459 605936 609003 611470 613236 614489 615470 615962 615478 614074 612518 611437 610698
63086 610698 609863 608844 607883 607135 606507 605746 604787 604257 605314 608348 612126 615044 617166 620021 624377 629405
63070 629405 634319 639545 645548 651727 657550 663925 672254 682637 694091 706245 719783 735405 753271
63057 753271 773396 795762 819985 845549 872434 901024 931541 964117 999235 1037403 1078386
$$ packed form
63154H67072j1433j4444j7060j9983k2829k4286k3882k2693k1851k1207j9944
63143F47460j7940j5903j4484j3791j3484j3035j1994j0356q577p102o032n283
63131E09479m797m430l811k642j141l7Jq94j709j387J31J960L332M243M950N390
63115E08638N433N326N380N568N806O294P084P673P534O827O069N381M604L894
63101E91511L598L662L688L477L067K467J766J253R81M92m84j404j556j081p39
63086F10698q35j019r61p48o28p61r59n30J057L034L778K918K122K855M356N028
63070F29405M914N226O003O179N823O375Q329J0383J1454J2154J3538J5622J7866
63057G53271K0125K2366K4223K5564K6885K8590L0517L2576L5118L8168M0983
$$ plain form
63046 1078386 1121310 1165549 1210978 1257375 1304145 1350694 1396691 1441886 1486000 1528832 1570276
63035 1570276 1610354 1649455 1688290 1727236 1765886 1803560 1839925 1874630 1906592 1934229 1956328
63024 1956328 1972215 1981183 1982304 1974876 1958633 1933518 1899651 1857633 1808711 1754586 1697133 1638098
63012 1638098 1578858 1520603 1464796 1413101 1366604 1325470 1289615 1259357 1235092 1216785 1204200
63001 1204200 1197271 1195770 1198946 1206026 1216840 1231526 1249861 1271275 1295179 1320861 1347512 1374822
62989 1374822 1403158 1432556 1462025 1490509 1518068 1545236 1571555 1595638 1616526 1634076 1648104
62978 1648104 1658051 1663492 1664145 1659247 1647627 1628550 1601952 1568017 1527279 1481162 1431546 1379635
62966 1379635 1325887 1271077 1216572 1163394 1111867 1062503 1016396 974289 935910 900686 868575
$$ packed form
63046A078386M2924M4239M5429M6397M6770M6549M5997M5195M4114M2832M1444
63035A570276M0078L9101L8835L8946L8650L7674L6365L4705L1962K7637K2099
63024A956328J5887Q968J121p428j6243k5115l3867m2018m8922n4125n7453n9035
63012A638098n9240n8255n5807n1695m6497m1134l5855l0258k4265j8307j2585
63001A204200o929j501L176P080J0814J4686J8335K1414K3904K5682K6651K7310
62989A374822K8336K9398K9469K8484K7559K7168K6319K4083K0888J7550J4028
62978A648104R947N441O53m898j1620j9077k6598l3935m0738m6117m9616n1911
62966A379635n3748n4810n4505n3178n1527m9364m6107m2107l8379l5224l2111
$$ plain form
62955 868575 839715 813770 790177 768801 749891 733575 719572 707186 695415 683481 671515
62944 671515 660439 650932 642781 635407 628648 622677 617438 612436 607070 601025 594507 588139 582427 577295
62930 577295 572308 567285 562341 557478 552628 548099 544356 541156 537493 532777 527577 522797 518476 513948
62916 513948 508963 504044 499746 495993 492326 488526 484774 481323 478235 475523 473373 472038 471461 471184 470743
62901 470743 470052 469320 468722 468225 467510 465970 463059 458883 454210 449691 445354 441082 437207 434149 431747
62886 431747 429461 427094 424813 422593 420219 417776 415636 413927 412511 411448 410977 411041 411331 411881 413044
62871 413044 414751 416374 417482 418298 419143 419964 420685 421568 422758 423813 424185 424045 424163 424928 425871 426319 426318 426621
62853 426621 427727 429192 430062 429883 429005 427972 426983 425979 424857 423425 421564 419630 418255 417465 416447
$$ packed form
62955H68575k8860k5945k3593k1376j8910j6316j4003j2386j1771j1934j1966
62944F71515j1076r507q151p374o759n971n239n002n366o045o518o368n712n132
62930E77295m987n023m944m863m850m529l743l200l663m716n200m780m321m528
62916E13948m985m919m298l753l667l800l752l451l088k712k150j335n77k77m41
62901D70743o91p32n98m97p15j540k911m176m673m519m337m272l875l058k402
62886D31747k286k367k281k220k374k443k140j709j416j063m71O4K90N50J163
62871D13044J707J623J108Q16Q45Q21P21Q83J190J055L72j40J18P65R43M48jL03
62853D26621J106J465Q70j79q78j033r89j004j122j432j861j934j375p90j018
$$ plain form
62838 416447 414554 412050 409456 406695 403510 400294 397716 395752 393788 391526 389134 386684 384069 381388
62824 381388 378792 376145 373422 371137 369584 367963 365301 362127 360135 360050 360873 361501 362106 363455 365715
62809 365715 368479 371308 373806 375780 377751 380722 384996 389774 394305 398841 403995 409807 416037 422910
62795 422910 430859 439815 449356 459435 470449 482669 495994 510299 525817 543189 563149 585993
62783 585993 611448 639298 670073 704678 743410 785856 831776 881485 935292 993255 1055632
62772 1055632 1122715 1193830 1267152 1340993 1414622 1487306 1557152 1621582 1678503 1726368 1763576
62761 1763576 1788724 1801367 1801801 1790099 1765951 1729634 1682698 1627535 1566466 1501234 1433090 1363142
62749 1363142 1292599 1222621 1153984 1087126 1022639 961506 904685 852548 804776 760696 719780
$$ packed form
62838D16447j893k504k594k761l185l216k578j964j964k262k392k450k615k681
62824C81388k596k647k723k285j553j621k662l174j992q5Q23O28O05J349K260
62809C65715K764K829K498J974J971K971M274M778M531M536N154N812O230O873
62795D22910P949Q956R541J0079J1014J2220J3325J4305J5518J7372J9960K2844
62783E85993K5455K7850L0775L4605L8732M2446M5920M9709N3807N7963O2377
62772A055632O7083P1115P3322P3841P3629P2684O9846O4430N6921M7865L7208
62761A763576K5148J2643M34j1702k4148l6317m6936n5163o1069o5232o8144o9948
62749A363142p0543o9978o8637o6858o4487o1133n6821n2137m7772m4080m0916
$$ plain form
62738 719780 682062 648045 617917 590971 566146 543062 522034 503135 485966 470435 457005
62727 457005 445780 435940 426617 417891 410430 404465 399556 395206 391273 387941 385546 384342 384271 385138 386994
62712 386994 390035 394082 398697 403984 410748 419586 430294 442477 456248 471921 489460 508701 529857
62699 529857 553421 579869 609743 643678 681918 724102 769773 818745 870662 924664 979850
62688 979850 1035653 1091289 1145244 1195832 1241881 1282333 1315563 1339905 1354731 1360312 1356666 1343174
62676 1343174 1319568 1286775 1246493 1200211 1148929 1093830 1036953 980901 927601 877417 829750
62665 829750 784326 741444 701084 662688 626215 592705 563135 537139 513499 491601 471724
62654 471724 454036 438016 423009 408885 395947 384426 374163 364693 355659 347173 339692 333439
$$ packed form
62738G19780l7718l4017l0128k6946k4825k3084k1028j8899j7169j5531j3430
62727D57005j1225r840r323q726p461n965m909m350l933l332k395j204p1Q67J856
62712C86994L041M047M615N287O764Q838J0708J2183J3771J5673J7539J9241K1156
62699E29857K3564K6448K9874L3935L8240M2184M5671M8972N1917N4002N5186
62688I79850N5803N5636N3955N0588M6049M0452L3230K4342J4826N581l646j3492
62676A343174k3606l2793m0282m6282n1282n5099n6877n6052n3300n0184m7667
62665H29750m5424m2882m0360l8396l6473l3510k9570k5996k3640k1898j9877
62654D71724j7688j6020j5007j4124j2938j1521j0263r470r034q486p481o253
$$ plain form
62642 333439 328129 323244 318380 313290 307952 302679 297892 293685 289858 286328 283065 279711 275911 272121
62628 272121 269350 267892 266961 265848 264727 263911 263086 261786 260077 258227 256348 254883 254756 256332 258759
62613 258759 261051 263278 266002 269144 272267 275478 279093 282818 286314 290279 295982 303807 313128 323448
62599 323448 334710 346659 359037 372516 388440 407434 429114 453343 480779 511791 545681
62588 545681 581520 619043 658150 697992 737216 774840 810383 843193 871987 895158 911533
62577 911533 920916 923879 920864 911697 896242 875299 850361 822573 792449 760631 728300 696569
62565 696569 665838 636021 607221 580012 555120 532835 512642 493584 475158 457638 441336
62554 441336 425908 410818 396168 382493 369895 357986 346618 336046 326392 317502 309403 302379
$$ packed form
62642C33439n310m885m864n090n338n273m787m207l827l530l263l354l800l790
62628B72121k771j458r31j113j121q16q25j300j709j850j879j465j27J576K427
62613B58759K292K227K724L142L123L211L615L725L496L965N703P825R321J0320
62599C23448J1262J1949J2378J3479J5924J8994K1680K4229K7436L1012L3890
62588E45681L5839L7523L9107L9842L9224L7624L5543L2810K8794K3171J6375
62577I11533R383K963l015r167j5455k0943k4938k7788l0124l1818l2331l1731
62565F96569l0731k9817k8800k7209k4892k2285k0193j9058j8426j7520j6302
62554D41336j5428j5090j4650j3675j2598j1909j1368j0572r654q890q099p024
$$ plain form
62542 302379 296506 291557 287342 283704 280266 276768 273661 271741 271151 271342 272004 273310 275120 276812 278257
62527 278257 280245 283485 287764 292620 298265 305163 313118 321532 330353 340131 351153 363162 376043
62514 376043 390358 406941 426164 447749 471172 496180 522932 551600 581811 612621 643124
62503 643124 672915 701795 729145 753819 774601 790611 801365 806720 806769 801608 791195 775682
62491 775682 755930 733333 708905 682862 655446 627864 601706 577417 554124 531282 509803
62480 509803 491026 475198 461685 450113 440289 431371 422417 413868 407261 403070 399914 396444 392966
62467 392966 390460 388915 387662 386717 386771 388156 390742 394532 399459 404844 409908 414774 420179 426381 433060
62452 433060 440088 447453 454425 459777 463065 464957 466034 465963 464168 460702 456045 450456 443888 436316 427841
$$ packed form
62542C02379n873m949m215l638l438l498l107j920n90J91O62J306J810J692J445
62527B78257J988L240M279M856N645O898P955Q414Q821R778J1022J2009J2881
62514C76043J4315J6583J9223K1585K3423K5008K6752K8668L0211L0810L0503
62503F43124K9791K8880K7350K4674K0782J6010J0754N355M9n161j0413j5513
62491G75682j9752k2597k4428k6043k7416k7582k6158k4289k3293k2842k1479
62480E09803j8777j5828j3513j1572r824q918q954q549o607m191l156l470l478
62467C92966k506j545j253r45N4J385K586L790M927N385N064M866N405O202O679
62452D33060P028P365O972N352L288J892J077p1j795l466m657n589o568p572q475
$$ plain form
62437 427841 418566 408480 397487 385678 373723 362733 353443 345740 339211 333821 329673 326517 324076
62424 324076 322526 322078 322369 322987 324311 327054 331179 336129 341957 349190 357506 365642 372958 380193 388165
62409 388165 396436 403850 409892 414946 419565 423930 427820 430732 432138 431856 430131 427384 424071 420674
62395 420674 417476 414316 410879 407092 402947 398194 392817 387612 383547 380603 377979 375524 374230 375084
62381 375084 378172 383168 390029 398853 409605 422378 437494 455030 474649 496201 520117 546952
62369 546952 576891 609885 645868 684545 725232 767043 808975 849888 888898 925844 960782
62358 960782 992866 1020302 1041568 1056196 1064245 1065723 1060887 1050550 1035624 1016778 994817 970866
62346 970866 945759 919628 892419 864473 836244 807867 779368 751093 723687 697897 674496
$$ packed form
62437D27841r275j0086j0993j1809j1955j0990r290p703o529n390m148l156k441
62424C24076j550m48K91O18J324K743M125M950N828P233Q316Q136P316P235P972
62409C88165Q271P414O042N054M619M365L890K912J406k82j725k747l313l397
62395D20674l198l160l437l787m145m753n377n205m065k944k624k455j294Q54
62381C75084L088M996O861Q824J0752J2773J5116J7536J9619K1552K3916K6835
62369E46952K9939L2994L5983L8677M0687M1811M1932M0913L9010L6946L4938
62358I60782L2084K7436K1266J4628Q049J478m836j0337j4926j8846k1961k3951
62346I70866k5107k6131k7209k7946k8229k8377k8499k8275k7406k5790k3401
$$ plain form
62335 674496 653946 635909 619515 604346 590705 578757 567978 557833 548494 540426 533623 527723
62323 527723 522553 518180 514623 511834 509705 507840 505638 502872 499871 496833 493349 488959 483807 478362
62309 478362 472815 467161 461662 456732 452440 448462 444494 440501 436666 433305 430761 429244 428840 429585 431299
62294 431299 433449 435604 438063 441536 446046 450661 454593 458158 462288 467392 473020 478499 483607 488756
62280 488756 494568 501172 507962 514347 520625 527680 535913 545045 555010 566409 579886 595608 613524
62267 613524 633591 655585 679329 705329 734564 767401 803358 842180 884223 929138 974793
62256 974793 1018242 1057373 1091135 1118668 1139010 1151433 1155579 1151453 1139756 1121926 1099439 1073283
62244 1073283 1044353 1013801 982389 949914 916017 881383 847534 815598 785913 758768 734824
$$ packed form
62335F74496k0550j8037j6394j5169j3641j1948j0779j0145r339q068o803n900
62323E27723n170m373l557k789k129j865k202k766l001l038l484m390n152n445
62309D78362n547n654n499m930m292l978l968l993l835l361k544j517m04P45J714
62294D31299K150K155K459L473M510M615L932L565M130N104N628N479N108N149
62280D88756N812O604O790O385O278P055Q233R132R965J1399J3477J5722J7916
62267F13524K0067K1994K3744K6000K9235L2837L5957L8822M2043M4915M5655
62256I74793M3449L9131L3762K7533K0342J2423M146m126j1697j7830k2487k6156
62244A073283k8930l0552l1412l2475l3897l4634l3849l1936k9685k7145k3944
$$ plain form
62233 734824 714546 697585 683032 670180 658986 649813 642690 636916 631589 626459 621924 618252 615237
62220 615237 612624 610376 608344 606249 604179 602597 601656 601096 601087 602441 605565 609781 614253 619073 624910
62205 624910 632014 640199 649466 660108 672386 686515 702729 721031 741182 763202 787371 813449
62193 813449 840460 867750 895680 924655 954006 982502 1009453 1034542 1056924 1075398 1089424
62182 1089424 1099326 1105630 1108775 1109375 1108203 1106025 1103844 1103084 1104997 1110070 1118393 1130278 1145906 1164674
62168 1164674 1185486 1207487 1229905 1251425 1270424 1285823 1297276 1304711 1308261 1308498 1306120 1301457
62156 1301457 1294670 1286194 1276449 1265394 1252945 1239586 1225913 1211832 1197021 1182139 1168750 1157930
62144 1157930 1149502 1142756 1137294 1133078 1130202 1128788 1128741 1129511 1130484 1131651 1133564 1136714 1141292 1147428 1155195
$$ packed form
62233G34824k0278j6961j4553j2852j1194r173p123n774n327n130m535l672l015
62220F15237k613k248k032k095k070j582r41n60rJ354L124M216M472M820N837
62205F24910P104Q185R267J0642J2278J4129J6214J8302K0151K2020K4169K6078
62193H13449K7011K7290K7930K8975K9351K8496K6951K5089K2382J8474J4026
62182A089424R902O304L145O00j172k178k181p60J913N073Q323J1885J5628J8768
62168A164674K0812K2001K2418K1520J8999J5399J1453P435L550K37k378m663
62156A301457o787q476r745j1055j2449j3359j3673j4081j4811j4882j3389j0820
62144A157930q428o746n462m216k876j414m7P70R73J167J913L150M578O136P767
$$ plain form
62129 1155195 1164417 1174888 1186728 1200131 1214922 1230863 1248307 1267999 1290155 1314123 1338918
62118 1338918 1363839 1388687 1413802 1439713 1466416 1493145 1519340 1545546 1572838 1601522 1630960
62107 1630960 1660519 1690062 1719661 1749481 1779996 1811743 1844805 1879000 1914446 1951417 1989772
62096 1989772 2029303 2070623 2114860 2162157 2211088 2259935 2308095 2355944 2403726 2451084 2497706
62085 2497706 2544211 2592213 2643195 2697102 2752241 2806650 2859210 2909171 2955398 2996990 3034497
62074 3034497 3069766 3104577 3139948 3176473 3214383 3253158 3291821 3329810 3366984 3402741 3435884
62063 3435884 3465665 3492369 3516626 3538628 3558271 3575531 3590449 3603103 3613774 3622699 3629493 3633343
62051 3633343 3634062 3632492 3629541 3625192 3618846 3610381 3600398 3589546 3577962 3565493 3552200 3538413 3524237
$$ packed form
62129A155195R222J0471J1840J3403J4791J5941J7444J9692K2156K3968K4795
62118A338918K4921K4848K5115K5911K6703K6729K6195K6206K7292K8684K9438
62107A630960K9559K9543K9599K9820L0515L1747L3062L4195L5446L6971L8355
62096A989772L9531M1320M4237M7297M8931M8847M8160M7849M7782M7358M6622
62085B497706M6505M8002N0982N3907N5139N4409N2560M9961M6227M1592L7507
62074C034497L5269L4811L5371L6525L7910L8775L8663L7989L7174L5757L3143
62063C435884K9781K6704K4257K2002J9643J7260J4918J2654J0671Q925O794L850
62051C633343P19j570k951m349o346q465r983j0852j1584j2469j3293j3787j4176
$$ plain form
62038 3524237 3509288 3493231 3476533 3460209 3444665 3429322 3413715 3398466 3384590 3372218 3360688
62027 3360688 3349668 3339450 3330153 3321308 3312427 3303587 3295326 3288306 3283100 3280038 3279268 3281106 3286043 3294152
62013 3294152 3304869 3317773 3333175 3351355 3371665 3393177 3415995 3441016 3468417 3497128 3525748
62002 3525748 3553135 3577950 3598384 3612723 3619772 3618624 3608545 3589276 3561118 3524751 3481325 3432576
61990 3432576 3380353 3326105 3271187 3217266 3165550 3115763 3066716 3017957 2970156 2923937 2879218
61979 2879218 2835865 2794167 2754348 2716298 2680010 2645703 2613264 2582155 2552097 2523330 2496061
61968 2496061 2470131 2445331 2421624 2399081 2378084 2359405 2343375 2329098 2315309 2301978 2290238
61957 2290238 2280723 2272972 2266630 2262222 2260447 2261550 2265691 2273010 2283021 2294828 2308371 2324669 2344422
$$ packed form
62038C524237j4949j6057j6698j6324j5544j5343j5607j5249j3876j2372j1530
62027C360688j1020j0218r297q845q881q840q261p020n206l062p70J838M937Q109
62013C294152J0717J2904J5402J8180K0310K1512K2818K5021K7401K8711K8620
62002C525748K7387K4815K0434J4339P049j148j0079j9269k8158l6367m3426m8749
61990C432576n2223n4248n4918n3921n1716m9787m9047m8759m7801m6219m4719
61979B879218m3353m1698l9819l8050l6288l4307l2439l1109l0058k8767k7269
61968B496061k5930k4800k3707k2543k0997j8679j6030j4277j3789j3331j1740
61957B290238r515p751o342m408j775J103M141P319J0011J1807J3543J6298J9753
$$ plain form
61944 2344422 2367166 2392139 2419034 2447491 2476841 2507012 2538850 2572856 2608406 2644884 2682701
61933 2682701 2722356 2763248 2804424 2845900 2888206 2931042 2973531 3015663 3058656 3104096 3153816
61922 3153816 3210767 3279127 3363049 3465581 3588939 3735552 3908656 4111954 4348712 4621232
61912 4621232 4931417 5281818 5675721 6115945 6603708 7138319 7716755 8332338 8973215
61903 8973215 9621541 10253176 10838006 11342028 11731417 11977022 12058061 11965425 11704418 11294844
61893 11294844 10767072 10155985 9495893 8817332 8145033 7496878 6884281 6313585 5787630
61884 5787630 5307172 4871901 4480486 4130087 3816779 3537031 3288423 3068682 2874716
61875 2874716 2703176 2551406 2417209 2298265 2192622 2099515 2018881 1950105 1891779 1842534
$$ packed form
61944B344422K2744K4973K6895K8457K9350L0171L1838L4006L5550L6478L7817
61933B682701L9655M0892M1176M1476M2306M2836M2489M2132M2993M5440M9720
61922C153816N6951O8360Q3922J02532J23358J46613J73104K03298K36758K72520
61912D621232L10185L50401L93903M40224M87763N34611N78436O15583O40877
61903H973215O48326O31635N84830N04022L89389K45605Q1039r2636k61007m09574
61893A1294844n27772o11087o60092o78561o72299o48155o12597n70696n25955
61884E787630m80458m35271l91415l50399l13308k79748k48608k19741j93966
61875B874716j71540j51770j34197j18944j05643r3107q0634o8776n8326m9245
$$ plain form
61865 1842534 1801474 1767941 1741547 1722542 1711601 1709017 1714269 1726303 1743948 1766215 1792602 1823079
61853 1823079 1857489 1894961 1934013 1972988 2010106 2043445 2071413 2093281 2109081 2119127 2123888
61842 2123888 2124136 2120866 2115196 2108496 2102369 2098146 2096537 2097930 2102714 2110904 2121616 2133260 2144143
61829 2144143 2152723 2157544 2157375 2151408 2139223 2120787 2096733 2068490 2037892 2006754 1976791 1949557
61817 1949557 1926096 1906752 1891376 1879512 1870384 1863279 1858223 1856030 1857524 1863114 1873261 1888866
61805 1888866 1910866 1939832 1976183 2020330 2072322 2131878 2199192 2275251 2361055 2457100 2564151
61794 2564151 2683988 2818744 2969878 3138496 3326514 3537008 3773733 4040837 4342903
61785 4342903 4684744 5071292 5508196 6002380 6561513 7192957 7903369 8698640 9582912
$$ packed form
61865A842534m1060l3533k6394j9005j0941k584N252J2034J7645K2267K6387L0477
61853A823079L4410L7472L9052L8975L7118L3339K7968K1868J5800J0046M761
61842B123888K48l270n670o700o127m223j609J393M784Q190J0712J1644J0883
61829B144143Q580M821j69n967j2185j8436k4054k8243l0598l1138k9963k7234
61817A949557k3461j9344j5376j1864r128p105n056k193J494N590J0147J5605
61805A888866K2000K8966L6351M4147N1992N9556O7314P6059Q5804R6045J07051
61794B564151J19837J34756J51134J68618J88018K10494K36725K67104L02066
61785D342903L41841L86548M36904M94184N59133O31444P10412P95271Q84272
$$ plain form
61776 9582912 10556570 11614232 12743124 13921544 15117626 16289006 17383753 18343011
61768 18343011 19106275 19619211 19842021 19755944 19366776 18704730 17819738 16772695 15625818
61759 15625818 14435556 13248805 12101149 11016549 10008792 9084296 8244844 7489220
61751 7489220 6813767 6212564 5678196 5203396 4782279 4409743 4079959 3786430 3523797
61742 3523797 3288797 3079045 2891656 2723712 2573283 2439181 2320168 2215032 2122900 2042697
61732 2042697 1972752 1911580 1858605 1813308 1774191 1739389 1707861 1678975 1651373 1623434 1594711
61721 1594711 1565736 1536428 1505806 1473511 1440509 1407898 1375876 1344384 1314038 1285841 1260361
61710 1260361 1237614 1217344 1199016 1181842 1165190 1148963 1133416 1118744 1104877 1091446 1077887
$$ packed form
61776I582912R73658J057662J128892J178420J196082J171380J094747R59258
61768A8343011P63264N12936K22810q6077l89168o62046q84992j047043j146877
61759A5625818j190262j186751j147656j084600j007757r24496q39452p55624
61751G489220o75453o01203n34368m74800m21117l72536l29784k93529k62633
61742C523797k35000k09752j87389j67944j50429j34102j19013j05136r2132q0203
61732B042697o9945o1172n2975m5297l9117l4802l1528k8886k7602k7939k8723
61721A594711k8975k9308l0622l2295l3002l2611l2022l1492l0346k8197k5480
61710A260361k2747k0270j8328j7174j6652j6227j5547j4672j3867j3431j3559
$$ plain form
61699 1077887 1063812 1049359 1035059 1021349 1008331 995855 983655 971449 959144 946943 935131
61688 935131 923935 913689 904869 897684 891736 886302 880801 874963 868896 863181 858539 855123 852361 849619
61674 849619 846682 843533 840233 837273 835366 834457 833476 831550 828909 826107 823013 819286 815302 811742 808622
61659 808622 805581 802818 800942 800018 799562 799373 799651 800362 801170 802061 803452 805585 808179 810599 812086 812104
61643 812104 810893 809449 808561 808167 808007 808424 810020 813046 817679 824412 833449 844273 856571 871027
61629 871027 888224 907172 925873 942989 957917 969613 976693 978793 976739 971230 962227 949739
61617 949739 934458 917504 900142 883585 868293 853692 839307 825766 813695 802105 789291
61606 789291 775219 761672 749958 739823 730664 722305 714221 705518 696393 688370 682352 677549 673018
$$ packed form
61699A077887j4075j4453j4300j3710j3018j2476j2200j2206j2305j2201j1812
61688I35131j1196j0246q820p185n948n434n501n838o067n715m642l416k762k742
61674H49619k937l149l300k960j907r09r81j926k641k802l094l727l984l560l120
61659H08622l041k763j876r24m56j89K78P11Q08Q91J391K133K594K420J487J8
61643H12104j211j444q88l94j60M17J596L026M633O733R037J0824J2298J4456
61629H71027J7197J8948J8701J7116J4928J1696P080K100k054n509r003j2488
61617I49739j5281j6954j7362j6557j5292j4601j4385j3541j2071j1590j2814
61606G89291j4072j3547j1714j0135r159q359q084q703r125q023o018m803m531
$$ plain form
61593 673018 669149 666750 665634 665110 665126 665946 667329 669001 671518 675676 681386 687943 695209 703652 713303
61578 713303 723500 733907 745254 758675 774474 791721 809214 826769 845354 865846 887981
61567 887981 910902 934296 958350 982828 1007099 1031086 1055340 1079970 1104245 1127491 1149677
61556 1149677 1170859 1190796 1209550 1227802 1246186 1264759 1283415 1302227 1320955 1338707 1354494
61545 1354494 1367793 1378324 1385703 1389478 1389135 1383992 1373742 1359271 1342262 1323756 1303726 1282306
61533 1282306 1260620 1239984 1220981 1203774 1188616 1175528 1164115 1154337 1146918 1142425 1140502 1140705
61521 1140705 1143603 1150334 1161416 1176740 1196425 1220899 1250199 1283979 1322360 1366267 1416791 1474628
61509 1474628 1540324 1614883 1699883 1796905 1906843 2029926 2166613 2318232 2486268 2671038
$$ packed form
61593F73018l869k399j116n24J6Q20J383J672K517M158N710O557P266Q443R651
61578G13303J0197J0407J1347J3421J5799J7247J7493J7555J8585K0492K2135
61567H87981K2921K3394K4054K4478K4271K3987K4254K4630K4275K3246K2186
61556A149677K1182J9937J8754J8252J8384J8573J8656J8812J8728J7752J5787
61545A354494J3299J0531P379L775l43n143j0250j4471j7009j8506k0030k1420
61533A282306k1686k0636j9003j7207j5158j3088j1413r778p419m493j923K03
61521A140705K898O731J1082J5324J9685K4474K9300L3780L8381M3907N0524N7837
61509A474628O5696P4559Q5000R7022J09938J23083J36687J51619J68036J84770
$$ plain form
61499 2671038 2871476 3086016 3312750 3548230 3786624 4020435 4241532 4441148 4609727
61490 4609727 4738282 4820819 4855729 4845103 4792936 4703885 4583354 4438214 4276667 4106685
61480 4106685 3934364 3763841 3598407 3441070 3294178 3159274 3037585 2930139 2837161 2757875
61470 2757875 2691168 2636240 2592634 2560206 2539125 2529345 2529818 2538754 2554838 2577708 2607054 2641853
61458 2641853 2680834 2723184 2768348 2815441 2863173 2910197 2955422 2998366 3039372 3079252 3118629
61447 3118629 3157910 3197728 3238838 3281490 3325448 3370708 3417652 3466340 3516131 3566145 3615693
61436 3615693 3664185 3711008 3755414 3796080 3830964 3858190 3876895 3886639 3886470 3875710 3855471 3827987
61424 3827987 3794297 3753871 3706880 3655567 3602758 3550141 3498609 3449151 3402575 3359221 3319796
$$ packed form
61499B671038K00438K14540K26734K35480K38394K33811K21097J99616J68579
61490D609727J28555Q2537L4910j0626n2167q9051j20531j45140j61547j69982
61480D106685j72321j70523j65434j57337j46892j34904j21689j07446r2978p9286
61470B757875o6707n4928m3606l2428k1081r780M73Q936J6084K2870K9346L4799
61458B641853L8981M2350M5164M7093M7732M7024M5225M2944M1006L9880L9377
61447C118629L9281L9818M1110M2652M3958M5260M6944M8688M9791N0014M9548
61436C615693M8492M6823M4406M0666L4884K7226J8705R744j69j0760k0239k7484
61424C827987l3690m0426m6991n1313n2809n2617n1532m9458m6576m3354l9425
$$ plain form
61413 3319796 3285734 3257983 3236186 3219760 3209016 3204320 3204836 3208984 3215670 3224206 3233469 3242014 3248770
61400 3248770 3253021 3254095 3251641 3245922 3237271 3225771 3212055 3198015 3186169 3178700 3177563 3184850 3202288
61387 3202288 3230777 3271134 3325035 3394677 3481810 3587612 3713063 3858889 4025327 4212286
61377 4212286 4419256 4644641 4885533 5138398 5399164 5662055 5918838 6159895 6375831
61368 6375831 6558138 6699653 6795661 6844508 6846895 6805209 6723760 6608409 6464691 6296543
61358 6296543 6107328 5901151 5682249 5453810 5218490 4979678 4741306 4506777 4278910
61349 4278910 4060438 3853601 3659581 3479122 3313316 3163011 3027959 2907512 2801748
61340 2801748 2711007 2634568 2570722 2517915 2475173 2441882 2417991 2404004 2399830 2403966 2414655 2431405
$$ packed form
61413C319796l4062k7751k1797j6426j0744m696N16M148O686Q536R263Q545O756
61400C248770M251J074k454n719q651j1500j3716j4040j1846p469j137P287J7438
61387C202288K8489M0357N3901O9642Q7133J05802J25451J45826J66438J86959
61377D212286K06970K25385K40892K52865K60766K62891K56783K41057K15936
61368F375831J82307J41515R6008M8847K387m1686q1449j15351j43718j68148
61358F296543j89215k06177k18902k28439k35320k38812k38372k34529k27867
61349D278910k18472k06837j94020j80459j65806j50305j35052j20447j05764
61340B801748r0741p6439o3846n2807m2742l3291k3891j3987m174M136J0689J6750
$$ plain form
61328 2431405 2454452 2483191 2516257 2552801 2592568 2634811 2678129 2721360 2763890 2805237 2845087
61317 2845087 2883414 2919893 2953652 2984349 3012839 3039636 3063458 3082685 3097791 3110837 3122748
61306 3122748 3132595 3139460 3143407 3144476 3142263 3136906 3129140 3118905 3105006 3086564 3063734 3036646 3004817
61293 3004817 2968189 2927755 2884502 2838542 2789919 2739654 2689460 2640976 2595623 2554624 2518633
61282 2518633 2487703 2461849 2441294 2426102 2416092 2411235 2411525 2416328 2424305 2433964 2443816 2452125 2457312
61269 2457312 2458657 2455965 2448579 2435458 2416229 2391460 2362005 2329016 2294662 2261859 2233041 2209740
61257 2209740 2193287 2184908 2185089 2193920 2212386 2242425 2285403 2341352 2409857 2490684 2583113 2685597
61245 2685597 2796576 2914703 3037642 3161277 3280547 3390419 3485656 3560560 3609887 3629852
$$ packed form
61328B431405K3047K8739L3066L6544L9767M2243M3318M3231M2530M1347L9850
61317B845087L8327L6479L3759L0697K8490K6797K3822J9227J5106J3046J1911
61306C122748R847O865L947J069k213n357p766j0235j3899j8442k2830k7088l1829
61293C004817l6628m0434m3253m5960m8623n0265n0194m8484m5353m0999l5991
61282B518633l0930k5854k0555j5192j0010m857K90M803P977R659R852Q309N187
61269B457312J345k692p386j3121j9229k4769k9455l2989l4354l2803k8818k3301
61257B209740j6453q379J81Q831J8466L0039M2978N5949O8505Q0827R2429J02484
61245B685597J10979J18127J22939J23635J19270J09872R5237P4904M9327J9965
$$ plain form
61235 3629852 3618199 3574150 3499085 3396922 3273265 3134295 2986348 2835502 2686689 2543316
61225 2543316 2407983 2282995 2169679 2067709 1975782 1892886 1818631 1752608 1693909 1641280
61215 1641280 1593667 1550728 1512899 1480788 1454518 1433778 1418289 1407841 1402104 1400840 1404086 1411526
61203 1411526 1421937 1433911 1446987 1461301 1476227 1490281 1502385 1512424 1520515 1526560 1530649 1532969
61191 1532969 1533131 1530486 1525304 1518659 1510797 1500542 1486749 1469483 1449272 1426137 1400102 1372028
61179 1372028 1343127 1314021 1284820 1255816 1227562 1200512 1174935 1150990 1128668 1107858 1088566
61168 1088566 1070750 1054017 1037931 1022577 1008288 994940 982187 970246 959521 949432 938573
61157 938573 926255 912961 899072 884134 867711 849979 831099 810920 789810 768876 748905
$$ packed form
61235C629852j1653m4049p5065j02163j23657j38970j47947j50846j48813j43373
61225B543316j35333j24988j13316j01970r1927q2896p4255o6023n8699n2629
61215A641280m7613m2939l7829l2111k6270k0740j5489j0448n737j264L246P440
61203A411526J0411J1974J3076J4314J4926J4054J2104J0039Q091O045M089K320
61191A532969J62k645n182o645p862j0255j3793j7266k0211k3135k6035k8074
61179A372028k8901k9106k9201k9004k8254k7050k5577k3945k2322k0810j9292
61168A088566j7816j6733j6086j5354j4289j3348j2753j1941j0725j0089j0859
61157I38573j2318j3294j3889j4938j6423j7732j8880k0179k1110k0934j9971
$$ plain form
61146 748905 729951 712403 697433 685703 676527 668981 663038 658887 656119 654458 654573 657137 661660
61133 661660 667121 673254 680289 687877 695226 702098 708886 715899 723187 730800 738556 745835 752243 758283
61119 758283 764812 772023 779391 786370 792695 798280 803284 807979 812247 815498 817387 818036 817275 814351 809040
61104 809040 802480 796142 790292 784024 776471 767454 757314 746647 735917 724899 712907 699928 686988
61091 686988 674883 663184 651156 639028 627544 616688 605806 594801 584353 574977 566525 558659
61079 558659 551387 545132 540501 537832 536721 536289 536086 536321 537062 537881 538623 539907 542376 546047 550716 556294
61063 556294 562249 567550 571868 576099 581075 586525 592031 598089 605166 612455 618800 624371 630202 636397
61049 636397 642039 646805 651544 657220 664133 672196 681237 690955 701108 711672 722416 732738 742432
$$ packed form
61146G48905j8954j7548j4970j1730r176p546n943m151k768j661J15K564M523
61133F61660N461O133P035P588P349O872O788P013P288P613P756P279O408O040
61119G58283O529P211P368O979O325N585N004M695M268L251J889O49p61k924n311
61104H09040o560o338n850o268p553r017j0140j0667j0730j1018j1992j2979j2940
61091F86988j2105j1699j2028j2128j1484j0856j0882j1005j0448r376q452p866
61079E58659p272o255m631k669j111m32k03K35P41Q19P42J284K469L671M669N578
61063E56294N955N301M318M231M976N450N506O058P077P289O345N571N831O195
61049F36397N642M766M739N676O913Q063R041R718J0153J0564J0744J0322R694
$$ plain form
61036 742432 752164 762519 773076 783049 792255 800647 807614 812732 816669 820331 823622 826047 827918 829833
61022 829833 831619 833121 835433 839793 845640 851406 857056 864230 873945 885804 899598 916064 935812
61009 935812 958885 985614 1016543 1051314 1089068 1130115 1175826 1226680 1281842 1340781 1403721
60998 1403721 1470528 1541110 1617232 1701932 1796612 1900687 2014540 2140487 2280063 2433056
60988 2433056 2600710 2787748 3000198 3244354 3530147 3873060 4290650 4800241 5422692
60979 5422692 6184522 7111952 8226816 9553714 11123602 12953317 15014914 17233546
60971 17233546 19516909 21766970 23845183 25546606 26663854 27123716 27067785 26779872 26518957
60962 26518957 26409137 26453434 26591891 26706129 26591297 25994498 24742798 22857566 20546503
$$ packed form
61036G42432R732J0355J0557R973R206Q392O967N118L937L662L291K425J871J915
61022H29833J786J502K312M360N847N766N650P174R715J1859J3794J6466J9748
61009I35812K3073K6729L0929L4771L7754M1047M5711N0854N5162N8939O2940
60998A403721O6807P0582P6122Q4700R4680J04075J13853J25947J39576J52993
60988B433056J67654J87038K12450K44156K85793L42913M17590N09591O22451
60979E422692P61830R27430J114864J326898J569888J829715K061597K218632
60971A7233546K283363K250061K078213J701423J117248M59862n5931k87913k60915
60962B6518957j09820M4297J38457J14238j14832n96799j251700j885232k311063
$$ plain form
60953 20546503 18086131 15702680 13528409 11619594 9985458 8606757 7450978 6485935
60945 6485935 5684387 5020948 4470905 4013167 3631111 3309852 3035234 2796134 2585498
60936 2585498 2398281 2230024 2077755 1940254 1816306 1703902 1601698 1509823 1428387 1356279
60926 1356279 1291998 1234398 1181792 1131564 1081913 1033318 987296 944377 904261 867211 833975
60915 833975 804577 778323 754978 734871 717722 702342 687880 674656 663353 653897 645639 638373
60903 638373 632590 628626 625849 623001 619382 615583 612923 612287 613603 616260 619711 623724 628446 634147
60889 634147 640578 646682 651416 654806 657586 659842 660745 659699 656856 652226 645284 636016 625529 614888
60875 614888 604100 592987 582323 573079 565051 557283 549580 542674 537130 532944 529992 527973 526180
$$ packed form
60953B0546503k460372k383451k174271j908815j634136j378701j155779r65043
60945F485935q01548o63439n50043m57738l82056l21259k74618k39100k10636
60936B585498j87217j68257j52269j37501j23948j12404j02204r1875q1436p2108
60926A356279o4281n7600n2606n0228m9651m8595m6022m2919m0116l7050l3236
60915H33975k9398k6254k3345k0107j7149j5380j4462j3224j1303r456q258p266
60903F38373n783l964k777k848l619l799k660o36J316K657L451M013M722N701
60889F34147O431O104M734L390K780K256R03j046k843m630o942r268j0487j0641
60875F14888j0788j1113j0664r244q028p768p703o906n544m186k952k019j793
$$ plain form
60862 526180 524302 523282 524400 527591 531695 536274 542113 549729 558488 567516 576758 586847 598557 612465
60848 612465 628393 645176 661705 678208 695620 713776 731341 747557 762808 777134 789504
60837 789504 799208 806912 813607 819382 823937 827454 830240 832200 833357 834224 834949 834744 832835 829434 825061
60822 825061 819566 812506 803970 794260 783296 771151 758718 746986 735880 724630 713055 701802
60810 701802 691491 682279 674144 666991 660555 654744 650025 647047 645944 646368 648104 651267 655963 661994
60796 661994 668842 675830 682524 688967 695243 700903 705305 708471 710860 712316 712201 710792 709491 709108 708925
60781 708925 708151 707312 707353 708148 709068 710499 713693 719306 726962 736058 746248 757253 768856 780947 793071
60766 793071 804291 814053 822824 831303 839345 846286 851869 856169 859073 860617 861480 862360 863130 863314 863073
$$ packed form
60862E26180j878j020J118L191M104M579N839P616Q759R028R242J0089J1710J3908
60848F12465J5928J6783J6529J6503J7412J8156J7565J6216J5251J4326J2370
60837G89504R704P704O695N775M555L517K786J960J157Q67P25k05j909l401m373
60822H25061n495p060q536r710j0964j2145j2433j1732j1106j1250j1575j1253
60810G01802j0311r212q135p153o436n811m719k978j103M24J736L163M696O031
60796F61994O848O988O694O443O276N660M402L166K389J456j15j409j301l83j83
60781G08925p74q39M1P95R20J431L194N613P656R096J0190J1005J1603J2091J2124
60766G93071J1220R762Q771Q479Q042O941N583M300K904J544Q63Q80P70J84k41
$$ plain form
60751 863073 862975 863167 863571 864554 866451 868590 869642 868912 866568 862846 857864 852113 846267 840400 834011 826827
60735 826827 819027 810710 801695 791821 780995 769163 756677 744417 732967 721945 710678 699280
60723 699280 688514 678916 670600 663546 657451 651731 646303 641914 639080 637264 635844 635219 636009 637767
60709 637767 639673 641957 645386 649627 653520 656835 660422 664539 668289 670942 672655 673641 673563 672079 669165
60694 669165 664696 658446 650638 641801 632069 621294 609783 598149 586606 575236 564709 555732 547971
60681 547971 540598 533794 528536 524951 522176 519929 518871 519171 519996 520839 522206 524560 527657 531387 536201
60666 536201 542159 548494 554627 560782 567207 573635 579898 586182 592303 597695 602493 607653 613577 619660
60652 619660 625677 632488 640643 649383 657865 666436 675713 685229 694119 702573 711449 720741 729485 737172
$$ packed form
60751H63073r8J92M04R83J897K139J052p30k344l722m982n751n846n867o389p184
60735H26827p800q317r015r874j0826j1832j2486j2260j1450j1022j1267j1398
60723F99280j0766r598q316p054o095n720n428m389k834j816j420o25P90J758
60709F37767J906K284L429M241L893L315L587M117L750K653J713R86p8j484k914
60694F69165m469o250p808q837r732j0775j1511j1634j1543j1370j0527q977p761
60681E47971p373o804n258l585k775k247j058L00Q25Q43J367K354L097L730M814
60666E36201N958O335O133O155O425O428O263O284O121N392M798N160N924O083
60652F19660O017O811Q155Q740Q482Q571R277R516Q890Q454Q876R292Q744P687
$$ plain form
60638 737172 744393 751913 759686 766997 773311 778786 783967 788970 793196 796100 797925 799144 799424 797924
60624 797924 794553 790070 784880 778621 771137 762966 754544 745664 736101 726057 715802 705582 696092
60611 696092 688162 681710 675942 670863 667600 666827 667945 670396 674629 680915 688194 695139 701670 708422
60597 708422 715247 721231 725861 729271 731638 733183 734547 736378 738555 740430 741844 743436 745935 749385
60583 749385 752962 755405 755880 754572 752188 748913 744368 738575 732210 725583 718024 708645 697281 684487
60569 684487 671178 658484 647204 637092 627301 617755 609281 602145 595462 588651 582533 578260 575896
60556 575896 574775 574615 575508 577316 579801 582980 586868 591344 596681 603568 612101 621478 631246 642126
60542 642126 655019 670041 687342 708054 733352 763099 796389 832930 872845 915361 958594
$$ packed form
60638G37172P221P520P773P311O314N475N181N003M226K904J825J219K80j500
60624G97924l371m483n190o259p484q171q422q880r563j0044j0255j0220r490
60611F96092p930o452n768n079l263p73J118K451M233O286P279O945O531O752
60597G08422O825N984M630L410K367J545J364J831K177J875J414J592K499L450
60583G49385L577K443M75j308k384l275m545n793o365o627p559r379j1364j2794
60569F84487j3309j2694j1280j0112r791r546q474p136o683o811o118m273k364
60556E75896j121j60Q93J808K485L179L888M476N337O887Q533R377R768J0880
60542F42126J2893J5022J7301K0712K5298K9747L3290L6541L9915M2516M3233
$$ plain form
60531 958594 1000379 1038499 1070409 1093690 1106866 1109414 1101432 1084071 1059871 1031837 1002322 973345
60519 973345 947458 927197 913604 906002 903157 904088 907933 913761 920666 927734 934130 939644 944909 950654
60505 950654 957023 963983 971922 981397 992861 1007384 1027066 1053897 1088462 1130507 1180429 1239455
60493 1239455 1308717 1389077 1481605 1587301 1706362 1838557 1984403 2145548 2324357 2523865
60483 2523865 2747585 2997865 3273695 3570226 3879721 4191407 4489809 4754407 4962684
60474 4962684 5095114 5139071 5090205 4951827 4733723 4451388 4125105 3777352 3428517 3093515
60464 3093515 2781480 2497493 2243874 2020545 1825645 1656543 1510378 1384187 1275276
60455 1275276 1181493 1100781 1030761 969346 915496 868769 828302 792868 761724 734650 711192
$$ packed form
60531I58594M1785L8120L1910K3281J3176K548p982j7361k4200k8034k9515k8977
60519I73345k5887k0261j3593p602k845R31L845N828O905P068O396N514N265N745
60505I50654O369O960P939R475J1464J4523J9682K6831L4565M2045M9922N9026
60493A239455O9262Q0360R2528J05696J19061J32195J45846J61145J78809J99508
60483B523865K23720K50280K75830K96531L09495L11686K98402K64598K08277
60474D962684J32430M3957m8866j38378k18104k82335l26283l47753l48835l35002
60464C093515l12035k83987k53619k23329j94900j69102j46165j26191j08911
60455A275276r3783q0712p0020o1415n3850m6727m0467l5434l1144k7074k3458
$$ plain form
60444 711192 690566 672372 656713 643455 631870 621132 610756 600479 590119 579719 569596
60433 569596 560183 551915 545081 539613 535197 531756 529413 527771 525818 523060 520287 518621 518176 518310 518815
60418 518815 520020 521933 524097 526336 528930 531970 535117 538123 541164 544562 548451 552671 556798 560419
60404 560419 563658 567173 571356 575839 580095 584079 587882 591305 594366 597730 601852 606006 608980 610583
60390 610583 611748 613286 615237 617299 619155 620340 620472 619716 618622 617598 616932 616972 617703 618364 618190 617406
60374 617406 616886 616993 617420 617945 618611 619239 619577 619913 620842 622371 623945 625403 627256 629860 632966 636262
60358 636262 639806 643694 647738 651711 655645 659761 664322 669551 675494 682001 688950 696304 703789 710863
60344 710863 717230 722971 727900 731320 732862 733048 732581 731668 730581 730108 730533 730786 729725 727915 727046 727805
$$ packed form
60444G11192k0626j8194j5659j3258j1585j0738j0376j0277j0360j0400j0123
60433E69596r413q268o834n468m416l441k343j642j953k758k773j666m45J34N05
60418E18815J205J913K164K239K594L040L147L006L041L398L889M220M127L621
60404E60419L239L515M183M483M256L984L803L423L061L364M122M154K974J603
60390F10583J165J538J951K062J856J185J32p56j094j024o66M0P31O61j74p84
60374F17406n20J07M27N25O66O28L38L36R29J529J574J458J853K604L106L296
60358F36262L544L888M044L973L934M116M561N229N943O507O949P354P485P074
60344G10863O367N741M929L420J542J86m67r13j087m73M25K53j061j810q69P59
$$ plain form
60328 727805 729477 731506 734191 737641 741093 743706 745248 745736 745070 743338 740875 737738 733640 728588 723145
60313 723145 717887 712976 708297 703627 698709 693586 688846 685105 682348 680160 678418 677309 676935 677440 679238
60298 679238 682444 686304 689890 693143 696499 699701 701853 702666 702799 702894 702942 702651 701836 700398 698469 696585
60282 696585 695209 694199 693255 692638 692854 693944 695757 698578 702603 707155 711381 715522 720463 726184 731814
60267 731814 737291 743806 752359 762798 774539 787342 801136 815914 832060 850063 869756 890596
60255 890596 912758 937125 964064 993147 1024312 1058421 1096324 1138176 1183975 1234077 1288797
60244 1288797 1348233 1412826 1483511 1561001 1645370 1736443 1833902 1936805 2043618 2152907 2263463
60233 2263463 2373725 2481699 2585554 2683584 2773611 2853213 2920736 2975392 3016335 3042529 3053715
$$ packed form
60328G27805J672K029K685L450L452K613J542M88o66j732k463l137m098n052n443
60313G23145n258m911m679m670m918n123m740l741k757k188j742j109l74N05J798
60298F79238L206L860L586L253L356L202K152Q13J33R5M8k91q15j438j929j884
60282F96585j376j010r44o17K16J090J813K821M025M552M226M141M941N721N630
60267G31814N477O515Q553J0439J1741J2803J3794J4778J6146J8003J9693K0840
60255H90596K2162K4367K6939K9083L1165L4109L7903M1852M5799N0102N4720
60244A288797N9436O4593P0685P7490Q4369R1073R7459J02903J06813J09289J10556
60233B263463J10262J07974J03855R8030R0027P9602O7523N4656M0943K6194J1186
$$ plain form
60222 3053715 3050778 3035008 3007781 2971153 2927814 2880106 2829689 2778414 2728788 2683304 2643892
60211 2643892 2612131 2589280 2576047 2573058 2581622 2603150 2637739 2684329 2742445 2812822 2895985 2991114
60199 2991114 3096587 3210585 3330621 3453325 3575322 3693783 3805833 3908227 3998052 4073141
60189 4073141 4131579 4171595 4192334 4194017 4177106 4142088 4090282 4023893 3944988 3855462 3758490
60178 3758490 3658823 3560919 3467566 3380963 3304117 3240157 3190928 3157154 3139506 3138642 3154463 3186036
60166 3186036 3232075 3291029 3360974 3439707 3524612 3612130 3697910 3777931 3849205 3909404 3956509
60155 3956509 3989224 4007178 4010348 3998935 3974162 3938626 3895437 3847445 3797508 3748738 3703975
60144 3703975 3665496 3635542 3616593 3610769 3619515 3644160 3686243 3747088 3827734 3929629 4054767
$$ packed form
60222C053715k937j5770k7227l6628m3339m7708n0417n1275m9626m5484l9412
60211B643892l1761k2851j3233k989Q564K1528L4589M6590N8116P0377Q3163R5129
60199B991114J05473J13998J20036J22704J21997J18461J12050J02394Q9825P5089
60189D073141N8438M0016K0739J683j6911l5018n1806o6389p8905q9526r6972
60178C758490r9667r7904r3353q6603p6846o3960m9229l3774j7648q64J5821L1573
60166C186036M6039N8954O9945P8733Q4905Q7518Q5780Q0021P1274O0199M7105
60155C956509L2715J7954L170j1413k4773l5536m3189m7992m9937m8770m4763
60144C703975l8479k9954j8949n824Q746K4645M2083O0845Q0646J01895J25138
$$ plain form
60133 4054767 4204833 4380753 4583143 4812398 5068111 5349215 5654858 5984134 6334498
60124 6334498 6701286 7079018 7462139 7844123 8217163 8573716 8907589 9212884 9482844
60115 9482844 9710709 9891163 10020356 10095243 10113698 10074735 9978148 9824874 9618608 9366467
60105 9366467 9077344 8760115 8423923 8079035 7735992 7403982 7090494 6801773 6542591
60096 6542591 6315844 6123193 5965855 5844244 5757331 5703120 5679524 5684361 5715017 5768623 5842037
60085 5842037 5931043 6030062 6133266 6235488 6331675 6416344 6484597 6533259 6560407 6564451 6544698
60074 6544698 6502422 6440368 6361097 6266257 6157053 6034696 5900492 5756073 5603485 5444775
60064 5444775 5281803 5116689 4952091 4790779 4635406 4488806 4353706 4231752 4123504
$$ packed form
60133D054767J50066J75920K02390K29255K55713K81104L05643L29276L50364
60124F334498L66788L77732L83121L81984L73040L56553L33873L05295K69960
60115I482844K27865J80454J29193P4887J8455l8963r6587j53274k06266k52141
60105I366467k89123l17229l36192l44888l43043l32010l13488k88721k59182
60096F542591k26747j92651j57338j21611q6913n4211k3596M837L0656N3606P3414
60085E842037Q9006R9019J03204J02222R6187Q4669O8253M8662K7148M044j9753
60074F544698m2276o2054p9271r4840j09204j22357j34204j44419j52588j58710
60064E444775j62972j65114j64598j61312j55373j46600j35100j21954j08248
$$ plain form
60055 4123504 4029787 3952182 3891727 3848140 3821097 3811430 3820162 3847125 3891508 3953152 4032182 4127617
60043 4127617 4237101 4357645 4485854 4617843 4749791 4878329 4999736 5109199 5201695 5273465
60033 5273465 5322202 5346364 5345183 5319094 5269432 5197772 5105941 4996344 4871769 4735296 4590793
60022 4590793 4442981 4296448 4154861 4021370 3898918 3789514 3693842 3612340 3546269 3497204
60012 3497204 3466068 3453163 3458585 3482043 3522996 3581633 3659072 3755964 3871478 4004162 4152939
60001 4152939 4316427 4491973 4676036 4864679 5052940 5234557 5403457 5555112 5685939
59992 5685939 5792372 5871476 5921716 5942123 5931561 5889818 5818639 5720622 5598021 5453988 5294249
59981 5294249 5126115 4956137 4789789 4632535 4489377 4363334 4255564 4166830 4097838 4048526
$$ packed form
60055D123504r3717p7605o0455m3587k7043r667Q732K6963M4383O1644P9030R5435
60043D127617J09484J20544J28209J31989J31948J28538J21407J09463R2496P1770
60033E273465M8737K4162j181k6089m9662p1660r1831j09597j24575j36473j44503
60022D590793j47812j46533j41587j33491j22452j09404r5672q1502o6071m9065
60012C497204l1136j2905N422K3458M0953N8637P7439R6892J15514J32684J48777
60001D152939J63488J75546J84063J88643J88261J81617J68900J51655J30827
59992E685939J06433P9104N0240K0407j0562m1743p1179r8017j22601j44033j59739
59981E294249j68134j69978j66348j57254j43158j26043j07770q8734o8992m9312
$$ plain form
59971 4048526 4018248 4006564 4012914 4035971 4074418 4128014 4196743 4279244 4373142 4476504 4587702
59960 4587702 4704153 4822359 4938915 5050437 5153128 5243986 5322296 5388628 5442558 5482734
59950 5482734 5509069 5523489 5528573 5526778 5521035 5514863 5511804 5515875 5532458 5567455 5625467 5709817
59938 5709817 5824147 5972480 6157531 6380229 6640997 6940188 7276880 7648137 8049382
59929 8049382 8474068 8912456 9351581 9776677 10171978 10520694 10806166 11014262 11134653
59920 11134653 11160739 11090432 10927882 10683410 10371100 10006634 9606592 9187447 8763672 8346949
59910 8346949 7947067 7572357 7228776 6919599 6646647 6411241 6213831 6053774 5930195
59901 5930195 5842515 5789870 5770756 5783795 5828339 5903934 6009421 6142550 6299955 6477327
$$ packed form
59971D048526l0278j1684O350K3057L8447N3596O8729Q2501R3898J03362J11198
59960D587702J16451J18206J16556J11522J02691R0858P8310O6332N3930M0176
59950E482734K6335J4420N084j795n743o172l059M071J6583L4997N8012Q4350
59938E709817J14330J48333J85051K22698K60768K99191L36692L71257M01245
59929H049382M24686M38388M39125M25096L95301L48716K85472K08096J20391
59920A1134653K6086p0307j62550k44472l12310l64466m00042m19145m23775m16723
59910H346949l99882l74710l43581l09177k72952k35406j97410j60057j23579
59901E930195q7680n2645j9114J3039M4544P5595J05487J33129J57405J77372
$$ plain form
59891 6477327 6669750 6871523 7075127 7270877 7448436 7598454 7712273 7781164 7797829 7758971
59881 7758971 7665489 7520550 7328916 7098056 6837939 6558759 6269493 5978502 5693840 5422049
59871 5422049 5167375 4932490 4718952 4526603 4353556 4197494 4056414 3928009 3809378
59862 3809378 3697955 3592148 3490959 3393871 3301438 3215122 3136137 3065042 3002477 2949328 2905946
59851 2905946 2872113 2847947 2833650 2827843 2827010 2827080 2824856 2817710 2803095 2779258 2746056 2704659 2656890
59838 2656890 2604961 2551082 2496974 2444173 2394681 2350496 2312472 2280522 2254989 2236791 2226088
59827 2226088 2221989 2224017 2232890 2249542 2274300 2307393 2349146 2398927 2454658 2513907 2574980 2636780
59815 2636780 2698513 2759879 2820604 2879145 2932469 2977508 3012321 3035776 3047250 3047274 3037826 3021475
$$ packed form
59891F477327J92423K01773K03604J95750J77559J50018J13819O8891J6665l8858
59881G758971r3482j44939j91634k30860k60117k79180k89266k90991k84662k71791
59871E422049k54674k34885k13538j92349j73047j56062j41080j28405j18631
59862C809378j11423j05807j01189r7088r2433q6316p8985p1095o2565n3149m3382
59851B905946l3833k4166j4297n807q33P0k224p146j4615k3837l3202m1397m7769
59838B656890n1929n3879n4108n2801m9492m4185l8024l1950k5533j8198j0703
59827B226088m099K028Q873J6652K4758L3093M1753M9781N5731N9249O1073O1800
59815B636780O1733O1366O0725N8541N3324M5039L4813K3455J1474K4r448j6351
$$ plain form
59803 3021475 3000770 2978616 2958370 2942997 2934622 2935099 2946240 2969175 3004365 3052803 3116722 3198913
59791 3198913 3301965 3428306 3580240 3759694 3968633 4209785 4485899 4797697 5142647
59782 5142647 5514892 5904329 6294882 6664736 6989342 7244687 7409643 7469316 7419716 7270036
59772 7270036 7039993 6754503 6439036 6116120 5802607 5509052 5241693 5004526 4799377
59763 4799377 4625292 4479358 4358324 4259359 4180167 4119258 4075805 4048683 4036036 4036327 4049388
59752 4049388 4075965 4116595 4171409 4240681 4324943 4424656 4540078 4671504 4819576 4985506
59742 4985506 5170938 5377424 5606331 5859555 6139848 6449813 6791015 7164785 7573250
59733 7573250 8018210 8499047 9012647 9554945 10120976 10703344 11292077 11876354 12445375
$$ packed form
59803C021475k0705k2154k0246j5373q375M77J1141K2935L5190M8438O3919Q2191
59791C198913J03052J26341J51934J79454K08939K41152K76114L11798L44950
59782E142647L72245L89437L90553L69854L24606K55345J64956N9673m9600j49680
59772G270036k30043k85490l15467l22916l13513k93555k67359k37167k05149
59763D799377j74085j45934j21034r8965p9192o0909m3453k7122j2647K91J3061
59752D049388K6577M0630N4814O9272Q4262R9713J15422J31426J48072J65930
59742D985506J85432K06486K28907K53224K80293L09965L41202L73770M08465
59733G573250M44960M80837N13600N42298N66031N82368N88733N84277N69021
$$ plain form
59724 12445375 12987946 13493587 13955669 14373323 14750625 15095486 15419570 15737294 16063169
59715 16063169 16410022 16789171 17209987 17677628 18191620 18746947 19335247 19944104 20556394
59706 20556394 21151779 21709015 22207292 22627468 22954199 23177665 23293892 23304892 23219224 23051430
59696 23051430 22819928 22545282 22249572 21955048 21681680 21446171 21263233 21146381 21106759
59687 21106759 21152418 21289713 21524686 21862581 22306983 22859937 23521556 24288235 25151386
59678 25151386 26097620 27108147 28156402 29206635 30215498 31134848 31914207 32504485 32863823
59669 32863823 32963042 32788747 32345335 31656270 30761806 29712413 28561816 27362750 26163564
59660 26163564 25003665 23910117 22897640 21969890 21119681 20329865 19576918 18835315 18080601
$$ packed form
59724A2445375N42571N05641M62082M17654L77302L44861L24084L17724L25875
59715A6063169L46853L79149M20816M67641N13992N55327N88300O08857O12290
59706B0556394N95385N57236M98277M20176L26731K23466J16227J1000q5668j67794
59696B3051430k31502k74646k95710k94524k73368k35509j82938j16852l9622
59687B1106759M5659J37295K34973L37895M44402N52954O61619P66679Q63151
59678B5151386R46234J010527J048255J050233J008863R19350P79359N90278L59338
59669C2863823R9219j74295m43412o89065q94464j049393j150597j199066j199186
59660B6163564j159899j093548j012477r27750q50209p89816p52947p41603p54714
$$ plain form
59651 18080601 17292938 16462470 15592884 14699180 13801557 12920164 12072132 11269694 10519780
59642 10519780 9825641 9188516 8607590 8079803 7601315 7168961 6779775 6430139 6116455
59633 6116455 5835951 5585903 5362945 5164134 4987885 4832871 4696878 4577834 4475015
59624 4475015 4388012 4315217 4254475 4204407 4163788 4130178 4100357 4071612 4041651 4008064 3968978
59613 3968978 3923603 3871172 3810219 3740051 3662152 3578922 3491844 3402017 3311420 3222099 3134858
59602 3134858 3050325 2970615 2898306 2834189 2777572 2728326 2687063 2653663 2627313 2607931 2596126
59591 2596126 2591803 2594076 2602472 2616910 2636530 2659706 2685243 2712551 2740709 2768351 2794480 2818723
59579 2818723 2841116 2862415 2884058 2906866 2930313 2954058 2979661 3009691 3045655 3088032 3137749
$$ packed form
59651A8080601p87663q30468q69586q93704q97623q81393q48032q02438p49914
59642A0519780o94139o37125n80926n27787m78488m32354l89186l49636l13684
59633F116455k80504k50048k22958j98811j76249j55014j35993j19044j02819
59624D475015q7003p2795o0742n0068m0619l3610k9821k8745k9961l3587l9086
59613C968978m5375n2431o0953p0168p7899q3230q7078q9827r0597q9321q7241
59602C134858q4533p9710p2309o4117n6617m9246m1263l3400k6350j9382j1805
59591B596126m323K273Q396J4438J9620K3176K5537K7308K8158K7642K6129K4243
59579B818723K2393K1299K1643K2808K3447K3745K5603L0030L5964M2377M9717
$$ plain form
59568 3137749 3196176 3263937 3341111 3428556 3527889 3640270 3766194 3906365 4061738 4232860
59558 4232860 4420060 4624026 4845227 5082894 5335284 5600495 5876140 6158614 6443540
59549 6443540 6726557 7003080 7268211 7518007 7750341 7963643 8155656 8324485 8469978
59540 8469978 8592797 8692898 8770218 8825872 8861146 8876347 8872870 8856216 8835314 8819041 8814687
59529 8814687 8828985 8868096 8935927 9033545 9160021 9312149 9483070 9662403 9837918 9996439
59519 9996439 10124109 10208017 10238393 10208747 10114682 9954293 9729591 9446141 9111355 8734316
59509 8734316 8326633 7901358 7470404 7043731 6630259 6237626 5870872 5532748 5225292
59500 5225292 4949736 4705206 4489341 4300449 4137647 3999112 3882075 3784869 3707363 3648995
$$ packed form
59568C137749N8427O7761P7174Q7445R9333J12381J25924J40171J55373J71122
59558D232860J87200K03966K21201K37667K52390K65211K75645K82474K84926
59549F443540K83017K76523K65131K49796K32334K13302J92013J68829J45493
59540H469978J22819J00101P7320N5654L5274J5201l477j6654k0902j6273m354
59529H814687J4298L9111O7831R7618J26476J52128J70921J79333J75515J58521
59519I996439J27670Q3908L0376k9646r4065j60389k24702k83450l34786l77039
59509H734316m07683m25275m30954m26673m13472l92633l66754l38124l07456
59500E225292k75556k44530k15865j88892j62802j38535j17037r7206p7506n8368
$$ plain form
59490 3648995 3608046 3583370 3575376 3584619 3610657 3652899 3711593 3787385 3880692 3991917 4121614
59479 4121614 4270142 4437596 4623849 4828039 5048341 5282836 5529772 5785706 6043972
59470 6043972 6296247 6535020 6753176 6942083 7092369 7196665 7250135 7249062 7191404 7079150
59460 7079150 6918188 6715445 6477702 6213090 5931228 5640735 5347862 5057949 4776458
59451 4776458 4507713 4253895 4016023 3794941 3591019 3404079 3234089 3080924 2943349
59442 2943349 2819451 2708219 2609488 2522303 2444826 2376108 2316515 2266079 2223755 2188461 2159549
59431 2159549 2136124 2117364 2103670 2095939 2093524 2094408 2097578 2103586 2112624 2123842 2137006 2153050 2172398
59418 2172398 2194314 2218336 2244731 2273108 2302303 2332077 2363005 2394037 2422259 2446252 2468233
$$ packed form
59490C648995m0949k4676p994R243K6038M2242N8694P5792R3307J11225J29697
59479D121614J48528J67454J86253K04190K20302K34495K46936K55934K58266
59470F043972K52275K38773K18156J88907J50286J04296N3470j073n7658j12254
59460G079150j60962k02743k37743k64612k81862k90493k92873k89913k81491
59451D776458k68745k53818k37872k21082k03922j86940j69990j53165j37575
59442B943349j23898j11232r8731q7185p7477o8718n9593n0436m2324l5294k8912
59431B159549k3425j8760j3694p731k415Q84L170O008R038J1218J3164J6044J9348
59418B172398K1916K4022K6395K8377K9195K9774L0928L1032K8222K3993K1981
$$ plain form
59407 2468233 2492049 2520680 2556494 2601909 2658158 2724600 2800537 2886599 2983130 3088350 3199582
59396 3199582 3315928 3439141 3572873 3721951 3891539 4085982 4308696 4563215 4853278
59387 4853278 5181540 5549258 5957427 6406751 6895823 7420415 7974786 8551936 9141845
59378 9141845 9731155 10306043 10854970 11368717 11839922 12264123 12640393 12969944 13254945
59369 13254945 13499031 13707252 13883896 14030730 14147551 14232974 14283755 14294772 14261099 14179661
59359 14179661 14048606 13866649 13634437 13355883 13037344 12686196 12310478 11918196 11515317
59350 11515317 11104781 10687950 10266201 9840757 9412537 8983406 8556827 8136639 7726232
59341 7726232 7329551 6951525 6596278 6265782 5960951 5682929 5432300 5208133 5008956
$$ packed form
59407B468233K3816K8631L5814M5415N6249O6442P5937Q6062R6531J05220J11232
59396C199582J16346J23213J33732J49078J69588J94443K22714K54519K90063
59387D853278L28262L67718M08169M49324M89072N24592N54371N77150N89909
59378I141845N89310N74888N48927N13747M71205M24201L76270L29551K85001
59369A3254945K44086K08221J76644J46834J16821Q5423N0781J1017l3673q1438
59359A4179661j31055j81957k32212k78554l18539l51148l75718l92282m02879
59350A1515317m10536m16831m21749m25444m28220m29131m26579m20188m10407
59341G726232l96681l78026l55247l30496l04831k78022k50629k24167j99177
$$ plain form
59332 5008956 4833939 4682291 4552481 4443017 4353220 4282421 4229200 4192133 4170377 4162772 4167320
59321 4167320 4182347 4207243 4241299 4282705 4329328 4379372 4430500 4479402 4523106 4559838 4588021
59310 4588021 4605698 4611744 4606401 4589737 4560883 4519922 4469373 4412690 4352183 4289384 4226326 4165301
59298 4165301 4108266 4057455 4015571 3984347 3963957 3954854 3959073 3978626 4013735 4063898 4129663 4211965
59286 4211965 4310564 4424469 4553154 4695995 4851047 5015483 5186621 5361484 5536039 5705929
59276 5705929 5867389 6016552 6148730 6259662 6347087 6410259 6448528 6461256 6448538 6411289
59266 6411289 6351382 6272489 6179920 6078569 5971267 5859348 5743684 5624527 5501601 5375354
59256 5375354 5247268 5118278 4988170 4857441 4728515 4604035 4485145 4372549 4268033
$$ packed form
59332E008956j75017j51648j29810j09464q9797p0799n3221l7067k1756p605M548
59321D167320J5027K4896L4056M1406M6623N0044N1128M8902M3704L6732K8183
59310D588021J7677O046n343j6664k8854m0961n0549n6683o0507o2799o3058o1025
59298D165301n7035n0811m1884l1224k0390r103M219J9553L5109N0163O5765Q2302
59286D211965R8599J13905J28685J42841J55052J64436J71138J74863J74555J69890
59276E705929J61460J49163J32178J10932Q7425O3172L8269J2728j2718l7249
59266F411289n9907p8893r2569j01351j07302j11919j15664j19157j22926j26247
59256E375354j28086j28990j30108j30729j28926j24480j18890j12596j04516
$$ plain form
59247 4268033 4173583 4090009 4017793 3958453 3913879 3885126 3873061 3879459 3906377 3955214 4027304
59236 4027304 4124554 4248777 4401545 4585466 4804053 5059092 5349413 5673319 6030253 6417986
59226 6417986 6829265 7252957 7677216 8089421 8474147 8814080 9093503 9299910 9423268
59217 9423268 9456187 9395506 9242931 9004489 8690349 8314498 7892969 7441912 6977155 6513763
59207 6513763 6064050 5636256 5235925 4867571 4533839 4234231 3966408 3728333 3518126
59198 3518126 3333049 3170349 3028429 2905714 2799171 2705492 2623073 2551302 2488713 2433512
59188 2433512 2385282 2344502 2310799 2283154 2261236 2245027 2233665 2226226 2223099 2225132 2231967 2242665
59176 2242665 2257357 2276711 2300394 2327672 2359061 2395848 2438476 2486859 2541607 2603196 2670455
$$ packed form
59247D268033r4450q3574p2216n9340m4574k8753j2065O398K6918M8837P2090
59236D027304R7250J24223J52768J83921K18587K55039K90321L23906L56934L87733
59226F417986M11279M23692M24259M12205L84726L39933K79423K06407J23358
59217I423268L2919o0681j52575k38442l14140l75851m21529m51057m64757m63392
59207F513763m49713m27794m00331l68354l33732k99608k67823k38075k10207
59198C518126j85077j62700j41920j22715j06543r3679q2419p1771o2589n5201
59188B433512m8230m0780l3703k7645k1918j6209j1362p439l127K033O835J0698
59176B242665J4692J9354K3683K7278L1389L6787M2628M8383N4748O1589O7259
$$ plain form
59165 2670455 2741594 2816340 2895371 2978085 3062552 3147280 3231290 3312695 3388838 3457707 3517817
59154 3517817 3567096 3603478 3626358 3636093 3632498 3615318 3585796 3546270 3498613 3444419 3386080 3325982
59142 3325982 3265117 3204048 3144748 3089848 3040596 2997269 2960927 2932858 2912823 2899927 2894962
59131 2894962 2899935 2915534 2941049 2976524 3022985 3080711 3149390 3230009 3324481 3433215 3555003
59120 3555003 3689503 3837952 4001151 4178577 4369850 4575355 4795000 5027832 5273032
59111 5273032 5529607 5794671 6063416 6330954 6592770 6843257 7075315 7281637 7454904
59102 7454904 7586770 7668502 7693523 7658687 7563593 7410475 7205037 6955758 6671709 6361777
59092 6361777 6035426 5702221 5369979 5044363 4730129 4431376 4150552 3888699 3646771
$$ packed form
59165B670455P1139P4746P9031Q2714Q4467Q4728Q4010Q1405P6143O8869O0110
59154C517817M9279L6382K2880R735l595j7180k9522l9526m7657n4194n8339o0098
59142C325982o0865o1069n9300n4900m9252m3327l6342k8069k0035j2896m965
59131B894962M973J5599K5515L5475M6461N7726O8679Q0619R4472J08734J21788
59120C555003J34500J48449J63199J77426J91273K05505K19645K32832K45200
59111E273032K56575K65064K68745K67538K61816K50487K32058K06322J73267
59102G454904J31866Q1732K5021l4836r5094j53118k05438k49279k84049l09932
59092F361777l26351l33205l32242l25616l14234k98753k80824k61853k41928
$$ plain form
59083 3646771 3425406 3223602 3039226 2870979 2718445 2580292 2454134 2338408 2232896
59074 2232896 2137175 2049961 1970295 1898041 1833004 1774654 1722767 1677134 1636718 1600307 1567843
59063 1567843 1539895 1516111 1495512 1477924 1463590 1451702 1440917 1430960 1422076 1413249 1402851 1390783
59051 1390783 1378086 1364754 1350017 1334652 1320724 1308820 1297540 1285911 1274292 1262730 1250563
59040 1250563 1238175 1227244 1218887 1213316 1211517 1215187 1224505 1237909 1254506 1274762 1298246 1322670
59028 1322670 1345962 1367514 1386746 1402122 1412461 1417843 1418754 1415770 1410434 1404812 1399688 1394660 1390234
59015 1390234 1388107 1389053 1392386 1397843 1406041 1416500 1427158 1436567 1444756 1451237 1454095 1452022 1445692 1436239
59001 1436239 1423938 1409148 1392963 1376052 1358255 1340122 1323442 1309484 1298037 1288785 1282167 1278248
$$ packed form
59083C646771k21365k01804j84376j68247j52534j38153j26158j15726j05512
59074B232896r5721q7214p9666p2254o5037n8350n1887m5633m0416l6411l2464
59063A567843k7948k3784k0599j7588j4334j1888j0785r957q884q827j0398j2068
59051A390783j2697j3332j4737j5365j3928j1904j1280j1629j1619j1562j2167
59040A250563j2388j0931q357n571j799L670R318J3404J6597K0256K3484K4424
59028A322670K3292K1552J9232J5376J0339N382R11k984n336n622n124n028m426
59015A390234k127R46L333N457Q198J0459J0658R409Q189O481K858k073o330r453
59001A436239j2301j4790j6185j6911j7797j8133j6680j3958j1447r252o618l919
$$ plain form
58989 1278248 1276232 1275873 1277990 1282857 1289455 1296981 1305782 1316090 1327182 1338464 1350209 1362666 1375597
58976 1375597 1389150 1403965 1420093 1437099 1455475 1476444 1500087 1525232 1551567 1580231 1611830
58965 1611830 1645454 1680169 1715897 1752266 1788090 1822533 1855489 1886539 1915042 1941502 1967332
58954 1967332 1993149 2019026 2046430 2077850 2114176 2154487 2198690 2248220 2303679 2364156 2429575
58943 2429575 2501405 2580189 2664584 2753868 2849293 2951925 3061300 3177499 3302664 3439232
58933 3439232 3588366 3751187 3929881 4126449 4341986 4578130 4837656 5122818 5434822
58924 5434822 5775733 6149045 6557570 7002748 7486814 8013330 8584214 9198104 9852573
58915 9852573 10545509 11272440 12024021 12787407 13548106 14288836 14988288 15622979 16169799
$$ packed form
58989A278248k016l59K117M867O598P526Q801J0308J1092J1282J1745J2457J2931
58976A375597J3553J4815J6128J7006J8376K0969K3643K5145K6335K8664L1599
58965A611830L3624L4715L5728L6369L5824L4443L2956L1050K8503K6460K5830
58954A967332K5817K5877K7404L1420L6326M0311M4203M9530N5459O0477O5419
58943B429575P1830P8784Q4395Q9284R5425J02632J09375J16199J25165J36568
58933C439232J49134J62821J78694J96568K15537K36144K59526K85162L12004
58924E434822L40911L73312M08525M45178M84066N26516N70884O13890O54469
58915I852573O92936P26931P51581P63386P60699P40730O99452O34691N46820
$$ plain form
58906 16169799 16606754 16914240 17078525 17093958 16961662 16688115 16286053 15774564 15176021
58897 15176021 14513093 13808314 13083408 12356669 11641802 10949990 10291154 9672139 9095729
58888 9095729 8562870 8074058 7627368 7217484 6838796 6488180 6163606 5862064 5580735
58879 5580735 5318504 5074523 4846750 4633474 4434695 4250352 4078692 3918073 3768857
58870 3768857 3631890 3506489 3391485 3286798 3192347 3106806 3028976 2959074 2897210 2842106
58860 2842106 2792751 2749796 2713762 2683466 2657807 2637585 2623887 2616112 2613209 2615471 2623515 2636928
58848 2636928 2655487 2680270 2712037 2749889 2792957 2841853 2897124 2958092 3024746 3098894 3181759
58837 3181759 3272359 3370085 3476924 3595119 3724475 3864206 4015717 4181265 4361498 4556725
$$ packed form
58906A6169799M36955L07486J64285J5433j32296k73547m02062n11489n98543
58897A5176021o62928p04779p24906p26739p14867o91812o58836o19015n76410
58888I095729n32859m88812m46690m09884l78688l50616l24574l01542k81329
58879E580735k62231k43981k27773k13276j98779j84343j71660j60619j49216
58870C768857j36967j25401j15004j04687r4451q5541p7830o9902o1864n5104
58860B842106m9355m2955l6034l0296k5659k0222j3698p775k903K262Q044J3413
58848B636928J8559K4783L1767L7852M3068M8896N5271O0968O6654P4148Q2865
58837C181759R0600R7726J06839J18195J29356J39731J51511J65548J80233J95227
$$ plain form
58827 4556725 4769294 5002447 5258038 5537578 5844250 6181738 6552232 6957618 7401246
58818 7401246 7886292 8413472 8982302 9593020 10244561 10931331 11643881 12371374 13100961
58809 13100961 13815564 14494596 15116347 15658380 16097587 16413261 16590857 16622520 16506294
58800 16506294 16247380 15859095 15360118 14770937 14113441 13411040 12685585 11954253 11230609
58791 11230609 10526854 9852621 9213030 8610491 8047570 7526235 7046049 6605733 6205325
58782 6205325 5844438 5519855 5227583 4966009 4734243 4528421 4342504 4171651 4011886
58773 4011886 3857392 3701627 3541334 3377360 3212227 3049315 2893462 2749068 2617246
58764 2617246 2496708 2386999 2288825 2201963 2125258 2058129 1999949 1948710 1902655 1862515 1829810
$$ packed form
58827D556725K12569K33153K55591K79540L06672L37488L70494M05386M43628
58818G401246M85046N27180N68830O10718O51541O86770P12550P27493P29587
58809A3100961P14603O79032O21751N42033M39207L15674J77596L1663j16226
58800A6506294k58914l88285m98977n89181o57496p02401p25455p31332p23644
58791A1230609p03755o74233o39591o02539n62921n21335m80186m40316m00408
58782F205325l60887l24583k92272k61574k31766k05822j85917j70853j59765
58773D011886j54494j55765j60293j63974j65133j62912j55853j44394j31822
58764B617246j20538j09709r8174q6862p6705o7129n8180n1239m6055m0140l2705
$$ plain form
58753 1829810 1803760 1782252 1764955 1752845 1745412 1740999 1739265 1740524 1743116 1744161 1742616 1739045 1732805
58740 1732805 1722155 1706902 1688386 1667071 1642652 1616303 1590264 1565163 1539959 1514309 1488781
58729 1488781 1463010 1435956 1407800 1379395 1350214 1319037 1286280 1253450 1220752 1187491 1154339
58718 1154339 1122801 1092874 1063636 1035738 1010825 988765 967843 947470 928437 910820 893981
58707 893981 878314 864749 852819 841357 830674 821897 814777 808391 803256 800343 798719 796723 794707
58694 794707 793941 793544 791391 787527 783733 780120 775145 768744 762527 756920 750996 745137 741220 740136 741549
58679 741549 745851 753771 764365 775999 789025 804850 822842 841001 859371 879921 903464 929682
58667 929682 959784 995711 1036494 1078194 1117292 1151209 1175700 1185384 1177738 1154417 1118935 1075782
$$ packed form
58753A829810k6050k1508j7297j2110p433m413j734J259K592J045j545l571o240
58740A732805j0650j5253j8516k1315k4419k6349k6039k5101k5204k5650k5528
58729A488781k5771k7054k8156k8405k9181l1177l2757l2830l2698l3261l3152
58718A154339l1538k9927k9238k7898k4913k2060k0922k0373j9033j7617j6839
58707H93981j5667j3565j1930j1462j0683q777p120o386n135k913j624j996k016
58694G94707p66l97k153l864l794l613m975o401o217n607n924n859l917j084J413
58679G41549M302P920J0594J1634J3026J5825J7992J8159J8370K0550K3543K6218
58667I29682L0102L5927M0783M1700L9098L3917K4491R684p646k3321l5482m3153
$$ plain form
58655 1075782 1031098 990436 955161 923661 895952 874052 858146 846109 837197 832859 833369 836932
58643 836932 842750 851907 864613 879562 896633 917327 942002 969444 999642 1034153 1073354 1116237
58631 1116237 1163324 1216836 1277563 1344444 1417715 1499619 1591639 1693960 1808009 1936529 2080644
58620 2080644 2239686 2414029 2604924 2811149 3028756 3254219 3484363 3712877 3930390
58611 3930390 4128530 4300564 4437861 4530078 4570570 4558897 4497619 4390388 4244141 4069167
58601 4069167 3874905 3668106 3455822 3246556 3046692 2858421 2682435 2520043 2371762
58592 2371762 2236768 2114962 2007049 1911927 1826945 1751488 1687288 1634435 1590288 1553185 1523902
58581 1523902 1502361 1486106 1473241 1463821 1457252 1451385 1445377 1440418 1436570 1431940 1426115 1421307 1418935
$$ packed form
58655A075782m4684m0662l5275l1500k7709k1900j5906j2037q912m338N10L563
58643H36932N818R157J2706J4949J7071K0694K4675K7442L0198L4511L9201M2883
58631A116237M7087N3512O0727O6881P3271Q1904R2020J02321J14049J28520J44115
58620B080644J59042J74343J90895K06225K17607K25463K30144K28514K17513
58611C930390J98140J72034J37297R2217M0492j1673o1278j07231j46247j74974
58601D069167j94262k06799k12284k09266j99864j88271j75986j62392j48281
58592B371762j34994j21806j07913r5122q4982p5457o4200n2853m4147l7103k9283
58581A523902k1541j6255j2865r420o569n867o008m959l848m630n825m808k372
$$ plain form
58568 1418935 1417961 1417545 1418069 1418357 1414951 1405430 1389811 1368121 1339927 1307086 1273443 1240782 1208354
58555 1208354 1177120 1150457 1129447 1111347 1094157 1078775 1064897 1048754 1027298 1001560 973882
58544 973882 944962 915437 887284 861587 837524 815024 795695 779846 765581 752047 740477
58533 740477 730941 721497 711716 703485 696997 689587 679976 670074 661178 652150 642789 635084 629447 623589
58519 623589 616841 611684 609243 607315 604749 603661 605199 607217 608419 610785 615554 620788 625374 631444
58505 631444 640298 649829 658621 668707 681642 695643 709400 724893 743533 763135 781512 799484
58493 799484 817593 833532 845574 854898 861802 863590 859149 851680 843711 833257 818184 800513 782873
58480 782873 764360 743593 722487 703379 685534 667910 652165 639565 628052 615721 604166
$$ packed form
58568A418935r74m16N24K88l406r521j5619k1690k8194l2841l3643l2661l2428
58555A208354l1234k6663k1010j8100j7190j5382j3878j6143k1456k5738k7678
58544I73882k8920k9525k8153k5697k4063k2500j9329j5849j4265j3534j1570
58533G40477r536r444r781q231o488p410r611r902q896r028r361p705n637n858
58519F23589o748n157k441j928k566j088J538K018J202K366M769N234M586O070
58505F31444Q854R531Q792J0086J2935J4001J3757J5493J8640J9602J8377J7972
58493G99484J8109J5939J2042R324O904J788m441p469p969j0454j5073j7671j7640
58480G82873j8513k0767k1106j9108j7845j7624j5745j2600j1513j2331j1555
$$ plain form
58469 604166 595239 587799 580771 575940 574358 573424 571019 569173 570178 572433 573623 574656 576876 578772
58455 578772 579109 580081 583788 588734 593254 598935 607162 615879 623601 633061 646918 663208 678971 694991
58441 694991 712971 731391 748229 764407 780449 793087 799325 800656 799282 793725 782447 768305
58429 768305 754888 741673 727130 713235 702361 693065 683569 676133 673304 673097 672689 673638 678596 686082
58415 686082 693536 702497 715574 731068 745651 759568 774220 787298 795380 798893 799822 797182 789475
58402 789475 778838 768048 756231 742134 728505 718310 709665 699531 689377 682166 676908 671394
58390 671394 667160 666322 666479 664184 660631 658696 657424 654787 652722 653858 656356 657559 659638 665908 674706
58375 674706 682699 691144 702956 716649 729100 741192 754804 767539 776622 784812 796123 808931
$$ packed form
58469F04166q927p440p028m831j582r34k405j846J005K255J190J033K220J896
58455E78772L37R72L707M946M520N681Q227Q717P722R460J3857J6290J5763J6020
58441F94991J7980J8420J6838J6178J6042J2638O238J331j374n557j1278j4142
58429G68305j3417j3215j4543j3895j0874r296r496p436k829k07m08R49M958P486
58415F86082P454Q961J3077J5494J4583J3917J4652J3078Q082L513R29k640p707
58402G89475j0637j0790j1817j4097j3629j0195q645j0134j0154p211n258n514
58390F71394m234q38J57k295l553j935j272k637k065J136K498J203K079O270Q798
58375F74706P993Q445J1812J3693J2451J2092J3612J2735R083Q190J1311J2808
$$ plain form
58363 808931 819650 829793 842675 856506 867821 878669 893202 909972 924653 937477 950840
58352 950840 962486 968443 970049 970819 969239 962107 952154 944608 938844 931161 923187 919501 919340 918696 918417
58337 918417 922258 929017 934607 939909 948759 960260 970867 981780 996350 1012532 1025949 1038050
58325 1038050 1053182 1070161 1085064 1099685 1118515 1139854 1158667 1175696 1194815 1213898 1227528
58314 1227528 1236427 1245023 1252171 1253689 1251567 1251063 1251130 1247473 1242474 1241988 1244910 1246301 1248235 1256632 1269661
58299 1269661 1280445 1289248 1301804 1317607 1331329 1344033 1361286 1381759 1399421 1415518 1436538
58288 1436538 1461899 1485688 1509117 1538976 1575165 1612166 1651262 1698445 1751558 1802610 1851564
58277 1851564 1904489 1959375 2007640 2048643 2088673 2126515 2154547 2173628 2192308 2211685 2225693
$$ packed form
58363H08931J0719J0143J2882J3831J1315J0848J4533J6770J4681J2824J3363
58352I50840J1646N957J606P70j580p132r953p546n764p683p974l686j61o44k79
58337I18417L841O759N590N302Q850J1501J0607J0913J4570J6182J3417J2101
58325A038050J5132J6979J4903J4621J8830K1339J8813J7029J9119J9083J3630
58314A227528Q899Q596P148J518k122n04O7l657m999m86K922J391J934Q397J3029
58299A269661J0784Q803J2556J5803J3722J2704J7253K0473J7662J6097K1020
58288A436538K5361K3789K3429K9859L6189L7001L9096M7183N3113N1052M8954
58277A851564N2925N4886M8265M1003M0030L7842K8032J9081J8680J9377J4008
$$ plain form
58266 2225693 2235897 2250940 2271599 2291504 2312163 2341669 2378976 2415491 2451825 2496483 2548502
58255 2548502 2598561 2647028 2703180 2766644 2827925 2887461 2955281 3031420 3106029 3179432 3262100
58244 3262100 3354024 3444740 3534773 3635823 3748486 3861800 3976190 4104121 4246316 4390997
58234 4390997 4538594 4702652 4883867 5068740 5256729 5462467 5688132 5921146 6162611
58225 6162611 6429298 6723624 7031641 7354981 7713464 8111315 8533643 8981584 9476448
58216 9476448 10023671 10609546 11240009 11943902 12731263 13590235 14533127 15601328 16816887
58207 16816887 18178138 19713527 21488680 23551671 25931349 28704812 32006710 35962988
58199 35962988 40692174 46393509 53359559 61893002 72314058 85071650 100724138 119775145
$$ packed form
58266B225693J0204J5043K0659J9905K0659K9506L7307L6515L6334M4658N2019
58255B548502N0059M8467N6152O3464O1281N9536O7820P6139P4609P3403Q2668
58244C262100R1924R0716R0033J01050J12663J13314J14390J27931J42195J44681
58234D390997J47597J64058J81215J84873J87989K05738K25665K33014K41465
58225F162611K66687K94326L08017L23340L58483L97851M22328M47941M94864
58216I476448N47223N85875O30463P03893P87361Q58972R42892J068201J215559
58207A6816887J361251J535389J775153K062991K379678K773463L301898L956278
58199C5962988M729186N701335O966050Q533443J0421056J2757592J5652488J9051007
$$ plain form
58191 119775145 142661301 169880137 201770328 237848352 276444346 315138918 351275798
58184 351275798 381650501 402009462 407938576 397212925 371529345 335820560 295817096
58177 295817096 256002355 219073052 186330466 158136177 134260753 114234396 97581924
58170 97581924 83841703 72535421 63235808 55629565 49469617 44518024 40582846 37562951
58162 37562951 35401867 34025739 33369008 33427741 34221312 35688616 37651616 39882956 42164835
58153 42164835 44235310 45683948 45981046 44723621 41921798 38038078 33718717 29474663
58145 29474663 25576361 22138431 19199685 16732290 14662054 12923779 11479213 10284464
58137 10284464 9280518 8425646 7705029 7100087 6577901 6118364 5722332 5383434 5077975
$$ packed form
58191A19775145K2886156K7218836L1890191L6078024L8595994L8694572L6136880
58184C51275798L0374703K0358961N929114j0725651k5683580l5708785m0003464
58177B95817096l9814741l6929303l2742586k8194289k3875424k0026357j6652472
58170I7581924j3740221j1306282r299613p606243o159948m951593l935178l019895
58162C7562951k161084j376128o56731N8733P93571J467304J963000K231340K281879
58153D2164835K070475J448638K97098j257425k801823l883720m319361m244054
58145B9474663l898302l437930k938746k467395k070236j738275j444566j194749
58137A0284464j003946q54872p20617o04942n22186m59537l96032l38898l05459
$$ plain form
58128 5077975 4791464 4529792 4294697 4071781 3852430 3645468 3457328 3280942 3113111
58119 3113111 2963068 2834501 2717439 2606461 2509256 2428940 2355215 2281197 2212304 2150505
58109 2150505 2086251 2014465 1943191 1878415 1815219 1751491 1695360 1650898 1610513 1569264 1533010
58098 1533010 1504707 1476289 1442065 1407286 1375695 1341323 1300505 1259831 1224233 1188790 1149959
58087 1149959 1113576 1084015 1056277 1026269 998305 975152 951124 922493 894729 872192 850463
58076 850463 825979 803521 786887 771452 753224 736288 724249 713072 699401 687381 680291 673781
58064 673781 664215 655545 651102 646618 638278 629898 625299 621045 613395 605158 599103 591815 580653 569780
58050 569780 562795 556251 546850 538180 533862 530731 525290 520458 519462 519381 517130 515636 517645 519539 517862
$$ packed form
58128E077975k86511k61672k35095k22916k19351k06962j88140j76386j67831
58119C113111j50043j28567j17062j10978r7205q0316p3725p4018o8893o1799
58109B150505o4254p1786p1274o4776o3196o3728n6131m4462m0385m1249l6254
58098A533010k8303k8418l4224l4779l1591l4372m0818m0674l5598l5443l8831
58087A149959l6383k9561k7738l0008k7964k3153k4028k8631k7764k2537k1729
58076H50463k4484k2458j6634j5435j8228j6936j2039j1177j3671j2020p090o510
58064F73781r566q670m443m484q340q380m599m254p650q237o055p288j1162j0873
58050E69780o985o544r401q670m318l131n441m832r96q1k251j494K009J894j677
$$ plain form
58035 517862 516168 518881 523834 527254 530608 536177 541073 542095 541749 543391 545125 544220 542681 542737 541744
58020 541744 537401 533144 532518 532912 530676 527728 527218 527313 525355 523814 526066 530335 533593 537402 544085
58005 544085 551155 555338 558274 562462 565322 563156 557468 551645 544837 534814 523572 514384 506324 497153
57991 497153 488578 483185 479118 473183 466534 462098 459172 455622 452644 452215 452484 450749 448503 448742 450821
57976 450821 452604 454940 459212 463202 464250 463987 465199 466625 465580 463144 461852 460756 457616 453617
57962 453617 451043 448563 443595 437207 431971 427074 420144 411910 404573 397689 390059 383519 380354 379127
57948 379127 377538 377114 380433 385891 389993 392879 396859 401339 403981 405146 406503 406836 403759 398043 391841
57933 391841 384380 373908 362130 351973 342479 330663 317086 304951 294897 285304 276614 270755
$$ packed form
58035E17862j694K713M953L420L354N569M896J022l46J642J734r05j539N6r93
58020E41744m343m257o26L94k236k948n10R5j958j541K252M269L258L809O683
58005E44085P070M183K936M188K860k166n688n823o808j0023j1242r188q060r171
57991D97153q575n393m067n935o649m436k926l550k978m29K69j735k246K39K079
57976D50821J783K336M272L990J048k63J212J426j045k436j292j096l140l999
57962D53617k574k480m968o388n236m897o930q234p337o884p630o540l165j227
57948C79127j589m24L319N458M102K886L980M480K642J165J357L33l077n716o202
57933C91841p461j0472j1778j0157r494j1816j3577j2135j0054r593q690n859
$$ plain form
57921 270755 267253 264265 262531 264037 267785 271170 274600 280505 288651 296595 303932 312000 320305 327352
57907 327352 334170 342886 352545 360353 366302 372607 379434 385220 390370 396501 402590 405943 406466 406178 405161
57892 405161 401890 396930 392272 387507 380592 371994 364219 357668 350812 344022 339259 336242 332785 328754
57878 328754 326001 324571 322709 320443 319482 319701 319435 319215 321533 326760 332701 338244 344139 350264 355476
57863 355476 360163 365662 371249 374979 377330 380585 384690 387166 387133 386084 384631 381907 378329 375596 373630
57848 373630 370640 366421 362549 359243 355139 350284 346252 343127 339433 335170 331847 329393 326113 321877
57834 321877 318347 315849 312975 309375 305997 302525 297601 291670 286549 282067 276177 268488 260584 252833
57820 252833 244172 235242 228293 223542 218825 213346 208578 204962 200980 196226 192292 189832 187718 185808
$$ packed form
57921B70755l502k988j734J506L748L385L430N905Q146P944P337Q068Q305P047
57907C27352O818Q716R659P808N949O305O827N786N150O131O089L353N23k88j017
57892D05161l271m960m658m765o915q598p775o551o856o790m763l017l457m031
57878C28754k753j430j862k266r61K19k66k20K318N227N941N543N895O125N212
57863C55476M687N499N587L730K351L255M105K476l3j049j453k724l578k733j966
57848C73630k990m219l872l306m104m855m032l125l694m263l323k454l280m236
57834C21877l530k498k874l600l378l472m924n931n121m482n890p689p904p751
57820B52833q661q930o949m751m717n479m768l616l982m754l934k460k114j910
$$ plain form
57806 185808 185544 186990 188227 188635 190030 193687 198840 204928 212582 221520 230087 237823 246019 254896 262676
57791 262676 268353 273043 277790 282293 286489 291086 295757 298984 300362 300920 300755 298641 294427 289454 284171
57776 284171 277705 270166 262888 255969 248209 239949 233250 228638 224409 219898 216692 215690 215663 215783 217015
57761 217015 219858 223071 225765 228562 231703 234252 236184 239052 243557 248492 252932 257323 261661 264862
57747 264862 266830 268959 271679 273725 274688 275984 278403 281017 283467 286932 291736 296408 300320 304947
57733 304947 311132 317372 322333 327083 333263 340813 348952 357858 367985 379041 390769 403461 416910
57720 416910 430289 443697 458301 474433 491285 508925 528663 550851 574438 599363 627260
57709 627260 659007 693756 731219 772747 819287 870609 927559 992809 1068188 1153393 1248461
$$ packed form
57806A85808k64J446J237M08J395L657N153O088P654Q938Q567P736Q196Q877P780
57791B62676N677M690M747M503M196M597M671L227J378N58j65k114m214m973n283
57776B84171o466p539p278o919p760q260o699m612m229m511l206j002k7J20J232
57761B17015K843L213K694K797L141K549J932K868M505M935M440M391M338L201
57747B64862J968K129K720K046R63J296K419K614K450L465M804M672L912M627
57733C04947O185O240M961M750O180P550Q139Q906J0127J1056J1728J2692J3449
57720D16910J3379J3408J4604J6132J6852J7640J9738K2188K3587K4925K7897
57709F27260L1747L4749L7463M1528M6540N1322N6950O5250P5379Q5205R5068
$$ plain form
57698 1248461 1355331 1475818 1610213 1759105 1924305 2106555 2304275 2515643 2739415
57689 2739415 2971964 3205439 3430305 3637652 3817860 3959949 4055032 4099440 4093342 4038731
57679 4038731 3940838 3809508 3656452 3491812 3324520 3163780 3017685 2891446 2788830 2713957
57669 2713957 2669330 2652859 2658585 2679306 2706456 2728145 2729834 2698231 2625412 2511576 2365847
57658 2365847 2203510 2040117 1886861 1750135 1632946 1535469 1455875 1392344 1343890 1308981
57648 1308981 1285133 1270911 1266824 1273216 1288820 1312603 1345453 1388722 1442516 1506785 1582680 1671469
57636 1671469 1773339 1888539 2018379 2163747 2323807 2497174 2682729 2877730 3076276
57627 3076276 3270893 3454343 3618746 3754674 3853102 3907779 3915213 3874348 3787912 3662694
$$ packed form
57698A248461J06870J20487J34395J48892J65200J82250J97720K11368K23772
57689B739415K32549K33475K24866K07347J80208J42089R5083M4408o098n4611
57679D038731r7893j31330j53056j64640j67292j60740j46095j26239j02616p4873
57669B713957m4627j6471N726K0721K7150K1689J689l1603p2819j13836j45729
57658B365847j62337j63393j53256j36726j17189r7477p9594o3531m8454l4909
57648A308981k3848j4222m087O392J5604K3783L2850M3269N3794O4269P5895Q8789
57636A671469J01870J15200J29840J45368J60060J73367J85555J95001J98546
57627C076276J94617J83450J64403J35928R8428N4677P434m0865q6436j25218
$$ plain form
57617 3662694 3506835 3327725 3133107 2931906 2731812 2537214 2350846 2175749 2013878
57608 2013878 1864577 1726651 1600729 1487716 1386289 1294137 1210626 1136177 1069983 1010409
57598 1010409 956841 909224 866499 827347 791701 759843 730916 704031 679853 659200 640971
57587 640971 623415 606599 591672 578443 565761 553605 542770 532985 523349 514205 506686 500760
57575 500760 495491 490871 487634 485630 484139 483392 484160 486180 488670 491990 497113 503856 511338 519797 530266
57560 530266 542775 556498 571341 587768 605467 623901 643864 666816 692990 721843 754032
57549 754032 791139 833765 881722 935869 997824 1067870 1145086 1229751 1323858 1429037 1545508
57538 1545508 1673220 1812239 1961508 2118435 2279914 2442304 2600130 2746072 2872672
$$ packed form
57617C662694j55859j79110j94618k01201k00094j94598j86368j75097j61871
57608B013878j49301j37926j25922j13013j01427r2152q3511p4449o6194n9574
57598A010409n3568m7617m2725l9152l5646l1858k8927k6885k4178k0653j8229
57587F40971j7556j6816j4927j3229j2682j2156j0835r785r636r144p519n926
57575E00760n269m620l237k004j491p47P68K020K490L320N123O743P482Q459J0469
57560E30266J2509J3723J4843J6427J7699J8434J9963K2952K6174K8853L2189
57549G54032L7107M2626M7957N4147O1955P0046P7216Q4665R4107J05179J16471
57538A545508J27712J39019J49269J56927J61479J62390J57826J45942J26600
$$ plain form
57529 2872672 2973263 3041663 3072820 3064601 3018247 2937167 2826299 2692451 2543588 2386959
57519 2386959 2228226 2072028 1922131 1780932 1649780 1529841 1421896 1325536 1239647 1163580
57509 1163580 1096968 1038709 987314 942158 903370 870691 843439 821301 804006 790509 779732
57498 779732 771938 768176 768520 772022 778206 787404 799777 815246 834330 857874 886044 918719 956721
57485 956721 1001429 1053330 1112179 1178603 1254321 1340656 1437851 1545816 1664502 1793463 1931823
57474 1931823 2078399 2230676 2383692 2530747 2664983 2779500 2866745 2919639 2933823 2908328
57464 2908328 2844747 2746989 2621349 2475192 2315289 2147961 1979886 1816905 1662067 1516146
57454 1516146 1379910 1254665 1140957 1038368 946567 865150 792574 726745 666753 612862
$$ packed form
57529B872672J00591O8400L1157q219m6354q1080j10868j33848j48863j56629
57519B386959j58733j56198j49897j41199j31152j19939j07945r6360q5889p6067
57509A163580o6612n8259n1395m5156l8788l2679k7252k2138j7295j3497j0777
57498G79732p794l762L44L502O184R198J2373J5469J9084K3544K8170L2675L8002
57485I56721M4708N1901N8849O6424P5718Q6335R7195J07965J18686J28961J38360
57474A931823J46576J52277J53016J47055J34236J14517Q7245N2894J4184k5495
57464B908328o3581r7758j25640j46157j59903j67328j68075j62981j54838j45921
57454A516146j36236j25245j13708j02589r1801q1417p2576o5829n9992n3891
$$ plain form
57444 612862 564993 522525 485229 452794 423672 396094 370222 347615 328541 311498 295450
57433 295450 280748 267521 254943 242592 231082 220832 211486 202824 194938 187296 179052 170533 163034
57420 163034 156848 150921 144684 138719 133299 127881 122505 118208 115486 113604 111874 110289 108579 106119
57406 106119 103253 101267 100579 100275 99834 99764 100045 99616 98123 96712 96260 96256 96187 96579 97745 98852 99231 99411
57388 99411 99892 100091 99477 98628 98172 97714 96741 95580 94446 92609 89563 86135 83324 80814 77656 73756
57372 73756 69613 65185 60037 54213 48194 42372 37180 33225 30626 28658 26555 24264 22049 20102
57358 20102 18926 19302 21208 23390 24583 24608 23942 22935 21913 21255 20796 19847 18216 16540 15287 14257
57342 14257 13525 13850 15542 17816 19957 22349 25688 29884 34367 38809 43004 46744 50364 54713 60037
$$ packed form
57444F12862m7869m2468l7296l2435k9122k7578k5872k2607j9074j7043j6048
57433B95450j4702j3227j2578j2351j1510j0250r346q662p886p642q244q519p499
57420A63034o186n927o237n965n420n418n376m297k722j882j730j585j710k460
57406A06119k866j986o88l04m41p0K81m29j493j411m52mo9L92J166J107L79J80
57388I9411M81J99o14q49m56m58r73j161j134j837l046l428k811k510l158l900
57372G3756m143m428n148n824o019n822n192l955k599j968k103k291k215j947
57358B0102j176L76J906K182J193K5o66j007j022o58m59r49j631j676j253j030
57342A4257p32L25J692K274K141K392L339M196M483M442M195L740L620M349N324
$$ plain form
57327 60037 65583 70800 76125 82073 88326 94313 99948 105279 110156 114811 119962 125822 131813 137754
57313 137754 144372 152015 159837 167007 173914 181426 189806 199068 209611 221585 234325 247237 260675
57300 260675 275283 291073 307819 325669 344705 364628 385558 408340 433250 459076 484294
57289 484294 508433 531476 552655 570865 585706 597104 604282 606049 601908 592201 577407 557875
57277 557875 533976 506036 474509 440619 406373 373471 342639 314260 288939 266965 247870
57266 247870 230942 215640 201308 187370 174178 162725 153120 144350 136011 128976 123683 119028 113936
57253 113936 108866 104666 100997 97207 93949 92478 92731 93305 93046 91766 89754 87439 85253 83183 80924
57238 80924 78869 78126 78929 79934 79840 78793 77409 75565 73277 71640 71487 71926 71649 70993 71234 72426 73450
$$ packed form
57327F0037N546N217N325N948O253N987N635N331M877M655N151N860N991N941
57313A37754O618P643P822P170O907P512Q380R262J0543J1974J2740J2912J3438
57300B60675J4608J5790J6746J7850J9036J9923K0930K2782K4910K5826K5218
57289D84294K4139K3043K1179J8210J4841J1398P178J767m141r707j4794j9532
57277E57875k3899k7940l1527l3890l4246l2902l0832k8379k5321k1974j9095
57266B47870j6928j5302j4332j3938j3192j1453r605q770q339p035n293m655n092
57253A13936n070m200l669l790l258j471K53N74k59j280k012k315k186k070k259
57238H0924k055p43Q03J005r4j047j384j844k288j637j53M39k77o56K41J192J024
$$ plain form
57221 73450 73817 73936 73903 73498 73276 74281 76675 79839 83713 88751 94494 99451 102707 104764 106622 108800
57205 108800 111390 114256 117074 119688 122487 125935 129876 133796 137519 141171 144833 148745 153489 159410
57191 159410 166256 173834 182367 191685 200956 210080 220481 233391 248032 262675 277034 292388 309730
57178 309730 328958 349658 371518 394124 417350 441839 468205 495971 524095 552227 580560
57167 580560 608895 636856 664728 692975 721203 748646 775549 802999 831398 860035 888195
57156 888195 915917 943677 972009 1001370 1031799 1062803 1094058 1126016 1159438 1194690 1231824
57145 1231824 1270780 1311037 1351753 1392754 1434748 1478173 1522785 1568937 1618240 1672241 1731457
57134 1731457 1796374 1868028 1946428 2029455 2114496 2200308 2286373 2371689 2455519 2538372 2621023
$$ packed form
57221G3450L67J19l3m05k22J005K394L164L874N038N743M957L256K057J858K178
57205A08800K590K866K818K614K799L448L941L920L723L652L662L912M744N921
57191A59410O846P578Q533R318R271R124J0401J2910J4641J4643J4359J5354J7342
57178C09730J9228K0700K1860K2606K3226K4489K6366K7766K8124K8132K8333
57167E80560K8335K7961K7872K8247K8228K7443K6903K7450K8399K8637K8160
57156H88195K7722K7760K8332K9361L0429L1004L1255L1958L3422L5252L7134
57145A231824L8956M0257M0716M1001M1994M3425M4612M6152M9303N4001N9216
57134A731457O4917P1654P8400Q3027Q5041Q5812Q6065Q5316Q3830Q2853Q2651
$$ plain form
57123 2621023 2703560 2786579 2872214 2962734 3059119 3162150 3273665 3395412 3527914 3671873
57113 3671873 3829480 4003158 4194568 4406411 4643850 4912911 5219260 5570130 5975624
57104 5975624 6446772 6994915 7635654 8392120 9293597 10374838 11680196 13266283 15197821
57095 15197821 17542807 20372786 23761796 27778154 32476252 37894625 44052451 50939793
57087 50939793 58514045 66709382 75442499 84605142 94066642 103697779 113367555 122862153
57079 122862153 131776276 139505142 145390470 148922216 149857492 148220503 144242049 138287646
57071 138287646 130780743 122133474 112715875 102866471 92906929 83133093 73794133 65080701
57063 65080701 57121804 49983012 43670779 38148350 33355219 29219945 25667256 22624138
$$ packed form
57123B621023Q2537Q3019Q5635R0520R6385J03031J11515J21747J32502J43959
57113C671873J57607J73678J91410K11843K37439K69061L06349L50870M05494
57104E975624M71148N48143O40739P56466R01477J081241J305358J586087J931538
57095A5197821K344986K829979L389010M016358M698098N418373O157826O887342
57087E0939793P574252Q195337Q733117R162643R461500R631137R669776R494598
57079A22862153Q914123P728866N885328L531746R35276j636989l978454n954403
57071A38287646p506903q647269r417599r849404r959542r773836r338960q713432
57063F5080701p958897p138792o312233n522429m793131m135274l552689l043118
$$ plain form
57055 22624138 20023370 17802900 15905372 14280493 12886363 11687353 10652384 9755777
57047 9755777 8977017 8297966 7701689 7174495 6706742 6290355 5917287 5581163 5278095
57038 5278095 5004445 4755379 4526677 4316262 4122847 3944562 3779849 3628018 3487767
57029 3487767 3356493 3232171 3114673 3004335 2900403 2801745 2707987 2619183 2535422 2457422
57019 2457422 2386253 2321671 2261799 2205160 2152031 2103246 2058948 2019407 1985944 1959985 1942023
57008 1942023 1932538 1933435 1947669 1977919 2026605 2096990 2192964 2316411 2464285 2628427 2798087
56997 2798087 2960853 3099043 3186802 3197022 3117228 2959996 2756285 2538295 2328078 2137701
56987 2137701 1973290 1836542 1725511 1636848 1567275 1513038 1469782 1433678 1401388 1368937 1332671
$$ packed form
57055B2624138k600768k220470j897528j624879j394130j199010j034969q96607
57047I755777p78760o79051n96277n27194m67753m16387l73068l36124l03068
57038E278095k73650k49066k28702k10415j93415j78285j64713j51831j40251
57029C487767j31274j24322j17498j10338j03932r8658r3758q8804q3761p8000
57019B457422p1169o4582n9872n6639n3129m8785m4298l9541l3463k5959j7962
57008A942023r485Q97J4234L0250M8686P0385R5974J23447J47874J64142J69660
56997B798087J62766J38190Q7759J0220p9794j57232k03711k17990k10217j90377
56987B137701j64411j36748j11031q8663o9573n4237m3256l6104l2290l2451l6266
$$ plain form
56976 1332671 1292007 1249566 1207993 1168203 1130961 1097906 1069843 1045669 1024090 1005098 988955
56965 988955 975302 964313 957331 955323 957905 964827 977014 994939 1016946 1040114 1061637 1078341
56953 1078341 1086092 1081277 1062788 1032187 992866 949571 907281 869097 835522 806209 781541 761948
56941 761948 746967 736090 729732 728455 732047 740358 754347 775299 803337 837299 875414 915292
56929 915292 953627 986356 1008792 1015839 1003753 972921 928407 877072 824463 774245 728853 689338
56917 689338 655262 625745 600301 578335 558804 541141 525797 513143 502585 493409 485672 479488
56905 479488 474179 469029 464245 460371 457274 454450 451961 450360 450088 451454 454813 460375 468218 478718
56891 478718 492447 509481 529464 552333 578047 605434 632375 657285 679192 696118 704952 703882
$$ packed form
56976A332671m0664m2441m1573l9790l7242l3055k8063k4174k1579j8992j6143
56965I88955j3653j0989o982k008K582O922J2187J7925K2007K3168K1523J6704
56953A078341P751m815j8489l0601l9321m3295m2290l8184l3575k9313k4668j9593
56941G61948j4981j0877o358j277L592Q311J3989K0952K8038L3962L8115L9878
56929I15292L8335L2729K2436P047j2086l0832m4514n1335n2609n0218m5392l9515
56917F89338l4076k9517k5444k1966j9531j7663j5344j2654j0558r176p737o184
56905D79488n309n150m784l874l097k824k489j601k72J366L359N562P843J0500
56891D78718J3729J7034J9983K2869K5714K7387K6941K4910K1907J6926Q834j070
$$ plain form
56879 703882 693986 677804 657529 635294 613791 595182 579981 567795 558555 552435 549532 550401 556083
56866 556083 567000 582778 603730 631306 666241 707301 752651 801041 850275 895410 929803
56855 929803 947736 945956 924464 887327 841719 794443 749368 708483 673875 647227 628456 616584
56843 616584 611548 614024 624257 642495 670120 709029 760113 823081 896885 979013 1064908 1148992
56831 1148992 1225408 1286714 1323467 1327846 1298412 1240653 1163573 1076768 989269 908021 836242
56820 836242 774188 721760 679544 647690 625401 611990 607539 612396 626938 651964 688268 735417
56808 735417 791266 852538 915114 973719 1021918 1052834 1060567 1042443 1001089 943849 879226 813689
56796 813689 751490 695715 648023 608154 575133 548722 529018 515488 507639 505935 510904 521997
$$ packed form
56879G03882r896j6182k0275k2235k1503j8609j5201j2186r240o120k903Q69N682
56866E56083J0917J5778K0952K7576L4935M1060M5350M8390M9234M5135L4393
56855I29803J7933j780k1492l7137m5608m7276m5075m0885l4608k6648j8771j1872
56843F16584n036K476J0233J8238K7625L8909N1084O2968P3804Q2128Q5895Q4084
56831A148992P6416O1306L6753M379k9434n7759p7080q6805q7499q1248p1779
56820H36242o2054n2428m2216l1854k2289j3411m451M857J4542K5026L6304M7149
56808G35417N5849O1272O2576N8605M8199L0916P733j8124m1354n7240o4623o5537
56796H13689o2199n5775m7692l9869l3021k6411j9704j3530p849j704M969J1093
$$ plain form
56784 521997 538536 560921 589286 621481 653918 683924 709513 727240 732520 722836 699579 666596
56772 666596 628015 587445 547739 510711 477467 448921 425373 405914 389260 375032 363398
56761 363398 353909 345821 339187 334421 330950 327570 324023 321009 318699 316392 313607 310413 306746 302574
56747 302574 298697 296233 295177 294500 293609 292635 291382 289286 286511 283932 281781 279329 276156 272810 269970
56732 269970 267783 266163 264993 263934 262690 261457 260488 259490 258220 257351 257719 258914 259627 259274 258381 257483
56716 257483 256643 255950 255558 255221 254524 253453 252119 250336 248243 246792 246671 247194 247206 246572 245797 244900 243843
56699 243843 243334 243819 244324 243834 243150 243756 245330 246258 246208 246294 246953 247679 248783 251290 254857 257721 259148
56682 259148 260175 261550 262721 263405 264362 265884 266947 266633 265223 263372 261374 259603 258464 257447 255447
$$ packed form
56784E21997J6539K2385K8365L2195L2437L0006K5589J7727N280r684k3257l2983
56772F66596l8581m0570l9706l7028l3244k8546k3548j9459j6654j4228j1634
56761C63398r489q088o634m766l471l380l547l014k310k307k785l194l667m172
56747C02574l877k464j056o77q91r74j253k096k775k579k151k452l173l346k840
56732B69970k187j620j170j059j244j233r69r98j270q69L68J195P13l53q93q98
56716B57483q40o93l92l37o97j071j334j783k093j451j21N23J2o34p75q97j057
56699B43843n09M85N05m90o84O06J574R28n0Q6O59P26J104K507L567K864J427
56682B59148J027J375J171O84R57J522J063l14j410j851j998j771j139j017k000
$$ plain form
56667 255447 252378 249386 247211 245601 244509 244461 245297 245868 245486 244646 244031 243901 244546 246043 247419 247364 246004
56650 246004 244662 243769 242486 240544 238843 237848 236915 235640 234440 233383 231857 229825 228046 226727 225325
56635 225325 223972 223572 224141 224592 224508 224599 225042 225051 224515 224389 224937 225299 225300 225937 227463 228757 229293 229959 231173
56616 231173 232033 232202 232832 234553 236264 237051 237668 238992 240508 241547 242535 243808 244567 244254 243666 243539 243246
56599 243246 242074 240570 239490 238580 237505 236807 236870 237032 236817 236909 237846 238927 239483 240042 241149 242203 242609
56582 242609 243029 244274 245932 247162 248004 249019 250567 253156 257278 262070 265440 266538 266841 267991 269949
56567 269949 272300 275700 280645 286177 291333 296657 302894 309347 315068 320610 327083 334338 341410 347939
56553 347939 353888 358799 362579 366146 370102 373665 376011 377589 378932 379327 378016 375607 372872 369199
$$ packed form
56667B55447l069k992k175j610j092m8Q36N71l82q40o15j30O45J497J376n5j360
56650B46004j342q93j283j942j701r95r33j275j200j057j526k032j779j319j402
56635B25325j353m00N69M51q4R1M43Rn36j26N48L62JO37J526J294N36O66J214
56616B31173Q60J69O30J721J711P87O17J324J516J039R88J273P59l13n88j27k93
56599B43246j172j504j080r10j075o98O3J62k15R2R37J081N56N59J107J054M06
56582B42609M20J245J658J230Q42J015J548K589M122M792L370J098L03J150J958
56567B69949K351L400M945N532N156N324O237O453N721N542O473P255P072O529
56553C47939N949M911L780L567L956L563K346J578J343L95j311k409k735l673
$$ plain form
56539 369199 363725 357068 350438 343912 336979 329943 323343 316872 310308 304656 300806 297757 293707 288344
56525 288344 282756 277756 273572 270483 268333 266090 263163 260499 259149 258508 257261 255296 253276 251144
56511 251144 248514 245890 244059 242800 241526 240561 240455 240695 240459 240092 240472 241500 242500 243521 244972 246497
56495 246497 247495 248258 249328 250300 250479 250221 250433 251268 252369 253835 255825 257819 259325 260729 262502 264334
56479 264334 266000 268160 271189 274139 276097 277668 279929 282760 285460 288139 291201 294244 296748 299156
56465 299156 302121 305498 309072 313264 318071 322451 325902 329395 333451 336692 337817 337669 337672 337556 336481
56450 336481 335140 334702 334642 333695 332200 331520 331820 332304 332951 334216 335637 336524 337386 338914 340236 339949 338289
56433 338289 336602 335286 333900 332541 331367 329497 326177 322400 319631 317646 315284 312495 309835 306774
$$ packed form
56539C69199n474o657o630o526o933p036o600o471o564n652l850l049m050n363
56525B88344n588n000m184l089k150k243k927k664j350o41j247j965k020k132
56511B51144k630k624j831j259j274r65j06K40k36l67L80J028J000J021J451J525
56495B46497R98P63J070R72J79k58K12Q35J101J466J990J994J506J404J773J832
56479B64334J666K160L029K950J958J571K261K831K700K679L062L043K504K408
56465B99156K965L377L574M192M807M380L451L493M056L241J125j48Lj16j075
56450C36481j341m38o0r47j495o80L00M84O47J265J421Q87Q62J528J322k87j660
56433C38289j687j316j386j359j174j870l320l777k769j985k362k789k660l061
$$ plain form
56419 306774 302462 297527 293278 289735 286196 282992 280873 279408 277783 276380 275792 275215 273741 272237 271889
56404 271889 271966 271233 270543 271524 273579 274790 275159 276263 278173 279399 279656 280119 280962 281074 280329 279965 280606
56387 280606 281788 283291 285123 286522 286909 287379 289269 291742 292897 292815 293241 294684 296074 296968 297851 298533
56371 298533 298473 298463 299840 302258 304245 305525 306781 307749 307846 308111 310009 312778 314401 314760 315308 316061 315662
56354 315662 314273 313722 314731 316383 318231 320575 322852 324132 325114 327278 330382 333109 335723 339534 344199
56339 344199 348300 352199 357519 364094 370411 376751 384775 394057 402227 408737 415421 423011 430126 436067
56325 436067 441707 447158 451339 454309 457314 460174 461354 460979 461028 462071 462530 461550 459992 458248 455739
56310 455739 453006 451575 451343 450619 449063 447977 447517 446342 444293 442698 441804 440624 439474 439843 441618
$$ packed form
56419C06774m312m935m249l543l539l204k119j465j625j403n88n77j474j504l48
56404B71889P7p33o90R81K055J211L69J104J910J226K57M63Q43J12p45l64O41
56387B80606J182J503J832J399L87M70J890K473J155q2M26J443J390Q94Q83O82
56371B98533o0j0J377K418J987J280J256R68R7K65J898K769J623L59N48P53l99
56354C15662j389n51J009J652J848K344K277J280R82K164L104K727K614L811M665
56339C44199M101L899N320O575O317O340Q024R282Q170O510O684P590P115N941
56325D36067N640N451M181K970L005K860J180l75M9J043M59r80j558j744k509
56310D55739k733j431k32p24j556j086m60j175k049j595q94j180j150L69J775
$$ plain form
56295 441618 443333 445263 449183 454918 460309 464905 470505 477686 485043 492347 501163 511797 522784 533982
56281 533982 547008 562116 577789 593917 612064 632210 652622 673537 697490 725360 755610
56270 755610 788057 824771 866509 911935 961314 1017222 1080611 1149874 1224879 1308253 1401427
56259 1401427 1503084 1612712 1731926 1860782 1996324 2136164 2279985 2426111 2570190
56250 2570190 2708758 2840615 2963254 3071640 3162245 3234925 3289471 3324036 3338647 3336495 3319991
56239 3319991 3289160 3245702 3194692 3139938 3081042 3017080 2949801 2881005 2810083 2736316 2660586
56228 2660586 2582883 2501306 2415474 2327776 2239501 2149092 2056028 1962971 1872021 1782252 1693003
56217 1693003 1606273 1523705 1444517 1368458 1297579 1233038 1173405 1117993 1068464 1025207 985600
$$ packed form
56295D41618J715J930L920N735N391M596N600P181P357P304Q816J0634J0987J1198
56281E33982J3026J5108J5673J6128J8147K0146K0412K0915K3953K7870L0250
56270G55610L2447L6714M1738M5426M9379N5908O3389O9263P5005Q3374R3174
56259A401427J01657J09628J19214J28856J35542J39840J43821J46126J44079
56250B570190J38568J31857J22639J08386R0605P2680N4546L4565J4611k152j6504
56239C319991l0831m3458n1010n4754n8896o3962o7279o8796p0922p3767p5730
56228B660586p7703q1577q5832q7698q8275r0409r3064r3057r0950q9769q9249
56217A693003q6730q2568p9188p6059p0879o4541n9633n5412m9529m3257l9607
$$ plain form
56206 985600 947912 913449 882948 854465 826902 801922 780329 760289 741285 725935 715467
56195 715467 707239 699092 692324 687946 684032 679485 676576 676970 678861 680702 684000 689820 696323 702471
56181 702471 710279 720626 730718 738493 745578 753138 758968 761743 763924 767212 769267 768282 766707 766931
56167 766931 767313 766088 765228 766659 768472 768705 769227 772105 775650 777751 779603 782596 785207 786548 789370
56152 789370 795885 804183 812295 822038 835320 850553 866417 885310 909487 937836 970221 1010921
56140 1010921 1063890 1128712 1205008 1296381 1405620 1529974 1665126 1809394 1959691 2107829
56130 2107829 2245699 2370529 2481338 2575165 2651579 2716336 2775310 2828400 2873417 2911019 2940900
56119 2940900 2958095 2958854 2946321 2925516 2897026 2860336 2818203 2771747 2715534 2643309 2554849 2452601
$$ packed form
56206I85600l7688l4463l0501k8483k7563k4980k1593k0040j9004j5350j0468
56195G15467q228q147o768m378l914m547k909L94J891J841L298N820O503O148
56181G02471P808J0347J0092P775P085P560N830K775K181L288K055r85j575K24
56167G66931L82j225q60J431J813K33N22K878L545K101J852K993K611J341K822
56152G89370O515Q298Q112R743J3282J5233J5864J8893K4177K8349L2385M0700
56140A010921N2969O4822P6296R1373J09239J24354J35152J44268J50297J48138
56130B107829J37870J24830J10809R3827P6414O4757N8974N3090M5017L7602K9881
56119B940900J7195P59j2533k0805k8490l6690m2133m6456n6213p2225q8460j02248
$$ plain form
56107 2452601 2336870 2210059 2080556 1955999 1836953 1722770 1618393 1528879 1452147 1383853
56097 1383853 1324758 1276628 1235830 1198187 1165756 1141678 1122845 1104851 1089648 1080816 1075623 1069327
56085 1069327 1063164 1060507 1059375 1056391 1053967 1055737 1058991 1059498 1059762 1064501 1071973 1077765 1083175 1091797
56071 1091797 1101798 1109631 1117394 1128513 1140312 1148976 1157400 1169865 1183471 1193416 1202117 1214317
56059 1214317 1227925 1238696 1249177 1263734 1279542 1292015 1304216 1321091 1339439 1353779 1367092
56048 1367092 1385337 1406297 1424596 1442685 1465826 1491268 1513813 1537063 1567372 1601459 1631980
56037 1631980 1660522 1693052 1727582 1758904 1790453 1828538 1869770 1907352 1944522 1988172 2034536
56026 2034536 2075574 2114278 2158868 2206942 2250747 2293105 2342160 2395107 2443470 2490082 2544211
$$ packed form
56107B452601j15731j26811j29503j24557j19046j14183j04377q9514p6732o8294
56097A383853n9095m8130m0798l7643l2431k4078j8833j7994j5203q832n193o296
56085A069327o163k657j132k984k424J770L254N07K64M739P472N792N410Q622
56071A091797J0001P833P763J1119J1799Q664Q424J2465J3606R945Q701J2200
56059A214317J3608J0771J0481J4557J5808J2473J2201J6875J8348J4340J3313
56048A367092J8245K0960J8299J8089K3141K5442K2545K3250L0309L4087L0521
56037A631980K8542L2530L4530L1322L1549L8085M1232L7582L7170M3650M6364
56026B034536M1038L8704M4590M8074M3805M2358M9055N2947M8363M6612N4129
$$ plain form
56015 2544211 2604262 2662162 2720466 2787714 2861154 2931811 3002362 3081983 3168066 3251703 3336522
56004 3336522 3432646 3536795 3638580 3741740 3858147 3985559 4113061 4243696 4389000 4545835
55994 4545835 4702304 4862025 5038123 5227829 5418437 5613700 5827842 6058473 6293402
55985 6293402 6539423 6814873 7118388 7435720 7772665 8148811 8563512 9002410 9473078
55976 9473078 9998280 10578827 11201484 11878872 12641029 13492803 14423461 15453614 16626416
55967 16626416 17958563 19451429 21145791 23111861 25393733 28027003 31107756 34781421
55959 34781421 39177033 44433888 50789607 58563143 68072862 79680855 93900953 111328946
55951 111328946 132477876 157825290 187918265 223008646 262325630 303859572 344935745
$$ packed form
56015B544211O0051N7900N8304O7248P3440P0657P0551P9621Q6083Q3637Q4819
56004C336522R6124J04149J01785J03160J16407J27412J27502J30635J45304J56835
55994D545835J56469J59721J76098J89706J90608J95263K14142K30631K34929
55985F293402K46021K75450L03515L17332L36945L76146M14701M38898M70668
55976I473078N25202N80547O22657O77388P62157Q51774R30658J030153J172802
55967A6626416J332147J492866J694362J966070K281872K633270L080753L673665
55959C4781421M395612N256855O355719P773536R509719J1607993J4220098J7427993
55951A11328946K1148930K5347414L0092975L5090381L9316984M1533942M1076173
$$ plain form
55944 344935745 382601977 413139261 431768155 434072420 418588541 388115076 348360444
55937 348360444 305250108 263118273 224462693 190415590 161184823 136435708 115660591
55930 115660591 98359754 84020210 72118347 62214032 53977559 47115211 41344976
55923 41344976 36455603 32315270 28803265 25788235 23178132 20929376 18992352 17296672
55915 17296672 15797048 14483483 13335801 12311850 11388092 10568806 9846180 9190288 8586211
55906 8586211 8043542 7561030 7116666 6700296 6322696 5984617 5668177 5366268 5090649
55897 5090649 4843682 4610384 4385373 4180314 3997768 3823771 3653175 3497200 3359070
55888 3359070 3226204 3093351 2970379 2860446 2752695 2643336 2542715 2454852 2370231 2285097
$$ packed form
55944C44935745L7666232L0537284J8628894K304265j5483879l0473465l9754632
55937C48360444m3110336m2131835l8655580l4047103k9230767k4749115k0775117
55930A15660591j7300837j4339544j1901863r904315q236473o862348n770235
55923D1344976m889373m140333l512005l015030k610103k248756j937024j695680
55915A7296672j499624j313565j147682j023951r23758q19286p22626o55892o04077
55906H586211n42669m82512m44364m16370l77600l38079l16440l01909k75619
55897E090649k46967k33298k25011k05059j82546j73997j70596j55975j38130
55888C359070j32866j32853j22972j09933j07751j09359j00621q7863q4621q5134
$$ plain form
55878 2285097 2208141 2141887 2076592 2008778 1947350 1895443 1844187 1790197 1741604 1700906 1659059
55867 1659059 1612472 1569293 1533129 1496882 1458453 1426530 1404820 1385878 1366335 1353107 1348738
55856 1348738 1345441 1339558 1337405 1340732 1340530 1331419 1318749 1305600 1286306 1258940 1231033 1206428 1178921
55843 1178921 1145091 1111199 1081111 1049392 1012811 977268 946915 917315 885588 856722 833729
55832 833729 811744 787820 766589 750583 734830 716632 701047 691069 681893 670374 660748 655465
55820 655465 649600 639969 630877 625361 619511 610924 604166 602346 601431 598205 595688 595536 593287 586398 579174
55805 579174 574534 568652 558813 548885 541934 534950 525901 518484 514727 510197 501667 492449 485201 476582
55791 476582 464180 451858 443091 435525 426950 420134 416916 413992 409310 406286 407076 407972 405904 403002
$$ packed form
55878B285097p6956o6254o5295o7814o1428n1907n1256n3990m8593m0698m1847
55867A659059m6587m3179l6164l6247l8429l1923k1710j8942j9543j3228m369
55856A348738l297n883k153L327k02r111j2670j3149j9294k7366k7907k4605k7507
55843A178921l3830l3892l0088l1719l6581l5543l0353k9600l1727k8866k2993
55832H33729k1985k3924k1231j6006j5753j8198j5585r978r176j1519r626n283
55820F55465n865r631r092n516n850q587o758j820r15l226k517j52k249o889p224
55805E79174m640n882r839r928o951o984r049p417l757m530q530r218p248q619
55791D76582j2402j2322q767p566q575o816l218k924m682l024P90Q96k068k902
$$ plain form
55777 403002 400240 393280 379616 363592 349472 335563 319879 305385 294650 285154 274724 265975
55765 265975 260742 255863 249102 243526 241447 239782 236032 233043 233113 233151 230591 228503 229771 231648 231085
55750 231085 230197 231435 232380 230343 227194 224808 220732 213226 205709 201260 197521 191851 186696 184838 184069
55735 184069 181626 179334 179382 179523 177530 175956 177318 178790 176896 173337 171111 168862 164339 159616 157569
55720 157569 156574 153734 150105 147980 146313 143522 141502 142249 143736 143628 143771 146603 150530 153399 157155
55705 157155 164380 173343 181031 188098 196365 204497 210479 215378 220455 223578 222664 219535 216277 211165
55691 211165 202515 193179 186608 181580 175417 169299 165739 163767 161435 160380 163171 168505 173453 178098
55677 178098 183749 189199 193031 197040 203064 208942 211875 213212 215657 218476 219800 221020 224229 227761
$$ packed form
55777D03002k762o960j3664j6024j4120j3909j5684j4494j0735r496j0430q749
55765B65975n233m879o761n576k079j665l750k989P0L8k560k088J268J877n63
55750B31085q88J238R45k037l149k386m076p506p517m449l739n670n155j858p69
55735A84069k443k292M8J41j993j574J362J472j894l559k226k249m523m723k047
55720A57569r95k840l629k125j667k791k020P47J487j08J43K832L927K869L756
55705A57155P225Q963P688P067Q267Q132N982M899N077L123r14l129l258n112
55691B11165q650r336o571n028o163o118l560j972k332j055K791N334M948M645
55677A78098N651N450L832M009O024N878K933J337K445K819J324J220L209L532
$$ plain form
55663 227761 228882 228696 229947 232213 233693 235440 239170 242895 243327 240877 238035 234714 229454 223316 218199
55648 218199 213059 205956 198134 191904 186265 178727 169846 161949 155081 148096 141906 137700 133792 128173
55634 128173 122307 118504 115587 111300 106909 105006 104618 102896 100062 98282 97193 94923 92182 91088
55620 91088 91185 90620 89901 90437 90927 89254 86546 85263 84768 82964 80732 80361 81002 80135 78336 78098 78972
55603 78972 78392 76458 75497 75593 74863 73525 73483 74409 74303 73473 74056 76027 77477 78284 79749 81148 80446 78036
55585 78036 76194 75255 73738 71662 70310 69321 67381 65120 64042 63467 61857 60132 60177 61101 60618 59118
55569 59118 58686 59077 58546 57742 58779 61187 62655 63106 64199 65475 65014 63393 63088 64337 65354 66099
55553 66099 68050 70702 72145 72680 74149 76126 76618 76041 76604 78192 78838 78868 80465 83349 84978 85099
$$ packed form
55663B27761J121j86J251K266J480J747L730L725M32k450k842l321n260o138n117
55648B18199n140p103p822o230n639p538q881p897o868o985o190m206l908n619
55634A28173n866l803k917m287m391j903l88j722k834j780j089k270k741j094
55620I1088R7n65p19N36M90j673k708j283m95j804k232l71O41q67j799k38Q74
55603G8972n80j934r61R6p30j338m2R26j06q30N83J971J450Q07J465J399p02k410
55585G8036j842r39j517k076j352r89j940k261j078n75j610j725M5R24m83j500
55569E9118m32L91n31q04J037K408J468M51J093J276m61j621l05J249J017P45
55553F6099J951K652J443N35J469J977M92n77N63J588O46L0J597K884J629J21
$$ plain form
55537 85099 86140 88951 91947 94529 97606 100702 102268 102967 104981 107940 109180 108075 106481 104959 102343
55522 102343 99092 97175 96384 94495 91313 88824 87151 84253 79993 76597 74553 71841 67874 64479
55508 64479 62247 59492 55692 52589 51059 50017 48988 48643 48393 46745 44444 43914 45160 45590 44308
55493 44308 43100 42728 41878 40391 39908 40514 40243 38676 37608 37400 36190 33640 31917 31950 32061 31427 31510
55476 31510 32925 34119 34326 34748 35755 35977 35172 34848 35068 33863 30960 28795 28578 28566 27598 27120 28181
55459 28181 29441 29870 30592 32349 33760 33736 33318 33630 34204 34555 35200 35994 35722 34371 33561 33908 34295 34412
55441 34412 35386 37153 38031 37823 38492 40707 42552 42820 42824 43701 44588 44746 44889 45209 44647 43311 43071 44591
55423 44591 46299 47305 48615 50386 50917 49650 48364 47998 47134 45081 43568 43747 44247 43937 43933 45103 46200
$$ packed form
55537H5099J041K811K996K582L077L096J566O99K014K959J240j105j594j522k616
55522A02343l251j917p91j889l182k489j673k898m260l396k044k712l967l395
55508F4479k232k755l800l103j530j042j029l45k50j648k301n30J246M30j282
55493D4308j208l72q50j487m83O06k71j567j068k08j210k550j723L3J11o34Q3
55476C1510J415J194K07M22J007K22q05l24K20j205k903k165k17j2r68m78J061
55459B8181J260M29P22J757J411k4m18L12N74L51O45P94k72j351q10L47L87J17
55441C4412R74J767Q78k08O69K215J845K68MQ77Q87J58J43L20n62j336k40J520
55423D4591J708J006J310J771N31j267j286l66q64k053j513J79N00l10mJ170J097
$$ plain form
55406 46200 46334 46794 48488 49988 50087 50042 51210 52522 52324 50836 48976 46594 43640 41317 40274 39297
55390 39297 37335 35229 34042 33441 32995 33187 33846 33509 31746 30211 30064 30304 29977 29914 30846 31829 32102 32551
55372 32551 33785 34689 34394 33833 33894 33965 33694 34190 35937 37477 37730 37697 38361 38907 38599 38476 39411 40357 40194
55353 40194 39626 39628 39681 39027 37969 36610 34240 31376 30269 31791 33851 34536 34722 35797 36989 37090 36827
55336 36827 37279 37670 36945 35974 35987 36226 35301 33627 32517 32027 31565 31401 31735 31504 29942 28220 27802 28325
55318 28325 28770 29438 30974 32557 32937 32381 31995 31968 31975 32358 33491 34876 36066 37425 38967 39735 39503 39630
55300 39630 40944 42190 41903 40468 38967 37521 36172 35904 37179 38713 39175 38852 38405 37471 35868 34710
55284 34710 34800 35246 35082 34883 35433 36201 36561 37030 37891 38078 36862 35204 34130 33325 32624 33088 35036 36762
$$ packed form
55406D6200J34M60J694J500R9m5J168J312j98j488j860k382k954k323j043r77
55390C9297j962k106j187o01m46J92O59l37j763j535j47K40l27o3R32R83K73M49
55372C2551J234R04k95n61O1P1k71M96J747J540K53l3O64N46l08j23R35R46j63
55353D0194n68KN3o54j058j359k370k864j107J522K060O85J86J075J192J01k63
55336C6827M52L91p25r71J3K39r25j674j110m90m62j64L34k31j562j722m18N23
55318B8325M45O68J536J583L80n56l86k7PL83J133J385J190J359J542P68k32J27
55300C9630J314J246k87j435j501j446j349k68J275J534M62l23m47r34j603j158
55284C4710R0M46j64j99N50P68L60M69Q61J87j216j658j074q05p01M64J948J726
$$ plain form
55266 36762 36833 36065 35686 35314 34443 34057 34908 35884 35967 36163 37547 39025 39059 38087 37253 36294 34752 33741 34347
55247 34347 35607 36121 36293 37021 37635 37320 37068 38015 39175 39131 38669 39363 40749 41261 40992 41193 41936 42468
55229 42468 43000 44072 45019 44999 44560 44368 43610 41637 39842 39713 40326 40041 39367 39666 40267 39560 38012 37350
55211 37350 37560 37331 36857 37477 39011 39965 40117 40553 41418 41855 41851 42052 42066 40995 39337 38431 38427 38613 39116 40323
55191 40323 41291 40839 39669 39391 40042 40549 40948 41979 43173 43517 43460 44093 44932 44722 43791 43346 43084 41921
55173 41921 40569 40761 42247 43089 42759 42468 42541 41949 40632 39941 40447 41256 41699 41894 41667 40758 40016 40509
55155 40509 41618 41842 41207 40903 40843 39817 38030 37254 38220 39752 40686 40938 40630 39852 39288 39540 39936 39471
55137 39471 38529 38148 38248 38392 39497 42616 46627 49427 50966 52786 55077 56770 58139 60565 63732
$$ packed form
55266C6762P1p68l79l72q71l86Q51R76Q3J96J384J478L4r72q34r59j542j011O06
55247C4347J260N14J72P28O14l15k52R47J160m4m62O94J386N12k69K01P43N32
55229D2468N32J072R47k0m39j92p58j973j795j29O13k85o74K99O01p07j548o62
55211C7350K10k29m74O20J534R54J52M36Q65M37mK01J4j071j658r06mJ86N03J207
55191D0323R68m52j170k78O51N07L99J031J194L44n7O33Q39k10r31m45k62j163
55173D1921j352J92J486Q42l30k91P3n92j317o91N06Q09M43J95k27r09p42M93
55155D0509J109K24o35l04o0j026j787p76R66J532R34K52l08p78n64K52L96m65
55137C9471r42l81J00J44J105L119M011K800J539J820K291J693J369K426L167
$$ plain form
55122 63732 65726 66137 66453 67154 66968 65398 63472 61543 58826 55713 54073 54459 55209 55101 54822 55053 55153
55105 55153 54657 54169 53909 53171 52016 51721 52659 53420 52988 52253 52371 53083 53631 54162 55216 56725 58227 59405
55087 59405 60050 60227 60537 61455 62525 63127 63664 64802 65965 66043 65247 64780 65036 65623 66627 68054 68598 67072
55069 67072 64726 63897 64556 64580 63389 62742 63589 64691 65026 65237 65836 66087 65592 65187 65441 65898 66435 67658
55051 67658 69311 70015 69297 68245 67585 66827 65945 66080 67734 69804 71247 72247 73089 73371 73067 72974 73380
55034 73380 73545 73085 72576 72332 71962 71550 71880 72981 73832 74035 74449 75733 77478 79083 80195 80202 78778 77049
55016 77049 76552 76843 75902 73122 70123 68261 67213 66494 66444 67029 67349 67096 66971 67171 66961 66192 65612 65326
54998 65326 64644 63761 63764 64576 64850 64374 64557 65914 67205 67755 68504 69862 70593 69975 69201 69474 70406 71296 72260
$$ packed form
55122F3732J994M11L16P01j86j570j926j929k717l113j640L86P50j08k79K31J00
55105E5153m96m88k60p38j155k95R38P61m32p35J18P12N48N31J054J509J502J178
55087E9405O45J77L10R18J070O02N37J138J163P8p96m67K56N87J004J427N44j526
55069F7072k346q29O59K4j191o47Q47J102L35K11N99K51m95m05K54M57N37J223
55051F7658J653P04p18j052o60p58q82J35J654K070J443J000Q42K82l04r3M06
55034G3380J65m60n09k44l70m12L30J101Q51K03M14J284J745J605J112Pj424j729
55016G7049m97K91r41k780k999j862j048p19n0N85L20k53j25K00k10p69n80k86
54998F5326o82q83LQ12K74m76J83J357J291N50P49J358P31o18p74K73R32Q90R64
$$ plain form
54979 72260 73126 72981 71968 71822 73477 75795 77698 79863 83095 86746 90084 93706 98279 103242 108119
54964 108119 113766 121091 129671 138856 149025 160676 173441 186936 201360 216265 229962 241136
54952 241136 249763 255615 257323 254052 246807 237071 225395 212246 198772 185644 172475 159403 147865
54939 147865 138722 131078 124120 118594 115183 112817 110050 106941 104265 101954 99655 97782 96750 96118
54925 96118 95574 95836 97547 100346 103960 108984 115585 122759 130000 138463 149248 161697 174519 187334
54911 187334 199836 210681 218650 223912 226818 226493 221941 213666 202983 190656 177384 164605 153441
54898 153441 143564 134224 125546 117836 110652 103715 97807 93582 90408 87460 85081 83933 83676 83536 83377
54883 83377 83225 82656 81562 80610 80115 79492 78569 78192 78641 78804 77961 76997 76702 76232 74547 72092 69809 67782
$$ packed form
54979G2260Q66j45j013j46J655K318J903K165L232L651L338L622M573M963M877
54964A08119N647P325Q580R185J0169J1651J2765J3495J4424J4905J3697J1174
54952B41136Q627N852J708l271p245r736j1676j3149j3474j3128j3169j3072j1538
54939A47865r143p644o958n526l411k366k767l109k676k311k299j873j032o32
54925I6118n44K62J711K799L614N024O601P174P241Q463J0785J2449J2822J2815
54911A87334J2502J0845P969N262K906l25m552q275j0683j2327j3272j2779j1164
54898A53441r877r340q678p710p184o937n908m225l174k948k379j148k57j40j59
54883H3377j52n69j094r52m95o23r23l77M49J63q43r64k95m70j685k455k283k027
$$ plain form
54865 67782 66085 65603 66524 67289 66580 65225 64719 65051 65452 65989 66762 66744 65211 63331 62580 62502 61760 60480
54847 60480 59752 59564 59098 58456 58368 58644 58477 57866 57407 57215 57311 58281 60185 61582 61246 60160 60290 61970
54829 61970 63911 65222 65915 66065 65915 66342 67854 69615 70663 71397 72702 74443 76163 78323 81388 84597
54813 84597 87186 89969 94075 98983 103587 108416 114931 123223 132279 142053 153392 166247 179665 193239
54799 193239 206880 219421 229073 235124 237790 236811 231759 223421 213387 202487 190946 179603 169509
54786 169509 160743 152979 146651 142100 138275 133991 129901 127471 126531 125728 124913 125061 126095 126876 127287 128391
54770 128391 130404 132424 134343 137266 141710 147025 152914 160158 169482 180983 194765 210899 228617
54757 228617 246675 264479 281755 297412 310071 319530 326322 330054 329716 325478 318668 309984 299176
$$ packed form
54865F7782j697m82R21P65p09j355n06L32M01N37P73j8j533j880p51p8p42j280
54847F0480p28j88m66o42q8K76j67o11m59j92R6R70J904J397l36j086J30J680
54829F1970J941J311O93J50j50M27J512J761J048P34J305J741J720K160L065L209
54813H4597K589K783M106M908M604M829O515Q292R056R774J1339J2855J3418J3574
54799A93239J3641J2541R652O051K666r79n052q338j0034j0900j1541j1343j0094
54786A69509q766p764o328m551l825m284m090k430r40q03q15J48J034P81M11J104
54770A28391K013K020J919K923M444N315N889P244R324J1501J3782J6134J7718
54757B28617J8058J7804J7276J5657J2659R459O792L732l38m238o810q684j0808
$$ plain form
54744 299176 286418 272482 257537 241304 224513 208812 195053 182899 172071 162707 154564 147180
54732 147180 140733 135455 130427 124469 118059 112862 109453 107022 105142 104108 103584 102694 101577 101093 100889
54717 100889 99558 97016 94865 93947 93324 92321 91792 92511 93765 94559 95009 95622 96210 96424 96569 97115 97983
54700 97983 98823 99492 99918 100032 100047 100228 100379 100094 99443 98803 98252 97870 98181 99408 100760 101543 102420 104322
54682 104322 106572 107643 107488 107491 108274 109225 110141 111614 113597 115275 116642 118686 121687 124853 127958 131807
54666 131807 136594 141320 145393 149458 154038 158596 162527 165945 168955 171286 173176 175625 179202 183471
54652 183471 187914 192539 197382 202430 208314 216094 226122 238021 251756 267608 285035 302796 320271
54639 320271 337322 352749 364325 370656 371754 367591 357701 342668 324510 304972 284652 264270
$$ packed form
54744B99176j2758j3936j4945j6233j6791j5701j3759j2154j0828r364q143p384
54732A47180o447n278n028n958o410n197l409k431j880j034n24q90j117m84k04
54717A00889j331k542k151r18o23j003n29P19J254P94M50O13N88K14J45N46Q68
54700I7983Q40O69M26J14J5J81J51k85o51o40n51l82L11J227J352P83Q77J902
54682A04322K250J071j55LP83R51R16J473J983J678J367K044L001L166L105L849
54666A31807M787M726M073M065M580M558L931L418L010K331J890K449L577M269
54652A83471M443M625M843N048N884P780J0028J1899J3735J5852J7427J7761J7475
54639C20271J7051J5427J1576O331J098m163r890j5033j8158j9538k0320k0382
$$ plain form
54627 264270 245271 228464 213299 199278 186991 177039 168976 162060 156173 151419 147628 144745 142908
54614 142908 141786 140788 140132 140610 141972 142772 142301 141491 141342 141578 141503 141105 140597 139807 138690 137593 136418
54597 136418 134356 131045 127248 123826 120759 117611 114232 110617 106834 103430 101175 100058 99214 98040
54583 98040 96636 95096 93258 91326 89767 88458 86869 85160 84069 83608 83056 82354 82287 83043 83801 84017
54567 84017 83942 83626 82739 81697 81647 82841 84185 84768 84727 84297 83410 82601 82920 84369 85683 86197 86651 87679
54549 87679 88855 89861 91252 93322 95441 97234 99309 102132 105325 108659 112586 117240 122117 127392
54535 127392 134181 142803 152001 160663 169066 177622 185673 192409 197791 201674 203158 201747 198120 192953
54521 192953 186033 177361 167980 158814 149824 141131 133811 128526 124444 120453 116484 112727 108711 104210
$$ packed form
54627B64270j8999j6807j5165j4021j2287r952q063o916n887m754l791k883j837
54614A42908j122r98o56M78J362Q00m71q10j49K36p5l98n08p90j117j097j175
54597A36418k062l311l797l422l067l148l379l615l783l404k255j117q44j174
54583I8040j404j540j838j932j559j309j589j709j091m61n52p02o7P56P58K16
54567H4017p5l16q87j042n0J194J344N83m1m30q87q09L19J449J314N14M54J028
54549H7679J176J006J391K070K119J793K075K823L193L334L927M654M877N275
54535A27392O789Q622R198Q662Q403Q556Q051O736N382L883J484j411l627n167
54521A92953o920q672r381r166q990q693p320n285m082l991l969l757m016m501
$$ plain form
54507 104210 100043 96911 94360 91909 90149 89603 89515 88948 88287 88418 89158 89641 89643 89545 89600 90099 91497 93507
54489 93507 94837 94788 94278 94398 94848 94842 94663 95049 95742 95917 95603 95531 95920 96342 96457 96138 95339 94473 94314 94870
54469 94870 95099 94408 93562 93319 93116 92157 90887 90278 90304 90270 90036 89815 89331 88265 87108 86554 86457 86246 85917
54450 85917 85765 85615 85234 85020 85395 85943 85949 85416 84781 84118 83327 82668 82437 82484 82574 82680 82530 81639 80244 79308
54430 79308 79088 78779 78183 78470 80324 82562 83737 84069 84539 85085 85118 84999 85538 86491 86935 86776 86739 87280 88457
54411 88457 90364 92756 94783 96079 97424 99438 101428 102639 103783 105984 108978 111809 114659 118451
54397 118451 123035 127304 130880 134311 137719 140555 142537 143745 143946 142951 141412 140177 139026 137093 134310
54382 134310 131366 128507 125430 122172 119046 115891 112436 109220 107120 106083 105261 104199 102981 101510
$$ packed form
54507A04210m167l132k551k451j760n46q8n67o61J31P40M83Kr8N5M99J398K010
54489I3507J330m9n10J20M50oj79L86O93J75l14p2L89M22J15l19p99q66j59N56
54469I4870K29o91q46k43k03r59j270o09K6l4k34k21m84j066j157n54r7k11l29
54450H5917j52j50l81k14L75N48On33o35o63p91o59k31M7R0J06j50q91j395r36
54430G9308k20l09n96K87J854K238J175L32M70N46L3j19N39R53M44j59l7N41J177
54411H8457J907K392K027J296J345K014J990J211J144K201K994K831K850L792
54397A18451M584M269L576L431L408K836J982J208K01r95j539j235j151j933k783
54382A34310k944k859l077l258l126l155l455l216k100j037q22j062j218j471
$$ plain form
54368 101510 99652 97899 96878 96324 95363 93712 91838 90214 89216 89362 90785 92759 94573 96452 98818
54353 98818 101178 102776 103874 105304 107146 108944 110854 113479 116816 120425 124349 128818 133308 136990
54339 136990 139870 142564 145201 147493 149452 151018 151404 150001 147540 145217 142993 140039 136487 133329
54325 133329 130698 127628 123591 119101 114737 110634 106980 103999 101440 98962 96929 95830 95152 93839
54311 93839 91747 89617 87747 85793 83767 82112 80825 79464 77979 76588 75028 72999 71143 70435 70664
54296 70664 70649 69950 69261 69129 69352 69705 70226 70710 70847 70838 71057 71219 70835 70280 70359 70950 71123 70496 69439 68145
54276 68145 66649 65649 66003 67420 68784 69763 70942 72360 73180 73050 72646 72643 73089 73970 75363 76849 77654
54259 77654 77548 76926 76161 75664 76226 78163 80323 81193 80897 80923 81953 83291 84344 85203 85660 85170 84142
$$ packed form
54368A01510j858j753j021n54r61j651j874j624r98J46J423J974J814J879K366
54353I8818K360J598J098J430J842J798J910K625L337L609L924M469M490L682
54339A36990K880K694K637K292J959J566L86j403k461k323k224k954l552l158
54325A33329k631l070m037m490m364m103l654k981k559k478k033j099o78j313
54311I3839k092k130j870j954k026j655j287j361j485j391j560k029j856p08K29
54296G0664j5o99o89j32K23L53N21M84J37rK19J62l84n55P9N91J73o27j057j294
54276F8145j496j000L54J417J364R79J179J418Q20j30m04lM46Q81J393J486Q05
54259G7654j06o22p65m97N62J937K160Q70k96K6J030J338J053Q59M57m90j028
$$ plain form
54242 84142 83910 84915 86033 86158 85410 84397 83371 82485 81919 81325 80062 78312 77065 76732 76704 76495 76355
54225 76355 76434 76307 75776 75318 75381 75913 76739 77653 78093 77564 76470 75707 75429 75123 74800 74981 75525 75707 75628 76284
54205 76284 77951 79630 80476 80682 80627 80224 79532 78981 78616 78007 77235 77021 77590 78403 79200 80229 81141 80877
54187 80877 79170 77100 75666 74752 73962 73450 73383 73444 73445 73608 73822 73450 72325 71114 70289 69617 69064 69270 70528
54168 70528 72041 72821 72701 72072 71284 70709 70729 71305 72070 72976 74204 75350 75590 74882 74158 74130 74741 75876
54150 75876 77539 79070 79268 77823 75786 74232 73280 72711 72566 72719 72777 72820 73410 74481 75108 74752 73916 73227
54132 73227 72762 72617 73162 74260 75088 75209 75011 74752 74076 72895 71799 71135 70524 69719 69066 68631 67824 66438
54114 66438 65253 65000 65436 65921 66247 66499 66748 67236 68219 69322 69765 69416 68850 68293 67478 66652 66623 67423 68039
$$ packed form
54242H4142k32J005J118J25p48j013j026q86n66n94j263j750j247l33k8k09j40
54225G6355P9j27n31m58O3N32Q26R14M40n29j094p63k78l06l23J81N44J82p9O56
54205G6284J667J679Q46K06n5m03o92n51l65o09p72k14N69Q13P97J029R12k64
54187H0877j707k070j434r14p90n12o7O1JJ63K14l72j125j211q25o72n53K06J258
54168G0528J513P80j20o29p88n75K0N76P65R06J228J146K40p08p24k8O11J135
54150G5876J663J531J98j445k037j554r52n69j45J53N8M3N90J071O27l56q36o89
54132G3227m65j45N45J098Q28J21j98k59o76j181j096o64o11q05o53m35q07j386
54114F6438j185k53M36M85L26K52K49M88R83J103M43l49n66n57q15q26k9Q00O16
$$ plain form
54095 68039 67820 67225 66781 66361 65892 65760 66057 66343 66555 67145 68020 68401 68056 67570 67057 65910 64211 63074
54077 63074 63052 63499 64044 65322 67503 69544 70768 71894 73553 75026 75494 75453 75720 76051 75847 75355 75110
54060 75110 75008 74962 75683 77694 80207 81980 82795 83318 84035 85022 86163 86989 86978 86493 86624 87663 88817 89909
54042 89909 92050 95802 99974 103307 106213 109720 113768 117804 122056 126866 131552 135262 138363 141815
54028 141815 145822 150209 155364 161429 167217 171316 173941 176429 179211 181480 182706 183337 184052 185119 186423
54013 186423 187487 187707 187070 186282 185751 185034 183730 182142 180461 178267 175579 173429 172368 171293 168834
53998 168834 165182 161479 158149 155048 152598 151421 151153 150742 149582 147552 144466 140572 137092 135167 134588
53983 134588 134422 134376 134616 134813 134518 134073 134102 134417 134376 133941 133529 133250 133182 133805 135238 136557 136901 136710 136822
$$ packed form
54095F8039k19n95m44m20m69j32K97K86K12N90Q75L81l45m86n13j147j699j137
54077F3074k2M47N45J278K181K041J224J126J659J473M68m1K67L31k04m92k45
54060G5110j02m6P21K011K513J773Q15N23P17R87J141Q26j1m85J31J039J154J092
54042H9909K141L752M172L333K906L507M048M036M252M810M686L710L101L452
54028A41815M007M387N155O065N788M099K625K488K782K269J226O31P15J067J304
54013A86423J064K20o37p88n31p17j304j588j681k194k688k150j061j075k459
53998A68834l652l703l330l101k450j177k68m11j160k030l086l894l480j925n79
53983A34588j66m6K40J97k95m45K9L15m1m35m12k79o8O23J433J319L44j91J12
$$ plain form
53964 136822 136991 136469 135523 135004 134784 133948 132383 130992 130345 130181 130187 130338 130499 130462 130270 129929 129170 128175 127976
53945 127976 129284 131371 133021 134129 135524 137720 140745 144679 149406 154259 158858 163720 169182 174425
53931 174425 178595 182108 185633 188514 189605 189103 188093 186792 184736 182431 181195 181427 182321 183231 184149
53916 184149 185043 185950 187589 190718 195032 199781 205056 211235 217565 222792 226969 231196 235692 239583 242510
53901 242510 244998 247203 248652 249310 249633 249584 248836 247877 247527 247363 246035 243181 239656 235839 231223 225882
53885 225882 220781 216344 212028 207652 203740 200169 195851 190298 184348 178873 173911 169501 166174 164007
53871 164007 162194 160068 157713 155219 152353 149372 147094 145687 144235 141969 139153 136396 133943 131964
53857 131964 130692 129816 128518 126477 124200 122143 120265 118594 117400 116570 115595 114313 112933 111350 109353
$$ packed form
53964A36822J69n22r46n19k20q36j565j391o47j64OJ51J61l7j92l41p59r95j99
53945A27976J308K087J650J108J395K196L025L934M727M853M599M862N462N243
53931A74425M170L513L525K881J091n02j010j301k056k305j236K32Q94R10R18
53916A84149Q94R07J639L129M314M749N275O179O330N227M177M227M496L891K927
53901B42510K488K205J449O58L23m9p48r59l50j64j328k854l525l817m616n341
53885B25882n101m437m316m376l912l571m318n553n950n475m962m410l327k167
53871A64007j813k126k355k494k866k981k278j407j452k266k816k757k453j979
53857A31964j272q76j298k041k277k057j878j671j194q30r75j282j380j583j997
$$ plain form
53842 109353 107518 106801 107064 107095 106321 105462 105216 105353 105497 105754 106154 106378 106439 106790 107403 107635 107284 106861 106520
53823 106520 105782 104756 104581 106029 108460 110699 112248 113215 113749 114052 114313 114364 114036 113975 115198 117624 119979
53806 119979 121563 123177 125859 129467 132987 135554 136887 137517 138896 142412 147852 153530 158230 162236
53792 162236 166280 170504 174862 179508 184158 187900 190241 191631 192554 192880 192597 192308 192349 192182 191251 189818
53776 189818 188384 186954 185397 183931 182628 180979 178459 175095 171160 166869 162737 159579 157690 156546
53762 156546 155683 155300 155644 156337 156700 156260 154769 152398 150138 149179 149530 149945 149549 148821 148596 148868 149028 148571
53744 148571 147127 144549 141470 139139 138144 137794 137120 135892 134293 132331 130024 127619 125243 122843 120764
53729 120764 119673 119619 119833 119798 119826 120222 120714 121138 121950 123536 125623 127730 129521 130446 129968 128641 128079 129207
$$ packed form
53842A09353j835p17K63L1p74q59k46J37J44K57M00K24O1L51O13K32l51m23l41
53823A06520p38j026j75J448K431K239J549R67N34L03K61N1l28o1J223K426K355
53806A19979J584J614K682L608L520K567J333O30J379L516N440N678M700M006
53792A62236M044M224M358M646M650L742K341J390R23L26k83k89M1j67r31j433
53776A89818j434j430j557j466j303j649k520l364l935m291m132l158j889j144
53762A56546q63l83L44O93L63m40j491k371k260r59L51M15l96p28k25K72J60m57
53744A48571j444k578l079k331r95l50o74j228j599j962k307k405k376k400k079
53729A20764j091n4K14l5K8L96M92M24Q12J586K087K107J791R25m78j327n62J128
$$ plain form
53711 129207 131302 133338 135386 137875 140308 141778 142421 143433 145723 149118 152728 155696 157779 159549
53697 159549 161828 164806 168017 171163 174425 177892 181364 184800 188217 191096 192787 193704 195111 197385
53683 197385 199520 200839 202086 204134 206543 208285 209242 210159 211584 213493 215554 217242 218186 218742 219670
53668 219670 221026 222136 222945 224381 226841 229285 230587 230956 231255 231708 232061 232322 232534 232413 231946 231746 232099
53651 232099 232287 231556 230155 228717 227251 225522 223761 222232 220706 219153 218357 218920 220205 221129 221507 221718
53635 221718 221561 220495 218739 217147 216118 215391 214773 214342 214040 213699 213440 213590 214343 215797 217904 220087
53619 220087 221435 221817 222240 223592 225554 227390 229253 231898 235485 239424 243157 246462 249247 251691 254348
53604 254348 257651 261473 265572 270085 275150 280423 285451 290216 294961 299850 305021 310464 315603 319704
$$ packed form
53711A29207K095K036K048K489K433J470O43J012K290L395L610K968K083J770
53697A59549K279K978L211L146L262L467L472L436L417K879J691R17J407K274
53683A97385K135J319J247K048K409J742R57R17J425J909K061J688R44N56R28
53668B19670J356J110Q09J436K460K444J302L69K99M53L53K61K12j21m67k00L53
53651B32099J88p31j401j438j466j729j761j529j526j553p96N63J285R24L78K11
53635B21718j57j066j756j592j029p27o18m31l02l41k59J50P53J454K107K183
53619B20087J348L82M23J352J962J836J863K645L587L939L733L305K785K444K657
53604B54348L303L822M099M513N065N273N028M765M745M889N171N443N139M101
$$ plain form
53590 319704 323092 327276 333356 340899 348762 356278 363231 369539 375555 381856 388179 393387 397100 400396
53576 400396 404186 407936 410906 413648 417083 420961 424490 427781 431397 434957 437468 438765 439459 439801 439614
53561 439614 439039 438325 437206 435443 433660 432546 431553 429466 426050 422186 418589 415432 412979 411456 410298
53546 410298 408485 405703 402536 399601 397173 395381 393993 392232 389570 386543 384147 382748 382179 382386 383215
53531 383215 384101 384873 386285 388774 391322 392774 393737 395783 399094 402415 405278 408786 413913 420295 427086
53516 427086 434025 441261 448905 457061 465773 474848 484181 494102 504883 516316 528470 542314 558525
53503 558525 576144 593607 610806 628821 647837 666903 685854 705947 728121 751901 776563
53492 776563 802306 829589 858157 887334 916703 946107 975533 1005287 1035783 1066947 1098336
$$ packed form
53590C19704L388M184O080P543P863P516O953O308O016O301O323N208L713L296
53576D00396L790L750K970K742L435L878L529L291L616L560K511J297O94L42j87
53561D39614n75p14j119j763j783j114r93k087l416l864l597l157k453j523j158
53546D10298j813k782l167k935k428j792j388j761k662l027k396j399n69K07Q29
53531C83215Q86P72J412K489K548J452R63K046L311L321K863L508N127O382O791
53516D27086O939P236P644Q156Q712R075R333R921J0781J1433J2154J3844J6211
53503E58525J7619J7463J7199J8015J9016J9066J8951K0093K2174K3780K4662
53492G76563K5743K7283K8568K9177K9369K9404K9426K9754L0496L1164L1389
$$ plain form
53481 1098336 1129838 1161574 1193126 1223698 1253271 1282878 1313468 1345060 1377125 1409238 1441256
53470 1441256 1473371 1505936 1538667 1570161 1598984 1625087 1649496 1672766 1694682 1715279 1735031
53459 1735031 1753869 1771130 1786766 1801679 1816550 1831145 1845031 1858155 1870420 1881410 1890839
53448 1890839 1898545 1903892 1905965 1904606 1900498 1893993 1884589 1871846 1856055 1837748 1817313 1795344 1772588
53435 1772588 1749149 1724379 1697863 1669905 1640823 1610501 1578929 1546479 1513392 1479642 1445585
53424 1445585 1411991 1379145 1346727 1314930 1284845 1257175 1231266 1206096 1181678 1158851 1138191
53413 1138191 1119775 1103705 1090130 1078809 1069193 1061047 1054746 1050967 1050168 1052333 1057164 1064490 1074319
53400 1074319 1086439 1100374 1116039 1133988 1154477 1176680 1199584 1223384 1249205 1277582 1308040
$$ packed form
53481A098336L1502L1736L1552L0572K9573K9607L0590L1592L2065L2113L2018
53470A441256L2115L2565L2731L1494K8823K6103K4409K3270K1916K0597J9752
53459A735031J8838J7261J5636J4913J4871J4595J3886J3124J2265J0990R429
53448A890839P706N347K073j359m108o505r404j2743j5791j8307k0435k1969k2756
53435A772588k3439k4770k6516k7958k9082l0322l1572l2450l3087l3750l4057
53424A445585l3594l2846l2418l1797l0085k7670k5909k5170k4418k2827k0660
53413A138191j8416j6070j3575j1321r616q146o301l779p99K165M831P326R829
53400A074319J2120J3935J5665J7949K0489K2203K2904K3800K5821K8377L0458
$$ plain form
53389 1308040 1340083 1373701 1408880 1445529 1483988 1524777 1567710 1612137 1658248 1707198 1759690
53378 1759690 1815253 1873194 1933410 1995903 2060340 2126595 2194971 2265380 2336941 2408829 2481002
53367 2481002 2553698 2626855 2700372 2774218 2847780 2919672 2988706 3054529 3116867 3174812 3227527
53356 3227527 3275264 3319101 3359951 3398233 3434051 3467068 3496401 3521209 3541268 3556682 3567196
53345 3567196 3572164 3570991 3563276 3548578 3526292 3495674 3455894 3406386 3347474 3280664 3208233 3132536
53333 3132536 3055477 2978206 2901137 2824402 2748356 2673468 2599887 2527454 2456095 2385910 2316863
53322 2316863 2248793 2181718 2115876 2051469 1988635 1927585 1868572 1811891 1758122 1708017 1661719
53311 1661719 1618439 1577356 1538528 1502513 1469572 1439839 1413730 1391351 1371852 1354195 1338162
$$ packed form
53389A308040L2043L3618L5179L6649L8459M0789M2933M4427M6111M8950N2492
53378A759690N5563N7941O0216O2493O4437O6255O8376P0409P1561P1888P2173
53367B481002P2696P3157P3517P3846P3562P1892O9034O5823O2338N7945N2715
53356C227527M7737M3837M0850L8282L5818L3017K9333K4808K0059J5414J0514
53345C567196M968j173p715j4698k2286l0618l9780m9508n8912o6810p2431p5697
53333C132536p7059p7271p7069p6735p6046p4888p3581p2433p1359p0185o9047
53322B316863o8070o7075o5842o4407o2834o1050n9013n6681n3769n0105m6298
53311A661719m3280m1083l8828l6015l2941k9733k6109k2379j9499j7657j6033
$$ plain form
53300 1338162 1323825 1310577 1297921 1286841 1278939 1274194 1270853 1267596 1264508 1261822 1259286 1257261 1257067
53287 1257067 1259380 1263290 1267654 1272527 1278549 1285815 1294194 1304146 1316434 1331427 1349199 1369880 1393404
53274 1393404 1419311 1447234 1477149 1508882 1541800 1575258 1608931 1642508 1675706 1708731 1742112
53263 1742112 1775769 1808832 1840590 1870976 1899917 1926995 1952062 1975494 1997493 2017768 2036181
53252 2036181 2053011 2068243 2081280 2091645 2099254 2103690 2104006 2099643 2090863 2077933 2060634 2038950
53240 2038950 2013495 1984868 1953214 1918778 1882154 1843697 1803492 1762179 1720869 1679893 1638632
53229 1638632 1597089 1556529 1517878 1480553 1443742 1407905 1373933 1341524 1309494 1277264 1245060
53218 1245060 1212916 1180446 1147510 1114425 1081584 1049303 1017912 987667 958784 931727 907105
$$ packed form
53300A338162j4337j3248j2656j1080p902m745l341l257l088k686k536k025j94
53287A257067K313L910M364M873O022P266Q379R952J2288J4993J7772K0681K3524
53274A393404K5907K7923K9915L1733L2918L3458L3673L3577L3198L3025L3381
53263A742112L3657L3063L1758L0386K8941K7078K5067K3432K1999K0275J8413
53252B036181J6830J5232J3037J0365P609M436L16m363q780j2930j7299k1684
53240B038950k5455k8627l1654l4436l6624l8457m0205m1313m1310m0976m1261
53229A638632m1543m0560l8651l7325l6811l5837l3972l2409l2030l2230l2204
53218A245060l2144l2470l2936l3085l2841l2281l1391l0245k8883k7057k4622
$$ plain form
53207 907105 885086 865314 847524 831621 817103 803238 790010 777910 766436 753857 739097
53196 739097 722947 706776 690989 675536 660960 647809 635591 623373 611003 598903 587023
53185 587023 574868 562243 549284 536031 522615 509600 497507 486194 475079 463654 451535
53174 451535 438578 425368 412981 401822 391300 380985 371255 362306 353521 344572 336279 329456 323593
53161 323593 317671 311594 305886 300502 294978 289348 284031 279119 274547 270543 267205 264061 260749 257599
53147 257599 254898 252221 249273 246666 244914 243405 241417 239469 238451 237980 236960 235335 233958 232959 231702
53132 231702 230227 229380 229398 229631 229831 230581 232186 234200 236420 239373 243333 247637 251426 254518 257128 259173
53116 259173 260195 259822 258148 255795 253490 251370 248932 245828 242329 238721 234816 230568 226615 223523
$$ packed form
53207I07105k2019j9772j7790j5903j4518j3865j3228j2100j1474j2579j4760
53196G39097j6150j6171j5787j5453j4576j3151j2218j2218j2370j2100j1880
53185E87023j2155j2625j2959j3253j3416j3015j2093j1313j1115j1425j2119
53174D51535j2957j3210j2387j1159j0522j0315r730q949q785q949q293o823n863
53161C23593n922o077n708n384n524n630n317m912m572m004l338l144l312l150
53147B57599k701k677k948k607j752j509j988j948j018m71j020j625j377r99j257
53132B31702j475q47J8K33K00P50J605K014K220K953L960M304L789L092K610K045
53116B59173J022l73j674k353k305k120k438l104l499l608l905m248l953l092
$$ plain form
53102 223523 220927 218072 214774 211218 207384 203515 200527 198900 197528 194833 190845 187128 184731 183278
53088 183278 181993 180516 178595 175958 172779 169525 166278 162887 159776 157746 156874 156420 155928 155646 155678 155464
53072 155464 154434 152669 150710 149082 148079 147638 147407 147230 147337 147720 147739 146987 146126 146092 146826 147608 148318 149347
53054 149347 150471 150953 150793 150851 151559 152417 152921 153101 153003 152559 152204 152657 153742 154230 153368 151899 151095 151296
53036 151296 151865 152144 151985 151575 151120 150646 150008 149218 148594 148343 148155 147582 146698 145924 145350 144665 143657 142377
53018 142377 140972 139801 139401 139777 140037 139399 138377 138214 139264 140621 141279 140930 139710 137979 136400 135525
53002 135525 135192 134823 134277 133857 133621 133355 133167 133405 133954 134291 134241 134134 134248 134655 135508 136907 138584 140313
52984 140313 142382 145055 147869 150294 152755 156109 160291 164505 168600 173127 177999 182244 185398 188160
$$ packed form
53102B23523k596k855l298l556l834l869k988j627j372k695l988l717k397j453
53088A83278j285j477j921k637l179l254l247l391l111k030q72m54m92k82L2k14
53072A55464j030j765j959j628j003m41k31j77J07L83J9p52q61l4P34P82P10J029
53054A49347J124M82j60N8P08Q58N04J80r8m44l55M53J085M88q62j469q04K01
53036A51296N69K79j59m10m55m74o38p90o24k51j88n73q84p74n74o85j008j280
53018A42377j405j171m00L76K60o38j022j63J050J357O58l49j220j731j579q75
53002A35525l33l69n46m20k36k66j88K38N49L37n0j07J14M07Q53J399J677J729
52984A40313K069K673K814K425K461L354M182M214M095M527M872M245L154K762
$$ plain form
52970 188160 191305 194670 197525 199325 199934 199757 199621 199860 199593 197745 194671 191764 189485 186998 183965
52955 183965 181371 179992 179092 177404 174725 171905 169790 168737 168677 169101 169207 168382 166462 163707 160887 159137
52939 159137 158956 159413 159118 157901 156711 155966 155122 154003 153398 153883 154980 155936 156649 157425 158461 159788 161037
52922 161037 161204 159564 157029 155593 156089 157407 158235 158507 158643 158531 158051 157710 157888 158089 157719 157081 156888
52905 156888 157304 158083 159195 160564 161577 161555 160602 159481 158820 158727 158976 159252 159428 159763 160624 161992 163508
52888 163508 164960 166303 167371 168107 168921 170110 171110 171185 170716 170763 171390 171574 170944 170360 170473 170916 171375 172255
52870 172255 173676 174989 176017 177699 180627 183827 185868 186468 186291 185965 186075 187312 189719 192378 194606
52855 194606 196850 199760 203170 206731 210756 215452 220049 223696 226676 229730 232699 234827 236010 236742
$$ packed form
52970A88160L145L365K855J800O09j77j36K39k67j848l074k907k279k487l033
52955A83965k594j379r00j688k679k820k115j053o0M24J06q25j920k755k820j750
52939A59137j81M57k95j217j190p45q44j119o05M85J097R56P13P76J036J327J249
52922A61037J67j640k535j436M96J318Q28K72J36j12m80l41J78K01l70o38j93
52905A56888M16P79J112J369J013k2r53j121o61r3K49K76J76L35Q61J368J516
52888A63508J452J343J068P36Q14J189J000P5m69M7O27J84o30n84J13M43M59Q80
52870A72255J421J313J028J682K928L200K041O00j77l26J10J237K407K659K228
52855A94606K244K910L410L561M025M696M597L647K980L054K969K128J183P32
$$ plain form
52841 236742 237134 236919 236165 235097 233465 230905 227730 224585 221492 218003 214081 210166 206483 202965 199683
52826 199683 196782 194127 191557 189255 187433 185884 184280 182542 180534 177885 174690 171828 169928 168537
52812 168537 166995 165583 164947 164872 164592 163943 163284 162530 161268 159735 158659 158157 157576 156495 155110 153596
52796 153596 151831 149868 148081 146726 145833 145454 145520 145525 144944 143929 143110 142748 142578 142383 142193 141973 141618 141193
52778 141193 140745 140012 138800 137446 136395 135514 134389 133168 132437 132369 132542 132545 132206 131331 129830 128101 126680
52761 126680 125488 123936 121820 119581 117640 115962 114379 112903 111581 110305 108914 107297 105501 103864
52747 103864 102851 102494 102204 101446 100362 99403 98663 97984 97421 97104 96827 96251 95395 94528 93796 93374 93652 94812
52729 94812 96379 97694 98612 99277 99479 98778 97158 95055 92957 91371 90857 91535 92751 93780 94668 95874
$$ packed form
52841B36742L92k15p54j068j632k560l175l145l093l489l922l915l683l518l282
52826A99683k901k655k570k302j822j549j604j738k008k649l195k862j900j391
52812A68537j542j412o36p5k80o49o59p54j262j533j076n02n81j081j385j514
52796A53596j765j963j787j355q93l79O6Nn81j015q19l62j70j95j90k20l55m25
52778A41193m48p33j212j354j051q81j125j221p31o8J73Ll39q75j501j729j421
52761A26680j192j552k116k239j941j678j583j476j322j276j391j617j796j637
52747A03864j013l57k90p58j084r59p40o79n63l17k77n76q56q67p32m22K78J160
52729I4812J567J315R18O65K02p01j620k103k098j586n14O78J216J029Q88J206
$$ plain form
52713 95874 97421 99041 100809 102909 104992 106591 108035 110158 113132 116367 119545 122915 126487 129644
52699 129644 131748 132560 132027 130343 128293 126858 126201 125669 124862 124064 123431 122482 120762 118447 115865 112927
52683 112927 109489 105977 103182 101512 100659 99892 98560 96456 93853 91166 88642 86476 84997 84403 84382
52668 84382 84338 83983 83439 82897 82531 82604 83180 83752 83613 82633 81314 80067 78894 77877 77470 78004 79161 80134
52650 80134 80297 79689 78985 78925 79642 80625 81432 82141 82910 83477 83575 83546 84093 85462 87323 89260 90912 91790 91609
52631 91609 90807 90174 89824 89043 87276 84882 82718 81320 80639 80287 79846 79118 78225 77436 76941 76828 77079 77454
52613 77454 77657 77769 78239 79200 80162 80714 81099 81649 82142 82324 82658 83791 85487 86917 87815 88505 88869 88344
52595 88344 87186 86762 88030 90378 92417 93444 93658 93458 93154 93105 93561 94335 94924 94969 94515 94005 94145 95543
$$ packed form
52713I5874J547J620J768K100K083J599J444K123K974L235L178L370L572L157
52699A29644K104Q12n33j684k050j435o57n32q07p98o33r49j720k315k582k938
52683A12927l438l512k795j670q53p67j332k104k603k687k524k166j479n94k1
52668H4382m4l55n44n42l66P3N76N72j39r80j319j247j173j017m07N34J157R73
52650H0134J63o08p04o0P17R83Q07P09P69N67R8k9N47J369J861J937J652Q78j81
52631I1609q02o33l50p81j767k394k164j398o81l52m41p28q93p89m95j13K51L75
52613G7454K03J12M70R61R62N52L85N50M93J82L34J133J696J430Q98O90L64n25
52595H8344j158m24J268K348K039J027K14k00l04m9M56P74N89M5m54n10J40J398
$$ plain form
52577 95543 98202 101434 104440 106870 108743 110027 110568 110437 110074 109989 110340 110933 111623 112539 113816 115216 116256
52560 116256 116712 116860 117204 118123 119667 121515 123183 124520 125891 127553 129092 129906 130077 130113 129995 129305 128272
52543 128272 127751 127968 128275 128433 129058 130261 131024 130768 130491 131272 132460 132641 131727 130770 130109 129200 128168 128059
52525 128059 129221 130616 131140 130749 129931 128871 127677 126844 126986 128230 130018 131386 131593 130796 129946 129669
52509 129669 129615 129290 129053 129579 130724 131746 132383 132855 133029 132538 131661 131101 130847 130163 128818 127540 127082 127539
52491 127539 128653 130085 131266 131673 131395 130886 130263 129472 128983 129415 130530 131477 132093 133011 134401 135600 136238
52474 136238 136818 137801 138939 139838 140516 141071 141463 141890 142767 144093 145422 146540 147568 148420 148890 149282 150102
52457 150102 151121 151676 151894 152484 153249 153134 152114 151616 152402 153321 153070 152087 151591 151655 151476 150971 150815 151122
$$ packed form
52577I5543K659L232L006K430J873J284N41j31l63q5L51N93O90R16J277J400J040
52560A16256M56J48L44R19J544J848J668J337J371J662J539Q14J71L6j18o90j033
52543A28272n21K17L07J58O25J203P63k56k77P81J188J81r14r57o61r09j032j09
52525A28059J162J395N24l91q18j060j194q33J42J244J788J368K07p97q50k77
52509A29669n4l25k37N26J145J022O37M72J74m91q77n60k54o84j345j278m58M57
52491A27539J114J432J181M07k78n09o23p91m89M32J115R47O16R18J390J199O38
52474A36238N80R83J138Q99O78N55L92M27Q77J326J329J118J028Q52M70L92Q20
52457A50102J019N55K18N90P65j15j020m98P86R19k51r83m96O4j79n05j56L07
$$ plain form
52439 151122 151118 150137 148208 145733 143212 141257 140256 139988 139852 139426 138621 137588 136740 136526 136822 136876 136122 134792
52421 134792 133441 132305 131426 130976 130991 131080 130804 130169 129506 129073 128976 129215 129608 129915 130086 130059 129410 127805 125816
52402 125816 124620 124677 125361 126050 126815 127740 128425 128734 129323 130774 132702 134238 134980 135005 134525 134100 134662 136654
52384 136654 139417 141945 143916 145603 147198 148752 150395 152121 153638 154805 155834 156759 157314 157746 159053
52369 159053 161728 164824 167067 168437 169843 171652 173436 174964 176465 177900 178859 179364 180080 181484 183315
52354 183315 185097 186780 188607 190593 192444 193970 195426 197357 200055 203224 206326 209119 211582 213478
52340 213478 214505 214890 215264 215850 216336 216778 217900 220093 222706 224841 226402 227892 229511 231015 232167
52325 232167 232918 233379 233937 235116 236945 238797 240127 241066 242039 243250 244820 246959 249622 252459 255472
$$ packed form
52439A51122mr81j929k475k521j955j001k68j36m26q05j033q48k14K96N4p54j330
52421A34792j351j136q79m50J5Q9k76o35o63m33r7K39L93L07J71k7o49j605j989
52402A25816j196N7O84O89P65R25O85L09N89J451J928J536P42K5m80m25N62J992
52384A36654K763K528J971J687J595J554J643J726J517J167J029R25N55M32J307
52369A59053K675L096K243J370J406J809J784J528J501J435R59N05P16J404J831
52354A83315J782J683J827J986J851J526J456J931K698L169L102K793K463J896
52340B13478J027L85L74N86M86M42J122K193K613K135J561J490J619J504J152
52325B32167P51M61N58J179J829J852J330R39R73J211J570K139K663K837L013
$$ plain form
52310 255472 259216 263969 269302 274935 281371 288986 297060 304539 311356 318253 325653 333574 342357 352442
52296 352442 363401 374029 383642 392741 402225 412495 423441 434812 446299 457547 468337 478749
52284 478749 489140 499945 511385 523348 535715 548713 562573 576853 590703 603920 617100
52273 617100 630541 643726 656278 668561 680711 691877 701329 709786 718569 727782 736315 743510 749771
52260 749771 755471 760219 763562 765741 767423 769079 770787 772218 772676 771557 768977 765782 762792 760242
52246 760242 757907 755516 752981 750390 747880 745600 743891 743405 744624 747257 750550 754285 758910 764571
52232 764571 770709 777047 784295 793262 803754 814938 826340 837892 849397 860618 871627 882445
52220 882445 892664 901970 910658 919037 926716 933207 938865 944416 949815 954341 957660 959938 961070 960679
$$ packed form
52310B55472L744M753N333N633O436P615Q074P479O817O897P400P921Q783J0085
52296C52442J0959J0628R613R099R484J0270J0946J1371J1487J1248J0790J0412
52284D78749J0391J0805J1440J1963J2367J2998J3860J4280J3850J3217J3180
52273F17100J3441J3185J2552J2283J2150J1166R452Q457Q783R213Q533P195O261
52260G49771N700M748L343K179J682J656J708J431M58j119k580l195k990k550
52246G60242k335k391k535k591k510k280j709m86J219K633L293L735M625N661
52232G64571O138O338P248Q967J0492J1184J1402J1552J1505J1221J1009J0818
52220H82445J0219R306Q688Q379P679O491N658N551N399M526L319K278J132l91
$$ plain form
52206 960679 958831 955941 951961 946496 939840 933052 926752 920500 913674 906353 898976 891570 883726 875179
52192 875179 866216 857615 850131 843851 838138 832370 826567 821075 816024 811477 807753 804938 802311 798917
52178 798917 794675 790369 786628 783461 780712 778299 775896 772960 769312 765347 761585 758235 755194 752185
52164 752185 749011 745912 743413 741503 739322 736195 732636 729664 727431 725337 723281 721826 721022 719990
52150 719990 718083 715749 713784 712205 710312 707625 704395 701301 698813 696796 694671 692084 689272 686557
52136 686557 683689 680040 675453 670521 665977 662062 658440 654520 649951 645000 640387 636541 633155 629616
52122 629616 625605 621142 616392 611759 607764 604447 601186 597503 593713 590432 587886 586146 585571 586331 587766
52107 587766 588891 589383 589608 590035 591171 593712 597963 603264 608592 613601 618611 623942 629907 637144 646178
$$ packed form
52206I60679j848k890l980n465o656o788o300o252o826p321p377p406p844q547
52192H75179q963q601p484o280n713n768n803n492n051m547l724k815k627l394
52178G98917m242m306l741l167k749k413k403k936l648l965l762l350l041l009
52164G52185l174l099k499j910k181l127l559k972k233k094k056j455q04j032
52150G19990j907k334j965j579j893k687l230l094k488k017k125k587k812k715
52136F86557k868l649m587m932m544l915l622l920m569m951m613l846l386l539
52122F29616m011m463m750m633l995l317l261l683l790l281k546j740n75P60J435
52107E87766J125M92K25M27J136K541M251N301N328N009N010N331N965P237R034
$$ plain form
52092 646178 656766 668310 680658 693919 707868 722325 737799 754838 772934 790943 808473
52081 808473 826048 844051 862323 880662 898853 916326 932642 948202 963619 978596 992346
52070 992346 1004899 1016890 1028102 1037440 1044479 1049935 1054401 1057660 1059520 1060349 1060346 1059155 1056449 1052238
52056 1052238 1046434 1038994 1030597 1022258 1014146 1005697 997008 988978 981913 975156 968439 962346 956967 951370
$$ packed form
52092F46178J0588J1544J2348J3261J3949J4457J5474J7039J8096J8009J7530
52081H08473J7575J8003J8272J8339J8191J7473J6316J5560J5417J4977J3750
52070I92346J2553J1991J1212R338P039N456M466L259J860Q29lj191k706m211
52056A052238n804p440q397q339q112q449q689q030p065o757o717o093n379n597
$$ [...]
##END NTUPLES=NMR SPECTRUM
##END=
