##TITLE=NES1031_Conilon_9266930_AQFG5NnhPy
##JCAMPDX= 6.0         $$ Bruker NMR JCAMP-DX V2.0
##DATA TYPE= NMR SPECTRUM
##DATA CLASS= NTUPLES
##ORIGIN= BRUKER
##OWNER= Administrator
$$ 1.72 TOPSPIN		Version 2.1
$$ 2015-07-09 20:22:27.035 -0700  Administrator@X
$$ Compression mode = diff/dup
##.OBSERVE FREQUENCY= 400.02188249412
##.OBSERVE NUCLEUS= ^1H
##.ACQUISITION MODE= SIMULTANEOUS (DQD)
##.ACQUISITION SCHEME= undefined
##.AVERAGES= 8
##.DIGITISER RES= 22
##SPECTROMETER/DATA SYSTEM= spect
##.PULSE SEQUENCE= zg30
##.SOLVENT NAME= COFFEE_meoh
##.SHIFT REFERENCE= INTERNAL, COFFEE_meoh, 1, 14.98509
##AUDIT TRAIL= $$ (NUMBER, WHEN, WHO, WHERE, PROCESS, VERSION, WHAT)
$$ ##TITLE= Audit trail, TOPSPIN		Version 2.1
$$ ##JCAMPDX= 5.01
$$ ##ORIGIN= Bruker BioSpin GmbH
$$ ##OWNER= Administrator
$$ $$ E:\/data/COFFEE/nmr/NES1031_Conilon_9266930_AQFG5NnhPy/10/pdata/1/auditp.txt
$$ ##AUDIT TRAIL=  $$ (NUMBER, WHEN, WHO, WHERE, PROCESS, VERSION, WHAT)
(   1,<2015-07-09 20:22:19.738 -0700>,<Administrator>,<X>,<go>,<TOPSPIN 2.1>,
      <created by zg
	started at 2015-07-09 20:21:13.550 -0700,
	POWCHK enabled, PULCHK disabled,
       configuration hash MD5:
       21 0F 79 D6 B3 7B B4 F6 88 20 88 DB 03 48 BD 9F
       data hash MD5: 64K
       6F E7 00 F3 5F 89 D2 92 5A 56 E6 6C 53 80 E0 3E>)
(   2,<2015-07-09 20:22:22.910 -0700>,<Administrator>,<X>,<proc1d>,<TOPSPIN 2.1>,
      <Start of raw data processing
       efp LB = 0 FT_mod = 6 PKNL = 1 PHC0 = 0 PHC1 = 0 SI = 32K 
       data hash MD5: 32K
       45 36 99 40 CF B0 A6 F1 95 E7 00 46 66 6D 19 BD>)
(   3,<2015-07-09 20:22:23.206 -0700>,<Administrator>,<X>,<proc1d>,<TOPSPIN 2.1>,
      <pk PHC0 = 89.06067 PHC1 = 0 
       data hash MD5: 32K
       9A 34 03 60 8B 18 38 F6 37 D6 35 7F 04 1E 55 45>)
(   4,<2015-07-09 20:22:23.331 -0700>,<Administrator>,<X>,<proc1d>,<TOPSPIN 2.1>,
      <abs ABSG = 1 
       data hash MD5: 32K
       BF 35 AE A0 66 3E B4 A5 6D CC 3E 06 1A A5 C3 15>)
(   5,<2015-07-09 20:22:23.394 -0700>,<Administrator>,<X>,<proc1d>,<TOPSPIN 2.1>,
      <abs ABSG = 2 
       data hash MD5: 32K
       71 9D 3F A1 E1 42 E5 B5 8F A6 CE 8C E9 79 25 98>)
(   6,<2015-07-09 20:22:23.456 -0700>,<Administrator>,<X>,<proc1d>,<TOPSPIN 2.1>,
      <abs ABSG = 3 
       data hash MD5: 32K
       7B E5 4A 95 03 AB A6 CB AE 5E 56 F0 05 75 B8 41>)
(   7,<2015-07-09 20:22:23.519 -0700>,<Administrator>,<X>,<proc1d>,<TOPSPIN 2.1>,
      <abs ABSG = 4 
       data hash MD5: 32K
       A9 A7 5C 5B 2F DF D4 0E 1A E3 FC 6D D2 91 B2 46>)
(   8,<2015-07-09 20:22:23.581 -0700>,<Administrator>,<X>,<proc1d>,<TOPSPIN 2.1>,
      <abs ABSG = 5 
       data hash MD5: 32K
       2C 65 A9 14 AE 5A B9 E8 F8 99 49 CF 4E 36 ED 6E>)
$$ ##END=
$$ 
$$ $$ hash MD5
$$ $$ A9 C0 B3 E4 77 14 5C AA 8C E1 E5 87 99 14 55 EE
##$RELAX= 
##$RELAX= 
##$RELAX= 
##$RELAX= 
##$RELAX= 
##$RELAX= 
##$RELAX= 
$$ Bruker specific parameters
$$ --------------------------
##$DU= <E:\>
##$EXPNO= 10
##$NAME= <NES1031_Conilon_9266930_AQFG5NnhPy>
$$ [...]
150 150 150 150 150 150 150 150
##$TP07= 0
##$TPNAME0= <>
##$TPNAME1= <>
##$TPNAME2= <>
##$TPNAME3= <>
##$TPNAME4= <>
##$TPNAME5= <>
##$TPNAME6= <>
##$TPNAME7= <>
##$TPOAL= (0..7)
0.5 0.5 0.5 0.5 0.5 0.5 0.5 0.5
##$TPOFFS= (0..7)
0 0 0 0 0 0 0 0
##$TUNHIN= 0
##$TUNHOUT= 0
##$TUNXOUT= 0
##$USERA1= <user>
##$USERA2= <user>
##$USERA3= <user>
##$USERA4= <user>
##$USERA5= <user>
##$V9= 5
##$VALIST= <valist>
##$VCLIST= <CCCCCCCCCCCCCCC>
##$VD= 0
##$VDLIST= <DDDDDDDDDDDDDDD>
##$VPLIST= <PPPPPPPPPPPPPPP>
##$VTLIST= <TTTTTTTTTTTTTTT>
##$WBST= 2048
##$WBSW= 25
##$XGAIN= (0..3)
0 0 0 0
##$XL= 0
##$YL= 0
##$YMAX_a= 620392
##$YMIN_a= -516867
##$ZGOPTNS= <>
##$ZL1= 120
##$ZL2= 120
##$ZL3= 120
##$ZL4= 120
##$ABSF1= 14.98509
##$ABSF2= -5.573092
##$ABSG= 5
##$ABSL= 3
##$ALPHA= 0
##$AQORDER= 0
##$ASSFAC= 0
##$ASSFACI= 0
##$ASSFACX= 0
##$ASSWID= 0
##$AUNMP= <proc_prof1d_extract_pilot.lims>
##$AXLEFT= 0
##$AXNAME= <>
##$AXNUC= <1H>
##$AXRIGHT= 0
##$AXTYPE= 0
##$AXUNIT= <>
##$AZFE= 0.1
##$AZFW= 0.1
##$BCFW= 0
##$BC_mod= 0
##$BYTORDP= 0
##$COROFFS= 0
##$CY= 15
##$DATMOD= 1
##$DC= 0
##$DFILT= <>
##$DTYPP= 0
##$F1P= 0
##$F2P= 0
##$FCOR= 0.5
##$FTSIZE= 32768
##$FT_mod= 6
##$GAMMA= 0
##$GB= 0
##$INTBC= 1
##$INTSCL= 1
##$ISEN= 128
##$LB= 0
##$LEV0= 0
##$LPBIN= 0
##$MAXI= 10000
##$MC2= 0
##$MEAN= 0
##$ME_mod= 0
##$MI= 0
##$NCOEF= 0
##$NC_proc= -8
##$NLEV= 6
##$NOISF1= 0
##$NOISF2= 0
##$NSP= 0
##$NTH_PI= 0
##$NZP= 0
##$OFFSET= 14.98509
##$PC= 1
##$PHC0= 89.06067
##$PHC1= 0
##$PH_mod= 1
##$PKNL= yes
##$PPARMOD= 0
##$PPDIAG= 0
##$PPIPTYP= 0
##$PPMPNUM= 2147483647
##$PPRESOL= 1
##$PSCAL= 4
##$PSIGN= 0
##$PYNMP= <proc.py>
##$REVERSE= no
##$SF= 400.02
##$SI= 32768
##$SIGF1= 0
##$SIGF2= 0
##$SINO= 400
##$SIOLD= 32768
##$SPECTYP= <>
##$SREGLST= <1H.CDCl3>
##$SSB= 0
##$STSI= 32768
##$STSR= 0
##$SW_p= 8223.68421052631
##$SYMM= 0
##$S_DEV= 0
##$TDeff= 65536
##$TDoff= 0
##$TI= <>
##$TILT= no
##$TM1= 0
##$TM2= 0
##$TOPLEV= 0
##$USERP1= <user>
##$USERP2= <user>
##$USERP3= <user>
##$USERP4= <user>
##$USERP5= <user>
##$WDW= 1
##$XDIM= 32768
##$YMAX_p= 449772978
##$YMIN_p= -642157
##$CURPLOT= <Network HP LaserJet P1505>
##$CURPRIN= <$Network HP LaserJet P1505>
##$DFORMAT= <normdp>
##$LAYOUT= <+/1D_H.xwp>
##$LFORMAT= <normlp>
##$PFORMAT= <normpl>
##$SURQMSG= 1
$$ End of Bruker specific parameters
$$ ---------------------------------
##NTUPLES= NMR SPECTRUM
##VAR_NAME=  FREQUENCY,     SPECTRUM/REAL,   SPECTRUM/IMAG
##SYMBOL=    X,             R,               I
##VAR_TYPE=  INDEPENDENT,   DEPENDENT,       DEPENDENT
##VAR_FORM=  AFFN,          ASDF,            ASDF
##VAR_DIM=   32768,         32768,           32768
##UNITS=     HZ,            ARBITRARY UNITS, ARBITRARY UNITS
##FACTOR=    0.250966925370066, 1,           1
##FIRST=     8223.43324360094, -119617,      -163684
##LAST=      0,             -41681,          146342
##MIN=       0,             -642157,         0
##MAX=       8223.43324360094, 449772978,    0
$$ Real data points
##PAGE= N=1
##DATA TABLE= (X++(R..R)), XYDATA
$$ [...]
$$ plain form
19441 -206732 88923 -148882 -102825 -218985 -57851 -228736 -223514 -360854 7504 -259239 -143010
19430 -143010 226971 -71838 -18592 83968 -29183 33169 -106080 -186291 331773 -180575 -2170
19418 -276784 -194066 2999 -251187 -84956 -242273 111110 315715 -165924 132870 -279909
19407 -1608 -134341 27822 -385330 -33584 53513 147046 92539 -12489 -70868 -26024 320994
19395 117394 -171296 61000 -357579 -155138 187232 -246144 -57240 -119375 -199164 -31513
19384 83092 -123234 92511 45944 -132555 177465 -160256 235654 12622 1009 234879 -101141
19372 -151258 -269684 230884 -139672 -8817 16337 263787 -61882 -339642 -226263 -183684
19362 -183684 -15155 29824 -345985 -276956 -246930 -145397 -114035 -327282 -165407 -246304 198099
$$ packed form
19441b06732H8923a48882M6057j16160e7851j70885N222j37340G504b59239J16229
19430a43010B26971g1838a8592H3968b9183C3169a06080q0211C31773a80575b170
19418b76784Q2718B999b51187h4956j57317A11110K04605a65924A32870b79909
19407a608j32733B7822c85330c3584E3513R3533n4507a2489n8379b6024C20994
19395A17394a71296F1000c57579a55138A87232b46144e7240o2135p9789c1513
19384H3092a23234I2511D5944a32555A77465a60256B35654A2622A009K33870a01141
19372a51258j18426B30884a39672h817A6337K47450f1882k77760J13379M2579
19362a83684a5155B9824c45985O9029L0026J01533L1362k13247J61875q0897A98099
$$ plain form
19350 12882 -116471 -32015 205046 3038 209734 -385988 -187423 -139273 -369939 99412 -255609
19338 -383622 152998 -8863 -43043 23688 305646 -73970 -119995 -216380 -274992 18756 190892
19327 190892 -429711 -93561 -244975 -34819 66996 -123668 -403505 -245033 -265806 -175747
19317 -175747 218689 36660 -213620 168412 -186223 171481 8034 75406 18325 -230538
19306 -280477 -21488 2052 -205119 -375945 -266254 -127877 -260479 -133509 -44658 -23029
19296 -23029 -96803 170765 -64726 -3858 -116892 -80000 -9066 -345311 -33876 -66430 -349830
19285 -349830 -108038 174118 -95801 16515 -60801 -146976 -115697 -123094 136129 -266116 -335869
19274 -335869 154541 168657 138593 118240 73044 -371790 118451 305380 141385 72967
$$ packed form
19350A2882a16471c2015B05046C038K06696c85988a87423M8150k30666I9412b55609
19338c83622A52998h863l4180B3688K81958g3970m6025r6385n8612A8756J72136
19327A90892d29711i3561j51414c4819F6996a23668k79837J58472k0773R0059
19317a75747B18689C6660b13620A68412a86223A71481H034O7372A8325b30538
19306b80477b1488B052b05119j70826J09691a27877j32602J26970d4658K1629
19296b3029p3774A70765f4726c858j13034L6892i066l36245c3876l2554k83400
19285c49830a08038A74118i5801A6515f0801q6175L1279p397A36129b66116o9753
19274c35869A54541J4116l0064k0353m5196c71790A18451J86929A41385o8418
$$ plain form
19264 72967 131382 -141494 909 -104393 -166881 -74413 40325 -30703 -266171 128956 40986
19252 -364196 -430426 -331200 -290443 -141246 56108 -210530 364906 116332 160789 13088 145374
19241 145374 -530449 -94154 88995 140512 17884 -59969 -322697 -74908 136126 217193 -301204
19229 -64551 76633 9516 -121662 -16223 112304 -215976 -117264 -288117 -67791 -157812 -157287
19218 -157287 169460 -365597 -174766 -163331 337599 -24020 -12167 -200419 -132216 -146813
19208 -146813 -176866 132904 62341 -247421 -385293 157964 -139032 -257497 40519 15263
19197 305850 -50442 -206186 -55651 -24320 59515 -184280 113846 76941 -236406 -125356
19187 -125356 -153590 68300 376700 179954 200203 39110 41327 -149764 -148392 -104562 -131771
$$ packed form
19264G2967N8415a41494I09a04393o2488g4413D0325c0703k35468A28956D0986
19252c64196o6230R9226M0757a41246E6108b10530C64906A16332M4457A3088J32286
19241A45374e30449i4154H8995N1517A7884e9969k62728g4908A36126Q1067c01204
19229f4551G6633I516a21662a6223A12304b15976R8712j70853f7791r0021N25
19218a57287A69460c65597a74766J1435C37599b4020J1853j88252O8203j4597
19208a46813l0053A32904F2341b47421j37872A57964a39032j18465D0519A5263
19197C05850e0442j55744e5651b4320E9515a84280A13846l6905b36406J11050
19187a25356k8234F8300L08400A79954K0249C9110K217a49764J372M3830k7209
$$ plain form
19176 -131771 -9697 24544 -333126 124722 -112551 -205143 -23471 -220583 79572 -137742 59260
19164 256465 -261611 -170432 -20936 274145 -56376 -32794 -267177 -21076 -179207 -101385 -323273
19153 -323273 -295198 79332 -137833 -126870 -63788 193894 24184 -161539 -199954 -42563 -182514
19142 -182514 -348630 -129367 -257046 -140445 -339724 -357154 -54977 -123832 -49722 61862
19131 -3854 12465 -200415 137949 82502 -113212 31776 -9977 -207533 -266144 20045 -154894
19119 42095 39894 11421 -13253 -143717 251365 146115 163141 -378960 59858 23855 237528
19108 237528 -293171 201433 184614 -141257 -14025 362810 -206746 -177976 -135879 -81409
19098 -81409 -217363 -78725 195908 -27495 82599 -234858 53592 -191312 91177 -33923 -165154
$$ packed form
19176a31771i697B4544c33126A24722a12551r2592b3471j97112G9572a37742E9260
19164B56465b61611R1179b0936B74145e6376K3582k34383b1076j58131P7822k21888
19153c23273K8075G9332a37833J0963O3082A93894B4184a61539l8415d2563j39951
19142a82514j66116a29367j27679J16601j99279j7430e4977o8855d9722F1862
19131c854A2465b00415A37949n5447a13212C1776i977j97556n8611B0045a54894
19119D2095k201A1421a3253j30464B51365j05250J7026c78960E9858B3855K13673
19108B37528b93171B01433j6819a41257a4025C62810b06746K8770M2097N4470
19098h1409j35954g8725A95908b7495H2599b34858E3592a91312I1177c3923j31231
$$ plain form
19087 -165154 14713 119080 -100099 -6058 103628 460138 238440 -249332 -22521 70874
19076 -364104 -376200 -19898 -102749 -5246 257502 -142027 196345 -126791 133583 61072 -25812
19064 20396 126081 -224698 -84300 6826 -31896 166244 -332034 240124 228395 -201156 72332
19052 -173380 -164640 82801 -519468 57979 14160 -97464 81464 -231060 -301663 -246903 47701
19040 -83315 109344 -147420 -137806 104262 11918 114054 -254543 -279647 81861 -387997 -38073
19028 37572 -313543 57470 83277 -214203 67221 -244772 -61982 228660 196337 -64625 -58149
19017 -58149 -29113 -200947 39044 23171 -34973 61357 -19194 -60021 289935 -76377 109832
19005 -186064 -128202 151440 114590 189789 -163660 -286988 29538 -163199 -296900 34263
$$ packed form
19087a65154A4713J04367a00099f058A03628L56510k21698b49332b2521G0874
19076c64104j2096a9898q2851e246B57502a42027A96345a26791A33583F1072b5812
19064B0396J05685b24698h4300F826c1896A66244c32034B40124j1729b01156G2332
19052a73380Q740H2801e19468E7979A4160i7464H1464b31060p0603N4760D7701
19040h3315A09344a47420R614A04262A1918J02136b54543k5104H1861c87997c8073
19028C7572c13543E7470K5807b14203F7221b44772f1982B28660l2323f4625O476
19017e8149K9036j71834C9044j5873c4973F1357a9194m0827B89935g6377A09832
19005a86064N7862A51440l6850P5199a63660j23328B9538a63199j33701C4263
$$ plain form
18994 -193744 -71467 -110077 -70198 -365468 115011 -308347 -403083 -89915 -253284 135601
18983 -70149 -1173 161944 -46696 59418 73358 -86584 -244082 -19626 -292654 -192207 -48470
18971 -89829 -131411 -37500 -120060 -78914 -345930 261850 -60268 182325 219276 397217 236032
18960 236032 135712 -289106 167492 78501 -276227 -238509 -108202 85299 -3090 -106172
18950 -106172 -82315 25647 -91213 164034 42384 -141767 -223694 -336 -138695 73720 112955
18939 112955 -10284 309532 158960 324280 -14035 -28789 -166081 181971 -97652 44085
18928 -286447 -170761 58092 -180567 -126753 -70664 224697 -138609 -217140 196350 -77312
18917 -168741 246919 -170824 -180603 -165595 -5738 -207804 -138393 -70208 -73886 -116585 -214564
$$ packed form
18994a93744g1467l8610L9879k95270A15011c08347r4736h9915j63369A35601
18983g0149a173A61944d6696E9418J3940h6584j57498a9626k73028J00447d8470
18971h9829m1582c7500q2560M1146k67016B61850f0268A82325L6951J77941j61185
18960B36032j00320b89106A67492G8501b76227L7718a08202H5299c090j03082
18950a06172K3857B5647i1213A64034D2384a41767q1927c36j38359G3720L9235
18939A12955a0284C09532j50572J65320a4035j4754j37292A81971i7652D4085
18928b86447J15686E8092a80567N3814N6089B24697a38609p8531A96350g7312
18917a68741B46919a70824r779J5008e738k02066O9411O8185l678m2699r7979
$$ plain form
18906 -214564 -20272 -221234 -342588 134160 6114 25841 199845 409744 335754 282099 -330337
18894 -237843 -129888 -40642 -16951 198238 -203429 -97729 9920 218982 -19816 -137520 56603
18882 211824 127288 -141323 88104 -37693 -401560 -23232 129250 -140163 -112408 170154
18871 47330 -108034 -53353 94082 101829 136087 371505 -154517 27448 -92310 -112892 13274
18859 250975 -189021 51952 -249241 11201 -319766 -246701 -139945 48992 104167 -209269
18848 57433 11766 -44677 67236 -177310 -151797 70210 141026 106337 -133928 -156265 2400
18836 346984 -133954 -201422 -143061 216368 -187481 88643 71889 -13850 183777 -141141
18825 -323002 -198817 -129814 -86400 68570 -210111 -216054 175187 28413 -30023 -4233 142788
$$ packed form
18906b14564b0272k00962j21354A34160F114J9727J74004K09899p3990n3655c30337
18894b37843J07955d0642a6951A98238b03429i7729I920K09062a9816j17704E6603
18882B11824q4536a41323H8104c7693l63867b3232A29250a40163K7755A70154
18871D7330a08034e3353I4082P747L4258K35418a54517B7448i2310k0582A3274
18859B50975a89021E1952b49241A1201c19766P3065J06756D8992N5175b09269
18848E7433A1766d4677F7236a77310K5513G0210P0816l4689a33928k2337B400
18836C46984a33954o7468N8361B16368a87481H8643j6754a3850A83777a41141
18825c23002J24185O9003M3414F8570b10111n943A75187B8413c0023d233A42788
$$ plain form
18813 61284 -228650 -189459 -67784 96394 46077 207755 268133 5066 -104939 -111206 -85506
18802 -85506 -52374 -38341 -109061 -89340 -545163 -303518 -61547 -262372 -198122 -116266 -3603
18790 43510 -288306 -4013 46412 -122171 -129732 -111503 214430 -24241 123974 48431 -150776
18778 -267644 -72759 -515373 82540 155080 40689 -182770 59753 -189218 -157730 135521 -166658
18766 -64257 -157729 -157783 102657 58966 226705 -48176 -219338 102839 63793 -186012 59334
18754 -73188 -263306 114934 -116095 8088 239933 19946 -206784 7741 -35985 -121727 -146381
18743 -146381 -161975 40505 125756 -75574 -51014 166661 -21725 9469 -581 -110743 183847
18731 -191905 105054 -205879 -28798 -350897 -316868 -93900 -147188 7396 -404626 -252245 61154
$$ packed form
18813F1284b28650L9191f7784I6394D6077J61678O0378E066a04939o267K5700
18802h5506L3132J4033p0720J9721m55823K41645f1547k00825O4250Q1856c603
18790D3510b88306d013D6412a22171p561J8229B14430b4241A23974D8431a50776
18778b67644g2759m42614H2540P2540D0689a82770E9753a89218L1488A35521a66658
18766f4257r3472n4A02657m3691J67739d8176j71162A02839l9046a86012E9334
18754g3188j90118A14934a16095H088K31845A9946b06784G741c5985q5742k4654
18743a46381j5594D0505Q5251g5574K4560A66661b1725I469e81j10162A83847
18731a91905A05054b05879b8798l22099L4029i3900n3288G396d04626J52381F1154
$$ plain form
18719 -17892 -246139 -10707 13868 129146 -83858 171735 -68500 -152026 -149524 -10686 80506
18707 71624 -3899 -238798 -147355 -63864 -158612 -260015 -33101 -12059 136860 1478 -69815
18695 -395666 121473 -203293 -317933 -4066 20925 52240 -80737 32074 -83414 102597 -52050
18683 15046 -167498 -228199 -247351 -127372 -35351 282891 238584 -140443 -219500 -60470 -208985
18672 -208985 -343787 170686 102605 -403646 18875 391139 -204528 -84795 119321 -316179
18661 -98105 -146155 -41347 30036 69253 -314122 -300315 12142 276582 40932 -58441 -73558
18650 -73558 26182 8241 -243567 9318 -338502 108142 -123794 -67776 292860 -50835 84821
18638 95469 299477 -24963 -556343 -357848 103339 -25664 121986 -164940 150837 280704
$$ packed form
18719a7892k28247a0707A3868J15278h3858A71735f8500q3526K502a0686H0506
18707G1624c899k34899R1443f3864r4748j01403c3101a2059A36860A478f9815
18695c95666A21473b03293j14640d066B0925L1315h0737C2074h3414A02597e2050
18683A5046a67498o0701j9152J19979c5351B82891m4307a40443p9057f0470j48515
18672b08985j34802A70686o8081d03646A8875L72264b04528h4795A19321c16179
18661i8105m8050d1347C0036L9217c14122J3807A2142K64440D0932e8441j5117
18650g3558B6182H241b43567I318c38502A08142a23794N6018B92860e0835H4821
18638I5469K04008b4963n31380J98495A03339b5664A21986a64940A50837J29867
$$ plain form
18628 280704 -177858 -159649 -344217 151128 -68635 -497793 -23026 -51152 115684 -24352
18617 -5491 97499 -181459 242940 -29133 -10030 68361 379857 -388754 200560 129763 -326578
18605 -213922 -32919 -114613 -338465 192640 -3265 323485 -329752 168002 -241492 -214992
18595 -214992 143673 -237298 111124 -72080 68896 -165900 22180 -227344 79978 190169
18585 190169 65299 -62610 -176024 -196963 -310633 -237770 -25452 -154958 289484 -37694 86750
18573 -365047 257073 -356561 -39352 160774 23315 1451 -341725 -270674 -40772 56957 -210017
18561 -226560 193410 -354373 -206694 11068 -107559 -246696 -36823 271296 -238391 -48045
18550 -287823 155269 153643 247645 234980 93302 163499 -44352 -19686 40039 186414 -87101
$$ packed form
18628B80704a77858J8209j84568A51128f8635m29158b3026k8126A15684b4352
18617e491I7499a81459B42940b9133a0030F8361L11496c88754B00560p0797c26578
18605b13922c2919q1694k23852A92640c265C23485c29752A68002b41492K6500
18595b14992A43673b37298A11124g2080F8896a65900B2180b27344G9978J10191
18585A90169F5299f2610j13414k0939j13670P2863b5452j29506B89484c7694H6750
18573c65047B57073c56561c9352A60774B3315A451c41725P1051d0772E6957b10017
18561b26560A93410c54373J47679A1068a07559j39137c6823B71296b38391d8045
18550b87823A55269j626R4002j2665I3302P0197d4352a9686D0039J46375h7101
$$ plain form
18538 77798 -94420 -86007 95991 106045 1066 -127016 181944 -49875 -106632 -224465 -215731 46370
18525 250754 -316919 367829 105024 116525 -24938 -14508 -325222 51161 -37693 -115881 -85054
18514 -85054 94921 145542 -203127 144361 -11906 111063 -156190 -21396 -68687 -36377 -111806
18503 -111806 -83889 -389475 204465 -164042 -143679 -77342 68878 70668 106580 153984 -100742
18491 -204728 43072 -127869 -525470 -121045 20292 60937 -272173 115374 -228603 -139277
18481 -139277 9865 248291 -160268 51312 -256302 -128599 -13753 104946 -128296 -344368
18471 -344368 110310 26780 -103489 -76037 -143253 283941 25120 308282 36564 -153564
18460 -30361 -33507 80851 -154767 -25458 -115133 -117096 -50235 132016 -100854 74656 -307926
$$ packed form
18538G7798i4420Q413I5991J0054A066a27016A81944d9875n6757j17833Q734D6370
18525B50754c16919C67829A05024J1501b4938J0430l10714E1161c7693p8188L0827
18514h5054I4921N0621b03127A44361a1906A11063a56190b1396m7291L2310p5429
18503a11806K7917l05586B04465a64042K0363O6337F8878J790L5912M7404a00742
18491b04728D3072a27869l97601a21045B0292M0645b72173A15374b28603Q9326
18481a39277I865K38426a60268E1312b56302J27703a3753A04946a28296k16072
18471c44368A10310B6780a03489K7452o7216B83941B5120K83162C6564a53564
18460c0361l146H0851a54767b5458q9675j963e0235A32016a00854G4656c07926
$$ plain form
18448 -96332 209923 -266503 -14336 -103160 -268453 408517 -17074 104411 150847 141300 214567
18437 214567 -61994 -442086 -114600 11788 84504 2907 -8103 -243648 -287865 -416512 -77549
18425 -115050 120712 -23621 -28033 50634 -110260 -108621 -39942 22719 -29989 -65684 125477
18413 -130981 65914 -122098 -131315 -81680 153653 -28928 -166746 -180427 170497 -322801 -166057
18402 -166057 -102093 24107 24273 9453 209621 165076 -190519 -24359 5909 -55394 -20602 -187734
18390 -187734 -122834 -121064 1449 153912 -6261 40170 246963 67081 -102716 1230 79313 55877
18378 55877 274643 -295238 372501 -223390 17906 -82518 225382 -30232 -238949 145794
18367 -30414 231143 211712 44377 114384 -150494 -11693 270933 175545 -30804 100657 74826
$$ packed form
18448i6332B09923b66503a4336q8824j65293D08517a7074A04411M6436r547P3267
18437B14567f1994l80092a14600A1788P2716B907h103k35545m4217j28647g7549
18425a15050A20712b3621m412E0634a10260J639c9942B2719b9989l5695A25477
18413a30981F5914a22098r217M9635A53653b8928j37818j3681A70497c22801J56744
18402a66057O3964B4107J66I453K00168m4545a90519b4359E909e5394b0602j67132
18390a87734O4900J770A449J52463f261D0170K06793F7081a02716A230P8083k3436
18378E5877K18766b95238C72501b23390A7906h2518B25382c0232k08717A45794
18367c0414B31143j9431D4377P0007a50494a1693B70933r5388c0804A00657k5831
$$ plain form
18356 74826 178987 112678 133919 -105528 -12659 -64796 -89169 -77878 -15637 105743 -122644
18344 -89452 -114792 -132340 -61071 87099 -167445 -129750 8042 108662 -77072 17623 38554
18333 38554 -18834 -202784 84166 -10942 357380 -15763 -60882 -25977 -152438 151245 -90875
18321 -159488 20011 -4994 -162899 11816 62297 8487 -271616 113230 -136454 -117042 -57058
18309 -87024 47203 -133824 -214952 -126936 -325584 11131 -45458 -37663 51697 188175 381765
18298 381765 32144 -71664 40675 -161171 -274679 -114226 -112441 174238 250673 -44988 -339058
18287 -339058 119175 -273062 -141854 -79969 50619 -432494 -82450 285557 -76555 52271
18276 311496 -78336 286597 -94448 216062 -61407 -371013 127853 170104 -163437 -275852
$$ packed form
18356G4826J04161o6309K1241a05528a2659n2137k4373J1291a5637A05743a22644
18344h9452k5340j7548f1071H7099a67445L7695H042J00620g7072A7623K0931
18333C8554a8834j83950H4166a0942C57380a5763m5119b5977j26461A51245i0875
18321a59488B0011d994j57905A1816N0481H487b71616A13230a36454J9412e7058
18309h7024D7203a33824q1128Q8016j98648A1131d5458P795E1697J36478J93590
18298C81765C2144g1664D0675a61171j13508a14226J785A74238P6435d4988k94070
18287c39058A19175b73062J31208O1885E0619d32494h2450B85557g6555E2271
18276C11496g8336B86597i4448B16062f1407l09606A27853M2251a63437j12415
$$ plain form
18266 -275852 -49996 -262948 267754 -25401 24457 72841 2225 -72939 -156959 -17908 223447
18254 116727 -161230 -57627 -128743 346639 83650 -268283 82164 71656 -246793 81566 -84600
18242 20660 -53311 -99657 182145 -32990 2302 -99341 -137175 -154581 -140156 -224389 86490 -164080
18229 -311061 -250497 -261166 -107414 82740 -30257 -417492 -102338 107191 11877 -73758 -46692
18218 -46692 204692 -441131 -201916 172253 -260203 -281795 -56590 32125 54125 -121810
18207 -137836 87665 239676 -37465 -70413 -29110 -150783 -230073 92298 29401 -143848 252713
18195 106126 169968 47485 199675 141520 344843 48915 -205028 -155653 239264 -35732 -13907
18183 -250583 2792 219199 -161686 7814 -39057 114596 4132 -65156 -28640 172450 -20341
$$ packed form
18266b75852d9996k12952B67754b5401B4457M8384B225g2939q4020a7908B23447
18254A16727a61230e7627p1116C46639H3650b68283H2164j0508b46793H1566h4600
18242B0660e3311m6346A82145c2990B302i9341l7834j7406J4425q4233H6490a64080
18229c11061O0564j0669a07414H2740c0257l87235a02338A07191A1877g3758K7066
18218d6692B04692d41131b01916A72253b60203k1592e6590C2125K2000a21810
18207a37836H7665J52011c7465l2948b9110j21673p9290I2298B9401a43848B52713
18195A06126O3842D7485J52190n8155K03323D8915b05028M9375B39264c5732a3907
18183b50583B792K16407a61686G814c9057A14596D132f5156b8640A72450b0341
$$ plain form
18171 254285 -136330 -95558 270242 225176 33029 82607 -238966 113817 -66478 -183929
18161 -183929 92097 -70835 92344 -108691 -6838 330791 -196081 -32631 -23818 -191343 -205762
18150 -205762 -232650 130791 -258622 -73609 288680 141898 133287 -205330 147423 83724
18140 83724 -65571 98377 176171 -71655 13705 133466 -24012 -103060 -101582 -229576 272520
18128 80879 -444642 20896 -55419 210732 -149729 50469 -231923 -86941 -33247 -16470 -3370
18116 -18340 107071 323286 -9524 137442 -132000 38990 51403 48323 156212 309359 293685
18105 293685 195143 -101105 17709 201874 -176649 -162596 -266627 69710 -152272 -56751
18094 110878 54079 25963 -85047 -8759 81358 180829 122020 -70825 -215506 42063 -58997
$$ packed form
18171B54285a36330M0772B70242m5066C3029M9578b38966A13817f6478j17451
18161a83929I2097g0835I2344a08691f838C30791a96081c2631Q813j67525j4419
18150b05762k6888A30791b58622g3609B88680A41898q611b05330A47423o3699
18140H3724f5571I8377P7794g1655A3705J19761b4012p9048J478j27994B72520
18128H0879d44642B0896e5419B10732a49729E0469b31923h6941c3247a6470c370
18116a8340A07071K16215i524A37442a32000C8990J2413l080J07889J53147j5674
18105B93685r8542a01105A7709J84165a76649J4053j04031F9710a52272e6751
18094A10878E4079B5963h5047h759H1358R9471n8809g0825j44681D2063e8997
$$ plain form
18082 -438066 -99947 -150782 -21210 -260709 -130427 -44904 74311 -85782 -304072 -99695 -249829
18071 -249829 10764 -9315 -287047 208896 -344290 50520 262049 62131 -284685 44286 49981
18060 49981 -154004 16547 249604 116019 -302570 -154644 162994 79962 146244 61158
18049 -103319 -10603 -315921 150980 45619 -14380 -122593 -13000 192573 371950 -114609
18038 184881 428668 127030 -951 133847 -141062 105953 38380 47552 39435 293786 357294
18027 357294 19612 1491 -5265 -238387 242323 -142421 -62029 -443529 206391 185932 269378
18016 269378 -101908 -111451 83799 101380 52282 6855 -233788 149448 -210596 -7475 145959
18004 -73527 61806 306896 45113 66568 -356139 -282210 -35194 -804 -1683 -9114 -233226 -17366
$$ packed form
18082d38066i9947n0835b1210k39499J30282d4904G4311h5782k18290i9695j50134
18071b49829A0764i315k77732B08896c44290E0520K11529F2131b84685D4286N695
18060D9981a54004A6547K33057A16019c02570J47926A62994G9962O6282F1158
18049a03319a0603l05318A50980D5619a4380j08213a3000A92573J79377a14609
18038A84881K43787A27030i51A33847a41062A05953C8380R172q117K54351O3508
18027C57294A9612A491e265k33122B42323a42421f2029l81500B06391k0459Q3446
18016B69378a01908r543H3799J7581m9098F855b33788A49448b10596g475A45959
18004g3527F1806K45090D5113K1455c56139P3929c5194h04q79p431k24112a7366
$$ plain form
17991 -102310 64913 -59479 87087 -72841 261312 133584 1048 -18450 -17134 120093 -46154
17979 224987 -175855 -134144 -82985 -90329 6795 152786 295836 -119326 23227 309718 -136706
17967 333493 11153 -52227 -184482 -191830 -276054 -156723 16376 223044 272916 179654 15253
17955 95839 49542 -32269 29692 -95685 411298 -123966 107538 20606 144467 33720 169017
17944 169017 230764 -31995 -16055 -254452 37019 -139193 58913 -28127 -67781 32836 159398
17933 159398 44028 161358 14098 -145335 58687 39086 32538 -60374 57144 -89060 211901
17921 93777 182314 67081 25496 -43943 -294130 383170 29611 284642 92068 -3444 -63547
17910 -63547 -110843 114161 54656 219033 -18644 26387 -197519 84399 15295 258570 236841
$$ packed form
17991a02310F4913e9479H7087g2841B61312j27728A048a8450J316A20093d6154
17979B24987a75855M1711N1159p344F795J45991J43050a19326B3227K86491a36706
17967C33493A1153e2227j32255p348q4224J19331A6376K06668M9872r3262A5253
17955I5839m6297c2269B9692i5685D11298a23966A07538B0606J23861C3720J35297
17944A69017O1747c1995J5940k38397C7019a39193E8913b8127l9654C2836J26562
17933A59398D4028J17330A4098a45335E8687j9601o548f0374E7144h9060B11901
17921I3777Q8537F7081B5496d3943k50187C83170B9611K55031I2068c444o0103
17910f3547m7296A14161E4656J64377a8644B6387a97519H4399A5295K43275k1729
$$ plain form
17899 236841 -83622 48932 -80551 85681 -332645 9137 8855 156302 118341 -94608 135058
17887 130610 23188 -17877 191914 -52330 89587 154593 108382 106752 -247678 -65778 43045
17875 221976 -189640 -248896 -49681 160357 -397365 74636 -97712 165191 248079 260837 -338594
17863 46948 107351 -180675 9810 -49652 -214210 129057 -12281 84754 52014 177179 -68763
17851 -844 -150516 120942 -162356 -148878 -210888 314228 -186177 137917 -44838 40106 -46426
17839 11606 -277730 -125406 -66966 -174458 18019 -10318 -173270 -357823 66578 -70155 107979
17827 -45639 102525 220945 -130776 21314 -114903 -218905 -58989 54037 108523 33441 109844
17816 109844 104181 9836 107493 428923 307101 -272070 -187804 93380 65040 275646 157777
$$ packed form
17899B36841h3622D8932h0551H5681c32645I137k82J47447l7961i4608A35058
17887A30610B3188a7877A91914e2330H9587O5006m6211j630b47678f5778D3045
17875B21976a89640n9256d9681A60357c97365G4636i7712A65191Q2888J2758c38594
17863D6948O0403a80675I810d9652j64558A29057a2281H4754l2740J25165f8763
17851h44j49672A20942a62356J3478o2010C14228a86177A37917d4838D0106d6426
17839A1606b77730a25406N8440j07492A8019a0318j62952j84553F6578g0155A07979
17827d5639A02525J18420a30776B1314a14903j04002e8989E4037N4486C3441P6403
17816A09844n663I836R7657L21430j21822b72070Q4266I3380k8340K10606j17869
$$ plain form
17805 157777 151434 118633 -91909 -31137 -14068 -79920 116093 -2144 187797 114445 -26752
17793 123044 122506 155348 160258 -39829 146956 11636 68788 295177 76815 154960 152218 -90821
17780 198794 -55310 -177341 333294 183334 152464 -202189 -200531 224604 201402 285500 4957
17768 71320 46954 446130 18027 -413593 283474 -36721 366967 267602 364087 207128 -48460
17756 -87455 94621 123929 121337 131273 152098 349742 89373 78063 89497 268065 141314
17745 141314 244337 304689 -193691 157737 -36689 168747 251148 145043 371010 166119
17734 217605 -1854 113499 -18149 172743 -64870 191675 168855 222085 160763 236883 194499
17723 194499 213526 307161 -339 145119 15775 -125395 4128 -112640 326149 -252266 256954
$$ packed form
17805A57777o343l2801i1909c1137a4068o5852A16093b144A87797p3352b6752
17793A23044n38L2842M910c9829A46956A1636N7152K26389G6815P8145k742i0821
17780A98794e5310j22031C33294j49960l0870b02189J658B24604k3202Q4098D957
17768G1320k4366L99176A8027d13593B83474c6721C66967r9365R6485j56959d8460
17756h7455I4621K9308k592R936K0825J97644H9373j1310J1434J78568j26751
17745A41314J03023O0352a93691A57737c6689A68747Q2401j06105K25967A66119
17734B17605a854A13499a8149A72743f4870A91675k2820N3230o1322P6120m2384
17723A94499J9027R3635c39A45119A5775a25395D128a12640C26149b52266B56954
$$ plain form
17711 373579 209971 150874 -61937 78446 79777 250901 92887 -259417 209650 268755 106292
17699 51541 -57420 259707 -125087 -309840 217924 77054 -129183 20346 335891 -37485
17688 148542 225373 219928 28563 306787 244763 241263 84892 245845 116083 156605 452867
17677 452867 150246 -27525 10479 -80150 193874 -63246 13710 64455 283297 6978 17387
17666 17387 29605 -157507 349860 86457 110623 3435 45753 286589 354090 9706 -98300
17654 -126146 -172710 153202 17933 363447 68942 -173786 80063 191839 -89894 339576
17643 335268 235261 -294849 32508 243099 142981 173350 36106 -203030 14920 63910
17633 63910 325862 -3570 -38187 145421 215006 323633 230329 356465 101928 -44821 862
$$ packed form
17711C73579j63608n9097f1937G8446J331J71124I2887b59417B09650N9105A06292
17699E1541e7420B59707a25087j84753B17924G7054a29183B0346L15545c7485
17688A48542P6831n445B8563K78224o2024l500H4892J60953A16083M0522K96262
17677D52867A50246b7525A0479h0150A93874f3246A3710N0745K18842F978J0409
17666A7387J2218a57507C49860H6457K4166C435M2318K40836O7501I706i8300
17654a26146m6564A53202A7933L45514F8942a73786H0063J11776h9894C39576
17643C35268j00007b94849C2508K10591j00118L0369C6106b03030A4920M8990
17633F3910K61952c570l4617A45421O9585J08627r3304J26136A01928d4821H62
$$ plain form
17621 15778 111903 106293 259173 239899 -85354 282996 209495 275253 435670 135268 -21856
17609 -100072 180223 207544 169339 128155 142526 56104 -60785 35714 -45771 244563 66207
17597 319397 405671 -23812 146357 122628 391542 -270886 -93856 48720 155297 23392 106609
17586 106609 275350 59996 369117 205429 -50828 246537 177888 217710 92243 107059 123481
17575 123481 42904 -34268 195911 349698 74537 -136660 169452 120147 -181758 354422
17564 295890 297188 -64325 304824 92116 126680 -72727 -157895 134331 -13053 -20169 264607
17552 412222 -97867 275197 78098 77975 400618 -36784 212039 509994 281523 75919 50536
17541 50536 174409 227099 221235 178270 81710 237090 257044 332168 141412 102799 253920
$$ packed form
17621A5778R6125n610J52880j9274h5354B82996p3501O5758J60417A35268b1856
17609a00072A80223K7321l8205m1184J4371E6104f0785C5714d5771B44563F6207
17597C19397Q6274b3812A46357k3729K68914b70886i3856D8720J06577B3392Q3217
17586A06609J68741E9996L09121j63688e0828B46537o8649L9822I2243J4816J6422
17575A23481D2904c4268A95911J53787G4537a36660A69452m9305a81758C54422
17564B95890J298f4325C04824I2116L4564g2727q5168A34331a3053p116B64607
17552D12222i7867B75197G8098j23L22643c6784B12039K97955k28471G5919k5383
17541E0536J23873N2690n864m2965H1710J55380J9954P5124A41412l8613J51121
$$ plain form
17530 253920 552653 465009 183364 257048 313208 407549 298811 652184 386743 326371
17520 326371 277960 67395 403895 406576 138113 403418 200898 429561 247236 447801
17510 447801 593001 271906 407474 630180 371464 194345 131825 316289 121688 291246
17500 291246 -152210 154678 184935 126069 258558 180791 187869 254491 511906 414685 144115
17488 155370 127871 236007 267616 81334 308932 155637 409137 104177 112220 422669
17478 422669 283348 88354 349924 183177 208356 140600 114203 520533 154715 296010
17468 296010 253517 225241 377536 479324 271201 372463 249731 209857 372440 384849
17458 384849 441237 -327647 276 104761 262866 -78618 406515 168834 397332 260545
$$ packed form
17530B53920K98733q7644A83364P3684N6160R4341j08738L53373k65441o0372
17520C26371m8411F7395L36500K681A38113K65305B00898K28663j82325K00565
17510D47801J45200B71906J35568K22706k58716j77119o2520J84464A21688J69558
17500B91246a52210A54678L0257n8866J32489p7767P078O6622K57415r7221A44115
17488A55370k7499J08136L1609H1334K27598j53295K53500A04177Q043L10449
17478D22669j39321H8354K61570j66747K5179o7756k6397M06330A54715J41295
17468B96010m2493k8276J52295J01788k08123J01262j22732l9874J62583J2409
17458C84849N6388c27647B76J04485J58105g8618D06515A68834K28498j36787
$$ plain form
17448 260545 78355 631409 402332 429634 449989 774157 535224 212000 596644 597554 446616
17437 446616 129540 154757 447157 297717 451820 359711 510362 300265 268937 589180
17427 589180 493560 519381 151899 452023 552371 502515 161071 685816 573432 115525
17416 519803 448284 337648 536860 290961 435025 335051 424864 733207 13150 496184
17406 496184 449039 298750 193301 782771 109204 383480 19073 294866 278623 481907
17396 481907 350898 74315 241647 306708 59739 298472 388747 318421 134963 399974
17386 399974 126079 541183 93948 169177 431687 500184 270879 636077 179773 190503
17376 190503 161365 -72580 180363 300830 329589 478490 447768 228820 422322 139105
$$ packed form
17448B60545G8355N53054k29077K7302K0355L24168k38933B12000L84644R10j50938
17437D46616A29540K5217K92400j49440J54103r2109J50651k10097l1328L20243
17427E89180r5620K5821A51899L00124J00348m9856A61071N24745j12384A15525
17416E19803p1519j10636J99212k45899J44064r9974Q9813L08343A3150M83034
17406D96184m7145j50289j05449N89470A09204K74276A9073K75793j6243K03284
17396D81907j31009G4315J67332O5061E9739K38733R0275p0326A34963K65011
17386C99974A26079M15104I3948P5229K62510O8497k29305L65198A79773J0730
17376A90503k9138g2580A80363J20467K8759J48901l0722k18948J93502A39105
$$ plain form
17365 69495 55504 267929 209711 192512 88051 406144 422070 337006 155308 319463 307849
17354 307849 192667 317055 424929 19195 91904 138062 371787 274475 339658 539553
17344 539553 281570 472902 -105096 430949 327374 192376 36497 550476 310041 347189
17334 347189 620027 228490 23789 -29781 339543 198872 284326 190988 125583 71758 440289
17323 440289 536249 540967 163323 247743 369843 614923 382001 617270 -1138 401455 232824
17312 232824 236314 445949 264559 312586 494655 382612 183689 478104 292093 283691
17302 283691 495690 531501 662337 9624 236287 315824 580819 307641 385823 297671 262536
17291 262536 367842 473184 163649 642377 263403 300029 387381 519366 394140 319651
$$ packed form
17365F9495j3991K12425n8218j7199H8051L18093J5926q5064A55308J64155j1614
17354C07849j15182J24388J07874A9195P2709M6158K33725r7312O5183J99895
17344E39553k57983J91332a05096D30949j03575j34998C6497N13979k40435L7148
17334C47189K72838B28490B3789b9781C39543j40671Q5454r3338o5405n3825L68531
17323D40289R5960M718A63323Q4420J22100K45080k32922K35269a138D01455j68631
17312B32824L490K09635j81390M8027J82069j12043A83689K94415j86011q402
17302B83691K11999L5811J30836I624K26663P9537K64995k73178P8182q8152l5135
17291B62536J05306J05342A63649M78728B63403L6626Q7352J31985j25226p4489
$$ plain form
17281 319651 384138 632935 217641 228563 515862 579486 512511 485260 266405 296183 180081
17270 180081 467085 232050 570094 503207 310483 245926 468703 502638 408634 233381
17260 233381 379676 262794 115167 449203 77481 422053 538082 415662 346496 447008
17250 447008 468813 411750 434069 454077 403547 510335 261826 400939 260349 369054
17240 369054 708476 209056 532669 447396 578784 428268 299815 456163 471974 390438
17230 390438 499910 867806 634531 502032 427041 587210 501629 667173 412917 543958
17220 543958 252877 576052 445718 394980 670084 195062 617366 782822 381801 345022
17210 345022 383478 418969 600832 572573 420015 286664 561410 602904 399921 619788
$$ packed form
17281C19651O4487K48797B17641J0922K87299O3624o6975k7251k18855K9778j16102
17270A80081K87004B32050L38044o6887j92724o4557K22777L3935r4004j75253
17260B33381J46295j16882A15167L34036G7481L44572J16029j22420o9166J00512
17250D47008K1805n7063K2319K0008n0530J06788k48509J39113j40590J08705
17240C69054L39422B09056L23613q5273J31388j50516j28453J56348J5811q1536
17230C90438J09472L67896k33275j32499p4991J60169q5581J65544k54256J31041
17220E43958B52877L23175j30334n0738K75104A95062M22304J65456C81801l6779
17210C45022L8456L5491J81863k8259j52558j33351K74746M1494k02983K19867
$$ plain form
17200 619788 397308 303732 562872 362998 695310 581018 881253 386526 835210 561376
17190 561376 483909 448964 555897 505502 716082 672845 870210 366653 963842 730172
17180 730172 685486 788392 497767 587810 433764 535670 566865 225907 884374 786784
17170 786784 659986 588255 715347 763134 447266 462076 730604 370277 873538 660809
17160 660809 639517 778976 759409 543943 835463 998282 940979 792504 862552 217474
17149 677000 676017 763717 616175 694555 601335 557427 635490 747016 708761 578619 941343
17138 941343 485704 725500 1005838 556988 947356 592416 1123373 648940 438272 902501
17128 902501 733233 940946 1077725 797662 585290 872617 438001 689860 843323 1187452
$$ packed form
17200F19788k22480r3576K59140j99874L32312j14292L00235C86526M48684k73834
17190E61376p7467l4945J06933n0395K10580m3237J97365C66653N97189k33670
17180G30172m4686J02906k90625R0043j54046J01906L1195B25907O58467r7590
17170G86784j26798p1731J27092M7787l15868J4810K68528l60327N03261k12729
17160F60809k1292J39459j9567k15466K91520J62819n7303j48475P0048B17474
17149F77000r83Q7700j47542P8380r3220m3908P8063J11526l8255j30142L62724
17138I41343m55639K39796K80338m48850L90368l54940N30957m74433k10668M64229
17128I02501j69268K07713J36779k80063k12372K87327m34616K51859J53463L44129
$$ plain form
17118 1187452 410082 759166 878947 636492 1025746 819545 682464 932620 796433
17109 796433 730058 1006086 1044250 1137188 965932 1018428 950701 950819 978801 663546 891862
17098 891862 998508 996963 967230 804782 1081192 560394 830706 1049425 1079222 848996
17088 848996 900941 675924 1111530 1283046 945977 1171858 1253712 1190439 1423025 1099058
17078 1099058 1101228 1204540 1144478 1234855 836948 1344958 1184692 1299395 938976 1353689
17068 1353689 1363584 1280664 1086456 1328024 1153854 925705 1066547 1332043 1307051 1280695
17058 1280695 1375320 1190821 1128753 1236397 1075727 1090894 1441305 1187051 1073036 1014968
17048 1014968 1444763 1577596 1264735 1436151 1667993 1416663 1452384 1651606 1538372 1461560
$$ packed form
17118A187452D10082L49084J19781k42455L89254k06201j37081K50156j36187
17109G96433o6375K76028L8164R2938j71256N2496o7727J18K7982l15255K28316
17098H91862J06646j545k9733j62448K76410n20798K70312K18719K9797k30226
17088H48996N1945k25017M35606J71516l37069K25881Q1854o3273K32586l23967
17078A099058K170J03312o0062R0377l97907N08010j60266J14703l60419M14713
17068A353689R895q2920j94208K41568j74170k28149J40842K65496k4992k6356
17058A280695R4625j84499o2068J07644j60670J5167L50411k54254j14015n8068
17048A014968M29795J32833l12861J71416K31842k51330L5721J99222j13234p6812
$$ plain form
17038 1461560 1420637 1745620 1293545 1795740 1474288 1619926 1582293 1361750 1439644 1805599
17028 1805599 1733755 1428145 1198875 1755986 1420514 1670460 1589853 1520284 1549691 1940203
17018 1940203 1658747 1716989 1878168 1687876 1509317 2047693 1668926 1803387 1680716 1791710
17008 1791710 1490527 1766194 1866430 1810729 1801210 1682711 2119813 2022194 1950959 2093465
16998 2093465 1962428 1742178 1572719 1559990 2116713 2127368 2012351 1707466 1904537 1944420
16988 1944420 2079813 1847888 2148759 2137481 2465811 1972119 1968040 2445333 2059905 2077833
16978 2077833 2140989 2289617 2232405 1929030 2438176 2244610 2135183 2306903 2320661 2525552
16968 2525552 2598275 2569411 2280027 2649818 2311084 2182549 2482338 2212346 2489545 2788955
$$ packed form
17038A461560m0923L24983m52075N02195l21452J45638l7633k20543P7894L65955
17028A805599p1844l05610k29270N57111l35472K49946q0607o9569K9407L90512
17018A940203k81456N8242J61179j90292j78559N38376l78767J34461j22671J10994
17008A791710l01183K75667J00236n5701r519j18499M37102r7619p1235J42506
16998B093465j31037k20250j69459j2729N56723J0655j15017l04885J97071L9883
16988A944420J35393k31925L00871j1278L28330m93692m079M77293l85428J7928
16978B077833O3156J48628n7212l03375N09146j93566j09427J71720J3758K04891
16968B525552P2723k8864k89384L69791l38734j28535K99789k69992K77199K99410
$$ plain form
16958 2788955 2772915 2488510 2417666 2648234 3071928 2774823 2472071 2676254 2769158 2772869
16948 2772869 2972509 2570347 2670938 2779217 2590262 3282120 3004436 3004419 2890012 3222764
16938 3222764 2906002 3191736 3103055 3134454 3236307 3099678 3197107 3140805 3410645 3452168
16928 3452168 3447086 3474250 3370584 3263364 3596784 3365440 3589721 3754885 3516910 3767503
16918 3767503 3706894 3742587 3745518 4051747 3866868 3575287 4141211 3733906 4063891 4184339
16908 4184339 4018774 4268986 4243092 4271557 4455502 4527797 4307261 4407159 4556318 4438327
16898 4438327 4757813 4730962 4543183 4702204 4748707 5094603 4954273 4887648 5174469 5352900
16888 5352900 5134439 5255920 5202865 5528483 5301519 5489360 5675268 5607929 5664274 5530311
$$ packed form
16958B788955j6040k84405p0844K30568M23694k97105l02752K04183R2904L711
16948B772869J99640m02162J00591J08279j88955O91858k77684j7j14407L32752
16938C222764l16762K85734q8681L1399J01853j36629R7429n6302K69840M1523
16928C452168n082K7164j03666j07220L33420k31344K24281J65164k37975K50593
16918C767503o0609L5693K931L06229j84879k91581N65924m07305L29985J20448
16908D184339j65565K50212k5894K8465J83945P2295k20536R9898J49159j17991
16898D438327L19486k6851j87779J59021M6503L45896j40330o6625K86821J78431
16888E352900k18461J21481n3055L25618k26964J87841J85908o7339N6345j33963
$$ plain form
16878 5530311 5600569 6037365 6001906 6075190 5738802 6152015 5994151 5994369 6443123 6431433 6406818
16867 6406818 6732453 6933281 6662391 7108084 7303482 7226789 7209093 7163322 7179790 7392327
16857 7392327 8053308 7783510 8022820 7827814 7945089 8106405 8459113 8315654 8664501
16848 8664501 8507802 9121361 8988237 8999916 9246048 9391568 9286038 9527709 9812272 9745898
16838 9745898 10211035 10385678 10407647 10449465 10979127 10682660 10941465 10887097 11246064 11543505
16828 11543505 11402642 11714239 11827477 12452608 12569981 12930306 12990774 13012100 13095443 13482150
16818 13482150 13715245 13918745 14351317 14658750 14786997 14903628 15283122 15279662 15674364 16054280
16808 16054280 16053300 16482233 16869431 17183343 17264836 17492969 18485565 18193358 18672403 18983889
$$ packed form
16878E530311P0258M36796l5459P3284l36388M13213j57864K18M48754j1690k4615
16867F406818L25635K00828k70890M45693J95398p6693j7696m5771J6468K12537
16857G392327O60981k69798K39310j95006J17275J61316L52708j43459L48847
16848H664501j56699O13559j33124J1679K46132J45520j05530K41671K84563o6374
16838I745898M65137J74643K1969M1818N29662k96467K58805n4368L58967K97441
16828A1543505j40863L11597J13238O25131J17373L60325O0468K1326Q3343L86707
16818A3482150K33095K03500M32572L07433J28247J16631L79494l460L94702L79916
16808A6054280r80M28933L87198L13912Q1493K28133R92596k92207M79045L11486
$$ plain form
16798 18983889 19437761 19937777 20183201 20623763 20936472 21560902 21574706 22248589 22383086
16789 22383086 23045985 23889917 24203104 24320521 25039136 25591221 25985067 26603054 27047322
16780 27047322 27634614 28332468 28973604 29379014 30238949 30870342 31178871 31967717 32809508
16771 32809508 33205589 34026659 34572595 35544691 35955984 36455344 37377738 38578798 39010452
16762 39010452 40121701 40786251 42010337 42660081 43783443 44333569 45091710 46340292 47240473
16753 47240473 47819699 49048016 50122107 50955901 51558456 52590940 53794292 54500496 55514868
16744 55514868 56628167 57683048 58469812 59306058 60407241 61304648 61966298 63246592 64027166
16735 64027166 64634637 65895487 66513970 67350270 68181156 68749831 69330003 69911304 70480457
$$ packed form
16798A8983889M53872N00016K45424M40562L12709O24430J3804O73883J34497
16789B2383086O62899Q43932L13187J17417P18615N52085L93846O17987M44268
16780B7047322N87292O97854O41136M05410Q59935O31393L08529P88846Q41791
16771C2809508L96081Q21070N45936R72096M11293M99360R22394J201060M31654
16762C9010452J111249O64550J224086O49744J123362N50126P58141J248582R00181
16753D7240473N79226J228317J074091Q33794O02555J032484J203352P06204J014372
16744E5514868J113299J054881P86764Q36246J101183Q97407O61650J280294P80574
16735F4027166O07471J260850O18483Q36300Q30886N68675N80172N81301N69153
$$ plain form
16726 70480457 70802841 71283912 71635638 72245888 72359991 72590395 72979790 73242773 73021046
16717 73021046 72798655 72929694 72764903 72454755 72634607 72181597 72110876 71841242 70832291
16708 70832291 70616376 69717144 69695946 68690002 68303660 67319673 66843943 65864947 65069075
16699 65069075 64158837 63603859 62730856 61776202 60747918 59693347 59144489 58413350 57127409
16690 57127409 56002682 55171008 54315312 53175296 52487706 51459619 50687595 49493271 48998568
16681 48998568 47834360 47124404 46278449 45255079 44667517 43461433 42595375 41837509 41002378
16672 41002378 39947415 39347908 38542581 38036145 37145024 36451063 35712122 34794420 34240776
16663 34240776 33498963 33261660 32293658 31561594 31125661 30656256 29988880 29275143 29077512
$$ packed form
16726G0480457L22384M81071L51726O10250J14103K30404L89395K62983k21727
16717G3021046k22391J31039j64791l10148J79852m53010p0721k69634j008951
16708G0832291k15915q99232k1198j005944l86342r83987m75730r78996p95872
16699F5069075r10238n54978q73003r54654j028284j054571n48858p31139j285941
16690E7127409j124727q31674q55696j140016o87590j028087p72024j194324m94703
16681D8998568j164208p09956q45955j023370n87562j206084q66058p57866q35131
16672D1002378j054963n99507q05327n06436q91121o93961p38941r17702n53644
16663C4240776p41813k37303r68002p32064m35933m69405o67376p13737j97631
$$ plain form
16654 29077512 28531636 27865908 26889975 26883871 26298702 25586012 25255464 24921869 24223565 23757746
16644 23757746 23290358 22849088 22540078 22100656 21943958 21162178 20894496 20304430 20331429
16635 20331429 20003565 19847646 19215736 18965442 18382799 18083660 17743271 17590743 17456371
16626 17456371 16939225 17120055 16654669 16255842 16130845 15749924 15509740 15115788 15120667 14785150
16616 14785150 14633982 14180648 14148286 13938446 14033596 13772263 13430019 12963733 12881201 13119525
16606 13119525 12422629 12536325 12044724 12348169 11636959 11877282 11537962 11331473 11269072
16597 11269072 11293916 10610154 10548345 10832221 10417610 10241208 10020036 10128440 10008848 9606839
16587 9606839 9504894 9509796 9228537 9270895 9214599 9049037 8851414 8738435 8797433 8547438
$$ packed form
16654B9077512n45876o65728r75933o104n85169p12690l30548l33595o98304m65819
16644B3757746m67388m41270l09010m39422j56698p81780k67682n90066K6999
16635B0331429l27864j55919o31910k50294n82643k99139l40389j52528j34372
16626A7456371n17146J80830m65386l98827j24997l80921k40184l93952M879l35517
16616A4785150j51168m53334l2362k09840R5150k61333l42244m66286q2532K38324
16606A3119525o96896J13696m91601L03445p11210K40323l39320k06489o2401
16597A1269072K4844o83762o1809K83876m14611j76402k21172J08404j19592m02009
16587I606839j01945M902k81259M2358n6296j65562j97623j12979N8998k49995
$$ plain form
16577 8547438 8631519 8664194 8391939 8087594 8235252 7812798 7850979 7921605 7437464 7606579
16567 7606579 7683431 7668063 7422985 7361933 7423667 6889587 6924631 7177880 7082567 6928584
16557 6928584 6830860 6825339 6219967 6406274 6343368 6160728 6712190 6345753 6282262 5917249
16547 5917249 6070233 5754907 6047650 6095432 5776509 5580235 5826677 5749620 5529244 5970978
16537 5970978 5318821 5326563 4975825 5247857 5622111 5350310 5204157 4881799 5080894 4996551
16527 4996551 4819992 5222749 5211304 4893761 5027725 5000254 4476824 4829065 4791437 4241840
16517 4241840 4671659 4501704 4420596 4445938 4277360 4523323 4101909 4522757 3990126 4320679
16507 4320679 4116342 4242911 4090180 4251053 4059489 3944792 4218139 4218405 3628029 3843209
$$ packed form
16577H547438Q4081L2675k72255l04345J47658m22454L8181P0626m84141J69115
16567G606579P6852j5368k45078o1052O1734n34080L5044K53249r5313j53983
16557F928584r7724n521o05372J86307o2906j82640N51462l66437o3491l65013
16547E917249J52984l15326K92743M7782l18923j96274K46442p7057k20376M41734
16537E970978o52157P742l50738K72032L74254k71801j46153l22358J99095q4343
16527D996551j76559M02757j1445l17543J33964k7471n23430L52241l7628n49597
16517D241840M29819j69955q1108K5342j68578K45963m21414M20848n32631L30553
16507D320679k04337J26569j52731J60873j91564j14697K73347K66n90376K15180
$$ plain form
16497 3843209 3724446 3544825 3733306 3877282 3906024 3727783 3509389 3658032 3507308 3512878
16487 3512878 3709321 3473239 3412708 3271923 3395705 3270252 3137457 3313837 3164859 3333642
16477 3333642 3227324 3249773 3014950 2901539 3171365 3017556 3164903 2854842 3187173 3136229
16467 3136229 2902644 2925603 2975273 2610278 2603614 3066404 3046993 2686968 2784598 3162131
16457 3162131 2998639 2715099 2597102 2852791 2674775 2405756 2651210 2812798 2758569 2485346
16447 2485346 2704445 2412870 2503479 2551165 2607109 2432355 2090311 2354552 2234353 2277265
16437 2277265 2598570 2420130 2196011 2320579 2347850 2356074 2197256 2157119 2207734 2208459 2572813
16426 2572813 2087069 2324666 2131678 2306493 2047350 2278938 2005046 2056373 2302141 2226615
$$ packed form
16497C843209j18763j79621J88481J43976K8742j78241k18394J48643j50724N570
16487C512878J96443k36082o0531j40785J23782j25453j32795J76380j48978J68783
16477C333642j06318K2449k34823j13411K69826j53809J47347l10061L32331n0944
16467C136229k33585K2959M9670l64995o664M62790j9411l60025R7630L77533
16457C162131j63492k83540j17997K55689j78016k69019K45454J61588n4229k73223
16447B485346K19099k91575R0609M7686N5944j74754l42044K64241j20199M2912
16437B277265L21305j78440k24119J24568K7271Q224j58818m0137N0615P25L64354
16426B572813m85744K37597j92988J74815k59143K31588k73892N1327K45768p5526
$$ plain form
16416 2226615 2249776 1710860 2007219 1649390 1807491 2061653 1898367 1830671 2053050 2081524
16406 2081524 2118718 1891615 1819605 1845126 1908304 2115313 1726477 1866172 1664110 1855407
16396 1855407 1883303 1860478 1951831 1893027 1990945 1463144 1975888 1878430 1695184 1603517 1517989
16385 1517989 1752055 2128313 1807908 1605447 1440654 1674359 1599052 1724692 1293398 1303157
16375 1303157 1702200 1519284 1817713 1552934 1702358 1402985 1544830 1425890 1413185 1566172
16365 1566172 1130602 1589999 1680746 1418690 1434940 1454248 1404701 1433296 1547304 1396187
16355 1396187 1299205 1339145 1428045 1429086 1231342 1544215 1537141 1565413 1218492 1011178 1260250
16344 1260250 1247569 1348468 1493671 1326992 1172148 1209742 1571259 987466 1337169 1242850
$$ packed form
16416B226615K3161n38916K96359l57829J58101K54162j63286o7696K22379K8474
16406B081524L7194k27103p2010K5521O3178K07009l88836J39695k02062J91297
16396A855407K7896k2825R1353n8804R7918n27801N12744r7458j83246r1667q5528
16385A517989K34066L76258l20405k02461j64793K33705p5307J25640m31294R759
16375A303157L99043j82916K98429k64779J49424k99373J41845j18940j2705J52987
16365A566172m35570M59397R0747k62056J6250J9308m9547K8595J14008j51117
16355A396187r6982L9940Q8900J041j97744L12873p074K8272l46921k07314K49072
16344A260250j2681J00899J45203j66679j54844L7594L61517n83793L49703r4319
$$ plain form
16334 1242850 1043468 1160282 1322761 1116522 1406468 1306276 1030970 1237406 986281
16325 986281 1114583 826092 884534 1103415 1028065 1183516 1226329 1138807 1012545 1145599
16315 1145599 1041755 1217955 1142331 1286557 1224541 1176248 1136013 1337876 1444738 1159827
16305 1159827 1091556 1170652 1139441 847922 1104718 993661 1195738 1105825 834011 890956
16295 890956 799861 780089 1057950 1156352 1254895 1127568 871498 966931 740022 715963 1232031
16284 1232031 1063362 788729 1210394 760334 749502 566057 1132350 883042 948936 701907
16274 701907 848860 780469 567739 1102039 1025948 1125161 724709 801516 1090812 830334
16264 830334 1001173 562809 715968 1209703 724450 1047178 1198725 783309 511678 865766
$$ packed form
16334A242850j99382J16814J62479k06239K89946j00192k75306K06436k51125
16325I86281J28302k88491N8442K18881p5350J55451M2813q7522j26262J33054
16315A145599j03844J76200p5624J44226o2016m8293m0235K01863J06862k84911
16305A159827o8271P9096l1211k91519K56796j11057K02077q9913k71814N6945
16295H90956r1095j9772K77861R8402R8543j27327k56070R5433k26909k4059N16068
16284A232031j68669k74633M21665m50060j0832j83445N66293k49308O5894k47029
16274G01907J46953o8391k12730N34300p6091R9213m00452P6807K89296k60478
16264H30334J70839m38364J53159M93735m85253L22728J51547m15416k71631L54088
$$ plain form
16254 865766 791292 1002619 753062 627461 765234 578248 725524 959279 839338 722415
16244 722415 827430 785802 880023 972233 790651 626407 690461 991551 921674 779670
16234 779670 658140 406734 357699 873088 616508 704388 569272 725505 632252 889279
16224 889279 661008 544906 926019 850004 784655 536908 594399 384792 857611 824057
16214 824057 870090 661232 862448 638927 915788 651555 727365 342109 644538 430835
16204 430835 822603 811507 777175 655873 942332 584676 493089 947045 494058 525819
16194 525819 600836 660135 631087 662554 861398 700365 555137 974605 541463 383330
16184 383330 404243 518171 542996 643021 680240 659028 302312 615515 560273 462578 590494
$$ packed form
16254H65766p4474K11327k49557j25601J37773j86986J47276K33755j19941j16923
16244G22415J05015m1628R4221R2210j81582j64244O4054L01090o9877j42004
16234G79670j21530k51406m9035N15389k56580Q7880j35116J56233r3253K57027
16224H89279k28271j16102L81113p6015o5349k47747N7491k09607M72819l3554
16214H24057M6033k08858K01216k23521K76861k64233P5810C42109L02429k13703
16204D30835L91768j1096l4332j21302K86459l57656r1587M53956m52987L1761
16194E25819P5017N9299k9048L1467J98844j61033j45228M19468m33142j58133
16184C83330K0913J13928K4825J00025L7219k1212C02312L13203n5242r7695J27916
$$ plain form
16173 590494 632110 322786 289701 202867 582600 884327 681758 658777 608280 787323
16163 787323 483280 315877 299858 651148 344660 3982 540774 423870 340539 691667
16153 691667 734474 281678 338094 441644 279339 449843 479300 417916 647723 474331
16143 474331 463368 331405 403979 443705 175288 319426 480048 421063 626234 468651
16133 468651 394980 400027 221113 151987 340940 446852 267178 339787 449838 366315 388398
16122 388398 399657 525965 382026 594383 707150 197179 320310 250836 334203 529283
16112 529283 478613 109097 33730 385527 559694 417734 269137 61680 537143 177730
16101 389288 486191 230423 633973 413231 415337 360520 111074 83820 483215 401329 372021
$$ packed form
16173E90494M1616l09324l3085q6834L79733L01727k02569k2981n0497J79043
16163G87323l04043j67403j6019L51290l06488C982N36792j16904q3331L51128
16153F91667M2807B81678N6416J03550j62305J70504K9457o1384K29807j73392
16143D74331j0963j31963P2574L9726A75288J44138J60622n8985K05171j57583
16133D68651p3671N047j78914o9126J88953J05912j79674P2609J10051q3523K2083
16122C88398J1259J26308j43939K12357J12767A97179J23131o9474Q3367J95080
16112E29283n0670A09097C3730L51797J74167j41960j48597F1680M75463A77730
16101C89288R6903B30423M03550k20742K106n4817A11074k7254L99395q1886k9308
$$ plain form
16090 372021 243785 191259 109932 475946 568879 330859 393368 445322 377757 583858 350749
16079 350749 538306 163031 301641 450162 259614 330724 474295 120417 213512 56307
16068 365805 238048 424193 63958 362552 362712 129293 269614 387037 426308 109231
16057 180869 190018 176041 295628 226834 475310 162153 180093 370789 415735 248845 252172
16046 252172 90801 98162 328448 287046 374145 172871 141072 -5276 60097 579226 254789
16034 235950 266445 376349 411226 560253 224227 88430 -88193 131183 309789 -105083
16023 26715 94358 272678 703205 226068 126582 218951 -64433 767736 102903 281843
16013 281843 215053 58868 250730 108250 19183 506616 317396 -140203 81075 160080
$$ packed form
16090C72021j28236n2526q1327L66014R2933k38020O2509N1954o7565K06101k33109
16079C50749J87557A63031J38610J48521j90548P1110J43571A20417R3095E6307
16068C65805j27757J86145F3958K98594J60A29293J40321J17423L9271A09231
16057A80869R149j3977J19587o8794K48476A62153J7940J90696M4946j66890L327
16046B52172I0801P361K30286m1402Q7099A72871l1799e276F0097N19129B54789
16034B35950L0495J09904L4877J49027B24227H8430h8193A31183J78606a05083
16023B6715O7643J78320M30527B26068r9486R2369f4433G67736A02903J78940
16013B81843o6790E8868J91862A08250A9183M87433j89220a40203H1075P9005
$$ plain form
16003 160080 86243 334640 462486 181809 -29370 109584 -34413 157288 248161 223529
15993 223529 456847 92190 173573 329208 -16860 534258 675751 770719 1031091 699214
15983 699214 703647 481894 357886 466002 292549 101118 225196 227174 272768 75391 235121
15972 235121 51294 441480 -87884 71527 119770 106485 116341 165685 238220 37882 301553
15961 301553 218536 11610 66443 -151341 59751 145660 118470 -269885 179610 48626 261081
15950 261081 274695 279793 235703 27987 349194 -22302 142639 78086 -46050 69579 434216
15939 434216 19782 189181 121215 350334 165786 98779 -27636 39466 -67239 251167 95211
15927 19587 271541 -250638 -10537 370802 341591 -94911 238961 123130 -32283 184911
$$ packed form
16003A60080p3837K48397J27846A81809b9370A09584c4413A57288R0873k4632
15993B23529K33318I2190Q1383J55635a6860E34258J41493R4968K60372l31877
15983F99214M433k21753j24008J08116j73453A01118J24078J978M5594G5391J59730
15972B35121E1294L90186h7884G1527M8243j3285R856M9344P2535C7882K63671
15961C01553q3017A1610N4833a51341E9751Q5909k7190b69885A79610D8626K12455
15950B61081J3614N098m4090B7987L21207b2302A42639o4553d6050F9579L64637
15939D34216A9782J69399o7966K29119A65786o7007b7636C9466f7239B51167I5211
15927A9587K51954b50638a0537C70802k9211i4911B38961j15831c2283A84911
$$ plain form
15916 42116 108441 159698 310597 -83062 392918 79433 26874 352261 493611 -41615 245288
15904 121426 206051 123477 -92441 13077 5004 197475 378186 198777 -17505 160629 245128
15893 245128 136878 440559 190080 59661 138725 -105617 403914 167619 -8404 62954
15882 136969 -149717 -17979 79882 -163309 60485 105592 -2427 266267 64732 -8349 135035
15870 -180222 -210907 -28490 45108 141770 47749 95832 -33453 -73120 66811 287800 -429407
15858 277640 -88350 281220 122116 -88158 52304 168804 155654 -217808 -109248 180765
15847 48667 136003 -149671 248711 126049 240401 55508 -63184 -28710 34137 43257 90494
15836 90494 141258 35831 41659 25471 169058 -8832 35507 250636 60523 214968 186723
$$ packed form
15916D2116O6325N1257J50899h3062C92918G9433B6874L25387J41350d1615B45288
15904A21426Q4625q2574i2441A3077E004J92471J80711j79409a7505A60629Q4499
15893B45128j08250L03681A90080E9661P9064a05617D03914A67619h404F2954
15882A36969a49717a7979G9882a63309F0485M5107b427B66267F4732h349A35035
15870a80222l0685b8490D5108R6662D7749M8083c3453l9667F6811K20989d29407
15858B77640h8350B81220A22116h8158E2304J16500j3150b17808J08560A80765
15847D8667Q7336a49671B48711j22662J14352E5508f3184b8710C4137R120M7237
15836I0494N0764C5831N828j6188J43587h832C5507K15129F0523J54445k8245
$$ plain form
15825 186723 6071 -18619 334854 160348 141602 154690 183490 -16411 190238 -74587 90116
15813 212163 -21837 -93181 252530 72576 79956 -146946 114828 -133696 -23909 -215794 61326
15801 -140511 -93551 182966 -336591 -43395 57366 72577 475672 128426 -313463 -166645
15791 -166645 -103303 -106576 244812 136757 43833 229613 143456 2763 291844 -13375 -46926
15780 -46926 -192740 86525 293916 389640 243443 21365 94492 152800 228822 -128062 107381
15768 49488 116554 9763 -72446 -68474 138971 -164928 11268 -36600 97200 -150649 171871
15756 -137967 105682 537044 -38466 150576 50278 -71656 207981 121502 90200 139038 115365
15745 115365 14005 332779 12519 157104 375327 139736 44713 -86173 -98703 -35131 -182165
$$ packed form
15825A86723F071a8619C34854A60348j8746J3088K8800a6411A90238g4587I0116
15813B12163b1837p1344B52530G2576P380a46946A14828a33696b3909j91885F1326
15801a40511M6960A82966c36591d3395E7366J5211M03095A28426c13463J46818
15791a66645O3342l273B44812j08055D3833J85780q6157B763K89081a3375l3551
15780d6926j45814H6525K07391R5724j46197B1365P3127N8308P6022a28062A07381
15768D9488O7066I763g2446L972A38971a64928A1268c6600I7200a50649A71871
15756a37967A05682M31362c8466A50576E0278g1656B07981q6479l1302M8838k3673
15745A15365A4005L18774A2519J44585K18223A39736D4713h6173j2530c5131j47034
$$ plain form
15734 -182165 157151 382161 125 -121972 15739 35067 306938 34703 -95817 490731 -70408
15722 101535 -141543 -60120 134977 -56719 -30073 272517 216458 50922 -146195 242003
15711 -71035 103688 269653 138144 252101 -172462 127730 -35926 -127387 76491 107561
15701 107561 -29386 -18143 -137127 -55879 -132254 -100690 330268 107286 154667 -130082 292975
15689 -124204 -148503 -70055 -156902 159516 5669 5357 -66990 3320 304340 -159782 -185358 103206
15676 17087 -161318 -79980 103674 57505 168704 205371 133785 -200561 203895 -93958 -15544
15664 157893 -208934 -5298 220951 -237609 218180 108923 191649 55301 61366 -208980 -25583
15652 62324 37727 -33704 249069 -451195 -112088 -32286 -135524 -131797 -91638 -268131 -142266
$$ packed form
15734a82165A57151K25010A25a21972A5739J9328K71871C4703i5817D90731g0408
15722A01535a41543f0120A34977e6719K6646B72517n6059E0922a46195B42003
15711g1035A03688J65965j31509J13957a72462A27730c5926r1461G6491L1070
15701A07561b9386J1243j18984e5879p6375L1564C30268A07286M7381a30082B92975
15689a24204k4299g0055q6847A59516E669l12f6990C320L01020a59782k5576A03206
15676A7087a61318g9980A03674m6169J11199L6667p1586b00561B03895i3958a5544
15664A57893b08934e298B20951b37609B18180A08923Q2726E5301O065b08980b5583
15652F2324k4597c3704B49069d51195a12088c2286j03238L727M0159j76493J25865
$$ plain form
15641 -142266 -174951 347152 -85022 5659 90608 -183037 202023 -35260 -194140 -266795 -54715
15629 -221852 16625 -37943 9769 18612 29773 -58304 46892 -7314 -56035 -155281 51946 66821
15617 66821 -553628 65942 5093 -109623 -166195 -218846 231181 -103111 -85166 87090 -174671
15605 413904 211476 68222 -112230 -426497 -120742 -82077 -292584 -2229 179228 185133 -56381
15593 85475 182975 -153442 171204 -188548 -157842 -44785 -179265 135628 209972 97992 -130143
15581 -164542 -262200 -30234 147850 45932 -256934 117697 262387 113024 310443 -15746
15570 -4550 -103259 28656 159486 16983 -268877 180790 133445 -79931 80561 42050 62360
15559 62360 17120 -37898 257545 157802 5513 49944 208863 291919 357892 -25746 398274
$$ packed form
15641a42266l2685C47152h5022E659Q4949a83037B02023c5260j58880p2655e4715
15629b21852A6625c7943I769Q843J1161e8304D6892g314m8721r9246E1946J4875
15617F6821e53628F5942E093a09623n6572n2651B31181a03111J7945H7090a74671
15605D13904k02428F8222a12230l14267a20742L8665k10507b229A79228N905e6381
15593H5475R7500a53442A71204a88548L0706d4785j34480A35628P4344I7992a30143
15581a64542r7658c0234A47850D5932b56934A17697J44690A13024J97419a5746
15570d550r8709B8656J30830A6983b68877A80790m7345g9931H0561l8511K0310
15559F2360A7120c7898B57545r9743E513M4431J58919Q3056O5973b5746C98274
$$ plain form
15547 346532 52122 236807 195211 86277 175113 479070 179145 36879 197590 41224 97081
15536 97081 -498767 -116102 226043 157363 33991 -10190 4904 187211 -45484 367953 97362
15524 539379 120834 364718 235412 -110163 121392 136891 -115127 292623 210674 61962
15513 -119492 69276 286641 -219201 -185429 114104 60957 -56226 124380 29336 193023
15503 193023 -35915 102142 53785 -98087 191339 -237321 -136696 286794 -265996 217503
15492 -15474 -37048 343779 143670 73634 -167522 123244 127792 45851 142346 34901 392224
15481 392224 90616 156666 -39760 105902 294801 434459 192471 -253479 -208770 -146911
15471 -146911 305748 121036 42273 127106 -61360 119875 121869 -238795 -1841 -6837 -211282
$$ packed form
15547C46532E2122J84685m1596H6277Q8836L03957A79145C6879J60711D1224N5857
15536I7081d98767a16102B26043o8680C3991a0190D904J82307d5484C67953I7362
15524E39379A20834K43884j29306a10163A21392J5499a15127B92623q1949F1962
15513a19492F9276K17365b19201L3772A14104n3147e6226A24380B9336J63687
15503A93023c5915A02142m8357i8087A91339b37321J00625B86794b65996B17503
15492a5474k1574C43779A43670p0036a67522A23244M548D5851R6495C4901L57323
15481C92224I0616O6050c9760A05902J88899J39658A92471b53479M4709O1859
15471a46911C05748A21036D2273Q4833f1360A19875J994b38795a841m996k04445
$$ plain form
15460 -211282 239747 148473 -191408 140702 -136877 -26837 54488 33202 125587 -146929
15449 39561 -111179 196485 91150 262351 268921 210107 104164 52181 -6112 160361 276244
15438 276244 -224306 -24825 -40433 -78568 48444 85210 -44613 54158 -16393 -34150 -59560
15427 -59560 139755 49423 -217172 128407 122580 166691 248628 -179033 162307 -377733 -6764
15415 -482729 91265 43180 55966 -10036 -89753 -63228 46854 106211 263206 356556 218348
15404 218348 8615 -166285 162472 -29419 413579 72762 31048 190901 90587 -88272 95959
15392 21160 -313766 37242 -9365 -238872 -53148 127242 -371240 429664 233128 279981 -388240
15380 -14274 63688 -259818 -22521 22759 227723 168909 108261 -37406 -120751 325637 -197720
$$ packed form
15460b11282B39747r1274a91408A40702a36877b6837E4488k1286R2385a46929
15449C9561a11179A96485I1150J71201O570n8814A04164n1983f112A60361J15883
15438B76244b24306b4825j5608l8135D8444L6766d4613E4158a6393j7757k5410
15427e9560A39755D9423b17172A28407n827M4111Q1937a79033A62307c77733f764
15415d82729I1265D3180J2786a0036p9717K6525D6854N9357J56995R3350j38208
15404B18348H615a66285A62472b9419D13579G2762C1048J59853I0587h8272I5959
15392B1160c13766C7242i365k29507e3148A27242c71240D29664j96536M6853c88240
15380a4274F3688b59818b2521B2759K04964n8814o0648c7406q3345C25637a97720
$$ plain form
15368 9084 66931 226526 222438 321929 -70734 183131 -63458 250084 281720 -23775 332097
15356 308901 49652 51793 128988 152234 -179245 62604 -38787 211308 -281525 546711 -148056
15344 320652 1613 38759 -78057 176200 -147654 -18571 -139506 -3490 56910 -92005 201456
15332 81445 483166 69072 -50472 62928 42932 18661 42389 373649 -56925 340001 -124318
15320 -98605 138713 -81970 239227 114649 104544 -88505 -70756 -107098 96378 160930 -89632
15308 1730 301997 -129701 189085 -7475 125887 69861 104411 34087 21359 185295 -30801
15296 -265430 105745 -263714 126586 78143 139767 139085 283090 35926 -223440 -136513 -37641
15284 -156246 -25612 172346 -123924 -83672 -159693 248844 296079 88389 -96002 254992 -101281
$$ packed form
15368I084N7847J59595m088R9491g0734A83131f3458B50084L1636b3775C32097
15356C08901D9652K141P7195K3246a79245F2604c8787B11308b81525E46711a48056
15344C20652A613L7146g8057A76200a47654a8571j20935c490E6910i2005B01456
15332H1445M01721F9072e0472F2928j9996A8661K3728L31260e6925C40001a24318
15320i8605A38713h1970B39227A14649j0105h8505J7749l6342I6378O4552h9632
15308A730L00267a29701A89085g475A25887n6026L4550C4087j2728J63936c0801
15296b65430A05745b63714A26586m8443O1624o82J44005C5926b23440Q6927c7641
15284a56246b5612A72346a23924M0252p6021B48844M7235H8389i6002B54992a01281
$$ plain form
15272 -98176 106191 -143966 63801 158711 -167344 -124362 401427 204623 165502 -387995
15261 156555 -359080 -64789 472200 173196 47650 -26482 388949 162688 224104 324607
15251 324607 75127 95493 -70900 -142900 268294 185259 -25913 305777 -146733 638358 701937
15240 701937 457804 965779 2237082 4795610 3347610 3174944 4267841 1310587 771447
15231 771447 65671 39201 -12164 278518 184946 -119914 -133093 -39308 -3705 -96135 160024
15219 168087 183478 106550 388616 -329016 317535 -1594 -72305 -286108 47206 -20239 75943
15207 247990 -162719 369215 337126 8401 282549 13964 65381 26143 -114377 131042 222315
15196 222315 -75742 -4479 -270339 230502 332121 224962 37990 223801 -235893 32328
$$ packed form
15272i8176A06191a43966F3801R4910a67344M2982D01427j96804l9121c87995
15261A56555c59080f4789D72200A73196D7650b6482C88949A62688O1416J00503
15251C24607G5127K0366g0900p2000B68294q3035b5913C05777a46733F38358O3579
15240G01937k44133N07975J271303K558528j448000j72666J092897A310587n39140
15231G71447F5671k6470a2164B78518r3572a19914j3179c9308c705r2430A60024
15219A68087J5391p6928K82066c29016C17535a594p0711k13803D7206b0239G5943
15207B47990a62719C69215l2089H401K74148A3964N1417B6143a14377A31042R1273
15196B22315g5742d479k65860B30502J01619j07159C7990J85811b35893C2328
$$ plain form
15185 -139846 7370 -184208 -392113 27242 89960 -301181 -56497 247737 -109441 79691 236539
15174 236539 -202185 147940 43238 -8891 -217516 27887 -263996 247552 -4958 -2190 83911
15162 -87584 44204 -236623 333660 74413 157446 -178733 155439 83763 -359802 -334515 150440
15150 13361 95425 429742 -19628 -236256 310231 -68700 -538 -21596 -2975 -126149 40071
15138 129602 -19269 236077 158345 131416 67072 -97082 307812 41255 159394 353601 -22484
15126 377170 351784 447763 -54868 -64338 -122139 206455 221296 404269 157986 189078 247519
15115 247519 381852 -131724 22157 330459 588113 296747 501381 306190 190841 190108
15105 190108 -16157 3392 458069 301340 -178151 208153 71627 88824 209804 95179 151228
$$ packed form
15185a39846G370a84208k07905B7242O2718c01181e6497B47737a09441G9691J56848
15174B36539b02185A47940D3238h891k08625B7887b63996B47552d958b190H3911
15162h7584D4204b36623C33660G4413Q3033a78733A55439p1676c59802K5287A50440
15150A3361Q2064L34317a9628k16628C10231f8700e38k1058b975j23174D0071
15138A29602a9269B36077p7732k6929o4344i7082C07812D1255J18139J94207b2484
15126C77170k5386R5979e4868r470n7801B06455J4841J82973A57986L1092N8441
15115B47519J34333a31724B2157L08302K57654k91366K04634j95191j15349p33
15105A90108a6157C392M54677j56729a78151B08153G1627J7197J20980I5179N6049
$$ plain form
15094 151228 98887 34528 398632 117636 463926 -10700 -63550 318373 -115283 -47161
15083 164430 260890 247456 -62319 89843 212407 207931 -84789 220782 457914 37766 81223
15072 81223 192025 -1195 -41753 285309 356649 216137 91228 289685 270076 268691 268933 264029
15060 264029 263995 210759 314150 205818 433106 257408 195286 281957 -70853 243661 147005
15049 147005 82997 142521 374088 207778 233570 215747 144702 94017 144655 77024 121418
15038 121418 559187 163946 286267 197746 43830 297525 361715 599813 256532 306278
15028 306278 336756 380901 568492 441428 42816 417046 252642 228328 272128 251159 256848
15017 256848 351635 494456 -129916 445927 24947 73810 266441 322359 509558 460674
$$ packed form
15094A51228n2341C4528L64104A17636L46290a0700n2850C18373a15283d7161
15083A64430R6460j3434f2319H9843J22564m476h4789B20782K37132C7766M3457
15072H1223J10802a195m0558B85309P1340j40512I1228J98457j9609j385K42m904
15060B64029l4n3236J03391j08332K27288j75698o2122Q6671g0853B43661r6656
15049A47005o4008N9524K31567j66310K5792j7823p1045n0685N0638o7631M4394
15038A21418M37769A63946J22321q8521D3830K53695O4190K38098B56532M9746
15028C06278L0478M4145J87591j27064D2816L74230j64404k4314M3800k0969N689
15017B56848R4787J42821a29916D45927B4947M8863J92631N5918J87199m8884
$$ plain form
15007 460674 286444 200184 443467 -77613 31269 338739 19384 124632 287436 149164
14997 149164 380795 507308 328049 133520 -97695 -34082 116752 129456 104149 350207
14987 350207 450691 144928 423599 208145 154514 211629 248476 290026 747763 594688
14977 594688 275786 761176 252032 316214 502693 196294 327826 236648 276053 410808
14967 410808 210462 194269 602276 389081 397546 449901 580126 604702 202247 452437
14957 452437 234021 167220 -52197 7634 494642 204578 725883 295179 180737 94547
14947 94547 584533 273913 77016 -46594 278006 261218 339436 433899 157472 372507 193368
14936 193368 130751 236848 369340 474761 370997 601749 539836 554100 346080 433615
$$ packed form
15007D60674j74230q6260K43283g7613C1269L07470A9384J05248J62804j38272
14997A49164K31631J26513j79259A33520i7695c4082A16752J2704k5307K46058
14987C50207J00484A44928K78671B08145n3631N7115L6847M1550M57737j53075
14977E94688B75786M85390B52032O4182J86479A96294J31532r1178L9405J34755
14967D10808k00346j6193M08007k13195Q465N2355J30225K4576B02247K50190
14957D52437k18416o6801e2197G634M87008B04578N21305B95179j14442q6190
14947I4547M89986B73913G7016d6594B78006j6788P8218R4463A57472K15035j79139
14936A93368o2617J06097J32492J05421j03764K30752o1913J4264k08020Q7535
$$ plain form
14926 433615 572701 407695 548748 859226 1043469 683885 617468 610972 687496 239392
14915 690457 196578 90837 422984 446856 288837 193936 378172 406789 347144 533195
14905 533195 457889 217167 601700 425672 553196 132163 232069 268134 437812 171838
14894 338529 55494 225852 330137 33784 292681 664124 718582 515391 237867 784793
14884 784793 472747 266937 391397 390929 236214 178739 429381 534380 396978 178137
14873 260817 177974 266162 501840 114034 685738 416929 722496 330706 482677 390126
14863 390126 215916 320502 146606 440015 366806 205570 306651 587878 350680 399483
14853 399483 600111 850476 461857 709349 715737 518278 732165 615693 596475 469171
$$ packed form
14926D33615J39086j65006J41053L10478J84243l59584o6417o496P6524B39392
14915F90457A96578I0837L32147K3872j58019r4901J84236K8617n9645J86051
14905E33195p5306B17167L84533j76028J27524A32163R9906L6065J69678A71838
14894C38529E5494J70358J04285C3784K58897L71443N4458k03191B37867N46926
14884G84793l12046k05810J24460m68j54715n7475K50642J04999j37402A78137
14873B60817q2843Q8188K35678A14034N71704k68809L05567C30706J51971r2551
14863C90126j74210J04586A46606K93409p3209j61236J01081K81227k37198M8803
14853C99483K00628K50365l88619K47492O388j97459K13887j16472j9218j27304
$$ plain form
14843 469171 647909 702898 552892 408807 606758 639394 686848 487119 792802 386717
14832 426563 323515 566444 473078 638903 321124 456153 228383 379032 488085 497790
14822 497790 475933 270358 679105 439265 561028 351422 231181 618138 695015 510674
14812 510674 594868 524530 680966 449655 864081 661881 457639 778485 570632 671090
14802 671090 676203 644986 625778 523181 1106525 627830 208403 640970 297847 410469
14792 410469 810902 774658 679835 433266 670379 755631 605115 774495 569767 831000
14782 831000 577471 986127 389290 570653 547347 348769 593765 582466 443334 357714
14772 357714 440438 499456 812166 590455 484518 566197 525621 431405 622738 436170
$$ packed form
14843D69171J78738N4989j50006j44085J97951L2636M7454j99729L05683C86717
14832D26563j03048K42929r3366J65825l17779J35029k27770J50649J09053R705
14822D97790k1857k05575M08747k39840J21763k09606j20241L86957P6877j84341
14812E10674Q4194p0338J56436k31311M14426k02200k04242L20846k07853J00458
14802F71090N113l1217j9208j02597N83344m78695B08403M32567B97847J12622
14792D10469M00433l6244r4823k46569K37113Q5252j50516J69380k04728K61233
14782H31000k53529M08656C89290J81363k3306j98578K44996j1299j39132q5620
14772C57714Q2724N9018L12710k21711j05937Q1679m0576r4216J91333j86568
$$ plain form
14762 436170 571000 582960 344983 746831 370218 901548 885308 849714 842101 749727 416549
14751 416549 680332 471412 518693 625853 546244 717027 539527 467190 834200 693119
14741 693119 597925 647800 813756 672827 740132 831029 957963 720653 1014037 875840
14731 875840 490937 778667 923941 889323 543660 849958 859846 895559 1048939 1116680
14721 1116680 1068472 875177 704433 913315 940274 475467 509351 602832 504726 603792
14711 603792 633676 728423 810827 560049 1011781 668300 834397 660661 984974 1199116
14701 1199116 911574 1103843 796077 1406009 979290 827838 564598 573083 1076605 865834
14691 865834 729054 867903 438830 1137108 1118524 782501 861015 1008380 1057158 875214
$$ packed form
14762D36170J34830J1960k37977M01848C70218N31330j6240l5594p613r2374l33178
14751D16549K63783k08920M7281J07160p9609J70783j77500p2337L67010j41081
14741F93119r5194M9875J65956j40929O7305R0897J26934k37310K93384j38197
14731H75840l84903K87730J45274l4618l45663L06298R888L5713J53380O7741
14721A116680m8208j93295j70744K08882K6959m64807L3884R3481r8106R9066
14711F03792K9884R4747Q2404k50778M51732l43481J66097j73736L24313K14142
14701A199116k87542J92269l07766O09932m26719j51452k63240Q485N03522k10771
14691H65834j36780J38849m29073O98278j8584l36023P8514J47365M8778j81944
$$ plain form
14681 875214 1123779 883265 1003015 796945 695018 703726 1306642 815167 679934 841194
14671 841194 936390 987861 702549 881316 982811 718046 1018104 929724 969233 767221
14661 767221 1024711 821895 934863 1045524 1037828 1139257 726426 559674 1156665 1173336
14651 1173336 962740 1183446 1058129 977403 1107091 1435793 1129289 1107828 1132469 1046389
14641 1046389 1480786 1133134 1144173 1196170 1452681 887519 912259 932352 1430186 1523238
14631 1523238 1126236 965010 1208265 1247774 1221510 1208867 1215461 1281569 1098120 1216379
14621 1216379 1338209 1270958 1453683 1307360 1271395 1529062 1299214 1219978 1286794 1381929
14611 1381929 1120189 1456746 1350326 1550060 1611855 1644257 1416907 1394596 1536300 1649580
$$ packed form
14681H75214K48565k40514J19750k06070j01927Q708O02916m91475j35233J61260
14671H41194R5196N1471k85312J78767J01495k64765L00058q8380L9509k02012
14661G67221K57490k02816J12968J10661p696J01429m12831j66752N96991J6671
14651A173336k10596K20706j25317q0726J29688L28702l06504k1461K4641q6080
14641A046389M34397l47652J1039N1997K56511n65162K4740K0093M97834R3052
14631A523238l97002j61226K43255L9509k6264j2643O594O6108j83449J18259
14621A216379J21830o7251J82725j46323l5965K57667k29848p9236O6816R5135
14611A381929k61740L36557j06420J99734O1795L2402k27350k2311J41704J13280
$$ plain form
14601 1649580 1514088 1491702 1295788 1510756 1357472 1545934 1557629 1410444 1314090 1183658
14591 1183658 1675550 1813301 1308274 1699882 1565285 1516554 1834724 1727908 1686015 1885723
14581 1885723 1792162 1842577 1899877 1986925 1943458 1838751 1966463 1957488 1941508 2003507 2287774
14570 2287774 1923427 2193047 1922419 2241989 2178327 2425686 2128444 2253795 1865921 2109393
14560 2109393 2327016 2399471 2523185 2587776 2890538 3174104 2984724 3699358 3678038 4553232
14550 4553232 5639683 8424160 11984141 19509397 36738834 43174098 16405210 7407079
14541 3703182 2722707 2042300 2191210 2140668 2263208 2343935 2536181 3363092 4189236 6582993
14531 6582993 10608742 4171268 2761745 2250657 2309109 2371250 1861812 2284610 2136118
$$ packed form
14601A649580j35492k2386j95914K14968j53284J88462J1695j47185r6354j30432
14591A183658M91892J37751n05027L91608j34597m8731L18170j06816m1893J99708
14581A885723r3561N0415N7300Q7048m3467j04707J27712q975j5980O1999K84267
14570B287774l64347K69620k70628L19570o3662K47359k97242J25351l87874K43472
14560B109393K17623P2455J23714O4591L02762K83566j89380P14634k1320Q75194
14550D553232J086451K784477L559981P525256J7229437O435264A6405210G407079
14541C703182r80475o80407J48910n0542J22540Q0727J92246Q26911Q26144K393757
14531F582993M025749D171268j409523n11088N8452O2141n09438M22798j48492
$$ plain form
14522 2136118 1796388 2099183 2180006 2176197 2431574 2501679 2062789 2486761 2514458 2276477
14512 2276477 2365086 2298350 2374036 2521831 2461837 2569279 2667542 2803253 2483134 2674820
14502 2674820 2688438 3067785 2857280 2687065 2916896 3302494 2952139 3011418 3214722 3467119
14492 3467119 2804929 3194658 2888252 3262363 3083772 3499579 3295436 3351235 3551066 3117483
14482 3117483 3782638 3178647 3254040 3529783 3634449 3623613 3625364 3665262 3836592 3490105
14472 3490105 3573559 3960767 3989138 4054847 4015617 3936843 3695197 3967011 3760810 4100886
14462 4100886 4256215 4638246 4130541 4471779 4547128 4381543 4151229 4645339 4627021 4504244
14452 4504244 4659756 4862439 4466315 5156636 5138311 4884891 5212512 4889152 5385936 5150528
$$ packed form
14522B136118l39730L02795Q0823l809K55377P0105m38890M23972K7697k37981
14512B276477Q8609o6736P5686J47795n9994J07442R8263J35711l20119J91686
14502B674820J3618L79347k10505j70215K29831L85598l50355N9279K03304K52397
14492C467119o62190L89729l06406L74111j78591M15807k04143N5799J99831m33583
14482C117483O65155o03991P5393K75743J04666j0836J751L9898J71330l46487
14472C490105Q3454L87208K8371O5709l9230p8774k41646K71814k06201L40076
14462D100886J55329L82031n07705L41238P5349j65585k30314M94110j8318j22777
14452D504244J55512K02683l96124O90321j8325k53420L27621l23360M96784k35408
$$ plain form
14442 5150528 5217509 4993539 5222991 5381940 5421533 5487618 5723133 5837678 5805507 6116828
14432 6116828 6130970 5980447 6134461 6201360 6257697 6622666 6748363 6811873 6632147 6827787
14422 6827787 6768349 7010830 7482107 7206884 7142643 7516761 7880405 8054090 7842885 8103488
14412 8103488 7606089 8224225 8297573 8620107 8579742 8768740 8941940 9033876 9073878 9136633
14402 9136633 9466617 9413938 9492583 9936558 9943227 10513283 10340799 10455164 10630507 10938748
14392 10938748 11080915 11523732 11608811 11734293 11898465 12064664 12380372 12398558 12672081 13027508
14382 13027508 12927510 13469094 13276544 14086066 13959358 14273445 14550914 15058283 15246235
14373 15246235 15586768 15984118 16352390 16502455 16714608 17188967 17736780 17942280 18428323
$$ packed form
14442E150528O6981k23970K29452J58949L9593O6085K35515J14545l2171L11321
14432F116828J4142j50523J54014O6899N6337L64969J25697O3510j79726J95640
14422F827787n9438K42481M71277k75223o4241L74118L63644J73685k11205K60603
14412H103488m97399O18136P3348L22534m0365J88998J73200R1936M0002O2755
14402I136633L29984n2679P8645M43975O669N70056j72484J14365J75343L08241
14392A0938748J42167M42817Q5079J25482J64172J66199L15708J8186K73523L55427
14382A3027508r9998N41584j92550Q09522j26708L14087K77469N07369J87952
14373A5246235L40533L97350L68272J50065K12153M74359N47813K05500M86043
$$ plain form
14364 18428323 18827561 18932076 19253307 20069254 20403349 20864239 21431662 21869159 22232246
14355 22232246 22914594 23349851 24225546 24490632 25113498 25869445 26446573 26778127 27526837
14346 27526837 28167622 29196072 29733356 30776936 31292247 31788363 33293378 34475266 35109556
14337 35109556 36122271 37107845 38164080 39157811 40517115 41788332 42979318 44282384
14329 44282384 45701515 47221013 48706492 50209583 52210179 53795301 55443579 57783790
14321 57783790 59806298 61695873 63693582 66213358 68903842 71607813 74496048 77475518
14313 77475518 80655823 84017542 87565116 90912785 95056514 99415454 103784838 108344350
14305 108344350 113355738 118861951 124171151 130221804 136516631 143345874 150202383 157728632
$$ packed form
14364A8428323L99238J04515L21231Q15947L34095M60890N67423M37497L63087
14355B2232246O82348M35257Q75695K65086O22866P55947N77128L31554P48710
14346B7526837O40785J028450N37284J043580N15311M96116J505015J181888O34290
14337C5109556J012715R85574J056235R93731J359304J271217J190986J303066
14329D4282384J419131J519498J485479J503091K000596J585122J648278K340211
14321E7783790K022508J889575J997709K519776K690484K703971K888235K979470
14313G7475518L180305L361719L547574L347669M143729M358940M369384M559512
14305A08344350N011388N506213N309200O050653O294827O829243O856509P526249
$$ plain form
14297 157728632 166006317 174325701 183170311 192553689 202378411 212799442 223747888 234734973
14289 234734973 246812455 259225542 272522478 286138117 300062656 314722599 329281392
14282 329281392 344048275 359017632 373824974 388269877 402104991 415389778 427021019
14275 427021019 437065931 444563462 446231409 446264178 446770427 448225428 449772978 442774639
14267 442774639 437603826 431404266 422205493 410017597 396999740 382436260 367074390
14260 367074390 351097357 335250577 319168919 303669903 288811973 274105581 260313023
14253 260313023 246936811 233910969 222009224 210749226 199888958 189560684 179687809
14246 179687809 170562615 161729994 154441931 146472637 141088332 138209796 130459399 123753304
$$ packed form
14297A57728632Q277685Q319384Q844610R383378R824722J0421031J0948446J0987085
14289B34734973J2077482J2413087J3296936J3615639J3924539J4659943J4558793
14282C29281392J4766883J4969357J4807342J4444903J3835114J3284787J1631241
14275D27021019J0044912P497531J667947L2769N06249J455001J547550o998339
14267D42774639n170813o199560r198773j2187896j3017857j4563480j5361870
14260C67074390j5977033j5846780j6081658j5499016j4857930j4706392j3792558
14253B60313023j3376212j3025842j1901745j1259998j0860268j0328274r872875
14246A79687809r125194q832621p288063p969294n384305k878536p750397o706095
$$ plain form
14238 123753304 117969449 112822759 107731802 103022997 98740720 94540910 90644753 87383187
14230 87383187 83994891 80532770 77146751 74370989 71721603 68743370 66191804 63841869
14222 63841869 61287119 59499271 57807463 55735651 53857508 51776261 50437996 48653776
14214 48653776 47462891 45973788 44466008 43181021 41453303 40489296 39264446 38744356
14206 38744356 37769734 36227567 35060780 34373043 33516894 32932850 31791192 30639311 29844068
14197 29844068 29041415 28609050 27574775 27282300 26726004 25845018 25014137 24228168 23933186
14188 23933186 23258067 22879026 22792080 21881386 21169497 20847057 20698745 19904993 19449065
14179 19449065 18871013 18892178 18274819 18073350 17369880 17290147 17089138 16652191 16223138 15959128
$$ packed form
14238A23753304n783855n146690n090957m708805m282277m199810l896157l261566
14230H7383187l388296l462121l386019k775762k649386k978233k551566k349935
14222F3841869k554750j787848j691808k071812j878143k081247j338265j784220
14214D8653776j190885j489103j507780j284987j727718r64007j224850n20090
14206C8744356r74622j542167j166787o87737q56149n84044j141658j151881p95243
14197B9844068q02653m32365j034275k92475n56296q80986q30881p85969k94982
14188B3933186o75119l79041q6946r10694p11889l22440j48312p93752m55928
14179A9449065n78052K1165o17359k01469p03470p9733k01009m36947m29053k64010
$$ plain form
14169 15959128 15675233 15213805 15178690 15073399 14652669 14372143 13807006 13874404 13665802 13471827
14159 13471827 13387462 12981424 12491771 12401073 12702508 11903229 12011721 11732795 11283851 11164645
14149 11164645 10950412 10758148 10605452 10709874 10450244 10333029 9930850 9903396 9804295 9718447
14139 9718447 9460027 9351366 9240040 9091953 9110417 9094804 8764303 8068876 8419647 7948676
14129 7948676 8279320 7983289 8092950 7786499 7811031 7783197 7760073 7514642 7694125 7192309
14119 7192309 7059564 7343721 7323197 6726453 6898956 6748839 6691468 6703727 6271519 6797986
14109 6797986 6040134 6337869 6636152 6458663 6172169 6048500 5928619 5913056 5837302 5928866
14099 5928866 5719174 5333399 5775985 5398913 5455654 5283250 5131843 5408187 5478487 5421519
$$ packed form
14169A5959128k83895m61428l5115j05291m20730k80526n65137O7398k08602j93975
14159A3471827q4365m06038m89653r0698L01435p99279J08492k78926m48944j19206
14149A1164645k14233j92264j52696J04422k59630j17215m02179k7454r9101q5848
14139I718447k58420j08661j11326j48087J8464j5613l30501o95427L50771m70971
14129G948676L30644k96031J09661l06451K4532k7834k3124k45431J79483n01816
14119G192309j32745K84157k0524n96744J72503j50117n7371J2259m32208N26467
14109F797986p57852K97735K98283j77489k86494j23669j19881j5563p5754R1564
14099E928866k09692l85775M42586l77072N6741j72404j51407K76344P0300n6968
$$ plain form
14089 5421519 5117261 5054488 4832545 4735266 4999368 4841170 4904141 4628819 4627305 4543844
14079 4543844 4507390 4522865 4651630 4215944 4392047 4191319 4082941 4076637 4213783 4116733
14069 4116733 3763699 4093748 4111362 4165591 3974108 3945081 4100368 3500915 3699135 3738263
14059 3738263 3627937 3483205 3504409 3511315 3618617 3386224 3602798 3501313 3152286 3345659
14049 3345659 3443252 3483756 3327352 2925403 3093334 3226026 3071744 3405108 2800785 2900385
14039 2900385 2780056 3215899 3093034 2971592 2924861 3079641 2966138 2915410 3212401 3079384
14029 3079384 2858421 3061445 3135112 2705667 2680610 2799653 2378880 2683842 2376762 2571099
14019 2571099 2335908 2310249 2642022 2466612 2287513 2231475 2428487 2572267 2241551 2467587
$$ packed form
14089E421519l04258o2773k21943r7279K64102j58198O2971k75322j514q3461
14079D543844l6454J5475J28765m35686J76103k00728j08378o304J37146r7050
14069D116733l53034L30049J7614N4229j91483k9027J55287n99453J98220L9128
14059C738263j10326j44732K1204O906J07302k32393K16574j01485l49027J93373
14049C345659R7593M0504j56404m01949J67931J32692j54282L33364o04323R9600
14039B900385j20329M35843j22865j21442m6731J54780j13503n0728K96991j33017
14029C079384k20963K03024P3667m29445k5057J19043m20773L04962l07080J94337
14019B571099k35191k5659L31773j75410j79099n6038J97012J43780l30716K26036
$$ plain form
14009 2467587 2401641 2231633 2337850 2224698 2090505 2134912 2128141 2133811 1655163 2072072
13999 2072072 2246572 1880856 2529915 2340108 1886420 1966204 2270969 2102435 2166447 2460002
13989 2460002 3403008 6327085 10996917 23029640 48169349 28673861 14134203 8145883
13981 8145883 5642745 4281857 4004767 3252702 2882812 2913177 2954420 2628448 2723080 2451973
13971 2451973 2257490 2633433 2488293 2421694 2107344 2132287 2449194 1799775 1912160 2207244
13961 2207244 1865413 1987778 1927661 2001493 1632317 2234857 1901328 2029792 1858749 2053898
13951 2053898 1820824 1985378 2041083 1778781 1820544 1851442 1756968 1803240 1520788 1559074
13941 1559074 1324014 1717829 1859550 1681202 1418962 1448670 1709061 1496592 1464035 1843623
$$ packed form
14009B467587o5946j70008J06217j13152j34193M4407o771N670m78648M16909
13999B072072J74500l65716O49059j89807m53688P9784L04765j68534O4012K93555
13989B460002R43006K924077M669832J2032723K5139709j9495488A4134203n988320
13981H145883k503138j360888k77090p52065l69890L0365M1243l25972R4632k71107
13971B451973j94483L75943j45140o6599l14350K4943L16907o49419J12385K95084
13961B207244l41831J22365o0117P3832l69176O02540l33529J28464j71043J95149
13951B053898k33074J64554N5705k62302M1763L0898r4474M6272k82452L8286
13941A559074k35060L93815J41721j78348k62240K9708K60391k12469l2557L79588
$$ plain form
13931 1843623 1711643 1375807 1224405 1507260 1852150 1478862 1523014 1423566 1579639 1402019
13921 1402019 1504407 1426339 1661853 1520597 1393721 1438461 1382240 1389608 1285917 1337203
13911 1337203 1281327 1186616 1376324 1394281 1314672 1460511 1170346 1449544 1355034 1421906
13901 1421906 1323643 1067290 1359694 1346232 1329804 1194450 1292049 1371423 1140828 1160247
13891 1160247 1156885 1356500 1203323 1139723 1314789 1201681 1187835 1148111 987118 1368265
13881 1368265 1293439 1065914 1114925 1108848 942423 1175766 1033526 1180154 1025524 970517
13871 970517 1149448 983801 1108001 993085 1381719 1176638 950820 1083174 783626 1030913
13861 1030913 905200 1104602 969749 732880 1341834 1115955 1347706 929223 899571 910820
$$ packed form
13931A843623j31980l35836j51402K82855L44890l73288M4152r9448J56073j77620
13921A402019J02388p8068K35514j41256j26876M4740n6221P368j03691N1286
13911A337203n5876r4711J89708J7957p9609J45839k90165K79198r4510O6872
13901A421906r8263k56353K92404j3462j6428j35354R7599P9374k30595J9419
13891A160247l362J99615j53177o3600J75066j13108j3846l9724j60993L81147
13881A368265p4826k27525M9011o077j66425K33343j42240J46628j54630n5007
13871I70517J78931j65647J24200j14916L88634k05081k25818J32354k99548K47287
13861A030913j25713J99402j34853k36869O08954k25879K31751m18483k9652J1249
$$ plain form
13851 910820 1220276 977953 653914 703008 1025704 884460 868788 841245 966705 794237
13841 794237 676544 983516 1027642 751641 918885 932056 629407 862641 906394 1050448
13831 1050448 891796 792394 999746 1245562 719974 1039608 668623 926808 869889 628174
13821 628174 1026777 1300558 876069 668427 673652 807981 663320 988589 950447 919745
13811 919745 856109 976304 851104 563663 735920 768423 1052999 1034387 887825 720691
13801 720691 579540 832614 801476 783144 886942 526393 775167 504876 635625 583377
13791 583377 876143 612291 900713 875634 705896 981971 862327 632520 640642 783096
13781 783096 931398 1039050 874277 1114885 574862 485293 635788 772360 567241 630314
$$ packed form
13851I10820L09456k42323l24039M9094L22696j41244j5672k7543J25460j72468
13841G94237j17693L06972M4126k76001J67244J3171l02649K33234M3753J44054
13831A050448j58652r9402K07352K45816n25588L19634l70985K58185n6919k41715
13821F28174L98603K73781m24489k07642N225J34329j44661L25269l8142l0702
13811I19745o3636J20195j25200k87441J72257L2503K84576j8612j46562j67134
13801G20691j41151K53074l1138j8332J03798l60549K48774k70291J30749n2248
13791E83377K92766k63852K88422k5079j69738K76075j19644k29807Q122J42454
13781G83096J48302J07652j64773K40608n40023q9569J50495J36572k05119O3073
$$ plain form
13771 630314 554276 567333 689244 516231 449446 745158 768189 563334 599738 752670
13761 752670 448842 1020053 580169 1124333 356025 611983 799898 786202 620090 449495
13751 449495 807103 884956 276080 475036 502202 492206 562637 384918 656748 461161
13741 461161 685400 689584 532314 472366 561326 776450 659492 763060 724362 552583
13731 552583 392139 385676 792385 611377 878088 953716 490574 549809 610425 505940
13721 505940 1005442 613543 635682 576715 532154 679796 648066 314988 297112 316365 329095
13710 329095 482639 557271 625581 466083 620286 854099 388593 669971 488671 444715
13700 444715 617392 240818 360114 302156 769042 245359 478528 740095 723968 845655
$$ packed form
13771F30314p6038J3057J21911j73013o6785K95712K3031k04855L6404J52932
13761G52670l03828N71211m39884N44164C56025K55958J87915j3696j66112j70595
13751D49495L57608P7853B76080J98956K7166r996P0431j77719K71830j95587
13741D61161K24239M184j57270n9948Q8960K15124j16958J03568l8698j71779
13731E52583j60444o463M06709j81008K66711P5628m63142N9235O0616j04485
13721E05940M99502l91899K2139n8967m4561J47642l1730C14988j7876J9253J2730
13710C29095J53544P4632O8310j59498J54203K33813C88593K81378j81300m3956
13700D44715J72677B40818J19296n7958M66886B45359K33169K61567j6127J21687
$$ plain form
13690 845655 566571 415285 495146 1054502 599829 209419 565448 352922 581473 393348
13680 393348 631603 152867 184447 640569 439866 784121 187975 713282 401429 526031
13670 526031 506802 489501 274573 460135 369011 525676 526998 119349 257981 184054 433090
13659 433090 249029 95090 436101 195245 452852 204459 242784 736418 513066 419605
13649 419605 342019 319018 391323 133685 324534 479869 150284 576443 287974 536533
13639 536533 501118 329576 432882 349628 382706 431638 636867 461801 472987 409375 486486
13628 486486 314125 524666 496628 345264 370036 641326 184319 423251 408462 444656
13618 444656 210818 519637 626159 464310 362245 245044 438132 74284 272356 144683
$$ packed form
13690H45655k79084j51286P9861N59356m54673B09419L56029k12526K28551j88125
13680C93348K38255A52867L1580M56122k00703L44255A87975N25307l11853J24602
13670E26031j9229j7301k14928J85562r1124J56665J322A19349J38632p3927K49036
13659D33090j84061I5090L41011A95245K57607B04459L8325M93634k23352r3461
13649D19605p7586k3001P2305A33685J90849J55335A50284M26159B87974K48559
13639E36533l5415j71542J03306q3254L3078M8932K05229j75066J1186o3612P7111
13628D86486j72361K10541k8038j51364K4772K71290A84319K38932j4789L6194
13618D44656B10818L08819J06522j61849j02065j17201J93088G4284J98072j27673
$$ plain form
13608 144683 255897 374294 444521 636554 403955 81511 160252 -45046 158981 436467
13598 436467 180798 369404 494529 536198 268831 294370 394946 13262 196457 192633
13588 192633 297813 620608 465622 351588 343226 271923 -36000 77586 504374 86462 277190
13577 277190 512245 326529 376382 331636 232971 195961 563328 432692 249387 339640
13567 339640 222905 271234 298203 462254 28238 326878 232116 349860 263047 708306
13557 708306 307305 439899 -92054 204908 348615 248009 301447 259102 271274 296247
13547 296247 366592 139860 211159 222595 411642 366801 549755 202428 169338 264888 134296
13536 134296 191760 240659 257136 -125021 4273 380742 387978 245214 738705 194063 391796
$$ packed form
13608A44683J11214J18397P0227J92033k32599H1511P8741d5046A58981K77486
13598D36467A80798J88606J25125M1669k67367K5539J00576A3262J83195l824
13588A92633J05180L22795j54986j14034q362p1303c6000G7586M26788H6462J90728
13577B77190K35055j85716M9853m4746r8665l7010L67367j30636j83305R0253
13567C39640j16735M8329K6969J64051B8238K98640r4762J17744q6813M45259
13557G08306C07305J32594i2054B04908J43707j00606N3438m2345J2172K4973
13547B96247P0345A39860P1299J1436J89047m4841J82954B02428l3090R5550j30592
13536A34296N7464M8899J6477a25021D273L76469P236j42764M93491A94063J97733
$$ plain form
13525 391796 462742 -48479 235086 285119 357518 363215 212480 226630 261708 117564 335614
13514 335614 325933 174362 134060 55019 384972 248183 297074 168745 -53912 200096 -115469
13502 184011 203649 -35466 -33002 -103440 260989 126945 110775 187527 339986 210747 443696
13491 443696 310616 265227 140867 192654 77299 297877 304017 29516 880246 102677 254067
13480 254067 459474 274164 176795 -9111 325178 96621 202750 132316 294433 244821 222900
13469 222900 338537 141000 159641 468768 207535 180731 82118 -24342 420208 404990
13459 404990 -71180 39250 297725 -16860 437708 98816 122095 304494 -6390 6746 251711
13448 251711 58787 -110911 440901 -160776 414012 508483 79632 13400 642018 223383
$$ packed form
13525C91796P0946d8479B35086N0033P2399N697j50735J4150L5078A17564K18050
13514C35614r681j51571m0302E5019L29953j36789M8891j28329e3912B00096a15469
13502A84011J9638c5466K464p0438B60989A26945j6170P6752J52459j29239K32949
13491D43696j33080m5389j24360N1787G7299K20578O140B9516Q50730A02677J51390
13480B54067K05407j85310r7369i111C25178I6621J06129p0434J62117m9612k1921
13469B22900J15637A41000J8641L09127B07535k6804H2118b4342D20208j5218
13459D04990g1180C9250K58475a6860D37708I8816K3279J82399f390F746K44965
13448B51711E8787a10911D40901a60776D14012R4471G9632A3400O28618B23383
$$ plain form
13437 3671 254729 322897 312718 422855 144412 349588 296707 146159 53309 307489 229990
13426 229990 186315 -38064 230434 108155 42948 9721 141988 25976 370013 42046 182685
13415 182685 399134 298789 48244 375898 -150669 329196 295538 182110 28841 215144
13405 215144 86742 65325 177925 256955 387325 345569 110132 151882 83996 -12138 245079
13393 138345 -8028 443314 175860 45628 280541 -36902 -80685 91658 128416 286544 254208
13382 254208 48617 205608 168478 350674 -153262 203572 25991 26844 54076 413739 147819
13370 -21838 282921 -81990 163352 202238 -193734 375797 -153653 405722 307655 231852
13360 231852 588810 502257 -152891 93462 285163 613181 54466 185543 288305 142867
$$ packed form
13437C671K51058O8168j0179J10137A44412K05176n2881A46159E3309K54180p7499
13426B29990m3675c8064B30434A08155D2948I721J32267B5976L44037D2046J40639
13415A82685K16449j00345D8244L27654a50669C29196l3658j13428B8841J86303
13405B15144H6742k1417J12600P9030J30370m1756A10132M1750o7886a2138B45079
13393A38345h028D43314A75860D5628K34913c6902m3783I1658L6758J58128l2336
13382B54208D8617J56991l7130J82196a53262B03572B5991Q53K7232L59663A47819
13370b1838B82921h1990A63352L8886a93734C75797a53653D05722r8067p5803
13360B31852L56958q6553a52891I3462J91701L28018E4466J31077J02762A42867
$$ plain form
13349 -7419 382227 466228 219442 198729 72548 181557 181427 36942 677927 673122 132057
13337 374294 40464 114331 166329 382638 124042 354319 364226 285798 720572 235151 29346
13325 449764 60264 278199 83994 297095 73886 84330 32538 131377 67541 116305 104096
13314 104096 192914 289661 251060 -71724 107 200235 372695 319654 106257 -148396 110598
13302 202037 -56764 198554 85478 261731 107627 91406 18285 108242 -47421 93483 -21259
13290 -39238 -2119 311457 426375 41190 -49093 35966 280734 14533 158037 164317 212938
13279 212938 215004 224075 324093 14570 -38948 251520 226850 259711 175615 775 -4433 -216179
13267 -216179 -76385 -261237 426371 303582 -28443 62501 194899 196439 -26647 -323945 -232308
$$ packed form
13349g419C82227Q4001B19442k0713G2548J09009j30C6942O40985m805A32057
13337C74294D0464P3867N1998K16309A24042K30277R907p8428M34774B35151B9346
13325D49764F0264K17935H3994K13101G3886J0444C2538R8839o3836M8764j2209
13314A04096Q8818R6747l8601g1724A07K00128J72460n3041A06257a48396A10598
13302B02037e6764A98554H5478J76253A07627j6221A8285Q9957d7421I3483b1259
13290c9238b119C11457J14918D1190d9093C5966K44768A4533J43504O280M8621
13279B12938K066R071J00018A4570c8948B51520k4670L2861q4096G75d433k11746
13267b16179g6385j84852D26371j22789b8443F2501J32398J540b6647k97298R1637
$$ plain form
13256 -232308 464188 64825 12160 453446 183440 -17266 52720 222364 -163516 230972
13245 172469 -203405 -67744 227694 27811 -354195 -123346 250157 -44923 163431 34969
13234 -41452 159527 48278 -261371 419856 347142 11225 257075 224011 -125757 -70059 73235
13222 -38638 60997 110186 167229 249690 5563 91816 -77186 58866 123913 79033 224295 220898
13210 220898 -162546 -108062 442294 -63530 141355 49822 285514 292870 20428 202880 50962
13198 -33572 158987 214667 22122 33677 212742 37684 421504 121518 182245 150491 -119883
13186 180252 -60658 -177263 43370 255347 -104323 4477 58963 65348 353738 -8964 218913
13174 154617 321646 223550 32563 100747 -25926 -35968 69333 -198424 -5342 -197229 287156
$$ packed form
13256b32308D64188F4825A2160M41286A83440a7266E2720J69644a63516B30972
13245A72469b03405f7744B27694B7811c54195a23346B50157d4923A63431C4969
13234d1452A59527D8278b61371D19856p2714A1225K45850l3064a25757N5698G3235
13222c8638F0997M9189N7043Q2461E563Q6253g7186E8866O5047m4880J45262l397
13210B20898a62546N4484D42294f3530A41355D9822K35692P356B0428J82452E0962
13198c3572A58987N5680B2122J1555J79065C7684L83820A21518O0727l1754a19883
13186A80252f0658j16605D3370K11977a04323D477N4486O385K88390h964B18913
13174A54617J67029r8096C2563O8184b5926j0042F9333a98424e342j91887B87156
$$ plain form
13162 -8514 40126 342347 -23462 73781 193560 -223767 276914 345211 70803 -101964 317684
13150 46015 133637 -16705 -45015 419819 67311 87767 45635 -2117 10047 -249451 -176003
13139 -176003 -39357 -163841 115824 181063 245102 -283325 -84456 -116392 182240 257611 623182
13128 623182 58135 4858 165609 175594 341726 269928 -41815 67486 344309 43949 80010
13117 80010 136322 194374 273491 226735 164561 80097 126450 44150 64534 76577 135160 96832
13105 96832 -26441 102310 -137415 292469 205938 117562 274079 79859 63369 -150237 -2585
13093 -182358 -76338 90390 -148105 -144626 71938 267499 -90906 -206065 123698 -90273 109810
13081 -87588 189599 55513 -10523 -43193 379657 257004 -333504 162522 142211 -134109
$$ packed form
13162h514D0126L02221b3462G3781J19779b23767B76914O8297G0803a01964C17684
13150D6015Q7622a6705k8310D19819F7311K0456m2132b117A0047b49451P3448
13139a76003c9357j24484A15824O5239O4039b83325h4456l1936A82240P5371L65571
13128F23182E8135D858J60751R985J66132p1798d1815F7486K76823D3949L6061
13117H0010N6312N8052P9117m6756o2174H0097M6353D4150K0384J2043N8583l8328
13105I6832b6441A02310a37415B92469q6531q8376J56517G9859j6490a50237b585
13093a82358g6338I0390a48105L479G1938J95561i0906j15159A23698i0273A09810
13081h7588A89599E5513a0523l2670C79657j22653c33504A62522k0311a34109
$$ plain form
13070 -242651 4535 -193283 -62747 -51867 -157921 -178688 75638 42279 177135 270068 -260192
13058 80490 -12317 221791 176409 203281 270397 314546 -197283 -6283 103449 -122999 314084
13046 88906 -2194 70510 1338 -135208 -37068 133877 -84128 158678 1751 -91210 -47083 142048
13033 -171169 -20203 91765 434121 110361 -127676 -65124 69797 302545 -112320 -228512
13023 -228512 47884 90021 -32221 -131865 -73256 161042 -40609 229150 9969 262324 220361
13012 220361 -9647 -118899 -317706 -197890 10844 76496 274352 28145 -251321 84966 -18691
13000 45531 -53934 -48411 -21718 -128641 -25990 255203 -251254 12554 156413 253506 -235174
12988 40342 66040 226171 275227 -330141 118765 202097 270443 -103702 403137 130745
$$ packed form
13070b42651D535a93283f2747J0880j06054k0767G5638l3359J34856R2933b60192
13058H0490a2317B21791m5382K6872O7116M4149a97283f283A03449a22999C14084
13046H8906b194G0510A338a35208c7068A33877h4128A58678A751i1210M4127A42048
13033a71169b0203I1765L42356A10361a27676O2552F9797K32748a12320j16192
13023b28512D7884M2137c2221r9644N8609A61042d0609B29150I969K52355m1963
13012B20361i647j09252j98807J19816A0844O5652J97856B8145b51321H4966a8691
13000D5531e3934N523b1718j06923b5990B55203b51254A2554J43859R7093b35174
12988D0342K5698J60131M9056c30141A18765Q3332O8346a03702D03137A30745
$$ plain form
12977 -279317 76421 -39249 94806 102283 -134160 -157408 -303889 5036 -64276 354073 -74996
12965 175661 358428 12289 80613 -74868 3067 -37186 -8492 -19304 121116 -373691 -127995
12953 293009 -144649 206364 150410 -237946 -21061 -129258 -151456 170476 -86507 312512
12942 -65768 53629 -206584 112071 240571 -1682 168461 -51668 -214191 -28318 5438 -50361
12930 113772 113850 -264239 -8604 328564 258067 192751 18704 16285 -73233 166041 102369 296939
12918 296939 189187 78916 339248 -63665 40430 185476 55335 106512 69276 -27323 -251823
12907 -251823 161461 39425 -171564 -49551 138430 -293340 289393 13681 -200268 51214
12896 -267761 146046 164217 -103905 -193673 72176 172699 86958 95545 143490 208652 149871
$$ packed form
12977b79317G6421c9249I4806P477a34160k3248j46481E036f4276C54073g4996
12965A75661J82767A2289O8324g4868C067c7186h492j0812A21116c73691a27995
12953B93009a44649B06364n5954b37946b1061j08197k2198A70476h6507C12512
12942f5768E3629b06584A12071J28500a682A68461e1668j62523b8318E438e0361
12930A13772P8b64239h604C28564p0497o5316A8704k419g3233A66041o3672J94570
12918B96939j07752G8916K60332f3665D0430J45046E5335N1177l7236b7323k24500
12907b51823A61461C9425a71564d9551A38430b93340B89393A3681b00268E1214
12896b67761A46046J8171a03905q9768G2176J00523q5741Q587M7945O5162n8781
$$ plain form
12885 149871 22984 182867 -70268 140599 48700 -56240 76283 -155907 -21722 6981 -6078
12873 139233 334268 9647 -76160 166649 -2933 -121646 -87027 143027 296062 -18714 208397
12861 154822 -19341 16873 120156 -13879 171360 -71495 -150504 -84098 -192245 62720 -164610
12849 -13733 50531 -155647 -141509 147347 30471 -159070 80277 -70616 9670 237376 20153
12837 -60540 -217837 183685 -44196 -311604 -217892 111905 -94647 48300 -44366 -98495 94265
12825 -21024 -84639 269564 72855 -220742 30634 -37149 319389 -137184 -186420 188078 -220674
12813 -134119 -74590 -16768 -159499 -57063 -82796 65554 20393 251763 -352206 116760 279074
12802 279074 48273 56292 82463 26010 170216 -10660 -14721 3146 228829 149027 -23341 245835
$$ packed form
12885A49871B2984J59883g0268A40599D8700e6240G6283a55907b1722F981f078
12873A39233J95035I647g6160A66649b933j18713L4619A43027J53035a8714B08397
12861A54822a9341A6873J03283a3879A71360g1495p9009O6406j08147F2720a64610
12849a3733E0531a55647J4138A47347C0471a59070H0277g0616I670K27706B0153
12837f0540j57297A83685d4196k67408R3712A11905i4647D8300d4366n4129I4265
12825b1024o3615B69564G2855b20742C0634c7149C19389a37184m9236A88078b20674
12813a34119N9529a6768j42731e7063k5733F5554B0393K31370c52206A16760J62314
12802B79074D8273Q019K6171B6010J44206a0660m061C146K25683p9802b3341B45835
$$ plain form
12789 54064 -37189 -73603 -82984 -3522 -53468 -43693 -213798 -169022 -33107 -217303 31177 -110933
12776 -127523 -234936 -291584 -139499 20314 -228965 -100262 -251017 36372 111241 129958
12766 129958 -167817 162274 -105619 54438 49995 151183 236671 343205 -48748 194613
12755 253656 -45667 -15203 52828 292173 -197132 21924 -152058 -111370 127127 -67308 6157
12743 -48760 -247239 -132329 204486 234367 -75071 28556 43647 103931 -146188 27190 117658
12732 117658 70227 -34298 -132573 83679 120900 -13833 20719 3696 -42902 88193 -152301
12720 144556 -105527 -36177 -48463 -101669 -29854 15115 113117 11267 -66334 24531 61944
12709 61944 199254 -158753 -32288 124454 145234 13363 203757 267931 -25880 210489 -158503
$$ packed form
12789E4064c7189l6414r381c522m9946R775j70105M4776c3107j84196C1177a10933
12776a27523j07413n6648a39499B0314b28965a00262j50755C6372P4869J8717
12766A29958a67817A62274a05619E4438m443J01188Q5488J06534d8748A94613
12755B53656d5667a5203E2828K39345a97132B1924a52058M0688A27127f7308F157
12743d8760j98479J14910B04486K9881g5071B8556J5091O0284a46188B7190R0468
12732A17658m7431c4298r8275H3679L7221a3833B0719C696d2902H8193a52301
12720A44556a05527c6177j2286n3206b9854A5115R8002A1267f6334B4531L7413
12709F1944J37310a58753c2288A24454K0780A3363J90394O4174b5880B10489a58503
$$ plain form
12697 -61334 144332 -99831 2761 390428 -190038 23595 30198 -50997 -119810 -213323 -212994 102293
12684 -21446 357351 140551 254769 -345377 -187235 68007 218678 4196 -154503 -435734
12674 -435734 97192 -301257 -227415 -4066 -179884 -23568 -8871 -60500 270744 52510 -48090
12662 22439 -12641 220761 -348428 19000 334 189633 -62252 -3854 122406 410801 -49281
12650 164997 263337 257389 -198702 195453 -135400 37625 -226511 152637 -232123 110322
12639 -129020 -104370 -297150 12590 288747 124548 -206090 184975 70133 1920 290902
12629 290902 -45123 -242463 -20628 -16027 374159 83260 78626 -150486 -42861 122141 128191
12618 128191 126670 211518 7861 363953 -30231 -261727 206179 -212040 -220475 -166484 -16524
$$ packed form
12697f1334A44332i9831B761L87667a90038B3595O603e0997o8813r3513L29A02293
12684b1446C57351A40551J14218c45377J58142F8007J50671D196a54503k81231
12674d35734I7192c01257P3842d066j75818b3568h871n1629B70744E2510d8090
12662B2439a2641B20761c48428A9000C34J89299f2252c854A22406K88395d9281
12650A64997R8340n948a98702A95453a35400C7625b26511A52637b32123A10322
12639a29020K4650j92780A2590K76157A24548b06090A84975G0133A920K88982
12629B90902d5123j97340b0628M601C74159H3260m634a50486d2861A22141O050
12618A28191j521Q4848G861L56092c0231k31496B06179b12040q435N3991a6524
$$ plain form
12606 67827 59302 -276729 132352 -129284 -314546 161940 123965 -183696 184353 105305
12596 105305 453 -93419 27139 -91489 -285234 -59577 159119 14231 336239 34395 170536
12585 170536 -58429 165410 -198054 -27175 -190807 -188942 -140928 -62974 68370 -110247 -28919
12573 -40252 246664 171801 182825 -81634 -247043 -30225 -249496 277432 -477908 -125646
12562 88464 155518 33415 -161281 270685 -197765 251934 -26318 59579 -39733 203344 -103492
12550 -333738 76826 -44917 144002 116855 -182776 -15041 -106648 -76678 538521 221304 401126
12539 401126 228154 28976 -78206 -44802 130347 192526 61499 -217174 74522 -153180 54007
12527 -1958 270795 -108803 236279 178249 -285999 143078 27638 -57224 -155764 136090 -23472
$$ packed form
12606F7827q525b76729A32352a29284j85262A61940l7975a83696A84353p9048
12596A05305D53i3419B7139i1489j93745e9577A59119A4231L22008C4395J36141
12585A70536e8429A65410a98054b7175j63632J865M8014f2974F8370a10247b8919
12573d0252B46664p4863J1024h1634j65409c0225k19271B77432d77908a25646
12562H8464O7054C3415a61281B70685a97765B51934b6318E9579c9733B03344a03492
12550c33738G6826d4917A44002k7147a82776a5041r1607K9970E38521B21304J79822
12539D01126j72972B8976g8206L3404A30347O2179F1499b17174G4522a53180E4007
12527a958B70795a08803B36279n8030b85999A43078B7638e7224r8540A36090b3472
$$ plain form
12515 70413 129384 -1891 241708 294880 124083 -83138 325072 55763 -287050 58426 -79117
12503 -142607 228902 184204 -7563 103440 -261669 58592 -32879 -205470 -42388 144816 -179970
12491 -218821 300705 -405095 -141713 54938 16015 -140604 232425 458359 315433 281699
12481 281699 -67935 53863 -66944 -305665 -171295 166655 -116041 -112158 74491 -95872 -162732
12470 -162732 299609 173732 34064 226031 101631 -240523 137067 134164 -223547 77362
12459 -250310 58443 2688 -19639 92460 2501 -20372 -350545 -13231 130471 287518 -335114
12447 -45289 195933 69087 -5723 6032 195090 -24505 -259655 -257167 71575 39330 209496
12436 209496 88215 99896 111654 -10808 -373071 -117154 -100266 -7952 -227055 335537 -206156
$$ packed form
12515G0413N8971a891B41708N3172A24083h3138C25072E5763b87050E8426g9117
12503a42607B28902m4698g563A03440b61669E8592c2879j72591d2388A44816a79970
12491b18821C00705d05095a41713E4938A6015a40604B32425K25934j42926l3734
12481B81699f7935E3863f6944k38721J34370A66655a16041L883G4491i5872o6860
12470a62732B99609j25877C4064J91967A01631b40523A37067k903b23547G7362
12459b50310E8443B688a9639I2460B501b0372l30173a3231A30471J57047c35114
12447d5289A95933F9087e723F032J89058b4505k35150K488G1575l2245J70166
12436B09496H8215J1681J1758a0808l62263a17154J6888g952k19103C35537b06156
$$ plain form
12424 -97876 -282947 48896 -106718 79523 -177846 28625 13810 2482 -192841 -276322 -77183
12412 -211438 -111234 77877 -221538 -148524 93648 -163035 -169736 -139351 108263 23705 272884
12401 272884 -87670 -181070 345282 -184810 -111735 -2826 231058 -262635 -101790 152183
12390 73388 -418826 -293806 285317 -100716 256866 -31855 132444 -199128 -269971 -41034
12379 230942 -402974 144216 246116 355381 -95450 -5085 38161 139054 411028 270344
12369 270344 135485 93304 181753 -127330 256807 224556 182602 -262962 -109874 94379
12358 380456 210234 32804 -154376 29022 61452 116708 288397 121461 -136322 4006 -132115
12346 -52231 8079 43321 -102249 178701 -30262 -19028 -112053 335591 -219321 190664 210425
$$ packed form
12424i7876j85071D8896a06718G9523a77846B8625A3810B482a92841q3481g7183
12412b11438J00204G7877b21538P3014I3648a63035o701L0385A08263B3705K49179
12401B72884h7670r3400C45282a84810P3075b826B31058b62635a01790A52183
12390G3388d18826J25020B85317a00716B56866c1855A32444a99128p0843d1034
12379B30942d02974A44216J01900J09265i5450e085C8161J00893K71974j40684
12369B70344j34859m2181Q8449a27330B56807l2251m1954b62962a09874I4379
12358C80456j70222C2804a54376B9022L2430N5256J71689A21461a36322D006a32115
12346e2231H079L5242a02249A78701c0262J1234r3025C35591b19321A90664J9761
$$ plain form
12335 210425 276461 210175 111288 157856 100902 200257 313798 -22002 23572 103694 -94789
12323 176378 309721 178092 266344 252537 -262687 25191 28978 189488 41659 192506 109910
12312 109910 458870 179327 122752 -47949 28878 136460 303088 15516 14503 43613 -44762
12300 -72369 -160362 225704 -37348 26796 222772 -22205 240872 -12808 293522 -243661 79835
12288 -38554 366556 107165 43806 80513 358762 76994 407746 46410 -80119 224567 -105642
12276 347216 287483 -85225 72382 121768 169550 303831 85866 -331964 -301771 256436 -127287
12264 -42853 271983 -1459 -9751 -196722 -167477 160184 54158 -119489 373286 242678 81176
12252 -39135 22684 192332 195393 -79060 -100078 360150 -144285 345249 -71925 208416 -59871
$$ packed form
12335B10425O6036o6286r8887M6568n6954R9355J13541b2002B3572Q0122i4789
12323A76378J33343j31629Q8252j3807b62687B5191L787J60510D1659J50847q2596
12312A09910L48960A79327n6575d7949B8878J07582J66628A5516j013K9110d4762
12300g2369q7993B25704c7348B6796J95976b2205B40872a2808B93522b43661G9835
12288c8554C66556A07165D3806L6707K78249G6994L30752D6410h0119B24567a05642
12276C47216n9733h5225G2382M9386M7782J34281H5866c31964L0193B56436a27287
12264d2853B71983a459q292j86971K9245A60184E4158a19489C73286j30608H1176
12252c9135B2684J69648L061g9060k1018C60150a44285C45249g1925B08416e9871
$$ plain form
12240 181641 -46676 -144973 323689 4850 -146063 -257720 107937 53026 303830 -16439 125856
12228 73796 -51030 26751 301346 100106 -129904 220839 398620 -138270 137043 255425
12218 255425 30143 597657 165839 19722 -70977 264890 113375 282594 243741 264886
12208 264886 237211 3753 -121326 304298 37649 341932 145177 -280504 344274 239278
12198 239278 -360997 97263 218658 123163 -61560 113386 353044 205954 149759 297322
12188 297322 289713 109664 121253 320379 440865 267068 343240 -11257 403113 387507 188439
12176 62564 14867 237784 73347 -46668 -186640 640714 184324 207165 -29243 443837 -59673
12164 333878 -77196 155665 -2237 51519 203449 75836 128957 -44103 486091 472433 211941
$$ packed form
12240A81641d6676r8297C23689D850a46063j11657A07937E3026K50804a6439A25856
12228G3796e1030B6751K74595A00106a29904B20839J77781a38270A37043J18382
12218B55425C0143N67514A65839A9722g0977B64890A13375J69219l8853K1145
12208B64886k7675C753a21326C04298C7649L04283A45177b80504C44274j04996
12198B39278c60997I7263J21395r5495f1560A13386K39658j47090n6195J47563
12188B97322p609A09664J1589J99126J20486j73797P6172a1257D03113j5606A88439
12176F2564A4867K22917G3347d6668j39972F40714A84324K2841b9243D43837e9673
12164C33878g7196A55665b237E1519J51930G5836N3121d4103D86091j3658B11941
$$ plain form
12152 -42253 97556 271567 50299 313391 376866 11960 550191 34775 425909 -43632 185655
12140 -85283 -154905 286164 118431 292000 -7312 -68442 292394 236468 176099 141603 278094
12129 278094 -32382 80440 10143 242687 -109340 230203 343116 -124586 -235125 121630
12118 193510 182315 36835 -157654 59740 -88610 248724 -91115 -66796 298060 47279 128508
12107 128508 188083 -73747 67740 33863 267205 211180 -103260 -118816 66406 -63353 -96194
12096 -96194 41077 96247 -133357 74652 139843 491972 393137 150328 106694 146623 130104
12085 130104 -97631 105578 -94560 119200 -227574 110381 42780 -79614 34927 130883 138630
12074 138630 19648 143771 -88378 -73561 179998 -223148 -174158 -11448 -190609 61275 -22812
$$ packed form
12152d2253I7556J74011E0299K63092O3475A1960N38231C4775L91134d3632A85655
12140h5283o9622B86164A18431J73569g312o1130B92394n5926o0369l4496J36491
12129B78094c2382H0440A0143K32544a09340B30203J12913a24586j10539A21630
12118A93510j1195C6835a57654E9740h8610B48724i1115K4319B98060D7279Q1229
12107A28508N9575g3747F7740C3863K33342n6025a03260j5556F6406f3353l2841
12096i6194D1077N5170a33357G4652O5191L52129r8835A50328m3634L9929j6519
12085A30104i7631A05578i4560A19200b27574A10381D2780g9614C4927R5956P747
12074A38630A9648J24123h8378J4817A79998b23148M8990a1448j79161F1275b2812
$$ plain form
12062 231585 -130846 207521 -356516 27577 297905 139544 84526 84780 179273 -45570 -222579
12051 -222579 199260 -244675 -21011 478613 239613 91934 -113174 -137411 -65838 -6194 50606
12039 44717 209484 -187413 -253655 56415 -369927 22677 36230 65450 -156113 78618 -62235
12027 355580 165614 37297 -43210 363334 142136 -36815 287403 93495 -136323 -7608 1895
12015 123834 -69511 128268 -31359 103107 28186 -3882 190525 -2987 142092 -210063 -233419
12004 -233419 8792 -402005 29045 -53426 -157928 30603 -40297 -176586 -239099 111804 -47002
11992 -281663 42760 -57034 -100063 -187263 -413364 335526 -63658 32237 -128082 53545 -54825
11980 -180497 -50378 -31504 112056 25688 6083 -278680 -322055 -83831 108383 -105373 -265184
$$ packed form
12062B31585a30846B07521c56516B7577K70328A39544n5018K54R4493d5570j77009
12051b22579A99260b44675b1011D78613k39000I1934a13174k4237f5838f194E0606
12039D4717J64767a87413o6242E6415c69927B2677J3553K9220a56113G8618f2235
12027C55580A65614C7297d3210C63334A42136c6815B87403I3495a36323g608A895
12015A23834f9511A28268c1359A03107B8186c882A90525b987A42092b10063k3356
12004b33419H792d02005B9045e3426j04502C0603d0297j36289o2513A11804d7002
11992b81663D2760e7034m3029q7200k26101C35526f3658C2237a28082E3545e4825
11980a80497e0378J8874A12056B5688F083b78680m3375h3831A08383a05373j59811
$$ plain form
11969 -265184 -38133 36550 22976 102088 214451 -203898 57906 188982 182950 -326947 -269698
11958 -269698 -167274 -117194 -145767 -99983 -224259 26257 250742 -84176 -418446 -198592
11947 6650 199400 161264 125707 -92187 229207 -89162 200940 40411 -34717 386934 -9603
11935 -26444 120299 -155205 -267837 -305828 114880 -39786 -207937 -11355 -97820 -291284
11925 -291284 -25208 -233781 2621 59656 -110845 -24144 -68215 -134884 -291463 246478 -50345
11913 135495 -105182 11884 -396304 -79951 -49285 10294 15732 -141531 -26000 -245183 43422
11901 -76113 73782 8722 -239013 77395 -179206 -136407 178634 71889 96519 -5724 -222595
11890 -222595 -55764 -237019 188160 -164206 51476 -127554 -350845 -286530 -29353 -157359
$$ packed form
11969b65184c8133C6550j3574P9112J12363b03898E7906J31076o032c26947N7249
11958b69698J02424N0080k8573M5784j24276B6257K24485h4176l34270a98592
11947F650J92750l8136l5557i2187B29207h9162B00940D0411c4717C86934i603
11935b6444A20299a55205j12632l7991A14880c9786j68151a1355q6465j93464
11925b91284b5208k08573B621N7035a10845b4144m4071o6669j56579B46478e0345
11913A35495a05182A1884c96304g9951L0666A0294N438a41531b6000k19183D3422
11901g6113G3782H722b39013G7395a79206M2799A78634G1889K4630e724k16871
11890b22595e5764j81255A88160a64206E1476a27554k23291O4315b9353j28006
$$ plain form
11880 -157359 -279920 -403982 -101800 -118364 -205300 -9176 -12024 194195 -164040 -182438 -172704
11869 -172704 -109206 65716 13369 -175903 221111 -283523 249732 -71968 -219655 36380
11858 -236672 -72428 93526 -21596 -349536 271462 63380 56106 -200636 -24467 -86943 -241947
11847 -241947 189487 -10021 -48786 -138208 -40351 -34904 -87094 -349571 -167261 -391101 110829
11835 -295198 70138 181650 -167906 -30699 -181740 -79537 98285 72801 -227341 -221808 12364
11823 68468 10450 -66540 -337514 -108276 94116 -65120 54541 12267 -41844 144818 -167726
11811 21861 -215930 -261922 -30089 181756 -153104 278958 -19425 -245152 -80909 -104677 -24830
11799 -169781 -174145 -219787 -139050 -210086 73524 -1740 66050 18465 38373 57753 -1516 -106074
$$ packed form
11880a57359j22561j24062a01800j6564q6936i176k848A94195a64040j8398R734
11869a72704O3498F5716A3369a75903B21111b83523B49732g1968j47687C6380
11858b36672g2428I3526b1596l27940B71462F3380p274b00636b4467o2476j55004
11847b41947A89487a0021l8765q9422d0351N447n2190k62477a67261k23840A10829
11835b95198G0138J11512a67906c0699j51041g9537I8285k5484b27341N533A2364
11823F8468A0450f6540k70974a08276I4116f5120E4541A2267d1844A44818a67726
11811B1861b15930m5992c0089A81756a53104B78958a9425k25727h0909k3768b4830
11799a69781m364m5642Q0737p1036G3524a740F6050A8465J9908J9380a516j04558
$$ plain form
11787 -106074 -193574 -174914 -184252 -207820 67386 -86069 112679 -196864 -209844 -303116 -316347
11776 -316347 -132179 71032 125565 -41682 100804 343895 -181416 93132 -212136 -47009
11765 112167 255172 -230968 49757 -183571 -209508 -445459 137941 -7207 -65982 -108188 55388
11753 83941 207819 10708 -6667 -436015 -29246 -162124 -103711 83261 -255659 -43470 62303
11741 -119738 -106401 -396659 52633 -54821 166440 -96060 -146792 138151 142686 162350 -205116
11729 -85660 51188 155983 15284 -134229 213826 30165 110594 109337 -308939 -53633 220809
11717 -427166 22963 -68939 107241 110483 187587 101857 -88398 110316 87134 -77073 -118056
11706 -118056 -308903 118121 -52190 -165737 -96397 -9467 144817 8204 -92149 388722 176840
$$ packed form
11787a06074q7500J8660r338k3568F7386h6069A12679a96864j2980r3272j3231
11776c16347a32179G1032N4533d1682A00804K43091a81416I3132b12136d7009
11765A12167J43005b30968D9757a83571k5937k35951A37941g207n8775m2206E5388
11753H3941J23878A0708f667m29348b9246j32878N8413H3261b55659d3470F2303
11741a19738J3337k90258E2633e4821A66440i6060n0732A38151M535J9664b05116
11729h5660E1188J04795A5284a34229B13826C0165Q0429j257c08939e3633B20809
11717d27166B2963f8939A07241L242P7104q5730h8398A10316k3182g7073m0983
11706a18056j90847A18121e2190j13547O9340i467A44817H204i2149C88722A76840
$$ plain form
11694 -40533 299953 23767 11534 -10623 -53243 -53727 43748 47276 131101 56588 -127701 -108771
11682 -108771 -135937 153103 186067 -135954 140876 -102308 -449637 -288562 -406075 107237
11671 123626 -193349 -103417 -287606 154078 289810 -222335 215024 -7507 -9454 -75967 -219132
11660 -219132 -317679 81361 55482 253035 -66860 108677 -309024 -78662 18521 56305 -73356
11648 215941 109732 -222403 164462 -174075 328719 194253 -191282 -182513 72987 -79317
11637 -88088 -10457 61525 -203351 3422 -148819 147979 40321 -306070 -202380 404969 -42700
11625 -10648 74031 -94781 27803 8715 27683 -118628 351921 -66643 -34388 12799 -32190
11613 -75343 36633 67079 -1326 -11342 -285505 -391322 -118876 8337 -293335 -289630 -76405
$$ packed form
11694d0533B99953B3767A1534a0623m2620m84D3748L528Q3825E6588a27701J8930
11682a08771k7166A53103L2964a35954A40876a02308l47329J61075j17513A07237
11671A23626a93349Q9932j84189A54078J35732b22335B15024g507j947o6513j43165
11660b19132r8547H1361k5879J97553f6860A08677c09024g8662A8521L7784g3356
11648B15941j06209b22403A64462a74075C28719j34466a91282Q769G2987g9317
11637h8088a0457F1525b03351C422a48819A47979D0321c06070J03690D04969d2700
11625a0648G4031i4781B7803H715J8968a18628C51921f6643L2255A2799c2190
11613g5343C6633L0446a326j0016k74163j05817a18876H337b93335L705g6405
$$ plain form
11601 -118360 -79812 -263610 -13910 -61588 -39465 -260069 -156388 -87426 -5289 -69863 -35775
11590 -35775 225251 -334736 227016 30890 -47000 -153814 -350685 -228304 6916 -315555
11579 -110859 43842 181594 4130 -153480 376378 -59356 182846 -87120 -269216 -283492 -133409
11567 -255233 -308166 444774 271694 4429 175695 -59786 32979 189085 72376 -159496 -72079
11555 55728 -23794 36641 124066 -127546 227334 -203610 -15339 253445 -202878 -52997 84962
11543 -359083 -196985 58830 253194 -26260 21529 -349669 130063 153882 118213 -19602 284481
11531 -393498 -43658 92326 65078 -19227 260152 4612 45599 -238839 228905 -116275 -95019
11520 -95019 104774 -119058 -170195 -54503 -275763 -70557 -154108 209239 -312649 -320 3799
$$ packed form
11601a18360L8548j83798a3910m7678K2123k20604J03681O8962e289o4574L4088
11590c5775B25251c34736B27016C0890d7000j06814j96871J22381F916c15555
11579a10859D3842J37752D130a53480C76378e9356A82846h7120j82096j4276a33409
11567b55233n2933D44774j73080D429J71266e9786C2979J56106G2376a59496g2079
11555E5728b3794C6641Q7425a27546B27334b03610a5339B53445b02878e2997H4962
11543c59083J62098E8830J94364b6260B1529c49669A30063K3819l5669a9602B84481
11531c93498d3658I2326k7248a9227B60152D612M0987b38839B28905a16275K1256
11520i5019A04774a19058n1137e4503k21260g0557q3551B09239c12649c20C799
$$ plain form
11508 121998 74984 -112354 293604 46434 -21849 151386 -100958 17102 40804 -115724
11497 240880 -183069 169347 -79321 12117 277696 -50000 -102559 58427 131706 12611 -97206
11485 210131 78488 28933 85341 -38121 62900 -114170 72796 24767 57751 -176693 202697
11473 127056 250136 77436 -100457 267289 112949 -165808 116800 126365 163344 -27957
11462 -38411 -131023 156356 218022 54829 199466 394902 143281 -380088 -121773 66274
11451 44014 113211 12326 -10173 190558 -201045 -70577 -374738 -60391 477671 81726 -358244
11439 -52595 116558 194186 91306 -270373 -57413 211248 -64422 154257 -5958 -388 89279
11427 -51199 -177400 70664 500928 224133 -108289 -106369 236612 -409795 39628 92864 136516
$$ packed form
11508A21998m7014a12354B93604D6434b1849A51386a00958A7102K3702a15724
11497B40880a83069A69347g9321A2117K65579e0000n2559E8427P3279A2611i7206
11485B10131G8488B8933N6408c8121F2900a14170G2796B4767L2984a76693B02697
11473A27056J23080G7436a00457B67289A12949a65808A16800R565L6979b7957
11462c8411r2612A56356O1666E4829J44637J95436A43281c80088a21773F6274
11451D4014O9197A2326a0173A90558b01045g0577l04161f0391D77671H1726c58244
11439e2595A16558P7628I1306b70373e7413B11248f4422A54257e958c88H9279
11427e1199j26201G0664M30264B24133a08289J920B36612d09795C9628N3236M3652
$$ plain form
11416 136516 -10019 44046 46054 354380 288597 -10332 117438 7992 -107629 -175632 12468
11404 -205562 -96870 -83927 -104096 -1155 -155576 -200435 -229472 -239648 -157721 -239732 -122094
11393 -122094 -233044 89482 95980 71455 34772 43222 -35139 -233390 9268 -75725 -21712 17164
11380 23877 51987 -221713 -97220 91513 -7804 -348322 -23842 15440 196693 -49312 112265
11368 -230333 43830 -268796 157871 -239673 198367 34751 -176549 217349 138973 160801
11358 160801 53907 -206487 -24351 52845 -42889 -52892 -147737 -34487 256356 -43169 90354
11346 -393532 -99757 -319188 -141842 -175877 -296377 -248140 193400 214360 -336931 -25521
11335 -306135 -215910 -59459 -132243 507091 -465278 8204 67174 -47154 54751 280696 12153
$$ packed form
11416A36516a0019D4046K008L08326o5783a0332A17438G992a07629o8003A2468
11404b05562i6870J2943k0169a155j54421m4859k9037j0176Q1927q2011J17638
11393a22094j10950H9482O498k4525C4772Q450c5139j98251I268g5725b1712A7164
11380B3877K8110b21713i7220I1513g804l40518b3842A5440J81253d9312A12265
11368b30333D3830b68796A57871b39673A98367C4751a76549B17349p8376K1828
11358A60801E3907b06487b4351E2845d2889j0003r4845c4487B56356d3169I0354
11346c93532i9757k19431a41842l4035j20500M8237A93400K0960c36931b5521
11335c06135R0225e9459p2784E07091d65278H204N8970d7154E4751K25945A2153
$$ plain form
11323 221032 217614 -82227 -13241 183179 -153390 118832 -54631 -24153 162965 -157842 -150145
11312 -150145 118220 -3378 -127663 6796 263379 -198615 227626 -135359 110657 -136424
11301 -169288 -271330 -98248 -215303 -263527 -45218 345486 -148415 -128805 96391 -12306 -141373
11290 -141373 275741 100047 -22751 -440889 -89163 -244783 34233 43485 411193 115401
11279 -281953 -269402 -461280 7768 181696 -327135 -343882 -72199 145693 157191 396323 -15501
11267 198609 9476 327676 -49438 -239499 -166036 -119345 -164305 -88056 136782 -16914 -68782
11256 -68782 127811 64066 -122527 -21874 151379 288924 -30451 -21882 78025 44994 90125
11245 90125 38058 -301674 131710 244078 150874 -171037 77895 -1037 -88400 -149104 -86944
$$ packed form
11323B21032l418h2227a3241A83179a53390A18832e4631b4153A62965a57842P697
11312a50145A18220c378j24285F796K56583a98615B27626a35359A10657a36424
11301a69288j02042i8248j17055m8224d5218C45486a48415J9610I6391a2306j29067
11290a41373B75741A00047b2751m18138h9163j55620C4233R252L67708A15401
11279b81953J2551j91878G768J73928c27135j6747g2199A45693J1498K39132a5501
11267A98609I476L18200d9438j90061P3463M6691m4960P6249A36782a6914n1868
11256f8782A27811o3745a22527b1874A51379J37545c0451Q569G8025l3031M5131
11245I0125C8058c01674A31710J12368r3204a71037G7895a037q7363o0704O2160
$$ plain form
11234 -86944 103627 -292472 112579 -84074 8509 -217503 91163 -121609 145582 260036
11224 260036 -5092 -33039 76991 263301 21628 -215375 -241643 -134113 211281 -122378 66729
11212 56676 20760 -250001 143132 -268051 -36400 263222 -275341 6682 -145590 85857 -255557
11200 174973 -84121 -32986 -40565 -210245 23034 12066 -17385 -321169 -151617 -62812 42894
11188 -224794 -232720 -18803 -189782 205805 -197963 101528 -174541 -214246 -358982 -48026
11177 144978 58116 262663 -59269 -161443 -167426 -189679 -101202 47773 13681 -69292 -315250
11166 -315250 28079 19060 -240655 -104504 -82850 -52589 -324486 39752 15237 128094 171086
11155 171086 -327417 83572 -193209 -578160 2869 48051 -183706 -38434 -127031 -90818 -154585
$$ packed form
11234h6944A03627b92472A12579h4074H509b17503I1163a21609A45582J14454
11224B60036e092k7947G6991J86310B1628b15375k6268J07530B11281a22378F6729
11212E6676B0760b50001A43132b68051c6400B63222b75341F682a45590H5857b55557
11200A74973h4121c2986p579j69680B3034j0968a7385l03784a51617f2812D2894
11188b24794p926a8803j70979B05805a97963A01528a74541l9705j44736d8026
11177A44978E8116K04547e9269j02174n983k2253Q8477D7773A3681f9292k45958
11166c15250B8079r019b40655a04504K1654L0261k71897C9752A5237J12857M2992
11155A71086c27417H3572a93209l84951B869M5182a83706c8434q8597L6213o3767
$$ plain form
11144 -154585 159330 3963 152815 -177846 -355834 28374 24026 -177057 87297 346832 -2792
11132 204517 116035 9581 316037 65443 -17783 -191355 181528 211555 -123862 164944 58076
11120 -52668 327900 -100019 142827 73541 20894 66275 -153067 -450406 -170799 252809
11109 -30463 9782 -166553 -55984 162719 195255 -173819 -50992 -261673 303590 -380248 -126092
11097 324916 174303 81831 7391 129937 229813 281327 -119530 236341 -1895 196455 61458
11085 136619 173291 474457 146853 90743 166148 213504 89269 309881 139841 6287 277765
11074 277765 269491 173379 485426 167636 -117421 293169 270690 197476 111651 439550 108349
11062 132352 402669 290361 199091 197789 92068 86089 251474 82935 68845 336129 459508
$$ packed form
11144a54585A59330C963J48852a77846j77988B8374m348a77057H7297K59535b792
11132B04517q8482I581L06456F5443a7783j73572A81528L0027a23862A64944E8076
11120e2668C27900a00019A42827o9286B0894M5381a53067k97339a70799B52809
11109c0463I782a66553e5984A62719L2536a73819e0992k10681C03590c80248a26092
11097C24916j50613H1831G391J22546R9876N1514a19530B36341a895A96455F1458
11085A36619L6672L01166A46853n6110P5405M7356H9269K20612A39841F287K71478
11074B77765q274r6112L12047A67636a17421B93169k2479p3214q5825L27899A08349
11062A32352K70317j12308r1270j302I2068n979J65385H2935j4090K67284J23379
$$ plain form
11051 459508 341623 361454 468190 474368 478474 258209 592912 567884 335362 548104 803129
11040 803129 508887 748367 620766 635312 623534 839052 553442 413144 74122 1006645
11030 1006645 652841 488525 873823 584830 454478 727093 531240 573724 374409 276257
11020 276257 324255 621355 349604 490334 671865 445447 590012 635854 597004 333613
11010 333613 492491 614241 412812 254785 430941 197113 482886 295670 220204 273964
11000 273964 963315 558469 209531 156751 225702 479437 419790 683357 200354 242317
10990 242317 756725 475596 383184 475904 438019 475925 796185 521220 213608 289457
10980 289457 468969 222940 574219 470968 703396 597691 503909 548584 987272 1042881
$$ packed form
11051D59508j17885J9831J06736O178M106k20265L34703k5028k32522K12742K55025
11040H03129k94242K39480j27601J4546j1778K15518k85610j40298G4122R32523
11030A006645l53804j64316L85298k88993j30352K72615j95853M2484j99315r8152
11020B76257M7998K97100k71751J40730J81531k26418J44565M5842l8850k63391
11010C33613J58878J21750k01429j58027J76156A97113K85773j87216p5466N3760
11000B73964O89351m04846B09531n2780O8951K53735n9647K63567B00354M1963
10990B42317N14408k81129r2412R2720l7885L7906L20260k74965B13608P5849
10980B89457J79512B22940L51279j03251K32428j05705r3782M4675M38688N5609
$$ plain form
10970 1042881 739744 856725 1051086 1172064 1066157 970492 1064603 1311031 1697847 1741404
10960 1741404 2255453 2106344 2294439 2309123 2181714 1910757 1440953 1017326 1038477 1076228
10950 1076228 879877 934394 854878 852098 873006 785518 717987 561025 567686 620037 325874
10939 325874 318632 109028 450425 482071 97666 28717 157587 223694 234260 -210446 -140893
10928 -140893 338318 316696 56180 -109648 336436 -342529 73945 182379 45589 -287349
10917 -302963 -52624 74220 -31146 74672 -17621 -37792 -64457 72510 -144548 -41942 106626
10905 83486 299987 181325 -34559 -97723 -240847 -205146 -152575 116917 2622 102802 181983
10894 181983 -190983 -28811 -37277 -154889 28492 -74683 -107990 28785 106169 82552 -330834
$$ packed form
10970A042881l03137J16981J94361J20978j05907r5665R4111K46428L86816M3557
10960A741404N14049j49109J88095J4684j27409k70957m69804m23627K1151L7751
10950A076228j96351N4517p9516k780K0908q7488o7531j56962O661N2351k94163
10939C25874p242A09028L41397L1646I7666B8717J28870O6107J0566b10446O9553
10928a40893C38318k1622E6180a09648C36436c42529G3945J08434D5589b87349
10917c02963e2624G4220c1146G4672a7621k0171k6665G2510a44548d1942A06626
10905H3486K16501j18662c4559o3164j43124L5701N2571A16917B622J00180P9181
10894A81983a90983b8811q466j17612B8492g4683l3307B8785P7384k3617c30834
$$ plain form
10882 66200 112179 -40559 -157780 82200 -173656 -218738 207229 96604 -54559 21440 -360
10870 247548 -43310 -170787 -144980 261769 -127703 207143 -50904 -69839 -316949 163846
10859 -208920 325490 -75926 154928 -43830 -63912 -35720 -7187 150017 172327 78626 44707
10848 44707 60923 107309 11807 60282 -66597 8380 14350 -130598 -5337 172816 -46739 -72794
10836 -72794 -409587 -163558 -203075 -30186 -246520 -98235 -195438 -84465 339041 -283905 64948
10824 -86406 -14185 -481660 2977 -42716 -352707 139227 -65212 -374187 -20267 256069 245235
10813 245235 96815 -64315 -136579 -130928 71982 -129319 20179 29425 -218654 35139 -207877
10801 143738 -87458 116331 -47006 91339 258064 -141505 24111 -305429 -64042 -146841 -41680
$$ packed form
10882F6200M5979d0559j17221H2200a73656m5082B07229I6604e4559B1440c60
10870B47548d3310j27477K5807B61769a27703B07143e0904j8935k47110A63846
10859b08920C25490g5926A54928d3830k0082K8192g187A50017K2310G8626l3919
10848D4707J6216M6386A1807M8475f6597H380N970a30598e337A72816d6739k6055
10836g2794l36793a63558l9517c0186k16334i8235r7203h4465C39041b83905F4948
10824h6406a4185m67475B977d2716l09991A39227f5212l08975b0267B56069j0834
10813B45235I6815f4315p2264N651G1982a29319B0179R246b18654C5139b07877
10801A43738h7458A16331d7006I1339J66725a41505B4111c05429f4042q2799d1680
$$ plain form
10789 380662 -63005 -174344 -216335 -133307 59317 -62839 -56801 50250 182840 -194529 -303782
10778 -303782 -129672 57351 -53933 -302300 -143054 97616 -183179 -380341 -70938 17895
10767 -132229 -141266 -65217 -104373 20567 -204657 42373 298878 -246793 -191866 251073 134427
10756 134427 -122360 -55930 -95796 -115323 -173569 155587 -138289 -300631 102221 141385
10746 141385 -194022 131826 -104522 98100 -108327 240827 -189314 168260 -14920 34232
10735 -39129 -119455 -66738 -122217 186615 -100592 -127210 -189463 311587 -185347 67907 -256598
10723 -151224 114994 -318932 -162407 -341758 7238 139447 104377 96703 -105058 244854
10712 -209435 -108586 60459 -120933 202260 234613 -25425 92031 -176449 -144026 -64557 21437
$$ packed form
10789C80662f3005j11339m1991Q3028E9317f2839O038E0250J32590a94529j09253
10778c03782a29672E7351e3933k48367a43054I7616a83179j97162g0938A7895
10767a32229r037f5217l9156B0567b04657D2373K56505b46793N4927B51073j16646
10756A34427a22360e5930l9866j9527n8246A55587a38289j62342A02221L9164
10746A41385a94022A31826a04522I8100a08327B40827a89314A68260a4920C4232
10735c9129q0326N2717n5479A86615a00592k6618o2253C11587a85347F7907b56598
10723a51224A14994c18932J56525j79351G238J32209l5070p674a05058B44854
10712b09435J00849F0459a20933B02260L2353b5425I2031a76449L2423f4557B1437
$$ plain form
10700 -250877 -84174 -65356 -163013 6742 163376 -60472 -188461 -425998 -46364 56702 -126429
10688 -254307 -226776 192209 -199940 -325906 -202729 -316918 -163804 -60072 -25832 -405838
10678 -405838 95920 -159068 201962 -26254 -105739 -25480 50943 189276 -164374 -398970
10668 -398970 -45018 -279261 186302 -199373 -27715 -286144 146148 -171140 -20576 -108300
10658 -108300 -67906 -220381 -126826 70190 258191 -146477 -93911 -260956 -28583 -289975
10648 -289975 48348 60548 -37537 -362410 234714 150892 104400 19677 6994 -84693 91884
10636 76332 -7656 90004 3096 7788 -108123 -22993 -183833 -65685 -154005 -23226 -144248 -82218
10624 -82218 125504 96693 5360 13940 -302138 7999 -352358 -22807 72422 -218969 -102300
$$ packed form
10700b50877h4174J8818r7657F742J56634f0472j27989k37537d6364E6702a26429
10688b54307K7531A92209a99940j25966J23177j14189J53114f0072b5832l80006
10678d05838I5920a59068B01962b6254p9485b5480E0943J38333a64374k34596
10668c98970d5018k34243A86302a99373b7715k58429A46148a71140b0576q7724
10658a08300M0394j52475R3555G0190J88001a46477N2566j67045b8583k61392
10648b89975D8348J2200c7537l24873B34714q3822m6492A9677F994h4693I1884
10636G6332g656I0004C096M692a08123b2993j60840f5685q8320b3226j21022O2030
10624h2218A25504k8811E360Q580c02138G999c52358b2807G2422b18969a02300
$$ plain form
10612 -123638 -195962 3258 -10254 -9907 107997 -42824 160895 23341 -228490 -93810 -163406
10601 -163406 18586 352604 -123794 277272 249015 -20695 -395341 -14271 97315 -57139 134237
10589 -41005 -250026 71209 -187288 -257932 -64640 -126293 153841 105879 -125076 -86435 -52897
10578 -52897 -187947 -149213 -278317 -85334 -322600 -306108 -158058 151130 4872 -215769 -240359
10567 -240359 127103 -375784 9635 -245322 140828 74616 780 -6840 -134043 -111482 -4337
10555 111690 -68883 -286627 -167214 -34919 -57672 -32156 -16334 277048 -118747 -55655 -33061
10544 -33061 -297764 -7718 -114249 495479 -240177 47643 193738 33380 71236 -267562 5180
10532 -284763 -215279 -248360 101249 2668 -228747 43349 -221144 -75019 -36823 -37777 -35963 255842
$$ packed form
10612a23638p2324C258a0254L47A07997d2824A60895B3341b28490i3810o9596
10601a63406A8586L34018a23794B77272k8257b0695l74646a4271I7315e7139A34237
10589d1005k09021G1209a87288p0644f4640o1653A53841m7962a25076L8641L3538
10578e2897j35050L8734j29104h5334k37266J6492J48050A51130D872b15769k4590
10567b40359A27103c75784I635b45322A40828o6212G80f840j27203K2561d337
10555A11690f8883k17744J19413c4919k2753K5516J5822B77048a18747e5655K2594
10544c3061k64703g718j06531D95479b40177D7643J46095C3380L7856b67562E180
10532b84763O9484l3081A01249B668b28747D3349b21144g5019c6823r54J814B55842
$$ plain form
10519 -288718 -306824 -45339 427316 30187 152791 -336681 -74823 -236416 -250856 90338 260712
10508 260712 -123523 -159566 -127017 -217821 4156 -65259 10287 -111942 -118776 -61476 -205938
10497 -205938 -149761 -189837 -118243 133063 -120688 42909 -72158 -72298 -111461 28741 -159069
10485 -124484 -322278 71143 -93368 63444 -583671 23287 16870 -69616 -17389 -110484 506 -60935
10472 88051 -50734 -129880 70366 267883 40878 337114 340355 -241938 -41405 -277436 -200307
10461 -200307 -99658 -80265 222704 118321 106981 -81001 -252605 -27153 143839 -77856 -26763
10449 -32251 41254 -194299 -446387 -29635 -55158 -281487 -444157 98167 -257130 -219492 -251258
10438 -251258 -149480 -147234 -143900 -286422 -200535 -148573 -144699 68827 -205772 -82193 -46262
$$ packed form
10519b88718j8106d5339D27316C0187J22604c36681g4823j61593j4440I0338J70374
10508B60712a23523l6043L2549r0804D156f5259A0287a11942o834N7300j44462
10497b05938N6177m0076P1594A33063a20688D2909g2158j40l9163B8741a59069
10485a24484j97794G1143i3368F3444e83671B3287o417f9616a7389r3095E06f0935
10472H8051e0734p9146G0366J97517D0878K96236L241b41938d1405k36031P7129
10461b00307i9658J9393B22704j04383j1340h1001j71604b7153A43839g7856b6763
10449c2251D1254a94299k52088b9635k5523k26329j62670I8167b57130L7638l1766
10438b51258J01778K246L334j42522Q5887N1962L874F8827b05772h2193L5931
$$ plain form
10427 -46262 6318 -61304 -211466 -2633 -343819 -41106 51058 -103246 -371005 -133597 -127199
10416 -127199 175207 -19613 -80215 125056 200280 -547739 74864 123773 67302 -25418 228987
10404 -359517 160060 20474 36603 35926 13278 187232 162570 -238627 151133 57166 62669
10393 62669 145139 -87315 -215034 -232321 -159201 174109 -136588 314626 -65659 -73563 156314
10381 -207711 -36716 -5344 7126 155171 -289126 264949 194504 1902 -19130 -20226 19624 -81137
10368 148266 98674 149923 -42232 297480 -14668 439299 298105 369980 139970 84414 214859
10357 214859 499165 171198 356906 375167 203865 -148310 9245 -80649 183342 -159729
10346 283645 -13813 252142 516885 167335 380116 482188 264341 87804 102692 130891
$$ packed form
10427d6262F318f1304j50162b633l41186d1106E1058a03246k67759a33597O398
10416a27199A75207a9613o0602A25056P5224e47739G4864M8909n6471b5418B28987
10404c59517A60060B0474J6129o77A3278J73954k4662b38627A51133E7166N503
10393F2669Q2470h7315j27719j7287P3120A74109a36588C14626f5659p904A56314
10381b07711c6716e344G126J48045b89126B64949p0445A902a9130j096A9624h1137
10368A48266m9592N1249d2232B97480a4668D39299j41194P1875A39970n5556J30445
10357B14859K84306A71198J85708J8261j71302a48310I245h0649A83342a59729
10346B83645a3813B52142K64743A67335K12781J02072k17847H7804J4888K8199
$$ plain form
10336 130891 269313 25999 164834 104156 14226 94599 -21666 85944 -159353 26323 190513
10325 190513 159940 237947 -51944 127453 40348 -106413 -53501 29827 52507 143758 -34613
10313 82240 413305 174508 76418 -5522 107799 301644 184231 -135054 202469 -207429
10302 -37730 95168 -58247 -254499 -38227 491999 106532 -89072 20293 -67057 -175238 24642
10290 -95237 119053 -22897 -288291 -115555 -80847 -359411 -75426 206662 73376 20282 -185211
10278 -158296 -133068 110511 -213976 -234360 -28364 29245 116780 -128825 -119553 -318668 81946
10266 132742 -50903 -267651 147462 77087 244126 -263282 180525 12351 114586 -195597
10255 98419 100308 41256 -161723 -252130 186957 -55502 103974 -124715 -186342 -68903 -74629
$$ packed form
10336A30891J38422B5999J38835o0678A4226Q0373b1666H5944a59353B6323J64190
10325A90513l0573P8007e1944A27453D0348a06413N2912B9827K2680R1251c4613
10313H2240L31065A74508G6418e522A07799J93845j17413a35054B02469b07429
10302c7730I5168e8247j96252c8227D91999A06532h9072B0293f7057j08181B4642
10290i5237A19053b2897k65394a15555L4708k78564g5426B06662G3376B0282a85211
10278a58296K5228A10511b13976k0384b8364B9245Q7535a28825R272j99115H1946
10266A32742e0903k16748A47462p0375J67039b63282A80525A2351J02235a95597
10255I8419J889D1256a61723r0407A86957e5502A03974a24715o1627f8903n726
$$ plain form
10244 -74629 492331 -4742 220019 143269 24420 -188657 56736 -35904 319147 -240712 -176321
10233 -176321 25426 -83402 -64461 -270099 -30665 -60497 327596 -34710 20312 27896 133843
10222 133843 -118416 -80116 -9855 -131333 -76765 63831 33513 -66725 -390675 -252115 22226
10210 183543 -348301 -263914 -149781 -82289 -129805 93994 -125970 85870 -155954 156885
10199 -49330 -60243 135194 -246091 -61504 -271436 -139243 -134984 -103592 104480 -272345 -31275
10187 133365 -242804 -71552 -196744 26226 136448 -88363 -129992 -48336 -18631 24372 -133370
10175 55785 -79724 -193937 -294701 25019 -52052 19119 2508 -185387 326380 -34949 136911
10163 280278 426826 -138015 -264317 -28123 -250528 -207214 27642 152284 122474 -112322
$$ packed form
10244g4629D92331d742B20019p6750B4420a88657E6736c5904C19147b40712O4391
10233a76321B5426h3402J8941k05638c0665k9832C27596c4710B0312P584J05947
10222A33843a18416L8300i855j21478N4568F3831l0318f6725l23950J38560B2226
10210A83543c48301Q4387J14133O7492m7516I3994a25970H5870a55954A56885
10199d9330j0913A35194b46091f1504k09932J32193M259L1392A04480b72345c1275
10187A33365b42804g1552j25192B6226J10222h8363m1629d8336a8631B4372a33370
10175E5785g9724j14213j00764B5019e2052A9119B508a85387C26380c4949A36911
10163B80278J46548a38015j26302b8123k22405M3314B7642J24642k9810a12322
$$ plain form
10152 -27249 -113034 112856 -285113 56598 -195745 -397427 -9553 -351675 147844 -272470
10141 38337 -332455 1435 -263084 -437344 -202483 -125838 3277 360719 -167294 -135701 13853
10129 -144491 -471996 -333170 164959 37111 102611 -131174 58648 23245 -351666 -85000
10118 -33986 143141 -139644 13308 -266277 -164802 -323593 231528 -98867 28578 -33512
10107 123532 87573 -394192 -126369 -343666 -98449 -209108 -232863 40458 -255225 -3524 -51886
10096 -51886 -389245 -13320 -36272 -182681 -92030 -257040 -121815 -127367 -221743 267563 73122
10084 -310813 -399809 -262960 -70305 -236017 -269334 -193363 -161554 -133385 424950 91331 -42076
10072 159455 -36615 -2832 -131660 -89863 49378 -110155 -393125 -120902 -112634 248924 -111794
$$ packed form
10152b7249q5785A12856b85113E6598a95745k01682i553l42122A47844b72470
10141C8337c32455A435b63084j74260b02483P6645C277L57442a67294L1593A3853
10129a44491l27505J38826A64959C7111O5500a31174E8648B3245c51666h5000
10118c3986A43141a39644A3308b66277J01475j58791B31528i8867B8578c3512
10107A23532l5959c94192a26369k17297i8449j10659k3755D0458b55225c524m8362
10096e1886l37359a3320k2952j46409R0651j65010a21815n552r4376B67563G3122
10084c10813q8996J36849g0305j65712l3317P5971L1809K8169D24950I1331d2076
10072A59455c6615b832j28828M1797D9378a10155k82970a20902Q268B48924a11794
$$ plain form
10060 -44105 40657 -203000 97406 130680 54064 146606 71154 -258964 -84026 -236146 67413
10048 -105718 35545 -304144 -143556 261419 -177318 88102 -136876 -48598 -83097 69543
10037 71857 -298963 -410258 82392 -31494 -125005 -53367 264040 -74706 40181 -177406 81360
10025 43279 103557 -236685 -200610 -120754 102900 -26286 -100269 99297 -209143 -238047 -163866
10014 -163866 63624 -91263 -164873 208507 61738 -386636 -106345 -22147 -161448 62059 244777
10003 244777 218725 -509021 -123845 -213097 80605 -155455 36642 269465 -60693 39472 17616
9991 -56982 -16207 112158 84842 -144239 -66042 -295139 6145 -156109 286309 -168028 -169023
9980 -169023 -119208 40610 98646 215515 -23577 76129 107506 64940 -158864 -160225 -403422
$$ packed form
10060d4105D0657b03000I7406L3274E4064R2542G1154b58964h4026j52120F7413
10048a05718C5545c04144a43556B61419a77318H8102a36876d8598l4499F9543
10037G1857b98963j11295H2392c1494r3511e3367B64040g4706D0181a77406H1360
10025D3279O0278b36685L6075P9856A02900b6286p3983I9297b09143k8904P4181
10014a63866F3624i1263p3610B08507F1738c86636a06345b2147j39301F2059J82718
10003B44777k6052e09021a23845q9252H0605a55455C6642K32823f0693C9472A7616
9991e6982a6207A12158k7316a44239f6042k29097F145a56109B86309a68028r95
9980a69023M9815D0610N8036J16869b3577G6129L1377m2566a58864j361k43197
$$ plain form
9969 -403422 -330918 -493425 -118151 157711 -279266 57268 183738 -57069 167705 186157
9959 186157 -50393 -243374 31804 35452 30060 -259760 -103592 115882 369454 107223 -264296
9947 -159126 -382577 -73871 140933 124209 -61138 234813 -267730 -262637 -176042 4906 54096
9936 54096 50917 42289 116901 -55055 -68008 72501 -25918 216175 -250207 -39942 29685 -341956
9923 -209443 -268848 -62059 182228 256091 8136 -359693 184285 24909 -195927 -383370 -40956
9911 -287424 -367571 -103209 -68161 -165140 221928 -77049 -195601 -21721 137302 -337889 -358584
9900 -358584 -63591 162897 238972 -243803 -175721 -375097 -140640 -59236 -85186 107122 42561
9888 -115461 -5831 -19896 320061 -3282 -43915 31764 -102183 -72923 -353403 -2177 -221802
$$ packed form
9969d03422P2504j62507a18151A57711b79266E7268J26470e7069A67705J8452
9959A86157e0393j92981C1804L648n392b59760a03592A15882K53572A07223b64296
9947a59126k23451g3871A40933j6724f1138B34813b67730N093Q6595D906M9190
9936E4096l179q628P4612e5055j2953G2501b5918B16175b50207c9942B9685c41956
9923b09443n9405f2059A82228P3863H136c59693A84285B4909a95927j87443d0956
9911b87424q0147a03209L5048r6979B21928g7049j18552b1721A37302c37889k0695
9900c58584f3591A62897P6075b43803O8082j99376a40640e9236k5950A07122D2561
9888a15461e831j4065C20061c282m0633C1764a02183K9260k80480b177k19625
$$ plain form
9877 -221802 -22877 -121309 -300822 -68411 -35301 64574 215807 -65171 54168 158601 196550
9866 196550 -316860 -261237 -137474 -159307 11606 -261790 114973 -369470 93047 -135640
9855 -470553 134441 -83808 -183700 -294255 -33688 337304 -358569 -36022 -255564 -419441
9845 -419441 163062 -559415 -331022 -51473 -165521 215107 320994 -144580 380885 -461685
9834 344435 -267538 219941 72564 78958 267921 -189224 25237 -120861 -45152 -348074 -187084
9823 -187084 -21907 282285 -168251 -112520 -209151 -117714 -199880 316248 -52912 26882 27544
9812 27544 -189202 285664 -48265 -38982 -201192 23683 -321454 -66805 -113526 -128288 -125387
9801 -125387 -127242 -215223 214264 -209857 2273 204308 -324213 -164274 -149814 -353323 -1873
$$ packed form
9877b21802b2877r8432j79513f8411L3110F4574J51233f5171E4168J04433L7949
9866A96550c16860N5623J23763k1833A1606b61790A14973c69470I3047a35640
9855d70553A34441h3808r9892j10555c3688C37304c58569c6022k19542j63877
9845d19441A63062e59415K28393e1473j14048B15107J05887a44580C80885d61685
9834C44435b67538B19941G2564O394J88963a89224B5237a20861d5152l02922J60990
9823a87084b1907B82285a68251N5731r6631R1437q2166C16248e2912B6882O62
9812B7544a89202B85664d8265R283j62210B3683c21454f6805m6721j4762K901
9801a25387j855q7981B14264b09857B273K02035c24213J59939J4460k03509a873
$$ plain form
9789 -79754 -166183 -161865 -224668 -89973 -14463 94010 -158954 -121899 -221000 -88739 -211306 191414
9776 -118967 -67496 60672 -102274 169708 43013 121740 -121607 -547656 -124495 -221313 -246612
9765 -246612 -152149 44622 260978 -28598 -207723 26362 -93403 74022 -324002 -110971 132048
9753 -164369 -111157 -117672 -58712 -282111 -182826 -127707 -488066 -493773 7519 16001 -135041 -206787
9741 -206787 -112148 217570 60855 -62011 -125465 -225504 -163620 -208246 24269 -515763 -50172
9729 102311 -467371 -320444 -210139 -72507 -156916 90583 188353 -40974 44503 121941 -103029
9717 -457605 -46144 -46435 326679 164543 -3270 43969 128813 610 -187981 -258055 89995 114876
9705 114876 184150 -141133 85774 -208075 -111933 -368658 -35191 -57095 54354 -49857 6796
$$ packed form
9789g9754q6429M318o2803h9973a4463I4010a58954L7055r9101h8739j22567A91414
9776a18967N1471F0672a02274A69708D3013P8727a21607m26049a24495r6818k5299
9765b46612R4463D4622K16356b8598j79125B6362i3403G4022c24002a10971A32048
9753a64369N3212o515e8712k23399R9285N5119l60359n707G519Q482a35041p1746
9741b06787R4639B17570F0855f2011o3454j00039O1884m4626B4269e15763e0172
9729A02311d67371J46927J10305g2507q4409I0583R7770d0974D4503P7438a03029
9717d57605d6144k91C26679j62136c270D3969Q4844F10a87981p0074H9995K4881
9705A14876O9274a41133H5774b08075R6142k56725c5191k1904E4354d9857F796
$$ plain form
9693 67339 167012 54721 -15878 3678 -5783 -26598 10615 -162399 149583 158168 -34702 -33477
9681 -33477 -26994 84644 2768 -98298 41313 -84715 -1346 -155566 72171 77051 -121333 170964
9668 13305 20778 -54504 -35554 143000 -27971 -475469 -20971 -33520 -129565 -214102 50759 -260128
9655 -267708 -2951 -255938 31024 -65252 -360896 -26653 -51912 188396 -10617 -127936 46436
9643 -23644 190969 -240786 -143946 52504 -272927 -23703 57058 16272 -317703 69028 -82844
9631 202008 -314199 87154 38588 -29849 -97282 -38207 -182556 -45660 -115830 -132876 -129556
9620 -129556 5376 35605 -168154 49886 2231 -170089 -109453 -74672 32129 163023 37991
9608 -99868 69535 175164 -182709 148094 17224 -238075 5593 80942 -240028 -56013 129625
$$ packed form
9693F7339R9673E4721a5878C678e783k0815A0615a62399A49583Q585c4702J225
9681c3477O483H4644B768i8298D1313h4715a346j54220G2171M880a21333A70964
9668A3305P473e4504J8950A43000b7971m47498b0971j2549r6045q4537E0759b60128
9655b67708b951k52987C1024f5252k95644b6653k5259A88396a0617j17319D6436
9643b3644A90969b40786R6840E2504b72927b3703E7058A6272c17703F9028h2844
9631B02008c14199H7154C8588b9849o7433c8207j44349d5660p0170j7046L320
9620a29556E376L0229a68154D9886B231a70089O0636L4781C2129J30894C7991
9608i9868F9535J05629a82709A48094A7224b38075E593P5349b40028e6013A29625
$$ plain form
9596 -448678 72016 -172986 321292 -79637 -89537 27109 -89317 68836 196963 -68759 154069
9584 -191925 233421 -246403 -66629 25738 9186 31755 -93631 -188858 -208604 -105117 -253033
9573 -253033 -33298 -354016 18622 -101995 92207 -17795 -102658 -165733 -10461 -268100 90114
9561 -227039 -163559 -290806 -224269 43115 -201458 -198556 -53463 -172976 -231097 265996 41300
9549 151113 -153099 82934 161944 -91642 -231992 -14667 131240 -74837 208306 -34127 30982
9537 -19483 -279096 73387 -140438 -237145 48349 -21774 -12284 23353 -128535 15255 13292 -94739
9524 -191856 -208488 -51835 -76494 -48242 -96322 225156 -157383 -43237 -13779 270280 -175841
9512 -111187 -173803 -20752 -26642 -59734 -47610 254977 8064 -183483 158790 -179260 -383867
$$ packed form
9596d48678G2016a72986C21292g9637r900B7109h9317F8836J28127f8759A54069
9584a91925B33421b46403f6629B5738I186K2569i3631r5227j9746J03487j47916
9573b53033c3298l20718A8622a01995I2207a7795q4863o3075a0461k57639I0114
9561b27039O3480j27247O6537D3115b01458K902e3463j19513n8121B65996D1300
9549A51113a53099H2934P9010i1642j40350a4667A31240g4837B08306c4127C0982
9537a9483k59613G3387a40438r6707D8349b1774R490B3353a28535A5255j963i4739
9524a91856j6632e1835k4659K8252m8080B25156a57383d3237a3779B70280a75841
9512a11187o2616b0752n890l3092J2124B54977H064a83483A58790a79260k04607
$$ plain form
9501 -383867 31779 -222152 -99147 -80646 7000 -314905 -232261 83068 -163857 -419231 16789
9489 252455 -117975 -197613 -233189 -49680 -126400 -105903 -165088 182187 -60963 9358 -183697
9477 -23858 -248215 136909 -154242 56472 -347122 -204386 -297138 108581 -51072 -16022 119777
9465 76923 235142 -380990 -41948 -132728 241758 276873 142626 23053 -181152 -211244 -393600
9454 -393600 -192154 94214 213137 -510 -508335 -46141 1514 -173486 4100 -99836 -60468 -129599
9442 -129599 -175227 -88293 -220611 55999 25312 -55056 -174327 -76382 -54302 -141512 323136
9430 -428221 -60784 -9806 -242724 254196 134457 -45381 -384929 -291199 219471 -33963 -152667
9419 -152667 -205638 -158744 -241916 -94333 -235244 123676 -275920 -564258 -118708 -184283 -80739
$$ packed form
9501c83867C1779b22152i9147J8501G000c14905Q2644H3068a63857k55374A6789
9489B52455a17975p9638l5576d9680p6720K0497n9185A82187f0963I358a83697
9477b3858k24357A36909a54242E6472c47122J42736r2752A08581e1072a6022A19777
9465G6923J58219c80990d1948r0780B41758L5115j34247B3053a81152l0092j82356
9454c93600a92154I4214J18923e10n07825d6141A514a73486D100i9836L9368o9131
9442a29599m5628Q6934j32318E5999B5312e5056j19271g6382K2080q7210C23136
9430d28221f0784i806k32918B54196j19739d5381l39548R3730B19471c3963j18704
9419a52667n2971M6894q3172i4333j40911A23676b75920k88338a18708o5575h0739
$$ plain form
9407 64172 -150979 -135633 -171818 -527912 -87898 249352 -38941 -87973 -52013 -367818 -104663
9395 -478176 210871 227386 -24042 -241181 -31509 -51306 289628 294334 -130676 -101970 -85848
9384 -85848 61203 43063 272794 -42918 46323 -26794 193296 -215530 -350402 103800 381102
9373 381102 40760 74401 31708 -172949 -122395 -105882 126860 -201788 48922 130070 -230368
9361 -36967 -58759 19032 33421 123763 -43828 120169 -272424 1979 -177474 -48738 -401361
9350 -401361 -98310 -160660 -311529 -5471 -119903 -160217 -102593 -52783 164485 31725 -284646
9338 -111844 -159555 -434901 -181690 217386 208928 -238045 -433897 -304627 -27740 -40353 -173724
9327 -173724 -55902 -190442 -143873 -135714 -61379 -438513 126274 -87809 -245728 -180693 223571
$$ packed form
9407F4172a50979J5346l6185l56094h7898B49352c8941m9032L5960l15805a04663
9395d78176B10871J6515b4042k17139c1509j9797B89628M706a30676K8706J6122
9384h5848F1203j8140K29731d2918D6323b6794A93296b15530j34872A03800K77302
9373C81102D0760L3641C1708a72949N0554J6513A26860b01788D8922Q1148b30368
9361c6967k1792A9032J4389R0342d3828A20169b72424A979a77474d8738l52623
9350d01361i8310o2350j50869e471j14432m0314N7624M9810A64485C1725b84646
9338a11844m7711k75346a81690B17386q458b38045j95852J29270b7740j2613j33371
9327a73724e5902j34540M6569Q159f1379l77134A26274h7809j57919O5035B23571
$$ plain form
9315 -199352 -93892 2423 -55406 -32945 -203139 172304 91038 -200007 191892 -96023 112542
9303 -21078 -219246 234434 -70845 -179453 124738 17641 -21931 13113 152851 -88044 -105335
9292 -105335 25459 -167416 109608 -183491 -4621 -248258 -380299 276128 80931 170249 70256
9280 -235940 -46910 151414 167244 69431 174372 -194340 -189440 -142061 -152293 -235980 -50686
9268 -118050 210369 20632 -167642 46374 37 -246433 -289735 -193234 -265461 -70941 -229893
9257 -229893 132883 -82320 -16651 -245977 -119306 -22806 28679 -233389 29553 -151607 -29592
9245 -23131 -311192 -250257 222171 -254686 -12037 -95019 238701 -131370 -314188 -78727 77185
9233 -70405 -264274 -174185 -147270 -2712 -128748 87379 99754 248341 -206402 68041 9133
$$ packed form
9315a99352i3892B423e5406K2461j70194A72304q1266b00007A91892i6023A12542
9303b1078j98168B34434g0845j08608A24738A7641b1931A3113J39738h8044j7291
9292a05335B5459a67416A09608a83491d621k43637j32041B76128H0931Q9318G0256
9280b35940d6910A51414J5830F9431J04941a94340M900M7379j0232q3687e0686
9268a18050B10369B0632a67642D6374C7b46433m3302R6501p2227g0941j58952
9257b29893A32883h2320a6651k29326a19306b2806B8679b33389B9553a51607b9592
9245b3131k88061O0935B22171b54686a2037q2982B38701a31370j82818g8727G7185
9233g0405j93869R0089K6915b712j26036H7379J2375J48587b06402F8041I133
$$ plain form
9221 -188763 21025 -29690 -59824 30937 265761 -122716 -91110 -135659 52910 -142087 -205404
9210 -205404 5521 217387 -85898 -369490 36629 -48201 -231905 -205309 12420 -222166 -47514
9198 -27104 -233389 -3349 92432 67204 17191 272859 -78836 493201 -64673 97849 92548 -164754
9185 17242 11031 -13176 72304 -193243 -141193 86216 -19446 64026 -294864 -310291 61473 -42114
9172 336621 227202 -68565 11775 -70340 -102683 -199033 -126072 -25616 264849 -26338 190957
9160 -60216 -99693 66471 90175 217127 152277 208509 58261 -41775 99580 -23478 -146432
9149 -146432 -209370 210186 219309 -80077 -99595 86008 -158528 12753 131581 -209747 14947
9137 -12145 10959 -28392 8672 -107231 -228494 -99117 -116724 -93210 -180951 61021 -296507
$$ packed form
9221a88763B1025b9690l0134C0937K34824a22716L1606m4549E2910a42087o3317
9210b05404E521K11866h5898k83592C6629d8201j83704K6596A2420b22166d7514
9198b7104k06285c349I2432k5228A7191K55668g8836D93201f4673I7849n301a64754
9185A7242o211a3176G2304a93243N2050H6216a9446F4026b94864j5427F1473d2114
9172C36621j09419f8565A1775g0340l2343r6350P2961b5616B64849b6338A90957
9160f0216l9477F6471K3704J26952o4850N6232E8261d1775I9580b3478j22954
9149a46432o2938B10186R123h0077j9518H6008a58528A2753J18828b09747A4947
9137a2145A0959b8392H672a07231j21263i9117j7607K3514q7741F1021b96507
$$ plain form
9125 111098 -359120 -14446 -263886 -70835 -156346 -38195 -156247 -133397 145342 2478 206558
9114 206558 148232 49711 81947 -74932 -31678 -124579 185882 322646 -110169 83832 -71001
9102 103960 -18154 940 -78833 -111323 -158998 -60857 26012 -37959 -464111 -15754 117707 -84672
9089 64009 -90319 -154234 32821 63870 -103860 -201655 234280 11013 -67796 57125 61417 8797
9076 -68254 5788 201538 -336827 -136591 -45988 -165368 -169258 -98055 -59211 -18671 216090
9064 -397770 -188262 155565 -506524 -169758 -220337 8468 -124106 -76559 -44269 -273143 -416512
9053 -416512 45021 154859 -2160 10778 22601 151421 160036 -32122 -162725 57513 -296578
9041 -302889 -502391 33481 -49276 -242332 -252994 -85225 -86737 -143866 15496 -405472 -83522
$$ packed form
9125A11098c59120a4446k49440g0835q5511c8195j18052K2850A45342B478K04080
9114B06558n8326D9711L2236g4932c1678r2901A85882J36764a10169H3832g1001
9102A03960a8154I40g8833l2490m7675f0857B6012c7959m26152a5754A17707h4672
9089F4009i0319o3915C2821L1049a03860r7795B34280A1013f7796E7125M292H797
9076f8254E788J95750c36827a36591d5988j19380l890P1203L8844a8671B16090
9064c97770a88262A55565e06524a69758n0579H468a24106M7547L2290k28874j43369
9053d16512D5021J09838b160A0778J1823J28820Q615c2122j30603E7513b96578
9041c02889j99502C3481d9276j93056j0662h5225j512n7129A5496d05472h3522
$$ plain form
9029 -32145 -185588 -57759 -107802 -107450 -159261 -163770 8219 -66359 -614 299707 -63075 16667 -156669
9015 27814 -118331 57782 38736 12844 10388 -47488 64702 172271 -125323 282268 45950
9003 -235919 -230103 248097 135062 -46859 -90455 -202813 -136661 146237 77069 -141954 -83637
8992 -83637 -234614 15002 -102687 -16218 -300684 -132226 -53441 125004 100536 -345508 -167483
8980 -73106 8031 34575 -200994 89993 48693 66406 -229627 -258182 -164423 -98431 -33153 37405
8967 172342 -152200 -294849 137965 -321367 -305409 -214205 -195207 -104017 94623 -414522 -217018
8956 -217018 -261608 -108420 -96137 159226 -230668 66692 213456 51467 27098 1094 171436
8945 171436 105110 -77145 -333390 282378 -106182 4541 -91669 -308763 276982 49989 102778
$$ packed form
9029c2145j53443e7759n0043L52n1811m509H219f6359f14B99707f3075A6667a56669
9015B7814a18331E7782j9046A2844k456d7488F4702J07569a25323B82268D5950
9003b35919N816B48097j13035d6859m3596j12358O6152A46237o9168a41954N8317
8992h3637j50977A5002a02687a6218k84466a32226e3441A25004k4468c45508a67483
8980g3106H031K6544b00994H9993m1300J7713b29627k8555R3759O5992c3153C7405
8967A72342a52200j42649A37965c21367J5958R1204J8998R1190I4623d14522J97504
8956b17018m4590a08420J2283A59226b30668F6692J46764E1467k4369A094J70342
8945A71436o6326g7145k56245B82378a06182D541i1669k17094B76982D9989N2789
$$ plain form
8934 102778 -294248 75783 -69527 -445491 -233492 -5017 320396 650 -319141 -141530 -238686
8923 -238686 148848 59440 -256031 -45631 -12251 -95943 54939 677018 883533 195591 -123229
8911 109318 -140878 -242486 116755 157764 -148116 71876 250317 127028 202172 -178670
8900 -200855 -282420 -112109 -166628 -3403 -103651 157007 85874 -29548 -15776 -296147 -90055
8888 178874 -27170 95418 -386554 -11852 -475483 113771 48735 -19288 -181746 -21548 -188284
8877 -188284 210472 -5582 166854 -97014 18688 -103603 124403 -13841 -76412 -22369 69703
8865 -187254 -204014 -30472 91155 -60572 -204042 131282 192910 78795 153128 244473 -30259
8853 28834 76818 23172 64040 -340892 -168074 37495 232040 -170076 -334974 -137440 128626
$$ packed form
8934A02778b94248G5783f9527l75964K11999e017C20396F50c19141a41530r7156
8923b38686A48848E9440b56031d5631a2251q3692E4939O22079K06515A95591a23229
8911A09318a40878j01608A16755M1009a48116G1876J78441j23289P5144a78670
8900b00855q1565a12109n4519c403j00248A57007p1133b9548J3772k80371i0055
8888A78874b7170I5418c86554a1852m63631A13771D8735a9288j62458b1548j66736
8877a88284B10472e582A66854i7014A8688a03603A24403a3841o2571b2369F9703
8865a87254j6760c0472I1155f0572j43470A31282O1628G8795P4333R1345c0259
8853B8834M7984B3172M0868c40892a68074C7495J94545a70076j64898a37440A28626
$$ plain form
8841 39469 59043 -408665 76554 64571 34401 -373908 -91619 -13756 115128 46554 -67944
8829 -29105 74061 -42231 10340 -99863 315753 9538 -72111 -76052 48232 -23499 -121178 -243175
$$ packed form
8841C9469J9574d08665G6554j1983l0170c73908i1619a3756A15128D6554f7944
8829b9105G4061d2231A0340i9863C15753I538g2111l941D8232b3499r7679j21997
$$ [...]
##END NTUPLES=NMR SPECTRUM
##END=
