##TITLE=NES1031_Conilon_9266930_AQFG5NnhPy
##JCAMPDX= 6.0         $$ Bruker NMR JCAMP-DX V2.0
##DATA TYPE= NMR SPECTRUM
##DATA CLASS= NTUPLES
##ORIGIN= BRUKER
##OWNER= Administrator
$$ 1.72 TOPSPIN		Version 2.1
$$ 2015-08-24 18:38:35.139 -0700  Administrator@X
$$ Compression mode = diff/dup
##.OBSERVE FREQUENCY= 400.02188249412
##.OBSERVE NUCLEUS= ^1H
##.ACQUISITION MODE= SIMULTANEOUS (DQD)
##.ACQUISITION SCHEME= undefined
##.AVERAGES= 8
##.DIGITISER RES= 22
##SPECTROMETER/DATA SYSTEM= spect
##.PULSE SEQUENCE= zg30
##.SOLVENT NAME= COFFEE_meoh
##.SHIFT REFERENCE= INTERNAL, COFFEE_meoh, 1, 14.98509
##AUDIT TRAIL= $$ (NUMBER, WHEN, WHO, WHERE, PROCESS, VERSION, WHAT)
$$ ##TITLE= Audit trail, TOPSPIN		Version 2.1
$$ ##JCAMPDX= 5.01
$$ ##ORIGIN= Bruker BioSpin GmbH
$$ ##OWNER= Administrator
$$ $$ E:\/data/COFFEE/nmr/NES1031_Conilon_9266930_AQFG5NnhPy/20/pdata/1/auditp.txt
$$ ##AUDIT TRAIL=  $$ (NUMBER, WHEN, WHO, WHERE, PROCESS, VERSION, WHAT)
(   1,<2015-08-24 18:38:27.639 -0700>,<Administrator>,<X>,<go>,<TOPSPIN 2.1>,
      <created by zg
	started at 2015-08-24 18:37:21.217 -0700,
	POWCHK enabled, PULCHK disabled,
       configuration hash MD5:
       21 0F 79 D6 B3 7B B4 F6 88 20 88 DB 03 48 BD 9F
       data hash MD5: 64K
       66 0C 06 41 33 3C 12 45 9A 5B 6C F4 E7 A5 FF 98>)
(   2,<2015-08-24 18:38:31.014 -0700>,<Administrator>,<X>,<proc1d>,<TOPSPIN 2.1>,
      <Start of raw data processing
       efp LB = 0 FT_mod = 6 PKNL = 1 PHC0 = 0 PHC1 = 0 SI = 32K 
       data hash MD5: 32K
       0C 27 28 F5 CA 93 6A 54 B3 2B 2D 0B 9C 4F 3B F9>)
(   3,<2015-08-24 18:38:31.311 -0700>,<Administrator>,<X>,<proc1d>,<TOPSPIN 2.1>,
      <pk PHC0 = 90.1593 PHC1 = 0 
       data hash MD5: 32K
       76 FD 8B 80 00 E4 12 E3 48 3F D0 4E 88 2A 2E D4>)
(   4,<2015-08-24 18:38:31.420 -0700>,<Administrator>,<X>,<proc1d>,<TOPSPIN 2.1>,
      <abs ABSG = 1 
       data hash MD5: 32K
       D1 C7 FA 19 9E 04 11 19 F7 1D 98 95 EA 8E 68 0F>)
(   5,<2015-08-24 18:38:31.483 -0700>,<Administrator>,<X>,<proc1d>,<TOPSPIN 2.1>,
      <abs ABSG = 2 
       data hash MD5: 32K
       55 34 D9 8B 21 85 8B D3 7A 5B 42 B7 51 B2 F4 8E>)
(   6,<2015-08-24 18:38:31.545 -0700>,<Administrator>,<X>,<proc1d>,<TOPSPIN 2.1>,
      <abs ABSG = 3 
       data hash MD5: 32K
       D0 C6 6C 8C 31 82 D2 96 34 E6 96 FB 27 32 61 DA>)
(   7,<2015-08-24 18:38:31.592 -0700>,<Administrator>,<X>,<proc1d>,<TOPSPIN 2.1>,
      <abs ABSG = 4 
       data hash MD5: 32K
       32 17 0D 7E 06 66 FA F3 F7 24 C2 6C 1C 65 E8 88>)
(   8,<2015-08-24 18:38:31.655 -0700>,<Administrator>,<X>,<proc1d>,<TOPSPIN 2.1>,
      <abs ABSG = 5 
       data hash MD5: 32K
       4F 9D 5F E1 B3 BC 5E 46 C9 10 B6 E2 72 39 A2 1E>)
$$ ##END=
$$ 
$$ $$ hash MD5
$$ $$ E7 B4 0E 5E D6 F6 5D D4 AA 8D 8A BF 1A 2E C4 8E
##$RELAX= 
##$RELAX= 
##$RELAX= 
##$RELAX= 
##$RELAX= 
##$RELAX= 
##$RELAX= 
$$ Bruker specific parameters
$$ --------------------------
##$DU= <E:\>
##$EXPNO= 20
##$NAME= <NES1031_Conilon_9266930_AQFG5NnhPy>
$$ [...]
150 150 150 150 150 150 150 150
##$TP07= 0
##$TPNAME0= <>
##$TPNAME1= <>
##$TPNAME2= <>
##$TPNAME3= <>
##$TPNAME4= <>
##$TPNAME5= <>
##$TPNAME6= <>
##$TPNAME7= <>
##$TPOAL= (0..7)
0.5 0.5 0.5 0.5 0.5 0.5 0.5 0.5
##$TPOFFS= (0..7)
0 0 0 0 0 0 0 0
##$TUNHIN= 0
##$TUNHOUT= 0
##$TUNXOUT= 0
##$USERA1= <user>
##$USERA2= <user>
##$USERA3= <user>
##$USERA4= <user>
##$USERA5= <user>
##$V9= 5
##$VALIST= <valist>
##$VCLIST= <CCCCCCCCCCCCCCC>
##$VD= 0
##$VDLIST= <DDDDDDDDDDDDDDD>
##$VPLIST= <PPPPPPPPPPPPPPP>
##$VTLIST= <TTTTTTTTTTTTTTT>
##$WBST= 2048
##$WBSW= 25
##$XGAIN= (0..3)
0 0 0 0
##$XL= 0
##$YL= 0
##$YMAX_a= 605509
##$YMIN_a= -504631
##$ZGOPTNS= <>
##$ZL1= 120
##$ZL2= 120
##$ZL3= 120
##$ZL4= 120
##$ABSF1= 14.98509
##$ABSF2= -5.573092
##$ABSG= 5
##$ABSL= 3
##$ALPHA= 0
##$AQORDER= 0
##$ASSFAC= 0
##$ASSFACI= 0
##$ASSFACX= 0
##$ASSWID= 0
##$AUNMP= <proc_prof1d_extract_pilot.lims>
##$AXLEFT= 0
##$AXNAME= <>
##$AXNUC= <1H>
##$AXRIGHT= 0
##$AXTYPE= 0
##$AXUNIT= <>
##$AZFE= 0.1
##$AZFW= 0.1
##$BCFW= 0
##$BC_mod= 0
##$BYTORDP= 0
##$COROFFS= 0
##$CY= 15
##$DATMOD= 1
##$DC= 0
##$DFILT= <>
##$DTYPP= 0
##$F1P= 0
##$F2P= 0
##$FCOR= 0.5
##$FTSIZE= 32768
##$FT_mod= 6
##$GAMMA= 0
##$GB= 0
##$INTBC= 1
##$INTSCL= 1
##$ISEN= 128
##$LB= 0
##$LEV0= 0
##$LPBIN= 0
##$MAXI= 10000
##$MC2= 0
##$MEAN= 0
##$ME_mod= 0
##$MI= 0
##$NCOEF= 0
##$NC_proc= -8
##$NLEV= 6
##$NOISF1= 0
##$NOISF2= 0
##$NSP= 0
##$NTH_PI= 0
##$NZP= 0
##$OFFSET= 14.98509
##$PC= 1
##$PHC0= 90.1593
##$PHC1= 0
##$PH_mod= 1
##$PKNL= yes
##$PPARMOD= 0
##$PPDIAG= 0
##$PPIPTYP= 0
##$PPMPNUM= 2147483647
##$PPRESOL= 1
##$PSCAL= 4
##$PSIGN= 0
##$PYNMP= <proc.py>
##$REVERSE= no
##$SF= 400.02
##$SI= 32768
##$SIGF1= 0
##$SIGF2= 0
##$SINO= 400
##$SIOLD= 32768
##$SPECTYP= <>
##$SREGLST= <1H.CDCl3>
##$SSB= 0
##$STSI= 32768
##$STSR= 0
##$SW_p= 8223.68421052631
##$SYMM= 0
##$S_DEV= 0
##$TDeff= 65536
##$TDoff= 0
##$TI= <>
##$TILT= no
##$TM1= 0
##$TM2= 0
##$TOPLEV= 0
##$USERP1= <user>
##$USERP2= <user>
##$USERP3= <user>
##$USERP4= <user>
##$USERP5= <user>
##$WDW= 1
##$XDIM= 32768
##$YMAX_p= 439469388
##$YMIN_p= -648188
##$CURPLOT= <Network HP LaserJet P1505>
##$CURPRIN= <$Network HP LaserJet P1505>
##$DFORMAT= <normdp>
##$LAYOUT= <+/1D_H.xwp>
##$LFORMAT= <normlp>
##$PFORMAT= <normpl>
##$SURQMSG= 1
$$ End of Bruker specific parameters
$$ ---------------------------------
##NTUPLES= NMR SPECTRUM
##VAR_NAME=  FREQUENCY,     SPECTRUM/REAL,   SPECTRUM/IMAG
##SYMBOL=    X,             R,               I
##VAR_TYPE=  INDEPENDENT,   DEPENDENT,       DEPENDENT
##VAR_FORM=  AFFN,          ASDF,            ASDF
##VAR_DIM=   32768,         32768,           32768
##UNITS=     HZ,            ARBITRARY UNITS, ARBITRARY UNITS
##FACTOR=    0.250966925370066, 1,           1
##FIRST=     8223.43324360094, -76404,       -126760
##LAST=      0,             -118223,         -55753
##MIN=       0,             -648188,         0
##MAX=       8223.43324360094, 439469388,    0
$$ Real data points
##PAGE= N=1
##DATA TABLE= (X++(R..R)), XYDATA
$$ [...]
23798 -221630 117630 -41022 11355 -59297 -539025 -121489 12289 -289013 -43360 -20008 -90476
23787 -90476 58119 228232 15357 -154918 -147029 -233249 -73286 -109609 -200278 -70761 150677
23775 -192725 -383887 274943 -73934 258769 -214013 -149060 123883 -177184 -9513 -284091
23765 -284091 128287 41214 36754 70793 -294250 -81701 131020 -43784 -57322 -127320 238135
23753 33129 127603 41222 166712 -28464 285554 -214762 166857 -151097 44305 -120094
23742 23999 -114868 14005 -132288 109494 -226704 151674 -274561 115516 -37759 -122622
23732 -122622 14909 149845 59706 -161047 281392 -416701 217584 62999 377396 180945
23721 -137090 143979 -160607 24070 -13521 74320 -75603 -396882 -317517 -31722 -107089 176293
23709 -144874 288702 285730 -125932 -83521 82537 6940 -79822 30632 -104986 35297 91805
23698 91805 19351 -49205 -313495 239260 -123663 4640 239097 124177 15128 -228976 147886
23686 123928 -48752 219606 -20239 53042 -184709 16093 -403565 232028 337786 -170342
23675 -70341 64517 122164 138884 1456 255236 10233 -142031 -44627 184683 -302876 -115695
23663 -21611 -155287 -23808 -267448 97036 -111730 53794 138577 245139 -186859 202010
23652 -218968 -3920 -250801 -211218 78631 6448 79415 74738 -176384 -81796 41752 -555383
23640 -144370 -221725 144862 -314326 -198657 -254681 -159005 9073 -97339 -139227 -132452 60068
23628 48470 -133316 56260 -79499 5428 38017 -125422 184587 -239897 71436 22004 261756
23617 261756 -19883 -317659 322207 -163532 -146512 11315 108181 -426448 -140894 -94191
23607 -94191 -194088 36323 -160933 -80937 -253821 65925 63533 -247465 -32032 -125216 16838
23595 -50906 166453 50489 -131539 75143 149215 -83600 285614 -26758 -245163 -50810 -91368
23584 -91368 -54072 -43045 196788 202001 223963 -13939 334248 70376 134205 306028 288720
23573 288720 452 70348 -59317 -118634 129737 43008 170230 112465 231116 -24173 -186536
23562 -186536 -84716 -214005 -133769 -180472 369996 -178990 179914 64080 -382627 -612318
23552 -612318 61081 -228755 -38499 220310 -395953 38602 19280 24085 123664 -85578 35196
23540 -33107 13530 -64897 -426913 -109875 -228332 -124849 60247 203836 195617 -208581 -175077
23529 -175077 -166798 -33341 439300 -388186 -43470 -48522 82048 -194691 -45809 19257 188065
23518 188065 -51364 227954 -6034 11727 -29041 -172569 -124869 -148151 -290878 46087 76316
23507 76316 264579 -10005 30651 -250474 -60115 -188314 -227186 -19318 95346 175529 157864
23496 157864 -339830 120385 151448 -10712 -139156 20689 -82878 113416 -148164 -134624
23486 -134624 -230452 -186118 -141034 -153922 -122148 64584 -25815 137688 -120849 -149704 -52168
23474 39735 -170854 -230163 -174257 216272 10808 -163360 -167657 132722 -90705 -144831 433973
23462 20272 79609 -174689 145119 124664 -193757 -200532 -95115 -26186 66970 -83464 -130814
23451 -130814 128478 -59125 189301 134454 -517227 -21195 -172620 -14329 -117283 -323022
23441 -323022 -122605 -118171 -204848 30815 -160000 36429 -30025 -115267 -48549 -175917 -2717
23429 96217 -14667 65720 -175033 198278 -81410 166063 -47757 -50109 11810 -108429 3674
23417 -157799 -52464 96190 307553 -233151 -19833 -167290 44437 -17706 211866 39855 -127007
23405 -601999 -4076 181180 -205465 -161593 110681 51375 115795 19616 198698 195847 -139871
23393 -28514 184304 -4095 118410 -23417 92657 21908 57779 -210415 86860 -138315 68679
23381 -5006 439450 145099 179391 107460 103858 153734 -351308 21949 -71317 -278231 67255
23369 -76764 -162726 31856 96515 183489 -124387 151527 73270 19638 212231 21510 -45596
23357 48475 -310141 -159465 44649 16862 -44357 29568 -100094 -63546 -60361 -80646 -110203
23346 -110203 315849 3884 87199 -330453 -40510 -181501 -246658 -86046 67021 -185754 24016
23334 -212540 176594 -374056 183471 -30170 -129769 116343 29860 -53665 -99764 -103545 25015
23322 -191362 48065 271741 -234218 118971 148580 -28727 279279 199668 -203408 -22868
23311 20197 313794 66133 -30501 174992 124997 -161409 225508 62594 317923 169370
23301 169370 -95767 -264940 17417 222832 -3485 -77598 -144342 -165219 -225835 139496 59273
23289 -178432 217993 157250 109956 -147577 -64973 -101869 103106 -8985 33991 -373785 71541
23277 168402 -30257 -140489 -5286 75 20655 160977 -21803 -123342 -135392 -180313 -151508 126975
23264 23881 -291714 -58646 207647 -36762 -35765 97336 -160975 -139798 -34478 12075 134094
23253 134094 -11658 45780 192716 -218491 139077 108480 -132673 -240086 -56396 -236666
23243 -236666 -144199 21278 175883 115967 26703 -46434 -32285 227681 -16021 110766 387463
23232 387463 19467 96514 30004 133787 209777 -138560 -99116 157564 -32756 -212404 63874
23220 -81537 3307 116181 -336314 -176338 68824 -125635 173265 -54975 -130105 -171247 131743
23208 93611 55394 61218 -110939 39587 -82740 -169512 -79408 -94489 231960 173373 -62504
23196 71036 -412502 63645 3327 -120004 -195061 38882 38530 31399 -314675 159707 -184228
23184 -512909 -233020 -240031 -62018 188065 70207 -290869 513455 -203721 93557 -105150
23173 3813 15986 -261426 -66332 90242 -102405 -36814 261715 -288832 -151971 36909 2927
23161 -44417 5457 -194304 216088 112336 -3208 143345 -48977 307492 133074 -172452 -81296
23149 229028 80679 -224824 -136235 144914 -150190 -189696 288732 -2223 -280448 357983
23138 86144 84311 -191421 -23219 -35194 -210019 19905 -145213 -132997 102789 102516 146465
23127 146465 -2404 129789 81763 164098 -199401 -202704 292689 -75447 300769 -117394 -5590
23115 -496110 -58353 141358 -88925 -36118 17537 219789 -129750 -236506 -269586 17545 -97390
23103 75102 142261 -198138 206163 116094 -120711 -331750 -93315 -281583 175960 -145777
23092 57160 -254292 -42413 -86764 -83686 -63497 61858 -112255 -43210 44705 219458 -59820
23080 -87427 -295362 92602 -115932 60520 143064 -72995 118682 139352 -20252 -83366 11923
23068 -217418 9253 80824 -160770 49243 -51719 6142 48570 -24704 -200283 -67070 -43714
23057 -43714 -65543 -42374 -46474 -34416 48388 43130 34322 -102885 -18585 322457 2888 178970
23045 178970 -12364 -12044 81604 -279062 -226070 -398102 144796 173299 90279 120497 -267319
23033 242077 277330 -202236 -197639 -134847 21193 -346310 142047 -250495 68212 -93250 385916
23021 95107 145941 -41327 -106523 -50324 -295060 -130782 -250974 -281801 101993 311929 -913
23009 436194 12219 -292035 54262 -68846 -96475 -230080 34152 39190 -213937 -151963 41758
22997 21229 90597 35292 257436 7004 21027 86278 266013 -20942 -41863 -14824 93233
22985 -55416 -38086 -135680 261787 -35707 229174 324623 112418 -15829 85744 248319 -24572
22973 -286646 -31980 -34305 179955 -124983 -145241 -147813 110721 -371480 -431491 -179298 -57100
22961 92221 -265915 39460 -200367 13680 73902 173770 309383 26533 -176992 -285959 -73944
22949 -305253 58760 -133479 -174 -219488 -346220 19108 -70509 141542 -242861 99651 236371
22938 236371 -101798 -59095 -32651 -189049 -27385 205771 113940 -113865 -58862 118641
22927 51545 155540 -94051 -83213 -46597 363444 110210 -93782 -100450 -165732 -226561 -58842
22915 -413909 88444 -241920 -57607 26563 -148536 -90867 379101 -33466 67753 13827 -3201
22903 -54291 117511 206479 139572 -189987 161763 -223657 148658 -128636 -120354 -51079 -105357
22892 -105357 -74868 1363 -46350 -182714 -327617 4467 112737 -14386 -33931 2404 55929
22881 55929 -12873 -295668 316856 96111 172274 -160308 -144075 -138822 -43859 99112 28232
22869 -274302 113965 -28194 -249168 132879 -33660 131788 -171124 -97334 -221267 -132950
22859 -132950 -100930 -215182 -172612 -200237 146883 3752 -273240 49704 60480 106617 -235382
22847 -58372 211582 42687 -227893 -152206 -48584 -74804 132447 -110763 -91265 -64189 167779
22835 115290 20203 -77309 216677 4130 106760 -259145 -137637 -109302 201591 5778 57241
22824 57241 161003 -124364 133048 41400 246881 -178057 -193797 -413223 -4479 -52046 93935
22812 -28730 97083 -188115 45121 -213040 -58982 120809 122210 139429 116907 88373 -41530
22800 -323711 -152469 52406 -175322 -151339 263928 -120186 -7694 -51304 84139 -206131 148110
22788 -89003 69639 41913 -179249 335126 185085 -219025 156127 147954 13047 -263582 334167
22776 -42466 -82861 -234883 412884 8894 69759 -249167 -364329 -65673 -228595 -63677 -245592
22765 -245592 82913 -50585 -189978 -117716 -91644 91718 -93544 -60827 -368258 -298133 -102205
22753 48517 -139326 37432 -199688 -132036 -32854 -41657 -97893 86984 -21964 267550 28574
22741 -82798 -225055 -72915 211417 -183545 -213874 -131759 -118350 284710 -293744 -155453
22731 -155453 -73998 -83486 -280875 66584 33863 -209951 -269309 60120 -219292 103660 -191339
22719 245469 42005 152849 194767 22719 -75962 106384 -134285 -151777 -81769 86621 -114282
22707 71559 149260 242771 -20479 -134850 45701 -97858 -76675 -157804 -162856 -246825 -153583 -139353
22695 -139353 -80365 157582 4830 -221282 -190009 -40514 -70663 -129426 -182868 -135412 -278191
22684 -278191 282862 -39621 -75568 -160406 -26821 215661 -124970 -219384 36551 -304891 191890
22672 71093 14216 57863 25728 -83054 -318402 52360 82902 -393694 -211189 -85728 -148283
22661 -148283 64259 95106 -249619 195537 -223631 -15736 216729 -325802 258317 -99952
22650 -92768 -300738 -356985 -92073 -30400 32198 59969 9333 180589 130971 100631 66641
22639 66641 72308 281140 88800 246172 45561 -157047 -7684 -100655 -29088 344677 -143912
22627 53575 212552 233502 -202269 -66229 -88246 57502 -337454 102911 117869 -154875 -27943
22615 75996 56679 87671 -57195 -85281 250744 124602 -140804 314923 -56668 -215271 1350
22603 -3269 -190891 -43028 363039 -202367 -170995 100205 -66025 -93937 -140539 -83647 155094
22591 -264362 148989 166900 -26401 -117222 -74484 26407 -84400 197214 -209561 -131257 -275015
22580 -275015 -159932 -160801 154202 -51807 -179559 -118251 -295965 -133227 -106176 257047 18684
22568 71086 -30444 -83194 137725 -174057 -359683 -14043 -76342 -2052 -258280 -112675 -104105
22557 -104105 -87233 59283 15677 -418261 77777 160258 85627 141836 177863 -261966 -349835
22546 -349835 -238099 -233530 70829 -78800 -8976 147880 -12230 -243020 -172577 42385 104171
22535 104171 13821 2162 328559 -65765 -83323 -138333 132656 -152182 -431549 397708 49068
22523 -104459 100249 224503 -298084 137190 145954 -47605 -12876 -123138 -240542 -105338
22512 77285 -152335 -28738 64019 152074 -52325 85181 199499 -177527 -57847 -519892 62752
22500 130967 60841 -197349 178545 -145106 -317904 -42665 75932 170485 266783 -72597 -330134
22489 -330134 -33584 148432 159247 -45213 -412828 -321321 -155344 -67019 86593 -156631 -106903
22478 -106903 -95271 156732 -121025 19460 65426 -202900 17337 -116287 -44917 -154056
22468 -154056 -110759 18854 -238578 -214370 412615 -160268 99056 195255 -187754 131856
22457 114929 -356564 155906 -337900 77615 -5045 -27830 176299 -284017 140194 -121660
22446 -142643 77371 261320 272698 -317920 11758 -63698 66651 -7298 85598 -80651 -204108
22435 -204108 79133 142041 -352710 -88579 48547 210141 -28707 100886 -42905 16303 15525
22424 15525 10607 174834 -21738 -257710 192939 64732 -59513 15565 175116 -4418 205846
22412 156963 -235638 -92161 -326635 125773 171217 -200259 -12482 180104 206032 -180606
22401 -115082 -350 -79072 207396 55608 -373871 -91467 -491804 -184343 310412 -164390 131202
22389 -25971 -212367 50839 333420 -103860 -44123 -51243 -171740 -241873 9419 35361 -80072
22377 89445 22905 240346 -144762 136191 33446 -109941 -429665 76754 -220871 -181461
22367 -181461 -146549 31944 -200610 42531 -43532 -271433 -269021 187689 19098 -301560 -75217
22355 -299053 -51984 -48295 -67330 -163000 6976 -24823 -169918 18439 26756 -93460 1968 -13145
22342 -77327 -177730 234481 -129230 -159976 -353166 203370 -174489 -392933 10095 -208721
22331 54302 278429 -228506 140106 26262 -237133 -14794 -60456 96026 -5397 -205340 141788
22319 -7979 264829 -224864 -17514 -39837 -8273 -29009 -20894 -342730 20100 -391374 34109
22307 -291595 12334 -65803 -90801 -62010 156164 -142885 -250294 166555 45306 -244987
22296 -152818 84688 -376659 192210 55214 -145666 -302114 109302 -87510 -106526 27642
22285 269263 -22151 -223976 -113383 215757 231333 -57763 -38564 14710 -150245 8365 -71487
22273 -175210 77014 -121579 -233975 -168974 48975 28755 -411897 -66354 189889 -74957 -24243
22261 13188 129451 61396 267344 -407494 -46969 -26597 -77608 -148200 313889 76677 103072
22250 103072 326156 83277 -58251 -384641 228512 -69025 -60415 4204 -378945 280185 95737
22238 -207243 202396 -9548 -223609 -29438 28528 -11964 167761 -17 -143224 -121979 -70128
22227 -70128 164006 -93654 25042 698 -415632 -240413 16978 -63052 2858 -118921 -111222 -187434
22215 -187434 117780 -20974 -25300 -231392 -113815 -292785 -30497 -38147 114709 -185719 -78839
22203 -381940 42602 267702 211429 -115067 -142738 7890 -221131 -141467 126531 52208 -9354
22191 -40539 109444 -191646 123924 162398 -216429 -191601 -96227 219991 266072 -86194 -22663
22179 -83672 -97111 116203 -282560 158615 -210530 -229866 -46801 -59034 -47226 74843 -104230
22167 46592 408494 -160878 -64688 -144948 -94264 385621 -112252 -125027 -151155 -5898 -155828
22156 -155828 -133451 167475 -421845 -63528 -90948 -120746 -57 59742 -190523 -65849 68865
22144 211185 113332 12715 -171643 -138402 -219941 189287 -264877 38747 -64010 -48704 -228335
22133 -228335 103002 13518 237010 8029 -191902 -50945 -113769 -20499 167867 -117195 85532
22121 -313866 -127247 62503 195614 56705 -466613 -358032 29720 163494 33548 -173627
22110 37892 -212239 343504 -58390 42444 -29868 472825 -172149 181102 52398 -123000
22099 -15243 -258849 -50572 153630 -195671 -30657 3680 85902 -324509 -217804 132105 174824
22088 174824 -148987 4326 -180663 145230 151985 -275382 60328 66907 -45435 244263 -551039
22076 -131418 280566 -239213 68365 -4291 -33385 -373733 77935 -47457 -182110 165469 -113921
22064 262303 21843 -400593 -48104 -359 -123178 -171695 -218046 -181632 -75103 -52663 -43086 195419
22051 -247028 339517 189266 113001 84904 -109041 278800 -115001 -85291 43210 -113071
22040 -138038 -80796 160011 -352842 -213553 -265125 104831 -77566 -111808 -95308 -164734 34
22028 -210474 -147504 -161314 -12787 62123 236904 112061 79896 32601 -436191 -62874 160118
22016 -151590 38414 -120236 66748 -257576 2078 112963 -195403 -131321 34273 351849 56106
22004 -153320 43714 153838 175346 5360 298728 -231465 -167210 254773 -309895 -7339 -138397
21993 -138397 97735 17369 6879 85738 -251320 -189916 -175693 -30277 -255918 114838 -10961
21981 126162 -30349 -332415 -29361 182778 -348914 -132479 -119869 -211339 4587 -380005 -199819
21970 -199819 35693 30868 -196335 -35054 115812 2365 -70132 199591 -114856 -440061 -28674
21958 -77582 -451982 -96523 38744 97306 6869 73675 119575 -89104 264816 157251 -54474
21946 61860 78040 -141945 -51332 77740 -198737 -185424 -46338 -197536 -350504 -201170 -1546
21934 146116 -287434 -63331 -46345 -136752 184364 125367 -66793 164211 -86884 89530 -54816
21922 -71846 135699 -16635 109495 -18855 46977 104732 -58946 -364771 -126347 -108603 14599
21910 -70828 80677 -63241 78261 42851 -83338 -148037 189186 62669 -52638 -160880 -352228
21899 -352228 -129507 -195166 113892 -35438 51117 236650 -9283 -90775 -368653 209778 13221
21887 44489 -61446 143021 -160320 -82587 111790 -265075 104182 104647 -271577 177820 307494
21876 307494 204598 -371744 77160 -98345 264841 -52321 -139938 46324 -121271 16261 -244080
21864 -181729 47255 -319447 -181652 26782 94611 289998 -202824 -190521 -253789 -20823 385863
21852 58386 63496 -195384 -292339 -45683 -176287 -156338 -321886 -140254 -83010 115156 175285
21841 175285 -368040 -204112 -208764 -121057 -64738 118063 -3203 99634 218931 68195 -19214
21829 64823 -287149 14673 110335 -4081 -210466 -120252 191205 333386 177654 -391660 -38977
21817 -14549 -41742 -54549 42949 -32654 -349686 51128 -66666 -117803 -142597 -73099 -209677
21806 -209677 -281378 -566467 129095 -91468 86932 143403 66519 -6665 16144 16530 -19365 -55330
21794 -55330 317194 -395408 253327 178045 -202400 15815 122235 -173294 -120812 -59352
21783 43177 16206 84577 23975 -28459 36605 111478 106171 -180095 -129680 219949 -62876
21771 169494 76404 -153279 -49712 85339 114967 157823 -90851 27472 -141317 -123593 -90291
21760 -90291 -225285 4142 78189 45080 66567 -342096 -162452 -200616 221236 -159746 358108
21748 46497 -160556 53992 -184613 335943 -85485 28697 -81479 -72096 -207805 219281 155971
21737 155971 83313 -96770 -172328 325290 81541 -228182 -213221 107735 7745 44322 225354
21726 225354 -134343 5149 232584 139971 200503 -14932 260341 45333 -148099 -153465 3191
21714 70551 -11829 -200790 -17170 -171821 323753 -187290 298363 -43175 -314294 56404
21703 -17121 -126945 -143345 -302760 -176329 -13519 1107 34337 -92611 -284450 -262593 303022
21691 125766 -77105 -71356 54494 190709 -12286 -305310 -261537 -75745 -97701 -120337 215060
21679 -51837 -181637 17667 -708 77315 -120904 98567 -312257 -169654 -147994 58951 49621
21668 49621 15807 -134626 -417706 -263277 96039 -65113 131338 -12930 200623 114387 -172866
21656 -366111 -312437 -285346 31113 -84972 125306 229086 230695 -96149 -328655 -56245 -141241
21645 -141241 -19659 -462389 -9562 -115475 15522 -329619 -66117 -121302 192549 -369528 215762
21633 -112207 96273 9605 -69839 -45472 -67050 163527 -252434 116318 28329 -291296 -33563
21621 -107881 -392468 -182150 -41678 -316239 -50372 167001 35315 -77367 -169722 -174987 -181515
21610 -181515 -204694 2102 -258178 -207133 -201343 129261 258412 -95758 60210 -15174 234650
21598 211556 -18442 -286510 8567 -310224 57875 76530 130264 -189918 -131153 -107764 -49459
21586 -141580 341971 48214 188013 -105546 -15916 -218415 -33584 -75115 257743 -197538
21575 -130180 -253879 -96560 66792 -138405 -157153 -235718 24141 104209 -88971 107208 -49965
21563 -682 352197 74075 -141323 -91861 -59693 -56017 93702 101453 -266626 -225038 200351 85243
21550 151521 113700 106965 -381186 183493 -459738 -307807 -238656 61293 12250 272250 -179148
21538 -15434 -66452 304077 -92088 -265960 -37015 -23644 187313 -255180 -141133 200396
21527 -27294 -171550 -39531 273148 -360870 -116227 96848 -259110 -5959 -176987 -352763
21517 -352763 19464 -69231 -5656 -158085 42083 -225421 -321323 -128552 -311307 -52104 -407446
21506 -407446 76752 239501 -190603 21075 108800 59127 -30208 -260490 115661 -52344 30409
21494 173219 37585 -234981 -90811 -194654 176957 43253 -113247 -21620 -261702 -172251
21484 -172251 26918 118609 -64415 -35005 -184492 -155028 -320752 358345 -122810 -180062 84811
21472 -56007 121477 139883 -41399 -59969 -95417 -60558 65378 64096 -112211 -60203 -65192 131318
21459 48664 -11081 -56484 349025 -83879 300157 150030 155868 6982 -38508 -354728 30133
21447 87927 7541 -42841 -140797 -338454 -184550 15229 -19649 208417 111790 98340 371084
21436 371084 470032 529496 852969 972508 677629 801071 424071 155205 105497 155828
21426 155828 -167262 -122282 -66671 -276038 -196107 -212628 -190321 9463 26070 -80118 -209262
21415 -209262 -43759 -241227 -139028 170424 -299245 -24267 120696 110389 5770 -90395 -332048
21404 -332048 -379304 -141076 -127528 -8696 -471100 -74402 -14412 -88990 36892 -94818 -195727
21393 -195727 48628 40588 -87738 101347 -401217 -177699 -249970 -161515 -373593 86448 16720
21381 -195875 196129 -40755 -406163 -126987 -230162 -79068 -23200 -364874 -3903 -162784
21371 -162784 -306843 -192833 -24728 -71299 -12245 -98873 -137689 178090 -222272 -257064 79447
21359 182220 -221119 -75541 -78354 -195273 72120 -17875 -118467 -429549 -184906 -207181 72236
21347 5950 -46961 -24117 -69965 83036 -59040 -176785 -117112 47098 8645 85609 85632 185908
21335 185908 -34174 -103323 49676 -11997 131444 -43036 -52658 -63047 -342914 37842 -217801
21323 -149125 -117002 -70265 16146 -209341 -92411 46803 -69197 -193951 -40339 213663 -249558
21311 -174905 60319 -377528 -33739 40550 -227992 -364938 -163237 225052 186733 -76241
21300 -249655 -114910 -150050 -148076 70443 -218917 107668 89331 27398 -179798 -258347 -407254
21289 -407254 34029 20081 -210620 -199088 99005 -53196 239456 58539 -53295 -312330 -73033
21277 -16240 281877 -71806 -111004 -152104 -185930 318814 -340651 181992 -181531 -235650 -10973
21265 92005 -359202 -306798 -7694 -178828 10294 -157303 23558 109003 -130313 -73483 1602
21253 4226 -75872 -345528 -191193 -78023 -155358 -6611 143665 -2014 13129 -156446 -91933
21242 -91933 118796 -131044 -5712 34501 71469 -462568 -56713 -204537 -54204 270366 -392130
21230 -108229 23694 29105 -62237 16956 65302 -112045 230321 -201959 -353731 -135521 -420217
21219 -420217 -102909 34153 -69006 6710 103382 -108043 49188 65302 50128 81571 -78544
21207 -9373 -141473 9158 -105431 -99580 -205794 -223744 139531 -70103 49994 122371 98915
21196 98915 185415 -103562 165266 -5966 264379 -272207 -111065 4747 38130 -29359 -202554
21185 -202554 -382359 137131 -191220 -28652 -76081 -256760 -304370 -35853 -92831 -179035 -39607
21173 -27206 -239726 198578 -26215 -315884 -108956 -79360 180703 52227 -293866 267637
21162 -197556 33416 -132968 121039 -194648 11624 -265427 -22132 -82861 -7432 -229633 155544
21150 258398 131967 273338 -1434 -245830 -396209 -211613 140059 483300 -115122 -51817
21139 -42535 -52108 -224064 -219905 -231727 -44049 -516326 89774 51311 110062 -290776 182249
21127 85743 12193 -192203 184735 -307558 -781 33474 -35430 -191433 180721 -110208 161518
21115 103862 -157729 -53769 266172 -75061 17428 3168 -349379 30001 85598 -231711 26531
21103 -254827 7814 -137443 141220 -118232 -196194 333641 37963 61233 -45438 57186 33582
21092 33582 340388 220793 -296073 -123389 233508 -201744 -60587 244171 -47497 -49734
21082 -49734 -201474 -33873 -149176 -283120 -221519 -272754 -53369 -16548 364704 -53287 -258237
21071 -258237 -344285 153834 83769 43699 -20359 -8976 57775 -56772 -490132 3419 -76044
21059 36657 -136841 -215424 -312154 185518 -65629 -50271 26677 117894 -222045 -89240 184502
21047 73357 164090 -164366 -45363 -10460 -87876 -70484 -96669 59350 124821 -21364 61988
21035 269990 75018 165622 139234 -41240 -156013 95391 -82830 32685 -103908 -29371 -31303
21024 -31303 15170 31096 -468154 206864 97898 -83347 -83842 144857 -129029 123944 -3188
21012 16904 64120 84607 13663 110171 50420 -290386 -130738 78562 153845 7678 -28642
21000 -10749 198579 136907 79473 -5759 267966 -53977 447022 -160484 117668 275462 -13607
20988 -234865 -246164 -235676 -68655 -303550 -258077 206754 -229141 -314067 -72455 -139780 -144995
20977 -144995 -64451 87613 93595 -386474 56677 -128546 17948 35498 -6769 220523 -91663
20965 -45385 -101628 -93179 243665 85375 -94985 -22633 -270989 -75796 205591 211973 -281490
20953 189261 108981 -50023 -175093 -271033 -128392 350724 334603 -88405 120840 -153670
20942 -53681 208515 -101799 -87659 -233946 58687 498834 -57518 128060 164270 89582 139968
20931 139968 195788 108695 -59200 16147 -10325 -15899 6394 49957 -156244 62860 15314 220157
20919 220157 -122515 -181041 130972 -138036 -173334 74362 -14003 -470514 -65906 -106812 166064
20907 -202870 -145465 -90427 -45336 -150993 276299 48287 258234 45094 -60025 163926 109436
20896 109436 465879 145963 9829 -210122 -102943 367293 -135742 -51234 152065 348105
20886 348105 88416 73446 -220146 -277616 -91262 -243414 220547 -117773 299326 -151719
20875 167105 215836 66419 224394 67987 113284 4970 -610921 -100185 -109590 105823 -38966
20863 107547 -65266 -20362 -278870 218659 -224293 -107891 -185909 4410 32270 -314889 17102
20851 3215 -108087 126238 128695 -2633 -110806 -84062 -35277 48926 -99355 -297963 -222097
20840 -222097 -208878 -144072 -281041 269157 -53030 -232929 -88070 68584 -178736 -75460 -417362
20829 -417362 20312 -16614 -5996 -85369 152616 -182605 46276 -184134 -110946 -16347 -141285
20818 -141285 -154081 -92 -31212 -445223 -327697 284031 -31478 -3924 77116 9084 10038 101382
20806 101382 -39530 -238061 25382 -170838 271349 51445 -331853 -300339 78954 -119839
20795 -86396 -313903 -192374 -142565 -119760 162525 -81528 -232280 55936 141355 200646 128016
20784 128016 -273979 236370 -275190 140753 -71134 -220432 -30912 -264999 -167435 -95362
20774 -95362 -311937 -362689 -250906 -420731 -265384 -286324 126282 -334039 -70124 -226813
20764 -226813 137351 212924 -142607 -134653 -314165 -309467 106517 -211280 -143564 -183907 100235
20752 -213405 415805 -19279 37336 128895 -179983 -15407 167796 -178844 128844 263504
20742 263504 129206 -212369 -303396 -103962 -415150 25364 -383381 -239145 -93441 -126124
20732 -126124 -283471 -121125 6463 -53053 -70106 219250 314303 -1758 -195865 54662 -223044
20720 -218613 -149919 48003 -220058 148130 -169786 46099 -37437 149970 116660 -79674 -14761
20708 -163798 51737 -108143 88928 41335 -344048 -293133 -270990 115171 94884 -122411 180403
20696 159317 -109178 -53906 -86536 -131098 13561 -138064 -119822 -164895 -127651 -40546 189888
20684 -199354 11846 89555 274680 -69049 -209185 -238794 52238 -103037 140750 -18304 -147437
20673 -147437 -230717 -64270 117505 -218116 137929 -297010 321194 -294382 -154117 16363
20662 -2236 -213271 188378 -154634 -103776 218371 309512 139200 -139014 300394 149246
20651 -174982 163739 94305 -52049 -178086 102198 -65032 17321 -110725 309139 -35494
20640 123587 5051 -471133 -12724 -212802 -55901 -44784 190780 -223508 -253516 -63774 208435
20628 -299303 37306 111482 70929 -116320 30078 27420 -102800 58861 283590 -74513 -26875
20616 -2495 145999 -208938 -300487 84264 130133 -247995 58268 -190123 43337 -14709 -31885
20605 -31885 152850 -164988 -96326 -207437 166442 245928 -15279 -43250 -314803 -289964 -72242
20593 37455 -213293 -258465 155916 -63892 -142757 -285568 -103505 -28477 -197441 10918 -96538
20581 -401107 80139 -53210 -80887 118058 -239515 -103616 142092 209193 -74632 120288
20570 -247111 -293965 -308972 -213377 44909 -146301 -65489 -291583 139401 206908 33411 46239
20559 46239 324098 -212575 -173107 -227794 150543 -120330 -543674 14723 83074 -155903
20548 3253 82107 -117247 8684 -60848 190045 -81337 -463984 102343 243445 -56752 -67677
20537 -67677 -226685 -38655 -27524 57717 -27671 200573 -286206 -89226 -338554 -381027 3848
20525 3695 -154303 -93049 149172 20027 -82192 42373 -71754 -161877 -36835 -185178 -80187
20513 -295462 158847 -224 -53998 77918 82116 136569 126042 133964 -36153 193281 -30024 -392824
20501 -392824 -210513 -630839 -93194 -211913 153533 -121823 -416897 -25590 -264540 80040
20490 -112497 -87818 -287382 -272829 13762 -230947 -126121 97151 52725 29362 -44418 48026
20478 -153319 8896 37478 -168779 34668 -142945 11278 104445 -18756 -360008 277123 104351
20466 -205312 -297963 156978 212092 86102 -94379 29679 31095 -33791 -259400 -200236 -102331
20455 -102331 -99027 -451467 177994 559145 19127 -437109 129514 -162437 157639 -315147
20444 -199296 -42564 107062 139045 -194155 -230188 -155501 51832 -141325 1536 126688 28979
20432 -97083 -226428 -221923 -12413 -93978 108533 -49003 -217834 -35295 -315110 -7322 -197424
20421 -197424 -253169 278548 14469 107577 -96587 -143693 -65048 -41782 -183245 -47961 75181
20409 -54502 32206 -49571 -188464 163199 -125309 -117977 62006 -201053 -272257 -182499 222807
20397 -132421 -257590 -57873 -180690 9037 -26134 82120 -69571 117738 -144584 51717 -78247
20385 -163259 248712 -221403 138611 -203788 -116141 -119942 -158543 17520 -311869 54121 82448
20374 82448 -160241 10992 115505 -425416 3560 109657 -417608 -185284 242276 115851
20363 198538 108472 8737 -236553 32097 100935 -174370 233302 -121753 -132251 201 199949
20352 199949 42894 221210 -110571 -164194 194463 -70056 12454 -12578 -35172 -63186 130898
20340 -146005 63217 -171202 289920 -243539 -204796 -116256 -41843 -180922 -133744 -187831 -207590
20329 -207590 -188970 -139026 18953 137741 204422 54702 -70446 -105247 200352 -37391 -28012
20318 -28012 -37402 -56113 53574 17728 -31210 -222699 21427 -184343 234336 -8723 -111560
20307 -111560 34535 -129298 82753 -283039 -184248 97129 -728 -174238 27005 449031 -170470
20295 189460 -101884 39351 -110170 -208294 77694 82750 -252365 -98051 -5256 -311837 -160267
20284 -160267 200424 -201272 -229399 4510 -192109 -204697 -102997 -98357 87292 -160874 305652
20272 -164867 -69021 -21575 103339 -65429 -87604 -324788 -33673 -139648 -115553 -145437 -83451
20261 -83451 -292341 -337993 201780 380513 -285872 -126697 -363967 296806 107734 92500
20251 92500 -31713 -25162 -97308 -114195 -200493 -223140 -173 -160892 -171547 -362642 -70274 -190660
20239 -190660 -240201 77224 -241680 -146256 20041 102006 49901 -34319 -60442 -287852 103912
20227 33958 -100007 -168905 29838 -277267 126583 -255538 -135685 60793 -29453 -83050 -205940
20216 -205940 95894 -6139 -175109 -58436 -80981 27118 68885 -65151 -182261 -21247 9854
20204 71067 -185431 -177921 -293422 89984 -108278 -167542 -78763 -47696 -124289 234212 -169052
20192 -163073 110114 39967 34916 45575 -54634 48707 -173743 62045 -89376 -107854 -203202
20181 -203202 -93158 -62447 68397 86239 -176999 -94583 18986 29237 -110364 -27694 -57042
20170 -57042 -262029 -225279 -230327 -131567 296083 192237 39882 67151 -286226 196830 -86306
20158 56865 -23122 11770 -189748 130596 -84558 -120576 -77787 -72197 -165219 51485 -98161
20146 136326 -181846 234997 77496 185629 29789 321035 191133 137787 146728 163028 100787
20135 100787 555829 242935 204351 291241 73749 -123939 -203826 -40314 -48050 -88310 -144411
20124 -144411 -275087 -8560 -64038 -399511 -190937 -281849 243920 -183534 52250 258690
20114 258690 259187 117876 75830 90591 55424 173843 -299926 213068 94161 103747 13172
20102 -533411 -141008 -289814 -10232 -65429 62433 -41229 209396 -60949 -94191 114819 106163
20091 106163 -232940 -60922 325593 -83421 -280082 -85411 76274 -70194 -330436 30664 8761
20079 -137633 -128516 228722 -43366 -115427 367946 -223632 86262 -110874 -290450 -137803
20068 120224 106305 -132614 220705 209730 100512 -162579 -161762 -116049 -168532 -77325 141822
20056 -186850 194997 92975 -2128 -125375 45077 95867 -221811 -38545 -253703 16425 -177231
20044 35203 -488610 -63554 -262867 -221215 65842 70138 315049 -32675 179161 -194828 -267308
20033 -267308 122132 21101 -99001 62498 -62778 -97229 -37702 -17780 -55132 -167905 -300940
20022 -300940 108801 8612 -3450 98447 6647 -240221 -135552 -3619 152206 6510 214957
20011 214957 -245343 269727 -328781 -216280 161373 -233916 -90762 -279767 48319 -356634
20000 -185522 31099 6125 34607 -86658 -56859 -292476 -82461 -148659 240665 -179142 13995
19988 -47349 -56197 107774 5321 -85626 549625 -179336 119962 -9176 142221 255229 -116369
19976 -30939 -37647 130967 164347 -80913 85960 23646 51123 41953 -135593 17400 -180377
19964 66483 -119301 -116426 -32437 75579 -96725 -65523 -201896 214719 403981 45829 -42273
19952 128561 145230 74655 107504 -37314 134621 -220162 250415 113875 -44432 170758
19941 -89936 -116545 -77448 81963 -121644 -26469 -75011 82166 219175 -144611 -40695 -270168
19930 -270168 -192017 -174450 -202128 -110749 124868 -145960 34668 -99602 205346 33262 -304104
19918 164799 9094 -172802 -64321 59015 295208 68951 81414 95225 -123186 -184703 -58174
19906 -166788 113225 -146912 -199957 -151781 -105202 -277806 94041 -134915 -180147 -22328 111082
19894 -278723 -412604 -29589 -117455 146537 218814 33887 5330 -387145 -120567 -261136 -521906
19883 -521906 -179647 -425174 -34650 -197990 72384 112746 -92975 -219445 -65754 22672 24330
19872 24330 217354 -208672 -88150 163739 -118629 -180419 47948 193826 -5995 -10384 -5820
19861 -5820 -136632 -338971 21898 152944 -22807 -257707 142049 -193130 319685 -4535 41001
19849 -139270 -38247 -68719 -110857 -191566 -96498 84606 -136713 -64233 -229903 198449 -51330
19837 55659 -186720 -200489 -799 560365 -35199 -375314 -133346 -148381 -172441 -258894 398208
19825 -136428 -59414 -50771 -122283 -104535 -256669 -37784 313873 -120465 -163201 -65920 431845
19813 -314835 160630 -21534 13634 -46810 -297619 -30155 -284114 -29891 174459 27954 11540
19801 -114375 15361 -493935 18591 -110101 -53199 141301 -94248 93891 -129900 -62115 92085
19789 -106759 -306281 317729 59841 -94763 -225585 -77757 -160873 92781 2517 -57183 95959
19777 -312989 -198797 150567 -320556 -3679 -233537 84101 -69626 41778 -138271 -5400 -225999
19766 -225999 -96775 -87502 237970 82376 -223199 -114687 21752 -29970 -172181 -66625 -22268
19754 19113 -156486 171682 -5221 94019 -139925 -393532 -161390 -110724 47441 235939 125198
19743 125198 -87610 -174040 569691 126056 -148840 325935 -176141 -322239 -530925 -123000
19732 177864 185037 18600 96057 306986 155026 418235 332482 381040 83644 -116653 99100
19720 -208597 335579 -91705 136700 229569 -325688 409747 -86595 78327 43347 109971 54910
19708 169767 211209 49197 -226396 -40908 255799 13654 -141736 3450 180907 322967 -140658
19696 97688 61242 333261 102052 -99885 316694 244029 19343 174749 117565 -128632 -7733
19684 -112111 -11081 -128247 7723 -245630 -134376 87147 205526 96772 248462 201775 -145640
19672 -148179 -28889 -201656 -116417 -46232 -27235 88592 -122993 -288140 55812 761 -231295
19660 -8245 -151358 151141 -110264 -272870 -222496 -127400 -126275 -167138 -164655 19172 -371608
19648 -120061 35528 -187157 -34878 24896 152163 -195135 -111757 -282637 144434 -7664 -415877
19637 -415877 -66153 47940 -17531 160420 243936 110500 -73675 -9324 -128563 -385152 -296482
19626 -296482 -174434 73554 15494 323145 -280506 54111 -216855 -383792 -305286 167414
19615 177158 -91432 -107933 -61451 -80826 11941 -58423 10498 -96167 76887 -209034 85811
19603 -120584 -245714 -125487 -108910 10521 71909 89995 -215004 -231188 -552952 -252579
19592 -52640 71427 77230 -105885 -129170 -115143 -294754 97079 -48541 -85591 -73343 -264478
19581 -264478 -58431 595 94082 212083 -233079 -135826 -196721 -48440 -184855 -307167 263091
19569 -97739 207888 -91684 -41510 -407233 -214977 -302432 -166668 -282101 -237084 -320556 19832
19557 -98275 337654 -90097 -267262 -64911 384360 -395667 -359652 -124595 -92603 -17911 -102895
19546 -102895 30219 -105860 -17324 -154737 -139015 35539 52041 -251753 38179 1610 39694
19535 39694 -138089 -262202 22099 -84235 58371 13103 286051 183917 -218446 -350822
19525 -350822 -224906 -171206 274916 -238914 -15554 13798 -135601 -211412 -387132 -50519
19514 -292572 -51216 931 -4742 -233653 72699 75516 18377 -184961 -53902 81170 70128 -216287
19501 101614 106582 -94307 -130394 1365 -110308 -118271 144447 415 -188777 -287135 207238 -207584
19488 -147113 -49559 160020 47712 51790 -205575 -138883 -210122 -196162 -47342 -156446 -74731
19476 69271 -90538 152726 -160920 -365963 -119643 -48515 373160 51375 -267306 -69118
19465 -61296 -112761 -370521 -26973 -199577 270266 -93902 15490 -103197 48794 146063 346261
19454 346261 -208527 111829 7720 -46435 65707 299083 -235906 152690 -246051 -90116
19443 165191 -83496 -205185 -73681 -410461 117963 -210252 369601 -131474 -1319 -24952
19433 -24952 -170061 33111 -150460 -190404 107869 52411 167679 -51019 72353 -109431 28483
19421 256711 -422715 -155240 96960 -231009 8318 -340157 77479 -8637 87409 -108279 66031
19409 -153223 -223442 44086 -67410 -234565 -79966 182190 -382756 65131 42297 -104320 35346
19397 -89952 212868 -89957 111858 77417 -21961 145376 -35372 -63493 -135257 52752 220927
19386 220927 -75190 -230692 -352549 -25493 -38144 -445803 -201854 -80742 -150606 122007
19375 -90085 -165288 -38778 -145630 -255798 96102 -136698 32356 -35200 95916 -145996 -245870
19364 -245870 -242906 -193302 80253 -70953 -146900 -357626 -28514 -169779 -232330 314411 113871
19352 309421 -195176 11370 -115780 20927 -124537 36901 -2206 -22797 160351 -41623 -64324
19341 -64324 -14138 -271194 -76102 -151005 55277 -316214 -23794 -273694 10769 -125882 -176219
19330 -176219 202085 40447 -197521 -20205 -60468 -219380 -115158 -240938 -35257 -176202
19320 -176202 -81459 73911 90773 -24483 -502479 -271436 -356182 126521 -96729 14712 -364056
19308 266374 -178757 -247817 77687 -91469 274007 -220427 -155579 -313619 30904 -39405 -36217
19297 -36217 52853 145026 -48194 -347136 233180 11887 -308141 -285907 -147670 20988 -151957
19285 -265093 -95042 -46333 274074 -297642 216649 -152133 -44014 -263146 132414 -60932
19274 236027 -7034 2204 -78986 -255844 -99162 -89541 -12902 26091 -139882 -296075 167270
19262 -207985 -160596 -282276 -175599 86801 -38440 74589 41026 89641 27270 60954 -62400
19250 230382 -142217 -52502 -206136 -93354 -70104 -343731 -275887 -63053 -54233 -84085 151331
19238 -199508 53294 -150192 -153217 -60831 105260 89643 -182682 -275323 -143239 106959 192751
19227 192751 -168818 -82616 -60379 113713 -4992 -327598 -21373 99801 133279 112532 -173197
19215 45689 -48742 -152145 134844 -120797 181197 23593 -44596 -35114 85779 205887 59750
19203 69898 44805 -235110 227279 -170295 183273 -223899 32108 -157195 174472 -80631
19192 -119282 -198008 -320033 -319757 -3613 -157658 30280 -39865 230760 -63396 -42011 69109
19180 -77735 -274286 165112 373817 50607 -368951 -240808 -36071 -107543 -112034 186270 -276428
19168 -127980 -9627 -316846 -355776 25064 138570 -78056 -298327 -255464 320693 -170658 -62295
19156 -164576 45132 78441 -27409 52648 -225337 -98442 329348 -58307 155172 1909 156720
19145 156720 180181 19403 -46517 -110537 -318815 -254162 -90452 -139303 -31654 -116628 -210200
19134 -210200 291672 -144677 89 169780 -319256 -69479 -345574 -205683 -46452 315406 -81591
19122 -96482 95969 -254994 157551 67077 -11055 100738 172874 -274385 -158237 -357012
19112 -357012 154789 79861 -80012 80779 110196 330650 -248360 -103939 163472 -91358
19101 -242730 -317387 28193 144869 -145356 -300624 -159179 -152719 58579 -129412 -152630 130165
19089 -57769 3193 -156154 -316223 163007 -99486 86124 -226860 182609 159310 130364 -80810
19077 -374899 -197650 -103987 -26734 -210287 29188 -49002 141349 -189686 -82045 -301857
19067 -301857 -85277 -25160 -185625 -92068 -3517 20511 -215673 -86659 197414 -68524 170991
19055 55537 67762 -279054 -33947 -57635 156819 34978 6280 -347696 -163454 -402406 -3123
19043 201760 -10041 -131821 -154039 -143826 48026 73059 -26411 -279382 -211336 157102 -247807
19031 105860 -122997 59139 -225254 -172932 101083 234469 288738 -409393 80226 -249567
19020 -280372 -341174 -114540 -345584 -226008 53239 58589 96164 135916 64511 -240818 117416
19008 149824 -241110 -100105 -36658 75141 -120154 149876 -60089 -134205 146035 -30600
18997 -282246 77618 124811 181472 65483 116929 -129027 3793 -4726 112278 -383187 168049
18985 3882 70952 -263902 48602 -183919 -143950 81572 -111183 -348394 56543 -86146 82521
18973 -55671 121060 -80801 -66284 115394 97623 194580 -196495 -118419 75072 -82960 566417
18961 47468 614799 -30670 399368 34443 -50427 -3654 -217674 -42596 -76725 12317 -254776
18949 -188533 36851 -272939 199235 -242309 -213884 88475 -294866 106658 261766 -135880
18938 -63298 -272119 -101191 85063 -64841 -75593 88592 54565 -55606 204211 382 -115859
18926 -229184 9759 3622 -114001 -98629 -134593 -40227 -149271 51684 -26819 255211 257082
18915 257082 13344 -264382 -165886 -247709 62443 -171895 124344 8075 78941 -155034 -27298
18903 66037 -63450 -256405 110815 296489 317542 -245383 213544 73103 77747 -97656 -167325
18892 -167325 46536 -90825 -7906 -108393 313823 -220836 -248580 38315 209211 -305330 169321
18880 -258218 238354 -305170 -207039 -22058 147219 156795 -304614 -143241 -264067 -114634
18869 -110627 -195260 10653 -189975 145825 237022 -22156 -293741 -24863 -34702 4450 21777
18858 21777 -132249 79383 -229947 -64129 -272139 -57849 218763 -48281 -41611 -219202 -30653
18846 23145 82491 -231930 134507 -131246 -78724 -45699 51767 -201518 -173368 -313945 -112395
18834 -255797 -104774 86249 -7230 -129636 -424823 -182955 -105349 -133712 17379 -125925 -75918
18823 -75918 -297869 24109 -159212 -132539 -110604 38116 -418377 88851 -71579 -199409 12647
18811 46212 -1995 139986 17501 28528 33998 -21126 103699 -157937 -113684 115236 174724
18800 174724 277067 110543 83284 -42737 -38379 -106397 -198952 -136250 -232076 -2780 -124034
18789 -124034 -41679 51097 -57427 -224718 -217045 -189833 -174934 257091 36918 54769 -136220
18777 -445787 40699 -73936 -8357 -87804 80839 -322511 -166292 -341656 93804 -283882 -257708
18766 -257708 -396280 -85117 33697 89923 -182065 -235649 -13661 -127317 125699 -12341 25391
18754 -167146 -2863 67580 -44373 217205 -82918 -219654 -56367 1433 -171748 -3687 -80841
18743 -80841 -210262 30253 -152313 -40558 -60359 -14349 105378 227987 -140954 -162177 134989
18731 -107329 -394667 -30514 166114 -226462 204332 -160744 -56229 -104695 262626 -155668
18720 -117980 -152712 -127262 414855 -82617 -37036 -109392 -6313 -160536 21759 -136580 -232101
18709 -232101 -240723 -127135 -26927 -276714 233004 47637 -284496 -123476 187850 -215310
18698 -107462 98166 89509 72540 -25767 -121303 104277 180520 74008 -85401 -58024 -18965
18686 -172569 63287 -141209 -46230 -212250 118427 -27372 -194459 82388 231226 241128 30565
18674 69076 47557 -21905 37366 -386531 82393 123491 21664 -215323 -171647 -27047 -113502
18663 -113502 -139199 -143437 5798 -118778 -111689 -80794 -266392 -285491 -501544 -83060 -108035
18652 -108035 -288796 109652 112212 124687 23748 -81983 92557 85222 -84388 237267 -330734
18640 -58387 285327 -366821 20407 61943 93893 -264882 -72295 -88664 -43421 -115476 -528005
18629 -528005 141384 -58684 -282956 -140557 -227104 -10385 86002 -121781 -248019 86652
18618 34998 -58111 -181156 -87888 -15374 168551 -1398 292508 -145029 175817 -21128 -190709
18607 -190709 305327 380677 76404 -79037 -123933 -178456 -56841 45132 -390488 -171001 -99520
18596 -99520 175966 -130862 -103715 -222946 152969 33705 -125288 -132740 25466 -262921 -249127
18585 -249127 -165041 -238547 -125059 -78883 -53546 -117809 11269 -38568 -183188 -11947 99303
18573 -48321 163079 -112153 -214419 -13885 -199756 275042 -115944 -109358 58040 -221572
18562 82740 131771 -320284 47463 -346937 -222851 -241181 -33786 97900 35654 -252421 -78733
18550 -106310 -16039 -173184 50709 288367 -272622 -86150 -29826 -27073 88124 -7003 -21150
18539 -21150 -187143 -130960 -163300 38973 -130682 187047 41509 -234182 -73737 -137429 -53949
18527 145481 241018 366358 107563 70963 62477 -171318 -78723 435562 28345 192417 56097
18515 -513753 233232 -221880 209580 -476238 -197742 -9347 -45074 -25768 -127569 -237727
18505 -237727 -443579 -176385 36396 140068 -80957 -413345 20385 1090 -257379 -203216 -172992
18494 -172992 54741 21583 -371426 53724 -129276 -108752 161152 -16538 -221966 100663
18483 -305250 293060 -70596 -169535 -219844 -21591 17583 96454 -42823 158200 23665 3997
18471 -67001 -244508 103159 -186533 -286317 -49807 205322 290185 168952 -266233 -5856 -80474
18460 -80474 -220 51260 -417457 -160864 -170952 -172538 -15814 -435631 -372196 -144569 -143234 -1566
18447 -248775 -134197 -193426 237358 -227487 -36587 -177789 -221403 213438 126228 -48555
18436 -13051 -70365 -14594 -74665 -72183 -205051 -174385 -168102 137514 852 -114436 -80868 -30108
18423 -144277 -121826 -161522 19546 -76028 -81207 -133870 -421899 -87288 47283 -40610 61910
18411 176803 92603 159685 12259 -50661 -352689 -194275 -9883 -249499 119160 119400 -17555
18399 -120832 -432732 -81842 -126648 219502 -142417 -80412 -163858 -92352 -89570 73191 -243602
18387 -229564 -274643 224192 208333 -87547 254363 162578 -35246 -262410 51932 458685 -256911
18375 120518 -96322 10451 -94201 -205250 -43234 -65160 197846 -129056 -100247 147582 -87703
18363 -356979 100104 -195602 -241044 -332222 -16191 230287 20627 98511 56898 329938 149310
18351 71589 175382 252276 -4659 -35317 -203717 -11563 -69847 114306 -142186 -80616 -338363
18340 -338363 -123866 35113 177653 -38633 -126664 88103 -427272 -29332 -80243 -24679 -322175
18329 -322175 -276151 -211518 -360 184465 111735 -51384 -95701 -416355 52735 -72592 21101
18317 -287282 -182381 -106164 100306 64469 -62758 124543 -281752 -73676 -149211 204819
18306 60051 -43728 307285 -119402 91742 192182 205459 -263697 435091 -73744 21548 317650
18295 317650 -99008 -72591 -114786 303221 -192358 115660 -138777 -82285 225089 -56297
18284 -126611 -151769 -89722 -53459 35887 -151484 254895 -48748 -156584 -161266 -37067 -96397
18273 -96397 41423 -134857 -9326 -196314 120820 -73101 87189 183206 142788 75705 -128063
18261 -204030 -298993 371267 -216212 -70145 -135722 261381 -94808 -180878 17331 7122 200724
18250 200724 45301 -111460 122730 -177127 -11212 91106 -285800 17909 99233 -249591
18239 -339027 15961 -333020 -6105 -62543 138744 64032 -417701 -411677 -71195 -100614 44778
18227 66025 294354 177460 127124 -41139 235687 -25986 15260 -243067 126636 51209 -202288
18215 -25986 5833 89427 -8045 -4738 62404 -10843 -62070 -199797 54425 267744 -146993 -136506
18203 -136506 -89010 -31353 -122270 41748 179762 -58224 192529 33298 41146 169236 -41986
18191 173973 60320 -46764 54948 80648 -245506 -205101 -215811 -4741 129700 92190 -122501
18179 68748 -99607 -82890 -159518 104499 -84444 -124933 1249 -38023 199166 63691 -241357
18167 129389 -156180 48787 -111717 -51621 127053 212303 -13622 177005 -219781 1850 2452
18156 2452 -138312 -81631 -190614 18115 14720 121979 31417 -301840 -86854 16213 322898
18145 322898 79806 -208335 96286 24857 -94142 -131558 284824 -143098 14281 299753 -153598
18133 161660 345076 -62206 -213281 -123867 -137105 146708 -132956 88725 52498 -12218 -261680
18122 -261680 190053 199476 -165474 -252539 -263933 90542 -43510 27340 111649 153782 230511
18111 230511 -38198 -317558 -40200 -216923 -5562 53118 201848 177612 -38473 -108409 -76819
18100 -76819 -24447 -66342 -100939 -12776 17311 -44497 17401 -101306 24636 23031 -17150 11106
18087 7506 152217 -203113 -88003 -37851 -11001 -456533 207132 -193866 32099 31671 -7271
18075 133034 13748 64763 -412641 -26815 -435567 320204 4056 -84448 -208345 30892 220197
18064 220197 281401 -120966 218961 -44046 50206 22329 -76282 -60106 -370565 44432 227640
18053 227640 198790 -187690 23684 76899 -144946 51285 45281 99098 -178566 170059 173489
18042 173489 -351678 -18018 63731 -290660 122989 -68919 -391835 -105845 -180603 -95686
18032 -95686 127572 -183609 -48994 41248 33304 229795 96433 27044 81627 137911 -109195
18020 -85166 -142591 19276 -10085 -203059 -226705 134866 148383 100316 -106776 127129 -51123
18008 -243357 -20092 267543 -18634 -201672 -89552 31214 28689 37448 -9921 128230 29008
17996 -172239 -139086 -185706 25763 -3671 -261392 38049 147897 52895 -342880 -74222 -404548
17985 -404548 130375 7959 11502 115316 -156670 153150 271660 -169739 -65224 43293 160528
17974 160528 323035 -32169 104244 9430 -118954 -90874 137735 53911 34763 319851 -42136
17962 11693 486258 953 177285 243777 383633 -78174 -165509 21125 12520 92765 238638
17951 238638 -90920 -425589 -82789 227185 -28193 -197791 -127756 -519207 -239674 84367
17940 -159773 65992 83532 -66517 -165841 142470 -164732 -159760 -3909 -173736 64978 -392611
17928 88689 -77606 -38425 152590 122220 247918 -44446 80996 -13929 221915 62001 257458
17917 257458 -326646 -63866 155464 -70601 -41718 -16803 196462 -269453 -104646 213248
17906 -65808 -76448 -13643 376946 -345144 43446 8951 -87825 -65779 -11524 111832 27752
17894 118885 279730 175588 -65048 216544 96238 45313 -103918 -159597 228638 43119
17883 34760 322362 139339 10549 14085 249428 103115 54068 77194 101383 -19704 288490
17871 -82190 79328 -87999 -89910 -58586 -82141 10554 -176137 316708 -50632 -65420 126448
17859 105301 40014 228586 313668 -19687 -98431 -46316 215487 -31186 -96644 -172550 -186639
17848 -186639 -83723 41825 281560 197316 29969 -198613 65137 199516 -61576 -195334 -29348
17836 -106332 -200557 -65638 -93352 174200 -65373 6406 -124847 -5849 40380 -24316 -229182
17825 -229182 332700 -120259 114979 55685 -137115 190599 228685 325999 -44443 287876
17814 -189474 209864 261432 -35182 -245157 354324 -5108 -408076 204759 129958 94113 376737
17803 376737 109440 298482 84253 -25181 -42366 -475315 -165502 -152144 76793 -2221 -22521
17792 -22521 6455 190248 -45388 237161 -58285 274918 1870 64806 250819 302106 38250
17780 295295 -87880 94478 10664 120108 -85337 172936 -34134 39583 -29595 -198632 133068
17768 250519 261203 -75892 -157737 246123 148830 302709 -176231 -75310 -189136 126751
17757 -198622 137256 86917 28259 221485 -12791 -39553 1428 -23924 116839 19843 245884
17746 245884 296197 -174277 -406833 131881 133479 -244109 -42812 185518 -15751 321778
17735 -72304 -128451 -271711 -311019 -23982 -57500 96548 -151837 5324 38110 108892 -164294
17723 141882 16282 162379 248158 269007 160337 -59763 -70658 102896 303969 -182391
17712 481048 13059 158604 297729 30127 287964 -86715 310488 -148656 -30692 -262687
17702 -262687 42613 253667 160976 -116731 -112696 305164 461167 99362 131009 149333 203044
17691 203044 -195953 109833 100545 182662 -33873 241870 -8079 309005 -90120 -229906 6375
17679 71415 384092 -199224 210515 -101957 74974 42809 -80306 -89785 43631 225206 -27542
17667 -171033 -89277 248315 167330 -115418 6534 -91724 366471 313532 255031 112179 100934
17656 100934 -39771 176282 50191 55926 82230 -143143 73687 -29345 44128 186250 41806
17644 199806 -260546 125846 -468746 148186 -234812 -8203 318585 -35167 32248 174587
17634 174587 195502 -263552 30555 221857 -61736 -142017 111524 155719 -36270 175925 -45432
17622 149021 -30190 5733 30708 -35676 110978 174844 -2094 208541 -22861 187169 -213769
17610 63053 -75051 -231933 375364 -13207 258493 117239 78417 304694 -174067 -121597
17600 -121597 106003 27095 40664 -97550 270199 16848 -72610 417802 129748 -319955
17589 199614 278563 114988 242098 -139800 85733 439723 276926 169113 450614 142635
17578 188560 76430 -372315 155793 -315681 166702 -240601 268711 226950 188624 375776
17568 375776 306291 -158394 232832 99565 257493 280471 67897 -9672 -194124 419390 52326
17556 31888 168314 177932 -9223 -136860 272571 -82956 282716 495892 237408 142298 -225460
17544 148576 -40502 45833 281398 92445 191353 211062 -12181 145969 222598 201411 78178
17532 61598 469784 456393 198480 85546 234295 -10349 202651 185723 56362 402865 267454
17521 267454 -36562 335771 211966 439695 173140 458493 493558 183589 52156 245786
17511 245786 -5888 292422 413867 413342 466169 204695 224605 194034 352038 361615 441326
17500 441326 77948 258070 191449 -5688 -92597 392266 240624 353621 245762 111335
17489 409484 465834 318061 -6926 124331 101032 60354 302498 303101 -148324 411533 224189
17478 224189 -71662 194887 170412 528837 36175 196415 116498 364298 -32578 186024
17467 158416 195710 433876 57310 338791 363577 302269 522490 132702 128185 275724 341548
17456 341548 -20587 315205 25622 520355 190465 162230 -169580 276338 174384 288617
17446 288617 208395 533729 462433 589466 336968 345198 274855 395825 359001 91196 230355
17435 230355 254928 488426 309793 203114 28762 489665 102619 80801 145505 295144
17425 295144 450449 526306 332466 287395 580989 351526 306734 512960 109324 212735
17415 212735 218640 483549 412963 661120 495394 436320 497440 468825 365643 -36096 330233
17403 568914 24468 128312 419575 -144119 380605 394952 195368 21449 159057 296729
17393 296729 167900 349820 391457 215266 482775 392057 147548 143196 207081 42673 248045
17382 248045 279842 65570 -113076 363427 193755 267841 134035 387998 232494 245053
17372 245053 72802 -54221 305974 351331 138999 281035 248110 415439 225405 240391
17362 240391 228559 586632 156857 124933 215242 157203 457937 238769 648878 449389
17352 449389 43454 589238 70141 336487 647530 313642 360499 174680 290539 258892
17342 258892 367629 60223 319304 286356 -25627 244625 365415 273997 162423 -93814
17331 541660 293513 326402 205655 491590 170812 48412 347476 28760 439669 367692
17321 367692 22754 281106 158867 119541 207317 391007 576580 168780 479529 -187957
17310 -54272 404836 233286 377909 272955 509784 469383 357709 278025 -8113 173368
17299 36806 184045 308508 -6110 348863 409785 472274 317595 69006 353890 417976 295289
17288 295289 159403 278934 252131 515528 439547 159394 424440 56481 389140 507053
17278 507053 378431 171940 145059 362488 241511 406947 428049 370273 166348 323063
17268 323063 407245 26694 315954 457092 163873 540370 264318 358336 579050 112724
17257 364770 205662 357083 353497 119604 501928 456993 420199 80462 402933 187680
17246 390500 205584 321569 494330 530564 218478 359304 509984 208143 602706 258230
17235 376056 363015 345671 252218 304027 606266 512564 646472 605358 663934 521526 343816
17224 343816 287951 220952 551216 586502 393198 557546 543520 175104 531917 498488
17214 498488 641471 333838 336876 476469 413738 555952 438275 447291 680622 524923
17204 524923 295413 427946 347653 673026 401866 384569 531706 212483 388042 199702
17194 199702 242071 388029 543008 355957 511672 349573 582343 284876 440771 404550
17184 404550 560536 596791 406710 462723 241979 309792 364096 493931 446140 572289
17174 572289 622071 757612 302182 979262 262553 392771 684477 670906 839999 571959
17164 571959 846387 523438 315204 621348 423863 647271 279745 777443 273748 684884
17154 684884 676568 342636 978589 334602 720437 666364 501796 399104 771664 556967
17144 556967 636933 739209 519068 846422 496316 331448 695646 728350 742563 957564
17134 957564 732605 834918 625336 615254 740366 690233 738584 939284 669752 426210
17124 426210 638927 615608 889321 623349 793461 627575 666829 805790 901105 984602
17114 984602 703259 638931 542480 779967 820585 699543 1047594 869405 749795 707544
17104 707544 1196725 977798 1125688 783735 858465 943199 674268 1140023 988353 1178906
17094 1178906 812647 555662 1080043 1009961 1063591 1066753 573441 629758 1013757 1111294
17084 1111294 752703 915318 1208806 998570 944000 664066 761171 870076 1012897 1187199
17074 1187199 1020364 952165 602115 1123043 1100168 816678 1244777 1145775 937017 1181802
17064 1181802 843258 792279 1340759 1186595 1106707 871154 1084711 994223 1015988 805678
17054 805678 1140487 994694 1050384 1158317 1258856 1223528 1319183 1393887 1096912 964113
17044 964113 1054150 1174317 1432776 992325 1101069 1340243 1196343 1186948 1138352 1218028
17034 1218028 1174801 1294260 1296671 1230587 1496524 1121135 1466056 1442266 968106 1175119
17024 1175119 1458124 1316200 1330788 1086812 1504842 1307483 1535411 1438232 1355732 1473255
17014 1473255 1571681 1319227 1359360 1708437 1402578 1810570 1570612 1777392 1510240 1592519
17004 1592519 1663240 1972663 1432966 1680502 1772965 1773912 1804663 1501525 1968652 1955678 1526609
16993 1526609 1624608 2050088 1532229 1544192 1651273 1976953 1944338 1754923 1852378 1823272
16983 1823272 1910805 2001653 1489381 1808480 2008946 1623010 1743391 1931079 1612881 1905056
16973 1905056 2002427 1986900 1855080 2111038 2060982 2148187 2230269 2389019 2309188 1978966
16963 1978966 2452926 2143940 1940461 2580616 2245234 2146057 2196587 2098627 2254979 2368688
16953 2368688 2273809 2504076 2424378 2428196 2478884 2347409 2430567 2502060 2345242 2563766 2224190
16942 2224190 2533508 2688559 2741841 2753380 2805149 2513223 2904637 2445008 3006151 2729890
16932 2729890 3195510 3246667 2842671 3151404 3029411 3155823 3120704 3195617 3118240 3079589
16922 3079589 3221188 3140857 3237325 3158360 3586784 3712349 3420488 3461980 3499583 3448563
16912 3448563 3480611 3454338 3589536 3890305 3402296 3657762 4063206 3904499 3699331 3957040
16902 3957040 3910857 3935560 3863569 4201579 4464213 4150580 4055716 4159830 4180650 4263915
16892 4263915 4374856 4347519 4731840 4659946 4500370 4510754 4934570 4592455 4609025 4896457
16882 4896457 5015499 4968279 5134726 5257973 5280984 5223806 5188677 5289905 5611210 5594284
16872 5594284 5935987 5883331 5825083 6049412 6032944 5992324 5932620 6340358 6348945 6555159 6415937
16861 6415937 6818204 6768395 6638200 6816963 6791236 7120384 7114144 7209354 7657369 7216455
16851 7216455 7643360 7720957 7714654 8033429 8083725 8101194 8190648 8324708 8520411 8629138
16841 8629138 8485500 8773287 9007251 9226185 9272298 9291802 9536195 9862094 9919782 9828092
16831 9828092 10084878 10512433 10297794 10717546 10561699 11174774 11001906 11467725 11610345
16822 11610345 12096662 12197097 12323567 12720539 12652448 12838728 13043605 13324659 13619064
16813 13619064 13785666 14119389 13988083 14886032 14761863 15098728 15327403 15708948 16064384
16804 16064384 16267560 16520450 16845426 17738746 17800549 17961940 18317900 18708008 19250278
16795 19250278 19656653 19781920 20326573 20695381 21334088 21963060 21857904 22580445 22906242
16786 22906242 23721830 24358533 24522993 25135711 25815444 26298108 26772347 27371300 28017959
16777 28017959 28524828 29414737 29951104 30586273 31170230 31735772 32638100 33549024 34705224
16768 34705224 35170442 36014797 36864974 37744554 38518985 39707725 40207574 41936536 42205539
16759 42205539 43256068 44352554 45222279 46296029 47272146 48542088 49303053 50678711
16751 50678711 51949762 52767176 53707808 54882349 56484258 57287289 58615369 60122299
16743 60122299 60917530 62029849 63362105 64442533 65467804 66686680 67906550 68500256
16735 68500256 69628582 70813889 71853936 72539106 73296908 74238112 74784954 75562691 76262897
16726 76262897 76694297 77059699 77315589 77955714 78220119 78196824 78459958 78480340 78457153 78198113
16716 78198113 78125227 77571866 77232333 76605783 75913488 75370151 75212479 74675925 73847487
16707 73847487 72640626 71603805 70640332 69884869 68668875 68006382 66643369 65696604 64463028
16698 64463028 63288957 62320374 61102879 60068869 58611845 57521059 56465878 55597659
16690 55597659 54405133 53225868 52056144 51143275 49895751 48954916 47922833 46802090
16682 46802090 45666659 44490847 43677897 42830015 41805730 40966761 39786493 39114244 37756261
16673 37756261 37217676 36423418 35812333 34850778 34081709 33519710 32945327 32222873 31082122
16664 31082122 30460665 30074110 29271284 28624127 27921886 27572229 26840016 26304794 25845168
16655 25845168 24876301 24795284 23993706 23937106 23407147 22681996 22368833 22036319 21689672 21144278
16645 21144278 20403681 20362575 19868231 19075772 19150829 18911930 18228540 17854766 17880232 17530069
16635 17530069 17049433 17145114 16216002 16153200 15893033 15663404 15421085 14937490 14674460 14231967
16625 14231967 14481041 14155276 13628968 13337994 13222875 13342772 12928508 12857262 12613563
16616 12613563 12552268 11820748 11712152 11710872 11315887 11418501 11213725 10958777 10901933 10657216
16606 10657216 10816983 10399951 10311271 9842350 10025155 9861238 9662936 9766245 9004679
16597 9004679 9282440 9222349 9043073 8917279 8808958 8547409 8352702 8534169 8314947 8151693
16587 8151693 7935964 7806365 7814467 8042074 7790476 7490129 7361992 7420127 7257200 7191411
16577 7191411 7101687 6773377 7284262 6717992 6555923 6979114 6695962 6242672 6521982 6714583
16567 6714583 6363261 6127788 6040101 6141082 6187302 5872950 5955311 5814189 5752675 5535054
16557 5535054 5724313 5724624 5080071 5465903 5423694 5172234 5288690 5202565 4979405 4944378
16547 4944378 5149661 4910558 4992695 4925532 4913387 4665415 4868280 4714339 4886805 4475504
16537 4475504 4495814 4550721 4503260 4267018 4320575 3774891 4180055 4299713 4004044 4503093
16527 4503093 3960648 4098616 3688047 3645485 3975455 3904904 3512184 3856379 3655934 3623012
16517 3623012 3815344 3541799 3723199 3646145 3512172 3432691 3433253 3423092 3410744 3521239 3431798
16506 3431798 3623006 3163500 3470415 3440990 3511940 3524853 3052082 3074505 2808948 2740215
16496 2740215 2955021 2946438 2929654 2877615 2752602 2933280 3024140 3034083 2841077 2669434 2731543
16485 2731543 2576992 2607249 2566853 2776886 2832464 2746697 2408673 2600871 2573745 2613561
16475 2613561 2466086 2657515 2755536 2331634 2538515 2535267 2643695 2334023 2497245 2590710
16465 2590710 2596015 2237036 2407702 2461990 2172117 2150439 2346792 2275441 2272775 2089929 2286021
16454 2286021 2273760 1932148 2271263 2233573 1963198 1907533 2330368 2104350 1871681 1913337
16444 1913337 2076647 2139447 1938545 1881134 2165401 1903592 1948572 1934735 1959349 1945688
16434 1945688 2027248 1762879 1722780 2037687 1824310 1893186 1672621 1902496 1757035 1567574
16424 1567574 1739198 1918358 1880629 1655442 1847880 1709990 1675946 1998738 1796249 1591066
16414 1591066 1477228 1530543 1447889 1663918 1660267 1525970 1546792 1518492 1519296 1486336 1520318
16403 1520318 1194477 1468527 1581842 1435942 1451032 1233389 1264610 1538837 1572635 1472633
16393 1472633 1226607 1416440 1281629 1733329 1538688 1359711 1566287 1356114 1251440
16384 1251440 1445950 1637653 1431690 1115336 1441784 1405673 988395 1389008 1411347 1052413
16374 1052413 1220837 994404 1165929 1389900 1483132 1256677 1424468 1394702 1061774 1397195
16364 1397195 1041543 1253362 988492 1283726 1280908 1334548 1147345 1304161 1151299 1368341
16354 1368341 1071584 1181899 1076936 1291501 932071 1204778 1260049 1016084 1079470 1153826
16344 1153826 1086679 1151188 1086195 1138682 1046367 1127652 1179841 740482 1310100 1049391 921976
16333 921976 765361 932408 1034460 1100113 1097300 969394 780338 981374 710754 1016261
16323 1016261 955431 817231 1003165 550420 845668 864300 731698 1109153 1146401 808059
16313 808059 890263 705703 820979 810455 1091113 743239 584366 829215 849950 852233
16303 852233 934454 686345 873027 852331 1151231 406480 539924 764383 930040 699832
16293 699832 927559 859561 577250 743228 528382 564982 297528 1082502 942808 1019023
16283 1019023 914642 574157 937778 620005 539940 1081089 1003812 756834 738294 744013
16273 744013 719218 689436 755957 615858 570780 716815 1021032 716293 956082 754291
16263 754291 601999 587832 833470 542241 763527 581387 743118 525132 714408 526181
16253 526181 713044 641573 406022 657807 547547 770941 493669 702991 703892 429916
16243 429916 181495 578309 628082 544064 465659 770164 787873 868139 665540 804548
16233 804548 393832 392557 603268 403272 577379 670855 445987 436839 799491 442476
16223 442476 400810 309526 464751 408824 347371 581265 852772 404536 546726 417193
16213 417193 532367 436529 414952 575801 590943 705749 413190 552628 512798 417716
16203 417716 286592 410545 449432 589612 282927 565609 490494 506700 227256 470260
16193 470260 352651 379142 536077 535125 710421 412024 582501 776972 337036 561980
16183 561980 588821 549653 67548 308988 447806 433800 282498 367580 786710 235791
16172 434005 16940 462372 420201 212163 374741 525475 462105 346662 325520 326948 196623
16161 196623 134442 161498 681995 552171 469573 402781 393345 466566 359613 240662 496209
16150 496209 716138 -43364 330710 314727 182509 457428 338734 235422 487382 308176
16140 308176 421887 182797 361605 160901 468321 276828 136195 318357 312111 589300
16130 589300 378182 381972 133293 125548 421469 351401 216120 259278 287697 140410 559163
16119 559163 395831 259281 236658 222523 68446 519022 323141 373190 138836 592479
16109 592479 195007 137939 451030 -6726 204254 179997 366131 192512 276888 228413 743422
16098 743422 370656 306822 640694 341076 396899 302471 79220 229294 123113 376811
16088 376811 572250 234571 726062 210535 195921 492236 221997 94474 -49186 213614
16077 411930 306960 443740 319027 450584 177307 210613 261792 272801 284308 227080
16067 227080 428397 105812 156829 223588 206283 65737 237153 239465 19973 150494 411848
16056 411848 381945 189473 149192 379343 357583 500829 250806 211232 80658 131423 -136600
16044 169371 58622 461304 402392 151534 394570 207388 246060 -2043 349889 181240
16034 181240 317533 161643 162713 87192 37028 -119553 136605 -39726 -34449 140870 190311
16023 190311 169302 -18827 -88268 217075 177499 40882 18735 129091 55486 284088 184560
16012 184560 -52088 299477 7957 -10339 211404 38352 164178 110009 419657 74904 73364
16001 73364 280281 317070 142058 303053 69348 -60961 187857 247479 275925 294456 34908
15989 197554 178184 421178 663219 572240 730843 1053424 399851 495692 481957 207560
15978 462714 184907 157202 62124 208180 60861 208603 557490 324763 64847 93155
15968 93155 348227 20524 -5951 -240909 159734 -129220 -76960 43596 -146000 -92962 -69056
15957 -69056 -5485 180964 559977 249051 164979 113676 135995 135229 91840 34284 10101 103684
15945 103684 -29743 -201853 243504 36100 99980 135380 294742 401934 23600 363332
15935 363332 19213 -102403 36226 277965 -198440 242913 74059 184728 33053 -90581
15924 -122511 302391 401950 -149290 -54761 1626 2905 -263608 307888 344467 -311703 44721
15912 388089 -139662 38630 81973 351745 133976 -134442 101793 175721 250188 171027
15902 171027 18088 -53185 399508 43441 173240 92579 -82662 116661 55281 158217 130389
15891 130389 102143 241192 -72989 144038 -77023 175755 137148 230440 -296446 191303
15880 85373 154288 -355281 308961 210992 141493 204122 296029 -52552 230271 21129 -86726
15868 66098 63096 95304 -67282 177245 15915 192512 44937 113159 -21808 13502 -210035
15856 -52364 -172635 292631 149213 78510 -223115 235377 462919 303659 -241360 81454
15845 60397 -259093 -20011 26113 -117081 46663 154797 186041 43922 181617 160276 20009
15833 76212 232785 -27731 96869 57075 73944 84462 -35882 212300 121860 56236 -38582
15821 8784 -418896 231358 23479 -167221 102331 134660 152104 -166297 364434 -17601 3004
15809 255211 -8796 98777 -83342 -154008 -361290 38704 149 50157 114479 -80665 -65821 55113
15796 -37790 102207 -132503 -172025 -200810 -28736 213116 69329 -118793 208750 141315 -104326
15784 119637 -175510 -194230 308352 27212 95405 200770 86251 30259 -395030 82158 214300
15773 214300 -135192 46571 112126 -147923 174959 -102290 -37914 -25608 -173000 -30343
15762 133912 217956 -99434 -11339 -200976 -101155 373853 162143 -58610 -21299 334229 170382
15751 170382 331111 243133 14923 31384 160417 -90972 19601 232191 174684 -8086 89553
15739 154763 -193300 -34675 -198821 -135744 -3372 34154 -139841 -42356 -64349 -145490 -44109
15727 51715 280007 118188 -101046 18895 -143101 -44469 87610 94379 -216412 134834 -43762
15715 85978 132849 14557 -16619 191738 97887 40958 96863 -233748 -54204 -168102 -101393
15704 -101393 148927 66725 -143703 21352 -340836 -439265 116034 59435 75484 -375051
15693 -42687 -52638 -290696 -73358 -38309 -79991 -209040 -81860 -81516 102008 -36547 -245707
15682 -245707 -161252 -162041 218373 -122851 30459 -51767 -61188 24799 410601 230198 -44926
15670 57024 151767 45489 -176943 32811 276420 -60324 -175752 -366139 -62917 177540 -57380
15658 31272 307144 -200453 143862 127031 100478 90296 249353 -267048 -125561 119684
15647 40664 70403 -121429 -155020 -96140 -67870 -67583 -152800 43529 19286 -114424 -74906 137391
15634 122370 146356 -5082 31835 9727 -256034 85736 -220552 -165656 62402 232415 -29314
15622 160052 253639 111030 80279 140191 -362256 29374 -208594 -7298 -75936 -83712 71712
15610 41837 -161910 -95998 -56893 29019 -54257 -240625 -57584 -171424 156984 -136805 -305475
15599 -305475 -190675 -140491 41255 30197 143211 324916 -174467 113412 -10317 -29489
15589 -29489 -12086 105140 151057 -159461 139591 -201884 62097 246953 282460 -278301
15578 -396451 -19835 189997 20526 222408 -43770 -44083 -138455 -155739 -378492 -50512 120580
15566 131032 87754 208908 124083 -146376 -80907 3940 -143556 29222 -73946 194976 122931
15555 122931 44826 -44812 -145609 -379462 144590 75677 4553 185711 78288 152945 -29807
15543 139445 -81764 16261 287924 12927 90356 345704 155048 78528 88409 222928 -50968
15531 265454 -177299 193364 -154309 -385981 152807 142473 308517 -125266 232269 -99878
15520 95459 -35688 -17922 -4675 63743 171062 161103 180765 183703 387504 10052 -105605 179140
15507 -114929 -214514 45414 -170819 286899 -111296 -377507 257786 189406 678 246603 -116900
15495 -185852 -26620 -145017 -29880 124790 -310256 59224 187421 -108592 -7255 221375
15484 124861 459678 -199504 -176999 -86218 23100 13759 173766 337414 11124 1922 4151
15473 4151 64933 166402 246597 75091 54768 51022 -69474 -141647 -69598 -175020 -293439
15462 -293439 -212408 -125540 -38373 -68302 -30485 -22540 8827 33703 -201207 136432 39326
15450 137326 41966 59380 -128777 333269 -10653 -302925 116846 -1550 -17122 133364 -8359
15438 8187 132919 162924 67432 14384 178379 -47436 76532 211 34560 -74869 -52379 87181
15425 160578 105801 257639 -130073 49494 89274 -47277 584964 36689 -43078 -75613 -258423
15414 -258423 -71027 74779 -192212 -123127 106531 -107621 46851 -150441 27360 -176146
15403 80141 387870 184374 245621 -69782 308857 43046 -116180 29122 -386408 -228842
15393 -228842 44865 244621 -231396 10227 75411 30568 188929 -110326 -70540 277475
15382 389546 -93546 63327 399225 433940 -160995 -27154 281683 145891 65536 114269 -33975
15370 27364 204366 81782 261422 346718 160641 172382 -5376 -76671 60210 -231915 -52120
15358 -15825 34924 293381 130263 44829 -25930 271679 271311 29764 -2504 69859 -246702
15346 338785 -35366 -274836 -208044 -101583 183732 303537 66142 121206 7850 72400 -239395
15334 -249025 -118637 215498 -718 -52256 306324 259217 333828 -153900 -150166 -23779 64799
15322 38115 42594 -68225 269691 -41436 -31860 118423 194386 -87299 -14892 12704 -105672
15310 -166820 70725 -17824 126412 61436 -31633 214459 161361 -14727 206352 68524 201397
15299 201397 -129463 29202 -203873 -159309 56517 256194 93587 61604 -131441 193759
15288 77978 228892 -123393 -12777 -114294 200199 247037 71987 79154 11851 39789 230463
15277 230463 409207 -22955 102846 308575 -70274 85524 166779 39414 44769 -26066 171949
15265 -105238 144945 58905 799 -50785 -145859 47707 9598 171393 96891 147381 212488 235070
15253 235070 -292044 441826 131571 -113502 188990 -48107 2337 46090 63349 204680
15243 204680 -127035 294104 498899 1725047 3555875 2961877 3258935 3633295 1285860
15233 445144 223141 340063 154371 316034 203985 -169436 -40844 55818 1642 -204061
15222 238008 250233 113984 -147870 27379 -2102 166076 -206105 -350826 227389 94629
15211 -223664 -3320 -7246 265183 -191057 -34252 195255 216466 137157 80891 349608 344774
15200 344774 -143597 -9272 21042 215623 -73511 102556 -22419 -174554 -91880 192514 115541
15189 115541 341923 279025 196575 -1761 200997 45670 -324329 -168496 -169768 50240 168367
15178 168367 159298 122683 72372 312373 44057 25814 274606 -14983 62304 182165 -7099
15166 -97834 -30204 202810 129213 -54895 -92031 -125340 259110 -17996 109532 46524 183202
15155 183202 90671 -279294 -208178 236414 -17498 216401 200449 262722 450435 -166503
15144 -164879 -565088 101418 73996 -15479 -135512 -141000 -9899 160284 350916 19233 160351
15133 160351 -29430 -95749 80777 20327 57966 15154 -21807 37224 222075 76882 -57907
15121 -79286 3071 109068 87118 154252 16413 404721 -14328 185964 490378 461050 329047
15110 329047 315546 231350 172108 328593 115632 128866 -14826 311496 161219 140732 295847
15099 295847 149343 301271 84530 -62843 138589 247180 121312 195489 -31466 229520
15088 92644 -82521 87559 390809 40563 333059 -104080 354139 108791 -50535 7429 -195634
15076 69006 309066 336973 44743 105995 -75110 126901 244778 105799 265769 134626
15066 134626 196337 32621 305797 95172 377565 237770 81182 -93370 185338 78517 166379
15055 166379 266606 213966 230527 81442 350475 280179 414043 382000 337571 79645 369273
15044 369273 61388 475002 239433 108653 109833 168382 11733 75693 249118 305766 -109205
15032 -123279 308922 170009 77591 142093 168910 257458 -50979 60104 273251 312161 111427
15020 358564 228059 134097 193225 174575 44093 75272 291313 481966 -15025 253139 248724
15009 248724 395162 640427 142716 89174 230833 187123 358241 433693 440810 84544 33473
14997 -87585 344342 -37484 333113 222183 20638 216343 320969 94486 173129 436429
14987 436429 53974 248925 120326 153936 420427 36648 244224 -173348 426962 449316
14977 449316 148559 341468 429631 416835 310814 268046 340758 477051 232028 54022
14966 291271 116274 471930 580390 592451 734552 453265 288616 614694 321802 -2325
14955 76436 96568 302253 503189 388565 72941 -35019 288048 322764 198481 26859 352190
14944 352190 661344 351883 632013 160990 96234 242644 46489 157686 179174 137484
14934 137484 97495 264755 476017 466771 510358 365111 420193 276983 431784 420423 467551
14923 467551 379930 440777 503082 405547 685419 334600 327009 529912 212544 -146574 254216
14911 312888 303835 38706 347706 64678 203989 354984 141042 114530 261329 564332
14901 564332 428742 469436 84092 105870 516328 496682 378140 407781 368111 337328 250346
14890 250346 321754 339688 295014 359333 391781 555386 254795 82797 104722 427056 391134
14879 391134 336719 101411 334593 182861 581296 377829 72617 226880 368373 389190
14869 389190 292728 416350 404610 435721 349666 225636 438442 503837 260701 170790 187537
14858 187537 335267 407140 326438 -32607 299094 595603 678056 420102 467232 691612
14848 691612 623856 621633 469521 402036 504625 518389 790965 394363 381828 717397 355156
14836 432730 541732 576929 682609 562660 519857 561879 323849 631640 506026 310126
14826 310126 359077 671310 664520 483705 715098 372999 744964 690229 515567 106941
14815 428379 452508 321567 483766 368984 313670 570676 687093 226777 695116 508303
14805 508303 352021 565101 538183 268277 634978 650941 281038 460172 590110 789937
14795 789937 391086 536243 384325 553758 503193 572599 284377 621409 461784 727584
14785 727584 722303 411190 510181 851155 522446 331174 483789 646311 760321 332376
14774 551949 503674 706958 384581 596935 579097 754799 459855 383112 420520 297334
14764 297334 861981 474994 1130383 542925 786810 293647 596274 647183 488509 732733
14754 732733 731468 638357 780524 647933 616451 607689 681704 952562 684534 612521 490075
14743 490075 227905 456635 379127 469506 672812 823471 912592 941712 923287 802584
14733 802584 521963 516936 797099 643772 525537 670473 1027891 600308 990553 963385
14723 963385 823343 564543 884587 621421 1022076 865207 946731 622877 707445 671858
14713 671858 559183 490888 621145 600154 901632 801510 802822 781639 931895 991252 762840
14702 762840 1134109 876522 753332 1064666 706288 850449 917106 883289 690704 794135
14692 794135 590718 825863 1051064 1062430 975610 960274 1065288 1126413 1060901 742652
14682 742652 745623 679087 767865 747940 1066331 897979 855170 882552 912802 896265 863284
14671 863284 916312 964396 931277 1117194 732028 802810 878986 795831 799157 1054957 812420
14660 812420 924662 883143 998792 795366 901513 937260 1201471 959814 1112042 1282904
14650 1282904 1037036 1114132 1070277 976640 1203026 1050312 1256790 1251483 1273723 1209211 1303709
14639 1303709 834575 1188831 1224642 1205856 1135441 1238160 1121085 1030853 1183610 1043833
14629 1043833 993434 1205159 1159493 990614 1449304 1366628 1435528 1123495 1404417 1350426
14619 1350426 1119201 1201745 1267136 1298335 1501283 1285177 1322778 1200585 1052964 1247763
14609 1247763 1574043 1324092 1597565 1026686 1203785 1028906 1141091 1357136 1227616
14600 1227616 1474711 1204367 1256327 1359671 1136077 1769247 1675708 1626737 2015800 1318043
14590 1318043 1531623 1600734 1681720 1692844 1407911 1686961 1355841 1759848 1814749 1928201
14580 1928201 1864668 1746471 1848237 1829675 1868934 1942500 2200537 1828244 2069547 2180249
14570 2180249 2106440 2000346 2326265 2115797 1916211 2011767 2163512 1838202 2575601 2349773
14560 2349773 2308401 2775549 2590725 2921456 2892310 2997942 2958004 3731081 3739511 4253652
14550 4253652 5360244 6958743 10677301 19698871 40141076 41561295 16602815 6190740
14541 3170762 2067712 1942765 2178390 1894166 2287452 2808787 4220033 7776322 7323631
14532 7323631 3469225 2221997 2359360 1845629 1923414 2252368 2259275 2267988 1945750 2176119
14522 2176119 2325079 2039498 2131556 2007582 2167248 2038425 2197156 2322480 2395424 2521417
14512 2521417 2637456 2265424 2525515 2361310 2377323 2498071 2622746 2330353 2621884 2934264
14502 2934264 3120304 3175796 2765122 2768534 3185577 2641808 2853112 3020908 2964112 3036089
14492 3036089 2941602 3032059 2971204 3010758 3313504 2964707 3264348 3182352 3334500 3541133
14482 3541133 3310571 3481725 3366936 3544121 3419390 3244735 3680352 3489911 3820177
14473 3820177 3979537 3566588 3687377 3618507 3764174 3760482 3884983 4014083 3829801 3983055
14463 3983055 3981651 3846527 3887388 4299497 4401491 4305036 4296209 4401836 4658158 4488528
14453 4488528 4654874 4757382 4799437 4860051 5203231 4983239 4816541 5114327 5210086 5220249
14443 5220249 5385781 5499535 5318531 5578102 5476238 5551513 5733430 6221036 5958429 5900778
14433 5900778 5873570 6143310 6224178 6385872 6439983 6674722 6506700 6494448 6545797 6512662
14423 6512662 6902336 7009912 6691043 7079320 7140877 7285434 7456413 7590155 7802958 7693195
14413 7693195 7911122 8181260 8099739 8038770 8423953 8241028 8481450 8941323 8916013 8912293
14403 8912293 9205149 9422433 9474235 9854123 9691814 9863921 10158041 10346844 10477733 10757592
14393 10757592 10642328 11030110 11084578 11397193 11391702 11957849 11921027 12189916 12449612 12885451
14383 12885451 12987425 13118723 13301786 13481660 13907152 14185556 14104796 14702586 14961871
14374 14961871 15255070 15360133 15744834 16095830 16279214 16580133 16832529 17467227 17827164
14365 17827164 18256086 18411516 18986600 19415921 19910982 19898700 20865367 21450925 21507859 22097475
14355 22097475 22619026 23102878 23594641 24390855 24840078 25261143 25745666 26841822 27619038
14346 27619038 27781270 29089218 29807836 30288827 31353503 32137443 33025927 33781432 35021419
14337 35021419 35575560 36897118 37902493 39344441 40255455 41796078 42972997 44236822
14329 44236822 45753146 47395970 49003572 50290800 52188246 53871016 55718981 57324135
14321 57324135 59773546 62037150 64130750 66872523 69208383 71737015 74456814 77483443
14313 77483443 80453625 83859967 87099558 90970890 94531764 98297387 102918326 107464304
14305 107464304 112066384 117096830 122594787 128128116 134540406 140525210 146988182 154059918
14297 154059918 161635504 169630449 178480701 187200608 196710243 206760110 216745463 227789821
14289 227789821 239218559 250676548 263209776 275916280 289353510 302923208 316700253
14282 316700253 330915158 345352774 359216143 373409597 386731787 399639855 411207998
14275 411207998 421442056 430510808 436560492 439265111 439469388 438219807 435671380 433070650
14267 433070650 430235049 423563746 413490957 401269140 387661724 373445211 358363135
14260 358363135 342648100 327352362 312025419 297062485 282312104 267939029 254242796
14253 254242796 241513649 228873800 217305586 206067910 195467861 185339583 175662623
14246 175662623 166453942 158372644 153877392 147704247 139570979 132841908 125911501 120396894
14238 120396894 114870553 109923140 104920793 100320130 96092531 92169106 88537974 85164652
14230 85164652 81972795 78241379 75040624 72052775 69648734 66975127 64489842 62619009
14222 62619009 60137351 57944239 55852504 54304062 52605133 50712332 48974045 47251815
14214 47251815 46263499 45021770 43550602 42084541 41107223 39850919 38791208 37852042
14206 37852042 37098444 35479587 34719644 33772047 32872345 32117066 31699302 30485485 29674883
14197 29674883 28520593 28165664 27516592 27103411 26320256 25345789 24657909 24237514 23786019
14188 23786019 23273326 22916390 22047887 21591482 20680265 20479982 20042242 19713877 19310409
14179 19310409 18858079 18762512 18325315 17806723 17234610 16939959 16855739 16401857 16174998 15706817
14169 15706817 15434405 15223957 15328302 14324304 14363180 14122959 13870262 13889153 13380487
14160 13380487 13019042 12941966 12570251 12311516 12291262 12076335 11784034 11629682 11316606 11378271
14150 11378271 11209027 11039986 10901238 10761327 10443100 10361521 9882451 10176689 9928550
14141 9928550 9534074 9641411 8981832 9171992 9435390 8924635 8457762 8563473 8904143
14132 8904143 8392799 8437400 8198387 8093601 8082108 7840474 8108624 7819971 7583502 7223984
14122 7223984 7264336 7254211 7284453 7237483 7159062 6643469 6760812 6615974 6694135 6663169 6433066
14111 6433066 6346011 6164515 6219035 6134971 6292782 5956953 6061236 5969574 6163319 5884244
14101 5884244 5605541 5760154 5443823 5313999 5223578 5353306 5183104 5161721 5194630 4995938
14091 4995938 5118929 4985180 5044502 4853019 4951017 4695131 4576094 4733886 4326511 4272713
14081 4272713 4756118 4573402 4336070 4859590 4347773 4534105 4395455 4194312 4100262 4256167
14071 4256167 4184333 4033242 4047155 3802639 3861206 3943293 3621790 3948242 3664474 3614641
14061 3614641 3684734 3841369 3583779 3696224 3561939 3340987 3502111 3432124 3336576 3502372
14051 3502372 3576028 3438135 3139117 3276499 3291145 3310833 3600449 3204675 3061403 3288545
14041 3288545 3050173 3026084 2685586 2873589 3102439 2757617 2493265 2926207 3232264 3242663
14031 3242663 2933952 3019356 2840515 2988047 2845572 2449078 2554630 2705363 2607967 2760173
14021 2760173 2383881 2506424 2532785 2292537 2464575 2245662 2431645 2363198 2608121 2581277
14011 2581277 2296149 2122791 2284039 2422130 2425256 2229502 2090857 1949479 2401479 1930394
14001 1930394 2176505 2194450 1887423 2104057 1995429 2204014 2124349 2248396 2020270 2185164
13991 2185164 2252965 2666108 2894985 4933839 10070438 26517319 45688698 28725257
13983 28725257 12747707 7546272 5274535 3999920 3387618 3400998 2811383 2714242 2971558
13974 2971558 2627432 2494961 2384593 2311299 2440469 2212821 2441787 2132319 2272591 2045366
13964 2045366 2047057 2132634 2416750 2107633 1959668 2002068 2112570 2012420 1929466 1939909
13954 1939909 1812623 1902996 1868634 1974915 1524332 1845880 2004002 1681542 1769625 1783388
13944 1783388 1595068 1599731 1986629 1786044 1591082 1578663 1460251 1638308 1662458 1669273
13934 1669273 1432544 1687609 1509596 1511148 1578407 1732210 1607108 1778784 1483677 1647582
13924 1647582 1622556 1418495 1337525 1669670 1178585 1516375 1284339 1552159 1232111 1351851
13914 1351851 1142987 1623095 1624309 1349957 1400129 1568415 1388426 1099097 1478928 1314332
13904 1314332 1112161 1318149 1424110 1197954 970012 1207822 1304994 1097010 1150072 1061086
13894 1061086 1620948 1085665 1228226 1456447 1369706 1297451 1176144 975518 879023 1080570
13884 1080570 1079620 1492227 1303009 1175913 914139 1518306 1194798 1080071 1226935 988062
13874 988062 1041941 998409 1071872 1375346 1087310 713833 1027068 1048042 895384 989421
13864 989421 1089250 967441 997812 1144078 1230479 986315 1221810 864470 919989 1189082
13854 1189082 917540 1115355 993084 834725 1093459 1366599 823379 1396621 748503
13845 748503 896444 838117 1021291 469329 739666 670644 788310 1016074 610964 985835
13835 985835 847888 923579 1061382 866695 906354 1003979 744856 924700 1134378 738549
13825 738549 959847 608643 667536 987604 873325 771816 798465 1089483 762100 895677
13815 895677 770871 714433 1029586 564114 741265 741520 644407 732510 804772 1033804 1150326
13804 1150326 695036 745932 817553 781798 674999 1016969 763723 624288 740165 792439
13794 792439 414030 409998 618864 766026 747724 873970 852794 421450 679982 692245
13784 692245 621282 982794 560423 783722 969169 711656 431996 665065 475641 634441
13774 634441 592188 435051 708536 455921 791384 799289 692363 854807 614571 473068
13764 473068 726535 743225 1090519 313284 774149 703437 562935 568635 458479 692347
13754 692347 704090 667760 966668 687804 883985 551533 334217 808338 739656 901302
13744 901302 472994 655488 710849 451178 750425 599279 368521 691498 630882 505396
13734 505396 715841 496411 488197 828726 475557 601945 494186 676997 480075 517921
13724 517921 291805 135324 511142 699712 689573 503024 643412 494898 620573 489628
13714 489628 895924 553917 513414 495147 661688 583787 507159 453425 541479 579952 759783
13703 759783 459759 437554 764634 447272 434426 528372 378178 421809 547283 297871
13693 297871 331155 692156 521775 360077 541158 443827 279201 657223 329811 227875
13683 227875 494691 659810 376648 104074 513057 485199 109407 456857 364718 505149
13673 505149 187230 696757 424114 285630 614854 291763 507317 481903 382395 502436
13663 502436 292204 264723 433547 204832 310267 633421 437975 478747 897583 795625
13653 795625 431549 216482 444675 144927 379088 338346 571896 392497 376389 408750
13643 408750 451580 830473 383499 423709 241499 697934 319705 334755 434515 358521
13633 358521 263099 450955 345061 574852 248523 300873 616108 519380 302394 284963
13623 284963 663977 413491 524329 130693 22629 219905 658596 191838 18421 154610
13613 154610 142585 188683 474690 299615 493456 223079 558284 560157 416669 176388
13602 460900 42588 662577 231530 547191 297035 395535 293126 425003 287179 223408
13592 223408 431402 458949 162576 451392 638697 246487 66823 484553 487374 162546
13581 199638 425852 238324 440093 230015 259724 433033 399865 734772 220317 455161
13571 455161 268955 268156 240221 419366 504969 309691 228841 410452 679812 380009 163862
13559 359968 411637 226590 365819 101045 245768 285114 184943 463928 285569 597284
13549 597284 271789 257605 170917 208476 472456 -157685 82770 285077 296445 34536 72436
13538 72436 113531 277583 219584 217535 61807 313334 190410 229705 -26462 237473 280057
13527 280057 59781 553306 415396 275953 16613 198931 92612 655008 362250 321460
13517 321460 -80926 199118 -107019 85717 93919 571631 354218 -69457 441078 159414
13506 137726 215698 104648 384398 286477 380336 61580 231776 234472 137212 221733 84063
13494 363580 448224 252487 406283 467 75591 303462 99888 250784 540000 171918 478875
13483 478875 357576 449618 360783 359647 286624 300017 59463 112899 224582 128995 489521
13472 489521 78505 199386 408345 178010 162802 59100 229279 44272 166193 335599
13462 335599 -125327 109908 300488 171492 244210 112336 211749 -194097 256841 9483
13451 382649 188161 178706 -149230 -54558 390931 585796 219061 426530 161220 498336
13441 498336 262735 188149 -37654 441371 54787 -98311 -59937 198864 113308 -30294 306524
13429 234879 -131190 434196 380666 1470 172795 399805 518700 84265 -172947 -2370 358288
13417 429511 169801 314419 373218 -264890 169746 355907 202627 605139 202071 379602
13407 379602 -202042 150132 122806 -161016 362104 -177300 279635 122596 189320 -42170
13396 7467 297827 65717 136454 158262 246362 52384 -192713 143517 387805 344930 124296
13384 174963 175057 239880 455121 265967 261365 -13730 262609 123130 69155 50998 347835
13373 347835 660024 -83230 295179 -24930 11105 326601 291772 -75804 -15710 222929 103239
13361 305991 298770 365667 111532 304586 309527 500579 159338 515669 340885 131478
13350 141476 1976 181293 115768 255911 220166 292888 1251 215044 438241 220456 264348
13339 264348 -25709 319696 312744 123186 323865 91969 23193 698044 307920 372684 174327
13327 314900 -57431 256361 -53892 121185 189311 95092 65438 291498 -60984 29163 167740
13316 167740 330563 371727 457574 342551 282726 116416 -68865 261874 293468 120711
13305 263253 349243 181326 88405 181372 153249 -155604 383347 -57394 13102 72274 332958
13294 332958 -144254 -40120 462512 353884 161959 384669 180273 272947 45245 58716
13284 58716 5895 270770 -83165 130618 139839 59350 -5306 251424 -242005 10794 102148
13273 102148 199720 278043 133814 236660 -29685 170432 439363 161803 317256 -44725
13262 259158 -160580 288586 126668 97424 259493 75386 220897 216075 -6124 -368300 -38572
13250 41951 -112946 1167 299519 104891 24619 257998 162313 240361 260469 -148095 -37054
13238 329791 -10288 17712 140189 173897 6886 10114 193892 302367 201466 64447 199362
13227 199362 -30174 84699 148170 -207102 224115 7931 -57859 104327 -57340 121792 206376
13216 206376 85467 193756 -6659 -193353 -12023 -20783 177110 166418 -39425 -20782 -30586
13205 -30586 180598 514606 173082 395966 221248 184305 166449 180126 35672 25190 -13337
13193 -25288 193413 109506 136334 12057 -109789 -24846 56326 209518 147948 45732 -154846
13181 234176 -44644 -206315 -183900 -68710 3164 171296 -46064 -20655 -154623 -44423 217911
13169 117388 247767 93238 81451 -190114 244782 155682 10863 133165 -169978 -12379
13158 -6060 -171907 232681 -37209 -355665 29238 -147842 169653 187677 171955 -43226 136391
13146 200294 229606 244694 214645 22995 -123411 -93040 -80202 179169 -199625 106365 -4957
13134 72885 136403 162609 255441 -256561 174884 13418 -29858 -1926 -30561 235840 76590
13122 9688 20585 -124031 286676 -79083 49303 155504 -150808 46253 118133 -4204 271598
13110 -9129 19868 124434 180685 41820 204212 -108866 94508 200254 120814 42716 234040
13099 234040 -106224 -45414 104010 17364 -143613 190493 -194877 161695 -163113 107794
13088 41768 -17890 210560 307461 112380 187776 142314 95285 253206 139165 -40181 -73058
13077 -73058 -90703 104284 86187 -143717 44517 168717 -163752 126201 -12112 -170533
13067 -170533 -42817 241121 276575 326701 89363 -509895 21808 -26455 11155 -179097 -145601
13056 -145601 328274 -127771 292942 258874 124476 428031 56143 -36605 -231821 -303233
13046 -303233 -31266 173398 -83631 118122 209502 -8170 111431 134187 -67995 183330 -228216
13034 -40945 325906 -115104 -136463 -170015 -11380 -181760 6202 298350 -56895 161910 184677
13023 184677 214314 49370 29985 -213142 -107775 112495 178579 -213473 93526 -151776
13012 -6996 -80896 -161253 254514 82991 49835 -278911 26116 312907 222736 -283728 42386
13000 29603 108424 103898 448535 178818 -89451 185689 420008 63487 -40371 249565 -13897
12988 128737 252980 245969 265171 -18379 -260520 133990 211123 -228539 313940 104718
12977 -29942 -314493 -78684 200898 -221744 292771 61184 150393 38808 -183381 190141
12966 47490 60330 -116133 -155100 89918 161700 47843 -20432 153366 108950 272460 238841
12955 238841 -26893 -378158 -6211 -247737 179715 154294 76787 -248944 -125216 -33594 81018
12943 44554 9668 -58802 5533 -93870 4168 -103874 -160452 48118 121357 4693 83654 71542
12931 71542 205064 -135942 -89208 237067 447897 -50168 6849 12489 129431 -213656 -123535
12920 -123535 -87982 -16498 107094 -143155 30827 175718 -592 23737 38668 244370 62560
12908 -364402 11378 -3819 -149974 265028 162839 203702 357119 -64844 315334 -107995
12897 301922 141613 258412 138101 -106811 139040 -265149 -3875 181107 73071 -422792
12886 49903 -185661 -162879 -143251 6116 -346239 -162914 -29229 127589 146788 103647 167637
12875 167637 363247 -181678 60915 234508 187904 18586 -90298 49725 113170 -102698 -264962
12864 -264962 -146618 241663 104489 130365 160400 -35104 -174798 323159 307801 144523
12853 65558 85959 -64824 334103 -308212 -96911 -210515 -254494 -156149 -187156 28204 300444
12842 300444 -222497 82828 222806 -17561 37430 102144 -51333 -288164 -150417 48542 220104
12831 220104 -214689 129507 -314253 165041 -117181 234125 32305 -59361 -105641 12397
12820 -252000 160414 36839 8294 -195479 226804 -38867 159679 63967 10164 39410 28204
12809 28204 -31993 -247259 -187776 126356 -42783 1654 185515 337667 27664 -40491 74950
12797 -124136 241301 -310622 50575 137650 -349533 314668 77340 -126170 203449 214337
12787 214337 -153500 71240 216019 -44627 -61350 -65259 -52795 101266 51136 112469 -195921
12775 -244726 331407 -79182 -82696 -155312 135616 209405 133565 197710 104489 -201322 269522
12763 -126571 164403 38227 47410 -211565 -24243 -89043 216911 -245392 -198698 268396 -133970
12751 147561 -177767 -4520 -45113 33666 -438594 20338 -37058 -136063 -141041 -275345 221318
12739 113448 362663 -49713 83744 32057 -184739 259167 94546 -170528 -106956 159925
12728 -76391 -51141 51887 14589 151191 228669 15952 208490 400232 148550 20801 -123746
12716 -47181 387980 66383 -4932 -114891 -28128 78474 -65256 97764 -311588 23974 -17846
12704 -240009 -347139 82963 177458 -49014 207927 41253 -31117 201538 279951 -406030 -38938
12692 367405 -75428 -201913 259574 -41076 -119184 14962 314094 -329951 -27225 -103333 22462
12680 115341 282345 17528 1763 -71529 216676 39008 -275921 -107815 32201 -178101 -245769
12669 -245769 25126 -150678 114170 8825 96203 111974 316554 64817 358925 -240175 106434
12657 131984 223179 193843 125001 250230 -30197 153677 390747 145120 -291196 33578
12646 -194496 -153766 -243514 -157641 187120 3017 -197953 64429 -64399 136271 -159821 -356328
12635 -356328 -262351 -24807 -64512 -142247 121492 -113669 -21711 200639 -68179 54512 235815
12624 235815 199963 357814 172437 -384228 172502 27625 208959 -34106 179662 -239751
12613 255914 -360531 75424 34306 64278 279676 -245449 159418 -246193 -107667 41907
12602 198187 -56145 -186664 -148026 238075 70646 -140545 -250700 -117435 26480 -235080
12591 -158165 16081 -305362 292182 134883 -22052 -370791 65756 -11241 58557 30385 97664
12580 97664 -206104 1078 -50662 177495 285499 127702 -223966 8417 97412 -27907 -71886
12569 -71886 -13234 184200 -88557 126677 -257237 181284 37115 -60669 180519 -112489
12558 -312593 23360 126494 218744 52979 136780 -167321 148764 -170398 143891 -31182
12547 285159 370319 110465 521415 255703 435833 274493 -108481 -6754 153752 -73002
12536 -127220 -114001 202695 34299 38763 244492 329810 -29332 9339 -92128 -172919 -107764
12525 -107764 4406 42037 -50963 91834 146897 186992 613971 185464 230258 472014 280255
12514 280255 262646 325488 111601 166206 174658 -3477 65820 403376 29219 33371 -6901 -121976
12502 -121976 41908 -397439 234521 -16899 -83 -303132 33163 -105993 368326 19277 -10748
12490 -29613 128533 -89302 143753 275624 192313 401308 130650 71575 12749 26932 111845
12479 111845 13833 -11703 122445 218857 -94770 -241074 -54856 -65751 -61443 -39946 -119178
12468 -119178 221997 15109 -207836 -10497 23456 -37047 115481 -128953 73492 369015
12458 369015 85825 -70755 37140 32483 474809 -91073 -117577 -50720 -52626 91750 266544
12447 266544 202501 187973 108234 40099 -71483 52172 -191949 -60692 -257443 -211761 -51116
12435 88497 3161 28066 -14274 -394111 -90799 -205103 -68768 -392202 -234301 115058 -84951
12423 79897 -79753 -391697 101166 98212 44254 -103048 -20224 -32640 92883 299941 -227553
12411 -184555 -66245 15369 39322 -265565 203402 -11825 104493 -52639 -39744 56858 23161
12399 -114282 115089 -186530 -227032 102944 -36155 -145092 69934 128385 227705 -212060
12388 -101244 -75789 195109 247978 183546 213999 202276 49638 -78601 90810 186942 78858
12376 207040 2676 -59593 89307 -21885 34228 -15660 152264 87078 237349 -260759 -432191
12365 -432191 -123649 229804 114423 235142 -58009 51371 87695 177357 -134417 -168062
12355 -168062 -147042 5046 -71888 153266 -42624 58799 -123952 -81907 108928 46528 -189493
12343 -123838 164299 95889 151994 -28902 -69410 492560 167217 -125318 171529 -18062
12332 -203135 -213411 81494 248334 -30256 -33636 -121978 476194 184224 101158 -115920 -104577
12321 -104577 179131 221501 149140 -36804 -72462 86032 -110213 88520 110683 -8880 -121124
12310 -121124 143862 -5826 237341 24601 110881 116239 119514 261398 -135946 273771 27096
12298 45876 -181308 -114491 231802 -132988 93590 -150893 266358 272455 -81065 -234231 -173241
12287 -173241 60621 -121486 146006 61038 312016 -170110 269900 61689 82009 101640
12277 101640 209734 155027 -49623 319823 104874 51611 -23879 -34330 222297 -126534
12266 263304 327987 -222441 -240188 -1334 172883 -23163 -172353 -143294 7876 210562 -277544
12254 -185814 43531 -160361 88099 -55654 96536 188809 -31082 89153 -128748 222214 110753
12242 -209652 191210 302379 14906 1667 338930 -12732 100332 297311 198408 -104568
12231 89067 -165638 -63940 137021 19693 -446305 478305 23897 352046 162837 39839
12220 -82096 115291 341888 -207224 374281 71633 182227 21071 36786 128070 80538 273522
12209 273522 428496 456241 170346 93022 429308 -75288 112919 289160 -108653 371577
12198 461052 494987 390805 -34827 105854 416078 69957 -28644 332327 226962 101633
12187 395629 448916 -36021 452003 388680 318347 359617 113923 357496 364841 58348 398402
12176 398402 -6556 275948 363065 377686 49258 -4517 -119041 258475 223716 -87342 169293
12164 311040 -60040 502504 -294204 190736 258172 320374 263787 144413 1034 86394 129083
12153 129083 -6644 -16615 43645 253396 96901 107831 232469 154699 161463 183031 182260 -89122
12140 217188 146875 177227 97477 98147 319935 502838 367606 108606 140051 -8429 -119375
12129 -119375 332084 33229 314690 -8370 -150303 -58552 109058 -70608 361209 80727 206147
12118 206147 50405 19430 -64149 -231660 21443 23892 -44618 119408 -11884 167695 114079
12107 114079 153856 -106969 -118604 264058 46197 233526 -167628 112758 241455 32010
12096 -4672 -37597 47591 -102410 -103324 -173871 -95699 120840 33620 113561 10398 40006 -23141
12083 53244 327942 -47730 -91435 8842 69135 -21135 483994 29883 -113904 -17553 73104
12071 -102848 -39569 291378 -125285 -74319 -112176 21675 90316 -271851 -86725 161073 -62432
12059 236409 174096 5343 -183620 -264273 -67781 17098 -116714 67275 -108638 13553 107271
12048 107271 -186374 -83206 109653 -108053 -67602 -260994 -38899 102259 120145 26162
12037 10760 70390 -117800 -76013 -130400 8668 -223714 25093 -40549 14987 31254 37734 -19622
12024 16026 -33302 -78863 67882 -375872 70896 95839 -202947 -313042 -11677 53674 -85716
12012 145872 -33208 -114784 177 268167 -125834 -390264 -65626 313058 273085 -58758 183693
12000 90261 -100123 77201 76485 -19785 238681 -346758 -47391 -184418 22134 259966 83221
11988 246563 -340603 -125351 -28302 203756 58335 -272921 178043 -17347 -158395 -33827
11977 239385 -239563 -22316 -67484 34640 -23995 -202124 183857 -81422 -188992 -223905 -116504
11966 -116504 -105379 -63079 -96366 -2100 -7298 -224589 -143173 47057 40002 -133314 -265649
11955 -265649 93428 -577 -63619 52453 -28318 -265055 -187879 -137320 -30195 39901 -211138
11943 -102333 -66994 -125190 -187286 -158114 -15726 9995 -55943 116426 26049 -107658 -212236
11932 -212236 -103594 13692 -166297 -103198 -114936 84471 77105 -259211 -83959 -133932 -209390
11921 -209390 150189 -153422 -90483 170654 -155424 148701 -22571 -232553 59584 -41934
11910 -158915 -231803 -178548 -339895 -73980 445251 -143666 -260770 -21309 13262 200943
11900 200943 126427 -177163 202556 213824 -292798 -264598 -165990 97881 124587 375209 -70598
11888 161879 10887 -182318 -120436 36653 -4138 191365 127728 -96349 -24110 1368 -30602
11876 -136986 -246700 -302801 -65337 -117326 30058 101083 -116350 70259 116925 -21117 107817
11864 -272550 -147967 -15871 -58329 -100403 70639 -267384 63986 -240472 162383 -64510 -225350
11853 -225350 -152899 -280254 28488 129959 -183947 -42713 -66014 -89659 -160923 26281 64231
11842 64231 67397 149673 -82530 -3163 298571 -212125 108153 -290260 -79801 -192847 8225
11830 62881 -62549 -28876 -154695 -233819 -97314 -215447 48668 -144548 19963 -150823 73868
11818 189553 -3866 -17118 -99222 -208242 -330674 -40996 147700 -382364 64616 -143021 -315368
11807 -315368 -37122 -420184 341 -115497 -9311 -343135 207875 -80735 -146723 -337959 -171126
11796 -171126 129681 -138083 257784 -29111 279372 -92130 286808 -276080 23658 252348
11786 252348 199831 128696 -286461 -61978 -246571 -128382 -125703 -1246 -182361 -179592 92368
11774 142897 104516 93994 -134893 -40298 -140695 -294057 -103010 -88016 62019 151831 -172102
11762 -179559 -56670 -272729 -167238 114871 184284 -171626 -240252 171607 -40375 -7421 -26535
11751 -26535 -108241 -71452 -128359 -84741 29327 224671 89933 -300129 199689 137688 -118355
11739 5491 97370 -174787 172048 -14385 -136900 102696 -208779 -133772 116466 -185341
11728 -157541 -283140 -166862 67247 -124974 -404889 14372 -217717 187855 161206 -190828
11717 -215909 -85710 163706 219032 -370366 -316887 70750 -255220 -160433 43778 -239627 -29712
11705 -398064 -61078 23399 75252 -261912 203022 22024 -56188 20032 -84733 -259561 -106712
11693 -149985 128823 40314 -122765 230175 47647 310549 -91174 -91579 -110990 66337 -26982
11681 -97979 -218262 10307 -10479 294320 -338747 21038 106345 -3311 129639 73525 406972
11670 406972 -406972 139443 61780 -129626 -39631 -190307 -310097 -419188 -77256 -200993
11660 -200993 60388 21397 151589 249402 -6553 155775 36333 -41870 -203286 410636 -128134
11648 -341104 -66102 84828 -163807 14616 181699 222587 -132006 -1159 -110088 75158 -142405
11636 -197238 -69567 -455731 -179256 65471 372097 -186450 -22988 -312279 -132307 58330
11625 180723 190543 -110281 -8392 -26829 -310601 -207508 -280642 -24921 -136670 15693 193329
11614 193329 -114452 -170399 -56426 59936 -129080 -30604 -94915 95252 -206681 -98617 -90301
11603 -90301 -64054 27131 -256823 102657 -177005 -148292 50465 20568 149156 -311719 -125072
11591 -252674 -238321 -411878 -77953 131560 -103924 -215032 -226315 296595 109009 -65853
11580 -98569 57068 3646 -146063 27781 -33184 66759 -134930 -16406 -19506 -12099 -162466 -150000
11568 -150000 80570 -201887 6530 -158416 -102271 -98535 246740 -163547 -16038 -24412 -160458
11557 -160458 -156976 129577 87276 -318402 167954 -52854 106793 -84097 -11733 71086 -74977
11545 188920 132967 -142895 201108 106463 -187992 171396 -272868 136820 171081 -38249
11534 -210475 -188586 -283106 -278584 -130959 123205 108146 -223735 -23013 42069 -243001 59153
11522 -6688 132711 76476 -37865 -267832 -115568 9887 160117 -11175 -83154 159378 -251811
11510 -122181 33918 -95363 108477 169521 273316 73487 258688 332710 -15293 -43189 115234
11498 -84500 32248 1610 173014 -87844 236624 15308 37569 -53544 335963 86155 25198
11486 -79588 97140 158563 -8413 -155914 55535 134417 55084 -42391 136685 217049 102805
11474 -404746 -278811 44325 336867 2125 89766 134674 -11011 -177565 107164 60396 145158
11463 145158 156874 201162 67432 133844 290852 76359 91005 -22622 290268 12299 48680
11452 48680 81568 356363 361570 59414 -308426 -228797 24938 -105748 33783 165443 31096
11440 90993 14623 198373 97553 -301275 -103783 27674 158857 3142 -51018 -5486 122754
11428 45485 32707 -261484 87345 179690 173494 110655 223450 -175159 123417 323674 -125698
11416 11388 66743 20766 29351 -83357 -226329 -29462 -206934 -27248 291067 268087 -207304
11404 -76312 -208416 70618 -226283 -62157 215274 -178639 144936 24140 234579 -99119
11393 397921 6114 219799 -24050 -173049 52390 84084 18264 48761 -1215 37263 -120671
11381 -67851 -41635 340889 -185506 85116 4189 -1931 39422 -30059 -196141 47285 2687 272839
11369 272839 127771 128400 160043 -332055 38863 -159423 -77864 -260471 -222219 32880 167178
11358 167178 128415 -200431 13159 46232 476623 165596 -190880 -531763 -94475 87695
11347 -42017 -218456 153003 -42812 -40261 -68776 193479 -313172 96011 -166235 113177 213193
11336 213193 15854 -163666 -111306 -88432 169913 78235 -192190 29457 213139 196668 -43083
11324 -137334 -103054 69855 56588 97968 92821 250780 1507 -188159 58115 -4835 -6581 -198212
11312 -198212 125419 -1114 336660 11459 96437 256344 -235006 -10758 -140214 -146531 79019
11300 -124412 187927 -206750 -30492 312007 40394 40624 235438 -65051 -95530 -138459 287292
11288 -26855 77944 -113012 91546 -83575 -242553 -11250 -185305 -332758 -385192 -45470 -142515
11277 -142515 220371 -112495 -47043 -303047 91487 152961 -106508 13142 -255511 76963
11266 -26374 174021 -68601 -58256 -169235 -128914 5350 131980 257462 234375 166479 20242
11254 -26600 28790 -231842 48165 -26658 222323 81479 82483 -109286 234824 -323312 -291028
11243 -291028 -22476 343648 -150531 301188 -244271 4583 -243348 -166063 -25818 73797 -199098
11231 20172 -48475 -223194 11644 70950 -259338 79515 276836 -419220 -209945 272632
11220 50717 -78403 -111103 37550 -15073 -212901 36743 104084 -111627 -387811 93992 -150750
11208 162208 124392 -172026 -90108 -53122 -127100 -36005 185413 106596 -75419 -280949 -195632
11197 -195632 -331748 -28433 -47830 166999 17561 -255143 72484 -47738 -320113 44094 -309456
11185 -211482 -299088 -76268 66574 -69987 19044 19232 -257251 -12769 17437 -152947 44345
11173 64025 -96317 -132196 -38985 -268552 -115628 7738 -11632 -210363 54251 264650 -15263
11161 11572 -219431 53103 34649 14121 -58422 -76212 190162 56414 -62042 -53221 -13387
11149 -174930 -73099 6189 -2400 -24311 -37093 -127203 24992 40562 -240385 105750 -113818
11137 -174370 -275588 -442033 -181048 -236692 -293168 -420142 50325 21180 33031 50615 194511
11126 194511 140972 -85403 64336 463996 30126 -123906 77464 -175344 -49111 -185707 59467
11114 264176 -157799 -53759 93228 175954 281023 115020 229386 263818 50388 -8792 201338
11102 -199395 80359 10360 280375 -89803 193822 -102067 184270 7410 186972 -11300 198970
11090 -234634 88152 361607 174667 182295 186746 347191 41442 -246688 183548 320856 97849
11078 482931 187252 279655 -68391 320730 -3484 4619 245166 164643 272873 279941 281761
11067 281761 48700 126434 36406 198731 145563 201508 100300 31011 352172 234677 135374
11056 135374 373151 246653 323772 589954 407502 902890 506874 558011 416144 579622
11046 579622 249761 428946 715521 562466 509759 842071 689481 818352 809001 534731
11036 534731 979681 596043 782981 541524 524931 755465 589724 988406 837495 490116
11026 490116 655257 450139 709427 417232 548364 794440 275380 553867 724929 718116
11016 718116 816583 577145 656477 643504 519188 682280 349107 545034 935917 499418
11006 499418 724365 305636 387686 529098 533843 343167 512933 379896 542166 368318
10996 368318 662849 786098 427528 589777 474131 499160 665737 363026 347581 268707
10986 268707 739615 588247 431608 697958 390018 211175 458351 514094 610944 632420
10976 632420 615652 810585 836749 811571 1069612 965311 788612 1022906 1173212 1230516
10966 1230516 1429781 1438095 1842356 2003454 2124703 2538771 2491994 2973783 2721440 1840030
10956 1840030 1561259 1711884 1093723 1198973 1118221 935652 611560 885601 702180 856194
10946 856194 569518 646410 705435 311048 441882 44549 431338 470825 375380 364583 -168067
10934 -14612 202243 -31796 305370 -4869 -57002 269111 69749 -4698 256694 147221 -109012
10922 -89937 43432 134272 156607 -180243 -108507 159847 306290 64588 157843 -82863 124841
10910 -31672 -425230 149818 221613 -173847 -130138 -188652 -50278 -38863 45589 -72787 332762
10898 -55794 227443 108721 186353 72501 -25335 -111032 15496 37171 23929 -196532 -2828
10886 175889 -255226 -73459 428332 -251996 243182 -102801 57522 128695 -212148 35141
10875 -85353 -42913 12342 -131429 23447 -284308 -165665 -222757 63819 -206337 -71634 -151593
10864 -151593 -110656 -161098 -56776 -97969 -74181 19686 -68397 -11099 -166219 -197724 -224568
10853 -224568 33880 -34362 -6526 -122026 -30634 140927 -122177 141764 28136 -37405 -62997
10842 -62997 -4483 -5926 -194046 -124320 -8453 340537 -84487 -197870 -199683 219443 110677
10831 110677 -24075 -309267 -492746 137382 183006 -209373 184722 149888 -134800 37123
10820 83618 -266070 2976 49406 -277206 -106948 377 -283549 -163706 298087 -206829 117291
10808 -191956 -127959 -118887 -85478 136105 235504 -158570 409074 -472077 -67815 -278887 219014
10796 -65506 134343 206586 200122 -268904 -427951 95019 -50191 21534 -180375 -56097 79140
10784 50946 -329090 226233 47218 -50376 -185764 -85294 96558 -136952 -174595 -151732 -202022
10773 -202022 -186445 -100710 -324558 3621 3292 44609 71165 -124263 -7093 -68040 173752 224724
10761 224724 232748 137656 -267936 -376677 -432681 -71938 93618 -72255 124744 1559 -30133
10749 173287 160959 -122386 -81942 20127 -27471 -409997 -239397 -150783 13473 166790 163528
10738 163528 172690 -373256 -193809 -14551 -11751 -53807 52617 -312822 -214901 -113460 137302
10726 -361663 127987 -69974 -58396 26166 16251 28245 -66115 38032 151284 -109670 292312
10714 -362616 28230 191223 214584 59617 36626 -6957 -73418 141625 65275 161536 8770
10702 -307620 -260818 -105052 -52036 -294966 -69757 -170916 120052 225204 -343295 -83189
10691 -269113 66075 -152840 4655 -125432 52749 -216460 -222154 -101203 36752 192104 -109381
10679 -147553 104572 -39808 142601 -35580 -87170 -161963 -41325 -152959 -67443 165859 161086
10668 161086 75833 2825 50781 -119058 -263638 -37802 -123597 -142482 -244627 150808 55720
10656 10067 -91152 -7373 98352 168316 -35612 5382 -196754 224933 1902 -40172 -285976 166874
10643 -19999 250128 -127403 -167646 -258503 -129757 -118383 11236 -79583 -260128 375077 91153
10631 148006 -226590 107783 -200662 -264333 93417 -335481 65336 -120882 -198077 272846
10620 177781 145444 195581 -109688 129073 -304192 199530 -262464 148705 -160069 142030
10609 -211933 -160775 -303719 37019 206110 175280 227965 48596 153410 -440803 244881
10598 -115039 114135 482185 -6065 -313065 -352116 -199044 -171389 -133465 85552 305517 237199
10587 237199 96279 66653 -66662 64114 -236943 -141560 -84289 -151677 -768 -195721 132544
10575 64832 -104586 -85160 208716 163488 -151514 -210596 117425 -200341 -40470 -136119 -204075
10564 -204075 32778 -319858 200727 153339 -172452 199572 -148976 29803 312292 -19954
10553 -270664 -125137 91875 47909 -360838 -284781 -11419 -241926 -297399 -47755 -91968 -100500
10542 -100500 -159019 180953 -5869 195454 8405 -35546 -32051 -224772 -111679 63857 115273
10531 115273 -185319 -9159 190697 -52518 81543 -220122 -158376 255268 91761 -181635 -416673
10520 -416673 94639 -52177 -90261 -122266 225770 -146617 -18010 33750 -127529 -159023 27465
10508 153199 -179103 -190605 -75488 -106159 -264048 23744 -62410 33591 350165 -193357 -139248
10497 -139248 97364 -42266 -162911 133653 -142848 63580 170987 -175134 78298 -40606
10486 345117 -134311 -181745 85933 46732 76229 -223999 -568868 -204982 48415 165122
10476 165122 -19380 88413 35955 272307 -107354 -133261 -293114 -92317 -213033 -40963 -205611
10465 -205611 -84211 124667 65595 -207203 10177 -241330 -167027 33288 -229859 -43850 119915
10453 -114098 62304 113443 -292807 -31746 134230 -109761 -221126 -498381 18844 -285900
10442 320333 -89750 -21420 -323976 -82008 -170570 -147466 -191368 53566 -113837 36469 -355909
10430 -423190 -111875 35549 -186518 381628 6723 -56349 235933 18047 14178 302885 76696
10418 -149524 -81890 -289425 21078 221768 35660 60934 38970 142553 -3847 1065 -12087
10406 -228621 104525 168178 -132536 98029 -18135 75517 58881 69580 -42453 -39711 -194319
10395 -194319 -184052 269855 -132897 -142761 -192005 -39892 -159022 33448 226955 157290 324575
10384 324575 -14970 48854 452393 22925 -3614 201696 -343767 96496 -86590 134244 -6854
10372 191108 -12921 121878 241391 137251 143347 367911 407040 -894 156390 331412 518901
10361 518901 265977 25635 147431 197810 420332 218638 34883 109305 -247478 182972
10350 299460 -11349 56184 -42011 424864 199727 519621 402112 401589 183331 273839 171287
10339 171287 221684 182794 227991 346623 -77453 -64073 209236 536790 69577 427554 -210557
10327 270088 286135 340550 -27888 -54193 -22815 224830 173232 261484 73827 -257657 72406
10315 212580 46407 269783 89436 -148728 -29868 206942 108075 102374 -185558 272691 263194
10304 263194 -98193 -37039 -34329 93598 70557 136130 -39380 -298933 -65276 -107152 -52316
10292 233674 -86382 83305 25420 -38907 -37910 -116855 -85494 -56244 -42352 -128979 -318412 383172
10279 41214 -229750 -31012 153365 -53381 -303419 -203170 38275 -38204 28949 115355 -243804
10267 -87386 -92104 -86486 -256200 -220643 -419850 216549 215333 -111826 -190732 31590 -144111
10255 -11647 -113479 -171835 203589 -11461 -207438 -169668 -178481 54287 -124454 160058 291938
10244 291938 240605 57339 54859 -103746 295934 175954 99143 -49420 146490 -211292 -26548
10232 -102901 41074 178960 248324 -12321 -32535 -400522 -178713 -3706 -52002 -26450 -124001
10221 -124001 -47654 -87173 -146292 -124336 -239554 -434767 -79632 116736 140067 -153459 15705
10209 -366016 97479 130527 -254992 -221996 -4918 174167 192012 61739 9829 -234007 -123692
10198 -123692 -327481 138784 -198424 -89315 158834 128526 -282945 -526525 151691 -46628
10187 257812 42086 -74563 -51843 184422 112289 -206485 -27265 353254 121113 236596
10177 236596 30826 -56139 104244 171155 -52277 -52480 -232879 -76749 -103602 114739 177323
10166 177323 75809 -130839 -165910 -89910 -190340 -160457 111934 -89476 -108507 -254288 -218828
10155 -218828 -257285 -98256 -67414 -251156 258070 23780 -63638 -77702 30819 -83 -121231
10144 -121231 19431 78402 -52265 32137 -369398 -17067 -176957 -180257 -155407 16243 8068
10132 -63893 -32337 163963 -106466 -260660 190380 -10378 -100929 22865 -390958 -307659 -115053
10120 205662 59715 182588 144480 22637 205338 48741 -312012 304089 -14043 -171149
10110 -171149 64957 -150620 -130182 31057 -88947 15271 -81410 -90450 221163 -162897 -113005
10099 -113005 -9838 -107723 -127530 -173093 -34158 -19032 24250 -263875 -280217 -101218 118180
10087 143343 -235788 -50539 -33243 124766 33676 68568 105322 68220 142124 231144 -348030
10075 36392 -124130 143310 -135871 -14291 -31693 -21969 -97242 -62359 5758 68535 -211885
10063 2171 -131588 -180539 75122 -145540 -266569 -101912 -119366 -27508 -116766 -111145 12444
10051 108074 -41642 -221588 -31104 220378 -30140 -202726 -40766 -19186 118081 59997 -115407
10039 -287642 -49256 -15026 -226891 -135503 -191885 -187057 -278002 109699 15259 130618 -166032
10027 -228839 -171890 -25936 -200559 36363 -120890 261022 -13052 -232635 -40250 35964 -63374
10015 -280220 -172681 -174729 -272410 -144210 95597 -153810 -80552 -250446 -120252 269745
10004 218141 -104235 -163140 88944 81563 18319 -74845 -103559 -31067 -241765 26425 -310130
9992 -374203 -331519 91037 90355 -77466 -44845 -158527 -1495 -196119 -153001 -59115 -265372 -161339
9980 -161339 -86004 92075 -386317 -106878 123685 -421099 -8525 -170861 -210705 -73620 -7123
9968 199093 138773 223881 82977 176318 202572 -112268 229605 -2444 -271500 119236 19639
9956 164131 256309 -11977 -143473 183706 -88325 -257872 25604 -85338 -220965 -335899 15032
9944 262697 -59379 -48679 -45995 -214694 -181737 -41845 -74628 -331597 122101 76960 -42057
9932 214809 -417 53094 127401 -63268 -166596 222241 -260501 49959 -40736 -22740 93825
9920 164180 -54720 -125396 -223479 -211281 90738 -30925 84621 -369173 113904 67905 -209110
9908 102258 -78283 -102236 -119542 312323 -277602 230939 -51479 -125869 -257986 72770 -54027
9896 -126344 141368 -79334 2625 -81880 243578 -30699 -67399 -17695 -225363 126653 -259907
9884 -89487 212909 84810 140807 -215500 -173066 52438 -285086 -268008 -102556 69786 9033
9872 -226530 -335867 92788 -148843 -75783 -264985 -1737 49205 -85111 -239110 -146462 84212
9860 -88215 -238642 -99371 32328 -3803 -156197 124899 -169576 3009 205311 18067 86846
9849 86846 -420932 94486 -140008 -115460 -144519 128262 402779 134881 295950 -52784 31061
9837 -152575 150597 32745 -53570 -61963 -239953 -202794 13431 -147802 -446269 -206665 43011
9825 -193017 96867 210044 -1322 -16170 297185 151678 56523 49120 74304 71625 155467 -181214
9812 -124442 -100004 -301522 -20900 -189202 -278344 -75335 -175852 -205041 -195733 195511 -81704
9800 -70142 -31522 -199995 102424 -216308 120669 -114814 -90452 -34268 85726 82762 110030
9789 110030 -85044 -161502 -80316 -11983 -71586 -290465 30188 -83658 370002 264279 -105041
9777 -2684 -170116 111320 8925 -232225 67009 -76458 165945 -246870 -336702 -143903 -172838
9766 -172838 -21452 -61993 -178880 -42814 -204517 201154 185428 -105777 -411885 -201370
9755 -64717 -279731 139264 -88939 -324048 -244562 -242898 119374 102499 -7086 157697 -376660
9743 45451 -402109 4813 -25901 -106024 -78610 -33533 93799 -183351 224351 -156859 -131381
9732 -131381 -128216 285536 -373911 154918 76143 -209370 -161136 -332364 -102847 -30782 -116844
9721 -116844 -94225 251835 180748 -250183 -32112 63796 16094 300871 55174 -190092 -154989
9710 -154989 -6168 -263636 2814 282683 -198914 -297446 -15442 -423642 36005 -291234 -30934
9698 -208929 28995 122719 55581 -79283 641 -278498 -258276 277419 114506 -129095 -402094
9687 -402094 -140629 -9731 48342 -97089 -20338 268871 3305 -103232 -325637 43728 108507
9676 108507 -183454 -141451 25982 -154411 -55844 -166901 100863 48359 152451 83890 -150869
9664 58527 -170404 161005 59873 -73450 191531 -184249 -135407 -169224 -174387 -58109 -173951
9653 -173951 329300 -69696 -174402 -130029 202041 -22321 -85946 161482 -68781 81276 -191335
9641 24571 -233127 -339274 -65512 -199618 92249 -100867 -193004 347136 -205353 -50480 -56688
9630 -56688 -142306 -203358 -214544 16539 73723 175057 -108555 -354351 -148513 -46859 -247911
9619 -247911 -13865 -27889 110718 -13331 224623 58264 55403 171420 201099 139647 14877
9607 45664 -34012 112028 -129902 87607 -120244 -25326 -3021 14741 -37814 166785 -114586
9595 165513 -10114 21254 -158173 96948 -35324 -52869 94628 -53265 -86598 -49160 -50267 53157
9582 -48048 86073 -110926 -130254 -159477 -49621 78609 -426322 -567328 -166947 -186974 -205293
9571 -205293 -30022 90410 -95718 -176409 -144523 -167058 74447 -179189 147462 -142475 -185931
9560 -185931 -199167 85130 -336929 -342121 23579 -107739 -195236 55079 -356868 -507041 -93532
9548 -268535 -56640 75256 8521 -209859 -65799 -193935 -53487 108697 -60817 -127708 154118
9536 16322 -219951 -202260 -100474 -80967 -153002 202176 -211992 69079 7571 79034 -357952
9524 2873 76277 -134939 -176690 -274554 -61149 -23089 -132912 110678 -189946 -238569 -250119
9513 -250119 122764 127507 -17452 60870 -59400 67568 35295 -4778 36934 56035 82002 62405
9501 62405 -371112 -43216 -242066 34419 -100928 -237861 -59504 -327809 -200923 -108071 -339017
9490 -339017 -121984 -216434 -187928 -113671 120906 -77234 -3066 35062 3244 -296677 21703
9478 -13199 164792 -353395 60108 13437 41284 -43471 -42051 -236602 96781 -261253 -247407
9467 -247407 6342 -163550 -162536 -92122 -78291 -54040 -46978 190605 96321 -87407 -357734 -203206
9455 -203206 138786 13234 -219471 -95475 -267194 -7802 240740 -35098 157377 -199712 -82334
9443 69455 -189345 29795 -147708 -72749 -4288 -99425 -330243 57167 39255 -57370 -331976
9432 -331976 -93577 -38645 -20624 -171970 -18590 -17553 125801 21074 -174518 36670 3309
9420 -8613 -142868 3632 -156805 140682 11488 -13911 -138084 60185 -302161 101269 -64403
9408 217134 -242682 -38984 -231469 22635 -169051 31758 -210222 123030 162781 44430 -373407
9396 -19910 88536 -108332 -122071 79966 -376576 -89616 57221 61636 32925 -9254 -32382 -182145
9384 -182145 -60411 -128106 -385916 181082 -94968 -111296 -356908 92629 208759 -82005 -68830
9373 -68830 -237371 122350 218693 -120834 -275058 -13433 -221287 19741 -60182 37071 -146787
9361 -64589 -329762 -237900 -47570 334286 106282 75309 -46255 -49014 -38751 5367 -280859
9349 207692 -298395 250239 215450 -60614 73169 130417 -402520 56830 -233576 -35341 -118631
9338 -118631 103244 192371 -438851 1541 -122072 -33128 5485 -183408 -77590 12861 30831
9327 30831 -20307 165821 -94118 -201322 135111 -146507 -145938 5695 38607 3646 -778 -347019
9315 -347019 -23185 -41955 263877 -138592 -23652 -102840 188671 -236320 -65320 121259 247847
9304 247847 -212459 -233315 230264 -110736 -32148 -79615 -160785 -193075 142631 -122199 -161077
9293 -161077 -104357 -87209 288032 -426757 149440 105068 -284241 32760 -441009 -141935
9282 -170368 22435 4313 -223780 -101134 15010 243165 -44781 -247967 -130859 -70650 -143202
9271 -143202 -12619 -28669 37131 -93533 -209320 65351 85901 -223093 -62779 16476 -52355
9259 -279021 80517 -377507 -82832 209017 -381549 -460517 133179 -22474 223010 -156153
9248 161678 -29402 -98373 -194426 -452987 -211760 -158634 -187129 -47567 -6924 78737 -136107
9236 -15662 -312532 -96046 -140431 -139853 -309547 76729 -25233 -119519 313802 127087 -324739
9224 -313342 -272523 66060 -119617 -76960 80496 61192 -220234 -10390 199423 217860 -104106
9212 236038 -122956 -26652 54577 13032 -37038 107257 92733 -164455 227823 -38624 -10453
9200 5472 9592 80274 -162671 34227 36851 301056 -135616 -99001 -19175 121441 -170729
9188 8698 249322 137838 29231 -62428 97163 269183 -144255 273814 -100704 -217483 -62715
9176 -88577 204610 -225552 -2414 -104173 160596 55575 -71405 187791 -77069 -259977 -203348
9165 -203348 -100479 -52520 -256718 -80652 -62327 -154910 -103097 294832 67826 -15347 67021
9153 -85548 255817 148406 -137740 98682 -144796 -323398 -202678 -221288 -267641 -113396
9142 -297327 -355566 -587585 -88933 -308117 18866 24997 42561 -254514 153060 -38946 120800
9130 219984 -90885 -8057 -171648 -245600 -23817 -95214 -98305 -42988 131658 51015 -126087
9118 70975 -321450 -107778 97163 83524 -153 99557 -213348 32826 -28060 -35897 -186228 170443
9105 -29898 196433 -168239 -27757 349847 -125142 121155 -337353 -43201 -104346 -343149
9095 -343149 -12527 -102042 -92461 -121263 74664 55135 -117590 166944 -163099 -96915 213709
9083 -190154 160435 41839 -188459 -189602 -140779 -14324 84093 -55735 -16272 212008 -156477
9071 -82745 -96745 136502 23045 -258202 -103758 -109012 50018 -64869 68166 -125077 -24250
9059 -301931 -220463 61060 -1730 101595 208464 -27388 -37035 285906 -148815 11775 -201762
9047 222447 -67113 68691 -118579 -11785 59885 -51587 87324 82480 -422081 -173839 -35942
9035 231679 176598 -176702 -67237 377433 -73092 -27859 23359 -82489 274197 28772 -29819
9023 -184022 -115702 94274 -326552 -121012 -244698 53007 95866 -4589 71642 -184254 -249884
9012 -249884 121371 45598 114078 -41075 -294238 135982 -213168 -232899 -291555 -77278 291120
9000 -53715 236428 -50943 104516 263759 -31221 -241418 65670 -182367 52665 -54691 -139456
8989 -139456 -7744 -39364 -350757 -106959 -42529 -29937 -140807 -174821 192141 76523 78228
8978 78228 -306223 97994 55469 -229668 -87903 6798 -106712 -68283 540 57123 193932 168448
8966 168448 -86493 -10723 -133848 59552 -190556 -203767 -378553 135928 47525 -240611 -270007
8955 -270007 -157230 218728 68159 -140457 -59805 170447 -59029 -162404 -440135 -245100
8945 -245100 -148541 -316092 138365 -21955 -120869 16058 70055 -157754 142916 24798 -31393
8933 -195585 -233147 121448 -84487 180826 -83893 20338 3349 131885 -324976 45302 -13681
8921 -92039 247681 -16686 169787 423374 1043690 3360689 2642704 547406 97581 -47623
8910 -66399 -172908 53752 -196333 -83793 13530 -395622 -242464 240610 -48283 134261 107685
8899 107685 68008 -198529 155132 184875 183777 -95527 -237062 -170613 17291 182736 -135326
8887 -166656 182442 -85978 -89549 -199718 -79714 -178554 -374812 -99938 98440 41442 213081
8876 213081 -395202 -104014 -256939 -143312 -309017 -39536 -14581 -63325 103521 51587
8865 -273446 -190811 -14831 -158572 -209455 209979 -211052 208800 151208 28680 -45084 79054
8853 -370597 50474 146327 -272309 31732 -90227 10507 184174 -367392 -118426 -71331 -84351
8842 -84351 37 -10595 52547 159120 124229 -189345 -151370 -66773 -177212 -66739 -43529 -245101
8830 -245101 35411 284533 -107868 299763 -154343 -347264 -84301 232055 -88781 -383218
8820 -383218 81597 247621 -54032 -63260 235749 72563 28612 -4170 -51871 -221348 -265142
8809 -265142 -72324 83603 239760 101926 185991 -59164 226492 171658 110659 223524 -54377
8797 -17222 -135706 -590587 -92795 166370 22829 -38644 -252675 -101931 194250 -211844
8786 -119389 -164004 -6214 -99135 -346389 276088 14205 -75228 -60503 -323990 272788 -137708
8774 -56061 52206 -232461 24828 -81879 77799 -130961 -165977 -132561 -61837 36512 -157996
8762 151470 -49657 -209798 -219527 -70331 95760 -113297 -26984 -50296 16436 -105022 -128894
8751 -128894 161475 -193781 -21203 -203395 -370578 -525323 -77180 -197879 -177291 -183221 70128
8739 -55452 170495 -47229 -227305 113558 -64021 73220 -125188 -144053 70905 -318714 -209636
8728 -209636 -45731 133038 15302 317280 -14361 215711 -145598 -57008 -197706 -251094 -120210
8716 -105297 332268 -138166 14474 -301836 -102785 -252072 258458 -142296 243221 -84892
8705 132436 182603 113348 -138190 8507 39194 36129 -274825 -164321 -150111 -384351 -46062
8693 112228 53193 280198 -240463 -280005 -317090 -140639 -6599 -25235 10833 -38357 162093
8681 -352315 407157 90281 -378014 147581 -259852 -50791 -80852 -171372 -7731 60741 234846
8670 234846 50017 -84869 258832 -308212 -92306 148482 -108371 -203588 -190748 -172498 -274658
8659 -274658 57168 -85153 362986 -30194 260471 -52999 134054 -178627 -100353 94867 -78655
8647 -113278 -76129 -336045 32344 -62300 31967 53908 19898 -16018 -33599 6111 165047
8636 165047 -337375 -219348 108542 -22338 147942 144667 -53995 -120509 -234978 1095 80768
8625 80768 6034 -164045 -186370 -116735 329701 502138 -74919 -13540 -81938 166097 256687
8614 256687 -98668 -165778 -276086 -262627 122769 -310476 -198428 144087 45326 -49736 -113820
8603 -113820 -115705 -389094 -67569 56380 147160 -154326 11631 -99540 85578 116387 -74328
8591 -152965 -112101 -163507 8289 -197489 200813 -91172 9210 -43138 -178667 -225906 -39434
8579 17444 -55906 -241781 319570 100988 225571 -232159 -91085 -206820 -189108 -24650 -163242
8568 -163242 329045 43693 103287 -153264 250953 192523 -67041 -180397 -266207 -207562 -161995
8557 -161995 41347 -363409 -122927 184400 -197075 -82459 -139838 -283568 -65555 112934
8546 -70498 173244 -12883 -186839 111653 -334867 -72082 326618 -28995 -87461 -181407 -433498
8535 -433498 -138395 69256 47987 -213807 65615 -218011 205012 195796 -193900 -24190 -78374
8524 -78374 78512 82925 -162674 -165154 -245406 -310013 56262 168802 290838 141455 75123
8513 75123 -193541 53856 123581 77423 -85289 -16503 -68571 -16922 -195552 -117107 37433
8501 -246708 -274694 -142396 21767 -76437 -136954 94511 -332052 -134912 -1913 -176534 43478
8489 6318 -95691 75967 -16502 -5209 120290 -9376 97145 -136323 26773 -399647 -175502 -181333
8477 -181333 120746 245884 226392 139840 -119680 161390 48113 12960 -160253 130468
8466 -196760 55008 220720 -256603 -26557 21743 232050 -191072 -3815 -77996 -142840 114181
8454 -191445 150333 -79914 -196684 -95008 -102646 -1418 -174236 -69775 57952 -282715 144730
8442 125621 -76395 -86973 262515 -249500 126835 -276276 188391 1008 40703 -26101 -3151
8430 -325464 -56327 32999 -192213 26000 26703 88409 -102025 51341 65886 43127 149861
8419 149861 239600 -66307 -105397 -83784 47821 -301943 -161926 141272 174830 -139959 -44408
8407 -119285 -118064 -75737 -66372 171582 -8047 -32841 -335602 60018 -150511 -341761 -108700
8395 -196707 -167391 -50408 63372 -20431 68691 52154 -212336 -34411 117183 -37520 -255939
8384 -255939 -19759 -201683 -335666 -295472 230838 -284568 315722 359047 -104906 -74964
8374 -74964 -127831 -97736 -13659 -14487 -55532 177378 155722 -17697 -293530 -96158 63037 -9911
8361 -183981 -154654 -30926 4426 89063 60502 -192650 -406283 -29851 197544 -20483 -73030
8350 -73030 373209 54372 38226 204962 46768 307294 -181024 18642 71389 46128 27320
8339 27320 -145349 -346561 232384 83342 -99237 -346382 -309985 52358 -232264 -8468 -59250
8328 -59250 -340225 -58940 -379317 42418 33496 357726 39940 -34503 324677 -7392 147550
8316 -160203 -156920 -78744 -193916 118958 -208071 207858 261524 34222 -69970 213774 140244
8305 140244 -99364 -73759 -114114 116546 50976 -74549 2400 169137 -119011 44258 1668
8293 97269 -240375 41615 72787 -233758 -222168 -124008 -441317 -248068 177984 -9415 -70473
8282 -70473 -186079 216963 -86912 12146 -158438 -43 -139693 -190274 5314 98734 -485353 -162470
8269 105076 -188044 261254 -369247 2471 10479 167478 -135705 -28401 -185700 128246 -80615
8257 -366942 -8630 256868 -59202 115699 -237012 46128 59841 101434 -143074 -204341 -51842
8245 57496 -21148 242502 -233687 -11781 -269314 -178511 121987 -134530 -96153 -122578 -109417
8234 -109417 -168981 197521 85909 76332 -235959 53614 -143165 -37115 -260376 -182780 147694
8222 185140 4625 120670 -93865 -214746 -94527 9470 154077 44201 -185349 -77922 102387
8210 194382 -151854 11953 90124 192965 40682 47689 126375 -15781 119528 -65241 -276685
8199 -276685 -419706 -424247 205825 -191698 79408 -37307 1120 -105654 -134477 -114321 -266513
8188 -266513 11080 -225995 22394 -189400 -303056 262379 76060 -77901 -178085 -117433 -206483
8177 -206483 124061 -156187 -115540 -172244 125909 -68787 -173100 -17864 -174463 -137634 168698
8165 39128 181922 65503 -98745 75863 88675 -228075 -131313 -275100 81768 -38908 -239769
8154 -239769 70476 196599 -121285 -155252 21533 -240926 -40753 -129363 43478 -194534 62074
8142 -72527 121016 -229816 220240 -186901 -48042 -171357 234371 269106 -37649 74849 55242
8131 55242 -124949 -161329 -152358 -108309 -18179 -92408 21257 45691 -240863 -238244 -167724 -224414
8119 -224414 -75356 -29786 -210510 -185832 54970 -259052 120428 -94901 -14410 -16072 -27058
8108 -27058 67497 -46102 31514 -68096 -98171 86088 89964 -6452 127115 -203090 4442 10224
8096 10224 75136 -145949 151602 -135857 60816 -181187 -162557 118623 51871 -138840 116112
8084 490716 -2554 -127252 59389 158331 -229008 216730 178175 -25392 131181 114653 88382
8073 88382 -193797 -22526 -239768 -67981 540 -47172 -185508 77384 -48500 38884 -12213 -53541
8061 -53541 -16570 -132761 219003 -8919 91219 -145916 -103821 -35326 -12434 95544 126640
8050 126640 75894 -348258 -86569 -203304 195053 229981 75462 -280211 52357 -142258 8318
8038 -289172 61802 184959 128474 -68921 -62764 -29524 -210942 -202097 -117373 -39847 -122699 -261029
8026 -261029 14394 -121190 -389639 -82200 -120273 -306556 -16211 191511 -10782 84582 15638
8014 86105 -330499 -18728 148293 20821 -154693 -142540 -144497 44550 -115851 -301798 110686
8002 -141888 145416 -136368 -20382 -48318 125217 45363 47777 104323 -67835 -37412 -169610
7991 -169610 -358509 -243056 -35393 -313999 118931 -50176 -3885 29805 62482 226284 -292909
7979 -56261 -62584 -449062 -252605 289595 193413 143059 -215627 93388 57808 -3888 -317293
7968 -317293 4131 -100945 193331 -849 -231553 106108 24045 -6778 -66883 -365135 -97386
7956 -415950 -79831 27376 52566 -93736 -157998 204638 -223467 7344 93065 -11087 5994 225433
7944 225433 -34509 -65080 -100470 -72042 -279124 -38244 72415 51736 246024 49225 -349657
7932 -70602 -182793 -28802 -1065 129458 -85754 -191139 -13067 199404 -169830 120048 -156597
7920 245825 -149110 -84775 -82574 -16962 -310283 205781 22571 88191 -78076 -123036 -133124
7909 -133124 371695 250721 -191154 56648 63905 -112202 -111572 159690 -127194 100885 109171
7898 109171 -59460 -160940 -78625 101569 -96464 -450282 -137067 -201174 42276 -4047 -67673
7887 -67673 178624 4396 110334 -142584 156710 76766 -2838 -87582 101639 -174242 -71032
7875 -150329 102449 -461696 71425 -35976 -20796 -360352 127880 -133926 -90841 -56767 174431
7863 -154859 -220433 -94147 17699 121299 -267973 -30648 52593 -352746 -250126 131905 222370
7852 222370 66205 -8759 -361170 -180310 259408 -317202 -112283 -112345 -97167 -45042 -120636
7841 -120636 -29870 71595 -195791 9921 140706 393263 84173 87159 335247 -145864 75110
7829 99679 -159307 98395 -207520 -160538 65462 -89398 -343349 112495 -110237 166718 -147956
7817 192707 83541 365720 -23509 -298584 -154245 21716 18664 -86985 -147161 138527 -405930
7805 -61750 13012 -31191 -112659 -157475 -131439 148034 132269 209469 -15661 304053 -100151
7793 -7575 -56884 -18866 -3205 -192380 -159045 -202582 196496 -123790 -434029 295731 -189435
7781 161995 -441208 91762 158725 -223714 -283867 -105115 -178789 -183823 70127 -9324 -13178 -32778
7769 -32778 -211286 -49121 -44639 -201508 -78066 11963 -168078 31257 -110189 285253 -34077
7757 -80740 227473 -64036 63649 -24254 -6589 242828 340783 124941 134753 196134 82047 -2839
7744 -182726 -73265 166829 -165771 -85189 -108862 80664 -22682 53565 -163049 83593 -3041
7732 41042 -79577 -12771 190524 -101356 155243 4155 -303393 -281898 -97332 -117749 307274
7720 -94828 149655 -264219 145957 -90864 -283937 -150493 297795 -32730 -35566 22600 -121976
7708 266368 -123955 -116182 52938 -99133 -93215 191109 84648 -101710 141559 -111021 -119909
7697 -119909 -177521 10865 92470 -136835 208441 -161370 -363053 122681 -103493 -115094
7687 -115094 -22482 -42894 -141022 104114 -322240 -172649 -148279 -101295 -227279 186332 66589
7675 -82342 -198639 -153646 19898 53308 -107578 -60777 153724 103890 -16683 -42651 8043
7663 -14282 -68991 -90917 -106184 30827 -92414 -214724 11102 220732 -486216 162433 -329358
7651 -8433 135397 22025 237653 -349370 -17519 -81392 158393 59330 -121336 245519 -57137
7639 163394 106600 20537 4170 -72654 -136961 -32458 174946 130066 -120263 -410845 241105
7627 116023 5872 -86672 38798 125306 24583 -134622 -437 -82305 -97476 -57640 148689 36671
7614 56897 242238 -180100 261040 -192924 43016 240021 -27578 -169185 24918 -275219
7603 -39125 -185753 -202863 78077 11882 -212153 59949 164367 106412 173795 -195898 -95814
7591 206448 -234279 -217653 -36848 -162580 -76807 66728 -247805 -163649 -110859 175078 240879
7580 240879 -363392 -501181 -98411 -15654 -40237 150844 -45278 -62037 -63495 277715 53989
7568 -143483 107265 -119433 44354 16473 53498 -318064 185130 47367 -97685 16359 6456
7556 -7340 190492 136256 -264163 -325418 -128399 -136284 -54830 -59777 -208192 10015 -294843
7544 -31927 -20667 -279839 7030 -126569 142719 -218437 -102453 29198 222620 33486 152071
7533 152071 100451 48553 -63525 369310 248387 -57234 -29807 191295 -22182 30345 -128136
7521 -97091 3629 65118 185871 -2776 -19104 40128 -96617 -41118 -130360 -20937 -370186 511489
7508 -54334 107620 -242956 129353 50646 -11796 117752 225938 -186911 109790 -98222
7497 -97169 11088 -283559 -307417 -58441 142967 -261946 -24141 190408 -107298 -163594 193172
7485 -33102 74579 -258233 -186285 -113123 241899 39120 -287607 190544 -14159 20513 -313152
7473 -184791 217082 -29679 -25629 98764 408501 -428382 -322650 -242344 -219649 275468 104247
7461 -167432 -148452 -10857 296513 -8905 -101111 -228741 -130146 275534 287511 625 -192332
7449 223863 218631 -165202 -143454 98290 135364 -97463 92421 134946 -141935 10632 -326869
7437 -158721 -265100 305871 -277000 -6926 -422108 164603 137986 -105243 194085 -96330
7426 -20311 -3869 -18082 -82618 -119973 5582 -47014 -146604 7892 -290761 -106441 104422 14418
7413 -92043 -73360 110660 -374154 -64807 -214065 -110684 51585 237815 16733 41947 122339
7402 122339 235415 129453 -198043 -14871 33159 92700 50266 -356383 -47792 -311894 -206202
7391 -206202 -6265 -289452 252897 200516 -103310 -794 24463 -142459 173894 124874 -72285
7379 -120929 42948 234414 181627 11230 4372 61313 -201521 -70290 -215127 -179276 43591
7367 179559 -39325 65581 90807 27501 -189068 -73258 128125 -257473 -252273 -144173 -30777
7355 -301105 -135711 -203445 182468 40253 -211134 83831 -183552 -286536 -293016 200053 -168192
7343 -61477 83707 32855 -34559 -118811 -21347 212767 -38889 -486489 -125967 -38726 -157559
7332 -157559 155927 165198 199536 342040 101281 -54444 -16417 -39976 10578 -107769 243795
7320 49667 -81759 -215635 108696 93963 69066 271898 128315 220731 111723 -25374 70923
7308 41839 16623 78316 -42402 -119254 33412 124091 107776 137821 37013 -371253 -24633 -379277
7296 -379277 84547 95854 90127 47774 244601 -140192 -126461 95044 99557 31536 -112547
7284 -158828 -151325 -25241 131032 -12015 -209059 153972 -336446 -18967 -53244 -285547 -103157
7272 -242083 159100 94897 21675 -89612 95537 -96293 112292 356358 64146 187180 159515
7261 159515 -186578 -142383 82741 105712 -424940 -172146 103874 -27074 -42822 -470284 -9844
7249 -214163 -124569 -78903 -144178 -54399 304155 -355420 -457347 -126674 -222860 -46438 30065
7237 -24408 175281 -86451 -140251 128318 -154068 278942 -193693 121749 362651 34174
7226 31704 -74453 120157 -122447 -110217 77259 -481999 68469 -115613 65455 154660 -48482
7214 -358949 274447 -179098 -35119 -344352 91266 81657 -105182 209072 43626 42607 -5871
7202 225538 -108619 32224 -28560 173394 8116 57436 17137 -211168 -56602 -97075 143102
7190 131044 90931 117958 399668 89943 -414906 156940 -186312 -63955 88417 60819 -370251
7178 75817 -3852 -396293 16562 88107 -109175 58602 -288686 7819 164967 -206843 179901
7166 70151 -9893 80622 136726 17069 -142083 -93347 -56080 -251319 43724 -552726 -29953
7154 -3261 -86224 156797 -79640 -236743 -185605 23634 5056 -179825 96629 -272453 -18045
7142 45232 290506 -49803 -88339 -134146 141317 -77413 119399 -71888 -26757 -135317 -105117
7131 -105117 -130381 131060 -159370 236077 -155608 97654 154287 101746 -92494 241260 318492
7120 318492 -169154 222181 -203561 -361539 19439 205420 -210277 207909 66339 99501
7110 99501 -133571 -8065 -360189 182210 -132573 260885 -185137 -24692 296646 19790 -30907
7098 131507 19578 -28586 65536 -293207 141817 -66228 -11226 -78119 -134673 -2868 73760
7086 -189341 -224610 -9910 197388 -51369 299932 -260703 -264750 20504 49336 -385801 -275062
7075 -275062 155166 302444 222631 -118905 155755 -175496 252694 -21530 15558 -52591
7064 -46965 -60372 -211236 -38310 -24612 93150 2951 -99133 208840 197493 -113527 -24304
7052 -121466 -28180 -203488 37598 191544 102375 121359 -89109 92384 4013 237060 28192
7040 -26959 -118667 -128820 -87982 62978 -223300 236839 -206721 -34146 -106058 186848 134604
7029 134604 -330085 -85280 2622 23662 92854 -97461 192004 -122519 113056 -86021 17016
7017 -250324 54204 -259322 39769 180684 -436020 -122954 -144284 220707 63759 -168505
7006 75439 -602363 162629 18635 -79499 75127 -126543 -157215 200648 -142408 95206 -106090
6994 37686 180698 -95336 31165 157932 -111106 -172883 -426006 -27442 -172622 -28530 56813
6982 -30579 60627 -220245 199573 40267 154250 106691 -6093 75389 49795 207317 175480
6971 175480 146122 -27430 -128228 85810 -120977 93371 96060 -100602 979 10599 56413 -98831
6958 -229736 -136904 -38489 198901 -197636 -103571 -42744 166372 -62360 145421 -160644 -111781
6947 -111781 157860 147287 -180341 367109 53664 75880 -126663 181990 291875 121290
6936 -23693 -120492 509212 -80012 -11077 104719 -321606 97902 -47376 11124 166862 151399
6925 151399 -288049 -178419 109201 -50511 59273 -35444 -112854 -266853 175987 -298547
6914 -22563 -193094 -59838 -311411 175634 -253803 -130377 -347791 -92328 307639 -245127
6903 -2607 -51603 -129176 -202415 367739 -188657 148004 -285418 2564 98745 -70937 316537
6891 -166748 -91787 13258 -104369 19993 -97045 -49317 -170570 50862 87652 -67290 -138154
6880 -138154 -242242 -106630 429221 -128720 -393839 97567 271650 -127660 -170682 -136250
6870 -136250 -249577 -444233 -47232 272862 -118569 204462 330766 129614 57308 89864
6860 89864 -461360 260395 -27578 -185426 -4176 -81194 -287983 251883 119276 232117 -97532
6848 -240994 251564 35730 26542 336147 113502 90898 31757 -109267 50547 63728 229762
6837 229762 5787 83030 53536 935 137481 -143480 67803 166279 60847 -13375 12904 -80787
6824 93269 90047 60414 -156695 -52869 -185417 118177 -236430 -32404 127254 2494 52254
6813 52254 -255730 400373 73320 231184 344232 17661 -193056 122630 -21549 140442
6802 5777 -89116 -185332 -199654 139846 94738 21828 -156119 -358555 -198469 -54681 175645
6790 -81332 8073 -281051 8625 -98948 268981 113254 21411 59882 50397 -31471 159339 58608
6777 -33833 -119238 -344792 -84238 182393 57183 134176 -16312 -32309 -327272 -277532 109173
6765 40086 187331 69771 -62999 -171528 -180559 -325813 -6362 -2399 -137525 -169967 256047
6753 -101506 27348 -63471 271552 -86233 -82124 267143 225691 -208207 -127078 364829 -154763
6741 -42704 487556 83074 -136454 -51515 -190497 -20095 -314905 -72053 -60587 186273 -197991
6729 -11955 14263 -235044 56275 -124209 -172909 9060 -6069 61445 -57645 195041 -90317 77583
6716 -76714 100957 -64083 -267500 61386 148653 73389 59753 -18079 -143808 121789 -537
6704 -139021 -30077 -351779 28380 14034 297754 131810 -7261 -198176 -328056 152890 19514
6692 37593 6701 151743 -16308 -26559 -9175 -26819 -34260 349934 -138555 -69214 -129226 -76014
6680 -76014 -211352 98172 150858 102853 446158 -3485 -92415 -213223 87848 22942 45223
6669 45223 -97724 -109326 304963 -129672 -22363 -66116 -119200 -88696 176606 363266 36985
6657 -71272 -139287 -125514 -23417 64149 291071 182348 32398 -156566 258669 -1041 78921
6645 37527 -113797 -107308 -19193 -64799 -250438 95364 -236447 -163755 -321999 68000 -229631
6633 37299 62409 173711 8575 48949 265173 -296607 -177270 27999 -46665 -1038 285140
6621 505964 -31705 1827 -15334 13285 79706 86856 230216 63808 119860 9097 -27264 -131504
6609 -131504 43077 61766 -115301 -177283 -22850 -219041 -195062 85116 110333 -344154 330221
6597 218746 149575 -78088 -13346 -37458 -93056 97778 -315288 -133207 -136643 -20300 -123359
6586 -123359 -11632 -57590 -181291 -31895 -82335 24501 41608 -216545 -77096 7353 9997 -152631
6573 -65454 134289 124753 -79076 64830 -175970 211417 92784 66209 -140635 -41958 62708
6561 -345301 225408 200888 -88761 -75160 -142672 171485 -316621 340891 114444 -280726
6550 -225664 -306417 -172568 51442 69066 58419 361527 148476 -248068 -180259 -93838 -98787
6539 -98787 -262147 29287 -137583 -76875 -13802 -91179 26573 -30013 -149519 354571 -48482
6527 -246727 -113730 -305973 -122152 162804 -22657 -99880 23325 -6768 -37113 97088 -97869
6515 -189548 360721 9537 -226320 361159 89600 31297 138410 -47357 -110297 -38973 -235812
6504 -235812 121966 129799 -72323 44495 433315 -13412 315315 213111 -53198 200185 -141874
6492 -190267 66498 -130275 134740 -389624 88805 -80468 -96450 -141602 413349 -16029 -3050
6480 135016 -68915 173632 -11377 -127336 -1242 -227899 218146 32383 -183923 -89398 -117117
6469 -117117 -168004 -90013 167675 194123 -6949 -287430 -62758 -186130 43255 -339353 50034
6457 -122353 60001 90085 -90948 -204636 98589 24971 -250203 16106 -101855 -3088 396094
6445 -155599 -309274 -139767 -4977 148155 9676 -158535 79843 233093 -174227 256216 -55419
6433 72716 -65339 70674 179890 -164979 30106 -23426 63755 77744 -361243 -148956 -163986
6422 -163986 -97186 -17248 8564 -157013 323401 106959 -21590 -339312 -218456 125477 -481237
6410 108905 147808 77946 -225343 84115 -278778 -140551 -255126 -113491 116465 -58949
6399 -19146 -149520 -194712 103277 -164740 133603 -142946 176804 -208723 -193843 80309
6388 188518 -33111 68140 -181874 545775 -141621 -33583 398100 -99159 -155820 128468 139682
6377 139682 17668 -220389 -173492 104034 236755 -88601 -105678 93071 -227682 -307486 80240
6365 100138 18147 -71613 -21185 -293938 118645 -148877 117867 -97386 -62064 -84769 166361
6353 -148412 -157143 88181 56593 3025 -144060 122103 132483 -197328 -28771 -8366 -160102
6342 -160102 -77314 83997 214861 -173651 139211 -144169 -225428 522268 224417 83591
6331 147756 -242175 -61716 -52347 -20767 -51056 408350 284744 -170792 180632 233014 -18077
6319 60311 23001 -281481 -382134 234765 39255 -207496 -4824 202966 -70669 -97120 -118777
6308 -118777 336370 -73255 -170777 31213 75481 23717 61592 175855 21736 105948 -147128
6296 283864 -280807 -97513 -100079 183855 100280 85650 -257981 -213228 -232112 150769 -135696
6284 -332495 -167892 57042 206051 127293 -49756 -127724 -7006 46078 -353405 -301182 254768
6272 -120229 -398549 118394 -65390 -182659 -326877 151166 -148585 96994 134174 -32463
6261 -57744 187329 -101362 -7868 -101025 -93990 -285348 -6390 92201 -47051 -87933 -145836 100140
6248 -203693 -34232 -245685 193672 -52081 -60119 -154474 -3251 -93925 191527 41041 125294
6237 125294 -189746 -146868 85253 -94546 66914 99000 204986 -164328 147827 -118074 -255551
6226 -255551 -196082 142666 39847 224498 -114939 109049 453373 -44841 -367557 -4609 43540
6214 -206125 -85099 116903 -11806 -86880 62634 -295455 -181592 111694 126643 211973 43589
6202 -38175 276923 332079 423112 -65933 -130517 115538 -166460 189782 -87703 -355099 -43143
6190 -189895 -10775 -224237 256573 68838 -113416 270118 -111766 -69379 3446 -158154 30281
6178 9450 -169109 -122476 -164252 14765 325214 -145373 178361 323329 -153087 17099 271740
6167 271740 61817 -260411 74008 302877 -109463 -177878 356145 344055 71287 -411752 173548
6155 -139796 -148446 -291949 141837 -281179 -59087 -18293 308688 314406 184798 36361 38567
6144 38567 -190544 -62570 213152 119306 -79910 208379 -31314 299139 40050 168744 -140712
6132 -289333 597037 102354 -355274 40869 255513 301024 -175355 36616 -178932 -148506
6122 -148506 -7774 -270993 170923 -172000 -271237 -93101 -59688 -326024 -280526 145260 -67359
6110 274457 -185634 -233054 8872 114709 -75119 120413 -4069 -144109 -196334 -44083 -111183
6099 -111183 -195968 110681 -81694 110542 334572 212670 -252534 99259 -58395 56494 114869
6088 114869 -149457 177842 63032 61004 -320927 128083 26091 -43291 -31144 -234238 27395
6076 -25310 -125894 -370619 89233 -156 136372 124917 70951 1511 130389 -234459 91461
6064 116414 44480 58037 47658 5486 -89124 108261 26821 21870 49047 124557 307198 126595
6051 -163251 121108 60244 -142178 104989 -234167 -52319 -226418 103309 -120453 12306
6040 -222229 -169547 -253853 80718 98737 -135249 -173571 -230616 -52138 -256588 -75722 -77773
6029 -77773 -45921 70732 125366 209469 -95664 131896 21006 190265 -14043 -91976 255237
6017 -105612 -249283 411894 -116294 -49986 -25561 326858 -27011 -148892 -269935 87003
6006 -178291 -46390 -289283 -257461 66941 32644 -114543 75179 165714 79565 11993 -129357
5994 -23458 130608 -39651 94285 -197845 17347 114581 90927 29120 168746 55420 -263507
5982 131014 257097 -47568 -68386 -84607 14130 -133146 -80062 233046 22842 -120851 110071
5970 -306210 -195960 385963 76894 -53779 159740 114352 -107112 81814 52185 62971 -218395
5958 269440 -91237 -82351 -77009 -252752 181203 119224 -70582 124085 -207003 56731 -69889
5946 -297390 121206 -228918 275044 -76527 -15535 -197466 208259 128071 -3804 -78577 40350
5934 72322 73835 -356932 236459 177272 150156 217139 136843 270903 -143497 236238 -324508
5922 -11819 200771 -89059 -287167 -54755 -16719 -39389 -54160 203825 -238 -35687 189183
5910 39199 -67638 164839 63440 41194 279343 72449 -21167 -144129 40969 49717 -20783
5898 -85164 -236714 35632 -337359 -77246 7738 282713 37827 -66776 -228420 68583 221722
5887 221722 -226891 41995 393192 -159902 -719 27064 143937 131297 -220392 66547 124958
5876 124958 73853 22528 167486 167373 146370 -34661 54859 -232596 4931 -2091 -294071 -60415
5863 -299843 -129285 -168378 -158631 471488 12622 -172367 -208064 283902 -64559 34581 -70336
5851 -184781 -37044 7888 -31099 -30227 163315 47696 -22977 -377021 -274675 64010 84745 -145297
5838 -46771 408550 -210808 -365583 73050 443462 352797 -352707 -108190 181129 -6774 -275190
5827 -275190 119038 -76781 35172 -46642 -314620 -123110 -100828 102484 247850 -164341
5816 -133503 112580 114279 104486 -17919 221840 262318 134942 160142 163964 -8162 160667 59959
5803 -35783 71424 151337 -191272 -185842 61084 63461 -945 -115616 -26208 36163 -144376 -310719
5791 -310719 91742 280484 -85542 -245858 -34 2065 98242 74303 -102287 -59053 -135538 -159299
5779 -159299 -64163 414587 -113248 142897 74615 118275 -173389 23845 -83671 -65171 -6555
5767 -94733 -128364 -40027 326203 262558 17725 -125891 96385 -168003 137641 42494 178971
5756 178971 -79679 -200258 -173988 -332826 27325 -33861 10746 -271138 -112899 4064 57902
5745 57902 61982 56777 113329 -317333 173903 -107512 -175276 -36858 -102570 -46599 1514 -256950
5732 19148 192748 69141 4663 -133537 22295 -24285 -43313 -77901 377944 -230482 111542
5720 103745 99267 170177 91556 -201433 98602 270660 94232 37950 410001 43770 255370
5709 255370 167559 -202175 -278089 15794 341881 175782 -61425 34603 244365 215569 -115933
5697 -247058 33887 -145577 -137647 172909 -122514 143543 -101533 -307120 175554 12742
5686 -140376 50011 -26308 -7663 -97936 -59355 70341 -86058 370707 123347 128760 46233 -2241
5673 137525 -48529 46631 52970 -9035 23511 -133426 -257221 108730 17275 -43711 220499
5661 -32707 24681 107685 -217543 89487 -186513 -345961 101749 77381 -242861 -5413 95490
5649 -178152 -14022 100106 -83436 162754 219347 -317193 40351 -138895 -236593 108706 -226208
5637 384954 -202606 -172387 73208 -61465 245674 223086 261286 288864 284537 -225847 78346
5625 -288618 87944 119910 -173365 -52621 -329719 106474 -129101 -86677 -22594 60604 -68975
5613 -90065 315661 110768 131344 185593 -71866 55339 -129824 -54254 86315 36925 -273898
5601 -55436 -203951 30158 72882 -131105 13192 41734 90515 86862 -23533 -206511 120925
5589 -27544 117520 291021 109663 -71167 -232912 21172 -349148 243300 -165875 182543
5578 319116 -371694 13548 -32051 168212 257976 26843 -198484 236237 -126199 104138
5567 2294 25734 -101246 109043 132548 -194773 60480 -229534 -73227 -46792 -25666 -56897
5556 -56897 -85969 -225532 159790 -210065 -114108 152133 154112 -41738 -113321 -203947 298911
5544 875 76182 218338 -64601 85200 -41100 77143 33670 9728 -75345 -237797 18047 -38802
5531 52332 -108206 40264 -50091 148057 65393 178706 51970 167951 5412 -409669 66749
5519 -53864 -60367 -107213 133065 87582 -283623 -186102 156829 -84835 -133528 -13122 -127053
5508 -127053 -85402 -22535 7249 -62286 -14527 -146798 235197 -216079 -158215 243062 16044
5496 52330 -76656 401298 58267 -18846 1573 -4206 -54505 377800 -22914 -77330 258012 -236360
5483 -75210 257474 -87141 -125199 294297 44034 -241419 -52416 45814 -33979 105957 -188014
5471 -148400 -228740 26267 463695 -181514 284622 -220869 67102 229748 45128 287326
5461 287326 224456 -1373 -147404 -45012 112735 -225937 155247 -102482 71256 -86238 -202011
5450 -202011 97460 -210072 -171247 8538 -56248 -250562 63549 -57700 -69932 39954 -192742
5438 62854 -25777 -126770 161843 27000 50619 7309 -239058 174277 211466 308262 93213
5426 13642 -1755 72782 118987 -249096 -351839 140297 -118186 -118616 193413 -229921 -2372
5414 -319016 78818 201471 -207466 -166348 46121 75764 120029 -29137 -134455 67152 -39318
5402 -160420 24455 -328168 290662 111747 -49633 -162069 -218988 35487 44101 -66719 270219
5390 111857 -71715 -296017 17741 -146162 211606 -66392 -167354 10659 -62154 153468 15866
5378 262572 79702 -52486 109634 -229692 73909 105201 253418 -406990 -66219 -164270 349999
5366 -1665 -71199 1484 -73266 119339 -43129 -261475 38183 270621 -110916 -90193 111180
5354 58159 -20880 330004 240052 -152438 10412 53835 272761 44457 1544 -97999 -81750
5343 -81750 77189 239734 128600 -5929 29170 -106246 84951 134804 -17254 -75924 -61771
5332 -61771 -106308 -128564 289770 355552 58951 -484 53575 -144451 -121358 -75560 -13594 36673
5319 -234725 128200 -209984 -139622 7263 -15681 -125840 20667 -155183 99855 197399 -55752
5307 -49252 -107891 -271919 -259090 -140331 -46914 -8859 -137269 161873 80688 147375 -98827
5295 64865 -188499 111682 104122 -351344 -19566 29773 -196613 113413 -207993 188218 293020
5284 293020 365440 189336 -15141 -29534 124955 -108650 -108034 -26575 -83514 -13022 160635
5272 -53614 30550 2495 -176053 -36579 149143 -24156 -79264 -104747 87556 121126 260824
5261 260824 37229 133319 51089 -65179 203089 -59500 127285 -53951 180343 -127269 -145960
5250 -145960 -3140 -308833 -90243 104915 -110532 -147357 111180 117114 97372 161576 -192257
5238 147725 -300199 41822 -117919 -35454 -88501 -149707 -76011 11819 106689 286877 5864
5226 -243350 -37037 284463 27484 -176429 -57374 -91401 107537 28535 30270 291730 -144120
5214 -175781 -33694 -83406 54831 81281 288033 -181153 -32899 265558 -43479 42132 -178419
5202 -163789 -174848 116691 -80018 192786 34822 -46842 -10546 -111388 -44894 -131691 119843
5190 -324992 -141839 22379 9222 -129901 141997 -143432 34208 -121722 132686 -273029
5179 61913 -29887 -199230 253658 285912 -91736 247638 111292 -63155 -84083 321979 16433
5167 54004 -152556 251002 322911 43270 84375 286127 89455 3895 230831 -207300 -108943
5156 -108943 358406 229520 -56706 -257267 40331 -132737 18350 290671 -121680 49442
5145 165547 529151 111066 225779 64543 45440 -83150 -52467 106511 -7802 447007 -120866
5133 247692 -9431 275341 19422 -34227 50550 143685 -8785 110581 -186189 -94701 129877
5121 -30360 -225028 55923 224744 232699 -163332 99570 11276 76845 132855 -64029 136866
5109 146035 -164415 -287264 -251924 257490 15806 304589 -143328 8637 -247325 210471
5098 139913 -131013 -937 -208704 -230434 -214099 -10483 290432 -159735 55009 82696 -35782
5086 228549 -340681 -146109 213468 -171171 -441392 -41885 12072 83086 -160231 -46965
5075 -195259 -61989 -633 -286649 70976 -117404 39082 65638 -131869 7850 -66984 -247342
5064 -247342 105452 -17292 -206311 -273436 96205 -79559 22252 109238 116846 -385556 411267
5052 -301407 189837 153039 -84752 -32331 207851 -207487 271075 74416 121187 114748 179780
5041 179780 -138844 117949 50794 -38367 57440 64554 -114724 240198 -175182 -195605 -196474
5030 -196474 -141718 -44116 -84211 68929 341405 20204 -369301 177407 108920 199477 55103
5018 -99297 -50651 1626 -79199 -10312 -71720 128064 -44227 -75681 -166806 192083 -94183 -225426
5006 -225426 -40874 -184827 -4689 -346781 -47378 423313 -73786 221534 286812 157713 170597
4995 170597 167202 -29111 -174290 47605 85638 -397213 -11369 44046 142366 20441 -120052
4983 286137 441794 77067 -156015 111239 -260116 189988 -43242 -32248 -377317 99951
4972 -6012 -190339 -17294 -97403 9632 388077 -201957 -71795 1355 -20899 132794 162757 79997
4959 67695 -181466 -10334 -238113 -10385 122434 -1315 -208087 -12117 -75007 60424 342586
4948 342586 -18977 -16893 -145393 173006 77430 -77991 -135915 298916 433913 343471 82623
4936 -15085 -47001 141949 -196251 -107544 130148 143124 49759 -23559 -131632 -252556 3489
4924 -474623 100897 -27602 255538 -388008 57647 -21786 302167 89964 -189273 -161257 93868
4912 -110472 217936 5438 -76637 -236879 -233819 -78003 -241427 89035 236307 3352 -164589
4900 34402 63254 9179 -60350 -225249 -125906 155044 182747 232778 540627 -197948 158587
4888 119544 -29610 169544 143971 6966 -485 164966 215470 -72530 29401 -69634 83512 92905
4876 92905 -142512 -108551 162323 222776 -69312 -6474 -126247 -16212 -77445 -12002 85440
4864 379369 60402 14151 -201115 217205 -252330 -92920 -84976 198487 -80042 -58751 67450
4852 1692 120694 194304 105789 -298604 -187925 240581 -97266 33522 -166317 -170937 74206
4840 -41202 -56621 141528 177869 237990 -12621 -70032 53734 76271 113817 240907 108261
4828 63821 -101119 147251 10829 -98599 71615 -312405 -108901 86987 -64528 -112861 -51833
4816 -74828 175295 69844 -82507 215972 166376 -233151 44038 -198240 -88784 -109395 200843
4804 -85579 55492 145777 283785 -176130 33837 23235 -422119 79831 7912 47850 61690
4793 61690 -226603 -48602 273341 47353 65168 -260546 99178 143752 -150079 201130 -154848
4781 -106454 -220502 54134 49162 6044 -4867 -260308 69424 -252244 -108604 42292 152148
4770 152148 25056 -312557 -421202 250392 -423440 4716 -127950 -259279 73991 93649 41520
4758 28091 -121008 130528 345933 7305 -3488 -22125 103689 -51088 -211856 11264 -95105
4746 -63370 -11388 -61079 -16892 166794 546 -254438 56318 48370 -19327 -120955 55716 -142855
4733 51421 -207160 -138778 133176 -66686 -181584 -53274 130881 635 177640 224807 -22096
4721 59355 168698 -201323 -154661 -86514 -85658 -3780 172579 -292165 -152956 149254 -57454
4709 -221245 3070 -58155 127165 25114 -141375 231540 30272 -58432 -80221 -59134 137593
4697 324152 88104 233207 186751 179450 -32626 120768 39158 -75582 156488 -154476 172941
4685 -39816 77657 111398 119148 -8395 209333 119908 -58329 2720 -6442 -335928 -20618 -44722
4673 -44722 46313 53581 -156949 -495760 147962 -166241 -8336 10216 234012 32438 230652
4662 230652 -252050 93988 171973 53065 145272 3232 42888 58803 -67333 -293783 149993
4650 -70061 147184 -29796 -16322 -244456 -61954 -302805 -61459 -138515 -232578 126984 -290767
4638 195308 -150842 -60034 -242924 37280 -149445 -47291 355995 45781 91547 154227 110227
4627 110227 -109458 -11757 23757 103964 73945 203017 244814 66509 137710 -114571 -40350
4615 197545 174040 -131273 -70093 7050 373447 -163875 -177353 210938 16909 -99333 50092
4603 401562 -30698 82936 -75836 148588 138258 -111163 110086 36530 -101501 -177238 327154
4591 -53423 108450 361266 -24167 61324 16359 25929 186975 -43769 345563 290361 -156098
4579 16529 134342 -56768 -64332 -4758 -11433 -117629 -262986 160926 -261652 101212 -7193
4567 274403 -99306 -19451 -165949 -62239 -218887 -33137 -90896 -268163 4537 163838 444000
4556 444000 191688 -55321 -69459 281049 -140467 80325 -135174 128284 28050 -185295
4545 -148561 -120481 324536 -2309 -144513 169868 -248006 -303198 96493 6421 45789 97610
4534 97610 -184560 -52219 193834 117610 -92895 -51617 123065 -93483 97197 -166708 170470
4522 234027 158210 -197388 58764 226892 301118 -357645 211523 232416 -160492 -121953 6786
4510 -58745 -339771 -58205 -431458 316298 164194 -93223 -55944 -13942 -327160 -281530 -173938
4499 -173938 -115767 23201 189888 -51292 -10588 -132308 467048 77217 357534 293750 -255383
4487 40249 120080 21461 -154899 -96777 -26188 237812 -43467 -245162 -60235 -275766 -99234
4475 77215 -7960 -224662 -360442 345035 117324 231255 147551 -287699 213726 -139753
$$ [...]
##END NTUPLES=NMR SPECTRUM
##END=
