##TITLE=NES1031_Conilon_9266930_AQFG5NnhPy
##JCAMPDX= 6.0         $$ Bruker NMR JCAMP-DX V2.0
##DATA TYPE= NMR SPECTRUM
##DATA CLASS= NTUPLES
##ORIGIN= BRUKER
##OWNER= Administrator
$$ 1.72 TOPSPIN		Version 2.1
$$ 2015-08-24 18:51:38.592 -0700  Administrator@X
$$ Compression mode = diff/dup
##.OBSERVE FREQUENCY= 400.02188249412
##.OBSERVE NUCLEUS= ^1H
##.ACQUISITION MODE= SIMULTANEOUS (DQD)
##.ACQUISITION SCHEME= undefined
##.AVERAGES= 64
##.DIGITISER RES= 22
##SPECTROMETER/DATA SYSTEM= spect
##.PULSE SEQUENCE= noesygpps1d.comp
##.SOLVENT NAME= COFFEE_meoh
##.SHIFT REFERENCE= INTERNAL, COFFEE_meoh, 1, 14.96455
##AUDIT TRAIL= $$ (NUMBER, WHEN, WHO, WHERE, PROCESS, VERSION, WHAT)
$$ ##TITLE= Audit trail, TOPSPIN		Version 2.1
$$ ##JCAMPDX= 5.01
$$ ##ORIGIN= Bruker BioSpin GmbH
$$ ##OWNER= Administrator
$$ $$ E:\/data/COFFEE/nmr/NES1031_Conilon_9266930_AQFG5NnhPy/22/pdata/1/auditp.txt
$$ ##AUDIT TRAIL=  $$ (NUMBER, WHEN, WHO, WHERE, PROCESS, VERSION, WHAT)
(   1,<2015-08-24 18:51:33.155 -0700>,<Administrator>,<X>,<go>,<TOPSPIN 2.1>,
      <created by zg
	started at 2015-08-24 18:40:03.733 -0700,
	POWCHK enabled, PULCHK disabled,
       configuration hash MD5:
       21 0F 79 D6 B3 7B B4 F6 88 20 88 DB 03 48 BD 9F
       data hash MD5: 64K
       A9 E5 C1 87 14 58 DF 3A 0E 48 40 4B D7 93 CD D1>)
(   2,<2015-08-24 18:51:36.530 -0700>,<Administrator>,<X>,<proc1d>,<TOPSPIN 2.1>,
      <Start of raw data processing
       efp LB = 0.3 FT_mod = 6 PKNL = 1 PHC0 = 0 PHC1 = 0 SI = 128K 
       data hash MD5: 128K
       9E 87 0D DB 4C DF 9F A3 75 3B 4D A2 52 4D 8C F0>)
(   3,<2015-08-24 18:51:37.389 -0700>,<Administrator>,<X>,<proc1d>,<TOPSPIN 2.1>,
      <pk PHC0 = -87.00623 PHC1 = 0 
       data hash MD5: 128K
       76 32 CE 57 FA 19 99 DB D7 F2 30 87 3E A1 F2 FB>)
(   4,<2015-08-24 18:51:37.780 -0700>,<Administrator>,<X>,<proc1d>,<TOPSPIN 2.1>,
      <abs ABSG = 1 
       data hash MD5: 128K
       29 F6 27 6E E9 56 16 6A 83 86 30 6D BF 06 56 50>)
(   5,<2015-08-24 18:51:37.889 -0700>,<Administrator>,<X>,<proc1d>,<TOPSPIN 2.1>,
      <abs ABSG = 2 
       data hash MD5: 128K
       D6 F3 FE 05 C4 8A B6 93 04 D6 3A 8F AF AF 87 77>)
(   6,<2015-08-24 18:51:37.967 -0700>,<Administrator>,<X>,<proc1d>,<TOPSPIN 2.1>,
      <abs ABSG = 3 
       data hash MD5: 128K
       65 DC 24 8A F5 98 1D 7E 60 BC 2B DC 5E 5D 33 7B>)
(   7,<2015-08-24 18:51:38.061 -0700>,<Administrator>,<X>,<proc1d>,<TOPSPIN 2.1>,
      <abs ABSG = 4 
       data hash MD5: 128K
       0E 92 2F DF B2 49 3B 59 0B 60 20 80 A6 2C BD F3>)
(   8,<2015-08-24 18:51:38.186 -0700>,<Administrator>,<X>,<proc1d>,<TOPSPIN 2.1>,
      <abs ABSG = 5 
       data hash MD5: 128K
       A2 69 9E 40 68 53 05 DD 86 36 6E AC 40 86 8A AC>)
$$ ##END=
$$ 
$$ $$ hash MD5
$$ $$ FD 96 89 CE 20 F1 2B 71 D8 E4 E5 F8 C0 B9 D4 EE
##$RELAX= 
##$RELAX= 
##$RELAX= 
##$RELAX= 
##$RELAX= 
##$RELAX= 
##$RELAX= 
##$RELAX= 
$$ Bruker specific parameters
$$ --------------------------
##$DU= <E:\>
##$EXPNO= 22
$$ [...]
##$TP07= 0
##$TPNAME0= <>
##$TPNAME1= <>
##$TPNAME2= <>
##$TPNAME3= <>
##$TPNAME4= <>
##$TPNAME5= <>
##$TPNAME6= <>
##$TPNAME7= <>
##$TPOAL= (0..7)
0.5 0.5 0.5 0.5 0.5 0.5 0.5 0.5
##$TPOFFS= (0..7)
0 0 0 0 0 0 0 0
##$TUNHIN= 0
##$TUNHOUT= 0
##$TUNXOUT= 0
##$USERA1= <user>
##$USERA2= <user>
##$USERA3= <user>
##$USERA4= <user>
##$USERA5= <user>
##$V9= 5
##$VALIST= <valist>
##$VCLIST= <CCCCCCCCCCCCCCC>
##$VD= 0
##$VDLIST= <DDDDDDDDDDDDDDD>
##$VPLIST= <PPPPPPPPPPPPPPP>
##$VTLIST= <TTTTTTTTTTTTTTT>
##$WBST= 2048
##$WBSW= 25
##$XGAIN= (0..3)
0 0 0 0
##$XL= 0
##$YL= 0
##$YMAX_a= 6497302
##$YMIN_a= -13391851
##$ZGOPTNS= <>
##$ZL1= 120
##$ZL2= 120
##$ZL3= 120
##$ZL4= 120
##$ABSF1= 14.96455
##$ABSF2= -5.593632
##$ABSG= 5
##$ABSL= 3
##$ALPHA= 0
##$AQORDER= 0
##$ASSFAC= 0
##$ASSFACI= 0
##$ASSFACX= 0
##$ASSWID= 0
##$AUNMP= <proc_prof1d_extract.lims>
##$AXLEFT= 0
##$AXNAME= <>
##$AXNUC= <1H>
##$AXRIGHT= 0
##$AXTYPE= 0
##$AXUNIT= <>
##$AZFE= 0.1
##$AZFW= 0.1
##$BCFW= 0
##$BC_mod= 0
##$BYTORDP= 0
##$COROFFS= 0
##$CY= 15
##$DATMOD= 1
##$DC= 0
##$DFILT= <>
##$DTYPP= 0
##$F1P= 0
##$F2P= 0
##$FCOR= 0.5
##$FTSIZE= 131072
##$FT_mod= 6
##$GAMMA= 0
##$GB= 0
##$INTBC= 1
##$INTSCL= 1
##$ISEN= 128
##$LB= 0.3
##$LEV0= 0
##$LPBIN= 0
##$MAXI= 10000
##$MC2= 0
##$MEAN= 0
##$ME_mod= 0
##$MI= 0
##$NCOEF= 0
##$NC_proc= -2
##$NLEV= 6
##$NOISF1= 0
##$NOISF2= 0
##$NSP= 0
##$NTH_PI= 0
##$NZP= 0
##$OFFSET= 14.96455
##$PC= 1
##$PHC0= -87.00623
##$PHC1= 0
##$PH_mod= 1
##$PKNL= yes
##$PPARMOD= 0
##$PPDIAG= 0
##$PPIPTYP= 0
##$PPMPNUM= 2147483647
##$PPRESOL= 1
##$PSCAL= 4
##$PSIGN= 0
##$PYNMP= <proc.py>
##$REVERSE= no
##$SF= 400.020008215242
##$SI= 131072
##$SIGF1= 0
##$SIGF2= 0
##$SINO= 400
##$SIOLD= 131072
##$SPECTYP= <>
##$SREGLST= <1H.CDCl3>
##$SSB= 0
##$STSI= 131072
##$STSR= 0
##$SW_p= 8223.68421052631
##$SYMM= 0
##$S_DEV= 0
##$TDeff= 65536
##$TDoff= 0
##$TI= <>
##$TILT= no
##$TM1= 0
##$TM2= 0
##$TOPLEV= 0
##$USERP1= <user>
##$USERP2= <user>
##$USERP3= <user>
##$USERP4= <user>
##$USERP5= <user>
##$WDW= 1
##$XDIM= 131072
##$YMAX_p= 443851413
##$YMIN_p= -11428
##$CURPLOT= <Network HP LaserJet P1505>
##$CURPRIN= <$Network HP LaserJet P1505>
##$DFORMAT= <normdp>
##$LAYOUT= <+/1D_H.xwp>
##$LFORMAT= <normlp>
##$PFORMAT= <normpl>
##$SURQMSG= 1
$$ End of Bruker specific parameters
$$ ---------------------------------
##NTUPLES= NMR SPECTRUM
##VAR_NAME=  FREQUENCY,     SPECTRUM/REAL,   SPECTRUM/IMAG
##SYMBOL=    X,             R,               I
##VAR_TYPE=  INDEPENDENT,   DEPENDENT,       DEPENDENT
##VAR_FORM=  AFFN,          ASDF,            ASDF
##VAR_DIM=   131072,        131072,          131072
##UNITS=     HZ,            ARBITRARY UNITS, ARBITRARY UNITS
##FACTOR=    0.0627417313425164, 1,          1
##FIRST=     8223.62146879497, 318,          -44533
##LAST=      0,             1424,            -45185
##MIN=       0,             -11428,          0
##MAX=       8223.62146879497, 443851413,    0
$$ Real data points
##PAGE= N=1
##DATA TABLE= (X++(R..R)), XYDATA
$$ [...]
61033A021769J325R48J009R95J522K781M210N762P999J0614J2458J3452J4951
61020A099795J7649K0462K2218K3212K4358K5975K8042L0609L3285L5401L7164
61009A398170L9629M3040M6443M9401N2755N7109O1930O6810P2182P8098Q3728
60998B049295Q8782R3987R9426J03956J07089J09724J12144J13112J11991J09921
60988C099427J07860J05688J04649J08312J19167J36158J57364J82834K12540
60979D333999K43828K73682L02003L30625L61574L99077M50755N23398O19673
60970G838614P41767Q94556J081583J303856J570981J909904K353634K924408
60962B0619303L634216M478704N377254O091605O251784N561034M048213K126524
$$ y = [1021769, 1023094, 1024042, 1025051, 1026046, 1027568, 1030349, 1034559, 1040321, 1048320, 1058934, 1071392, 1084844, 1099795, 1117444, 1137906, 1160124, 1183336, 1207694, 1233669, 1261711, 1292320, 1325605, 1361006, 1398170, 1437799, 1480839, 1527282, 1576683, 1629438, 1686547, 1748477, 1815287, 1887469, 1965567, 2049295, 2138077, 2232064, 2331490, 2435446, 2542535, 2652259, 2764403, 2877515, 2989506, 3099427, 3207287, 3312975, 3417624, 3525936, 3645103, 3781261, 3938625, 4121459, 4333999, 4577827, 4851509, 5153512, 5484137, 5845711, 6244788, 6695543, 7218941, 7838614, 8580381, 9474937, 10556520, 11860376, 13431357, 15341261, 17694895, 20619303, 24253519, 28732223, 34109477, 40201082, 46452866, 52013900, 56062113, 58188637]
60954E8188637L75798p64476j139332q18532l335R76268J660166J601664O20990
60945F0697848j052920k906366m433383n360183n672535n509400n050562m454754
60937B6257745l834425l250666k726653k268985j878900j551984j279181j052654
60929H414297q68000p20766o04698n14094m44535l90746l46733l08846k76231
60920C939648k47884k21623j96387j73037j52333j34210j19489j09950j05992
60911B478743j05940j08008j10956j12565j10025j02820r3351q3786p4135o4198
60901A512959n5218m8183m2215l6162l0520k6424k3838k2021k0825k0333k0152
60890A167068k0121k0799k2279k3455k3535k3327k3791k4241k3377k1376j9540
$$ y = [58188637, 58564435, 57799959, 56660627, 55842095, 55838760, 56815028, 58475194, 60076858, 60697848, 59644928, 56738562, 52305179, 46944996, 41272461, 35763061, 30712499, 26257745, 22423320, 19172654, 16446001, 14177016, 12298116, 10746132, 9466951, 8414297, 7546297, 6825531, 6220833, 5706739, 5262204, 4871458, 4524725, 4215879, 3939648, 3691764, 3470141, 3273754, 3100717, 2948384, 2814174, 2694685, 2584735, 2478743, 2372803, 2264795, 2153839, 2041274, 1931249, 1828429, 1735078, 1651292, 1577157, 1512959, 1457741, 1409558, 1367343, 1331181, 1300661, 1274237, 1250399, 1228378, 1207553, 1187220, 1167068, 1146947, 1126148, 1103869, 1080414, 1056879, 1033552, 1009761, 985520, 962143, 940767, 921227]
60879I21227j8365j7370j6485j6181j6268j5859j4698j3492j2741j2196j1575
60868G55997j1026j0563r827q730p837p717q251q794q819q268p457o717o114n507
60854F40370m941m664m811n333o332p987r939j1188j1036r774q193o815n844n292
60840E38221m707l344j174P47J503J567J998K786K858J702J25p95q34m42L8O39
60824E40888J414K112K250J601N37l05p19j050j508j898k129k470k934k999k392
60809E30398j625j283j274j386k015l524n342o522o923p040p028o747o553p001
60795D66135p835q198p851p395p214p097o897o680o208n196m181m148n075n804
60781C76356n653n176m949m676l991l234k752k219j368o27l80k05M02J112J373
$$ y = [921227, 902862, 885492, 869007, 852826, 836558, 820699, 806001, 792509, 779768, 767572, 755997, 744971, 734408, 724581, 715851, 708014, 700297, 692046, 683252, 674433, 666165, 658708, 651991, 645877, 640370, 635429, 630765, 625954, 620621, 614289, 606302, 596363, 585175, 574139, 564365, 556172, 549357, 543513, 538221, 533514, 530170, 528996, 529743, 531246, 532813, 534811, 537597, 540455, 542157, 542282, 541487, 540653, 540211, 540249, 540888, 542302, 544414, 546664, 548265, 548802, 548497, 547778, 546728, 545220, 543322, 541193, 538723, 535789, 532790, 530398, 528773, 527490, 526216, 524830, 522815, 519291, 513949, 507427, 500504, 493464, 486436, 479689, 473136, 466135, 458300, 450102, 442251, 434856, 427642, 420545, 413648, 406968, 400760, 395564, 391383, 387235, 382160, 376356, 370703, 365527, 360578, 355902, 351911, 348677, 345925, 343706, 342338, 341711, 341331, 341126, 341528, 342640, 344013]
60766C44013J390J728K267K455K327K504L290M346N242N800O078O379P055P795
60752D02669P468N267J829j295l194m084m463m459m035l321k620k300k573l181
60738C81708l536l455l476m016m636m673m255l984l842l241k089j100p89q54p49
60723C37013l75M5M04O79P94P38P10R67J584K382K990L109K793K433K312K325
60707C60903K233J964J483O67l77j135j224r31q84j328j993k487k462j737o40
60692C52052M2j01n00k97N80J491J982K103J999J765J629J783K100K431K985L911
60676C75955M759M973M722M624M743M563L890L074K350J680J280J514K174K479
60662D22780K091J488J207J222J218R35Q8j436l104m100m349m676n612o604o760
$$ y = [344013, 345403, 347131, 349398, 351853, 354180, 356684, 359974, 364320, 369562, 375362, 381440, 387819, 394874, 402669, 410137, 415404, 417233, 415938, 412744, 408660, 404197, 399738, 395703, 392382, 389762, 387462, 384889, 381708, 378172, 374717, 371241, 367225, 362589, 357916, 353661, 349677, 345835, 342594, 340505, 339405, 338616, 337762, 337013, 336638, 336683, 337087, 337766, 338560, 339298, 340008, 340975, 342559, 344941, 347931, 351040, 353833, 356266, 358578, 360903, 363136, 365100, 366583, 367250, 366873, 365738, 364514, 363583, 362699, 361371, 359378, 356891, 354429, 352692, 352052, 352094, 351993, 351493, 351196, 351776, 353267, 355249, 357352, 359351, 361116, 362745, 364528, 366628, 369059, 372044, 375955, 380714, 385687, 390409, 395033, 399776, 404339, 408229, 411303, 413653, 415333, 416613, 418127, 420301, 422780, 424871, 426359, 427566, 428788, 430006, 430941, 431029, 429593, 426489, 422389, 418040, 413364, 407752, 401148, 394388]
60647C94388n976m994m596m957n518n412m300k849k054k117k363k185j615r92
60633C44460n83n15o22m40J50N20J83k46J53R85R46j42r45n92J56K90QR9P06J467
60613C46038K192K717K798K685L122M130M557L608K108J419J788K639L815N402
60599C89018O856P471P562Q129R406J0723J1746J2839J4147J5140J5413J5155
60587E23605J4543J3263J0996Q027M975K156o28l717p052j0017j1902j2634j2776
60574E18839j2740j2323j1208r541p720o005m590l700l191k474j233J47J196J941
60560D47398K488K561K088J674J828K031J411J10q29q09k07L48O17O34O23R99
60544D62965K023L411M667N616O341O889P563R012J1378J3684J4897J5370J6374
$$ y = [394388, 388412, 383418, 378822, 373865, 368347, 362935, 358635, 355786, 353732, 351615, 349252, 347067, 345452, 344460, 343877, 343362, 342740, 342300, 342450, 342970, 343153, 342907, 343060, 344045, 344991, 344849, 343904, 343312, 343468, 343758, 343766, 343865, 344571, 346038, 348230, 350947, 353745, 356430, 359552, 363682, 368239, 371847, 373955, 375374, 377162, 379801, 383616, 389018, 395874, 403345, 410907, 419036, 428442, 439165, 450911, 463750, 477897, 493037, 508450, 523605, 538148, 551411, 562407, 570434, 575409, 577565, 576937, 573220, 566168, 556151, 544249, 531615, 518839, 506099, 493776, 482568, 473027, 465307, 459302, 454712, 451012, 447821, 445347, 444114, 444261, 445457, 447398, 449886, 452447, 454535, 456209, 458037, 460068, 461479, 461589, 460760, 459951, 459744, 460092, 460709, 461343, 461966, 462965, 464988, 468399, 473066, 478682, 485023, 491912, 499475, 508487, 519865, 533549, 548446, 563816, 580190]
60531E80190J8296K0330K1956K3768K6518L0195L4469L9497M5792N3681O3174
60520I57866P4050Q5835R7812J09095J18226J22923J20859J11032R4228P2305
60510A964231M7464K1983k137k3680m1939n5952o4668o8081o7650o5232o1809
60499A582530n7438n1879m5007l7006k8466k0100j2135m296L582J1324J9064K7612
60487A387785L7841M9899O3326P7580R2025J05433J16090J22571J24412J22075
60477B299037J16650J09808J03657R9731R7613R4742Q8269P7150O2124M4042K3427
60466C216250K127j5688k5148k3130q650J8196N6465J03865J57344K14419K73049
60455C969099L29883L79210M13679M25583M08097L57260K74227J65502M0853q8646
$$ y = [580190, 598486, 618816, 640772, 664540, 691058, 721253, 755722, 795219, 841011, 894692, 957866, 1031916, 1117751, 1215563, 1324658, 1442884, 1565807, 1686666, 1797698, 1891926, 1964231, 2011695, 2033678, 2031541, 2007861, 1965922, 1909970, 1845302, 1777221, 1709571, 1644339, 1582530, 1525092, 1473213, 1428206, 1391200, 1362734, 1342634, 1330499, 1326203, 1329785, 1341109, 1360173, 1387785, 1425626, 1475525, 1538851, 1616431, 1708456, 1813889, 1929979, 2052550, 2176962, 2299037, 2415687, 2525495, 2629152, 2728883, 2826496, 2921238, 3009507, 3086657, 3148781, 3192823, 3216250, 3218377, 3202689, 3177541, 3154411, 3145761, 3163957, 3220422, 3324287, 3481631, 3696050, 3969099, 4298982, 4678192, 5091871, 5517454, 5925551, 6282811, 6557038, 6722540, 6763393, 6674747]
60445F674747k11100l14736l90816m36397m54020m49023m27343l94806l56675
60436C239831l16886k77961k41661k09312j81376j57364j36631j19040j04513
60427A495087r2298q1240p0748o1048n2371m4425l6869k9853k3663j8151j2989
60416I71432q360m698j899O78L396O186R196J2906J7278K1627K5577K9509L3554
60403A116382L6903L8686L8957L8040L5471L0507K3412J5463P764P21n464j0482
60391A366360j4126j6304j6917j6064j4234j1866r092o294m460m249n064n762
60379A241928o077o467o873o570n268l445j531N01K572M192M880M278J838k921
60365A221037r700j7472k5324l2752l9143m3645m5770m5753m4212m1798l9012
$$ y = [6674747, 6463647, 6148911, 5758095, 5321698, 4867678, 4418655, 3991312, 3596506, 3239831, 2922945, 2644984, 2403323, 2194011, 2012635, 1855271, 1718640, 1599600, 1495087, 1402789, 1321549, 1250801, 1189753, 1137382, 1092957, 1056088, 1026235, 1002572, 984421, 971432, 963072, 958374, 956475, 957153, 960549, 966735, 975931, 988837, 1006115, 1027742, 1053319, 1082828, 1116382, 1153285, 1191971, 1230928, 1268968, 1304439, 1334946, 1358358, 1373821, 1381585, 1382306, 1376842, 1366360, 1352234, 1335930, 1319013, 1302949, 1288715, 1276849, 1267757, 1261463, 1257003, 1252754, 1247690, 1241928, 1235851, 1229384, 1222511, 1215941, 1210673, 1207228, 1205697, 1206198, 1208770, 1212962, 1217842, 1222120, 1223958, 1221037, 1211337, 1193865, 1168541, 1135789, 1096646, 1053001, 1007231, 961478, 917266, 875468, 836456]
60354H36456l6005l2600k8846k5231k2013j8849j5619j3029j1513j0197q021n450
60342F09083l784l084k180o93M23N26J60m8j45j64J51M89m3j569l127m121n068
60325E86806o370p379p423o855o334n813m914l728k655j960j827k241k600k187
60311E24520j275q72j159j254q29o27q52m06J287L002L386K898K889L538M055
60296E38301M226M474M742M596M280M527N500O787Q260R968J1414J1971J1892
60283F30938J2113J2998J4166J5513J7512K0348K3458K6140K8105K9315K9772
60272H60378K9679K9411K9115K8440K6744K3687J9817J6556J5089J5135J5252
60261A109303J4593J3736J3556J3955J4284J4396J4678J5406J6677J8574K0831
$$ y = [836456, 800451, 767851, 739005, 713774, 691761, 672912, 657293, 644264, 632751, 622554, 614533, 609083, 605299, 602215, 600035, 599342, 599765, 600291, 600451, 600403, 600258, 600094, 600245, 600734, 600691, 599122, 595995, 591874, 586806, 580436, 573057, 565634, 558779, 552445, 546632, 541718, 537990, 535335, 533375, 531548, 529307, 526707, 524520, 523245, 522373, 521214, 519960, 519131, 518504, 517652, 517246, 518533, 521535, 524921, 527819, 530708, 534246, 538301, 542527, 547001, 551743, 556339, 560619, 565146, 570646, 577433, 585693, 595661, 607075, 619046, 630938, 643051, 656049, 670215, 685728, 703240, 723588, 747046, 773186, 801291, 830606, 860378, 890057, 919468, 948583, 977023, 1003767, 1027454, 1047271, 1063827, 1078916, 1094051, 1109303, 1123896, 1137632, 1151188, 1165143, 1179427, 1193823, 1208501, 1223907, 1240584, 1259158, 1279989]
60250A279989K2755K4020K5236K7185K9847L2680L5430L7975L9806M0319L9539
60239A634781L8109L6723L5931L5995L6520L6568L5743L4668L4029L3654L3138
60228B025859L2762L3019L3698L4231L4587L5131L5873L6646L7584L8736L9597
60217B417723L9941M0707M3133M7065N0994N3583N4368N3076M9350M3336L5833
60206B929109K7729J9822J3044Q097M710J831j247m372p050r014j0187j0587j0358
60193B951527r651q678p977q307r772j1534j2803j3709j4664j5399j5578j5886
60181B807569j7633k1357k6637l3204m1217n0374n9528o7449p3531p7661q0002
60170B258976q0905q0659p9258p6694p3244o9126o4238n8681n3129m7942m2396
$$ y = [1279989, 1302744, 1326764, 1352000, 1379185, 1409032, 1441712, 1477142, 1515117, 1554923, 1595242, 1634781, 1672890, 1709613, 1745544, 1781539, 1818059, 1854627, 1890370, 1925038, 1959067, 1992721, 2025859, 2058621, 2091640, 2125338, 2159569, 2194156, 2229287, 2265160, 2301806, 2339390, 2378126, 2417723, 2457664, 2498371, 2541504, 2588569, 2639563, 2693146, 2747514, 2800590, 2849940, 2893276, 2929109, 2956838, 2976660, 2989704, 2997801, 3002511, 3004342, 3003095, 2998723, 2991673, 2982659, 2972472, 2961885, 2951527, 2941876, 2933198, 2925221, 2916914, 2907142, 2895608, 2882805, 2869096, 2854432, 2839033, 2823455, 2807569, 2789936, 2768579, 2741942, 2708738, 2667521, 2617147, 2557619, 2490170, 2416639, 2338978, 2258976, 2178071, 2097412, 2018154, 1941460, 1868216, 1799090, 1734852, 1676171, 1623042, 1575100, 1532704]
60159A532704l5628k8215k1845j7529j4890j3139j1852j0827r954r539j0019j1284
60147A337983j2711j3962j5115j6106j6612j6487j5792j4406j2172r324o223k752
60135A186321J387N963J0501J5076K0144K5649L1123L6606M2768N0039N8313O7456
60123A551346P7342Q7272R6139J03313J08750J12115J12478J09000J01567R0659
60113B549981P7172O2209M6575L0496J4312q99j4089k5335l5418m4529n2215n8389
60101B549871o3406o7311o9908p1519p2639p2951p1719o9144o6269o3501o0375
60090A801129n6783n3163m9276m4175l7749l1032k4561j7672j0050k666L639R399
60078A487040J5342K0906K4938K7190K8107K7792K6228K4071K2249K0978J9987
$$ y = [1532704, 1497076, 1468861, 1447016, 1429487, 1414597, 1401458, 1389606, 1378779, 1368825, 1359286, 1349267, 1337983, 1325272, 1311310, 1296195, 1280089, 1263477, 1246990, 1231198, 1216792, 1204620, 1195296, 1189073, 1186321, 1187708, 1193671, 1204172, 1219248, 1239392, 1265041, 1296164, 1332770, 1375538, 1425577, 1483890, 1551346, 1628688, 1715960, 1812099, 1915412, 2024162, 2136277, 2248755, 2357755, 2459322, 2549981, 2627153, 2689362, 2735937, 2766433, 2780745, 2779846, 2765757, 2740422, 2705004, 2660475, 2608260, 2549871, 2486465, 2419154, 2349246, 2277727, 2205088, 2132137, 2060418, 1991274, 1925005, 1861504, 1801129, 1744346, 1691183, 1641907, 1597732, 1559983, 1528951, 1504390, 1486718, 1476668, 1474002, 1477641, 1487040, 1502382, 1523288, 1548226, 1575416, 1603523, 1631315, 1657543, 1681614, 1703863, 1724841, 1744828]
60067A744828J9467J9967K1529K3615K5862K8250L0496L1874L1744L0031K7181
60056B034844K3843K0549J7482J4498J1399Q073M449N84l192o626j0041j4268
60044B101594j9987k7294l5573m3306m8387m9458m7082m2998l8294l2971k7186
60033A689058k1863j7848j5222j3740j3171j3077j3037j3341j4653j6732j8439
60022A517935j9307k0058k1107k1601k0658j8638j6368j3886j0894p705m811j957
60010A340945J359M847P825J0385J3173J6193J8673K0279K1656K3584K6052K8436
59998A533407L0227L1504L2788L4497L6451L8022L8732L8534L7514L5758L3561
59987A920995L1318K9020K6262K2749J8376J2753N419l318j2387k1125k9589l7418
$$ y = [1744828, 1764295, 1784262, 1805791, 1829406, 1855268, 1883518, 1914014, 1945888, 1977632, 2007663, 2034844, 2058687, 2079236, 2096718, 2111216, 2122615, 2130688, 2135137, 2135721, 2132529, 2125903, 2115862, 2101594, 2081607, 2054313, 2018740, 1975434, 1927047, 1877589, 1830507, 1787509, 1749215, 1716244, 1689058, 1667195, 1649347, 1634125, 1620385, 1607214, 1594137, 1581100, 1567759, 1553106, 1536374, 1517935, 1498628, 1478570, 1457463, 1435862, 1415204, 1396566, 1380198, 1366312, 1355418, 1347713, 1342902, 1340945, 1342304, 1347151, 1354976, 1365361, 1378534, 1394727, 1413400, 1433679, 1455335, 1478919, 1504971, 1533407, 1563634, 1595138, 1627926, 1662423, 1698874, 1736896, 1775628, 1814162, 1851676, 1887434, 1920995, 1952313, 1981333, 2007595, 2030344, 2048720, 2061473, 2066892, 2063574, 2051187, 2030062, 2000473, 1963055]
59975A963055m3259m6022m5996m4099m0629l5568k9466k3071j6385q990j123O341
59963A634788J2915J8820K4391K9734L4862L9587M3374M5822M7237M8257M8946
59952B028733M8838M7774M6254M4848M3548M1791L8952L4817K9711K3927J7096
59941B446289Q575j336j1119j9343k5732l0543l3437l3705l1310k6973k1336j4599
59929B205431o900J481J0350J9567K8914L8234M7543N6625O4752P1083P5154P6516
59917B688750P4434O8552N9659M9102L7604K5328J3051K394n356j0048j2006j1181
59905B980283p356q52P517J7041K7465L8892N1708O6593Q4199J04426J25837J45783
59893C641536J60994J68049J63614J45103J12011O7140J6473l2494p3156j01752
$$ y = [1963055, 1919796, 1873774, 1827778, 1783679, 1743050, 1707482, 1678016, 1654945, 1638560, 1629570, 1628447, 1634788, 1647703, 1666523, 1690914, 1720648, 1755510, 1795097, 1838471, 1884293, 1931530, 1979787, 2028733, 2077571, 2125345, 2171599, 2216447, 2259995, 2301786, 2340738, 2375555, 2405266, 2429193, 2446289, 2454864, 2453528, 2442409, 2423066, 2397334, 2366791, 2333354, 2299649, 2268339, 2241366, 2220030, 2205431, 2198531, 2200012, 2210362, 2229929, 2258843, 2297077, 2344620, 2401245, 2465997, 2537080, 2612234, 2688750, 2763184, 2831736, 2891395, 2940497, 2978101, 3003429, 3016480, 3018874, 3013518, 3003470, 2991464, 2980283, 2972927, 2972075, 2979592, 2996633, 3024098, 3062990, 3114698, 3181291, 3265490, 3369916, 3495753, 3641536, 3802530, 3970579, 4134193, 4279296, 4391307, 4458447, 4474920, 4442426, 4369270, 4267518]
59883D267518j18025j24141j22701j15762j05446r4517q5324p8371p2753o7848
59873C282630o3797o0347n6370n0835m3464l4147k2559q842O159K2003L9459N9608
59861C069498Q2605J07905J35223J64610J95907K28588K61671K93014L18646L33349
59851E191016L32013L10912K68889K08635J36846O2337o804o5055j09724j40508
59841F188557j59027j68458j73307j78662j88429k03449k21475k39059k53259
59832D403432k61766k62718k55418k41001k21739j99811j76821j53961j32006
59823B498191j11349r2383p5621o1242m8912l8307k9424k2181j6165j1024o546
59812A985037k153L013R016J4668J8485J9621J7917J3994R843Q337J1385J8923
$$ y = [4267518, 4149493, 4025352, 3902651, 3786889, 3681443, 3586926, 3501602, 3423231, 3350478, 3282630, 3218833, 3158486, 3102116, 3051281, 3007817, 2973670, 2951111, 2942269, 2948428, 2970431, 3009890, 3069498, 3152103, 3260008, 3395231, 3559841, 3755748, 3984336, 4246007, 4539021, 4857667, 5191016, 5523029, 5833941, 6102830, 6311465, 6448311, 6510648, 6503844, 6438789, 6329065, 6188557, 6029530, 5861072, 5687765, 5509103, 5320674, 5117225, 4895750, 4656691, 4403432, 4141666, 3878948, 3623530, 3382529, 3160790, 2960979, 2784158, 2630197, 2498191, 2386842, 2294459, 2218838, 2157596, 2108684, 2070377, 2040953, 2018772, 2002607, 1991583, 1985037, 1982884, 1985897, 1994913, 2009581, 2028066, 2047687, 2065604, 2079598, 2089441, 2097778, 2109163, 2128086]
59800B128086K9997M3724N8579P1919Q1570Q7421R0397R0469Q6597P8225O5689
59789B912673M9545L0710J1158o587k0776l0784l6425l7863l6043l2362k8018
59778B775228k4186k2421k3763k7489l1534l4269l5268l4639l2450k8878k4193
59767B456138j8559j2290o008q5N821J1941J7556K1687K4191K5350K4855K2353
59755B572950J8732J5544J3168J0693P743N255M045L756L737M198N932R329J4083
59742B689165J9481K4705K9272L3236L6695L9113L9623L7869L4115K8736K2392
59731C034402J6514J2721J1564J2562J5528K1012K9215L9350N0528O2568P5366
59720C381330Q7918R8442J05404J08213J07174J02938R5950Q6416P4900O2598
$$ y = [2128086, 2158083, 2201807, 2260386, 2332305, 2413875, 2501296, 2591693, 2682162, 2768759, 2846984, 2912673, 2962218, 2992928, 3004086, 2997499, 2976723, 2945939, 2909514, 2871651, 2835608, 2803246, 2775228, 2751042, 2728621, 2704858, 2677369, 2645835, 2611566, 2576298, 2541659, 2509209, 2480331, 2456138, 2437579, 2425289, 2419281, 2419196, 2425017, 2436958, 2454514, 2476201, 2500392, 2525742, 2550597, 2572950, 2591682, 2607226, 2620394, 2631087, 2638830, 2644085, 2648130, 2651886, 2655623, 2659821, 2665753, 2675082, 2689165, 2708646, 2733351, 2762623, 2795859, 2832554, 2871667, 2911290, 2949159, 2983274, 3012010, 3034402, 3050916, 3063637, 3075201, 3087763, 3103291, 3124303, 3153518, 3192868, 3243396, 3305964, 3381330, 3469248, 3567690, 3673094, 3781307, 3888481, 3991419, 4087369, 4173785, 4248685, 4311283]
59710D311283N0597L9118K8032J7890R808M471J909K149N333J1211J9279K9478
59698D530558M2017N6218P0303Q2744R3381J02985J12233J21504J31194J41565
59688E484702J52085J61156J66639J66800J60735J47798J26802R6602N7832J3633
59678F734784l1845p5230j13976j45692j68640j82739j89184j89218j84224j76763
59668E277273j70161j66505j65528j65603j65155j63004j58268j50750j41305
59659C830994j31497j22826j16064j11118j07540j05197j04122j03673j02550
59650B826407j00066r6813r3531r0045q5982q1666p7345p2269o5739n8423n1361
59639A953167m4151l5650k6171j7320r736k748L523P449P950N853K538j532o207
$$ y = [4311283, 4361880, 4400998, 4429030, 4446920, 4456728, 4461199, 4463108, 4465257, 4470590, 4481801, 4501080, 4530558, 4572575, 4628793, 4699096, 4781840, 4875221, 4978206, 5090439, 5211943, 5343137, 5484702, 5636787, 5797943, 5964582, 6131382, 6292117, 6439915, 6566717, 6663319, 6721151, 6734784, 6702939, 6627709, 6513733, 6368041, 6199401, 6016662, 5827478, 5638260, 5454036, 5277273, 5107112, 4940607, 4775079, 4609476, 4444321, 4281317, 4123049, 3972299, 3830994, 3699497, 3576671, 3460607, 3349489, 3241949, 3136752, 3032630, 2928957, 2826407, 2726341, 2629528, 2535997, 2445952, 2359970, 2278304, 2200959, 2128690, 2062951, 2004528, 1953167, 1909016, 1873366, 1847195, 1829875, 1820139, 1817391, 1820914, 1828363, 1836313, 1842166, 1844704, 1843172, 1836965]
59626A836965j0722j4288j6814j8459j9167j9147j9016j8905j8246j6884j5524
59615A649793j4513j3006j0101o037j736K191N349P174P474O763N499L404K17
59602A642471l470o709r179j0972j1944j1875j1074j0149r267q078o271l992j767
59589A537724j46Q36J851L641O296R564J3617J8708K4177K8775L2168L5081L7675
59576A749967L8814L7591L4712L1716K9511K8237K7851K8106K8396K8377K8422
59565B091700K9058L0326L2181L4950L8893M3663M8654N3545N8100O1780O3859
59554B586709O3639O0407N3758M4145L2641K0098P223m642j4327k2837l3221m7188
59542B746405o2585p5189q2382q4214q1795p6111o8109n8572m7636l5203k1834
$$ y = [1836965, 1826243, 1811955, 1795141, 1776682, 1757515, 1738368, 1719352, 1700447, 1682201, 1665317, 1649793, 1635280, 1622274, 1612173, 1606136, 1604400, 1606591, 1611940, 1619114, 1626588, 1633351, 1638850, 1642254, 1642471, 1639001, 1632292, 1623113, 1612141, 1600197, 1588322, 1577248, 1567099, 1557832, 1549754, 1543483, 1539491, 1537724, 1537578, 1538414, 1540265, 1543906, 1550202, 1559766, 1573383, 1592091, 1616268, 1645043, 1677211, 1712292, 1749967, 1788781, 1826372, 1861084, 1892800, 1922311, 1950548, 1978399, 2006505, 2034901, 2063278, 2091700, 2120758, 2151084, 2183265, 2218215, 2257108, 2300771, 2349425, 2402970, 2461070, 2522850, 2586709, 2650348, 2710755, 2764513, 2808658, 2841299, 2861397, 2868620, 2863978, 2849651, 2826814, 2793593, 2746405, 2683820, 2608631, 2526249, 2442035, 2360240, 2284129, 2216020, 2157448, 2109812, 2074609, 2052775]
59531B052775q561M029J5777K6139L4288M0030M3772M5484M4395M0040L2929K3878
59519B394975J3170Q01j2782k6547l9409n0627n9850o6989p2066p4996p5518p3554
59507A856608o9669o4941o0057n4809m8868m2937l8290l5016l1659k7147k2215
59496A361000j8024j4210r614m394J14L525O884J0877J5107J9459K4638L0616
59484A425978L5903L9260M1062M2083M2027M0242L6953L2657K7028J9544J0717
59473A793454J618p361j6251k4495l1211l6291m0260m3242m4936m5419m5117m4109
59461A416380m2280m0069l8248l6856l5122l2517k9305k5993k2726j9376j5813
59450A078075j2098q603n832l790j760R20M040O841Q985J0736J2413J4132J5991
$$ y = [2052775, 2044214, 2048243, 2064020, 2090159, 2124447, 2164477, 2208249, 2253733, 2298128, 2338168, 2371097, 2394975, 2408145, 2408946, 2396164, 2369617, 2330208, 2279581, 2219731, 2152742, 2080676, 2005680, 1930162, 1856608, 1786939, 1721998, 1661941, 1607132, 1558264, 1515327, 1477037, 1442021, 1410362, 1383215, 1361000, 1342976, 1328766, 1319152, 1314758, 1314872, 1318397, 1325281, 1336158, 1351265, 1370724, 1395362, 1425978, 1461881, 1501141, 1542203, 1584286, 1626313, 1666555, 1703508, 1736165, 1763193, 1782737, 1793454, 1795072, 1787711, 1771460, 1746965, 1715754, 1679463, 1639203, 1595961, 1551025, 1505606, 1460489, 1416380, 1374100, 1334031, 1295783, 1258927, 1223805, 1191288, 1161983, 1135990, 1113264, 1093888, 1078075, 1065977, 1057374, 1051542, 1047752, 1045992, 1046912, 1050952, 1057793, 1066778, 1077514, 1089927, 1104059, 1120050]
59437A120050J8009J9926K1444K2687K4050K5650K7231K8620K9982L1591L3575
59426A402815L6001L9089M3056M7356N0157M9207M3906L6342K9724K6033K5516
59415A829202K7829L2497L8511M4888N1744N9483O6632P0139O8754O5006O2814
59404B417499O4121O8761P6479Q7422J01032J15814J30279J43236J53305J58966
59394C516914J59126J53185J40909J23049J01868Q0441O1347M6180L5655K9476
59384D448150K6464K5469K5919K7099K7594K6291K3511K0332J7202J3979J0917
59373D692927Q542O721M716K240k86k468m419o667j0188j6219k5378l6952m9678
59360D562891o2898p6289q8707r8283j03766j05232j03342r8466r0656q0011o7086
$$ y = [1120050, 1138059, 1157985, 1179429, 1202116, 1226166, 1251816, 1279047, 1307667, 1337649, 1369240, 1402815, 1438816, 1477905, 1520961, 1568317, 1618474, 1667681, 1711587, 1747929, 1777653, 1803686, 1829202, 1857031, 1889528, 1928039, 1972927, 2024671, 2084154, 2150786, 2220925, 2289679, 2354685, 2417499, 2481620, 2550381, 2626860, 2714282, 2815314, 2931128, 3061407, 3204643, 3357948, 3516914, 3676040, 3829225, 3970134, 4093183, 4195051, 4275492, 4336839, 4383019, 4418674, 4448150, 4474614, 4500083, 4526002, 4553101, 4580695, 4606986, 4630497, 4650829, 4668031, 4682010, 4692927, 4701469, 4708190, 4712906, 4715146, 4714860, 4712392, 4707973, 4701306, 4691118, 4674899, 4649521, 4612569, 4562891, 4499993, 4423704, 4334997, 4236714, 4132948, 4027716, 3924374, 3825908, 3735252, 3655241, 3588155]
59349C588155n3088l9517k7296j6611p980l017l437r498j9889l2786m6424n9023
59337C269589o9207p6644q1820q5156q6739q6743q5564q3578q1136p8686p6477
59326B377839p4265p1649o8461o4598n9851n4320m8575m2928l6931l0171k3069
59315A803021j6311r886l341L331R840J6297K2985K9601L5436M0242M4176M7039
59303B022430M8294M7814M6024M3313L9935L6493L3924L2812L2981L3752L4257
59292B452029L3705L1747K8534K4199J8477J1105K271p640j8359k9348l9521m7907
59280B459292n4339n9052o1898o2447o0578n6498n0472m2958l4799k6786j9264
59269A930201j2358o264j009L594P470J0315J2417J4746J7834K1311K5085L0216
$$ y = [3588155, 3535067, 3495550, 3468254, 3451643, 3443663, 3440646, 3437209, 3427711, 3407822, 3375036, 3328612, 3269589, 3200382, 3123738, 3041918, 2956762, 2870023, 2783280, 2697716, 2614138, 2533002, 2454316, 2377839, 2303574, 2231925, 2163464, 2098866, 2039015, 1984695, 1936120, 1893192, 1856261, 1826090, 1803021, 1786710, 1776824, 1773483, 1776814, 1786654, 1802951, 1825936, 1855537, 1890973, 1931215, 1975391, 2022430, 2070724, 2118538, 2164562, 2207875, 2247810, 2284303, 2318227, 2351039, 2384020, 2417772, 2452029, 2485734, 2517481, 2546015, 2570214, 2588691, 2599796, 2602067, 2594427, 2576068, 2546720, 2507199, 2459292, 2404953, 2345901, 2284003, 2221556, 2160978, 2104480, 2054008, 2011050, 1976251, 1949465, 1930201, 1917843, 1911579, 1910570, 1914164, 1921634, 1931949, 1944366, 1959112, 1976946, 1998257, 2023342, 2053558]
59257B053558L7771M7176N6074O1231N9467M9232L2559J4757R72o718q620n336
59245B392123K179J1705K0949K9591L8739M8566N7879O5840P2637P8264Q2071
59234B900543Q3813Q4073Q3299Q1322P8081P3958O9173O3502N6765M8933L9657
59223C663119K8403J5264J086j3254k7261m0591n2828o3399p1348p5520p5409
59212C288262p1535o4621n4935m2837k9278j5043j65J5153K9780M2764N4481O5686
59200C217712P6123Q5173R3161J00544J06320J08599J06405R9531Q7011O7417
59190D147996M0915R875k2509n3206p9449r9492j13528j22751j27555j27785j24431
59179C328080j19535j14192j07987j00541r2370q3987p5370o6619n8021m9317
$$ y = [2053558, 2091329, 2138505, 2194579, 2255810, 2315277, 2364509, 2397068, 2411825, 2412797, 2406079, 2397459, 2392123, 2394302, 2406007, 2426956, 2456547, 2495286, 2543852, 2601731, 2667571, 2740208, 2818472, 2900543, 2984356, 3068429, 3151728, 3233050, 3311131, 3385089, 3454262, 3517764, 3574529, 3623462, 3663119, 3691522, 3706786, 3707872, 3694618, 3667357, 3626766, 3573938, 3510539, 3439191, 3363671, 3288262, 3216727, 3152106, 3097171, 3054334, 3025056, 3010013, 3009848, 3025001, 3054781, 3097545, 3152026, 3217712, 3293835, 3379008, 3472169, 3572713, 3679033, 3787632, 3894037, 3993568, 4080579, 4147996, 4188911, 4198786, 4176277, 4123071, 4043622, 3944130, 3830602, 3707851, 3580296, 3452511, 3328080, 3208545, 3094353, 2986366, 2885825, 2793455, 2709468, 2634098, 2567479, 2509458, 2460141]
59169B460141l9980l0378k1584j3891o679L4N087P583P831O748N346N056P420
59156B392734J2957K1035L0964M2320N4092O4547P2293P6869P8324P7043P4008
59145B997186P0357O6451O1993N6727N0295M1822L0701J7584L545j1276k7090
59134C358295m3109n8122p1945q4649r4874j00741j02237j00751r6305q7510p4594
59123B443458o0177m6374l3094k0019q259J191R016J6238K2411K6306K7493K6295
59111B404485K3010J7991J1727M316m403j3705k1929k7952l1816l3683l3329l1075
59099B263637k7915k4248j9598j4083q934n106k555j328j993m372p148r399j1356
59086B125602j3051j3476j1895q827n145j369J645K727J911O97J2p61k024k715
$$ y = [2460141, 2420161, 2389783, 2368199, 2354308, 2347629, 2347663, 2352750, 2360333, 2368164, 2374912, 2380258, 2385314, 2392734, 2405691, 2426726, 2457690, 2500010, 2554102, 2618649, 2690942, 2767811, 2846135, 2923178, 2997186, 3067543, 3133994, 3195987, 3252714, 3303009, 3344831, 3375532, 3393116, 3396661, 3385385, 3358295, 3315186, 3257064, 3185119, 3100470, 3005596, 2904855, 2802618, 2701867, 2605562, 2518052, 2443458, 2383281, 2336907, 2303813, 2283794, 2275535, 2276726, 2285742, 2301980, 2324391, 2350697, 2378190, 2404485, 2427495, 2445486, 2457213, 2461529, 2457126, 2443421, 2421492, 2393540, 2361724, 2328041, 2294712, 2263637, 2235722, 2211474, 2191876, 2177793, 2168859, 2163753, 2161198, 2159870, 2157877, 2153505, 2146357, 2136958, 2125602, 2112551, 2099075, 2087180, 2078353, 2073208, 2071839, 2073484, 2076211, 2078122, 2078819, 2078831, 2078070, 2076046, 2073331]
59072B073331j889k48J117K501M964Q958J4568K2092L1100L9471M4229M2885L3731
59059B316810J6244p596l3298n6281p3979q5428r0158q8598q2486p3701o3222
59048A678307n1758m0346k9479j8673p838J709Q417J1855J2332J0280O866M060
59036A585732L052L518N073Q320J3521J9591K5642L2423M1017N1198O2227P4297
59024A925611Q7763J01847J15430J28391J40765J51202J57456J57788J50735J34388
59014C251376J07656P2149L1764r268m7298p9121j02552j17088j23173j21160
59004B863285j11708r6511p7733n7104l6280j7249j356J1480K1535K7885K9230
58993B555474K5567J8094P921m225j7451l0747m3151n3315n9531o0875n7707n0586
$$ y = [2073331, 2071442, 2071194, 2072311, 2074812, 2079776, 2088734, 2103302, 2125394, 2156494, 2195965, 2240194, 2283079, 2316810, 2333054, 2325458, 2292160, 2235879, 2161900, 2076472, 1986314, 1897716, 1815230, 1741529, 1678307, 1626549, 1586203, 1556724, 1538051, 1530213, 1531922, 1540339, 1552194, 1564526, 1574806, 1581672, 1585732, 1588784, 1592302, 1597375, 1605695, 1619216, 1638807, 1664449, 1696872, 1737889, 1789087, 1851314, 1925611, 2013374, 2115221, 2230651, 2359042, 2499807, 2651009, 2808465, 2966253, 3116988, 3251376, 3359032, 3431181, 3462945, 3453677, 3406379, 3327258, 3224706, 3107618, 2984445, 2863285, 2751577, 2655066, 2577333, 2520229, 2483949, 2466700, 2465344, 2476824, 2498359, 2526244, 2555474, 2581041, 2599135, 2607056, 2602831, 2585380, 2554633, 2511482, 2458167, 2398636, 2337761, 2280054, 2229468]
58981B229468l9732k6282j2800j395P748J4940J9223J9461J6234J1123M763k840
58969B239911j0507j5958j7755j6170j2342p424k284K791P847J2292J4774J4690
58957B209865J2997J0894Q718O921O969J0033J5654K2892L1828M2708N4490O5531
58945B499500P4834Q1188Q2050P5118O0654M0961J8169n838k7970m4417n3013
58934B801236n4145m9530m1102l0801k0105r606M16R350J6736K2695K7321L0534
58922B702999L3353L8159M6609N8318P2580Q9843J09958J30259J47408J59985
58912C589471J67378J67337J57388J38404J14497Q9555O5863M5583L0801K1517
58902D587794J5743J2081J0508J0329R371O089R51m948j1400j8701k7076l7260
$$ y = [2229468, 2189736, 2163454, 2150654, 2149259, 2157007, 2171947, 2191170, 2210631, 2226865, 2237988, 2242751, 2239911, 2229404, 2213446, 2195691, 2179521, 2167179, 2159755, 2157471, 2160262, 2168109, 2180401, 2195175, 2209865, 2222862, 2233756, 2242474, 2249395, 2256364, 2266397, 2282051, 2304943, 2336771, 2379479, 2433969, 2499500, 2574334, 2655522, 2737572, 2812690, 2873344, 2914305, 2932474, 2926636, 2898666, 2854249, 2801236, 2747091, 2697561, 2656459, 2625658, 2605553, 2595947, 2596363, 2605713, 2622449, 2645144, 2672465, 2702999, 2736352, 2774511, 2821120, 2879438, 2952018, 3041861, 3151819, 3282078, 3429486, 3589471, 3756849, 3924186, 4081574, 4219978, 4334475, 4424030, 4489893, 4535476, 4566277, 4587794, 4603537, 4615618, 4626126, 4636455, 4645826, 4651915, 4652866, 4647918, 4636518, 4617817, 4590741, 4553481]
58890D553481n0542o7508q7236j07836j27126j42882j53724j60140j63803j65682
58880C327002j65486j62861j58142j51788j44035j35264j26006j16472j06683
58871B060265r7008q7910p9388p1277o3779n7012n0480m3860l7850l3327l0022
58860A408352k6972k3806k0658j7343j3714j0305p506m705j336J796L637M717
58848A292157O427Q868J0962J2407J3931J5797J7489J8939K0693K2888K5294K8250
58836A494102L2383L7516M2897M8225N3238N6671N7040N4241M9193M2271L3498
58825B001275K3956J5373Q432K956m07k92L499R624J6830K4812L3484M2675N2506
58812B234723O2908P2881Q1330Q8322R4284R8407R9196R6278R0104Q0277O5937
$$ y = [4553481, 4502939, 4435431, 4348195, 4240359, 4113233, 3970351, 3816627, 3656487, 3492684, 3327002, 3161516, 2998655, 2840513, 2688725, 2544690, 2409426, 2283420, 2166948, 2060265, 1963257, 1875347, 1795959, 1724682, 1660903, 1603891, 1553411, 1509551, 1471701, 1438374, 1408352, 1381380, 1357574, 1336916, 1319573, 1305859, 1295554, 1288048, 1283343, 1282007, 1283803, 1287440, 1292157, 1298584, 1307452, 1318414, 1330821, 1344752, 1360549, 1378038, 1396977, 1417670, 1440558, 1465852, 1494102, 1526485, 1564001, 1606898, 1655123, 1708361, 1765032, 1822072, 1876313, 1925506, 1967777, 2001275, 2025231, 2040604, 2049036, 2051992, 2051585, 2051293, 2054792, 2064416, 2081246, 2106058, 2139542, 2182217, 2234723, 2297631, 2370512, 2451842, 2540164, 2634448, 2732855, 2832051, 2928329, 3018433, 3098710, 3164647]
58801C164647M7698K7570O841j4371l5502n5050p1916q5885r6710j03999j08023
58790B675300j09441j08244j04155r7845r0420q2017p2180o1329n0404l9625k9170
58779A830470k0660j6125j5656j7661k1041k5359k9361l1431l1424l0152k7304
58768A564296k1898j4520o826J172J1041K3068L5747M8378O1918P6880R2681J09517
58756A981454J28664J50139J71923J91783K07772K16487K13438J96426J67085
58747C625171J28572Q3643L5596j1375n4033r0909j20569j40964j51444j53696
58737C149992j49671j40192j26428j11085r6950q5479p7418p3213p2014p1821
58727B145721p1492p1262p0630o7493o0358m9992l7921k4643j0180M797J9253
$$ y = [3164647, 3212345, 3239915, 3246756, 3232385, 3196883, 3141833, 3069917, 2984032, 2887322, 2783323, 2675300, 2565859, 2457615, 2353460, 2255615, 2165195, 2083178, 2010998, 1949669, 1899265, 1859640, 1830470, 1809810, 1793685, 1778029, 1760368, 1739327, 1713968, 1684607, 1653176, 1621752, 1591600, 1564296, 1542398, 1527878, 1521052, 1522224, 1533265, 1556333, 1592080, 1640458, 1702376, 1779256, 1871937, 1981454, 2110118, 2260257, 2432180, 2623963, 2831735, 3048222, 3261660, 3458086, 3625171, 3753743, 3837386, 3872982, 3861607, 3807574, 3716665, 3596096, 3455132, 3303688, 3149992, 3000321, 2860129, 2733701, 2622616, 2525666, 2440187, 2362769, 2289556, 2217542, 2145721, 2074229, 2002967, 1932337, 1864844, 1804486, 1754494, 1716573, 1691930, 1681750, 1686547, 1705800]
58716A705800L1960M0737M2889L7203K4667P081j3550l4163n1283o3519p1974
58705A655848p7668q0157p9306p6462p2791o7964o1493n4053m6579l9295l2372
58694I67708k6283k0868j5372r830n040p07M691J1740J9415K6993L4708M1961
58682A029116M7032M9480N0743N1343M9577M4365L7537L1639K6982K2430J7800
58671A458044J3914J1022Q432M977q74j0373k3060l6676m8833n7929o2598o2099
58659A193947n7736n2169m6665m0460l3198k6087k0092j4863j0209o789m578k468
58647H78633j38J424J944K354K681J565j204l858n323o557q217r229q980q617
58633H36478q850q502o730m601l082j384J137L560N265P170R655J1399J1961J3318
$$ y = [1705800, 1737760, 1778497, 1821386, 1858589, 1883256, 1890337, 1876787, 1842624, 1791341, 1727822, 1655848, 1578180, 1498023, 1418717, 1342255, 1269464, 1201500, 1140007, 1085954, 1039375, 1000080, 967708, 941425, 920557, 905185, 895355, 890315, 889608, 894299, 906039, 925454, 952447, 987155, 1029116, 1076148, 1125628, 1176371, 1227714, 1277291, 1321656, 1359193, 1390832, 1417814, 1440244, 1458044, 1471958, 1482980, 1491412, 1496389, 1495515, 1485142, 1462082, 1425406, 1376573, 1318644, 1256046, 1193947, 1136211, 1084042, 1037377, 996917, 963719, 937632, 917540, 902677, 892468, 885679, 881101, 878633, 878495, 879919, 881863, 884217, 886898, 888463, 887259, 883401, 878078, 871521, 863304, 854075, 845095, 836478, 827628, 819126, 812396, 807795, 804713, 803329, 804466, 808026, 813291, 820461, 830116, 841515, 853476, 866794]
58619H66794J6875K1075K3978K6352K9900L4260L8055M1397M5029M8238M9804
58608A241757N0027M9767M8469M5017L9658L3472K6825J9813J3261P927L751R75
58596A580719N89K530M979O761Q765J1684J4333J5843J7676K1654K7648L4947
58584A748128M4106N5579O8401Q2232R8920J19862J43362J66646J88531K07570
58574B923337K18996K16333J95324J54856R6074K3624n3379j24527j82555k23805
58564C244278k46544k51484k42890k26294k05299j81921j58559j37296j18262
58555A475729j00878q5911p4356o5459n7868n1592m6831m2229l6625l1246k7763
58544H54971k5296k1886j7819j4854j3012j0845q283o589n842m820l150j459K37
$$ y = [866794, 883669, 904744, 928722, 955074, 984974, 1019234, 1057289, 1098686, 1143715, 1191953, 1241757, 1291784, 1341551, 1390020, 1435037, 1474695, 1508167, 1534992, 1554805, 1568066, 1575993, 1579744, 1580719, 1581308, 1583838, 1588817, 1595578, 1604343, 1616027, 1630360, 1646203, 1663879, 1685533, 1713181, 1748128, 1792234, 1847813, 1916214, 1998446, 2097366, 2217228, 2360590, 2527236, 2715767, 2923337, 3142333, 3358666, 3553990, 3708846, 3804920, 3828544, 3775165, 3650638, 3468083, 3244278, 2997734, 2746250, 2503360, 2277066, 2071767, 1889846, 1731287, 1593991, 1475729, 1374851, 1288940, 1214584, 1149125, 1091257, 1039665, 992834, 950605, 913980, 882734, 854971, 829675, 807789, 789970, 775116, 762104, 751259, 742976, 736387, 730545, 725725, 722575, 721116, 721353]
58531G21353K346M440O040Q075J1606J5828J9235K2093K5685K9925L3760L7294
58519I37680M1386M5658M8820N0407N0405M7959M2476L5499K9552K5680K3816
58508A379338K4652K9235L7356M8159O1527P7155R3011J06446J15946J20290J17381
58497B210496J06102Q8408O7667M5693K2888j99k3508m8144p4146r8560j17797
58486B178900j30711j37509j37472j30470j19278j07550r6314q4856p3817o4725
58476A096198n7461n0922m5370m1591l8624l4908l0855k7722k4887k0789j5837
58465G07232j1876r472q024p617q367q966q257p241p255p358o099m405l995m236
58451F04064l446k098j639j387K68K609L606L346L332L414K440J096R58J553J418
$$ y = [721353, 723699, 728139, 734179, 742254, 753860, 769688, 788923, 811016, 836701, 866626, 900386, 937680, 979066, 1024724, 1073544, 1123951, 1174356, 1222315, 1264791, 1300290, 1329842, 1355522, 1379338, 1403990, 1433225, 1470581, 1518740, 1580267, 1657422, 1750433, 1856879, 1972825, 2093115, 2210496, 2316598, 2405006, 2472673, 2518366, 2541254, 2541055, 2517547, 2469403, 2395257, 2296697, 2178900, 2048189, 1910680, 1773208, 1642738, 1523460, 1415910, 1319596, 1234740, 1160923, 1096198, 1038737, 987815, 942445, 900854, 862230, 827322, 796467, 768745, 743858, 723069, 707232, 695356, 685884, 677860, 670243, 661876, 652910, 644653, 637412, 630157, 622799, 616700, 612295, 608300, 604064, 600618, 598520, 596881, 595494, 595762, 598371, 601977, 605323, 608655, 612069, 614509, 615605, 616563, 618116, 619534]
58436F19534J052J747K570J830M88O22J447N61j580k192p33O51R45J194J816K213
58420F32165K772M277N787N925N554O222P024O218M811M995O061N620L958L249
58406G04638L314K180L26J93J849L060L432M621O702Q157R253J1704J5285J8431
58392G93145K1763K7280L4437M0561M4288M4816L9115K4804N395j1921k3557l0611
58380A009515l3811l2588k8802k5974k4234k0746j5355j1089q836o379l217j477
58368G97007j374m56J900L628M194N318P036P448O784P300Q834Q979P904Q245
58354H72747R957J0183Q663Q282R687J0400R870J0347J2064J2607J1870J2605
58342I99282J5207J7014J7523J9213K2413K4648K5811K8699L3448L6747L7463
$$ y = [619534, 620586, 622333, 624903, 626733, 627221, 627843, 629290, 629851, 628271, 626079, 625346, 625997, 626942, 628136, 629952, 632165, 634937, 639214, 645001, 650926, 656480, 662702, 669726, 675944, 680755, 685750, 691811, 697431, 701389, 704638, 707952, 710132, 710458, 710651, 712500, 715560, 718992, 723613, 730315, 738472, 747725, 759429, 774714, 793145, 814908, 842188, 876625, 917186, 961474, 1006290, 1045405, 1070209, 1075604, 1063683, 1040126, 1009515, 975704, 943116, 914314, 888340, 864106, 843360, 828005, 816916, 808080, 801701, 798484, 797007, 795633, 795177, 797077, 800705, 804899, 810217, 817253, 824701, 831485, 838785, 847619, 856598, 864502, 872747, 882704, 892887, 901550, 909832, 919519, 929919, 939789, 950136, 962200, 974807, 986677, 999282, 1014489, 1031503, 1049026, 1068239, 1090652, 1115300, 1141111, 1169810, 1203258, 1240005, 1277468]
58331A277468L7639L7103L2853K4923J7228J1339N067j665n519n716n446n825
58319A419449m289m60K421L579O195J1058J4736J5870J7300K0112K1714K1662
58307A549347K3196K6934K9344K9528L1121L5350L8825M0492M4129N1362N8901
58296A958529O5439P4585Q8032J02448J16199J32643J53567J75713J96704K17722
58286C281581K37020K47348K43221K24808J92324J43948Q2774J8880l9102q8360
58276D544442j25928j46692j51091j46972j39678j27261j08956r0101p4376n8987
58266C374400m2105k7503j7259p479M109J3835J9782K6078L4996M2595M6762N1624
58254C519835N9365O5858O9031P3141Q0180Q5617Q7418R0305R6384J00919J02275
$$ y = [1277468, 1315107, 1352210, 1385063, 1409986, 1427214, 1438553, 1443620, 1441955, 1436436, 1430720, 1425274, 1419449, 1415160, 1414700, 1417121, 1420700, 1426895, 1437953, 1452689, 1468559, 1485859, 1505971, 1527685, 1549347, 1572543, 1599477, 1628821, 1658349, 1689470, 1724820, 1763645, 1804137, 1848266, 1899628, 1958529, 2023968, 2098553, 2186585, 2289033, 2405232, 2537875, 2691442, 2867155, 3063859, 3281581, 3518601, 3765949, 4009170, 4233978, 4426302, 4570250, 4653024, 4671904, 4632802, 4544442, 4418514, 4271822, 4120731, 3973759, 3834081, 3706820, 3597864, 3507763, 3433387, 3374400, 3332295, 3304792, 3287533, 3280054, 3284163, 3297998, 3317780, 3343858, 3378854, 3421449, 3468211, 3519835, 3579200, 3645058, 3714089, 3787230, 3867410, 3953027, 4040445, 4130750, 4227134, 4328053, 4430328]
58243D430328J06077J14397J21179J23908J29003J39779J50069J56113J63308
58234E634161J74691J84616J90835K00533K17082K33349K45803K61894K85294
58225G628258L07750L24461L43217L69020L94737M16907M44985M83954N24314
58216A1237603N61008O05132O64290P29319P94026Q69328R63191J066529J174831
58207A8665257J302991J461955J643238J845035K089647K395565K759485L189006
58199C5352179L725662M413257N276375O353860P712552R402640J1460055J4001089
58191I7697669J7252960K1427715K6609932L2740767L9392090M5173319M7446587
58184C27741039M3293011L1490707J3846969n484200k2188404l3678210l9515022
$$ y = [4430328, 4536405, 4650802, 4771981, 4895889, 5024892, 5164671, 5314740, 5470853, 5634161, 5808852, 5993468, 6184303, 6384836, 6601918, 6835267, 7081070, 7342964, 7628258, 7936008, 8260469, 8603686, 8972706, 9367443, 9784350, 10229335, 10713289, 11237603, 11798611, 12403743, 13068033, 13797352, 14591378, 15460706, 16423897, 17490426, 18665257, 19968248, 21430203, 23073441, 24918476, 27008123, 29403688, 32163173, 35352179, 39077841, 43491098, 48767473, 55121333, 62833885, 72236525, 83696580, 97697669, 114950629, 136378344, 162988276, 195729043, 235121133, 280294452, 327741039, 371034050, 402524757, 416371726, 410887526, 388699122, 355020912, 315505890]
58177C15505890m0689635l8708476l4996032l0611972k6194311k2069198j8398529
58170A03837737j5247880j2599650j0390867q563239p068987n849892m843662
58163C9273560m008679l322437k760703k296484j915034j610923j369363j164230
58155B0825707r75444p96032o20084m35483k33376j3948K26021N03339Q35017
58146A9315717J222842J670853K216881K923586L836684M981551O386678P998316
58138E0553108R459396J0023044Q897614N865081J590597k732259o082628q043477
58130F9530476q733360q509658p752904o774912n774900m840307m002101l282906
58122A9859428k691721k209220j808633j479178j214413r96016q07649o51014
$$ y = [315505890, 274816255, 236107779, 201111747, 170499775, 144305464, 122236266, 103837737, 88589857, 75990207, 65599340, 57036101, 49967114, 44117222, 39273560, 35264881, 31942444, 29181741, 26885257, 24970223, 23359300, 21989937, 20825707, 19850263, 19054231, 18434147, 17998664, 17765288, 17751340, 17977361, 18480700, 19315717, 20538559, 22209412, 24426293, 27349879, 31186563, 36168114, 42554792, 50553108, 60012504, 70035548, 78933162, 84798243, 86388840, 83656581, 77573953, 69530476, 60797116, 52287458, 44534554, 37759642, 31984742, 27144435, 23142334, 19859428, 17167707, 14958487, 13149854, 11670676, 10456263, 9460247, 8652598, 8001584]
58114H001584n31848m41768l67960l09027k67379k36397k08281j85470j72611
58105E280843j66059j61871j64871j78797j95758k05768k08898k08390k00261
58096C590170j80415j55169j34589j20990j12217j09614j13821j18704j18238
58087B426413j14331j10705j05081r4819q4149p7894p3484o6660n9582n5928n3415
58076A530365m8598m3922m2652m1817l7487l2292l0537l0338k7689k4024k2744
58065A148265k2337j9818j6998j6759j6832j3963j0519j0538j2613j3028j2480
58054I82380j3505j4545j2875j0297r911j0247q359n684m943m378j108K668K911
58041H92107O92P8J336J922K099L954O725Q241R161J0996J2035J0075P101O575
$$ y = [8001584, 7469736, 7027968, 6660008, 6350981, 6083602, 5847205, 5638924, 5453454, 5280843, 5114784, 4952913, 4788042, 4609245, 4413487, 4207719, 3998821, 3790431, 3590170, 3409755, 3254586, 3119997, 2999007, 2886790, 2777176, 2663355, 2544651, 2426413, 2312082, 2201377, 2096296, 2001477, 1917328, 1839434, 1765950, 1699290, 1639708, 1583780, 1530365, 1481767, 1437845, 1395193, 1353376, 1315889, 1283597, 1253060, 1222722, 1195033, 1171009, 1148265, 1125928, 1106110, 1089112, 1072353, 1055521, 1041558, 1031039, 1020501, 1007888, 994860, 982380, 968875, 954330, 941455, 931158, 921247, 911000, 902641, 896957, 892014, 887636, 886528, 889196, 892107, 892799, 892877, 894213, 896135, 898234, 902188, 908913, 917154, 926315, 937311, 949346, 959421, 966522, 973097]
58027I73097Q187R802J2199J7152K3184K8082L3393M1610N1225N9474O7825P9624
58015A404854R4157J07944J20111J31631J40837J44625J42761J36731J25907J09219
58005B658777Q8866O7784M5119J8630j0093l7281o2063q5163j04257j15597j19163
57994B345559j17729j12062j01506q7938p4385o0551m4156k5704p497J0897L1564
57983A756492N3495P3453R0778J06574J18493J20894J10330Q7346N3589J1602
57973B583046l2816p2403j03229j24880j36881j38819j33290j24522j13999j00936
57963A501271q6457p3342o1877n0027l7727k7133j8569j0034r82P025J3859K1516
57951A177523L0860M0736N0715O1681P3468Q4697R5025J04607J11351J11622J03757
$$ y = [973097, 981284, 991086, 1003285, 1020437, 1043621, 1071703, 1105096, 1146706, 1197931, 1257405, 1325230, 1404854, 1499011, 1606955, 1727066, 1858697, 1999534, 2144159, 2286920, 2423651, 2549558, 2658777, 2747643, 2815427, 2860546, 2879176, 2869083, 2831802, 2769739, 2684576, 2580319, 2464722, 2345559, 2227830, 2115768, 2014262, 1926324, 1851939, 1791388, 1747232, 1721528, 1714031, 1724928, 1756492, 1809987, 1883440, 1974218, 2080792, 2199285, 2320179, 2430509, 2517855, 2571444, 2583046, 2550230, 2477827, 2374598, 2249718, 2112837, 1974018, 1840728, 1716206, 1602207, 1501271, 1414814, 1341472, 1279595, 1229568, 1191841, 1164708, 1146139, 1136105, 1135123, 1142148, 1156007, 1177523, 1208383, 1249119, 1299834, 1361515, 1434983, 1519680, 1614705, 1719312, 1830663, 1942285, 2046042]
57940B046042Q8216O4840L3345l335l9523p1071r6574j14800j24449j26771j25118
57929A530802j21219j14504j05346r5872q7051p7872o8053n8933n1116m3808l6966
57918F70062l1676k7870k4187k0517j8210j7265j5831j3078j0216q003n554k372
57906D75283O04K755M673O545P417O801N483M193K848J412K29p38j764k561k812
57891E10368l140m140n071n030m750n404o348o059m749l840l430k556j499j377
57877D52975j705q14J362L255M365N672P385Q530Q955R506J0130R880Q876Q151
57863E36523P512N656K592j91k095l918n909p314q037q788r563r766r773j0371
57849D76558j0856r768p485n744m720k859K03L037M943O781Q805R942R864R762
$$ y = [2046042, 2134258, 2199098, 2232443, 2229108, 2189585, 2118514, 2021940, 1907140, 1782691, 1655920, 1530802, 1409583, 1295079, 1189733, 1093861, 1006810, 928938, 860885, 801952, 750836, 707028, 670062, 638386, 610516, 586329, 565812, 547602, 530337, 514506, 501428, 491212, 483209, 477655, 475283, 475887, 478642, 483315, 489860, 497277, 504078, 509561, 513754, 516602, 518014, 518243, 517505, 515741, 513180, 510368, 507228, 503088, 498017, 492987, 488237, 482833, 476485, 470426, 465677, 461837, 458407, 455851, 454352, 452975, 451270, 450456, 451818, 455073, 459438, 465110, 472495, 481025, 489980, 499486, 509616, 519496, 528372, 536523, 544035, 549691, 552283, 552092, 549997, 546079, 540170, 532856, 524819, 516031, 506468, 496702, 486929, 476558, 465702, 455934, 448449, 442705, 437985, 435126, 435329, 438366, 443309, 450090, 458895, 468837, 478701, 488463]
57835D88463J0400J1078J1026J0267Q823O683M658L681L245K225R67O49R54O82
57821E63801L98J957N239Q059R641J1624J4950J8342K0737K3056K6518L1170L7035
57808G72527M4852N4783O5907P7667R0161J02337J11430J14643J10036R5855P1396
57797A711594L9278N064k6278n2209p1186q1971q5224q3641p9425p3060o5118
57786A137824n7255n0531m4552l9251l5797l4777l5031l5314l5707l6505l7050
57775F96054l6581l5064l2601k9203k5572k2708k0263j6826j2302q329n802l631
57763D47172o99K624N728Q937J2523J5848J8295J9846K0070J7938J3279P271R67
57750E89799n349j1044j4964j6943j7980j8377j7314j4786j2204j0361q512o232
$$ y = [488463, 498863, 509941, 520967, 531234, 540057, 546740, 551398, 555079, 558324, 560549, 561516, 562165, 563119, 563801, 564199, 566156, 571395, 579454, 589095, 600719, 615669, 634011, 654748, 677804, 704322, 735492, 772527, 817379, 872162, 938069, 1015736, 1105897, 1208234, 1319664, 1434307, 1544343, 1640198, 1711594, 1750872, 1755936, 1729658, 1677449, 1606263, 1524292, 1439068, 1355427, 1276002, 1202942, 1137824, 1080569, 1030038, 985486, 946235, 910438, 875661, 840630, 805316, 769609, 733104, 696054, 659473, 624409, 591808, 562605, 537033, 514325, 494062, 477236, 464934, 456605, 450803, 447172, 446473, 449097, 454825, 463762, 476285, 492133, 510428, 530274, 550344, 568282, 581561, 588832, 589799, 584450, 573406, 558442, 541499, 523519, 505142, 487828, 473042, 460838, 450477, 441965, 435733]
57738D35733m479l858l498k680k048k196k399j900j069l30P92K531M013M500M418
57723D27530M319L993L459L469M173M512L955L573M375N758O661P199P997R000
57709D99973R965J1274J3328J5824J8427K1310K4369K6891K8721L0751L3490L6087
57697G70410L7477L7504L6333L3804L0034K5574K0252J3109M255m334j0802j5208
57685I78408j8530k0950k2094k1970k0699j8000j3791q619k833M043J2563K2727
57673H70255L4505M8295O4524Q3738J07219J36439J71345K09475K45567K69832
57663B241194K67664K26032J44146L7718o8846j54981k10741k36080k37149k22361
57653A786596j98939j71603j43791j18454r6844p8082o1236m6830l5343k5649
$$ y = [435733, 431254, 427396, 423898, 421218, 419170, 416974, 414575, 412675, 411606, 411276, 412068, 414599, 418612, 423112, 427530, 431849, 435842, 439301, 442770, 446943, 451455, 455410, 458983, 463358, 469116, 475777, 482976, 490973, 499973, 509938, 521212, 534540, 550364, 568791, 590101, 614470, 641361, 670082, 700833, 734323, 770410, 807887, 845391, 881724, 915528, 945562, 971136, 991388, 1004497, 1008752, 1004418, 993616, 978408, 959878, 938928, 916834, 894864, 874165, 856165, 842374, 833755, 830922, 834965, 847528, 870255, 904760, 953055, 1017579, 1101317, 1208536, 1344975, 1516320, 1725795, 1971362, 2241194, 2508858, 2734890, 2879036, 2916754, 2847908, 2692927, 2482186, 2246106, 2008957, 1786596, 1587657, 1416054, 1272263, 1153809, 1056965, 978883, 917647, 870817, 835474, 809825]
57643H09825j6370p706n12N419J0785J5423J8873K1487K3599K4399K2962J9690
57631I47874J5437R972K754n324j2506j8088k2604k6451k9505l1772l3279l3603
57619G62905l2430l0323k8078k5744k3100k0563j8716j7337j5775j3942j2215
57608E24682j0698r241p815o390m936l869l716m022l632k533k023k467k378p84
57594D60178J020J521J418K250L666M106L547L531M703O015O489O245N686M953
57580E15328M227L560K358Q6k631m523n200n255n091m628m023l657l423k900k186
57565D82042j753j613j326p62m8R79K459L935M875N590O808Q534J0105J1227J2201
57550E43253J3201J4209J5484J7409J9829K2169K4168K5913K7313K8008K7760
$$ y = [809825, 793455, 785749, 785237, 790656, 801441, 816864, 835737, 857224, 880823, 905222, 928184, 947874, 963311, 973283, 976037, 970713, 958207, 940119, 917515, 891064, 861559, 829787, 796508, 762905, 730475, 700152, 672074, 646330, 623230, 602667, 583951, 566614, 550839, 536897, 524682, 513984, 504743, 496928, 490538, 485602, 481733, 478017, 473995, 470363, 467830, 465807, 463340, 460962, 460178, 461198, 462719, 464137, 466387, 470053, 474159, 477706, 481237, 485940, 491955, 498444, 504689, 510375, 515328, 519555, 523115, 525473, 525559, 522928, 518405, 513205, 507950, 502859, 498231, 494208, 490551, 487128, 484228, 482042, 480289, 478676, 477350, 476588, 476540, 477519, 479978, 483913, 488788, 494378, 501186, 509720, 519825, 531052, 543253, 556454, 570663, 586147, 603556, 623385, 645554, 669722, 695635, 722948, 750956, 778716]
57539G78716K6478K4025K0406J5824J0316L790l226r446j4029j7314j9873k1500
57527G94167k1813k1187k0257j8966j7008j4713j2653j0752q571o142l785j507
57515F36813O86K270K753K395J720Q38r5l83L67J479K128K453K805K680J578M45
57499F60932P66K467M049M727N142N961P033Q147R539J1254J2930J4523J6483
57486G63953J8871K1070K2640K3894K5282K6690K7556K7371K5901K3177J9382
57475A025787J4580Q678J949m722j0497j5223j9094k1940k3405k3605k3067k2136
57463H87305k0843j9180j7133j4703j2172j0129q849p976p063o043m877l313j413
57450G53611K24J242J970K675L026K834K679L097L739M074M302M841N461N757
$$ y = [778716, 805194, 829219, 849625, 865449, 875765, 879555, 876329, 866883, 852854, 835540, 815667, 794167, 772354, 751167, 730910, 711944, 694936, 680223, 667570, 656818, 648247, 642105, 638320, 636813, 637499, 639769, 642522, 644917, 646637, 647475, 647380, 646997, 647364, 648843, 650971, 653424, 656229, 658909, 660487, 660932, 661698, 664165, 668214, 672941, 678083, 684044, 691077, 699224, 708763, 720017, 732947, 747470, 763953, 782824, 803894, 826534, 850428, 875710, 902400, 929956, 957327, 983228, 1006405, 1025787, 1040367, 1049045, 1050994, 1046272, 1035775, 1020552, 1001458, 979518, 956113, 932508, 909441, 887305, 866462, 847282, 830149, 815446, 803274, 793145, 784296, 776320, 769257, 763214, 758337, 755024, 753611, 753835, 755077, 757047, 759722, 762748, 765582, 768261, 771358, 775097, 779171, 783473, 788314, 793775, 799532]
57436G99532N931O280O416N924N311N336N770N861N664N910O691P287P260O914
57422H86087O725O972P825R125J0225J0593J0389J0010R529R055R123R961J0917
57409A006536J1394J1828J2871J4119J4610J4259J3834J3783J4005J4447J4994
57398A156680J5108J4429J3445J2740J2058J1040J0341J0724J1515J1346J0272
57387A289698R775J0623J1999J2935J3405J3691J3769J3691J3815J4310J4980
57376A432691J5736J6545J7052J7008J6925J7483J8372J8679J8375J8407J9177
57365A626450J9941J9982J9547J9322J9675K0677K2208K3825K5038K5774K6115
57354A868554K5773K4461K2651K1194K0309J9703J9559K0334K1677K2548K2599
$$ y = [799532, 805463, 811743, 818159, 824083, 829394, 834730, 840500, 846361, 852025, 857935, 864626, 871913, 879173, 886087, 892812, 899784, 907609, 916734, 926959, 937552, 947941, 957951, 967480, 976535, 985658, 995619, 1006536, 1017930, 1029758, 1042629, 1056748, 1071358, 1085617, 1099451, 1113234, 1127239, 1141686, 1156680, 1171788, 1186217, 1199662, 1212402, 1224460, 1235500, 1245841, 1256565, 1268080, 1279426, 1289698, 1299473, 1310096, 1322095, 1335030, 1348435, 1362126, 1375895, 1389586, 1403401, 1417711, 1432691, 1448427, 1464972, 1482024, 1499032, 1515957, 1533440, 1551812, 1570491, 1588866, 1607273, 1626450, 1646391, 1666373, 1685920, 1705242, 1724917, 1745594, 1767802, 1791627, 1816665, 1842439, 1868554, 1894327, 1918788, 1941439, 1962633, 1982942, 2002645, 2022204, 2042538, 2064215, 2086763, 2109362]
57343B109362K2548K2922K3361K3483K3628K4331K5595K7045K8383K9513L0530
57332B390701L1681L2940L3814L4022L4116L4761L5662L6010L5777L5693L5980
57321B771157L6109L5916L6038L6923L8109L8858L8944L8686L8579L8998L9820
57310C188137M0428M0400M0017L9660L9171L8365L7610L7140L6352L4834L3546
57299C605660L3725L4976L5791L5814L6102L7177L8240L8657L8849L9329M0080
57288D014400M1216M3095M5339M6880M7481M8131M9433N0678N1040N0710N0328
57277D538731N0154N0332N0931N1283N0305M8127M6441M6504M7738M8997N0201
57266E079744N1832N3704N5309N6710N8140N9262N9730N9998O0558O0782N9664
$$ y = [2109362, 2131910, 2154832, 2178193, 2201676, 2225304, 2249635, 2275230, 2302275, 2330658, 2360171, 2390701, 2422382, 2455322, 2489136, 2523158, 2557274, 2592035, 2627697, 2663707, 2699484, 2735177, 2771157, 2807266, 2843182, 2879220, 2916143, 2954252, 2993110, 3032054, 3070740, 3109319, 3148317, 3188137, 3228565, 3268965, 3308982, 3348642, 3387813, 3426178, 3463788, 3500928, 3537280, 3572114, 3605660, 3639385, 3674361, 3710152, 3745966, 3782068, 3819245, 3857485, 3896142, 3934991, 3974320, 4014400, 4055616, 4098711, 4144050, 4190930, 4238411, 4286542, 4335975, 4386653, 4437693, 4488403, 4538731, 4588885, 4639217, 4690148, 4741431, 4791736, 4839863, 4886304, 4932808, 4980546, 5029543, 5079744, 5131576, 5185280, 5240589, 5297299, 5355439, 5414701, 5474431, 5534429, 5594987, 5655769, 5715433]
57255E715433N7399N5240N3797N2427N0473M8262M6566M5635M5148M4773M4446
57244F259599M4174M3898M3694M4014M5382M7622M9763N1091N2056N3580N5644
57233F790517N7392N8541N9715O1133O1967O1603O0663O0087N9786N9033N7731
57222G448168N6412N5143N3274N0407M6991M3772M1026L8510L5989L3618L1869
57211G935179L1017L0689L0100K8872K7499K6828K7176K8094K8876K9101K8742
57200H252173K7990K7147K6607K6709K7352K7922K7878K7376K6991K6835K6472
57189H551452K5728K4986K4397K3547K2408K1812K2211K2564K1508J9163J6737
57178H796513J4531J1672P922M448K281R91m06j908k628j957M9L186P160J0865
$$ y = [5715433, 5772832, 5828072, 5881869, 5934296, 5984769, 6033031, 6079597, 6125232, 6170380, 6215153, 6259599, 6303773, 6347671, 6391365, 6435379, 6480761, 6528383, 6578146, 6629237, 6681293, 6734873, 6790517, 6847909, 6906450, 6966165, 7027298, 7089265, 7150868, 7211531, 7271618, 7331404, 7390437, 7448168, 7504580, 7559723, 7612997, 7663404, 7710395, 7754167, 7795193, 7833703, 7869692, 7903310, 7935179, 7966196, 7996885, 8026985, 8055857, 8083356, 8110184, 8137360, 8165454, 8194330, 8223431, 8252173, 8280163, 8307310, 8333917, 8360626, 8387978, 8415900, 8443778, 8471154, 8498145, 8524980, 8551452, 8577180, 8602166, 8626563, 8650110, 8672518, 8694330, 8716541, 8739105, 8760613, 8779776, 8796513, 8811044, 8822716, 8830638, 8835086, 8837367, 8838358, 8837952, 8836044, 8833416, 8831459, 8831508, 8834694, 8841854, 8852719]
57164H852719J2143Q970J524o857j1447r623k889M599R327J0234Q030L696k344
57151H878082j0153j9675l0153m0311m9313n7172o3952o9052p1740p1961p0067
57140H324533o6197o0651n4510m9067m4886m1984m0692m1662m5201n1160n9151
57129G769372o8279p7059q4190q8972r0532q7543p9789o9275n8670m9169m0941
57118F974953l4804l1718l0960l0458k8841k5694k0075j0715K058J6342L1091
57107F811179M6989O4639Q3925J06129J34650J71772K16338K67913L33996M30276
57097H667806N70772P57715R83753J244868J548418J905891K319889K781665L278588
57088B4059365L796363M311886M790817N196677N498369N667185N677738N523675
$$ y = [8852719, 8864862, 8873832, 8875356, 8868499, 8857052, 8847429, 8844540, 8849139, 8858466, 8868700, 8876730, 8880426, 8878082, 8867929, 8848254, 8818101, 8777790, 8728477, 8671305, 8607353, 8538301, 8466561, 8394600, 8324533, 8258336, 8197685, 8143175, 8094108, 8049222, 8007238, 7966546, 7924884, 7879683, 7828523, 7769372, 7701093, 7624034, 7539844, 7450872, 7360340, 7272797, 7193008, 7123733, 7065063, 7015894, 6974953, 6940149, 6908431, 6877471, 6847013, 6818172, 6792478, 6772403, 6761688, 6763746, 6780088, 6811179, 6858168, 6922807, 7006732, 7112861, 7247511, 7419283, 7635621, 7903534, 8237530, 8667806, 9238578, 9996293, 10980046, 12224914, 13773332, 15679223, 17999112, 20780777, 24059365, 27855728, 32167614, 36958431, 42155108, 47653477, 53320662, 58998400, 64522075]
57080F4522075N226712M813144M276829L577435K684199J618057M49426p35408
57072H6432469j860790k870072l729341m428540m970563n354617n573019n623362
57064E2022165n517808n279709m937109m521409m066048l600875l147926k722902
57056A8228379k337195j996503j700342j445624j229636j048859q97641p70347
57048F802232o63531n74667n00294m37026l83104l37592k99028k65911k37474
57039C103605k12963j91164j71508j54455j40025j27085j14873j03951r4777q6593
57029A706211p8745p1833o6430o1745n6796n1927m7988m4827m1779l8902l6543
57018A108696l4317l1674k8987k7050k5873k4892k3863k2686k0862j8133j5220
$$ y = [64522075, 69748787, 74561931, 78838760, 82416195, 85100394, 86718451, 87167877, 86432469, 84571679, 81701607, 77972266, 73543726, 68573163, 63218546, 57645527, 52022165, 46504357, 41224648, 36287539, 31766130, 27700082, 24099207, 20951281, 18228379, 15891184, 13894681, 12194339, 10748715, 9519079, 8470220, 7572579, 6802232, 6138701, 5564034, 5063740, 4626714, 4243610, 3906018, 3606990, 3341079, 3103605, 2890642, 2699478, 2527970, 2373515, 2233490, 2106405, 1991532, 1887581, 1792804, 1706211, 1627466, 1555633, 1489203, 1427458, 1370662, 1318735, 1270747, 1225920, 1184141, 1145239, 1108696, 1074379, 1042705, 1013718, 986668, 960795, 935903, 912040, 889354, 868492, 850359, 835139]
57007H35139j2929j0918q257m846j246K502O784J1337J5361J8755K2308K6704
56995I00694L2138L8965M7834N9137P3041R0015J10650J35310J65209K03733K55326
56984B112052L22823M06701N04989O07942O88544P02499O08851M00776J19146
56975F474323j66455l94550n36849n97431n96518n56391m95781m28562l63166
56966B338620l03286k50121k04096j64973j31668j02856p7560n5029l4692j6768
56956I97571k768N139N489j425j3371k6807l8110m4896m6729m4789m0765l5719
56944G12820k9769k2857j5708r628n318k303K12K472M491O742R846J3872J8483
56931F83355K3405K7949L0112K7101J7295J579j7001l4534m7635n4687n6341n4469
$$ y = [835139, 822210, 811292, 803035, 798189, 796943, 799445, 806229, 817566, 832927, 851682, 873990, 900694, 932832, 971797, 1019631, 1078768, 1151809, 1241824, 1352474, 1487784, 1652993, 1856726, 2112052, 2434875, 2841576, 3346565, 3954507, 4643051, 5345550, 5954401, 6355177, 6474323, 6307868, 5913318, 5376469, 4779038, 4182520, 3626129, 3130348, 2701786, 2338620, 2035334, 1785213, 1581117, 1416144, 1284476, 1181620, 1104060, 1049031, 1014339, 997571, 994803, 999942, 1005431, 1004006, 990635, 963828, 925718, 880822, 834093, 789304, 748539, 712820, 683051, 660194, 644486, 634858, 629540, 627237, 627449, 629921, 634412, 641154, 651000, 664872, 683355, 706760, 734709, 764821, 791922, 809217, 810796, 793795, 759261, 711626, 656939, 600598, 546129]
56919E46129n0551m5276l9383l3892k9276k5123k1022j7276j4334j2017r816p622
56907B40541n807m678m225m131l900l179k156j435j325j471j267m07J015K658
56893B10233M101N198O366Q224J0881J3998J7498K1520K5345K7167K5409K0037
56881C95977J2207L295n274j1908j5589j6678j6344j5233j3277j0545p503m297
56869B94831o18L490P341J0556J3785J8096K3970L1266L9707M8713N6738O1161
56857F09036N9162M9046L1452R738j1156k7156l6867m1097m1019l7323l0914k3441
56845E09461j6495j0528m921J091P892J5552K3938L2798M2065N2194O3943P7456
56833G94446R1104J00807J00810Q6450N7648K0059j7656m8374o9015p9908q2813
$$ y = [546129, 495578, 450302, 410919, 377027, 347751, 322628, 301606, 284330, 269996, 257979, 248163, 240541, 234734, 230056, 225831, 221700, 217800, 214621, 212465, 211030, 209705, 208234, 206967, 206560, 207575, 210233, 214334, 219532, 225898, 234122, 245003, 259001, 276499, 298019, 323364, 350531, 375940, 395977, 408184, 411479, 406205, 394297, 378708, 362030, 345686, 330453, 317176, 306631, 299128, 294831, 294213, 297703, 305044, 315600, 329385, 347481, 371451, 402717, 442424, 491137, 547875, 609036, 668198, 717244, 748696, 758434, 747278, 720122, 683255, 642158, 601139, 563816, 532902, 509461, 492966, 482438, 477517, 478608, 486500, 502052, 525990, 558788, 600853, 653047, 716990, 794446, 885550, 986357, 1087167, 1173617, 1231265, 1251324, 1233668, 1185294, 1116279, 1036371, 953558]
56822I53558p9720p2529o3026n2799m3018l4060k5509j6882q292n2Q229J7541
56810E83441K8419M0561N3436O6334P7139Q1706P5609N7199K9308j776k9214m8602
56798A013560n9203o2777o1412n6576m9716m2537l6032k9899k3517j7127j1396
56787E63368o241r46M733J0286J5414K0530K5911L0607L2316K8416J7552J040
56775G42986j7224l2805m3238m8668n0466m9623m6554m1706l5889l0073k5048
56764C21692k1139j8090j5376j2740j0392q624p387o351n275m240l554l459l896
56751B01169m443m572m056l188k551k450k585k372j651p97l9J047K885M959O117
56736A87473N991N528N761O625P500Q445J0152J2716J5285J7207J8956K1488K4913
$$ y = [953558, 873838, 801309, 738283, 685484, 642466, 608406, 582897, 566015, 557723, 557671, 565900, 583441, 611860, 652421, 705857, 772191, 849330, 931036, 1006645, 1063844, 1093152, 1091376, 1062162, 1013560, 954357, 891580, 830168, 773592, 723876, 681339, 645307, 615408, 591891, 574764, 563368, 557127, 556181, 560914, 571200, 586614, 607144, 633055, 663662, 695978, 724394, 741946, 742986, 725762, 692957, 649719, 601051, 550585, 500962, 454408, 412702, 376813, 346740, 321692, 300553, 282463, 267087, 254347, 243955, 235331, 227944, 221593, 216318, 212078, 208524, 205065, 201169, 196726, 192154, 188098, 184910, 182359, 179909, 177324, 174952, 173301, 172504, 172465, 173512, 176397, 181356, 187473, 193464, 198992, 204753, 211378, 218878, 227323, 237475, 250191, 265476, 282683, 301639, 323127, 348040]
56723C48040K8274L0572L1655L1954L1641L0355K7720K3764J8842J3426Q237M252
56711F28732K098J448J364J320J506K078K609K629K386K577L481M670N646O383
56697F68927P113P756P820O874N005K669J53k625n849r518j3538j7695k1431k3925
56683F11736k4801k4494k3577k1995j9442j6262j3328j1057r156p346n770m563
56671D29945l657l202l582m670n595n592m739l551k248p56R99L133N792Q603J0546
56656D21426J0823R769Q442P409O363M907L331K397K544L466M407M762M339L141
56642D97526J238j091l388n459p533r619j1045j1085r870q129o227l998j423J265
56628D21162M012O791R043J0070J0058R931J0072R907Q973P578O179M885L817
$$ y = [348040, 376314, 406886, 438541, 470495, 502136, 532491, 560211, 583975, 602817, 616243, 624480, 628732, 630830, 632278, 633642, 634962, 636468, 638546, 641155, 643784, 646170, 648747, 652228, 656898, 662544, 668927, 676040, 683796, 691616, 698490, 703495, 706164, 706317, 703692, 697843, 688325, 674787, 657092, 635661, 611736, 586935, 562441, 538864, 516869, 497427, 481165, 467837, 456780, 447624, 440278, 434508, 429945, 426288, 423086, 419504, 414834, 409239, 403647, 398908, 395357, 393109, 392353, 393352, 396485, 402277, 410880, 421426, 432249, 442018, 450460, 457869, 464232, 469139, 472470, 474867, 477411, 480877, 485284, 490046, 494385, 497526, 498764, 497673, 494285, 488826, 481293, 471674, 460629, 449544, 439674, 431545, 425318, 421320, 419897, 421162, 425174, 431965, 441008, 451078, 461136, 471067, 481139, 491046, 500019, 507597, 513776, 518661, 522478]
56615E22478L172K557J156r85k612k779j919r30M5J223K302K795K764K412J463
56600E33142l13k353l833m698n361n710n177l822k563k196k565k835k422j676
56586D87618j576k598l969m626m834o017q717j1731j3745j4864j5776j6288j5776
56573C67101j4508j3277j2049j0018p026l974j684lJ790M123O700Q690R434R261
56559C44560R257R986J0775J0711R813Q689P516O102M596L337K242R81l39j370
56545D26856k252l489n157o829q229r480j0737j1972j3036j3615j3269j1952j0276
56532C06563q901p906p063o344n676m670l215k026j910k604k957k233p46N59Q26
56517B51697k46k106l642m134l814l267k748k390k536l256l951m024l690l541
$$ y = [522478, 525650, 528207, 529363, 528378, 525766, 522987, 521068, 520138, 520183, 521406, 523708, 526503, 529267, 531679, 533142, 532829, 530476, 526643, 521945, 516584, 510874, 505697, 501875, 499312, 497116, 494551, 491716, 489294, 487618, 486042, 483444, 479475, 474849, 470015, 463998, 455281, 443550, 429805, 414941, 399165, 382877, 367101, 352593, 339316, 327267, 317249, 310223, 306249, 304565, 304562, 306352, 310475, 317175, 325865, 335299, 344560, 353817, 363803, 374578, 385289, 395102, 403791, 411307, 417409, 422005, 425342, 427584, 428565, 428226, 426856, 424604, 421115, 415958, 409129, 400900, 391420, 380683, 368711, 355675, 342060, 328791, 316839, 306563, 297662, 289756, 282693, 276349, 270673, 266003, 262788, 260762, 258852, 256248, 253291, 251058, 250312, 250871, 251697, 251451, 249345, 245703, 241569, 237755, 234488, 231740, 229350, 226814, 223558, 219607, 215583, 211893, 208352]
56503B08352l702l930m245m730m989m490l365k314j812j779j902j848j445r34
56489A66867p73q96o07L98J500K049K265K634L011L049K995L275L704L836L819
56474A97126M046M288L876K683J252J30m74o31p45j377k581l737m401m796n092
56459A89567m870l862k622j794j326r96r48j128r17j97J39m06q37r4J213J808
56443A72730J744K046K828L237L007K679K422J899J260J105J455J800K120K836
56429B03168L827M517M860N266N656N547M996M519M175L605K915K549K396J866
56415B59862P83n39j844k888l221k884k778l390l798l051j917j805k553k835k492
56400B24650k692l798m766m888m590m241l552k629k205k453k598k197j735j636
$$ y = [208352, 204650, 200720, 196475, 191745, 186756, 182266, 178901, 176587, 174775, 172996, 171094, 169246, 167801, 166867, 166094, 165198, 164591, 164989, 166489, 168538, 170803, 173437, 176448, 179497, 182492, 185767, 189471, 193307, 197126, 201172, 205460, 209336, 212019, 213271, 213401, 212927, 212296, 211551, 210174, 207593, 203856, 199455, 194659, 189567, 184697, 180835, 178213, 176419, 175093, 174097, 173149, 172021, 171104, 170907, 171046, 170640, 169803, 169709, 170922, 172730, 174474, 176520, 179348, 182585, 185592, 188271, 190693, 192592, 193852, 194957, 196412, 198212, 200332, 203168, 206995, 211512, 216372, 221638, 227294, 232841, 237837, 242356, 246531, 250136, 253051, 255600, 257996, 259862, 260645, 260106, 258262, 255374, 252153, 249269, 246491, 243101, 239303, 236252, 234335, 232530, 229977, 227142, 224650, 221958, 218160, 213394, 208506, 203916, 199675, 196123, 193494, 191289, 188836, 186238, 184041, 182306, 180670]
56386A80670j624j459j398j591j777j824j813j582r65m43o41j243j337p98l15
56371A61860j24K31Q76J392J668J925K026J721J434J673J871J155J01J31J172
56356A79112J631R30L62Q65J589J450P95N03N40L78P5O1L69O91Q10O18J85k4L98
56337A91338J086J217O74R6j36k24k01K40J065J809K238K428K268J717J340J700
56321B08655K353K485K236K310K507K017J075Q87J758K645K866K957L452M025
56307B42228M235M195M088L829L513L410L452L466L760M625N435N326M541M015
56293C00118L838L430K975L244M032M303L941L935M618N116M808M097L479L013
56279C54947K830L056L224K886K671L511M978N820N990O614P984R227J0028J1041
$$ y = [180670, 179046, 177587, 176189, 174598, 172821, 170997, 169184, 167602, 166637, 166194, 165553, 164310, 162973, 162175, 161860, 161736, 161967, 162843, 164235, 165903, 167828, 169854, 171575, 173009, 174682, 176553, 177708, 177809, 177940, 179112, 180743, 181673, 182035, 182900, 184489, 185939, 186734, 187237, 187777, 188155, 188230, 188291, 188660, 189351, 190161, 190779, 190964, 190940, 191338, 192424, 193641, 194315, 194411, 194275, 194051, 193850, 194090, 195155, 196964, 199202, 201630, 203898, 205615, 206955, 208655, 211008, 213493, 215729, 218039, 220546, 222563, 223638, 224525, 226283, 228928, 231794, 234751, 238203, 242228, 246463, 250658, 254746, 258575, 262088, 265498, 268950, 272416, 276176, 280801, 286236, 291562, 296103, 300118, 303956, 307386, 310361, 313605, 317637, 321940, 325881, 329816, 334434, 339550, 344358, 348455, 351934, 354947, 357777, 360833, 364057, 366943, 369614, 373125, 378103, 383923, 389913, 396527, 404511, 413738, 423766, 434807]
56265D34807J2496J3866J5120J6838J8931K0697K2100K3552K4564K4287K3267
56254F50525K2916K3259K3103K2317K1964K2026K1191J9229J7423J6197J4371
56243H74521J1388Q323N958L656P98k325n587r349j3240j6304j8678k1426k4400
56230G93335k6236k6685k7047k7752k7642k6145k4172k2250j9885j7233j5448
56219E32840j4659j3617j1864j0305r167p629n897n325n927o083n379n058n042
56206D26888l399J11K759K745J734J932K941L331L165L149L060K754L107M475
56192D58752N756O239O658P331P155N768M729N134N842N492M521L816L203K605
56178E33001K905M248N186M883M406M661M862M308L926M617N746O502P146P823
$$ y = [434807, 447303, 461169, 476289, 493127, 512058, 532755, 554855, 578407, 602971, 627258, 650525, 673441, 696700, 719803, 742120, 764084, 786110, 807301, 826530, 843953, 860150, 874521, 885909, 894232, 900190, 903846, 904644, 902319, 896732, 887383, 874143, 857839, 839161, 817735, 793335, 767099, 740414, 713367, 685615, 657973, 631828, 607656, 585406, 565521, 548288, 532840, 518181, 504564, 492700, 482395, 473228, 465599, 459702, 454377, 448450, 442367, 436988, 431930, 426888, 423489, 423600, 426359, 429104, 430838, 432770, 435711, 439042, 442207, 445356, 448416, 451170, 454277, 458752, 464508, 470747, 477405, 484736, 491891, 497659, 502388, 507522, 513364, 518856, 523377, 527193, 530396, 533001, 535906, 540154, 545340, 550223, 554629, 559290, 564152, 568460, 572386, 577003, 582749, 589251, 596397, 604220]
56164F04220P900P542Q099R860J1361J1823J2315J3509J4508J4936J5888J7739
56152G49700J9357K0616K3252K7873L2681L6522M0792M6953N4623O3677P5642
56141A191688R1472J10250J31653J57090J86644K17162K44706K66224K77628K73847
56131C148364K53600K22147J87468J55762J31481J17720J13248J11324J04161
56122D545275Q7712O1753K8836n063l2316m9306n8963o6765p7034r3917j21248
56111D218964j58144j97516k31554k56331k69768k69558k56280k35112k11127
56102B133574j85398j58145j32175j10067r1089p4099o0467n1055m3442l5372
56092A192265k8080k3141j9154j4676j1288j0330r739p449m924l926k982n26J660
$$ y = [604220, 612120, 619662, 627761, 637621, 648982, 660805, 673120, 686629, 701137, 716073, 731961, 749700, 769057, 789673, 812925, 840798, 873479, 910001, 950793, 997746, 1052369, 1116046, 1191688, 1283160, 1393410, 1525063, 1682153, 1868797, 2085959, 2330665, 2596889, 2874517, 3148364, 3401964, 3624111, 3811579, 3967341, 4098822, 4216542, 4329790, 4441114, 4545275, 4632987, 4694740, 4723576, 4718513, 4686197, 4636891, 4577928, 4511163, 4434129, 4340212, 4218964, 4060820, 3863304, 3631750, 3375419, 3105651, 2836093, 2579813, 2344701, 2133574, 1948176, 1790031, 1657856, 1547789, 1456700, 1382601, 1322134, 1271079, 1227637, 1192265, 1164185, 1141044, 1121890, 1107214, 1095926, 1085596, 1075857, 1068408, 1063484, 1059558, 1056576, 1056050, 1057710]
56079A057710J736J447K879M701N156N582P375Q768Q331Q247J0309J2215J1804
56066A146260J1312J3237J5629J5823J5284J6226J7037J5776J4661J6246J8564
56055A316055J8874J8722K0443K2166K1392J9954K0444K1213K0098J9325K1428
56044A540114K4033K4124K3590K4971K5887K3796K2230K5898L3306M0508M8066
56033A856523N7574O5277O6556O3508O1227N9894N7290N5257N6380N7911N6295
56022B513692N4190N5763N8910N9692O0319O4742P0425P2890P4445P9807Q6921
56011C251796R0976R3681R9511J06422J09495J10191J12821J15713J15167J14133
56001D319906J17437J22535J24795J27391J35746J46905J54996J62295J74000
$$ y = [1057710, 1059446, 1060893, 1063772, 1068473, 1073629, 1079211, 1086586, 1095354, 1103685, 1111932, 1122241, 1134456, 1146260, 1157572, 1170809, 1186438, 1202261, 1217545, 1233771, 1250808, 1266584, 1281245, 1297491, 1316055, 1334929, 1353651, 1374094, 1396260, 1417652, 1437606, 1458050, 1479263, 1499361, 1518686, 1540114, 1564147, 1588271, 1611861, 1636832, 1662719, 1686515, 1708745, 1734643, 1767949, 1808457, 1856523, 1914097, 1979374, 2045930, 2109438, 2170665, 2230559, 2287849, 2343106, 2399486, 2457397, 2513692, 2567882, 2623645, 2682555, 2742247, 2802566, 2867308, 2937733, 3010623, 3085068, 3164875, 3251796, 3342772, 3436453, 3535964, 3642386, 3751881, 3862072, 3974893, 4090606, 4205773, 4319906, 4437343, 4559878, 4684673, 4812064, 4947810, 5094715, 5249711, 5412006, 5586006]
55992E586006J87300J97123K07241K23547K42139K56611K70985K92098L15710
55983G778760L34498L53106L80025M11450M39287M68088N06860N51487N93249
55974A1816810O37173O92808P55090Q14807Q79397R61615J057262J157855J274931
55965B0047748J425777J606380J807235K044165K342409K704260L128600L649493
55957C8756067M318297N165380O221898P555720R236032J1299994J3832147J7047494
55949A13433029K1203496K6447337L2789868L9985187M6961068N1233500M9453290
55942C81506775L9399790K1936139J008709j8447883l2896545m1165358m3929961
55935C07411666m2717600l9156929l4559026k9757059k5184310k1059445j7489857
$$ y = [5586006, 5773306, 5970429, 6177670, 6401217, 6643356, 6899967, 7170952, 7463050, 7778760, 8113258, 8466364, 8846389, 9257839, 9697126, 10165214, 10672074, 11223561, 11816810, 12453983, 13146791, 13901881, 14716688, 15596085, 16557700, 17614962, 18772817, 20047748, 21473525, 23079905, 24887140, 26931305, 29273714, 31977974, 35106574, 38756067, 43074364, 48239744, 54461642, 62017362, 71253394, 82553388, 96385535, 113433029, 134636525, 161083862, 193873730, 233858917, 280819985, 332053485, 381506775, 420906565, 442842704, 443851413, 425403530, 392506985, 351341627, 307411666, 264694066, 225537137, 190978111, 161221052, 136036742, 114977297, 97487440]
55928I7487440j4480561j1966996r884399q186009o811366n687543m765299m019854
55920C1685413l418379k919153k500172k157823j878504j638566j429661j257650
55912A4485505j117588r93568q81570p89453p15379o47451n83575n31477m89754
55903G735690m48025m05316l70340l43881l17741k90656k69176k53155k35611
55894D801789k16600k02564j92528j79055j62366j49933j42371j33042j21182
55885C302148j12488j06869r8201q6420p7925p3659o7998n9513n2042m5228l4703
55874B487102k1785j2840r128p013p484j5265k8690m0461m8426n6159o3337o5440
55862B111074o3070o1865o2757o1375n7251n4671n4068n1451m6569m3010m0152
$$ y = [97487440, 83006879, 71039883, 61155484, 52969475, 46158109, 40470566, 35705267, 31685413, 28267034, 25347881, 22847709, 20689886, 18811382, 17172816, 15743155, 14485505, 13367917, 12374349, 11492779, 10703326, 9987947, 9340496, 8756921, 8225444, 7735690, 7287665, 6882349, 6512009, 6168128, 5850387, 5559731, 5290555, 5037400, 4801789, 4585189, 4382625, 4190097, 4011042, 3848676, 3698743, 3556372, 3423330, 3302148, 3189660, 3082791, 2984590, 2898170, 2820245, 2746586, 2678588, 2619075, 2567033, 2521805, 2487102, 2465317, 2452477, 2443349, 2436336, 2428852, 2413587, 2384897, 2344436, 2296010, 2239851, 2176514, 2111074, 2048004, 1986139, 1923382, 1862007, 1804756, 1750085, 1696017, 1644566, 1597997, 1554987, 1514835]
55851A514835l3869k5584k1748k3591k5804k6024k7045k8821k6879k0225j2876
55840A242369o104L260J5310K5050K9235K8498K2046P722j1258k6772l4808l7954
55828A256594l8281l4683k8260k3197k0612j7745j4535j4533j8092k1080k1814
55817A003762k2923k4924k4397k0293j5929j2937r065l627P69L757Q613J6289
55805H99095K3623K9346L6391M6233N6282O4819P3209Q1156Q4735Q1348P2132
55794A548369N7901L7808J3810q715k7111m3764o0262p3941q2351q6667q8349
55783A186728q6594q1348p4974o8834o1737n3531m6448m1268l5991k9912k5277
55772E80814k3214k1780j9591j7745j6693j4908j2138j0343r998r164p409o803
$$ y = [1514835, 1480966, 1455382, 1433634, 1410043, 1384239, 1358215, 1331170, 1302349, 1275470, 1255245, 1242369, 1236265, 1239525, 1254835, 1279885, 1309120, 1337618, 1359664, 1367386, 1356128, 1329356, 1294548, 1256594, 1218313, 1183630, 1155370, 1132173, 1111561, 1093816, 1079281, 1064748, 1046656, 1025576, 1003762, 980839, 955915, 931518, 911225, 895296, 882359, 873294, 869667, 870436, 874193, 882806, 899095, 922718, 952064, 988455, 1034688, 1090970, 1155789, 1228998, 1310154, 1394889, 1476237, 1548369, 1606270, 1644078, 1657888, 1649173, 1622062, 1578298, 1518036, 1444095, 1361744, 1275077, 1186728, 1100134, 1018786, 943812, 874978, 813241, 759710, 713262, 671994, 636003, 606091, 580814, 557600, 535820, 516229, 498484, 481791, 466883, 454745, 444402, 434404, 425240, 417831, 411028]
55760D11028p630p212m649k740l330m536m475m235n083o109o533p311q681r019
55746C29485p728o430o058n634m887m915n376m432k378j748k851k953j056M67
55732B73506L12L27J543K146J230P92J881K470J267K65J226K841L592M371O053
55717C03822P421P606P931R281J0253R767Q868Q248O732L850J241j81j734m016
55703C79089n303m614l599l761m353m588n080n605m369j105J887L359M883P533
55689C54374R891J1077J2636J5591J8677K1350K5497L2171L9675M6890N5323O5679
55677G08831P5538Q2793Q8390R3129R4623R0228Q0346O6327M7856K5400K795j5733
55665A440523k9321l8759m3223m1552l5018k6136j6044n221M964J3652K1658K9116
$$ y = [411028, 403398, 396186, 391537, 388797, 385467, 380931, 376456, 372221, 367138, 361029, 354496, 347185, 338504, 329485, 321757, 315327, 309269, 303635, 298748, 293833, 288457, 284025, 281647, 279899, 277048, 274095, 273039, 273506, 273818, 274145, 275688, 277834, 279064, 279856, 281737, 284207, 285474, 285739, 286965, 289806, 293398, 297769, 303822, 311243, 318849, 326780, 336061, 346314, 356081, 364949, 373197, 379929, 383779, 385020, 384839, 383105, 379089, 373786, 369172, 365573, 361812, 357459, 352871, 347791, 342186, 337817, 336712, 338599, 341958, 346841, 354374, 364265, 375342, 387978, 403569, 422246, 443596, 469093, 501264, 540939, 587829, 643152, 708831, 784369, 867162, 955552, 1048681, 1143304, 1233532, 1313878, 1380205, 1428061, 1453461, 1456256, 1440523, 1411202, 1372443, 1329220, 1287668, 1252650, 1226514, 1210470, 1205249, 1210213, 1223865, 1245523, 1274639]
55653A274639L3645L2869K6885J6405P65j9658m1139n9305p2764q2034q6799q6769
55641I36740q3531p8960p3022o5282n7121n0216m4263l8318l2981k9117k5850
55630C58079k2008j8271j5854j4367j2908j1860j1673j1275r672p742o579n615
55618B10255m243l600m589n706n171l770l317l660l499k962k940k949j951m91
55604A61407J47P9K31M24M9k95K83J188J216N13Kk99p90j045n57P0J25M9M03O71
55584A63871M18L57R87J371P49K2J94O65N05J29K63N55O42J160K322L039K830
55567A80079K940M050M743L883K652K322K007O63n24j32Q27P06J54P27J898K147
55551B09142J894K775M777O488P586Q822J0251J1503J3150J5889J9128K2194K5896
$$ y = [1274639, 1308284, 1341153, 1368038, 1384443, 1385208, 1365550, 1324411, 1265106, 1192342, 1110308, 1023509, 936740, 853209, 774249, 701227, 635945, 578824, 528608, 484345, 446027, 413046, 383929, 358079, 336071, 317800, 301946, 287579, 274671, 262811, 251138, 239863, 230191, 222449, 215870, 210255, 206012, 202412, 197823, 192117, 186946, 183176, 179859, 176199, 172700, 169738, 166798, 163849, 161898, 161407, 161554, 161633, 161864, 162288, 162337, 162042, 162325, 163513, 164729, 165242, 165244, 164945, 164155, 163110, 162553, 162623, 162748, 162797, 163200, 163871, 164289, 164646, 165633, 167004, 167753, 167775, 167969, 168634, 169139, 169268, 169531, 170086, 170728, 171888, 174210, 177249, 180079, 183019, 187069, 191812, 195695, 198347, 200669, 202676, 203339, 202815, 202683, 203510, 204216, 204370, 205097, 206995, 209142, 211036, 213811, 218588, 225076, 232662, 241484, 251735, 263238, 276388, 292277, 311405, 333599, 359495]
55538C59495L1103L6866M1955M7077N3444O0104O4991O7635O8601O7054O1099
55527I59424N0082L4604J5213o896k8657m6830o0429o9823p4599p4383p0764o6034
55515E60908o0668n4096m7105m1150l6064l0791k5735k2183j9911j7619j5239
55504A90347j3662j2622j0979q777o988n708m475l814m462n539n494m395l467
55491I9965k951k318j877k199k594k126j436j612k062j642r82j439k528k738k184
55476F9277k079k268j746r89j186j768j288k81m84j640j847q63l06n92n37L2q
55459E1427n35j31J108J386K64o37m72k93p31r22m67k95q21j199r26m59J63J361
55441D7821K426J985M19k68N32J278J050Q43J417J870J352M41p8k99l91j36K17
$$ y = [359495, 390598, 427464, 469419, 516496, 569940, 630044, 695035, 762670, 831271, 898325, 959424, 1009506, 1044110, 1059323, 1052427, 1023770, 976940, 916511, 846688, 772089, 697706, 626942, 560908, 500240, 446144, 399039, 357889, 321825, 291034, 265299, 243116, 223205, 205586, 190347, 176685, 164063, 153084, 144307, 137319, 131611, 127136, 123322, 118860, 113321, 107827, 103432, 99965, 97014, 94696, 92819, 90620, 88026, 85900, 84464, 82852, 80790, 79148, 78166, 76727, 74199, 71461, 69277, 67198, 64930, 63184, 62195, 61009, 59241, 57953, 57672, 57188, 55548, 53701, 52838, 52532, 51940, 51403, 51435, 51427, 50892, 50761, 51869, 53255, 53519, 52882, 52410, 52117, 51386, 50464, 49997, 49702, 48881, 47682, 46756, 46297, 46460, 47821, 50247, 52232, 52651, 52383, 52915, 54193, 55243, 56086, 57503, 59373, 60725, 61166, 61088, 60789, 60398, 60262, 60479]
55424F0479N7l12N2R68J281Q81P95J066O14m51n79O29J588J332R13J285J676J199
55406G3473M64M05P52P14J49p38j797k513k239j366j095j721k305k360k444k786
55390E4593k724k027j397j157q24l48m32j138j566j341j068r29k85Q79J529J173
55374D2938N39J77k41p92q56l22R0J77O07J503K034J863J582J339M75r61j826
55357D8326j632j284j458j669j474j290j340j132o04n03j032j378j099p29m69
55342C1233K40J339J835J462J226J538J397K71p36o41j28k36o22l84L47P72P06
55325C9619M97K63n5k94l51l53k07L46J024J135O29J65k1l53q40q65l16J34J61
55306D0318J66L17K81P1N1l9p89j735j677n54L73N14N80R39Q84J18n75o52n62
$$ y = [60479, 60536, 60224, 60276, 61244, 62525, 63406, 64201, 65267, 65881, 65430, 64851, 65480, 67068, 68400, 69313, 70598, 72274, 73473, 73937, 74342, 75094, 75808, 75957, 75219, 73422, 70909, 68670, 67304, 66209, 64488, 62183, 59823, 57379, 54593, 51869, 49842, 48445, 47288, 46464, 46116, 45684, 44546, 42980, 41639, 40571, 39642, 39357, 40236, 41765, 42938, 43477, 43654, 43413, 42621, 41765, 41443, 41533, 41710, 42317, 43820, 45854, 47717, 49299, 50638, 51113, 50152, 48326, 46694, 45410, 43952, 42283, 40809, 39519, 38179, 37047, 36443, 35940, 34908, 33530, 32431, 31702, 31233, 31473, 32812, 34647, 36109, 37335, 38873, 40270, 40541, 39805, 39164, 39036, 38800, 38178, 37794, 38141, 38913, 39619, 40116, 40379, 40324, 40030, 39679, 39326, 39119, 39465, 40489, 41624, 42253, 42418, 42397, 42044, 41204, 40339, 40023, 40157, 40318, 40484, 40801, 41082, 41153, 41204, 41165, 40376, 38641, 36964, 36410, 36783, 37297, 37877, 38816, 39700, 39818, 39243, 38591, 38029]
55287C8029o16m90k20l76q30q42n40p72j258p59N40R20J5l69P00J606Q74m76q76
55268C4260o56q53j136p61l60q37j432p89P37J537J089L76K19M80P62Q65O77K69
55250C4447n2k13l68k80M82J433J353J07q96o79%J24l9K25O88P11L37l8m02p84
55230C6156q88p11p37r76p56N8O28N26M38R51J702K265K692K677J614Q8l28N08
55212D5907P43o40k145k160j291q18m26P03J829J640M61l30m54o97j229j489j348
55195C8256j110p51k35n5m38o98l38p6o52j444j442p79j87L36J001J206M18n97
55177C2415p41k42q7l81n60o80j166j652j323j97R51J600J596Q80j10l93K35O42
55159C0787N6o27l02N28P41M94P22J403J817J886J906J519M49m04o7Q22R43L93
$$ y = [38029, 37413, 36923, 36703, 36327, 35497, 34655, 34115, 33343, 32085, 31326, 31866, 32786, 32801, 32432, 33132, 34738, 35612, 35136, 34260, 33604, 32751, 31615, 30854, 30494, 29657, 28225, 27436, 28173, 29710, 30799, 31175, 31394, 31874, 32636, 33501, 34178, 34447, 34395, 34182, 33814, 33534, 34016, 35449, 36802, 36909, 36013, 35334, 35334, 35458, 35419, 35644, 36332, 37043, 37380, 37342, 36940, 36156, 35268, 34557, 33820, 32844, 32088, 32146, 32774, 33300, 33738, 34689, 36391, 38656, 41348, 44025, 45639, 45727, 45399, 45907, 46650, 46010, 43865, 41705, 40414, 39596, 39170, 39873, 41702, 43342, 43803, 43473, 43019, 42322, 41093, 39604, 38256, 37146, 36395, 36160, 36105, 35667, 34969, 34631, 34555, 33903, 32459, 31017, 30238, 30051, 30387, 31388, 32594, 33012, 32415, 31674, 31432, 31345, 30964, 30404, 29724, 28558, 26906, 25583, 25386, 26337, 27937, 29533, 30413, 30303, 29910, 30145, 30787, 30843, 30216, 29914, 30442, 31183, 31677, 32399, 33802, 35619, 37505, 39411, 40930, 41379, 40975, 40908, 41730, 42673, 43066]
55141D3066L14Q59J152J036J222J818K201K273K567L121L500L663L711L087J353
55126G4943n75j418j430j851k708k856k095j535j657j703j268j014j257j296p13
55111E1567k20n50j356j796j532p65P6M60J99j60K7N07N02j1k72M9M82O60P26
55092D8593P45N12J43Q8M33P81R08R73J012Q80O12L36p3o78j039p40j24J16p5
55073E3403k28j28J84Q17J671J987J220R5j46N67J180J142R40J028J122Q50L82
55056F6086J10K53Q34J712K647L527M312M626M049L093L029M022M481L177J070
55041A07028j30m11r50j851k078j456r72j052j041o73o71j494k594l294l493l257
55025H1611k652k174k393k991l058k501k157k336k284j434k87M32P02Q62R99J073
$$ y = [43066, 43380, 44239, 45391, 46427, 47649, 49467, 51668, 53941, 56508, 59629, 63129, 66792, 70503, 73590, 74943, 74368, 72950, 71520, 69669, 66961, 64105, 62010, 60475, 58818, 57115, 55847, 54833, 53576, 52280, 51567, 51347, 50797, 49441, 47645, 46113, 45348, 45424, 45884, 46083, 45923, 45950, 46457, 46959, 46948, 46676, 46725, 47207, 47867, 48593, 49338, 49850, 49993, 50081, 50514, 51295, 52203, 53176, 54188, 55068, 55680, 56016, 55943, 55265, 54226, 53486, 53362, 53478, 53403, 53175, 53047, 53231, 54048, 55719, 57706, 58926, 59021, 58875, 59442, 60622, 61764, 62704, 63732, 64854, 65704, 66086, 66196, 66449, 67283, 68995, 71642, 75169, 79481, 84107, 88156, 91249, 94278, 98300, 102781, 105958, 107028, 106898, 106487, 105537, 103686, 101608, 100152, 99180, 98128, 97087, 96414, 95743, 94249, 91655, 88361, 84868, 81611, 78959, 76785, 74392, 71401, 68343, 65842, 63685, 61349, 59065, 57631, 57344, 57776, 58478, 59340, 60339, 61412]
55009F1412J139J101P21J13j57K58J054J626J608J106N78M57O51P01N49P13J369
54992G4999J922J928J822K096K522K828L438M622N685O127O902R191J2438J4994
54978A51514J6429J7800J9860K2348K4921K7327K8603K7457K3742J8412J1960
54967C90373M196m185j1245j5653j7980j9565k0912k1673k1535k0608j9240j7739
54955B04234j6014j3660j0725q122o676o056n377m426l543k643j396q5P61J385
54941A27657K442L799M758N307O189P756R836J2493J5937J9696K2847K4912K5603
54928B89232K4163K0162J4517Q462J874n833j3556j9063k1675k2676k2974k2176
54916B30457k0253j8216j6549j4596j2125r989q569p066n035l214k122j252m07
$$ y = [61412, 62551, 63652, 64373, 64486, 64329, 64587, 65641, 67267, 68875, 69981, 70559, 71016, 71667, 72368, 72917, 73630, 74999, 76921, 78849, 80671, 82767, 85289, 88117, 91555, 96177, 101862, 107989, 114891, 124082, 136520, 151514, 167943, 185743, 205603, 227951, 252872, 280199, 308802, 336259, 360001, 378413, 390373, 394569, 390384, 379139, 363486, 345506, 325941, 305029, 283356, 261821, 241213, 221973, 204234, 188220, 174560, 163835, 155713, 149037, 142981, 137604, 133178, 129635, 126992, 125596, 125511, 126272, 127657, 130099, 133898, 138656, 143963, 150152, 157908, 167744, 180237, 196174, 215870, 238717, 263629, 289232, 313395, 333557, 348074, 356536, 358410, 352577, 339021, 319958, 298283, 275607, 252633, 230457, 210204, 191988, 175439, 160843, 148718, 138729, 130160, 123094, 118059, 114845, 112723, 111471, 111064]
54903A11064m25j587k640k494j792j714k237k652k881l101k898j953j012j102
54889H2576k080k906l022k691k252j770j269q54o71r37j626k084j649p55o32j534
54873E5844k180j477l5P35L83l60o76l35M22J110J302R77M24j84p41q79k95N84
54855E4619J045J137J490K067K050J173J66l66o16q06o85k24P2L5K48J095K082
54838F4582K528K351J881J493J656K637L981M928N469O210P230Q040Q737J0101
54824A31824J2288J4598J6727J9135K1808K3879K4879K5107K4346K1486J6092
54813C52169R158J770n789j2913j8101k0516k0985k0632j9516j7579j5667j4433
54801A96966j3240j1355r300p891o741n072l300k453k426k129j079K38J386K356
$$ y = [111064, 110639, 109052, 106412, 103918, 102126, 100412, 98175, 95523, 92642, 89541, 86643, 84690, 83678, 82576, 80496, 77590, 74568, 71877, 69625, 67855, 66586, 65732, 65061, 64124, 62498, 60414, 58765, 58010, 57378, 55844, 53664, 52187, 52152, 52887, 53270, 52910, 52234, 51899, 52321, 53431, 54733, 55710, 56134, 55950, 55209, 54330, 54035, 54619, 55664, 56801, 58291, 60358, 62408, 63581, 63747, 63381, 62765, 61959, 61274, 61050, 61122, 61157, 61405, 62500, 64582, 67110, 69461, 71342, 72835, 74491, 77128, 81109, 86037, 91506, 97716, 104946, 112986, 121723, 131824, 144112, 158710, 175437, 194572, 216380, 240259, 265138, 290245, 314591, 336077, 352169, 361327, 363097, 357308, 344395, 326294, 305778, 284793, 264161, 244645, 227066, 211399, 196966, 183726, 172371, 163071, 155180, 148439, 143367, 140067, 137614, 135188, 133059, 131980, 132218, 133604, 135960]
54787A35960L133L806M965P127R940J2530J4560J6387J8481K1185K4655K8471
54775C01200L1647L3443L3765L2445K8848K2778J5102O814j820j0520j8192k3829
54763D51681k7695l0596l2453l2486l0589k7625k4468k1515j8997j7021j5322
54752A72914j3486j1459r527p955o826o030n227m231l428l319l614l512k939k568
54738H8793k504k054j118n67o79n10M51J244J039N64Q17J394J405J082J131J231
54722I1719P12O6K88J082J253O81N18J354K488L102L048K414J326L27Q1N43J028
54705A12030J167J107R41O03K91K85M21K87r0l39l61l17k48j97l81p45p25j00
54687A13629M14J33m42k92O82J737K507L261M069M545M437L896L241K947L558
$$ y = [135960, 139093, 142899, 147864, 154991, 164931, 177461, 192021, 208408, 226889, 248074, 272729, 301200, 332847, 366290, 400055, 432500, 461348, 484126, 499228, 506042, 504222, 493702, 475510, 451681, 423986, 393390, 360937, 328451, 297862, 270237, 245769, 224254, 205257, 188236, 172914, 159428, 147969, 138442, 130487, 123661, 117631, 112404, 108173, 104745, 101426, 97812, 94300, 91361, 88793, 86289, 84235, 83117, 82550, 81871, 81361, 81812, 83056, 84095, 84659, 85476, 86870, 88275, 89357, 90488, 91719, 92431, 92497, 92785, 93867, 95120, 95801, 96319, 97673, 100161, 103263, 106311, 108725, 110051, 110378, 110459, 111002, 112030, 113197, 114304, 115245, 115848, 116139, 116424, 116845, 117132, 117042, 116703, 116342, 116025, 115777, 115580, 115199, 114454, 113729, 113629, 114043, 114176, 113734, 113442, 114124, 115861, 118368, 121629, 125698, 130243, 134680, 138576, 141817, 144764, 148322]
54672A48322N049O593P496Q087R094J0617J2310J4109J6071J7941J9649K1770
54660B97108K4711K7806K9898L0388K8961K4920J7885Q788p15r594j7370k3347
54648D39439k6975k8676k9287k8910k7296k4943k2726k0643j8099j5204j2731
54637A83949j0914r367p993o972o014m821l973m190m817m370k653j093p74j290
54623A14708j725j671j106k67K10n5l46L34J681K455K324K032J765R32j27M6J758
54606A22948L285L181K231J966K402K499K099J955K289K515K310J951J665J325
54592A54621Q74L59l29j169j578r15M82J342P97o67j843k133j974k055k423k584
54576A40805k237j651j251j182j329j519j491j027l25M0j41l18J40J138K076K620
$$ y = [148322, 153371, 159964, 167460, 175547, 184641, 195258, 207568, 221677, 237748, 255689, 275338, 297108, 321819, 349625, 379523, 409911, 438872, 463792, 481677, 490465, 489750, 480156, 462786, 439439, 412464, 383788, 354501, 325591, 298295, 273352, 250626, 229983, 211884, 196680, 183949, 173035, 163668, 155675, 148703, 142689, 137868, 133895, 129705, 124888, 120518, 117865, 116772, 115998, 114708, 112983, 111312, 110206, 109939, 110149, 110094, 109748, 110082, 111763, 114218, 116542, 118574, 120339, 121271, 121144, 121190, 122948, 126233, 129414, 131645, 133611, 136013, 138512, 140611, 142566, 144855, 147370, 149680, 151631, 153296, 154621, 155495, 155854, 155525, 154356, 152778, 151863, 152345, 153687, 154484, 153817, 151974, 149841, 147867, 145812, 143389, 140805, 138568, 136917, 135666, 134484, 133155, 131636, 130145, 129118, 128793, 128833, 128692, 128374, 128514, 129652, 131728, 134348]
54560A34348K910L222L803M751N753O315O537P209Q731J0470J1706J2667J3975
54547B32397J5563J6888J7611J7300J5055J0511M913P1l604o962j0281j2771j3966
54534B82725j4356j4364j3720j2257j0566r366q757q333p587o218m555l532l608
54521A65506l935l403k298j812k083j991j074k95m37r07q38m74n35r64j032l88
54505A43040P13J790K365K108J260N86N46Q00P96N46M48O21P57N11j46q52j118
54488A54771q80o73r83j538j670j233o45j43L78Q15P80J87o10j341j922k113j696
54471A41484j098j171k066k927k896k047j109o82q58j341j729j893j979j990j660
54456A16038j017n81n27k43O06J211P38k42n98l96m97p70l12N80M13j104k341
$$ y = [134348, 137258, 140480, 144283, 149034, 154787, 161102, 167639, 174848, 183579, 194049, 205755, 218422, 232397, 247960, 264848, 282459, 299759, 314814, 325325, 330238, 330309, 326705, 319743, 309462, 296691, 282725, 268369, 254005, 240285, 228028, 217462, 208096, 199339, 191006, 183419, 177201, 172646, 169114, 165506, 161571, 158168, 155870, 154058, 151975, 149984, 148910, 148615, 148178, 147271, 146433, 145959, 145424, 144460, 143428, 143040, 143753, 145543, 147908, 150016, 151276, 151862, 152408, 153208, 154004, 154550, 154998, 155619, 156376, 156887, 156741, 155889, 154771, 153891, 153218, 152235, 150697, 149027, 147794, 147149, 147006, 147384, 148199, 148979, 149166, 148556, 147215, 145293, 143180, 141484, 140386, 139215, 137149, 134222, 131326, 129279, 128170, 127488, 126630, 125289, 123560, 121667, 119688, 117698, 116038, 115021, 114440, 113913, 113670, 114276, 115487, 116225, 115983, 115385, 114989, 114492, 113722, 113410, 113990, 114403, 113299, 110958]
54439A10958k079j130p83r86j035r72j090r37l1R55R77J81l42j92n4m74j073j218
54421A00675q69n33n73p90o72j17K51j51r25j000jJ283J921J794J310P15M5o14
54403A01749j153j500j499j148q35r61j259j088m32P6J98L99R57J499J712J789
54387I8504J867J715J338J191J441J671J693J854K224K213J611J164J450J876
54373A21812J583P93L68M68M99J83j53k95m36p10r89j268j739k452l118l419l266
54356A07861k782k161j566j133r62j120j502j844j988k044k102k033j805j680
54342H3139j761j655j067m55m17p64q70p19q18j168j192p18j79J61M00M05o6o83
54324G1573p56k64J87L69M82L47l70j150j020j41L17L2p2M23P36M20J84M87O85
$$ y = [110958, 108879, 107749, 106966, 105980, 104945, 103973, 102883, 101946, 101915, 102870, 103847, 104028, 103686, 103494, 103440, 102966, 101893, 100675, 99806, 99273, 98700, 97910, 97238, 97121, 97372, 97221, 96296, 95296, 95295, 96578, 98499, 100293, 101603, 102318, 102363, 101749, 100596, 99096, 97597, 96449, 95614, 94653, 93394, 92306, 91874, 91950, 92148, 92547, 93504, 95003, 96715, 98504, 100371, 102086, 103424, 104615, 106056, 107727, 109420, 111274, 113498, 115711, 117322, 118486, 119936, 121812, 123395, 124188, 124556, 125024, 125523, 125706, 125553, 125258, 124822, 124112, 123123, 121855, 120116, 117664, 114546, 111127, 107861, 105079, 102918, 101352, 100219, 99257, 98137, 96635, 94791, 92803, 90759, 88657, 86624, 84819, 83139, 81378, 79723, 78656, 78201, 77784, 77020, 76150, 75431, 74613, 73445, 72253, 71535, 71356, 71517, 71917, 72322, 72256, 71573, 70817, 70553, 70740, 71109, 71591, 71938, 71568, 70418, 69398, 69257, 69574, 69606, 69534, 69957, 70693, 71113, 71297, 71784, 72469]
54305G2469K92j66l59r21k012k559j932j167j219j258k52R35P18o04j271o76J12
54288F0130K50K8k13n93j005r94n82k46k7M85J244J636J358P04Nn53o90m04l41
54269F0192r84j640j231M0P90L28n84j047j116j168j039l92N36J049P67j21j102
54252E3278j732j789j318m76N19J281J407Q20j13r45j409j308n83L81J011J238
54236E0262J458J627J150j2r33r38n37n15p52p47o35q21j060q85n63p32j240j295
54218D2832o93m8J85K16M04Q23J383J871J906J308M33k11n34o39m71p1J52o8l61
54199D8417l47l35p55j280j213n07L17R94J559J770J311M34k43n28o54o82n41
54182D7717m74p57j105r76l62K48N57N88L57l2j87J20N42P47R49J365J586J249
$$ y = [72469, 72761, 72595, 72236, 71315, 69303, 66744, 64812, 63645, 62426, 61168, 60916, 61851, 62569, 61965, 60694, 60018, 60130, 60380, 60408, 60195, 59602, 58597, 57603, 57021, 56775, 56748, 57233, 58477, 60113, 61471, 62175, 62180, 61627, 60937, 60533, 60192, 59208, 57568, 56337, 56377, 57167, 57495, 56911, 55864, 54748, 53580, 52541, 52149, 52685, 53734, 54501, 54380, 53278, 51546, 49757, 48439, 47963, 48482, 49763, 51170, 51990, 51877, 50932, 49523, 48215, 47632, 48013, 49024, 50262, 51720, 53347, 54497, 54485, 53552, 52614, 52077, 51562, 50810, 50063, 49428, 48607, 47547, 46662, 46099, 45367, 44127, 42832, 42139, 42091, 42276, 42492, 42896, 43719, 45102, 46973, 48879, 50187, 50620, 50409, 49875, 49236, 48765, 48694, 48846, 48778, 48417, 48070, 47735, 46980, 45700, 44487, 43980, 44297, 45291, 46850, 48620, 49931, 50365, 50122, 49594, 48940, 48258, 47717, 47243, 46486, 45381, 44405, 44043, 44291, 44848, 45436, 45793, 45761, 45574, 45694, 46236, 46983, 47932, 49297, 50883, 52132]
54164E2132Q16Q56R83N34j70l05N6J92J22M90J132J061N3r97j474j707j882j505
54146E0387m07O64J021Q27M93O1l25j48O64J273Q40m04j492j752j200k91M17O52
54128E1280O83Q70R88M64o03j373j402j216j411j750j605q81n6M54O00N53M78
54111D6073L97K26K4J32P27J394J485R15K24o4J75P90J370J262J87j170j757j334
54093E1056o22k29m8J78L27J54k78o75p41l65K05M24O0l96l47J08M09L81K36L2
54073D9869k71m00j65j7m31q54l25Q62J280M15n06k41Q00J328R12K81J94O73J151
54054E4555J105O53N87J403K393K298R34m77q12j94O25J245J555J384Q20M14N10
54037F8998P22N99L93O39J226J556J443J364J752K466L056L301L359L481L627
$$ y = [52132, 52948, 53804, 54787, 55321, 55151, 54846, 54902, 55094, 55216, 55706, 56838, 57899, 57952, 56955, 55481, 53774, 51892, 50387, 49980, 50644, 51665, 52492, 52985, 53046, 52721, 52573, 53237, 54510, 55350, 54946, 53454, 51702, 50502, 50211, 50628, 51280, 51963, 52833, 53821, 54285, 53682, 52309, 50907, 49691, 48280, 46530, 44925, 44044, 43988, 44442, 45042, 45595, 46073, 46470, 46696, 46720, 46852, 47579, 48973, 50458, 51373, 51597, 51533, 51708, 52498, 53868, 55130, 55317, 54147, 52390, 51056, 50434, 50205, 50157, 50335, 50662, 50816, 50538, 49863, 49122, 48757, 48962, 49386, 49446, 49050, 48703, 48811, 49220, 49601, 49837, 49869, 49598, 49198, 49033, 49016, 48585, 47731, 47406, 48268, 49548, 49963, 49457, 49216, 50016, 51344, 52256, 52537, 52731, 53404, 54555, 55660, 56313, 56900, 58303, 60696, 62994, 63928, 63451, 62639, 62445, 63070, 64315, 65870, 67254, 68074, 68488, 68998, 69720, 70319, 70712, 71351, 72577, 74133, 75576, 76940, 78692, 81158, 84214, 87515, 90874, 94355, 97982]
54022I7982L484K949K426K456L056L752M152M219M028L643L258L041K801K228
54008A43475J460J036J113J175O63l61j370j909j861j470j172j240j484j520j296
53993A35239j157j360j831k335k706k896k955k928k632j840q03k68n96j214j379
53978A08339j155j108j444j915k284k346j823r18n24j208k295k749k528k192j659
53963H2191n05P99J240Q33N39N77J85p83j392j203j004j401j810j572r84n29n2
53946G5129N12N65q1m23M06J676K022J372Q79J183J803K134K158K016J665J266
53930I4282J299J978K779K853J968R06P50J676K711K921K515K282K298K027J562
53915A24807J717K664L475L462L192L546M487N300N565N332M818M413M622N454
$$ y = [97982, 101466, 104415, 106841, 109297, 112353, 116105, 120257, 124476, 128504, 132147, 135405, 138446, 141247, 143475, 144935, 145971, 147084, 148259, 148922, 148561, 147191, 145282, 143421, 141951, 140779, 139539, 138055, 136535, 135239, 134082, 132722, 130891, 128556, 125850, 122954, 119999, 117071, 114439, 112599, 111796, 111528, 110932, 109718, 108339, 107184, 106076, 104632, 102717, 100433, 98087, 96264, 95346, 94822, 93614, 91319, 88570, 86042, 83850, 82191, 81686, 82485, 83725, 84558, 85097, 85674, 85859, 85076, 83684, 82481, 81477, 80076, 78266, 76694, 75710, 75181, 75129, 75641, 76206, 76125, 75702, 76108, 77784, 79806, 81178, 82057, 83240, 85043, 87177, 89335, 91351, 93016, 94282, 95581, 97559, 100338, 103191, 105159, 106065, 106815, 108491, 111202, 114123, 116638, 118920, 121218, 123245, 124807, 126524, 129188, 132663, 136125, 139317, 142863, 147350, 152650, 158215, 163547, 168365, 172778, 177400, 182854]
53901A82854O284O684O884P077O851N917M881M512M552L970K350M37o62n29L18
53886B42380R30Q01K75pj9l18j150k193l241m471n715o286n937n403n406n685
53870A98555n540m882m183l773l703l963m311m249l659l114l087l252l077k727
53856A45035k689k853k691k189j905k103k377k283j896j642j743j999k019j734
53842A14912j612k078k772k824j943q14j27K48P73J378J591J251O16n1o31r98
53826A06919r95o33j86j30q19j975k618k041p38J39K41K74P65J362J562J377R33
53809A03437J43q11j328j146p17m11K3P58J262R98K34l36l68J21J061K152K882
53792A07954L114L247L435L331K929K944L701M348L915K706J838J797K133K291
$$ y = [182854, 189138, 195822, 202706, 209783, 216634, 222551, 227432, 231944, 236496, 240466, 242816, 243253, 242591, 242062, 242380, 243310, 244111, 244386, 244379, 244360, 244042, 242892, 240699, 237458, 232987, 227272, 220986, 215049, 209646, 204240, 198555, 193015, 188133, 183950, 180177, 176474, 172511, 168200, 163951, 160292, 157178, 154091, 150839, 147762, 145035, 142346, 139493, 136802, 134613, 132708, 130605, 128228, 125945, 124049, 122407, 120664, 118665, 116646, 114912, 113300, 111222, 108450, 105626, 103683, 102869, 102742, 102990, 103763, 105141, 106732, 107983, 108599, 108548, 107917, 106919, 105924, 105291, 105105, 104975, 104156, 102181, 99563, 97522, 96784, 96923, 97164, 97438, 98203, 99565, 101127, 102504, 103437, 103580, 102769, 101441, 100295, 99578, 99167, 99190, 99948, 101210, 102208, 102442, 102106, 101738, 101859, 102920, 105072, 107954, 111068, 114315, 117750, 121081, 124010, 126954, 130655, 135003, 138918, 141624, 143462, 145259, 147392, 149683]
53778A49683K082J520Q10L06J37N0r4o8J65J85k40p63j083j429k000k507k701
53761A44053k718k512j730o94n76j840l287l567k819j937r73M50J700J521j77
53746A24894k056k877k493j446m47j69p74j538j587r35l32l42j035k123k912k535
53730A01293j024L81N91j16q74j472j930j694n46L46k26j493j618m19M17m6p83
53713I0787p10l38o97j702k384k156j209n0Q39J188J024N07k39q42o51L86J274
53696H5027J178P10J008J907K273J936J818K012J385l83j810j587m00K34J07J74
53680I5589Q07J375J387J130J053J120J058R16J094J776K485K487J776J273J711
53665A17037K615K999K726K481K538K469K050J598J263Q14L48M44J208J929K063
$$ y = [149683, 151765, 153285, 154095, 154401, 154538, 154588, 154494, 154426, 154591, 154776, 154536, 153773, 152690, 151261, 149261, 146754, 144053, 141335, 138823, 137093, 136399, 135823, 133983, 130696, 127129, 124310, 122373, 121400, 121850, 123550, 125071, 124894, 122838, 119961, 117468, 116022, 115575, 115406, 114632, 113094, 111507, 110572, 110240, 109898, 108863, 106740, 103828, 101293, 100269, 100650, 101241, 101125, 100251, 98779, 96849, 95155, 94609, 94955, 94729, 93236, 91618, 91199, 91616, 91570, 90787, 90077, 89739, 89042, 87340, 84956, 82800, 81591, 81541, 82380, 83568, 84592, 85099, 84860, 84018, 83367, 83753, 85027, 86205, 86915, 87923, 89830, 92103, 94039, 95857, 97869, 99254, 98871, 97061, 95474, 95074, 95308, 95415, 95589, 96396, 97771, 99158, 100288, 101341, 102461, 103519, 104435, 105529, 107305, 109790, 112277, 114053, 115326, 117037, 119652, 122651, 125377, 127858, 130396, 132865, 134915, 136513, 137776, 138590, 138938, 139382, 140590, 142519, 144582]
53650A44582J909J927K020J949J899K074K147J724R95N09M82P28J004J113Q72
53635A65934K87l61q17j076j145q54k04L66L76r4m76m21k39n06j293j932j786
53618A55759j057n03l63j11N11R27N57k81r25j283j580j602j036k61P4P5L35Q23
53600A50059Q91M14K1J04L89O39R63J306J392J315J495J880J943J598J384J514
53584A67307J594J484J605K056K269J962J729K135K900L469L785L989L873L304
53570B03461K704K545K659K605K370K254K297K264K126K059K111K138J972J546
53556B35111R95P25J049J555J305n2j630k188j468l35K91K85R7Jk23q68j753k333
53538B30564k305j896j481j248j378k047k973l369k792j715q60l58m6o4m44n75
$$ y = [144582, 146491, 148418, 150438, 152387, 154286, 156360, 158507, 160231, 161226, 161735, 162217, 162945, 163949, 165062, 165934, 166221, 165860, 165043, 163967, 162822, 161968, 161764, 162130, 162506, 162412, 161936, 161515, 161276, 160770, 159477, 157545, 155759, 154702, 154199, 153836, 153725, 154236, 155163, 155720, 155439, 154514, 153231, 151651, 150049, 149013, 148752, 148826, 148901, 149236, 150059, 150950, 151364, 151385, 151489, 151878, 152517, 153480, 154786, 156178, 157493, 158988, 160868, 162811, 164409, 165793, 167307, 168901, 170385, 171990, 174046, 176315, 178277, 180006, 182141, 185041, 188510, 192295, 196284, 200157, 203461, 206165, 208710, 211369, 213974, 216344, 218598, 220895, 223159, 225285, 227344, 229455, 231593, 233565, 235111, 236106, 236831, 237880, 239435, 240740, 240688, 239058, 236870, 235402, 235067, 235358, 235643, 235740, 235741, 235518, 234650, 232897, 230564, 228259, 226363, 224882, 223634, 222256, 220209, 217236, 213867, 211075, 209360, 208500, 208142, 208096, 208032, 207588, 207013]
53522B07013P0J000J331J172J345J918K064J505J029J280J906K243K163J935J806
53507B29780J983K491L009L228L403L864M260M033L498L539M289N114N889P087
53493B85467Q487R093Q696Q381Q911R728J0181J0727J2060J3825J5041J5329J5089
53480D31015J4963J5598J7379J9856K1921K2922K3151K2983K2287K1085K0039
53469F53199J9722J9926K0260K0828K1913K3556K5775K8654L1810L4429L6135
53458I36207L7135L7261L5840L2897K9641K7023K4628K1672J8271J5067J2280
53447A227922R993Q751R065J0697J3047J5738J8367K0280K1155K1251K0636J8912
53435A415814J6255J3842J2445J1309R205N918J957k353o612r944j1912j3316
$$ y = [207013, 207083, 208083, 209414, 210586, 211931, 213849, 215913, 217418, 218447, 219727, 221633, 223876, 226039, 227974, 229780, 231763, 234254, 237263, 240491, 243894, 247758, 252018, 256051, 259549, 263088, 267377, 272491, 278380, 285467, 293954, 303047, 311743, 320124, 329035, 338763, 348944, 359671, 371731, 385556, 400597, 415926, 431015, 445978, 461576, 478955, 498811, 520732, 543654, 566805, 589788, 612075, 633160, 653199, 672921, 692847, 713107, 733935, 755848, 779404, 805179, 833833, 865643, 900072, 936207, 973342, 1010603, 1046443, 1079340, 1108981, 1136004, 1160632, 1182304, 1200575, 1215642, 1227922, 1237915, 1246666, 1255731, 1266428, 1279475, 1295213, 1313580, 1333860, 1355015, 1376266, 1396902, 1415814, 1432069, 1445911, 1458356, 1469665, 1478870, 1484788, 1486745, 1484392, 1477780, 1467836, 1455924, 1442608]
53423A442608j5138j7298j9344k1665k4798k8049l0081l0547l0068k8989k7365
53412A169266k5949k5866k7250k9138l0677l1608l1744l1051l0094k9442k8667
53401H47780k6926k4384k1988j9850j7086j3404r768p072n114l191r35J811N153
53388G05026Q760J1921J4366J6513J8642K0424K1505K2108K2684K3392K4174K5048
53376I34563K6028K7060K8120K9257L0515L1977L3792L5948L8273M0845M4047
53365A300425M7791N1159N3412N4934N6517N8042N8871N9194O0012O1666O3453
53354A925476O4832O6011O6962O6720O4351O0122N5303N1077M7976M6003M4944
53343B559777M4700M5440M7268M9794N2370N4724N6884N8486N8651N6605N1910
$$ y = [1442608, 1427470, 1410172, 1390828, 1369163, 1344365, 1316316, 1286235, 1255688, 1225620, 1196631, 1169266, 1143317, 1117451, 1090201, 1061063, 1030386, 998778, 967034, 935983, 905889, 876447, 847780, 820854, 796470, 774482, 754632, 737546, 724142, 714374, 707302, 702188, 698997, 698062, 699873, 705026, 713786, 725707, 740073, 756586, 775228, 795652, 817157, 839265, 861949, 885341, 909515, 934563, 960591, 987651, 1015771, 1045028, 1075543, 1107520, 1141312, 1177260, 1215533, 1256378, 1300425, 1348216, 1399375, 1452787, 1507721, 1564238, 1622280, 1681151, 1740345, 1800357, 1862023, 1925476, 1990308, 2056319, 2123281, 2190001, 2254352, 2314474, 2369777, 2420854, 2468830, 2514833, 2559777, 2604477, 2649917, 2697185, 2746979, 2799349, 2854073, 2910957, 2969443, 3028094, 3084699, 3136609]
53332C136609M3984L2035J6034k528k1139l7539n0593o0289o7141p1630p4207
53321B843596p5668p7071p8862q0460q1115q0933q0565q0212p9640p9008p8882
53310A971180p9266p9374p8629p7304p5944p4601p2925p0657o7814o4633o1413
53299A168620n8142n4252m9197m3232l7293l1992k7245k2888j9121j6104j3594
53288G95560j1307r317p779o541n274l784k066k17J527K858L692M254M821N508
53274G71935O350P361Q410R302J0080J1062J2433J3986J5387J6535J7560J8518
53262I18919J9253J9576J9538J9539K0108K1533K3693K6189K8532L0220L0867
53251A177967L0455K9428K8522K8430K9436L1189L3044L4823L6968L9488M1135
$$ y = [3136609, 3180593, 3212628, 3228662, 3226134, 3204995, 3167456, 3116863, 3056574, 2989433, 2917803, 2843596, 2767928, 2690857, 2611995, 2531535, 2450420, 2369487, 2288922, 2208710, 2129070, 2050062, 1971180, 1891914, 1812540, 1733911, 1656607, 1580663, 1506062, 1433137, 1362480, 1294666, 1230033, 1168620, 1110478, 1056226, 1007029, 963797, 926504, 894512, 867267, 844379, 825258, 809154, 795560, 784253, 774936, 767157, 760616, 755342, 751558, 749492, 749275, 750802, 753660, 757352, 761606, 766427, 771935, 778285, 785646, 794056, 803358, 813438, 824500, 836933, 850919, 866306, 882841, 900401, 918919, 938172, 957748, 977286, 996825, 1016933, 1038466, 1062159, 1088348, 1116880, 1147100, 1177967, 1208422, 1237850, 1266372, 1294802, 1324238, 1355427, 1388471, 1423294, 1460262, 1499750, 1540885]
53240A540885M0375L7116L2645K7874K2645J6942J1608P069K239m246j2228k0262
53228A702662k7254l3017l7594m1043m3844m6636m9366n1190n1349m9788m7009
53217A224572m3650m0155l6649l3288l0816l0203l1439l3295l4800l6375l8865
53206H35037m2040m4815m6470m6805m5605m2889l9515l6509l3885l0950k7552
53195C98002k4250k1297j8408j5493j2879j0753r068p896p240o609n585m596m365
53182B49563m736m953m871m951n150m953m489m583n347n799n225m093l224k825
53168A84364k679k653k697k768l002l425l515k720j433o77q08j244j607k151k865
53153A50120l081k414j402p86p35j083j649k058j853j175p06p05p35n66o39j219
$$ y = [1540885, 1581260, 1618376, 1651021, 1678895, 1701540, 1718482, 1730090, 1737159, 1739398, 1735152, 1722924, 1702662, 1675408, 1642391, 1604797, 1563754, 1519910, 1473274, 1423908, 1372718, 1321369, 1271581, 1224572, 1180922, 1140767, 1104118, 1070830, 1040014, 1009811, 978372, 945077, 910277, 873902, 835037, 792997, 748182, 701712, 654907, 609302, 566413, 526898, 490389, 456504, 425554, 398002, 373752, 352455, 334047, 318554, 305675, 294922, 285854, 277958, 270718, 264109, 258524, 253928, 249563, 244827, 239874, 235003, 230052, 224902, 219949, 215460, 210877, 205530, 199731, 194506, 190413, 187189, 184364, 181685, 179032, 176335, 173567, 170565, 167140, 163625, 160905, 159472, 158795, 157987, 156743, 155136, 152985, 150120, 147039, 144625, 143223, 142437, 141702, 140619, 138970, 136912, 135059, 133884, 133178, 132473, 131738, 131172, 130533, 129314]
53137A29314j735j493n93K56M98M0p80j281r72j58L81L63J69J8l09q05j087j102
53119A20724j317j842k062j536o87j87j44k25j38K85J020J632J560Q17Jm14l89
53102A17098PO07R17N59p6l96o29j298j820j003Q52J851J079j25k30M15O02K66
53084A18676J81L62J21o23j219j287j084r73j209j972k986l400k680j346k76L53
53068A00638Q14R96O57J68J75O13Q14M95L5k60n40r74j386j514j280q04l12k2
53050I8313N2P1P0q3l82n66m76j50M12J213J850J759R41K7o31j248j824j845j237
53031I6266q41j281j929j762q45j99m17j044j326j046n91m48o43o74k28J56k67
53014H2881j237j659j185p28j010j513j432r10n05j72L73P95N84k1m09o13j176
$$ y = [129314, 127579, 126086, 125493, 125749, 126247, 126287, 125507, 124226, 123254, 123096, 123477, 123840, 124009, 124027, 123718, 122913, 121826, 120724, 119407, 117565, 115503, 113967, 113280, 113093, 112949, 112724, 112586, 112871, 113891, 115523, 117083, 117900, 117901, 117487, 117098, 117105, 117712, 118629, 119188, 119112, 118716, 118087, 116789, 114969, 113966, 114818, 116669, 117748, 117623, 117393, 117808, 118410, 118676, 118857, 119219, 119340, 118717, 117498, 116211, 115127, 114154, 112945, 110973, 107987, 104587, 101907, 100561, 100285, 100638, 101452, 102448, 103105, 103273, 103448, 104061, 104875, 105370, 105405, 105145, 104605, 103631, 102245, 100731, 99451, 98647, 98335, 98313, 98365, 98436, 98506, 98423, 98041, 97475, 96999, 96849, 97261, 98474, 100324, 102083, 103024, 103051, 102420, 101172, 99348, 97503, 96266, 95425, 94144, 92215, 90453, 89608, 89409, 88992, 87948, 86622, 85576, 84985, 84537, 83894, 83220, 82992, 83148, 82881, 81644, 79985, 78800, 78072, 77062, 75549, 74117, 73207, 72702, 72530, 72903, 73698, 74282, 74261, 73852, 73239, 72063]
52997G2063k071k553k078q66L69R27N62j97m40L8L96r7r87j279p92k07rk1J03
52978F2861M20P30P60L86j50m41m10k78m7L66N07k25j383j633o36K61j19j168
52960E9801j574j144n48J3O63J005N69j62k63K81O50L97k30q82j270j024k30K73
52942E6325o9o39o50m65p94j224p65M02J101R59O31M25K0l72k3Q82J189N44o3
52923E7414P7L68J61j05K24Q24Q54R5r39j613j544q00n2m6o91j194j204j071r76
52904D9782n71J42N31L73L55R85J691J657R36J28n74j266j660j306l56M19M14
52887E1680k97j120j375p97J91Q29Q48O27N59N80N39N61P46Q81P84O25O31P03
52869E7195O51N09L72K17J13L15P96J028O26j0j28M13J066J450J825K567L508
$$ y = [72063, 69992, 67439, 65361, 64495, 64864, 65791, 66353, 66156, 65716, 65754, 66150, 66053, 65066, 63787, 62995, 62788, 62779, 62758, 62861, 63281, 64011, 64771, 65157, 65007, 64566, 64156, 63878, 63831, 64197, 64704, 64479, 63096, 61463, 60827, 61088, 60969, 59801, 58227, 57083, 56535, 56548, 57211, 58216, 58785, 58623, 58360, 58641, 59291, 59688, 59458, 58576, 57306, 56282, 56052, 56325, 56256, 55617, 54967, 54502, 53708, 52484, 51719, 52121, 53222, 54181, 54812, 55237, 55257, 54885, 54862, 55744, 56933, 57477, 57414, 57491, 57859, 58020, 57915, 58139, 58963, 59817, 59912, 58973, 57360, 55816, 55016, 54964, 54918, 54227, 53033, 51829, 50758, 49782, 49211, 49353, 49884, 50257, 50612, 51597, 53288, 54945, 55881, 56009, 55435, 54169, 52509, 51203, 50847, 51266, 51680, 51383, 50263, 48888, 48091, 48282, 49111, 49959, 50586, 51145, 51725, 52264, 52825, 53571, 54452, 55236, 55861, 56492, 57195, 57846, 58355, 58727, 58944, 59057, 59372, 60168, 61196, 61822, 61812, 61684, 62097, 63163, 64613, 66438, 69005, 72513]
52852G2513M093M016L489K825K072J075j88j569k836l632l586k814k141k328l029
52837F7960l151k327j347r49r07p85q65j458j985j622n88J40K39K62M97N55K48
52820E3917RJ28K51n3o47j127j327j323j159q33l35K87P79P46K25j00K78Q39O61
52801E1216k21q23o32k34k74n02l15K65O69N68J73j71l70n13o16n20j69J45M8
52782D7724l14l77K9L82K80O8J95M43L62Q2M6K81N49Q43J116R19J28m10Q8J010
52762E3444J119L86p6J43K84p2k95J06P32J148J505J836J690J045P00J223K149
52745F7067K795L085L119K587J345o9j053j621j964j950j577j407j853k517k776
52730F3211k611k352j991j383p81n37m89k65K2r6o67j170j171p98m67l23q0N60
$$ y = [72513, 76606, 80622, 84111, 86936, 89008, 90083, 89895, 88326, 85490, 81858, 78272, 75458, 73317, 70989, 67960, 64809, 62482, 61135, 60186, 59279, 58494, 57629, 56171, 54186, 52564, 51976, 52116, 52355, 52617, 53114, 53669, 53917, 53926, 54054, 54305, 54252, 53605, 52478, 51151, 49828, 48669, 47836, 47501, 47788, 48567, 49313, 49538, 49438, 49716, 50555, 51216, 50995, 50172, 49540, 49306, 49032, 48530, 48215, 48480, 49149, 49717, 49890, 49719, 49349, 48836, 48220, 47700, 47531, 47676, 47724, 47410, 47033, 47062, 47444, 47724, 47792, 47987, 48430, 48792, 48874, 48920, 49201, 49750, 50593, 51709, 52628, 52756, 52346, 52434, 53444, 54563, 54949, 54873, 55016, 55300, 55228, 54933, 55039, 55771, 56919, 58424, 60260, 61950, 62995, 63695, 64918, 67067, 69862, 72947, 76066, 78653, 79998, 79929, 78876, 77255, 75291, 73341, 71764, 70357, 68504, 65987, 63211, 60600, 58248, 56257, 54874, 54093, 53556, 53067, 52802, 52824, 52728, 52061, 50891, 49720, 48922, 48455, 48132, 48052, 48612]
52712D8612J304J398N65m79q86p72q40j128j008l67J07J6k06j44P2L61R66J729
52694D9300J851R69j89p61p35n20j66L22N14J07m56m97NN20P01O01M25L74M55
52675E2820K86m04j057p63L57J074P43J47J44M44M19K17J64j10r05j448q39M43
52657E1732J092Q04M38N86R83J300J555J667J453J098Q86N40l78j472j794j211
52641E9279o17o13q66r54j044j279j221m80N38J077R65O50M83L39om48o58n50
52623E4595m34n96q02n74P9N88O28N70Q61J339J544J362R47K94n89j330j518j215
52605E5749p55j92N81J344J620J242M39m56j110j129l95O59J445J778J773J485
52589F4078J010P26Q67J074Q60L72J75L95N92M39N6l23n57n77m93n95q70q01r8
$$ y = [48612, 49916, 51314, 51879, 51400, 50514, 49742, 48902, 47774, 46766, 46399, 46506, 46522, 46316, 46172, 46244, 46605, 47571, 49300, 51151, 52120, 51931, 51170, 50435, 49915, 49749, 50071, 50585, 50692, 50236, 49739, 49744, 50264, 50965, 51566, 51991, 52365, 52820, 53106, 52702, 51645, 50882, 51239, 52313, 53056, 53203, 53347, 53791, 54210, 54427, 54591, 54481, 53576, 52128, 51289, 51732, 52824, 53628, 54066, 54652, 55635, 56935, 58490, 60157, 61610, 62708, 63594, 64134, 63756, 62284, 60490, 59279, 58662, 58049, 57183, 56229, 55185, 53906, 52685, 52205, 52743, 53820, 54785, 55435, 55918, 56257, 56251, 55803, 55145, 54595, 54161, 53565, 52763, 52189, 52268, 52856, 53484, 54054, 54915, 56254, 57798, 59160, 60107, 60401, 59812, 58482, 56964, 55749, 54994, 54802, 55383, 56727, 58347, 59589, 60028, 59572, 58462, 57333, 56938, 57597, 59042, 60820, 62593, 64078, 65088, 65814, 66681, 67755, 68615, 68987, 69162, 69557, 70149, 70588, 70644, 70321, 69764, 69187, 68694, 68099, 67229, 66428, 66330]
52570F6330N77L43o60j471j618j459j264p93oN80O03L28M0l90j016j373j053l40
52552E7358K07M79P48J043J177J239J571K172K469J959Q65l2k23P6L24L20K65
52535G2017K54J04k15l25Q7P77J273J498J608J367L08j346k477k215j012j37k25
52518G1341p76j052r49p76n71k01J70K63L26Q74J620J487J43j176j185k75K47
52501F9510J46K79P66O56k93r12l70N02N42n9m00l93n50p65m93J38M97N28P28
52482G0057J120J192Q46N71N44L61j54n89n63k06J71M01L68P2k22k86l71p85j153
52463G1374p27M62J425J382O30lp3K69O43O98L24j51k09K60P56P03O3o31p66j75
52443G6254P09J333J607J866K237K460K391K233J991J348M85L33J333K436K253
$$ y = [66330, 66907, 67250, 66590, 65119, 63501, 62042, 60778, 59985, 59979, 60559, 61162, 61490, 61530, 61140, 60124, 58751, 57698, 57358, 57565, 58044, 58792, 59835, 61012, 62251, 63822, 65994, 68463, 70422, 71287, 71255, 71032, 71108, 71432, 71752, 72017, 72271, 72375, 72160, 71835, 71922, 72699, 73972, 75470, 77078, 78445, 78753, 77407, 74930, 72715, 71703, 71566, 71341, 70565, 69513, 68564, 67788, 67217, 67016, 67186, 67449, 67775, 68649, 70269, 71756, 71899, 70723, 69538, 69263, 69510, 69656, 69935, 70701, 71357, 71064, 70152, 69782, 70284, 70826, 70767, 70367, 69974, 69424, 68659, 68166, 68304, 68801, 69329, 70057, 71177, 72369, 73215, 73786, 74330, 74691, 74537, 73948, 73385, 73179, 73350, 73751, 74119, 74191, 73969, 73683, 73312, 72527, 71374, 70647, 71109, 72534, 73916, 74546, 74543, 74470, 74739, 75382, 76080, 76404, 76253, 76044, 76304, 77060, 77763, 77826, 77195, 76429, 76254, 76963, 78296, 79903, 81769, 84006, 86466, 88857, 91090, 93081, 94429, 94914, 95247, 96580, 99016, 101269]
52428A01269Q22n79j203j389j508j331p14r3K9l64r79j473j526j137q23j058j533
52411H6410j559j049n02j23K39L78j50j051j341p03J9M0m08p07p60q04q59p93
52393G6277n81j67M93J015Q24J0n95m71j7K72M74P78R21P32O14Q77J071O56l7
52374H3146k49R1L47J84q4j31nJ53L05L25O9k61j55N63J400J735J582J555J979
52355I2549K302J722L55o97o40R2O08Q02J156J606J560J033Q00J139J298O86j47
52338A06224l46J4K56K19L27P87J381J882K179K036J325M15p3Q3O75J525K487
52321A21396L097K791J595J97p03q82m76K23P57P79M80M42Q48J121O87k07p21
52304A31424m25K08M08m3o38p82m16j5ok87l71K4O55J058J081R67J017J287J683
$$ y = [101269, 102091, 101512, 100309, 98920, 97412, 96081, 95367, 95274, 95303, 94939, 93960, 92487, 90961, 89824, 89001, 87943, 86410, 84851, 83802, 83300, 83177, 83416, 83794, 83644, 82593, 81252, 80549, 80568, 80608, 80200, 79493, 78733, 77929, 77070, 76277, 75696, 75529, 76022, 77037, 77861, 77871, 77276, 76805, 76788, 77060, 77534, 78312, 79233, 79965, 80579, 81456, 82527, 83183, 83146, 82897, 82988, 83335, 83519, 83435, 83304, 83299, 83452, 83757, 84082, 84151, 83890, 83735, 84298, 85698, 87433, 89015, 90570, 92549, 94851, 96573, 96928, 96231, 95591, 95683, 96291, 97093, 98249, 99855, 101415, 102448, 103248, 104387, 105685, 106371, 106224, 105878, 105892, 106148, 106367, 106694, 107481, 108862, 110744, 112923, 114959, 116284, 116699, 116626, 116709, 117384, 118909, 121396, 124493, 127284, 128879, 129076, 128373, 127491, 127015, 127238, 127995, 128774, 129254, 129696, 130544, 131665, 132352, 132145, 131424, 130999, 131207, 131615, 131572, 130934, 130152, 129736, 129721, 129715, 129428, 129057, 129081, 129736, 130794, 131875, 132842, 133859, 135146, 136829]
52285A36829K084K303K177J900K004K728L560L774L281K511J702R02N81J364K947
52270A70647M052L933L272L022L067K733K015J468J201R11P19J047J698J879J285
52255B02949M31j45m42n91n04j36L79R43J502J859J869J758J785J745J383J065
52239B15850J358K063K449K362K303K385K226J905K101K972L832M238M475M592
52225B55111M003K579J339J287K212L278M063M419L991K828J931K248L378M061
52211B96728L772L103K720K667K718K778K828K786K582K199J772J649K050K575
52197C32927K578K169K266L232M191M264L814L710L925L811L403L388L866M123
52183C81667L815L522L799M337M425L824K916K268K259K834L449L543L152K891
$$ y = [136829, 138913, 141216, 143393, 145293, 147297, 150025, 153585, 157359, 160640, 163151, 164853, 165755, 166336, 167700, 170647, 174699, 178632, 181904, 184926, 187993, 190726, 192741, 194209, 195410, 196321, 197040, 198087, 199785, 201664, 202949, 203380, 203235, 202793, 202202, 201698, 201562, 201941, 202884, 204386, 206245, 208114, 209872, 211657, 213402, 214785, 215850, 217208, 219271, 221720, 224082, 226385, 228770, 230996, 232901, 235002, 237974, 241806, 246044, 250519, 255111, 259114, 261693, 263032, 264319, 266531, 269809, 273872, 278291, 282282, 285110, 287041, 289289, 292667, 296728, 300500, 303603, 306323, 308990, 311708, 314486, 317314, 320100, 322682, 324881, 326653, 328302, 330352, 332927, 335505, 337674, 339940, 343172, 347363, 351627, 355441, 359151, 363076, 366887, 370290, 373678, 377544, 381667, 385482, 389004, 392803, 397140, 401565, 405389, 408305, 410573, 412832, 415666, 419115, 422658, 425810, 428701]
52169D28701L178L778M214M338M312M215L905L369K896K750K643J950O00n68q04
52154D69477m67m76q90r02l60k06j010j968k090j643j541j884k101k139k446k948
52138D46406l036k627k274k122j676q78n11j093k039k474k321k109k087k093k039
52123D17027k085k343k722k986k845k220j474j169j395j658j584j411j510j805
52109C89820k031k290k780l208l007k230j613j645j985k045j705j182n64M7K48
52094C63830k63j127j602j452j050o24j6P09J030P14K87L23P55J239J767K409
52078C66929K839K778K545K565K588K163J614J696K343K661K258J755J771K198
52064C98703K666L026L062K491J530R02Q79R90R18J054J666K278K310J910J606
$$ y = [428701, 431879, 435657, 439871, 444209, 448521, 452736, 456641, 460010, 462906, 465656, 468299, 470249, 470849, 470281, 469477, 469010, 468534, 467644, 466742, 466382, 466176, 465166, 463198, 461108, 459465, 457924, 456040, 453939, 451800, 449354, 446406, 443370, 440743, 438469, 436347, 434671, 433793, 433282, 432189, 430150, 427676, 425355, 423246, 421159, 419066, 417027, 414942, 412599, 409877, 406891, 404046, 401826, 400352, 399183, 397788, 396130, 394546, 393135, 391625, 389820, 387789, 385499, 382719, 379511, 376504, 374274, 372661, 371016, 369031, 366986, 365281, 364099, 363535, 363582, 363830, 363567, 362440, 360838, 359386, 358336, 357712, 357696, 358405, 359435, 360149, 360436, 360759, 361514, 362753, 364520, 366929, 369768, 372546, 375091, 377656, 380244, 382407, 384021, 385717, 388060, 390721, 392979, 394734, 396505, 398703, 401369, 404395, 407457, 409948, 411478, 412380, 413259, 414249, 415167, 416221, 417887, 420165, 422475, 424385, 425991]
52049D25991J585J740J958K068J878J639J853K389K401J594Q19Q22J142R87N87
52034D49453P77J670K624L225L468L216K280J002P2k42j62J07M04M01p4o91j088
52017D66442j449k055k630k805k870l285l708l428k615k236k686l336l553l371
52003D26415l029k585k239k383k993l454l261k477j418l00O08R69P54L62J80K59
51987D05408L86K30n29j837l156m011m556n145n614n540n087m938n378o063o647
51972C47523p054p075o483n625n278n575n808n527n244n550o115o237n996o236
51958B63720p337q601q975q222p081o360o115n826n251m669m268l775l056k651
51944A81533l205m532n738o150n731m749l584k732k502k656k763k800k934k892
$$ y = [425991, 427576, 429316, 431274, 433342, 435220, 436859, 438712, 441101, 443502, 445096, 445915, 446737, 447879, 448866, 449453, 450230, 451900, 454524, 457749, 461217, 464433, 466713, 467715, 467787, 467545, 467383, 467490, 467894, 468295, 468221, 467530, 466442, 464993, 462938, 460308, 457503, 454633, 451348, 447640, 444212, 441597, 439361, 436675, 433339, 429786, 426415, 423386, 420801, 418562, 416179, 413186, 409732, 406471, 403994, 402576, 402276, 402884, 403853, 404607, 404969, 405149, 405408, 405794, 406024, 405495, 403658, 400502, 396491, 391935, 386790, 381176, 375636, 370549, 365611, 360233, 354170, 347523, 340469, 333394, 326911, 321286, 316008, 310433, 304625, 299098, 293854, 288304, 282189, 275952, 269956, 263720, 256383, 247782, 238807, 230585, 223504, 217144, 211029, 205203, 199952, 195283, 191015, 187240, 184184, 181533, 178328, 173796, 168058, 161908, 156177, 151428, 147844, 145112, 142610, 139954, 137191, 134391, 131457, 128565]
51930A28565k131p38M85Q82N50k3m58n55l47j52k87o36q33q31q54r54j005j055
51912A19623j120q19J51J226J357L83o65p73Q1J271K193K409J768P78L31P40J350
51895A30284J442J066O74L59p1n59o74p9J084K138K330J533N42K60P17J258J605
51878A43909K097K826L191K685J716J225J709K842L813M004L567L428M395O303
51864A87710Q335J0081J1804J3726J5760J8054K1255K5836L1686L8536M6384N5207
51852D84374O4499P3048P8609P7886O7785M7576J9956j0021l6931n6619o7438
51841G42724p0708o9423o5868o0656n3995m6880m0391l4628k9192k4370k0836
51830B25777j8471j6233j3410j0411q109o840o170n489m651l997l767l628l106
$$ y = [128565, 126434, 125696, 126181, 127063, 127613, 127590, 127132, 126577, 126230, 126078, 125791, 125155, 124322, 123491, 122637, 121683, 120678, 119623, 118503, 117684, 117835, 119061, 120418, 120801, 120136, 119363, 119444, 120715, 122908, 125317, 127085, 127863, 128194, 128934, 130284, 131726, 132792, 133466, 133825, 133754, 133195, 132521, 132442, 133526, 135664, 137994, 139527, 140069, 140329, 141046, 142304, 143909, 146006, 148832, 152023, 154708, 156424, 157649, 159358, 162200, 166013, 170017, 173584, 177012, 181407, 187710, 196045, 206126, 217930, 231656, 247416, 265470, 286725, 312561, 344247, 382783, 429167, 484374, 548873, 621921, 700530, 778416, 846201, 893777, 913733, 903712, 866781, 810162, 742724, 672016, 602593, 536725, 476069, 422074, 375194, 334803, 300175, 270983, 246613, 225777, 207306, 191073, 177663, 167252, 159143, 152303, 146133, 140644, 135993, 131996, 128229, 124601, 121495]
51817A21495k332j948k176k542k603k416j986r70N25J486J015m19j510j689j535
51802A02395j630j715j223k49M38K11p40j578j666j151o66n36n49m79m02l92l01
51785H9767j08j22n34j053j304j306j158o23M66J494J471K36j149j559j015m68
51769H3035n12p11l27O38J403J334N87j78m05J20J238K270K333J216k60j082j073
51752H9626p07k13M98J237J516J144M01l89r53r49l73R6j83p83p31M4O56O93P16
51733I1346J051J137O04Pj41k57q47j438j199k49M22J93o88j519j676r38K42J011
51715H7061R99O64N35N03K30k34o54r78j150r93o58o76j093j240q30o46j332k132
51697G7376j801m17P47R45O60N78P42R00R69R92J068J461K275L067L258K879K431
$$ y = [121495, 119163, 117215, 115039, 112497, 109894, 107478, 105492, 104522, 105047, 106533, 107548, 107129, 105619, 103930, 102395, 100765, 99050, 97827, 97578, 98016, 98227, 97487, 95909, 94243, 93092, 92426, 91890, 91341, 90862, 90460, 90068, 89767, 89659, 89537, 89003, 87950, 86646, 85340, 84182, 83559, 84025, 85519, 86990, 87226, 86077, 84518, 83503, 83035, 82523, 81812, 81485, 82123, 83526, 84860, 85447, 85269, 84864, 84984, 86222, 88492, 90825, 92041, 91781, 90699, 89626, 88919, 88706, 89204, 90441, 91957, 93101, 93502, 93113, 92160, 91211, 90838, 90934, 90751, 89968, 89237, 89281, 89937, 90630, 91346, 92397, 93534, 94138, 94145, 94004, 93747, 92900, 91462, 90263, 90014, 90436, 90629, 89941, 88422, 86746, 85808, 86050, 87061, 88060, 88724, 89259, 89762, 89992, 89758, 89104, 88126, 86976, 85983, 85325, 84649, 83556, 82316, 81486, 80840, 79508, 77376, 75575, 75158, 75905, 76850, 77510, 78088, 78830, 79730, 80699, 81691, 82759, 84220, 86495, 89562, 92820, 95699, 98130]
51680I8130K043J307P7j202k066k479k503k026j113k69K7j23k32q2L5j82n02l84
51662H8456K86R52J119J025J197J504J311M92k94n49m72l50l6O22J341J787J944
51645A00335J844J428R92J118J771K118J771J462J862K454K389J811J437J325
51631A24117J044P12P85J054Q53J51m57p31q98r04n20j16l62j085j375r76n93
51614A20699o71p63m51n8m3l62q66j720k919l859l848k772j130L08Q02J51r57
51597A01541j541j413j222j393j611j544j421j544j744j652j154l63M49P13l5
51582H6066j339k018j519n73p3J16O32J376J593J062M59M41Q68J176J126R03O71
51565I0967L49j43n58m35L76J392J829J376N45K11Q07J956K849K989K613K292
$$ y = [98130, 100173, 101480, 101557, 100355, 98289, 95810, 93307, 91281, 90168, 89899, 89926, 89803, 89571, 89489, 89524, 89342, 88840, 88456, 88742, 89694, 90813, 91838, 93035, 94539, 95850, 96342, 96048, 95499, 95027, 94677, 94641, 95263, 96604, 98391, 100335, 102179, 103607, 104599, 105717, 107488, 109606, 111377, 112839, 114701, 117155, 119544, 121355, 122792, 124117, 125161, 125873, 126658, 127712, 128565, 128716, 128259, 127528, 126630, 125726, 125206, 125090, 124728, 123643, 122268, 121292, 120699, 120028, 119265, 118814, 118756, 118713, 118351, 117485, 115765, 112846, 108987, 105139, 102367, 101237, 101545, 102347, 102498, 101541, 100000, 98587, 97365, 95972, 94361, 92817, 91396, 89852, 88108, 86456, 85302, 84939, 85388, 86101, 86066, 84727, 82709, 81190, 80617, 80544, 80660, 81292, 82668, 84261, 85323, 85782, 86223, 87091, 88267, 89393, 90296, 90967, 91316, 91173, 90615, 90180, 90556, 91948, 93777, 95153, 95698, 95909, 96716, 98672, 101521, 104510, 107123, 109415]
51549A09415K235K115J597P48j62r35j357j169l79N35J019Q96L90o4O9R73J995
51532A17921K080J050p9l96j75j15k14j77l14r86j545r53N90J771J913J556J218
51515A23145O71k25j021j428j795k352k756k851l066l577l694k877j713j206j416
51500I3839j569j211o00j54j5j34l43m74o11j041j640j753j023p3K48m4k46r6
51482H3060m9m15q12p20j86K88L40%m38o09k75M52J099J139M71m91j161j245q31
51463G9617j40N76R47O33j89p59m71M12J095J231J132J120J069Q48O79P96R69
51446H9565P19m3q90j397j561j627j619j268m23O17J369J664J713J691J524J149
51430I1183O96L68K76M44P04O50J41k22L47J634K486K316J878K016K370J985P23
$$ y = [109415, 111650, 113765, 115362, 116110, 115948, 115013, 113656, 112487, 112108, 112643, 113662, 114558, 114948, 114884, 114953, 115926, 117921, 120001, 121051, 120972, 120576, 120401, 120286, 120072, 119895, 119581, 118595, 117050, 116097, 116687, 118458, 120371, 121927, 123145, 123816, 123591, 122570, 121142, 119347, 116995, 114239, 111388, 108322, 104745, 101051, 98174, 96461, 95255, 93839, 92270, 91059, 90459, 90305, 90290, 90156, 89813, 89339, 88728, 87687, 86047, 84294, 83271, 83198, 83446, 83402, 83156, 83060, 83011, 82596, 81784, 81064, 80878, 81166, 81506, 81506, 81068, 80459, 80184, 80636, 81735, 82874, 83345, 82854, 81693, 80448, 79617, 79477, 80053, 81000, 81633, 81444, 80685, 80214, 80626, 81721, 82952, 84084, 85204, 86273, 87121, 87800, 88596, 89565, 90284, 90241, 89351, 87954, 86393, 84766, 83147, 81879, 81456, 82073, 83442, 85106, 86819, 88510, 90034, 91183, 91879, 92247, 92523, 92967, 93671, 94321, 94462, 94240, 94587, 96221, 98707, 101023, 102901, 104917, 107287, 109272, 109995]
51413A09995p14j846k726l423l846l946l611k699j594j221j809k200j303K73J068
51398H0398Q34N57O89O89K64k29p25j443j843r56Q39J774J027j84n31l14l95n54
51380G9897j45M52L15m69r21o20l7M16Q60J332J475R74Lq48r97m12J48j56j129
51361H0138j677j270o24n29p03m69J3O1l01k82M78J373J562Q78q7n99m67k46n61
51342G6688j214j340n90L68P76O88N25L09j20n07m77j81j31m61q01p93m15J01
51324G2425M68N27M15L40K69J02J21O45J284J245N86K20M15K39q57j922j867j144
51306G3511r87j482j611r31j02K79L44L51J97k22o80q95p32j81N37R82R29O94
51288G0001O68Q02Q76R62J138J162R91J173K072L036L072K127R74Q2o14j054j021
$$ y = [109995, 109281, 107435, 104709, 101286, 97440, 93494, 89883, 87184, 85590, 84369, 82560, 80360, 79057, 79330, 80398, 81232, 81789, 82478, 83167, 83431, 83202, 82477, 81034, 79191, 78235, 79074, 80848, 81875, 81691, 81160, 80846, 80451, 79897, 79752, 80204, 80519, 80050, 79129, 78509, 78472, 78888, 79748, 81080, 82555, 83529, 83532, 82684, 81687, 81275, 81423, 81267, 80138, 78461, 77191, 76567, 76038, 75335, 74866, 74879, 74940, 74639, 74357, 74835, 76208, 77770, 78648, 78561, 77962, 77495, 77249, 76688, 75474, 74134, 73544, 73912, 74688, 75376, 75901, 76210, 76090, 75583, 75106, 74925, 74794, 74333, 73532, 72739, 72324, 72425, 72893, 73420, 73835, 74175, 74444, 74546, 74667, 75312, 76596, 77841, 78427, 78647, 79062, 79301, 78444, 76522, 74655, 73511, 72524, 71042, 69431, 68500, 68398, 68677, 69021, 69372, 69569, 69347, 68667, 67772, 67040, 66859, 67396, 68378, 69307, 70001, 70669, 71471, 72347, 73309, 74447, 75609, 76600, 77773, 79845, 82881, 85953, 88080, 89054, 89136, 88522, 87468, 86447]
51271H6447p47p26r54j071j149j493j758j204O3J036J183J020J052J013N45p8
51255H3179l93k81K44J154J895J563J15j146j038M7P79O40K94L94P74R01N72o4
51237H9629p39j202j343j322j381j456j214n79L4J98L0j6J28L7n01j011q71q9
51219G8332P99J455J877J962J527Q30L82J25n13j485j767p68O41J192Q62N77O59
51202H6687O08K99L34R63J453J031q0r33r20k43M21N25J26j67J57R37J570J714
51184I4482J517J256J110J192J460J661J607J457J407J238O04l67j201j715k117
51169A03591k515k800k955k948k484j386j83L23J04p3K04N26N36N32Q00J004P19
51152I2995J94J2K63N25N07L05R0m9p6l9j32m29o06k59M84R08M82m28q82m46L05
$$ y = [86447, 85700, 84974, 84020, 82949, 81800, 80307, 78549, 77345, 77408, 78444, 79627, 80647, 81699, 82712, 83257, 83179, 82786, 82505, 82749, 83903, 85798, 87361, 87476, 86330, 85292, 85339, 86118, 86758, 87052, 87446, 88220, 89121, 89693, 89629, 88890, 87688, 86345, 85023, 83642, 82186, 80972, 80393, 80427, 80625, 80655, 80639, 80767, 80804, 80303, 79292, 78421, 78332, 79131, 80586, 82463, 84425, 85952, 86782, 87164, 87289, 86776, 85291, 83524, 82756, 83397, 84589, 85451, 86028, 86687, 87295, 87594, 87928, 88891, 90344, 91375, 91295, 90362, 89442, 89199, 89620, 90145, 90271, 90104, 90261, 91198, 92768, 94482, 95999, 97255, 98365, 99557, 101017, 102678, 104285, 105742, 107149, 108387, 108991, 108624, 107423, 105708, 103591, 101076, 98276, 95321, 92373, 89889, 88503, 88320, 88643, 88747, 88674, 88878, 89404, 89940, 90472, 91272, 92276, 92995, 93189, 93201, 93464, 93989, 94496, 94801, 94891, 94842, 94766, 94727, 94595, 94166, 93560, 93301, 93785, 94693, 95175, 94747, 93865, 93419, 93724]
51131I3724N35K19O9M34P92O03K01L26J037J565J283M15k98l51J02M11N1p70j252
51112I9096r50l45j95n42p86n73j71K5m9k40l52k75j31k72q58j450j397o40J62
51093I0057L16k53r40r19J65J738K700K540J826J395J411J505J470J334J127J014
51077A06486J320J904J943J041J32M00J578K244J780J055J024J547J845J455M85
51062A26239n22q41k20N72N52j60n07m5M80L73j05m28o36r79j343j502j507j403
51044A18018j042n28l58p65j313j519j405j152o91q9J79j60n78l35N32J260J304
51027A11358Q48M71M75O42N82L04K50N85Q31N95K88M88Q53N46l33p58k85M20Q33
51008A18993J238J755J749Q83r1l37m5K03M92J146J793J791J236Q02Q23J191J807
$$ y = [93724, 94259, 94478, 94547, 94981, 95773, 96376, 96577, 96903, 97940, 99505, 100788, 101203, 100905, 100554, 100656, 101067, 101118, 100348, 99096, 98146, 97801, 97606, 97064, 96278, 95705, 95534, 95559, 95510, 95270, 94918, 94643, 94512, 94240, 93382, 91932, 90535, 89895, 90057, 90373, 90120, 89180, 88261, 88426, 90164, 92864, 95404, 97230, 98625, 100036, 101541, 103011, 104345, 105472, 106486, 107806, 109710, 111653, 112694, 112826, 113226, 114804, 117048, 118828, 119883, 120907, 122454, 124299, 125754, 126239, 125717, 124876, 124656, 125228, 125780, 125620, 125113, 125068, 125548, 125921, 125816, 125388, 124752, 123773, 122430, 120928, 119421, 118018, 116976, 116448, 116090, 115325, 114012, 112493, 111088, 109936, 109245, 109156, 109335, 109175, 108597, 108262, 108794, 110054, 111358, 112206, 112677, 113152, 113794, 114376, 114680, 114930, 115515, 116346, 116941, 117229, 117717, 118570, 119116, 118783, 118025, 117740, 118160, 118993, 120231, 121986, 123735, 124618, 124527, 124190, 124145, 124348, 124840, 125986, 127779, 129570, 130806, 131608, 132431, 133622, 135429]
50991A35429K519K927K876K883L361L840L634K976K651K775K796K566K527K821
50977A76581L038K978K972L264L657L918M060M115M138M496N690P668R800J1530
50963B47905J2788J3669J4267J4911J6082J7867J9830K1606K3214K4656K5559
50952D52354K5635K5235K5027K5116K4732K2967J9770J5977J2318Q563M016j238
50940F60472o110r707j2331j4925j7875k0774k3109k4695k5530k5682k5349k4697
50928D29688k3640k2024k0046j8108j6386j4747j3031j1249r552q208p496p302
50916B57899o999o035m575l288k522k052j541j032q41j154j737k038j754j348
50902B20983j623k646l440l111j918p84j15L42P28Q44P10P63J245J887K284K306
$$ y = [135429, 137948, 140875, 143751, 146634, 149995, 153835, 157469, 160445, 163096, 165871, 168667, 171233, 173760, 176581, 179619, 182597, 185569, 188833, 192490, 196408, 200468, 204583, 208721, 213217, 218907, 226575, 236375, 247905, 260693, 274362, 288629, 303540, 319622, 337489, 357319, 378925, 402139, 426795, 452354, 477989, 503224, 528251, 553367, 578099, 601066, 620836, 636813, 649131, 657694, 661710, 660472, 654362, 644655, 632324, 617399, 599524, 578750, 555641, 530946, 505416, 479734, 454385, 429688, 406048, 384024, 363978, 345870, 329484, 314737, 301706, 290457, 280905, 272697, 265201, 257899, 250900, 244865, 240290, 237002, 234480, 232428, 230887, 229855, 229014, 227860, 226123, 224085, 222331, 220983, 219360, 216714, 213274, 210163, 208245, 207461, 207346, 207688, 208416, 209260, 209970, 210733, 211978, 213865, 216149, 218455]
50886B18455K030J627J423J688K276K779L163L874N151O538P392P737Q294R667
50872B82094J1672J3599J4938J5729J6226J6450J6309J5878J5168J3762J1227
50861D43052P931M965K936J414k06j743k607k592j769j7K632N497P894J0149J3235
50846D90771J7384K1846K6032L0134L4357L8347M1886M5524M9803N4161N7266
50835I07511N8457N8384N7988N7159N4700M9609M2173L3626K4886J5918O389l491
50823A363309j3121k2189l0748l8678m5447n0469n3467n4579n4321n3371n2070
50812H94849n0164m7314m3675l9708l5593l1326k7250k3858k0983j7768j3765
50801E43445r556n999l203o06K189M994P443R418J1020J2254J2891J2712J1902
$$ y = [218455, 220485, 222112, 223535, 225223, 227499, 230278, 233441, 237315, 242466, 249004, 256396, 264133, 272427, 282094, 293766, 307365, 322303, 338032, 354258, 370708, 387017, 402895, 418063, 431825, 443052, 450983, 455948, 458884, 460298, 460092, 458349, 455742, 453150, 451381, 451364, 453996, 459493, 467387, 477536, 490771, 508155, 530001, 556033, 586167, 620524, 658871, 700757, 746281, 796084, 850245, 907511, 965968, 1024352, 1082340, 1139499, 1194199, 1243808, 1285981, 1319607, 1344493, 1360411, 1366800, 1363309, 1350188, 1327999, 1297251, 1258573, 1213126, 1162657, 1109190, 1054611, 1000290, 946919, 894849, 844685, 797371, 753696, 713988, 678395, 647069, 619819, 595961, 574978, 557210, 543445, 533889, 527890, 524687, 524081, 526270, 531264, 538707, 548125, 559145, 571399, 584290, 597002, 608904]
50788F08904J0953J0094Q936O969M257J414r70k601l345l404l545m622o637q694
50774F17709j0025j0692j1080j1187j0717r583p921n810l305n52K435N916J0026
50761E55214J4247J7589J9281J9191J7627J4985J1575P566L145j231m846p200
50749F67143q441r124r674j0221j0799j1320j1381j0508q726o625m702k913j076
50736E61633O15J826K648L492M484N325N854O374P279Q614J0166J1805J3575J5636
50722F59326J8229K1423K4713K7195K8458K9034K9571K9829K8986K6753K3591
50711I47108J9810J5116R298K870l314q785j3450j7194j9797k1237k1846k2173
50699H66406k2745k3710k4643k4886k4220k3023k1775k0598j9365j7886j5903
$$ y = [608904, 619857, 629951, 638887, 645856, 650113, 651527, 650557, 647956, 644611, 641207, 637662, 633040, 626403, 617709, 607684, 596992, 585912, 574725, 564008, 554425, 546504, 540694, 537389, 536837, 539272, 545188, 555214, 569461, 587050, 606331, 625522, 643149, 658134, 669709, 677275, 680420, 679189, 674343, 667143, 658702, 649578, 639904, 629683, 618884, 607564, 596183, 585675, 576949, 570324, 565622, 562709, 561633, 562248, 564074, 566722, 570214, 574698, 580023, 585877, 592251, 599530, 608144, 618310, 630115, 643690, 659326, 677555, 698978, 723691, 750886, 779344, 808378, 837949, 867778, 896764, 923517, 947108, 966918, 982034, 991332, 994202, 990888, 982103, 968653, 951459, 931662, 910425, 888579, 866406, 843661, 819951, 795308, 770422, 746202, 723179, 701404, 680806, 661441, 643555, 627652]
50688F27652j3201r994o861m149j553J471N080Q975J2798J6394J9826K3198K6357
50675G05993K8798L0072L0234K9608K8189K5754K2570J9438J6837J4483J1954
50664I63930R278O647M037J478o62k083k935l550m017m231l981k825l72L061O497
50649I70272R275J1502J3285J4244J4102J3152J1558Q901N071J035k073m202n984
50636A060138p559q635r406j0475j1874j2993j3436j3421j3320j3288j3252j2814
50624I19665j1437r242p271o378o237o109o125o903q225r114r161q863q651q466
50610H07483q283q153p702o433m669l412l148l534m249n333o572p506q254r486
50596G20749j1314j3010j4031j4531j4615j3986j2675j1312j0281r325q399q022
$$ y = [627652, 614451, 604457, 597596, 593447, 591894, 593365, 598445, 607420, 620218, 636612, 656438, 679636, 705993, 734791, 764863, 795097, 824705, 852894, 878648, 901218, 920656, 937493, 951976, 963930, 973208, 979855, 983892, 985370, 984708, 982625, 979690, 976140, 972123, 967892, 963911, 961086, 960714, 963775, 970272, 979547, 991049, 1004334, 1018578, 1032680, 1045832, 1057390, 1066291, 1071362, 1072397, 1070324, 1066122, 1060138, 1052579, 1043944, 1034538, 1024063, 1012189, 999196, 985760, 972339, 959019, 945731, 932479, 919665, 908228, 898986, 891715, 885337, 879100, 872991, 866866, 859963, 851738, 842624, 833463, 824600, 815949, 807483, 799200, 791047, 783345, 776912, 772243, 768831, 765683, 762149, 757900, 752567, 745995, 738489, 730235, 720749, 709435, 696425, 682394, 667863, 653248, 639262, 626587, 615275, 604994, 595669, 587270, 579248]
50584E79248q324q423p486n782m282l600l800m683n784o480o521o102n218l609
50570D99154j557LO81J230K431M089N720P546J0002J2771J5168J7128J9046K0874
50556F14286K2198K2978K3494K3628K2882K1192J9178J7544J6566J6192J6210
50545H36348J6306J6237J6021J5850J5925J6399J7305J8367J9309K0442K2591
50534A031100K6134L0462L4702L8467M1675M4118M5660M6428M6350M4922M1991
50523A472009L8204L4062K8970K2068J3660M942l508j2036k0669k8587l5036m0075
50511A474004m3985m6660m8046m8567m8552m7552m4878m0710l6181l2213k8646
50500A008014k4740k0292j5956j2460r732o982l496Q15N490R861J3420J6107J8158
$$ y = [579248, 570924, 562501, 555015, 549233, 544951, 541351, 537551, 532868, 527084, 520604, 514083, 507981, 502763, 499154, 497597, 497600, 498281, 499511, 501942, 506031, 511751, 519297, 529299, 542070, 557238, 574366, 593412, 614286, 636484, 659462, 682956, 706584, 729466, 750658, 769836, 787380, 803946, 820138, 836348, 852654, 868891, 884912, 900762, 916687, 933086, 950391, 968758, 988067, 1008509, 1031100, 1057234, 1087696, 1122398, 1160865, 1202540, 1246658, 1292318, 1338746, 1385096, 1430018, 1472009, 1510213, 1544275, 1573245, 1595313, 1608973, 1613915, 1610407, 1598371, 1577702, 1549115, 1514079, 1474004, 1430019, 1383359, 1335313, 1286746, 1238194, 1190642, 1145764, 1105054, 1068873, 1036660, 1008014, 983274, 962982, 947026, 934566, 924834, 917852, 914356, 915171, 920661, 930522, 943942, 960049, 978207]
50487I78207J9405J8905J5778J0435M339j545p472j3828k0096k5437k9690l3109
50475I15892l5500l6435l6083l5146l3926l2217l0025k7806k5766k3611k1173
50464E78204j8838j7046j5744j4574j3302j1860j0188q365o742n602m839m109
50452D46995l234k308j456p18j21L37Q39J692L003M452N533O056O315O758P589
50437D81732Q770J0201J1771J3256J4397J5132J5657J6281J7260J8670K0255K1545
50425F64927K2291K2738K3273K3939K4534K5091K5843K6761K7488K7800K7880
50414I42565K7975K8077K7974K7383K5923K3291J9626J5498J1457P599L608r64
50402A160012o378j2369j8211k3263k7456l1027l4026l6380l8238l9663m0184
$$ y = [978207, 997612, 1016517, 1032295, 1042730, 1047069, 1045524, 1038052, 1024224, 1004128, 978691, 949001, 915892, 880392, 843957, 807874, 772728, 738802, 706585, 676560, 648754, 622988, 599377, 578204, 559366, 542320, 526576, 512002, 498700, 486840, 476652, 468287, 461545, 455943, 451104, 446995, 443761, 441453, 439997, 439279, 439158, 439495, 440334, 442026, 445029, 449481, 455014, 461070, 467385, 474143, 481732, 490502, 500703, 512474, 525730, 540127, 555259, 570916, 587197, 604457, 623127, 643382, 664927, 687218, 709956, 733229, 757168, 781702, 806793, 832636, 859397, 886885, 914685, 942565, 970540, 998617, 1026591, 1053974, 1079897, 1103188, 1122814, 1138312, 1149769, 1157368, 1160976, 1160012, 1153634, 1141265, 1123054, 1099791, 1072335, 1041308, 1007282, 970902, 932664, 893001, 852817]
50391H52817l9179l6746l3678l0556k7399k4129k0795j7305j3620j0240p864o287
50379E85019m402j575J584M213O296Q331J0379J1965J2639J2310J1192R623P702
50366F75276N119J708j967n183q047j1055j3729j4856j4380j3920j4688j5885
50354E68393j5979j4751j3221j2146j1486j0976j0344r289p889o740o175n776
50342D43621n078m229l460k566j579j164j664k310k310j984j967j976j470q79
50328D10985r32j197o30P09J826K538L638N337O868P885Q995J0534J1907J2610
50314D81073J2953J3274J3262J2493J1054R305P521O005M993M283L466K564J885
50301E84131J301M02p45j778k905m580o355p241p341p933r494j0898j1166j0905
$$ y = [852817, 813638, 776892, 743214, 712658, 685259, 661130, 640335, 623030, 609410, 599170, 591306, 585019, 580617, 579042, 580626, 584839, 591135, 599466, 609845, 621810, 634449, 646759, 657951, 667574, 675276, 680395, 682103, 680136, 674953, 666906, 655851, 642122, 627266, 612886, 598966, 584278, 568393, 552414, 537663, 524442, 512296, 500810, 489834, 479490, 470201, 462312, 455572, 449397, 443621, 438543, 434314, 430854, 428288, 426709, 425545, 423881, 421571, 419261, 417277, 415310, 413334, 411864, 410985, 410053, 408856, 408226, 408935, 410761, 413299, 416937, 422274, 429142, 437027, 446022, 456556, 468463, 481073, 494026, 507300, 520562, 533055, 544109, 553414, 560935, 566940, 571933, 576216, 579682, 582246, 584131, 585432, 585834, 585089, 583311, 580406, 575826, 569471, 562230, 554889, 546956, 537462, 526564, 515398, 504493]
50287E04493j1097j1485j1213j0298r429q734p787o549n425m592l893l273k605
50274D08113j408N12K396L236L067K778K741K456J696J036Q95P93J59o11o72j19
50258D27068k2q78j734j315L00J806K339K378K779L494L865L802L997M913O126
50243D58918O883O954O746O686O754O609O143N835O304P465Q468Q718Q573Q726
50229E59782R189R475R524R824J0584J1410J1928J2196J2344J2200J1581J0673
50217F90710R947R873J0754J2621J5136J7769K0159K2266K4347K6853L0182L4331
50205I24948L8934M3827M9306N5643O2850P1210Q1511R4130J08359J23369J39539
50194A793626J57926J78436J99269K17956K32044K38995K36552K23908K02110
$$ y = [504493, 493396, 481911, 470698, 460400, 450971, 442237, 434450, 427901, 422476, 417884, 413991, 410718, 408113, 406705, 407217, 409613, 412849, 415916, 418694, 421435, 423891, 425587, 426623, 427518, 428311, 428470, 427859, 427187, 427068, 427046, 426168, 424434, 423119, 423419, 425225, 427564, 429942, 432721, 436215, 440080, 443882, 447879, 452792, 458918, 465801, 472755, 479501, 486187, 492941, 499550, 505693, 511528, 517832, 525297, 533765, 542483, 551056, 559782, 568971, 578446, 587970, 597794, 608378, 619788, 631716, 643912, 656256, 668456, 680037, 690710, 700657, 710530, 721284, 733905, 749041, 766810, 786969, 809235, 833582, 860435, 890617, 924948, 963882, 1007709, 1057015, 1112658, 1175508, 1246718, 1328229, 1422359, 1530718, 1654087, 1793626, 1951552, 2129988, 2329257, 2547213, 2779257, 3018252, 3254804, 3478712, 3680822]
50185C680822J73344J40565J07687P8854N6480M0141K7375J5140M85j8987m4435
50174D257471p5407j10045j45285j77119k01793k17437k24296k23501k16254k04143
50164B462191j89113j72604j55296j37906j21469j06550r2990q0858p0726o2507
50154A272172n5038m7604m1086l6671l4031l1734k9026k6251k3792k1582j9600
50143I05757j8037j6850j5663j4221j2508j0573q622p102o280n787n012l815k547
50130G78740j474n49L70J407K637L986N264O485P820R141J0026J0459J1053J2131
50116H57496J3144J3469J3348J3521J4271J5438J6933J8539J9535J9394J8679
50105A033767J8514J9155J9851K0103K0331K1059K2221K3559K5120K7003K9063
$$ y = [3680822, 3854166, 3994731, 4102418, 4181272, 4237752, 4277893, 4305268, 4320408, 4320893, 4301906, 4257471, 4182064, 4072019, 3926734, 3749615, 3547822, 3330385, 3106089, 2882588, 2666334, 2462191, 2273078, 2100474, 1945178, 1807272, 1685803, 1579253, 1486263, 1405405, 1334679, 1272172, 1217134, 1169530, 1128444, 1091773, 1057742, 1026008, 996982, 970731, 946939, 925357, 905757, 887720, 870870, 855207, 840986, 828478, 817905, 809283, 802181, 795901, 790114, 785102, 781287, 778740, 777266, 776717, 777087, 778494, 781131, 785117, 790381, 796866, 804686, 813827, 823853, 834312, 845365, 857496, 870640, 884109, 897457, 910978, 925249, 940687, 957620, 976159, 995694, 1015088, 1033767, 1052281, 1071436, 1091287, 1111390, 1131721, 1152780, 1175001, 1198560, 1223680, 1250683, 1279746]
50094A279746L1304L4122L7777M1839M5699M9519N4263O0730O8922P8549Q9863
50083A872333J03626J20411J40221J62857J88495K17750K51114K88127L26567
50074C671501L62316L90394M06585M08353L94890L67427L30047K89213K51172
50065F871898K19226J93342J71379J49726J23476Q7940M1057j5787p9071j44449
50055G618737k07072k62260l06970l40453l63324l76486l81028l78125l68660
50046D634359l53411l33867l11964k88742k64084k38183k12336j87839j65022
50037B278911j44036j25577j10005r6496q4043p2787o3492n6229n0431m5747m1989
50026A388079l8657l5395l2575l0698k9450k8169k6905k6174k5995k5847k5416
$$ y = [1279746, 1311050, 1345172, 1382949, 1424788, 1470487, 1520006, 1574269, 1634999, 1703921, 1782470, 1872333, 1975959, 2096370, 2236591, 2399448, 2587943, 2805693, 3056807, 3344934, 3671501, 4033817, 4424211, 4830796, 5239149, 5634039, 6001466, 6331513, 6620726, 6871898, 7091124, 7284466, 7455845, 7605571, 7729047, 7816987, 7858044, 7842257, 7763186, 7618737, 7411665, 7149405, 6842435, 6501982, 6138658, 5762172, 5381144, 5003019, 4634359, 4280948, 3947081, 3635117, 3346375, 3082291, 2844108, 2631772, 2443933, 2278911, 2134875, 2009298, 1899293, 1802797, 1718754, 1645967, 1582475, 1526246, 1475815, 1430068, 1388079, 1349422, 1314027, 1281452, 1250754, 1221304, 1193135, 1166230, 1140056, 1114061, 1088214, 1062798]
50015A062798k4576k2977k0472j7718j5603j4192j2888j1447j0078q775p313n748
50003H91011m305k923j598q13q91j221j004n41p93j762k299j614j64J116J752
49988H73951J792J569J517J738J776J348J007J478K585L587M457N885Q137J0751
49974I21578J3378J6034J8541K0638K2844K6319L1515L7700M3964N0143N6620
49963A259274O3966P2943Q4234R7897J13532J31058J50816J72884J96665K20829
49953B564098K42861K58957K65485K60828K45299K19841J86204J48330J11891
49944D503794Q1454N8537M2161K9870J7727R90k3725n6917r6816j40343j83097
49933D233635k19977k47328k64215k71143k68505k57203k39842k19788j99089
$$ y = [1062798, 1038222, 1015245, 994773, 977055, 961452, 947260, 934372, 922925, 912847, 904072, 896759, 891011, 886706, 883783, 882185, 881372, 880481, 879260, 878256, 877715, 876922, 875160, 872861, 871247, 871083, 872199, 873951, 875743, 877312, 878829, 880567, 882343, 883691, 884698, 886176, 888761, 892348, 896805, 902690, 910827, 921578, 934956, 950990, 969531, 990169, 1013013, 1039332, 1070847, 1108547, 1152511, 1202654, 1259274, 1323240, 1396183, 1480417, 1578314, 1691846, 1822904, 1973720, 2146604, 2343269, 2564098, 2806959, 3065916, 3331401, 3592229, 3837528, 4057369, 4243573, 4391903, 4503794, 4585248, 4643785, 4685946, 4715816, 4733543, 4734533, 4710808, 4653891, 4557075, 4416732, 4233635, 4013658, 3766330, 3502115, 3230972, 2962467, 2705264, 2465422, 2245634, 2046545]
49924B046545j78222j57534j37909j20120j04439r0975p9668o9906o0840n2260
49914I94672m4719l8744l4209l0560k7302k4304k1787j9961j8608j7248j5826
49903G01404j4786j4218j3460j1989j0318r402r432r746r711r215q425p624p179
49890E65899p209p290o930o326o192o797p532p548o649n480m894n158n754o024
49876D76116n905n777n727n411m768m256m098l852l174k490k320k366j914r80
49862D23078l17l40n95m92K3O91J374K008K358K204J690J289J280J407J203O52
49846D37513L15N96J119J173O71K22K12L32J19n00j339k171k550j912l46J089
49830D34543J365O77J65N48J400J785J350O77O24J359K134K231J906J986K566
$$ y = [2046545, 1868323, 1710789, 1572880, 1452760, 1348321, 1257346, 1177678, 1107772, 1046932, 994672, 949953, 911209, 877000, 846440, 819138, 794834, 773047, 753086, 734478, 717230, 701404, 686618, 672400, 658940, 646951, 636633, 627231, 617799, 608053, 598342, 589127, 580702, 573078, 565899, 558690, 551400, 544470, 538144, 531952, 525155, 517623, 510075, 503426, 497946, 493052, 487894, 482140, 476116, 470211, 464434, 458707, 453296, 448528, 444272, 440174, 436322, 433148, 430658, 428338, 425972, 424058, 423078, 422761, 422421, 421826, 421334, 421357, 422048, 423422, 425430, 427788, 429992, 431682, 432971, 434251, 435658, 436861, 437513, 437828, 438424, 439543, 440716, 441387, 441609, 441821, 442153, 442272, 441772, 440433, 438262, 435712, 433800, 433454, 434543, 435908, 436585, 436750, 437298, 438698, 440483, 441833, 442510, 443134, 444493, 446627, 448858, 450764, 452750, 455316]
49815D55316K773J942M98p90j770k643l254l298k986k796k682k222j474j089j389
49800D34136j866j866j395j005j064j416j718j888k081k269k110j393m63J37L57
49785D14096O22J090J358J031J58j004k160k764k233p73N22Q41N39M06N06K96
49769D12531l65j052j435j545j479j286j132j077q39j75N74Q60P21P34J152J572
49753D07759J607J342J065R04Q96J102J417J509J136M47j43m12n90j154k213l165
49737D11507l286k677k213k413k763k503j656q77o16q70j465k042k046j253k12
49722C84615L48L26N9l50q93j056k52J233K408K800K776K618K096J204N50N90
49706C99072J081J697K571L736M538M313L330K476K162K110K029J985K004J897
$$ y = [455316, 458089, 460031, 460529, 459739, 457969, 455326, 452072, 448774, 445788, 442992, 440310, 438088, 436614, 435525, 434136, 432270, 430404, 429009, 428004, 426940, 425524, 423806, 421918, 419837, 417568, 415458, 414065, 413602, 413739, 414096, 414718, 415808, 417166, 418197, 418355, 417351, 415191, 412427, 410194, 409421, 409943, 410784, 411323, 411729, 412235, 412531, 412166, 411114, 409679, 408134, 406655, 405369, 404237, 403160, 402321, 402146, 402720, 403580, 404301, 405035, 406187, 407759, 409366, 410708, 411773, 412677, 413573, 414675, 416092, 417601, 418737, 419184, 419041, 418629, 418039, 416885, 414672, 411507, 408221, 405544, 403331, 400918, 398155, 395652, 393996, 393119, 392503, 391633, 390168, 388126, 386080, 384827, 384615, 384963, 385289, 385348, 384998, 384105, 383049, 382797, 384030, 386438, 389238, 392014, 394632, 396728, 397932, 398482, 399072, 400153, 401850, 404421, 408157, 412695, 417008, 420338, 422814, 424976, 427086, 429115, 431100, 433104, 435001]
49692D35001J653J628K140L077M043M716M986M866M524M218M064L834L232K379
49678D84361J872K160K978L572L500K981K439J985J529J129R83J042R63M94k18
49663E11770p49p83l57J91N42O80Q56J236J716K048K126J988J737J417J047P37
49647E26202Q05J566K783L563L227K276J894K527L416L810L937M364N013N383
49633E70766N364N192M811M020L179L008L630M285M249L686L383L865M891N753
49619F30082O039O093O470P037P035O321N831O341P314P744P698Q005Q649Q641
49605G29300P712P021P639R080J0043J0104J0006J0526J1636J2741J3354J3487
49593H52649J3553J3906J4455J4876J5110J5449J6064J6772J7350J7737J7877
$$ y = [435001, 436654, 438282, 440422, 443499, 447542, 452258, 457244, 462110, 466634, 470852, 474916, 478750, 481982, 484361, 486233, 488393, 491371, 494943, 498443, 501424, 503863, 505848, 507377, 508506, 509489, 510531, 511494, 511988, 511770, 511021, 510238, 509881, 510072, 510614, 511294, 512150, 513386, 515102, 517150, 519276, 521264, 523001, 524418, 525465, 526202, 527007, 528573, 531356, 534919, 538146, 540422, 542316, 544843, 548259, 552069, 556006, 560370, 565383, 570766, 576130, 581322, 586133, 590153, 593332, 596340, 599970, 604255, 608504, 612190, 615573, 619438, 624329, 630082, 636121, 642214, 648684, 655721, 662756, 669077, 674908, 681249, 688563, 696307, 704005, 712010, 720659, 729300, 737012, 744033, 751672, 760752, 770795, 780899, 790905, 801431, 813067, 825808, 839162, 852649, 866202, 880108, 894563, 909439, 924549, 939998, 956062, 972834, 990184, 1007921, 1025798]
49582A025798J7723J7486J7585J8140J8820J9294J9580J9828K0061K0306K0641
49571A235262K0927K0753J9943J8898J8240J8223J8594J8844J8569J7762J6842
49560A442857J6167J5558J4530J2946J1150R490Q088P060O431N797M630L048J745
49547A559497J023M82j39m87l16m3p6j63J39P79J616K854M467N720O052O068O698
49530A594171P733Q204Q079Q411R611J0695J0753J0256J0195J0620J0820J0566
$$ y = [1025798, 1043521, 1061007, 1078592, 1096732, 1115552, 1134846, 1154426, 1174254, 1194315, 1214621, 1235262, 1256189, 1276942, 1296885, 1315783, 1334023, 1352246, 1370840, 1389684, 1408253, 1426015, 1442857, 1459024, 1474582, 1489112, 1502058, 1513208, 1522698, 1530786, 1537846, 1544277, 1550074, 1554704, 1557752, 1559497, 1560520, 1561002, 1560863, 1560376, 1560060, 1560017, 1559941, 1559778, 1559917, 1560696, 1562312, 1565166, 1569633, 1575353, 1581405, 1587473, 1594171, 1601904, 1610108, 1618187, 1626598, 1636209, 1646904, 1657657, 1667913, 1678108, 1688728, 1699548, 1710114]
$$ [...]
##END NTUPLES=NMR SPECTRUM
##END=
