##TITLE=NES1032_872015071_9242772_QoE1DjywgL
##JCAMPDX= 6.0         $$ Bruker NMR JCAMP-DX V2.0
##DATA TYPE= NMR SPECTRUM
##DATA CLASS= NTUPLES
##ORIGIN= BRUKER
##OWNER= Administrator
$$ 1.72 TOPSPIN		Version 2.1
$$ 2015-07-01 22:05:20.930 -0700  Administrator@X
$$ Compression mode = diff/dup
##.OBSERVE FREQUENCY= 400.02188249412
##.OBSERVE NUCLEUS= ^1H
##.ACQUISITION MODE= SIMULTANEOUS (DQD)
##.ACQUISITION SCHEME= undefined
##.AVERAGES= 8
##.DIGITISER RES= 22
##SPECTROMETER/DATA SYSTEM= spect
##.PULSE SEQUENCE= zg30
##.SOLVENT NAME= COFFEE_meoh
##.SHIFT REFERENCE= INTERNAL, COFFEE_meoh, 1, 14.98509
##AUDIT TRAIL= $$ (NUMBER, WHEN, WHO, WHERE, PROCESS, VERSION, WHAT)
$$ ##TITLE= Audit trail, TOPSPIN		Version 2.1
$$ ##JCAMPDX= 5.01
$$ ##ORIGIN= Bruker BioSpin GmbH
$$ ##OWNER= Administrator
$$ $$ E:\/data/COFFEE/nmr/NES1032_872015071_9242772_QoE1DjywgL/20/pdata/1/auditp.txt
$$ ##AUDIT TRAIL=  $$ (NUMBER, WHEN, WHO, WHERE, PROCESS, VERSION, WHAT)
(   1,<2015-07-01 22:05:13.727 -0700>,<Administrator>,<X>,<go>,<TOPSPIN 2.1>,
      <created by zg
	started at 2015-07-01 22:04:07.867 -0700,
	POWCHK enabled, PULCHK disabled,
       configuration hash MD5:
       21 0F 79 D6 B3 7B B4 F6 88 20 88 DB 03 48 BD 9F
       data hash MD5: 64K
       E4 DC 9C 0D F0 B0 94 F0 2F 25 03 79 A7 AB A4 A4>)
(   2,<2015-07-01 22:05:16.867 -0700>,<Administrator>,<X>,<proc1d>,<TOPSPIN 2.1>,
      <Start of raw data processing
       efp LB = 0 FT_mod = 6 PKNL = 1 PHC0 = 0 PHC1 = 0 SI = 32K 
       data hash MD5: 32K
       9B C9 76 FF 79 4F EA EF A8 11 D0 33 14 55 CF 7F>)
(   3,<2015-07-01 22:05:17.149 -0700>,<Administrator>,<X>,<proc1d>,<TOPSPIN 2.1>,
      <pk PHC0 = 93.87817 PHC1 = 0 
       data hash MD5: 32K
       CE 63 35 A4 10 E7 1A 04 AB B8 12 4F 94 5C 4A 65>)
(   4,<2015-07-01 22:05:17.258 -0700>,<Administrator>,<X>,<proc1d>,<TOPSPIN 2.1>,
      <abs ABSG = 1 
       data hash MD5: 32K
       D7 DF 7D 28 C2 7C E6 8D D4 36 E3 BE FD CE 6C F5>)
(   5,<2015-07-01 22:05:17.320 -0700>,<Administrator>,<X>,<proc1d>,<TOPSPIN 2.1>,
      <abs ABSG = 2 
       data hash MD5: 32K
       04 5A 6A A1 63 1A BE 0E 69 BD D0 5F 4A 44 C0 4C>)
(   6,<2015-07-01 22:05:17.383 -0700>,<Administrator>,<X>,<proc1d>,<TOPSPIN 2.1>,
      <abs ABSG = 3 
       data hash MD5: 32K
       A9 C3 00 BD F8 8F 32 3A 9B 28 F1 57 1E 83 C9 88>)
(   7,<2015-07-01 22:05:17.445 -0700>,<Administrator>,<X>,<proc1d>,<TOPSPIN 2.1>,
      <abs ABSG = 4 
       data hash MD5: 32K
       C5 9F 80 B1 34 E1 3B 1C 7F DB 7C 1E 2E AC E2 F1>)
(   8,<2015-07-01 22:05:17.508 -0700>,<Administrator>,<X>,<proc1d>,<TOPSPIN 2.1>,
      <abs ABSG = 5 
       data hash MD5: 32K
       F4 2D A6 97 B4 59 41 7F 65 4A EC 3A 67 10 F8 F7>)
$$ ##END=
$$ 
$$ $$ hash MD5
$$ $$ 59 C1 0A 27 57 BE 01 49 4C 96 02 53 E8 20 59 51
##$RELAX= 
##$RELAX= 
##$RELAX= 
##$RELAX= 
##$RELAX= 
##$RELAX= 
##$RELAX= 
$$ Bruker specific parameters
$$ --------------------------
##$DU= <E:\>
##$EXPNO= 20
##$NAME= <NES1032_872015071_9242772_QoE1DjywgL>
$$ [...]
150 150 150 150 150 150 150 150
##$TP07= 0
##$TPNAME0= <>
##$TPNAME1= <>
##$TPNAME2= <>
##$TPNAME3= <>
##$TPNAME4= <>
##$TPNAME5= <>
##$TPNAME6= <>
##$TPNAME7= <>
##$TPOAL= (0..7)
0.5 0.5 0.5 0.5 0.5 0.5 0.5 0.5
##$TPOFFS= (0..7)
0 0 0 0 0 0 0 0
##$TUNHIN= 0
##$TUNHOUT= 0
##$TUNXOUT= 0
##$USERA1= <user>
##$USERA2= <user>
##$USERA3= <user>
##$USERA4= <user>
##$USERA5= <user>
##$V9= 5
##$VALIST= <valist>
##$VCLIST= <CCCCCCCCCCCCCCC>
##$VD= 0
##$VDLIST= <DDDDDDDDDDDDDDD>
##$VPLIST= <PPPPPPPPPPPPPPP>
##$VTLIST= <TTTTTTTTTTTTTTT>
##$WBST= 2048
##$WBSW= 25
##$XGAIN= (0..3)
0 0 0 0
##$XL= 0
##$YL= 0
##$YMAX_a= 572008
##$YMIN_a= -476945
##$ZGOPTNS= <>
##$ZL1= 120
##$ZL2= 120
##$ZL3= 120
##$ZL4= 120
##$ABSF1= 14.98509
##$ABSF2= -5.573092
##$ABSG= 5
##$ABSL= 3
##$ALPHA= 0
##$AQORDER= 0
##$ASSFAC= 0
##$ASSFACI= 0
##$ASSFACX= 0
##$ASSWID= 0
##$AUNMP= <proc_prof1d_extract_pilot.lims>
##$AXLEFT= 0
##$AXNAME= <>
##$AXNUC= <1H>
##$AXRIGHT= 0
##$AXTYPE= 0
##$AXUNIT= <>
##$AZFE= 0.1
##$AZFW= 0.1
##$BCFW= 0
##$BC_mod= 0
##$BYTORDP= 0
##$COROFFS= 0
##$CY= 15
##$DATMOD= 1
##$DC= 0
##$DFILT= <>
##$DTYPP= 0
##$F1P= 0
##$F2P= 0
##$FCOR= 0.5
##$FTSIZE= 32768
##$FT_mod= 6
##$GAMMA= 0
##$GB= 0
##$INTBC= 1
##$INTSCL= 1
##$ISEN= 128
##$LB= 0
##$LEV0= 0
##$LPBIN= 0
##$MAXI= 10000
##$MC2= 0
##$MEAN= 0
##$ME_mod= 0
##$MI= 0
##$NCOEF= 0
##$NC_proc= -8
##$NLEV= 6
##$NOISF1= 0
##$NOISF2= 0
##$NSP= 0
##$NTH_PI= 0
##$NZP= 0
##$OFFSET= 14.98509
##$PC= 1
##$PHC0= 93.87817
##$PHC1= 0
##$PH_mod= 1
##$PKNL= yes
##$PPARMOD= 0
##$PPDIAG= 0
##$PPIPTYP= 0
##$PPMPNUM= 2147483647
##$PPRESOL= 1
##$PSCAL= 4
##$PSIGN= 0
##$PYNMP= <proc.py>
##$REVERSE= no
##$SF= 400.02
##$SI= 32768
##$SIGF1= 0
##$SIGF2= 0
##$SINO= 400
##$SIOLD= 32768
##$SPECTYP= <>
##$SREGLST= <1H.CDCl3>
##$SSB= 0
##$STSI= 32768
##$STSR= 0
##$SW_p= 8223.68421052631
##$SYMM= 0
##$S_DEV= 0
##$TDeff= 65536
##$TDoff= 0
##$TI= <>
##$TILT= no
##$TM1= 0
##$TM2= 0
##$TOPLEV= 0
##$USERP1= <user>
##$USERP2= <user>
##$USERP3= <user>
##$USERP4= <user>
##$USERP5= <user>
##$WDW= 1
##$XDIM= 32768
##$YMAX_p= 431301061
##$YMIN_p= -639980
##$CURPLOT= <Network HP LaserJet P1505>
##$CURPRIN= <$Network HP LaserJet P1505>
##$DFORMAT= <normdp>
##$LAYOUT= <+/1D_H.xwp>
##$LFORMAT= <normlp>
##$PFORMAT= <normpl>
##$SURQMSG= 1
$$ End of Bruker specific parameters
$$ ---------------------------------
##NTUPLES= NMR SPECTRUM
##VAR_NAME=  FREQUENCY,     SPECTRUM/REAL,   SPECTRUM/IMAG
##SYMBOL=    X,             R,               I
##VAR_TYPE=  INDEPENDENT,   DEPENDENT,       DEPENDENT
##VAR_FORM=  AFFN,          ASDF,            ASDF
##VAR_DIM=   32768,         32768,           32768
##UNITS=     HZ,            ARBITRARY UNITS, ARBITRARY UNITS
##FACTOR=    0.250966925370066, 1,           1
##FIRST=     8223.43324360094, 80058,        -119465
##LAST=      0,             -84445,          19038
##MIN=       0,             -639980,         0
##MAX=       8223.43324360094, 431301061,    0
$$ Real data points
##PAGE= N=1
##DATA TABLE= (X++(R..R)), XYDATA
$$ [...]
19486A34162L5038j1375N8145Q7270g9320j68407O1178b9194A3935d6115r2141
19475a38256L0277P596A45081n7227c27553B04041B7848d77487h6758B00826B1826
19463c6918k35597h9850b2121k8582n8973j3437c2901J4956j18539A91517g3739
19451B05012J09766a73090P4657b5942k40013h6847r4079c4023k12730P5301q158
19440a79610I3658C9667e391j67988c2900B25415h2654b7819H969b60527E2122
19428a6518A9295f7339j61278j9127k75954A20549c22457B51312L7664A41092
19417b05025E8718c57036a36397K4472k1518d3942k9969A3815M657d3118A74961
19405b6376g630q8354n1727j22454I8485R777p935a02742a1011j92855G2574d22509
$$ y = [134162, 169200, 157825, 215970, 303240, -79320, -247727, -186549, -29194, 13935, -46115, -138256, -107979, -100383, 145081, 87854, -327553, 204041, 27848, -477487, -86758, 200826, 21826, -36918, -272515, -89850, -22121, -50703, -109676, -123113, -32901, -17945, -136484, 191517, -73739, 205012, 314778, -173090, -98433, -25942, -265955, -86847, -180926, -34023, -246753, -171452, -179610, 93658, 39667, -5391, -173379, -32900, 225415, -82654, -27819, 8969, -260527, 52122, -16518, 19295, -67339, -228617, -247744, -523698, 120549, -322457, 251312, 288976, 141092, -205025, 58718, -357036, -136397, -111925, -133443, -43942, -73911, 13815, 18472, -43118, 174961, -26376, -7630, -95984, -147711, -270165, 98485, 108262, 100327, -102742, -11011, -203866, 72574, -422509]
19392a90030A82909a15822k2985k93701i8367C0715J8385A9657i4614G3865M5235
19381A19100a51904C3204a07535F4093J08254a38771o0381B6191c57263G571e7980
19369A15314m5657J47656j00625l3771d3430m1152K9422o0587N6977a8348j67666
19358a86014A17712b21136m0962I8539d6047j8876m8381A85638c6421k31742A87807
19346I957c6123n5829k55625J5628a04615n9368G2362c223A18652e6936j00376
19335a57312b4945k34733i3855H6901b17775N0959J7815I8969a27314d8839A18407
19323c7555j03991l426l7343F4944A2973g7735c735k13985a01387L6716k5888
19312i0559B58809c67378a01091m559q0343d3800k53509G4759c08995A42595B717
$$ y = [-190030, 182909, -115822, -138807, -432508, -98367, 30715, 49100, 19657, -94614, 73865, 119100, -151904, 33204, -107535, 64093, 172347, -138771, -199152, 26191, -357263, 7571, -57980, 115314, 69657, 217313, 116688, 82917, -43430, -84582, -55160, -115747, -58770, -18348, -186014, 117712, -221136, -262098, 98539, -46047, -64923, -113304, 185638, -36421, -268163, 187807, 9957, -36123, -91952, -347577, -331949, -104615, -163983, 72362, -3223, 118652, -56936, -157312, -24945, -259678, -93855, 86901, -217775, -166816, -149001, 98969, -127314, -48839, 118407, -37555, -141546, -144972, -182315, 64944, 12973, -77735, -3735, -217720, -101387, -64671, -90559, 258809, -367378, -101091, -105650, -185993, -43800, -297309, 74759, -308995, 142595, 2717]
19300g4179A72313F8535J56612A08328a03888r2948R6922j07986i6631j144q0235
19289a78010M4597A35664b57277C79685H9744a84619M1396k709B0259e4162k03555
19278b57717g0895j87740j39070a45334G7704a63815r5212a07848k45844N3342
19268c00350a3730k08989e3727j969H7423a74380A9117g4632j91586O9206A43176
19256b04829L0590p7b8211i915E1717e6220D6447f7552b1438k24578A31639H629
19243b37730F2570h2462l28785I050d3766H6100i8610J6305d0383C6578J81090
19232B17668n6282a01057m9059K5495a925r5274A80180a20947F694O0679c467
19220a29454L6758j88085A52842A2964P2237h7241j89217d0795G2394l0948a18257
$$ y = [-74179, 172313, 68535, 225147, 108328, -103888, -196836, -99914, -207900, -96631, -97775, -178010, -133413, 135664, -257277, 379685, 89744, -184619, -143223, -145932, 20259, -54162, -257717, -70895, -258635, -397705, -145334, 77704, -163815, -259027, -107848, -353692, -300350, -13730, -222719, -53727, -55696, 87423, -174380, 19117, -74632, -266218, -197012, 143176, -204829, -174239, -174316, -28211, -9915, 51717, -56220, 46447, -67552, -21438, -246016, 131639, 8629, -237730, 62570, -82462, -411247, 9050, -43766, 86100, -98610, -82305, -40383, 36578, 217668, 161386, -101057, -150116, -124621, -1925, -97199, 180180, -120947, 6694, 67373, -3467, -129454, -92696, -280781, 152842, 12964, 85201, -87241, -276458, -40795, 72394, 41446, -118257]
19208a52319O8115e499j15495N7493A22159J01280h8652q8094N7521k2018p9691
19197b20934C6745a02679l87485H5262a12892k009G9338a03642k89223H8050k8037
19186F0013a08107B21999I5932a25438n9624R381f5221B7290a84857a5887p4227
19175i0114P914A95688f4779J6567l70887c0927j60338b9479J386j25831A73828
19163a26820l00042D3919a19670n3919j58674F0465K17430b09663h4240k5312
19153a09552q4546M0911N2541k13969a02092E9050b42379B61136c58344J76857
19143a81487L8434g0168J5652I0163c40094L1333i6210B81760j21107f9291A18604
19131b34733J03843p4337k4212N2110P4799L7345b4564B6205a7707k63125J12759
$$ y = [-152319, -84204, -5499, -120994, -63501, 122159, 223439, -88652, -176746, -119225, -141243, -220934, 36745, -102679, -490164, 85262, -112892, -114901, 79338, -103642, -392865, 88050, 60013, -108107, 221999, 95932, -125438, -185062, -175681, -65221, 27290, -184857, -15887, -90114, -82200, 195688, -64779, -48212, -419099, -30927, -191265, -29479, -28093, -153924, 173828, -126820, -426862, 43919, -119670, -173589, -332263, 60465, 277895, -209663, -84240, -109552, -194098, -153187, -100646, -314615, -102092, 59050, -242379, 261136, -358344, -181487, -143053, -70168, -54516, 90163, -340094, -308761, -96210, 281760, 160653, -69291, 118604, -234733, -130890, -205227, -229439, -177329, -102530, -65185, -24564, 26205, -17707, -280832, -168073]
19120a68073m0519f9256j83728c7317k6680C2535e8742j38738B65401A23016J29549
19109B52565C4196e6448J4089j48525j23481c4671J2370B69706q1810e5433H8619
19097i0653j04542D7532c7284B2212a40077a8252A96678H4846C0774b94667g1035
19085D468J88936B247J49474n6619D0473L6392R584b27437a2117B76316a5303
19073b40693d378D17492a24856p1720A16252k998b79620e8244p6853p4392k57664
19062d67153b12290c8067p126k8270L0251A00407h8085G3502J07810A9004P5414
19051I4418a03908C00808c24737J56552P3417J7124f618A46952l1058B779a04602
19039I9910b8619A67247D8997l136J63771b76560a18812d7355j43601N5063j04232
$$ y = [-168073, -208592, -69256, -252984, -37317, -63997, 32535, -58742, -197480, 265401, 123016, 252565, 34196, -56448, -42359, -190884, -314365, -34671, -22301, 269706, 187896, -55433, 88619, -90653, -195195, 47532, -37284, 22212, -140077, -18252, 196678, 84846, 30774, -294667, -71035, 4468, 193404, 2247, 151721, 95102, 40473, 76865, 86449, -227437, -12117, 276316, -15303, -240693, -4378, 417492, -124856, -196576, 116252, 113254, -279620, -58244, -135097, -209489, -467153, -212290, -38067, -45193, -73463, -43212, 100407, -88085, 73502, 181312, 19004, 94418, -103908, 300808, -324737, -168185, -94768, -77644, -6618, 146952, 115894, 2779, -104602, 99910, -28619, 167247, 48997, 45861, 209632, -276560, -118812, -47355, -190956, -135893, -240125]
19028b40125Q7330B43700a05288A01216f4622j05359N2167N56D7669a18086r8867
19017b16953c4951m9441a9191g020l1137j23427F1208J7376C0633J17236P3212
19006B21081a83944P8479A84356l9608j1016h8635l07544J36075a8008j32513
18996a50521A09153K04279i9802L5972K9338B32152B5127b38713i0093n1142R361
18985a31874l634A38115a78745g493I1743b51970b2741j06737j08917O3542l38959
18974e13812a53129A29219d2352A51900M4147f28774A38785n8758c4396k81679
18964c16075i3746D0176e2432j75808K776p3040J25132k0791A03628c8264m1712
18953g9976l24970a4896H0985i9215A33987a64097A254b85702B66814I7971P0154
$$ y = [-240125, -152795, 243700, -105288, 101216, -64622, -169981, -117814, -117258, 47669, -118086, -216953, -34951, -84392, -19191, -7020, -38157, -161584, 61208, 78584, 30633, 147869, 221081, -183944, -105465, 184356, 144748, 133732, -88635, -396179, -260104, -18008, -150521, 109153, 313432, -99802, -63830, -34492, 232152, 25127, -238713, -90093, -141235, -131874, -135508, 138115, -178745, -7493, 91743, -251970, -22741, -129478, -238395, -174853, -513812, -153129, 129219, -42352, 151900, 196047, -628774, 138785, 80027, -34396, -316075, -93746, 40176, -52432, -228240, -225464, -298504, -173372, -194163, 103628, -38264, -79976, -404946, -14896, 80985, -99215, 133987, -164097, 1254, -285702, 266814, 97971, 168125]
18942A68125J93565b87620j947A973J22316b45111M3057B71923b62013F6809J32046
18931A98855C8996a82231H2177e05437A09819a79317Q7524b578C5421b068B13400
18919A91025b55743e4040M177j18777A18923G195b48862e7613b193j68764o4154
18908b35111A86679H4139b57652f1501E77369c13209A5890b86613J35475L6524
18898a14614j91687H6378i9116b0845j82469A560h932A46576c35078J37156A03784
18886B76929b38881E3244b1863E2452e6221F507a76362o3422a00791B93616a63169
18874A02049C436f7823I0975c7612j29320J2440g0492k1329a6502l5917J326j62627
18862b13720B42005J4293b3712B4162g8033k11800J05012n0404a05544A52264
$$ y = [168125, 361690, -287620, -289567, 1973, 124289, -245111, -202054, 271923, -262013, 66809, 198855, 38996, -182231, 82177, -505437, 109819, -179317, -91793, -2578, 35421, -2068, 213400, 191025, -255743, -54040, -49863, -168640, 118923, 7195, -248862, -57613, -2193, -170957, -235111, 186679, 84139, -257652, -61501, 577369, -313209, 15890, -286613, -151138, -114614, -306301, 86378, -99116, -20845, -203314, 1560, -8932, 146576, -335078, -197922, 103784, 276929, -238881, 53244, -21863, 52452, -56221, 6507, -176362, -239784, -100791, 293616, -163169, 102049, 3436, -67823, 90975, -37612, -166932, -154492, -70492, -91821, -16502, -52419, -51093, -213720, 242005, 256298, -23712, 24162, -78033, -289833, -184821, -235225, -105544, 152264]
18851i5877A41838q362B8431c7328a5719j21623C1293a69968d0606C0403a61031
18839a57961f0799j52564M8420E3369J86439B039c07623B45713a23273B0337a56598
18827a63708l7243b9948r2528j22694k18738C4113J60128N6429F7687j4549i243
18815g7657A18503b44534A92427i6741A06265c11504F7215K4447J78412L972c81367
18803g972B2788e6629C16884a749o3024G1406g1643E0528b29186A5013J3815a90449
18790a02593M2967B90434a64375J1379B36879h4565q3778p2926h3996P224F6863
18778d6851j10794q0405j28433b3416G8447B5648a60980M1840C2856b31558E169
18766A51562b09714c3571k55325h1167B02097a03962B30463a01372p924F6978
$$ y = [-95877, 141838, 133476, 28431, -37328, -15719, -137342, 31293, -169968, -40606, 30403, -161031, -157961, -60799, -213363, -164943, 53369, 239808, 2039, -307623, 245713, -123273, 20337, -156598, -163708, -200951, -29948, -122476, -245170, -463908, 34113, 194241, 250670, 67687, 53138, -9243, -77657, 118503, -244534, 192427, -96741, 106265, -311504, 67215, 91662, 270074, 274046, -381367, -7972, 22788, -56629, 316884, -1749, -64773, 71406, -71643, 50528, -229186, 15013, 28828, -190449, -102593, -59626, 290434, -164375, -152996, 236879, -84565, -168343, -241269, -83996, -76772, 66863, -46851, -157645, -238050, -366483, -23416, 78447, 25648, -160980, -119140, 32856, -231558, 5169, 151562, -209714, -33571, -288896, -81167, 202097, -103962, 230463, -101372, -109296, 66978]
18755i0606j28425A00197b31304M9050K2857P4548A55963b67397A42505c14748
18744I5701E525b08356l8880C838c11867b90j62773O7906H0137a73020k5561A7004
18731g1368k5824j40502K1772j99926K07461A12721a57405f2221J8025A19890
18720b89648E4575h6709E2880g3731b5444B12930e7062j2633l42434a12422n7981
18709a70403Q4316k86012H2942b03846K4356B67298c46116a32950B35275H0573
18698A45898c184A28510m0103b7374j16444D3204a54078m2960K6506m6015k50478
18687d67025J14558b0016n21451B21694c8737Q707A85471m7509o7608Q2757J52797
18676C05908A29203a05801A21725a84832H2580a22311c9814j02785j75348a43222
$$ y = [-90606, -219031, 100197, -231304, -182254, -159397, -84849, 155963, -267397, 142505, -314748, 95701, 5525, -208356, -247236, 3838, -311867, -290, -163063, -95157, 80137, -173020, -198581, 17004, -71368, -97192, -237694, -215922, -415848, -208387, 112721, -157405, -62221, -44196, 119890, -289648, 54575, -86709, 52880, -73731, -25444, 212930, -57062, -69695, -412129, -112422, -170403, -86087, -372099, 82942, -203846, -179490, 267298, -346116, -132950, 235275, 80573, 145898, -3184, 128510, 88407, -27374, -143818, 43204, -154078, -197038, -170532, -216547, -467025, -352467, -20016, -541467, 221694, -38737, -30030, 185471, 137962, 70354, 153111, 305908, 129203, -105801, 121725, -184832, 82580, -122311, -39814, -142599, -317947, -143222]
18665B9985a86759h9289k91581A55443a32511n6236Q7695B35519A14481a41709
18654b48015l3542B57497a29645f1784j32777E7802J61266a83362e5122r9172
18644a54294d7044j48879h4980m0229N21B11287b13971j43274a59801F8930P5339
18633A44269b29335g6278j7482a6120j10099i105j3585B03641F7775b31489b3053
18621b33230E475c91182H5259c4096D4763J9581a57162N907K2079D0177d62725
18609B66834j17911o1398b97631e3701A34923J2889c06311h4528A00950b18680
18598c484j79579A91040a21174j4779G4603b85009a5455B20462f9j39438O6147
18587g3360G2795g6878c5946A67745a5425k5182n3702A90704E287c2819O667j47940
$$ y = [29985, -186759, -89289, -380870, 155443, -132511, -188747, -101052, 235519, 114481, -141709, -248015, -281557, 257497, -129645, -61784, -194561, 57802, 219068, -183362, -55122, -154294, -47044, -195923, -84980, -125209, -124688, 211287, -213971, -357245, -159801, 68930, 144269, -229335, -76278, -93760, -16120, -126219, -9105, -22690, 203641, 67775, -231489, -23053, -233230, 5475, -391182, 85259, -34096, 44763, 64344, -157162, -151255, -129176, 40177, -462725, 266834, 148923, 87525, -297631, -53701, 134923, 147812, -306311, -84528, 100950, -218680, -3484, -183063, 191040, -121174, -135953, 74603, -285009, -15455, 220462, -69, -139507, -73360, 72795, -76878, -35946, 167745, -15425, -40607, -94309, 190704, 5287, -32819, -26152, -174092]
18575a74092B11625c2500p2782D8864e7592A19001j5028l7220C0068h7650j00225
18564a87875C3635G849a6142n4285A6548a12945j63032Q9835f5366B24049a67454
18552A98886P2079c13907A40179b82056a17568k3480a6665l0101j78593l0073
18542b55432j45679A46583l7843K195J03667a90541h5610o3236n0800C29547L0932
18531C60479h8638p8054b619m3326j64086J4355A74545J8822d925j96529l8697
18520b40151c1081B74071h3564A46664o6248c45149B5535a06323c9579A57319
18509E0599P4528j1205J31094d56660A33088b50464E8931k0934e2963B07841A03601
18497a46192N666k3502j173A36664b78257C6462A6251R3233M7604c06245B69284
$$ y = [-174092, 211625, -32500, -105282, 48864, -57592, 119001, 103973, 66753, 30068, -87650, -187875, 33635, 7849, -16142, -70427, 16548, -112945, -275977, -186142, -65366, 224049, -167454, 198886, 270965, -313907, 140179, -282056, -117568, -141048, -16665, -46766, -225359, -255432, -401111, 146583, 108740, 110935, 214602, -190541, -85610, -148846, -199646, 329547, 360479, -88638, -166692, -2619, -45945, -210031, -195676, 174545, 193367, -4925, -201454, -240151, -31081, 274071, -83564, 146664, 80416, -345149, 25535, -106323, -39579, 157319, 50599, 125127, 113922, 245016, -456660, 133088, -250464, 58931, 37997, -52963, 207841, 103601, -146192, -140526, -164028, -165201, 136664, -278257, 36462, 16251, 109484, 157088, -306245, 269284]
18485E2548b3358I1239a61126c2872l73498B0447b32426i893j13608f760I2464
18473B7807P8648a38676M2955b4912A85839G0170k376O6798b66791E966e8634
18461c5168C49184a10194B0126J4035P9689e9889F3784D19Q4307a15165I3209
18449A17534D4958J41923J7071G8401e3955j63596G1866a78938a0437j1953m8694
18438g1084G1533c039j95475K5961B31150n2155c83084d3541l13941J55681c0446
18426i28k91720B03746e4483J6207k64948a03824k47642A23790a42343c9065E9338
18414H6443b30156H120i3151L0969B3089N4416f2944A19589d1265j5090k3397
18403g9752o4650B12666a04905A77374i5207f710q843k94309f6407a3462C55197
$$ y = [52548, -23358, 91239, -161126, -32872, -406370, 20447, -232426, -9893, -123501, -6760, 92464, 27807, 106455, -138676, -95721, -24912, 185839, 70170, 67794, 134592, -266791, 5966, -58634, -35168, 349184, -110194, 20126, 34161, 113850, -59889, 63784, 419, 84726, -115165, 93209, 117534, 44958, 186881, 203952, 78401, -53955, -217551, 71866, -178938, -10437, -22390, -71084, 71533, -3039, -198514, -172553, 231150, 178995, -383084, -43541, -357482, -201801, -30446, -928, -292648, 203746, -54483, -38276, -303224, -103824, -351466, 123790, -142343, -39065, 59338, 86443, -230156, 8120, -93151, -62182, 23089, 77505, -62944, 119589, -41265, -56355, -79752, -144402, 212666, -104905, 177374, -95207, -6710, -15553, -309862, -66407, -13462, 355197]
18391B07472A207a53217H6766j0737K91825I4551e4720C7925e5619k32743f0536
18379b83169A5935J56864C862a60644A60906b37611p983a03066I5876a61866k42733
18368d04599a97859j0112c9760C7337R241c56799A36695P4309b86335a6920B0604
18356c51021h6347b572j24386A32237a53176M9909C86156a76456A0650J72921
18346A83571a60887C47949g8348j46192E0624b877r953j6506k8045p9028j70094
18335c06503C58938c5896k62244Q0614h6455A78836E9796k2632b20639C7210R7431
18324A34641a82357O5269e3016j6368B8813K32566F8406c1692m1143B12157p027
18313B05130I7459f2349k97008C3568a87754d5746F9991b77319e8246B64732a77219
$$ y = [207472, 1207, -153217, 86766, 76029, 367854, 94551, -54720, 37925, -55619, -288362, -60536, -283169, 15935, 172799, 3862, -160644, 160906, -237611, -245594, -103066, 95876, -161866, -404599, -197859, -207971, -39760, 37337, 46578, -356799, 136695, 211004, -286335, -16920, 20604, -351021, -86347, -2572, -126958, 132237, -153176, -103267, 386156, -176456, 10650, 183571, -160887, 347949, -78348, -224540, 50624, -2877, -12830, -29336, -57381, -136409, -306503, 358938, -35896, -298140, -217526, -86455, 178836, 59796, 37164, -220639, 37210, 134641, -182357, -117088, -53016, -69384, 28813, 261379, 68406, -31692, -72835, 212157, 205130, 97459, -62349, -359357, 33568, -187754, -45746, 69991, -277319, -58246, 264732, -177219]
18301A4153c85125b7904A0586g3565c5364M750j92836b7627j15667l0110C7042
18289c48903f3725A08934g9582j09179d0129C740Q6552M7008j0893n5640r268
18278F1499a63310B55959j5095B0690a74144b5369B1993N7168a46714C99578a14832
18266B84025b68190R1423j8495J4378l1324n626H4526l1391h9078A38067K252
18255A40319b90092k1804A72108j8353b1435B38702A04335j317a12829A68629
18244a37247E595a66226G1068i9882j7117b2376A75208c09324J14529k35357A27168
18232A14293g276k40739j10725C12767a26652B9558a44889C7364h9970l64478
18222d54448a33954j14306C5827K6065c55802A23684a40199B14660f033k63156
$$ y = [14153, -385125, -27904, 10586, -73565, -35364, -30614, -223450, -27627, -143294, -173404, 37042, -348903, -63725, 108934, -79582, -188761, -40129, 3740, 90292, 137300, 126407, 70767, 61499, -163310, 255959, 240864, 20690, -174144, -25369, 21993, 79161, -146714, 399578, -114832, 284025, -268190, -176767, -195262, -180884, -212208, -217834, 84526, 53135, -89078, 138067, 140319, -290092, -311896, 172108, 153755, -21435, 238702, 104335, 103018, -112829, 168629, -137247, 5595, -166226, 71068, -99882, -116999, -22376, 175208, -309324, -194795, -430152, 127168, 114293, -7276, -248015, -358740, 312767, -126652, 29558, -144889, 37364, -89970, -454448, -133954, -248260, 35827, 61892, -355802, 123684, -140199, 214660, -6033, -269189]
18212b69189G9418B8937A992b59497k4056a05734A75057h0736b2894A20206m4847
18201G5359J00223a13939j84177J32492Q732O7592J709K8585l55403a72458r913
18190a82371A34951a4129k71242I7116i0245o3497a2689A14778o832d50255a46506
18178b54532A12230L8789J14524F2708j2293a39476N5078p6565k0113B12086b96721
18166h3703k6048q8124B8336J75038i5966b5397j37186j00872A65408n9837a43110
18154b71239B42162b5899p7251C380c12695A5744K30659G8194a94928K346R3992
18143i8590l26618a31878d6328k07861C00448M8238a991D005N8230k0465K31962
18132B73732j28779a79172E5367a67670j31963A12335a55126J5303J9346E8915
$$ y = [-269189, 79418, 28937, 1992, -259497, -283553, -105734, 175057, -80736, -22894, 120206, 75359, 175582, -113939, -298116, -165624, -156892, -89300, -87591, -59006, -414409, -172458, -182371, 134951, -14129, -285371, 97116, -90245, -153742, -12689, 114778, 107946, -450255, -146506, -254532, 112230, 151019, 265543, 62708, 50415, -139476, -84398, -160963, -181076, 212086, -296721, -83703, -109751, -197875, 28336, 203374, -95966, -25397, -162583, -263455, 165408, 105571, -143110, -271239, 242162, -25899, -103150, 3380, -312695, 15744, 246403, 78194, -194928, -192582, -98590, -425208, -131878, -46328, -254189, 300448, 348686, -1991, 4005, 62235, 41770, 273732, 144953, -179172, 55367, -167670, -299633, 112335, -155126, -139823, -120477, 58915]
18121f6226j01958r9232o231G0212M5401L04599j58314C2888e2109j66079C32275
18109F9714a07627A14074a18092k7600M3008B535a32948b0825k88067F6610K12808
18098B79418b18621L9040K9444B20017R8551F7151B9832K04605c67718A88629
18087A79850g0724k29078E7327L36139d3159H4335c5517J7075n19653B54174i1185
18075B9745l774J8792h725A1625D906K7112e4981j04997j7735G2229i4337d3776
18062G4377b39620M5537A53844i6867A9057c354C08748j24519j0045F5281c04180
18050a06059A9685Q0779a93717A19031K9853G684P8017J97879a5701B31895E3192
18038c2664k21828e2000A00426C08J76906a93424h6440O914D404a47095A79246
$$ y = [-66226, -168184, -267416, -273647, 70212, 115613, 420212, 261898, 32888, -52109, -218188, 332275, 69714, -107627, 114074, -118092, -145692, -102684, 2535, -132948, -20825, -308892, 66610, 279418, -218621, -179581, -150137, 220017, 318568, 67151, 29832, 234437, -367718, 188629, 179850, -70724, -299802, 57327, 393466, -43159, 84335, -35517, -18442, -538095, 254174, -91185, 29745, 25971, 44763, -8725, 11625, 4906, 32018, -54981, -159978, -177713, 72229, -94337, -43776, 74377, -239620, -194083, 153844, -96867, 19057, -3354, 308748, 184229, 174184, 65281, -304180, -106059, 19685, 100464, -193717, 119031, 148884, 7684, 85701, 283580, -15701, 231895, 53192, -32664, -254492, -52000, 100426, 308, 177214, -193424, -86440, -79526, 4404, -147095, 179246]
18026b35972a14040b5063f104j35524A62347a02944A60474i2893A11605k0661
18016I0944K7915f1651o0499C34958A45859b94947a01220O575L8852A09380n2920
18005E6460J509e4167a0132p2170F2253a26453k13111c9479D2582A4401b4658
17993b67866k6029A0561J23444l4577d5078j26289B5989M43422c06336B6747d69064
17981i7779B04806b81275e53m1094n6087M5416C66370A42961C775P5056j3132
17970F5699d8555J5103M3A44465O400R7059C871d70293K25604E1274O8302m840
17958A14736D7629a00071c5574B79375C9903a43798M2332I8296J28289a22848
17947g8123m2853B60442f3703A72548g126C94976j71532a20599K9318M3154j01233
$$ y = [-235972, -114040, -25063, -6104, -141628, 162347, -102944, 160474, -92893, 111605, 90944, 118859, -61651, -122150, 334958, 145859, -294947, -101220, -94645, -55793, 109380, 56460, 57969, -54167, -10132, -82302, 62253, -126453, -339564, -39479, 42582, 14401, -24658, -267866, -293895, 10561, 134005, 99428, -45078, -171367, 25989, 469411, -306336, 26747, -469064, -97779, 204806, -281275, -553, -41647, -97734, -52318, 366370, 142961, 3775, 78831, 65699, -48555, -33452, -33409, 144465, 150865, 247924, 3871, -470293, -244689, 51274, 119576, 114736, 47629, -100071, -35574, 279375, 39903, -143798, -101466, 98296, 226585, -122848, -78123, -120976, 260442, -63703, 172548, -7126, 394976, 223444, -120599, -91281, -48127, -149360]
17936a49360M3817r8703A91138a73295A36003d4261B27669a21172e0664F1483
17925I3674b68261a23397l138A25779B6174J24651l3944b0433j8769A34708e05461
17913b91077a8820o6367j64810E0545L452a95180A30946J27898a35676d5630j99239
17902b44869R1653d4585C53656f07254B7221b02409b4047A1615c7701j08283A55926
17890C38655a09400H2126J80747h6565B12435A5632a25150p5529a2646A58349
17879a39501F194J40596b71762F4140n142N6557J3639d9830A03422e477D5311
17867A22770b29856A29288J0176K18802a26769A78089b76410K4740a7690B06368
17856C35153a43145B39135a80420j40071g7610E9404k9451P6366B5876b49746
$$ y = [-149360, -105543, -204246, 191138, -173295, 136003, -44261, 227669, -121172, -50664, 61483, 93674, -268261, -123397, -126535, 125779, 26174, 150825, 116881, -20433, -39202, 134708, -505461, -291077, -18820, -85187, -249997, 50545, 53997, -195180, 130946, 258844, -135676, -45630, -244869, -153216, -44585, 353656, -607254, 27221, -202409, -24047, 11615, -37701, -145984, 155926, 338655, -109400, 82126, 262873, -86565, 212435, 15632, -125150, -200679, -12646, 158349, -139501, 6194, 146790, -271762, 64140, 58998, 115555, 129194, -49830, 103422, -5477, 45311, 122770, -229856, 129288, 139464, 358266, -126769, 178089, -276410, -251670, -17690, 206368, 335153, -143145, 239135, -180420, -320491, -77610, 59404, 29953, 106319, 25876, -249746]
17845A47269J34037B2813J87555D9528a78532B59810L784c5912A67731K3955D7586
17833I9500O9252i0078m3584d7171I1885c6090H2946a87346f0830a5373B5085
17821c89645B8235O30642a21893N7323C0901Q3959a98769G380L306L6224q998
17810C7912a36478A88539p1158D0545j0545N8363B9439c9055H7955d3460I9878
17798A1638c5467j24064j75064H409C872a74945e800p2471b9738A63314o6178
17787I7136J86023a67954A85647J9203N9542k9632A0547J16043c9106A2042Q5054
17776I7096k7032a37886C1657p165K15223j17790f2515A81039m448M6424b9643
17764a52358K0785C73804F0960a19886A40535b5846A11075K9258J18106a06130
$$ y = [147269, 281306, 22813, 210368, 49528, -178532, 259810, 263594, -35912, 167731, 191686, 47586, 99500, 168752, -90078, -133662, -47171, 91885, -36090, 82946, -187346, -60830, -15373, 25085, -389645, 28235, 658877, -121893, -64570, 30901, 114860, -198769, 7380, 10686, 46910, 37912, -136478, 188539, 117381, 40545, 30000, 88363, 29439, -39055, 87955, -43460, 99878, 11638, -35467, -159531, -334595, 8409, 3872, -174945, -5800, -78271, -29738, 163314, 97136, 283159, -167954, 185647, 204850, 264392, 234760, 10547, 126590, -39106, 12042, 97096, 70064, -137886, 31657, 24492, 239715, 121925, -62515, 181039, 176591, 223015, -29643, -152358, -131573, 373804, 60960, -119886, 140535, -25846, 111075, 140333, 258439, -106130]
17753b8416C9132A7483P0571a17644B31282I6318A4631Q8243h4526B0440a75175
17741B53027n9184I2822a48954B64482C6066a4896D0217P5208O3812l4300Q2123
17730B27060b2536A81688b35325H1351h85A88186a64602N1359M1804C4030K68188
17719C02218m8673A21506e8529I002N2885d5419P312A28399r863a19676A30439
17707e3542A57964b78222C10875C3548a27608C85445I5246f2740J3200A00805
17696D3811a1004E274K1484h8618A00242N6760a96649M3871B96898j47134j5451
17685A34313K14324j34361o4840a54304l2467o8291D443b77085A36734b7411p8819
17674a06230B39088I9810P7372a25496A54703c1299r5910G2462e4064D18556A55996
$$ y = [-28416, 39132, 17483, 88054, -117644, 231282, 96318, 14631, 102874, -84526, 20440, -175175, 253027, 193843, 92822, -148954, 264482, 36066, -14896, 40217, 115425, 179237, 144937, 227060, -22536, 181688, -235325, 81351, -885, 188186, -164602, -113243, -71439, 34030, 302218, 253545, 121506, -58529, 9002, 61887, -45419, -38107, 128399, 118536, -119676, 130439, -53542, 157964, -278222, 310875, 33548, -127608, 385445, 95246, -62740, -49540, 100805, 43811, -11004, 5274, 26758, -88618, 100242, 157002, -196649, -152778, 296898, 149764, 134313, 348637, 214276, 149436, -154304, -186771, -255062, 4443, -277085, 136734, -27411, -106230, 239088, 99810, 177182, -125496, 154703, -31299, -127209, 72462, -54064, 418556, 155996]
17662B92204j45620a66645A92644h6226n2877k06595A45785o8119J64143J25451
17652C67260k5738l8344a88072F8602K99758A23511A6715J27130b41522A70752
17641A1123a11887L9904C27596B4303L14522d7409A47432h6319D08007p8891B5118
17629a08375A02298a22223B85574D3958J41567h5573B69581L96540c7155B37146
17618a45124A87604a03241I4763K65419c0990A69447m7737L37386A15954L69945
17608D85899j14662b3030B89977D7543J61642g0567C6522d3988D00732i8090I5428
17596A50811a21250D54905b43262H1661J46037N35549A34987a32380G7371b08750
17585h2048A0395L1569N9868c69833A30089K46415A06108R488b01590E0457O8886
$$ y = [292204, 146584, -166645, 192644, -86226, -139103, -345698, 145785, 77666, 241809, 367260, 341522, 303178, -188072, 68602, 368360, 123511, 16715, 143845, -241522, 170752, 11123, -111887, -71983, 327596, 24303, 338825, -47409, 147432, -86319, 408007, 329116, 25118, -108375, 102298, -122223, 285574, 43958, 185525, -85573, 269581, 666121, -37155, 237146, -145124, 187604, -103241, 94763, 360182, -30990, 169447, 121710, 459096, 115954, 485899, 371237, -23030, 289977, 47543, 209185, -70567, 36522, -43988, 400732, -98090, 95428, 150811, -121250, 454905, -243262, 81661, 227698, 763247, 134987, -132380, 77371, -208750, -82048, 10395, 41964, 101832, -369833, 130089, 376504, 106108, 115596, -201590, 50457, 119343]
17574A19343D3382a49977A67205N1727p5775h393a030D8985a75275d4847E3967
17562A8947a6267A81240f8636B50848m5951J860D8858b05341i0927A82570a19075
17550B47833l0833j3491D6896J71214d4110D1643Q609P6517J26946J46993j70942
17539B29766I8350F130L65321r2456o4900F0805J55012l1126J52248A11819L8078
17528A49897a02234I1883L82749k06971J7589M33080A88129L13200K87720C66201
17517D98322r1124A32489J83979m6752n3565L0804k0760L58659k20419k5004j21807
17506B17624K29551P3453J95066H1489L82810j80166M611q974j14186l7920J94675
17495C22339b19622L0336j00443B02250n3643J41438E6396J43022r4511b50178
$$ y = [119343, 43382, -149977, 167205, 218932, 143157, -8393, -1030, 48985, -175275, -44847, 53967, 18947, -16267, 181240, -68636, 250848, 204897, 206757, 48858, -205341, -90927, 182570, -119075, 247833, 217000, 203509, 46896, 218110, -44110, 41643, 50252, 126769, 253715, 400708, 229766, 98350, 6130, 371451, 278995, 214095, 60805, 215817, 184691, 336939, 111819, 149897, -102234, 91883, 474632, 267661, 285250, 718330, 188129, 501329, 789049, 366201, 498322, 407198, 132489, 316468, 269716, 216151, 246955, 226195, 584854, 364435, 339431, 217624, 447175, 520628, 715694, 81489, 464299, 284133, 288744, 279770, 165584, 127664, 322339, -219622, -189286, -289729, 202250, 148607, 290045, 56396, 199418, 104907, -250178]
17484F7269g873C0256M60305A39239a5337C74792j36150K92422E2721L9853J10206
17473B02780j6171q5492k0813K78902A6974K84009g3021A52264J44369j14294
17463A82339D8077d4987E94510b21046R3190A94996n1739F3294P3708J92973o7244
17452B62731G9133L59141k2426B7378J59809K12203J76522A30392l3548l6320
17442F0524M03425d2729A94876O0016O3647R1069A27062K53119A58893c4580C37151
17430E8851N0779J63417a3790E42291E8920B0781Q3911P4696J13599C36L0690
17419C1026K68285n2317J0925J46882F1031d8908B1955K59739j4447H0372J04808
17408A85180J63205A55755N6066F8525L02249G6789e9607B93697e232A33945J03845
$$ y = [67269, -7873, 30256, 490561, 139239, -15337, 374792, 238642, 531064, 52721, 92574, 202780, 186609, 101117, 80304, 359206, 16974, 300983, -73021, 152264, 296633, 182339, 48077, -44987, 594510, -221046, -127856, 194996, 143257, 63294, 137002, 329975, 262731, 79133, 438274, 415848, 27378, 187187, 399390, 575912, 130392, 96844, 60524, 463949, -42729, 194876, 254892, 318539, 409608, 127062, 380181, 158893, -34580, 337151, 58851, 109630, 273047, -13790, 542291, 58920, 20781, 104692, 179388, 292987, 336, 31026, 299311, 246994, 257919, 404801, 61031, -48908, 21955, 281694, 267247, 80372, 185180, 348385, 155755, 211821, 68525, 370774, 76789, -59607, 293697, -5232, 133945, 237790]
17397B37790p6343a12243D11931j5071A75932J4947K09254j9527A01933a32204
17386b3878A68057J27614A35577K8236J24121J22164j7737a22283E34367j85461
17376C48906b1140C05435L2262B5512R0689h3776B78080D35J48762L61115A76135
17364C72885K1180F7583b9656E75510j12078B25899J35998n5333A00347J93948
17354B94295A44243O5594l2362K57348f0387A75054L9622L1949L26188k53413
17344C19400A57736A7596J80274J28587d6783D00509A04290k7579J03289F1784
17333B45586P6765j18770O1295j09767k6789C6661e3306C20442M12467I9660Q7244
17322A86904K18120c5797A36682l6541L3680K38779a41282C08908J98580D658
$$ y = [237790, 161447, -112243, 411931, 396860, 175932, 190879, 400133, 380606, 101933, -132204, -23878, 168057, 295671, 135577, 163813, 287934, 410098, 392361, -122283, 534367, 348906, -21140, 305435, 337697, 25512, 116201, -83776, 278080, 435, 149197, 510312, 176135, 372885, 394065, 67583, -29656, 575510, 463432, 225899, 361897, 306564, 100347, 294295, 144243, 209837, 177475, 434823, -60387, 175054, 214676, 246625, 572813, 319400, 157736, 17596, 197870, 326457, -46783, 400509, 104290, 76711, 180000, 61784, 245586, 322351, 203581, 264876, 155109, 128320, 36661, -53306, 320442, 732909, 99660, 186904, 405024, -35797, 136682, 100141, 133821, 372600, -141282, 308908, 507488, 4658]
17311b6915A19836J38422G5331K58051j19110L94899k74161F0687J79295b5758
17300D91868B5290L54597Q3706j81589q2130H3404R5651K90954j03405l5770C2878
17288D16102b6661B36169r7446f1453F06507k77413n1132r2366L32882A93077
17277A5372K30748m5459K88978j61827J03635A83774l4887M24672k86191O9693
17267C57061J1525I8324M62631k67674b8721G0195J53258J70951J2646J95489
17257F02539G2633L60302R7632B21183R2912L6602r7739N9521E8815q952K40254
17246B90117f0801B18562J50841L26j70482J09525F4762O2752J10218R38j14197
17235A24473n2488L82443m911A55596J05937M06300A7528K15801P7481K2017J8151
$$ y = [-26915, 119836, 258258, 75331, 333382, 214272, 609171, 335010, 60687, 239982, -25758, 491868, 25290, 379887, 463593, 282004, 199874, 83404, 179055, 470009, 366604, 330834, 32878, 416102, -26661, 236169, 138723, -61453, 606507, 329094, 277962, 185596, 518478, 193077, 15372, 246120, 200661, 489639, 327812, 431447, 183774, 148887, 573559, 287368, 357061, 368586, 98324, 560955, 293281, -28721, 70195, 223453, 394404, 407050, 602539, 72633, 432935, 530567, 221183, 314095, 350697, 252958, 312479, 58815, 49863, 290117, -60801, 218562, 369403, 369729, 199247, 308772, 64762, 127514, 237732, 238670, 124473, 71985, 454428, 449517, 155596, 261533, 667833, 17528, 233329, 310810, 332827, 350978]
17224C50978A51012j1857J38962q0511n0910J26585k4911M7514o5542J62375j40142
17213B52575B6505L59172n7111M467m4135J20155L6930B12089a8709E40376B32940
17201D36590m6824J13194l8885P742B27458O3299j1332K06703l7805k4075r9570
17190C24678n2805M7419L44419F5161J29159P0971o7208d5166C09183K50602K70065
17179H29850l26095k30122J17989J37362j4334B17521L75669j43042R4664j14270
17169D30542A55671J66639J88408n0247k19315j01895M85941m3583j01241J39026
17159F19404j76134A25526K63070O2841A96671N00302k96017L05319j29020j15554
17149D61701J08593k13329j07754J79624J5545j2913J27810o3783K58616k78907
$$ y = [350978, 151012, 139155, 278117, 197606, 146696, 273281, 248370, 295884, 230342, 392717, 252575, 26505, 385677, 328566, 333033, 288898, 409053, 445983, 212089, -18709, 540376, 232940, 436590, 389766, 502960, 464075, 471817, 227458, 290757, 279425, 486128, 448323, 424248, 324678, 271873, 319292, 663711, 65161, 194320, 265291, 198083, -45166, 309183, 559785, 829850, 503755, 273633, 391622, 528984, 514650, 217521, 593190, 450148, 544812, 430542, 155671, 322310, 510718, 460471, 241156, 139261, 625202, 581619, 480378, 619404, 443270, 125526, 388596, 451437, 196671, 696973, 400956, 706275, 577255, 461701, 570294, 356965, 249211, 428835, 444380, 431467, 559277, 495494, 754110, 475203]
17139D75203R9128K2245B45503K7186J97566J64846r5171A28538M03533j15467
17129D16604K45557L2374l04120J07733I6988M40536m4631K27581q6120L50701
17119I85055l55742M3039n7039j56432Q2089k60950j4741L27461k18914j60024
17109B13802L56281P9734l06926O8929k048K0049j0502J54285k65264K13145K6549
17098E48034J17645J28523q7028J79617m29461L33938k95575J17850J40627J77857
17088I32027m58706K21543J513P6020j80367J8530J19633L4441m9166k04459J13857
17077F24866q0811J53554J53444j46251J60224j51167M3794j09026J8712m2753
17067F24586L9949M3254j34757O572M9743L21309N8242l03626j39692J33840K86253
$$ y = [475203, 574331, 596576, 245503, 272689, 470255, 635101, 539930, 128538, 532071, 416604, 662161, 694535, 390415, 498148, 96988, 537524, 492893, 720474, 634354, 985055, 629313, 672352, 615313, 458881, 540970, 280020, 265279, 592740, 373826, 213802, 570083, 649817, 342891, 411820, 409772, 429821, 419319, 573604, 308340, 521485, 548034, 665679, 794202, 707174, 886791, 457330, 791268, 495693, 613543, 754170, 932027, 473321, 694864, 696377, 772397, 592030, 610560, 730193, 764634, 715468, 511009, 624866, 544055, 697609, 851053, 704802, 865026, 713859, 757653, 648627, 667339, 624586, 664535, 707789, 573032, 579604, 629347, 950656, 1008898, 705272, 565580, 699420, 985673]
17056I85673l51179K33637o2455O9244j46960K76335J3212k88696P1582K71265
17046A071658k48392K63231l78095N00872k38119K23966n77759j73878O12599
17037A056083E12159l4073N47063m1107k0403J22627K6641r6866K20595K76466
17027A513102n65481J45458j31670L5431K15978k6866j18690n0411J47843L9980
17017A204674l4214j28092j0793K21774m25752J32329K96571l9948l8150q4205
17007A094194j43723J66204m8173M33460k51873l1589m2294J11111M8040m24099
16997I11258K41900j01714J73051K70167p9497p529j8116n6965J17025j65631
16987A283949J78056q9439J18590m14177L13448J58872j68524J24744Q4078l73667
$$ y = [985673, 634494, 868131, 805676, 874920, 727960, 1004295, 1017507, 728811, 800393, 1071658, 823266, 1086497, 708402, 1209274, 971155, 1195121, 617362, 443484, 1056083, 512159, 478086, 1025149, 984042, 963639, 1086266, 1112907, 1016041, 1236636, 1513102, 947621, 1093079, 961409, 996840, 1212818, 1185952, 1067262, 1016851, 1164694, 1204674, 1170460, 1042368, 1031575, 1253349, 827597, 959926, 1256497, 1216549, 1178399, 1094194, 950471, 1116675, 1068502, 1501962, 1250089, 1218500, 1176206, 1287317, 1335357, 911258, 1153158, 1051444, 1224495, 1494662, 1415165, 1407636, 1389520, 1332555, 1449580, 1283949, 1462005, 1372566, 1491156, 1076979, 1390427, 1549299, 1380775, 1505519, 1589597, 1215930]
16977A215930K48375k97142M71980j9041j09317k10421N07023m02146L59839n235
16967A759845m06751o1865N22789j88091R693J91395r9764K01650j98659J74746
16957A904988j79710j37063J43778J23424J17964j52421L502r6749O79123q35195
16947A571641M78300K1771k68703J48106j05457K05561L03773l72676j72854L81067
16937B190529J28040p6672R5941k03150L09685N53k12404J28046J30671j24055
16927B367184J37836Q4392l46954L65119r4254r7051J02303j39320L01724J27983
16917B808962k02896L16108k39075K76678j37517k87090J58972L29681k60918
16908B762905J88976j98043q1407K95763K38420j0966p9446j66267N03772R1181
$$ y = [1215930, 1464305, 1167163, 1639143, 1620102, 1510785, 1300364, 1807387, 1405241, 1765080, 1759845, 1353094, 1291229, 1814018, 1625927, 1635620, 1827015, 1727251, 1928901, 1730242, 1904988, 1725278, 1588215, 1731993, 1855417, 1973381, 1820960, 1824462, 1727713, 2406836, 1571641, 2049941, 2071712, 1803009, 1951115, 1845658, 2051219, 2354992, 1982316, 1809462, 2190529, 2318569, 2241897, 2337838, 2134688, 2444373, 2444926, 2232522, 2360568, 2491239, 2367184, 2505020, 2589412, 2242458, 2607577, 2513323, 2416272, 2518575, 2379255, 2680979, 2808962, 2606066, 2922174, 2683099, 2959777, 2822260, 2535170, 2694142, 3023823, 2762905, 2951881, 2753838, 2672431, 2968194, 3206614, 3195648, 3116202, 2949935, 3453707, 3544888]
16898C544888l83793k7489K13197Q8584P2083k5960J61946L05979k41586o6514
16888C641335R2996J46938J52826j95102K95493l32294O4790Q4723P4603L30005
16878D356313l57599R1668M16580j32685M59724l3314j29007j42914J66261k8126
16868D666901k5499K25031p7796K11820L45964K1015L4959J4256K16677o256J38404
16857E765476k65247L67815j12212K69503K01407k79539J27450N03801j30546
16848F447908K6453L54301j31095K38891N60082m45251R5376Q0848K13131M55936
16838G896580r6006K05330R4972L17378l09017K57145J23236M52336J5645O8222
16828I025821O5200K89192L59193l1879Q0449K78644N37924J2678Q434N73526
$$ y = [3544888, 3161095, 3133606, 3346803, 3435387, 3507470, 3481510, 3643456, 3949435, 3707849, 3641335, 3734331, 3881269, 4034095, 3838993, 4134486, 3802192, 3866982, 3951705, 4026308, 4356313, 3998714, 4090382, 4506962, 4374277, 4834001, 4800687, 4671680, 4528766, 4695027, 4666901, 4641402, 4866433, 4788637, 5000457, 5346421, 5367436, 5402395, 5416651, 5633328, 5627072, 5765476, 5500229, 5868044, 5755832, 6025335, 6226742, 5947203, 6074653, 6578454, 6447908, 6474361, 6828662, 6697567, 6936458, 7496540, 7051289, 7146665, 7227513, 7440644, 7896580, 7800574, 8005904, 8100876, 8418254, 8109237, 8366382, 8489618, 8941954, 8957599, 9025821, 9091021, 9380213, 9739406, 9707527, 9787976, 10066620, 10604544, 10617222, 10625656, 11199182]
16818A1199182k55400L54082M48603m4650K07366L71898K42954L35950J04984
16809A2964969M42487K76297L28531L06621J69727K95449M99617M80032J2623
16800A5776353N28981K68278L73942M39618M93905J25351L33749M31937Q67816
16791A9639930R2715O61352N18769L68842L17873R22821O70225N95582O74136
16782B4462245L86355O60389Q15736P75555L84761Q64785M82366O86891R75943
16773C0495026O78201O65632P84699J201445R46101J031423R43328N95752J303375
16764C8644982Q54773J260370J207271J172752R41137J400858Q86479J068192
16756D7436814J533985J084483J495393R85192J360170J085198J746161J230739
$$ y = [11199182, 10943782, 11297864, 11746467, 11701817, 11909183, 12281081, 12524035, 12859985, 12964969, 13407456, 13683753, 14012284, 14318905, 14488632, 14784081, 15283698, 15763730, 15776353, 16305334, 16573612, 16947554, 17387172, 17881077, 18006428, 18340177, 18772114, 19639930, 19732645, 20393997, 20912766, 21281608, 21599481, 22522302, 23192527, 23788109, 24462245, 24848600, 25508989, 26324725, 27100280, 27485041, 28349826, 28832192, 29519083, 30495026, 31173227, 31838859, 32623558, 33825003, 34771104, 35802527, 36745855, 37341607, 38644982, 39499755, 40760125, 41967396, 43140148, 44081285, 45482143, 46368622, 47436814, 48970799, 50055282, 51550675, 52535867, 53896037, 54981235, 56727396, 57958135]
16748E7958135J487932J130937J253696J390572J505404J184663R41004J497506
16740F8349849J462779Q62808J376668J116363P31254R44585P60259J176512N43749
16731G7324826N76919L79808L14599O04270R8319M10419j59796k29319R1123k24158
16721G9187010m85148n50498q12088k52653r22980q50429q59687r44420j183297
16712G2325810j105514o12085j343065j493863j257993j280846j258954j393310
16704F2580180j109972j160684j477979j284504j238513j044028j662295j268700
16696E2333505j175618j102247r75545j477281j215110p51340j356389j106936
16688D3173039j045799q57668j089739p43625j372134q73350q96781o32414j207593
$$ y = [57958135, 59446067, 60577004, 61830700, 63221272, 64726676, 65911339, 66852343, 68349849, 69812628, 70675436, 72052104, 73168467, 73899721, 74844306, 75604565, 76781077, 77324826, 77901745, 78281553, 78596152, 79200422, 79298741, 79709160, 79549364, 79320045, 79411168, 79187010, 78701862, 78151364, 77339276, 77086623, 76163643, 75313214, 74453527, 73509107, 72325810, 71220296, 70608211, 69265146, 67771283, 66513290, 65232444, 63973490, 62580180, 61470208, 60309524, 58831545, 57547041, 56308528, 55264500, 53602205, 52333505, 51157887, 50055640, 49080095, 47602814, 46387704, 45636364, 44279975, 43173039, 42127240, 41269572, 40179833, 39436208, 38064074, 37190724, 36293943, 35661529, 34453936]
16679C4453936n24461j194489p61947o32292m57847r19307q63787n4799j401015
16670B7643992o80805n59039k46332m11218j115043o26725l5001m90066p83389
16661B2696374p00726J56073p04881n62440m33929q5927l05072j060383j4591
16652A8984498q29112j22832m70461j1328n62025n44537L4041j49587l20304m59372
16642A5548981l66876k53371l37523N3027l84126m92714l05439K22824l31744
16633A3353039k85044o34285K05782n21614j01136o6737k58574K9366m34786o8158
16623A1217853l24879j79859k16987o5817j10099p7686j97957q1723k06656j95134
16613I561056j03717o35368J84548q5932r6079j09295j00345O00l40400p2776
$$ y = [34453936, 33929475, 32734986, 31973039, 31340747, 30882900, 29963593, 29099806, 29045007, 27643992, 26963187, 26404148, 26157816, 25746598, 24631555, 24004830, 23969829, 23479763, 22696374, 21995648, 22151721, 21446840, 20884400, 20450471, 20364544, 20059472, 18999089, 18984498, 18155386, 18032554, 17562093, 17550765, 16988740, 16444203, 16478244, 16328657, 16008353, 15548981, 15182105, 14928734, 14591211, 14644238, 14260112, 13767398, 13461959, 13684783, 13353039, 13067995, 12433710, 12639492, 12117878, 12016742, 11950005, 11691431, 11720797, 11286011, 11217853, 10892974, 10713115, 10496128, 10430311, 10320212, 10242526, 10044569, 9962846, 9756190, 9561056, 9457339, 8821971, 9006519, 8920587, 8824508, 8715213, 8614868, 8615468, 8275068, 8202292]
16603H202292o391j92853n5528l40298L26464j65441m86647K76748m60650M02905
16593G500601k01740j74299j52566O3132l69726J64883J03893l02247l71588J06207
16583F366550J18818O7679k06184m35586J39763l43428L67988n76098M64842p89852
16573E174492P06388k11799l38768K88295k55524K88728k22325m27873L73131
16564E374745k42367Q8191m33197O367J83095k29987J27740j19754K90207l5123
16554E009917j31842j74405j74308p4720m3074j45538r4633M19902l52085J44023
16544D383237k39511J63578J71249m16668M7208k80505O7788l02928j45595P89704
16534D237557m79454R1032k67006L15352l4188n78919L93996j38091K13604l74212
$$ y = [8202292, 8195901, 8003048, 7947520, 7607222, 7933686, 7768245, 7281598, 7558346, 7097696, 7500601, 7298861, 7124562, 6971996, 7035128, 6665402, 6830285, 6934178, 6631931, 6260343, 6366550, 6485368, 6553047, 6346863, 5911277, 6051040, 5707612, 6075600, 5499502, 5964344, 5174492, 5880880, 5669081, 5330313, 5618608, 5363084, 5651812, 5429487, 5001614, 5374745, 5132378, 5220569, 4787372, 4793739, 4976834, 4746847, 4874587, 4754833, 5045040, 5009917, 4878075, 4703670, 4529362, 4454642, 4411568, 4266030, 4171397, 4591299, 4239214, 4383237, 4143726, 4307304, 4478553, 4061885, 4109093, 3828588, 3896376, 3593448, 3447853, 4237557, 3758103, 3849135, 3582129, 3897481, 3863293, 3284374, 3678370, 3540279, 3753883, 3379671]
16524C379671J23601j09246K84205k29416K78903k64767k18929K46617j05787
16515C384852j99375K64974j89907j06249N7709J39951j49153j37924J73454k90667
16505B947665J40653j00976n9990K29439l98134K92993j67889M8894n406j40170
16495B787079n7142J49291O3446k49042J12793j69502J95593j96193J48708k01053
16485B583978m22367R51776p44329m6652L95269l1590l36001J70197m2680j20950
16475B356651O1664K55062k77764j63938M46613J27467k92501j62444k04269J28317
16465B274858J59467p43533P32908q8995j74702P9435L65750m58734L57622n95932
16455A908144R5723N12992j32424l53383l61243M48891k04093J78296j7392l43929
$$ y = [3379671, 3503272, 3394026, 3678231, 3448815, 3727718, 3462951, 3244022, 3490639, 3384852, 3185477, 3450451, 3260544, 3154295, 3212004, 3351955, 3202802, 3064878, 3238332, 2947665, 3088318, 2987342, 2927352, 3156791, 2758657, 3051650, 2883761, 2932655, 2927249, 2787079, 2729937, 2879228, 2942674, 2693632, 2806425, 2636923, 2832516, 2636323, 2785031, 2583978, 2161611, 3113387, 2369058, 2322406, 2717675, 2686085, 2350084, 2520281, 2477601, 2356651, 2418315, 2673377, 2395613, 2231675, 2678288, 2805755, 2513254, 2350810, 2146541, 2274858, 2434325, 1690792, 2423700, 2334705, 2160003, 2239438, 2605188, 2146454, 2504076, 1908144, 2003867, 2516859, 2384435, 2031052, 1669809, 2118700, 1914607, 2092903, 2075511, 1731582]
16445A731582L95443k45358l2138K03887Q2000j17209k85303L03776l68132K59732
16435A928280r6870j14335Q1304k40569M29790j15079p3095l669j4283o087K39461
16424B014848l16749Q8259l0257j03109r7655L10491j47499Q1187j86366J14358
16414A727508P6286j8659k56605M26182k74145j02206K83071k76321o072M44398
16404B023437l26474M6348m24357L90040O72k16424O5524m7732r1746m55459O64927
16393A628756j03125q9448K27227o9397k582O6208k73243J37631k10982p7527
16383A233518K25639k1361J37808N2695l70615K07041j20373L02149m16788K08040
16373A437753J05761p5891M4863m81433j0996O82325r5622k41145j23938K75231
$$ y = [1731582, 2127025, 1881667, 1849529, 2053416, 2135416, 2018207, 1732904, 2036680, 1668548, 1928280, 1831410, 1717075, 1798379, 1557810, 1987600, 1872521, 1799426, 1795757, 1781474, 1775387, 2014848, 1698099, 1786358, 1756101, 1652992, 1555337, 1865828, 1718329, 1799516, 1613150, 1727508, 1803794, 1785135, 1528530, 1954712, 1680567, 1578361, 1861432, 1585111, 1579039, 2023437, 1696963, 1743311, 1318954, 1708994, 1709666, 1493242, 1558766, 1511034, 1419288, 963829, 1628756, 1525631, 1436183, 1663410, 1594013, 1591431, 1657639, 1384396, 1522027, 1311045, 1233518, 1459157, 1437796, 1575604, 1628299, 1257684, 1464725, 1344352, 1646501, 1229713, 1437753, 1543514, 1467623, 1512486, 1031053, 1020057, 1702382, 1606760, 1365615, 1241677, 1516908]
16363A516908k77240K10297j73538R960n3108o1043L14162m9980p2166M9472l57402
16352A056322K06542r6960L04082n53547k6574L00462j2969j78905J09525r5015
16342A012963L45038j26197l77727R0967R339J32139L14718l9703m41556K61315
16332A181296k43619K66138M4751k48068J50280j21987K35325l49796J29995J58963
16322A203278O0298k49606R6138j39804L27226K38419n62242P2079N3412l1322
16312A067876J37948l03028J43417j47086Q6840l53599O1178J1864M41011P8976
16302A225397q1186j16295l066j22789M69479m67279J17796k07791m348p9056
16292G30862L35892l76513K23442j93996K40897j14389l7301K47266R4786l97902
$$ y = [1516908, 1239668, 1449965, 1276427, 1286387, 1233279, 1172236, 1486398, 1436418, 1364252, 1413724, 1056322, 1262864, 1165904, 1469986, 916439, 889865, 1190327, 1177358, 998453, 1107978, 1012963, 1358001, 1231804, 854077, 945044, 954383, 1086522, 1401240, 1361537, 919981, 1181296, 937677, 1203815, 1248566, 1000498, 1150778, 1028791, 1264116, 914320, 1044315, 1203278, 1263576, 1013970, 1110108, 970304, 1297530, 1535949, 973707, 1045786, 1099198, 1067876, 1205824, 902796, 1046213, 899127, 985967, 632368, 693546, 705410, 1146421, 1225397, 1144211, 1027916, 1024850, 902061, 1371540, 904261, 1022057, 814266, 809918, 730862, 1066754, 690241, 913683, 719687, 960584, 846195, 808894, 1056160, 1150946, 753044]
16282G53044L06888l19088K40231r8998m9213j43575J63787k34597K29862l06252
16272E42089J62208J15582J75389k0540N7546j41615K99196m59930L47047l62139
16262G14833o1173K80756j8318k39077J53668l64931J39503K88646j39617k82263
16252D72027K36934p9091L81900k93236j93794K18553p9245p7379K67336k49548
16242F04457N6042m7172M5412o0568R5934k25984M06247m12285L23438l45975
16232D39546A32892M56310K65512k96266n4488p574j75796K01057p9016K52154
16222F94785j3555O9638k86579M63828n958k51773J15291j06625L34460l13974
16212F99538j65849N8007J38628M483m4755j0130M9705j71738K18117K3504j67317
$$ y = [753044, 1059932, 740844, 981075, 882077, 832864, 689289, 853076, 618479, 848341, 542089, 704297, 819879, 995268, 974728, 1032274, 890659, 1189855, 729925, 1076972, 714833, 653660, 934416, 916098, 677021, 830689, 465758, 605261, 893907, 754290, 472027, 708961, 629870, 1011770, 718534, 524740, 743293, 664048, 586669, 854005, 604457, 660499, 613327, 658739, 598171, 694105, 468121, 874368, 462083, 785521, 439546, 132892, 589202, 854714, 558448, 503960, 496386, 320590, 521647, 442631, 694785, 681230, 750868, 464289, 928117, 922159, 670386, 785677, 679052, 1013512, 699538, 533689, 591696, 730324, 734807, 690052, 679922, 729627, 557889, 776006, 799510, 632193]
16201F32193j04229M90604l58322J96898p4159j52406k77131K37656L5827j55645
16191D71286K38578C06214J21597J35890N3440J02463j9322k42268j14769K49406
16181E92651J53926j21801J12440C23913J08046K86595N5990k73622G7136L84408
16171D61544K75186l12778k1819j18350L13196j23020r6334p8943J54889m1404
16161D12167K5049j87873K54951J08855A43480K55299r0576K4581p0107L80381
16151F43058j81427j62862J51920m5833L16838l08655j22999L53878l02764F8631
16140E52715k03685K77289p7372j86735J73865o6608k5943m6836r5081L31921
16130F33530j32391k45738J91506q2281J82081j88608j74800L8915J92546j24304
$$ y = [632193, 527964, 1018568, 660246, 857144, 782985, 630579, 353448, 591104, 626931, 471286, 709864, 306214, 427811, 563701, 617141, 719604, 700282, 458014, 343245, 592651, 746577, 624776, 737216, 323913, 431959, 718554, 774544, 500922, 77136, 461544, 736730, 423952, 402133, 283783, 596979, 473959, 377625, 298682, 453571, 412167, 437216, 249343, 504294, 613149, 143480, 398779, 308203, 332784, 262677, 643058, 461631, 298769, 450689, 404856, 721694, 413039, 290040, 643918, 341154, 68631, 552715, 349030, 626319, 548947, 362212, 536077, 469469, 443526, 396690, 301609, 633530, 501139, 255401, 446907, 364626, 546707, 358099, 183299, 222214, 414760, 290456]
16120B90456J33267F3149J81933O2488M2266J24196p3746j72821H5164L84453
16110D69617A20940R3270K38392k7785O0009r0123l6207k9718k4068J28967O5466
16099D99143r914j38970O1600j70466n4529L28963k15049J23922O3069j49369
16089C38400J25495o0483j60315J19112r0255j22814J49800J16124J93378B3823
16078B18490K46001j03204A8876h4934c8150A06849J44348n4217n4899m3922C1373
16066D40761K65858A84235J50157n9898j14336P6573J74476B9812K79610P1112
16056C80534j42320e745G861M89275j46227L11291l20268p7032m647I8536P9292
16045A77828J13295A35434K94456J03215k23773A35585R8152C7526O10317G2793
$$ y = [290456, 423723, 63149, 245082, 307570, 349836, 474032, 400286, 227465, 85164, 469617, 120940, 214210, 452602, 424817, 484826, 394703, 358496, 328778, 304710, 433677, 499143, 489229, 350259, 411859, 241393, 186864, 515827, 300778, 424700, 487769, 338400, 463895, 403412, 243097, 362209, 271954, 149140, 298940, 415064, 608442, 23823, 218490, 464491, 361287, 18876, -84934, -38150, 106849, 251197, 196980, 142081, 98159, 31373, 440761, 706619, 184235, 334392, 274494, 160158, 236731, 411207, 29812, 309422, 380534, 238214, -5745, 7861, 497136, 350909, 662200, 341932, 264900, 260253, 98536, 177828, 291123, 135434, 429890, 533105, 309332, 135585, 233737, 37526, 647843, 72793]
16034A89717m2746K11557j08441p206p3846J08129A00303B6827M08036j62632
16024B72231J21518A34030g7085A06170E1841L37629A1439L71165j20309b95696
16013B49412k8330J20570j13068r618c858A29593d5208B73462m3575J59752D6930
16001A84185J5583K94433B28838K9955c3155A43484J00224j10215M92896A79227
15990C65253L61522q3515P8082L29737l56870j47353L03852l01631B01895M8805
15980B50700J5577a52888B90584I4726J91304K2693H9743j5495K4290J51403a39308
15968A58261B6551K45052a37681A44430J77073r1878C7123h2173B8534L22951
15958C51485a4049A76371h4247C22274A18510D9975J8790J60939a63880A37513
$$ y = [189717, 146971, 358528, 250087, 242881, 169035, 277164, 100303, 26827, 434863, 272231, 393749, 134030, -77085, 106170, 51841, 389470, 11439, 382604, 262295, -295696, 249412, 221082, 341652, 228584, 218966, -3858, 129593, -45208, 273462, 229887, 389639, 46930, 184185, 199768, 494201, 228838, 258793, -33155, 143484, 243708, 133493, 626389, 179227, 365253, 726775, 643260, 721342, 1051079, 694209, 546856, 850708, 549077, 201895, 250700, 266277, -152888, 290584, 94726, 286030, 308723, 89743, 74248, 98538, 249941, -139308, 158261, 26551, 271603, -137681, 144430, 321503, 229625, 37123, -82173, 28534, 351485, -14049, 176371, -84247, 322274, 118510, 49975, 68765, 229704, -163880, 137513]
15947A30536J12644r9707K76533F755R3875g6243A97396F8842O3767b03246C24292
15935A02654a08926A6167J69953o1235B5631O5373J48788E6962K53217M6497j13576
15924B43100a1856G9608a86354B59003G1426L1653b46358J08287k7552A97401
15913b7939r3112B44664J04J13949n0340j32789J6392o8943A0266J95895G9051
15901g3297b6331A23411J9471N054E1973N2033K55332E3059O6006a5519B63900
15889I4212c29568A8511J93606a25076e7126G251K50958E5523L55959I9681d6325
15877A60556A1080P552J29994a20416A28723L28364j49653h3132A88865d435j4776
15866a9211D39766j61054g4832A88606N318n123J28797b2901l19284A3447a73605
$$ y = [130536, 243180, 143473, 420006, 6755, 100630, -76243, 197396, 68842, 132609, -203246, 324292, 102654, -108926, 16167, 186120, 124885, 25631, 91004, 239792, 56962, 310179, 356676, 243100, -11856, 79608, -186354, 259003, 71426, 103079, -246358, -138071, -165623, 197401, -27939, -121051, 244664, 244768, 358717, 308377, 175588, 191980, 123037, 10266, 206161, 79051, -73297, -26331, 123411, 142882, 147936, 51973, 104006, 359338, 53059, 119065, -15519, 263900, 94212, -329568, 18511, 212117, -125076, -57126, 7251, 258209, 55523, 411482, 99681, -46325, 160556, 11080, 18632, 148626, -120416, 128723, 457087, 307434, -83132, 188865, -4435, -19211, 439766, 278712, -74832, 188606, 193924, 188801, 317598, -22901, -342185, 13447, -173605]
15854A74781b5446A68578e0361l6668F9825i4375j29226a1297j28253C08346a44526
15842a34785k9081H160J85527I4035a51464M8969E7303b92373a6548c615B2720
15830i8050A12468g2065G9590b2962A24881l4173B3571J37013p6015a10966I6472
15818F5201k4533M30083o3470a43433M7582j9737A8082a03884A36806i0013j3374
15807a03387d9728A08304o384O0659N83D773d02121E8486K06161b41406G9667
15795B91050j1960E4137a11891A40203n161J54249A2421c3009A28760a82410g483
15783A07846b55591A16637h2418j47760B5268M1337l62i3054B07821j8861n7435
15772A31525b17381k82641a14267F8985b6196j62294C5677L65863F0438O7380
$$ y = [174781, -25446, 168578, -50361, -87029, 69825, -94375, -223601, -11297, -139550, 308346, -144526, -134785, -163866, 8160, 193687, 94035, -151464, -102495, 57303, -292373, -16548, -3615, 22720, -98050, 112468, -72065, 79590, -22962, 124881, 90708, 23571, 160584, 84569, -110966, 96472, 65201, 40668, 470751, 407281, -143433, -95851, -115588, 18082, -103884, 136806, -90013, -103387, -49728, 108304, 101920, 162579, 163162, 4773, -402121, 58486, 264647, -241406, 79667, 291050, 279090, 54137, -111891, 140203, 135042, 289291, 12421, -33009, 128760, -182410, -7483, 107846, -255591, 116637, -82418, -230178, 25268, 66605, 66243, -93054, 207821, 188960, 131525, -217381, -500022, -114267, 68985, -26196, -188490, 35677, 401540, 60438, 127818]
15762A27818R1223C4235L0756a64064p7514F0083a51086j2228l198O2310A73587
15750D9712L1644i4828q6982h4310r098E3846B4129J81720g3335H7695J07445
15739A95140I5210f3181j30724I3571J47723h6813n3055j31944Q3459K8580A08348
15727D6745M646a56803k45324e5914o4275a4163A26955d17780F9570J38721I6776
15715A51081a6921A33234h3839D9304J4261K1512Q1135A7076i3789c297p1427
15704g4724r9678c2322a2862A08666b71573F7816J76555E4562f0075I6880J51842
15693B48722j2705a75869H0011a46330B70406E6801B0764a21864c3145E0177a49535
15681B78885a98017d4453j36870r431d1601G129i7757j30738C48385j37316i2458
$$ y = [127818, 219041, 34235, 64991, -164064, -241578, 60083, -151086, -163314, -166512, -104202, 173587, 49712, 81356, -94828, -181810, -84310, -93408, 53846, 24129, 205849, -73335, 87695, 195140, 95210, -63181, -193905, 93571, 241294, -86813, -139868, -271812, -188353, -159773, 108348, 46745, 51391, -156803, -402127, -55914, -120189, -14163, 126955, -417780, 69570, 208291, 96776, 151081, -16921, 133234, -83839, 49304, 63565, 85077, 166212, 17076, -93789, -3297, -74724, -174402, -32322, -12862, 108666, -271573, 67816, 244371, 54562, -60075, 96880, 248722, 236017, -175869, 80011, -146330, 270406, 56801, 20764, -121864, -33145, 50177, -149535, 278885, -198017, -44453, -181323, -190754, -41601, 7129, -97757, -228495, 348385, 211069, -92458]
15669E11941f7115B1346K57351c18001J56870C7093I632K60438r1754i7162B60480
15657f257j31499B03651b3079k98905A56502L6748a59631B93488I7947a19116
15646a53194D6676a73333c5437B04810g6329B06713B2653a85329M5790A1191J02292
15635A13483Q4273c59405R0112H3349J25030a49257B84803a0379D4029a08636
15624B94482a15361A29569c43728D04095A32364K15116h559k784B5635c1075b582
15612g9178A1180J29591L8514E3746M44913E8269b1986k21384A07296c45215A10130
15600A69916b82408o0448A7874a8247m4413q1347F7659c3960A44932a20459B39694
15588B84099b32103C5025a09191A46626J44636n4212b9626B04956a58577G8004
$$ y = [511941, -67115, 21346, 278697, -318001, -161131, 37093, 9632, 270070, 178316, -97162, 260480, -6257, -137756, 203651, -23079, -321984, 156502, 193250, -159631, 293488, 97947, -119116, -153194, 46676, -173333, -35437, 204810, -76329, 206713, 22653, -185329, -139539, 11191, 113483, 197756, -359405, -269293, 83349, 208379, -149257, 284803, -10379, 44029, -108636, 294482, -115361, 129569, -343728, 404095, 132364, 347480, -8559, -11343, 25635, -31075, -2582, -79178, 11180, 140771, 179285, 53746, 498659, 58269, -21986, -243370, 107296, -345215, 110130, 169916, -282408, -342856, 17874, -18247, -62660, -144007, 67659, -33960, 144932, -120459, 239694, 284099, -232103, 35025, -109191, 146626, 291262, 237050, -29626, 204956, -158577, 78004]
15577a73354B39189j8424j1709E0461O5945a99034O4683A21429f117j78742e6947
15565a18315A60003J32017A14374f6155A37452C7547A8322R703e6601k70891a45336
15553a91330i0146A15148b01592G341c9997A19616d1496A10696a01788D17695
15542D4749J33278K85093a2198A82660a39061H4317e8191A7287R113J01411D3829
15530A66578p4826K2833N1771c4019B09187P1119c2730j58796p7587q7855B06567
15518B05094k7025n2892b36331l4978A68806F894K75893q1958a45084B36947e545
15506c82488m7304E7832b39912d2566A20321m2316a21472C57188A72013A9946
15495B36709j04676m0871e6064p4207B3689N2555b54395i7911F6745j7778K09469
$$ y = [-173354, 239189, 220765, 209056, 50461, 116406, -199034, -134351, 121429, -6117, -184859, -56947, -118315, 160003, 292020, 114374, -66155, 137452, 37547, 18322, 28025, -56601, -327492, -145336, -191330, -90146, 115148, -201592, 7341, -39997, 119616, -41496, 110696, -101788, 417695, 44749, 178027, 463120, -12198, 182660, -139061, 84317, -58191, 17287, 26400, 127811, 43829, 166578, 91752, 114585, 166356, -34019, 209187, 280306, -32730, -191526, -269113, -356968, 206567, 205094, 178069, 125177, -236331, -271309, 168806, 6894, 282787, 200829, -145084, 236947, -5545, -382488, -429792, 57832, -239912, -42566, 120321, 78005, -121472, 357188, 172013, 19946, 236709, 132033, 91162, -56064, -130271, 23689, 76244, -254395, -97911, 66745, 48967, 258436]
15484B58436C3389J32427B8064o85P1800K79113j38818l5189k435M1467r0017
15473A53300P8660C5883i7769L0957k91166J45862A60054a13441k0694c7939k76296
15462c14235B35144a6850j09556O386E5730a33099m5947n8641e1870n7861c0955
15450B74429j32413b91047a08502A78947N9107n8814P589K42713k12632J39704
15440C56614a7496H7298J8753b07013P0497D143a28432B9878J15693b01107F7919
15428d4244k36091a39519m6776c6078A33239a65837G2803J23070d08234a85711
15417c56377A71686c2148k16759a01765A48271a63998j86319a23065j25530A7290
15406b32346j25293I2926J9008L2601b01350A43156b71013o0424H6189i2556k9380
$$ y = [258436, 33389, 165816, 28064, 27379, 99179, 378292, 239474, 204285, 201850, 243317, 153300, 231960, 35883, -97769, -66812, -357978, -212116, 160054, -113441, -134135, -37939, -314235, 235144, -16850, -126406, -120020, 55730, -133099, -179046, -237687, -51870, -109731, -30955, 274429, 142016, -291047, -108502, 178947, 238054, 179240, 186829, 429542, 216910, 356614, -17496, 87298, 106051, -207013, -136516, 4143, -128432, 29878, 145571, -201107, 67919, -44244, -280335, -139519, -186295, -36078, 133239, -165837, 72803, 195873, -408234, -185711, -356377, 171686, -32148, -248907, -101765, 148271, -163998, -350317, -123065, -248595, 17290, -232346, -357639, 92926, 111934, 144535, -201350, 143156, -271013, -331437, 86189, -92556, -121936]
15395a21936j32055a12548A06390R6358r1624J13335k0586H0630d4237B55688
15384A80497j6711m6754J32414F8325N399K79787b9153F5682M4339g8672c0619
15372B14800r7872J16357a08279b4449A89454R1345j16445B3333h3316H0304b5017
15360b10951G472J2206a83824j54636e8267A4128R9426J02995k5119b33791F3476
15348I2699P1784D1431h347B12340H2965O1147J21588J33538n0249A43834K37217
15337C81051A07477J12147L4818J47685D8174L14071a05596C25968A02423F040
15326E8973K00577K25714d5557O433B03651r79J07967o0908L7867F0606A2118
15314D002b73421B03626n9949h519A55141a07355C80252f8903D3873K14941r6832
$$ y = [-121936, -253991, -112548, 106390, 202748, 111124, 224459, 203873, 80630, -44237, 255688, 180497, 163786, 117032, 249446, 68325, 73724, 353511, -29153, 65682, 110021, -78672, -30619, 214800, 116928, 233285, -108279, -24449, 189454, 280799, 164354, 23333, -83316, 80304, -25017, -210951, 7472, 19678, -183824, -338460, -58267, 14128, 113554, 216549, 191430, -233791, 63476, 92699, 164483, 41431, -8347, 212340, 82965, 144112, 265700, 399238, 348989, 143834, 381051, 107477, 219624, 254442, 402127, 48174, 362245, -105596, 325968, 102423, 6040, 58973, 259550, 485264, -45557, -39124, 203651, 202672, 310639, 249731, 287598, 60606, 12118, 4002, -273421, 203626, 143677, -8519, 155141, -107355, 380252, -68903, 43873, 258814, 161982]
15303A61982P2850d309q8244B2482B290O7871M6725J68777j19878E2090K7963
15292H0053J9682K63350D1900a37697q8214C5834c3340A43527b95p2245j17900
15281a90440J9594M6334A91478f5913C65432A11690P384c1266j55754f5904C30060
15269a23675l0611A60215N2559J63721j86583L36784B61933F2645M17835k25793
15259B54687G8714K01711A2013l39A929J86046B4050J53493k2359J36618M96016
15248G87818M31372N60744j81390j45420q8087E97311C6920a32690B97248f6645
15237C47410d0128j05269d24j27804e7167B40846F0627J76699A5978a01546D43175
15225A6091J35002G2117l2073a15680G326K43425E4415L7957R8204F7582c47300
$$ y = [161982, 234832, -4309, -92553, 22482, 2290, 70161, 116886, 285663, 165785, 52090, 80053, 99735, 363085, 41900, -137697, -225911, 35834, -33340, 143527, -295, -72540, -190440, -170846, -124512, 191478, -65913, 365432, 111690, 119074, -31266, -187020, -65904, 330060, -123675, -154286, 160215, 212774, 376495, 189912, 526696, 261933, 62645, 480480, 254687, 78714, 280425, 12013, 11674, 1929, 187975, 24050, 177543, 155184, 291802, 787818, 1219190, 1779934, 1598544, 1453124, 1365037, 597311, 36920, -132690, 297248, -66645, 347410, -40128, -145397, -424, -128228, -57167, 240846, 60627, 237326, 15978, -101546, 443175, 16091, 151093, 72117, 40044, -115680, 7326, 250751, 54415, 92372, 190576, 67582, -347300]
15213A86637a22274L5390A62757b08602C13357g8199c6913F1425g668H3154O252
15202H9406g686A88106J15681a31602K7142G8728b32856A73025I864K14991I0900
15190a04307j59495B01735o2882A5120L52603B5803a04969D4765b41794A58931
15179G0549b441k8481m9285K8298C3052K59974a31165N092D5246N2516N6477Q4680
15167B38919J19521c33854i1807A13736p074g5632B58271b9810B7984K65379j35041
15156A58322n5583i7256G129J62849i1319l60j38624H8219a45495a8066B67944
15144B18807f3824b5431n501A38900K3179b35085r019H1325A3332J95900B9062
15132c0841B33503I1534O9276m16O7584L2409d87j2911B20416j02269L07208C849
$$ y = [186637, -122274, -86884, 162757, -208602, 313357, -78199, -36913, 61425, -7668, 83154, 89406, -7686, 188106, 303787, -131602, -104460, 78728, -232856, 173025, 9864, 224855, 90900, -104307, -263802, 201735, 138853, 15120, 367723, 25803, -104969, 44765, -241794, 158931, 70549, -2441, -30922, -80207, -51909, 33052, 293026, -131165, -126073, 45246, 97762, 154239, 238919, 358440, -333854, -91807, 113736, 106662, -75632, 258271, -29810, 27984, 293363, 158322, 102739, -97256, 7129, 169978, -91319, -91679, -230303, 88219, -145495, -18066, 267944, 218807, -63824, -25431, -30932, 138900, 162079, -235085, -244104, 81325, 13332, 209232, 29062, -30841, 233503, 91534, 160810, 160394, 227978, 260387, -487, -13398, 220416, 118147, 425355, 3849]
15119B67998E2909L09369q6058m4078a5003D195K79264o8315J13495E3164J86254
15108B39418A06117J07152h0571L0408D18995F9857d5990C79497A77131g4063
15097B23326B6405a23781H1396O596Q5180J1240b5888n5511k0953K6864N206B18229
15084D05301E5432k6928L8023K4611K32604I4038D11J25454F162M20886r877A48316
15071C0477c71616f903G8402M731J9051k6604a458E1659e1350B03286G0236J20835
15059A91071e0497B40682e2992H5784J52827K88716A29642J60036f7876D58401
15048B48624j05479F7154N21810B59690G8861P3442P9375J76387J36862H3055
15037D54346k18155A10512K099L59161j02973A09384C9650M31412A33766K18944
$$ y = [267998, 52909, 362278, 276220, 232142, -15003, 4195, 283459, 215144, 328639, 53164, 239418, 106117, 213269, -80571, -50163, 418995, 69857, -45990, 379497, 177131, -74063, 223326, 26405, -123781, 81396, 87992, 173172, 184412, -25888, -81399, -102352, -75488, -70282, 218229, 405301, 55432, 28504, 66527, 91138, 323742, 94038, 411, 125865, 6162, 427048, 417171, 148316, 30477, -371616, -6903, 78402, 83133, 102184, 75580, -1458, 51659, -51350, 203286, 70236, 191071, -50497, 240682, -52992, 85784, 238611, 527327, 129642, 289678, -67876, 458401, 248624, 143145, 67154, 588964, 259690, 78861, 152303, 231678, 408065, 544927, 83055, 454346, 236191, 110512, 112611, 471772, 368799, 109384, 39650, 471062, 133766, 352710]
15027C52710r4597N16279l49041L0678j58360G6233K4955N36873k05337A91895
15016a03159D49936j60362J64794j70636K45416D7512L29098C5817H084K26725
15006B34809K65385A94589L93961B28703n7993p603L32352a8514B92229a0534
14995A73630J13882O3863A426N54454B21897G3398L14001j70462G8065J00308
14985A78373G3591L77278G1849J90766M8960J33267K16547C09416K10317K49675
14975G69408l66962j3697J69054k69565F9898K79956M3990O8765D7533P06988
14965G54521l11209c4128B53103o9107N947C9394B590L77418J21480j76265l0541
14954B94682R8092k3614A09128L74413A76283M89950B93893R6443n9502Q5396
$$ y = [352710, 258113, 774392, 425351, 456029, 297669, 76233, 101188, 638061, 432724, 191895, -103159, 449936, 289574, 454368, 283732, 529148, 47512, 376610, 35817, 8084, 234809, 500194, 194589, 588550, 228703, 170710, 163107, 495459, -18514, 292229, -10534, 173630, 287512, 351375, 1426, 555880, 221897, 73398, 387399, 216937, 78065, 178373, 73591, 450869, 71849, 262615, 311575, 444842, 661389, 309416, 519733, 769408, 402446, 388749, 557803, 288238, 69898, 349854, 393844, 462609, 47533, 754521, 443312, -34128, 253103, 183996, 189943, 39394, 2590, 380008, 501488, 325223, 294682, 392774, 369160, 109128, 483541, 176283, 666233, 293893, 390336, 330834, 416230]
14944D16230M0937L6455j70253j52233J62317K19701B40698l8820K27863J7963
14934D47704J11024j9098k11155M94735J3467j80272K89744J22423k72324o1628
14924G34620N6713P7043j48874O9987P2849J04502J65636J74622k41785j57132
14914I08181k00990C29394L98649B15473K86677j37782A44698K08214J00238j9027
14904D34123P052L9749j3528A08815M44378r5722j77799n501A27706L49882A92126
14892A97938R3165l6820J62911K65390k29700M89300l53504k90987J78253Q046
14882D83992j396d2325C36988j13253J29966K2884J70305k65225L58979l06361
14872C34283k3645l5247J12957L49734l62013n4749N2207L0869P2265a24138C51675
$$ y = [416230, 457167, 493622, 323369, 171136, 333453, 553154, 240698, 201878, 429741, 447704, 558728, 539630, 328475, 823210, 836677, 656405, 946149, 1068572, 796248, 734620, 791333, 868376, 719502, 789489, 862338, 966840, 1132476, 1307098, 1065313, 908181, 707191, 329394, 728043, 215473, 502150, 364368, 144698, 352912, 453150, 434123, 441175, 480924, 467396, 108815, 553193, 457471, 279672, 274171, 127706, 477588, 192126, 197938, 291103, 254283, 417194, 682584, 452884, 942184, 588680, 297693, 475946, 483992, 482596, -42325, 336988, 223735, 353701, 376585, 546890, 281665, 640644, 334283, 310638, 275391, 388348, 738082, 376069, 321320, 373527, 404396, 476661, -124138, 351675]
14860F27595j52531I1421L88593k20039m6223J61380J15162m923r1797M5924P4129
14849E13627k17337B1338K95612J22832R3868k08618J99857J84070k1753J71255
14839H58461k2362k06365L153J97356j75589k22659K95718l04464K9160K63501
14829G15910j32365k19148j36829r1528J86792J13272Q1967J34929k61627A61549
14818G36026j90621J4621j26890j13187j5375K07027J20334G8325N25225B32061
14807C93703j80443L58286M3628j66516J75992l7314M15762D13363L25431O4830
14797H03624k36960j17100J67372B83724M45367j77210K06642J7109B73261P7396
14787C50657n8317L38994A29980L63561N2319j26135L35389j30649k81039L36396
$$ y = [627595, 475064, 91421, 480014, 259975, 213752, 375132, 490294, 485371, 393574, 439498, 513627, 296290, 21338, 316950, 439782, 533650, 325032, 524889, 708959, 687206, 858461, 836099, 629734, 632887, 830243, 654654, 431995, 727713, 423249, 452409, 715910, 583545, 364397, 227568, 136040, 322832, 436104, 518071, 653000, 391373, 161549, 736026, 545405, 560026, 433136, 319949, 304574, 511601, 631935, 78325, 603550, 232061, 393703, 213260, 571546, 615174, 448658, 624650, 587336, 1003098, 413363, 738794, 803624, 566664, 449564, 616936, 283724, 729091, 551881, 758523, 775632, 273261, 350657, 292340, 631334, 129980, 493541, 545860, 419725, 755114, 624465, 343426, 679822]
14777F79822l18218L7402M44021C95719M32286k50602J99071j47130K6015k85969
14767C69390M3693A53220M73858B60806j2160N76817k56066o264N480J19464j00245
14756E87832J30213o7353K06441k64647q7364B31314K93460K79474k70051j19267
14746D14930K60654k40580L57553l58444J29134L15048l78429A04815K13647L92186
14736G10648L85050k48991l5851K64808m41792M12831p788j54515q9477O3700
14726H58623j7852k65542M84428k27210L77808O9158l69184j6380p3537J46248
14716I66560q4611M611J16332m23995N03J82576k26234R3486J57928O8532q957
14705H46731k17632J04723J68056K6119j9529P87J11623O2021n0559J25005J83223
$$ y = [679822, 361604, 399006, 843027, 395719, 828005, 577403, 776474, 629344, 655359, 369390, 413083, 153220, 627078, 260806, 248646, 825463, 569397, 563133, 568613, 688077, 587832, 718045, 650692, 857133, 592486, 505122, 231314, 524774, 804248, 534197, 414930, 675584, 435004, 792557, 434113, 563247, 878295, 499866, 104815, 318462, 710648, 1095698, 846707, 810856, 1075664, 633872, 1046703, 1038915, 884400, 794923, 858623, 840771, 575229, 1059657, 832447, 1210255, 1279413, 910229, 893849, 820312, 966560, 881949, 886560, 1002892, 578897, 579400, 761976, 535742, 629228, 787156, 855688, 846731, 629099, 733822, 901878, 927997, 908468, 909255, 1020878, 1082899, 1032340, 1157345, 1340568]
14694A340568k90406j24368j34982J67660r6189l80073M4927M09680l92513J31521
14684F75825J30045N4272J96740m30256K83344k4579q098R41j9478j79592K38924
14673I18088j87827L16724o1747L18966m03580r8145J94664l5873j13989K3004
14663H70285K27123k00168j55149L70950j42300l90744L33169J19765j9188j40692
14653H73051p7105K60421r2068J00807j93513K32068q0161J69724l09725p0242
14643H13257J24102M6406j33544L04651j7943k44196N1636L3140k73538N19793
14633A223764j13046n7143l62719K01207J60387j8299R3073j33010K44579k70074
14623I68719j58125N08293m06306j30271M14394l49985P5593J58039R3981J89913
$$ y = [1340568, 1050162, 925794, 790812, 958472, 862283, 482210, 527137, 936817, 544304, 675825, 805870, 860142, 1056882, 626626, 909970, 885391, 877293, 878234, 858756, 679164, 918088, 730261, 1046985, 985238, 1304204, 900624, 802479, 997143, 961270, 847281, 870285, 1097408, 897240, 742091, 1113041, 970741, 579997, 913166, 1032931, 1013743, 873051, 795946, 1056367, 964299, 1065106, 871593, 1103661, 1023500, 1193224, 883499, 813257, 937359, 983765, 850221, 1154872, 1136929, 892733, 944369, 977509, 703971, 1223764, 1110718, 1053575, 690856, 892063, 1052450, 1034151, 1127224, 994214, 1238793, 968719, 810594, 1318887, 912581, 782310, 1196704, 846719, 922312, 1080351, 1174332, 1364245]
14613A364245l92639L49688k99415j13541L57521J5801j73026K6024o7152M01295
14603A468801p6221r5973l01033K72160M3376K98906k93947O408K95666n04049
14593A114094N36804k02844m52591L95268j24623K39833Q9773j19906k043o0170
14583A413595P9013j7045l416J93851j51950K25449J97056m11226K34657R8159
14573A858143k27095J85787J05913j19582J99025q2124J909K55047j13283K6970
14563B090710K28244j81684L72223k15152K12515N4079M29837m4601M57039K24971
14553C628181K25047N64415Q19947P65730J554484L449042O200639Q709097O70440
14544B6587022r853883o345563m116350k141993r47417q25309R8507l36676Q2126
$$ y = [1364245, 971606, 1321294, 1021879, 908338, 1265859, 1281660, 1108634, 1134658, 1067506, 1468801, 1392580, 1296607, 995574, 1267734, 1311110, 1610016, 1316069, 1322477, 1618143, 1114094, 1650898, 1448054, 995463, 1390731, 1266108, 1505941, 1595714, 1475808, 1473765, 1413595, 1492608, 1475563, 1472147, 1665998, 1514048, 1739497, 1936553, 1525327, 1759984, 1858143, 1631048, 1816835, 1922748, 1803166, 2002191, 1920067, 1921976, 2177023, 2063740, 2090710, 2318954, 2137270, 2509493, 2294341, 2506856, 2560935, 2990772, 2946171, 3403210, 3628181, 3853228, 4417643, 5237590, 6003320, 7557804, 11006846, 17207485, 25916582, 26587022, 16733139, 10387576, 6271226, 4129233, 3181816, 2356507, 2455014, 2118338, 2200464]
14535B200464j76370k18151K0629m8740L18601q2919k92505M12138j74979J13357
14525B071525j08591K88550k28787L61612k51154Q1441K9024j3699k18977p2303
14515A938641M36192l01832J46329Q3240l0799M3074P5234M7524r7348j71279
14505B168976K84947K13881j16465K59933j31429K45740n61385M54836j13121
14496B705913p8539J24856J33583k38400J89485L7029m6640M30293k20088K48494
14486C285986j93733P228R3570n0421M19299k31095j28582Q9099j51022L12386
14476C452715r5042J62707p6985O6230K85019m03081J48563J34291J36826K04862
14466D016105k80045J9585j63138M10527K22362n26995L52394K68122j96208K75754
$$ y = [2200464, 2024094, 1805943, 1826572, 1777832, 2096433, 2013514, 1721009, 2133147, 1958168, 2071525, 1962934, 2251484, 2022697, 2384309, 2133155, 2214596, 2243620, 2229921, 2010944, 1938641, 2374833, 2073001, 2219330, 2302570, 2271771, 2314845, 2390079, 2437603, 2340255, 2168976, 2453923, 2667804, 2551339, 2811272, 2679843, 2925583, 2364198, 2819034, 2705913, 2627374, 2752230, 2885813, 2647413, 2836898, 2873927, 2827287, 3257580, 3037492, 3285986, 3092253, 3099481, 3193051, 3142630, 3561929, 3330834, 3202252, 3291351, 3140329, 3452715, 3357673, 3520380, 3443395, 3509625, 3794644, 3391563, 3540126, 3674417, 3811243, 4016105, 3736060, 3755645, 3592507, 4003034, 4225396, 3698401, 4050795, 4318917, 4122709, 4398463]
14456D398463j64918l00237J66004R5321K88720j74541M18666P2891j57134N02839
14446E146074l68455J71962j01952j8592K55062J39522j28227J21996Q049L65886
14436E591325J15891l13005r6223K97182J28897L76085k43601J66226J3837K1219
14426F057833L7736j24435N65856R1622m87459O44784r1967M95430Q71l03829
14416F886442O37878j95774j35735O52363n67618J30447J96789L50101j23131
14407G831762K09623K25457Q767J81308L41512L73946l09573q2218K73960L29418
14397I383962m25403M70489l6433L84254J85817J32187Q9761J98289J38446J00388
14387A0621757L95801J78852K77903Q3711K59361L46472N6912K33311J46921K13348
$$ y = [4398463, 4233545, 3933308, 4099312, 4194633, 4483353, 4308812, 4727478, 4800369, 4643235, 5146074, 4777619, 4949581, 4847629, 4829037, 5084099, 5223621, 5095394, 5217390, 5225439, 5591325, 5707216, 5394211, 5297988, 5595170, 5724067, 6100152, 5856551, 6022777, 6036614, 6057833, 6095569, 5971134, 6536990, 6628612, 6141153, 6785937, 6693970, 7189400, 7190271, 6886442, 7524320, 7328546, 7192811, 7845174, 7277556, 7408003, 7604792, 7954893, 7831762, 8041385, 8266842, 8275609, 8456917, 8798429, 9172375, 8862802, 8780584, 9054544, 9383962, 8958559, 9429048, 9392615, 9776869, 9962686, 10094873, 10184634, 10382923, 10521369, 10621757, 11017558, 11196410, 11474313, 11558024, 11817385, 12163857, 12220769, 12454080, 12601001, 12814349]
14377A2814349J5754K25997Q26052l43751P67640J25333K55022N4209O37341N0836
14367A5428782M38666M88742K26544M50118N08312j44501L89864L86930K03214
14358A8376671N15274J152254r8422O45933R58843m9773P28329N64290J67353
14349B2960752Q58864L36246M97212Q96182O52483N69511P49299O09870Q82099
14340B9012518P73315Q28516Q61905Q87399P83040J070786J211327R23387R84899
14331C7337092J203634J038989J457368J329603J382603J427608J389569J540477
14323D8106943J529252K004702J746276J890162K269879J767028K496976K289723
14315F4100941K386084K354459K946699K823396L410468K792026L692433L372025
$$ y = [12814349, 12830103, 13056100, 13882152, 13538401, 14306041, 14431374, 14686396, 14740605, 15377946, 15428782, 15867448, 16356190, 16582734, 17032852, 17541164, 17396663, 17786527, 18173457, 18376671, 18891945, 20044199, 19945777, 20591710, 21550553, 21500780, 22229109, 22793399, 22960752, 23819616, 24155862, 24653074, 25549256, 26201739, 26771250, 27520549, 28130419, 29012518, 29785833, 30614349, 31476254, 32363653, 33146693, 34217479, 35428806, 36352193, 37337092, 38540726, 39579715, 41037083, 42366686, 43749289, 45176897, 46566466, 48106943, 49636195, 51640897, 53387173, 55277335, 57547214, 59314242, 61811218, 64100941, 66487025, 68841484, 71788183, 74611579, 78022047, 80814073, 84506506, 87878531]
14307H7878531L915691M409346M258573M281321N093246M990647N414693N597642
14299A25839690O479018O314626P148561P096129P497577Q038775Q859516Q844447
14291A86118339R636661J0189858J0671338J0881871J1630844J1883848J2674508
14284B63687267J3147075J3298324J3808019J4106734J4248627J3743613J3601918
14277C59641577J3087970J2369968J1886128J0253956Q928661O811708M917924
14270D27897892L403169j132194l937375l146196q904758j1155112j2231032j3590204
14262C77204190j3976189j4298503j4425072j5391069j5279380j5055184j4833196
14255B73945597j3842444j3767306j2215444j2033751j1783287j0947853j0422133
$$ y = [87878531, 91794222, 96203568, 100462141, 104743462, 109836708, 114827355, 120242048, 125839690, 132318708, 138633334, 145781895, 152878024, 160375601, 168414376, 177273892, 186118339, 195755000, 205944858, 216616196, 227498067, 239128911, 251012759, 263687267, 276834342, 290132666, 303940685, 318047419, 332296046, 346039659, 359641577, 372729547, 385099515, 396985643, 407239599, 416168260, 422979968, 427897892, 431301061, 430168867, 426231492, 423085296, 414180538, 403025426, 390794394, 377204190, 363228001, 348929498, 334504426, 319113357, 303833977, 288778793, 273945597, 260103153, 246335847, 234120403, 222086652, 210303365, 199355512, 188933379]
14248A88933379r977091r046617q727624q227061p354892p114280o691159o508483
14240A25286172n986111n538591m892294m975569m719065m092966m355176l674590
14232H7051810l446896l269649l461514k941925l054922k682920k216000k801550
14224F3176434k506204j639921k363917j960047j485604k061976k015962j463877
14216D7678926j247999j594574j300428j113993j819731q02875j275614j318365
14208C7205347o82909r50076j346716r91399q31506r90487p63156p02216q19148
14199B9127734p63228q60974p54531q12629m15191m27657q85826m87782o79741
14190B3040175o19498n17846n22450l04874q65146m30949j39622n86364m07739
$$ y = [188933379, 178956288, 169909671, 161182047, 152954986, 145600094, 138485814, 131794655, 125286172, 119300061, 113761470, 108869176, 103893607, 99174542, 95081576, 90726400, 87051810, 83604914, 80335265, 76873751, 73931826, 70876904, 68193984, 65977984, 63176434, 60670230, 59030309, 56666392, 54706345, 53220741, 51158765, 49142803, 47678926, 46430927, 44836353, 43535925, 42421932, 40602201, 39799326, 38523712, 37205347, 36522438, 35572362, 34225646, 33234247, 32402741, 31412254, 30649098, 29946882, 29127734, 28364506, 27503532, 26749001, 25936372, 25521181, 25093524, 24207698, 23719916, 23040175, 22420677, 21902831, 21380381, 21075507, 20210361, 19779412, 19639790, 19053426, 18645687]
14181A8645687k05764n29953l48907n70479k63998l83694k82282k73016j08316
14172A5679278n62995m34963L36723m97839l16086n50401J5151k68659k45984
14163A3154225N5831n91553j13645k69523j75982j79066j2634o20905j8915k64785
14153A0963048n858j03072p17179J11241K40933n13278P9112m63056j10229r6347
14143I385315k03060j59023j74478j22620K92584m05896j77891j60105j36477
14134H138349o2721l97912J16771l09558k68822K92108n0208m45027o9481q2497
14124F861002J12199J08172m96185m4190M4413J2478k81975j96420R4988n5498
14114F158984k09925J07995j01204j36606l63620O41199k95543k05358m1114j71881
$$ y = [18645687, 18439923, 17909970, 17561063, 16990584, 16726586, 16342892, 16060610, 15787594, 15679278, 15116283, 14681320, 15018043, 14520204, 14204118, 13653717, 13668868, 13400209, 13154225, 13210056, 12618503, 12504858, 12235335, 12059353, 11880287, 11867653, 11246748, 11227833, 10963048, 10957190, 10854118, 10136939, 10248180, 10489113, 9975835, 10054947, 9591891, 9481662, 9385315, 9182255, 9023232, 8848754, 8726134, 9018718, 8612822, 8434931, 8274826, 8138349, 8075628, 7677716, 7794487, 7484929, 7216107, 7508215, 7458007, 7012980, 6943499, 6861002, 6973201, 7081373, 6585188, 6540998, 6585411, 6597889, 6315914, 6119494, 6214482, 6158984, 5949059, 6057054, 5955850, 5819244, 5455624, 6096823, 5801280, 5595922, 5554808, 5382927]
14104E382927j18979J80649m28722J60485l26596K03644K7364k46074j44378L07750
14094D998070k30078K530k53611L61962m41445L83182k57000r0990j80221q532
14084D283867J50914q0649m96846M76118l12041j36882K17774m30550K05519j10613
14074C766611j19078R8956J33718k39933l7389j8683k4873J21418n8132k35207
14064C387408J73209J28849J5644m09829J81126K0328l540j56463K58410j12846
14054C482296n10077O6993J45676k38848Q6167j3432j66472J8992n8010m469j98455
14043B610361M87660k59270p2140m02211K03177K50404L5365q0149J07494R7642
14033B978333J6932l35610J68756o5459K00436l99823k23131J18575k3914J58137
$$ y = [5382927, 5263948, 5444597, 5015875, 5176360, 4849764, 5053408, 5080772, 4834698, 4690320, 4998070, 4767992, 4770522, 4516911, 4878873, 4437428, 4820610, 4563610, 4472620, 4292399, 4283867, 4434781, 4354132, 3857286, 4333404, 4021363, 3884481, 4102255, 3671705, 3877224, 3766611, 3647533, 3746489, 3880207, 3640274, 3602885, 3584202, 3559329, 3680747, 3622615, 3387408, 3560617, 3689466, 3705110, 3295281, 3476407, 3496735, 3493195, 3336732, 3595142, 3482296, 2972219, 3039212, 3184888, 2946040, 3032207, 3018775, 2852303, 2871295, 2813285, 2808816, 2610361, 3098021, 2838751, 2766611, 2364400, 2567577, 2817981, 2853346, 2773197, 2880691, 2978333, 2995265, 2659655, 2828411, 2762952, 2963388, 2563565, 2340434, 2459009, 2435095, 2593232]
14023B593232j27220j90189L5801L16847j56172k05816K99644k02565R2686p7823
14013B378425k51413M63121k47610J36268n10798K91537k83933M10788O3317O2816
14003B512518k86719k8650n4906Q5675k46499j80951K65181L97961K94713j22441
13993B635882K65356J07952M04251P88112Q70200K261328M663187R049914O410737
13984B7456919o859508q527360m174142k136430j049666p08209n17610n8037l03643
13975C122314p6356l79923j19262j45905l32327M0176L05554l91309K87456m6901
13965B263517o80086M29652k19749J17771J4186k72006K66738J34762l42925k9493
13955A682367J67771j28957J20922j73713j49930N38811J18873k80550k42567
$$ y = [2593232, 2466012, 2275823, 2311624, 2628471, 2472299, 2266483, 2566127, 2363562, 2456248, 2378425, 2127012, 2590133, 2342523, 2478791, 1967993, 2259530, 1975597, 2386385, 2449702, 2512518, 2225799, 2197149, 2142243, 2227918, 1981419, 1800468, 2065649, 2463610, 2758323, 2635882, 2901238, 3009190, 3413441, 4201553, 5071753, 7333081, 11996268, 21046182, 27456919, 20597411, 12070051, 7895909, 5759479, 4709813, 4001604, 3483994, 3425957, 3122314, 3045958, 2666035, 2546773, 2400868, 2068541, 2108717, 2414271, 2022962, 2310418, 2263517, 1583431, 2013083, 1793334, 1911105, 1925291, 1653285, 1920023, 2054785, 1711860, 1682367, 1850138, 1721181, 1842103, 1668390, 1518460, 2057271, 2176144, 1895594, 1653027]
13946A653027J09084k88206K98451j73229n1742k49464K55531J67892l69808J58219
13936A509755l06967k06089M88556l36007J31981j51958M58094m2611l4707J02209
13926A612256j15676m7340j51546M47703o72833M00704m45093M34113j26042j72329
13916A163917q9293J50254q0330K73213l20988L45487j32714Q5816j59852p4678
13906A160832m3565K65887m40449K66111J24207l5973k16732N3846J19346n7287
13896A196223k15771N4538j41118M98785k65865l00622M23630L75433n81677j06442
13886I37114R665J81808k72723J37731J61268j80041p9148L22567j47423j24387
13876I46431o0824J10654j7918j88004K93081r4240O066j86157O7201P059R5408
$$ y = [1653027, 1762111, 1473905, 1772356, 1599127, 1547385, 1297921, 1553452, 1721344, 1351536, 1509755, 1202788, 996699, 1485255, 1149248, 1281229, 1129271, 1587365, 1544754, 1510047, 1612256, 1496580, 1449240, 1297694, 1745397, 1072564, 1473268, 1028175, 1462288, 1336246, 1163917, 1074624, 1224878, 1144548, 1417761, 1096773, 1442260, 1309546, 1395362, 1235510, 1160832, 1117267, 1383154, 942705, 1208816, 1333023, 1297050, 1080318, 1134164, 1253510, 1196223, 980452, 1034990, 893872, 1392657, 1126792, 826170, 1249800, 1625233, 1043556, 937114, 946779, 1128587, 855864, 993595, 1154863, 974822, 895674, 1218241, 1070818, 946431, 885607, 996261, 978343, 790339, 1083420, 989180, 995246, 809089, 876290, 883349, 978757]
13865I78757P1431J2751p8745k67282L54972m67480N05741j00437n2772j39694
13855H17242p5552L35611J2391o6487k87736K75841k4636j05617M98477o44293
13845G35241J07423K20408l70310J60965m9997J33253K73418n19020K64397l18132
13835F37646M38509k78376L8167R9640J08326l03436O3701J52510k55759k42270
13825D58658K43191m459O9098j8017K51144j26940o6551m4868K09010l56675K89517
13814I03108L5578o1666o9456J51244m28412J23990J1252J79042k92956K04655
13804G56379j31443k54236K28015J52770j91759j09960M03669D00906L84902K30689
13794A016497D63692j42637M06362o5427K43864l87501L16253B04410O58825l35590
$$ y = [978757, 1050188, 1062939, 984194, 716912, 1071884, 604404, 1110145, 1009708, 956936, 817242, 741690, 1077301, 1089692, 1023205, 735469, 1011310, 986674, 881057, 1379534, 735241, 842664, 1063072, 692762, 853727, 803730, 936983, 1210401, 691381, 955778, 637646, 1076155, 797779, 835946, 935586, 1043912, 740476, 804177, 956687, 700928, 458658, 701849, 697390, 766488, 748471, 999615, 872675, 806124, 761256, 970266, 613591, 903108, 938686, 877020, 807564, 958808, 530396, 654386, 665638, 844680, 551724, 756379, 624936, 370700, 598715, 751485, 559726, 449766, 853435, 400906, 785808, 1016497, 463692, 321055, 727417, 661990, 905854, 518353, 834606, 204410, 863235, 527645]
13784E27645O438m8145M0668J43583r6891J22702Q0438q6067j85612J61728k7784
13773F38703k15691M9725N92558n07121J24931k54210L94653J46078k43103n3239
13763F73284B90417K90114L028j47948O3613K68682l78054L84164j57462j2413
13753F04141o0877R1839j47942m1157J98798j23351q4972K72647k27626j10569
13743C70931J58801J42346J5405j34932K0646N3619J81750j63188j07028k51279
13733B87071L57081j81893J73589n6259j2428J41078C39780L98489k2154l10215
13723D05900K89845C40272K6710J92911j36710j19956J32701R6864q0714j22765
13713C29313J96083q6867L7946J67106C06110J91680B31401M54670K2158B99633
$$ y = [527645, 534083, 485938, 526606, 670189, 573298, 696000, 776438, 690371, 504759, 666487, 638703, 423012, 472737, 1065295, 558174, 683105, 428895, 823548, 969626, 726523, 673284, 290417, 580531, 583559, 435611, 499224, 767906, 389852, 774016, 616554, 604141, 543264, 635103, 487161, 446004, 644802, 521451, 436479, 709126, 481500, 370931, 529732, 672078, 687483, 552551, 573197, 626816, 808566, 645378, 538350, 287071, 644152, 462259, 635848, 579589, 567161, 708239, 339780, 738269, 716115, 405900, 695745, 340272, 366982, 559893, 423183, 303227, 435928, 532792, 452078, 329313, 525396, 438529, 476475, 643581, 306110, 497790, 231401, 686071, 708229, 299633]
13702D85544p6887J82888N4475L0694A77246Q5150L77476k38432j87406L53823
13692E67857j46129r3073J56488J37515A64600J86090l7631L02654k10619j45101
13682B59993a61115E98109k66899J18215j58392Q589J11204J5775j03795J82455
13672E05261j97308J08874J9261m580j52146M70233j27026A95262M50657l18423
13662C27496K8793K50348k78056P3293j12148J19778k5406P5513F0242M44197
13652E04439P7871k51298j01409m4290N94318k64494B13073J73332j08079K28396
13642E06722p2374Q5321J95216k74772J57773n0840k5239j84525o6836m1784p4675
13631A53987L45903B11576h0138C98691j16655J74640k21334M3168K85534j82697
$$ y = [485544, 408657, 591545, 646020, 676714, 177246, 262396, 639872, 401440, 214034, 567857, 421728, 328655, 485143, 622658, 164600, 350690, 313059, 615713, 405094, 259993, -161115, 598109, 331210, 449425, 291033, 299622, 410826, 426601, 322806, 505261, 307953, 416827, 436088, 431508, 279362, 749595, 622569, 195262, 645919, 327496, 356289, 606637, 328581, 401874, 289726, 409504, 384098, 459611, 60242, 504439, 582310, 331012, 229603, 185313, 779631, 515137, 213073, 386405, 278326, 506722, 434348, 519669, 714885, 440113, 597886, 547046, 521807, 337282, 270446, 228662, 153987, 499890, 211576, -80138, 398691, 282036, 456676, 235342, 278510, 564044, 381347]
13621C81347q2020M41213k74145a9052B07215p2594K21118J05651k12347K8657
13611B77700J35279o5775K46228j96345H5430L57746A87445l8488J10589J57810
13601D17356J67447B49550N4988m4356K1648K10579k980B04372a49B4767M06813
13590D31580j33866J20469j53402H5719K78236A29643J33858A10840N29515k52783
13580C87572L46322B18090K28584j05177J59540B40026N524J89101P5452m2665
13570D67438j84827N14673c9971D69484A31413m8697M15783j93313j36102K53574
13560D22658C782M31214J58941A72326K16271A76288Q1334E7668a474B09038j077
13549B07961h838I3243J03707n124K3656I5747O7801l8087M04842j37125j36789
$$ y = [381347, 299327, 740540, 466395, -19052, 207215, 134621, 355739, 461390, 249043, 277700, 412979, 347204, 593432, 397087, 85430, 443176, 187445, 148957, 259546, 417356, 584803, 249550, 304538, 260182, 281830, 492409, 489429, 204372, -149, 24767, 431580, 297714, 418183, 264781, 85719, 363955, 129643, 263501, 110840, 640355, 387572, 733894, 218090, 446674, 341497, 501037, 240026, 245550, 434651, 510103, 467438, 282611, 797284, -39971, 469484, 131413, 82716, 498499, 305186, 169084, 422658, 3782, 434996, 593937, 172326, 388597, 176288, 257622, 57668, -1474, 209038, 207961, -8838, 93243, 196950, 191826, 215482, 95747, 163548, 125461, 530303, 393178, 256389]
13538B56389J34248K48380k55575m7329C0387J48940g223C8590J85895J52596
13528C77081A74130n5282M35112k18349j07632a31888B54298J16897A83123J12927
13518B96050r0922N0686H8585K26956J57770k20743b9288B85638r4981K06188
13508C96845o135E891J70869q0347J56218N4308m4475J53060l2913O1566k03106
13497B41071J22751j73562J24960C8814L36175p8787r8074O8908d12F4646J76192
13486B40838F4399N051a19208A09592L10129j50125q2704B7192L41597m1248A57995
13474D82184G1939N26622A60013k7335R3009B7258M4686L85377m8203a236B84431
13462B51926n3798A9129J77988O526J44223A58097j1120J03691a52642F7791K29786
$$ y = [256389, 390637, 639017, 383442, 336113, 30387, 179327, -7223, 38590, 224485, 377081, 174130, 118848, 553960, 335611, 227979, -131888, 254298, 371195, 183123, 296050, 205128, 255814, 88585, 315541, 473311, 252568, -29288, 285638, 190657, 396845, 390710, 5891, 176760, 96413, 252631, 306939, 262464, 415524, 382611, 444177, 241071, 363822, 190260, 315220, 38814, 374989, 296202, 198128, 267036, -412, 64646, 240838, 64399, 69450, -119208, 109592, 419721, 269596, 186892, 27192, 368789, 327541, 157995, 482184, 71939, 598561, 160013, 132678, 225687, 27258, 71944, 457321, 409118, -1236, 284431, 251926, 198128, 19129, 197117, 203643, 347866, 158097, 146977, 250668, -152642, 67791, 297577]
13451B97577l1478k5371J07666a13665B07601o1445J09055k230b741B41789q4971
13440A56818M7073J93446j29780J72902B14425J51635c6866A69466J5944J50332
13430C35742a94212B32792A4944Q6771b7579l6457l7800A08242B2644K41545J28553
13419C92742I5499k7595Q6815A9477q97K08220j00121L5472E2286J43395J65355
13408C61036n0159O578C472J46678M7046J00535p7156i0424c6472B42470A19080
13396B54840Q607A28376K20071C8300L8953M14892h1553A54146M9438K93888l1546
13385D65926A87292N4015h922j15775A12234B07K09313J82060A50245B8115J48216
13374A76331O6286Q3428D160K10962D2576K62616F6514J07753J92449l0339d4117
$$ y = [297577, 266099, 240728, 348394, -113665, 207601, 146156, 255211, 252981, -2741, 241789, 156818, 203891, 397337, 267557, 440459, 214425, 366060, -36866, 169466, 185410, 335742, -194212, 232792, 14944, 101715, -27579, -64036, -101836, 108242, 22644, 264189, 392742, 95499, 67904, 154719, 19477, 18580, 226800, 126679, 162151, 52286, 195681, 361036, 310877, 317455, 3472, 150150, 197196, 297731, 220575, -90424, -36472, 242470, 119080, 254840, 263447, 128376, 348447, 38300, 77253, 492145, -81553, 154146, 203584, 497472, 465926, 187292, 241307, -8922, -124697, 112234, 207, 209520, 391580, 150245, 28115, 176331, 242617, 326045, 4160, 215122, 42576, 305192, 66514, 174267, 366716, 336377, -44117]
13362B58335D6075a58180A06783K35559P0789n6441f8039A32939K73755m8438
13352C58256G7810K79442G2495A208K73952A02393J5485K9487J09205k6161r8791
13341A31618J48801P9381A30609O8903J63311L9119j93827J65707A60979j1684
13331A49295A4607a2483j1547H8339J54599d0890o2730M188P79A9902K5463J45777
13319A91142a482D6392M36293c536a58C63330a66895B25024R5129A4338d9633
13307A40029K26021j8084j61825q0287P7280N8781m6608q2737b02668A98237a2960
13295A39866E9409R2276a2188m0879H3871c7962C5556K21534r2118G8483P7893
13284A56376N3582j2150J05007A50609K8507N0187o8523l1615l6115P7538a11152
$$ y = [258335, 46075, -158180, 106783, 342342, 413131, 356690, -68039, 132939, 406694, 358256, 77810, 357252, 72495, 1208, 275160, 102393, 117878, 147365, 256570, 230409, 131618, 280419, 359800, 130609, 199512, 362823, 401942, 208115, 373822, 160979, 149295, 14607, -12483, -24030, 88339, 242938, -40890, -103620, -99432, -98653, 19902, 45365, 191142, -1482, 46392, 482685, -3536, -158, 363330, -166895, 225024, 320153, 14338, -49633, 140029, 366050, 347966, 186141, 105854, 183134, 241915, 195307, 112570, -202668, 198237, -12960, 139866, 59409, 151685, -12188, -53067, 83871, -37962, 35556, 257090, 164972, 78483, 156376, 209958, 197808, 302815, 150609, 179116, 229303, 160780, 129165, 93050, 170588, -111152]
13272C67120L0609o4676c6281A76937o664e6843A06917k2737J08834a0260L306
13261f954B77967a38927H3844K1770a21042D4941J57130I6896b33712g6297G1138
13249A40314A8144c6389J8043A38851M3954a22237F9899J11532F5995K23630C8757
13237C21645A1288J19820J45860A87e9777B13062G9659b18191A80800J08220a36274
13225C73365a21609C89655j35125a08921C05869j03688D2363b2924B13990p3599
13215A40391E331J96781G4459J84823j02319M5410f5057B11771f1522k71641A00542
13203G8933J72556G1679L01401A54841h7283j03736D01120A96878K16765j93232
13193B20411a12677B22590K4498C048a3836m3276H9328b46646c1558B54235n6459
$$ y = [367120, 397729, 333053, -36281, 176937, 170273, -56843, 106917, 84180, 193014, -10260, -6954, 277967, -138927, 83844, 105614, -121042, 44941, 202071, 96896, -233712, -76297, 71138, 140314, 18144, -36389, -18346, 138851, 182805, -122237, 69899, 181431, 65995, 289625, 38757, 321645, 11288, 131108, 276968, 187, -59777, 213062, 79659, -218191, 180800, 289020, -136274, 373365, -121609, 389655, 254530, -108921, 305869, 202181, 42363, -22924, 213990, 140391, 5331, 202112, 74459, 259282, 156963, 202373, -65057, 211771, -61522, -333163, 100542, 78933, 251489, 71679, 373080, 154841, -87283, -191019, 401120, 196878, 413643, 220411, -112677, 222590, 247088, 3048, -13836, -57112, 89328, -246646, -31558, 254235, 197776]
13182A97776G8010e8899I774b9356G2957J16447C9539M4345J63993e1918B17833
13170D6419J50707b6698r6617B12261i2544k26657F7118b20044A47460E0381J65493
13159B15874a71186F708b504G3261C5450j269K78399B2507L3780O9965C2635J45438
13147A78073K07705B4662J2216K90927A14292f557k86A36432M1877n1954k3885
13136A02470d0141B50970d0912C3049N9040j0200a77569B09518L6703o7539a36430
13124f981j16312A10786k8956a41948F6012a76370C9929b37176f844A77219n6075
13113A21144m4398c06957F2531b53310A77731d3049F0357B510b10962A53680c3289
13101I218J20237o1688g2053B38535a0385H1164a28046B12185i5138D85624C7205
$$ y = [197776, 78010, -58899, 9774, -29356, 72957, 189404, 39539, 83884, 247877, -51918, 217833, 46419, 197126, -26698, -123315, 212261, -92544, -319201, 67118, -220044, 147460, 50381, 215874, -171186, 6708, -2504, 73261, 35450, 34181, 312580, 22507, 56287, 126252, 32635, 178073, 385778, 24662, 36878, 327805, 114292, -6557, -6843, 136432, 178309, 126355, 102470, -40141, 250970, -40912, 33049, 92089, 81889, -177569, 209518, 246221, 178682, -136430, -6981, -123293, 110786, 81830, -141948, 66012, -176370, 39929, -237176, -6844, 177219, 121144, 76746, -306957, 62531, -253310, 177731, -43049, 60357, 2510, -210962, 153680, -33289, 9218, 129455, 67767, -72053, 238535, -10385, 81164, -128046, 212185, -95138, 485624, 37205]
13089C62223A28520C4414P8886P223N5314d264k24401A85832l6698f157H609K2335
13077C0944L09180b36014B78751c6827A37632b23111A88541d1481A09828C1941
13066C13210A41479D7158d25021f6000A07082m4930i7428E4381e5567B33662N6068
13055B89730I4341J24543G4072a17515D3958P8857a2977D79438k24248c8568B01905
13043E146J87696k1894a39907A84026a22892E6217i2069F936K14194D6590K48457
13032B95047F7990k971J62967b01461B42214o5902a08120I1082M6899K6712a40194
13020b55983g2018B5434N5772O7037O9010J53197a29817d3570H0761A1575b17185
13008C43358C0522d4281B00273a93640A96619b2288A2801a54709a5441m0308j6773
$$ y = [362223, 128520, 34414, 113300, 120523, 175837, -4264, -228665, 185832, 149134, -6157, 8609, 30944, 340124, -236014, 278751, -36827, 137632, -223111, 188541, -41481, 109828, 31941, 313210, 141479, 47158, -425021, -66000, 107082, 62152, -97428, 54381, -55567, 233662, 289730, 94341, 218884, 74072, -117515, 43958, 122815, -12977, 479438, 255190, -38568, 201905, 5146, 192842, 170948, -139907, 184026, -122892, 56217, -92069, 6936, 221130, 46590, 295047, 67990, 65019, 227986, -201461, 242214, 176312, -108120, 91082, 137981, 164693, -140194, -255983, -72018, 25434, 81206, 148243, 217253, 370450, -129817, -43570, 80761, 11575, -217185, 343358, 30522, -44281, 200273, -193640, 196619, -22288, 12801, -154709, -15441, -55749, -72522]
12997g2522I2237i360j00318B32886K03046K8699A20761B0898L9645j6052L27331
12986C71822h2059A44767K6165E5485k055f0068B4655a3753m2050A86592a35619
12974B57400j05705n4081B0557L8740Q0905E9556a9932A2071K21628e6248F063
12962B4301L26267l6851A26582a56001b3880o5633A1826K51102a13449A06165
12951b58565F1525b17578A60086i151l5659j84789B21946B9897d00161f5258H009
12939B29471K5918g3193A2491a82003N0779r1739E3132J70633i3424A43249a13354
12927a82924B26901a24286B7954h189H9556n666q791a18199B42599e7034Q635
12916d8399k78000g0991A22385d9563l5453B06738b83382A63193K03150D3204
$$ y = [-72522, 92237, -9360, -109678, 232886, 435932, 464631, 120761, 20898, 60543, 44491, 371822, -82059, 144767, 170932, 55485, 53430, -60068, 24655, -13753, -55803, 186592, -135619, 257400, 151695, 97614, 20557, 59297, 140202, 59556, -19932, 12071, 233699, -56248, 6063, 24301, 350568, 313717, 126582, -156001, -23880, -89513, 11826, 262928, -113449, 106165, -258565, 61525, -217578, 160086, -9151, -44810, -229599, 221946, 29897, -400161, -65258, 8009, 229471, 255389, -73193, 12491, -182003, -131224, -222963, 53132, 223765, -93424, 143249, -113354, -182924, 226901, -124286, 27954, -8189, 89556, 83890, 75099, -118199, 242599, -57034, -48399, -326399, -70991, 122385, -49563, -85016, 206738, -283382, 163193, 366343, 43204]
12905i5869C52420d5136n1013B10862E716d1774n7483J5981j67539C5850J81842
12894B17692h5584F7611c24584b9914k47682G0914L8167a14732p5710h8442L5328
12883e3114p0227G770L8156g0466B4658P5778i3500A95351b18462I0627K6864
12872A17491B1566Q0862b01528B29885a99899D1407a44709j71290A725b8134o9343
12861i7477r6788D03192e9056j28785C45019c11544A19685J08866b29990N7902
12851a72088A06820c869A33404R0809b17354P8280B05752J22654j110a03241j03061
12840b06302A74296q6528J29843L9009c8055j55329B05259f3833G7159c6631E5965
12828A56226k5434n6130b4042E1483Q8419b42663b9424A82506i2937B36442K03508
$$ y = [-95869, 352420, -45136, -96149, 210862, 5716, -41774, -99257, -83276, -250815, 35850, 217692, -85584, 67611, -324584, -29914, -277596, 70914, 109081, -114732, -190442, -88442, -53114, -123341, 7770, 45926, -70466, 24658, 100436, -93500, 195351, -218462, 90627, 117491, 21566, 102428, -201528, 229885, -199899, 41407, -144709, -315999, 1725, -28134, -97477, -194265, 403192, -59056, -187841, 345019, -311544, 119685, 228551, -229990, -172088, 106820, -3869, 133404, 224213, -217354, -139074, 205752, 328406, 327296, -103241, -206302, 174296, 87768, 217611, 256620, -38055, -193384, 205259, -63833, 77159, -36631, 55965, 156226, 130792, 74662, -24042, 51483, 139902, -242663, -29424, 182506, -92937, 236442, 439950]
12817D39950d4583k08183C9084c2835A27587C1464R652J30891D8453a5332q8411
12806a03743B62650n6718g0366B17402b26294H4126c34242N5736e5788k98295
12796c54083e6666a4329m784n9835o2501L9530E2541J25056h302l79284d5215
12784a53294a5414A56388K1731a06593B31386J35208h5974H4753D2346c174C07838
12772d3726j34419C63448d5504j20797A8897L5367d64644b18272J01384N0697
12762f6191N627A78410B9159M46375G3545A5363J39109Q0488a47071A39736Q559
12751A48295a06998C4197O0136a12887M4667J4351o3563j58147A69729c23395
12740B52360j09643B606a12862q5394R4692A61237R2957C1006J86066B3529J03830
$$ y = [439950, -44583, -252766, 39084, -32835, 127587, 31464, 41116, 172007, 48453, -15332, -103743, 262650, 205932, -70366, 217402, -226294, 84126, -334242, -278506, -55788, -354083, -56666, -14329, -19113, -78948, -141449, -101919, 52541, 177597, -8302, -387586, -45215, -153294, -15414, 156388, 178119, -106593, 231386, 366594, -85974, 84753, 42346, -3174, 307838, -43726, -178145, 363448, -45504, -166301, 18897, 54264, -464644, -218272, -116888, -66191, -60564, 178410, 29159, 475534, 73545, 15363, 154472, 234960, -147071, 139736, 148295, -106998, 34197, 94333, -112887, -68220, -53869, -117432, -275579, 169729, -323395, 252360, 142717, 2606, -112862, -198256, -103564, 161237, 254194, 31006, 217072, 23529, 127359]
12729A27359J15980G5445a76076c3721A60201K31150a2632B25495b6822A45496
12718I1747N6442K55995A08730J6767g1587q9017c2607J5812D7620J59884J77142
12707C84646j42560G4488a83870D8091J02056E3125J420a53089f9175l47254A43380
12695B56230c51799H5880a27080c3491m4980l9074F2730J32207a852j30757B5468
12683a01404A30000d6913B53609A22801J83930A17095L3654g7658C98739A14295
12672A35618F0111g7384A18545R414K678o4188J7286A3587N5900a94583p7057
12661b71640F6757J65062C6559b07072A80306a52202b1637A87425E676K42573
12651B48249O3558b7409D8944M4707J44753o3486k2377G104c3820D4873J2425
$$ y = [127359, 243339, 75445, -176076, -33721, 160201, 391351, -12632, 225495, -26822, 145496, 91747, 148189, 404184, 108730, 125497, -71587, -160604, -32607, -16795, 47620, 207504, 384646, 242086, 74488, -183870, 48091, 150147, 53125, 54545, -153089, -69175, -416429, 143380, 256230, -351799, 85880, -127080, -33491, -78471, -117545, 62730, 194937, -1852, -132609, 25468, -101404, 130000, -46913, 253609, 122801, 306731, 117095, 150749, -77658, 398739, 114295, 135618, 60111, -77384, 118545, 127959, 130637, 66449, 83735, 13587, 69487, -194583, -271640, 66757, 231819, 36559, -207072, 180306, -152202, -21637, 187425, 5676, 248249, 311807, -27409, 48944, 93651, 238404, 174918, 152541, 7104, -33820, 44873, 57298]
12640E7298J28910H056Q4166J9842n5612M7500k6870Q4293p4992a55505j07937
12629b63442A76266C9087i128j3220B18213A9230e4009B85059j28135o4031M8601
12618A41494J25152o6573b47885a0878F5429J30738a15598A38517a45199k01643
12608c46842l5983B27707J7862h4750A94441f9869A22217C7351Q3450i7500B08413
12596C1573K1589J42207a94220A0125a40134C91436a95846f9073j63731Q8349
12586a44455L2137B2268a52629E2197a85411B29591a44313l428C56401a66544
12575E2423h6728B37763J76875c0594A22605b8766F0644K9013A4060A491a21343
12563D5539R4373J0485a35124b5726m4267j43912d9682j16877d0827A74721m9313
$$ y = [57298, 186208, 8056, 92222, 112064, 56452, 103952, 77082, 161375, 86383, -155505, -263442, 176266, 39087, -9128, -22348, 218213, 19230, -54009, 285059, 156924, 92893, 141494, 266646, 200073, -247885, -10878, 65429, 196167, -115598, 138517, -145199, -346842, -382825, 227707, 245569, -84750, 194441, -69869, 122217, 37351, 120801, -97500, 208413, 31573, 53162, 195369, -194220, 10125, -140134, 391436, -195846, -69073, -232804, -144455, -112318, 22268, -152629, 52197, -185411, 229591, -144313, -147741, 356401, -166544, 52423, -86728, 237763, 414638, -30594, 122605, -28766, 60644, 89657, 14060, 1491, -121343, 45539, 139912, 150397, -135124, -25726, -69993, -213905, -49682, -166559, -40827, 174721, 125408]
12552A25408a80411k12698A14715K253A7688M4546R927K9020a44237B12653k337
12541B10316i2260k1527A2960a7926A95787b70831I812b32354A0475g0958k31352
12530c02310d2864k7430d891C66265A60864b08540A35368N0444B8304c7300d047
12518E7963F221K17924L5233a7687A61257a98682R8339A42886d82627A35801C0396
12506d1531n2845r2887m7943L9111A4215e0045l1116j98946B67272H6754O8695
12495A55449L0457Q9674c57842a38278o6664D1116L2027A8573h866E5578c1101
12483A38922a14515d2179I4483A5162f1227k04256A24410L162j5736a16395A63711
12471a94897h4234J4760A90422J0367a14801C15014a13525A14168a45749B2759
$$ y = [125408, -180411, -393109, 114715, 116968, 17688, 62234, 72161, 101181, -144237, 212653, 210316, -92260, -113787, 12960, -17926, 195787, -270831, 9812, -232354, 10475, -70958, -302310, -42864, -70294, -4891, 366265, 160864, -208540, 135368, 185812, 28304, -37300, -4047, 57963, 6221, 224145, 259378, -17687, 161257, -198682, -100343, 142886, -482627, 135801, 30396, -41531, -94376, -187263, -235206, -196095, 14215, -50045, -81161, -280107, 267272, 86754, 155449, 185906, 275580, -357842, -138278, -204942, 41116, 73143, 18573, -8866, 55578, -31101, 138922, -114515, -42179, 94483, 15162, -61227, -265483, 124410, 127572, 111836, -116395, 163711, -194897, -84234, -69474, 190422, 200789, -114801, 315014, -113525, 114168, -145749, 22759]
12460a37679L3950m392A10760j7253O9070a94683o8290I2991a95268A69368i9709
12448a09188a5973j32659G6654f5814A56154a49894q2092e5335A65682D3259e0187
12436g7922b2832A64207b44369J4470A62298i2673K6745A7226a77542b8731j17843
12425a46574L2107l38212A23078n3794i4306J6642k6012A2114L03449a60204D9118
12413c59143Q1415A33384E2845k857M4391B7390i2068B44108b2591B43996b43931
12401c1153j76419b0859K876A8939c79506K71A42465M7904j4834J86770a3445
12389a34314l975C7871a26847j67206A28370b8723l22860A78732d142B37370j5378
12378B21992o2827n5011D652M0949J69077j175D0364d7879l3027A05697E2002
$$ y = [-137679, -103729, -108121, 110760, 93507, 162577, -194683, -262973, 92991, -195268, 169368, -99709, -109188, -15973, -148632, 76654, -65814, 156154, -149894, -231986, -55335, 165682, 43259, -50187, -77922, -22832, 164207, -244369, -229899, 162298, -92673, -65928, 17226, -177542, -28731, -146574, -114467, -452679, 123078, 69284, -94306, -77664, -103676, 12114, 315563, -160204, 49118, -359143, -277728, 133384, 52845, 49988, 94379, 27390, -92068, 244108, -22591, 243996, -243931, -31153, -207572, -20859, -17983, 18939, -379506, -379235, 142465, 190369, 175535, 362305, -13445, -134314, -138289, 37871, -126847, -294053, 128370, -28723, -351583, 178732, -4142, 237370, 221992, 159165, 104154, 4652, 45601, 214678, 213503, 40364, -47879, -80906, 105697, 52002]
12366c5192C41870F714L14017D9902J25776a40080a159j32467A2595O118a62638
12354f2654j83413c4659j62860E2236a11466C4144J74064K26132a85568R1966
12344i3602p1250A01189A1993K3333c0420B06135a54566M6210L2506B93045a15518
12332A20925a73703D35906A17955c39567G3482M4617M1424P6137h7696A65164
12321B25093b91411B41306i0185B30419a79458h3230r8929b9948A41349E3331
12310a1957I9316b9888B90094C1136p713L81435f1390K7287q8554K8519f590D2370
12297G1505O2610m9463K60085a22120f536m2792n6909A35488A8589L99073a71973
12285b38289A54979J6582g7319A43509J37884j0198A27079R4958a48803A72409
$$ y = [-35192, 341870, 6714, 320731, 49902, 175678, -140080, -1159, -133626, 12595, 18713, -162638, -62654, -246067, -34659, -197519, 52236, -111466, 34144, 208208, 434340, -185568, -93602, -164852, 101189, 11993, 35326, -30420, 206135, -154566, -108356, -75850, 293045, -115518, 120925, -173703, 435906, 117955, -339567, 73482, 118099, 159523, 235660, -87696, 165164, 225093, -291411, 241306, -90185, 230419, -179458, -83230, -182159, -29948, 141349, 53331, -11957, 99316, -29888, 290094, 31136, 23423, 404858, -61390, -34103, -122657, -94138, -6590, 42370, 71505, 134115, 84652, 344737, -122120, -6536, -49328, -106237, 135488, 18589, 417662, -171973, -238289, 154979, 171561, -77319, 143509, 281393, 271195, 127079, 222037, -148803, 172409]
12274b97992i6139k69293E4951a24826C85944G3740K81015P207b67679A58868
12263A41219f9375C6344g5122j70476B07944q4194b08970P4400E2803O3208J81549
12252B97560H5907K01917I102J18433k6628D9894L5623a13808E1627n532L45132
12241C91227A04832D1465J5016h8317B61748J12624H8977O3222L49817a86012
12230D1144h0983A63875m8264h3880A19953b92425A37388e1990A49179h7213A79829
12218I9619d1554B38572g3230A00789a20114B14996q5502k7746P9067m4005L16464
12207D53274c20274A55685p545a86312a0954j09596c9914P901B36202L5103j5856
12196B55449q505i4714A62504j2735A4056e7933b0217B00924J22380G9286c38579
$$ y = [-297992, -96139, -365432, 54951, -124826, 385944, 73740, 354755, 361962, -267679, 158868, 141219, -69375, 36344, -75122, -245598, 207944, 123750, -208970, -134570, 52803, 116011, 297560, 85907, 287824, 9102, 127535, 100907, 49894, 85517, -113808, 51627, 46095, 391227, 104832, 41465, 56481, -88317, 261748, 374372, 88977, 152199, 502016, -186012, 41144, -80983, 163875, 115611, -83880, 119953, -292425, 137388, -51990, 149179, -87213, 179829, 99619, -41554, 238572, -73230, 100789, -120114, 214996, 129494, 101748, 180815, 136810, 453274, -320274, 155685, 148140, -186312, -10954, -120550, -39914, -32013, 236202, 271305, 255449, 246944, -94714, 162504, 149769, 14056, -57933, -20217, 200924, 323304, 79286, -338579]
12184B28042j04855a43444B17143e1102I1803a94880A67544d5443E1423g0307
12173A15855b6506E0220L37285n114M6759h9660I9498K22564j06775b22543b0995
12161a23810J6046M1364K0467m7789k07375E7262k828L24046D5817a62984r3602
12150b56586D28677a18909a0572E0887K64315A13449M1949h3679H7221a59212
12139b30163A73588J71505a3035A85452A893a52752b2091k58260A6268L6511Q0021
12128A32800R1472a22498j31523A66352K04170a68667N2995E1227f6750C91778
12117A27237P2813n3114c2612E2501b85121A00670P1602a38178A02416K9406K944
12106A34766d037G585d2148J9942l21691B6114b78560B23063B6286a74827J6241
$$ y = [228042, 123187, -143444, 217143, -51102, 91803, -194880, 167544, -45443, 51423, -70307, 115855, -26506, 50220, 387505, 382391, 429150, -89660, 99498, 322062, 215287, -222543, -20995, -123810, -107764, -66400, -45933, -93722, -301097, 57262, 54434, 378480, 45817, -162984, -256586, 428677, -118909, -10572, 50887, 315202, 113449, 155398, -83679, 87221, -159212, -230163, 173588, 345093, -13035, 185452, 1893, -152752, -22091, -280351, 16268, 52779, 132800, 224272, -122498, -254021, 166352, 370522, -168667, -115672, 51227, -66750, 391778, 127237, 200050, 146936, -32612, 52501, -285121, 100670, 172272, -138178, 102416, 131822, 134766, -4037, 7585, -42148, -22206, -343897, 26114, -278560, 223063, 26286, -174827, -158586]
12095a58586m8504k486B63582L235d4149l2648j33450E9771d3978r7650j47332
12084b88960P6684Q1353c4887r1095B51947b52072B41779n0026h0118k05665A08326
12072H9734a37715f8324C10843d28061d8673A61465l0153f5154k1368E10788Q9212
12061F00000k17450J29543g7344c5009B24255O368l8141g1735F9186h1676B10625
12049h1769E1936P8145b99121b1624p643k25280J15039d4955j35910E7413a05441
12037A6096b37633L6501N3454A27885b96262A23440L7281D067h0416A00584k4189
12026G6395c87464A273c34192J21721A55620a0313l8438C20866b61799C13406
12015A3847c81A7465J22024F2839c53033B83558F5265B6441L1892L22174J041
$$ y = [-158586, -207090, -209576, 263582, 266817, -44149, -76797, -210247, 59771, -43978, -141628, -288960, -212276, -130923, -34887, -125982, 251947, -252072, 241779, 191753, -80118, -285783, 108326, 89734, -137715, -68324, 310843, -428061, -48673, 161465, 131312, -65154, -86522, 510788, 600000, 382550, 512093, -77344, -35009, 224255, 230623, 192482, -71735, 69186, -81676, 210625, -81769, 51936, 130081, -299121, -21624, -29267, -254547, -139508, -44955, -180865, 57413, -105441, 16096, -237633, -201132, -147678, 127885, -296262, 123440, 160721, 4067, -80416, 100584, 76395, -387464, 1273, -334192, -212471, 155620, -10313, -48751, 320866, -261799, 313406, 13847, -381, 17465, 139489, 62839, -353033, 283558, 65265, 26441, 58333, 380507, 381548]
12004C81548K0525I8246a01236J7279L0991A42309e1737B56712D2535a58717K4343
11993a34374H6549Q3815K43558b8595k48219e1085B18040C4567h4426F5927B4396
11981B13526P4237E7352i2643a8913j10080p060M4886b9824M357k24270a14953
11969c2308E2841a73824p5311P1671d9486r259B91720h9670q8379j64608P2737
11958b69920a18099N3371k16316B27335I148d4082H8446J47942m0851h1597B16543
11946A70488J53047j52078G2279a93402h0122H4047a63598A66845k8796e4121
11935F0548G44K5655P8732d3421k14859a08919C57088f2241r1692A66348a25464
11923A99074m3364g6757A32894B6017h0622j66885A53356l2584g6859b8143C14659
$$ y = [381548, 402073, 98246, -101236, -83957, -52966, 142309, -51737, 256712, 42535, -158717, -134374, 86549, 170364, 413922, -28595, -276814, -51085, 218040, 34567, -84426, 65927, 24396, 213526, 287763, 57352, -92643, -18913, -128993, -136053, -91167, -29824, -25467, -249737, -114953, -32308, 52841, -173824, -249135, -177464, -49486, -58745, 291720, -89670, -178049, -342657, -269920, -118099, -64728, -281044, 227335, 9148, -44082, 88446, 236388, 195537, -81597, 216543, 170488, 323535, 171457, 72279, -193402, -80122, 84047, -163598, 166845, 138049, -54121, 60548, 744, 26399, 105131, -43421, -258280, -108919, 357088, -62241, -153933, 166348, -125464, 199074, 155710, -76757, 132894, 26017, -80622, -247507, 153356, 120772, -76859, -28143, 314659]
11911b50675A42979D7759J45970K8911a728F9333J08716p8324c66563C11575H6387
11899c75191L3395j32174A63793b23255e6637E6752J22162i4299B3148o88J06151
11888A28611d11748I8907c3261j17371M4012D1697d9703A06159R6652q9314i3408
11876i0610p811j66128g136l1396I7019J07482a04375j24351a7352B21902m9641
11865A72261D387a28675L9884K9127A13797N8785J6625a48636f832A9079b31212
11853b279F0105b04378D39451A83685a39735j17066A08103g3282i368C12575b01163
11841D8742M54003a67783O2115j7998A24257b424k11274B09459C855a19547m8497
11830a68044h0676G5539Q9253e0663r8076J759r9942f8230b5467j66611A32467
$$ y = [-250675, 142979, 47759, 193729, 222640, -1728, 69333, 178049, 99725, -366563, 311575, 86387, -375191, -341796, -473970, 163793, -223255, -56637, 56752, 178914, -94299, 23148, 22460, 128611, -411748, 98907, -33261, -150632, -106620, 41697, -49703, 106159, 202811, 113497, -93408, -90610, -98421, -264549, -7136, -38532, 97019, 204501, -104375, -228726, -17352, 221902, 172261, 4387, -128675, -88791, -59664, 113797, 172582, 189207, -148636, -6832, 19079, -231212, -2279, 60105, -204378, 439451, 183685, -139735, -256801, 108103, -73282, -9368, 312575, -201163, 48742, 502745, -167783, -105668, -123666, 124257, -2424, -213698, 209459, 3855, -119547, -168044, -80676, 75539, 164792, -50663, -148739, -146980, -246922, -68230, -25467, -192078, 132467]
11818a7900p2689J1990O389C08135A04867A0202J09804f4529G030g8438A44183
11806a9584A9482J996a28199M539H6890J31258P9207f19643C41465a11431m08245
11795e19676d445l4941j78864R9513j98642A371a55651f5431D3719h1130E3847
11783F8858g9152j06357g4985b6994j70593L1246C12222p512c62545a28052N703
11772a22349j9442A66698b72740H665N4844c757C5471M6194b42097B31626i0849
11760b91343a10962a8820k0945C17429I6590b04506g3630j71990A6489J75432
11750A91921b17943K5881C55922j07789g99j49470J425A47017a60516A03114b74430
11738c10757A7595b18627A21718b36122O2656l8220A95886d41072a21296j26608
$$ y = [-17900, -90589, -78599, -72210, 308135, 104867, 10202, 120006, -64529, 7030, -78438, 144183, -19584, 19482, 21478, -128199, -123660, 86890, 218148, 297355, -619643, 341465, -111431, -519676, -4445, -39386, -218250, -118737, -317379, 1371, -155651, -65431, 43719, -81130, 53847, 68858, -79152, -185509, -74985, -26994, -197587, -166341, 312222, 304710, -362545, -128052, -122349, -141791, 166698, -272740, 8665, 63509, -3757, 35471, 81665, -242097, 231626, -90849, -291343, -110962, -18820, -39765, 317429, 96590, -204506, -73630, -245620, 16489, 191921, -217943, -192062, 355922, 248133, -799, -150269, -148844, 147017, -160516, 103114, -274430, -310757, 17595, -218627, 121718, -236122, -173466, -211686, 195886, -441072, -121296, -247904]
11728b47904H6518a6534C02634b6006n7212K0302k11515i1171B14181A0269b99455
11716B82406a23518A32024b16890C84237i194j22828B5919a95556A09608a41116
11705A04492a19060B3715K90432i3530A94974b31459O3882I353J75143K0033a92160
11693a87441f7630m8754C57690a38611C00739a73764B65656l2892e6796A3029
11682d91239J25635J10362E2662J86997I4070a26567D7582a6727F8747a09416
11671G043L45595a23716H386a6449j20753A96753a63311d8297k28964b0786j26501
11660a47287H3260a9177C24048m7627H3636k5836c57863F2685a55523C42437C179
11648g4603K9163j13961P0461A50482D4542c5866A68437M2921a45301J4010E382
$$ y = [-247904, 86518, -16534, 302634, -26006, -83218, -62916, -274431, -91171, 214181, 10269, -299455, 282406, -123518, 132024, -216890, 384237, -9194, -132022, 25919, -195556, 109608, -141116, 104492, -119060, 23715, 314147, -93530, 194974, -231459, -167577, 9353, 184496, 204529, -192160, -187441, -67630, -116384, 357690, -138611, 300739, -173764, 265656, 232764, -56796, 13029, -491239, -365604, -255242, 52662, 239659, 94070, -126567, 47582, -16727, 68747, -109416, 7043, 352638, -123716, 8386, -16449, -137202, 196753, -163311, -48297, -277261, -20786, -147287, 83260, -19177, 324048, 276421, 83636, 57800, -357863, 62685, -155523, 342437, 3179, -74603, -45440, -159401, -88940, 150482, 44542, -35866, 168437, 211358, -145301, -131291, 5382]
11636e8082B32767p5024a24770E9083J40690A387c9262k0091A3595c3871k98741
11625c32612B8497K5801J45529p0363E0948a6713j69167A86613k6340A8896L4294
11614E3190g560C29160c3717A55324D7198K3389A8184P6918B8550c3243j50206
11603a83449G4851a48547A03668a80756A39816C3170J38580B1586J28943K48030
11593C98559c40652a19612B8852a21533a7690A09755N7875H441b14937f4878I5792
11581a2445B90397m7722e4317D9322b22849F3650e1376I7511i1335p7757C138
11569b5708C29229A35394b57907D9820J67460d86871B30692b38363C35652a08524
11558f8361a7846n7242A62155a37802A13883Q6029g360J794l6934G318J05895
$$ y = [-58082, 232767, 157743, -124770, 59083, 199773, 1387, -39262, -59353, 13595, -33871, -332612, 28497, 54298, 199827, 129464, 50948, -16713, -185880, 186613, 160273, 18896, 53190, -7560, 329160, -33717, 155324, 47198, 70587, 18184, 95102, 28550, -33243, -183449, 74851, -148547, 103668, -180756, 139816, 33170, 171750, 21586, 150529, 398559, -340652, -119612, 28852, -121533, -17690, 109755, 167630, 8441, -214937, -64878, 95792, -12445, 290397, 242675, -54317, 49322, -222849, 63650, -51376, 97511, -91335, -169092, 3138, -25708, 329229, 135394, -257907, 49820, 217280, -486871, 230692, -238363, 335652, -108524, -68361, -17846, -75088, 162155, -137802, 113883, 199912, -7360, -5566, -42500, 7318, 113213]
11547A13213a30588k11343a03378C72491g2570o2783A0206f130j13618C18953
11536d1439A81890e176A33564B3893J2904Q2920K40046a26938A10388a9790B39753
11524B04789M5128l9640q8501B3583a72171B02234a38828C81494D7546b41817
11513a66231B03501a91767e6984B3420a88253A55014F4711A9511a28735j35628
11503b64363j41230d2160A17793A0503a85453d3699D3126b76816J0259f1440B4583
11491a43806C62483a03873d1815B10614f4492m158A07732a34655j9282H668f9762
11479A19224J38666g1008A11578A5630J33817A081N33404k54885J65470a1262
11468C5838K96353O6438G6985f3556A00671J01411M8708j6805j2774J71677c40621
$$ y = [113213, -130588, -341931, -103378, 372491, -72570, -135353, 10206, -6130, -119748, 318953, -41439, 181890, -5176, 133564, 23893, 36797, 119717, 359763, -126938, 110388, -19790, 239753, 204789, 249917, 210277, 121776, 23583, -172171, 202234, -138828, 381494, 47546, -241817, -166231, 203501, -191767, -56984, 23420, -188253, 155014, 64711, 19511, -128735, -264363, -405593, -42160, 117793, 10503, -185453, -43699, 43126, -276816, -266557, -61440, 24583, -143806, 362483, -103873, -41815, 210614, -64492, -68650, 107732, -134655, -153937, 8668, -69762, 119224, 257890, -71008, 111578, 15630, 149447, 1081, 534485, 279600, 445070, -11262, 35838, 332191, 398629, 76985, -63556, 100671, 202082, 250790, 233985, 221211, 392888, -340621]
11456B09878A840c9559m773p3139o384K5488A86049j9896b18490h3066l07344
11445c90410E1023J06139F5434K5698c32890g6994C83445j79439a44861J7243
11435a27618B7639f2834j99634e4461A4316J9906b620C05826i9888A25433j571
11424A23862M2325E7350a41371g121k82528j590B19774C7550b14094B0800K28849
11413B49649f7144k30647o593A34981c00314B65931b42421j00102A64998h7345
11402B51418a20342A36492h0960k51529J3831i9551H740j334P9255a94824j55729
11391c50553h0873c742A79230l6671a94046b7884j82762B61223O094I7481a69777
11379a14452f889n7760G9561c8980C73838b06806j0683A82832c19805P8983a243
$$ y = [209878, 1840, -39559, -44332, -117471, -123855, -98367, 186049, 166153, -218490, -83066, -390410, 51023, 157162, 65434, 91132, -332890, -76994, 383445, 204006, -144861, -127618, 27639, -62834, -262468, -54461, 14316, 34222, -2620, 305826, -99888, 125433, 123862, 166187, 57350, -141371, -7121, -289649, -291239, 219774, 37550, -214094, 20800, 249649, -67144, -297791, -304384, 134981, -300314, 265931, -242421, -342523, 164998, -87345, 251418, -120342, 136492, -80960, -332489, -318658, -99551, 8740, 7406, 86661, -194824, -350553, -80873, -3742, 179230, 142559, -194046, -27884, -210646, 261223, 267317, 97481, -169777, -114452, -6889, -64649, 79561, -38980, 373838, -206806, -217489, 182832, -319805, -240822, -1243]
11367a32415l5973A7283e12725D09894A46911A7933J32135a37745A03663h5397
11356b12961B81852c17231d2063q4808C7768b848r5503j32983A12554E3942e38610
11344d9101o570m3767D3988a36687C00520a24215L848A36692O5377F4038O9765
11333A33803K2313i6863B19213f3549D08401b41446h4344j38510d8528j19176
11323a67704N9568p1091E6961J074L7148c2984J1785q0232M7091q8918j11811
11312b55069A1476L3743b18417i6964d5358n2046J7331j48883J13035d41I6937
11300i4476b5752O09l15816a02690H6398e622p4319j61453i8538E6859b80365
11288b84852G8725R9458j6618b99703J10488B29269b17368C4174e8192B29785
$$ y = [-132415, -168388, 17283, -512725, 409894, 146911, 17933, 150068, -137745, 103663, -85397, -212961, 281852, -317231, -42063, -126871, 37768, -2848, -98351, -231334, 112554, 53942, -538610, -49101, -55671, -99438, 43988, -136687, 300520, -124215, -120367, 136692, 202069, 64038, 133803, 156116, -96863, 219213, -63549, 408401, -241446, -84344, -222854, -48528, -167704, -108136, -179227, 56961, 58035, 95183, -32984, -21199, -101431, -54340, -143258, -255069, 11476, 45219, -218417, -96964, -45358, -97404, -80073, -228956, -115921, -441, 96937, -94476, -25752, -25143, -340959, -102690, 86398, -5622, -79941, -241394, -98538, 56859, -280365, -284852, 78725, 178183, 161565, -299703, -189215, 229269, -217368, 34174, -58192, 229785]
11277E00281a76431B9673a11624k25704a31237O3465m8089j0002A8578b33961
11266d6625j66208l4773i3856A81418a5638j97294a9093i488k0623a2040j26824
11255a38864L7140j63601e5955A68196e6310E1587h6383m1200m7194A42819Q8004
11244B30823o4558N6271a38214n2173j0843M7251A18965e7310D9231a77235J6307
11233a60928k2529d7278C5914O9609b6641A70421c2109A79595j0249J46196e8582
11221A1702a59263g3161B42827a62555f2446k30774J44707m4587j67944J75228
11211a85816M6715J3759A36728n0958f1354b6848A04381J9620a20550j4679m5043
11200a80272G9402h5725A04229a16323j18218R9457N9751E8230r867d1848K0357
$$ y = [500281, -176431, 29673, -111624, -337328, -131237, -67772, -115861, -125863, 18578, -233961, -46625, -212833, -247606, -93856, 181418, -15638, -212932, -19093, -9488, -30111, -12040, -138864, -101724, -265325, -55955, 168196, -56310, 51587, -86383, -127583, -174777, 142819, 230823, 166265, 222536, -138214, -190387, -201230, -153979, 118965, -57310, 49231, -177235, -160928, -183457, -47278, 35914, 105523, -26641, 170421, -32109, 179595, 169346, 315542, -58582, 11702, -159263, -73161, 242827, -162555, -62446, -293220, -148513, -193100, -361044, -185816, -139101, -125342, 136728, 85770, -61354, -26848, 104381, 124001, -120550, -135229, -180272, 79402, -85725, 104229, -116323, -234541, -135084, -75333, 58230, 48363, -41848, -21491]
11189b1491j97227C0995b39630R4499L442I8361P977f6382H2009L2636B9100K40657
11177B69757c26387a07738B20607c1144I2746g0776k4002A56068a39212e0770
11166b58568k8693J17999B60414j25394f2914J4250C0335J45607C5970a99336
11155G2571a72749B20953b69738B15954a77448A76249a33206f4182A48543a32692
11144A21708a66170A54593Q1924c77940a10364B56367b55157d7375J8338j21181
11134a50218i250H4716K8328a15747m3217G4922C6025P9864J17239b444r9320
11123a01764G4306d7233m3891k22732F6818c53934i220B13513f9341A46516n1807
11112I4709D2723O3081a67199A32080g976k04907R3682j46407J6618j5915A29246
$$ y = [-21491, -218718, 30995, -239630, -145131, -141689, 98361, 106338, -66382, 82009, 114645, 29100, 269757, -326387, -107738, 220607, -31144, 92746, -70776, -94778, 156068, -139212, -50770, -258568, -287261, -169262, 260414, 135020, -62914, -48664, 30335, 175942, 35970, -199336, 72571, -172749, 220953, -269738, 215954, -177448, 176249, -133206, -64182, 148543, -132692, 121708, -166170, 154593, 236517, -377940, -110364, 256367, -255157, -47375, -29037, -150218, -9250, 84716, 113044, -115747, -158964, 74922, 36025, 115889, 233128, -2444, -101764, 74306, -47233, -91124, -313856, 66818, -353934, -9220, 213513, -69341, 146516, 94709, 42723, 105804, -167199, 132080, -7976, -212883, -119201, -265608, -248990, -264905, 129246]
11100H4726J93451k7244D6998J44437g6288C92998A28304a8736M474o458A12131
11088F313Q7747J34334J75748D7831J87947C1143K48202g1197K6821A20574A8199
11076A67787B0455b6749E8601J36026A5575a45617C10175f4389j77492B2432L44431
11065C66863m0147A43775K51199r4756b8055A36199a33710C26366M0090j61519
11055B04937Q6866J74803K5844j10478n994k9530A40332K71487k929J3507J09331
11044E31728j03452A97305R6879M00876j34580J46377k88521j90967N6666K61385
11034E45420j29610J02501j80199J07683j39230L26219l9339B17179Q1149j2788
11024B85540A06185L20432Q8272K5047k08046D6883K13536O1463f6024D34420
$$ y = [84726, 278177, 250933, 46998, 191435, -76288, 392998, 128304, -18736, -14262, -20720, 112131, 6313, 94060, 228394, 404142, 47831, 235778, 31143, 279345, -71197, -44376, 120574, 18199, 167787, 20455, -26749, 58601, 194627, 15575, -145617, 310175, -64389, -241881, 22432, 366863, 326716, 143775, 394974, 300218, -28055, 136199, -133710, 326366, 366456, 204937, 291803, 466606, 492450, 381972, 375978, 346448, 140332, 411819, 408890, 422397, 531728, 428276, 197305, 294184, 695060, 560480, 706857, 418336, 227369, 284035, 545420, 415810, 518311, 338112, 445795, 306565, 632784, 593445, 217179, 298328, 285540, 106185, 426617, 514889, 539936, 331890, 46883, 260419, 321882, -66024, 434420]
11013E78728B26756J13034J67715j47391j50011J75349q27J78398k5576B48865
11002C13126K41313B66266N5925A45255M27826k54865M455p0292J60190o2351
10992C50218K6462m4548m3204O7781k7776J11030j0459l4034O9997k5485k0078
10981D19904O3780j19889L17218C04892L46197k78292K19411N65804m15980K03132
10971I45164j1948K07625j09776K43120j32813L18866J13407m98231K47778M2904
10961A366096m28269J65633l45413j20077L75868K1007J125M57704n50733j77791
10951G65150K43157J83270k65245q0803R0952K388l70831l3221k19984L59325
10941F74158k91387j03250J62171A64140f2913C93790m5815H6909J80173i7300
$$ y = [578728, 226756, 339790, 507505, 360114, 210103, 385452, 384625, 563023, 537447, 248865, 313126, 554439, 266266, 322191, 145255, 573081, 318216, 322671, 252379, 412569, 350218, 376680, 332132, 288928, 356709, 328933, 439963, 429504, 395470, 465467, 439982, 419904, 483684, 363795, 681013, 304892, 651089, 372797, 592208, 1158012, 742032, 945164, 933216, 1140841, 1031065, 1274185, 1141372, 1460238, 1573645, 1075414, 1323192, 1366096, 937827, 1103460, 758047, 637970, 1013838, 1034845, 1035970, 1493674, 942941, 765150, 1008307, 1191577, 926332, 845529, 936481, 938869, 568038, 534817, 314833, 674158, 382771, 279521, 441692, 164140, -62913, 393790, 347975, 86909, 267082, -97300]
10930A45615h3256k2158B19198n7732l3487J29620l4179D2700a82226c8844m0915
10919g9759j10942r6242I4794a33400B3241O9230J15952b75010a06963j09286
10909b16249B76073a26808H5690f796n08676b54814K7011C60111b95972a99q1533
10898h1732H1834f0536k01894B30568a242A2069L2712b9238B47119b7076q8631
10887a15707A0070b19141A00457J07486a60886d1673h925F0841a40217J049E74897
10875f8218A7851c12065A35841L0253b08393p0350D026c146A84889m2937c50458
10863A75973a30523J6774L2094o1956J2334A51676a1658n4960A70643f8234A66739
10851a05940B0450b65661A03567b6495q3262j14497d6387r4909J0541A10733b52571
$$ y = [145615, -83256, -105414, 219198, 161466, 127979, 257599, 223420, 42700, -182226, -38844, -79759, -190701, -286943, 94794, -133400, 23241, 92471, 208423, -275010, -106963, -216249, 276073, -126808, 85690, -6796, -515472, -254814, -227803, 360111, -295972, -199, -81732, 81834, -60536, -262430, 230568, -1242, 12069, 44781, -29238, 247119, -27076, -115707, 10070, -219141, 100457, 207943, -160886, -41673, -8925, 60841, -140217, -139168, 574897, -68218, 17851, -312065, 135841, 166094, -208393, -278743, 4026, -3146, 184889, 141952, -350458, 175973, -130523, -113749, -81655, -143611, -131277, 151676, -11658, -66618, 170643, -68234, 166739, -105940, 20450, -265661, 103567, -26495, -109757, -224254, -46387, -141296, -130755, 110733, -252571]
10839A26467a64116j66473L7717I9695e3696A11536d7098D4413K99137a85469
10828f728k13246H4843a56233A31832J35317C909c37595F4250J9840a37195A40178
10816a32523A36969C8508J2801L36328a47764b8089j96973g0892A15349K5732
10806A41081b41686F7488a19878A18314L8430c357j10449D9280a31828c4187o9494
10795a03681J1355C23972i1761J3794q1338f0514D5056a83714h2920K2088A3094
10783a96814L0719K3627j13528h6769r8992f146nk43181f0786l18265A40259E554
10770a6626j1494A17485J5351l6392j1443g3596l5421k01319A54667c80150C676
10758B43436j9498n969e7665a2034j42628j24343J07992j0163p6221A60459R3052
$$ y = [126467, -164116, -330589, -292872, 99695, -53696, 111536, -47098, 44413, 343550, -185469, -6728, -219974, 84843, -156233, 131832, 267149, 3909, -337595, 64250, 84090, -137195, 140178, -132523, 136969, 38508, 51309, 387637, -147764, -28089, -225062, -70892, 115349, 141081, -241686, 67488, -119878, 118314, 156744, -3357, -113806, 49280, -131828, -34187, -103681, -92326, 323972, -91761, -77967, -159305, -60514, 45056, -183714, -82920, -60832, 13094, -196814, -166095, -142468, -255996, -86769, -185761, -6146, -6151, -249332, -60786, -379051, 140259, 5554, -16626, -28120, 117485, 132836, 96444, 85001, -73596, -109017, -310336, 154667, -380150, 3676, 243436, 223938, 217969, -57665, -12034, -154662, -279005, -171013, -181176, -257397, 160459, 253511]
10747B53511a61173A71351D3440J63837e0879C0561b75049C2795M9002k0328h9195
10735b70846J0406B3216i7987B53779l1217C4191g7528k75810a34580d2700B24669
10723b27675i9075M4776A9132b5340l04000A08287c8072j38240h7343A80204G4562
10711b88268f9336A45943k1959l9485b91286f1175I8923a49695G4956J07665a1863
10699A3232a89641q960C6304L28511G3191a1393G1733c26130M5822A6813J78733
10688A95546a29227B71455f1759J4362C54357j44470a53258f7773B55617m9588
10678B06029G9248i3260D6981P8704d9687k92972J05786Q2972E2692R1711C151
10666a20562B42093c6966m19047A20102a36694B63211j27945c1066j40997A4403
$$ y = [253511, -161173, 171351, 43440, 207277, -50879, 30561, -275049, 32795, 81797, 61469, -89195, -270846, -260440, 23216, -97987, 253779, 222562, 34191, -77528, -353338, -134580, -42700, 224669, -227675, -99075, -54299, 19132, -25340, -329340, 108287, -38072, -176312, -87343, 180204, 74562, -288268, -69336, 145943, 123984, 84499, -291286, -61175, 98923, -149695, 74956, 182621, -11863, 13232, -189641, -198601, 36304, 364815, 73191, -11393, 71733, -326130, -280308, 16813, 195546, -129227, 271455, -61759, -47397, 354357, 209887, -153258, -67773, 255617, 206029, 79248, -93260, 46981, 125685, -49687, -342659, -236873, -153901, 52692, 144403, 3151, -120562, 242093, -36966, -456013, 120102, -136694, 263211, 135266, -31066, -172063, 14403]
10655B00062a6245B51843h7696C3880c5379n2984m14176b35694D95556D3928b5363
10643a84905r6388J07126A14236b97835j10427A73629a35234N1500I8652r801
10633H8851h3862l7276K8815j28651a9319l27229H056P2302J48198b01811B43183
10621b5040k37983h7683o121D4834J18183a19101j38169a24039l34614n5132A50742
10609A59359n7923b08720g8541A27423c0491j86393A8920a11968B08315H557P6983
10598H5540M7791a50065B2882g8729A49135D38a86301B76295b05905G526f0300
10586g2965G3011c30560i2774k4459C7725a13088D580a46479A96879H3323D0719
10574A9598d8748l7019k49450A78826b79977C83863D4588R6364n4284P5096d14494
$$ y = [200062, -16245, 251843, -87696, 33880, -35379, -88363, -502539, -235694, 495556, 43928, -25363, -184905, -281293, -174167, 114236, -297835, -408262, 173629, -135234, -83734, 98652, 88851, -83862, -121138, -92323, -220974, -19319, -346548, 8056, 80358, 228556, -201811, 243183, -25040, -263023, -87683, -93804, 44834, 163017, -119101, -257270, -124039, -458653, -513785, 150742, 159359, 101436, -208720, -78541, 127423, -30491, -216884, 18920, -111968, 208315, 8557, 85540, 133331, -150065, 22882, -78729, 149135, 438, -186301, 276295, -205905, 7526, -60300, -72965, 73011, -330560, -92774, -117233, 37725, -113088, 4580, -146479, 196879, 83323, 40719, 19598, -48748, -85767, -335217, 178826, -279977, 383863, 44588, 140952, 86668, 161764, -414494]
10562b44013D0562a0041A02278a5414o6265b7826r3440r9031R3582a0928k53863
10551b64791a5475A33912K21746a06200D1837a27314N3539j37552A4097a88537
10540a13725A80856o4572a57983k5615h1561B96726a82365l7435B16028b00047
10529h2424H1836A1970O0480H35c19562A8341i6960C34572j46546a06666p5633
10518a82299j32619f1235a6655H7292R2038r056a99284B46684a29595a231B79374
10506C2637b127k05707H146a57972g1201A14544a98714A65395D7466b90650d6074
10494b7664j10667j06327b7707G4945j8979b17885H2568J26297B4941c5618A03938
10482b36120A79703i4677c754m9094h10A60492N9983K85853K7290B19073J84679
$$ y = [-244013, 40562, -10041, 102278, -15414, -81679, -27826, -121266, -220297, -126715, -10928, -264791, -15475, 133912, 355658, -106200, 41837, -127314, -73775, -211327, 14097, -188537, -113725, 180856, 116284, -157983, -183598, -81561, 296726, -182365, -219800, 216028, -200047, -82424, 81836, 11970, 72450, 835, -319562, 18341, -96960, 334572, 188026, -106666, -182299, -314918, -61235, -16655, 87292, 179330, 170274, -199284, 246684, -129595, -1231, 279374, 32637, -2127, -207834, 8146, -157972, -71201, 114544, -198714, 165395, 47466, -290650, -46074, -27664, -138331, -244658, -27707, 74945, 55966, -217885, 82568, 208865, 24941, -35618, 103938, -236120, 179703, -94677, -3754, -52848, -810, 160492, 220475, 506328, 533618, 219073, 403752]
10471D03752A7232b22204j07499A11095a75996C71526A48183a35913M4134D0942
10460a59630g0059B70007g367j55923A3929J9252R2695b18716B72711H8422k2774
10449F5648c70540c2168D692Q5492b73736J02288E799a45294K9291C6674a41285
10437C0460b38754N0083O3549e6552p567A23095l7163b71204J01856A25513c03409
10425E7987b1757p2088A94782a47846A45168C6866c60422a77857k9921A76137
10414f8014r004G1414a92842K6407B2569N5838b56510D7654B849b11502A15319
10402a3866k30741j20959J43258A1128J31397d8927C59072a5163j50140B8333
10391e8668j50445Q9021G5836b155B02977A2317J63340J06142d132B26221r5303
$$ y = [403752, 17232, -222204, -329703, 111095, -175996, 371526, 148183, -135913, -91779, 40942, -159630, -70059, 270007, -7367, -163290, 13929, 33181, 125876, -218716, 272711, 88422, 65648, -370540, -32168, 4692, 90184, -273736, -171448, 5799, -145294, -116003, 36674, -141285, 30460, -238754, -188671, -125122, -56552, -64119, 123095, 85932, -271204, -169348, 125513, -303409, 57987, -21757, -93845, 194782, -147846, 145168, 36866, -360422, -177857, -207778, 176137, -68014, -77018, 71414, -192842, -166435, 22569, 78407, -256510, 47654, 2849, -211502, 115319, -13866, -244607, -365566, -222308, 11128, 142525, -48927, 359072, -15163, -165303, 28333, -58668, -209113, -120092, 75836, -2155, 202977, 12317, 175657, 281799, -4132, 226221, 130918]
10380A30918j4386O8436n4846a86051A39078a00884p462N558q5195D03659a0460
10368E09576c8247C11308A31795l6919g5239B55733J1902k1109K33890A39171
10357A69120l3204L7248e4775B85826l1147E0772K11011A5488P8036J19064K16796
10346D29384j02493j53938G3384K394B814f6513B83779b7536D23752k08859P6311
10335B91204E2337R1662A1129J49101F4735J07412g7107k3954D0499b5182A54585
10323a06074C45145b44347h8322B46472D5586Q0568K75400A12523e7414a3176
10312a24604B21117N8100I8712O2575c3735k3570D7297J98444b61913g2222E8908
10300A75255a77375I7835N8224a75576k4108A08019k7576c3109J5424A22738a27007
$$ y = [130918, 116532, 184968, 130122, -186051, 139078, -100884, -108346, -102788, -187983, 403659, -10460, 509576, -38247, 311308, 131795, 94876, -75239, 255733, 267635, 246526, 480416, 139171, 169120, 135916, 173164, -54775, 285826, 254679, 50772, 261783, 15488, 93524, 212588, 429384, 326891, 172953, 73384, 75778, 2814, -66513, 283779, -27536, 423752, 214893, 291204, 52337, 143999, 11129, 160230, 64735, 172147, -77107, -101061, 40499, -25182, 154585, -106074, 345145, -244347, -88322, 246472, 45586, 126154, 401554, 112523, -57414, -13176, -124604, 221117, 279217, 98712, 161287, -33735, -57305, 47297, 245741, -261913, -72222, 58908, 175255, -177375, 97835, 156059, -175576, -199684, 108019, 80443, -33109, -17685, 122738, -127007]
10288A00705K24321C0583g8532j07497p5764B70254h8890j32304b0866j71080
10278a91946B0235h4879k562j5451D2472b94209C1641O8877b82428a26656n2722
10267a79378I0567a4312D6721a01094j11068A09633N6332g0165A84796a74433
10256g5255q0010B19096A00059K84299A61564B8706M24055h8308E2013o442j9481
10245B6090a01683E5731N5952b63347F2793d06088A5041J73774a15534C3626L1269
10234F4895c74673h0353F8393J28203K20263F9938N6591a05765d8994m23761d5403
10222A17051a15207q4572N5101F0906a18675n9740A28471K36256b94656E383a65642
10210b44603C02705j23956l5611i9359a1082j48295F6869j925h0228Q488B24382
$$ y = [100705, 325026, 30583, -78532, -186029, -261793, 270254, -88890, -221194, -20866, -191946, 20235, -84879, -87441, -102892, 42472, -294209, 31641, 100518, -282428, -126656, -179378, 90567, -14312, 46721, -101094, -212162, 109633, 165965, -70165, 184796, -174433, -75255, -155265, 219096, 100059, 384358, 161564, 28706, 452761, -88308, 52013, 45571, 26090, -101683, 55731, 111683, -263347, 62793, -406088, 15041, 188815, -115534, 33626, 64895, -374673, -80353, 68393, 196596, 416859, 69938, 126529, -105765, -48994, -472755, -45403, 117051, -115207, -199779, -144678, 60906, -118675, -178415, 128471, 364727, -294656, 5383, -165642, -244603, 302705, 178749, 143138, -99359, -11082, -159377, 66869, 64944, -80228, -71740, 224382]
10198c9889k25281Q1832A08346b1070A25642d274k48513O6844B58226C3341d36518
10186b38119H9657O4013c62810M4233h1460m02627C2779K54216F6806b02658e5481
10174D2023G129f5620F8812l1607a33601m0414o1470j78076e6063m2346A72158
10162B23049a70035B95958a13364H11b39799Q3443o0533d8588A72239n0058f3899
10150h5219A78060b45595a19059k41935I7143D1992f357I7914M6323o5309O9689
10139A48617a04432A7312a6336B3764P6389h0385A63465E3272i7018p3519q4886
10128b55423a6909p3095B2868M0611a31919K0440p3040G766a50481i562k1266
10117c0828A65767d0618j30377O5374a2123q8777j19704H3682c43329a15015k1943
$$ y = [-39889, -265170, -183338, 108346, -21070, 125642, -4274, -252787, -185943, 258226, 33341, -436518, -238119, 89657, 153670, -362810, -318577, -81460, -484087, 32779, 286995, 66806, -202658, -55481, 42023, 7129, -65620, 68812, 37205, -133601, -174015, -235485, -413561, -56063, -98409, 172158, 223049, -170035, 295958, -113364, 811, -239799, -156356, -216889, -48588, 172239, 122181, -63899, -85219, 178060, -245595, -119059, -360994, 97143, 41992, -6357, 97914, 144237, 78928, 148617, -104432, 17312, -16336, 23764, 100153, -80385, 163465, 53272, -97018, -170537, -255423, -16909, -90004, 22868, 63479, -131919, -111479, -184519, 7766, -150481, -9562, -30828, 165767, -40618, -170995, -105621, -12123, -100900, -220604, 83682, -343329, -115015, -136958]
10106a36958n0174C6404J15596b6751k02584C20857f0195o255A6277c0348l4194
10095f4542k8128r9123J4849B20036g8884G2178N9814A9075h6870c6242A57681
10083B65083a4174F3865h0263r6547L2205M46A06871B2147J51548a31344A72345
10071b45039B8272d3140B49469F3182O4575l1071K30488b3964p0701j03414h2406
10059D7700a80936L8677j59556J36750A16100b55553H455M9860a68442A14324
10048a3609r7818A10550b41514C7675C737a16761C34182i564p3084m5272n0783
10037a78703G4020d6413C7087e2632n1760B17573a20177I4541b57668g867H6436
10025a98197P3960p114m0435c5355j30946H4773l6567d1961o5480k57267n3879
$$ y = [-136958, -187132, 36404, 152000, -26751, -229335, 320857, -60195, -66450, 16277, -30348, -64542, -92670, -191793, -176944, 220036, -78884, 72178, 131992, 19075, -86870, -36242, 157681, 265083, -14174, 63865, -80263, -176810, -144605, -144159, 106871, 22147, 173695, -131344, 172345, -245039, 28272, -43140, 249469, 63182, 127757, 96686, 327174, -23964, -94665, -198079, -82406, 47700, -180936, -142259, -301815, -165065, 116100, -255553, 8455, 58315, -168442, 114324, -13609, -111427, 110550, -241514, 37675, 3737, -116761, 334182, -9564, -82648, -127920, -178703, 74020, -46413, 37087, -52632, -104392, 217573, -120177, 94541, -257668, -7867, 86436, -198197, -124237, -131351, -171786, -35355, -166301, 84773, 48206, -41961, -107441, -364708, -418587]
10014d18587E8561a65257k34486A52598e65628a86895A8679L9532a53626C4693
10003a60339M5787j17689C4899K69571d5054k33680G7296c17470A60193C9218
9992C86684A15681E4364c3681a2646k88120e7686m63106b27022L4675A3130h0029
9980d9081J4771A94657C4121M5195a44759A34672a13991k74556J84076l5225j4254
9969b53950m097b6737I9296a55619j4208B8836a44823A11261a97801O8917j92183
9958c21067d135m1657k062G0195k1817i1626C09561I1404c7983A4022a18692j47216
9946b65908m3549a18477D9993a30933N2747r3891B00868D8062a43395O2991a3972
9934b14325M1893N7102C973K85b55001A77638G0551b94569h992H0201M2300a93096
$$ y = [-418587, 58561, -165257, -399743, 152598, -565628, -186895, 18679, 58211, -153626, 34693, -160339, -114552, -232241, 34899, 304470, -45054, -278734, 77296, -317470, 160193, 39218, 386684, 115681, 54364, -33681, -12646, -300766, -57686, -520792, -227022, -192347, 13130, -80029, -49081, -34310, 194657, 34121, 79316, -144759, 134672, -113991, -388547, -204471, -239696, -253950, -258047, -26737, 99296, -155619, -169827, 28836, -144823, 111261, -197801, -128884, -321067, -4135, -45792, -47854, 70195, 48378, -91626, 309561, 91404, -37983, 14022, -118692, -265908, -309457, -118477, 49993, -130933, -78186, -172077, 200868, 48062, -143395, -80404, -13972, -214325, -172432, -115330, 3973, 4258, -255001, 177638, 70551, -294569, -8992, 80201, 122501, -193096]
9921a56429m902L2104a3073b88j67003q5083J11808B8108c8336p2518H7027c3612
9908e5948E521a60549N1417F7356b57431d5241D7861b05410k73988a32580G9501
9896a26423q5965l7370c332k29426A89546D0433h1880G8585e6736G2625h6844
9884A62270d8569F9505a48647j82010E7974a84411h6906B05602j01400I350M41681
9873D51031E5853g4973G3484c0303A07982b41778i1636r2328F1988a3124H4358
9861c70772a84516l4398f3907l27856q1004a42523j80044b465E8587b44319G886
9849H166i0440A38248O695K98583a99330R9316j68649a8256M297k40523j9688
9838b74170A9023h5717C3753b57304K0506F5423Q8184K956a28258B1026a7523
$$ y = [-156429, -161331, -129227, -13073, -288, -167291, -252374, -140566, 28108, -38336, -110854, 87027, -33612, -55948, 5521, -160549, -109132, 67356, -257431, -45241, 47861, -205410, -479398, -132580, 79501, -126423, -212388, -249758, -3332, -232758, 189546, 40433, -81880, 78585, -56736, 72625, -86844, 162270, -48569, 69505, -148647, -330657, 57974, -184411, -86906, 205602, 104202, 9350, 451031, 55853, -74973, 73484, -30303, 107982, -241778, -91636, -183964, 61988, -13124, 84358, -370772, -184516, -218914, -63907, -391763, -472767, -142523, -322567, -2465, 58587, -244319, 7886, 8166, -90440, 138248, 144943, 443526, -199330, -100014, -268663, -18256, -13959, -254482, -274170, 19023, -85717, 33753, -257304, -236798, 65423, 153607, 156563, -128258, 21026, -17523]
9826A43519m2092K08256A33303c07609C7838d0505j20398j4372k98561a46226
9815c07424A55670b33603a02385j44278G6399b34181l1133J13341A53735a41346
9804d4625H0232a78170B20915b74498B0235a65089E4577A51J05989a64497F2960
9792e8605A5603J45762b51798C33273a28657a0943j7051A7718M2064a15180A44535
9780b39446A22759B9086g8980l9684k83651A70619K8548p7314d84807a73190n0256
9769b23446b6010B30120r6553g3936A28972A8094K21483b33596a03626n2835D9235
9757f6001A36380f474B9094a42699e8026r4728b0452l5581b0652F6796c56195
9745C27211a11273j26783L3127R4057G9528I510J00225C9543b65897D8236b36745
$$ y = [143519, 101427, 309683, 133303, -307609, 37838, -40505, -160903, -175275, -473836, -146226, -307424, 155670, -233603, -102385, -246663, 76399, -234181, -265314, -151973, 153735, -141346, -44625, 80232, -178170, 220915, -274498, 20235, -165089, 54577, 151, 106140, -164497, 62960, -58605, 15603, 161365, -251798, 333273, -128657, -10943, -27994, 17718, 59782, -115180, 144535, -239446, 122759, 29086, -78980, -118664, -402315, 170619, 199167, 121853, -484807, -173190, -223446, -26010, 230120, 133567, -73936, 128972, 18094, 239577, -233596, -103626, -156461, 49235, -66001, 136380, -6474, 29094, -142699, -58026, -152754, -20452, -56033, -20652, 66796, -356195, 327211, -111273, -238056, -204929, -110872, 79528, 9510, 109735, 39543, -265897, 48236, -236745]
9733B41975e4629j75246H4896O3157a81710j70768a44292q4180A27435l2972h0523
9721I889Q122a19467j22788Q6962O0863r8587Q7800a5302j22732j76262j00119
9710d14415a59583C1291a22976B5970c44195b5181j74020g8902j4533F3008f7445
9698b18102k13205e0893A18908a04819J3821j94488E7586d3576A19196D8141a71382
9686f2732P331k5076E559C27b10823k499G9575c00389A75109e3110k31762h415
9673b44378O9287B5308L64881b11549B9180J489J00256d2165k6737R812k82969
9662c42059j38597g0291j05293c7233l6534j43773e4117k3592E0512f7276A87160
9650A76580a47707b0217Q642j39272g0683k89296c2526n4286B99698E665a99746
$$ y = [241975, -54629, -229875, 84896, 148053, -181710, -352478, -144292, -228472, 127435, 94463, -80523, 9889, 18011, -119467, -242255, -155293, -94430, -193017, -105217, -15302, -138034, -314296, -414415, -159583, 31291, -122976, 25970, -344195, -25181, -199201, -78902, -93435, 63008, -67445, -218102, -431307, -50893, 118908, -104819, -90998, -285486, 57586, -43576, 119196, 48141, -171382, -62732, -55401, -80477, 5559, 327, -210823, -213322, 79575, -300389, 175109, -53110, -284872, -8415, -244378, -175091, 25308, 390189, -211549, 29180, 30669, 130925, -42165, -68902, -59090, -342059, -480656, -70291, -175584, -37233, -73767, -217540, -54117, -77709, 50512, -67276, 187160, 176580, -147707, -20217, -11575, -150847, -70683, -359979, -32526, -86812, 299698, 5665, -199746]
9638b94653a21019B91305A00761b06606A1629a16773m4623G6670a7893q5717E2840
9626a89285j47426J50843E9713N4214b72907r3183O5569J17343H0063d9493A31091
9614B4887g1973k01668A9805f7650n2304n7801d4387A40799e2667A74627a14337
9602d6063P789G273a37855D5829d7481a186k88166D8288K22953b25448C0015C63
9589a81173j24984A19774O6198b97855a17345N4824C650c47750j64819C1656M1912
9578G3568J06412f925C84876a44424J0675E4565a51534M8882C9610a82383j65822
9567c48205B6857a98966A83607p2397d6293C3242n709L01863a1128A52042a73677
9555c04890A0957a25160p5634A93577c82178F4458K13321C7188h032j44117n4615
$$ y = [-294653, -121019, 291305, 100761, -206606, 11629, -116773, -161396, 76670, -17893, -103610, 52840, -189285, -336711, -185868, 59713, 113927, -272907, -366090, -300521, -183178, 80063, -49493, 131091, 24887, -71973, -273641, 19805, -67650, -119954, -177755, -44387, 140799, -52667, 174627, -114337, -46063, -38274, 7273, -137855, 45829, -47481, -1186, -289352, 48288, 271241, -225448, 30015, 363, -181173, -306157, 119774, 185972, -297855, -117345, -62521, 3650, -347750, -512569, 31656, 73568, 179980, -6925, 384876, -144424, -133749, 54565, -151534, -102652, 39610, -182383, -348205, 26857, -198966, 183607, 111210, -46293, 33242, 27533, 329396, -11128, 152042, -173677, -304890, 10957, -125160, -200794, 193577, -382178, 64458, 277779, 37188, -8032, -152149, -206764]
9544b06764b6796j13198j69750a41681A1247a22772G7109O3939b04316P5953C0392
9532c5890I2110A1770J46640a56269B17049e5844j2905l3509j15933A19376b61166
9520c2302q4576j07159A07435b06631D5778j2689a18388j47841J19723H9318a45267
9508e2509A6761c06809D9405c24007e8826A81978m5285b49965E8218O816e6489
9496d55626a41582j50683I1786J96652k1279i4685A6356J13899a14267n5273q5819
9485b55359e9844A93016J02019a64440a0960j3607A6559b9073k24285h1141C46369
9473a56054c8997J8237D8217a6943A56448b29959D9620N589a37364O3347D2869
9461B69500j34320b81032a30946D40736b7997B35870b74697f9084J5993A39840
$$ y = [-206764, -26796, -139994, -309744, -141681, 11247, -122772, 77109, 141048, -204316, -128363, 30392, -35890, 92110, 11770, 158410, -156269, 217049, -55844, -68749, -102258, -218191, 119376, -261166, -32302, -116878, -224037, 107435, -206631, 45778, 33089, -118388, -266229, -146506, 89318, -145267, -52509, 16761, -306809, 49405, -324007, -58826, 181978, 136693, -249965, 58218, 65034, -56489, -455626, -141582, -292265, 91786, 288438, 267159, -94685, 16356, 130255, -114267, -169540, -255359, -59844, 193016, 295035, -164440, -10960, -24567, 16559, -29073, -253358, -81141, 346369, -156054, -38997, -20760, 48217, -16943, 156448, -229959, 49620, 55209, -137364, -74017, 42869, 269500, 135180, -281032, -130946, 440736, -27997, 235870, -274697, -69084, -53091, 139840]
9450b80882f8824j15557l19998b09476A53069R6144m4602F3579a17700N2335B58283
9438a5694G4573K65029b6013C8599b77995J32840f6079c1531n81439B51287a17516
9426a45516j70191a17550H7954O3735a53243P5602A21883c6123j58913M4617P4661
9415g5758n34575a56160H5330R0618j8299a59598o6122c1184p4664j02621b7050
9403c5137j07315m5707B11991b99717l5990b5094B9367f3291A0069P2041b19515
9391B42087a87843A6527b31729a07410j7155k74910a90449B70200b41003J9969
9381b21034P1430L3365l8133e9980i131c269m2985C3919L4247c76325f7806K9189
9369c8617k10377k8155d2290B8637b5576j12778A95644c29498R0253B8566d3064
$$ y = [-280882, -68824, -184381, -504379, -209476, 153069, 249213, 204611, 63579, -117700, -65365, 258283, -15694, 74573, 339602, -26013, 38599, -277995, -145155, -66079, -31531, -612970, 251287, -117516, -145516, -315707, -117550, 87954, 151689, -153243, -77641, 121883, -36123, -195036, -150419, -75758, -610333, -156160, 85330, 175948, 157649, -159598, -225720, -31184, -105848, -208469, -27050, -35137, -142452, -188159, 211991, -299717, -335707, -25094, 29367, -63291, 10069, 82110, -219515, 242087, -187843, 16527, -231729, -107410, -124565, -399475, -190449, 270200, -241003, -221034, -149604, -116239, -154372, -59980, -9131, -3269, -46254, 33919, 68166, -376325, -67806, -38617, -248994, -277149, -42290, 28637, -25576, -138354, 195644, -329498, -239245, 28566, -43064]
9357C8406j2805h2669A8370L2120K23089A21477i6440B07896n9554L0834O6609
9346B45785b56637A6263b27638b985p5388a4614j20751C1890b58972F209b79008
9334A37516b4604k86731E2387j959P2403a18010O962B72533E2111i8901o6205
9323a65106H6796j8949O1811h7741E3965K14380a58253j05373a15215j28094B49825
9311c4872E8928b6109g219l48013a61378c1173a4836o0795A26063L9623b54129
9299a33400M9033k77493e4729F7551g5489p7811j19628A89164c21242K3115c441
9287i3195o007e09E505a56868G8985g3231B00580a00388j74274f9602c4323A28356
9274I0130R6971a70895a5991B76632K0972C6623P6282a34622H0888K8895b49484
$$ y = [38406, 25601, -82669, 18370, 50490, 273579, 121477, -96440, 207896, 148342, 179176, 245785, -256637, 16263, -227638, -2985, -78373, -14614, -135365, 31890, -258972, 6209, -279008, 137516, -24604, -311335, 52387, 50428, 122831, -118010, -111048, 272533, 52111, -98901, -165106, 86796, 67847, 129658, -87741, 53965, 268345, -158253, -263626, -115215, -243309, 249825, -34872, 58928, -26109, -7219, -355232, -161378, -31173, -14836, -75631, 126063, 165686, -254129, -133400, -84367, -361860, -54729, 67551, -75489, -153300, -272928, 189164, -321242, -298127, -3441, -93195, -99202, -509, 5505, -156868, 78985, -73231, 200580, -100388, -274662, -69602, -34323, 128356, 90130, 187101, -170895, -15991, 276632, 297604, 36623, 112905, -134622, 80888, 109783, -249484]
9262G1168a8746k67464d2244J6335A87437D1872b67619a08102j12719R1694b2542
9250b17920N0981P6064A27222K13067b80743L3950k3354a00552B8891e0188k27702
9239b77890j180g9588K2179a6258A44169K11804D7952c3277B42316q3885A4055
9227D7713P5280k6337R5248Q2892i6014A42404o2267H669N0968a0966l58669a05985
9214a68700D0300a5418k23080D1113d9648n7593N2900j37258f5616B148a7444
9202d4354n789r183k22587b8013D3052d8482j10673C6832J3979c50348a53604
9190f8101C8966a51848m8645h993j36138c7035r8112l074B6037K93063j17655
9179B01445h3721C0766J999L302e8309m9384A59513J37724d12170c2064p9697
$$ y = [71168, -18746, -286210, -42244, -25909, 187437, 41872, -267619, -108102, -220821, -129127, -22542, -217920, -166939, -90875, 127222, 340289, -280743, -246793, -270147, -100552, 28891, -50188, -277890, -279070, -79588, -57409, -16258, 144169, 355973, 47952, -33277, 242316, 158431, 14055, 47713, 122993, 96656, 191904, 274796, -96014, 142404, 80137, 8669, 59637, -10966, -369635, -105985, -168700, 40300, -15418, -238498, 41113, -49648, -107241, -54341, -191599, -65616, 2148, -17444, -44354, -50143, -59326, -281913, -28013, 43052, -48482, -159155, 36832, 50811, -350348, -153604, -68101, 38966, -151848, -200493, -8993, -145131, -37035, -135147, -138221, 26037, 319100, 201445, -83721, 30766, 32765, 36067, -58309, -107693, 159513, 297237, -412170, -32064, -111761]
9168a11761a55l73565R640A73509a28552F5099e557F5864a07463K4831B26257
9156c61535c3864j86317B2131g8993o7403A47362Q1125F555a23026H8295i0659
9144C93479e915k51963J07539A33474H46M5478d5031r8013j46742B72720C2523
9132a68402F3316J48578d24907B5323b5899C41074j17856C5107f2760k5743j95320
9121b83823D8790K1490b2482O721j21554j91614j77590a01943A48241a57963n8570
9110b16533B2095a51999K7785N9539l10656A91944F1268g295A80103C2066P3695
9099A05761b03561M1993N9514B4385M6906a82847P2984j62281H5245J24264a1775
9087a30484k24146E4242Q460b7566C5275J03884c69698f8586k5068B72722D6095
$$ y = [-111761, -155, -373720, -364080, 173509, -128552, 65099, -5557, 65864, -107463, -82632, 226257, -361535, -33864, -220181, 22131, -78993, -146396, 147362, 228487, 6555, -123026, 88295, -90659, 393479, -5915, -257878, -150339, 133474, 846, 46324, -45031, -143044, -289786, 272720, 32523, -168402, 63316, 211894, -424907, 25323, -25899, 341074, 223218, 35107, -62760, -88503, -283823, 48790, 70280, -22482, -15761, -137315, -328929, -506519, -101943, 148241, -157963, -216533, 22095, -151999, -124214, -64675, -375331, 191944, 61268, -7295, 180103, 32066, 105761, -203561, -161568, -102054, 24385, 71291, -182847, -109863, -272144, 85245, 209509, -11775, -130484, -354630, 54242, 62702, -27566, 35275, 139159, -369698, -68586, -93654, 272722, 46095]
9075a12465j7707j19968A84047b25423I4030C9679b10557A07428a93768B38849
9064b34997J13042k04375j37580B25036m4300I106b18224E7953a42181B94029
9053F8261k7479a87868O5760G8184d3664A10080R5829F8837b5190A61791b25367
9041a16019A35611a12201k90882Q4160p0297i6796k09687B3349c28395C7821J3529
9030E1350O2491n6094b62990I1431e1364j31996D2440M6619a53353B16313a32731
9018C3009c71591G186a59251A58098d3003N691j49733I3333J1612a12621H4799
9006a7370M76k31182h8978j6161C19478b04237A6041K71634c5205H2347k4149
8995E8198a64524P8268A36501a029r3780j49849C32344b74377B04084r6697e3418
$$ y = [-112465, -130172, -250140, 184047, -225423, 94030, 39679, -210557, 107428, -193768, 238849, -234997, -121955, -326330, -463910, 225036, 180736, 9106, -218224, 57953, -142181, 294029, 68261, 40782, -187868, -122108, 78184, -43664, 110080, 205909, 68837, -25190, 161791, -225367, -116019, 135611, -112201, -403083, -318923, -389220, -96796, -306483, 23349, -328395, 37821, 51350, 113841, 57747, -262990, 91431, -51364, -183360, 42440, 89059, -153353, 216313, -132731, 33009, -371591, 7186, -159251, 158098, -43003, -37312, -187045, 93333, 104945, -112621, 84799, -17370, -16894, -248076, -88978, -105139, 319478, -204237, 16041, 287675, -35205, 82347, 58198, -164524, -86256, 136501, -1029, -94809, -244658, 332344, -274377, 204084, 107387, -53418]
8983d41910a16656A32234a65730B71965A15604I923h4066c8436p1750A28663a38141
8971B4332h8367A29085d9217j51938f7303o8270A34947a18478L2307A70437c6174
8959A99063K1621E4914B6841g8955a6148B48746c2108A74227E9439a51719B08259
8947i9612B2902a06510j12105M7341A57999n1523a35477B97609b7639j15145A12086
8935f7291j72858g8444k39878q7232B40366a11549l9765K8447m0485A9486e22186
8923B2034a09689m2586A78769e0877D20242L80791j33075A24147a82242A30180
8912D3190b22225g530G129K07524r9368j6963c7116J81G8408d6704C07354c50617
8899A49110f5029J5986l42931j40568a92134A42048D6022L321a01686C03608p8403
$$ y = [-441910, -116656, 132234, -165730, 271965, 115604, 9923, -84066, -38436, -110186, 128663, -138141, 24332, -88367, 129085, -49217, -201155, -67303, -135573, 134947, -118478, -86171, 170437, -36174, 199063, 220684, 54914, 26841, -78955, -16148, 248746, -32108, 174227, 59439, -151719, 208259, -99612, 22902, -106510, -218615, -171274, 157999, 106476, -135477, 297609, -27639, -142784, 112086, -67291, -240149, -78444, -318322, -405554, 240366, -111549, -151314, -122867, -163352, 19486, -522186, 22034, -109689, -152275, 178769, -50877, 420242, 801033, 667958, 124147, -182242, 130180, 43190, -222225, -7530, 7129, 214653, 115285, 98322, -37116, -36935, 78408, -46704, 307354, -350617, 149110, -65029, -49043, -391974, -532542, -192134, 142048, 46022, 49343, -101686, 303608, 225205]
8888B25205a50096k59797R2680A93782a64111e7131B5802L1657R7507k1395i3396
8876c11058Q5312B60132a71196h085r0535r2337C4790b9973A66822h0514b7964
8864A75994b6274j89632C34347a38305A42742a62056a1919A35562b68364p5527
8854c43891J18952k1067k40538F9312L2183d7209j61433A28275a39025q0101H9248
$$ y = [225205, -150096, -409893, -317213, 193782, -164111, -57131, 25802, 57459, 154966, 133571, -93396, -311058, -225746, 260132, -171196, -8085, -98620, -190957, 34790, -29973, 166822, -80514, -27964, 175994, -26274, -215906, 334347, -138305, 142742, -162056, -11919, 135562, -268364, -343891, -224939, -246006, -486544, 69312, 101495, -47209, -208642, 128275, -139025, -219126, 89248]
$$ [...]
##END NTUPLES=NMR SPECTRUM
##END=
