##TITLE=NES1032_872015071_9242772_QoE1DjywgL
##JCAMPDX= 6.0         $$ Bruker NMR JCAMP-DX V2.0
##DATA TYPE= NMR SPECTRUM
##DATA CLASS= NTUPLES
##ORIGIN= BRUKER
##OWNER= Administrator
$$ 1.72 TOPSPIN		Version 2.1
$$ 2015-07-01 22:18:24.539 -0700  Administrator@X
$$ Compression mode = diff/dup
##.OBSERVE FREQUENCY= 400.02188249412
##.OBSERVE NUCLEUS= ^1H
##.ACQUISITION MODE= SIMULTANEOUS (DQD)
##.ACQUISITION SCHEME= undefined
##.AVERAGES= 64
##.DIGITISER RES= 22
##SPECTROMETER/DATA SYSTEM= spect
##.PULSE SEQUENCE= noesygpps1d.comp
##.SOLVENT NAME= COFFEE_meoh
##.SHIFT REFERENCE= INTERNAL, COFFEE_meoh, 1, 14.96318
##AUDIT TRAIL= $$ (NUMBER, WHEN, WHO, WHERE, PROCESS, VERSION, WHAT)
$$ ##TITLE= Audit trail, TOPSPIN		Version 2.1
$$ ##JCAMPDX= 5.01
$$ ##ORIGIN= Bruker BioSpin GmbH
$$ ##OWNER= Administrator
$$ $$ E:\/data/COFFEE/nmr/NES1032_872015071_9242772_QoE1DjywgL/22/pdata/1/auditp.txt
$$ ##AUDIT TRAIL=  $$ (NUMBER, WHEN, WHO, WHERE, PROCESS, VERSION, WHAT)
(   1,<2015-07-01 22:18:19.242 -0700>,<Administrator>,<X>,<go>,<TOPSPIN 2.1>,
      <created by zg
	started at 2015-07-01 22:06:49.524 -0700,
	POWCHK enabled, PULCHK disabled,
       configuration hash MD5:
       21 0F 79 D6 B3 7B B4 F6 88 20 88 DB 03 48 BD 9F
       data hash MD5: 64K
       36 15 C9 31 B5 9C 26 9D 2D E3 4F EE B1 1E C2 6B>)
(   2,<2015-07-01 22:18:22.445 -0700>,<Administrator>,<X>,<proc1d>,<TOPSPIN 2.1>,
      <Start of raw data processing
       efp LB = 0.3 FT_mod = 6 PKNL = 1 PHC0 = 0 PHC1 = 0 SI = 128K 
       data hash MD5: 128K
       A0 77 A3 3C 8B 3D 3B 20 39 68 0A 36 58 C8 FC 34>)
(   3,<2015-07-01 22:18:23.336 -0700>,<Administrator>,<X>,<proc1d>,<TOPSPIN 2.1>,
      <pk PHC0 = -82.69958 PHC1 = 0 
       data hash MD5: 128K
       E3 02 C4 F4 20 44 E0 97 69 BD 30 4F 9E 8B 86 78>)
(   4,<2015-07-01 22:18:23.727 -0700>,<Administrator>,<X>,<proc1d>,<TOPSPIN 2.1>,
      <abs ABSG = 1 
       data hash MD5: 128K
       76 E6 78 C2 61 7C 22 2A 6C 63 ED 0A 5A AC D4 68>)
(   5,<2015-07-01 22:18:23.836 -0700>,<Administrator>,<X>,<proc1d>,<TOPSPIN 2.1>,
      <abs ABSG = 2 
       data hash MD5: 128K
       49 1C 1A CC E6 6E 9E 50 1D A0 4C ED EF 93 45 95>)
(   6,<2015-07-01 22:18:23.914 -0700>,<Administrator>,<X>,<proc1d>,<TOPSPIN 2.1>,
      <abs ABSG = 3 
       data hash MD5: 128K
       74 E7 CE 4F 7E 8A EE C7 4A FA 52 8B A1 30 03 12>)
(   7,<2015-07-01 22:18:23.992 -0700>,<Administrator>,<X>,<proc1d>,<TOPSPIN 2.1>,
      <abs ABSG = 4 
       data hash MD5: 128K
       D4 41 23 5E E0 D3 C7 3E 46 02 48 41 6A DD 01 94>)
(   8,<2015-07-01 22:18:24.070 -0700>,<Administrator>,<X>,<proc1d>,<TOPSPIN 2.1>,
      <abs ABSG = 5 
       data hash MD5: 128K
       17 49 F3 06 8A F7 40 BB 62 D4 66 76 F9 EC 38 4E>)
$$ ##END=
$$ 
$$ $$ hash MD5
$$ $$ E4 AB 64 33 0C C2 49 E7 7E 54 23 A8 72 17 EF D9
##$RELAX= 
##$RELAX= 
##$RELAX= 
##$RELAX= 
##$RELAX= 
##$RELAX= 
##$RELAX= 
##$RELAX= 
$$ Bruker specific parameters
$$ --------------------------
##$DU= <E:\>
##$EXPNO= 22
$$ [...]
##$TP07= 0
##$TPNAME0= <>
##$TPNAME1= <>
##$TPNAME2= <>
##$TPNAME3= <>
##$TPNAME4= <>
##$TPNAME5= <>
##$TPNAME6= <>
##$TPNAME7= <>
##$TPOAL= (0..7)
0.5 0.5 0.5 0.5 0.5 0.5 0.5 0.5
##$TPOFFS= (0..7)
0 0 0 0 0 0 0 0
##$TUNHIN= 0
##$TUNHOUT= 0
##$TUNXOUT= 0
##$USERA1= <user>
##$USERA2= <user>
##$USERA3= <user>
##$USERA4= <user>
##$USERA5= <user>
##$V9= 5
##$VALIST= <valist>
##$VCLIST= <CCCCCCCCCCCCCCC>
##$VD= 0
##$VDLIST= <DDDDDDDDDDDDDDD>
##$VPLIST= <PPPPPPPPPPPPPPP>
##$VTLIST= <TTTTTTTTTTTTTTT>
##$WBST= 2048
##$WBSW= 25
##$XGAIN= (0..3)
0 0 0 0
##$XL= 0
##$YL= 0
##$YMAX_a= 6421856
##$YMIN_a= -12955403
##$ZGOPTNS= <>
##$ZL1= 120
##$ZL2= 120
##$ZL3= 120
##$ZL4= 120
##$ABSF1= 14.96318
##$ABSF2= -5.595002
##$ABSG= 5
##$ABSL= 3
##$ALPHA= 0
##$AQORDER= 0
##$ASSFAC= 0
##$ASSFACI= 0
##$ASSFACX= 0
##$ASSWID= 0
##$AUNMP= <proc_prof1d_extract.lims>
##$AXLEFT= 0
##$AXNAME= <>
##$AXNUC= <1H>
##$AXRIGHT= 0
##$AXTYPE= 0
##$AXUNIT= <>
##$AZFE= 0.1
##$AZFW= 0.1
##$BCFW= 0
##$BC_mod= 0
##$BYTORDP= 0
##$COROFFS= 0
##$CY= 15
##$DATMOD= 1
##$DC= 0
##$DFILT= <>
##$DTYPP= 0
##$F1P= 0
##$F2P= 0
##$FCOR= 0.5
##$FTSIZE= 131072
##$FT_mod= 6
##$GAMMA= 0
##$GB= 0
##$INTBC= 1
##$INTSCL= 1
##$ISEN= 128
##$LB= 0.3
##$LEV0= 0
##$LPBIN= 0
##$MAXI= 10000
##$MC2= 0
##$MEAN= 0
##$ME_mod= 0
##$MI= 0
##$NCOEF= 0
##$NC_proc= -2
##$NLEV= 6
##$NOISF1= 0
##$NOISF2= 0
##$NSP= 0
##$NTH_PI= 0
##$NZP= 0
##$OFFSET= 14.96318
##$PC= 1
##$PHC0= -82.69958
##$PHC1= 0
##$PH_mod= 1
##$PKNL= yes
##$PPARMOD= 0
##$PPDIAG= 0
##$PPIPTYP= 0
##$PPMPNUM= 2147483647
##$PPRESOL= 1
##$PSCAL= 4
##$PSIGN= 0
##$PYNMP= <proc.py>
##$REVERSE= no
##$SF= 400.020008765702
##$SI= 131072
##$SIGF1= 0
##$SIGF2= 0
##$SINO= 400
##$SIOLD= 131072
##$SPECTYP= <>
##$SREGLST= <1H.CDCl3>
##$SSB= 0
##$STSI= 131072
##$STSR= 0
##$SW_p= 8223.68421052631
##$SYMM= 0
##$S_DEV= 0
##$TDeff= 65536
##$TDoff= 0
##$TI= <>
##$TILT= no
##$TM1= 0
##$TM2= 0
##$TOPLEV= 0
##$USERP1= <user>
##$USERP2= <user>
##$USERP3= <user>
##$USERP4= <user>
##$USERP5= <user>
##$WDW= 1
##$XDIM= 131072
##$YMAX_p= 298557669
##$YMIN_p= -10701
##$CURPLOT= <Network HP LaserJet P1505>
##$CURPRIN= <$Network HP LaserJet P1505>
##$DFORMAT= <normdp>
##$LAYOUT= <+/1D_H.xwp>
##$LFORMAT= <normlp>
##$PFORMAT= <normpl>
##$SURQMSG= 1
$$ End of Bruker specific parameters
$$ ---------------------------------
##NTUPLES= NMR SPECTRUM
##VAR_NAME=  FREQUENCY,     SPECTRUM/REAL,   SPECTRUM/IMAG
##SYMBOL=    X,             R,               I
##VAR_TYPE=  INDEPENDENT,   DEPENDENT,       DEPENDENT
##VAR_FORM=  AFFN,          ASDF,            ASDF
##VAR_DIM=   131072,        131072,          131072
##UNITS=     HZ,            ARBITRARY UNITS, ARBITRARY UNITS
##FACTOR=    0.0627417313425164, 1,          1
##FIRST=     8223.62146879497, -665,         -43317
##LAST=      0,             1594,            -43788
##MIN=       0,             -10701,          0
##MAX=       8223.62146879497, 298557669,    0
$$ Real data points
##PAGE= N=1
##DATA TABLE= (X++(R..R)), XYDATA
$$ [...]
63364D54580l009k613k122k070k512l314m243m914n190n599o664p879q020o743
$$ 454580 451571 448958 446836 444766 442254 438940 434697 429783 424593 418994 412330 404451 396431 389688
63350C89688n180m605n003n374n104m417l738l240l122l666m716n447n124m018
$$ 389688 384508 379903 374900 369526 364422 360005 356267 353027 349905 346239 341523 336076 330952 326934
63336C26934l047k595k146j261l19P7L0Q4K74J75j99k43L71J364K530L945N228
$$ 326934 323887 321292 319146 317885 317566 317643 317673 317757 318031 318206 318007 317764 318135 319499 322029 325974 331202
63319C31202N415M204K648J868J608R50n8n22l57o12j941l694m883n303n271m930
$$ 331202 336617 340821 343469 345337 346945 347895 347837 347315 346958 346346 344405 340711 335828 330525 325254 320324
63303C20324m382l991m017m161l940l334k651k048j520j165j060j053r71r20j007
$$ 320324 315942 311951 307934 303773 299833 296499 293848 291800 290280 289115 288055 287002 286031 285111 284104
63288B84104r76n21J14L02j22n68m21K66R48J225J065N71r6n53k92P49J869K190
$$ 284104 283128 282607 282721 283023 282901 282333 281912 282178 283126 284351 285416 285987 285891 285338 285046 285795 287664 289854
63270B89854J638J043J161J829K402K665K908L196L166K653K076J905K129K506
$$ 289854 291492 292535 293696 295525 297927 300592 303500 306696 309862 312515 314591 316496 318625 321131
63256C21131L089M016N005N507N407N168N157N181M930M642M950O077P534Q719
$$ 321131 324220 328236 333241 338748 344155 349323 354480 359661 364591 369233 374183 380260 387794 396513
63242C96513R540J0178J0517J0302R862J0083J1310J2742J3351J3200J3196J3726
$$ 396513 406053 416231 426748 437050 446912 456995 468305 481047 494398 507598 520794 534520
63230E34520J4175J3974J3479J3455J4113J5067J5974J6785J7452J7828J7864
$$ 534520 548695 562669 576148 589603 603716 618783 634757 651542 668994 686822 704686
63219G04686J7726J7638J7726J7931J8000J7583J6442J4571J2117R320O491L863
$$ 704686 722412 740050 757776 775707 793707 811290 827732 842303 854420 863740 870231 874094
63207H74094J382j203m048p156j0461j3627j5814j6227j5139j3882j3396j3257
$$ 874094 875476 874273 870225 863069 852608 838981 823167 806940 791801 777919 764523 751266
63195G51266j2493j1001r462q122o436l989j147J425L425M852N759O388P251Q724
$$ 751266 738773 727772 718310 710188 703752 699763 698616 700041 703466 708318 714077 720465 727716 736440
63181G36440J0609J2286J3273J3529J3397J3322J3575J4108J4740J5421J6114
$$ 736440 747049 759335 772608 786137 799534 812856 826431 840539 855279 870700 886814
63170H86814J6550J6396J5724J4942J4148J2964J1222R372P755N891L086l66l308
$$ 886814 903364 919760 935484 950426 964574 977538 988760 998132 1005887 1011778 1014864 1014498 1011190
63157A011190n191o749q907j1513j3676j4927j5499j5641j5303j4555j3657j2558
$$ 1011190 1005999 999250 990343 978830 965154 950227 934728 919087 903784 889229 875572 863014
63145H63014j0893q723o860n942n586n063m514m828o217p680q146p716p351p646
$$ 863014 852121 843398 836538 830596 825010 819947 815433 810605 804388 796708 788562 780846 773495 765849
63131G65849q272q510p942o713n398m598m458m546m268l417k200r03K59J087J478
$$ 765849 757577 749067 741125 734412 729014 724416 719958 715412 711144 707727 705527 704624 704883 705970 707448
63116G07448J534J463J413J480J720J978J805R23k86j068j111p75m76k20R2K80
$$ 707448 708982 710445 711858 713338 715058 717036 718841 719764 719478 718410 717299 716524 716048 715828 715920 716200
63100G16200J57j0K98J241K471L502L989L680K550J111L19P23J804K474K251J716
$$ 716200 716357 716347 716645 717886 720357 723859 727848 731528 734078 735189 735508 736231 738035 740509 742760 744476
63084G44476J692K302K985L310L383L481L635L716L768L968M341M694M889N026
$$ 744476 746168 748470 751455 754765 758148 761629 765264 768980 772748 776716 781057 785751 790640 795666
63070G95666N314N863O661P668Q787R717J0120J0099J0351J1528J3409J5013J5732
$$ 795666 800980 806843 813504 821172 829959 839676 849796 859895 870246 881774 895183 910196 925928
63057I25928J6034J6807J8303K0037K1552K2769K3675K4216K4610K5293K6381
$$ 925928 941962 958769 977072 997109 1018661 1041430 1065105 1089321 1113931 1139224 1165605
63046A165605K7521K8389K8943K9058K8424K7127K5849K5078K4484K3539K2416
$$ 1165605 1193126 1221515 1250458 1279516 1307940 1335067 1360916 1385994 1410478 1434017 1456433
63035A456433K1683K1385K1047K0494J9925J9188J7573J4640J0791O722K597j980
$$ 1456433 1478116 1499501 1520548 1541042 1560967 1580155 1597728 1612368 1623159 1629881 1632478 1630498
63023A630498p316j3169j8807k3526k7183l0201l2912l5060l6171l6194l5378
$$ 1630498 1623182 1610013 1591206 1567680 1540497 1510296 1477384 1442324 1406153 1369959 1334581
63012A334581l3719l1109k7927k4815k1793j8230j3970r813o456l595n05K955
$$ 1334581 1300862 1269753 1241826 1217011 1195218 1176988 1163018 1153205 1146749 1143154 1142649 1145604
63000A145604O441R810J3003J5587J7113J7841J8530J9517K0503K1181K1545K1596
$$ 1145604 1152045 1161855 1174858 1190445 1207558 1225399 1243929 1263446 1283949 1305130 1326675 1348271
62988A348271K1256K0651J9966J9002J7360J5135J2846J0581P794M164Q9m048
$$ 1348271 1369527 1390178 1410144 1429146 1446506 1461641 1474487 1485068 1492862 1497026 1497115 1493067
62976A493067q558j3935j9997k6028l1508l6257m0118m2967m4934m6222m6853
$$ 1493067 1484509 1470574 1450577 1424549 1393041 1356784 1316666 1273699 1228765 1182543 1135690
62965A135690m6828m6282m5113m2822l9363l5814l3443l2171l0746k8468k5848
$$ 1135690 1088862 1042580 997467 954645 915282 879468 846025 813854 783108 754640 728792
62954G28792k3440k1057j8669j7074j6800j6904j5946j3866j1955j1055j0706
$$ 728792 705352 684295 665626 648552 631752 614848 598902 585036 573081 562026 551320
62943E51320j0155r349q559p771o872o049n611n614n934o404o742o672o231n721
$$ 551320 541165 531816 523257 515486 508614 502565 496954 491340 485406 479002 472260 465588 459357 453636
62929D53636n235m633m059l946m254m335l859l340l252l162k462j483j131j538
$$ 453636 448401 443768 439709 435763 431509 427174 423315 419975 416723 413561 411099 409616 408485 406947
62915D06947j942j877j701j826k071k104j934j676j250p24n90j253k399l177l023
$$ 406947 405005 403128 401427 399601 397530 395426 393492 391816 390566 389842 389252 387999 385600 382423 379400
62900C79400k169j361j141j338j346q94m50n40j004j258j150j018r82q16o27q96
$$ 379400 377231 375870 374729 373391 372045 371151 370701 370161 369157 367899 366749 365731 364749 363933 363306 362410
62884C62410j594j905j289k26N52J001J307J066j40j624k064j153P1P00R54J362
$$ 362410 360816 358911 357622 357396 357948 358949 360256 361322 361182 359558 357494 356341 356412 357112 358066 359428
62868C59428J741J606J080P16O44N58M07M83P79P65Q9q56j355j184p57o08q93
$$ 359428 361169 362775 363855 364571 365215 365773 366180 366663 367442 368207 368296 367440 366085 364901 364144 363536 362643
62851C62643j361j594j318o29KJ30j53k63K09R36J201P85K54J94M17K80l10o44
$$ 362643 361282 359688 358370 357741 357743 357873 357720 357457 357666 358602 359803 360588 360842 361036 361453 361733 361423 360779
62833C60779j66P01J020M81k83m66J64J281K376K950K697J811R78Q22J373K213
$$ 360779 360613 361314 362334 362815 362532 362066 362230 363511 365887 368837 371534 373345 374323 375145 376518 378731
62817C78731K935L347L433L385L519L897M180M158M177M610N096M990M471M546
$$ 378731 381666 385013 388446 391831 395350 399247 403427 407585 411762 416372 421468 426458 430929 435475
62803D35475N702P237Q282Q871R532J0367J1162J2083J3544J5490J7435J9120
$$ 435475 441177 448414 456696 465567 475099 485466 496628 508711 522255 537745 555180 574300
62791E74300K0644K2046K3300K4708K6741K9358L1976L4164L6005L7725L9426
$$ 574300 594944 616990 640290 664998 691739 721097 753073 787237 823242 860967 900393
62780I00393M1217M3047M4357M4386M3100M1269L9366L6836L2846K7333K0933
$$ 900393 941610 984657 1029014 1073400 1116500 1157769 1197135 1233971 1266817 1294150 1315083
62769A315083J4098O775j097r152j6675k3031k8092l2326l6280l9915m2584m3839
$$ 1315083 1329181 1335956 1334859 1325707 1309032 1286001 1257909 1225583 1189303 1149388 1106804 1062965
62757A062965m4016m3851m3662m3143m1809l9540l6731l4000l1664k9530k7269
$$ 1062965 1018949 975098 931436 888293 846484 806944 770213 736213 704549 675019 647750
62746F47750k4959k2986k1435j9935j8167j6209j4339j2713j1351j0110q720p123
$$ 647750 622791 599805 578370 558435 540268 524059 509720 497007 485656 475546 466826 459703
62734D59703n780n163n002m520l531k609k106j578n52P77K034L196M184M600M459
$$ 459703 453923 448760 443758 439238 435707 433098 430992 429414 428862 429639 431673 434869 439053 443653 448112
62719D48112M657N935P759R035R633J0457J2153J4490J6894J8944K0337K1185
$$ 448112 452769 458704 466463 475498 485131 495588 507741 522231 539125 558069 578406 599591
62707E99591K2280K4458K7539L0491L2730L4711L7084L9809M2312M4084M4946
$$ 599591 621871 646329 673868 704359 737089 771800 808884 848693 891005 935089 980035
62696I80035M5002M4476M3340M1177L7677L3080K7775K1642J4473O764o88p948
$$ 980035 1025037 1069513 1112853 1154030 1191707 1224787 1252562 1274204 1288677 1295441 1294753 1286805
62684A286805j5795k4201l1818l7400m0986m3302m4601m4754m3969m2758m1426
$$ 1286805 1271010 1246809 1214991 1177591 1136605 1093303 1048702 1003948 959979 917221 875795
62673H75795m0014l8552l6894l4696l1994k9554k8035k6997k5328k2666j9843
$$ 875795 835781 797229 760335 725639 693645 664091 636056 609059 583731 561065 541222
62662E41222j7807j6598j5616j4525j3492j2683j1876j0737r325q118p547p581
$$ 541222 523415 506817 491201 476676 463184 450501 438625 427888 418563 410445 402898 395317
62650C95317p819p803p206o002m667l996m291m895m896m242l698l754m042l975
$$ 395317 387498 379695 372489 366487 361820 357824 353533 348638 343742 339500 335802 332048 328006 324031
62636C24031l412k498j334j60N12L94j45m85m81m57n98o82m12J80P52J060J268
$$ 324031 320619 318121 316787 316627 317139 317533 317388 316903 316422 315965 315367 314685 314273 314453 315205 316265 317533
62619C17533J805K779L676L864L347K789K871L836N508P309Q387Q353P903Q227
$$ 317533 319338 322117 325793 329657 333004 335793 338664 342500 348008 355317 363704 372057 379960 388187
62605C88187R588J1130J2159J2950J4006J5211J6275J7447J9126K1057K2511K3106
$$ 388187 397775 408905 421064 434014 448020 463231 479506 496953 516079 537136 559647 582753
62593E82753K2978K2391K1555K0630J9435J7353J4026R956O018K534p88m151p379
$$ 582753 605731 628122 649677 670307 689742 707095 721121 731077 737095 739629 738841 734690 727311
62580G27311j0204j2449j4073j5320j6672j8292j9711k0394k0336j9777j8728
$$ 727311 717107 704658 690585 675265 658593 640301 620590 600196 579860 560083 541355
62569E41355j7272j5938j5092j4304j3021j1593j0786j0428r579q081o930o843
$$ 541355 524083 508145 493053 478749 465728 454135 443349 432921 423342 415261 408331 401488
62557D01488p291p400p019o418n684m877m209l569k388o25O65M32r20j888j444
$$ 401488 394197 386797 379778 373360 367676 362799 358590 355021 352633 352008 352673 353105 352185 350297 348853
62542C48853J75K061L314L379K430J546J919L625N553O711P206P821Q989J0464
$$ 348853 349028 351089 354403 357782 360212 361758 363677 367302 372855 379566 386772 394593 403582 414046
62528D14046J1764J2648J3309J4227J5762J7747J9608K1051K2422K4213K6288
$$ 414046 425810 438458 451767 465994 481756 499503 519111 540162 562584 586797 613085
62517F13085K7971K8885K9379K9892L0155K9410K7386K4657K1860J8924J5331
$$ 613085 641056 669941 699320 729212 759367 788777 816163 840820 862680 881604 896935
62506H96935J0898N871M49n221j0590j4845j7854k0515k3610k6633k8306k8232
$$ 896935 907833 913704 914153 908932 898342 883497 865643 845128 821518 794885 766579 738347
62494G38347k7383k6793k6371k5369k3613k1674j9942j8232j6375j4607j3129
$$ 738347 710964 684171 657800 632431 608818 587144 567202 548970 532595 517988 504859
62483E04859j1711j0186q927q328p987p077n522m153l592l528l327k802k041j042
$$ 504859 493148 482962 474035 465707 457720 450643 445121 440968 437376 433848 430521 427719 425678 424636
62469D24636K5O30N47M00R36K004K879L397M018M860N454N634N823O106N849M693
$$ 424636 424661 425291 425838 426238 427174 429178 432057 435454 439472 444332 449786 455420 461243 467349 473198 477891
62453D77891L373K780K650J860n3k382m236n467o431p292p865p932p514o833o122
$$ 477891 481264 484044 486694 488554 488501 486119 481883 476416 469985 462693 454828 446896 439382 432549 426427
62438D26427n489m911m376l880l297k464j473p12l71j60K52P68J168J674K675
$$ 426427 420938 416027 411651 407771 404474 402010 400537 399825 399454 399294 399546 400314 401482 403156 405831
62423D05831L960M836N115N383N951O241N737N085N402O689P739P764P286P080
$$ 405831 409791 414627 419742 425125 431076 437317 443054 448139 453541 460230 467969 475733 483019 490099
62409D90099O998O437N472M767M552M410M052L699L553L382K886K107J334Q21
$$ 490099 497097 503534 509006 513773 518325 522735 526787 530486 534039 537421 540307 542414 543748 544569
62395E44569P34J029J369J413J301J494K185L239M701O681Q703R899J0216J0722
$$ 544569 545303 546332 547701 549114 550415 551909 554094 557333 562034 568715 577418 587317 597533 608255
62381F08255J2151J3860J4895J5482J6534J8122J9443K0177K0881K1860K2633
$$ 608255 620406 634266 649161 664643 681177 699299 718742 738919 759800 781660 804293
62370H04293K2715K2266K1593K0560J8841J6381J3344R951O500L221M0l115n867
$$ 804293 827008 849274 870867 891427 910268 926649 939993 949944 956444 959665 959705 956590 950723
62357I50723p742r031j0620j2841j5057j6604j7504j8066j8370j8472j8528j8339
$$ 950723 942981 933950 923330 910489 895432 878828 861324 843258 824888 806416 787888 769549
62345G69549j7403j5758j4160j2992j1727j0018q638q481r121r240q249o654n035
$$ 769549 752146 736388 722228 709236 697509 687491 678853 670372 661251 652011 643762 637108 632073
62332F32073l509k228j543j479j557j367r26l66L42J204K045K638K866K853K946
$$ 632073 628564 626336 624793 623314 621757 620390 619464 619098 619440 620644 622689 625327 628193 631046 633992
62317F33992L343L582K876J275J7J34J127J768J866K279L294M069L948L426L345
$$ 633992 637335 640917 643793 645068 645085 645219 646346 648114 649980 652259 655553 659622 663570 666996 670341
62302F70341L735L964L603K786J979J697K127K848L201K997K588K239J917J789
$$ 670341 674076 678040 681643 684429 686408 688105 690232 693080 696281 699278 701866 704105 706022 707811
62288G07811K258L277M165M476M588N083O075P450R245J1269J2876J3742J4484
$$ 707811 710069 713346 717511 721987 726575 731658 737733 745183 754428 765697 778573 792315 806799
62275H06799J5822J7416J8307J8340J8377J9064K0120K1005K1580K1769K1157
$$ 806799 822621 840037 858344 876684 895061 914125 934245 955250 976830 998599 1019756
62264A019756J9447J6955J4238J1369Q025M238O69j984l647m800n955p356r047
$$ 1019756 1039203 1056158 1070396 1081765 1089790 1094028 1094697 1092713 1089066 1084266 1078311 1070955 1061908
62251A061908j0955j2808j4197j4882j4903j4321j3076j1333r696q600p618n917
$$ 1061908 1050953 1038145 1023948 1009066 994163 979842 966766 955433 945737 937137 929519 923602
62239I23602l513j464n29k59J95P95R06N40M99J174J906J869J176O68Q05J122
$$ 923602 920089 918625 918096 917837 918032 918827 919733 920273 920772 921946 923852 925721 926897 927565 928370 929492
62223I29492P84m65k011k964k984k433j761j003m3R42J699K365L247M222M829
$$ 929492 930276 929811 927800 924836 921852 919419 917658 916655 916612 917554 919253 921618 924865 929087 933916
62208I33916N048N450O362P335P756P644P519P745Q319R130J0003J0633J0856
$$ 933916 938964 944414 950776 958111 965867 973511 981030 988775 997094 1006224 1016227 1026860 1037716
62195A037716J0921J1150J1434J1354J0879J0525J0759J1494J2307J2929J3348
$$ 1037716 1048637 1059787 1071221 1082575 1093454 1103979 1114738 1126232 1138539 1151468 1164816
62184A164816J3634J3863J4138J4488J4741J4671J4309J4001J4052J4283J4063
$$ 1164816 1178450 1192313 1206451 1220939 1235680 1250351 1264660 1278661 1292713 1306996 1321059
62173A321059J2866J0745Q173N526K984Q54m87j146j866l171m633n460n700o213
$$ 1321059 1333925 1344670 1352843 1358369 1361353 1362207 1361720 1360574 1358708 1355537 1350904 1345444 1339744 1333531
62159A333531p437q766r387r244q737p921o629n168m290m329m821n238n661o445
$$ 1333531 1326094 1317328 1307941 1298697 1289960 1282039 1275410 1270242 1265952 1261623 1256802 1251564 1245903 1239458
62145A239458p355p570o722n609n437o354p233p091o331o059o513o828o354n453
$$ 1239458 1232103 1224533 1217811 1212202 1206765 1200411 1193178 1186087 1179756 1173697 1167184 1160356 1154002 1148549
62131A148549m706m091l445l112l413l819l420k177r36k57J54P04J333J923K783
$$ 1148549 1143843 1139752 1136307 1133195 1129782 1125963 1122543 1120366 1119430 1119173 1119327 1120031 1121364 1123287 1126070
62116A126070M176N661O297N549L753J743J15j134k293l370l971l863l389l166
$$ 1126070 1130246 1135907 1142204 1147753 1151506 1153249 1153364 1152230 1149937 1146567 1142596 1138733 1135344 1132178
62102A132178l629m998p301r973j1809j2065j1410j1112j1373j1224j0024q155
$$ 1132178 1128549 1123551 1116250 1106277 1094468 1082403 1070993 1059881 1048508 1037284 1027260 1019105
62090A019105o150m106k300j415j530j657r40L13J355K106K851L437L597L552
$$ 1019105 1012955 1008849 1006549 1005134 1003604 1001947 1001007 1001320 1002675 1004781 1007632 1011069 1014666 1018218
62076A018218L470K816J145q30k005k463l325n012o764p832q276q430q514q957
$$ 1018218 1021688 1024504 1025649 1024819 1022814 1020351 1017026 1012014 1005250 997418 989142 980712 972198 963241
62062I63241j0245j2126j3699j4530j4983j5284j5059j4208j3435j3355j3624
$$ 963241 952996 940870 927171 912641 897658 882374 867315 853107 839672 826317 812693
62051H12693j3431j2467j1043r678q885q870r152q930q113p484p577p979q053
$$ 812693 799262 786795 775752 766074 757189 748319 739167 730237 722124 714640 707063 699084 691031
62038F91031p701p060o142n279n171n859o288n695m798m740n376n579m942m122
$$ 691031 683330 676270 670128 664849 659678 653819 647531 641836 637038 632298 626922 621343 616401 612279
62024F12279l637l376l292l576l965l790k969k210j913j632r17k8O41J242K021
$$ 612279 608642 605266 601974 598398 594433 590643 587674 585464 583551 581919 581002 580974 581615 582857 584878
62009E84878K576K219R09n29j178q10r1mr19k139k613k120j403j084r96p27l47
$$ 584878 587454 589673 590582 590053 588875 588065 587974 587970 587051 584912 582299 580179 578776 577692 576696 575969 575622
61992E75622j53p2J79N87R36J264J816K620L456M164M708M973M886M738M978N683
$$ 575622 575469 575397 575576 576163 577099 578363 580179 582799 586255 590419 595127 600100 604986 609724 614702 620385
61976F20385O463P007P410P882Q435R050R865J0919J1819J2039J1543J0875J0612
$$ 620385 626848 633855 641265 649147 657582 666632 676497 687416 699235 711274 722817 733692 744304
61963G44304J0917J1641J2621J3716J4729J5536J6221J6918J7616J8329J9319
$$ 744304 755221 766862 779483 793199 807928 823464 839685 856603 874219 892548 911867
61952I11867K0837K2678K4345K5662K6942K8347K9540L0233L0740L1673L3262
$$ 911867 932704 955382 979727 1005389 1032331 1060678 1090218 1120451 1151191 1182864 1216126
61941A216126L5334L7730M0371M2965M5165M7015M8980N1435N4378N7699O1442
$$ 1216126 1251460 1289190 1329561 1372526 1417691 1464706 1513686 1565121 1619499 1677198 1738640
61930A738640O5798P1013P7306Q4657R2694J01092J10013J19843J30520J41464
$$ 1738640 1804438 1875451 1952757 2037414 2130108 2231200 2341213 2461056 2591576 2733040
61920B733040J52244J62883J73414J83531J92803K00870K07118K10407K09283
$$ 2733040 2885284 3048167 3221581 3405112 3597915 3798785 4005903 4216310 4425593
61911D425593K02360J88492J67043J38323J03551O4200K1679k2302o5502j05673
$$ 4425593 4627953 4816445 4983488 5121811 5225362 5289562 5311241 5288939 5223437 5117764
61901E117764j41033j70089j91593k05294k12410k14668k12974k07523j98968
$$ 5117764 4976731 4806642 4615049 4409755 4197345 3982677 3769703 3562180 3363212
61892C363212j88641j77556j65916j53820j41815j30375j19377j08581r8265q8924
$$ 3363212 3174571 2997015 2831099 2677279 2535464 2405089 2285712 2177131 2078866 1989942
61882A989942q0565p2809o5565n9193n3922m9456m5200m0768l6232l2002k8380
$$ 1989942 1909377 1836568 1771003 1711810 1657888 1608432 1563232 1522464 1486232 1454230 1425850
61871A425850k5220k2094j8844j5814j3306j1129q901o611m537k806j376k72O12
$$ 1425850 1400630 1378536 1359692 1343878 1330572 1319443 1310542 1303931 1299394 1296588 1295212 1294940 1295552
61858A295552J877M099O842Q838R434R335R484R800R670R267R419J0208J0586
$$ 1295552 1297429 1301528 1308370 1317208 1326642 1335977 1345461 1355261 1364931 1374198 1383617 1393825 1404411
61845A404411R736Q155O950O498O304N895N340M932M775M721M511L979L281K903
$$ 1404411 1414147 1422302 1429252 1435750 1442054 1447949 1453289 1458221 1462996 1467717 1472228 1476207 1479488 1482391
61831A482391L229M146N209O120O949P967R373J1115J2813J4125J5328J7250K0364
$$ 1482391 1485620 1489766 1494975 1501095 1508044 1516011 1525384 1536499 1549312 1563437 1578765 1596015 1616379
61818A616379K4078K7365K9945L2434L5420L8860M2443M5981M9413N2850N6829
$$ 1616379 1640457 1667822 1697767 1730201 1765621 1804481 1846924 1892905 1942318 1995168 2051997
61807B051997O1953O8023P3976P9121Q4061Q9928R7119J05256J14144J24043J35065
$$ 2051997 2113950 2181973 2255949 2335070 2419131 2509059 2606178 2711434 2825578 2949621 3084686
61796C084686J46881J59284J72534J86996K02758K19724K37699K56245K74800
$$ 3084686 3231567 3390851 3563385 3750381 3953139 4172863 4410562 4666807 4941607
61787D941607K93138L11308L28815L44183L55595L61585L60741L51067L30414
$$ 4941607 5234745 5546053 5874868 6219051 6574646 6936231 7296972 7648039 7978453
61778G978453K97566K52595J96255J29832N5812k1859r8672j70691k34775k88365
$$ 7978453 8276019 8528614 8724869 8854701 8910513 8888654 8789982 8619291 8384516 8096151
61768H096151l29763l58678l76085l83430l82111l73536l59335l41332l21387
$$ 8096151 7766388 7407710 7031625 6648195 6266084 5892548 5533213 5191881 4870494
61759D870494l01067k81130k61370k41324k21233k02049j84551j68820j54647
$$ 4870494 4569427 4288297 4026927 3785603 3564370 3362321 3177770 3008950 2854303
61750B854303j41939j30504j19845j09606j00063r1714q4576p8182p2247o6942
$$ 2854303 2712364 2581860 2462015 2352409 2252346 2160632 2076056 1997874 1925627 1858685
61740A858685o2501n8827n5566n2376m9062m5655m2361l9311l6369l3363l0466
$$ 1858685 1796184 1737357 1681791 1629415 1580353 1534698 1492337 1453026 1416657 1383294 1352828
61729A352828k8083k6397k5172k4090k2980k1770k0424j9069j8013j7474j7325
$$ 1352828 1324745 1298348 1273176 1249086 1226106 1204336 1183912 1164843 1146830 1129356 1112031
61718A112031j7189j6699j5725j4502j3532j3201j3433j3786j3867j3613j3230
$$ 1112031 1094842 1078143 1062418 1047916 1034384 1021183 1007750 993964 980097 966484 953254
61707I53254j3006j3027j2923j2018j0053p717o094n630n883o248o408o085m943
$$ 953254 940248 927221 914298 902280 892227 884510 878416 872786 866903 860655 854247 848162 843219
61694H43219l136j491p66j000j849l221n054o799p741p898q051q789r882j0699
$$ 843219 840083 838592 837826 836826 834977 831756 826702 819903 812162 804264 796213 787424 777542 766843
61680G66843j0896j0497r615q451p378o767o598o432n841m878m011l625l615l580
$$ 766843 755947 745450 735835 727384 720006 713239 706641 700209 694368 689490 685479 681854 678239 674659
61666F74659l380l310l689m435n181n663n883o027o353p013p767q015p380o208
$$ 674659 671279 667969 664280 659845 654664 649001 643118 637091 630738 623725 615958 607943 600563 594355
61652E94355n236m791m580m240l792l430l184k985k876k963l195l379l345l002
$$ 594355 589119 584328 579748 575508 571716 568286 565102 562117 559241 556278 553083 549704 546359 543357
61638E43357k319j409o07k93m69o95n16rK46j08o63o17K56J258J540J053M69K79
$$ 543357 541038 539629 539022 538729 538260 537565 537049 537040 537286 537178 536515 535898 536154 537412 538952 540005 540474 540753
61620E40753K61q9q97j765k093j478m2J433J982J343L39O4P52J676K117K077J981
$$ 540753 541014 540925 540028 538263 536170 534692 534650 536083 538065 539408 539747 539811 540563 542239 544356 546433 548414
61603E48414K059K247K422K448K196J849J991K994M402N387N775O137O802P368
$$ 548414 550473 552720 555142 557590 559786 561635 563626 566620 571022 576409 582184 588321 595123 602491
61589F02491P451P388P768Q624R583J0505J1496J2419J2991J3269J3615J4258
$$ 602491 609942 617330 625098 633722 643305 653810 665306 677725 690716 703985 717600 731858
61577G31858J5249J6723J8663K0587K2030K3251K4801K6379K6950K6132K4688
$$ 731858 747107 763830 782493 803080 825110 848361 873162 899541 926491 952623 977311
61566I77311K3320K1700J9210J5966J2579R373O423L986K300J259P21P07R31P16
$$ 977311 1000631 1022331 1041541 1057507 1070086 1079459 1085882 1089868 1092168 1093427 1094148 1094855 1095786 1096502
61552A096502lj53J180L313M734M995M829M671M123L057K127J816J810J684J495
$$ 1096502 1096499 1096346 1097526 1100839 1105573 1110568 1115397 1120068 1124191 1127248 1129375 1131191 1133001 1134685 1136180
61537A136180J276P02k73r94r00k77K68P70J861L921O665R413J1550J2975J4278
$$ 1136180 1137456 1138158 1137885 1136891 1135991 1135714 1135982 1136752 1138613 1142534 1149199 1158612 1170162 1183137 1197415
61522A197415J6255J9054K2096K4896K7534L0150L2656L5161L8213M2035M5992
$$ 1197415 1213670 1232724 1254820 1279716 1307250 1337400 1370056 1405217 1443430 1485465 1531457
61511A531457M9380N2423N6039O0815O6673P3206P9876Q6077R1566R6634J01407
$$ 1531457 1580837 1633260 1689299 1750114 1816787 1889993 1969869 2055946 2147512 2244146 2345553
61500B345553J05267J07476J08118J07670J05808J01457R4143Q4622P3896O2342
$$ 2345553 2450820 2558296 2666414 2774084 2879892 2981349 3075492 3160114 3234010 3296352
61490C296352N0062L7529K5388J3918L223o256j3811j9053k2163k3720k4465k5177
$$ 3296352 3346414 3383943 3409331 3423249 3426472 3420216 3406405 3387352 3365189 3341469 3317004 3291827
61478C291827k6400k8195l0362l2970l6501m1330m7057n2659n7283o0724o2934
$$ 3291827 3265427 3237232 3206870 3173900 3137399 3096069 3049012 2996353 2939070 2878346 2815412
61467B815412o3434o1644n7774n2762m7287m1291l4809k8582k3303j8718j4131
$$ 2815412 2751978 2690334 2632560 2579798 2532511 2491220 2456411 2427829 2404526 2385808 2371677
61456B371677r549n562k243R98M425P647J0484J3395J6706K0080K3234K6604L0739
$$ 2371677 2362128 2356566 2354323 2355321 2359746 2367393 2377877 2391272 2407978 2428058 2451292 2477896 2508635
61443B508635L5386L9821M3695M6913M8947M9026M6985M3266L8011L0832K1810
$$ 2508635 2544021 2583842 2627537 2674450 2723397 2772423 2819408 2862674 2900685 2931517 2953327
61432B953327J2162L535l153p933j1251j3546j5177j6225j6364j5127j2386q524
$$ 2953327 2965489 2969024 2965871 2957938 2946687 2933141 2917964 2901739 2885375 2870248 2857862 2849338
61420B849338m230k20K962N094O157N899L658j083p958j5753k3176k9434l4054
$$ 2849338 2845108 2844888 2847850 2852944 2859101 2865000 2868658 2867575 2859617 2843864 2820688 2791254 2757200
61407B757200l6609l6882l5177l2230k8835k5539k2523j9584j6416j3048r953
$$ 2757200 2720591 2683709 2648532 2616302 2587467 2561928 2539405 2519821 2503405 2490357 2480404
61396B480404p543n662l706j151K181O261J0967J6110K1529K7145L2855L8487
$$ 2480404 2472861 2467199 2463493 2462342 2464523 2470784 2481751 2497861 2519390 2546535 2579390 2617877
61384B617877M4060M9922N6351O3191P0044P6621Q2550Q7201R0253R2299R4108
$$ 2617877 2661937 2711859 2768210 2831401 2901445 2978066 3060616 3147817 3238070 3330369 3424477
61373C424477R5237R4069Q9454Q1627P1303N8615M3554K6774R319q107k4923m0210
$$ 3424477 3519714 3613783 3703237 3784864 3856167 3914782 3958336 3985110 3994429 3986322 3961399 3921189
61361C921189n3237o4322p4344q3413r0692r5581r8494j00259j01282j01436j00438
$$ 3921189 3867952 3803630 3729286 3645873 3555181 3459600 3361106 3260847 3159565 3058129 2957691
61350B957691r8131r4681r0524q5941q0786p4954o8892o3107n7376n1088m4348
$$ 2957691 2859560 2764879 2674355 2588414 2507628 2432674 2363782 2300675 2243299 2192211 2147863
61339B147863l7978l2373k7131k1986j7286j3105q712l560J827O559J0505J3967
$$ 2147863 2109885 2077512 2050381 2028395 2011109 1998004 1989292 1985732 1987559 1994118 2004623 2018590
61327B018590J6709J8205J8672J8951J9264J8831J7031J4359J1910J0265R224
$$ 2018590 2035299 2053504 2072176 2091127 2110391 2129222 2146253 2160612 2172522 2182787 2192011
61316B192011Q403P819P838Q658R804J0346R836Q890Q529R019R762J0300J0857
$$ 2192011 2200414 2208233 2216071 2224729 2234533 2244879 2254715 2263605 2272134 2281153 2290915 2301215 2312072
61303B312072J1638J2096J1448R723P783O268M883K895R1l052n990q634j1108
$$ 2312072 2323710 2335806 2347254 2356977 2364760 2371028 2375911 2378806 2378897 2375845 2369855 2361221 2350113
61290B350113j3228j4457j4496j3751j3027j2796j2789j2350j1053r019o842n321
$$ 2350113 2336885 2322428 2307932 2294181 2281154 2268358 2255569 2243219 2232166 2223147 2216305 2210984
61278B210984n088o176p862r186r826j0346j1340j2506j2922j2220j1054j0216
$$ 2210984 2205896 2199720 2191858 2182672 2172846 2162500 2151160 2138654 2125732 2113512 2102458 2092242
61266B092242r719r080q102o838n067k456P45L776O317Q863J1924J5392J8987
$$ 2092242 2082523 2073443 2065341 2058503 2053436 2050980 2051725 2055501 2061818 2070681 2082605 2097997 2116984
61253B116984K2903K7529L2795L8267M3754M9440N5379O1195O6330P0378P3110
$$ 2116984 2139887 2167416 2200211 2238478 2282232 2331672 2387051 2448246 2514576 2584954 2658064
61242B658064P4195P2830O7746N7912M3562K6300Q079r778k6487m1245n3280o2256
$$ 2658064 2732259 2805089 2872835 2930747 2974309 3000609 3008688 2998910 2972423 2931178 2877898 2815642
61230B815642o8127p0678o9712o5677n9703n2769m5058l6292k6559j6755q364
$$ 2815642 2747515 2676837 2607125 2541448 2481745 2428976 2383918 2347626 2321067 2304312 2295948
61219B295948k681j75n40l386q567j5672k3595l1097l7573m2848m6447m7755m6880
$$ 2295948 2293267 2293092 2292552 2289166 2280599 2264927 2241332 2210235 2172662 2129814 2083367 2035612 1988732
61206A988732m4674m1825l8527l5167l2574l1096l0007k8439k6567k5270k4892
$$ 1988732 1944058 1902233 1863706 1828539 1795965 1764869 1734862 1706423 1679856 1654586 1629694
61195A629694k4855k4452k3487k2176k0820j9684j8893j8342j7814j7178j6351
$$ 1629694 1604839 1580387 1556900 1534724 1513904 1494220 1475327 1456985 1439171 1421993 1405642
61184A405642j5279j4167j3470j3317j3126j2242j0846r727r137q477p315o136
$$ 1405642 1390363 1376196 1362726 1349409 1336283 1324041 1313195 1303468 1294331 1285854 1278539 1272403
61172A272403n704o084o783p631q986j1077j3578j5962j7969j9631k1040k2225
$$ 1272403 1266699 1260615 1253832 1246201 1237215 1226138 1212560 1196598 1178629 1158998 1137958 1115733
61160A115733k3079k3345k2812k1666k0509j9870j9710j9470j8636j7217j5641
$$ 1115733 1092654 1069309 1046497 1024831 1004322 984452 964742 945272 926636 909419 893778
61149H93778j4218j2805j1091r219p836p359p385p092o162m939l778k630j383
$$ 893778 879560 866755 855664 846445 838609 831250 823865 816773 810611 805672 801894 799264 797881
61136G97881j72Q76J876K934L995N152O721Q611J0004J0141R245Q171P323O486
$$ 797881 797709 798585 800461 803395 807390 812542 819263 827874 837878 848019 857264 865435 872758 879244
61122H79244N553M699L811K469P33o68j182j006n94j20K98L83Q7k48m63q34j351
$$ 879244 884797 889496 893307 895776 896509 895841 894659 893653 893059 892939 893237 893620 893707 893459 892996 892162 890811
61105H90811j363n88Q0m56j957l150l375l158l084l044k780k507k495k511k150
$$ 890811 889448 888860 888940 888484 886527 883377 880002 876844 873760 870716 867936 865429 862934 860423 858273
61090H58273j442p91m49k68J2M56Q60J022J051J312J989K955M157N766P584Q797
$$ 858273 856831 856040 855591 855323 855335 855791 856651 857673 858724 860036 862025 864980 869137 874903 882487 891284
61074H91284Q834Q265Q212R003J0029J0808J1447J2021J2308J2305J2351J2459
$$ 891284 900118 908383 916595 925598 935627 946435 957882 969903 982211 994516 1006867 1019326
61062A019326J2161J1315J0492J0187J0225J0266J0349J0562J0729J0920J1738
$$ 1019326 1031487 1042802 1053294 1063481 1073706 1083972 1094321 1104883 1115612 1126532 1138270
61051A138270J3505J5589J7123J8150J9404K1240K3299K5164K6819K8488L0381
$$ 1138270 1151775 1167364 1184487 1202637 1222041 1243281 1266580 1291744 1318563 1347051 1377432
61040A377432L2581L4922L7103L9125M1431M4332M7576N0824N4213N8047O2199
$$ 1377432 1410013 1444935 1482038 1521163 1562594 1606926 1654502 1705326 1759539 1817586 1879785
61029A879785O6359P0635P5402Q0570Q5512Q9766R3464R7160J01514J07111J14267
$$ 1879785 1946144 2016779 2092181 2172751 2258263 2348029 2441493 2538653 2640167 2747278 2861545
61018B861545J23020J33446J45796J60160J76272J93845K12797K33067K54927
$$ 2861545 2984565 3118011 3263807 3423967 3600239 3794084 4006881 4239948 4494875
61009D494875K79770L09858L46795L91057M43645N07016N83444O73854P79907
$$ 4494875 4774645 5084503 5431298 5822355 6266000 6773016 7356460 8030314 8810221
61000H810221R05710J054709J226165J418100J631111J858209K062469K170406
$$ 8810221 9715931 10770640 11996805 13414905 15046016 16904225 18966694 21137100
60992B1137100K104233J834861J408064R19720M67197J20405p9206j19539l4913
$$ 21137100 23241333 25076194 26484258 27403978 27871175 27991580 27912374 27792835 27757922
60983B7757922Q4114J19687j3992l26896p58331j217593j622495j916574k072795
$$ 27757922 27842036 27961723 27947731 27620835 26862504 25644911 24022416 22105842 20033047
60974B0033047k093884k006817j848814j653247j444932j242338j058219q97788
$$ 20033047 17939163 15932346 14083532 12430285 10985353 9743015 8684796 7787008
60966G787008p60034o42719n45057m65851m01736l48904l05379k70446k42783
$$ 7787008 7026974 6384255 5839198 5373347 4971611 4622707 4317328 4046882 3804099
60957C804099k20332k01410j84956j70004j55746j41919j28652j16119j04671
$$ 3804099 3583767 3382357 3197401 3027397 2871651 2729732 2601080 2484961 2380290
60948B380290r4861q6849q0134p4299o9524o5890o2709n9184n5407n1949m8823
$$ 2380290 2285429 2198580 2118446 2044147 1974623 1908733 1846024 1786840 1731433 1679484 1630661
60937A630661m5611m2365l9529l7002l4213l1198k8780k7353k6196k4477k2331
$$ 1630661 1585050 1542685 1503156 1466154 1431941 1400743 1371963 1344610 1318414 1293937 1271606
60926A271606k0583j9708j9579j9820k0065k0071j9886j9729j9477j8679j7276
$$ 1271606 1251023 1231315 1211736 1191916 1171851 1151780 1131894 1112165 1092688 1074009 1056733
60915A056733j5914j5134j4646j3859j2809j1998j1564j1219j0816j0412r851
$$ 1056733 1040819 1025685 1011039 997180 984371 972373 960809 949590 938774 928362 918511
60904I18511q996q319q534r417r737q720p012n802n459n509n536n472n211m555
$$ 918511 909515 901196 892662 883245 873508 864788 857776 851974 846515 841006 835470 829998 824787 820232
60890H20232l625k843k423k150j701j046m79l97r68j918k689l022l195l581m114
$$ 820232 816607 813764 811341 809191 807490 806444 805965 805568 804600 802682 799993 796971 793776 790195 786081
60875G86081m418m282l754k950k156j897k443l240l288k240p94J05J58k40m84
$$ 786081 781663 777381 773627 770677 768521 766624 764181 760941 757653 755413 754619 754724 754882 754642 754158
60860G54158j34Q05J693J650M57j071j900j841j556j668k191k815l410m062m909
$$ 754158 754024 754829 756522 758172 758629 757558 755658 753817 752261 750593 748402 745587 742177 738115 733206
60845G33206o051p498r027j0238j0851j0896j0485r542q002o145m465l137j994
$$ 733206 727155 719657 710630 700392 689541 678645 668160 658618 650616 644471 640006 636869 634875
60832F34875j084q01j207j612j366q53j000j885k476j983q20J21N96R26J213J299
$$ 634875 633791 632990 631783 630171 628805 627952 626952 625067 622591 620608 619788 619909 620505 621431 622644 623943
60816F23943J284J428J617J402O91m9l66k75j02q6k42l92l42j65k28o90j172j186
$$ 623943 625227 626655 628272 629674 630365 630316 629950 629675 629573 629487 629245 628853 628511 628346 628118 627428 626256 625070
60798F25070q37o97j048j601j929j906j700j608j869k411k879l157l607m462n217
$$ 625070 624233 623536 622488 620887 618958 617052 615352 613744 611875 609464 606585 603428 599821 595359 590142
60783E90142n178m408l587l036k557k161k194k591k737k277j515p94p8N95Q77
$$ 590142 584964 580556 576969 573933 571376 569215 567021 564430 561693 559416 557901 557107 557029 557624 558501
60768E58501O11J09l26o17n47J13R31J066N40M25J234K032J823J034O76P51N29
$$ 558501 559112 559221 558895 558278 557731 557844 558775 559841 560381 560806 562040 564072 565895 566929 567605 568356 568885
60751E68885m5l65k96l31o29r53j436k455l657m108l632l098l107l162k537j362
$$ 568885 568840 568475 568179 567848 567219 566266 564830 562375 558718 554610 550978 547880 544773 541611 539074 537712
60735E37712m17k87j051k316l366l612l231k935l018l055k699k265k271k793l535
$$ 537712 537295 537008 535957 533641 530275 526663 523432 520497 517479 514424 511725 509460 507189 504396 500861
60720E00861m099m059l185j940j297j742k692l177k787j801p76j95j55j61L89
$$ 500861 496762 492703 489518 487578 486281 484539 481847 478670 475883 474082 473306 473111 472956 472795 473184
60705D73184J315J783J509J233J592K124K047J531J400J809K052J663R96N91N46
$$ 473184 474499 476282 477791 479024 480616 482740 484787 486318 487718 489527 491579 493242 494238 494829 495375
60690D95375P01J005J443J971K593L257L646L391K625J981J900K220K497K497
$$ 495375 496076 497081 498524 500495 503088 506345 509991 513382 516007 517988 519888 522108 524605 527102
60676E27102K267K026K066K505K975K893K182J411J016P97M52K09L91O72M44j60
$$ 527102 529369 531395 533461 535966 538941 541834 544016 545427 546443 547240 547692 547901 548292 548964 549408 549248
60660E49248k99L73J182J392J065N67k04j435k656l167l062l056l332l399l130
$$ 549248 548949 549322 550504 551896 552961 553528 553324 551889 549233 546066 543004 539948 536616 533217 530087
60645E30087l127l683m178m010l492l204l037k558j908j551j448j341j560k579
$$ 530087 526960 523277 519099 515089 511597 508393 505356 502798 500890 499339 497891 496550 494990 492411
60631D92411l803l881k495r56m98q39r46o50o31j129j497j086j05O38N37k95j194
$$ 492411 488608 484727 482232 481276 480778 479939 478993 478343 477712 476583 475086 474000 473895 474533 475070 474775 473581
60614D73581j522j113k49O38J075O64m56j299q17Q70K491L065K842K604K570K522
$$ 473581 472059 470946 470697 471335 472410 473074 472618 471319 470502 471372 473863 476928 479770 482374 484944 487466
60598D87466K476K590K601K062J049J51l10n43p88r33p59k77L43R04J223J264
$$ 487466 489942 492532 495133 497195 498244 498395 498085 497542 496754 495821 495062 494785 495128 496032 497255 498519
60582D98519J272J569K137K530K322J579Q86Q91J752K966L794L886L395K581J623
$$ 498519 499791 501360 503497 506027 508349 509928 510814 511705 513457 516423 520217 524103 527498 530079 531702
60567E31702Q58O95J070J336J117R04J375K349L014L036K916L247M088N151O064
$$ 531702 532560 533255 534325 535661 536778 537682 539057 541406 544420 547456 550372 553619 557707 562858 568922
60552E68922O457O187N700N771O794Q562J0748J3176J5541J7433J8898K0544K2773
$$ 568922 575379 581566 587266 593037 599831 608393 619141 632317 647858 665291 684189 704733 727506
60539G27506K5297K7756L0483L4135L8681M3135M6304M7547M6878M4546M0517
$$ 727506 752803 780559 811042 845177 883858 926993 973297 1020844 1067722 1112268 1152785
60528A152785L4347K5661J4891L240q103j8497k7378l3826l7224l8054l7413l5767
$$ 1152785 1187132 1212793 1227684 1230924 1222821 1204324 1176946 1143120 1105896 1067842 1030429 994662
60516I94662l2804k8560k3904j9610j5544j1266o984l258q1L099O553J0021J3330
$$ 994662 961858 933298 909394 889784 874240 862974 855990 852732 852651 855750 862303 872324 885654
60503H85654J6621J9970K3338K7054L1633L6783M1138M3524M3976M2944L9972
$$ 885654 902275 922245 945583 972637 1004270 1041053 1082191 1125715 1169691 1212635 1252607
60492A252607L4141K5637J5936O328k848j1134j7124j9534j8709j6216j3058q907
$$ 1252607 1286748 1312385 1328321 1334649 1331801 1320667 1303543 1284009 1265300 1249084 1236026 1227119
60480A227119l062M431J2868K1539K9981L7774M4365M9127N1428N0631M6074L7259
$$ 1227119 1224057 1228488 1241356 1262895 1292876 1330650 1375015 1424142 1475570 1526201 1572275 1609534
60468A609534K4385Q708p935k4198l9590n3560o4737p1693p4347p3941p1582o7445
$$ 1609534 1633919 1642627 1634692 1610494 1570904 1517344 1452607 1380914 1306567 1232626 1161044 1093599
60456A093599o1635n5043m8784m3149l7821l2859k8782k5672k2908k0015j7270
$$ 1093599 1031964 976921 928137 884988 847167 814308 785526 759854 736946 716931 699661
60445F99661j5049j3071j0807q437o723n967n576m860l758k594j524o04r9k50
$$ 699661 684612 671541 660734 652297 645574 639607 634031 629171 625413 622819 621295 620691 620592 620342
60431F20342q29j358j587j534j175n91l01q34j902k581k427j854j207j67J501
$$ 620342 619513 618155 616568 615034 613859 613268 612967 612133 610231 607650 605223 603369 602162 601995 603496
60416F03496L255M443N186N916O382N984M989M601N577P360Q900R791J0356J0971
$$ 603496 606751 611194 616380 622296 628678 634662 639651 644252 649829 657189 666089 675880 686236 697207
60402F97207J1706J2447J3040J3393J3486J3302J2728J1776J0735R877R049P943
$$ 697207 708913 721360 734400 747793 761279 774581 787309 799085 809820 819697 828746 836689
60390H36689O716N873N432M751L437J984J100P51L76k31p37q53o96n20m58n77
$$ 836689 843405 849278 854710 859461 862898 864882 865982 866733 867109 866878 866141 865288 864592 864072 863614 863037
60374H63037q93j267j491j568j754k186k603k520j675l92N56N52k63j190j810
$$ 863037 862144 860877 859386 857818 856064 853878 851275 848755 847080 846688 847244 847796 847533 846343 844533
60359H44533k336k950l219k698j811j434j564j252q9R89R13r6j014j513k151l244
$$ 844533 842197 839247 836028 833330 831519 830085 828521 827269 827180 828169 829082 828986 827972 826459 824308 821064
60343H21064m416n346o146o733o591n587m392l640l125k395j694j637k248k901
$$ 821064 816648 811302 805156 798423 791832 786245 781853 778213 775088 772693 770999 769362 767114 764213
60329G64213l179l177l122l198l640m418m943m638l815l290l224l025k507k250
$$ 764213 761034 757857 754735 751537 747897 743479 738536 733898 730083 726793 723569 720544 718037 715787
60315G15787k562k838k417j485o63j65J09K28M50J320K950M563N375N680O419
$$ 715787 713225 710387 707970 706485 705822 705657 705766 705994 706444 707764 710714 715277 720652 726332 732751
60300G32751P868R314R976R706Q869P951P204O352M758K204o73l014m532n320
$$ 732751 740619 749933 759909 769615 778484 786435 793639 799991 804749 806953 806280 803266 798734 793414
60286G93414n347m607l493k429j328QJ310K196K798L407L845L980M490O084Q171
$$ 793414 788067 783460 779967 777538 776210 776218 777528 779724 782522 785929 789774 793754 798244 804328 812499
60271H12499R419R659J0073J1328J2719J3549J4209J5232J6306J6953J7463J8216
$$ 812499 821918 831577 841650 852978 865697 879246 893455 908687 924993 941946 959409 977625
60259I77625J8776J8518J7720J7157J6914J6489J5839J5486J5605J5773J5741
$$ 977625 996401 1014919 1032639 1049796 1066710 1083199 1099038 1114524 1130129 1145902 1161643
60248A161643J5860J6600J8025J9981K2347K4962K7570L0046L2591L5567L9032
$$ 1161643 1177503 1194103 1212128 1232109 1254456 1279418 1306988 1337034 1369625 1405192 1444224
60237A444224M2499M5229M6985M8461N0653N3728N6871N9356O1362O3539O6044
$$ 1444224 1486723 1531952 1578937 1627398 1678051 1731779 1788650 1848006 1909368 1972907 2038951
60226B038951O8298O9526O9287O7683O5273O2563N9498N5637N0826M5314L9142
$$ 2038951 2107249 2176775 2246062 2313745 2379018 2441581 2501079 2556716 2607542 2652856 2691998
60215B691998L2136K4730J8155J3195R207M932Q4m446p724r549j0246j0210r676
$$ 2691998 2724134 2748864 2767019 2780214 2789421 2794353 2794437 2789991 2782267 2772718 2762472 2752262 2742586
60202B742586q516o289k773J628O289J1040J6126K1672K7507L3385L9082M4377
$$ 2742586 2734070 2727781 2725008 2726636 2732925 2743965 2760091 2781763 2809270 2842655 2881737 2926114
60190B926114M9170N3413N6738N8457N8185N6210N2855M7935M1200L3007K4039
$$ 2926114 2975284 3028697 3085435 3143892 3202077 3258287 3311142 3359077 3400277 3433284 3457323
60179C457323J4672N157m035j2717k1481l0884m0304m8400n4637n9432o2916o4497
$$ 3457323 3471995 3477152 3473117 3460400 3438919 3408035 3367731 3319331 3264694 3205262 3142346 3077849
60167C077849o3935o1864n8879n4822m9423m2985l5947k8354k0313j2420n182
$$ 3077849 3013914 2952050 2893171 2838349 2788926 2745941 2709994 2681640 2661327 2648907 2643725
60156B643725J598Q242J4336J9000K1835K2987K2496K0267J6714J2757Q906M807
$$ 2643725 2645323 2653565 2667901 2686901 2708736 2731723 2754219 2774486 2791200 2803957 2812863 2817670
60144B817670j4n244r955j3499j5906j7432j8049j7501j5633j2497q197k863L266
$$ 2817670 2817656 2812412 2802457 2788958 2773052 2755620 2737571 2720070 2704437 2691940 2683743 2680880 2684146
60131B684146R875J6787K4004L1583L9621M8267N7475O6795P5764Q4637R4204
$$ 2684146 2694021 2710808 2734812 2766395 2806016 2854283 2911758 2978553 3054317 3138954 3233158
60120C233158J04712J15324J25087J33873J41902J48700J53256J55172J54966
$$ 3233158 3337870 3453194 3578281 3712154 3854056 4002756 4156012 4311184 4466150
60111D466150J53095J49211J42484J32341J18837J02730Q5263O7360M8885K9092
$$ 4466150 4619245 4768456 4910940 5043281 5162118 5264848 5350111 5417471 5466356 5495448
60101E495448P966j3248l3068n0973o7398q2832r7120j09467j18912j24986j28010
$$ 5495448 5503414 5490166 5457098 5406125 5338727 5255895 5158775 5049308 4930396 4805410 4677400
60090D677400j28609j26974j22889j16434j08163r8474q7223p4387o0771m7637
$$ 4677400 4548791 4421817 4298928 4182494 4074331 3975857 3888634 3814247 3753476 3705839
60080C705839l5628k4324j2943j356R669J9254K7325L4434M0568M4571M5198M2436
$$ 3705839 3670211 3645887 3632944 3631588 3641257 3660511 3687836 3722270 3762838 3807409 3852607 3895043
60068C895043L7257L0328K1753J1998K093p446j7131k7411l7657m6830n4631o1427
$$ 3895043 3932300 3962628 3984381 3996379 3998472 3991026 3973895 3946484 3908827 3861997 3807366 3745939
60056C745939o7296p1842p4811p6329p6600p5761p3908p0837o5976n9080n0948
$$ 3745939 3678643 3606801 3531990 3455661 3379061 3303300 3229392 3158555 3092579 3033499 2982551
60045B982551m2837l5109k6964j7631p310L247J3560K3379L2233L9617M5630N0863
$$ 2982551 2939714 2904605 2877641 2860010 2852700 2855947 2869507 2892886 2925119 2964736 3010366 3061229
60033C061229N5469N8731N9793N8577N5625N1244M5339L8062L0001K1430J1905
$$ 3061229 3116698 3175429 3235222 3293799 3349424 3400668 3446007 3484069 3514070 3535500 3547405
60022C547405J106j0203k0713k9889l8200m6068n3248n9270o3836o6528o6743
$$ 3547405 3548511 3538308 3517595 3487706 3449506 3403438 3350190 3290920 3227084 3160556 3093813
60011C093813o4368o0061n4494m7786m0040l1960k4229j6586q189J123J0581J9555
$$ 3093813 3029445 2969384 2914890 2867104 2827064 2795104 2770875 2754289 2746100 2747223 2757804 2777359
59999B777359K8245L7107M6028N4510O2411P0056P7626Q4644R0194R3539R4488
$$ 2777359 2805604 2842711 2888739 2943249 3005660 3075716 3153342 3237986 3328180 3421719 3516207
59988C516207R3177Q9670Q3844P5709O5689N4471M2464K9548J5472N69j4108k7555
$$ 3516207 3609384 3699054 3782898 3858607 3924296 3978767 4021231 4050779 4066251 4066820 4052712 4025157
59976D025157l9639n0793o0865o8770p3529p5257p4679p2050o7186o0358n2384
$$ 4025157 3985518 3934725 3873860 3805090 3731561 3656304 3581625 3509575 3442389 3382031 3329647
59965C329647m3731l4221k3841j3236l102O409J5372K3666L1249L8444M5449N1858
$$ 3329647 3285916 3251695 3227854 3214618 3211516 3217925 3233297 3256963 3288212 3326656 3372105 3423963
59953C423963N7046O0829O3309O4335O3623O1271N7743N3349M8102M2091L5690
$$ 3423963 3481009 3541838 3605147 3669482 3733105 3794376 3852119 3905468 3953570 3995661 4031351
59942D031351K9328K3302J7763J2763Q329M628K055J012J632L805P421J2578J9688
$$ 4031351 4060679 4083981 4101744 4114507 4122836 4127464 4129519 4130531 4132163 4135968 4143389 4155967 4175655
59929D175655K9186M0945N3964O6990P9567R2181J05349J18927J32315J44845
$$ 4175655 4204841 4245786 4299750 4366740 4446307 4538488 4643837 4762764 4895079 5039924
59919E039924J55766J64276J69873J72309J70957J64655J52560J34848J12336
$$ 5039924 5195690 5359966 5529839 5702148 5873105 6037760 6190320 6325168 6437504
59910F437504Q5814N6073K4358p642l8114o5458q8688j07589j22083j31382j34548
$$ 6437504 6523318 6579391 6603749 6596107 6557993 6492535 6403847 6296258 6174175 6042793 5908245
59899E908245j32155j26383j18921j09512r7295q2720o7173n1318l5067j8687
$$ 5908245 5776090 5649707 5530786 5421274 5323979 5241259 5174086 5122768 5087701 5069014
59889E069014k713J3144K9645M6548O2516P6606Q8737R8446J04359J05429J01801
$$ 5069014 5066301 5079445 5109090 5155638 5218154 5294760 5383497 5481943 5586302 5691731 5793532
59878E793532R4003Q2160O6666M8842L0153J1166q164k7560m6392o4209q0765
$$ 5793532 5887535 5969695 6036361 6085203 6115356 6126522 6118358 6090798 6044406 5980197 5899432
59867E899432r5653j08408j18734j26356j30831j31905j29867j25258j18348j09209
$$ 5899432 5803779 5695371 5576637 5450281 5319450 5187545 5057678 4932420 4814072 4704863
59857D704863r8103q5550p2051n7964m3485k8750j4099k29J2182K3126L3197M2765
$$ 4704863 4606760 4521210 4449159 4391195 4347710 4318960 4304861 4304632 4316814 4339940 4373137 4415902
59845D415902N1450N8485O3166O4863O3094N7860M9562L8464K4689R075o514k0264
$$ 4415902 4467352 4525837 4589003 4653866 4716960 4774820 4824382 4862846 4887535 4896610 4890096 4869832
59833D869832l1659m1357n0106n8047o4767o9661p2466p3704p4382p4970p5041
$$ 4869832 4838173 4796816 4746710 4688663 4623896 4554235 4481769 4408065 4333683 4258713 4183672
59822D183672p4160p2686p1161o9310o6293o1885n6753n1663m6985m3000m0062
$$ 4183672 4109512 4036826 3965665 3896355 3830062 3768177 3711424 3659761 3612776 3569776 3529714
59811C529714l8152l6679l5016l3055l1072k9185k7126k4501k1147j7225j2820
$$ 3529714 3491562 3454883 3419867 3386812 3355740 3326555 3299429 3274928 3253781 3236556 3223736
59800C223736p522o05Q099J7767K7360L6762M6877N8560P1800Q6025J00840J16053
$$ 3223736 3216214 3215609 3223708 3241475 3268835 3305597 3352474 3411034 3482834 3568859 3669699 3785752
59788C785752J31061J44561J54963J60870J60867J53017J35253J06851O9607K7338
$$ 3785752 3916813 4061374 4216337 4377207 4538074 4691091 4826344 4933195 5002802 5030140
59778E030140j5653n5504q8841j13176j27889j34296j34272j29047j19563j07352
$$ 5030140 5014487 4958983 4870142 4756966 4629077 4494781 4360509 4231462 4111899 4004547
59768D004547r4127q0714o7096n3521m0870k9712j9670j0085r56P317J4745K1851
$$ 4004547 3910420 3829706 3762610 3709089 3668219 3638507 3618837 3608752 3607796 3615113 3629858 3651709
59756C651709K8951L5749M1855M7425N3086N9279O5965P2991Q0412Q8278R6373
$$ 3651709 3680660 3716409 3758264 3805689 3858775 3918054 3984019 4057010 4137422 4225700 4322073
59745D322073J04587J13399J23495J34795J46376J57609J68939J81202J94541
$$ 4322073 4426660 4540059 4663554 4798349 4944725 5102334 5271273 5452475 5647016
59736E647016K08458K22580K36743K50440K62827K73283K81416K86302K86474
$$ 5647016 5855474 6078054 6314797 6565237 6828064 7101347 7382763 7669065 7955539
59727G955539K81047K70611K56637K40317K22489K04401J87870J74391J64522
$$ 7955539 8236586 8507197 8763834 9004151 9226640 9431041 9618911 9793302 9957824
59718I957824J58389J56400J58918J65214J73309J81194J87939J93277J96445
$$ 9957824 10116213 10272613 10431531 10596745 10770054 10951248 11139187 11332464 11528909
59709A1528909J96017J90937J81267J67801J51436J33113J13830R4261P4692N5770
$$ 11528909 11724926 11915863 12097130 12264931 12416367 12549480 12663310 12757571 12832263 12888033
59699A2888033L9009K6044J7391J2511J1068J3706K1508L5001N3718P6381J01529
$$ 12888033 12927042 12953086 12970477 12982988 12994056 13007762 13029270 13064271 13117989 13194370 13295899
59688A3295899J28240J56375J85891K15987K45299K72724K97443L18062L32443
$$ 13295899 13424139 13580514 13766405 13982392 14227691 14500415 14797858 15115920 15448363
59679A5448363L38728L36015L23586K99990K63598K14051J52828Q2613O610p1645
$$ 15448363 15787091 16123106 16446692 16746682 17010280 17224331 17377159 17459772 17466382 17394737
59669A7394737j48477k20406k84278l37374l78032m06360m23950m32727m34559
$$ 17394737 17246260 17025854 16741576 16404202 16026170 15619810 15195860 14763133 14328574
59660A4328574m32113m29355m30232m36553m47408m60449m73263m83515m88732
$$ 14328574 13896461 13467106 13036874 12600321 12152913 11692464 11219201 10735686 10246954
59651A0246954m86937m77700m62207m42255m19314l94481l68738l42960l17842
$$ 10246954 9760017 9282317 8820110 8377855 7958541 7564060 7195322 6852362 6534520
59642F534520k94030k72024k51723k32327k13205j94746j77945j63077j49290
$$ 6534520 6240490 5968466 5716743 5484416 5271211 5076465 4898520 4735443 4586153
59633D586153j35687j22333j09836r8348q7541p7456o8751o1894n6476n1622m6916
$$ 4586153 4450466 4328133 4218297 4119949 4032408 3954952 3886201 3824307 3767831 3716209 3669293
59622C669293m2756l9826l8350l7801l7357l6714l6364l6822l7710l8075l7696
$$ 3669293 3626537 3586711 3548361 3510560 3473203 3436489 3400125 3363303 3325593 3287518 3249822
59611C249822l7564l8659m0597m2020m2152m1342m0169l8672l6667l4252l1625
$$ 3249822 3212258 3173599 3133002 3090982 3048830 3007488 2967319 2928647 2891980 2857728 2826103
59600B826103k8856k6188k4177k3010k1922j9887j6815j3598j0991q893o795m467
$$ 2826103 2797247 2771059 2746882 2723872 2701950 2682063 2665248 2651650 2640659 2631766 2624971 2620504
59588B620504j960O68L324N817Q110J0479J3131J5817J8126K0186K2677K5968
$$ 2620504 2618544 2619212 2622536 2628353 2636463 2646942 2660073 2675890 2694016 2714202 2736879 2762847
59576B762847K9437L2103L3914L6090L9833M4959N0166N4600N8624O2933O7538
$$ 2762847 2792284 2824387 2858301 2894391 2934224 2979183 3029349 3083949 3142573 3205506 3273044
59565C273044P2096P6703Q1675Q6752R1264R5160R9175J03722J08142J11405J13151
$$ 3273044 3345140 3421843 3503518 3590270 3681534 3776694 3875869 3979591 4087733 4199138 4312289
59554D312289J13760J13626J12801J11120J08269J03689R6675Q6729P3899N8823
$$ 4312289 4426049 4539675 4652476 4763596 4871865 4975554 5072229 5158958 5232857 5291680
59544E291680M2395K5305P939r143k4894l8342m9371n8519o6001p1409p4365p4939
$$ 5291680 5334075 5359380 5367319 5358176 5333282 5294940 5245569 5187050 5121049 5049640 4975275 4900336
59532D900336p3307o9572o4106n7392m9206l8646k5489j0911L821J8818L4927
$$ 4900336 4827029 4757457 4693351 4635959 4586753 4548107 4522618 4511707 4515528 4534346 4569273
59521D569273N2003O8777Q4255R8284J10540J19870J24972J25100J19844J08857
$$ 4569273 4621276 4690053 4774308 4872592 4983132 5103002 5227974 5353074 5472918 5581775
59511E581775R2260P0873M5685J7366j3284m4771p5161j02712j26084j44287j56939
$$ 5581775 5674035 5744908 5790593 5807959 5794675 5749904 5674743 5572031 5445947 5301660 5144721
59500E144721j64397j67285j65934j60612j52053j41284j28944j15192j00362
$$ 5144721 4980324 4813039 4647105 4486493 4334440 4193156 4064212 3949020 3848658
59491C848658q5218p0413n6063m2091k8686j6033l864Q195J9884L0374L9272M7131
$$ 3848658 3763440 3693027 3636964 3594873 3566187 3550154 3546290 3554485 3574369 3604743 3644015 3691146
59479C691146N4695O1870O7752P1431P2423P0557O5853N8533M8769L6437K1526
$$ 3691146 3745841 3807711 3875463 3946894 4019317 4089874 4155727 4214260 4263029 4299466 4320992
59468D320992M759j2607k9716m6424o2601p7593r0637j01408j09843j15774j19104
$$ 4320992 4325751 4313144 4283428 4237004 4174403 4096810 4006173 3904765 3794922 3679148 3560044
59457C560044j20099j19172j16576j12591j07749j02530r7005r1079q4919p8798
$$ 3560044 3439945 3320773 3204197 3091606 2983857 2881327 2784322 2693243 2608324 2529526
59447B529526p2795o6927o1364n6188n1153m6108m1285l6754l1945k6411k0859
$$ 2529526 2456731 2389804 2328440 2272252 2221099 2174991 2133706 2096952 2065007 2038596 2017737
59436B017737j6546j3636j0921p404l475j45K318M465O774R208J1540J3652J5416
$$ 2017737 2001191 1987555 1976634 1969230 1965755 1965610 1967928 1972393 1979167 1988375 1999915 2013567 2028983
59423B028983J6403J5946J3765J0657Q278P764Q659R720J0686J2683J6626K1852
$$ 2028983 2045386 2061332 2075097 2085754 2094032 2101796 2110455 2120175 2130861 2143544 2160170 2182022
59411B182022K6665K9787L0942L0560K9490K8850K9465L1330L3877L6769M0207
$$ 2182022 2208687 2238474 2269416 2299976 2329466 2358316 2387781 2419111 2452988 2489757 2529964
59400B529964M4511M9654N5322O1227O7300P3618Q0187Q6750R2943R8723J04567
$$ 2529964 2574475 2624129 2679451 2740678 2807978 2881596 2961783 3048533 3141476 3240199 3344766
59389C344766J11074J18285J25516J31993J37679J43308J49551J56331J63286
$$ 3344766 3455840 3574125 3699641 3831634 3969313 4112621 4262172 4418503 4581789
59380D581789J70783J79996J91765K05747K20902K36319K51125K64060K73849
$$ 4581789 4752572 4932568 5124333 5330080 5550982 5787301 6038426 6302486 6576335
59371F576335K79874K81910K79425K71873K59752K44479K27111K07804J86771
$$ 6576335 6856209 7138119 7417544 7689417 7949169 8193648 8420759 8628563 8815334
59362H815334J64975J43392J22047J00212P7064N1885K4067o500l9408p4434j11840
$$ 8815334 8980309 9123701 9245748 9345960 9423024 9474909 9498976 9492476 9453068 9378634 9266794
59351I266794j51442j91673k30055k64337k92864l14355l28116l34400l34024
$$ 9266794 9115352 8923679 8693624 8429287 8136423 7822068 7493952 7159552 6825528
59342F825528l27732l16385l01531k84932k67454k49063k30059k11738j95442
$$ 6825528 6497796 6181411 5879880 5594948 5327494 5078431 4848372 4636634 4441192
59333D441192j81418j69028j57833j48013j39741j32516j25312j17413j08995
$$ 4441192 4259774 4090746 3932913 3784900 3645159 3512643 3387331 3269918 3160923
59324C160923j00823r3385q6489p9766p3316o7493o2142n6534n0277m4050l8975
$$ 3160923 3060100 2966715 2880226 2800460 2727144 2659651 2597509 2540975 2490698 2446648 2407673
59313B407673l5285l1974k8007k3541j9543j6287j2897q590l740P88M954R385
$$ 2407673 2372388 2340414 2312407 2288866 2269323 2253036 2240139 2231549 2227809 2228597 2233551 2242936
59301B242936J4166J8629K2452K6136L0176L4417L8564M2535M5946M7933M8126
$$ 2242936 2257102 2275731 2298183 2324319 2354495 2388912 2427476 2470011 2515957 2563890 2612016
59290B612016M7193M5890M4139M1707L9289L7914L7542L7051L5571L3034K9466
$$ 2612016 2659209 2705099 2749238 2790945 2830234 2868148 2905690 2942741 2978312 3011346 3040812
59279C040812K4542J8003R992Q37r029j8913k8171l6612m4148n0236n4263n6453
$$ 3040812 3065354 3083357 3093349 3094186 3085157 3066244 3038073 3001461 2957313 2907077 2852814 2796361
59267B796361n7655n8208n7759n6199n4079n1802m9208m6189m3026l9806l6189
$$ 2796361 2738706 2680498 2622739 2566540 2512461 2460659 2411451 2365262 2322236 2282430 2246241
59256B246241l2160k8320k4969k1508j7320j2665q143l821M48M326P469J0337
$$ 2246241 2214081 2185761 2160792 2139284 2121964 2109299 2101156 2097335 2097783 2102109 2109578 2119915
59244B119915J3745J7701K1452K4646K7707L1061L4687L8571M2958M7840N2705
$$ 2119915 2133660 2151361 2172813 2197459 2225166 2256227 2290914 2329485 2372443 2420283 2472988
59233B472988N7196O1685O6974P3561Q1320Q9651R7971J06322J15545J26379J38344
$$ 2472988 2530184 2591869 2658843 2732404 2813724 2903375 3001346 3107668 3223213 3349592 3487936
59222C487936J49939J60147J69169J77309J83660J86479J84577J77667J65451
$$ 3487936 3637875 3798022 3967191 4144500 4328160 4514639 4699216 4876883 5042334
59213E042334J47223J22667R2635N8747K2567j4517n0973q5295j16464j43764
$$ 5042334 5189557 5312224 5404859 5463606 5486173 5471656 5420683 5335388 5218924 5075160
59203E075160j66152j82292j91544j94541j92532j86436j76928j65202j52817
$$ 5075160 4909008 4726716 4535172 4340631 4148099 3961663 3784735 3619533 3466716
59194C466716j40622j28328j15518j02657r0631p9551o8782n8202m8788m1452
$$ 3466716 3326094 3197766 3082248 2979591 2888960 2809409 2740627 2682425 2633637 2592185
59184B592185l5761l0303k4253j8002j2368p754m375k686l055n243q711j3325
$$ 2592185 2556424 2526121 2501868 2483866 2471498 2463744 2459369 2456683 2453628 2448385 2439674 2426349
59172B426349j9230k6064l2914l9173m4876m9888n3376n4692n4350n3409n2097
$$ 2426349 2407119 2381055 2348141 2308968 2264092 2214204 2160828 2106136 2051786 1998377 1946280
59161A946280m9800m6446m2975m0067l7146l3340k9013k5539k3520k1987j9559
$$ 1946280 1896480 1850034 1807059 1766992 1729846 1696506 1667493 1641954 1618434 1596447 1576888
59150A576888j5930j1944q503n884l912k327q24R42L079N270P061Q297R145R688
$$ 1576888 1560958 1549014 1540511 1534627 1530715 1528388 1527564 1528506 1531585 1536855 1543916 1552213 1561358 1571046
59136A571046R726R130Q171P396P180P439P719P536O790N965N777O462P507Q250
$$ 1571046 1580772 1589902 1598073 1605469 1612649 1620088 1627807 1635343 1642133 1648098 1653875 1660337 1667844 1676094
59122A676094Q603Q997R707J0613J1626J2977J4897J7143J9071K0164K0468K0521
$$ 1676094 1684697 1693694 1703401 1714014 1725640 1738617 1753514 1770657 1789728 1809892 1830360 1850881
59110A850881K0823K1363K1702K1618K1435K1607K2106K2618K3184K4142K5473
$$ 1850881 1871704 1893067 1914769 1936387 1957822 1979429 2001535 2024153 2047337 2071479 2096952
59099B096952K6738K7882K9526L2064L4843L6836L7892L8756L9862M0677M0360
$$ 2096952 2123690 2151572 2181098 2213162 2248005 2284841 2322733 2361489 2401351 2442028 2482388
59088B482388L8631L5781L2127K7715K2348J5660P378k256j2409k2186l1163l9257
$$ 2482388 2521019 2556800 2588927 2616642 2638990 2654650 2662028 2659772 2647363 2625177 2594014 2554757
59076B554757m6202n1525n5030n7058n8070n8203n7398n5848n4055n2338n0554
$$ 2554757 2508555 2457030 2402000 2344942 2286872 2228669 2171271 2115423 2061368 2009030 1958476
59065A958476m8363m5712m2902m0255l7871l5674l3531l1318k8978k6571k4189
$$ 1958476 1910113 1864401 1821499 1781244 1743373 1707699 1674168 1642850 1613872 1587301 1563112
59054A563112k1836j9499j7413j6003j5411j5154j4465j3068j1490j0586j0692
$$ 1563112 1541276 1521777 1504364 1488361 1472950 1457796 1443331 1430263 1418773 1408187 1397495
59043A397495j1287j1476j0814r660q693q101p378n979m000k039n09O62J701K640
$$ 1397495 1386208 1374732 1363918 1354258 1345565 1337464 1330086 1324107 1320107 1318068 1317559 1318221 1319922 1322562
59029A322562L523M629O145P744Q844R422J0137J1479J3060J4180J4888J5945
$$ 1322562 1326085 1330714 1336859 1344603 1353447 1362869 1373006 1384485 1397545 1411725 1426613 1442558
59017A442558J7609J9103J9639J9705K0676K3168K6241K8504K9676L0800L3039
$$ 1442558 1460167 1479270 1498909 1518614 1539290 1562458 1588699 1617203 1646879 1677679 1710718
59006A710718L6562M0547M3974M6348M7710M8227M7784M5993M2530L7372L0847
$$ 1710718 1747280 1787827 1831801 1878149 1925859 1974086 2021870 2067863 2110393 2147765 2178612
58995B178612K3456J5698P888J76p259j4005j9600k3903k7124k9388l0487l0351
$$ 2178612 2202068 2217766 2225654 2225830 2218571 2204566 2184966 2161063 2133939 2104551 2074064 2043713
58983B043713k9544k8919k8689k8164k6661k4379k2066k0032j7908j5461j3118
$$ 2043713 2014169 1985250 1956561 1928397 1901736 1877357 1855291 1835259 1817351 1801890 1788772
58972A788772j1363r803p346l332J660O294R613J1620J2938J4059J5003J5596
$$ 1788772 1777409 1767606 1760260 1756928 1758588 1764882 1774495 1786115 1799053 1813112 1828115 1843711
58960A843711J5917J6345J7094J7877J8229J8099J7932J8139J8724J9523K0600
$$ 1843711 1859628 1875973 1893067 1910944 1929173 1947272 1965204 1983343 2002067 2021590 2042190
58949B042190K2186K4354K6970K9891L3022L6159L9020M1609M4466M8327N3388
$$ 2042190 2064376 2088730 2115700 2145591 2178613 2214772 2253792 2295401 2339867 2388194 2441582
58938B441582N8948O3845O7303O9337P0334P0384O9071O5895O0834N4690M8968
$$ 2441582 2500530 2564375 2631678 2701015 2771349 2841733 2910804 2976699 3037533 3092223 3141191
58927C141191M5239M4254M5642M8561N2587N7813O4253P1554P9276Q7078R4566
$$ 3141191 3186430 3230684 3276326 3324887 3377474 3435287 3499540 3571094 3650370 3737448 3832014
58916C832014J01435J07900J14719J22479J31159J40446J50118J59925J69480
$$ 3832014 3933449 4041349 4156068 4278547 4409706 4550152 4700270 4860195 5029675
58907E029675J78657J87643J96296K03741K09108K12325K13748K13291K10606
$$ 5029675 5208332 5395975 5592271 5796012 6005120 6217445 6431193 6644484 6855090
58898F855090K05962K00312J94376J88127J81001J72111J60299J44691J25399
$$ 6855090 7061052 7261364 7455740 7643867 7824868 7996979 8157278 8301969 8427368
58889H427368J03167P8318N0622K0287j1675m4220p6678j08008j36589j61409
$$ 8427368 8530535 8608853 8659475 8679762 8668087 8623867 8547189 8439181 8302592 8141183
58879H141183j82936k01987k18171k30188k37546k41100k41958k40549k36984
$$ 8141183 7958247 7756260 7538089 7307901 7070355 6829255 6587297 6346748 6109764
58870F109764k31590k24780k16823k07988j98626j88882j78616j67854j57043
$$ 6109764 5878174 5653394 5436571 5228583 5029957 4841075 4662459 4494605 4337562
58861D337562j46642j36690j27034j17729j08973j00732r2813q5192p8057p1421
$$ 4337562 4190920 4054230 3927196 3809467 3700494 3599762 3506949 3421757 3343700 3272279
58851C272279o4932n8191n1124m4110l7755l2472k8082k3866j9221j4269r638
$$ 3272279 3207347 3149156 3098032 3053922 3016167 2983695 2955613 2931747 2912526 2898257 2888619
58840B888619n660k095J299M449P457J0904J5195J9817K3932K7585L1663L6632
$$ 2888619 2882959 2880864 2882163 2886612 2894069 2904973 2920168 2939985 2963917 2991502 3023165 3059797
58828C059797M1949M6936N1507N5764N9544O2874O6332P0265P4096P7055P9387
$$ 3059797 3101746 3148682 3200189 3255953 3315497 3378371 3444703 3514968 3589064 3666119 3745506
58817C745506Q2125Q5881R0579R6253J03400J12288J22478J33160J43689J53858
$$ 3745506 3827631 3913512 4004091 4100344 4203744 4316032 4438510 4571670 4715359 4869217
58807D869217J64062J74968J86543J97553K06680K13900K19945K24482K25894
$$ 4869217 5033279 5208247 5394790 5592343 5799023 6012923 6232868 6457350 6683244
58798F683244K22990K15923K05053J89983J70370J46776J19890Q9577N5664J9240
$$ 6683244 6906234 7122157 7327210 7517193 7687563 7834339 7954229 8043806 8099470 8118710
58788H118710j7740n3889q8653j21293j50467j75077j94966k10643k22546k30682
$$ 8118710 8100970 8047081 7958428 7837135 7686668 7511591 7316625 7105982 6883436 6652754
58778F652754k34887k35592k34263k32517k30533k26891k20414k11573k01620
$$ 6652754 6417867 6182275 5948012 5715495 5484962 5258071 5037657 4826084 4624464
58769D624464j90987j79503j67684j56694j46972j37854j28630j19269j10018
$$ 4624464 4433477 4253974 4086290 3929596 3782624 3644770 3516140 3396871 3286853
58760C286853j01039r2660q5318p8983p3040o6923o0514n3961m7571m1888l7228
$$ 3286853 3185814 3093154 3007836 2928853 2855813 2788890 2728376 2674415 2626844 2584956 2547728
58749B547728l3139k8810k4096j9534j5363j1321p407m069j317J472M429O586
$$ 2547728 2514589 2485779 2461683 2442149 2426786 2415465 2408058 2403989 2402672 2404144 2408573 2415159
58737B415159O910N336K241k492r065j6792k4280l0533l5378l8967m1435m2985
$$ 2415159 2422069 2427405 2429646 2427154 2418089 2401297 2377017 2346484 2311106 2272139 2230704 2187719
58725B187719m3836m4060m3797m3458m3369m3292m2633m1085l8792l5996l2856
$$ 2187719 2143883 2099823 2056026 2012568 1969199 1925907 1883274 1842189 1803397 1767401 1734545
58714A734545k9553k6155k2362j7699j2126o331j376J892L149K469k9m360j0320
$$ 1734545 1704992 1678837 1656475 1638776 1626650 1620319 1618943 1620835 1623984 1626453 1626424 1622064 1611744
58701A611744j7076k3424k8594l2471l5029l6027l5509l4086l2216k9634k6055
$$ 1611744 1594668 1571244 1542650 1510179 1475150 1439123 1403614 1369528 1337312 1307678 1281623
58690A281623k2106j8903j6791j5224j3789j2723j2220j1895j1216j0158r082
$$ 1281623 1259517 1240614 1223823 1208599 1194810 1182087 1169867 1157972 1146756 1136598 1127516
58679A127516q231p515o634n322l665k132j036p2J272K899M144M680M807M687
$$ 1127516 1119285 1111770 1105136 1099814 1096149 1094017 1092981 1092909 1094181 1097080 1101224 1105904 1110711 1115398
58665A115398L874J950q65m004p073r722j1479j2253j2636j3161j3513j2957j1331
$$ 1115398 1119272 1121222 1120357 1116353 1109280 1099558 1088079 1075826 1063190 1050029 1036516 1023559 1012228
58652A012228r097o653m207k135o94O02K491M736O172O273N976O428P570Q528
$$ 1012228 1003131 996478 992271 990136 989442 990044 992535 997271 1003443 1009716 1015692 1022120 1029690 1038218
58638A038218Q913R045R126R029Q806Q779R013R304R670J0449J1622J2608J2995
$$ 1038218 1047131 1056176 1065302 1074331 1083137 1091916 1100929 1110233 1119903 1130352 1141974 1154582 1167577
58625A167577J3171J3905J5534J7806K0318K2752K4832K6456K7948K9818L2175
$$ 1167577 1180748 1194653 1210187 1227993 1248311 1271063 1295895 1322351 1350299 1380117 1412292
58614A412292L4554L6586L8669M1620M5579M9677N3040N5854N8967O2535O5637
$$ 1412292 1446846 1483432 1522101 1563721 1609300 1658977 1712017 1767871 1826838 1889373 1955010
58603A955010O7380O7810O7430O6208O3625N9357N3360M5471L5505K3849J1455
$$ 1955010 2022390 2090200 2157630 2223838 2287463 2346820 2400180 2445651 2481156 2505005 2516460
58592B516460p73j2323k2859l2179m0335m7274n2345n4750n4620n3152n1355m9255
$$ 2516460 2515687 2503364 2480505 2448326 2407991 2360717 2308372 2253622 2199002 2145850 2094495 2045240
58580B045240m6519m3335m0199l7264l4472l2048l0419k9629k9252k8833k8224
$$ 2045240 1998721 1955386 1915187 1877923 1843451 1811403 1780984 1751355 1722103 1693270 1665046
58569A665046k7616k7347k7479k7502k6820k5656k4992k5366k6172k6629k6804
$$ 1665046 1637430 1610083 1582604 1555102 1528282 1502626 1477634 1452268 1426096 1399467 1372663
58558A372663k7029k6811k5257k2552k0082j8915j8770j8808j8776j8865j8864
$$ 1372663 1345634 1318823 1293566 1271014 1250932 1232017 1213247 1194439 1175663 1156798 1137934
58547A137934j8121j6417j4442j3201j2967j3055j2630j1639j0713j0323j0269
$$ 1137934 1119813 1103396 1088954 1075753 1062786 1049731 1037101 1025462 1014749 1004426 994157
58536I94157j0039r319q133o803n878n688n774n221l815k397j769j723j607j231
$$ 994157 984118 974799 966666 959863 953985 948297 942523 937302 933487 931090 929321 927598 925991 924760
58522I24760o49M52K251L964M505L917L458M118N719P509Q967R874J0233J0353
$$ 924760 924111 924563 926814 930778 935283 939200 942658 946776 952495 960004 968971 978845 989078 999431
58508I99431J0581J0827J0705J0150R409Q414O795M590K344M26j249k685l614
$$ 999431 1010012 1020839 1031544 1041694 1051103 1059517 1066312 1070902 1073246 1073672 1072423 1069738 1066124
58495A066124m060m465n020n370n202m714m196l661l128k795k737k798l027l690
$$ 1066124 1062064 1057599 1052579 1047209 1042007 1037293 1033097 1029436 1026308 1023513 1020776 1017978 1014951 1011261
58481A011261m640n209n028m461l994l704l573l803m371m750m545l974l409k882
$$ 1011261 1006621 1001412 996384 991923 987929 984225 980652 976849 972478 967728 963183 959209 955800 952918
58467I52918k408k343k908l714m230m402m398m153l536k713j860r70k44k15r38
$$ 952918 950510 948167 945259 941545 937315 932913 928515 924362 920826 918113 916253 915283 915039 914824 913886
58452I13886j507j070O6R79J409J760K117K090J705J546J942K483K616K285J901
$$ 913886 912379 911309 911375 912354 913763 915523 917640 919730 921435 922981 924923 927406 930022 932307 934208
58437I34208K005K882M192N096N170M975N248N717N460M385L541L686M313M516
$$ 934208 936213 939095 943287 948383 953553 958528 963776 969493 974953 979338 982879 986565 990878 995394
58423I95394M314M443N161N878N991N660N567O078O806P042O550N869N739O306
$$ 995394 999708 1004151 1009312 1015190 1021181 1026841 1032408 1038486 1045292 1052334 1058884 1064753 1070492 1076798
58409A076798O997P140O598N755N029M505M055L712L769M335M990N128M649M018
$$ 1076798 1083795 1090935 1097533 1103288 1108317 1112822 1116877 1120589 1124358 1128693 1133683 1138811 1143460 1147478
58395A147478L646L520L465L443L421L312L218L417L910M293M308M208M373M884
$$ 1147478 1151124 1154644 1158109 1161552 1164973 1168285 1171503 1174920 1178830 1183123 1187431 1191639 1196012 1200896
58381A200896N705O815P953Q652Q923R385J0293J0967J0752J0114R968J0320J0394
$$ 1200896 1206601 1213416 1221369 1230021 1238944 1248329 1258622 1269589 1280341 1290455 1300423 1310743 1321137
58368A321137J0016R863J0319J0866J0972J0810J0720J0528R916R116Q778R272
$$ 1321137 1331153 1341016 1351335 1362201 1373173 1383983 1394703 1405231 1415147 1424263 1433041 1442313
58356A442313J0374J1569J2372J2481J1874J0878J0082R993J0678J1682J2477
$$ 1442313 1452687 1464256 1476628 1489109 1500983 1511861 1521943 1531936 1542614 1554296 1566773
58345A566773J2960J3392J3883J4300J4709J5472J6678J7882J8746J9469K0222
$$ 1566773 1579733 1593125 1607008 1621308 1636017 1651489 1668167 1686049 1704795 1724264 1744486
58334A744486K0641K0485K0406K1288K3012K4591K5485K6063K6712K7270K7534
$$ 1744486 1765127 1785612 1806018 1827306 1850318 1874909 1900394 1926457 1953169 1980439 2007973
58323B007973K7722K8038K8327K8385K8224K7775K6695K4796K2435K0225J8592
$$ 2007973 2035695 2063733 2092060 2120445 2148669 2176444 2203139 2227935 2250370 2270595 2289187
58312B289187J7697J7528J7785J7977J7977J8259J9418K1470K3878K6151K8146
$$ 2289187 2306884 2324412 2342197 2360174 2378151 2396410 2415828 2437298 2461176 2487327 2515473
58301B515473K9870L1261L2350L3444L4936L6871L8878M0596M2016M3300M4554
$$ 2515473 2545343 2576604 2608954 2642398 2677334 2714205 2753083 2793679 2835695 2878995 2923549
58290B923549M5926M7705M9930N2078N3674N5036N6868N9117O1013O2345O3930
$$ 2923549 2969475 3017180 3067110 3119188 3172862 3227898 3284766 3343883 3404896 3467241 3531171
58279C531171O6404O9191P1234P2256P2752P3081P3134P2732P1983P1266P1058
$$ 3531171 3597575 3666766 3738000 3810256 3883008 3956089 4029223 4101955 4173938 4245204 4316262
58268D316262P1579P2658P4215P6754Q0684Q5298Q9344R2717R6514J01193J05853
$$ 4316262 4387841 4460499 4534714 4611468 4692152 4777450 4866794 4959511 5056025 5157218 5263071
58257E263071J09949J14382J20040J26349J32349J38209J44501J50885J56858
$$ 5263071 5373020 5487402 5607442 5733791 5866140 6004349 6148850 6299735 6456593
58248F456593J63135J70872J79912J89058J97813K06693K16209K26573K38093
$$ 6456593 6619728 6790600 6970512 7159570 7357383 7564076 7780285 8006858 8244951
58239H244951K50783K63931K77050K90859L06382L23544L41628L60516L80527
$$ 8244951 8495734 8759665 9036715 9327574 9633956 9957500 10299128 10659644 11040171
58230A1040171M01671M24226M49324M77733N08763N41514N76457O14598O56085
$$ 11040171 11441842 11866068 12315392 12793125 13301888 13843402 14419859 15034457 15690542
58221A5690542P00962P50165Q04278Q62576R25089R94332J073094J161790J260102
$$ 15690542 16391504 17141669 17945947 18808523 19733612 20727944 21801038 22962828 24222930
58212B4222930J369789J493514J632453J787801J963333K163641K391403K649429
$$ 24222930 25592719 27086233 28718686 30506487 32469820 34633461 37024864 39674293
58204C9674293K943876L282281L670484M115246M627890N221572N908002O702151
$$ 39674293 42618169 45900450 49570934 53686180 58314070 63535642 69443644 76145795
58196G6145795P627897Q713902R986011J1464943J3159410J5048082J7069502
$$ 76145795 83773692 92487594 102473605 113938548 127097958 142146040 159215542
58189A59215542J9121862K1020305K2389729K2613216K1009243J7210090J1452676
$$ 159215542 178337404 199357709 221747438 244360654 265369897 282579987 294032663
58182B94032663M525006k563837q903897j3838722j7031609j8524468j8713223
$$ 294032663 298557669 295993832 287089935 273251213 256219604 237695136 218981913
58175B18981913j8157892j7326010j6458617j5612086j4762825j3868640j2890206
$$ 218981913 200824021 183498011 167039394 151427308 136664483 122795843 109905637
58168A09905637j1812574j0661099r489102q350283p284594o319508n470665m739442
$$ 109905637 98093063 87431964 77942862 69592579 62307985 55988477 50517812 45778370
58160D5778370m116041l587066l139393k759967k436738k160561j924867j724113
$$ 45778370 41662329 38075263 34935870 32175903 29739165 27578604 25653737 23929624
58152B3929624j553464j408718j285365j178741j085578j003925r31175q63940
$$ 23929624 22376160 20967442 19682077 18503336 17417758 16413833 15482658 14618718
58144A4618718q00410p40966o85838o34083n85373n40640n00009m62043m26009
$$ 14618718 13818308 13077342 12391504 11757421 11172048 10631408 10131399 9669356 9243347
58135I243347l92989l63710l37221l13003k92496k76936k65044k54389k43934
$$ 9243347 8850358 8486648 8149427 7836424 7543928 7266992 7001948 6747559 6503625
58126F503625k33847k23852k13377k02595j92048j81655j71185j61112j52008
$$ 6503625 6269778 6045926 5832549 5629954 5437906 5256251 5085066 4923954 4771946
58117D771946j43627j35503j27932j21476j15880j10408j04860r9489r4266q9014
$$ 4771946 4628319 4492816 4364884 4243408 4127528 4017120 3912260 3812771 3718505 3629491
58107C629491q4003p9739p6276p3291p0632o8302o6043o3463o0560n7811n5734
$$ 3629491 3545488 3465749 3389473 3316182 3245550 3177248 3111205 3047742 2987182 2929371 2873637
58096B873637n4423n3442n2186n0555m9074m8052m6990m5365m3639m2635m2098
$$ 2873637 2819214 2765772 2713586 2663031 2613957 2565905 2518915 2473550 2429911 2387276 2345178
58085B345178m0979l9118l7538l6837l6415l5715l5111l4966l4784l4045l3117
$$ 2345178 2304199 2265081 2227543 2190706 2154291 2118576 2083465 2048499 2013715 1979670 1946553
58074A946553l2542l2032l0930k9265k7613k6269k5070k3821k2446k0998j9776
$$ 1946553 1914011 1881979 1851049 1821784 1794171 1767902 1742832 1719011 1696565 1675567 1655791
58063A655791j9078j8657j7933j6893j6128j5737j5088j4052j3573j4325j5591
$$ 1655791 1636713 1618056 1600123 1583230 1567102 1551365 1536277 1522225 1508652 1494327 1478736
58052A478736j6190j5915j5237j4288j3051j2000j1552j1229j0273q909q052p965
$$ 1478736 1462546 1446631 1431394 1417106 1404055 1392055 1380503 1369274 1359001 1350092 1342040 1334075
58040A334075q049p885p609p288o718n951n341m929m376l563k782k267j974j903
$$ 1334075 1326026 1318141 1310532 1303244 1296526 1290575 1285234 1280305 1275929 1272366 1269584 1267317 1265343 1263440
58026A263440k080k234j942j198l90K63Q71J500K113K891M048N322O154O524P117
$$ 1263440 1261360 1259126 1257184 1255986 1255596 1255859 1256730 1258230 1260343 1263234 1267282 1272604 1278758 1285282 1292399
58011A292399Q456J0304J2153J3896J5733J7782K0035K2509K5025K7111K8520
$$ 1292399 1300855 1311159 1323312 1337208 1352941 1370723 1390758 1413267 1438292 1465403 1493923
58000A493923K9710L1445L3780L5858L6929L7314L7944L8965L9307L7898L4900
$$ 1493923 1523633 1555078 1588858 1624716 1661645 1698959 1736903 1775868 1815175 1853073 1887973
57989A887973L1377K7993K4605K1086J7855J5416J3865J3041J2747J2543J1664
$$ 1887973 1919350 1947343 1971948 1993034 2010889 2026305 2040170 2053211 2065958 2078501 2090165
57978B090165R418N462l86q074j6933k5909l4396m2349m9378n4406n6734n6725
$$ 2090165 2099583 2105045 2104659 2096585 2079652 2053743 2019347 1976998 1927620 1873214 1816480 1759755
57966A759755n4972n1390m5928l9571l3680k8653k4079j9894j6384j3277r987
$$ 1759755 1704783 1653393 1607465 1567894 1534214 1505561 1481482 1461588 1445204 1431927 1421940
57955A421940o824m825m170l739k696j520r66p49j09Q94J511J499J517K258L735
$$ 1421940 1415116 1410291 1406121 1402382 1399686 1398166 1397200 1396451 1396342 1397236 1398747 1400246 1401763 1404021 1407756
57940A407756N563P559R824J2359J4840J6891J8490J9820K0702K0515J8886J6035
$$ 1407756 1413319 1420878 1430702 1443061 1457901 1474792 1493282 1513102 1533804 1554319 1573205 1589240
57928A589240J2026O168k077j1691k0497k7072l1657l5015l7232l8031l7512l5998
$$ 1589240 1601266 1607434 1605357 1593666 1573169 1546097 1514440 1479425 1442193 1404162 1366650 1330652
57916A330652l3548l0213k6539k3282k0804j9014j7704j6586j5275j3679j2271
$$ 1330652 1297104 1266891 1240352 1217070 1196266 1177252 1159548 1142962 1127687 1114008 1101737
57905A101737j1560j1389j1108j0394r619r349r710j0240j0289r628q672p974
$$ 1101737 1090177 1078788 1067680 1057286 1047667 1038318 1028608 1018368 1008079 998451 989779 981805
57893I81805p555o952n954m859l890k815j435j9J144K310L890N687P053P695P918
$$ 981805 974250 967298 961344 956485 952595 949780 948345 948326 949470 951780 955670 961357 968410 976105 984023
57878I84023Q053Q066P791P221O495N769N162M629L914K782J359P1p48j118j366
$$ 984023 992076 1000142 1007933 1015154 1021649 1027418 1032580 1037209 1041123 1043905 1045264 1045335 1044587 1043469 1042103
57863A042103j900k900m160n245n855n845n041l446j753j001j387j780j022O31
$$ 1042103 1040203 1037303 1033143 1027898 1022043 1016198 1011157 1007711 1005958 1004957 1003570 1001790 1000768 1001399
57849A001399J905K150J933K024K509K964L060K695J985J254P86M60m6o35p90
$$ 1001399 1003304 1005454 1007387 1009411 1011920 1014884 1017944 1020639 1022624 1023878 1024664 1025124 1025078 1024443 1023653
57834A023653l45J74J96j92m73l47J52R71K099L386M555N406N989O619P744R604
$$ 1023653 1023308 1023482 1023678 1023486 1023013 1022666 1022818 1023789 1025888 1029274 1033829 1039235 1045224 1051843 1059587 1069191
57818A069191J1962J4346J6585J8878K1282K3441K4954K5776K6073K6007K5916
$$ 1069191 1081153 1095499 1112084 1130962 1152244 1175685 1200639 1226415 1252488 1278495 1304411
57807A304411K6361K7595K9192L0552L1570L2302L2109K9805K4854J7890R892
$$ 1304411 1330772 1358367 1387559 1418111 1449681 1481983 1514092 1543897 1568751 1586641 1596533
57796A596533J287p737j6534k4230l0519l5550l9081m0453l9657l7896l6508l5616
$$ 1596533 1597820 1590083 1573549 1549319 1518800 1483250 1444169 1403716 1364059 1326163 1289655 1254039
57784A254039l4301l1989k9116k6440k4191k2107j9919j7557j5078j2675j0635
$$ 1254039 1219738 1187749 1158633 1132193 1108002 1085895 1065976 1048419 1033341 1020666 1010031
57773A010031r149q139p330o396n097l524k132j250o04K92J238J418N81l75l66
$$ 1010031 1000882 992743 985413 979017 973920 970396 968264 967014 966410 966702 967940 969358 969939 969564 969198
57758I69198P20K229L667M929N908O556P126P815Q341Q434Q547R399J0790J1612
$$ 969198 969918 972147 975814 980743 986651 993207 1000333 1008148 1016489 1024923 1033470 1042869 1053659 1065271
57744A065271J1147R777Q295P064O003M899L588K209J334J308J537J106J54j96
$$ 1065271 1076418 1086195 1094490 1101554 1107557 1112456 1116044 1118253 1119587 1120895 1122432 1123538 1123692 1123496
57730A123496N06J414J841K360L708N376O319O530O893P759Q675R449J0437J1618
$$ 1123496 1124002 1125416 1127257 1129617 1133325 1138701 1145020 1151550 1158443 1166202 1174877 1184326 1194763 1206381
57716A206381J2322J2248J2104J2778J4285J5944J7301J8478J9780K1293K2860
$$ 1206381 1218703 1230951 1243055 1255833 1270118 1286062 1303363 1321841 1341621 1362914 1385774
57705A385774K4282K5509K6697K8058K9722L1657L3673L5574L7501M0094M3901
$$ 1385774 1410056 1435565 1462262 1490320 1520042 1551699 1585372 1620946 1658447 1698541 1742442
57694A742442M8549N2995N6727O0328O4488O9042P3340P7032P9846Q1221Q0937
$$ 1742442 1790991 1843986 1900713 1961041 2025529 2094571 2167911 2244943 2324789 2406010 2486947
57683B486947P9710P8144P5450P0354O3203N5932M9728M3990L8115L3164L0889
$$ 2486947 2566657 2644801 2720251 2790605 2853808 2909740 2959468 3003458 3041573 3074737 3105626
57672C105626L1893L5443M0189M3840M2643L2733J2662j5551m7644p8894j05186
$$ 3105626 3137519 3172962 3213151 3256991 3299634 3332367 3345029 3329478 3281834 3202940 3097754
57661C097754j23654j33138j34136j28290j17920j05575r3217q1615p0618n9975
$$ 3097754 2974100 2840962 2706826 2578536 2460616 2355041 2261824 2180209 2109591 2049616
57651B049616m9715m0045l1444k4564j9570j5577j1427o938k821O76M228Q273
$$ 2049616 1999901 1959856 1928412 1903848 1884278 1868701 1857274 1850336 1847515 1848191 1852419 1860692
57639A860692J2241J5518J8570K2357K6933L1447L5365L8971M2517M5616M7896
$$ 1860692 1872933 1888451 1907021 1929378 1956311 1987758 2023123 2062094 2104611 2150227 2198123
57628B198123M9695N1627N3700N5256N5663N4610N1905M7411M1218L3526K4339
$$ 2198123 2247818 2299445 2353145 2408401 2464064 2518674 2570579 2617990 2659208 2692734 2717073
57617B717073J3659K046r461k0201l0225l9525m7437n3255n7166n9948o1890o2553
$$ 2717073 2730732 2732778 2723317 2703116 2672891 2633366 2585929 2532674 2475508 2415560 2353670 2291117
57605B291117o1649n9511n6645n3269m9588m6056m3092m0667l8338l5547l1915
$$ 2291117 2229468 2169957 2113312 2060043 2010455 1964399 1921307 1880640 1842302 1806755 1774840
57594A774840k7695k3969k1860k1251k0786j9446j7672j6476j5924j5187j3786
$$ 1774840 1747145 1723176 1701316 1680065 1659279 1639833 1622161 1605685 1589761 1574574 1560788
57583A560788j2054j0395q781p154n754m784m138l665l360l070k329p98J258L183
$$ 1560788 1548734 1538339 1529558 1522404 1516650 1511866 1507728 1504063 1500703 1497633 1495304 1494506 1495764 1498947
57569A498947M453M890M570L855L381L666M600N544O059O371O973P874Q600Q935
$$ 1498947 1503400 1508290 1512860 1516715 1520096 1523762 1528362 1533906 1539965 1546336 1553309 1561183 1569783 1578718
57555A578718R307J0198J1421J2426J3158J4144J5668J7351J8778K0042K1412
$$ 1578718 1588025 1598223 1609644 1622070 1635228 1649372 1665040 1682391 1701169 1721211 1742623
57544A742623K2834K4251K6000K8425L1214L3730L5913L8282M1053M3743M5834
$$ 1742623 1765457 1789708 1815708 1844133 1875347 1909077 1944990 1983272 2024325 2068068 2113902
57533B113902M7377M8662M9655N0001M9385M7638M4649M0434L5150K8862K1381
$$ 2113902 2161279 2209941 2259596 2309597 2358982 2406620 2451269 2491703 2526853 2555715 2577096
57522B577096J2570K845o771j5244k2209k8025l3113l7353m0266m1700m2015m1520
$$ 2577096 2589666 2592511 2585740 2570496 2548287 2520262 2487149 2449796 2409530 2367830 2325815 2284295
57510B284295m0168l8025l5610l3470l1556k9442k6900k3942k0638j7327j4632
$$ 2284295 2244127 2206102 2170492 2137022 2105466 2076024 2049124 2025182 2004544 1987217 1972585
57499A972585j2688j0645p797m908l363l018k113K64K918M477N450P236R818J1872
$$ 1972585 1959897 1949252 1941455 1936547 1933184 1930166 1928053 1928317 1931235 1935712 1941162 1948398 1958216 1970088
57485A970088J2964J4178J6404J9109K1381K3261K5395K7877L0188L2104L4051
$$ 1970088 1983052 1997230 2013634 2032743 2054124 2077385 2102780 2130657 2160845 2192949 2227000
57474B227000L6447L9083M1262M2524M3120M3638M4074M3489M0862L6132K9986
$$ 2227000 2263447 2302530 2343792 2386316 2429436 2473074 2517148 2560637 2601499 2637631 2667617
57463B667617K2775J4301M769m755j3312k0941k8069l4401l9154m2249m4417m6089
$$ 2667617 2690392 2704693 2709462 2704707 2691395 2670454 2642385 2607984 2568830 2526581 2482164 2436075
57451B436075m6798m6060m4241m2152m0102l7833l5211l2503k9968k7554k5076
$$ 2436075 2389277 2343217 2298976 2256824 2216722 2178889 2143678 2111175 2081207 2053653 2028577
57440B028577k2504j9979j7734j5926j4478j3065j1483r922q737q028p593p211
$$ 2028577 2006073 1986094 1968360 1952434 1937956 1924891 1913408 1903486 1894749 1886721 1879128 1871917
57428A871917o714n940m925m084l807l900l750l127k352j645q46K9N08L33J3K64
$$ 1871917 1865203 1859263 1854338 1850254 1846447 1842547 1838797 1835670 1833318 1831673 1830827 1830856 1831364 1831697 1831710 1831974
57412A831974J211K455L639M507M798M579M368M453M360L629K822K908L862M618
$$ 1831974 1833185 1835640 1839279 1843786 1848584 1853163 1857531 1861984 1866344 1869973 1872795 1875703 1879565 1884183
57398A884183M553M145M078M405M854N299N638N758N931O535P189O865N333L839
$$ 1884183 1888736 1892881 1896959 1901364 1906218 1911517 1917155 1922913 1928844 1935379 1942568 1949433 1954766 1958605
57384A958605L674M649N619O013O097O050N683N028M493M292M256M250M346M543
$$ 1958605 1962279 1966928 1972547 1978560 1984657 1990707 1996390 2001418 2005911 2010203 2014459 2018709 2023055 2027598
57370B027598M723M905N255N768O303O858P502P996P890P024N820N026N223O443
$$ 2027598 2032321 2037226 2042481 2048249 2054552 2061410 2068912 2076908 2084798 2091822 2097642 2102668 2107891 2114334
57356B114334P955Q724Q358P527P141P313P488P406P394P722Q216Q552Q607Q375
$$ 2114334 2122289 2131013 2139371 2146898 2154039 2161352 2168840 2176246 2183640 2191362 2199578 2208130 2216737 2225112
57342B225112P923P512P498P960Q577Q955Q953Q740Q674Q998R512R748R674R908
$$ 2225112 2233035 2240547 2248045 2256005 2264582 2273537 2282490 2291230 2299904 2308902 2318414 2328162 2337836 2347744
57328B347744J0895J2194J3017J3226J3243J3231J3014J2683J2591J2679J2521
$$ 2347744 2358639 2370833 2383850 2397076 2410319 2423550 2436564 2449247 2461838 2474517 2487038
57317B487038J2180J2351J3418J4886J5952J6266J6041J5854J6371J7702J8980
$$ 2487038 2499218 2511569 2524987 2539873 2555825 2572091 2588132 2603986 2620357 2638059 2657039
57306B657039J9193J8490J7949J7970J7840J7037J6025J5212J4121J2352J0476
$$ 2657039 2676232 2694722 2712671 2730641 2748481 2765518 2781543 2796755 2810876 2823228 2833704
57295B833704R074P540N016K034N9m66n25r56j533j778j778j743j427m74J027
$$ 2833704 2842778 2850318 2855334 2857368 2857427 2856961 2856436 2855480 2853947 2852169 2850391 2848648 2847221 2846747 2847774
57280B847774K656M041M952N355N534N850O295O607O903P729R234J0707J1233
$$ 2847774 2850430 2854471 2859423 2864778 2870312 2876162 2882457 2889064 2895967 2903696 2912930 2923637 2934870
57267B934870J0696R894R742J0459J1451J1966J1998J2290J3258J4181J4087J3296
$$ 2934870 2945566 2955460 2965202 2975661 2987112 2999078 3011076 3023366 3036624 3050805 3064892 3078188
57255C078188J3208J4386J5699J5952J5594J5942J7106J7784J7177J6103J5805
$$ 3078188 3091396 3105782 3121481 3137433 3153027 3168969 3186075 3203859 3221036 3237139 3252944
57244C252944J6351J6879J6947J6936J7224J7697J8179J8750J9342J9485J8935
$$ 3252944 3269295 3286174 3303121 3320057 3337281 3354978 3373157 3391907 3411249 3430734 3449669
57233C449669J8231J8164J8847J9751K0556K1339K1916K1773K0930K0340K0810
$$ 3449669 3467900 3486064 3504911 3524662 3545218 3566557 3588473 3610246 3631176 3651516 3672326
57222C672326K1876K2382K1982K1552K2035K3390K4823K5704K6040K6221K6479
$$ 3672326 3694202 3716584 3738566 3760118 3782153 3805543 3830366 3856070 3882110 3908331 3934810
57211C934810K6668K6544K6243K6217K6626K7059K7082K6901K7093K7917K9230
$$ 3934810 3961478 3988022 4014265 4040482 4067108 4094167 4121249 4148150 4175243 4203160 4232390
57200D232390L0953L3213L6022L9217M2710M6458N0158N3315N5733N7578N8924
$$ 4232390 4263343 4296556 4332578 4371795 4414505 4460963 4511121 4564436 4620169 4677747 4736671
57189D736671N9625N9683N9322N8524N6902N4306N1291M8599M6393M4343M2366
$$ 4736671 4796296 4855979 4915301 4973825 5030727 5085033 5136324 5184923 5231316 5275659 5318025
57178E318025M0901M0298M0159L9588L8153L6428L5339L5068L4973L4560L4117
$$ 5318025 5358926 5399224 5439383 5478971 5517124 5553552 5588891 5623959 5658932 5693492 5727609
57167E727609L4090L4298L4285L4106L4181L4492L4573L4269L3949L3911L4039
$$ 5727609 5761699 5795997 5830282 5864388 5898569 5933061 5967634 6001903 6035852 6069763 6103802
57156F103802L4108L3925L3172L1683K9825K8021K5839K2419J7994J4123J1914
$$ 6103802 6137910 6171835 6205007 6236690 6266515 6294536 6320375 6342794 6360788 6374911 6386825
57145F386825J0767R575Q495Q608J0171J2105J3304J3761J4193J4979J5683J5519
$$ 6386825 6397592 6407167 6415662 6424270 6434441 6446546 6459850 6473611 6487804 6502783 6518466 6533985
57133F533985J4224J2423J0988R971Q596O418M140K919L237M777P078R898J3085
$$ 6533985 6548209 6560632 6571620 6581591 6590187 6596605 6600745 6603664 6606901 6611678 6618756 6628654 6641739
57120F641739J6485J9971K3523K7455L2478L8943M5964N2072N7055O2374O9219
$$ 6641739 6658224 6678195 6701718 6729173 6761651 6800594 6846558 6898630 6955685 7018059 7087278
57109G087278P7052Q4793R2785J02489J14926J30527J50132J74769K04422K38287
$$ 7087278 7164330 7249123 7341908 7444397 7559323 7689850 7839982 8014751 8219173 8457460
57099H457460K76519L20729L72363M31465M97397N70159O50632P39997Q39154
$$ 8457460 8733979 9054708 9427071 9858536 10355933 10926092 11576724 12316721 13155875
57090A3155875R48338J067119J194812J330215J469947J606674J728448J817965
$$ 13155875 14104213 15171332 16366144 17696359 19166306 20772980 22501428 24319393
57082B4319393J851527J802409J652066J401976J073401O93745K84299j38239
$$ 24319393 26170920 27973329 29625395 31027371 32100772 32794517 33078816 32940577
57074C2940577n52499r30676j247808j491000j659407j758197j794472j777042
$$ 32940577 32388078 31457402 30209594 28718594 27059187 25300990 23506518 21729476
57066B1729476j716756j625324j513633j390619j262831j134901j010607q93484
$$ 21729476 20012720 18387396 16873763 15483144 14220313 13085412 12074805 11181321
57058A1181321p86280o90187o04996n29895m63955m06177l55579l11418k73259
$$ 11181321 10395041 9704854 9099858 8569963 8106008 7699831 7344252 7032834 6759575
57049F759575k40884k14281j93577j78628j68460j61265j55050j48448j40990
$$ 6759575 6518691 6304410 6110833 5932205 5763745 5602480 5447430 5298982 5157992
57040E157992j32802j24270j15924j08293j01569r5517q9860q4621p9859p5275
$$ 5157992 5025190 4900920 4784996 4676703 4575134 4479617 4389757 4305136 4225277 4150002
57030D150002p0417o5191n9859n4597m9384m4131l8530l1891k3773j4589m974
$$ 4150002 4079585 4014394 3954535 3899938 3850554 3806423 3767893 3736002 3712229 3697640 3692666
57019C692666N047J5013K2127K2035J2590m019k3647m3626o2853p9720r1924r8382
$$ 3692666 3697713 3712726 3734853 3756888 3769478 3765459 3741812 3698186 3635333 3555613 3463689 3365307
57007C365307r9864r7580r2320q5120p7508p0514o4134n8111n2481m7179m1954
$$ 3365307 3265443 3167863 3075543 2990423 2912915 2842401 2778267 2720156 2667675 2620496 2578542
56996B578542l7050l3268l0868k9062k6967k4519k2126j9990j8167j6751j5563
$$ 2578542 2541492 2508224 2477356 2448294 2421327 2396808 2374682 2354692 2336525 2319774 2304211
56985B304211j4160j2448j0918j0041r985j1008j3392j6566j9076k0088k0253
$$ 2304211 2290051 2277603 2266685 2256644 2246659 2235651 2222259 2205693 2186617 2166529 2146276
56974B146276k0520k0803k0552j9940j9463j8713j6745j3600j0485q317o890n675
$$ 2146276 2125756 2104953 2084401 2064461 2044998 2026285 2009540 1995940 1985455 1977138 1970248 1964573
56962A964573m611l747k764j407o9N60K75n49j577k987n204q295j1642j4323j5755
$$ 1964573 1959962 1956215 1953451 1952044 1951975 1952535 1952810 1952261 1950684 1947697 1942493 1934198 1922556 1908233 1892478
56947A892478j6005j5519j4710j3742j2430j0366p509m686l024k662k493j440
$$ 1892478 1876473 1860954 1846244 1832502 1820072 1809706 1802197 1797511 1794487 1791825 1789332 1787892
56935A787892L89K268M023O004Q107R498R295P113L035k395q115j3003j6555j8908
$$ 1787892 1788281 1790549 1794572 1800576 1808683 1818181 1827476 1834589 1837624 1835229 1827114 1814111 1797556 1778648
56921A778648k0330k1026k1264k1190k0562j9129j7221j5512j4196j2926j1516
$$ 1778648 1758318 1737292 1716028 1694838 1674276 1655147 1637926 1622414 1608218 1595292 1583776
56910A583776j0183r032p921o955o528o669o821o544n955n336m802m576m916n426
$$ 1583776 1573593 1564561 1556640 1549685 1543157 1536488 1529667 1523123 1517168 1511832 1507030 1502454 1497538 1492112
56896A492112n068l456j590o88n85j27J164K583L502M234N268O208O041M305J652
$$ 1492112 1487044 1483588 1481998 1481310 1480725 1480598 1481762 1484345 1487847 1492081 1497349 1503557 1509598 1513903 1515555
56881A515555q35k630m074n652p177p831p184n886n039m855m345k460O58L764
$$ 1515555 1514720 1512090 1508016 1502364 1495187 1487356 1480172 1474286 1469247 1464392 1460047 1457587 1458245 1462009
56867A462009N799O880Q010R977J2652J5372J7716J9643K0816K0343J7468J2378
$$ 1462009 1467808 1474688 1482698 1492675 1505327 1520699 1538415 1558058 1578874 1599217 1616685 1629063
56855A629063O037o33p016j2465j6244j8109j8486j7845j6186j3496j0325p455
$$ 1629063 1635100 1634467 1627451 1614986 1598742 1580633 1562147 1544302 1528116 1514620 1504295 1496840
56843A496840m951k123J580N990J0643J5378K0221K4958K9074L1990L3104L1852
$$ 1496840 1491889 1489766 1491346 1497336 1507979 1523357 1543578 1568536 1597610 1629600 1662704 1694556
56831A694556K8010K1769J3365K940q708j9572k7450l1710l3453l3837l2848l0137
$$ 1694556 1722566 1744335 1757700 1760640 1751932 1732360 1704910 1673200 1639747 1605910 1573062 1542925
56819A542925k6216k2023j7699j2765p414k757N40L150O205J0056J4279J8389
$$ 1542925 1516709 1494686 1476987 1464222 1456808 1454051 1454591 1457741 1463946 1474002 1488281 1506670
56807A506670K1758K3077K0797J4602O065k565j0134j6848k2946k7619k9681k9023
$$ 1506670 1528428 1551505 1572302 1586904 1592969 1590404 1580270 1563422 1540476 1512857 1483176 1454153
56795A454153k6942k4844k2941k0480j7038j3152r694o966m642k441m93J023K371
$$ 1454153 1427211 1402367 1379426 1358946 1341908 1328756 1319062 1312096 1307454 1305013 1304520 1305543 1307914
56782A307914M093O205P765P496M892N46m497r435j3743j7086j9444k1104k2193
$$ 1307914 1312007 1318212 1325977 1333473 1338365 1338911 1334414 1324979 1311236 1294150 1274706 1253602 1231409
56769A231409k2402k1503j9833j7973j6144j4295j2556j1130r892q623p558p115
$$ 1231409 1209007 1187504 1167671 1149698 1133554 1119259 1106703 1095573 1085681 1077058 1069500 1062385
56757A062385p062o623n551m497m064m062m016l957m221m728m924m404l377k517
$$ 1062385 1055323 1048700 1043149 1038652 1034588 1030526 1026510 1022553 1018332 1013604 1008680 1004276 1000899 998382
56743I98382k404k923l291l014k663l144m240m727m167l627l991m463l701j893
$$ 998382 995978 993055 989764 986750 984087 980943 976703 971976 967809 964182 960191 955728 952027 950134
56729I50134n63m74q80r13p37q97j350j637j573j349j226j395j858k237k014j098
$$ 950134 949571 949097 948217 947304 946567 945670 944320 942683 941110 939761 938535 937140 935282 933045 931031 929933
56713I29933O3J008J569J624J097M44N46J701L050L476K807J679N78m48j219j317
$$ 929933 929996 931004 932573 934197 935294 935738 936284 937985 941035 944511 947318 948997 949575 949127 947908 946591
56697I46591p36j80l15r78j460j428j236j266j372j200q56q11j173j489j413j219
$$ 946591 945855 945675 945360 944382 942922 941494 940258 938992 937620 936420 935564 934753 933580 932091 930678 929459
56681I29459j324j662j870j938k130k447k661k877l431m245m817m987n108n292
$$ 929459 928135 926473 924603 922665 920535 918088 915427 912550 909119 904874 900057 895070 889962 884670
56667H84670n125m458l877l898m220m273m060l903l728l339l078l414m032m169
$$ 884670 879545 875087 871210 867312 863092 858819 854759 850856 847128 843789 840711 837297 833265 829096
56653H29096l829l805m367m680l940k442j109m24l10o53j370k130k473k220j601
$$ 829096 825267 821462 817095 812415 808475 806033 804924 804500 804190 803537 802167 800037 797564 795344 793743
56638G93743j009p77r91j392j556j367j093r60q61p13p67j280k118k955l663m177
$$ 793743 792734 791957 790966 789574 788018 786651 785558 784598 783737 783024 782257 780977 778859 775904 772241 768064
56622G68064m157l310k010j162j245j773j874j262m28jp9k37j41N4J5j90j31L27
$$ 768064 763907 760597 758587 757425 756180 754407 752533 751271 750843 750842 750763 750526 750385 750439 750454 750264 750133 750460
56604G50460P29O42K66J23L13M12M8p10j540k094k065j383m91j29o29j479j780
$$ 750460 751189 751831 752097 752220 752533 752945 752993 752283 750743 748649 746584 745201 744710 744581 743952 742473 740693
56587G40693j116J3O27J42j049j942j877j096k85K12N18P38O89J56p60j628j948
$$ 740693 739577 739590 740217 740359 739310 737368 735491 734395 734110 734322 734840 735578 736267 736423 735663 734035 732087
56570G32087j563r44p80j142j261o01K39J93q27j863k238k234k278k201j768j317
$$ 732087 730524 729580 728800 727658 726397 725796 726035 726228 725401 723538 721300 719066 716788 714587 712819 711502
56554G11502j288j566j825k211l069m185m948n150n052m735l994l061k746l472
$$ 711502 710214 708648 706823 704612 701543 697358 692410 687260 682208 677473 673479 670418 667672 664200
56540F64200m534m774l919k817k333k328k023j172m72n79j163j346r46p04j168
$$ 664200 659666 654892 650973 648156 645823 643495 641472 640300 639828 639249 638086 636740 635794 635090 633922
56525F33922j953k430k623k879l024k494j270j32J06p26k187l538m027l312j824
$$ 633922 631969 629539 626916 624037 621013 618519 617249 617117 617223 616497 614310 610772 606745 603433 601609
56510F01609m59K06K19j43p45j473k033k113j611p32Q6L73J7o25j147j512j807
$$ 601609 601150 601356 601575 601432 600687 599214 597181 595068 593457 592725 592811 593184 593201 592576 591429 589917 588110
56493E88110j837j393q04o64r23q68k01M33L22l14o55l20L91J100J642J859J621
$$ 588110 586273 584880 584076 583412 582489 581621 581420 581853 582175 581861 581206 580886 581277 582377 584019 585878 587499
56476E87499J153R39J033Q28j63j455j997j445o08m26q87j341j537j685j670j065
$$ 587499 588652 589591 590624 591452 591289 589834 587837 586392 585784 585358 584471 583130 581593 579908 578238 577173
56460E77173j19J69n46j252j033m83o94j352j195j80K75m78j211o21P80J504R95
$$ 577173 577054 577223 576677 575425 574392 573909 573215 571863 570668 570488 570763 570285 569074 568453 569233 570737 571732
56443E71732j77j410k414k803k385j671j367j463j483j424j676k118k118j495
$$ 571732 571555 570145 567731 564928 562543 560872 559505 558042 556559 555135 553459 551341 549223 547728
56429E47728p42k07K45O14N51Nm55k79N07J544K406K519J484j78j224j115o63
$$ 547728 546986 546779 547024 547638 548189 548194 547739 547460 547967 549511 551917 554436 555920 555742 554518 553403 552740
56412E52740p78j144q43J43R38J115J074J093P81j05j038j360j121q39p48p15
$$ 552740 551962 550818 549975 550118 551056 552171 553245 554338 555119 555014 553976 552616 551495 550656 549908 549193
56396E49193o67o64o26m40k95n02r80j257j040n02Q2O31J065J105N51l93j199
$$ 549193 548526 547862 547236 546796 546501 545999 545019 543762 542722 542220 542302 542933 543998 545103 545654 545261 544062
56379E44062j420r96k69K68M66P40J480K294K304J347L66K40P88J345J820K454
$$ 544062 542642 541646 541377 541645 542111 542851 544331 546625 548929 550276 550642 550882 551670 553015 554835 557289
56363E57289K955K777K100J645J469Q90j84q26l23R16K152L212L959L742K309
$$ 557289 560244 563021 565121 566766 568235 569125 568941 568115 567792 568708 570860 574072 578031 581773 584082
56348E84082P70N22J415J966J428O62P97J832K997L779M119M077L792L565L537
$$ 584082 584852 585374 586789 588755 590183 590845 591642 593474 596471 600250 604369 608446 612238 615803 619340
56333F19340L511L346L274L551L952M050L849L764M005M333M455M363M135L693
$$ 619340 622851 626197 629471 633022 636974 641024 644873 648637 652642 656975 661430 665793 669928 673621
56319F73621K978K214J781J795K001K089J939J617J208Q53P71J117J784K449K883
$$ 673621 676599 678813 680594 682389 684390 686479 688418 690035 691243 692096 692867 693984 695768 698217 701100
56304G01100L172L547M053M478M661M779N241O200P320Q124Q487Q657Q888R271
$$ 701100 704272 707819 711872 716350 721011 725790 731031 737231 744551 752675 761162 769819 778707 787978
56290G87978R904J0894J2093J3163J4010J4869J5863J6819J7764J9194K1461K4204
$$ 787978 797882 808776 820869 834032 848042 862911 878774 895593 913357 932551 954012 978216
56278I78216K6755K8892L0839L2866L5259L8409M2348M6555N0673N5076O0068
$$ 978216 1004971 1033863 1064702 1097568 1132827 1171236 1213584 1260139 1310812 1365888 1425956
56267A425956O5002O9164P3116P7927Q3115Q6733Q7756Q7145Q6123Q4639Q2176
$$ 1425956 1490958 1560122 1633238 1711165 1794280 1881013 1968769 2055914 2142037 2226676 2308852
56256B308852P8758P4222O7533N8151M7347L6940K7157J6946O036m565j4083k2771
$$ 2308852 2387610 2461832 2529365 2587516 2634863 2671803 2698960 2715906 2721942 2717377 2703294 2680523
56244B680523l0974l8301m4250m9052n3560n8416o3440o7662p0227p1388p2249
$$ 2680523 2649549 2611248 2566998 2517946 2464386 2405970 2342530 2274868 2204641 2133253 2061004
56233B061004p3234p3505p2328p0308o8430o6558o3939o0724n7730n4865n1215
$$ 2061004 1987770 1914265 1841937 1771629 1703199 1636641 1572702 1511978 1454248 1399383 1348168
56222A348168m6689m2404l9086l6267l3420l0828k8703k6455k3510k0275j7579
$$ 1348168 1301479 1259075 1219989 1183722 1150302 1119474 1090771 1064316 1040806 1020531 1002952
56211A002952j5595j3914j2236j0492q677o968n814n398n275m801l803k574j498
$$ 1002952 987357 973443 961207 950715 942038 935070 929256 923858 918583 913782 909979 907405 905907
56198I05907q56o97p04l83M64J601K697L506L830L818M224N743P917R372R458
$$ 905907 905051 904354 903650 903267 903731 905332 908029 911535 915365 919183 923407 929150 937067 946439 955897
56183I55897R079R468J0636J1589J1770J1690J2183J3340J4300J4121J2897J1862
$$ 955897 964976 974444 985080 996669 1008439 1020129 1032312 1045652 1059952 1074073 1086970 1098832
56171A098832J2120J3355J4341J4617J5058J6593J9064K1677K4065K6452K9129
$$ 1098832 1110952 1124307 1138648 1153265 1168323 1184916 1203980 1225657 1249722 1276174 1305303
56160A305303L2256L6005M0549M5938N2219N9579O8233P8312Q9770J02192J14577
$$ 1305303 1337559 1373564 1414113 1460051 1512270 1571849 1640082 1718394 1808164 1910356 2024933
56149B024933J25614J34076J38896J39033J33979J24395J11895R8176Q4732P3042
$$ 2024933 2150547 2284623 2423519 2562552 2696531 2820926 2932821 3030997 3115729 3188771
56139C188771O4022N6997M9986M1457L1359K0310Q603l429j4756k4254l1925l9091
$$ 3188771 3252793 3309790 3359776 3401233 3432592 3452902 3461505 3458076 3443320 3419066 3387141 3348050
56127C348050m7475n8276p1758q7072j02421j15662j25070j29813j29984j26252
$$ 3348050 3300575 3242299 3170541 3083469 2981048 2865386 2740316 2610503 2480519 2354267
56117B354267j19264j09402r7260q4006p0910n8706m7848l8963l2310k7025k1880
$$ 2354267 2235003 2125601 2028341 1944335 1873425 1814719 1766871 1727908 1695598 1668573 1646693
56106A646693j6840j2915j0459q639o853n687n760o569p111p078o798o491o095
$$ 1646693 1629853 1616938 1606479 1597840 1590987 1585300 1579540 1572971 1565860 1558782 1551984 1545493 1539398
56093A539398n475m334k359J56K289L475M021M447M892N491O683Q541J0367J1480
$$ 1539398 1533923 1529589 1527230 1527386 1529675 1533150 1537171 1541618 1546510 1552001 1558684 1567225 1577592 1589072
56079A589072J1999J2440J3007J3739J4845J6402J7962J9021J9534J9744J9888
$$ 1589072 1601071 1613511 1626518 1640257 1655102 1671504 1689466 1708487 1728021 1747765 1767653
56068A767653K0252K1034K1932K2452K2765K3618K5122K6436K7003K7337K8090
$$ 1767653 1787905 1808939 1830871 1853323 1876088 1899706 1924828 1951264 1978267 2005604 2033694
56057B033694K9092K9896L0548L1258L1903L2444L3270L4614L6113L7433L8662
$$ 2033694 2062786 2092682 2123230 2154488 2186391 2218835 2252105 2286719 2322832 2360265 2398927
56046B398927L9800M0596M1303M2728M4975M7058M8401M9768N1929N4274N5734
$$ 2398927 2438727 2479323 2520626 2563354 2608329 2655387 2703788 2753556 2805485 2859759 2915493
56035B915493N6364N7040N8187N9689O1551O3745O5796O7359O8842P0873P3495
$$ 2915493 2971857 3028897 3087084 3146773 3208324 3272069 3337865 3405224 3474066 3544939 3618434
56024C618434P6412P9476Q2510Q5252Q7957R1264R5067R8373J00858J03494J06996
$$ 3618434 3694846 3774322 3856832 3942084 4030041 4121305 4216372 4314745 4415603 4519097 4626093
56013D626093J10761J14205J18095J23451J30020J36824J43537J50426J57650
$$ 4626093 4736854 4851059 4969154 5092605 5222625 5359449 5502986 5653412 5811062
56004E811062J65361J73771J82488J90724J98719K07821K18575K29997K41474
$$ 5811062 5976423 6150194 6332682 6523406 6722125 6929946 7148521 7378518 7619992
55995G619992K53828K67673K82374K97612L14361L33022L52402L71840L92660
$$ 7619992 7873820 8141493 8423867 8721479 9035840 9368862 9721264 10093104 10485764
55986A0485764M16099M41637M68857M99088N33480N71255O11666O55680P03996
$$ 10485764 10901863 11343500 11812357 12311445 12844925 13416180 14027846 14683526 15387522
55977A5387522P55584Q10351Q71101R40586J018863J105856J204042J315889J441258
$$ 15387522 16143106 16953457 17824558 18765144 19784007 20889863 22093905 23409794 24851052
55968B4851052J580370J737007J915799K119071K349614K613707K918068L267242
$$ 24851052 26431422 28168429 30084228 32203299 34552913 37166620 40084688 43351930
55960D3351930L667790M131597M671400N297850O025993O879632P884021R059466
$$ 43351930 47019720 51151317 55822717 61120567 67146560 74026192 81910213 90969679
55952I0969679J0424579J1991612J3744596J5626646J7543060J9322977K0611279
$$ 90969679 101394258 113385870 127130466 142757112 160300172 179623149 200234428
55945B00234428K0809972J9244070J5530808R876549L045833l957598j0236586
$$ 200234428 221044400 240288470 255819278 265695827 268741660 264784062 254547476
55938B54547476j5184728j8519857k0249588k0598460j9902572j8510975j6731940
$$ 254547476 239362748 220842891 200593303 179994843 160092271 141581296 124849356
55931A24849356j4814022j2934549j1196525r645667q295405p140016o159248
$$ 124849356 110035334 97100785 85904260 76258593 67963188 60823172 54663924
55924E4663924n327668m624481m032794l534018l109592k746632k436854k171491
$$ 54663924 49336256 44711775 40678981 37144963 34035371 31288739 28851885 26680394
55916B6680394j941625j741915j569492j420124j289027j174075j074619r88036
$$ 26680394 24738769 22996854 21427362 20007238 18718211 17544136 16469517 15481481
55908A5481481r10553q40408p77175p19129o64291o13035n66811n25071m86098
$$ 15481481 14570928 13730520 12953345 12234216 11569925 10956890 10390079 9865008 9378910
55899I378910m49938m17763l89009l61877l36128l12942k92385k73339k55541
$$ 9378910 8928972 8511209 8122200 7760323 7424195 7111253 6818868 6545529 6289988
55890F289988k39549k25052k11180j98177j86822j76586j66255j56001j46990
$$ 6289988 6050439 5825387 5614207 5416030 5229208 5052622 4886367 4730366 4583376
55881D583376j39221j31656j24177j17542j11463j04622r6814q9641q4754q2588
$$ 4583376 4444155 4312499 4188322 4070780 3959317 3854695 3757881 3668240 3583486 3500898
55871C500898q2735q4458q6662q8293q8841q7990q5402q1499p7711p4862p2075
$$ 3500898 3418163 3333705 3247043 3158750 3069909 2981919 2896517 2815018 2737307 2662445 2590370
55860B590370o8318o4207o0920n8179n4830n0942m7605m4990m2172l8822l5630
$$ 2590370 2522052 2457845 2396925 2338746 2283916 2232974 2185369 2140379 2098207 2059385 2023755
55849B023755l2999l0592k8323k6645k5736k5219k4736k4107k3108k1914k1404
$$ 2023755 1990756 1960164 1931841 1905196 1879460 1854241 1829505 1805398 1782290 1760376 1738972
55838A738972k2137k3363k3924k3795k3764k4058k4298k4465k4786k4884k4147
$$ 1738972 1716835 1693472 1669548 1645753 1621989 1597931 1573633 1549168 1524382 1499498 1475351
55827A475351k2809k1656k0906k0229j9661j9487j9480j9201j8837j8803j8839
$$ 1475351 1452542 1430886 1409980 1389751 1370090 1350603 1331123 1311922 1293085 1274282 1255443
55816A255443j8416j7674j6953j5874j4042j2205j1401j1284j0710r781r752j0867
$$ 1255443 1237027 1219353 1202400 1186526 1172484 1160279 1148878 1137594 1126884 1117103 1107351 1096484
55804A096484j1862j1883j1548j1626j1874j1637j0739r341p725o452n968n878
$$ 1096484 1084622 1072739 1061191 1049565 1037691 1026054 1015315 1005974 998249 991797 985829 979951
55792I79951n415m676m518n183n925o150n983n574m824m047l876m300m641m796
$$ 979951 974536 969860 965342 960159 954234 948084 942101 936527 931703 927656 923780 919480 914839 910043
55778I10043n543p388r955j2804j5791j8341j9385j8745j7676j7397j7669j7430
$$ 910043 904500 897112 887157 874353 858562 840221 820836 802091 784415 767018 749349 731919
55766G31919j6269j4707j3403j2599j2052j1219r762q054o868o483o490o443o178
$$ 731919 715650 700943 687540 674941 662889 651670 641908 633854 626986 620503 614013 607570 601392
55753F01392n589m707m040m106m579m624m139l924m461n341o033o449o517o023
$$ 601392 595803 591096 587056 582950 578371 573747 569608 565684 561223 555882 549849 543400 536883 530860
55739E30860n166m547m271l804k986k436k615l219l779m145m035l086j770j341
$$ 530860 525694 521147 516876 513072 510086 507650 505035 501816 498037 493892 489857 486771 485001 483660
55725D83660k170k971k420r35L8pk94p0N78J211J678K085K534K963L219L341L681
$$ 483660 481490 478519 476099 475164 475202 475195 474901 474831 475409 476620 478298 480383 482917 485880 489099 492440 496121
55708D96121M444N185N272M839M620M799M794M327L893L774L408K355J120L40
$$ 496121 500565 505750 511022 515861 520481 525280 530074 534401 538294 542068 545476 547831 548951 549291
55694E49291j82r83j923k464k610k847l423m191m969n499n448m924m704n385o518
$$ 549291 549109 548126 546203 543739 541129 538282 534859 530668 525699 520200 514752 509828 505124 499739 493221
55679D93221p127o790n817m622l553k972k957l046k762k177j530o59O07J860K660
$$ 493221 486094 479304 473487 468865 465312 462340 459383 456337 453575 451398 449868 449209 449816 451676 454336
55664D54336L407M896P051Q839R598R643R517R164Q216O634M707K688O48j353
$$ 454336 457743 462639 469690 478529 488127 497770 507287 516451 524667 531301 536008 538696 539344 537991
55650E37991l148m486n235n531n609n417m709l576k599k159j987j648j174r06
$$ 537991 534843 530357 525122 519591 513982 508565 503856 500280 497681 495522 493535 491887 490713 489807
55636D89807j065j887l752o595r494j1446j2455j3179j3755j3677j2802j1779
$$ 489807 488742 486855 483103 476508 467014 455568 443113 429934 416179 402502 389700 377921
55624C77921j1210j1023j0786j0245r278p872o367n371n088n001m530l793l390
$$ 377921 366711 355688 344902 334657 325379 317507 311140 305769 300681 295680 291150 287357 283967
55611B83967l555l788l430k481j701j790k503k861k321j495j393k165k939k808
$$ 283967 280412 276624 273194 270713 269012 267222 264719 261858 259537 258042 256649 254484 251545 248737
55597B48737j722m22K68J07m04n81l87m35j029j549j265m00K10L39N60J238K036
$$ 248737 247015 246593 246861 246968 246564 245983 245596 245161 244132 242583 241318 240918 241128 241467 242027 243265 245301
55580B45301K559K896L202L287L011K765L086L993M987N550N458M778L827K972
$$ 245301 247860 250756 253958 257245 260256 263021 266107 270100 275087 280637 286095 290873 294700 297672
55566B97672K310J622P90K0n09r90j701k511k997l000k838k936l350l807m020
$$ 297672 299982 301604 302394 302414 301905 300915 299214 296703 293706 290706 287868 284932 281582 277775 273755
55551B73755l981l948m163m574m856m684m008l078k275j918k070k472k687k383
$$ 273755 269774 265826 261663 257089 252233 247549 243541 240463 238188 236270 234200 231728 229041 226658
55537B26658j598p03r8J69M68J168K158K927L167L078L019L073L142L295L745
$$ 226658 225060 224357 224259 224428 224896 226064 228222 231149 234316 237394 240413 243486 246628 249923 253668
55522B53668M528N534O707P986Q976R088Q120O566N170M180L162J590m83k462
$$ 253668 258196 263730 270437 278423 287399 296487 304607 311173 316343 320523 323685 325275 324792 322330
55508C22330m008n517p494r623j0950j1039j0420r701q848p747o898o839p212
$$ 322330 318322 312805 305311 295688 284738 273699 263279 253578 244730 236983 230085 223246 216034
55495B16034p170o557n951n583m987l902k807k280k338k674l068l279l020k330
$$ 216034 208864 202307 196356 190773 185786 181884 179077 176797 174459 171785 168717 165438 162418 160088
55481A60088j660j330j263j349j662k056k045j434p19m47n95q04r36r92r09p87
$$ 160088 158428 157098 155835 154486 152824 150768 148723 147289 146570 146123 145528 144724 143788 142796 141887 141100
55465A41100r79j472j620r61j9L43K0m57q94j519k155k118j154J40R80J079N37
$$ 141100 140121 138649 137029 136068 136049 136392 136412 135955 135061 133542 131387 129269 128115 128255 129235 130314 130851
55448A30851l63j080j013j59P76J139R59O10K49j35l52j07N93J308J481Q61k42
$$ 130851 130488 129408 128395 128236 129012 130151 131110 131720 131969 131834 131482 131375 131968 133276 134757 135618 135376
55431A35376j155j465j381j310j160n48L82Q76N19k41p15p88p75q21q16o84m41
$$ 135376 134221 132756 131375 130065 128905 128357 128739 129615 130134 129893 129178 128390 127615 126794 125978 125294 124853
55414A24853j49J2j29l95l43Q1L71K25L3J94L71oq21j467j721j807j749j343p21
$$ 124853 124704 124716 124587 124192 123849 123930 124301 124526 124559 124753 125124 125118 124297 122830 121109 119302 117553 116210 115489
55395A15489l03j51M3L14L72K40K43K23m20j617k297j734o36k69q22j335j078
$$ 115489 115186 115035 115078 115392 115764 116004 116247 116470 116050 114433 112136 110402 109766 109497 108675 107340 106262
55378A06262k90L95P88J052J194R86M04o7J20P83R76O9j378k248k199j793j391
$$ 106262 105972 106367 107155 108207 109401 110387 110791 110724 110844 111627 112603 112672 111294 109046 106847 105054 103663
55361A03663p78ML08j08m78p6O85R74Q50R79J331J223N62J14K64L79j83j040j356
$$ 103663 102885 102889 103197 103089 102611 102535 103220 104194 105044 106023 107354 108577 109139 109253 109517 109896 109713 108673 107317
55342A07317j031p16q18j000p99l06J0M9J78N53O90J31o61p16J38R50Q96K57k04
$$ 107317 106286 105570 104752 103752 102953 102647 102657 102706 102884 103437 104127 104258 103597 102881 103019 103969 104865 105122 104918
55323A04918k88l05l95m99o47p56m35M14J123J016L40j73l74o06q32p06l50k06
$$ 104918 104630 104325 103930 103431 102784 102028 101593 102007 103130 104146 104486 104313 103939 103333 102501 101795 101445 101239
55305A01239j64K04O82N94Nk80l0J44jO9M73M71k51q50n37L21R55J173R66P7j218
$$ 101239 101075 101279 101961 102555 102560 102280 102250 102394 102393 102462 102935 103406 103155 102305 101768 102089 103044 104217 105183 105260 104042
55284A04042j701o69Q05J084L1j032j101l49M12M03o63k015k194p83P52R16K06
$$ 104042 102341 101672 102477 103561 103592 102560 101459 101110 101522 101925 101262 99247 97053 96270 97022 97938 98144
55267I8144R3N36J25j404k508k046p26J76M02L57K14P1K21O05O10l0p77j117j174
$$ 98144 98237 98773 98898 97494 94986 92940 92214 92390 92792 93149 93363 93434 93655 94260 94870 94840 94063 92946 91772
55248I1772j039l70P28J253N59n61q81l26K83O01Q28Q08J57q19j274j027o89n40
$$ 91772 90733 90363 91091 92344 92903 92342 91461 91135 91418 92019 92847 93655 93812 92993 91719 90692 90003 89463
55230H9463j90M11N68n4p31o89k23p2k20p8L80N67L39K89O94R46M63l70p84p06
$$ 89463 89273 89684 90252 90198 89467 88778 88555 88483 88263 88185 88565 89132 89471 89760 90454 91400 91863 91493 90709 90003
55210I0003o32n98p8R76J751J585Q71M52M99M71J6n70q02n30j7K73P9l16k74L85
$$ 90003 89371 88773 88695 89671 91422 93007 93878 94330 94829 95300 95316 94746 93944 93414 93397 93670 93749 93433 93159 93544
55190I3544J028J036O33M57M66O4p89j322j086o10n95r15q86k34O12J022O91r4
$$ 93544 94572 95608 96241 96698 97164 97228 96439 95117 94031 93421 92826 91911 91025 90791 91403 92425 93116 93022
55172I3022n86k71L74K68q71j984j974j130o75j106j662j433m00P36J335J242
$$ 93022 92436 92165 92539 92807 91936 89952 87978 86848 86173 85067 83405 81972 81572 82308 83643 84885
55156H4885P42K66P0M7j8r3j4J92L08K33K6k94p72j296j572j366o40M78J605K145
$$ 84885 85627 85893 85963 86010 85992 85899 85885 86077 86385 86618 86644 86350 85578 84282 82710 81344 80704 81182 82787 84932
55136H4932J767R04M02O21J164J531J678J745J674J404J130R98P49J37n08o58
$$ 84932 86699 87603 88005 88626 89790 91321 92999 94744 96418 97822 98952 99950 100699 100836 100328 99670
55120I9670m38n00r53j034k83N92O22j5l09j4np60j391q43N09J283R15K03J2K77
$$ 99670 99232 98732 97779 96745 96462 97054 97676 97661 97352 97338 97333 96573 95182 94339 94848 96131 97046 97249 97261 97538
55100I7538N04N92O61N66J61k08n9M20M25m40j572k001j405l62L97P06Q55R63
$$ 97538 98042 98634 99295 99861 100022 99814 99755 100175 100600 100160 98588 96587 95182 94820 95217 95923 96778 97741
55082I7741P76K18k01M2O14N86l39j372j694j431j198j105q14l51o7P6N13J196
$$ 97741 98517 98735 98534 98576 99190 99776 99437 98065 96371 94940 93742 92637 91823 91472 91405 91481 91994 93190
55064I3190J393O84l77r57q89n58k18Q2J92N3L4N67J396J727J224L83j77l57l10
$$ 93190 94583 95267 94890 93933 93044 92486 92268 92350 92542 92595 92629 93196 94592 96319 97543 97926 97749 97392 97082
55045I7082PO37J328J783K009K070J802J117M19K10M24N51L56l7o16j423k019
$$ 97082 97089 97726 99054 100837 102846 104916 106718 107835 108254 108464 108888 109439 109795 109758 109142 107719 105700
55028A05700j669l75Q93J292R32L71j36m52k35N24J053O19m69j290j533j575j562
$$ 105700 104031 103656 104549 105841 106773 107144 107008 106556 106321 106845 107898 108517 108048 106758 105225 103650 102088
55011A02088j228o09j35J13M42P78N49l43j191j397j114o64OQ62J379J187O79
$$ 102088 100860 100251 100116 100229 100671 101449 101998 101655 100464 99067 97953 97289 97295 98157 99536 100723 101402
54994A01402M21L77K24N6J88N61R06J275J819K303K299J819J273R79J056J540
$$ 101402 101823 102200 102424 102480 102668 103229 104135 105410 107229 109532 111831 113650 114923 115902 116958 118498
54978A18498K171K330J810J329J763L053M415N426O169O613O681O845P675Q855
$$ 118498 120669 122999 124809 126138 127901 130954 135369 140795 146964 153577 160258 167103 174778 183633
54964A83633R500R609J0102J1141J1505J0172P646M958K211r99m282o719q159
$$ 183633 193133 202742 212844 223985 235490 245662 253308 258266 260477 259478 255196 248477 240318
54951B40318r282j0400j1032j0778r917q931p996p159o539o093n562m855m199
$$ 240318 231036 220636 209604 198826 188909 179978 171982 164823 158284 152191 146629 141774 137575
54938A37575l722l131k077o12Q52J954K599K887K989L071L216L324L206K878K886
$$ 137575 133853 130722 128645 128033 128885 130839 133438 136325 139314 142385 145601 148925 152131 155009 157895
54923A57895M023O427R030J0367J0023Q878P809O710N123L187J335n36k790n155
$$ 157895 161918 168345 177375 187742 197765 206643 214452 221162 226285 229472 230807 230271 227481 222326
54909B22326o885p813q457r054r239q849q291p790p031n899m957m672m643m207
$$ 222326 215441 207628 199171 190117 180878 172029 163738 155948 148917 143018 138061 133389 128746 124539
54895A24539l305k338j524r49q38j180j403j060n56n75r89j068n93q1Q2kk79q43
$$ 124539 121234 118896 117372 116423 115585 114405 113002 111942 111386 110811 109822 108754 108161 108080 108162 108160 107881 107038
54877A07038j446j550j105o58n22m65l86o59j395j999j910j340q41o53p69j181
$$ 107038 105592 104042 102937 102279 101757 101292 100906 100247 98852 96853 94943 93603 92762 92109 91340 90159
54861I0159j577j239P0J520K060J624R40M91K37J48K88L60n5q09j219r90n26k26
$$ 90159 88582 87343 87413 88933 90993 92617 93557 94048 94285 94433 94721 95081 95026 94217 92998 92008 91482 91256
54843I1256K2L90O23L39l57r28r11k61P12J606K187K442K421K158J811J683J896
$$ 91256 91278 91668 92291 92630 92273 91345 90434 90173 90885 92491 94678 97120 99541 101699 103510 105193 107089
54826A07089K185K249K154K105K033J773J507J627K177K844L484M255N178N964
$$ 107089 109274 111523 113677 115782 117815 119588 121095 122722 124899 127743 131227 135482 140660 146624
54812A46624O373O464O492O740P460Q578R553R806R258Q043N989K942m54l116
$$ 146624 152997 159461 165953 172693 180153 188731 198284 208090 217348 225391 231380 234322 233868 230752
54798B30752m740o011p381q402q644q463q308p825o466m615l295k855k643k067
$$ 230752 226012 220001 212620 204218 195574 187111 178803 170978 164512 159897 156602 153747 151104 149037
54784A49037j362j023r28m90N07J558K098K274K758L805M880N377N429N599O080
$$ 149037 147675 146652 145724 145234 145741 147299 149397 151671 154429 158234 163114 168491 173920 179519 185599
54769A85599O706P478Q422R078Q852P978P255O711N444L045L61j830l902o441
$$ 185599 192305 199783 208205 217283 226135 234113 241368 248079 253523 256568 256929 255099 251197 244756
54755B44756q867j0138j0344j0533j1058j1183j0425r364q773q557p968o575m713
$$ 244756 235889 225751 215407 204874 193816 182633 172208 162844 154071 145514 137546 130971 126258
54742A26258l214k707l083l587l586l128k616k212j861j568j280p63p4J77m01
$$ 126258 123044 120337 117254 113667 110081 106953 104337 102125 100264 98696 97416 96653 96579 96756 96355
54727I6355j195j258o77m35q80j192o15M09Q44L85k83l83R4M63J54n44p95l06
$$ 96355 95160 93902 93225 92790 91910 90718 90103 90512 91356 91741 91458 91075 91169 91632 91786 91242 90447 90141
54709I0141K47K34RK39P37Q27O57J037J921K179J246J0n03m58n00n65k64Q2j37
$$ 90141 90388 90622 90631 90870 91607 92434 93091 94128 96049 98228 99474 99484 98981 98523 98023 97458 97194 97276 97139
54690I7139o77o35K08J106J449J445J526J732J926K123K300K290K093K007K178
$$ 97139 96462 95827 96035 97141 98590 100035 101561 103293 105219 107342 109642 111932 114025 116032 118210
54675A18210K345K229J934J675J401R91O73Q73J593K346K723K850L107L661M403
$$ 118210 120555 122784 124718 126393 127794 128785 129458 130331 131924 134270 136993 139843 142950 146611 151014
54660A51014N201N919O276N952M930L623K501J694Q89l24k043l861n115n500n342
$$ 151014 156215 162134 168410 174362 179292 182915 185416 187110 187999 187675 185632 181771 176656 171156 165814
54645A65814n192n244n351n433n483n285m618l773l296l127k567j391l49j09l35
$$ 165814 160622 155378 150027 144594 139111 133826 129208 125435 122139 119012 116445 115054 114705 114596 114261
54630A14261l73l54p67j416j662j461j257r89k56N42L29j030k237k255j571j193
$$ 114261 113888 113534 112767 111351 109689 108228 106971 105982 105726 106268 106597 105567 103330 101075 99504 98311
54614I8311j098o19J80M76m5p33q67m51K7K04rn36j156j522j334n84L34Q42P03
$$ 98311 97213 96594 96774 97250 97205 96472 95605 95154 95181 95385 95376 94840 93684 92162 90828 90244 90578 91420 92123
54595I2123K73M8Pk65p60q84l14L81M64J7k53n1J98K4n26j086j356j211p23k37
$$ 92123 92396 92444 92451 92186 91426 90542 90228 90609 91073 91090 90837 90786 90984 91008 90482 89396 88040 86829 86106 85869
54575H5869j89n90q61m20N66J321J343R19O17N29M12L03M68P28N25q7j83P53J879
$$ 85869 85680 85090 84229 83809 84375 85696 87039 87958 88575 89104 89516 89819 90287 91015 91540 91453 91270 92023 93902
54556I3902K012J248O48O07N32J62J51R74K098K742K827K694K466K147J856J515
$$ 93902 95914 97162 97810 98417 98949 99111 99262 100236 102334 105076 107903 110597 113063 115210 117066 118581
54540A18581P77l08j078j165j110j499k039k139j991k194k664k756k383k149k310
$$ 118581 119358 119050 117972 116807 115697 114198 112159 110020 108029 105835 103171 100415 98032 95883 93573
54525I3573k352j872j147o02j98K70O64P50O61P55J024R77K14j011j897j843r78
$$ 93573 91221 89349 88202 87600 87402 87672 88336 89086 89747 90502 91526 92503 92717 91706 89809 87966 86988
54508H6988M3P24R45P66L08j40l13l61o52r93o65N03J591J667J002N20M11R9n11
$$ 86988 87031 87755 88700 89466 89774 89634 89321 88960 88308 87315 86650 87153 88744 90411 91413 91933 92344 92443 91932
54489I1932o77K0Q93R84K84l92m93j99R8K54K43j05p78j268j010k47K2p13j635
$$ 91932 91255 91275 92168 93152 93436 93044 92551 92352 92450 92704 92947 92842 92064 90796 89786 89539 89561 88848 87213
54470H7213j565m59N84P75L84j6k76l76j12M91R04P93M64L28K87J84K81P42J004
$$ 87213 85648 85189 85773 86548 86932 86916 86640 86264 86152 86643 87547 88340 88804 89132 89419 89603 89884 90626 91630
54451I1630M48n88j139q10j15L31L39o3p25j252j223o86q3K90M45M75M24L72K94
$$ 91630 92078 91490 90351 89541 89426 89757 90096 90033 89308 88056 86833 86147 86064 86354 86799 87274 87698 88070 88364
54432H8364L0l79n41k06M07J026J730K463K606J711L14n95p16m50q1L53O01M33
$$ 88364 88394 88015 87474 87268 87675 88701 90431 92894 95500 97211 97525 96930 96214 95764 95683 96036 96637 97070
54414I7070K40O41J539K244K443K377K138J567Q55M36L62M08P08J398J776Q69
$$ 97070 97310 97951 99490 101734 104177 106554 108692 110259 111114 111550 111912 112320 113028 114426 116202 117071
54398A17071j081k682l134k888k454j659n47R6j66o51o07k82l33p23r31p33k50
$$ 117071 115990 113308 110174 107286 104832 103173 102626 102722 102556 101905 101298 101016 100683 99960 99029 98296 98046
54381I8046L50O55M1j498k951l293k513j315k30N04P50O77P65J133J246Q04L54
$$ 98046 98396 99051 99092 97594 94643 91350 88837 87522 87292 87796 88546 89223 89988 91121 92367 93171 93525
54364I3525M74Q50Q35N07M35O74P75O15N34P02R37J052R63N73m4m96n32m66p07
$$ 93525 93999 94849 95684 96191 96626 97300 98075 98690 99224 99926 100863 101915 102878 103451 103407 102911 102379 101913 101206
54345A01206j108j259j185j222j401j454j320j166r67n56j1L57L67O1m67j040
$$ 101206 100098 98839 97654 96432 95031 93577 92257 91091 90124 89568 89557 89914 90281 90342 89875 88835
54329H8835j424j565j598j425q28j56k63j220j763q55P33J384P57j6j00J80K79
$$ 88835 87411 85846 84248 82823 81995 81839 81576 80356 78593 77738 78471 79855 80612 80596 80496 80676 80955
54312H0955J57j77q84j666j685o26P25J374J150M99k29q43j107r32o17m80m36
$$ 80955 81112 80935 80051 78385 76700 76074 76799 78173 79323 79822 79593 78750 77643 76711 76094 75614 75178
54295G5178j59M38J128J598J608J074K13n35q52p77m78l2N56J194J708J893J573
$$ 75178 75019 75457 76585 78183 79791 80865 81078 80543 79691 78914 78436 78404 78960 80154 81862 83755 85328
54278H5328P75q0m05j3O12P27K1j124j988k047j288j23R02J392J324J117J213
$$ 85328 86103 86023 85618 85605 86217 86944 86965 85841 83853 81806 80518 80395 81297 82689 84013 85130 86343
54261H6343J486J271L48m42j92O57O95n22j747j647l53J008J707J704J149L22
$$ 86343 87829 89100 89448 89006 88814 89471 90166 89644 87897 86250 85897 86905 88612 90316 91465 91787
54245I1787k70l85l76n46o11l45j92n04p45k66M90N52j53q89j363j803j983j300
$$ 91787 91517 91132 90756 90210 89599 89254 89062 88558 87813 87547 88037 88589 88436 87547 86184 84381 82398 81098
54227H1098L3R79J065Q21P08N40K43K12N08N42j9p33j054r10l60N32J272J190
$$ 81098 81131 82110 83175 83996 84704 85244 85487 85699 86207 86749 86730 85997 84943 84033 83673 84205 85477 86667
54209H6667M73J07M45O99L24p3K42R66J302J042M40l72j207j592j369j041r77
$$ 86667 87140 87247 87692 88391 88715 88642 88884 89850 91152 92194 92634 92262 91055 89463 88094 87053 86076
54192H6076q56l98m0k07n51n87n42p62r41o79m07p45j386j493r14k19K60N84O47
$$ 86076 85220 84822 84782 84575 84024 83437 82895 82133 81192 80513 80106 79361 77975 76482 75568 75349 75609 76193 76840
54173G6840L15j23l53o37j187j353m09J057J638Q97l08j219j823k083j678q35
$$ 76840 77155 77032 76679 76042 74855 73502 73093 74150 75788 76685 76377 75158 73335 71252 69574 68739
54157F8739l58m16k58N07J224J269R33O84L58k45o10k12N10O67J98r3K59P64O88
$$ 68739 68381 67965 67707 68214 69438 70707 71640 72324 72682 72437 71827 71615 72125 72792 72990 72897 73156 73920 74608
54138G4608q7r71j316j006m62q9J37M14O10M48M0j76q4L2Q6L44Q73J373J684J871
$$ 74608 74521 73550 72234 71228 70766 70677 70814 71228 71838 72286 72326 72150 72066 72098 72184 72528 73401 74774 76458 78329
54118G8329J692O67r64k064j900j077o49p94r48q37o26l58M6M28N70O97J135J646
$$ 78329 80021 80688 79724 77660 75760 74683 74034 73240 72292 71455 70829 70471 70517 70945 71515 72212 73347 74993
54100G4993J620R48J59k68k45K13R85J504J070k36j418j631j082n50m33n22m86
$$ 74993 76613 77561 77720 77452 77207 77420 78405 79909 80979 80743 79325 77694 76612 76062 75629 75107 74621
54083G4621k00L09R18J411J559J321Q95N31L08Q1k86o96q70o57j58M62J061J412
$$ 74621 74421 74730 75648 77059 78618 79939 80834 81365 81673 81754 81468 80772 79902 79245 79087 79549 80610 82022
54065H2022J318R85R50J390J839J915J903K136K178J338j32j099r45j74N16J088
$$ 82022 83340 84325 85275 86665 88504 90419 92322 94458 96636 97974 97842 96743 95798 95624 96140 97228
54049I7228J711K094J836J113N17M02O84J133J523J712J848K267K890L077K422
$$ 97228 98939 101033 102869 103982 104499 104901 105585 106718 108241 109953 111801 114068 116958 120035 122457
54034A22457J471J160J686K421K815K883K836K747K710K830K947K701K121J724
$$ 122457 123928 125088 126774 129195 132010 134893 137729 140476 143186 146016 148963 151664 153785 155509
54020A55509J823J996J582N54m03o91m40k83o07j186j538j593j728k136k504k501
$$ 155509 157332 159328 160910 161464 161061 160370 159930 159647 159040 157854 156316 154723 152995 150859 148355 145854
54004A45854k348k512k951l110k687k023j613j569j703j824j804j578j250j016
$$ 145854 143506 140994 138043 134933 132246 130223 128610 127041 125338 123514 121710 120132 118882 117866
53990A17866r22q80r38j232j620j734j516j307j265j082n52LK06J48P6q4m16n58
$$ 117866 116944 116064 115126 113894 112274 110540 109024 107717 106452 105370 104818 104821 105027 105175 105251 105167 104751 104193
53972A04193j53M47N27K8l73k52R9K80L07L22K39L5K8M72J118J497J507J470J703
$$ 104193 104040 104487 105014 105042 104669 104417 104516 104796 105103 105425 105664 105699 105727 106199 107317 108814 110321 111791 113494
53953A13494K222K815L146K963K376J945K206L091L940M189L931L698L758L876
$$ 113494 115716 118531 121677 124640 127016 128961 131167 134258 138198 142387 146318 150016 153774 157650
53939A57650L789L716M061M695M889M113K658J246L23p3n9J52J90p7k95p8L22
$$ 157650 161439 165155 169216 173911 178800 182913 185571 186817 187140 187067 187008 187160 187350 187273 186978 186900 187222
53922A87222L48Po3M60J131J386J277J248J559K139K785L245L372L348L560M083
$$ 187222 187570 187577 187514 187974 189105 190491 191768 193016 194575 196714 199499 202744 206116 209464 213024 217107
53906B17107M543M620M317L626K276K28j819k914k772j985j395j423j923k450
$$ 217107 221650 226270 230587 234213 236489 236717 234898 231984 229212 227227 225832 224409 222486 220036
53892B20036k712k854l224l828m258m245l991l843l886m045m245m219l558k296
$$ 220036 217324 214470 211246 207418 203160 198915 194924 191081 187195 183150 178905 174686 171128 168832
53878A68832j177r28j448k076k456k709k925k994k900k767k573k198j807j779
$$ 168832 167655 166727 165279 163203 160747 158038 155113 152119 149219 146452 143879 141681 139874 138095
53864A38095k201k753l142l372l441l127k291j235n22m24o71q03p25p71j126j450
$$ 138095 135894 133141 129999 126627 123186 120059 117768 116533 116011 115587 114916 114113 113388 112617 111491 110041
53848A10041j322r53r42j344j562j339j140j230j037j68O45M29m89q74l59K10
$$ 110041 108719 107766 106824 105480 103918 102579 101439 100209 99172 99004 99649 100078 99589 98715 98356 98566
53832I8566L08M95J282K104K123J455R07Q57R31O90J07m99p51m15L58J143J603
$$ 98566 98874 99369 100651 102755 104878 106333 107240 108097 109028 109718 109825 109326 108575 108160 108518 109661 111264
53815A11264J648J239M14l65l97M19J323J586J364J298J598K032K494L042L419
$$ 111264 112912 114151 114565 114200 113803 114222 115545 117131 118495 119793 121391 123423 125917 128959 132378
53800A32378L229K641K390K832L405L368K716K033J622J273Q72P35J047J351R75
$$ 132378 135607 138248 140638 143470 146875 150243 152959 154992 156614 157887 158759 159494 160541 161892 162867
53785A62867k9q74j006p72q38j310j725j758j539j355j373j657k161k665k934
$$ 162867 162838 161964 160958 160186 159348 158038 156313 154555 153016 151661 150288 148631 146470 143805 140871
53770A40871k985k962k884k729k658k737k649k050j199p03o00l25L05O60J81p83
$$ 140871 137886 134924 132040 129311 126653 123916 121267 119217 118018 117315 116715 116390 116695 117355 117536 116753
53754A16753j467j652j708j911k140k135j756j109n73n48r31j072m81N17J114
$$ 116753 115286 113634 111926 110015 107875 105740 103984 102875 102302 101754 100823 99751 99270 99787 100901
53739A00901Q78J22n32p73q15j005j207q39J97R27L25j088j605n90N55L18q15
$$ 100901 101779 101901 101369 100596 99781 98776 97569 96730 96927 97854 98179 97091 95486 94896 95451 95769 94954
53722I4954j119q0J031J005J39m69l79o6n8k28l4O93J322J059l2j015j211q90
$$ 94954 93835 93755 94786 95791 95930 95461 95082 95016 94958 94730 94696 95389 96711 97770 97738 96723 95512 94622
53704I4622n15Q6J209K366K678K018J079M12mk44j51L51J129K009K713K779K117
$$ 94622 94107 94193 95402 97768 100446 102464 103543 103955 103951 103707 103556 103907 105036 107045 109758 112537 114654
53687A14654J407J311J476J095K80r6R2K8n10n66M99J886K439K079J442Q01J70
$$ 114654 116061 117372 118848 119943 120223 120127 120219 120247 119737 119171 119670 121556 123995 126074 127516 128317 128487
53670A28487j15J63M73J78m62o61k27M06J013J619J879J328K95k92j82j03n33
$$ 128487 128372 128535 129008 129186 128724 128063 127836 128242 129255 130874 132753 134081 134376 134084 133902 133799 133266
53653A33266r00m66N53J239J068L82q3J26Q32J334J032P8p36q15k71M11Q55Q60
$$ 133266 132366 131900 132453 133692 134760 135142 135059 135185 136017 137351 138383 138461 137725 136910 136639 137050 137905 138765
53635A38765L66l15o10k64L12N87O43R26J437J564Q90j63p75o49k49j64m28n98
$$ 138765 139131 138816 138206 137942 138254 138841 139484 140410 141847 143411 144301 144138 143363 142714 142465 142301 141873 141275
53617A41275l33K43P66J020J060J036J058J138J141Q86M74M19J157K371L039K462
$$ 141275 140942 141185 141951 142971 144031 145067 146125 147263 148404 149290 149764 150183 151340 153711 156750 159212
53601A59212J073j5j73K96Q08J256J814K381K601K411K143J957J598R63N43Q65
$$ 159212 160285 160270 160097 160393 161201 162457 164271 166652 169253 171664 173807 175764 177362 178325 178868 179733
53585A79733J669K146J935J422R99N73L5k55N5O96J083J123J228J548J688J324
$$ 179733 181402 183548 185483 186905 187904 188477 188512 188257 188312 189008 190091 191214 192442 193990 195678 197002
53569A97002P25M22N33O95N36R9k66k62Q4M91P10O67L94j5k99j56L68P41M81k18
$$ 197002 197727 198149 198682 199377 199913 200012 199746 199484 199568 200059 200769 201436 201830 201815 201516 201360 201728 202469 202950 202732
53549B02732p05o58l15K3L76P63R32P02L12J00l2m21r66j073m32N06J056J096
$$ 202732 202027 201369 201054 201077 201453 202216 203148 203850 204162 204262 204230 203809 202843 201770 201338 201844 202900 203996
53531B03996J044J212J461J567J533J484J411J274J185J316J659K015K192K175
$$ 203996 205040 206252 207713 209280 210813 212297 213708 214982 216167 217483 219142 221157 223349 225524
53517B25524K152K445L214M155M653M551M476N055N897N960M988L996M066N068
$$ 225524 227676 230121 233335 237490 242143 246694 251170 256225 262122 268082 273070 277066 281132 286200
53503B86200O028O378O358O371O496O705P089P692Q311Q691Q819Q943R331R961
$$ 286200 292228 298606 304964 311335 317831 324536 331625 339317 347628 356319 365138 374081 383412 393373
53489C93373J0491J0609J0478J0651J1353J2214J2761J2995J3066J2762J1843
$$ 393373 403864 414473 424951 435602 446955 459169 471930 484925 497991 510753 522596
53478E22596J0772J0486J1358J2744J3730J3886J3278J2236J1372J1243J1701
$$ 522596 533368 543854 555212 567956 581686 595572 608850 621086 632458 643701 655402
53467F55402J1851J1140J0152R868J0343J0643J0121R161Q503Q267Q001P474O970
$$ 655402 667253 678393 688545 698413 708756 719399 729520 738681 747184 755451 763452 770926 777896
53454G77896O752O666O429O110N953N783N026L403J303p69k704m455n578n669
$$ 777896 784648 791314 797743 803853 809806 815589 820615 824018 825321 824552 821848 817393 811815 806146
53440H06146n150m937n263n485n229n109n840p153q122q370q335q486q744q761
$$ 806146 800996 796059 790796 785311 780082 774973 769133 761980 753858 745488 737153 728667 719923 711162
53426G11162q444q075q058q520r068r025q121o781n573m564l492k427j781j650
$$ 711162 702718 694643 686585 678065 668997 659972 651851 645070 639497 634933 631441 629014 627233 625583
53412F25583j542r60K5Q91J250J213J281J921L101M250M777M666M497M813N657
$$ 625583 624041 623081 623106 623997 625247 626460 627741 629662 632763 637013 641790 646456 650953 655766 661423
53397F61423O663P499Q120Q728R497J0366J1162J1872J2631J3358J3766J3869
$$ 661423 668086 675585 683705 692433 701930 712296 723458 735330 747961 761319 775085 788954
53385G88954J4212J5226J6581J7600J8175J8781J9634K0431K1018K1714K2719
$$ 788954 803166 818392 834973 852573 870748 889529 909163 929594 950612 972326 995045
53374I95045K3701K4311K4697K5060K5119K4539K3720K3519K4174K4920K4847
$$ 995045 1018746 1043057 1067754 1092814 1117933 1142472 1166192 1189711 1213885 1238805 1263652
53363A263652K3792K2297K0999K0207J9847J9525J8745J7248J5234J3226J1740
$$ 1263652 1287444 1309741 1330740 1350947 1370794 1390319 1409064 1426312 1441546 1454772 1466512
53352A466512J0909J0275R035O728L774J022j284l809p171j0900j3733j4998j5381
$$ 1466512 1477421 1487696 1496731 1503459 1507233 1508255 1506971 1503162 1495991 1485091 1471358 1456360 1440979
53339A440979j6197j8059k0373k2047k2477k1958k1318k1196k1585k1974k1936
$$ 1440979 1424782 1406723 1386350 1364303 1341826 1319868 1298550 1277354 1255769 1233795 1211859
53328A211859k1513k1018k0604k0204j9850j9769k0107k0678k1136k1242k0901
$$ 1211859 1190346 1169328 1148724 1128520 1108670 1088901 1068794 1048116 1026980 1005738 984837
53317I84837k0127j9112j8149j7294j6161j4388j2286j0698j0098j0025r598q469
$$ 984837 964710 945598 927449 910155 893994 879606 867320 856622 846524 836499 826901 818432
53305H18432p173o599p173q422r280r020p995p345p714q437q243o763m991m153
$$ 818432 811259 804660 797487 789065 779785 770765 762770 755425 747711 739274 731031 724268 719277 715124
53291G15124m392m781m461l416k231j367q50l62M70J722K980L628L498L171L389
$$ 715124 710732 705951 701490 698074 695843 694476 693626 693264 693734 695456 698436 702064 705562 708733 712122
53276G12122M228N102N529N703O197P277Q624R610R821R428R004Q897Q859Q464
$$ 712122 716350 721452 726981 732684 738881 746158 754782 764392 774213 783641 792645 801542 810401 818865
53262H18865P758P143O714O222N715N598N815N571M344K685J436N91m02j598k607
$$ 818865 826623 833766 840480 846702 852417 858015 863830 869401 873745 876430 877866 878457 878055 876457 873850
53247H73850l560n019o903q390r165r948j1280j2555j2914j2567j2503j3149j4010
$$ 873850 870290 865271 858368 849978 840813 830865 819585 807030 794116 781549 769046 755897 741887
53234G41887j4521j4596j4326j3663j2635j1537j0711j0295j0157j0040r762r459
$$ 741887 727366 712770 698444 684781 672146 660609 649898 639603 629446 619406 609644 600185
53222F00185r540j0218j1175j1837j1956j1758j1573j1470j1187j0384r036p665
$$ 600185 590645 580427 569252 557415 545459 533701 522128 510658 499471 489087 480051 472386
53210D72386o940o921o985o598n866n120m407l804l802m781o215p115p226p248
$$ 472386 465446 458525 451540 444942 439076 433956 429549 425745 421943 417162 410947 403832 396606 389358
53196C89358p711q341q671q822r121r368r038q181p569p737q123p605n885m026
$$ 389358 381647 373306 364635 355813 346692 337324 328286 320105 312536 304799 296676 289071 283186 279160
53182B79160l308l800m534m936n376o150o707o537o094o068o116n379m090l478
$$ 279160 275852 272052 267518 262582 257206 251056 244349 237812 231718 225650 219534 214155 210065 206587
53168B06587l968m532m232l471l082l048k888k652k658k635k083j309j157j705
$$ 206587 202619 198087 193855 190384 187302 184254 181366 178714 176056 173421 171338 170029 168872 167167
53154A67167j996j346k22L98J52n80j260j611j648j570j547j549j445j283j300
$$ 167167 165171 163825 163603 164001 164153 163573 162313 160702 159054 157484 155937 154388 152943 151660 150360
53139A50360j555j732j462p61q7Q4k89p53q35n57l39l58k90J69P86J093R91O99
$$ 150360 148805 147073 145611 144850 144763 144847 144558 143805 142970 142413 142074 141716 141426 141595 142381 143474 144465 145164
53121A45164L00k53p66q94o54m19l57k77j14j48n17r08j007r27q90p76m51k38
$$ 145164 145464 145211 144445 143551 142897 142478 142121 141844 141730 141582 141065 140157 139150 138223 137333 136557 136106 135868
53103A35868n62j225j471r29l7N26N53K79n2k87k88m1J63K6l18m03j2N34Q00O74
$$ 135868 135306 134081 132610 131681 131644 132170 132723 133002 132950 132663 132375 132334 132497 132523 132205 131802 131790 132324 133124 133798
53083A33798K68l21q41p71J82J466K098J778J189R73R00M59j79l68m7J46j80o43
$$ 133798 134066 133745 132904 132133 132315 133781 135879 137657 138846 139819 140719 141178 140999 140631 140584 140730 140550 139907
53065A39907p47n64m62m83m48l76m28n08l29Q2K97J0n66r73j025q97p68n95k33
$$ 139907 139160 138596 138134 137651 137203 136827 136399 135891 135562 135644 135941 135951 135385 134412 133387 132490 131722 131127 130894
53046A30894K46N64N45L42K02J09j56n34n75J7R10J459J461J304J274J061K14
$$ 130894 131140 131704 132249 132591 132793 132902 132746 132212 131637 131654 132564 134023 135484 136788 138062 139123 139337
53029A39337j084j995j888r81m0M85P84J236J821K151J953J365P16J59l19o40
$$ 139337 138253 136258 134370 133389 133349 133834 134618 135854 137675 139826 141779 143144 143860 144019 143700 143060
53013A43060n38J21J012J579J580J261R16N45Q2k09m8L45M39J75P2L89O62M36
$$ 143060 142522 142643 143655 145234 146814 148075 148991 149536 149618 149409 149361 149706 150145 150320 150392 150781 151443 151879
52995A51879M9J61P39J138J075R48J146J478J517J189P93O95J029J543J665J031
$$ 151879 151928 152089 152828 153966 155041 155989 157135 158613 160130 161319 162112 162807 163836 165379 167044 168075
52979A68075J8n62l29M00J118J565J595J235R55J339K177K460J637M78J10O61
$$ 168075 168093 167531 167202 167602 168720 170285 171880 173115 174070 175409 177586 180046 181683 182161 182271 182932
52963A82932J389J782J869J682J160N98M37N72M49l7l84l72m71r82j368r41J10
$$ 182932 184321 186103 187972 189654 190814 191412 191849 192421 192870 192833 192449 192077 191606 190624 189256 188315 188425
52946A88425R29J007N70M5l69n46k76M89J402J938J848J312O87K32J00M02J072
$$ 188425 189354 190361 190931 190976 190607 190061 189785 190274 191676 193614 195462 196774 197461 197693 197793 198195 199267
52929A99267J671J664J013K87QJ03K26L20M82M77m8q48j144n96J35J29p19j636
$$ 199267 200938 202602 203615 203902 203910 204013 204239 204559 205041 205518 205470 204622 203478 202882 203017 203146 202427 200791
52911B00791j857j417j060j409k225k556j795m60L86K56m95j335j955k059j499
$$ 200791 198934 197517 196457 195048 192823 190267 188472 188012 188398 188654 188159 186824 184869 182810 181311
52896A81311p63p12j484k202k128j554j116p94j83O14J034Q42L20k02n23m29P6
$$ 181311 180548 179836 178352 176150 174022 172468 171352 170558 170375 170989 172023 172865 173185 172983 172460 172031 172107
52879A72107N17M06l7j42L05Q89J275J557J799J737J127Q6j022j852k234k274
$$ 172107 172624 173030 172993 172851 173156 174045 175320 176877 178676 180413 181540 181626 180604 178752 176518 174244
52863A74244k305k458k438k001j430j161j124r62p40q01j050j107j091j508k179
$$ 174244 171939 169481 167043 165042 163612 162451 161327 160365 159625 158824 157774 156667 155576 154068 151889
52848A51889k174j196k24k55j016j503j395j210j416j915k321k287j642n98K62
$$ 151889 149715 148519 148295 148040 147024 145521 144126 142916 141500 139585 137264 134977 133335 132737 132999
52833A32999N37M05K53J21k27q72j669k403k796k570j769q69k81L7L05N30O58
$$ 132999 133536 133941 134194 134315 134088 133216 131547 129144 126348 123778 122009 121140 120859 120896 121201 121731 122389
52816A22389Q15J123J534K023K647L150K991K104J259J153J570J836J777J630
$$ 122389 123204 124327 125861 127884 130531 133681 136672 138776 140035 141188 142758 144594 146371 148001
52802A48001J379Q30J34m07p93j091r76j98P42J082P87L73n0o97j273j201p04
$$ 148001 149380 150210 150344 149937 149144 148053 147077 146879 147621 148703 149490 149863 149813 149116 147843 146642 145938
52785A45938o19r87q52J39R51N71n81j341j272q11l97j35n2r3OM30R83J345J403
$$ 145938 145319 144332 143480 143619 144570 145141 144560 143219 141947 141136 140739 140604 140552 140459 140465 140895 141878 143223 144626
52766A44626J172O92J65j49l81r14j621j784j143m26l76p46p98l79J17M83P85
$$ 144626 145798 146490 146655 146506 146125 145211 143590 141806 140663 140237 139861 139115 138317 137938 138055 138538 139323
52749A39323R60Q51N16J05l11n01r4O94R03M3j036j256q15o21o11J33J635K671
$$ 139323 140283 141134 141650 141755 141444 140943 140849 141543 142446 142489 141453 140197 139382 138761 138150 138283 139918 142589
52731A42589K520J947J900K098J720Q58M27R34J956K754K880K320J462R11R58
$$ 142589 145109 147056 148956 151054 152774 153632 154059 154993 156949 159703 162583 164903 166365 167276 168234
52716A68234J282J396J291J300J474J451J026M74J32n6l29n80m10K00O73N04q0
$$ 168234 169516 170912 172203 173503 174977 176428 177454 177928 178060 178004 177675 177095 176685 176885 177558 178062 177982
52699A77982m05k07K46O99J106J262Q88K41M9M65P24L25j04K44J047J363J039
$$ 177982 177577 177370 177616 178315 179421 180683 181571 181812 181861 182326 183050 183375 183271 183515 184562 185925 186964
52682A86964P01M97k3q10j137q23o49j119j622j421q18o84j301k195k828k911
$$ 186964 187665 188162 188139 187329 186192 185369 184720 183601 181979 180558 179740 179056 177755 175560 172732 169821
52666A69821k407j651j202j168r82k65M80N41P2j37K47P91J046J015Q68O42L73
$$ 169821 167414 165763 164561 163393 162411 162146 162626 163167 163239 163102 163349 164140 165186 166201 167069 167711 168084
52649A68084J69ql77j030j746k113j798q09L07O82r0j394k071j558l63N44O40
$$ 168084 168253 168245 167868 166838 165092 162979 161181 160372 160679 161361 161271 159877 157806 156248 155885 156429 157069
52632A57069J07n87j157j565j825j813j427p72j44K20K62N6j89k01O5K24j25p95
$$ 157069 157176 156589 155432 153867 152042 150229 148802 148030 147886 148106 148368 148424 148235 148034 148099 148323 148198 147403
52614A47403j153r48m87j4O35J412J732J157J07n84n41O2R60J799K041J467O91
$$ 147403 146250 145302 144815 144801 145436 146848 148580 149737 149844 149260 148719 148781 149741 151540 153581 155048 155739
52597A55739N71J087J354Q10j18o26m41K7J45m19j321j705j099j32L4q50j797
$$ 155739 156310 157397 158751 159561 159443 158817 158376 158403 158548 158129 156808 155103 154004 153872 153906 153056 151259
52580A51259j852j223q59j159j637j654j151o03n34j042j682j824j258m23Q6J50
$$ 151259 149407 148184 147325 146166 144529 142875 141724 141121 140587 139545 137863 136039 134781 134358 134444 134594
52564A34594J42L56O57P18M29l0m41o43m75O4N58L97m27j015n71L98N31n91j753
$$ 134594 134736 135092 135749 136467 136896 136866 136425 135782 135307 135371 135929 136326 135899 134884 134313 134711 135242 134651 132898
52545A32898j639n05L42K95j25l94o59j089j398j380j288j225p27M64J569J489
$$ 132898 131259 130754 131096 131391 131266 130872 130213 129124 127726 126346 125058 123833 123106 123570 125139 126628
52529A26628K64q88j050n36j40j6K01N69O64K29m78j023j178q93l37J2l45j245
$$ 126628 126892 126004 124954 124418 124278 124262 124463 125032 125696 125925 125447 124424 123246 122353 122016 122028 121683 120438
52511A20438j795j355k71O47J087J167P50l21j442j602p74q4k53n61r4P88R86
$$ 120438 118643 117288 117017 117664 118751 119918 120668 120347 118905 117303 116529 116445 116192 115631 115537 116325 117311
52494A17311L20l58m86l52k81j50Q8Q4l21p16o74l13l3K0q7l15n81o44l43J47
$$ 117311 117631 117273 116787 116435 116154 116004 116092 116176 115855 115139 114465 114152 114119 114139 114052 113737 113156 112512 112169 112316
52474A12316N27P04P52O58L08k95q90j085p30j70mm01q33o41J71R65J272J265
$$ 112316 112843 113547 114299 114957 115265 114970 114080 112995 112265 112095 112091 111690 110857 110216 110387 111352 112624 113889
52456A13889J400J771J873J078n56k002k151j076K3L23K33L89M86l4p31o57R2
$$ 113889 115289 117060 118933 120011 119455 117453 115302 114226 114249 114572 114805 115194 115680 115646 114915 114258 114350
52439A14350M48L8l43j22K40K90M11R87J543J477R71N40J81l06o33m52q7j40n14
$$ 114350 114798 114836 114493 114371 114611 114901 115312 116299 117842 119319 120290 120830 121011 120705 120072 119620 119533 119393 118879
52420A18879n71j32L23L83J87J04L24P26R35O83K63K88P42Q12R6n79j92R66J681
$$ 118879 118308 118176 118499 118882 119069 119173 119497 120223 121158 121841 122104 122392 123134 123946 124042 123463 123271 124237 125918
52401A25918J439Q69O06N26K35l32j025j694k065j854j146l51K98Q77J386J624
$$ 125918 127357 128226 128832 129358 129593 129261 128236 126542 124477 122623 121477 121126 121424 122301 123687 125311
52385A25311J449R34K91j20R6Q51J365J007J75k06N3L64M73P77J411J796J494
$$ 125311 126760 127694 127985 127865 127961 128812 130177 131184 131359 131153 131206 131570 132043 132820 134231 136027 137521
52368A37521Q63M81M31N39Q02J202J408J141N86J40l0P8M60R23J061P30L68N11
$$ 137521 138384 138865 139296 139835 140637 141839 143247 144388 144974 145114 145084 145162 145622 146545 147606 148336 148704 149215
52350A49215J223K135K822K950K423J649J354J766K263K146J523J016R17R88J005
$$ 149215 150438 152573 155395 158345 160768 162417 163771 165537 167800 169946 171469 172485 173402 174390 175395
52335A75395J007J070J174J275J283R82L12l26l17N57J870K967L442L322K958
$$ 175395 176402 177472 178646 179921 181204 182186 182498 182172 181855 182412 184282 187249 190691 194013 196971
52320A96971K735K759K832K799K774K991L514M181M664M630M097L739M375N892
$$ 196971 199706 202465 205297 208096 210870 213861 217375 221556 226220 230850 234947 238686 243061 248953
52306B48953P080O917N762M772M453M377M213M305M975N832O205N984N705N924
$$ 248953 256033 262950 268712 273484 277937 282314 286527 290832 295807 301639 307844 313828 319533 325457
52292C25457O720P752Q522Q716Q467Q274Q488Q921R029Q537P741P169P074P314
$$ 325457 332177 339929 348451 357167 365634 373908 382396 391317 400346 408883 416624 423793 430867 438181
52278D38181P655P988Q272Q421Q347Q125P928P868P910P929P767P292O587O053
$$ 438181 445836 453824 462096 470517 478864 486989 494917 502785 510695 518624 526391 533683 540270 546323
52264E46323O084O616P152P263O967O557O215N862N282M385L423K834K749K735
$$ 546323 552407 559023 566175 573438 580405 586962 593177 599039 604321 608706 612129 614963 617712 620447
52250F20447K365J867J885K515L071K959K341J775J525J546J748K021K293K780
$$ 620447 622812 624679 626564 629079 632150 635109 637450 639225 640750 642296 644044 646065 648358 651138
52236F51138L836N233O033N705M971M998N962P046P669Q008Q240Q100P463O820
$$ 651138 654974 660207 666240 671945 676916 681914 687876 694922 702591 710599 718839 726939 734402 741222
52222G41222O791P369Q006Q249Q073P728P478P390P269O855O124N314M641M100
$$ 741222 748013 755382 763388 771637 779710 787438 794916 802306 809575 816430 822554 827868 832509 836609
52208H36609L555K871K027J111J79r41k501m287n594o024o051o312o587o177n166
$$ 836609 840164 843035 845062 846173 846352 845411 842910 838623 833029 827005 820954 814642 808055 801878 796712
52193G96712m578n093o222p010p053o519n707m976m735n005n288n108m579m088
$$ 796712 792134 787041 780819 773809 766756 760237 754530 749554 744819 739814 734526 729418 724839 720751
52179G20751l759l541l521l764m023l985l680l333l028k800k863l249l412k731
$$ 720751 716992 713451 709930 706166 702143 698158 694478 691145 688117 685317 682454 679205 675793 673062
52165F73062j533r97j849l433m431m289l625l277l309l161k595k031j894k015
$$ 673062 671529 670532 668683 665250 660819 656530 652905 649628 646319 643158 640563 638532 636638 634623
52151F34623k028k017k223k351j876j066q63j523k115j846j224j236j970k711
$$ 634623 632595 630578 628355 626004 624128 623062 622199 620676 618561 616715 615491 614255 612285 609574
52137F09574l055l114k947k525k167k233k539k718l005l805m624m460l330k445
$$ 609574 606519 603405 600458 597933 595766 593533 590994 588276 585271 581466 576842 572382 569052 566607
52123E66607k503k797k421j559q96n03p5K65J37l78p76o92LJ295K657L117K284
$$ 566607 564104 561307 558886 557327 556431 555928 555853 556118 556255 555877 555101 554409 554412 555707 558364 561481 563765
52106E63765J142J015J997L115L879M767O110P342P718P228O494O192O765Q185
$$ 563765 564907 565922 567919 571034 574913 579680 585790 593132 600850 608078 614572 620764 627529 635714
$$ [...]
##END NTUPLES=NMR SPECTRUM
##END=
