##TITLE=NES1033_872015079_9243059_InYdxdyMnh
##JCAMPDX= 6.0         $$ Bruker NMR JCAMP-DX V2.0
##DATA TYPE= NMR SPECTRUM
##DATA CLASS= NTUPLES
##ORIGIN= BRUKER
##OWNER= Administrator
$$ 1.72 TOPSPIN		Version 2.1
$$ 2015-07-02 14:58:20.492 -0700  Administrator@X
$$ Compression mode = diff/dup
##.OBSERVE FREQUENCY= 400.02188249412
##.OBSERVE NUCLEUS= ^1H
##.ACQUISITION MODE= SIMULTANEOUS (DQD)
##.ACQUISITION SCHEME= undefined
##.AVERAGES= 8
##.DIGITISER RES= 22
##SPECTROMETER/DATA SYSTEM= spect
##.PULSE SEQUENCE= zg30
##.SOLVENT NAME= COFFEE_meoh
##.SHIFT REFERENCE= INTERNAL, COFFEE_meoh, 1, 14.98509
##AUDIT TRAIL= $$ (NUMBER, WHEN, WHO, WHERE, PROCESS, VERSION, WHAT)
$$ ##TITLE= Audit trail, TOPSPIN		Version 2.1
$$ ##JCAMPDX= 5.01
$$ ##ORIGIN= Bruker BioSpin GmbH
$$ ##OWNER= Administrator
$$ $$ E:\/data/COFFEE/nmr/NES1033_872015079_9243059_InYdxdyMnh/20/pdata/1/auditp.txt
$$ ##AUDIT TRAIL=  $$ (NUMBER, WHEN, WHO, WHERE, PROCESS, VERSION, WHAT)
(   1,<2015-07-02 14:58:13.305 -0700>,<Administrator>,<X>,<go>,<TOPSPIN 2.1>,
      <created by zg
	started at 2015-07-02 14:57:07.383 -0700,
	POWCHK enabled, PULCHK disabled,
       configuration hash MD5:
       21 0F 79 D6 B3 7B B4 F6 88 20 88 DB 03 48 BD 9F
       data hash MD5: 64K
       63 18 C7 48 D9 A2 73 24 F1 6B 1B 13 12 A8 DF F8>)
(   2,<2015-07-02 14:58:16.399 -0700>,<Administrator>,<X>,<proc1d>,<TOPSPIN 2.1>,
      <Start of raw data processing
       efp LB = 0 FT_mod = 6 PKNL = 1 PHC0 = 0 PHC1 = 0 SI = 32K 
       data hash MD5: 32K
       0C 11 39 22 37 83 78 FF 56 C8 CA 72 FB D5 18 D8>)
(   3,<2015-07-02 14:58:16.711 -0700>,<Administrator>,<X>,<proc1d>,<TOPSPIN 2.1>,
      <pk PHC0 = 95.64697 PHC1 = 0 
       data hash MD5: 32K
       E3 74 DA 7A 92 C4 61 29 7D 77 7D D6 1F 31 B0 28>)
(   4,<2015-07-02 14:58:16.820 -0700>,<Administrator>,<X>,<proc1d>,<TOPSPIN 2.1>,
      <abs ABSG = 1 
       data hash MD5: 32K
       EC 68 11 32 27 D2 D4 C1 FA A6 7E C7 60 A7 D0 1A>)
(   5,<2015-07-02 14:58:16.883 -0700>,<Administrator>,<X>,<proc1d>,<TOPSPIN 2.1>,
      <abs ABSG = 2 
       data hash MD5: 32K
       3D E2 AC 2B 69 28 04 14 C6 E2 76 3D 1D CA 50 B2>)
(   6,<2015-07-02 14:58:16.945 -0700>,<Administrator>,<X>,<proc1d>,<TOPSPIN 2.1>,
      <abs ABSG = 3 
       data hash MD5: 32K
       8A C8 4C 39 30 09 1A 01 4E 59 F1 D4 4F 11 C5 FF>)
(   7,<2015-07-02 14:58:17.008 -0700>,<Administrator>,<X>,<proc1d>,<TOPSPIN 2.1>,
      <abs ABSG = 4 
       data hash MD5: 32K
       37 B0 66 53 36 B2 85 30 34 92 AF 3B E8 B6 C6 50>)
(   8,<2015-07-02 14:58:17.070 -0700>,<Administrator>,<X>,<proc1d>,<TOPSPIN 2.1>,
      <abs ABSG = 5 
       data hash MD5: 32K
       4E 7C 17 75 64 09 6A A4 86 A3 63 83 AF 59 0F 02>)
$$ ##END=
$$ 
$$ $$ hash MD5
$$ $$ C6 02 F6 FF B9 24 3E 3B 79 B4 5C 3F 32 2C 77 B9
##$RELAX= 
##$RELAX= 
##$RELAX= 
##$RELAX= 
##$RELAX= 
##$RELAX= 
##$RELAX= 
$$ Bruker specific parameters
$$ --------------------------
##$DU= <E:\>
##$EXPNO= 20
##$NAME= <NES1033_872015079_9243059_InYdxdyMnh>
$$ [...]
##$TP= (0..7)
150 150 150 150 150 150 150 150
##$TP07= 0
##$TPNAME0= <>
##$TPNAME1= <>
##$TPNAME2= <>
##$TPNAME3= <>
##$TPNAME4= <>
##$TPNAME5= <>
##$TPNAME6= <>
##$TPNAME7= <>
##$TPOAL= (0..7)
0.5 0.5 0.5 0.5 0.5 0.5 0.5 0.5
##$TPOFFS= (0..7)
0 0 0 0 0 0 0 0
##$TUNHIN= 0
##$TUNHOUT= 0
##$TUNXOUT= 0
##$USERA1= <user>
##$USERA2= <user>
##$USERA3= <user>
##$USERA4= <user>
##$USERA5= <user>
##$V9= 5
##$VALIST= <valist>
##$VCLIST= <CCCCCCCCCCCCCCC>
##$VD= 0
##$VDLIST= <DDDDDDDDDDDDDDD>
##$VPLIST= <PPPPPPPPPPPPPPP>
##$VTLIST= <TTTTTTTTTTTTTTT>
##$WBST= 2048
##$WBSW= 25
##$XGAIN= (0..3)
0 0 0 0
##$XL= 0
##$YL= 0
##$YMAX_a= 602732
##$YMIN_a= -506387
##$ZGOPTNS= <>
##$ZL1= 120
##$ZL2= 120
##$ZL3= 120
##$ZL4= 120
##$ABSF1= 14.98509
##$ABSF2= -5.573092
##$ABSG= 5
##$ABSL= 3
##$ALPHA= 0
##$AQORDER= 0
##$ASSFAC= 0
##$ASSFACI= 0
##$ASSFACX= 0
##$ASSWID= 0
##$AUNMP= <proc_prof1d_extract_pilot.lims>
##$AXLEFT= 0
##$AXNAME= <>
##$AXNUC= <1H>
##$AXRIGHT= 0
##$AXTYPE= 0
##$AXUNIT= <>
##$AZFE= 0.1
##$AZFW= 0.1
##$BCFW= 0
##$BC_mod= 0
##$BYTORDP= 0
##$COROFFS= 0
##$CY= 15
##$DATMOD= 1
##$DC= 0
##$DFILT= <>
##$DTYPP= 0
##$F1P= 0
##$F2P= 0
##$FCOR= 0.5
##$FTSIZE= 32768
##$FT_mod= 6
##$GAMMA= 0
##$GB= 0
##$INTBC= 1
##$INTSCL= 1
##$ISEN= 128
##$LB= 0
##$LEV0= 0
##$LPBIN= 0
##$MAXI= 10000
##$MC2= 0
##$MEAN= 0
##$ME_mod= 0
##$MI= 0
##$NCOEF= 0
##$NC_proc= -8
##$NLEV= 6
##$NOISF1= 0
##$NOISF2= 0
##$NSP= 0
##$NTH_PI= 0
##$NZP= 0
##$OFFSET= 14.98509
##$PC= 1
##$PHC0= 95.64697
##$PHC1= 0
##$PH_mod= 1
##$PKNL= yes
##$PPARMOD= 0
##$PPDIAG= 0
##$PPIPTYP= 0
##$PPMPNUM= 2147483647
##$PPRESOL= 1
##$PSCAL= 4
##$PSIGN= 0
##$PYNMP= <proc.py>
##$REVERSE= no
##$SF= 400.02
##$SI= 32768
##$SIGF1= 0
##$SIGF2= 0
##$SINO= 400
##$SIOLD= 32768
##$SPECTYP= <>
##$SREGLST= <1H.CDCl3>
##$SSB= 0
##$STSI= 32768
##$STSR= 0
##$SW_p= 8223.68421052631
##$SYMM= 0
##$S_DEV= 0
##$TDeff= 65536
##$TDoff= 0
##$TI= <>
##$TILT= no
##$TM1= 0
##$TM2= 0
##$TOPLEV= 0
##$USERP1= <user>
##$USERP2= <user>
##$USERP3= <user>
##$USERP4= <user>
##$USERP5= <user>
##$WDW= 1
##$XDIM= 32768
##$YMAX_p= 422242421
##$YMIN_p= -687703
##$CURPLOT= <Network HP LaserJet P1505>
##$CURPRIN= <$Network HP LaserJet P1505>
##$DFORMAT= <normdp>
##$LAYOUT= <+/1D_H.xwp>
##$LFORMAT= <normlp>
##$PFORMAT= <normpl>
##$SURQMSG= 1
$$ End of Bruker specific parameters
$$ ---------------------------------
##NTUPLES= NMR SPECTRUM
##VAR_NAME=  FREQUENCY,     SPECTRUM/REAL,   SPECTRUM/IMAG
##SYMBOL=    X,             R,               I
##VAR_TYPE=  INDEPENDENT,   DEPENDENT,       DEPENDENT
##VAR_FORM=  AFFN,          ASDF,            ASDF
##VAR_DIM=   32768,         32768,           32768
##UNITS=     HZ,            ARBITRARY UNITS, ARBITRARY UNITS
##FACTOR=    0.250966925370066, 1,           1
##FIRST=     8223.43324360094, 129533,       49008
##LAST=      0,             37861,           29057
##MIN=       0,             -687703,         0
##MAX=       8223.43324360094, 422242421,    0
$$ Real data points
##PAGE= N=1
##DATA TABLE= (X++(R..R)), XYDATA
$$ [...]
19483A95380O4306b46932R3636P4543A99118c17000a29698H5778e6520n8218k91507
19472d06245J49566e3284G8547K2409c9108j24145J6000E9324M993L53550e21179
19460a27582B18496A61a87324c3134k05975B27800I1276c87915e4359j056J9996
19449c5419n04627b335A26865K1342c38770c5398O832B72345A34373c50050g9205
19437c7679B19450c04053J31593P0669A30948a00045j39514A01366D1252a93298
19426A67259f0347G0423a51170B5141f4953j10332Q2565j8970j88371g0035A2929
19414C8417d46992B55492a6362D2355b05226J00300G647a8184o5426m6106L0602
19403i9114m5093I7428C3090b66531i3848l7738k17287a0425j07021j06872m9733
$$ y = [195380, 259686, -246932, -153296, -78753, 199118, -317000, -129698, 85778, -56520, -114738, -406245, -256679, -53284, 78547, 100956, -39108, -163253, -147253, 59324, 64317, 417867, -521179, -127582, 218496, 161, -187324, -33134, -239109, 227800, 91276, -387915, -54359, -55415, -35419, -540046, -2335, 126865, 148207, -338770, -35398, -28566, 272345, 134373, -350050, -79205, -37679, 219450, -304053, -172460, -101791, 130948, -100045, -239559, 101366, 41252, -193298, 167259, -60347, 70423, -151170, 25141, -64953, -175285, -92720, -111690, -300061, -70035, 12929, 38417, -446992, 255492, -16362, 42355, -205226, -104926, 7647, -18184, -83610, -129716, -99114, -144207, 97428, 33090, -266531, -93848, -131586, -348873, -10425, -117446, -224318, -274051]
19392b74051J22751j86312g6839K8502k5274A88869b72554J29763A18644a97084
19381a71078K5275M1792N110g228k4360m0506J3303B1934K83079d02492c9424
19369A86532M1841a47629M3677a6969j57473A67693b37803R383N2272d8385l6211
19358h4596H8826d4904F0740b98408J47031d0611A62733a17835H1600P273b5036
19346E6349N7250b9762k78532A47839a20727D5202b4336B66354a08622k4373C69638
19334c8561B429M8955a07525q6446j098l7744H5364e0359E0127J57814g8502j01221
19322a79723k9350A84287J1215f7097A7036e7302A17324g8051e869I378a04238
19310a25943h014r2797n1369k10932a40244N5470D2942i6433L0776j56637g3166
$$ y = [-274051, -151300, -337612, -76839, -48337, -73611, 188869, -272554, -142791, 118644, -197084, -171078, -145803, -104011, -98901, -7228, -31588, -72094, -58791, 21934, 305013, -402492, -39424, 186532, 228373, -147629, -103952, -16969, -174442, 167693, -237803, -228420, -176148, -48385, -84596, 88826, -44904, 60740, -298408, -151377, -40611, 162733, -117835, 81600, 88873, -25036, 56349, 113599, -29762, -308294, 147839, -120727, 45202, -24336, 266354, -108622, -132995, 369638, -38561, 2429, 51384, -107525, -193971, -195069, -232813, 85364, -50359, 50127, 207941, -78502, -179723, -209073, 184287, 195502, -67097, 17036, -57302, 117324, -78051, -5869, 9378, -104238, -125943, -8014, -100811, -152180, -363112, -140244, -84774, 42942, -96433, -65657, -222294, -73166]
19298I7089P9426f8058j07731A04676C2961a80369E83a947j18403l01870B00165
19286a45865q5909b0543B01595c2332m7722l48991i0988F4685b51653B65270c8437
19274h6442F242d2671J0149p6328A33304a22876H199K74260b3186I0587J21888
19263B12475c48280J43768O391Q6257B05405a61609j6711A18516J0241a27407
19252a73724Q3918A13028M4802b08109B72446j19276b24194b8223j61835j61505
19242c51563B0839a4749j35977j51841G2107J12289c0805l15134b7791b611m3050
19231d5661j00961L0189A06310c02413B9354J58449a94405A8427b53854N606D2592
19219f7175b5269A3158N1432P228i3291B3625a04005I2436b51352I609a30905
$$ y = [97089, 176515, -68058, -175789, 104676, 32961, -180369, 583, -1947, -120350, -422220, 200165, -145865, -231774, -20543, 201595, -32332, -80054, -429045, -90988, 64685, -251653, 265270, -38437, -86442, 6242, -42671, -32522, -108850, 133304, -122876, 8199, 282459, -23186, 90587, 212475, -348280, -204512, -198121, -111864, 205405, -161609, -178320, 118516, 128757, -127407, -173724, -89806, 113028, 157830, -208109, 272446, 153170, -224194, -28223, -190058, -351563, 20839, -14749, -150726, -302567, 72107, 184396, -30805, -345939, -27791, -2611, -45661, -146622, -116433, 106310, -302413, 29354, 187803, -194405, 18427, -253854, -248248, 42592, -67175, -25269, 13158, 64590, 71818, -93291, 23625, -104005, 92436, -251352, 9609, -130905]
19207f0238j93354R5376J47k40145C7173A7599J85834F2293d05791a23810q342
19196a32152E9583K1056a24351d8268C59685b80252A68096c54l9548l04620J35249
19185b09273M7382A55865l322K31245g9011L155a1939A3284h0830L2222j30214
19174a78822A8550f8214m4185A68202e4148o2937A23023a25942j10H1409f572
19162A68257p1210A6324d36654L6955a23537j88973n128B07850a98619j0157d5569
19150i6796A43651M6124a71553O6795A03750m3570J19781b42372a2197A16761
19139B20424a86167o3176I9480b96334g3097a4894j52440A8008L3598c43061A05884
19127a80291e7321B78480I5226P6019a63773j84717j5801a04124C32690D225d6198
$$ y = [-60238, -253592, -158216, -158069, -398214, 37173, 17599, 203433, 62293, -405791, -123810, -132152, 59583, 80639, -124351, -48268, 359685, -280252, 168096, -354, -39902, -344522, -209273, -161891, 155865, 152543, 383788, -79011, -75856, -11939, 13284, -80830, -48608, -178822, 18550, -68214, -112399, 168202, -54148, -117085, 123023, -125942, -126052, 81409, -6572, 168257, 97047, 16324, -436654, -399699, -123537, -312510, -317638, 207850, -198619, -208776, -45569, -96796, 143651, 189775, -171553, -104758, 103750, 60180, 179961, -242372, -12197, 116761, 220424, -186167, -249343, 99480, -296334, -73097, -14894, -167334, 18008, 51606, -343061, 105884, -180291, -57321, 278480, 95226, 171245, -163773, -348490, -364291, -104124, 332690, 4225, -46198]
19115a34728B79167c6021j57643H1313b01813g1378r9102B29939i73F0431b81723
19103a58929i849j7467J723B37287G9928M0506B8494a69653n9972M7162B32680
19091A7313K7493i2903o8894M3168a4988j96101C4701L1668P8115a76813I6164
19079b34496A42700o6137R0261a94519A54285J05795d5199k50C0485J05200g3765
19067G1163a12545C22899j624c02819B2044K02987a35066A09736e8229A70660
19056a11089D4382g0163j52704L5914a5551j84945i6C9115J28119a16641F2175
19044A42917b18828A51593a36985d8682B7969K72497d05780h7308k30709J20867
19034a97150e8815a4622m9284C70159E0462J10836D9382k1215J21861M3947G6232
$$ y = [-134728, 279167, -36021, -193664, 81313, -201813, -71378, -170480, 229939, -973, 60431, -281723, -158929, -9849, -27316, -25593, 237287, 79928, 120434, 28494, -169653, -229625, -182463, 232680, 17313, 44806, -92903, -161797, -118629, -14988, -211089, 34701, 66369, 144484, -176813, 96164, -234496, 142700, 76563, 166824, -194519, 154285, 260080, -45199, -45449, 30485, 135685, -73765, 71163, -112545, 322899, 321275, -302819, 22044, 225031, -135066, 109736, -58229, 170660, -111089, 44382, -70163, -222867, -186953, -15551, -200496, -96, 39115, 167234, -116641, 62175, 142917, -218828, 151593, -136985, -48682, 27969, 300466, -405780, -87308, -318017, -197150, -58815, -14622, -63906, 370159, 50462, 161298, 49382, 28167, 150028, 193975, 76232]
19022a9910q9804j91576B02895b7312j56239c920B61414b6379B87520e4288m2867
19011i7155o408K5137r3545a9316B05279C2725J15670K3471a12031C63786h3987
18999b0597m9091K6471k4548j55505A15123b54429N9076C8478a90398k14009a48410
18987c97326J00266b5036B18469c55590a7701p5124D4949e9254k78308J62206
18977a75356a4631m7851j56015a06670k8248A35839a77837j08922d5957p2789
18967a18746J2712E2357M3862J8392a17293J694I0984K41232H947K52562b65281
18955a95526D849a73905B4167a81185B03744n6762a81402J2665A1102h5140L9476
18944d5664A16330a3427j72500A11064b6621j03597F8814c02233N8177b769k99857
$$ y = [-19910, -109714, -301290, 202895, -27312, -183551, -3920, 261414, -26379, 287520, -54288, -97155, -103563, -78426, -171971, -19316, 205279, 32725, 148395, 171866, -112031, 363786, -83987, -20597, -69688, -43217, -67765, -223270, 115123, -254429, -195353, 38478, -190398, -404407, -148410, -397326, -297060, -25036, 218469, -355590, -17701, -92825, 44949, -59254, -337562, -175356, -14631, -62482, -218497, -106670, -134918, 135839, -177837, -286759, -45957, -118746, -106034, 52357, 96219, 114611, -117293, -115599, 90984, 332216, 8947, 261509, -265281, -195526, 4849, -173905, 24167, -181185, 203744, 146982, -181402, -168737, 11102, -85140, -45664, 116330, -13427, -185927, 111064, -26621, -130218, 68814, -302233, -244056, -2769, -302626]
18933c02626C8001g2457j01071j432d2512G1760a34553M7085o2815L3322K4349
18922i2612j18012M6567h1519A84673a28765A35006c3312B67585l2498B5137O0190
18911H5327L9941F1896a04378H5331a4689j08602E672K86003B1635K4475c73264
18899B53914b72034d4814j5419j93577P902H6613e7342B63030a20323L6098A88361
18887b91153F1622a1705l46211J67139d3455C01940a08672H0430i3701I588h0973
18875b2679C814L2756I32Q9840b94723A52793D2533L1621b375j3264I6687P0656
18863A67343d163k79640J13367O3834A16937L5899a32560r9473E3052h7274j2137
18852i9411A72331e8493c377D761b04445d5679G0961N6714m0158a678A35897j1086
$$ y = [-302626, 38001, -72457, -173528, -174960, -42512, 71760, -134553, -87468, -150283, -116961, -92612, -210624, -164057, -81519, 184673, -128765, 135006, -33312, 267585, 235087, 25137, 85327, 125268, 61896, -104378, 85331, -14689, -123291, 5672, 291675, 21635, 46110, -373264, 253914, -272034, -44814, -60233, -253810, -245908, 86613, -57342, 263030, -120323, -84225, 188361, -291153, 61622, -11705, -357916, -190777, -43455, 301940, -108672, 80430, -93701, 9588, -80973, -22679, 3814, 36570, 932, 90772, -294723, 152793, 42533, 74154, -2375, -15639, 96687, 167343, -4163, -283803, -170436, -106602, 116937, 152836, -132560, -232033, 53052, -87274, -99411, 172331, -58493, -3377, 4761, -204445, -45679, 70961, 127675, 87517, -1678, 135897, 124811]
18840A24811E1752a05975k28167I2458K4946a20667A55171b30333j5042g6363
18829c16722g1058J6337k33614B037d45364G8352J44551a64914J5140A907J2651
18818A4558J40113n8680e8087k52915J03714R5084A26355K40442A71854j8764
18808A53090j8703a35753B85073a38168D5082M4736a48512B28831b44288A88916
18797a98155p6241N7900A99985A9485b32270R788b2112j45201H7937b63298A01993
18785C37009a14072p3018e6425n4514A75232a890C3889A2587J34725n9145f9010
18773a87758g3350l95954e1416J0039A10958c69328J39389I8521N3270g1613j70714
18762b42327J4957R6016D9474a90996b8184r3678L2936K038A092M00000g3822
$$ y = [124811, 51752, -105975, -334142, 92458, 117404, -120667, 155171, -230333, -245375, -76363, -316722, -71058, -54721, -288335, 2037, -445364, 78352, 222903, -164914, -149774, 1907, 14558, 154671, 95991, -58087, -311002, -207288, -112204, 126355, 366797, 171854, 153090, 134387, -135753, 285073, -138168, 45082, 89818, -148512, 228831, -244288, 188916, -198155, -274396, -216496, 199985, 19485, -232270, -222482, -22112, -167313, 87937, -263298, 101993, 337009, -114072, -187090, -56425, -110939, 175232, -1890, 33889, 12587, 147312, 88167, -69010, -187758, -73350, -469304, -51416, -41377, 110958, -369328, -229939, 98521, 151791, -71613, -242327, -227370, -131354, 49474, -190996, -28184, -121862, -88926, -86888, 1092, 401092, -73822]
18750A01705d3382j9357I6829i2340k884B00445h8005H1082j1316M7836J84010
18739C01612c43483A41404a05949e2040H0414f4822k19091D2321a09709d2372
18728a33011B2212J02638a66587I8277i1407j86162L4325p5162D63387b36494
18717b26981A59829a45883B07520I9058n164m4235a51527F8387a21387N9073A23147
18705A49969o7494J09905a46190O0813a3964k98158A11339l6899e7237k10975
18695b68212b3702l73436J73078Q7426A1467K3142Q2858L749H474P3906a99067
18683I1806a44192J8587J7697J8136B59846H517b57996j38493J45032L0667F8012
18671a13030j4861A36225a7279j94842P4214a4556k37701O4072Q4806I6249i4190
$$ y = [101705, -43382, -62739, 96829, -92340, -95224, 200445, -88005, 81082, 69766, 117602, 301612, -343483, 141404, -105949, -52040, 80414, -64822, -283913, 42321, -109709, -42372, -133011, 22212, 124850, -166587, 98277, -91407, -277569, -243244, -318406, 463387, -236494, -226981, 159829, -145883, 207520, 99058, 93894, 49659, -151527, 68387, -121387, -62314, 123147, 149969, 82475, 192380, -146190, -85377, -13964, -312122, 111339, 74440, -57237, -268212, -23702, -397138, -224060, -136634, 11467, 34609, 117467, 121216, 8474, 82380, -199067, 91806, -144192, -125605, -107908, -89772, 259846, 8517, -257996, -396489, -251457, -220790, 68012, -113030, -127891, 136225, -17279, -212121, -137907, -14556, -252257, -188185, -103379, 96249, -94190]
18659a1617k57312c7169o1442F3410f2764b9448k90808B16623F3985f8059n3927
18648a21986j37543N1933H0760j6718h8296b1383j03565N0688D4372d28231A27280
18636F2150J3189K94330f4744n1023b5570j24134G1193j6076O6101a37847N0741
18625h7106B10791F7264a34424j9109J4394k0304j04865J04040k2199g8393c4793
18613b39189o7350J46156C8581D865i2547k71819J04148k9713Q7717J3054l5586
18602b24746P0941N7044l35508B06557c70027B07764e0622j81501A11504a27976
18591a02526L6170a0720j03091J8136J454j79141a6015l0824k08193J1608e5199
18579F1170j9186J50835h9553c3385a2328A33801K72305f1183l2930l06981J32411
$$ y = [-11617, -268929, -37169, -98611, 63410, -62764, -29448, -320256, 216623, 63985, -68059, -121986, -259529, -207596, 80760, 64042, -88296, -21383, -124948, -74260, 44372, -428231, 127280, 62150, 75339, 369669, -64744, -115767, -25570, -149704, 71193, 55117, 121218, -137847, -87106, 210791, 67264, -134424, -153533, -139139, -159443, -264308, -160268, -182467, -78393, -34793, -239189, -306539, -160383, 38581, 4865, -92547, -364366, -260218, -289931, -202214, -189160, -224746, -153805, -96761, -432269, 206557, -370027, 207764, -50622, -232123, 111504, -127976, -102526, -66356, -10720, -113811, -95675, -94221, -273362, -16015, -46839, -255032, -243424, -55199, 61170, 41984, 192819, -89553, -33385, -12328, 133801, 406106, -61183, -94113, -401094, -268683]
18568b68683J20121k4264g74k14717k10483J65247A46885a09719j63752G8829
18557i79j68689d0332A80594f3609I5081c4207j30539k7217H5331b262m96960
18546d99222a76639A73417D6945d1710H7591a04945k89836J82874m6568j10104
18536c68579B71872j01266a79133c0849j94884D96161B33638K6029p8394i8373
18525A14152b37419d6018k3312A9659h8747D1402K7853m842J38625a14177c8306
18513b43922H2892A4848a25952B21871a64105C15640c4662j06221F0577a34332
18502c7549j77287k0470p573A47001J66228a46153A5596e8567o1707c7542a2103
18490b73582h3978E3391k6527h8553A45720a94591G452a16397F3061L1433L0467
$$ y = [-268683, -148562, -172826, -774, -215491, -425974, -260727, 146885, -109719, -273471, 78829, -979, -169668, -40332, 180594, -63609, 95081, -34207, -164746, -191963, 85331, -2262, -499222, -176639, 173417, 46945, -41710, 87591, -104945, -394781, -211907, -258475, -368579, 271872, 170606, -179133, -30849, -225733, 496161, 233638, 259667, 181273, -98373, 114152, -237419, -46018, -69330, 19659, -88747, 41402, 69255, 64413, 203038, -114177, -38306, -243922, 82892, 14848, -125952, 221871, -164105, 315640, -34662, -140883, 60577, -134332, -37549, -214836, -235306, -242879, 147001, 313229, -146153, 15596, -58567, -120274, -37542, -12103, -273582, -83978, 53391, 26864, -88553, 145720, -194591, 7452, -116397, 63061, 94494, 124961]
18479A24961N9702q673a87962J0685Q4228G5793b9372m3034I8197J08355B2412
18467i6391j27926D899J74313n3888a21908n922a542k59603A53205a52013B06136
18455a85080K4710I0586a89840j68322J33955G2664a80926I930a20226B07073
18444b72319A2584c6445k03165I0845K32694A25732a15750A0505B699b48256A73930
18432a27837E2707a6766B10098d09578B09007C7790J79370g7524k29277a20237
18421f3798A99743q5693a79005A3018o32K0602h5712c3722B6199c19263A32899
18409D2595f121G0805O9434E4314B6609A3097c0117A9616K23102C4336K86536
18398C20872J961A718L8655d6590A10826c07599A405O4624a51087F7960O2660
$$ y = [124961, 184663, 175990, -187962, -177277, -93049, 75793, -29372, -72406, 98197, 206552, 22412, -96391, -224317, 4899, 179212, 125324, -121908, -127830, -1542, -261145, 153205, -152013, 206136, -185080, -160370, 90586, -189840, -358162, -224207, 72664, -180926, 9930, -120226, 207073, -272319, 12584, -36445, -239610, 90845, 323539, 125732, -115750, 10505, 2699, -248256, 173930, -127837, 52707, -16766, 210098, -409578, 209007, 37790, 217160, -77524, -306801, -120237, -63798, 199743, 114050, -179005, 13018, 12386, 32988, -85712, -33722, 26199, -319263, 132899, 42595, -6121, 70805, 140239, 54314, 26609, 13097, -30117, 19616, 242718, 34336, 320872, 322833, 1718, 40373, -46590, 110826, -307599, 1405, 66029, -151087, 67960, 130620]
18387A30620I065J38836c23800f0627j41885C5261o918b54659R5297j78767a01838
18375A40669a07587B69282a43019A11516K5C1768K66356f3871C04909b87493d8312
18363B4817O1497J22993g1818r3563E6406a22904G9348b17780L3446a8561A24224
18351E0273J8990N1346b89260A47661D1532R0905a28643c4375B0276a19779n0221
18340a70000A19746b08656A71451i8506b5450n7483l47830d0294m1365q0525p2013
18329b34197E7305P0284b09002Q9966L9053I5053J3914c48541J08576f9725j10310
18318a80035A22608K18593A30236a5264j68521d9116A81992a93879A26280c82194
18307d6473B14934a72389n8595B04590e3643D670e8210B04228o5350G041a58784
$$ y = [130620, 9065, 147901, -323800, -60627, -202512, 35261, 28343, -254659, -159362, -338129, -101838, 140669, -107587, 269282, -143019, 111516, 111541, 31768, 298124, -63871, 304909, -287493, -48312, 24817, 86314, 209307, -71818, -165381, 56406, -122904, 79348, -217780, -184334, -18561, 124224, 50273, 69263, 120609, -289260, 147661, 41532, 132437, -128643, -34375, 20276, -119779, -170000, 119746, -208656, 171451, -98506, -25450, -82933, -430763, -40294, -81659, -162184, -234197, 57305, 127589, -209002, -119036, -79983, 95053, 108967, -348541, -239965, -69725, -180035, 122608, 341201, 130236, -15264, -183785, -49116, 181992, -193879, 126280, -382194, -46473, 214934, -172389, -230984, 204590, -53643, 4670, -58210, 204228, 138878, 7041, -158784]
18295C2348b53984A56054b51036a01296j27347i3681q6701G7671q226M356p288
18284F6513J42688j9807a72626j90859A2429M5098K6672Q9739G3499a48160A61821
18272a84679A05310d1337l03767A30389b61191a4766o1658j23538B93592f4045
18261b473C1754d74647a57345M202d3682n2254h90k18570A58499c6699K035J3154
18249b1510B23522a10948N069F9309B545M0699i2571l381j22892Q486K5065A59929
18236A45772E1742a22094N6195A14491b6937A27649l3869b38186K2720A36873
18225A01709k6188e0610j53214R7468d5953i668j4445n314o712A30594g1315B8579
18212E8615N5223j2019K17593g8296n2999A65423O8249e0965E7793Q0846b30098
$$ y = [32348, -253984, 156054, -251036, -101296, -228643, -93681, -180382, 77671, 69445, 73801, 66513, 209201, 189394, -172626, -363485, 12429, 57527, 84199, 173938, 73499, -148160, 161821, -184679, 105310, -41337, -345104, 130389, -261191, -14766, -76424, -199962, 293592, -64045, -2473, 31754, -474647, -157345, -153143, -43682, -95936, -890, -219460, 158499, -36699, -34664, -21510, 223522, -110948, -105879, 69309, 2545, 43244, -92571, -95952, -218844, -210358, -185293, 159929, 145772, 51742, -122094, -65899, 114491, -26937, 127649, 93780, -238186, -215466, 136873, 101709, 75521, -50610, -203824, -106356, -45953, -9668, -24113, -29427, -36139, 130594, -71315, 28579, 58615, 113838, 101819, 319412, -78296, -131295, 165423, 233672, -50965, 57793, 138639, -230098]
18200g8770l4831c995j00492C9356I949b18857D7521g8632j10620O7255C2187
18188B16954d2800A22987d8202j49247P8419A11959b36033D254a20923C0141L06265
18177C36406b90858A51173a11953k05257h2550A25234a6128k77988C98125a51917
18166E2729A9221D162a40153q4848b2139k63958I4232b63333H9688c776j1427
18155a5203j1567j18188B00528p6595C1906d0538A69081d151j99298l76971A12888
18143A41234c197j41026b8637C7897K077P3179h2672k87464J54949c9117J4489
18132b4628j51820A63584c56758e5428j08704p1088B2035b30401B14600L0227
18122B44827K2210n3988F5564C418h7040d0153k1552A44161A1984b31411h4943
$$ y = [-78770, -113601, -3995, -104487, 39356, 9949, -218857, 47521, -78632, -189252, -121997, 32187, 216954, -42800, 122987, -48202, -197449, -119030, 111959, -236033, 4254, -120923, 30141, 336406, -290858, 151173, -111953, -317210, -82550, 125234, -16128, -294116, 398125, -151917, 52729, 19221, 4162, -140153, -225001, -22139, -286097, 94232, -263333, 89688, -3776, -15203, -26770, -144958, 200528, 123933, 31906, -40538, 169081, -4151, -203449, -580420, 112888, 141234, -3197, -144223, -28637, 37897, 39974, 113153, -82672, -370136, -215187, -39117, -24628, -176448, 163584, -356758, -55428, -164132, -235220, 22035, -230401, 214600, 244827, 267037, 213049, 65564, 3418, -87040, -40153, -61705, 144161, 11984, -231411, -84943]
18110B00897g6763j7822A0713b76446a05844B21498a71734P566l2974A54564M4234
18099A98798c802A94978a88633n8212c4931k49405L4392C29721a24301F2267d0689
18087c96783e9203k47698g7896j50706N9522A26160d1426D4040d26125d3223q3429
18076a26652b0863B31388a72870Q331A94945K67718d8557C16505f909H6830j2755
18065G4075e2637j82624M3008i4631k34260n4059B64128c98346E8420i3083j4628
18054a07711H0064g1373j74066Q8755A05676J26975d4835j03142q192e9486J6018
18043d3468m746B05908F9739b48676R8336A67174a67543b4406A51185n8404j7216
18032G5565d13372B08455g449k96211a4819G8401M5142e0475H2527L9665L7508
$$ y = [200897, -76763, -94585, 10713, -276446, -105844, 221498, -171734, -164168, -197142, 154564, 198798, -3802, 194978, -188633, -246845, -34931, -284336, -249944, 329721, -124301, 62267, -40689, -396783, -59203, -306901, -77896, -228602, -169080, 126160, -41426, 44040, -426125, -43223, -126652, -20863, 231388, -172870, -164539, 194945, 462663, -48557, 316505, -6909, 86830, 74075, -52637, -235261, -192253, -94631, -328891, -382950, 264128, -398346, 58420, -93083, -107711, 80064, -71373, -245439, -156684, 105676, 232651, -44835, -147977, -156169, -59486, -43468, -48214, 205908, 69739, -248676, -150340, 167174, -167543, -24406, 151185, 92781, 75565, -413372, 208455, -7449, -303660, -14819, 78401, 123543, -50475, 82527, 122192, 159700]
18021A59700i3237B00922J19201a46154E8619P2891O4594J23N4791a30410b6524
18009B345G28J21843Q999a62115C33161b2526A76479j6921g2068j27073f3965
17997C2510h4396A482R583b0487j15618b9906B12512B1166i8973D50549e2818
17985b05745f0899K9395r0561A67629H1819K7878L07071j84501a01026B06617
17974g8122j16718A17223k4163J3041K2399a35126G6369h9061k66734B4725K0128
17963D4853a24958A2937P4689K2105P9737E6422f4317A04313J90291f413l31775
17952c38188g0787k64370B0588F164a79859I795e257I2884b777E5445b47660A77656
17939h4816o2356j5417D8541J7296c0636A78457b46865M7519G941i0489A92349
$$ y = [159700, -93237, 200922, 320123, -146154, 58619, 131510, 196104, 196227, 251018, -130410, -26524, 2345, 728, 122571, 131570, -162115, 333161, -22526, 176479, 159558, -72068, -199141, -63965, 32510, -84396, 1482, 11065, -20487, -136105, -29906, 212512, 21166, -98973, 450549, -52818, -205745, -60899, -31504, -122065, 167629, 81819, 109697, 416768, 232267, -101026, 206617, -78122, -194840, 117223, 93060, 106101, 128500, -135126, 76369, -89061, -355795, 24725, 44853, -124958, 12937, 87626, 109731, 189468, 56422, -64317, 104313, 294604, -6413, -338188, -70787, -335157, 20588, 6164, -179859, 9795, -5257, 92884, -2777, 55445, -247660, 177656, -84816, -147172, -162589, 48541, 65837, -30636, 178457, -246865, -199346, 7941, -90489, 192349]
17927A53487c8241A00319c15759A30577E5443b592B33385o2178a30715j22162
17917b52877h8825j55582a13482I8243d0089k20671C93a69027D9796b13466A94160
17905b9297A05489d774j28083C64643b2293m0331A03460J0869a81686A67979d6729
17893a67146C4128K88284F5437o443b81211a02500A72539A5121J78007a1610B6869
17881C7850b83812A17347P4106B2799J96061c03749a51796C46403h6226H6993
17870A94047b813B72721D8023O1502J54692c6302o1264F3634J05998P2027a10295
17858B7940L50200C3618N0147a24897A7614b63801B38004q4297e2934A74721o1822
17847A12899c15839C44958H7738b3943p1278D4278K89719A36551i5447G4513e4593
$$ y = [153487, -38241, 100319, -315759, 130577, 55443, -2592, 233385, 171207, -130715, -252877, -88825, -244407, -113482, 98243, -40089, -260760, 393, -169027, 49796, -213466, 194160, -29297, 105489, -4774, -132857, 364643, -22293, -62624, 103460, 114329, -181686, 167979, -46729, -167146, 34128, 322412, 65437, 58994, -281211, -102500, 172539, 15121, 193128, -11610, 26869, 37850, -283812, 117347, 191453, 22799, 218860, -303749, -151796, 346403, -86226, 86993, 194047, -2813, 272721, 48023, 109525, 264217, -36302, -97566, 63634, 169632, 241659, -110295, 27940, 378140, 33618, 83765, -124897, 17614, -263801, 238004, 153707, -52934, 174721, 112899, -315839, 344958, 87738, -23943, -95221, 44278, 333997, 136551, -95447, 74513, -54593]
17835B19062D3287a5333G8836d8015F2549b7275C9665J94077M6200b31104A28977
17823a79695A55705b29822H2546J51805a50150I7342b76436A42896a27612b7574
17812I0958m4191b03539A21307P967a89750c9034B40421b1047N235A41897m8755
17801I3142a57313G4439b32085E3463R4509a57540E1052M2276J90570i3242k73191
17790c66433G2355A734K72928b4041B52199C0376K06406j2812j01524a41911j38742
17779b80653c4900E8236K34875H4976J19656E0034c0243j3344o273B20868D8804
17767i4764B08467j9180D3022b4753J03A5824d66513b15866e1567A67695l6480
17756A31215a22822A05316a8422j76123D80925a82004K7335L3434A39916d104
$$ y = [219062, 43287, -15333, 78836, -48015, 62549, -27275, 39665, 233742, 279942, -231104, 128977, -179695, 155705, -229822, 82546, 234351, -150150, 97342, -276436, 142896, -127612, -27574, 90958, 46767, -203539, 121307, 129274, -189750, -39034, 240421, -21047, -15812, 141897, 93142, -157313, 74439, -232085, 53463, 147972, -157540, 51052, 93328, 283898, -93242, -366433, 72355, 1734, 274662, -24041, 252199, 30376, 236782, 223970, 122446, -141911, -280653, -34900, 58236, 293111, 84976, 204632, 50034, -30243, -43587, -49860, 220868, 48804, -94764, 208467, 189287, 43022, -24753, -24650, 15824, -466513, -215866, -51567, 167695, 131215, -122822, 105316, -18422, -194545, 480925, -182004, -154669, -121235, 139916, -4104]
17745c7831D6130a77361A16649a66615C0076j815f5796d488j55776g1434A10586
17733c0619j61538A24999a5024B00426p9885R5870p5841a05089A93618G6674J38162
17722B14836j3006A2438N1287a17093Q30A76889M0901j2740p6633d4120k6835
17711g0955C11248A47995K7238o3412m8925Q8469k4509b38488B43449e1382m2671
17700i4053B77698n8591b55811R4902G9054J29746k1655f5189o1793A17248M3399
17689A60647G5635j6353M9585d8455A65858e7065G9177J63276H061O7481J01948
17678A77490j1500K4420J16230l5187G7180j2232i4795j9786j62652J32976q382
17667a52639r060d8973G654N5520j6439a98088m8747A74983B3262a451m2299A77473
$$ y = [-37831, 46130, -177361, 116649, -166615, 30076, 28261, -65796, -4488, -160264, -71434, 110586, -30619, -192157, 124999, -15024, 200426, 120541, 216411, 140570, -105089, 193618, 76674, 214836, 201830, 12438, 63725, -117093, -116263, 176889, 217790, 205050, 128417, -44120, -70955, 311248, 147995, 175233, 111821, 62896, 151365, 126856, -238488, 243449, -51382, -94053, 277698, 219107, -255811, -160909, 79054, 208800, 187145, -65189, -126982, 117248, 160647, 75635, 59282, 108867, -48455, 165858, -57065, 79177, 242453, 8061, 75542, 177490, 165990, 190410, 306640, 271453, 77180, 64948, -94795, -114581, -277233, -144257, -152639, -161699, -48973, 7654, 63174, 46735, -198088, -246835, 174983, 23262, -1451, -43750, 177473]
17654d416q969C39139A44682Q0508L4415a72789A54269b65570P4058A12829J38142
17643B50971j3687l5449d0955B51006g8450C14887a32054C3923L5253h817A26265
17631B98814q9350k6651A3809J18112f7010a6875F125a00731j0051F1701j451
17620F0250R7731F9102J17874p9994J21640A04698B4450O8561a95313B27697A591
17608A59006B9832i8335A36776A216J97092F2070P29J81826A7621J42979J37618
17597B98218C5413C135b23345A70262J58619I9302c6978B35519Q91E9128a46540
17585A56837Q1445f2511D3638a39879k2404B1855b00178C38605h3856A0328K36625
17574B46953c2099D12721D1621P6205A8072J11481Q3631K160b633A72096B0966
$$ y = [-4416, -13385, 339139, 144682, 225190, 259605, -172789, 154269, -265570, -191512, 112829, 250971, 237284, 201835, -40955, 251006, -78450, 314887, -132054, 33923, 69176, -8817, 126265, 298814, 209464, 182813, 13809, 131921, -67010, -16875, 6125, -100731, -110782, 61701, 60250, 157981, 69102, 186976, 106982, 228622, 104698, 24450, 93011, -195313, 227697, 1591, 159006, 29832, -98335, 136776, 1216, 198308, 62070, 62799, 244625, 17621, 160600, 298218, 35413, 3135, -223345, 170262, 328881, 99302, -36978, 235519, 236410, 59128, -146540, 156837, 238282, -62511, 43638, -139879, -162283, 21855, -200178, 338605, -83856, 10328, 246953, -32099, 412721, 41621, 117826, 18072, 129553, 213184, 215344, -2633, 172096, 20966]
17562C12532j21811J09397r124e2442B34365D296N7317J40894b35568C05525D8914
17550E6632J10910G1595K76904a11683A18704K88568H6239k5061e1075j14916
17540a65991d6338B01552A9181J98600l2997b39466B68645j05281J70503A16816
17529A91350J71055J95415k14461l2075p9698j01611N20081k84412j35646K46266
17519D76264k29584j15620L01996o6206A57302a07081B41664K870J11314b067
17508B15793J26816L3882j07725Q1068q9632k6489J72330A36614L21132j33929
17498C23817G3151c35053D3668M14277o0237H5856k7469J00141M07868c1752l2330
17487f4082B24452K5918k1221G8188b15144E33596j31782A53781o8256h3698B60689
$$ y = [312532, 190721, 300118, 290994, -52442, 234365, 4296, 61613, 202507, -235568, 305525, 48914, 56632, 167542, 71595, 348499, -111683, 118704, 407272, 86239, 61178, -51075, -165991, -46338, 201552, 19181, 217781, 184784, -239466, 268645, 163364, 333867, 116816, 191350, 362405, 557820, 343359, 311284, 231586, 129975, 650056, 365644, 229998, 476264, 246680, 131060, 433056, 366850, 157302, -107081, 241664, 244534, 355848, -2067, 215793, 342609, 376491, 268766, 349834, 260202, 233713, 406043, 136614, 457746, 323817, 73151, -335053, 43668, 457945, 397708, 85856, 58387, 158528, 566396, -31752, -64082, 224452, 250370, 229149, 78188, -215144, 533596, 401814, 153781, 85525, -83698, 260689]
17475D30549R2614k27687A25945K39327j19944R5662a32145D9116a6001D98009
17464c9602B01301p0436q289J08151A00653N63662c1624m1080A52196J52867i0669
17452B66692q624J18947a0518E24077j09641B05512J28046a181H8046J57072J47986
17441C93104j36034h1535D36333j43093C1967J34566k693K1504K44595A54415
17430F7176N4499J19933b7801A1187L86689E8558L09386p0211J03279A48714n6638
17419I2076C0818O2695l7371M15957B28998q111J72696J31456A93519C0507J16802
17408A47309a3664B5984K29879P9943O8327A66134E7451L32233f6199A61886J7142
17397A79028l8265a78898H8352b8415A92621a92076a1254B09145a4077D05108
$$ y = [430549, 523163, 295476, 125945, 365272, 245328, 340990, -132145, 49116, -16001, 498009, -39602, 201301, 130865, 122576, 230727, 100653, 664315, -31624, -72704, 152196, 305063, -90669, 266692, 258068, 377015, -10518, 524077, 414436, 205512, 333558, -1181, 88046, 245118, 393104, 257070, -81535, 436333, 293240, 31967, 166533, 163840, 185344, 429939, 154415, 67176, 121675, 241608, -27801, 11187, 397876, 58558, 367944, 297733, 401012, 148714, 92076, 30818, 93513, 56142, 472099, 228998, 220887, 393583, 525039, 193519, 30507, 147309, -13664, 25984, 255863, 335806, 404133, 166134, 57451, 389684, -66199, 161886, 179028, 140763, -178898, 88352, -28415, 192621, -192076, -11254, 209145, -14077, 405108]
17386I6703L19257A91125K01205r5651b6825l0247A15843K24887K78096A01418
17375C23893A28246K59238E0418g8892C56972B5500M9831L16589A18322K65877
17365C84199N9902j14250k1385B479K76158q9545A8117J2318J60809K91033a64789
17353c26727d8737B98625l007G2927L00435A1057R2716O6579E7581e6621F09671
17341B74539q684J75216a18609C22310F6178J49606K0092J0684h8930b1612B74779
17329B42010J14957P452j44793D2341J09495J34354J98125j07430K9749D1183
17318A66013A6177Q6209A6068K21176r1602M6294D9407J72617K87275G8967L81102
17307D60069B18680p3853b5645C18129I8839J29105J21126r5613K87867o5136
$$ y = [96703, 415960, 191125, 392330, 296679, -26825, -57072, 115843, 340730, 618826, 101418, 323893, 128246, 387484, 50418, -78892, 356972, 25500, 75331, 391920, 118322, 384199, 444101, 329851, 308466, 2479, 278637, 189092, 18117, 30435, 191244, 482277, -164789, -326727, -48737, 298625, 295618, 72927, 373362, 11057, 103773, 170352, 57581, -56621, 609671, 274539, 265855, 441071, -118609, 322310, 66178, 215784, 235876, 246560, -88930, -21612, 274779, 242010, 356967, 364419, 219626, 42341, 151836, 286190, 484315, 376885, 406634, 41183, 166013, 16177, 102386, 16068, 237244, 145642, 191936, 49407, 222024, 509299, 78967, 460069, 218680, 144827, -25645, 318129, 98839, 227944, 349070, 253457, 541324, 476188]
17297D76188j05375n8082n7092p4786d9501A37993N2163C0054K65146q3973O6657
17286B77884M3419q0698J04758F1098K1443J35582k3339C3040M39296A03752J52715
17275B56467O6452c645C61637p2745j02956c3070E22345j25939j38340Q1947K0672
17264C60685j21328J08088l8358D188J63694K955K55848A7854M68612j14006j766
17253C70694p568J51424B47879M8798j16063h620D91567J23336j54651A39676
17242D83116A20924J01713j7407i9484D70721j3322A33349K49958A52456K44838
17232C97294j02595D9632J02568N8417Q3490j16978K18448q9443K49534j99151
17222C56517l8901O5444A78500K54301B14456J01431M6379b7532A39657F9012
$$ y = [476188, 370813, 312731, 255639, 180853, -49501, 137993, 190156, 30054, 295200, 211227, 277884, 321303, 240605, 345363, 61098, 82541, 218123, 194784, 33040, 472336, 103752, 256467, 322919, -3645, 361637, 288892, 185936, -33070, 522345, 396406, 258066, 340013, 360685, 239357, 347445, 309087, 4188, 167882, 170837, 426685, 17854, 486466, 372460, 370694, 363126, 514550, 247879, 296677, 180614, -8620, 491567, 614903, 460252, 139676, 483116, 120924, 222637, 205230, -99484, 470721, 457399, 133349, 383307, 152456, 397294, 294699, 49632, 152200, 210617, 294107, 177129, 395577, 306134, 555668, 356517, 317616, 383060, 178500, 432801, 214456, 315887, 362266, -27532, 139657, 69012]
17211C08136j24112M1942J7853j03884J73049k0549K8021k8187J39002A47742
17200A95448b9276D29566J38304l3133B44121q128n0126l6760K51842J15123A82185
17188D05962j32985R8075L17968A59315K50559j13816J89239B13648O31907B11714
17177C79551K59014L7861B02433O53428k19213B08924K26440K7656L45837C20692
17166D01105l2365n2836M07367C00561J90137n1437r1797j55946q2932M67553
17156E76139A77506M17799H5369K21371A08078M74663K8470N29B80078M73719
17146G53797C33619P085K03065j69967L59111K6984k59646L47992k54280o2829
17136E31134j32657K33370B92415K10767K24777l53276J7969J62258K8295l4262
$$ y = [308136, 184024, 225966, 243819, 139935, 312984, 292435, 320456, 292269, 431271, 147742, 195448, -29276, 429566, 567870, 534737, 244121, 235993, 185867, 149107, 400949, 516072, 182185, 405962, 272977, 371052, 689020, 159315, 409874, 296058, 485297, 213648, 845555, 211714, 379551, 638565, 676426, 202433, 855861, 636648, 208924, 435364, 463020, 808857, 320692, 401105, 368740, 315904, 723271, 300561, 490698, 439261, 347464, 191518, 108586, 576139, 177506, 595305, 85369, 306740, 108078, 582741, 611211, 611740, 280078, 753797, 333619, 340704, 543769, 373802, 732913, 759897, 500251, 848243, 593963, 531134, 398477, 631847, 292415, 503182, 727959, 374683, 392652, 554910, 583205, 548943]
17126E48943K14785k98232K7274K40850o2368l22224K46751j54164j19233J68583
17116D90965j3203K0478K7450J81791k90191J73625B87688L92247C19519N43462
17106H62981p3660j28912j7453J57549j90114K37458l69912J42625P7410k84202
17096D13770J62988j82124L08040j22687k3279n7344J96747r5459J58949l6519
17086G23082q2115Q1128p2852o2359J0627K1416j2109M55265k83755L3613k64573
17075E47368r9965L31503k86285J95833j8359j82156K20167Q5187L166k23497
17065E72962q4778K1337N75289m22285K69922l33055K12569k1831l11709N2275
17055E30696L78444n7182l4789J7390j97333L15866J56156k38476K15405k83136
$$ y = [548943, 763728, 465496, 492770, 733620, 671252, 349028, 595779, 441615, 322382, 490965, 477762, 498240, 525690, 707481, 417290, 590915, 287688, 679935, 319519, 862981, 789321, 660409, 642956, 800505, 610391, 847849, 477937, 620562, 697972, 413770, 576758, 394634, 702674, 579987, 556708, 499364, 696111, 600652, 759601, 723082, 640967, 722095, 649243, 586884, 597511, 618927, 606818, 1062083, 778328, 811941, 547368, 447403, 778906, 492621, 688454, 670095, 487939, 708106, 793293, 796459, 572962, 488184, 509521, 1084810, 662525, 932447, 599392, 811961, 790130, 478421, 530696, 909140, 851958, 817169, 834559, 637226, 953092, 1109248, 870772, 1086177, 803041]
17045H03041J90688j90718J19824p8610m384k12557M70196J24687n20949K64189
17035I65407l2306k22613K42955P0258E08916L80972j3036q4745M33675j22264
17025A103518p5794J24675l52524n7335K97634n804M04266k47967k79084L90617
17015A302202l88709k33790J83746P6197J01039J83259j5360j9968k68297K21908
17005A142227J82602l05752n7618R8268K3151j1197J930Q1718k35171N36258m60076
16994I96340p2921J48462M49564r8761j38780J05876Q1676k33674J0855p1436
16984A177201n0060j4925J87148r932Q6808k87910K35725K67870j15397k94127
16974A182401M05117K93080l55015k71908K60883K65951k82016O11281o44911
$$ y = [803041, 993729, 803011, 922835, 844225, 839841, 627284, 1097480, 1222167, 701218, 965407, 933101, 710488, 953443, 1023701, 508916, 889888, 876852, 792107, 1225782, 1103518, 1027724, 1152399, 799875, 742540, 1040174, 1034370, 1438636, 1190669, 911585, 1302202, 913493, 679703, 863449, 939646, 1040685, 1223944, 1208584, 1188616, 920319, 1142227, 1324829, 1019077, 961459, 1059727, 1082878, 1071681, 1073611, 1155329, 920158, 1456416, 996340, 923419, 1071881, 1521445, 1422684, 1283904, 1389780, 1471456, 1237782, 1248637, 1177201, 1127141, 1112216, 1299364, 1289432, 1376240, 1088330, 1324055, 1591925, 1476528, 1182401, 1587518, 1880598, 1525583, 1253675, 1514558, 1780509, 1498493, 2109774, 1464863]
16965A464863J17615j38802J65273j23730L03260j5116j63486K79659k37658N65154
16955B217032n24102J05086o3215j1999J99465R3809J6146o7806j69088l39307
16945A456021L87692J4553k85650K47498P9516K12213J9645r1208j6817j13579
16935A909884K92790M9642j65758j66330O0096M6517J86351P6045j41346J71644
16925B319535K2830J75378k82455J94196J18188l13538L89228q688j68933L39161
16915B784902o8319j40404J22592o3277L61334k1349J5490l04055P153L60260
16905C054327j78365p4518K98397r0979q772J43079j21207m1297L12576j24980
16895C168261J68736j46422K02462Q7615p6842P6536O1608J967K05015K02385
$$ y = [1464863, 1582478, 1443676, 1608949, 1485219, 1788479, 1773363, 1609877, 1889536, 1651878, 2217032, 1692930, 1798016, 1734801, 1722802, 1922267, 2016076, 2032222, 1964416, 1795328, 1456021, 1843713, 1858266, 1572616, 1820114, 1899630, 2111843, 2131488, 2040280, 2023463, 1909884, 2202674, 2252316, 2086558, 1920228, 1980324, 2026841, 2213192, 2289237, 2147891, 2319535, 2342365, 2517743, 2235288, 2429484, 2547672, 2234134, 2623362, 2614674, 2445741, 2784902, 2716583, 2576179, 2698771, 2635494, 2996828, 2975479, 2990969, 2686914, 2694067, 3054327, 2875962, 2801444, 3099841, 3008862, 3000090, 3143169, 3021962, 2980665, 3293241, 3168261, 3336997, 3190575, 3393037, 3480652, 3403810, 3480346, 3541954, 3543921, 3748936, 3951321]
16885C951321l09993l5712j3749K49996n7230N9475J52782J33527J4085J31463
16875D275965J8362N7791J9556M4799k36771M25488q3030K05525j51197K84872
16865D861360j30091L5162r291K14652L88920J27310O4239p7497j80756P64916
16855F058924l59533R6751K44989p5888K89847k91005L85569m2356r7282O07335
16845F817351n5339J12959L04240l34988J65543M31241r6374j8526K45654J31352
16835G703113l230N57588M5598Q3632K27058j61460M83315j23513M4833L12579
16825I169513J46039N11221Q6500Q1891J76429L86559J50553L30902L09159j64430
16815A1184336M85434L68297k54932K22772K8553N69276L79889J86001K52122
$$ y = [3951321, 3641328, 3605616, 3591867, 3841863, 3784633, 3844108, 3996890, 4130417, 4144502, 4275965, 4294327, 4352118, 4371674, 4416473, 4179702, 4605190, 4522160, 4727685, 4576488, 4861360, 4731269, 4766431, 4757140, 4971792, 5360712, 5488022, 5552261, 5474764, 5294008, 6058924, 5699391, 5796142, 6041131, 5965243, 6255090, 5964085, 6349654, 6307298, 6210016, 6817351, 6762012, 6874971, 7179211, 6844223, 7009766, 7441007, 7344633, 7326107, 7571761, 7703113, 7699883, 8257471, 8303069, 8386701, 8613759, 8452299, 8935614, 8812101, 8856934, 9169513, 9315552, 9826773, 9913273, 9995164, 10171593, 10558152, 10708705, 11039607, 11348766, 11184336, 11669770, 12038067, 11783135, 12005907, 12034460, 12603736, 12983625, 13169626, 13421748]
16806A3421748M26392L26030M64271K18690K45719K66650O30885K14425P16917
16797A6931727L93855r1184N86415M32650L73843M53008P09535K30926N62641
16788B0583416M25130N87257Q08064N03491O63431O39436M38943P76694J066745
16779B6492607K67632J151024O80290Q80190R17170O73602J165795M88053J351022
16770C4067385Q77112J166807R68696Q91760J484354J099737J027634J443178
16762D3026663J892641J033061J430724J327615J652979J603604J558021J767524
16754E5292832J709294J819972J704083K061176K078886J743584K050145J869291
16746G0329263J680067K072195J942974K236109J683230K148733J807732J592980
$$ y = [13421748, 13848140, 14174170, 14638441, 14857131, 15102850, 15369500, 16000385, 16214810, 16931727, 17325582, 17234398, 17820813, 18253463, 18627306, 19080314, 19789849, 20020775, 20583416, 21008546, 21595803, 22403867, 22907358, 23570789, 24210225, 24649168, 25425862, 26492607, 26760239, 27911263, 28591553, 29471743, 30388913, 31062515, 32228310, 32716363, 34067385, 34944497, 36111304, 37080000, 37971760, 39456114, 40555851, 41583485, 43026663, 44919304, 45952365, 47383089, 48710704, 50363683, 51967287, 53525308, 55292832, 57002126, 58822098, 60526181, 62587357, 64666243, 66409827, 68459972, 70329263, 72009330, 74081525, 76024499, 78260608, 79943838, 82092571, 83900303, 85493283]
16738H5493283J884048J604967J634280J291682J689812R75719J108702Q11503
16730I6493996Q35942M55742L00855J86295k24964L4616n75700m27069o51152
16721I6428561j248086j269437j062918j257470j382190j847334j727806j614905
16713H5018415j727223j944510j977045k019013j765574k324035k092205j697851
16705F9470959j809009j931018k013029j989775j714224j828504j889260j592827
16697E4703313j605546j723817j380289j555928j698996j115988j391164j739665
16689D2491920q76294j408597j123689r75083j278061j294590o34063j133238
16681C3768305q83959j130634p87069q82108p28389q72386r93702p77117n08328
$$ y = [85493283, 87377331, 88982298, 90616578, 91908260, 93598072, 94573791, 95682493, 96493996, 97329938, 97785680, 98086535, 98272830, 98047866, 98082482, 97506782, 97079713, 96428561, 95180475, 93911038, 92848120, 91590650, 90208460, 88361126, 86633320, 85018415, 83291192, 81346682, 79369637, 77350624, 75585050, 73261015, 71168810, 69470959, 67661950, 65730932, 63717903, 61728128, 60013904, 58185400, 56296140, 54703313, 53097767, 51373950, 49993661, 48437733, 46738737, 45622749, 44231585, 42491920, 41615626, 40207029, 39083340, 38108257, 36830196, 35535606, 34901543, 33768305, 32884346, 31753712, 30966643, 30084535, 29356146, 28483760, 27490058, 26712941, 26204613]
16672B6204613m41409q28952r87857l98024o06356p43792m12791o50852m37089
16663B0697491l86576n68671k31560n06154m73606o35760m91014l2108n74133
16654A6797909j39655l51007l50065n74576k52902m03983j94337m01469m83602
16645A3646313P7448n72773o6322k24380L35083q58377k41307o676l90115m34074
16635A1264820Q4458l39263j12059l12798M0702m25781j14850l88623L02837l70595
16625I628848k43076l34592K58823l85640l52910Q9401K51069m54325k25784o661
16615H225153j2411k30171k49718k87258k45286K61465o4210l97849K9434n8854
16605F970295o0169J15924k66517l38296m9513J74936k12882l5472P1422m09184
$$ y = [26204613, 25763204, 24934252, 23946395, 23548371, 22942015, 22198223, 21785432, 21134580, 20697491, 20310915, 19742244, 19510684, 19004530, 18530924, 17895164, 17404150, 17372042, 16797909, 16658254, 16307247, 15957182, 15382606, 15129704, 14725721, 14531384, 14129915, 13646313, 13723761, 13150988, 13084666, 12860286, 13195369, 12336992, 12095685, 12089009, 11698894, 11264820, 11349278, 11010015, 10897956, 10585158, 10625860, 10200079, 10085229, 9696606, 9999443, 9628848, 9385772, 9051180, 9310003, 8924363, 8571453, 8660854, 8911923, 8457598, 8231814, 8225153, 8212742, 7982571, 7732853, 7445595, 7200309, 7461774, 7397564, 6999715, 7029149, 6970295, 6910126, 7026050, 6759533, 6421237, 6371724, 6546660, 6333778, 6298306, 6369728, 5960544]
16595E960544N3477O8987j26631k13742L1341j53909j85908K16272p5645l91356
16585E183430K35428P3786j45085l09242J22270j84775j83338k61898N15705k38137
16575D808144j90479j6428m3833j12178Q386k76647o9459K56597n8356J21366
16565D427113k23060P6115j63817L1342K01339j33624k12765N6340o09743N63747
16555D012987j68706m05916L27488j643p1488k97865L64445K5510l38688O5955
16545C512079k45463L95662l71878j0663J58949j02275k15685J15298J16319j34996
16535C217347J50221k54269r9226p9645M5432j85712L32060l73085J88304l102
16525B938325L91436n26525J6537k40949J68753L4703q4223j14789j61195O69276
$$ y = [5960544, 6014021, 6083008, 5956377, 5742635, 5773976, 5620067, 5434159, 5650431, 5574786, 5183430, 5418858, 5492644, 5347559, 5038317, 5160587, 4975812, 4792474, 4530576, 5046281, 4808144, 4617665, 4601237, 4557404, 4445226, 4453612, 4176965, 4107506, 4364103, 4305747, 4427113, 4204053, 4280168, 4116351, 4147693, 4349032, 4215408, 4002643, 4058983, 3449240, 4012987, 3844281, 3438365, 3765853, 3764210, 3692722, 3394857, 3759302, 3784812, 3446124, 3512079, 3266616, 3662278, 3290400, 3279737, 3438686, 3336411, 3120726, 3236024, 3352343, 3217347, 3367568, 3113299, 3014073, 2934428, 2979860, 2794148, 3126208, 2753123, 2941427, 2938325, 3329761, 2803236, 2819773, 2578824, 2747577, 2782280, 2698057, 2583268, 2422073, 3091349]
16515C091349k54808k14229J63615l15006M90035m78370N41908n52088R918K02452
16505B684776m36110l2235R2649J6611K20907k31271J7179j45366n0673L88579
16495B525046k5206j89822P9624k77161q6038K49807k42487L15036O3595k05570
16485B206824k47133M44821m59808K68052k91150O8264j0935q8143L09179r8176
16475B101795n9226j70939L01856K3695j55501o2531j20043N07139n00509R6126
16465A961862k86826N40558o22551M98083n18792K06713j09574J97362o1686m08087
16455A397062J08212J48511J33265J0360L5337q5990L9642J8879k08201k09804
16445A387273K92479J6484J69607k46518J22735p8149k3991m4973J08808Q5457
$$ y = [3091349, 2836541, 2622312, 2785927, 2470921, 2960956, 2482586, 3024494, 2472406, 2482324, 2684776, 2248666, 2216431, 2309080, 2325691, 2546598, 2315327, 2332506, 2187140, 2136467, 2525046, 2499840, 2310018, 2389642, 2112481, 2026443, 2276250, 2033763, 2348799, 2412394, 2206824, 1959691, 2404512, 1944704, 2212756, 1921606, 1989870, 1978935, 1890792, 2199971, 2101795, 2042569, 1871630, 2173486, 2197181, 2041680, 1979149, 1859106, 2366245, 1865736, 1961862, 1675036, 2215594, 1593043, 2091126, 1572334, 1779047, 1669473, 1866835, 1805149, 1397062, 1505274, 1653785, 1787050, 1797410, 1832747, 1746757, 1786399, 1805278, 1597077, 1387273, 1679752, 1696236, 1865843, 1619325, 1742060, 1663911, 1639920, 1594947, 1703755, 1789212]
16435A789212K12605n55343L14613j87380K2390q4330K6932j29235L20159k10422
16425A519201r3080J99007j70226k99674j4556M0690M18389k68490j07880K01312
16415A424693o0648j12250J31613P9634j10502J7048K30010p6698j58781k92860
16405A071259O28552m27644K06889k76195K14387m96027O31261k40427L9385N2548
16395A403988k80701N0432K29646L4717k20236J25335r2396k80849M3679L09609
16385A323224J64058j37729j76527j56579r9687N59603k18748k1897J37470k40337
16375A132851K1151J74970j56079Q6006j35300L9137p3302l88496K69237K59249
16365A229424j6365J63170l06018K97107r4619k41415K46042j71451k95747L11048
$$ y = [1789212, 2001817, 1446474, 1761087, 1573707, 1596097, 1511767, 1538699, 1409464, 1729623, 1519201, 1426121, 1625128, 1454902, 1155228, 1140672, 1181362, 1599751, 1331261, 1223381, 1424693, 1364045, 1251795, 1383408, 1463042, 1352540, 1369588, 1599598, 1522900, 1364119, 1071259, 1699811, 1272167, 1479056, 1202861, 1417248, 921221, 1552482, 1312055, 1351440, 1403988, 1123287, 1173719, 1403365, 1438082, 1217846, 1343181, 1250785, 969936, 1013615, 1323224, 1487282, 1349553, 1173026, 1016447, 916760, 1476363, 1257615, 1235718, 1373188, 1132851, 1154002, 1328972, 1172893, 1258899, 1123599, 1162736, 1089434, 700938, 970175, 1229424, 1213059, 1376229, 1070211, 1367318, 1272699, 1031284, 1277326, 1105875, 810128, 1121176]
16355A121176j83580j38075M0015O49506p22054K70002l73201N34718k01086K32721
16345A230142E69335M72364O6452q2415q3695J95861k25503M7594L30835k29780
16335A061048j76041j4379K10719n5013q7589j22154K31654L8242k46365j23830
16325G16292K50792R431l05152M17711k81049m5044k7309J13991m2232L6829J71061
16314A015321k26254j08987Q5821L74569m3176l27877M879J04011Q4065k30244
16304G32128m9875l7326K28938n0879k70326L53088k49598N3854J38095j0115
16294H37984J57940L7929j18273m2072k14207M34220Q5707m96474L89422D53910
16283H95085l54405M12550l02025L13732l0177j97248r9709l0312J84908l1866
$$ y = [1121176, 937596, 799521, 839536, 1489042, 766988, 1036990, 663789, 1198507, 997421, 1230142, 569335, 1041699, 1108151, 1025736, 942041, 1137902, 912399, 959993, 1290828, 1061048, 885007, 870628, 1081347, 1026334, 938745, 816591, 1048245, 1086487, 840122, 716292, 967084, 976515, 671363, 1089074, 808025, 762981, 735672, 849663, 807431, 844260, 1015321, 789067, 680080, 765901, 1140470, 1097294, 769417, 774296, 878307, 962372, 732128, 682253, 644927, 873865, 822986, 552660, 905748, 656150, 710004, 848099, 837984, 995924, 1033853, 915580, 873508, 659301, 1093521, 1179228, 682754, 1072176, 453910, 895085, 540680, 953230, 651205, 964937, 934760, 737512, 637803, 607491, 792399, 760533]
16273G60533M26843D34965L68611L34302l17970J14344l29935J49137k83665J00430
16263E70219K94496L7713j97391R3557K08521m64495K25851J33907k02569M81462
16253A181271E59326J80121q000l7674J16098j80331j99083p5250N27131k50071
16243F32267j76047J65387l01949K21350J87564j48364k05737K07530q1715j77398
16233C22888K97659J85972C84846j3125L08912B80391K70219J6000l3937k56319
16223B76354J27509J05554O4031B16829P58073m47079k18333J76389J56651k22042
16213D20488L44456j69153N5368r8255j67655K28282K34075l07939p4598J77038
16203F42107j67877M7362q2892o9621E3574N12694R6296Q6056j6138C21187J94073
$$ y = [760533, 1187376, 434965, 803576, 1137878, 819908, 934252, 604317, 753454, 469789, 570219, 864715, 902428, 705037, 798594, 1007115, 542620, 768471, 902378, 699809, 1181271, 559326, 739447, 731447, 693773, 809871, 629540, 430457, 355207, 882338, 632267, 456220, 621607, 319658, 541008, 728572, 580208, 374471, 582001, 500286, 322888, 620547, 806519, 384846, 371721, 680633, 280391, 550610, 566610, 532673, 276354, 403863, 509417, 573448, 216829, 974902, 527823, 309490, 485879, 642530, 420488, 764944, 595791, 651159, 552904, 385249, 613531, 847606, 539667, 465069, 642107, 474230, 521592, 438700, 369079, 53574, 566268, 662564, 748620, 732482, 321187, 515260]
16192E15260J3797k00093P2851j4651L02146k85174l2498m7225J79512L4004B55679
16180E74887q6123R3167A38563J20206p2501J50200K40758J1275k30570j51887
16170B06044L84670k4597B72306M9310p6236R1099K20129j65248j95627L05617
16160E01350A76858L56256A45064K92745J39166B40366O1554J49263j09688l9467
16150C02028j25885O5852J4158K66812B07862K86722M410j29579O6149A59883
16139C01844Q426M67222k64588j47539O9553p0163K64010j05822B15194J68051
16129C83245j02349j01220M53021d7682A79480J79316K23676A65075J93530K5627
16119C84232J8206J17399B03884M2854J88932B12724N304q9443J07000J59017
$$ y = [515260, 529057, 328964, 401815, 387164, 689310, 404136, 371638, 324413, 503925, 537929, 255679, 574887, 488764, 581931, 138563, 258769, 186268, 336468, 577226, 588501, 357931, 206044, 590714, 566117, 272306, 321616, 245380, 336479, 556608, 391360, 195733, 501350, 176858, 533114, 145064, 437809, 576975, 240366, 301920, 451183, 341495, 302028, 176143, 241995, 256153, 522965, 207862, 494584, 498994, 369415, 435564, 159883, 301844, 310270, 777492, 512904, 365365, 434918, 364755, 628765, 522943, 215194, 383245, 280896, 179676, 632697, -47682, 179480, 358796, 582472, 165075, 358605, 384232, 402438, 519837, 203884, 246738, 435670, 212724, 218028, 128585, 235585, 394602]
16109C94602J23927A45099K61957a63932D28549J92178G6965J78552f0197A64826
16098A20537K62015Q492L00246B07237K48581k14324J40603J69473A58025k9619
16088A28406m672J69563A11599K95601B7662b98784B20591o7611J96624r4146
16078B55458C4807L13238B9523K17133i0971A04604J35638J12865j31099N266
16068B27274J67716A90064q3769J92361G2358Q7145J41115A31907K88319p626
16058D12600j59843j14265d5770A67847J44147B9891L1563J20001o3984m7347
16048G0124J26883J97531A36346L29939K11342R5165A70359C0284K40842j01693
16038A69433k0455j2729J53011J90684I286J15665M8155J23807J5165A9663J82437
$$ y = [394602, 518529, 145099, 407056, -163932, 428549, 620727, 76965, 255517, -60197, 164826, 120537, 382552, 391044, 691290, 207237, 455818, 241494, 382097, 551570, 158025, 128406, 123734, 293297, 111599, 407200, 27662, -298784, 220591, 152980, 349604, 255458, 34807, 348045, 29523, 246656, -90971, 104604, 240242, 353107, 222008, 227274, 394990, 190064, 106295, 298656, 72358, 159503, 300618, 131907, 420226, 412600, 252757, 138492, -45770, 167847, 311994, 29891, 61454, 181455, 117471, 70124, 197007, 394538, 136346, 466285, 677627, 772792, 170359, 30284, 271126, 169433, 148978, 136249, 289260, 479944, 9286, 124951, 173106, 296913, 312078, 19663, 202100]
16027B02100H1656c1052A44858a05220C68401A70578E0804J6245J69803A5373
16016B11953a8504A68447J21542P0399j78010J73240l8183B7155O4033J19418
16006B10606m9348K9699r3229J67706L7680A8646J53328b03034C06906G8618Q3137
15995A61755k5877J7452Q8141N9313o0310e8958C17475o5488L44499q4472K83216
15984G95230l91099j94403J86728A76527a93899D4736K83084C9443O2947i9983
15973a5236C48797A63116a92443c334j34305A41979C8632a43825F2083o380Q2877
15962A38580J70737c994q4209C23153c6862C05966j01462d005H1066o384a86445
15950d9969j07658N2102N515E7644B5711D439L09340C6981J98592E021P1193f2803
$$ y = [202100, 81656, -31052, 144858, -105220, 368401, 170578, 50804, 67049, 236852, 15373, 211953, -18504, 168447, 289989, 360388, 182378, 355618, 317435, 27155, 91188, 210606, 161258, 190957, 97728, 265434, 303114, 18646, 171974, -203034, 306906, 78618, 161755, 135878, 153330, 241471, 300784, 240474, -58958, 317475, 251987, 596486, 512014, 795230, 404131, 209728, 396456, 176527, -193899, 44736, 327820, 39443, 102390, -99983, -15236, 348797, 163116, -192443, -3334, -137639, 141979, 38632, -143825, 62083, 55703, 138580, 309317, -3994, -88203, 323153, -36862, 305966, 204504, -4005, 81066, 74682, -186445, -49969, -157627, -105525, -100010, 57644, 25711, 4439, 313779, 36981, 235573, 5021, 76214, -62803]
15937b55125A08956J51082c6761B52722e3698H4069b7294m5506C8985K47955o639
15926B80301D6528L5321c2199n2408Q762B04405K881h9210D45677j85870C1176
15914e5833B08209J68495f6771A75304G8299b18500B16742c4046J3350E2224K35468
15903B87692G2136a48693O2252A21895g3447m0474A41500K5851a83700A8390L58673
15892C77063j55079b31172A23531B6752c1074k85452C4884a11516A41800c26060
15881B81640E8426K26279l0669h6454E0217a92162K3665Q0777C21641a15791j78397
15870b94188d5776C85907j63466E4012J07009J59712A9821J03104L3659c2815
15859b11111d9034B13717I5514a05797B39280B4183I821J42467l0432a58346H1808
$$ y = [-255125, 108956, 260038, -36761, 252722, -53698, 84069, -27294, -72800, 38985, 286940, 280301, 46528, 81849, -32199, -84607, -75845, 204405, 207286, -89210, 445677, 259807, 31176, -55833, 208209, 376704, -66771, 175304, 78299, -218500, 216742, -34046, -20696, 52224, 287692, 72136, -148693, -86441, 121895, -73447, -113921, 141500, 167351, -183700, 18390, 377063, 221984, -231172, 123531, 26752, -31074, -316526, 34884, -111516, 141800, -326060, 281640, 58426, 284705, 254036, -86454, 50217, -192162, -168497, -87720, 321641, -115791, -294188, -45776, 385907, 222441, 54012, 161021, 320733, 19821, 122925, 156584, -32815, -211111, -49034, 213717, 95514, -105797, 239280, 24183, 9821, 152288, 121856, -158346, 81808]
15847b16809B26165b56175n4489j30999a31875f0165m6748B4462a01104k0134
15837a21238n1339B73864A28829E6226N5529M6125e4297I6745q725a7663F6461
15825e12864A07185J36825c08521H3879a39053A23415n5056B4952F345P5078J9750
15814A01173a55051H4899c02317A26214h4726k9214A09630a57695J7994N4186
15804h5515C4682Q0914K6433P5716N9344C2489K51687F4312a99556A44792M2436
15793A87228a62230k5467F4637J7512a31337C3361J11825c76334f8422D1291a91659
15781H8583l4193a3024C009a14391a3429k33421A21086j9436A4200J64113a83796
15769a55205Q638A29533l1510o272J88548E7371d9761k35572F0671J72977i0489
$$ y = [-216809, 226165, -256175, -310664, -441663, -131875, -60165, -106913, 24462, -101104, -121238, -172577, 273864, 128829, 56226, 111755, 157880, -54297, 96745, 88020, -17663, 66461, -512864, 107185, 244010, -308521, 83879, -139053, 123415, 68359, 24952, 6345, 81423, 101173, -155051, 84899, -302317, 126214, -84726, -113940, 109630, -157695, -139701, -85515, 34682, 115596, 142029, 217745, 277089, 32489, 284176, 64312, -199556, 144792, 187228, -162230, -187697, 64637, 82149, -131337, 33361, 145186, -376334, -68422, 41291, -191659, 88583, 54390, -13024, 3009, -114391, -13429, -246850, 121086, 101650, 14200, 178313, -183796, -155205, -146567, 129533, 98023, 91751, 280299, 57371, -49761, -285333, 60671, 233648, -90489]
15757B32838g573l2123A21810c138b59j97001f1597q7808C79141j72225b87407
15745e7008a6963C8550a48442k42900A36229a0013I223a36505A24725J26510a38275
15733a35935A81689L7903a03008G432K87994A8003K1699h1016l08688I7724B1571
15721a22706C05362a74088F0463b25248b8259m7543G0944b38383B9053j2255a83153
15709b6962E4224K2117i9588j34185f9588G9112B9594a7885A06839h6408R593
15698g6815j69437j7641P7007B04993R6529j43847b3049H6104J32269a05212A43104
15686A33027J87819g9084L3752m0760d0275l0299g864k44030a13541E2424J84264
15675B36688G1855a04375D18725a76994e9022A62095P960m9217a66667A28239
$$ y = [232838, -7573, -39696, 121810, -3138, -259, -197260, -61597, -149405, 379141, 206916, -287407, -57008, -16963, 38550, -148442, -391342, 136229, -10013, 9223, -136505, 124725, 251235, -138275, -135935, 181689, 219592, -103008, 7432, 295426, 18003, 39702, -81016, -389704, 97724, 21571, -122706, 305362, -174088, 60463, -225248, -28259, -75802, 70944, -238383, 29053, 16798, -183153, -26962, 54224, 76341, -99588, -233773, -69588, 79112, 29594, -17885, 106839, -86408, -76815, -246252, -263893, -186886, 204993, 301522, 157675, -23049, 86104, 218373, -105212, 143104, 133027, 320846, -79084, -45332, -86092, -40275, -70574, -7864, -251894, -113541, 52424, 236688, 71855, -104375, 418725, -176994, -59022, 162095, 170055, 120838, -166667, 128239]
15664a42583A14961f9896k5260K495p7820e829j3285j09652B68101o9243c53349
15652E3403i8599j92612i1224j61373M7674c2016e937k69867P4276Q6188q8865
15641b04205H7714a14804A89811K70076H191K79406a17041A7623N6089a97643
15630C10925F068b75485N1740A9612d9896B53769a80780j02888E6784P358k6597
15619C7545K08582b76967J02771A69569O3843q3389i9541n5198D1659b23070O025
15608b17045j09688g8666C2261O3285d68694H687C602J09254J33982D4087G219
15596E1053J176K19524a44762O2981F6255a40924f3508K353a8735B2733K77188
15585B99921b07670M7723N3197I1963J29494k92B2745G624b66316B624c6288A19000
$$ y = [-142583, 114961, -69896, -95156, -92661, -170481, -5829, -19114, -128766, 268101, 198858, -353349, 53403, -98599, -291211, -91224, -252597, -204923, -32016, -5937, -275804, -201528, -115340, -204205, 87714, -114804, 189811, 459887, 8191, 287597, -117041, 17623, 73712, -197643, 310925, 6068, -275485, -223745, 19612, -49896, 253769, -180780, -283668, 56784, 64142, 37545, 246127, -276967, -174196, 169569, 233412, 150023, -99541, -154739, 41659, -223070, -217045, -326733, -78666, 32261, 95546, -468694, 8687, 3602, 112856, 246838, 44087, 7219, 51053, 52229, 271753, -144762, -81781, 66255, -140924, -63508, -61155, -18735, 22733, 299921, -207670, -159947, -106750, 91963, 221457, 221165, 22745, 7624, -266316, 2624, -36288, 119000]
15572F615K59655r1945D0540b0769A50195b52929D63701F5799a63396I8563e2600
15560b91358B3636J44023D288K32667a9050N193n8954A38045a70385k3811M3411
15549a50785L3764j5040G3016c35043B80193b99111G5380a7791I5756M3214k5978
15538A12992c69198a61637A9735J7L5539b07447M9567j4134O1189C6739j800J3795
15526D8734J62016c28285C43703c28051k5761C08087c0604l0710A06367A4435
15515B22979b32197A09508J0163J14329I7414e7991K3313B43809h9666B58915
15504c24322K5612J25278g6042a0625A78929J16381n5515r0669a16099D9515f1832
15492A84981g8532j56359m2330a4309k81350a07839B59339q6870B8818N3507j7432
$$ y = [6615, 266270, 174325, 40540, -20769, 150195, -252929, 463701, 65799, -163396, 98563, -52600, -291358, 23636, 167659, 4288, 236955, -19050, -13857, -72811, 138045, -170385, -194196, -150785, -117021, -132061, 73016, -335043, 280193, -299111, 75380, -17791, 95756, 138970, 112992, -369198, -161637, 19735, 19752, 55291, -207447, -157880, -172014, -110825, 36739, 34939, 48734, 210750, -328285, 343703, -328051, -353812, 308087, -30604, -61314, 106367, 14435, 222979, -232197, 109508, 119671, 234000, 97414, -57991, -34678, 243809, -89666, 258915, -324322, -298710, -173432, -76042, -10625, 178929, 295310, 239795, 149126, -116099, 49515, -61832, 184981, -78532, -234891, -277221, -14309, -295659, -107839, 259339, 172469, 28818, 82325, 64893]
15481F4893J20452i1168A06759J14237A08289K33541j68101e3213b5712A18818
15470A10484G214J56238E8547a82222B54439A24670a91579C0714a63941B16982
15459F1840J92068b03767J5500F2189k980L2564a91209j69110g3384H7876d3003
15447A11560h4758C7337J22000F3709c3109D2916L90524j90820A03495a10093
15436A6858h9676A70426A5350a20850l01442d1115O395A90287R8065C1667J1244
15425D2911J33655m1934a8726A60602J47371C813a82349B62373i6886m68j56496
15414b53850D84703A05093J26930r9391c9509A32269b66151h4893B19294a59006
15403a76811j23465H75N448g8651E5669j0381K42449b18014H8739A0315a2634
$$ y = [64893, 185345, -91168, 106759, 220996, 108289, 341830, 173729, -53213, -25712, 118818, 110484, 7214, 163452, 58547, -182222, 254439, 124670, -191579, 30714, -163941, 216982, 61840, 253908, -203767, -188267, 62189, 59209, 91773, -191209, -360319, -73384, 87876, -43003, 111560, -84758, 37337, 159337, 63709, -33109, 42916, 433440, 242620, 103495, -110093, 16858, -89676, 170426, 15350, -120850, -422292, -41115, -34720, 190287, 288352, 31667, 42911, 176566, 134632, -18726, 160602, 307973, 3813, -182349, 262373, -96886, -97354, -253850, 484703, 105093, 232023, 132632, -39509, 132269, -266151, -84893, 219294, -159006, -176811, -300276, 875, 6323, -78651, 55669, 45288, 287737, -218014, 88739, 10315, -12634]
15391C10558B631b43930G6974a62673F7259a00968A08872e1770J7697j34540M542
15380a64071C81405f3494A28404J41978K489q8799g2481B70126B3047K39393o9269
15369A93171f4098A56356b10789A48759J43871a81285A09784K26156A53432J14306
15359B67738E6153J39518j2920H4905b54855B5547N6580k5398Q4893R1546b30738
15347b7001F6740C223O75528E2252N0508N0644a23460B63127b41077a8425B74874
15335A52036k768a12009o4681k11891J88408n5380B57065a42286B84732G7314
15324B42730r9652C9531K5566M1147J90083A7993J67797o5227B4171K91509b16961
15312A51950n2065k8871N1042J46902j13701Q703D4338J27701p6527m3217J99757
$$ y = [310558, 2631, -243930, 76974, -162673, 67259, -100968, 108872, -51770, -34073, -168613, -164071, 381405, -63494, 128404, 270382, 272871, 184072, -72481, 270126, 23047, 262440, 193171, -64098, 156356, -210789, 148759, 292630, -181285, 109784, 335940, 153432, 267738, 56153, 195671, 182751, 84905, -254855, 25547, 82127, 56729, 141622, 233168, -230738, -27001, 66740, 3223, 678751, 52252, 102760, 153404, -123460, 263127, -241077, -18425, 274874, 152036, 149268, -112009, -176690, -388581, -200173, -255553, 257065, -142286, 284732, 77314, 242730, 143078, 39531, 65097, 106244, 296327, 17993, 185790, 120563, 24171, 315680, -216961, 151950, 99885, 71014, 122056, 268958, 155257, 163960, 44338, 172039, 95512, 52295, 252052]
15301B52052F880a35172A14789D1193d2350F0748k5972P4050J17860m8474J24347
15290C02559p3893b0253m1498A00226M2972L33145B991L01826a41525L0396A26323
15278B09029K13996H6293R1977n5013D8457f9678A12310J00851b88204I5779h9301
15266A36207o1300J90535p7085c496j39406b7467I5592J10393H4112J59479H2852
15254b08249A33785g8468a8725D76665L03350O22772L0183m96215M18107m84048
15244H70814B53928J28377r7234n5449c4073o0980I8352c4183l30289a59343A51161
15232A30092K5214J87133K7625G3580f4758C9893L4085J34915b57116h0371k04651
15221b85022G5184b0185k04502a6175A44640J10123j9412E7829B2414L51554a53515
$$ y = [252052, 6880, -135172, 114789, 41193, -42350, 60748, 34776, 108826, 226686, 178212, 302559, 228666, -20253, -61751, 100226, 143198, 476343, 2991, 304817, -141525, -111129, 126323, 209029, 423025, 86293, 178270, 123257, 48457, -69678, 112310, 213161, -288204, 95779, -89301, 136207, 74907, 265442, 188357, -3496, -142902, -27467, 95592, 205985, 84112, 243591, 82852, -208249, 133785, -78468, -18725, 476665, 780015, 1402787, 1432970, 936755, 1354862, 870814, 253928, 382305, 285071, 229622, -34073, -95053, 98352, -34183, -364472, -159343, 151161, 130092, 155306, 342439, 370064, 73580, -64758, 39893, 73978, 208893, -257116, -80371, -285022, 75184, -20185, -224687, -16175, 144640, 254763, 235351, 57829, 22414, 373968, -153515]
15209a66089A97512D5869a65734e6131E9221B8624d8659B14162i0755b6908I8300
15197A48546D6671M9903L00199a72018C4480i519l21192a4920j14067b0988B3288
15185A49747O1528q3677b8228B38169j1730E0988P0703K13894j53710h1500e144
15173a50970C5680J41391F2322a26566A91017i8131B11831G3796a2012q021C01851
15161B5049g0158A29830P9530B9185J72669h7897K7868C53256a75787C2284R8277
15150A30561R0910a29609A36064J69924A08166M6607n0510B1850c6990r6092B46642
15138B96980N895H1501a71050D865J78005o6408L24958b4060B41350J47820a79561
15126D8713J47986F3108b2011A99914p2683K87275j79932G3270L0609r402J78025
$$ y = [-166089, 197512, 45869, -165734, -56131, 59221, 28624, -48659, 214162, -90755, -26908, 98300, 148546, 46671, 96574, 396773, -172018, 34480, -9519, -330711, -14920, -128987, -20988, 23288, 149747, 211275, 127598, -28228, 238169, 226439, 50988, 121691, 335585, 181875, -81500, -5144, -150970, 35680, 177071, 62322, -126566, 191017, -98131, 211831, 73796, -12012, -20033, 301851, 25049, -70158, 129830, 209360, 29185, 201854, -87897, -60029, 353256, -175787, 32284, 130561, 221471, -129609, 136064, 305988, 108166, 154773, 104263, 21850, -36990, -133082, 246642, 296980, 302875, 81501, -171050, 4865, 182870, 116462, 441420, -24060, 241350, 389170, -179561, 48713, 196699, 63108, -22011, 199914, 127231, 414506, 234574, 73270, 103879, 94477, 272502]
15115B72502n9931A0850K84616K7695j13628e3826l7136C0969J96675L36485I1859
15103B84920E2185a9976j42698E212J334K42734D1907J34017K46145a40675B42050
15091i6831B52642N066M035A1299J32367a41620B61745E7722J55504a18363A10860
15079A26766B1172J38937J00957A22359f5024E40047A61934J97869j25920A02530
15068F656a52B13071n8275c3517G8324c7269B14519c3737C7706K81752b11361
15056A03728O3595a63338d6845I6358K39304r2633K47667j34029J7709P6070L0405
15045D80851A25845L03934o4365D6845L2654P7721p394K6467J68736j12887l1490
15034B00652J25768P5530H2834M37086A65564L17108q5679K61253j00793k64845
$$ y = [272502, 212571, 10850, 295466, 323161, 209533, -53826, -90962, 30969, 227644, 564129, 91859, 284920, 52185, -19976, -162674, 5212, 6546, 249280, 41907, 175924, 422069, -140675, 242050, -96831, 252642, 257708, 261743, 11299, 143666, -141620, 261745, 57722, 213226, -118363, 110860, 126766, 21172, 160109, 261066, 122359, -65024, 540047, 161934, 359803, 233883, 102530, 6656, -152, 213071, 154796, -33517, 78324, -37269, 214519, -33737, 37706, 319458, -211361, 103728, 167323, -163338, -46845, 96358, 335662, 243029, 490696, 356667, 374376, 450446, 480851, 125845, 429779, 365414, 46845, 79499, 157220, 149826, 176293, 345029, 232142, 200652, 326420, 401950, 82834, 519920, 165564, 482672, 396993, 658246, 557453, 292608]
15024B92608K71128k32657J68527p3931A24937D8346K7872J18400q123J93799
15014C80294K6031j31709j33618R5730p2439K79738B21459J18537r3433J36176
15004C82739K46172m3723k22027k9619E7362K07255B7374J45143F7728K95393
14994C63121J90714B62241J23859j92996j2385K9936K93811A83722L77085B36597
14983C74615J63924A29458K11981j09459H929N69658j03622L3997J9806L6088
14973E64856B79114o2461K53023G0788M40856j96258M91077l85660A51387J78362
14963C29749A55121P9296K96948j05751O5825j38009J81764j55386r8382P1985
14953C53411R6449H2384L18536p6991q6834J62783j25204J16564A30889K69787
$$ y = [292608, 563736, 331079, 499606, 425675, 124937, 48346, 76218, 194618, 186495, 380294, 406325, 274616, 140998, 236728, 164289, 444027, 221459, 339996, 246563, 382739, 628911, 585188, 363161, 333542, 57362, 264617, 27374, 172517, 67728, 363121, 553835, 262241, 386100, 193104, 180719, 210655, 504466, 183722, 560807, 236597, 374615, 538539, 129458, 341439, 231980, 8929, 578587, 474965, 508962, 528768, 564856, 279114, 216653, 469676, 70788, 511644, 315386, 806463, 420803, 151387, 329749, 155121, 234417, 531365, 425614, 491439, 353430, 535194, 379808, 281426, 353411, 449860, 82384, 400920, 323929, 237095, 399878, 274674, 391238, 130889, 400676]
14943D00676j28001g1018D59800M7749L2049j18507j07421J73357j22125J08765
14933D73667j17158R0615r7338K19817J19684k43285P3455o6505N42264j87233
14923H07983J19164k96180J70640j93282k1240K81282m2706k51808J28191q1307
14913F20737J44357l46679K77788k39334K50789p2170k6988B61246J3091b8301
14902C62691r8334K66407Q3400C00632j41338M10341l1884J08970B82886Q2223
14892C65109j0252Q5226j35134J92877N7101M9706L6390L8190B50996N54704k70383
14881E35317J1541j58325K24505r8256k55876M30675l34743L59198q6143j52659
14871D75234A98079L66693k24191N35643l85073q5379K21811k03245O4872k1927
$$ y = [400676, 272675, -71018, 459800, 507549, 539598, 421091, 313670, 487027, 364902, 473667, 356509, 447124, 349786, 569603, 689287, 446002, 519457, 452952, 995216, 807983, 927147, 630967, 801607, 608325, 587085, 868367, 825661, 573853, 702044, 620737, 765094, 418415, 696203, 456869, 707658, 635488, 608500, 261246, 274337, -28301, 362691, 264357, 530764, 614164, 300632, 159294, 569635, 537751, 646721, 282886, 365109, 354857, 440083, 304949, 497826, 554927, 604633, 641023, 679213, 250996, 805700, 535317, 546858, 388533, 613038, 514782, 258906, 689581, 354838, 714036, 627893, 475234, 198079, 564772, 340581, 876224, 491151, 405772, 627583, 424338, 489210, 467283]
14861D67283j16930B5644M69056j58745J50885J98835j68620J1387A1301M97107
14851E08408O9239j83816J65752m604q477o9078M6780k23099M82207j87194k09696
14840C86422K87115J04940k02395R4347j63731J22439N3141k2713K86545k64656
14830F81454j08603q8643M13769m31838K14616j09167N8719B82309R8994n11j00263
14819B80529M8938J68363K21939j84907L7089K9622j47545K94478l48990A47565
14808F23610J96199B62027O6742O5145N6365j72206L18336L7281K78403C54331
14797E92812K27386k41976R1130n5224R0529j91153j16849K00797J87505j56165
14787F28792K01303B04774L69737l4481K8136l4223l0699K2556J28394A99210
$$ y = [467283, 350353, 25644, 494700, 335955, 486840, 685675, 517055, 528442, 11301, 508408, 577647, 393831, 559583, 554979, 546502, 477424, 524204, 301105, 783312, 596118, 386422, 673537, 778477, 576082, 670429, 506698, 629137, 682278, 659565, 946110, 681454, 572851, 484208, 897977, 466139, 680755, 571588, 630307, 282309, 381303, 380792, 280529, 329467, 497830, 719769, 534862, 571951, 601573, 454028, 748506, 399516, 147565, 623610, 819809, 262027, 328769, 393914, 450279, 278073, 596409, 633690, 912093, 354331, 592812, 820198, 578222, 669352, 614128, 704657, 513504, 396655, 597452, 784957, 628792, 830095, 204774, 574511, 540030, 568166, 533943, 503244, 525800, 654194, 199210]
14776D50491N1108J11821J98291n4445k87102J03604k46537M62954O9511q4827
14766G74869j48506P574n2387K4699j98277L59981J0491O8640k16014n1616R7196
14755F76650j10564J89007j32333m9505o9642K50340C55122N49028k10422J65165
14745H58893J7934k26497l4707M33004j29674j66628k94515K32229L6128O4722
14735G90889j19674N1003K55715j9971J36810k44566K47794k16914K97408k98267
14725H80227L64389m5173j41299j61851K92241j33649K09294k53858k79J61661
14715A171703P7203m72505K83902k62836L16058n49769N08425J2962k32753n5683
14705G96707K30950k05152R7082P1481P9017n9665m9839R0837J44147j56294P8722
$$ y = [450491, 501599, 613420, 811711, 757266, 470164, 573768, 327231, 790185, 859696, 774869, 626363, 633937, 581550, 606249, 407972, 767953, 778444, 847084, 631070, 579454, 676650, 566086, 755093, 622760, 573255, 503613, 753953, 355122, 904150, 693728, 858893, 876827, 650330, 615623, 1048627, 918953, 752325, 457810, 690039, 726167, 790889, 671215, 722218, 977933, 957962, 1094772, 850206, 1098000, 881086, 1178494, 880227, 1244616, 1199443, 1058144, 896293, 1188534, 1054885, 1264179, 1010321, 1010042, 1171703, 1248906, 776401, 1060303, 797467, 1113525, 563756, 1072181, 1085143, 852390, 796707, 1027657, 822505, 919587, 991068, 1070085, 1010420, 960581, 1051418, 1195565, 1039271, 1117993]
14694A117993L84236l80059l82208L28768l21127L6561J71823K81562j20986k01799
14684I14764L8801r1779J28692k03607M68056l6940j57665j75884N2901J81562
14674A118901j41131k5561J86730j66444J98413K86904j44013l99125K81826l21168
14664H75332J35153K01739Q1477m65193K40830M4000K56444k22181k13944K18591
14654A152248k25502J22784j21409M4117K6056N54739j11492p8073j39140M16747
14644A641075l52492L44732m70203M37921o29026K87864P4687L60274m57538j11887
14634A125407k0304J71086j76129K45163K4578j80327K66656L04554n48522L60564
14624A572726j63819L8j35677m4018J79672P9664J66468l67276o8004N31342n98768
$$ y = [1117993, 1502229, 1122170, 739962, 1068730, 747603, 784164, 955987, 1237549, 1116563, 914764, 953565, 861786, 990478, 786871, 1254927, 1217987, 1060322, 884438, 937339, 1118901, 977770, 952209, 1138939, 972495, 1170908, 1457812, 1313799, 914674, 1196500, 875332, 1010485, 1212224, 1293701, 828508, 1069338, 1113338, 1369782, 1147601, 933657, 1152248, 926746, 1049530, 928121, 972238, 998294, 1553033, 1441541, 1363468, 1224328, 1641075, 1288583, 1633315, 1163112, 1601033, 972007, 1259871, 1334558, 1694832, 1237294, 1125407, 1105103, 1276189, 1100060, 1345223, 1369801, 1189474, 1456130, 1760684, 1212162, 1572726, 1408907, 1408945, 1273268, 1229250, 1408922, 1488586, 1655054, 1287778, 1219774, 1751116, 1152348]
14613A152348L12633j19212K58284K75420j6226n94087K43976J22935J01508m2062
14603A695517P6752l55332M27751q1619k59317N33983o42658O49255j84103k95692
14593A564537M65975l17217L31099r3051k41870J15815m0983L90777p4214p8110
14583B022758o3953M7496P5919j40092j09940L98472M966J06103m61441N44779
14573B425067J1947K5076j66819J55802j63499J90588m1592K62947j412K54348
14563B952453o68874O02138l2943J37811j92413L50413K44947M1203m13810Q61757
14553C882682J4548R60896K63434J313356K439623M309456P046208J1182926J54947
14544C1568076j2590626H906632l511321j650376r84196o2608n36748N30588l24433
$$ y = [1152348, 1464981, 1345769, 1604053, 1879473, 1863247, 1269160, 1513136, 1636071, 1737579, 1695517, 1772269, 1416937, 1844688, 1763069, 1503752, 2037735, 1395077, 2044332, 1860229, 1564537, 2030512, 1713295, 2044394, 1951343, 1709473, 1825288, 1784305, 2175082, 2100868, 2022758, 1958805, 2006301, 2082220, 1942128, 1832188, 2230660, 2235626, 2341729, 1880288, 2425067, 2437014, 2462090, 2295271, 2451073, 2287574, 2478162, 2436570, 2699517, 2698105, 2952453, 2283579, 2885717, 2852774, 2990585, 2798172, 3148585, 3393532, 3434735, 3020925, 3882682, 3897230, 4858126, 5121560, 6434916, 8874539, 13183995, 20230203, 31413129, 31568076, 18977450, 8906632, 5395311, 3744935, 2760739, 2698131, 2161383, 2691971, 2367538]
14535B367538K4613M8250l80147L99589q9518j78397L47004j30869L18313r3275
14525B633101n40431P35680j05801m66903M22965m2223L68402j39805l7266J78995
14515C006714J42993l23782K17458q9543K28798j05284o4093j53064M15401l72663
14505B902935l960N8279J44463K98301l80118M58158K5925O1129j03038k24573
14495C237501J46467J35417J2032K49215k16209M65262m64923K29663N5678k81788
14485C568315K10681J70782j42082O93223k08142l49476K23183m5971j09847K31378
14475D242044R1582q9827k0077K75542n4524m2003M5663K42558j34095J40854
14465D697717N7711K6933J14738J11422K64964k42620L26075J22728j72590P7063
$$ y = [2367538, 2392151, 2440401, 2060254, 2459843, 2370325, 2191928, 2538932, 2408063, 2726376, 2633101, 2092670, 2828350, 2722549, 2255646, 2678611, 2636388, 3004790, 2864985, 2827719, 3006714, 3149707, 2825925, 3043383, 2953840, 3182638, 3077354, 3013261, 2860197, 3275598, 2902935, 2898975, 2957254, 3101717, 3400018, 3019900, 3478058, 3503983, 3565112, 3462074, 3237501, 3383968, 3519385, 3531417, 3780632, 3564423, 4029685, 3564762, 3794425, 3850103, 3568315, 3778996, 3949778, 3807696, 4500919, 4292777, 3943301, 4166484, 4120513, 4010666, 4242044, 4333626, 4243799, 4223722, 4499264, 4444740, 4402737, 4448400, 4690958, 4556863, 4697717, 4755428, 4782361, 4897099, 5008521, 5273485, 5030865, 5356940, 5479668, 5307078, 5384141]
14455E384141k99770M14397r4116K79431j23901p213M77027J40645j46866j18578
14445E905197m2630L04144n0838K69246l31401L81366J24386N5332K29408j37022
14435F707188J01670r5721J72266J18673K53021j33412K90900J35750n58243N34250
14425G526342L57977J17678R598J40247M44168J8724o9761l2753K24602L88448
14415I125270r2146J94129P6553j19218K35848n8625M60299O6890N11118j82145
14405A0217973M35203j87318M69565K6570J93199j00635M67204l9519J15594K53099
14395A1850935K57294J32158L14542J14052J68228J60843J67874L20829J7357
14386A3504112M44117N70868k41745M73554P3852L71543J79618L28772N04822
$$ y = [5384141, 5084371, 5498768, 5404652, 5684083, 5560182, 5552969, 6029996, 6170641, 6023775, 5905197, 5862567, 6166711, 6115873, 6385119, 6053718, 6435084, 6559470, 6614802, 6844210, 6707188, 6808858, 6713137, 6885403, 7004076, 7257097, 7123685, 7414585, 7550335, 6992092, 7526342, 7884319, 8001997, 8011595, 8151842, 8596010, 8614734, 8544973, 8512220, 8736822, 9125270, 9033124, 9227253, 9303806, 9184588, 9420436, 9361811, 9822110, 9889000, 10400118, 10217973, 10653176, 10465858, 10935423, 10961993, 11155192, 11054557, 11521761, 11482242, 11597836, 11850935, 12108229, 12240387, 12554929, 12668981, 12837209, 12998052, 13165926, 13486755, 13504112, 13948229, 14519097, 14277352, 14750906, 14824758, 15196301, 15375919, 15704691, 16209513]
14377A6209513M17954l5640J41158K58647N04483L26160K60478O49236j23938
14368A8608051Q62025K56774J51775M44995N27926L62902J11771O25539O50080
14359B2601838K73660M89710N08664O54366L93073Q90790K21265N34623Q72574
14350B7440563M82763N82121Q90093N95031L57711J072562R15851N63405N55649
14341C3455749J142572N96797R56267J064009P57231J141497J047812J067674
14333D1229608J071203J314322J086089J350983J442946J403543J226160J753817
14325E1878671J666809J835430J416685J889846J889062J853106K279451J962118
14317F6671178K419922K389406K472461K376920K706894L028498L105430L347915
$$ y = [16209513, 16627467, 16591827, 16732985, 16991632, 17496115, 17822275, 18082753, 18731989, 18608051, 19470076, 19726850, 19878625, 20323620, 20851546, 21214448, 21326219, 21951758, 22601838, 22875498, 23365208, 23873872, 24528238, 24921311, 25812101, 26033366, 26567989, 27440563, 27923326, 28505447, 29395540, 29990571, 30348282, 31420844, 32336695, 32900100, 33455749, 34598321, 35195118, 36151385, 37215394, 37972625, 39114122, 40161934, 41229608, 42300811, 43615133, 44701222, 46052205, 47495151, 48898694, 50124854, 51878671, 53545480, 55380910, 56797595, 58687441, 60576503, 62429609, 64709060, 66671178, 69091100, 71480506, 73952967, 76329887, 79036781, 82065279, 85170709, 88518624]
14309H8518624L425663L226698L891512M160856M441876M367525N039046M818471
14301A21890271N353759N655166O001505O085553O478323P383617P604096P858373
14293A74310663Q353882Q868843R166620R867183J0311634J1234187J1559283
14286B43672295J1481194J2323593J2941009J3110653J3521128J3702904J3529841
14279C34282617J4093604J3597761J3201099J2551305J1514157R433107O412167
14272D15085817K781449K533183J222565l14166R33573j392418m925185p180604
14264D08744214r159838j1172177j2402387j3592115j4647099j4563574j4905164
14257C18301860j5093304j4404908j3808833j3315873j3185209j2796593j2085975
$$ y = [88518624, 91944287, 95170985, 99062497, 103223353, 107665229, 112032754, 117071800, 121890271, 127244030, 132899196, 138900701, 144986254, 151464577, 158848194, 166452290, 174310663, 182664545, 191533388, 200700008, 210567191, 220878825, 232113012, 243672295, 255153489, 267477082, 280418091, 293528744, 307049872, 320752776, 334282617, 348376221, 361973982, 375175081, 387726386, 399240543, 408673650, 415085817, 417867266, 420400449, 421623014, 421308848, 422242421, 420850003, 415924818, 408744214, 399584376, 388412199, 376009812, 362417697, 347770598, 333207024, 318301860, 303208556, 288803648, 274994815, 261678942, 248493733, 235697140, 223611165]
14250B23611165j1383959j0462031j0704860r592136q941928q634686p683245
14243A56208320p449965p129392o947896o367011n587749n670324m731381n360998
14235A06963604m567719m649930l993075l554352l489142l300374l931568k870532
14227G6606912l094171k558967k949114k234517k544803k408945k081085j606671
14219E7128639k176661k060590j642483j881355j343425j558767j158102j378531
14211D3928725j644794j353081r23888j133710j160973q23312j289750q52961
14203C4746256r52526r18098o36710q64977j069017j037862m62123j049120m52489
14194B7303334o73518o61365o83794o27276l30660r70545l71222q13739k84808
$$ y = [223611165, 212227206, 201765175, 191060315, 181468179, 172526251, 163891565, 156208320, 148758355, 141628963, 134681067, 128314056, 122726307, 117055983, 112324602, 106963604, 102395885, 97745955, 93752880, 90198528, 86709386, 83409012, 79477444, 76606912, 73512741, 70953774, 68004660, 65770143, 63225340, 60816395, 58735310, 57128639, 54951978, 52891388, 51248905, 49367550, 48024125, 46465358, 45307256, 43928725, 42283931, 40930850, 40006962, 38873252, 37712279, 36888967, 35599217, 34746256, 33793730, 32875632, 32238922, 31373945, 30304928, 29267066, 28804943, 27755823, 27303334, 26629816, 25968451, 25284657, 24657381, 24326721, 23356176, 22984954, 22171215, 21886407]
14185B1886407n25998n36924n13793l07247n42960n00313j73231l65096p23141
14176A7697704k45616k50525l63716k42639j12228n76275l48085l20424J07068
14167A5345264o25558q8580m82480j19852l63415k58902O2443p24294r6845j15832
14157A2531949k39756j21485l14694j57012j72556j24760J16748o22012N4430
14148A0950852m64785j17129K22043m31619k93379M8615k45763L0269o8877n56335
14138I073892J90964l64432j79092r7701p9377N573l78427R2790j694p2191n97542
14127G592763J79189k97471L44566o06596J98949j14164J276j0049l74830L10097
14117G223730j62341k37229j76625J15863l44457k597q3501m17936K03431J03254
$$ y = [21886407, 21360409, 20823485, 20309692, 20002445, 19459485, 18959172, 18785941, 18420845, 17697704, 17452088, 17201563, 16837847, 16595208, 16482980, 15906705, 15558620, 15238196, 15345264, 14719706, 14631126, 14148646, 14028794, 13665379, 13406477, 13468920, 12744626, 12647781, 12531949, 12292193, 12170708, 11856014, 11699002, 11526446, 11401686, 11518434, 10896422, 10950852, 10486067, 10368938, 10590981, 10159362, 9865983, 9914598, 9668835, 9699104, 9630227, 9073892, 9264856, 8900424, 8721332, 8623631, 8544254, 8549827, 8171400, 8264190, 8262496, 8190305, 7592763, 7771952, 7474481, 7819047, 7212451, 7411400, 7297236, 7298512, 7288463, 6913633, 7223730, 7061389, 6824160, 6647535, 6763398, 6418941, 6416344, 6332843, 5914907, 6118338, 6221592]
14107F221592l11692l8547j09298J54471l45976j68954k9351K30975j7925j52081
14097E433214j82439k06618M02050j01046j60324L0404l24998j12646k39079J06990
14087D645508J51257j14760k3010j36173J41917R0964l47362J05164L5248k56081
14077D292672n7721j07493J88326m77790K79094n6687j32591j31301K35380P3051
14067D104940k12413l8064k45980M5553J92495k94742j697K46966K52024l93959
14057C655123n7711k05456M20751p716l65836J09929k13159k06639K40356l15028
14047C054614M21302k26605k06572k81070J70977L45764k29130k38P3939k38521
14037B884460J70702l03149K02099L1369n3986O7200j34256r7439J00637m28690
$$ y = [6221592, 5909900, 5871353, 5762055, 5916526, 5570550, 5401596, 5372245, 5603220, 5585295, 5433214, 5250775, 5044157, 5446207, 5345161, 5184837, 5215241, 4890243, 4777597, 4538518, 4645508, 4796765, 4682005, 4658995, 4522822, 4664739, 4755703, 4408341, 4513505, 4548753, 4292672, 4234951, 4127458, 4315784, 3837994, 4117088, 4060401, 3927810, 3796509, 4031889, 4104940, 3892527, 3854463, 3608483, 3654036, 3846531, 3551789, 3550092, 3797058, 4049082, 3655123, 3597412, 3391956, 3812707, 3804991, 3439155, 3549084, 3335925, 3129286, 3369642, 3054614, 3475916, 3249311, 3042739, 2761669, 2932646, 3278410, 3049280, 3049042, 3122981, 2884460, 3055162, 2752013, 2954112, 2985481, 2931495, 2998695, 2864439, 2767000, 2867637, 2438947]
14027B438947K82005j75151r4687J23521J05466q4208J35532m69147O4209l7863
14017B288624N1203J43278l13104J00311J33810l9025j73780j52592N4457K14468
14007B307650J8980j95801l252L8154L43539k43318j59899L85473o72003L46730
13997B166253N5973j09567l5586J26973M81509k17341K20490N16703J005582L874844
13987H085833N694397J1764455N459783p354020j0443534n032517k324203j425067
13979D425127m06852o81437j03458k35918k33525k06817m9146r4791p2253j57951
13969B182979K08181k12768J90381k83260K09281l19272J41660Q2624l17673k0279
13959A861854R2833J86033k29645L22650m23279J04669O1011j82720k19517J02491
$$ y = [2438947, 2720952, 2545801, 2451114, 2574635, 2680101, 2595893, 2731425, 2262278, 2326487, 2288624, 2339827, 2483105, 2170001, 2270312, 2404122, 2365097, 2191317, 2038725, 2093182, 2307650, 2326630, 2130829, 2127577, 2165731, 2509270, 2265952, 2106053, 2491526, 1819523, 2166253, 2222226, 2112659, 2077073, 2204046, 2685555, 2468214, 2688704, 3205407, 4210989, 8085833, 13780230, 25544685, 31004468, 23650448, 13206914, 8174397, 5850194, 4425127, 4018275, 3336838, 3233380, 2997462, 2763937, 2557120, 2507974, 2413183, 2340930, 2182979, 2391160, 2178392, 2368773, 2085513, 2294794, 1975522, 2117182, 2199806, 1882133, 1861854, 1954687, 2140720, 1911075, 2233725, 1810446, 1915115, 1976126, 1793406, 1573889, 1676380]
13949A676380J26307J31735m45114M46431m8366q0436J7406l17738n2457J61252
13939A615400o7921k2613K04920k04656N7806k00170J73944j36462J22433l33839
13929A208842J41183R7125J58891k30477k27059o0340J20537K08717l2597J26459
13919A511281p1139j29596j9400J29606M2889k83070J36894J86927j23193j41634
13909A239565n6618p059k245L25288j22700p1844j9595l23956O11208m13565M47646
13898A606125p67729L08166l2139J64369R0085n0397k23002l4330j19922K0223
13888I61449j84924K87593k05432J6181K51821K63982l48812j5756N60463n67809
13878A018756J56162n1100k2150l32036N81791k34589K73230l41152j63283P4703
$$ y = [1676380, 1802687, 1934422, 1489308, 1935739, 1887373, 1806937, 1824343, 1506605, 1454148, 1615400, 1547479, 1524866, 1729786, 1525130, 1582936, 1382766, 1556710, 1420248, 1542681, 1208842, 1350025, 1447150, 1606041, 1375564, 1148505, 1088165, 1208702, 1417419, 1384822, 1511281, 1440142, 1310546, 1291146, 1420752, 1463641, 1180571, 1317465, 1504392, 1381199, 1239565, 1182947, 1175888, 1173643, 1498931, 1376231, 1304387, 1284792, 960836, 1572044, 1158479, 1606125, 838396, 1146562, 1114423, 1278792, 1368877, 1318480, 1095478, 1061148, 941226, 961449, 776525, 1064118, 858686, 874867, 1126688, 1390670, 1041858, 1026102, 1586565, 1018756, 1174918, 1123818, 1101668, 769632, 1351423, 1116834, 1390064, 1048912, 885629, 960332]
13868I60332L7109j67551K94556j83172L5615R9611k2105j45366J01964j61307
13858H49686K34553J371J799j46643L05687m33755m2495J8835K41605k43889J62017
13847I48771P3365j82283j75262J22332j75204L2526J65241O4753j45563O0549
13837G89225j96846o5689J33240J25373K1546l30070J70687K36522J08897j14448
13827H78437j99383J16602K4233K70864j95754M0678j47165k03960K19042l177
13817H00417j83356j44461M1748K52188L12509m95998J26598J72135J25636j85644
13807H21772j57098j02043O0862B42365N02275P8684k27356q9232L08887j59604
13797F56019K40174k60284q7381K29462L2350O8393m21663K00086K02254k60520
$$ y = [960332, 997441, 829890, 1124446, 941274, 976889, 1076500, 1054395, 909029, 1010993, 849686, 1084239, 1085610, 1087409, 940766, 1246453, 812698, 770203, 789038, 1030643, 786754, 948771, 1022136, 839853, 664591, 786923, 611719, 644245, 809486, 874239, 728676, 789225, 592379, 526690, 659930, 785303, 806849, 476779, 647466, 883988, 992885, 878437, 679054, 795656, 819889, 1090753, 894999, 935677, 788512, 584552, 803594, 800417, 617061, 472600, 514348, 766536, 1079045, 583047, 709645, 881780, 1007416, 821772, 664674, 562631, 623493, 242365, 744640, 823324, 595968, 506736, 815623, 656019, 896193, 635909, 548528, 777990, 810340, 878733, 457070, 657156, 859410, 598890]
13787E98890L02404l56055n5366R9275K10021L6856k09541J19064N7243k88966
13777E13825J17163J02939l7189M3528C67556J35276J43253j75371N14034m47740
13767E37008J43083p9210j26646R3173O1626J89559k31413L15706o0623k32257
13757F10006Q6286l1676R3769q2059j52237K40609J15331l38837J45113q3290
13747F03015J01067C05993K25485K17744l62005L09490k86801J34338l7404j2659
13737D94181j65663K76568j60763j11417J22339K7989J55047k75864R2134J06649
13727E61200k31418j05518L02699m4594A66121N38557m5626B80099J46006K40456
13717F66561J2865q7610B10884K05909m3775L04723j11161A68161N83246k67066
$$ y = [598890, 901294, 545239, 489873, 589148, 799169, 836025, 626484, 745548, 802791, 513825, 630988, 733927, 696738, 740266, 367556, 502832, 646085, 470714, 984748, 537008, 680091, 600881, 474235, 567408, 629034, 818593, 587180, 902886, 842263, 610006, 696292, 664616, 758385, 676326, 524089, 764698, 880029, 541192, 686305, 603015, 704082, 305993, 531478, 749222, 387217, 696707, 409906, 544244, 506840, 494181, 328518, 605086, 444323, 332906, 455245, 483234, 638281, 362417, 454551, 561200, 329782, 224264, 526963, 482369, 166121, 704678, 659052, 280099, 426105, 666561, 679426, 591816, 210884, 416793, 373018, 677741, 566580, 168161, 751407, 484341]
13707D84341J67529F9164J25733L03486P378o8801j17769J04558n3442L058J44987
13696E18352J74964l11870O5777L7522B29639K85836k07395Q6756p2072J29226
13686D51990J78514k05981l5898M44670j77015o2741k52890j8935K56797j92802
13676C85709m3411J70096A22544K84790K13878A75567L22026r9306j1723P1291
13666D57855b23805E76943k52519m1211J57566J00757k06475J86504O2200j75619
13656D08146O3416q2134j62973J92343K42375B31711J60012J04066J62150k63090
13646C94849m964M84538k40538j18092A26300K30104J52955o9177J5554p4618
13636C81118J8399p3740J07762K49191j49500k17370B8696K52190M26545l29717
$$ y = [484341, 651870, 69164, 194897, 498383, 505761, 436960, 319191, 423749, 370307, 373365, 518352, 693316, 381446, 447223, 484745, 229639, 515475, 308080, 394836, 322764, 451990, 630504, 424523, 388625, 833295, 656280, 593539, 340649, 321714, 578511, 385709, 342298, 512394, 122544, 407334, 621212, 175567, 497593, 398287, 386564, 457855, -223805, 576943, 324424, 283213, 440779, 541536, 335061, 521565, 583765, 408146, 471562, 389428, 226455, 418798, 661173, 231711, 391723, 495789, 657939, 394849, 389885, 874423, 633885, 515793, 126300, 356404, 509359, 440182, 455736, 381118, 399517, 325777, 433539, 682730, 533230, 315860, 28696, 280886, 707431, 377714]
13626C77714j67082L73398p302A20738R2227Q8778K99634E9962M42542k12224
13616B90280A28728M13282r0545d8924B23488E0365K31499k1623O9551p0972J8964
13605B77784J17458Q1602G8048M20186B35838k5838K09323Q4608m4858k920J07776
13594E63929Q1747p9680K0255A29968h2053A45710J40950L53591I0459L13233
13584D03692A67046J85387J96376k13811p6818k193P6831r5819K11257Q9438G5779
13572B90369j00397J31722K01310A33848J52912m004J9912P0570j73976J38026
13562C37288A49122R0248R927m5740m0703L39185B24732K60102A10898K22499
13552C33397A48954j220K66083o243j73407r5449J57213J28421A96629p7208J27540
$$ y = [377714, 210632, 584030, 576728, 120738, 212965, 301743, 601377, 59962, 502504, 290280, 128728, 542010, 451465, -48924, 223488, 50365, 281864, 260241, 329792, 258820, 277784, 395242, 476844, 78048, 498234, 235838, 210000, 419323, 503931, 459073, 456153, 563929, 645676, 565996, 586251, 129968, -82053, 145710, 286660, 640251, 90459, 403692, 167046, 352433, 548809, 334998, 258180, 255987, 332818, 236999, 448256, 537694, 75779, 290369, 189972, 321694, 523004, 133848, 286760, 282756, 302668, 373238, 199262, 337288, 149122, 239370, 249297, 203557, 162854, 502039, 224732, 484834, 110898, 333397, 148954, 147734, 413817, 407574, 234167, 138718, 295931, 424352, 196629, 119421, 246961]
13541B46961o242h1600b88D13034j78156M13783j51758k44999J19644j78789O993
13530A99752J68567d7480D45937A07230K59131A74464L49590k41142J60677N0109
13520D93698j59487q87I4224J90373I5010J00036J64759N74n9067j36295J32917
13509B97934J21264A97379r2677k6636K89543j18277L2156p6813o0669b1151C06136
13497C12248Q2456J70605B74116B078L1618N4965J06225J91073F5267b43421C75744
13485e9481A1789L78751A44436K40837A30312L36694M3675p3708e8539m2244B35966
13473b56846C04671b088C40434I8785j622M30950I4799J70020j14866J30386l4894
13462B45445o8104N6846a14966A2111K35283N1078D5584a68147l9687D02156a8528
$$ y = [246961, 240719, -81600, -288, 413034, 234878, 648661, 496903, 251904, 371548, 192759, 199752, 368319, -47480, 445937, 107230, 366361, 174464, 524054, 282912, 443589, 493698, 334211, 333324, 94224, 284597, 95010, 195046, 359805, 360379, 301312, 165017, 297934, 419198, 197379, 104702, 78066, 367609, 249332, 281488, 204675, 144006, -21151, 306136, 312248, 394704, 565309, 274116, 2078, 33696, 88661, 194886, 385959, 65267, -243421, 375744, -59481, 11789, 390540, 144436, 385273, 130312, 467006, 510681, 436973, -58539, -100783, 235966, -256846, 304671, -2088, 340434, 98785, 97163, 528113, 94799, 264819, 149953, 280339, 245445, 177341, 234187, -114966, 12111, 247394, 298472, 45584, -168147, -207834, 402156, -18528]
13450C19689o5758h9309B23554R9177r5153l0699o2948K94794A55898j3154O96
13439A43440m88L15436K1880i0345A64983L55451B57374k2984J08789a42173C58488
13427I8356b1342A61795M9001j7212J19662J60560b9210B64175J16449A4778c4722
13415E0970K07418C9257j7803L23815o7417b41687F6718M04521G7034L23377j10548
13404B89863E5433d466A11825O352O119f761A68618M6231G4693J03868N2272j6584
13392B14249c4926A64831n3771P5640G5601J20979H0216J27650a73166B80278
13381A25376L7674a22560L0881C75464F429J70333A4737n864J25819K61999I6676
13369D38070A10959K79821j70681m5835R9545l5477n7063b0685E926N9832L9964
$$ y = [319689, 253931, -89309, 223554, 322731, 227578, 196879, 133931, 428725, 155898, 142744, 143440, 142952, 458388, 480268, -90345, 164983, 520434, 257374, 234390, 343179, -142173, 358488, 98356, -21342, 161795, 210796, 193584, 313246, 473806, -29210, 264175, 380624, 14778, -34722, 50970, 258388, 39257, 21454, 345269, 277852, -241687, 66718, 471239, 77034, 400411, 289863, 55433, -4466, 111825, 118177, 124296, -6761, 168618, 214849, 74693, 178561, 230833, 214249, -34926, 164831, 111060, 186700, 75601, 196580, 80216, 207866, -173166, 280278, 125376, 163050, -122560, -91679, 375464, 6429, 176762, 14737, 8873, 134692, 396691, 96676, 438070, 110959, 390780, 220099, 174264, 273809, 238332, 181269, -20685, 5926, 65758, 105722]
13358A05722R139J71965a35320k0994B25837a8522I5267P0792L4459A0722J50129
13347A60851e8397C466N33433A30994j6251P6407J51406a09362O02D9861J49263
13336A99124n0977Q0832r8415L17971j25177j04911b5271G4600K57424j9246a46204
13324E12062j09149A57333F2633J61615A03835c4134C46996A41255J56809K99941
13314E98005B12248O5899q1548E6358L71841j64339j9213i3090A88291a3949B76545
13302D10383A41603a0925n6436G6382K81274B7067R246K14539p783A16365A6555
13290A12467J64023j27804m0115J24526k3031E9873K31632k6764f0250A88982
13279E3708J26079c599B66075G2000c53507A40999O2251p9665c9740A92799L7085
$$ y = [105722, 114861, 286826, -135320, -156314, 225837, -18522, 95267, 166059, 200518, 10722, 160851, -58397, 3466, 536899, 130994, 114743, 191150, 342556, -109362, -108760, 49861, 199124, 148147, 228979, 130564, 448535, 323358, 218447, -25271, 74600, 332024, 312778, -146204, 512062, 402913, 157333, 62633, 224248, 103835, -34134, 346996, 141255, 298064, 598005, 212248, 278147, 196599, 56358, 428199, 263860, 244647, -93090, 188291, -13949, 276545, 410383, 141603, -10925, -67361, 76382, 357656, 27067, 36313, 250852, 243069, 116365, 16555, 112467, 276490, 148686, 108571, 233097, 210066, 59873, 291505, 264741, -60250, 188982, 53708, 179787, -3599, 266075, 72000, -353507, 140999, 203250, 123585, -39740, 192799, 229884]
13268B29884c17759J14954d8779C38610j53231E6394K47213J120F0054A5338c0452
13256B14624B3540J86615d632D7008B898L1204i102E48103d09308B33337F5258
13244E02386c067A8192R9601K39808B9736K9206d5558B19314Q995F4466h2697
13232A3695O5442J51398k5609K0266f3661A79091k0825J51575n7064a05900a1132
13220C342J32710B2035K78345n8604l8131O9797A01054a22579l3749B33778G6541
13208B28609a86676e5914A75607g3657F3287a55834A69198C0084a75794C75733
13197D4534a29900A42137a01005D4662K19281a6524A44359k1643b9150q9507B10268
13185B00735b4930A0597K27104a39493L6644A91461j7292l3486K90022j40595
$$ y = [229884, -317759, -202805, -48779, 338610, 185379, 56394, 303607, 304727, 60054, 15338, -30452, 214624, 23540, 210155, -4632, 47008, 2898, 34102, -9102, 548103, -409308, 233337, 65258, 502386, -3067, 18192, 117793, 357601, 29736, 58942, -45558, 219314, 228309, 64466, -82697, 13695, 79137, 230535, 204926, 225192, -63661, 179091, 158266, 309841, 252777, -105900, -11132, 3342, 136052, 22035, 300380, 241776, 203645, 273442, 101054, -122579, -156328, 233778, 76541, 228609, -186676, -55914, 175607, -73657, 63287, -155834, 169198, 30084, -175794, 375733, 44534, -129900, 142137, -101005, 44662, 263943, -16524, 144359, 122716, -29150, -118657, 210268, 200735, -24930, 10597, 237701, -139493, -102849, 191461, 174169, 140683, 430705, 290110]
13175B90110H5286f8193n0823A8770b7175B04420M5333G036J67513f6374j02111
13164a68485I4705g1567A73194e5269j34734H1277k2873A6258a10602m4646I0049
13152f3880A80503E5180a6639D5740b66483A03303P7510E190E8J19106f963A29884
13139a19644A97313J30276A63418j641D4866M03006k05197b9531A07849A0075
13128a21715I4267d319q4603C3620M1547J24453H1528R3844a02814j99386f1914
13116I6768J43157q2422i8770B99596A5835a3795H6467j3533a18696m2549B24036
13104G6813J10068J75421o7670A36530C152J67957a65298B75067K936r1463a4735
13092A12613n0528b2013A4519b47750g554E4373g7293C33143j27822h6026B43479
$$ y = [290110, 85286, -68193, -119016, 18770, -27175, 204420, 249753, 7036, 174549, -66374, -168485, 94705, -71567, 173194, -55269, -190003, 81277, 58404, 16258, -110602, -155248, 90049, -63880, 180503, 55180, -16639, 45740, -266483, 103303, 180813, 5190, 58, 119164, -6963, 129884, -119644, 197313, 327589, 163418, 161777, 44866, 447872, 242675, -29531, 107849, 10075, -121715, 94267, -4319, -88922, 33620, 75167, 199620, 81528, 175372, -102814, -302200, -61914, 96768, 239925, 157503, -98770, 299596, 15835, -13795, 86467, 72934, -118696, -161245, 224036, 76813, 186881, 362302, 294632, 136530, 3152, 171109, -165298, 275067, 278003, 186540, -14735, 112613, 62085, -22013, 14519, -247750, -7554, 54373, -77293, 333143, 205321, -86026, 243479]
13080B25456J88649F9998O3156m6009k8046a42081n743I2610a68865N8090A36095
13068C05384i0876g828A97431a97790C34855P4725c33441f9709I0696C0587J17146
13057A47733L12967a3383I4151j9350J11546G981K72316C1477L39521c47125f4167
13045e2678D2944O502J43213b2792A97591a52656b3006B13184a60707C2009h6879
13033A65899G3519L2023i882B47001K5710a5939o7111E2381a21169e4643F4142
13021i0506A46464D6154j9710J65683C7230K8470G548J61708a99469B5482B994
13009A39026l0191h6193A60658q348J03037A00789g7767B14249j00147g2361B94357
12997B64334A27098a14856F8346N2300b9674I0223N681a0383H1398b44178G0166
$$ y = [225456, 414105, 69998, 133154, 87145, 59099, -142081, -147824, 92610, -168865, -110775, 136095, 305384, -90876, -7828, 197431, -197790, 334855, 409580, -333441, -69709, 90696, 30587, 147733, 460700, -13383, 94151, 74801, 186347, 7981, 280297, 31477, 370998, -347125, -64167, -52678, 42944, 49446, 192659, -22792, 197591, -152656, -23006, 213184, -160707, 32009, -86879, 165899, 73519, 105542, -9882, 247001, 272711, -15939, -83050, 52381, -121169, -54643, 64142, -90506, 146464, 46154, 26444, 192127, 37230, 65700, 7548, 169256, -199469, 25482, 2994, 139026, 108835, -86193, 160658, 152310, 255347, 100789, -77767, 214249, 114102, -72361, 294357, 264334, 127098, -114856, 68346, 120646, -29674, 90223, 95904, -10383, 81398, -244178, 70166]
12985c13494C05149j33059j2663C4499D938J70762J9132a41216L8122m2330d3064
12973A57606a98340j03013H3882Q3037m6684J18923b20861B31344A10454a33084
12962a88536F15228C0599L03471e6906C2340j0543b60276P6062e4151l88092B0688
12950B34651a35191A91603a1612k7853A42475d37639a12798M7828p3361M7500
12940i0831B79990F4297B3532a58646C8643L77618k04879d64409A18994c52027
12929a14358N1852D5784J26881B0468B790d41375d8126C42723A31864E4087d4127
12917a48842L8178B55710c84979E5977O2873D1606b642l09581H0618l4799J65783
12906B11602D5653a6950B39445c5520A00315c908p0618K6537B48891o9035N4552
$$ y = [-313494, 305149, 172090, 159427, 34499, 4938, 175700, 194832, -141216, -103094, -145424, -43064, 157606, -198340, -301353, 83882, 166919, 120235, 239158, -220861, 231344, 110454, -133084, -188536, 615228, 30599, 334070, -56906, 32340, 21797, -260276, -184214, -54151, -442243, 20688, 234651, -135191, 191603, -11612, -39465, 142475, -437639, -112798, -64970, -138331, -90831, 279990, 64297, 23532, -158646, 38643, 416261, 211382, -464409, 118994, -352027, -114358, -62506, 45784, 172665, 20468, 2790, -441375, -48126, 342723, 131864, 54087, -44127, -148842, -110664, 255710, -384979, 55977, 118850, 41606, -2642, -312223, 80618, 45819, 211602, 45653, -16950, 239445, -35520, 100315, -3908, -74526, -47989, 248891, 179856, 234408]
12895B34408A00654Q757D8588j498J06046d35535A49976B3107b21209A84844h48
12883a87486j33504B70460j13620b48858c2745k92682g4260D5135a61324B50127
12872C23105F1257J38680a16755E5597N9559a18881F2879K26065b495n2020j29762
12861a84277A28559a62741A08903c9300a6472j26190G1230C4444b1586F8799j6602
12850E2197L26702h1529A73935m400N3405A4683Q3066p499i6192C7420L4327K99740
12838C71487d03971F2537b864D88392c2175C96913D4058a92757C29053A14244
12827A17378N0424A4949e5949A9437a63614Q1641B00981c9516A18028J85311d2109
12815D6369b78928B17430m8856a28853j82645F059b3698a0982A48c41225J49497
$$ y = [234408, 100654, 109411, 48588, 47090, 153136, -435535, 149976, 23107, -221209, 184844, -848, -187486, -320990, 270460, 156840, -248858, -32745, -325427, -74260, 45135, -161324, 250127, 323105, 61257, 199937, -116755, 55597, 115156, -118881, 62879, 288944, -2495, -54515, -184277, 128559, -162741, 108903, -39300, -16472, -142662, 71230, 34444, -21586, 68799, 52197, 378899, -81529, 173935, 169535, 222940, 14683, 97749, 90250, -96192, 37420, 71747, 371487, -403971, 62537, -2864, 488392, -32175, 396913, 44058, -192757, 329053, 114244, 117378, 167802, 14949, -55949, 19437, -163614, -81973, 200981, -39516, 118028, 303339, -42109, 46369, -278928, 217430, 168574, -128853, -311498, 6059, -23698, -10982, 148, -341225, -191728]
12804a91728I7103k4815h7765j02593i1939k07699a43798B46947j22922g0349
12793i4107e292j57721h1104c8313C50370g9120m1350G0932a42385L2607n7424
12782a67202e1542D5508b5985P574q5794k36573c9628I385g0680C54861B400a27331
12769D8093N8478b874P25n8709m2075E9297b10515P1042A91388F505f3303j16551
12757a79854e7972C3968j3182J11199k5090J9775N230P1514A2694L1525a99418
12745a4131k7211j00363C0274P4259K31465A64663F009K88938d0618a7147C27515
12733E2732J05790m6526c05967E6122g6126B56144l4078B2409b01389k5632B71777
12721B8640O3328f3929A29195r786b92936e6969J8533k7306A81209l067J93759
$$ y = [-191728, 97103, 72288, -87765, -190358, -91939, -299638, -143798, 246947, 124025, -70349, -94107, -5292, -163013, -81104, -38313, 350370, -79120, -120470, 70932, -142385, -109778, -167202, -51542, 45508, -25985, -18411, -104205, -340778, -39628, 9385, -70680, 354861, 2400, -127331, 48093, 106571, -2874, -2149, -60858, -102933, 59297, -210515, -139473, 191388, 6505, -63303, -179854, -57972, 33968, 20786, 131985, 106895, 126670, 131900, 203414, 12694, 44219, -199418, -14131, -41342, -141705, 30274, 104533, 335998, 164663, 6009, 294947, -40618, -17147, 327515, 52732, 158522, 111996, -305967, 56122, -76126, 256144, 222066, 22409, -201389, -227021, 271777, 28640, 91968, -63929, 129195, 119409, -292936, -56969, -38436, -65742, 181209, 178142, 371901]
12710C71901a09174a757j67183E28496k37482J11070e0173B01293l5605b25215
12699g0778j69329B9868b02895G6450J35377C2814a99150N5455d235A53694e5249
12687a92541A661E21b59667D8245B2891o46a30777j11586G0847b52410g2997n6726
12675a29723M5270C05320g8636j97874q3672J49283B32648h9473a2220B04691
12664f0625B18158f4731B56523P134j16400e3983A74163a01732A60679c22053
12653c6186A5900J99767r2319a42654D3707J66006a16592e5597H1893g6685k13399
12642b90084L3831h1224G8352J59847h8372j49087B2534L0996R8852a99473B05391
12630b1876j75397F0491b55170I8067l9985c10168B4226a62475f644H7340d8961
$$ y = [371901, -109174, -1757, -168940, 528496, 291014, 402084, -50173, 201293, 165688, -225215, -70778, -240107, 29868, -202895, 76450, 211827, 32814, -199150, -143695, -4235, 153694, -55249, -192541, 1661, 521, -259667, 48245, 22891, 22245, -130777, -242363, 70847, -252410, -72997, -129723, -84453, 305320, -78636, -276510, -360182, -210899, 232648, -89473, -12220, 204691, -60625, 218158, -64731, 256523, 263657, 147257, -53983, 174163, -101732, 160679, -322053, -36186, 15900, 215667, 123348, -142654, 43707, 209713, -116592, -55597, 81893, -76685, -290084, -256253, -81224, 78352, 238199, -88372, -237459, 22534, 53530, 152382, -199473, 205391, -21876, -197273, 60491, -255170, 98067, 58082, -310168, 24226, -162475, -6644, 87340, -48961]
12618B18551G1011f2159k46386M9165O8064A00417J18317b3611A13971B4473f6110
12606f3154A8333a46256B03409e8170l21713F6526R5851c9838C05552l6340E3861
12594A0449c03961a11163N4194B53888g997q3420K8664B7244P6184b35473j32319
12583c67792a29950A25284A374L13908b31442C3800a75199E7120M8898b73276
12572C9228m276h5695l80331b12310B1395K22394d4490n7588A73191m0261n3342
12561G9588L089a74404j13504Q3179K3430Q8846C00648C2116J80743p3969a497
12549a20030A34017E9977j4578g3601C6024b35678j5569M8778P8407B26358b41452
12537a02752C30572J76329c7621A17597l6199b36903G435c9743k13642a2878C2581
$$ y = [218551, 71011, -62159, -308545, -259380, -191316, 100417, 218734, -23611, 113971, 24473, -66110, -63154, 18333, -146256, 203409, -58170, -379883, 66526, 162377, -39838, 305552, 269212, 53861, 10449, -303961, -111163, -56969, 253888, -7997, -91417, -62753, 27244, 103428, -235473, -367792, -129950, 125284, 1374, 315282, -231442, 33800, -175199, 57120, 106018, -273276, 39228, 34952, -85695, -466026, -212310, 21395, 243789, -44490, -102078, 173191, 132930, 79588, 82677, -174404, -287908, -204729, -181299, -92453, 300648, 32116, 212859, 138890, -1497, -120030, 134017, 59977, 45399, -73601, 36024, -235678, -251247, -202469, -124062, 226358, -241452, -102752, 330572, 506901, -37621, 117597, 81398, -236903, 7435, -39743, -253385, -12878, 32581]
12525a50885A88492D4697K94916o1690H758A319J47548H864J18551m6674K64285
12514C45026B3725b4291B70767g4833j99934C46236A26630h9564A71983G4692
12503a23695C20061b21210A38873c36976e6558J2655O350p5664F1914k6477a37533
12491g5984j4591A59682p5136b04640a01002q9182R3611m3963A25733a68084N5440
12480a12644A56320I576J53329a47963c9640A28265d2700A26836a43740j17425
12470b61165E6173J30190h0612J6085n4077A0018L96592I2773a8560p828k03168
12459b29556A42415R3853p8162h6805J3110A4745a62054I4661J40101b89268P6718
12448b12550a3736k18571J13251A9317Q1063d9020n1716k15061B22566J24882
$$ y = [-150885, 188492, 44697, 339613, 277923, 8758, 1319, 148867, 8864, 127415, 80741, 345026, 23725, -24291, 270767, -74833, -274767, 346236, 126630, -89564, 171983, 74692, -123695, 320061, -221210, 138873, -336976, -56558, -43903, -37553, -113217, 61914, 35437, -137533, -75984, -90575, 159682, 84546, -204640, -101002, -190184, -96573, -140536, 125733, -168084, -112644, 156320, 9576, 162905, -147963, -39640, 128265, -42700, 126836, -143740, -261165, 56173, 186363, -80612, -64527, -118604, 10018, 406610, 92773, -18560, -26388, -229556, 142415, 236268, 158106, -86805, -73695, 14745, -162054, 94661, 234762, -289268, -212550, -13736, -232307, -119056, 19317, 100380, -49020, -100736, -315797, 222566, 347448]
12438C47448G4980A2924P439a36743A93566b13158H2854b12759b3679m8347C33383
12426b90056a17864D4516d0665j10815k5959g1190j91453J30218j6296A04534
12415A68910a53744I1997a67584j0272A54126J0150d4056n5447b0201C5515K72454
12404C07969B451g0714H9551b61852E5778j4540f2752A88018P7922l932H134h74
12391a39973A2280e4731H6960A0462c02126a3859C06196A03058O309d8345b0597
12379B37841c1374q7926C03267f85727H6543b601B91207r9808a85947E9564g8688
12367a23378j1029B23685I5588a43212k15344a34532g756A02478a3884C5206J61495
12356A96701b07060f8473b0465j65649C8170i6306D40515G8895b5532k5854B05544
$$ y = [347448, 74980, 12924, 20363, -136743, 193566, -213158, 82854, -212759, -23679, -72026, 333383, -290056, -117864, 44516, -40665, -151480, -177439, -71190, -262643, -132425, -148721, 104534, 168910, -153744, 91997, -167584, -177856, 154126, 164276, -44056, -99503, -20201, 35515, 307969, 2451, -70714, 89551, -261852, 55778, 41238, -62752, 188018, 265940, 262008, 8134, -874, -139973, 12280, -54731, 86960, 10462, -302126, -13859, 306196, 103058, 109367, -48345, -20597, 237841, -31374, -119300, 303267, -685727, 86543, -2601, 291207, 191399, -185947, 59564, -78688, -123378, -134407, 223685, 95588, -143212, -358556, -134532, -7756, 102478, -13884, 35206, 196701, -207060, -68473, -20465, -186114, 38170, -96306, 440515, 78895, -25532, -51386, 205544]
12344F359J08430A1673L8373g7015q8036G9987a9247A62316B1077J40533b25107
12332b5020o2847C14666j39304P122M7338E2393K20059g5281j34989C4331a04955
12320F2428i5493j53494C7034c65231H168d6043B96282F780a14044d2531G9364
12308A46733f2500r7736J9864A53870G2545K7030n42j3398P794K7583m0008J47965
12296B28969a30049B56401a53334E2751K902j5357K84088a69704C58914m2906
12286C16008a96782j74424L2209g3281j69532e5920a238m1909A79069b50648a7574
12274a645E654c5882m1757j7745J1453D749N3504f9040F2999J31261J36055A41709
12261B03722F9968M3212h413k77373a38964D2287f458j0020B73394J00914B7333
$$ y = [6359, 114789, 11673, 50046, -77015, -165051, 79987, -19247, 162316, 21077, 161610, -225107, -25020, -87867, 314666, 175362, 182484, 229822, 52393, 272452, -75281, -210270, 34331, -104955, 62428, -95493, -248987, 37034, -365231, 8168, -46043, 296282, 6780, -114044, -42531, 79364, 146733, -62500, -160236, -140372, 153870, 72545, 99575, 99033, 85635, 93429, 121012, 81004, 228969, -130049, 256401, -153334, 52751, 55653, 40296, 324384, -169704, 358914, 316008, -196782, -371206, -338997, -73281, -242813, -55920, -1238, -43147, 179069, -250648, -17574, -1645, 5654, -35882, -77639, -95384, -83931, 4749, 58253, -69040, 62999, 194260, 330315, 141709, 203722, 69968, 113180, -8413, -285786, -138964, 42287, -6458, -16478, 273394, 374308, 27333]
12249G2959b69645E7055J30288C3569J48558B254a47127I2841J72414A21600k3403
12238I8197l5431K16551B8566K12566b43393j5151e8380B09863L2991b75301I9406
12226C08068G9293F639L4295g648C64564j8614M8148P82h9154B99245p4657A03062
12213E2632r959P1422m7667N3868K2905a8306A45395B0084J16092C3018N7362
12202I0380b37428L2401Q4971j4647B68773L26535H849K15120M8279o8664m2335
12191A61249k9844J84552j45055J33398L8453j13782j2905M2561n0217K10742
12181D19152A13655a62300l3021D2505M13094h0708C13343l7520B6231N84L6074
12170F2889d2057B48999j11876J45251H6755B5931G906L55227j76783F1685C054
$$ y = [72959, -269645, 57055, 187343, 33569, 182127, 2254, -147127, 92841, 265255, 121600, 98197, 62766, 279317, 28566, 241132, -243393, -258544, -58380, 209863, 242854, -275301, 99406, 308068, 79293, 6639, 40934, -7648, 364564, 345950, 394098, 394880, -89154, 299245, 224588, 103062, 52632, 42673, 114095, 66428, 120296, 143201, -18306, 145395, 20084, 136176, 33018, 90380, -237428, -205027, -120056, -134703, 268773, 595308, 8849, 223969, 272248, 203584, 161249, 131405, 315957, 170902, 304300, 342753, 228971, 216066, 258627, 208410, 419152, 113655, -162300, -195321, 42505, 455599, -80708, 313343, 275823, 26231, 26815, 62889, -42057, 248999, 137123, 282374, 86755, 25931, 7906, 363133, 186350, 61685, 3054]
12158f3067N097a2520G6787N9831a11717B0847K2047J59617e0831e943B23070
12146d69727B35953d6573B55795b4910I9104a45577G8756J34440m08L1401C7312
12134c642A29748f2085a5029o3653C02911h4591A574N9676O8926b99609D6489
12122A80223a9543F2515K26141q1295n3623a35478G7409G878K8411R5223a60171
12110a79547j79081c4589B93823c19550K5193g316A01255D3186J556a28562A99489
12098C9628b27926A07513k5192a38355C15893b72361B82677c5069A70916J6345
12088A87261f675m4507l8903b2679Q309A01505a91447A35122J2813P2260a74378
12076C1129O7958J56505b0775B085J64182K36533b36358J09218M4507j53636D39387
$$ y = [-63067, -57970, -12520, 76787, 136618, -111717, 20847, 42894, 202511, -50831, -5943, 223070, -469727, 235953, -46573, 255795, -24910, 99104, -145577, 78756, 213196, 212788, 244189, 37312, -3642, 129748, -62085, -15029, -78682, 302911, -84591, 1574, 61250, 130176, -299609, 46489, 180223, -19543, 62515, 288656, 207361, 153738, -135478, 77409, 7878, 36289, 131512, -160171, -179547, -358628, -34589, 293823, -319550, -294357, -7316, 101255, 43186, 44742, -128562, 199489, 39628, -227926, 107513, 82321, -138355, 315893, -272361, 282677, -35069, 170916, 187261, -6675, -51182, -90085, -22679, -14370, 101505, -191447, 135122, 147935, 220195, -174378, 31129, 99087, 255592, -20775, 2085, 166267, 402800, -236358, -127140, -82633, -236269, 439387]
12064F59583k40507K8111j28803a17809D6817J7661g3965a8693A26875a8979A42414
12052D1992K37064h508l1271j09742B97974b07398J1716O6037L9039C193c63380
12040C7134g424l45297a51300j73982a2657B13225G3581a12849j6768A20412b05699
12028c719j84022A91296o8347D3209a22173A06736K86407a61079C11200c1188
12017D8218P3344d1341C5599f0676A466K39J3412O6232f5498b9055B67084g4995
12004H5155J69317b99904C32114a58061k1151a6810f371j66285k3096m8076a03936
11992G8902R7643b80524A1984M1010c15544a030k47507A00724L3276c36577J68135
11981a68442m7627g9075E5063c60556B62956o8010H3969f5359A97979c10804i3106
$$ y = [659583, 419076, 447187, 318384, -117809, 46817, 64478, -73965, -18693, 126875, -18979, 142414, 41992, 279056, -8508, -39779, -149521, 297974, -207398, -195682, -129645, -90606, 3193, -363380, 37134, -7424, -352721, -151300, -325282, -12657, 213225, 73581, -112849, -129617, 120412, -205699, -3719, -187741, 191296, 122949, 43209, -122173, 106736, 393143, -161079, 311200, -31188, 48218, 121562, -41341, 35599, -60676, 1466, 1705, 15117, 81349, -65498, -29055, 267084, -74995, 85155, 254472, -299904, 332114, -158061, -179212, -16810, -6371, -172656, -195752, -243828, -103936, 78902, 176545, -280524, 11984, 52994, -315544, -1030, -248537, 100724, 134000, -336577, -168442, -216069, -79075, 55063, -360556, 262956, 194946, 83969, -65359, 197979, -310804, -93106]
11969i169A07907I201f9447C195L08832E1067b4508C1685a7948l7261j76070P3957
11957a57322b3303B50814F9168B5958J47289e6125l9552E2889J27684m6943A572
11945A05796a63106o3854b9353A66563c16599A52326A7465d3906A0262M3843a6873
11933B85614h1111F4581i8918B16231a65081E8739B4212e6530A55906C814b29958
11921f8373B31214a56477B88048B1516e620l72646A22425b22055J01163e7933
11910a7906j56659o1737f8404C858a90438A69026K7957G8437c87589c0365l37608
11899c67973B99552c6307j5748f118j41398q514P5073F8945A7037M6397J39307
11888B02741h4624D37786b45362J14487p5059q2282a4539H3224l206d996H3238
$$ y = [-9169, 107907, 9201, -69447, 3195, 312027, 51067, -24508, 31685, -17948, -55209, -231279, -157322, -23303, 250814, 69168, 25958, 173247, -56125, -95677, 52889, 180573, 133630, 1572, 105796, -163106, -226960, -29353, 166563, -316599, 152326, 17465, -43906, 10262, 54105, -16873, 285614, -81111, 64581, -98918, 216231, -165081, 58739, 24212, -56530, 155906, 3814, -229958, -68373, 231214, -156477, 288048, 21516, -5620, -378266, 122425, -222055, -120892, -57933, -17906, -174565, -236302, -68404, 3858, -190438, 169026, 196983, 78437, -387589, -30365, -367973, 299552, -36307, -52055, -6118, -147516, -156030, -80957, 68945, 17037, 63434, 202741, -84624, 437786, -245362, -130875, -205934, -288216, -14539, 83224, 80018, -4996, 83238]
11876B73655c03823J01916N455g4397r3027g3451K4260Q39j00298H5046b3188
11864i7017m7719d7069n0717E0007K6416j7338e7914a6052D9604a23629C0058
11852H3938b15583R4162D468J50196A8860n834c23840J00273B658P0607b02972
11840c3096E674J10443K8617b7226j35744K7204a7728A10651M1105a66581A81519
11828c31765b3327j39680k33471a61172j2124c0763B0660b5338q9782L5944k30964
11817c10140E4284b26658A85557m0512g555H8365a523n5510l08173d7395k20318
11806b67713a21891I1400a36746j401N7695k96669A28772i5459B3912J04442A5504
11794A08445f0932j0345j08432Q8264B99019m5721b51990G1600c7498l3845r0094
$$ y = [273655, -303823, -201907, -196452, -74397, -167424, -73451, -49191, -48352, -148650, 85046, -23188, -97017, -144736, -47069, -97786, 50007, 76423, 59085, -57914, -16052, 49604, -123629, 30058, 83938, -215583, -121421, 4468, 154664, 18860, 13026, -323840, -223567, 2658, 73265, -202972, -33096, 5674, 116117, 144734, -27226, -162970, -135766, -17728, 110651, 151756, -166581, 181519, -331765, -23327, -163007, -396478, -161172, -173296, -30763, 20660, -25338, -115120, -79176, -310140, 54284, -226658, 185557, 145045, -7555, 88365, -1523, -57033, -365206, -47395, -267713, -121891, 91400, -136746, -138147, -80452, -377121, 128772, -95459, 23912, 128354, 15504, 108445, -60932, -71277, -179709, -91445, 299019, 253298, -251990, 71600, -37498, -71343, -161437]
11783a61437B5568P483f0235c069k5905E4779R6818A9946J42098n0969d2505J7194
11771b5311I1526d2862J138E0475b01138B20213g8095j77326J23195b5515m7292
11760g2807B2178b30473Q3433d2257q8559C985J5840J83217a1309B45039H5066
11748b179j41045C71910j22965n5858J89007e221B16330D4053J07060h4848k8661
11737a13509j05336d1610k7238m01846K21725A58262b2037j22912j0202P3743
11727h1408A57640d044B75264r7219F099a25816B57049a28358a65j14378j42296
11716b56839g137r7858B44745j4863P6465E4566g8308K8371A36288k5767f9297
11704b10603M1163a8153k13274G1830O1357c24426H1449A5912K9922N3259d3614
$$ y = [-161437, 25568, 33051, -60235, -3069, -28974, 54779, 151597, 19946, 162044, 111075, -42505, -25311, 91526, -42862, -41724, 50475, -201138, 220213, -78095, -255421, -132226, -25515, -72807, 22178, -230473, -147040, -42257, -130816, 3985, 19825, 203042, -11309, 245039, 85066, -2179, -143224, 371910, 248945, 193087, 382094, -5221, 216330, 44053, 151113, -84848, -113509, -218845, -41610, -68848, -470694, -248969, 158262, -22037, -144949, -155151, -81408, 157640, -4044, 275264, 178045, 6099, -125816, 257049, -128358, -165, -114543, -256839, -7137, -104995, 244745, 229882, 306347, 54566, -78308, -49937, 136288, 110521, -69297, -210603, -169440, -18153, -231427, 71830, 133187, -324426, 81449, 15912, 45834, 99093, -43614]
11692A88497j3375n9239K9708A4242N8094a33185q5786B28745J19939d1723A2524
11680A11781a60697A82650a4871B3546c6485F1584K07092A10374c5217r8437I4556
11668C3622Q4340a4708j41479A26391a18199j34739A3493f8372b2420k4758j69637
11657b16815B7877a8728A9326g0316A56477a2977l68567d728l8446A34431i1044
11645i1475n9423O2703j05597g718A67109k2643a28268A18842a7360j46204H9248
11633i6743l0946C14850A52368a24734A33899a4755k03660C40726e9102C48109
11622f1482B47334j12577l8721o404M7903b9604O338l1274b3877A15761a95711
11610a48104A32910M4732H6785c13050k6634A87125B351K25352i77D9928p408
$$ y = [188497, 175122, 115883, 145591, 14242, 72336, -133185, -218971, 228745, 348684, -41723, 12524, 111781, -160697, 182650, -14871, 23546, -36485, 61584, 268676, 110374, -35217, -133654, 94556, 33622, 117962, -14708, -156187, 126391, -118199, -252938, 13493, -68372, -22420, -47178, -216815, 27877, -18728, 19326, -70316, 156477, -12977, -381544, -4728, -43174, 134431, -91044, -91475, -150898, -88195, -193792, -7718, 167109, 144466, -128268, 118842, -17360, -163564, 89248, -96743, -127689, 314850, 152368, -124734, 133899, -14755, -218415, 340726, -59102, 348109, -61482, 247334, 134757, 96036, 89632, 137535, -29604, -23266, -54540, -23877, 115761, -195711, -148104, 132910, 177642, 86785, -313050, -339684, 187125, 2351, 227703, -977, 49928, 42520]
11599D2520d7647B28432j02177J1573J51697a55352B68042H720J68150o6601b28265
11587A89055i0677K7640A673h7690A00457J5321D5577k376J52280k2310q1120
11576I2051e1683K5123A0723J49598L5475l8238a12647A99661l7936C5799J04730
11565A40529E2330A1821K4809J3025a71973A01078k8667B0418K12354a7148m616
11554b1764D3767L94130j55051g803G949N3378a66572A65571n7338b76789N9738
11543b17051B49437j2134e6697q9908e6272m067B99220F7912a98586R346b1203
11531a84913B18829a86266D6817c8451H4348A8746d1633F7987G549N5994K6743
11520I0286c8582H6845O8476K04365A0724e5985k4004K2364L734a9713B25379
$$ y = [42520, -47647, 228432, 126255, 137828, 289525, -155352, 268042, 8720, 176870, 110269, -228265, 189055, -90677, -63037, 1673, -87690, 100457, 115778, 45577, 43201, 195481, 173171, 92051, -51683, -26560, 10723, 160321, 195796, 157558, -112647, 199661, 161725, 35799, 140529, 52330, 11821, 36630, 49655, -171973, 101078, 72411, 20418, 232772, -17148, -21764, 43767, 437897, 282846, -7803, 7949, 61327, -166572, 165571, 108233, -276789, -217051, 249437, 237303, -56697, -146605, -56272, -60339, 299220, 67912, -198586, -189240, -21203, -184913, 218829, -186266, 46817, -38451, 84348, 18746, -41633, 67987, 7549, 63543, 90286, -38582, 86845, 155321, 359686, 10724, -55985, -79989, -57625, -53891, -19713, 225379]
11508C9468i7082B45136q8624J06283J15337d5011C99360A43210C7999b1067A96258
11496C83678G183J08165a57887l7715A60766k3655b41536L9242A27042J30817
11486B57859b74540c2610f784A38204R1466P771F9544a71253A09361m932l1272
11475G3157K13674a41903F8490P4690a21164C4325J72815J3378R8416A01556O3786
11464A65342R521G1439a5785l0325j03356F9038g1022G6975J74662a37558d6532
11452E9722N8082l2102F866a50332G059K90746G5665l6951a03092B51732A25577
11440d01747A37942a30470G2600b97851P9221p4062F3052j5484a28291H7153B255
11428F7154e9237j33484B13688j5769K400b43884F4168d9480A35282a85984A42378
$$ y = [39468, -97082, 245136, 156512, 262795, 378132, -45011, 399360, 143210, 37999, -21067, 196258, 383678, 7183, 115348, -157887, -195602, 160766, 137111, -241536, -202294, 127042, 257859, -274540, -32610, -6784, 138204, 229670, 237441, 69544, -171253, 109361, 104429, 73157, 286831, -141903, 68490, 143180, -121164, 34325, 207140, 220518, 318934, 101556, 165342, 174863, 71439, -15785, -46110, -149466, 69038, -71022, 76975, 251637, -137558, -46532, 59722, 117804, 85702, 6866, -150332, 7059, 297805, 75665, 38714, -103092, 251732, 125577, -401747, 137942, -130470, 72600, -297851, -218630, -292692, 63052, 47568, -128291, 87153, 2255, 67154, -59237, -192721, 213688, 197919, 200319, -243884, 64168, -49480, 135282, -185984, 142378]
11416a4330d93A3489J43249b3093m7382J7804D1253K40595a38087H2697N5407
11405A38104a69956F3741j6449Q2752h8853A7895b9111I8459J37018G2007a43895
11393C6263g7496D065O7804K6921N5403F2024B509a30820F4216c0415A37384n0936
11381H6448J68340f5213B2162b42372a16243B6904f057A39033h4296l9190A47755
11369C09223I389g3559l378j48700A17329a23590L51A80779b35958B185d767j48943
11357a53710d7793G3399k2925B355b53732p085A96935H305K71855i2992c327m6197
11345d9524D3538J03197L0903e6130A73785H1554L38246A06080a04635D5611J05779
11334A51390a21012B1641h2187A92858a67100o5011c26j28605G2885a01178M2186
$$ y = [-14330, -493, 13489, 156738, -23093, -70475, -52671, 41253, 281848, -138087, 82697, 138104, -169956, 63741, 47292, 130044, -88853, 17895, -29111, 98459, 235477, 72007, -143895, 36263, -77496, 4065, 71869, 98790, 154193, 62024, 2509, -130820, 64216, -30415, 137384, 86448, 254788, -65213, 22162, -242372, -116243, 26904, -6057, 139033, -84296, -123486, 147755, 309223, 9389, -73559, -76937, -225637, 117329, -123590, -123239, 180779, -235958, 2185, -4767, -153710, -47793, 73399, 50474, 2355, -253732, -260817, 196935, 8305, 280160, -92992, -3327, -49524, 43538, 146735, 177638, -56130, 173785, 81554, 419800, 106080, -104635, 45611, 151390, -121012, 21641, -82187, 192858, -167100, -232111, -326, -128931, 72885, -101178, -58992]
11323e8992k97432b9945A57992k2945N9929a02112A23469L7591a48193r6780j53917
11312c98890I6057L493N3199b07322i4836D5160K2563b23593k329p4148a17591
11300A41014D8378a89767p7210F9609K3351h6022E1064b98381b5840k09194b1634
11288a31590I5549c32986C2810a06827I1523b40236D4229Q7680N492d46687b12266
11276b71160A48984b23720C63560c43432Q9675C5533b06778g4143H6202J5934
11266A02136P4319J13231H0439b88569C4005K99169b16526B30461a9229A3287
11255a16791k19004e6341C6664b5289k23746O3163L5799C1548i5180o6402D65203
11243i9488C01616f3882j54125F4742h2425j23197A05313B093N1285b64792r8464
$$ y = [-58992, -356424, -29945, 157992, 135047, 194976, -102112, 123469, 161060, -148193, -244973, -398890, 96057, 99550, 152749, -207322, -94836, 45160, 67723, -223593, -225922, -300070, -117591, 141014, 48378, -189767, -266977, 69609, 92960, -86022, 51064, -298381, -25840, -235034, -21634, -131590, 95549, -332986, 32810, -106827, 91523, -240236, 44229, 131909, 137401, -446687, -212266, -271160, 148984, -223720, 363560, -343432, -253757, 35533, -206778, -74143, 86202, 102136, 176455, 289686, 80439, -288569, 34005, 333174, -216526, 230461, -19229, 13287, -116791, -335795, -56341, 36664, -25289, -249035, -185872, -150073, 31548, -95180, -161582, 465203, -99488, 301616, -63882, -218007, 64742, -82425, -205622, 105313, 2093, 53378, -264792, -363256]
11232c63256J80639e7303I4385c12885a52325G0466B1218a0396j97547o6525A15748
11220A87709a35812B3581O6172B3633h2150l8209K5903m0217L6458j7452k52835
11209c68502O9337D19685C4184a01396B97265a59222C06708b49850F3570a12417
11198a73834D6589b09094L2826A70603d15057J42005J3753c4509k47535A77727
11187f623j82124M5051H4907J98326C9168b19741f8033r3676d4925A26655f1856
11175g9276K9603j58184i0128B67564j21976e6192D8208e0666r4939n3537F0988
11163A8662b96498h337A75715F1261B7973b74227A84472d1585j31663k7357H5157
11151e15494p7935B74029I1867b53689A00567D1763J75065F8740g9185C03999
$$ y = [-363256, -182617, -57303, 94385, -312885, -152325, 70466, 21218, -10396, -207943, -274468, 115748, 187709, -135812, 23581, 89753, 23633, -82150, -120359, -94456, -134673, -98215, -115667, -368502, -299165, 419685, 34184, -101396, 297265, -159222, 306708, -249850, 63570, -112417, -173834, 46589, -209094, -176268, 170603, -415057, -273052, -259299, -34509, -282044, 177727, -6623, -188747, -143696, 84907, 283233, 39168, -219741, -68033, -161709, -44925, 126655, -61856, -79276, -49673, -207857, -90128, 267564, 145588, -56192, 48208, -50666, -145605, -199142, 60988, 18662, -296498, -8337, 175715, 61261, 27973, -274227, 184472, -41585, -173248, -200605, 85157, -515494, -593429, 274029, 91867, -253689, 100567, 41763, 216828, 68740, -79185, 303999]
11140i6977M0916K4863C08046L7919d2145H5331N1627D3464J41979m9297j3347
11129A22799a78016q3844B04059A00228f3867h180k03688A45953l922j9412K2040
11118A44659A1328a47691I9615J28194b77769F0158d71097O9696A57357m836M3033
11107A95554A5877J35712a15309e6938j60653M3594o0804b8470r3040F5757K69186
11096C34943j19472K29340f8684F4110k0637M9787J99764e6488H6587d6197p3305
11085a19502e814D4765J16554J18730j10867F554J93504a26480A0772L42263k4076
11074C28959a1584A14130J37697r493q8196R2435j1711j920j00062K31269A34205
11062A61745J93457o9115O8745G2603K28556o2470K72227q5599K3230o3259R7144
$$ y = [-96977, -56061, -31198, 308046, 345965, -42145, 85331, 136958, 43464, 185443, 136146, 122799, -178016, -261860, 204059, 100228, -63867, -8180, -211868, 145953, 142031, 122619, 144659, 11328, -147691, 99615, 227809, -277769, 60158, -471097, -401401, 157357, 152521, 195554, 15877, 151589, -115309, -56938, -217591, -173997, -234801, -28470, -121510, 65757, 334943, 215471, 444811, -68684, 64110, 43473, 93260, 293024, -56488, 86587, -46197, -119502, -5814, 44765, 161319, 280049, 169182, 6554, 200058, -126480, 10772, 353035, 328959, -11584, 114130, 251827, 242334, 154138, 246573, 234862, 232942, 132880, 364149, 134205, 161745, 355202, 286087, 354832, 72603, 301159, 238689, 510916, 425317, 448547, 385288, 482432]
11051D82432K20676A77184N05156B49563q0272L66695r0182J54304j67122J52984
11041E85970k64160K51798R4203B20321J98061j02450J26902K52099B53225k4442
11031B28783K59287J45743j1577k66089J25049m544J55225j36307j59508J96282
11021E32344J38405j62486O6557B65171J86743p9496o0434J53769J67194j21286
11011E11661L0004j98702K12168N6991j86927k05688L7976Q1030R7517A22588
11000E93316k5453K25906j30005q4663k17736k9591N6096r2749R7357J28343B46690
10988F27508j04794J79805o6106J09634o3864k4109j89075P3791j3845K32039
10978G60984k02404K97787n4617n954K30197l2743J11808J49762M24218l1873
$$ y = [482432, 703108, 177184, 682340, 249563, 169291, 535986, 445804, 600108, 432986, 585970, 321810, 573608, 667811, 220321, 418382, 315932, 442834, 694933, 253225, 228783, 488070, 633813, 622236, 356147, 481196, 476652, 631877, 495570, 336062, 532344, 670749, 508263, 574820, 265171, 451914, 372418, 311984, 465753, 632947, 511661, 541665, 342963, 555131, 612122, 425195, 219507, 257483, 338513, 436030, 122588, 593316, 567863, 793769, 663764, 579101, 361365, 331774, 387870, 295121, 392478, 520821, 246690, 627508, 522714, 702519, 636413, 746047, 682183, 658074, 468999, 542790, 528945, 760984, 558580, 856367, 801750, 795796, 1025993, 993250, 1105058, 1254820, 1679038, 1647165]
10968A647165J62808k56879L28802j8148j49804m23928J54058o3981m11221K26101
10958A194973j41318J23322N6793O1805J74926l81121L90001m36223l3833m1069
10948I68256j40811j35211r8895B60379J89901M1981A62692M5159B9498K64834
10938B94332j15207F6392K00964a5348B60047l3819b47095i5037A09385b91156
10927G9558b02350f3411M735J3304A89148b48467c7819E1961J3342J52967J8120
10916B36390b393A56522d0035a0111A96437l7373E4337d58488b10578C1057d5198
10904D2700a55876I3539b3144A07865A4404O6231b65937A1692f1473o0126J3838
10893a07761L8600j55726A02141J42078q8783a52203M7640I5263J08173M9358
$$ y = [1647165, 1809973, 1553094, 1881896, 1863748, 1713944, 1290016, 1444074, 1380093, 968872, 1194973, 1053655, 1176977, 1233770, 1295575, 1470501, 1089380, 1479381, 1043158, 1009325, 968256, 827445, 692234, 593339, 260379, 450280, 492261, 162692, 207851, 29498, 294332, 179125, 66392, 267356, -15348, 260047, 226228, -247095, -95037, 109385, -291156, 79558, -202350, -63411, -58676, -45372, 189148, -248467, -37819, 51961, 65303, 218270, 236390, -2393, 156522, -40035, -10111, 196437, 159064, 54337, -458488, -210578, 31057, -45198, 42700, -155876, 93539, -23144, 107865, 14404, 80635, -265937, 11692, -61473, -121599, -107761, -69161, -224887, 102141, 244219, 155436, -152203, -104563, 95263, 203436, 252794]
10883B52794a96546K8568B58574g7873B9943O0979D0223J18135c68278C44177
10872d6236o169H2917i5739r1492f180k09986E8036f6740q4503n3119e7433A80187
10859a39867d8312i118C31762a22487b4405E97121a05677L5470k95477E518i892
10847c02946M1507D6530J51577q1933b3147j7130I1701i0501I4745D2590I361
10835e5145G8386a37524N2396A30262a96152c1839p1575j60243B44218b92085
10824c50573l6169a15131f818A52199c55255h4955D2264b60335A21786b68074
10813b13721h2906B16791d689D0032K5486a44235d6377F7146a78654a959l93198
10802c95157e0884H3966K2936a54244A27887B9056g6079A27916k9535b45617J16585
$$ y = [252794, -196546, -167978, 258574, -77873, 29943, 90922, 40223, 158358, -368278, 344177, -46236, -52405, 82917, -95739, -187231, -6180, -216166, 58036, -66740, -151243, -204362, -57433, 180187, -139867, -48312, -9118, 331762, -122487, -24405, 597121, -105677, -70207, -365684, 5518, -9892, -302946, -261439, 46530, 198107, 116174, -23147, -40277, 91701, -90501, 94745, 42590, 9361, -55145, 78386, -137524, -85128, 130262, -196152, -31839, -103414, -263657, 244218, -292085, -350573, -386742, -115131, -6818, 152199, -355255, -84955, 42264, -260335, 121786, -268074, -213721, -82906, 216791, -4689, 40032, 65518, -144235, -46377, 67146, -178654, -1959, -395157, -50884, 83966, 106902, -154244, 127887, 29056, -76079, 127916, 98381, -245617, -129032]
10791a29032a7681j96265A00274a27593a2328G6948a06450D8882K3666j1404M9741
10780A10885A6963b37429F9044c49976J65791b8641A00971b98415b5502D1490
10769A2762R4334k0203b31103O0251k74334a39691f6165j91406g8791j06733G4122
10757a37675I677J39013a3255o2172l18326a4798p7344E5408b12732K7383H9621
10745c3754j5138J6262j56789Q3117B8438c50675E4899R4040h8545A26370d70492
10733a99153M1148H7775N0204b89981B1286a19770d3762A66951e0337A92426a46730
10721a55588F3168C1234P7491a16354a2674I7742b66408g3305o1545j69117p4684
10710c78651J41884l8234C21874i5467c8615k15442f0228k6031J7874k07963j04552
$$ y = [-129032, -17681, -213946, 100274, -127593, -12328, 76948, -106450, 48882, 72548, 61144, 110885, 16963, -237429, 69044, -349976, -184185, -28641, 100971, -298415, -25502, 41490, 12762, 107096, 86893, -231103, -170852, -445186, -139691, -66165, -257571, -78791, -185524, 74122, -137675, 9677, 148690, -13255, -75427, -393753, -14798, -92142, 55408, -212732, -185349, 89621, -33754, -48892, -32630, -189419, -106302, 28438, -350675, 54899, 148939, -88545, 126370, -470492, -199153, -158005, 87775, 137979, -289981, 21286, -119770, -43762, 166951, -50337, 192426, -146730, -155588, 63168, 31234, 108725, -116354, -12674, 97742, -266408, -73305, -134850, -303967, -378651, -236767, -275001, 321874, -95467, -38615, -254057, -60228, -86259, -68385, -276348, -380900]
10699c80900H5813M8868i8657d8097l15809A26185n2934b7419o5251J4865A61363
10687a56195N4016k5807l9781C32951I59b97006a04687l3329B49981a98885e1909
10675e3088k55193e7328C5211L9581a49656E4210c48392O0387N4061h3550l090
10664h6640j4768N403o4333J6318A30553J248J66279a94805j95339J78732L755
10653b07657I1503q479a31461k17068I4428a06650j680a2803n2827k56646a54224
10641G9262L08140a20198j83384n6734a65425E1727a65143C6168a8385k85947
10631c04332b3372j14665B73721g3672J2219m3526q690B70317F199J21732L9239
10620A67170c87630J10534G3677J2933b51211g0974j54188d0511j10229n8116
$$ y = [-380900, 85813, 134681, -98657, -48097, -363906, 126185, 73251, -27419, -92670, -77805, 161363, -156195, -102179, -127986, -167767, 332951, 959, -297006, -104687, -138016, 249981, -198885, -51909, -53088, -308281, -57328, 35211, 74792, -149656, 54210, -348392, -288005, -233944, -83550, -86640, -101408, -96005, -160338, -144020, 130553, 131801, 298080, -194805, -390144, -211412, -207657, 91503, 83024, -131461, -348529, 94428, -106650, -108330, -12803, -65630, -322276, -154224, 79262, 387402, -120198, -303582, -360316, -165425, 51727, -165143, 36168, -18385, -304332, -23372, -138037, 273721, -73672, -61453, -104979, -113669, 270317, 6199, 127931, 167170, -387630, -277096, 73677, 86610, -251211, -70974, -225162, -40511, -150740, -208856]
10610b08856A89951a34859d8022K1134j96002e1616B07342f0234k8119l6550B8848
10598F9333j1825i667A32600A6972f518o5682A04872b13038j17931E0625a01546
10586b00951F7000f697k17424m3261b5351l25497K5578A37186m1284J92258g4042
10574b46055C11962a18030e6781i496j648I4543C0546d3754G076a15821j2460
10563a28281o7458B21457J11456a91614O6398n7731g4441b6113n3169i131k0801
10552b9932A86162a24995C6271a93579f7495o5361A22733h3626n3262C99259a59785
10540e9598A74626a34552E6797e0214j96315g9902B7764i5548l9535c9122H9128
10528b74889i0642L7609A62064i4229C61806a57560O4761A43657b75328e8633
$$ y = [-208856, 189951, -134859, -48022, -26888, -222890, -51616, 207342, -60234, -88353, -124903, 28848, 69333, 57508, -9667, 132600, 16972, -6518, -72200, 104872, -213038, -330969, 50625, -101546, -200951, 67000, -6697, -224121, -267382, -25351, -350848, -325270, 137186, 95902, 288160, -74042, -246055, 311962, -118030, -56781, -9496, -11144, 94543, 30546, -43754, 7076, -115821, -128281, -195739, 221457, 332913, -191614, -125216, -182947, -74441, -26113, -79282, -9131, -29932, 186162, -124995, 36271, -193579, -67495, -132856, 122733, -83626, -136888, 399259, -159785, -59598, 174626, -134552, 56797, -50214, -246529, -79902, 27764, -95548, -135083, -39122, 89128, -274889, -90642, -53033, 162064, -94229, 361806, -157560, -92799, 143657, -275328, -58633]
10517G5881j1251b18024E7646k7280J73864A5543g4913I1309c04197A0589J51933
10506A62522b04468R9228K0516A20194c46246F5113K10596b08763i2959H8740
10495A45555C7319a48038E6604H665i659C141R0985O4489m3689C884a28361B26905
10482G8297f2575A29178O2579a11383A25651M79548k76321Q9679q6331p4701a67864
10470A34321f1757g49B005a37672A55967C6097i1219b532j13423A24340b18486
10458A91008c06205e5671k90315I1947c48523F3646K7006c3699A13219J39620
10448B52839g3628E7027h202p0198j10586N3190j05145C58321a61251q8593f1854
10436b9696D31971A66248p4371i9427D00862d3070j632r2844O1128b5375F5107
$$ y = [75881, 64630, -218024, 57646, 30366, 204230, 15543, -74913, 91309, -304197, 10589, 162522, -204468, -105240, -84724, 120194, -346246, 65113, 275709, -208763, -92959, 88740, 145555, 37319, -148038, 56604, 8665, -9659, 3141, 94126, 158615, 114926, 3884, -128361, 226905, 78297, -62575, 129178, 191757, -111383, 125651, 605199, 328878, 418557, 332226, 257525, -167864, 134321, -61757, -749, 2005, -137672, 155967, 36097, -91219, -2532, -115955, 124340, -218486, 191008, -306205, -55671, -345986, 91947, -348523, 63646, 90652, -33699, 113219, 252839, -73628, 57027, -8202, -78400, -188986, -135796, -240941, 358321, -161251, -249844, -61854, -29696, 431971, 166248, 91877, -99427, 400862, -43070, -44702, -137546, -76418, -25375, 65107]
10424A07934a7418B94403m6312a46883C32566d3162D10321f2025B23798a07044
10413d7139o4780H7036c21035I2761M9389c32855R5884C2104b55704R2187o1114
10402b24631A29400a3964B06786c35210b552A41643M3008A0778b14538h5847p891
10391i3738j63304M7382C22761B656K25109a25251r352E9521J61574a69670H4385
10379B78790j35261J06891b62800A13789k2502k2147a9495A44959J8778J3424
10369A77161J79729J06588B22971k5912J63571J00804q6633l1433J8782F798K78877
10358B85675A33283l1917j0792M6743R4024j2446B9794a96665D9940O25001l09412
10347C65529n8219M8006A63532Q6602m4522J71450J26992k02079A6501J24409
$$ y = [107934, -17418, 294403, 248091, -146883, 332566, -43162, 410321, -62025, 223798, -107044, -47139, -111919, 87036, -321035, 92761, 142150, -332855, -236971, 32104, -255704, -163517, -224631, 129400, -13964, 206786, -335210, -2552, 141643, 184651, 10778, -214538, -85847, -93738, -257042, -209660, 322761, 2656, 227765, -125251, -134603, 59521, 221095, -169670, 84385, 278790, 143529, 250420, -262800, 113789, 91287, 69140, -19495, 144959, 163737, 177161, 356890, 463478, 222971, 197059, 360630, 461434, 374801, 343368, 362150, 6798, 285675, 133283, 101366, 90574, 137317, 231341, 218895, 29794, -196665, 49940, 674941, 365529, 307310, 355316, 163532, 250134, 205612, 377062, 504054, 301975, 16501, 140910]
10337A40910E6873J41422l2021G6815J38700q4647L1743l696b79195E5445K99694
10326C55139F1567J31559L164P1391j32689K2613b0157A14547J10210J56613h5053
10314c18173A12439k1826J36332q1777P6980a85498e1846R022A09565b47209J11698
10303a35511f6882H8137h5732H0620j6714c4796B7575d1405A04360e50009C8580
10291G5335b57594d3406k57186a40149m2598h3991A15634d3846l47135a3307m4386
10280e7693A51720a29091N6985B52731l5360e4689r447A30449c4113A25030h4546
10268a63003K8969A46347b50199B50105o0207i2647c531k22231b5031I3429j6036
10257G7393J00724L40301H4532K5477K61728i4727B60004g7316D4053P3272A0966
$$ y = [140910, 56873, 198295, 166274, 76815, 215515, 130868, 162611, 158915, -279195, 55445, 355139, 61567, 193126, 196290, 267681, 134992, 157605, -20157, 114547, 224757, 381370, -85053, -318173, 112439, 90613, 226945, 145168, 222148, -185498, -51846, -42824, 109565, -247209, -135511, -66882, 88137, -85732, 80620, 63906, -34796, 27575, -41405, 104360, -550009, 38580, 75335, -257594, -43406, -300592, -140149, -182747, -83991, 115634, -43846, -390981, -13307, -57693, 151720, -129091, -72106, 252731, 217371, -54689, -64136, 130449, -34113, 125030, -84546, -163003, -134034, 146347, -250199, 250105, 189898, -92647, -3531, -225762, -25031, 93429, 77393, 178117, 518418, 84532, 110009, 371737, -94727, 260004, -77316, 44053, 117325, 10966]
10245f8046B632d1918A55502a99216A30903a65786L5628j53932J41856n7800e3952
10233A03424M6470e7173B47703a04531p9224A6661a41365o9194b7491k95682b754
10221a6142A77008G7847a9522C430h8893k01097C0789a51092j98296J29811h2588
10209a0299B00387H2622a30423B42690B3545M8817h2899E1241a76322A4225J25277
10198A39502a0447n7193a7412A48629a54705B12486d95799H8428a83386j61567
10188c44953b5345k03766b5709k12797A19360k4366f4179I1429l2721e52145A12649
10176h4797E233b1868n4140r5317b5333q7809j12671G9656J04642e6103r658J4285
10164e1476k0381A263a12274I9804i0083K136j9650k23543O2128J3144c5858A97106
$$ y = [-68046, 2632, -41918, 155502, -199216, 130903, -165786, -130158, -284090, -142234, -200034, -53952, 103424, 149894, -57173, 247703, -104531, -183755, 16661, -141365, -210559, -27491, -323173, -2754, -16142, 177008, 77847, -19522, 3430, -88893, -289990, 30789, -151092, -349388, -219577, -82588, -10299, 200387, 82622, -130423, 242690, 23545, 72362, -82899, 51241, -176322, 14225, 139502, -10447, -67640, -17412, 148629, -154705, 212486, -495799, 88428, -183386, -344953, -25345, -229111, -25709, -238506, 119360, 94994, -64179, 91429, 58708, -552145, 112649, -84797, 5233, -21868, -76008, -171325, -25333, -113142, -225813, 79656, 184298, -56103, -65761, -51476, -71857, 1263, -112274, 99804, -90083, -87947, -107597, -331140, -269012, -255868, -35858, 197106]
10151A71605o8938E0841b11004J8980N4610A27699d28393A39945R9253L7514A794
10139i5121A9075a63307A63880b01109c6095P270j4421B03211a1942E2646j051
10128E1595L3014a30756N6076j89979F6237b33835B07321R6791h5346j42766B27822
10116G9008J28796b44596O2448c7980m281D5192b3904A96497B2695a06205j28591
10105b34796J08828A40715m6487b51499h6211J1871r1628A49448a38621r37A29263
10093A86064c6391B3523f6271b0664C274d3845j12871A99319a25723j07474b5233
10081A57500c4937k1449A284K6896Q3604i2957a360l01987A66895d825I2072a46245
10068a06502E3905a17858D804a07389b5284k2364k53487J39426N1071j13874G8594
$$ y = [171605, 102667, 50841, -211004, -192024, -137414, 127699, -428393, 139945, 239198, 276712, 1794, -95121, 19075, -163307, 163880, -201109, -36095, -28825, -43246, 203211, -11942, 52646, 51595, 84609, -130756, -74680, -264659, 66237, -233835, 207321, 304112, -85346, -228112, 227822, 79008, 207804, -244596, -182148, -37980, -42261, 45192, -23904, 196497, 22695, -106205, -234796, -125968, 140715, 94228, -251499, -86211, -74340, -165968, 149448, -138621, -139558, 129263, 186064, -36391, 23523, -66271, -20664, 3274, -43845, -156716, 199319, -125723, -233197, -25233, 157500, -34937, -56386, 1284, 28180, 111784, -92957, -1360, -303347, 166895, -4825, 92072, -146245, -106502, 53905, -117858, 4804, -107389, -25284, -47648, -301135, -161709, -110638, -224512, 78594]
10056i0587L2128p4867p9432A47163a2442l13988B3792J06051K4486c27672d724
10044C9124J5029i7031h092F030f6319k9028k67429L4159A09442a19265j51080
10033b70345J00606A3509a30942k26862a25815A74784l5247d17327d4131j619
10023d5750j44437k24700B52736a47213l2202A38085c47012a43288k8714B29931
10012a21533e1437j4403A19257a38034E4205M4074C9323e7291j47383A77128F878
10000a19925b3228q9488c1099B14181B9832Q1173h1794I0774d69007G3451b01747
9988c945l38986A59334G689b45285g4568c4687A47975a69687p686E6875K9307
9977H6182d45094e307g87p7429n4430d2822q827B4685b44606A05362n0897K9696
$$ y = [-90587, -58459, -133326, -212758, 147163, -12442, -326430, 23792, 129843, 154329, -327672, -4724, 39124, 54153, -97031, -8092, 6030, -66319, -95347, -362776, -328617, 109442, -119265, -270345, -169739, 13509, -130942, -357804, -125815, 174784, 139537, -417327, -44131, -45750, -190187, -414887, 252736, -147213, -179415, 138085, -347012, -143288, -172002, 229931, -121533, -51437, -65840, 119257, -138034, 54205, 98279, 39323, -57291, -204674, 177128, 6878, -119925, -23228, -112716, -31099, 214181, 29832, 111005, -81794, 90774, -469007, 73451, -201747, -3945, -342931, 159334, 7689, -245285, -74568, -34687, 147975, -169687, -177373, 56875, 86182, -445094, -5307, -787, -78216, -132646, -42822, -51649, 24685, -244606, 105362, 54465, 84161]
9965H4161K6046L0913g4033j40545A52204h9294A32281h2444A48063k2964j9561
9954A05538a33413c8443l0680j81306C8478R6264m3764a54713B1138O6575a96208
9942b00897B7519O9152a55873E6370g5914C15240a60418j062k61894a01503k74698
9931c76201F6234e00974K43484r7024I2711j7846b33080E8094c2114k57810a3621
9919c28174a14973o7304j09870Q7393B85177E7006a78185A03715a11292f443A06674
9907A71531b27131J07986c9597g783j54238P2516K0233A1381b54533D0237a5175
9895b11346P6532q8472K8159A35570b94650f085I7762J57418C3691a35433E17
9883b6664A911d0749a1385B30927h309I3298A6558P479a16728B7444a39871C3352
$$ y = [84161, 110207, 141120, -74033, -214578, 152204, -89294, 132281, -82444, 148063, 125099, 105538, -133413, -38443, -69123, -250429, 38478, 134742, 90978, -154713, 21138, 87713, -196208, -200897, 27519, 96671, -155873, 56370, -75914, 315240, -160418, -161480, -423374, -101503, -376201, 66234, -500974, -257490, -354514, 92711, 74865, -233080, 58094, -32114, -289924, -13621, -328174, -114973, -182277, -292147, -204754, 285177, 57006, -178185, 103715, -111292, -6443, 106674, 171531, -227131, -119145, -39597, -7783, -162021, -89505, -69272, 11381, -254533, 40237, -15175, -211346, -134814, -223286, -195127, 135570, -294650, -6085, 97762, 255180, 33691, -135433, 517, -26664, 1911, -40749, -11385, 230927, -8309, 93298, 16558, 24037, -116728, 27444, -139871, 33352]
9870H8261j421d4076p1551G6684b36452b5589A64882C019J03704n2006b96409
9858b27548M2006A3208J42772a73346G5456b96371H5476i4303j58851i8516c8800
9846D4489J04801a60436d8409n4217m7448B45917c09007a44238P187B17355b26489
9834b5198O152A33679b44912A48026i6892j88221B98067a20775m804j77587F1917
9822c22708d3263B19827d2084m6983A93690f6018j70043e7093J5177n682J1668
9811c5930k11640a0207A3462a71988A3502c30100a11483M3904E8412c15273I0382
9799b90636g5268m1775e7651K5163j2310B08268G4834a08403j61402B24368i2055
9787b8089G731K05551e0316k555G3388a35261n2253A8697P492a70896A11668a16622
$$ y = [88261, 86840, -44076, -115627, 76684, -236452, -25589, 164882, 3019, 106723, 54717, -296409, -227548, -185542, 13208, 155980, -173346, 75456, -296371, 85476, -94303, -253154, -98516, -38800, 44489, 149290, -160436, -48409, -102626, -150074, 245917, -309007, -144238, -137051, 217355, -226489, -25198, -19046, 133679, -244912, 148026, -96892, -285113, 298067, -120775, -125579, -303166, 61917, -322708, -43263, 219827, -42084, -89067, 193690, -66018, -236061, -57093, -41916, -47598, -35930, -247570, -10207, 13462, -171988, 13502, -330100, -111483, -67579, 58412, -315273, 90382, -290636, -75268, -117043, -57651, -32488, -44798, 208268, 74834, -108403, -269805, 224368, -92055, -28089, 7731, 213282, -50316, -52871, 73388, -135261, -187514, 18697, 26189, -170896, 111668, -116622]
9774a32318o8556F134a07968J0877b7370a1612j30360B35144F3190b14123P1716
9763a42407A04894J13384D7957a70774j38977N2319m62e6031l5000j5796A5408
9751A0526a74585f0157b9219j20947E6965B0438J7432e9336m0012G6275J90053
9740B66328g0402A61801B9563a32440C36643a47668A71298a80503m4019d1916
9729g505j79568A10754A9111a32290d5935m88724A04940J344d7933A42489i3142
9717b30954J15372N5384k37357a43055j73482h7654q7187J8961E4029J33858f7936
9705A3585L2625b21500R9246J736E75981A41909a20948j53458a03461a6318k66976
9694b83294h3507j05969j32575I4930B3920R0073J48313C617J64898A9131b86960
$$ y = [-132318, -200874, 6134, -107968, -97091, -27370, -11612, -141972, 235144, 63190, -214123, -142407, 104894, 218278, 47957, -170774, -309751, -257432, -257894, -56031, -91031, -106827, 15408, 10526, -174585, -60157, -29219, -150166, 56965, 20438, 37870, -59336, -99348, 76275, 266328, -70402, 161801, 29563, -132440, 336643, -147668, 171298, -180503, -224522, -41916, -7505, -187073, 110754, 19111, -132290, -45935, -534659, 104940, 106284, -47933, 142489, -93142, -230954, -115582, -60198, -297555, -143055, -316537, -87654, -174841, -155880, 54029, 187887, -67936, 13585, 46210, -221500, -122254, -120518, 575981, 141909, -120948, -274406, -103461, -16318, -283294, -83507, -189476, -322051, 94930, 23920, 113993, 262306, 3617, 168515, 19131, -286960]
9682i6702c726k05143a02616H6775f3604A27073m3088a9592F7618a30464B40812
9670e12348A94995H220b57844a09523q3403j30648C16028D4217a327C2646e4764
9658A51514h716l18951h2729B07700a26862m6111Q1685a725A72182j4096b9400
9646e3042j49303C3891L7828c40809A25182i8487A57095b48483r3624a24621G4532
9634E5210J13682a0746N275C00501A4428P3930D1089a67706A27349a98633a7951
9622i610j42926k01591C72583b46625O6136A56625A0105b17560a02890B270K68458
9611B70728e6799j32024p429q9071a19964l4173I2273a21636l92056a04566j73152
9600b77718A78054b00304D49198A25129b30879g0577A92438a88901B07214o1442
$$ y = [-96702, -3726, -208869, -102616, 86775, -63604, 127073, 83985, -19592, 67618, -130464, 240812, -512348, 194995, 8220, -257844, -109523, -192926, -323574, 316028, 44217, -1327, 32646, -54764, 151514, -8716, -327667, -82729, 207700, -126862, -172973, -91288, -1725, 172182, 158086, -29400, -53042, -202345, 33891, 71719, -340809, 125182, -98487, 157095, -248483, -342107, -124621, 74532, 55210, 168892, -10746, -5471, 300501, 14428, 88358, 41089, -167706, 127349, -198633, -17951, -9610, -152536, -354127, 372583, -246625, -180489, 156625, 10105, -217560, -102890, 2270, 270728, -56799, -188823, -196252, -285323, -119964, -154137, 92273, -121636, -513692, -104566, -277718, 178054, -200304, 449198, 125129, -230879, -70577, 192438, -188901, 207214, 145772]
9590A45772b03366A35108B9985a80715c5154m6348J7013k63802a25422j56785
9580b82207B00629F2822K12038c14644I6064h8225B16640a01117C1374c63618
9569D4608Q5479b21689B8161J08893C6607F338L9861a37299k75953A9128a37714
9557a33983d5348J1846j10718r8915F0952e5435j84927D1063a15786N579j62406
9546b72613N8588A94333F5950a49884A917h5296j33844C6061b1524A67019b74386
9534a81859D0259g4750B11553b19552n6905B31547F6512b50276m9751C270J40252
9523A43522o9726Q3172b87757D9556f345A01768h0314j36018I7619J39190E7152
9511b59880o3489M2240a31119O5305k19611j32087A12234J97090c2046r5949B0936
$$ y = [145772, -203366, 135108, 29985, -180715, -35154, -81502, -64489, -328291, -125422, -282207, 200629, 62822, 274860, -314644, 96064, -88225, 216640, -101117, 31374, -363618, 44608, 130087, -221689, 28161, 137054, 36607, 6338, 46199, -137299, -413252, 19128, -137714, -133983, -45348, -33502, -144220, -243135, 60952, -55435, -240362, 41063, -115786, -110207, -272613, -214025, 194333, 65950, -149884, 1917, -85296, -219140, 36061, -21524, 167019, -274386, -181859, 40259, -74750, 211553, -219552, -276457, 231547, 66512, -250276, -300027, 3270, 143522, 73796, 156968, -287757, 49556, -6345, 101768, -80314, -216332, 97619, 236809, 57152, -259880, -323369, -281129, -131119, -65814, -285425, -417512, 112234, 309324, -32046, -127995, 20936]
9499a14721j34320j36897B15753a2802k993j04626e5849l30753b6082A67954c04919
9487D2667j9237J27409a89552c7371H4812a35703O078d9286j41789k17440F1753
9475A22749m8759h8611k07540f1430A03782K6333b1260j60667j71936A51314b12003
9463b76894g129G5862b00413H4398b57832A56373d3558k1385l2492j11927A07959
9451A1380b12249p0913B372L0726M9293c148n4651j48831J6382p7729F9274C3840
9438I2235a49089o1732G6238B6327J92088A7072L6621a19067j97893a28590c6799
9426d2991B58869h9432B44575a21863h320B88978j06027a97222E8418b8196l12091
9415c40287A07587d12980D3850K35473b58456A19475C0244K35120D584c9975k55970
$$ y = [-114721, -249041, -385938, 215753, -12802, -15795, -120421, -55849, -386602, -26082, 167954, -304919, 42667, 23430, 150839, -189552, -37371, 84812, -135703, -129625, -49286, -191075, -408515, 61753, 122749, 73990, -88611, -296151, -61430, 103782, 130115, -21260, -181927, -353863, 151314, -212003, -276894, -7129, 75862, -200413, 84398, -257832, 156373, -43558, -64943, -97435, -209362, 107959, 11380, -212249, -283162, 2372, 33098, 82391, -3148, -57799, -206630, -190248, -267977, 69274, 33840, 92235, -149089, -210821, 76238, 26327, 218415, 17072, 53693, -119067, -316960, -128590, -36799, -42991, 258869, -89432, 244575, -121863, -8320, 288978, 182951, -197222, 58418, -28196, -340287, 107587, -412980, 43850, 279323, -258456, 119475, 30244, 265364, 4584, -39975, -295945]
9404b95945E1441J57929a39174l1698A48156c3625j34937p4520B38023b33377
9393C14803c33026a13292d1689l9055j54112e0025A32996h0874m4844I0264i9381
9381b53234a22191K4910C1725am11534A7714a44905G1882k8260A4936P6679l9483
9369E2132O153g9160A17813f0768C8310a19184d9923C4509N7337a7909I5840f4041
9356d4236B30228a43757j16188P3618e0070H5328a06420I7604E938h0854A0801
9344B38286d5818b636A19968K6397a29789c7424j05280C30997G0190M5246b96737
9332e3528B0343d57604a69098k23869J17754a16715F9212d1151k0428I9442J28273
9321B27715e0836o9856G5110L03874a0670B8369b64858R1773K7760A32729c1948
$$ y = [-295945, 51441, 209370, -139174, -170872, 148156, -33625, -168562, -243082, 238023, -233377, 314803, -333026, -113292, -41689, -80744, -234856, -50025, 132996, -80874, -125718, 90264, -99381, -253234, -122191, -97281, 31725, -1, -411535, 17714, -144905, 71882, 43622, 14936, 91615, 52132, 58285, -79160, 117813, -60768, 38310, -119184, -49923, 34509, 91846, -17909, 95840, -64041, -44236, 230228, -143757, -259945, -186327, -50070, 85328, -106420, 97604, 5938, -80854, 10801, 238286, -45818, -2636, 119968, 146365, -129789, -37424, -142704, 330997, 70190, 115436, -296737, -53528, 20343, -457604, -169098, -392967, -275213, -116715, 69212, -41151, -61579, 99442, 227715, -50836, -120692, 75110, 378984, -10670, 28369, -264858, -173085, -145325, 132729, -31948]
9309D6429L3972c3701C28711A05735P7305g1648k13086r379A97394r764B1435
9297E6404b30968A87348i2731B20317G0998Q9150C5113d2323j8759m4477B11990
9285a32392r3698K5864F6357b41146a10971P677k86775A87764b18784Q388a01544
9273A8158a87757G995b34620A22462d7456A9215a07122A2556a6291k72584A06351
9261f2252K2161G8651b50366A00641L483a71717j54958l2270a20266j8604p4955
9250b13825j9862a15017E5377a82036B2037J49853q5087J82195a87848D4790J23672
9239A68462J32459a29599c8733q7657A14549g6722f472A11084k3896d7693A34234
9227a75728J0190a7663l33757J3005D7134a30307A19594b14227m4679a0126I4696
$$ y = [46429, 80401, -33701, 328711, 105735, 183040, -71648, -284734, -294113, 197394, 187630, 21435, 56404, -230968, 187348, -92731, 220317, 70998, 160148, 35113, -42323, -61082, -105559, 211990, -132392, -226090, -200226, 66357, -241146, -110971, -103294, -390069, 187764, -218784, -210396, -101544, 18158, -187757, 7995, -234620, 122462, -47456, 19215, -107122, 12556, -16291, -288875, 106351, -62252, -40091, 78651, -250366, 100641, 104124, -171717, -326675, -358945, -120266, -138870, -213825, -233687, -115017, 55377, -182036, 22037, 171890, 86803, 268998, -187848, 44790, 168462, 300921, -129599, -38733, -126390, 114549, -76722, -6472, 111084, 87188, -47693, 134234, -175728, -165538, -17663, -351420, -338415, 47134, -130307, 119594, -214227, -258906, -10126, 94696]
9215c05783B05051c04295C41409F7175O777q654a74811e4889m1607p6913o489
9204a79898p1571A55770C2361b80052A54349J46451a55177o5231d1664p2829F375
9192D3641K56510A16242P3814B6810i7736K9457A9943d6699r8759m8047h9027
9180b34110K0884i8134F7838b22049A34161a84423J382A02221b34749c3533j52189
9169a85722A09042g6485k86683a76263K5762n3324k2346A69780a53175A09765
9158a20672j54672I8955M9270A9597i9780J3876j98952n0562B3114b53091g5710
9146D5956B2340K40749c54196J21063G4352b21975k3369c0772j45841B98263b91466
9134A12181a15301G7737b46753H802a24083k3833N8048j53820B375J37581J35634
$$ y = [-305783, 205051, -304295, 341409, 67175, 73952, 65298, -174811, -54889, -96496, -173409, -179898, -251469, 155770, 32361, -280052, 154349, 300800, -155177, -220408, -41664, -114493, 6375, 43641, 300151, 116242, 190056, 26810, -97736, -68279, 19943, -46699, -145458, -193505, -89027, -234110, -213226, -98134, 67838, -222049, 134161, -184423, -183041, 102221, -234749, -33533, -185722, 109042, -76485, -363168, -176263, -150501, -203825, -226171, 169780, -153175, 109765, -120672, -275344, 98955, 148225, 19597, -99780, -85904, -284856, -335418, 23114, -253091, -75710, 45956, 22340, 263089, -354196, -233133, 74352, -221975, -245344, -30772, -176613, 298263, -291466, 112181, -115301, 77737, -246753, 8802, -124083, -147916, -89868, -243688, 2375, 139956, 275590]
9123B75590b9177A90993h5799j18915F608O3373g1250m7578A37607N8035b31554
9111f5227j63722A14940a49480j5482A68835c5996j68375e0752K0651n9072a4833
9099c45455g7694B8941c625m96363D3083a31337r3140Q0797I7782c45325N9643
9088b85682L8948A14920A7381a70081c8761o1529l95059A69580f4083H2952d6658
9076a11270B3980J97726H6356b8397Q434l07430J16046k9591A72527a52946L9604
9065a13342I6207a70268b6463k25723h971m5278q791B09015d0748j32383e8850
9053A89108a02117A36770a59371C8436c14950A3675B80c0495k6266B35104a40886
9041i9783k05715B20497p416n0599A5947a79068A24422a88426I454b91335c7450
$$ y = [275590, -29177, 190993, -85799, -204714, 6608, 69981, -71250, -118828, 137607, 195642, -231554, -65227, -228949, 114940, -149480, -164962, 168835, -35996, -204371, -50752, -30101, -89173, -14833, -345455, -77694, 28941, -3625, -499988, 43083, -131337, -224477, -143680, 97782, -345325, -285682, -246734, 114920, 17381, -170081, -38761, -100290, -495349, 169580, -64083, 82952, -46658, -111270, 23980, 221706, 86356, -28397, -19963, -327393, -211347, -240938, 172527, -152946, -113342, 96207, -170268, -26463, -252186, -8971, -54249, -63040, 209015, -40748, -173131, -58850, 189108, -102117, 136770, -159371, 38436, -314950, 13675, 280, -30495, -56761, 235104, -140886, -99783, -305498, 220497, 213081, 162482, 15947, -179068, 124422, -188426, 9454, -291335, -37450]
9029g0291A28798b14879D5394L23561b42107H3246P2615i5051F1865p369b3702
9017a82651E2979a68356A58094M7351a18041A07532a99729g3762m79401a60215
9006B26944a02759A54237J6646J91D9166J97027a06572E1835d16490b02539a00960
8994B88994a09082M1331j54853a00288A42762a77117A33960R7888f5190m4820
8984a10010L8061j37691i097H3488j1827L7702C2788c29381N7161b4108A85392
8972A46083d0419C8698i2766j19380O7616m6590p674c3323B91827f6420k57554
8961c23974A67104a62205j32625J43095E1756k0857c5837O904B1401a80968P7135
8950a03833M5290B0757a39956H7699J29997M5566a81163F4610b13370j14684n0620
$$ y = [-70291, 128798, -214879, 45394, 368955, -242107, 83246, 155861, -95051, 61865, 54496, -23702, -182651, 52979, -168356, 158094, 205445, -118041, 107532, -199729, -73762, -553163, -160215, 226944, -102759, 154237, 170883, 171074, 49166, 246193, -106572, 51835, -416490, -202539, -100960, 288994, -109082, -67751, -222604, -100288, 142762, -177117, 133960, 231848, -65190, -110010, -71949, -209640, -9097, 83488, 71661, 109363, 32788, -329381, -272220, -24108, 185392, 146083, -40419, 38698, -92766, -212146, -144530, -191120, -198794, -33323, 291827, -66420, -323974, 167104, -162205, -294830, -151735, 51756, 30899, -35837, -28933, 21401, -180968, -103833, -58543, 20757, -139956, 87699, 217696, 263262, -181163, 64610, -213370, -328054, -378674]
8939c78674a74108L7253j43248a3927q4218j89796A4557c0744k04896B67147H9928
8927a13003D3741j9028c72393h3297a9503j11172A33610L55341L67913l60362
8917D96502L7020f7533F8558A0596b74725C24139j10239b09823J5333B54407E0580
8905B20360a08789A58455e0936k48952J7753B35730j2202B2003L61427b340n4142
8894e6482J6017C2157h8464B29896F6770e9277I791a31477E1435O6657c2803R515
8882b3288A0973K7445A2833M4542K01647G9375N7030i6509p0388E1623a28270
8870D2666J09104Q5051B7059Q2394g3188j27064A09658D4224P7319n557c1199
8858A6503e4759B2989f5777j37322B4262c36978G6556b73304J3186A25078G538
$$ y = [-378674, -174108, -136855, -280103, -13927, -98145, -287941, 14557, -30744, -235640, 267147, 89928, -113003, 43741, 24713, -372393, -83297, -19503, -130675, 133610, 488951, 856864, 496502, 533522, -67533, 68558, 10596, -274725, 324139, 213900, -209823, -194490, 254407, 50580, 220360, -108789, 158455, -50936, -299888, -282135, 235730, 223528, 22003, 383430, -2340, -56482, -40465, 32157, -88464, 229896, 66770, -59277, 9791, -131477, 51435, 118092, -32803, -23288, 10973, 38418, 12833, 57375, 259022, 79375, 136405, -96509, -166897, 51623, -128270, 42666, 151770, 236821, 27059, 109453, -73188, -200252, 109658, 44224, 121543, 115986, -31199, 16503, -54759, 22989, -65777, -203099, 24262, -336978, 76556, -273304, -260118, 125078, 7538]
8846a71533C7751A3537K03508f2444p913k63916a011B94709H725b31540R4226
8835a37314C8832L47465A0411b35898G5942b8946r7775f3085j7224o8224H8849
8823a28733f0605r4365A52843a75402a3883k51372r9744J44694A59511a68789
$$ y = [-171533, 37751, 13537, 217045, -62444, -70357, -334273, -1011, 294709, 8725, -231540, -137314, 38832, 386297, 10411, -235898, 75942, -28946, -126721, -63085, -80309, -148533, 88849, -128733, -60605, -154970, 152843, -175402, -13883, -265255, -364999, -220305, 159511, -168789]
$$ [...]
##END NTUPLES=NMR SPECTRUM
##END=
