##TITLE=NES1033_872015079_9243059_InYdxdyMnh
##JCAMPDX= 6.0         $$ Bruker NMR JCAMP-DX V2.0
##DATA TYPE= NMR SPECTRUM
##DATA CLASS= NTUPLES
##ORIGIN= BRUKER
##OWNER= Administrator
$$ 1.72 TOPSPIN		Version 2.1
$$ 2015-07-02 15:11:24.258 -0700  Administrator@X
$$ Compression mode = diff/dup
##.OBSERVE FREQUENCY= 400.02188249412
##.OBSERVE NUCLEUS= ^1H
##.ACQUISITION MODE= SIMULTANEOUS (DQD)
##.ACQUISITION SCHEME= undefined
##.AVERAGES= 64
##.DIGITISER RES= 22
##SPECTROMETER/DATA SYSTEM= spect
##.PULSE SEQUENCE= noesygpps1d.comp
##.SOLVENT NAME= COFFEE_meoh
##.SHIFT REFERENCE= INTERNAL, COFFEE_meoh, 1, 14.96214
##AUDIT TRAIL= $$ (NUMBER, WHEN, WHO, WHERE, PROCESS, VERSION, WHAT)
$$ ##TITLE= Audit trail, TOPSPIN		Version 2.1
$$ ##JCAMPDX= 5.01
$$ ##ORIGIN= Bruker BioSpin GmbH
$$ ##OWNER= Administrator
$$ $$ E:\/data/COFFEE/nmr/NES1033_872015079_9243059_InYdxdyMnh/22/pdata/1/auditp.txt
$$ ##AUDIT TRAIL=  $$ (NUMBER, WHEN, WHO, WHERE, PROCESS, VERSION, WHAT)
(   1,<2015-07-02 15:11:19.086 -0700>,<Administrator>,<X>,<go>,<TOPSPIN 2.1>,
      <created by zg
	started at 2015-07-02 14:59:49.477 -0700,
	POWCHK enabled, PULCHK disabled,
       configuration hash MD5:
       21 0F 79 D6 B3 7B B4 F6 88 20 88 DB 03 48 BD 9F
       data hash MD5: 64K
       00 DE A1 50 01 AA 07 2F 1F A0 B7 C7 25 66 77 B9>)
(   2,<2015-07-02 15:11:22.227 -0700>,<Administrator>,<X>,<proc1d>,<TOPSPIN 2.1>,
      <Start of raw data processing
       efp LB = 0.3 FT_mod = 6 PKNL = 1 PHC0 = 0 PHC1 = 0 SI = 128K 
       data hash MD5: 128K
       B2 58 62 DE 98 7D CB B7 30 6A D7 B5 64 1C 36 B1>)
(   3,<2015-07-02 15:11:23.070 -0700>,<Administrator>,<X>,<proc1d>,<TOPSPIN 2.1>,
      <pk PHC0 = -82.71057 PHC1 = 0 
       data hash MD5: 128K
       ED A2 F1 40 4D 9C 5F 82 CD 87 C1 67 12 1D FF A0>)
(   4,<2015-07-02 15:11:23.445 -0700>,<Administrator>,<X>,<proc1d>,<TOPSPIN 2.1>,
      <abs ABSG = 1 
       data hash MD5: 128K
       EF CA 47 4E 5F 92 91 2C 67 D0 D4 FE 24 A7 75 6B>)
(   5,<2015-07-02 15:11:23.539 -0700>,<Administrator>,<X>,<proc1d>,<TOPSPIN 2.1>,
      <abs ABSG = 2 
       data hash MD5: 128K
       83 36 29 55 BB 2A 1D 80 8A 47 83 9A 4C 70 AE A3>)
(   6,<2015-07-02 15:11:23.633 -0700>,<Administrator>,<X>,<proc1d>,<TOPSPIN 2.1>,
      <abs ABSG = 3 
       data hash MD5: 128K
       40 A8 EB B0 F4 A4 CF BC BE 89 71 44 81 41 78 54>)
(   7,<2015-07-02 15:11:23.711 -0700>,<Administrator>,<X>,<proc1d>,<TOPSPIN 2.1>,
      <abs ABSG = 4 
       data hash MD5: 128K
       3F 86 A5 BF 15 63 14 D3 40 63 FF 62 B4 25 3C 3B>)
(   8,<2015-07-02 15:11:23.836 -0700>,<Administrator>,<X>,<proc1d>,<TOPSPIN 2.1>,
      <abs ABSG = 5 
       data hash MD5: 128K
       F1 C2 AC 4A D9 9F D5 4E AD BB C0 27 24 B2 74 AA>)
$$ ##END=
$$ 
$$ $$ hash MD5
$$ $$ AA 8B FF B7 3E BA C1 20 1A 4E DB 9B 41 52 E8 26
##$RELAX= 
##$RELAX= 
##$RELAX= 
##$RELAX= 
##$RELAX= 
##$RELAX= 
##$RELAX= 
##$RELAX= 
$$ Bruker specific parameters
$$ --------------------------
##$DU= <E:\>
##$EXPNO= 22
$$ [...]
##$TP07= 0
##$TPNAME0= <>
##$TPNAME1= <>
##$TPNAME2= <>
##$TPNAME3= <>
##$TPNAME4= <>
##$TPNAME5= <>
##$TPNAME6= <>
##$TPNAME7= <>
##$TPOAL= (0..7)
0.5 0.5 0.5 0.5 0.5 0.5 0.5 0.5
##$TPOFFS= (0..7)
0 0 0 0 0 0 0 0
##$TUNHIN= 0
##$TUNHOUT= 0
##$TUNXOUT= 0
##$USERA1= <user>
##$USERA2= <user>
##$USERA3= <user>
##$USERA4= <user>
##$USERA5= <user>
##$V9= 5
##$VALIST= <valist>
##$VCLIST= <CCCCCCCCCCCCCCC>
##$VD= 0
##$VDLIST= <DDDDDDDDDDDDDDD>
##$VPLIST= <PPPPPPPPPPPPPPP>
##$VTLIST= <TTTTTTTTTTTTTTT>
##$WBST= 2048
##$WBSW= 25
##$XGAIN= (0..3)
0 0 0 0
##$XL= 0
##$YL= 0
##$YMAX_a= 7750796
##$YMIN_a= -13961486
##$ZGOPTNS= <>
##$ZL1= 120
##$ZL2= 120
##$ZL3= 120
##$ZL4= 120
##$ABSF1= 14.96214
##$ABSF2= -5.596042
##$ABSG= 5
##$ABSL= 3
##$ALPHA= 0
##$AQORDER= 0
##$ASSFAC= 0
##$ASSFACI= 0
##$ASSFACX= 0
##$ASSWID= 0
##$AUNMP= <proc_prof1d_extract.lims>
##$AXLEFT= 0
##$AXNAME= <>
##$AXNUC= <1H>
##$AXRIGHT= 0
##$AXTYPE= 0
##$AXUNIT= <>
##$AZFE= 0.1
##$AZFW= 0.1
##$BCFW= 0
##$BC_mod= 0
##$BYTORDP= 0
##$COROFFS= 0
##$CY= 15
##$DATMOD= 1
##$DC= 0
##$DFILT= <>
##$DTYPP= 0
##$F1P= 0
##$F2P= 0
##$FCOR= 0.5
##$FTSIZE= 131072
##$FT_mod= 6
##$GAMMA= 0
##$GB= 0
##$INTBC= 1
##$INTSCL= 1
##$ISEN= 128
##$LB= 0.3
##$LEV0= 0
##$LPBIN= 0
##$MAXI= 10000
##$MC2= 0
##$MEAN= 0
##$ME_mod= 0
##$MI= 0
##$NCOEF= 0
##$NC_proc= -2
##$NLEV= 6
##$NOISF1= 0
##$NOISF2= 0
##$NSP= 0
##$NTH_PI= 0
##$NZP= 0
##$OFFSET= 14.96214
##$PC= 1
##$PHC0= -82.71057
##$PHC1= 0
##$PH_mod= 1
##$PKNL= yes
##$PPARMOD= 0
##$PPDIAG= 0
##$PPIPTYP= 0
##$PPMPNUM= 2147483647
##$PPRESOL= 1
##$PSCAL= 4
##$PSIGN= 0
##$PYNMP= <proc.py>
##$REVERSE= no
##$SF= 400.020009182347
##$SI= 131072
##$SIGF1= 0
##$SIGF2= 0
##$SINO= 400
##$SIOLD= 131072
##$SPECTYP= <>
##$SREGLST= <1H.CDCl3>
##$SSB= 0
##$STSI= 131072
##$STSR= 0
##$SW_p= 8223.68421052631
##$SYMM= 0
##$S_DEV= 0
##$TDeff= 65536
##$TDoff= 0
##$TI= <>
##$TILT= no
##$TM1= 0
##$TM2= 0
##$TOPLEV= 0
##$USERP1= <user>
##$USERP2= <user>
##$USERP3= <user>
##$USERP4= <user>
##$USERP5= <user>
##$WDW= 1
##$XDIM= 131072
##$YMAX_p= 294110112
##$YMIN_p= -10954
##$CURPLOT= <Network HP LaserJet P1505>
##$CURPRIN= <$Network HP LaserJet P1505>
##$DFORMAT= <normdp>
##$LAYOUT= <+/1D_H.xwp>
##$LFORMAT= <normlp>
##$PFORMAT= <normpl>
##$SURQMSG= 1
$$ End of Bruker specific parameters
$$ ---------------------------------
##NTUPLES= NMR SPECTRUM
##VAR_NAME=  FREQUENCY,     SPECTRUM/REAL,   SPECTRUM/IMAG
##SYMBOL=    X,             R,               I
##VAR_TYPE=  INDEPENDENT,   DEPENDENT,       DEPENDENT
##VAR_FORM=  AFFN,          ASDF,            ASDF
##VAR_DIM=   131072,        131072,          131072
##UNITS=     HZ,            ARBITRARY UNITS, ARBITRARY UNITS
##FACTOR=    0.0627417313425164, 1,          1
##FIRST=     8223.62146879497, -1576,        -48786
##LAST=      0,             453,             -49574
##MIN=       0,             -10954,          0
##MAX=       8223.62146879497, 294110112,    0
$$ Real data points
##PAGE= N=1
##DATA TABLE= (X++(R..R)), XYDATA
$$ [...]
63464B67539L053L411M219N096N430N264N102N071M769L882K663J783J800K590
63450C21672L344L433L231L647M820N927O440O851P861R411J1047J2637J4143
63437D14464J5200J5492J5262J4860J4101J2660J0804R134P796O495N154L943
63425E45365K803J544L16n70j222k056l107l964m440m823n395o049o536o804p037
63410D98025p501q317r236r751r679r389r250r125q777q386q192p808o576m575
63396C81463k714j751j554j385n63J067L043M654N601O156O517O451O030O132
63382D19147P454R367J0575J0779J0756J0919J0848J0335R902R841R661Q926P914
63369E46424O904N558L642J721M21m87j548k536k813k489k420k968l561l709l769
$$ plain form
63464 267539 270592 274003 278222 283318 288748 294012 299114 304185 308954 312836 315499 317282 319082 321672
63450 321672 325016 328449 331680 335327 340147 346074 352514 359365 367226 376637 387684 400321 414464
63437 414464 429664 445156 460418 475278 489379 502039 512843 521977 529773 536268 541422 545365
63425 545365 548168 549712 550028 549458 548236 546180 543073 539109 534669 529846 524451 518402 511866 505062 498025
63410 498025 490524 482207 472971 463220 453541 444152 434902 425777 417000 408614 400422 392614 386038 381463
63396 381463 378749 376998 375444 374059 373496 374563 377606 382260 387861 394017 400534 406985 413015 419147
63382 419147 426601 435968 446543 457322 468078 478997 489845 500180 510082 519923 529584 538510 546424
63369 546424 553328 558886 562528 564249 564670 564183 562635 560099 557286 554797 552377 549409 545848 542139 538370
63354E38370m367n532o765p735q424q774q615q101p771p925q134p726o729n833
63340D35939n383m841l708k507k280l232m437m926m627m129l983m338m937n324
63326C77287n286n125n187n205m549l142j634o14j23l0k98o04l18P25J794K047
63310C49738J450N71j97p93j180j346j536k050k804l333l304k960l011m003n551
63295C19691o397n630l896k786k938l315k651j059K75N35j37j146j981k418k592
63280B83555k784k908k494j438l36K73N78R28J093O88j2l63k15J92R02K029L028
63263B82716L100K398J966K336K948L231L374L645L733L438L444M516O216P218
63249C34279O966O335O426P241P951Q163Q389R249J0656J2017J3000J3798J4729
$$ plain form
63354 538370 534003 528471 521706 513971 505547 496773 488158 480057 472286 464361 456227 448501 441772 435939
63340 435939 430556 425715 422007 419500 417220 413988 409551 404625 399998 395869 391886 387548 382611 377287
63326 377287 372001 366876 361689 356484 351935 348793 347159 346545 346422 346392 346094 345490 345172 345897 347691 349738
63310 349738 351188 351759 351562 350769 349589 348243 346707 344657 341853 338520 335216 332256 329245 325242 319691
63295 319691 313294 307664 303768 300982 298044 294729 292078 291019 291294 291829 291692 290546 288565 286147 283555
63280 283555 280771 277863 275369 273931 273595 273868 274446 275374 276467 277155 277143 276780 276565 276757 277659 279688 282716
63263 282716 285816 288214 290180 292516 295464 298695 302069 305714 309447 312885 316329 320845 327061 334279
63249 334279 341245 347580 354006 361247 369198 377361 385750 394999 405655 417672 430672 444470 459199
63236D59199J5897J7226J8499J9424J9956K0576K1697K2867K3081K2160K1115
63225F81697K0777K0795K0536K0320K0774K1474K1297K0117J9024J8775J8902
63214I04488J8572J7455J5428J2358Q626N159K259r81n423j0483j4729j7547j9509
63201I15673k1229k2570k3086k2770k2075k1411k0711j9419j7101j4069j1285
63190F99947r344p812n757k776P19L965O315P517P991Q696J0246J2185J3477J3763
63176G59132J3691J3984J4572J4865J4528J3764J2940J2216J1453J0377Q878P175
63164I07575N547L889J782r01l688o122q393j0989j3738j5753j6474j6334j6118
63151H10283j6048j5925j5770j5683j5198j3641j1293r410q699q375p288n436
$$ plain form
63236 459199 475096 492322 510821 530245 550201 570777 592474 615341 638422 660582 681697
63225 681697 702474 723269 743805 764125 784899 806373 827670 847787 866811 885586 904488
63214 904488 923060 940515 955943 968301 976927 982086 984345 983364 977941 967458 952729 935182 915673
63201 915673 894444 871874 848788 826018 803943 782532 761821 742402 725301 711232 699947
63190 699947 690603 682791 677034 674258 674977 678942 685257 692774 700765 709461 719707 731892 745369 759132
63176 759132 772823 786807 801379 816244 830772 844536 857476 869692 881145 891522 900400 907575
63164 907575 913122 917011 918793 917892 914204 908082 899689 888700 874962 859209 842735 826401 810283
63151 810283 794235 778310 762540 746857 731659 718018 706725 697315 688616 680241 672953 667517
63139F67517l717k609j889j407j320j520j601j558j867k698l574m001m006l839
63125F31911l664l652l893m036l555k564j813j619j448q80l26k86m47j67N23J046
63109F05130J125R29O67N67R86J897K512K075R39J59J49L79M13M59P37R83R08
63092F21014O58M80L18P2p6J43O93J262J557J470J170J096J663K858M248N350
63076F43976N875N785N465N672O848Q521R812J0508J1045J1567J1718J1595J2021
63063G60408J3451J5290J6842J8274K0031K1865K3335K4834K7104K9892L2077
63052A003403L3231L4175L5637L7235L8184L8403L8383L8410L8429L8350L8035
63041A411875L7328L6458L6077L6457L6929L6641L5608L4379L2945L0673K7350
$$ plain form
63139 667517 663800 661191 659302 657895 656575 655055 653454 651896 650029 647331 643757 639756 635750 631911
63125 631911 628247 624595 620702 616666 613111 610547 608734 607115 605667 604787 604461 604175 603728 603561 604084 605130
63109 605130 606255 607184 607851 608418 609404 611301 613813 615888 616827 616986 617135 617514 617927 618386 619123 620106 621014
63092 621014 621672 622152 622470 622542 622466 622609 623302 624564 626121 627591 628761 629857 631520 634378 638626 643976
63076 643976 649851 655636 661101 666773 673621 682142 691954 702462 713507 725074 736792 748387 760408
63063 760408 773859 789149 805991 824265 844296 866161 889496 914330 941434 971326 1003403
63052 1003403 1036634 1070809 1106446 1143681 1181865 1220268 1258651 1297061 1335490 1373840 1411875
63041 1411875 1449203 1485661 1521738 1558195 1595124 1631765 1667373 1701752 1734697 1765370 1792720
63030A792720K3492J9426J4677Q695J660n789j3237k0505k7265l3208l8406m3107
63018A679153m7172n0091n1520n1576n0560m8721m6223m3124l9358l4962l0274
63007A185572k5689k1262j6768j2155p662l520J86L412O181Q787J1614J4622J7233
62994A160551J8901J9614J9768J9743J9682J9469J8833J7646J6164J4752J3333
62983A358456J1387Q572N022R16l789r008j4235j9071k3689k8403l2892l6419
62971A216847l8776m0554m2297m3794m4466m4146m3187m1858m0010l7522l4797
62960G65440l2468l0608k8582k5909k3014k0721j9231j8062j6903j5944j5193
62949E18805j4152j2556j0906r722q718p297n724m975n429o308o633o313n997
$$ plain form
63030 1792720 1816212 1835638 1850315 1859010 1860670 1854881 1841644 1821139 1793874 1760666 1722260 1679153
63018 1679153 1631981 1581890 1530370 1478794 1428234 1379513 1333290 1290166 1250808 1215846 1185572
63007 1185572 1159883 1138621 1121853 1109698 1102036 1098516 1098702 1102114 1108295 1117082 1128696 1143318 1160551
62994 1160551 1179452 1199066 1218834 1238577 1258259 1277728 1296561 1314207 1330371 1345123 1358456
62983 1358456 1369843 1378415 1383437 1384353 1380564 1371556 1357321 1338250 1314561 1286158 1253266 1216847
62971 1216847 1178071 1137517 1095220 1051426 1006960 962814 919627 877769 837759 800237 765440
62960 765440 732972 702364 673782 647873 624859 604138 584907 566845 549942 533998 518805
62949 518805 504653 492097 481191 471469 462751 455454 449730 444755 439326 433018 426385 420072 414075
62936D14075o090o260n826m519k844j656j334j519j738k012k575l215l431l177
62922C67879k961l097l266l033k461j978j862k097k472k719k640k304j993j912
62908C33084k035k244k381k126j183K26J252J191K73n25n21K9L17l8o28q22n30
62891C23339k33k57l72k38J36N75J093J600J591P66k09k68O16J266Q05k50q14
62874C29146n01L44J395K395K852K422J508Q33M86m8q34j219q33k81l75j061j642
62857C34587j815j956k399k874k920k510k026j742j595j457j289r64k51P41J343
62842C12873R79k2o91n63q2K75O70J343J846J590Q88P27J411K115K052J463J092
62825C27966J117J118Q97Q21J316K362L484M104L990L534L433L961M666N016N052
$$ plain form
62936 414075 407985 401725 395899 391380 388536 386880 385546 384027 382289 380277 377702 374487 371056 367879
62922 367879 364918 361821 358555 355522 353061 351083 349221 347124 344652 341933 339293 336989 334996 333084
62908 333084 331049 328805 326424 324298 323115 323341 324593 325784 326057 325532 325011 325040 325357 325319 324691 323869 323339
62891 323339 323106 322849 322477 322239 322375 322950 324043 325643 327234 328000 327791 327523 328139 329405 330210 329960 329146
62874 329146 328645 328989 330384 332779 335631 338053 339561 340394 340880 340832 339998 338779 337946 337665 337290 336229 334587
62857 334587 332772 330816 328417 325543 322623 320113 318087 316345 314750 313293 312004 311040 310789 311530 312873
62842 312873 313852 313830 313139 312576 312494 312769 313439 314782 316628 318218 319106 319833 321244 323359 325411 326874 327966
62825 327966 329083 330201 331098 331919 333235 335597 339081 343185 347175 350709 354142 358103 362769 367785 372837
62810C72837N083M978M420L788M104N758P862R283R905J0444J1260J2060J2649
62797D74431J3334J4443J5928J7687J9866K2529K5275K7614K9639L2036L5372
62786G28154L9584M4152M8637N2945N7134O1018O4121O6074O7000O7261O6820
62775A362900O5069O1445N6041M9458M2182L4306K5703J6283O149m324j4600k4253
62763A676359l3074m0829m7173n2009n5698n8636o0729o1647o1481o0708n9508
62752A084867n7595n4875n1766m8641m5397m1944l8796l6541l4896l2859k9931
62741F11626k6692k3949k1743j9599j7401j5503j4035j2615j0932r236p953p082
62729D24886o270n330m397l591k772j727m12R57J987K450K666L420N135P269Q893
$$ plain form
62810 372837 377920 382898 387318 391106 395210 400968 408830 418113 428018 438462 449722 461782 474431
62797 474431 487765 502208 518136 535823 555689 578218 603493 631107 660746 692782 728154
62786 728154 767738 811890 860527 913472 970606 1031624 1095745 1161819 1228819 1296080 1362900
62775 1362900 1427969 1489414 1545455 1594913 1637095 1671401 1697104 1713387 1719536 1715212 1700612 1676359
62763 1676359 1643285 1602456 1555283 1503274 1447576 1388940 1328211 1266564 1205083 1144375 1084867
62752 1084867 1027272 972397 920631 871990 826593 784649 745853 709312 674416 641557 611626
62741 611626 584934 560985 539242 519643 502242 486739 472704 460089 449157 439921 431968 424886
62729 424886 418616 413286 408889 405298 402526 400799 400387 401344 403331 405781 408447 411867 417002 424271 433164
62714D33164R797J0630J1932J3560J5184J6941J9239K2252K5758K9256L2119L4061
62702F73893L5619L7761M0695M3520M5326M6145M6410M5973M4349M1493L7693
62691A138877L2954K7129K0539J3734O801m82p893j4838k1079k6711l1503l5007
62679A102521l7407l9464m1433m2756m3002m2437m1421l9988l8260l6570l4793
62668F64990l2304k9069k6092k4142k2630k0534j7946j5935j5063j4787j4260
62657D32228j3144j1663j0347r771j0025j0395r902q295o329m969m486m368l974
62644C24560l237k658k560k596k247j642j353j452j414j060r17j324j793j757
62630B98550j366j128j177j345j511j415o13P99J919K094J852K149L030L813M213
$$ plain form
62714 433164 442961 453591 465523 479083 494267 511208 530447 552699 578457 607713 639832 673893
62702 673893 709512 747273 787968 831488 876814 922959 969369 1015342 1059691 1101184 1138877
62691 1138877 1171831 1198960 1219499 1233233 1240034 1239552 1231659 1216821 1195742 1169031 1137528 1102521
62679 1102521 1065114 1025650 984217 941461 898459 856022 814601 774613 736353 699783 664990
62668 664990 632686 603617 577525 553383 530753 510219 492273 476338 461275 446488 432228
62657 432228 419084 407421 397074 387303 377278 366883 356981 348686 342357 337388 332902 328534 324560
62644 324560 321323 318665 316105 313509 311262 309620 308267 306815 305401 304341 303424 302100 300307 298550
62630 298550 297184 296056 294879 293534 292023 290608 289995 290794 292713 294807 296659 298808 301838 305651 309864
62615C09864M539M960N363N812O474P198P831Q761J0437J2531J4269J5528J6837
62602D30404J8487K0377K2627K5326K7839K9309K9942L0796L2142L3067L2919
62591G33235L2004L0526K7965K4101J9687J5368J0817N646L94m246q462j2729
62579H74306j6757j9999k2670k5283k7560k8755k8852k8462k7775k6573k5153
62568E96467k4164k3428k1998j9703j7621j6585j5961j4602j2435j0465r480r285
62556D00740r138q497p411o411o025o247o606o717o498n874m735l417k677k771
62542C17716k924k272j091m09m69l05R22K762M075M370M094L855L930M466N643
62527C44363P410R416J1333J3067J4539J5660J6622J7920J9717K1569K3048K4355
$$ plain form
62615 309864 314403 319363 324726 330538 337012 344210 352041 360802 371239 383770 398039 413567 430404
62602 430404 448891 469268 491895 517221 545060 574369 604311 635107 667249 700316 733235
62591 733235 765239 795765 823730 847831 867518 882886 893703 899349 899743 895497 887035 874306
62579 874306 857549 837550 814880 789597 762037 733282 704430 675968 648193 621620 596467
62568 596467 572303 548875 526877 507174 489553 472968 457007 442405 429970 419505 410025 400740
62556 400740 391602 383105 375694 369283 363258 357011 350405 343688 337190 331316 326581 323164 320487 317716
62542 317716 314792 312520 311429 311020 310551 310246 311168 313930 318005 322375 326469 330324 334254 338720 344363
62527 344363 351773 361189 372522 385589 400128 415788 432410 450330 470047 491616 514664 539019
62515E39019K5883K7324K7867K7272K6193K5244K4202K2427J9745J6521J3118
62504G94815R620N992K219j700n657r365j2566j5285j7673j9680k1089k1933k2557
62491F65141k3169k3477k3011k1750k0190j8731j7304j5733j4223j3110j2307
62480D62136j1409j0351r473q804p886o575n515n227n253m823m083l781l888l502
62466C71566k244q84j41L38J260K542L545M105M560M969M960M431L855L759M204
62451D10825M929N671O181O185N525M394L239K307J352p7j935l530m293m541n043
62436D31189n967o723o837o409n635m477l188k498k797l494l701l247k524j666
62422C72026n92L60O04K28J25Q99K106K851K878K721K934L487M000M307M605N021
$$ plain form
62515 539019 564902 592226 620093 647365 673558 698802 723004 745431 765176 781697 794815
62504 794815 804435 810427 812646 810946 805289 795924 783358 768073 750400 730720 709631 687698 665141
62491 665141 641972 618495 595484 573734 553544 534813 517509 501776 487553 474443 462136
62480 462136 450727 440376 430903 422099 414213 407638 402123 396896 391643 386820 382737 378956 375068 371566
62466 371566 369322 368438 368297 368635 369895 372437 375982 380087 384647 389616 394576 399007 402862 406621 410825
62451 410825 415754 421425 427606 433791 439316 443710 446949 449256 450608 450531 448596 445066 440773 436232 431189
62436 431189 425222 418499 411662 405253 399618 395141 391953 389455 386658 383164 379463 376216 373692 372026
62422 372026 371434 371794 372398 372626 372751 373650 375756 378607 381485 384206 387140 390627 394627 398934 403539 408560
62406D08560N317N218M919M899N307N793O037O068N926N492M827M312M148M064
62392D80887L785L472L351L316L207L151L191L013K547K430L239M588N719O686
62378E32582Q138J0034J1511J2195J2795J4087J5959J7868J9673K1531K3343K4699
62366G24415K5281K5083K4382K3592K2910K2024K0466J8220J5678J3011J0024
62355I45086O733L538O50k185n118p765r681j1026j2424j4338j6689j8884k0115
62342H37782k0001j9081j8360j8221j8068j7282j6066j5095j4625j4314j3727
62331F52942j2697j1376j0109r161q457p724o911o204n593m825l888l061k392
62318E60544j594o77j30j43k00J68P37J165J644K445L259L650L851M329M893M980
$$ plain form
62406 408560 413877 419095 424014 428913 434220 440013 446050 452118 458044 463536 468363 472675 476823 480887
62392 480887 484672 488144 491495 494811 498018 501169 504360 507373 509920 512350 515589 520177 525896 532582
62378 532582 540720 550754 562265 574460 587255 601342 617301 635169 654842 676373 699716 724415
62366 724415 749696 774779 799161 822753 845663 867687 888153 906373 922051 935062 945086
62355 945086 951819 955357 956007 953822 948704 940939 931258 920232 907808 893470 876781 857897 837782
62342 837782 817781 798700 780340 762119 744051 726769 710703 695608 680983 666669 652942
62331 652942 640245 628869 618760 609599 601142 593418 586507 580303 574710 569885 565997 562936 560544
62318 560544 558950 558273 558143 558000 557800 557968 558705 559870 561514 563959 567218 570868 574719 579048 583941 588921
62302E88921M639M521M862N244N362N377N480N631N862O269O587O372N670N077
62288F65874M992N252N522N619N430M972M577M532M651M766N437P332R898J1702
62274G50556J2318J2903J4457J6546J8357K0033K2021K3904K4946K5300K5585
62263I66926K5590K4585K2708K0945J9559J7675J4707J1289Q274N578K554r55
62251A139435m567q044j1474j4769j7362j8637j8661j8423j8970k0143k0572j9285
62239I48528j7000j5227j4331j3365j1672r732q171o902n718m908m629m254l071
62226H29548j300K54J241J947K665L448M225M749M656M071L782M268M872M647
62212H73073L766L286L654M291M643M765M734M328L737L782M856O196O752O507
$$ plain form
62302 588921 593560 598081 602943 608187 613549 618926 624406 630037 635899 642168 648755 655127 660797 665874
62288 665874 670866 676118 681640 687259 692689 697661 702238 706770 711421 716187 721624 728956 738854 750556
62274 750556 762874 775777 790234 806780 825137 845170 867191 891095 916041 941341 966926
62263 966926 992516 1017101 1039809 1060754 1080313 1097988 1112695 1123984 1132258 1137836 1140390 1139435
62251 1139435 1134868 1126824 1115350 1100581 1083219 1064582 1045921 1027498 1008528 988385 967813 948528
62239 948528 931528 916301 901970 888605 876933 867201 859030 852128 846410 841502 836873 832619 829548
62226 829548 828248 828502 829743 831690 834355 837803 842028 846777 851433 855504 859286 863554 868426 873073
62212 873073 876839 880125 883779 888070 892713 897478 902212 906540 910277 914059 918915 925111 931863 938370
62198I38370O360O907P878Q690R116R341R667J0211J0731J0772J0111R101Q433
62185A055688Q585R496J0670J1578J2009J2196J2581J3436J4687J6056J7240J8034
62173A212256J8372J8262J7676J6547J4944J3045J0927Q619O372M525K918Q73
62161A345336j870m649o775q532j0607j2843j4413j5052j5265j5287j4759j3616
62149A211668j2488j1824j1383j0882j0535j0496j0415r984r399q927q529q263
62137A088543q408q813q744p920p040o791o888o700o166n457m316k615j023k30
62123A007432J30Q96J970K397J682K54j295k563l115k697j753j061r00j194k165
62108I98018m039o232p715q250q431q607q614q590q944r377q935p432n933n327
$$ plain form
62198 938370 944730 951637 959515 968205 977321 986662 996329 1006540 1017271 1028043 1038154 1047255 1055688
62185 1055688 1064273 1073769 1084439 1096017 1108026 1120222 1132803 1146239 1160926 1176982 1194222 1212256
62173 1212256 1230628 1248890 1266566 1283113 1298057 1311102 1322029 1330648 1337020 1341545 1344463 1345336
62161 1345336 1343466 1338817 1332042 1323510 1312903 1300060 1285647 1270595 1255330 1240043 1225284 1211668
62149 1211668 1199180 1187356 1175973 1165091 1154556 1144060 1133645 1123661 1114262 1105335 1096806 1088543
62137 1088543 1080135 1071322 1062578 1054658 1047618 1040827 1033939 1027239 1021073 1015616 1011300 1008685 1007662 1007432
62123 1007432 1007562 1008458 1010428 1012825 1014507 1014761 1013466 1010903 1007788 1005091 1003338 1002277 1001377 1000183 998018
62108 998018 993979 987747 980032 971782 963351 954744 946130 937540 928596 919219 910284 902852 896919 891592
62094H91592n257m892m074l126k133j035M9J034K078L178L968M301M614N393O510
62079I02200P492Q111Q416Q494Q452Q380Q180P696P052O457N700M327K433O34
62065I94024q98k707n064p444r351j1037j2970j4994j6582j7491j7802j7715j7623
62052H42346j7965j8640j9029j8833j8429j8075j7408j6154j4786j3905j3406
62041F55716j2816j2015j1165j0311r470q746p958o761n426m863n348n935n766
62028E49136n275n341n883o162n873n181m174l188l052l925m485l449j548o30
62014D90970j100j615j270o36l84k86K2L74O74J138J501J008l29j403j502j212
61998D85950j257j350j023p31j136j819j804j114q27j517k443k520j627o71n42
$$ plain form
62094 891592 886335 881443 877369 874243 872110 871075 871124 872158 874236 877414 881382 885683 890297 895690 902200
62079 902200 909692 917803 926219 934713 943165 951545 959725 967421 974473 980930 986630 990957 993390 994024
62065 994024 993126 990419 985355 977911 968560 957523 944553 929559 912977 895486 877684 859969 842346
62052 842346 824381 805741 786712 767879 749450 731375 713967 697813 683027 669122 655716
62041 655716 642900 630885 619720 609409 599939 591193 583235 576474 571048 566185 560837 554902 549136
62028 549136 543861 538520 532637 526475 520602 515421 511247 508059 505007 501082 496597 493148 491600 490970
62014 490970 489870 488255 486985 486349 485965 485679 485701 486075 486749 487887 489388 490396 490067 488664 487162 485950
61998 485950 484693 483343 482320 481589 480453 478634 476830 475716 474889 473372 470929 468409 466782 466111 465569
61983D65569j160j591j116o2P11R88J321J989K498K423K108K120K412K648K900
61968D83758L421L996M149L967M084M798N671O160O297O587P385Q527R493R899
61954E68192R879R932J0424J1336J2510J3923J5526J7066J8229J8924J9310J9625
61942G44876K0105K0897K1929K2885K3452K3601K3580K3702K4100K4651K5145
61931I98923K5591K6237K7222K8463L0055L2442L5838L9755M3650M7842N3035
61920A389053N9055O4853O9967P5222Q1575Q9012R6984J05236J13532J21139J27323
61909B392951J32162J36111J38953J39733J37675J32598J24513J13319R9036Q1897
61899C628948O2190M0283J6896o915l0055n1561p0673q7043j00880j12522j21943
$$ plain form
61983 465569 464409 462818 461702 461640 462351 463339 464660 466649 469147 471570 473678 475798 478210 480858 483758
61968 483758 487179 491175 495324 499291 503375 508173 513844 520004 526301 532888 540273 548800 558293 568192
61954 568192 578071 588003 598427 609763 622273 636196 651722 668788 687017 705941 725251 744876
61942 744876 764981 785878 807807 830692 854144 877745 901325 925027 949127 973778 998923
61931 998923 1024514 1050751 1077973 1106436 1136491 1168933 1204771 1244526 1288176 1336018 1389053
61920 1389053 1448108 1512961 1582928 1658150 1739725 1828737 1925721 2030957 2144489 2265628 2392951
61909 2392951 2525113 2661224 2800177 2939910 3077585 3210183 3334696 3448015 3547051 3628948
61899 3628948 3691138 3731421 3748317 3741402 3711347 3659786 3589113 3502070 3401190 3288668 3166725
61888C166725j28835j33078j34830j34289j31667j27317j21612j14803j07277
61879B033017r9727r2662q5888p8909p1852o5374n9722n4415m9068m3973l9537
61868A291890l5580l1566k7342k3219j9508j6261j3400j0772q108n152j933J207
61856A100256L818N535O238O224O139O437O855O696N686M320L242K522J877J412
61842A167257J684K855M219M955N173N728O963Q065P981O691N179M210L503K329
61828A236792N46j254k613l758n143o721q008q774r170r176q402o706m631k773
61814A160209r79J362M337P301R689J1622J3628J6075J8981K2057K4890K7312
61802A316484K9681L2562L6110L9999M3892M7677N1375N5271O0098O6451P3887
$$ plain form
61888 3166725 3037890 2904812 2769982 2635693 2504026 2376709 2255097 2140294 2033017
61879 2033017 1933290 1840628 1754740 1675831 1603979 1538605 1478883 1424468 1375400 1331427 1291890
61868 1291890 1256310 1224744 1197402 1174183 1154675 1138414 1125014 1114242 1106134 1100982 1099049 1100256
61856 1100256 1104074 1109609 1115847 1122071 1128210 1134647 1141502 1148198 1153884 1158204 1161446 1163968 1165845 1167257
61842 1167257 1168941 1171796 1176015 1180970 1186143 1191871 1198834 1206899 1214880 1221571 1226750 1230960 1234463 1236792
61828 1236792 1237338 1236084 1233471 1229713 1224570 1217849 1209841 1201067 1191897 1182721 1174319 1167613 1162982 1160209
61814 1160209 1159230 1160592 1164929 1172230 1181919 1193541 1207169 1223244 1242225 1264282 1289172 1316484
61802 1316484 1346165 1378727 1414837 1454836 1498728 1546405 1597780 1653051 1713149 1779600 1853487
61791A853487Q1227Q8068R5376J04237J14604J25785J37619J50380J63781J76971
61781C091535J89567K02022K14739K27145K37783K45063K47869K45699K38425
61772E139847K25828K07431J82863J52366J16918P8028L7461l167m2800q0782
61762F013993j16197j47739j74515j96580k14261k27231k34827k37137k35182
61753D230324k30128k22752k13611k03204j91857j79911j67987j56746j46273
61744B517855j36187j26264j16680j07654r9291r1692q4762p8014p1176o4943
61734A541192o0346n7207n4008m9705m4970m1148l8531l6350l3987l1493k9063
61723A064384k6739k4677k3101k1898k0643j9138j7607j6298j5256j4549j4347
$$ plain form
61791 1853487 1934714 2022782 2118158 2222395 2336999 2462784 2600403 2750783 2914564 3091535
61781 3091535 3281102 3483124 3697863 3925008 4162791 4407854 4655723 4901422 5139847
61772 5139847 5365675 5573106 5755969 5908335 6025253 6103281 6140742 6137575 6094775 6013993
61762 6013993 5897796 5750057 5575542 5378962 5164701 4937470 4702643 4465506 4230324
61753 4230324 4000196 3777444 3563833 3360629 3168772 2988861 2820874 2664128 2517855
61744 2517855 2381668 2255404 2138724 2031070 1931779 1840087 1755325 1677311 1606135 1541192
61734 1541192 1480846 1423639 1369631 1319926 1274956 1233808 1195277 1158927 1124940 1093447 1064384
61723 1064384 1037645 1012968 989867 967969 947326 928188 910581 894283 879027 864478 850131
61712H50131j4558j4674j4294j3678j3454j3758j3904j3124j1520j0001r297r254
61700F98615r264r047q703q228p503o719o233n924n225m076l265l345l719l380
61686F13984k296j356j115j325j657k172k884l506l952m556n470o315o774p063
61672E63543p435p645p376o895o599o247n284l828k657k182k039j742j160k40
61658E02214J031K175K356J384R7p03j177j878k739l271l432l641m023m320m499
61643D79574m811n200n166m450l428k663k353k309k252k038j756j630j662j559
61629D38297j235j045j159j043j82Q85J091L48l16k61n2m38j189j523j183o37
61613D30358m34o95j038r41m46l67j222k144j767k91N45r9r42n37O89J402J474
$$ plain form
61712 850131 835573 820899 806605 792927 779473 765715 751811 738687 727167 717166 707869 698615
61700 698615 689351 680304 671601 663373 655870 649151 642918 636994 631769 627693 624428 621083 617364 613984
61686 613984 611688 610332 609217 607892 606235 604063 601179 597673 593721 589165 583695 577380 570606 563543
61672 563543 556108 548463 541087 534192 527593 521346 516062 512234 509577 507395 505356 503614 502454 502214
61658 502214 503245 505420 507776 509160 509257 508554 507377 505499 502760 499489 496057 492416 488393 484073 479574
61643 479574 474763 469563 464397 459947 456519 453856 451503 449194 446942 444904 443148 441518 439856 438297
61629 438297 437062 436017 434858 433815 433633 434518 435609 435957 435641 435380 435328 434890 433701 432178 430995 430358
61613 430358 429924 429229 428191 427250 426804 426437 425215 423071 421304 421013 421558 421459 420517 419980 420669 422071 423545
61596D23545J787K496K906K849K918L344L718L833L926L988L797L677M290N601
61582D72675O900P883Q747R243Q808P943Q218J0283J2831J4240J4488J4689J5417
61569F12365J6355J7143J7750J8144J8213J7972J7481J6716J5766J4851J3927
61558G96683J2563J0573Q415O604N078L528K013Q58J97l8L5J54n7n36o67j28M60
61541H45735K49p18j627j992k040k115k267k543l141m015m585m168k662p07R01
61526H14305J903K619L334L928M353N230P329J0481J3574J5872J7789K0096K2934
61513I43747K6018K9320L2984L6836M0573M4246M8098N2110N6142O0350O4881
61502A435305O9286P2766P5067P6675P8081P9104P8957P6759P2124O5604N8408
$$ plain form
61596 423545 425332 427828 430734 433583 436501 439845 443563 447396 451322 455310 459107 462784 467074 472675
61582 472675 479575 487458 496205 505448 514256 522199 530417 540700 553531 567771 582259 596948 612365
61569 612365 628720 645863 663613 681757 699970 717942 735423 752139 767905 782756 796683
61558 796683 809246 819819 828234 834838 839916 843444 845457 846315 846512 846474 846509 846663 846606 846070 845403 845275 845735
61541 845735 845984 845266 843639 841647 839607 837492 835225 832682 829541 825526 820941 816773 814111 813404 814305
61526 814305 816208 818827 822161 826089 830442 835672 843001 853482 867056 882928 900717 920813 943747
61513 943747 969765 999085 1032069 1068905 1109478 1153724 1201822 1253932 1310074 1370424 1435305
61502 1435305 1504591 1577357 1652424 1729099 1807180 1886284 1965241 2042000 2114124 2179728 2238136
61491B238136N1364M4245L6464K8171K0119J2584N190k053q218j2465j5067j6910
61479B381560j8224j8463j7518j6411j6432j7800j9626k1156k2596k4508k6840
61468B161986k8977l0614l2018l3465l4794l5587l5412l3869l0952k7431k4298
61457A814569k1612j8423j4197r653n708k214J477N277Q555J1419J4750J8846
61445A803086K2901K6162K8898L1714L4314L5481L4247L0790K6257K1841J7981
61434B113672J4347J0506O550K940o7k592m742o266o737n960m167j845O55L234
61420B119528N657P157O848M608J283k184n503q829j2310j6085k0173k4095k6985
61407B028917k8557k9418l0020k9858k8427k6398k4871k3784k2093j9425j6572
$$ plain form
61491 2238136 2289500 2333745 2370209 2398380 2418499 2431083 2436273 2434220 2426002 2413537 2398470 2381560
61479 2381560 2363336 2344873 2327355 2310944 2294512 2276712 2257086 2235930 2213334 2188826 2161986
61468 2161986 2133009 2102395 2070377 2036912 2002118 1966531 1931119 1897250 1866298 1838867 1814569
61457 1814569 1792957 1774534 1760337 1750684 1744976 1742762 1744239 1749516 1758071 1769490 1784240 1803086
61445 1803086 1825987 1852149 1881047 1912761 1947075 1982556 2016803 2047593 2073850 2095691 2113672
61434 2113672 2128019 2138525 2145075 2148015 2147948 2145356 2140614 2134348 2127611 2121651 2117484 2115639 2116294 2119528
61420 2119528 2125185 2132342 2139190 2143798 2145081 2142897 2137394 2128565 2116255 2100170 2079997 2055902 2028917
61407 2028917 2000360 1970942 1940922 1911064 1882637 1856239 1831368 1807584 1785491 1766066 1749494
61396A749494j4226j2178r991p537m611q71L422P320J0452J3693J8080K3494K8955
61383A805496L3896L8586M3535M8898N4309N9048O2577O5071O7172O9041P0055
61372B417684O9545O7364O3545N7930N0609M2233L3422K4139J4122L599o907j7123
61360B820162k6873l5716m3399n0476n7663o4477o9356p1384p1406p0950p0534
61349B187928o9561o7664o5403o3404o1372n8455n4402m9838m5376m1005l6567
61338A574881l2295k8411k4638k0703j7010j4106j1609q544m767j211J537M047
61326A417171O957R896J2196J4045J6067J8057J9126J9025J8480J8057J7367J5847
61314A602291J3760J1951J0797R840Q516O913N634N040M894M736M393L958L555
$$ plain form
61396 1749494 1735268 1723090 1713099 1705562 1700951 1700080 1703502 1710822 1721274 1734967 1753047 1776541 1805496
61383 1805496 1839392 1877978 1921513 1970411 2024720 2083768 2146345 2211416 2278588 2347629 2417684
61372 2417684 2487229 2554593 2618138 2676068 2726677 2768910 2802332 2826471 2840593 2844192 2837285 2820162
61360 2820162 2793289 2757573 2714174 2663698 2606035 2541558 2472202 2400818 2329412 2258462 2187928
61349 2187928 2118367 2050703 1985300 1921896 1860524 1802069 1747667 1697829 1652453 1611448 1574881
61338 1574881 1542586 1514175 1489537 1468834 1451824 1437718 1426109 1417565 1412798 1411587 1413124 1417171
61326 1417171 1424128 1434024 1446220 1460265 1476332 1494389 1513515 1532540 1551020 1569077 1586444 1602291
61314 1602291 1616051 1628002 1638799 1648639 1657155 1664068 1669702 1674742 1679636 1684372 1688765 1692723 1696278
61301A696278L325L369L391K692J019p98j719j832k145l040l853m182m578n397
61287A682530n873n212l900l044k854k663k171j670j188l95N26P18l36k192m034
61272A648242n442o440p255q214r553j1090j2331j2930j2876j2319j1446j0365
61260A527981q869o528l330J59L641P652J2649J7965K2543K6454L0692L5624M0662
61247A707295M5527N0566N5411N8469N8383N5255M9810M2359L3283K3741J4797
61236B194896O194k988j2677k1629k8750l3822l6973l8239l7814l6153l3605l0242
61224A888198k6116k1448j6717j2882j1188j2088j4482j6631j7866j8830k0116
61213A699834k1506k2709k3979k5487k6629k6700k5882k4928k4047k2736k0748
$$ plain form
61301 1696278 1699603 1702972 1706363 1709055 1710074 1709276 1707557 1705725 1703580 1700540 1696687 1692505 1687927 1682530
61287 1682530 1676657 1671445 1667545 1664501 1661647 1658984 1656813 1655143 1653955 1653560 1654086 1654804 1654468 1652276 1648242
61272 1648242 1642800 1636360 1629105 1620891 1611338 1600248 1587917 1574987 1562111 1549792 1538346 1527981
61260 1527981 1519112 1512584 1509254 1509413 1513054 1520706 1533355 1551320 1573863 1600317 1631009 1666633 1707295
61247 1707295 1752822 1803388 1858799 1917268 1975651 2030906 2080716 2123075 2156358 2180099 2194896
61236 2194896 2201090 2198102 2185425 2163796 2135046 2101224 2064251 2026012 1988198 1952045 1918440 1888198
61224 1888198 1862082 1840634 1823917 1811035 1799847 1787759 1773277 1756646 1738780 1719950 1699834
61213 1699834 1678328 1655619 1631640 1606153 1579524 1552824 1526942 1502014 1477967 1455231 1434483
61202A434483j8603j6945j5807j4842j3971j3397j3082j2611j1823j1309j1911
61191A280182j3649j5462j6201j5821j5274j5278j5511j5249j4514j4147j4691
61180A114385j5602j5878j5268j4438j3920j3361j2146j0429r056q522q465q298
61168I69002p928p558p172o620o122o244p346r248j1443j3438j4870j5549j5625
61155H39839j5524j5679j6239j6959j7330j6901j5646j4001j2374j0749q942p160
61143F72335n989n723o040o410o560o383n701m426k854j456m26L60R49J193J098
61128F23967J095J735L156M929O414P281P731Q267R163J0105J0417R656Q030O230
61114G18176M904M188L678K877J713O27K0k72p28j446j991k048j928k112k619
$$ plain form
61202 1434483 1415880 1398935 1383128 1368286 1354315 1340918 1327836 1315225 1303402 1292093 1280182
61191 1280182 1266533 1251071 1234870 1219049 1203775 1188497 1172986 1157737 1143223 1129076 1114385
61180 1114385 1098783 1082905 1067637 1053199 1039279 1025918 1013772 1003343 994287 985765 977300 969002
61168 969002 961074 953516 946344 939724 933602 927358 920012 910764 899321 885883 871013 855464 839839
61155 839839 824315 808636 792397 775438 758108 741207 725561 711560 699186 688437 679495 672335
61143 672335 666346 660623 654583 648173 641613 635230 629529 625103 622249 620793 620367 620727 621676 622869 623967
61128 623967 625062 626797 629953 634882 641296 648577 656308 664575 673738 683843 694260 703916 711946 718176
61114 718176 723080 727268 730946 733823 735536 736163 736183 735911 735183 733737 731746 729698 727770 725658 723039
61099G23039l091l390l690m013m127m003l981m280m679m839m738m502m098l504
61085F66104k975k712k426j640m28O10J132J408J747J981J865J662J958L009M505
61070F75800N870O555O228N100M021L871M699N716O256O443O781P356P870Q234
61056G60800Q708R365R849R897R821J0112J0721J1140J1219J1513J2587J4214
61044H89946J5594J6248J6512J7117J8498K0544K2811K4953K6997K9269L1993
61033A130482L5018L7977M0572M2698M4436M6243M8922N3022N8224O3699O9091
61022A670384P4893Q1703Q9581R8317J08027J19303J33128J50916J74350K04792
61012B905394K42895K88780L42118M02057M68216N42685O30715P39113Q74707
$$ plain form
61099 723039 719948 716558 712868 708855 704728 700725 696744 692464 687785 682946 678208 673706 669608 666104
61085 666104 663129 660417 657991 656351 655923 656533 657665 659073 660820 662801 664666 666328 668286 671295 675800
61070 675800 681670 688225 694453 699553 703574 707445 712144 717860 724116 730559 737340 744696 752566 760800
61056 760800 769508 778873 788722 798619 808440 818552 829273 840413 851632 863145 875732 889946
61044 889946 905540 921788 938300 955417 973915 994459 1017270 1042223 1069220 1098489 1130482
61033 1130482 1165500 1203477 1244049 1286747 1331183 1377426 1426348 1479370 1537594 1601293 1670384
61022 1670384 1745277 1826980 1916561 2014878 2122905 2242208 2375336 2526252 2700602 2905394
61012 2905394 3148289 3437069 3779187 4181244 4649460 5192145 5822860 6561973 7436680
61003G436680J042992J240526J438718J575258J577841J417903J149426Q85179
60995A7764523P20025O69761O81031O91156O66944N89685M28403J56062k02332
60986B2165258n56234q04744r12694r31091r44887j004675j103761j204691j274431
60977A3428050j297387j270511j198092j091252r65931q37453p16459o08939n17698
60968D924328m42695l81414l30662k88354k53524k25145k01644j81461j63626
60959B455803j47698j33423j20576j09074r9099r1003q4782p9709p4721o9338
60949A446380o3928n8980n4511n0376m6779m3906m1317l8268l4636l0976k7655
60938I55048k4498k1422j8802j6844j5156j3365j1782j0865j0313r352p870o648
$$ plain form
61003 7436680 8479672 9720198 11158916 12734174 14312015 15729918 16879344 17764523
60995 17764523 18484548 19154309 19835340 20526496 21193440 21783125 22211528 22367590 22165258
60986 22165258 21609024 20804280 19891586 18960495 18015608 17010933 15907172 14702481 13428050
60977 13428050 12130663 10860152 9662060 8570808 7604877 6767424 6050965 5442026 4924328
60968 4924328 4481633 4100219 3769557 3481203 3227679 3002534 2800890 2619429 2455803
60959 2455803 2308105 2174682 2054106 1945032 1845933 1754930 1670148 1590439 1515718 1446380
60949 1446380 1382452 1323472 1268961 1218585 1171806 1127900 1086583 1048315 1013679 982703 955048
60938 955048 930550 909128 890326 873482 858326 844961 833179 822314 812001 802649 794779 788131
60926G88131o350o800p370p637p446o805n991n513n648o175o686o945o848o388
60912F95529n818n548n651n764n678n567n447m906l937l433m057n054n074m105
60898F25490l517m075m970n132m615m006l327k397j634j620k071k200j920j847
60884E82159k146k188j583q26n95r65j534j931j939j538j092j068j390j475j058
60869E60831n29k54j12j5k95j070j711j615j110r62j198j161n94L6L54M62M54
60852E51511J70l55q13j190j894k948l666l564l122l137l666m179m476m764m983
60837E08924m724l959l195k747k306j580r26q59j194j171m27N90J240J395J351
60822D90412J301J230J133J084J039Q45M96K02Q5Q4K08O38J334J797J591R73N33
$$ plain form
60926 788131 781781 774981 767611 759974 752528 745723 739732 734219 728571 722396 715710 708765 701917 695529
60912 695529 689711 684163 678512 672748 667070 661503 656056 651150 647213 643780 639723 634669 629595 625490
60898 625490 621973 617898 612928 607796 603181 599175 595848 593451 591817 590197 588126 585926 584006 582159
60884 582159 580013 577825 576242 575416 574821 573856 572322 570391 568452 566914 565822 564754 563364 561889 560831
60869 560831 560302 560048 559936 559921 559626 558556 556845 555230 554120 553158 551960 550799 550205 550241 550595 551057 551511
60852 551511 551681 551326 550513 549323 547429 544481 540815 537251 534129 530992 527326 523147 518671 513907 508924
60837 508924 504200 500241 497046 494299 491993 490413 489487 488628 487434 486263 485836 486426 487666 489061 490412
60822 490412 491713 492943 494076 495160 496199 497044 497540 497742 497827 497911 498119 498757 500091 501888 503479 504452 504985
60805E04985K83l10j258j699r87K06N72k49j353j790j604j443j681k182k642k907
60789D85941l011l118l326l495l439l313l498l985m258m007l650l753m167m197
60775D34724l547k621j895j450j204j188j349j430j245r21n60%Q66J665J870J437
60759D23152R09Q26J262J907K380K472K289K165K319K522K328J661R27M76J77
60744D47772l35j156k029k697l082l183k995k646k459k690l246l665l467k593
60730D11529j531j008j357k181k658k318j481r18j065j663k103k033j576j081
60716C88556p92p31p66p68p09o52o50o64o42n81m78l22j47j9J62O32J350J810
60698C84589J650J273J383J920K059J464Q88J126J830K035J511R54R33J386K081
$$ plain form
60805 504985 505268 504958 503700 502001 501014 501220 501792 501543 500190 498400 496796 495353 493672 491490 488848 485941
60789 485941 482930 479812 476486 472991 469552 466239 462741 458756 454498 450491 446841 443088 438921 434724
60775 434724 431177 428556 426661 425211 424007 422819 421470 420040 418795 417874 417314 417314 418180 419845 421715 423152
60759 423152 424061 424887 426149 428056 430436 432908 435197 437362 439681 442203 444531 446192 447119 447595 447772
60744 447772 447437 446281 444252 441555 438473 435290 432295 429649 427190 424500 421254 417589 414122 411529
60730 411529 409998 408990 407633 405452 402794 400476 398995 398077 397012 395349 393246 391213 389637 388556
60716 388556 387764 387033 386267 385499 384790 384138 383488 382824 382182 381601 381123 380801 380654 380635 380797 381429 382779 384589
60698 384589 386239 387512 388895 390815 392874 394338 395226 396352 398182 400217 401728 402682 403615 405001 407082
60683D07082K939L659L727L085K431K412K861L102K747J898Q62k7m71m09q2K36
60667D36052M93O60N53J22k98l25j4K49L07L77P10J284J783J808J206L48p2K40
60649D45483P79P82P5q35j414j568j524j519j670j920k089k057j972k106k520
60634D25925k917k883k288j504j163j482j904j722j081r40j781k784k755j596
60620C99125l73L7k51o17p88q56q47n99q6M05N56M39M94J022J769K225K222J912
60602D05789J297L06o02o55J41P46M19k75m25j33j31l96j87O47J335J260O19l3
60584D09722k82J30J039J600J125J93N5Q62J485J319J066J352J664J512J514K314
60568D26670L220L170K468K375L213M060M257M160M224M326M195L875L529L328
$$ plain form
60683 407082 410021 413680 417407 420492 422923 425335 428196 431298 434045 435943 436805 436778 436307 435898 435816 436052
60667 436052 436545 437205 437758 437880 437582 437257 437243 437492 437799 438176 438886 440170 441953 443761 444967 445315 445243 445483
60649 445483 446262 447044 447119 446284 444870 443302 441778 440259 438589 436669 434580 432523 430551 428445 425925
60634 425925 423008 420125 417837 416333 415170 413688 411784 410062 408981 408041 406260 403476 400721 399125
60620 399125 398752 398789 398538 397921 397133 396277 395430 394831 394745 395150 395706 396145 396639 397661 399430 401655 403877 405789
60602 405789 407086 407392 406790 406135 406276 407022 407441 407166 406741 406608 406477 406081 405894 406541 407876 409136 409755 409722
60584 409722 409440 409570 410609 412209 413334 413527 413582 414444 415929 417248 418314 419666 421330 422842 424356 426670
60568 426670 429890 433060 435528 437903 441116 445176 449433 453593 457817 462143 466338 470213 473742 477070
60554D77070L634M646N849O443O455O763P869R368J0808J2372J4340J6512J8642
60541F00771K0948K3656K6492K9114L1726L4695L7692L9668L9663L7362L3104
60530I54891K7615K1593J5184Q077L68o950j2851j7409k1465k5256k7994k8977
60518H86826k8451k7027k4809k1616j7828j4299j1472q997o301l110O81N114R833
60505G38544J4034J7257K0058K3403K7391L0952L2879L2787L0989K7871K3720
60494A019885J8882J3686Q276K756k511o955j0117j1858j2293j1621r931p084
60482I91115k897K484Q596J5073K1959K9328L6811M3611M8858N1760N1641M8198
60470A346537M1727L2871K2271J0571j385j2788k3342l3154m2111m9643n5175
$$ plain form
60554 477070 480704 485350 491199 497642 504097 510860 518729 528097 538905 551277 565617 582129 600771
60541 600771 621719 645375 671867 700981 732707 767402 805094 844762 884425 921787 954891
60530 954891 982506 1004099 1019283 1027360 1027728 1020778 1007927 990518 969053 943797 915803 886826
60518 886826 858375 831348 806539 784923 767095 752796 741324 732327 726026 722916 723597 728711 738544
60505 738544 752578 769835 789893 813296 840687 871639 904518 937305 968294 996165 1019885
60494 1019885 1038767 1052453 1060729 1063485 1060974 1054019 1043902 1032044 1019751 1008130 998199 991115
60482 991115 988218 990702 999298 1014371 1036330 1065658 1102469 1146080 1194938 1246698 1298339 1346537
60470 1346537 1388264 1421135 1443406 1453977 1452592 1439804 1416462 1383308 1341197 1291554 1236379
60459A236379n8587o0103n9959n8337n5528n1901m7744m3201l8460l3917l0014
60448F98628k6827k3924k0888j7896j5495j3717j1957r887q055p117o783o133
60436E29949m879l675l129l022k795k336j997j949j876j381n47k0l61j285j818
60421D98879j423o81m90p97o78L58J703K451K463K351K721L640M646N208N221
60406E25572N075N144N371N680O428P955R756J0889J1180J1341J1698J1672J0938
60393F38699J0248J0366J0755J0208Q491O607N504N293N577N875N645M635L402
60380G31305K903L360L964L897L165K208J180R2p51q96l30M69R74R73N97K19J70
60363G53499L87M91L62M33J033J803K107K028K256K961L369K800J648Q20N21J79
$$ plain form
60459 1236379 1177792 1117689 1057730 999393 943865 891964 844220 801019 762559 728642 698628
60448 698628 671801 647877 626989 609093 593598 579881 567924 558037 549982 542865 536082 529949
60436 529949 525070 521395 518266 515244 512449 510113 508116 506167 504291 502910 502363 502343 501982 500697 498879
60421 498879 497456 496775 496285 495488 494810 495168 496871 499322 501785 504136 506857 510497 515143 520351 525572
60406 525572 530647 535791 541162 546842 553270 561225 570981 581870 593050 604391 616089 627761 638699
60393 638699 648947 659313 670068 680276 688767 695374 700878 706171 711748 717623 723268 727903 731305
60380 731305 734208 737568 741532 745429 748594 750802 751982 752074 751323 750427 750097 750566 751540 752513 753110 753329 753499
60363 753499 753886 754377 754739 755172 756205 758008 760115 762143 764399 767360 770729 773529 775177 775997 776518 776697
60347G76697n40j388k178l127m236m912m733m180m061m418m615m418m343m813
60333G24735n439n499m842m070l907m470n180n321m861m471m626m860m456l599
60319F59134l198l526l781l322k566k137j812j012J01R78J790L231N159O565P082
60304F62686P588Q709R606R111P464N905M772L143M18k679n147o894q365r542
60290F86775j0114j0225j0301j0243r575q384p347o680n776m289k869k228j991
60277E96753j161M82K140L146L705M319M985N276N050M751M941N630O168O050
60263F52235N663N864O697P134O490N523N440O203O704O505O429P250Q615R658
60249G46410J0016R860R496R426J0275J2087J3957J4911J4992J5095J5855J7171
$$ plain form
60347 776697 776157 774769 772591 769464 765228 760316 755583 751403 747342 742924 738309 733891 729548 724735
60333 724735 719296 713797 708955 704885 700978 696508 691328 686007 681146 676675 672049 667189 662733 659134
60319 659134 655936 652410 648629 645307 642741 640604 638792 637780 637881 638859 640649 643880 649039 655604 662686
60304 662686 670274 678983 688589 697700 705164 711069 715841 718984 719402 716723 711576 704682 696317 686775
60290 686775 676661 666436 656135 645892 636317 627933 620586 613906 608130 603841 600972 598744 596753
60277 596753 595592 596074 598214 601360 605065 609384 614369 619645 624695 629446 634387 640017 646185 652235
60263 652235 657898 663762 670459 677593 684083 689606 695046 701249 707953 714458 720887 728137 736752 746410
60249 746410 756426 766286 775782 785208 795483 807570 821527 836438 851430 866525 882380 899551
60237H99551J8670K0226K1971K3955K5987K7825K9611L1916L5127L8823M2212
60226A215874M5066M7727N0217N1967N2661N2703N2521N2021N1038M9775M8335
60215A769905M6287M3184L9078L4230K8819K3298J8389J4182R922N279J142j601
60203B032114l366m985o155n943m461k726j010J428M862Q577J2027J5538J9489
60190B065389K3768K8217L2743L6775L9534M1216M2893M4868M6019M5257M2744
60179B489423L9155L4669K9423K3986J8473J1964L781n131j3141j9855k6187l2710
60167B553850l8920m4004m7540m9409m9750m9035m7602m5156m1238l6095l0463
60156B074638k4603j8304j1812n947j043L512Q240J2575J5374J6151J5481J4340
$$ plain form
60237 899551 918221 938447 960418 984373 1010360 1038185 1067796 1099712 1134839 1173662 1215874
60226 1215874 1260940 1308667 1358884 1410851 1463512 1516215 1568736 1620757 1671795 1721570 1769905
60215 1769905 1816192 1859376 1898454 1932684 1961503 1984801 2003190 2017372 2027294 2032573 2033715 2032114
60203 2032114 2028748 2023763 2017608 2011665 2007204 2004478 2003468 2004896 2009758 2018335 2030362 2045900 2065389
60190 2065389 2089157 2117374 2150117 2186892 2226426 2267642 2310535 2355403 2401422 2446679 2489423
60179 2489423 2528578 2563247 2592670 2616656 2635129 2647093 2650874 2645743 2632602 2612747 2586560 2553850
60167 2553850 2514930 2470926 2423386 2373977 2324227 2275192 2227590 2182434 2141196 2105101 2074638
60156 2074638 2050035 2031731 2019919 2013972 2012929 2016441 2024681 2037256 2052630 2068781 2084262 2098602
60144B098602J3260J2011R891O428J893k876p139j0662j3498j5698j7219j7987
60132B057006j7879j6721j4325j0593n733l40N058J0730J7595K6065L5348M4355
60120B130566N3003O2000P1535Q0906Q9532R7621J05509J12836J18778J22767
60110C045053J24695J24650J22678J18691J12471J03955R3533Q1714O8497N3563
60100D049500L7265K0819N174r913k5104m0179n4096o6146p6347q4745r1024r5042
60088C570162r7170r7735r6496r3109q7835q1399p4327o6751n8740n0367m1509
60077B724724l2054k2485j3818o664n83N262J0941J5589J8342J9085J8257J6278
60065B752874J3324R470M824l93n842j1229j6529k1890k7357l2830l8285m3668
$$ plain form
60144 2098602 2111862 2123873 2133764 2140192 2142085 2139209 2132070 2121408 2107910 2092212 2074993 2057006
60132 2057006 2039127 2022406 2008081 1997488 1991755 1991415 1996473 2007203 2024798 2050863 2086211 2130566
60120 2130566 2183569 2245569 2317104 2398010 2487542 2585163 2690672 2803508 2922286 3045053
60110 3045053 3169748 3294398 3417076 3535767 3648238 3752193 3845726 3927440 3995937 4049500
60100 4049500 4086765 4107584 4112758 4102845 4077741 4037562 3983466 3917320 3840973 3756228 3665204 3570162
60088 3570162 3472992 3375257 3278761 3185652 3097817 3016418 2942091 2875340 2816600 2766233 2724724
60077 2724724 2692670 2670185 2656367 2649703 2649120 2654382 2665323 2680912 2699254 2718339 2736596 2752874
60065 2752874 2766198 2775668 2780492 2780099 2774257 2763028 2746499 2724609 2697252 2664422 2626137 2582469
60053B582469m8462n1789n3286n3585n3517n3028n1353m8191m4246m0449l7009
60042B047554l3298k8507k2285j4962p298P3O994J3582J9940K6246L2829L9669
60030B080537M5902N0345N2671N3552N3549N2256M8898M3371L6272K8264J9782
60019B565399J1183K673n867j4558k3001l0436l6485m1380m5309m7949m8927m8486
60007B236857m7293m5564m2767l8363l2618k6435k0453j4598q479j976M734J1500
59995A974545J8358K5429L2789M0303M7466N3655N8728O3154O7238P0350P1440
59984B523455P0202O7243O3122N7817N1263M3808L5749K6901J7045O553l835j3596
59972B945727k2389k9810l5672m0374m4463m7829m9696m9388m6875m2725l7824
$$ plain form
60053 2582469 2534007 2482218 2428932 2375347 2321830 2268802 2217449 2169258 2125012 2084563 2047554
60042 2047554 2014256 1985749 1963464 1948502 1941204 1941277 1948271 1961853 1981793 2008039 2040868 2080537
60030 2080537 2126439 2176784 2229455 2283007 2336556 2388812 2437710 2481081 2517353 2545617 2565399
60019 2565399 2576582 2579255 2573388 2558830 2535829 2505393 2468908 2427528 2382219 2334270 2285343 2236857
60007 2236857 2189564 2144000 2101233 2062870 2030252 2003817 1983364 1968766 1960287 1958311 1963045 1974545
59995 1974545 1992903 2018332 2051121 2091424 2138890 2192545 2251273 2314427 2381665 2452015 2523455
59984 2523455 2593657 2660900 2724022 2781839 2833102 2876910 2912659 2939560 2956605 2963158 2959323 2945727
59972 2945727 2923338 2893528 2857856 2817482 2773019 2725190 2675494 2626106 2579231 2536506 2498682
59961B498682l2946k8124k2588j5801q329j202N338J1790J8197K3869K8511L2750
59949B510147L7120M1088M3626M4328M3570M1968M0096L8336L6531L4041L0502
59938B941353K6420K2660J9659J7408J5819J4705J3784J3211J3858J6578K1330
59927C136785K7479L4641M2740N1555O0822P0551Q0558Q9918R7631J03726J08811
59916C905217J12575J13664J11194J05443R6848Q5277P0830N4491L7139J8678
59906D711356j080k1063l9419n5106o8262p9159q7601r3338r6405r6812r4541
59895C978570q9993q4019p7185o9304n9883m8950l7239k5598j4313k993Q754K0615
59883C498462L1841M2190N2132O1786P0189P6185P9643Q1181Q0800P7590P0794
$$ plain form
59961 2498682 2465736 2437612 2415024 2399223 2390894 2389692 2395030 2406820 2425017 2448886 2477397 2510147
59949 2510147 2547267 2588355 2631981 2676309 2719879 2761847 2801943 2840279 2876810 2910851 2941353
59938 2941353 2967773 2990433 3010092 3027500 3043319 3058024 3071808 3085019 3098877 3115455 3136785
59927 3136785 3164264 3198905 3241645 3293200 3354022 3424573 3505131 3595049 3692680 3796406 3905217
59916 3905217 4017792 4131456 4242650 4348093 4444941 4530218 4601048 4655539 4692678 4711356
59906 4711356 4710276 4689213 4649794 4594688 4526426 4447267 4359666 4266328 4169923 4073111 3978570
59895 3978570 3888577 3804558 3727373 3658069 3598186 3549236 3511997 3486399 3472086 3469093 3477847 3498462
59883 3498462 3530303 3572493 3624625 3686411 3756600 3832785 3912428 3993609 4074409 4151999 4222793
59872D222793O0599M7737L2876J6546p38j8533l6211n2639o6591p7617q6126r2473
59860C949623r6509r8144r7739r5613r1663q5918p8976p1501o3667n5540m7563
59849C066790m0184l3248k6382j9682j3474p560j343N340J2035J8251K3716K8184
59837C012443L1598L4505L7562M0459M1918M1092L8340L4357K9133K2409J4715
59826C378531P170L71n946j2177j8294k4043k9241l3740l7450m0468m2935m4710
59814C097068m5576m5748m5709m5516m4785m3553m2482m1867m1021l9286l7131
59803B624394l5496l4396l3070l1399l0140k9597k8962k7390k5007k2329j9383
59792B307225j5850j1631o660p27O022J2838J9361K6376L4905M4844N5290O5870
$$ plain form
59872 4222793 4283392 4331129 4364005 4380551 4379813 4361280 4325069 4272430 4205839 4128222 4042096 3949623
59860 3949623 3853114 3754970 3657231 3561618 3469955 3384037 3305061 3233560 3169893 3114353 3066790
59849 3066790 3026606 2993358 2966976 2947294 2933820 2926260 2924917 2930257 2942292 2960543 2984259 3012443
59837 3012443 3044041 3078546 3116108 3156567 3198485 3239577 3277917 3312274 3341407 3363816 3378531
59826 3378531 3385701 3386072 3380126 3367949 3349655 3325612 3296371 3262631 3225181 3184713 3141778 3097068
59814 3097068 3051492 3005744 2960035 2914519 2869734 2826181 2783699 2741832 2700811 2661525 2624394
59803 2624394 2588898 2554502 2521432 2490033 2459893 2430296 2401334 2373944 2348937 2326608 2307225
59792 2307225 2291375 2279744 2273084 2272357 2278379 2291217 2310578 2336954 2371859 2416703 2471993 2537863
59780B537863P6828Q7966R8422J07546J14906J19304J18677J11537R8117P9991
59770C551157N9199L7739J6965k926k2291m0652n6535o8901p7839q3517q5432
59759C226967q3352p8186p1125o2630n3058m3553l5305k8265k1602j5059q913
59748B725919k973L220R268J4151J7777K1333K5798L0993L6406M2127M8482N5322
59736C027823O2298O9459P7206Q5890R5627J06233J17246J28359J39883J52309
59726D062333J65310J77766J88984J99237K08767K16860K22455K25251K25519
59717E892482K23256K18189K10643K01727J92472J83190J73801J64487J55731
59708G615978J47828J40625J33830J27439J21653J16322J10737J04155R6406Q7758
$$ plain form
59780 2537863 2614691 2702657 2801079 2908625 3023531 3142835 3261512 3373049 3471166 3551157
59770 3551157 3610356 3648095 3665060 3662134 3639843 3599191 3542656 3473755 3395916 3312399 3226967
59759 3226967 3143615 3065429 2994304 2931674 2878616 2835063 2799758 2771493 2749891 2734832 2725919
59748 2725919 2722946 2726166 2735434 2749585 2767362 2788695 2814493 2845486 2881892 2924019 2972501 3027823
59736 3027823 3090121 3159580 3236786 3322676 3418303 3524536 3641782 3770141 3910024 4062333
59726 4062333 4227643 4405409 4594393 4793630 5002397 5219257 5441712 5666963 5892482
59717 5892482 6115738 6333927 6544570 6746297 6938769 7121959 7295760 7460247 7615978
59708 7615978 7763806 7904431 8038261 8165700 8287353 8403675 8514412 8618567 8714973 8802731
59698H802731P8339O8098N7267M6468L6255K6878J8519J1477O030K515J507L558
59686I159642Q646J6261K6189L8722N4001P1577R0851J11398J32576J53302J72633
59675A0035798J90183K05458K17210K24023K25248K20774K10041J92072J66574
59666A1887381J34435R7011N5403J0743l5325q0870j24282j64368j99907k29521
59656A1350700k52201k67964k77762k82790k84087k82946k81378k81540k84411
59647H855621k89303k94707k99412l02791l04675l05409l05658l05565l04092
59638F144009k99702k91698k80599k67264k52163k35568k18062k00485j83510
59629C914958j67365j51950j37109j22883j09470r7065q5821p6050o8165o2158
$$ plain form
59698 8802731 8881070 8949168 9006435 9052903 9089158 9116036 9134555 9146032 9152062 9154577 9156084 9159642
59686 9159642 9168288 9184549 9210738 9249460 9303461 9375038 9465889 9577287 9709863 9863165 10035798
59675 10035798 10225981 10431439 10648649 10872672 11097920 11318694 11528735 11720807 11887381
59666 11887381 12021816 12118827 12174230 12184973 12149648 12068778 11944496 11780128 11580221 11350700
59656 11350700 11098499 10830535 10552773 10269983 9985896 9702950 9421572 9140032 8855621
59647 8855621 8566318 8271611 7972199 7669408 7364733 7059324 6753666 6448101 6144009
59638 6144009 5844307 5552609 5272010 5004746 4752583 4517015 4298953 4098468 3914958
59629 3914958 3747593 3595643 3458534 3335651 3226181 3129116 3043295 2967245 2899080 2836922
59619B836922n7247n2415m7335m2570l8786l5977l3556l1084k8804k7319k6833
59608B414996k6794k6539k6118k6152k6777k7249k6841k5748k4699k4027k3560
59597B130492k3209k3011k2707k1912k0764j9861j9405j8916j7948j6639j5292
59586A910828j3816j2004r939p849n696l398j198N60K002L656N746P906R731J1354
59572A897883J3223J5435J7610J9455K1264K3596K6592K9892L3248L6831M0718
59561B175747M4362M7100M9096N1398N4870N9373O4036O8140P1538P4501P7336
59550B837497Q0165Q2891Q5265Q6816Q6706Q3978P8414P1065O3502N6306M8698
59539C661303L9718K9432J8749Q435j315j0588j9419k7666l4986m1062m6007n0259
$$ plain form
59619 2836922 2779675 2727260 2679925 2637355 2598569 2562592 2529036 2497952 2469148 2441829 2414996
59608 2414996 2388202 2361663 2335545 2309393 2282616 2255367 2228526 2202778 2178079 2154052 2130492
59597 2130492 2107283 2084272 2061565 2039653 2018889 1999028 1979623 1960707 1942759 1926120 1910828
59586 1910828 1897012 1885008 1875069 1867220 1861524 1858126 1856928 1857488 1859490 1863146 1868892 1876798 1886529 1897883
59572 1897883 1911106 1926541 1944151 1963606 1984870 2008466 2035058 2064950 2098198 2135029 2175747
59561 2175747 2220109 2267209 2316305 2367703 2422573 2481946 2545982 2614122 2685660 2760161 2837497
59550 2837497 2917662 3000553 3085818 3172634 3259340 3343318 3421732 3492797 3556299 3612605 3661303
59539 3661303 3701021 3730453 3749202 3757637 3756322 3745734 3726315 3698649 3663663 3622601 3576594 3526335
59527C526335n3868n6205n6809n6137n4908n2888m9071m3090l5725k7823j9345
59516C020466r878N16J1439K2804L4719M6905N8734O9722P9588Q7921R4129R7686
59504C614751R8078R4787Q7791P7944O6208N2591L6419J7842j669k0606l8467
59493D085669n5214p0251q2616r1781r7730j00604j00814r9124r5913r0652q2826
59482C118144p3201o3286n3631m3507l2398k0901r925J65R218J6940K3365K8974
59470B899957L3738L6693L7153L5734L3395K9970K4543J6966Q053j573j1821k2301
59458C120507l2153m1061m9576n8034o5727p1646p5623p8273q0076q0946q0645
59447B406747p9226p7065p4505p1512o7761o3222n8479n4220n0544m7115m3775
$$ plain form
59527 3526335 3472467 3416262 3359453 3303316 3248408 3195520 3146449 3103359 3067634 3039811 3020466
59516 3020466 3010588 3011104 3022543 3045347 3080066 3126971 3185705 3255427 3335015 3422936 3517065 3614751
59504 3614751 3712829 3807616 3895407 3973351 4039559 4092150 4128569 4146411 4144742 4124136 4085669
59493 4085669 4030455 3960204 3877588 3785807 3688077 3587473 3486659 3387535 3291622 3200970 3118144
59482 3118144 3044943 2981657 2928026 2884519 2852121 2831220 2821295 2821460 2830678 2847618 2870983 2899957
59470 2899957 2933695 2970388 3007541 3043275 3076670 3106640 3131183 3148149 3156202 3154629 3142808 3120507
59458 3120507 3088354 3047293 2997717 2939683 2873956 2802310 2726687 2648414 2568338 2487392 2406747
59447 2406747 2327521 2250456 2175951 2104439 2036678 1973456 1914977 1860757 1810213 1763098 1719323
59436A719323m0479l6827l2428k7834k4229k1858j9485j5931j1545p456l864N
59424A477392M406Q279J0225R824P938O079N556O720Q707J0039R871Q779Q313
59411A582128R645J2408J4836J5209J3373J0768R041Q820R745J1166J2478J3210
59399A722827J3349J3555J4674J6964J9975K3105K6096K9080L2374L6134M0068
59388A988201M3653M6745M9718N2801N5716N8339O1271O5063O9085P2012P3512
59377B636116P4738P6896Q0110Q4034Q8969R5608J04027J13627J24029J35433
59367C613587J47972J61107J73941J85907J96837K06434K13946K18547K19937
59358E338215K18400K14217K07280J97435J84975J70439J53976J35376J14745
$$ plain form
59436 1719323 1678844 1642017 1609589 1581755 1557526 1535668 1516183 1500252 1488707 1481251 1477387 1477392
59424 1477392 1481798 1490077 1500302 1510126 1518064 1524143 1529699 1536419 1545126 1555165 1565036 1573815 1582128
59411 1582128 1591773 1604181 1619017 1634226 1647599 1658367 1667408 1676228 1685973 1697139 1709617 1722827
59399 1722827 1736176 1749731 1764405 1781369 1801344 1824449 1850545 1879625 1911999 1948133 1988201
59388 1988201 2031854 2078599 2128317 2181118 2236834 2295173 2356444 2421507 2490592 2562604 2636116
59377 2636116 2710854 2787750 2867860 2951894 3040863 3136471 3240498 3354125 3478154 3613587
59367 3613587 3761559 3922666 4096607 4282514 4479351 4685785 4899731 5118278 5338215
59358 5338215 5556615 5770832 5978112 6175547 6360522 6530961 6684937 6820313 6935058
59349F935058R2715O9840M6105K1272m593l1149n7998q4586j10188j34281j56711
59338F585484j77142j94619k08261k18084k24652k28060k27985k24739k19448
59329D662494k12899k04942j95417j85021j74658j64451j54086j43768j34047
59320C093205j24942j16033j07379r9469r2266q5136p7972p1461o5859o0279n3926
59309B138483m7267m1234l5766l0075k4039j8371j3597r792p292o586p195p582
59297A889687o716n092l835l370l328l096j980O13M418Q271J1400J4366J8084
59284A919422K2349K6152K9138L1727L3956L5238L5399L5015L4347L2770K9697
59273B265210K5406K0483J5006Q904K597l343q987j4814k0779k6173l0440l3732
$$ plain form
59349 6935058 7027773 7097613 7143718 7164990 7160397 7129248 7071250 6986664 6876476 6742195 6585484
59338 6585484 6408342 6213723 6005462 5787378 5562726 5334666 5106681 4881942 4662494
59329 4662494 4449595 4244653 4049236 3864215 3689557 3525106 3371020 3227252 3093205
59320 3093205 2968263 2852230 2744851 2645382 2553116 2467980 2390008 2318547 2252688 2192409 2138483
59309 2138483 2091216 2049982 2014216 1984141 1960102 1941731 1928134 1918342 1911050 1904464 1897269 1889687
59297 1889687 1882971 1877879 1874044 1870674 1867346 1864250 1862270 1862883 1867301 1875572 1886972 1901338 1919422
59284 1919422 1941771 1967923 1997061 2028788 2062744 2097982 2133381 2168396 2202743 2235513 2265210
59273 2265210 2290616 2311099 2326105 2335009 2337606 2334263 2325276 2310462 2289683 2263510 2233070 2199338
59261B199338l6531l8986m0765m1447m1040m0126l9302l8496l7014l4484l1432
59250A779715k8668k6356k4038k1396j8525j5583j2618r763p215m856k260P56
59238A609193L828O487Q667J0592J2279J3437J3893J4082J4868J6812J9650K2670
59226A766458K5572K8613L1882L4983L7829M1246M6124N2174N8327O4311P1050
59215B258569P9266Q8452R7662J06580J15287J23492J30632J36352J40147J40856
59205C417295J37370J29906J19745J07553R2609P4039N2231K8653M637j9115m2082
59194D102841o3459q2303r7928j10148j19131j25069j28001j28080j25842j21943
59184C000937j16649j09905j01867r3034q3859p4658o5897n8041n0917m3813l6571
$$ plain form
59261 2199338 2162807 2123821 2083056 2041609 2000569 1960443 1921141 1882645 1845631 1811147 1779715
59250 1779715 1751047 1724691 1700653 1679257 1660732 1645149 1632531 1622768 1615553 1610697 1608437 1609193
59238 1609193 1613021 1619508 1628175 1638767 1651046 1664483 1678376 1692458 1707326 1724138 1743788 1766458
59226 1766458 1792030 1820643 1852525 1887508 1925337 1966583 2012707 2064881 2123208 2187519 2258569
59215 2258569 2337835 2426287 2523949 2630529 2745816 2869308 2999940 3136292 3276439 3417295
59205 3417295 3554665 3684571 3804316 3911869 4004478 4078517 4130748 4159401 4164038 4144923 4102841
59194 4102841 4039382 3957079 3859151 3749003 3629872 3504803 3376802 3248722 3122880 3000937
59184 3000937 2884288 2774383 2672516 2579482 2495623 2420965 2355068 2297027 2246110 2202297 2165726
59173B165726l0033k4969k1034j7394j4022j1591j0350r895j0046j1151j3330
59162A991911j6120j9071k2193k5480k8531l1014l3052l4828l6140l6730l6726
59151A672026l6356l5462l3739l1279k8534k5810k3120k0456j7855j5245j2488
59140A391682r644o943m553k476o63J008K723M522O152P296P941Q332Q692R069
59126A423138R415R545R219Q478P826P748Q079Q127P574O937O970P729Q440Q312
59112A537537P401O499O198O236O041N694N868O761P634P774P464P590Q583J0217
59098A637497J2186J4216J5857J6796J7454J8601K0346K2088K3578K5266K7276
59087A851161K8807K9072K8404K7713K7187K6223K4489K2305J9843J6610J2138
$$ plain form
59173 2165726 2135693 2110724 2089690 2072296 2058274 2046683 2036333 2026438 2016392 2005241 1991911
59162 1991911 1975791 1956720 1934527 1909047 1880516 1849502 1816450 1781622 1745482 1708752 1672026
59151 1672026 1635670 1600208 1566469 1535190 1506656 1480846 1457726 1437270 1419415 1404170 1391682
59140 1391682 1382038 1375095 1370542 1368066 1367403 1368411 1371134 1375656 1381808 1389104 1397045 1405377 1414069 1423138
59126 1423138 1432553 1442098 1451317 1459795 1467621 1475369 1483448 1491575 1499149 1506086 1513056 1520785 1529225 1537537
59112 1537537 1544938 1551437 1557635 1563871 1569912 1575606 1581474 1588235 1595869 1603643 1611107 1618697 1627280 1637497
59098 1637497 1649683 1663899 1679756 1696552 1714006 1732607 1752953 1775041 1798619 1823885 1851161
59087 1851161 1879968 1909040 1937444 1965157 1992344 2018567 2043056 2065361 2085204 2101814 2113952
59076B113952O782J418l516q261j3152j8086k2729k6875l0397l3047l4634l5341
59064A896114l5546l5309l4442l3172l2200l1803l1259k9775k7630k5738k4271
59053A554969k2575k0501j8854j8138j7563j6058j3730j1581j0087q824p415o046
59041A383597m962m033l152k622k778l481m241m751n097n554o265p072p568p343
59027A314678o320m859l513k646k144j522m22R32J940K413K838L672M605M967
59013A314619M801M981O180Q062R773J0860J1510J2052J2679J3574J4976J6922
59001A440989J9080K1000K2556K4068K5905K8041L0059L1610L2710L3564L4199
58990A743781L4386L3836L2323K9754K6264K2212J7889J3293Q316L187j561n549
$$ plain form
59076 2113952 2120734 2122152 2118636 2110375 2097223 2079137 2056408 2029533 1999136 1966089 1931455 1896114
59064 1896114 1860568 1825259 1790817 1757645 1725445 1693642 1662383 1632608 1604978 1579240 1554969
59053 1554969 1532394 1511893 1493039 1474901 1457338 1441280 1427550 1415969 1405882 1397058 1389643 1383597
59041 1383597 1378635 1374602 1371450 1368828 1366050 1362569 1358328 1353577 1348480 1342926 1336661 1329589 1322021 1314678
59027 1314678 1308358 1303499 1299986 1297340 1295196 1293674 1293252 1294184 1296124 1298537 1301375 1305047 1309652 1314619
59013 1314619 1319420 1324401 1330581 1338643 1348416 1359276 1370786 1382838 1395517 1409091 1424067 1440989
59001 1440989 1460069 1481069 1503625 1527693 1553598 1581639 1611698 1643308 1676018 1709582 1743781
58990 1743781 1778167 1812003 1844326 1874080 1900344 1922556 1940445 1953738 1962054 1965241 1963680 1958131
58978A958131q826j1696j4461j7300k0126k2460k3730k3840k3245k2329k1027
58967A749091j9179j7016j4920j2890j0640q124n642l343j113J015K698L773M534
58954A668244N274N858O182O713Q017R831J1197J1760J2275J3486J5031J5998
58942A789866J6275J6646J7656J9047K0506K2296K4773K7697L0538L3249L6261
58931B054810L9810M3664M7528N1390N5247N8730O1170O2091O1606O0311N8812
58920B655169N7353N5929N4594N3439N2384N1295N0424N0402N1596N3782N6568
58909C242935N9866O3704O7875P2228P7073Q2868Q9610R6855J04321J12068J20166
58898D189569J28565J37171J45568J52766J57694J60140J60667J59520J56167
$$ plain form
58978 1958131 1949305 1937609 1923148 1905848 1885722 1863262 1839532 1815692 1792447 1770118 1749091
58967 1749091 1729912 1712896 1697976 1685086 1674446 1666322 1660680 1657337 1656224 1657239 1659937 1663710 1668244
58954 1668244 1673518 1679376 1685558 1692271 1700288 1710119 1721316 1733076 1745351 1758837 1773868 1789866
58942 1789866 1806141 1822787 1840443 1859490 1879996 1902292 1927065 1954762 1985300 2018549 2054810
58931 2054810 2094620 2138284 2185812 2237202 2292449 2351179 2412349 2474440 2536046 2596357 2655169
58920 2655169 2712522 2768451 2823045 2876484 2928868 2980163 3030587 3080989 3132585 3186367 3242935
58909 3242935 3302801 3366505 3434380 3506608 3583681 3666549 3756159 3853014 3957335 4069403 4189569
58898 4189569 4318134 4455305 4600873 4753639 4911333 5071473 5232140 5391660 5547827
58889E547827J50186J42043J32501J21599J08816R4103P8277O2262M6252K9687
58879F513553J1957o916k6192m4925o2624p9322r5085j09622j22439j33266j42241
58868E702878j49780j56230j61437j64716j65536j64299j62071j59448j56033
58859D263328j51225j45086j38233j31280j24717j18880j13490j07582j00497
58850C132338r2797q5669p9506p3697o7724o1757n6014n0302m4496l9028l4343
58839B447005l0254k6232k2215j8663j5850j3407j0638p167l238N62L887O944
58827B310734J0125J3451J6627J9553K2446K5323K7796K9659L1299L3159L5114
58816B575286L6773L8263M0152M2632M5306M7936N0962N5009O0110O5726P1457
$$ plain form
58889 5547827 5698013 5840056 5972557 6094156 6202972 6297075 6375352 6437614 6483866 6513553
58879 6513553 6525510 6518594 6492402 6447477 6384853 6305531 6210446 6100824 5978385 5845119 5702878
58868 5702878 5553098 5396868 5235431 5070715 4905179 4740880 4578809 4419361 4263328
58859 4263328 4112103 3967017 3828784 3697504 3572787 3453907 3340417 3232835 3132338
58850 3132338 3039541 2953872 2874366 2800669 2732945 2671188 2615174 2564872 2520376 2481348 2447005
58839 2447005 2416751 2390519 2368304 2349641 2333791 2320384 2309746 2302579 2299341 2299903 2303790 2310734
58827 2310734 2320859 2334310 2350937 2370490 2392936 2418259 2446055 2475714 2507013 2540172 2575286
58816 2575286 2612059 2650322 2690474 2733106 2778412 2826348 2877310 2932319 2992429 3058155 3129612
58805C129612P7436Q4069R1464R9241J06921J14433J22105J30070J37824J44564
58795D237739J49851J53742J56290J57319J56641J54143J49571J42585J33162
58786E591043J21619J07982R1820P3047N2514L1283R537j3179l6731n9994q1750
58775E887191j01399j18685j33348j45391j55219j63013j68324j70659j70308
58766D560845j68132j64724j60135j54291j47352j39740j32059j24842j18091
58757C251479j11280j04068r6786q9882q3171p6204o9179o2817n7430n2641m8057
58746B399964m3588l9040l4123k9091k4722k1343j8436j5482j2603r973p193l881
58734B140489l62K842N846R024J2077J4166J4832J4154J2098Q477L642j548o659
$$ plain form
58805 3129612 3207048 3291117 3382581 3481822 3588743 3703176 3825281 3955351 4093175 4237739
58795 4237739 4387590 4541332 4697622 4854941 5011582 5165725 5315296 5457881 5591043
58786 5591043 5712662 5820644 5912464 5985511 6038025 6069308 6078845 6065666 6028935 5968941 5887191
58775 5887191 5785792 5667107 5533759 5388368 5233149 5070136 4901812 4731153 4560845
58766 4560845 4392713 4227989 4067854 3913563 3766211 3626471 3494412 3369570 3251479
58757 3251479 3140199 3036131 2939345 2849463 2766292 2690088 2620909 2558092 2500662 2448021 2399964
58746 2399964 2356376 2317336 2283213 2254122 2229400 2208057 2189621 2174139 2161536 2151563 2144370 2140489
58734 2140489 2140127 2142969 2148815 2157839 2169916 2184082 2198914 2213068 2225166 2233643 2237285 2235737 2229078
58721B229078j2115j8409k5279l1858l7339m1373m4133m6156m7770m8604m7962
58710A828080m5823m3063m0470l7917l4724l0528k5495j9999j4457r406n344k455
58698A518399o35K44K10p45k628n401q808j2373j5628j8415k0773k2592k3472
58685A387383k3097k1697k0003j8485j6766j4016j0043n605j535K075N480Q557
58673A272248J1022J3098J5220J7190J8246J7998J6626J4087R970M498j084n629
58661A403490r108j2093j4820j7280j9700k2130k3886k4126k2903k0989j8830
58650A197625j6372j3846j1885j0598r217p038m390k239j072m68L88J879L673
58637A126440N015N444N211M976N140N552N860N920N874N898N970N860N540N513
$$ plain form
58721 2229078 2216963 2198554 2173275 2141417 2104078 2062705 2018572 1972416 1924646 1876042 1828080
58710 1828080 1782257 1739194 1698724 1660807 1626083 1595555 1570060 1550061 1535604 1526198 1520854 1518399
58698 1518399 1517764 1518008 1518218 1517473 1514845 1509444 1500636 1488263 1472635 1454220 1433447 1410855 1387383
58685 1387383 1364286 1342589 1322586 1304101 1287335 1273319 1263276 1257671 1256136 1258211 1263691 1272248
58673 1272248 1283270 1296368 1311588 1328778 1347024 1365022 1381648 1395735 1405705 1410203 1409119 1403490
58661 1403490 1394382 1382289 1367469 1350189 1330489 1308359 1284473 1260347 1237444 1216455 1197625
58650 1197625 1181253 1167407 1155522 1144924 1135707 1128669 1124279 1122040 1120968 1120500 1120888 1122767 1126440
58637 1126440 1131455 1136899 1142110 1147086 1152226 1157778 1163638 1169558 1175432 1181330 1187300 1193160 1198700 1204213
58623A204213O402Q031R275R197Q142P328P535Q654J0308J2273J4227J5720J6699
58610A338004J7633J8879K0298K1771K3689K6545L0196L3902L7028L9529M1730
58599A649204M3922M6124M8122M9636N0463N0388M9131M6575M3026L8953L4439
58588B149983K9139K2890J6125R491L300k436p606j1886j4997j6951j8101j8997
58576B139954k0045k1135k1731k1483k0681j9917j9375j8692j7497j5920j4532
58565A928946j3815j3817j4106j4108j3565j2774j2335j2568j3234j3961j4830
58554A779833j6307j8488k0736k2369k3433k4389k5215k5421k4966k4516k4480
58543A529513k4393k3714k2692k1816k0889j9395j7543j6077j5131j4109j2775
$$ plain form
58623 1204213 1210615 1218646 1227921 1237118 1245260 1252588 1260123 1268777 1279085 1291358 1305585 1321305 1338004
58610 1338004 1355637 1374516 1394814 1416585 1440274 1466819 1497015 1530917 1567945 1607474 1649204
58599 1649204 1693126 1739250 1787372 1837008 1887471 1937859 1986990 2033565 2076591 2115544 2149983
58588 2149983 2179122 2202012 2218137 2227628 2230928 2228492 2220886 2209000 2194003 2177052 2158951 2139954
58576 2139954 2119909 2098774 2077043 2055560 2034879 2014962 1995587 1976895 1959398 1943478 1928946
58565 1928946 1915131 1901314 1887208 1873100 1859535 1846761 1834426 1821858 1808624 1794663 1779833
58554 1779833 1763526 1745038 1724302 1701933 1678500 1654111 1628896 1603475 1578509 1553993 1529513
58543 1529513 1505120 1481406 1458714 1436898 1416009 1396614 1379071 1362994 1347863 1333754 1320979
58532A320979j1651j0992j0181q568o447m626l507k922k610k376k055j661j415
58519A251968j396j375j108n50L37J533K557K695K023J692K710M766O749Q068
58505A280669Q906R578J0263J1199J2445J3507J3757J3224J2456J1740J0919R972
58493A418635R132Q362P242N610L908K698K100J859J665J364J042R51J148J319
58479A467035J171Q84P87P86N58J02m33j323k922m719n572n257m943n715p167
58464A433272q119q215q044p969p619o659n445m619m344m201l671k643j481o60
58450A359583k53J68J072K383L479L824L563L474M232N689P013P581P516P221
58436A416545O702N830M964M775N295N812N854N777O059O490O559O212N796N439
$$ plain form
58532 1320979 1309328 1298336 1288155 1279587 1273140 1268514 1265007 1262085 1259475 1257099 1255044 1253383 1251968
58519 1251968 1250572 1249197 1248089 1247539 1247876 1249409 1251966 1254661 1256684 1258376 1261086 1265852 1272601 1280669
58505 1280669 1289575 1299153 1309416 1320615 1333060 1346567 1360324 1373548 1386004 1397744 1408663 1418635
58493 1418635 1427767 1436129 1443371 1448981 1452889 1455587 1457687 1459546 1461211 1462575 1463617 1464568 1465716 1467035
58479 1467035 1468206 1469090 1469877 1470663 1471221 1471323 1470890 1469567 1466645 1461926 1456354 1451097 1446154 1440439 1433272
58464 1433272 1425153 1416938 1408894 1400925 1393306 1386647 1381202 1376583 1372239 1368038 1364367 1361724 1360243 1359583
58450 1359583 1359330 1359498 1360570 1362953 1366432 1370256 1373819 1377293 1381525 1387214 1394227 1401808 1409324 1416545
58436 1416545 1423247 1429077 1434041 1438816 1444111 1449923 1455777 1461554 1467613 1474103 1480662 1486874 1492670 1498109
58422A498109N099M973N369O167O912P489Q208R105R687R600R228R254R816J0395
58408A609411J0471J0031R416Q930Q693Q723Q950R181R166Q750P987P097O403
58395A723209O190O498P053P524P904Q416R047R476R636J0014J0980J2117J2680
58382A840744J2593J2339J1922J0703Q562O511N607N666N711N370N192N561O030
58369A942511N943N350M972N399O560P921R015R709J0045J0084R951R944J0292
58356B047696J0810J1158J1378J1818J2442J2680J2292J1895J2176J2886J3224
58345B180455J3057J3122J3947J5094J5700J5449J4789J4448J4849J5856J6932
58334B343698J7622J7940J8185J8523J8936J9529K0480K1680K2710K3284K3558
$$ plain form
58422 1498109 1503208 1508181 1513550 1519717 1526629 1534118 1542326 1551431 1561118 1570718 1579946 1589200 1599016 1609411
58408 1609411 1619882 1629913 1639329 1648259 1656952 1665675 1674625 1683806 1692972 1701722 1709709 1716806 1723209
58395 1723209 1729399 1735897 1742950 1750474 1758378 1766794 1775841 1785317 1794953 1804967 1815947 1828064 1840744
58382 1840744 1853337 1865676 1877598 1888301 1896863 1903374 1908981 1914647 1920358 1925728 1930920 1936481 1942511
58369 1942511 1948454 1953804 1958776 1964175 1970735 1978656 1987671 1997380 2007425 2017509 2027460 2037404 2047696
58356 2047696 2058506 2069664 2081042 2092860 2105302 2117982 2130274 2142169 2154345 2167231 2180455
58345 2180455 2193512 2206634 2220581 2235675 2251375 2266824 2281613 2296061 2310910 2326766 2343698
58334 2343698 2361320 2379260 2397445 2415968 2434904 2454433 2474913 2496593 2519303 2542587 2566145
58323B566145K3871K4398K5130K5982K6848K7635K8250K8498K8126K7209K6366
58312B858458K6230K6649K6759K5970K4611K3464K2949K2895K2866K2573K2118
58301C125542K2008K2744K4281K6064K7681K9280L1205L3402L5407L6753L7333
58290C451700L7466L7732L8561L9909M1486M3212M5130M6870M7749M7679M7505
58279C924999M8112M9542N1424N3815N6946O0335O2943O4280O4825O5196O5491
58268D567908O5581O5537O5487O5444O5611O6458O8205P0474P2813P5271P8178
58257E326967Q1596Q5347Q9372R3662R7999J02211J06609J11702J17560J23763
58247F336788J30029J36399J42882J49335J55869J62963J70991J79871J89383
$$ plain form
58323 2566145 2590016 2614414 2639544 2665526 2692374 2720009 2748259 2776757 2804883 2832092 2858458
58312 2858458 2884688 2911337 2938096 2964066 2988677 3012141 3035090 3057985 3080851 3103424 3125542
58301 3125542 3147550 3170294 3194575 3220639 3248320 3277600 3308805 3342207 3377614 3414367 3451700
58290 3451700 3489166 3526898 3565459 3605368 3646854 3690066 3735196 3782066 3829815 3877494 3924999
58279 3924999 3973111 4022653 4074077 4127892 4184838 4245173 4308116 4372396 4437221 4502417 4567908
58268 4567908 4633489 4699026 4764513 4829957 4895568 4962026 5030231 5100705 5173518 5248789 5326967
58257 5326967 5408563 5493910 5583282 5676944 5774943 5877154 5983763 6095465 6213025 6336788
58247 6336788 6466817 6603216 6746098 6895433 7051302 7214265 7385256 7565127 7754510
58238G754510J99395K09697K20007K30522K42098K55542K70886K87659L05659
58229I975975L25042L45910L68287L92493M19120M48603M81070N16673N55797
58220A3828970N98899O46421O98933P57253Q22512Q96233R80391J077189J188808
58211B1495609J317519J465961J637362J835784K066797K338380K661614L050684
58203C7869710L521909M092045M776439N587359O532283P613725Q833498J0200395
58195H9027363J1733844J3457485J5383767J7486434J9645421K1567984K2754445
58188B11056743K2611996K0730193J7157558J2448616P406437K698569j382161
58181B92727951m890160q028080j0948629j3655901j6010414j7803983j8861454
$$ plain form
58238 7754510 7953905 8163602 8383609 8614131 8856229 9111771 9382657 9670316 9975975
58229 9975975 10301017 10646927 11015214 11407707 11826827 12275430 12756500 13273173 13828970
58220 13828970 14427869 15074290 15773223 16530476 17352988 18249221 19229612 20306801 21495609
58211 21495609 22813128 24279089 25916451 27752235 29819032 32157412 34819026 37869710
58203 37869710 41391619 45483664 50260103 55847462 62379745 69993470 78826968 89027363
58195 89027363 100761207 114218692 129602459 147088893 166734314 188302298 211056743
58188 211056743 233668739 254398932 271556490 284005106 291411543 294110112 292727951
58181 292727951 287837791 279809711 268861082 255205181 239194767 221390784 202529330
58174B02529330j9118303j8637897j7575457j6126201j4483977j2812188j1225056
58167I2550251r784894q515161p416830o478015n679291m999575m420333l925194
58159D1330958l498721l128098k804807k522652k274913k054955j858442j682938
58151B1505432j525657j383255j253600j136160j030411r34940q48203p69288
58143A2623918o97852o33937n77780n29048m86337m47968m13176l81952l53988
58134H101880l28619l05621k85245k67340k51078k35628k20546k05557j90729
58125E811517j76896j65132j55506j46862j38192j29630j21853j14984j08589
58116D553873j02393r6532r1201q6419q2059p7851p3529o9199o5370o2366n9762
$$ plain form
58174 202529330 183411027 164773130 147197673 131071472 116587495 103775307 92550251
58167 92550251 82765357 74250196 66833366 60355351 54676060 49676485 45256152 41330958
58159 41330958 37832237 34704139 31899332 29376680 27101767 25046812 23188370 21505432
58151 21505432 19979775 18596520 17342920 16206760 15176349 14241409 13393206 12623918
58143 12623918 11926066 11292129 10714349 10185301 9698964 9250996 8837820 8455868 8101880
58134 8101880 7773261 7467640 7182395 6915055 6663977 6428349 6207803 6002246 5811517
58125 5811517 5634621 5469489 5313983 5167121 5028929 4899299 4777446 4662462 4553873
58116 4553873 4451480 4354948 4263747 4177328 4095269 4017418 3943889 3874690 3809320 3746954 3687192
58105C687192n6678n2698m8300m4343m1283l8908l6771l4774l3233l2432l2215
58094C235557l2149l1936l1514l0857k9937k8926k8210k8013k8150k8221k7983
58083B909661k7457k6757k5946k4969k3726k2244k0748j9426j8184j6903j5795
58072B667506j5293j5420j5618j5315j4491j3475j2469j1490j0659j0164j0005
58061B523107r949r729r185q347p549p256p551p871p605o854o204n867n482m877
58047B418781m449m578n013n202m941m336l385k072p10K44P21J028J321J420J251
58032B390080J028R07P43L73r5m69o78o14j8J169K489L365L765M163M882N785
58016B416875O618P386Q134Q638Q656Q396Q478R190J0037J0273R875R721J0633
$$ plain form
58105 3687192 3630514 3577816 3529516 3485173 3443890 3404982 3368211 3333437 3300204 3267772 3235557
58094 3235557 3203408 3171472 3139958 3109101 3079164 3050238 3022028 2994015 2965865 2937644 2909661
58083 2909661 2882204 2855447 2829501 2804532 2780806 2758562 2737814 2718388 2700204 2683301 2667506
58072 2667506 2652213 2636793 2621175 2605860 2591369 2577894 2565425 2553935 2543276 2533112 2523107
58061 2523107 2513158 2503429 2494244 2485897 2478348 2471092 2463541 2455670 2448065 2441211 2435007 2429140 2423658 2418781
58047 2418781 2414332 2409754 2404741 2399539 2394598 2390262 2386877 2384805 2384095 2384339 2385060 2386088 2387409 2388829 2390080
58032 2390080 2391108 2392015 2392758 2393131 2393036 2392567 2391889 2391275 2391257 2392426 2394915 2398280 2402045 2406208 2411090 2416875
58016 2416875 2423493 2430879 2439013 2447651 2456307 2464703 2473181 2482371 2492408 2502681 2512556 2522277 2532910
58003B532910J2458J4323J5687J6841J8290K0042K1683K2995K4185K5611K7401
57992B752426K9329L1005L2223L3269L4763L7009L9594M1748M3056M3647M3816
57981C161885M3637M2884M1216L8392L4475K9721K4226J7900J0896L827k731q773
57969C437555j4576k0013k4661k8447l1657l4214l5453l4929l3019l0485k7746
57958C122355k4855k1868j8853j5752j2587r651p188m971k605j77J750K851L438
57945C011887M111N081O040O559O597O532O620O605O118N486N642O990Q798J0133
57931C103199J1090J2531J4730J6981J8632J9897K1340K2870K3640K2834K0350
57920C308094J6830J3146R807O711L446k03m065p757j0831j2876j3743j3749j3420
$$ plain form
58003 2532910 2545368 2559691 2575378 2592219 2610509 2630551 2652234 2675229 2699414 2725025 2752426
57992 2752426 2781755 2812760 2844983 2878252 2913015 2950024 2989618 3031366 3074422 3118069 3161885
57981 3161885 3205522 3248406 3289622 3328014 3362489 3392210 3416436 3434336 3445232 3449059 3446328 3437555
57969 3437555 3422979 3402966 3378305 3349858 3318201 3283987 3248534 3213605 3180586 3150101 3122355
57958 3122355 3097500 3075632 3056779 3041027 3028440 3018789 3011601 3006630 3004025 3003848 3005598 3008449 3011887
57945 3011887 3015998 3021079 3027119 3033678 3040275 3046807 3053427 3060032 3066150 3071636 3077278 3084268 3093066 3103199
57931 3103199 3114289 3126820 3141550 3158531 3177163 3197060 3218400 3241270 3264910 3287744 3308094
57920 3308094 3324924 3338070 3347877 3354588 3358034 3357831 3353766 3346009 3335178 3322302 3308559 3294810 3281390
57907C281390j3066j2687j2195j1446j0245q651p260o673o666o326n105l373j807
57894C175890p49l46p26j674k422k278j289k8J033J779K282K760L416M180M770
57879C186598N244O090P579R375J1059J2484J3340J3084J1968J1412J2450J4162
57867C314845J4776J4012J3187J3115J3219J2988J2913J3260J3116J1661R700
57856C456792Q790R268J0031J0139R764R529R659R912R936R554R038Q970R593
57843C580975J0440J0899J0960J0965J0895J0484R885R615R759R783R281Q500
57831C702441P995Q026Q426Q766Q650Q119P775Q235R460J0927J2349J3835J5324
57818C830328J6405J6835J6882J7050J7707J9016K0915K3001K4789K6147K7316
$$ plain form
57907 3281390 3268324 3255637 3243442 3231996 3221751 3213100 3205840 3199167 3192501 3186175 3181070 3177697 3175890
57894 3175890 3175141 3174795 3174069 3172395 3169973 3167695 3166406 3166378 3167411 3169190 3171472 3174232 3177648 3181828 3186598
57879 3186598 3191842 3197932 3205511 3214886 3225945 3238429 3251769 3264853 3276821 3288233 3300683 3314845
57867 3314845 3329621 3343633 3356820 3369935 3383154 3396142 3409055 3422315 3435431 3447092 3456792
57856 3456792 3465582 3474850 3484881 3495020 3504784 3514313 3523972 3533884 3543820 3553374 3562412 3571382 3580975
57843 3580975 3591415 3602314 3613274 3624239 3635134 3645618 3655503 3665118 3674877 3684660 3693941 3702441
57831 3702441 3710436 3718462 3726888 3735654 3744304 3752423 3760198 3768433 3777893 3788820 3801169 3815004 3830328
57818 3830328 3846733 3863568 3880450 3897500 3915207 3934223 3955138 3978139 4002928 4029075 4056391
57807D056391K8509K9828L1494L3643L5912L7730L8980L9827L9871L8232L4800
57796D445217L0642K6780K3114J9079J4656J0172N586Q30l528o733q833j0486
57784D546496j1926j2851j3280j3675j4107j4050j3227j1996j0616q799o418m103
57772D411448k570j685p61M79J720K757L819N113O444P471Q155Q788R617J0561
57758D471356J1276J1510J1407J1447J2089J3396J4977J6266J6935J7155J7429
57747D625243J8063J8829J9238J9163J9010J9274J9989K0690K0816K0236J9396
57736D839947J8846J8604J8136J7145J6106J5636J5647J5530J5177J5133J5624
57725E021531J6027J5711J4916J4349J4265J4441J4812J5524J6413J6994J7111
$$ plain form
57807 4056391 4084900 4114728 4146222 4179865 4215777 4253507 4292487 4332314 4372185 4410417 4445217
57796 4445217 4475859 4502639 4525753 4544832 4559488 4569660 4575246 4576076 4572548 4565815 4556982 4546496
57784 4546496 4534570 4521719 4508439 4494764 4480657 4466607 4453380 4441384 4430768 4421969 4415551 4411448
57772 4411448 4408878 4407193 4406432 4406911 4408631 4411388 4415207 4420320 4426764 4434235 4442390 4451178 4460795 4471356
57758 4471356 4482632 4494142 4505549 4516996 4529085 4542481 4557458 4573724 4590659 4607814 4625243
57747 4625243 4643306 4662135 4681373 4700536 4719546 4738820 4758809 4779499 4800315 4820551 4839947
57736 4839947 4858793 4877397 4895533 4912678 4928784 4944420 4960067 4975597 4990774 5005907 5021531
57725 5021531 5037558 5053269 5068185 5082534 5096799 5111240 5126052 5141576 5157989 5174983 5192094
57714E192094J7174J7599J8316J9039J9685K0374K1150K1955K2710K3328K3729
57703E417153K3963K4238K4680K5167K5476K5610K5859K6572K7831K9274L0339
57692E706162L0857L1330L2426L4194L6088L7789L9738M2532M6157N0062N3909
57681F141244N7814O1995O6480P1322P6799Q3199R0503R8364J06389J14290J21558
57670G089957J26671J26668J18283J00557P6651N2524L2914J8318N774p670k2382
57659G718265l6639m8752n8124o4505o7148o5494o0480n4403m9062m4360l9198
57648G130100l3289k7506k2630j8543j4752j1089p584m183q94K106M829P467R966
57635G013998J2032J3844J6092J8892K1344K2838K4153K6399K9358L1914L3787
$$ plain form
57714 5192094 5209268 5226867 5245183 5264222 5283907 5304281 5325431 5347386 5370096 5393424 5417153
57703 5417153 5441116 5465354 5490034 5515201 5540677 5566287 5592146 5618718 5646549 5675823 5706162
57692 5706162 5737019 5768349 5800775 5834969 5871057 5908846 5948584 5991116 6037273 6087335 6141244
57681 6141244 6199058 6261053 6327533 6398855 6475654 6558853 6649356 6747720 6854109 6968399 7089957
57670 7089957 7216628 7343296 7461579 7562136 7638787 7691311 7724225 7742543 7748317 7740647 7718265
57659 7718265 7681626 7632874 7574750 7510245 7443097 7377603 7317123 7262720 7213658 7169298 7130100
57648 7130100 7096811 7069305 7046675 7028132 7013380 7002291 6994707 6990524 6989630 6991736 6996565 7004032 7013998
57635 7013998 7026030 7039874 7055966 7074858 7096202 7119040 7143193 7169592 7198950 7230864 7264651
57624G264651L5700L7894L9712M0944M2429M4821M7667N0275N2683N5116N7149
57613G769041N8178N8281N7938N7193N5755N3571N0705M6865M1767L5839L0017
57602H315150K4800J9940J4975R726M351o95m877q003j0317j1971j2651j2122
57590H328306j0819r512q505p554o372m869l101j348K2J142K668M857P018Q470
57576H300403R493J0686J1845J2456J2911J4074J5750J6830J7070J7544J8873
57565H457935K0158K0417K0166K0723K2333K3884K4338K3889K3650K4484K6112
57554H708089K7349K7389K6735K6459K6767K6968K6858K7149K8200K9264K9592
57543I010819K9537K9907L0751L1584L2298L3079L3746L3990L4121L4802L6141
$$ plain form
57624 7264651 7300351 7338245 7377957 7418901 7461330 7506151 7553818 7604093 7656776 7711892 7769041
57613 7769041 7827219 7885500 7943438 8000631 8056386 8109957 8160662 8207527 8249294 8285133 8315150
57602 8315150 8339950 8359890 8374865 8384591 8388942 8388247 8383370 8375367 8365050 8353079 8340428 8328306
57590 8328306 8317487 8307975 8299470 8291916 8285544 8280675 8277574 8276226 8276248 8277390 8280058 8284915 8291933 8300403
57576 8300403 8309896 8320582 8332427 8344883 8357794 8371868 8387618 8404448 8421518 8439062 8457935
57565 8457935 8478093 8498510 8518676 8539399 8561732 8585616 8609954 8633843 8657493 8681977 8708089
57554 8708089 8735438 8762827 8789562 8816021 8842788 8869756 8896614 8923763 8951963 8981227 9010819
57543 9010819 9040356 9070263 9101014 9132598 9164896 9197975 9231721 9265711 9299832 9334634 9370775
57532I370775L7642L9024M0474M2099M3706M5169M6605M8078M9500N0813N1992
57521I865877N2982N3898N5050N6372N7078N6449N4787N2949N1063M8399M4538
57510A0449442L9977L5398L0983K6720K2782J9225J5731J2100Q671N987M232L312
57498A0674560L087L242L272L034L128M203O074P980R639J1489J3753J5959J7643
57485A0777063J9032K0530K1969K2965K3850K5363K7361K8732K8949K8999L0083
57474A1054896L1990L3547L4420L5408L7064L8889M0195M0969M1590M2289M3266
57463A1474523M4763M6621M8213M9247N0147N1281N2257N2437N1733N0449M8725
57452A2020396M6522M3807M0351L5729L0063K4322J9405J5273J1445P896M844
$$ plain form
57532 9370775 9408417 9447441 9487915 9530014 9573720 9618889 9665494 9713572 9763072 9813885 9865877
57521 9865877 9918859 9972757 10027807 10084179 10141257 10197706 10252493 10305442 10356505 10404904 10449442
57510 10449442 10489419 10524817 10555800 10582520 10605302 10624527 10640258 10652358 10661029 10667016 10671248 10674560
57498 10674560 10677647 10680889 10684161 10687195 10690323 10694526 10700600 10708580 10718219 10729708 10743461 10759420 10777063
57485 10777063 10796095 10816625 10838594 10861559 10885409 10910772 10938133 10966865 10995814 11024813 11054896
57474 11054896 11086886 11120433 11154853 11190261 11227325 11266214 11306409 11347378 11388968 11431257 11474523
57463 11474523 11519286 11565907 11614120 11663367 11713514 11764795 11817052 11869489 11921222 11971671 12020396
57452 12020396 12066918 12110725 12151076 12186805 12216868 12241190 12260595 12275868 12287313 12295209 12300053
57441A2300053K104n53k696l687l693l481l396l225k899k511j773k97J574L026
57427A2278546L973N095O686Q227R358J0421J1730J3034J3947J4386J4381J4051
57415A2403835J3930J4570J5679J6345J6365J6461J6970J7263J6963J6751J7261
57404A2582393J7983J8092J7740J7639J7848J7882J7660J7514J7485J7376J7222
57393A2776834J7066J6499J5286J4122J3915J4376J4368J3624J3178J3739J4617
57382A2937624J4764J4156J3487J3008J2386J1475J0570R860R220Q627Q351Q537
57370A3072065Q825Q747Q297P850P548P138O473N842N563N510N436N423N575N441
57356A3165733M408K731J534J560K407L216L587L548L169K655K383K372K059J110
$$ plain form
57441 12300053 12302157 12301604 12298908 12295221 12291528 12288047 12284651 12281426 12278527 12276016 12274243 12273946 12275520 12278546
57427 12278546 12282519 12287614 12294300 12302527 12311885 12322306 12334036 12347070 12361017 12375403 12389784 12403835
57415 12403835 12417765 12432335 12448014 12464359 12480724 12497185 12514155 12531418 12548381 12565132 12582393
57404 12582393 12600376 12618468 12636208 12653847 12671695 12689577 12707237 12724751 12742236 12759612 12776834
57393 12776834 12793900 12810399 12825685 12839807 12853722 12868098 12882466 12896090 12909268 12923007 12937624
57382 12937624 12952388 12966544 12980031 12993039 13005425 13016900 13027470 13037330 13046550 13055177 13063528 13072065
57370 13072065 13080890 13089637 13097934 13105784 13113332 13120470 13126943 13132785 13138348 13143858 13149294 13154717 13160292 13165733
57356 13165733 13170141 13172872 13174406 13175966 13178373 13181589 13185176 13188724 13191893 13194548 13196931 13199303 13201362 13202472
57342A3202472O5k89O8N01N99M06M1m02p60j081j814l149m465m950m671m386m465
57325A3173720m731n183o088p294q185q549q783r120r302r258r373r788j0035
57312A3068031r850r687j0052j0787j1502j2266j3270j4254j4792j4901j4822
57301A2931848j4518j3935j3542j3932j4972j5925j6443j6904j7706j8700j9544
57290A2755727k0142k0626k1143k1894k3072k4679k6559k8648l0894l2911l4103
57279A2471056l4362l4310l4654l5524l6674l7962l9294m0353m0916m1295m1974
57268A2053738m2798m3108m2791m2688m3572m5147m6445m7025m7326m7954m9003
57257A1555881n0105n0793n0829n0408n0143n0490n1216n1650n1461n0875n0150
$$ plain form
57342 13202472 13202537 13202248 13202316 13202817 13203416 13203822 13203863 13203461 13202701 13201620 13199806 13196657 13192192 13187242 13182571 13178185 13173720
57325 13173720 13168989 13163806 13157718 13150424 13142239 13133690 13124907 13115787 13106485 13097227 13087854 13078066 13068031
57312 13068031 13058181 13048494 13038442 13027655 13016153 13003887 12990617 12976363 12961571 12946670 12931848
57301 12931848 12917330 12903395 12889853 12875921 12860949 12845024 12828581 12811677 12793971 12775271 12755727
57290 12755727 12735585 12714959 12693816 12671922 12648850 12624171 12597612 12568964 12538070 12505159 12471056
57279 12471056 12436694 12402384 12367730 12332206 12295532 12257570 12218276 12177923 12137007 12095712 12053738
57268 12053738 12010940 11967832 11925041 11882353 11838781 11793634 11747189 11700164 11652838 11604884 11555881
57257 11555881 11505776 11454983 11404154 11353746 11303603 11253113 11201897 11150247 11098786 11047911 10997761
57246A0997761m9303m8441m7896m7777m7688m7237m6534m5945m5568m5269m4971
57235A0481132m4609m4049m3331m2817m2784m3074m3464m4091m5065m5920m6078
57224I995850m5747m5776m6566m7626m8412m8975m9618n0373n1192n2290n3849
57213I455426n5509n6620n6918n6724n6503n6506n6784n7287n7778n7917n7620
57202H829260n7329n7645n8600n9517n9806n9661n9640n9696n9199n8017n6956
57191H183194n6833n7512n8319n8935n9391n9601n9519n9616o0429o1664o2383
57180G528992o2089o1133o0100n9362n9179n9543n9816n9203n7779n6406n5519
57169F878863n4721n3814n3440n4160n5518n6610n7098n7179n7024n6804n6936
$$ plain form
57246 10997761 10948458 10900017 10852121 10804344 10756656 10709419 10662885 10616940 10571372 10526103 10481132
57235 10481132 10436523 10392474 10349143 10306326 10263542 10220468 10177004 10132913 10087848 10041928 9995850
57224 9995850 9950103 9904327 9857761 9810135 9761723 9712748 9663130 9612757 9561565 9509275 9455426
57213 9455426 9399917 9343297 9286379 9229655 9173152 9116646 9059862 9002575 8944797 8886880 8829260
57202 8829260 8771931 8714286 8655686 8596169 8536363 8476702 8417062 8357366 8298167 8240150 8183194
57191 8183194 8126361 8068849 8010530 7951595 7892204 7832603 7773084 7713468 7653039 7591375 7528992
57180 7528992 7466903 7405770 7345670 7286308 7227129 7167586 7107770 7048567 6990788 6934382 6878863
57169 6878863 6824142 6770328 6716888 6662728 6607210 6550600 6493502 6436323 6379299 6322495 6265559
57158F265559n7684n8728n9524n9852n9706n9063n8143n7460n7111n6472n5126
57147E626690n3569n2375n1095m8915m5975m3129m0532l7559l4101l0925k8494
57136E160021k6400k4326k2806k2471k3138k4176k5283k6458k7575k8429k8956
57125D880003k9102k8700k7809k6736k5402k2988j8568j1999l959M659J3175K1390
57113D723964K9802L9393N0822O3981P8565R4822J13414J34833J59488J88241
57103E677325K22465K63574L12843L71572M40990N21827O14182P17746Q31851
57094I974375R55144J085378J219469J353656J483596J604344J709822J792152
57086B1177936J842078J851206J814741J732947J611315J460014J291272J113392
$$ plain form
57158 6265559 6207875 6149147 6089623 6029771 5970065 5911002 5852859 5795399 5738288 5681816 5626690
57147 5626690 5573121 5520746 5469651 5420736 5374761 5331632 5291100 5253541 5219440 5188515 5160021
57136 5160021 5133621 5109295 5086489 5064018 5040880 5016704 4991421 4964963 4937388 4908959 4880003
57125 4880003 4850901 4822201 4794392 4767656 4742254 4719266 4700698 4688699 4684740 4689399 4702574 4723964
57113 4723964 4753766 4793159 4843981 4907962 4986527 5081349 5194763 5329596 5489084 5677325
57103 5677325 5899790 6163364 6476207 6847779 7288769 7810596 8424778 9142524 9974375
57094 9974375 10929519 12014897 13234366 14588022 16071618 17675962 19385784 21177936
57086 21177936 23020014 24871220 26685961 28418908 30030223 31490237 32781509 33894901
57078C3894901R24946P16178M79318K18951m8362l05323n44635p69420r85148
57069C3581406j192127j383846j549437j677087j757619j787929j772160j719439
57061B0741762j640076j543327j437102j327949j220591j117870j021436r32293
57053A0501118q50797p76792p10069o50484n97409n49469n05064m63157m23464
57044D974413l86235l51972l20979k92876k66690k41629k17592j94812j73337
57035B528291j53059j33957j15916r8453q0910o2969m5134k9330j9006j7410k4373
57024A747774l4969m2786m5297m5550m8371n5448o4433p1954p6482p8422p8534
57013A105528p6914p3296o7827o1351n4967m9372m4623m0354l6173l2003k8277
$$ plain form
57078 33894901 34819847 35536025 36015343 36234294 36185932 35880609 35335974 34566554 33581406
57069 33581406 32389279 31005433 29455996 27778909 26021290 24233361 22461201 20741762
57061 20741762 19101686 17558359 16121257 14793308 13572717 12454847 11433411 10501118
57053 10501118 9650321 8873529 8163460 7512976 6915567 6366098 5861034 5397877 4974413
57044 4974413 4588178 4236206 3915227 3622351 3355661 3114032 2896440 2701628 2528291
57035 2528291 2375232 2241275 2125359 2026906 1945996 1883027 1837893 1808563 1789557 1772147 1747774
57024 1747774 1712805 1670019 1624722 1579172 1530801 1475353 1410920 1338966 1262484 1184062 1105528
57013 1105528 1028614 955318 887491 826140 771173 721801 677178 636824 600651 568648 540371
57002E40371k5653k4236k3157k1293j8433j5384j2906j0985r302p791o413m870
56990C59948l116j746j342j545j423p19j78n14j565k616l157l195l094l338m169
56975C28231n316o242o750p079p330p151o190m555k591n13J532L253M441N319
56961B89059O314P515Q545Q884Q167O321L743J274l78j284k162l538n213o611
56947C20636p409p679p640p413o912n855m011j593P52K617M315O438Q924J0958
56933C06128J1883J1793J1015R410O720L432O03j316k944n012p382r460j1170
56920C23700j2815j4217j4702j4091j3037j2144j1208r824q241p100o496n937
56908A93888n114m259l542k682j408m5P24O29P6l30l60j83M3M65J414L035N087
$$ plain form
57002 540371 514718 490482 467325 446032 427599 412215 399309 388324 379022 371231 364818 359948
56990 359948 356832 355086 353744 352199 350776 350057 349879 349365 347800 345184 342027 338832 335738 332400 328231
56975 328231 322915 316673 309923 302844 295514 288363 282173 277618 275027 274514 276046 279299 283740 289059
56961 289059 295373 302888 311433 320317 328484 334805 338548 339822 339444 338160 335998 332460 327247 320636
56947 320636 313227 305548 297908 290495 283583 277728 273717 272124 272876 275493 279808 286246 295170 306128
56933 306128 318011 329804 340819 350229 356949 360381 360984 359668 356724 351712 344330 334870 323700
56920 323700 310885 296668 281966 267875 254838 242694 231486 221662 213421 206321 199825 193888
56908 193888 188774 184515 180973 178291 176883 176838 177562 178191 178267 177937 177577 177394 177437 177902 179316 182351 187438
56891A87438P070Q552R404R780R873R598Q606O662M080J618j14j108j757k327
56877B57375k793l074l242l323l092k166l99J926M397O863R448J2154J4708J6905
56863C05687J8855K0577K1463K0597J7753J3774R787O273L101K01k215m008n366
56850D26479o496p274p350o572n176l382r46K664P391J2297J6560K0542K5144
56837D73881L0042L3377L3590L0920K6511K0784J3716O215r8m704q753j3328j7993
56824F24160k1590k3740k4805k4848k3493k0731j7128j3159q839m103Q07N549
56812D48080J0002J4243J8224K1411K2642K0725J5642R055L101j380n080q835
56800E67830j2619j6057j9134k1826k3525k3547k2062j9896j7504j4684j1297
$$ plain form
56891 187438 194508 203060 212464 222244 232117 241715 250321 256983 261063 262681 262567 261459 259702 257375
56877 257375 254582 251508 248266 244943 241851 239685 239286 241212 245609 252472 261920 274074 288782 305687
56863 305687 324542 345119 366582 387179 404932 418706 428493 434766 437867 438068 435853 431845 426479
56850 426479 419983 412709 405359 398787 393611 390229 389283 391947 399338 411635 428195 448737 473881
56837 473881 503923 537300 570890 601810 628321 649105 662821 669036 668938 664234 655481 642153 624160
56824 624160 602570 578830 554025 529177 505684 484953 467825 454666 445827 441724 442531 448080
56812 448080 458082 472325 490549 511960 534602 555327 570969 580024 583125 581745 576665 567830
56800 567830 555211 539154 520020 498194 474669 451122 429060 409164 391660 376976 365679
56789C65679p662m033l52L234O147Q034R161R702R074O710L224J01j833l062m489
56774C99635o470q861j1385j3693j5428j6530j7198j7364j6675j5133j3341j1807
56762B35750j0474r201q268p840p440o522n338m588m402m263l897l572l479l398
56748A53068l130k763k374j848j187o27k95j02m0k41n69n74n1O38J097J395J801
56731A44198K191K037J051l68j350j284m34K91K60k47m92j53N29J199J599J463
56715A50490P98J95K93Q71J103P59N35Q88J307J204R26J228K054K528K100J204
56699A68483P16J065J933K640K859K887L145L485L444L035K775K740K362J457
56685B03026P78J004J713K068J995J957J887J298L45j42K46J039J714K260K674
$$ plain form
56789 365679 358017 353984 353632 356866 363013 371047 380208 389910 398984 405694 408918 409019 407186 404124 399635
56774 399635 393165 384304 372919 359226 343798 327268 310070 292706 276031 260898 247557 235750
56762 235750 225276 216075 207807 199967 192527 186005 180667 176079 171677 167414 163517 159945 156466 153068
56748 153068 149938 147175 144801 142953 141766 141139 140844 140742 140702 140461 139892 139318 139267 139905 141002 142397 144198
56731 144198 146389 148426 149477 149109 147759 146475 146041 146332 146592 146345 145853 145700 146229 147428 149027 150490
56715 150490 151288 151483 151776 152647 153750 154509 155044 155932 157239 158443 159369 160597 162651 165179 167279 168483
56699 168483 169199 170264 172197 174837 177696 180583 183728 187213 190657 193692 196467 199207 201569 203026
56685 203026 203804 204808 206521 208589 210584 212541 214428 215726 216071 215929 216175 217214 218928 221188 223862
56670B23862K594J867R84N92P38R18P26K17j99j03M39P22J9j532k960l539l531
56653B21814l629l970m042l436k338j287o84n65p34r93j260j524j729j762j569
56638A92292j230r29q49j019j219j111o27r4J18M6L7K60M94M28M8l57m77k55O9
56619A85625K18J43rj71m20p54j014j100j089j041q39l93J94P85J249J323P76
56602A83483n5l38K41R75J134J090J748L024L764L280K226J708K028K674L082
56587B10064L009K468J699J065O83L46k4m8O38J701K189J426k78j809k113j004
56571B20012P21J977K281K042K033K602L376L677L229K433J861J589J264Q08O25
56556B50530R31J334J382J189J083R42M17l71r71j376k001k908l633l881l851
$$ plain form
56670 223862 226456 228323 229307 229899 230637 231555 232281 232498 232299 232196 232635 233357 233376 231844 228884 225345 221814
56653 221814 218185 214215 210173 206737 204399 203112 202428 201863 201129 200136 198876 197352 195623 193861 192292
56638 192292 191062 190133 189284 188265 187046 185935 185308 185214 185332 185378 185415 185675 186169 186597 186645 186288 185811 185556 185625
56619 185625 185843 185986 185977 185806 185386 184632 183618 182518 181429 180388 179549 179156 179350 180135 181384 182707 183483
56602 183483 183428 183090 183331 184306 185440 186530 188278 191302 195066 198346 200572 202280 204308 206982 210064
56587 210064 213073 215541 217240 218305 218988 219334 219310 219262 219900 221601 223790 225216 224938 223129 221016 220012
56571 220012 220733 222710 224991 227033 229066 231668 235044 238721 241950 244383 246244 247833 249097 249905 250530
56556 250530 251461 252795 254177 255366 256449 257391 257808 257437 256466 255090 253089 250181 246548 242667 238816
56541B38816l768l612l539l919m718n283n124m577m256m185l859k996j881j044
56527A86055p78q93q88m96n6q7n48r05r27r40j130j175q32l74r8J85O53R53O78
56508A78397R2k33l03n92j164j498j248o91k17J29M21M58J2p61j348j304o24L07
56490A69833J002J186R65O86O73J020J563K031K248K273K293K427K630K775K795
56475A96400K789K978L374L509K777J305Q2j04M23Q14Q65R94J194R41J93l57l24
56458B17853j13k5L60J258J955J775J257J404K125K404J920J468J600J746J157
56443B38144Lr32j298j397j541j653j525j205r92j083j276j152o35k23m55j203
56427B21577j696j345l69M47N10o3n98n09J28O91O84K49j11p3K51N58O54N83N45
$$ plain form
56541 238816 235048 231436 227897 223978 219260 213977 208853 204276 200020 195835 191976 188980 187099 186055
56527 186055 185277 184384 183496 183000 182944 182857 182309 181404 180477 179537 178407 177232 176400 176026 175928 176113 176766 177719 178397
56508 178397 178489 178256 177953 177361 176197 174699 173451 172760 172543 172672 173093 173551 173563 172802 171454 170150 169526 169833
56490 169833 170835 172021 172986 173672 174345 175365 176928 178959 181207 183480 185773 188200 190830 193605 196400
56475 196400 199189 202167 205541 209050 211827 213132 213214 213110 213533 214347 215212 216206 217400 218341 218534 218177 217853
56458 217853 217740 217715 218075 219333 221288 223063 224320 225724 227849 230253 232173 233641 235241 236987 238144
56443 238144 238147 237215 235917 234520 232979 231326 229801 228596 227604 226521 225245 224093 223458 223235 222780 221577
56427 221577 219881 218536 218167 218614 219124 219061 218463 217954 218082 218773 219457 219706 219595 219522 219773 220331 220985 221568 222113
56408B22113P05J005J291J541J825K013J852J411J146J377J927K430K684K607
56394B45927K194J740J723K164K446K114J531J313J423J279O60m4m07l80j57L4
56378B63560j5l51p68j023j022o53K46J465K296K224J552R37N54K73L24J090K250
56361B72939K854K413J419O61M70Q01J544K441L058L065K542J854J381J305J524
56346C00271J826K200K781L373L447K976K734L211L724L388K534K197K429K390
56332C39481K008K298L524M468M179L363L147L374L224K860L157M113M706M431
56318C88333L918L838M032M060L914L829L830L864M069M563N147N485N456N190
56304D49528M855M531M244M023L930L980M003L741L146K527K229K299K589L066
$$ plain form
56408 222113 222818 223823 225114 226655 228480 230493 232345 233756 234902 236279 238206 240636 243320 245927
56394 245927 248121 249861 251584 253748 256194 258308 259839 261152 262575 263854 264514 264470 264063 263683 263526 263560
56378 263560 263545 263194 262426 261403 260381 259728 259974 261439 263735 265959 267511 268448 269002 269275 269599 270689 272939
56361 272939 275793 278206 279625 280286 280756 281557 283101 285542 288600 291665 294207 296061 297442 298747 300271
56346 300271 302097 304297 307078 310451 313898 316874 319608 322819 326543 329931 332465 334662 337091 339481
56332 339481 341489 343787 347311 351779 355958 359321 362468 365842 369066 371926 375083 379196 383902 388333
56318 388333 392251 396089 400121 404181 408095 411924 415754 419618 423687 428250 433397 438882 444338 449528
56304 449528 454383 458914 463158 467181 471111 475091 479094 482835 485981 488508 490737 493036 495625 498691
56290D98691L787M706N662O497O994O999O794P168Q559J0344J1492J1943J2685
56277F02321J4352J6371J7849J8803J9948K1680K3869K6461K9552L2921L6157
56266H60284L9360M3142M7689N2363N6627O0753O5143O9432P2888P5460P7629
56255A520770P9361P9943P8963P6744P3543O9014O2886N5617M7861L9708L0932
56244B215342K1704J2557L739m852j3230k1125k8243l4449l9749m4350m8518n2190
56232A966636n4967n6813n8382o0160o1616o1759o0470n8616n6952n5465n3827
56221A327609n1832m9282m6037m2409l9115l6538l4350l2008k9320k6441k3693
56210I16584k1448j9791j8205j6046j3442j1240r902q983p961o993o420n920m874
$$ plain form
56290 498691 502478 507184 512846 519343 526337 533336 540130 547298 555857 566201 577693 589636 602321
56277 602321 616673 633044 650893 669696 689644 711324 735193 761654 791206 824127 860284
56266 860284 899644 942786 990475 1042838 1099465 1160218 1225361 1294793 1367681 1443141 1520770
56255 1520770 1600131 1680074 1759037 1835781 1909324 1978338 2041224 2096841 2144702 2184410 2215342
56244 2215342 2237046 2249603 2253342 2248490 2235260 2214135 2185892 2151443 2111694 2067344 2018826 1966636
56232 1966636 1911669 1854856 1796474 1736314 1674698 1612939 1552469 1493853 1436901 1381436 1327609
56221 1327609 1275777 1226495 1180458 1138049 1098934 1062396 1028046 996038 966718 940277 916584
56210 916584 895136 875345 857140 841094 827652 816412 806510 797527 789566 782573 776153 770233 765359
56197G65359l321j977j252p28J27J180J808J723J369J379J894K601L341M281N431
56182G83215O449P134P799Q715R528R703R353R132R438J0216J1444J3195J5209
56169I10530J6941J8065J8620J8735J8829J9684K1628K3769K4957K5489K6807
56158A144054K9481L2638L5717L9541M5023N1889N9606O8570P9291R0952J01898
56147A778660J11125J18372J23019J24082J21386J16102J10060J04834J00997
56138B808637R7548R2265Q3384P0990N6520M1544K7665J6747R745N216J07p752
56126C302616j8661l2206m7924o4401p9026q9748r6715j01472j05014j07181j07577
56115B452691j06265j03540r9418r3627q5958p6691o6727n7090m8226l9889l1836
$$ plain form
56197 765359 762038 760061 758809 758081 758208 759388 761196 762919 764288 765667 767561 770162 773503 777784 783215
56182 783215 789664 796798 804597 813312 822840 832543 841896 851028 860466 870682 882126 895321 910530
56169 910530 927471 945536 964156 982891 1001720 1021404 1043032 1066801 1091758 1117247 1144054
56158 1144054 1173535 1206173 1241890 1281431 1326454 1378343 1437949 1506519 1585810 1676762 1778660
56147 1778660 1889785 2008157 2131176 2255258 2376644 2492746 2602806 2707640 2808637
56138 2808637 2906185 2998450 3081834 3152824 3209344 3250888 3278553 3295300 3305045 3310261 3310368 3302616
56126 3302616 3283955 3251749 3203825 3139424 3060398 2970650 2873935 2772463 2667449 2560268 2452691
56115 2452691 2346426 2242886 2143468 2049841 1963883 1887192 1820465 1763375 1715149 1675260 1643424
56104A643424k4418j8387j4176j1420r201o811m336k235l80K015N197Q095R431
56091A576798R340R132R590J0236J0399J0149R859R557R241R279R904J0641J0771
56078A704896J0297R965J0372J1367J2398J3157J3731J4280J4796J5300J6164
56067A846723J7856K0209K2271K3226K3249K3130K3315K3810K4750K6279K7969
56056B102787K9124K9790L0743L2228L3513L4038L4251L4728L5193L5134L4881
56045B466410L5249L6371L7629L8579L9167L9198L8444L7398L7206L8569M1143
56034B885363M4161M7086M9635N1732N3821N6607O0140O3554O6103O8031P0060
56023C516293P2395P4771P7127P9583Q1992Q4114Q6277Q9212R3095R7232J00830
$$ plain form
56104 1643424 1619006 1600619 1586443 1575023 1565822 1559011 1554675 1552440 1552060 1554075 1559272 1567367 1576798
56091 1576798 1586138 1595270 1604860 1615096 1625495 1635644 1645503 1655060 1664301 1673580 1683484 1694125 1704896
56078 1704896 1715193 1725158 1735530 1746897 1759295 1772452 1786183 1800463 1815259 1830559 1846723
56067 1846723 1864579 1884788 1907059 1930285 1953534 1976664 1999979 2023789 2048539 2074818 2102787
56056 2102787 2131911 2161701 2192444 2224672 2258185 2292223 2326474 2361202 2396395 2431529 2466410
56045 2466410 2501659 2538030 2575659 2614238 2653405 2692603 2731047 2768445 2805651 2844220 2885363
56034 2885363 2929524 2976610 3026245 3077977 3131798 3188405 3248545 3312099 3378202 3446233 3516293
56023 3516293 3588688 3663459 3740586 3820169 3902161 3986275 4072552 4161764 4254859 4352091 4452921
56012D452921J03770J06550J09839J14129J19372J24890J30006J34895J40327
56003E536699J46558J53041J59474J66341J74141J82665J91693K01751K13470
55994G125833K26542K40070K53727K67931K83216L00091L19209L40895L64657
55985I722171L89861M16689M45768M77352N11762N50234N94010O42809O95682
55976A4446338P53454Q18803Q93658R78205J073228J181924J308391J455776J627241
55967B4537018J828001K065248K347328K684637L090919L582220M174463M882080
55959D9191914N716352O682167P777713R002462J0368186J1900443J3626703J5557195
55951A29823135J7652983J9760605K1524868K2371002K1673531J9101468J4916211
$$ plain form
56012 4452921 4556691 4663241 4773080 4887209 5006581 5131471 5261477 5396372 5536699
56003 5536699 5683257 5836298 5995772 6162113 6336254 6518919 6710612 6912363 7125833
55994 7125833 7352375 7592445 7846172 8114103 8397319 8697410 9016619 9357514 9722171
55985 9722171 10112032 10528721 10974489 11451841 11963603 12513837 13107847 13750656 14446338
55976 14446338 15199792 16018595 16912253 17890458 18963686 20145610 21454001 22909777 24537018
55967 24537018 26365019 28430267 30777595 33462232 36553151 40135371 44309834 49191914
55959 49191914 54908266 61590433 69368146 78370608 88738794 100639237 114265940 129823135
55951 129823135 147476118 167236723 188761591 211132593 232806124 251907592 266823803
55944B66823803R935610N110331J009382k383106n435490q457002j1460294j4213914
55936B40929320j6431912j7911698j8572280j8446373j7662600j6411343j4895131
55929A20597983j3287559j1716146j0261480q962489p827194o847073o007327
55922E5688715n290162m676457m148988l694023l299878k956042k654348k389032
55914B6579785k154719j945685j757623j588576j437253j301557j179333j069376
55906A4145663r70923q82750q03419p31788o66967o08340n55742n08982m67131
55897G949621m29004l94351l63660l36677l12070k88829k67087k47228k28937
55888E081778k11652j95209j79713j65395j53012j43691j37729j33853j30149
$$ plain form
55944 266823803 276759413 281869744 282879126 280496020 275060530 266603528 255143234 240929320
55936 240929320 224497408 206585710 188013430 169567057 151904457 135493114 120597983
55929 120597983 107310424 95594278 85332798 76370309 68543115 61696042 55688715
55922 55688715 50398553 45722096 41573108 37879085 34579207 31623165 28968817 26579785
55914 26579785 24425066 22479381 20721758 19133182 17695929 16394372 15215039 14145663
55906 14145663 13174740 12291990 11488571 10756783 10089816 9481476 8925734 8416752 7949621
55897 7949621 7520617 7126266 6762606 6425929 6113859 5825030 5557943 5310715 5081778
55888 5081778 4870126 4674917 4495204 4329809 4176797 4033106 3895377 3761524 3631375
55879C631375j25610j20504j15587j11278j07509j03998j00647r7528r4455r0847
55869B563412q6336q1322p6560p2304o8274o4354o0772n7547n4378n1191m8440
55858A841934m6599m5620m4962m4005m2491m0699l9145l7993l6882l5478l3892
55847A394168l2337l0838k9528k8740k8357k7520k5633k3204k1041j9096j6866
55836A111008j4541j2706j1203r345p177n469m357l199j897j302j858k868l654
55823A031432m554o152q185j0003j1563j3267j5210j7137j8905k0383k1127k0794
55811H64152j9728j8729j8174j7686j6732j5315j3987j3198j2654j1552r585p475
55799F89337o163n663n194m274l140k175j581j730l100n512p938r424r868r776
$$ plain form
55879 3631375 3505765 3385261 3269674 3158396 3050887 2946889 2846242 2748714 2654259 2563412
55869 2563412 2477076 2395754 2319194 2246890 2178616 2114262 2053490 1995943 1941565 1890374 1841934
55858 1841934 1795335 1749715 1704753 1660748 1618257 1577558 1538413 1500420 1463538 1428060 1394168
55847 1394168 1361831 1330993 1301465 1272725 1244368 1216848 1191215 1168011 1146970 1127874 1111008
55836 1111008 1096467 1083761 1072558 1063213 1056036 1050567 1046210 1043011 1041114 1039812 1037954 1035086 1031432
55823 1031432 1026878 1020726 1012541 1002538 990975 977708 962498 945361 926456 906073 884946 864152
55811 864152 844424 825695 807521 789835 773103 757788 743801 730603 717949 706397 696812 689337
55799 689337 683174 677511 672317 668043 664903 662728 661147 659417 656317 650805 642867 633443 623575 613799
55785F13799r588r483r476r448r301r120q915q330p110n677m677l964k801j121
55771E14788K13O56O22N05p1j508l388n092o624q274r890j1158j2138j2942j3270
55756D32429j2909j2348j2232j2394j2102j1054r570q052o766o033n946n993n522
55743C11508m551l664l163k866k640k592k685k675k575k748l317l851l798l112
55729B67271k313j998k278k646k509j940j671k186l097l614l413k700j724p02
55715B34480m4j18p07j048n60O25J869K612K792K819L061L362L260K698K185K022
55699B59308J904J591J499K058K837L009K450J772J350J124J312K438M346N919
55685B92917O280N786N387N335N093M268L155K285J802J405O73n66k103l474m387
$$ plain form
55785 613799 604211 594728 585252 575804 566503 557383 548468 540138 533028 527351 522674 518710 515909 514788
55771 514788 515001 515657 516279 516784 516713 515205 511817 506725 500101 491827 481937 470779 458641 445699 432429
55756 432429 419520 407172 394940 382546 370444 359390 349820 341768 335002 328969 323023 317030 311508
55743 311508 306957 303293 300130 297264 294624 292032 289347 286672 284097 281349 278032 274181 270383 267271
55729 267271 264958 262960 260682 258036 255527 253587 251916 249730 246633 243019 239606 236906 235182 234480
55715 234480 234436 234318 233611 232563 232003 232628 234497 237109 239901 242720 245781 249143 252403 255101 257286 259308
55699 259308 261212 262803 264302 266360 269197 272206 274656 276428 277778 278902 280214 282652 286998 292917
55685 292917 299197 304983 310370 315705 320798 325066 328221 330506 332308 333713 334386 333820 331717 328243 323856
55670C23856n032n900p139q223q406p529o192n070m245l447k683k212k005j690
55656B54083j101l49P24K578N132P397Q490Q618Q492Q235P514O541N960N701M821
55641C32836K826M85j113j817k277k887l448l690l637l470l274l052k738k262
55627C02482j738j506j826k519l144l575m169n248o547p419p643p777q549r946
55613B30876j1150j1437j0916j0217r649q959p861o511n300m383l640l067k959
55600A34827l509m336m666m195l446l062k903k329j288o02r13j835k467k413j906
55585I4957j260o50k58j48n6K69N91M97J36J52P43J296J221P31M86P10J057J226
55567A01700J326J549J738J553R04Q4n58q93q71l18P78J883K251J792J241J220
$$ plain form
55670 323856 318824 312924 305785 297562 289156 281627 275435 270365 266120 262673 259990 257778 255773 254083
55656 254083 252982 252633 253357 255935 261067 268464 276954 285572 294064 302299 309813 316354 322314 328015 332836
55641 332836 335662 336147 335034 333217 330940 328053 324605 320915 317278 313808 310534 307482 304744 302482
55627 302482 300744 299238 297412 294893 291749 288174 284005 278757 272210 264791 257148 249371 240822 230876
55613 230876 219726 208289 197373 187156 177507 168548 160687 154176 148876 144493 140853 137786 134827
55600 134827 131318 126982 122316 118121 114675 111613 108710 106381 105093 104491 103578 101743 99276 96863 94957
55585 94957 93697 93047 92789 92641 92585 92854 93445 93942 94078 94230 94973 96269 97490 98221 98707 99417 100474 101700
55567 101700 103026 104575 106313 107866 108770 108854 108296 107403 106532 106214 106992 108875 111126 112918 114159 115379
55551A15379J447J213M06l64n92m34l79o78j171j517j570j568j837k264k285j702
55535A02084j132j278j942k290j983j488j246j102p71l66j11J14N65J154J524
55520I1732J489J224J105J421K180L044L576L661L612L826M427N296O254P130
55506A39977P694P701P066N992M880M015L258K210P45q47k298l662m928n765o049
55491A59989o309p054p843p745o750n913n921o274o213n789n458n163m488l463
55477G5606k642k380k544k820k931k642j963j343j291j779k259k294j928j518
55463D5272j393j610j774j297j28R15R57J27o43p96o25n36m55j95P9J70K06L00
55445C8574K05k18n19k27K85J58p42j539j482p62pN09Q25Q44M98L6k06k40k63
$$ plain form
55551 115379 116826 118039 118445 118081 117489 117055 116676 115998 114827 113310 111740 110172 108335 106071 103786 102084
55535 102084 100952 99674 97732 95442 93459 91971 90725 89623 88852 88486 88375 88489 89054 90208 91732
55520 91732 93221 94445 95550 96971 99151 102195 105771 109432 113044 116870 121297 126593 132847 139977
55506 139977 147671 155372 162438 168430 173310 177325 180583 182793 183538 182691 180393 176731 171803 166038 159989
55491 159989 153680 146626 138783 131038 124288 118375 112454 106180 99967 94178 88720 83557 79069 75606
55477 75606 72964 70584 68040 65220 62289 59647 57684 56341 55050 53271 51012 48718 46790 45272
55463 45272 43879 42269 40495 39198 39070 39985 40942 41069 40426 39630 39005 38469 38014 37819 37898 38068 38274 38574
55445 38574 38779 38561 38042 37815 38100 38258 37516 35977 34495 33733 33726 34235 35060 35904 36402 36438 36232 35992 35729
55426C5729k41ML87O17N01Lq03j509j433m48N49N82j38n73l96k40m25m25J13O96
55406C2550Q46Q59J075J146O74J6l27n87j226j936j997j347n36J85R10J418J276
55389C2999N44k71q99j315j286o66J7N3m16o65n08l44k06J41L27k86j240j258
55371B4721j88N31n5j076j265o74j33J40L94N37L89K98O19J019J069J034J283
55354B8643J438R83K65p2j93o36j100p94J28O39L57l8qJ27l1l86p83j299j771
55335B5469j734j145n69l55k33P4M03O30R03J172J049N33K13L25J95p66k003k425
55317B1736j760o88J57O55P90M42j90n05j68M11N45J01l51k24M41J077J244R83
55299B4696N80K46Q6J57K94J30m12q53p17k14R7J75N27J275J817J607P93j04p73
$$ plain form
55426 35729 35488 35492 35879 36496 36997 37000 36197 34688 33255 32807 33356 33938 33800 33227 32831 32591 32166 31741 31854 32550
55406 32550 33396 34255 35330 36476 37150 37166 36839 36252 35026 33090 31093 29746 29210 29395 30305 31723 32999
55389 32999 33543 33272 32373 31058 29772 29106 29123 29176 28760 28095 27587 27243 27037 27178 27505 27219 25979 24721
55371 24721 24533 25064 25009 23933 22668 21994 21861 22001 22395 22932 23321 23619 24238 25257 26326 27360 28643
55354 28643 30081 31064 31329 31257 31064 30428 29328 28534 28662 29301 29658 29620 29612 29739 29708 29322 28539 27240 25469
55335 25469 23735 22590 22021 21666 21433 21507 21910 22540 23443 24615 25664 26197 26410 26735 26930 26164 24161 21736
55317 21736 19976 19288 19445 20100 20890 21332 21142 20637 20469 20880 21425 21526 21175 20951 21392 22469 23713 24696
55299 24696 25276 25522 25608 25765 26059 26189 25777 24924 24207 23993 24090 24265 24792 26067 27884 29491 30284 30180 29407
55280B9407j129j206j237j471j656j188q8P44P03L75N84J067R27J92j36L33P73
55263B6994N00O2K24N70L3j374k318j819m76L22l5r25j366r22M2P36O38j5m55
55244B0416l31q6j87l30P9Q43J071M89j28q0L12L85J89K04M09L86J75K40O10P58
55224B5424M73J35l1l08q18j107q85n47m94m01J48O83L80n77j015l71M99M91k70
55205B1409p18k91N04Q89P35M34K85K41J69N8p3k54m93o67o38m00j46p4j60j36
55185B0674K46Q54J190Q90J47n31q84r92q75m12K46N67L19j1K12Q83J333J227
55167B5083Q25M15p9p25j230j199n72L07R21R17M48J30L21N57J16q80j488j210
55149B2657o23m41n23l13J93N22N29M97M70J77l39n33p5O07Q34M78K0j36q3j37
$$ plain form
55280 29407 28278 27072 25835 24364 22708 21520 21432 22176 22879 23254 23838 24905 25832 26024 25888 26221 26994
55263 26994 27494 27556 27780 28350 28383 27009 24691 22872 22396 22718 22683 21758 20392 19470 19512 20248 20886 20871 20416
55244 20416 20085 19999 19812 19482 19561 20404 21475 21964 21836 21756 22068 22453 22642 22846 23255 23641 23816 24056 24666 25424
55224 25424 25897 26032 26001 25693 24875 23768 22883 22336 21842 21441 21589 22272 22652 22075 21060 20689 21188 21679 21409
55205 21409 20691 20400 20904 21793 22528 22962 23247 23488 23657 23715 23642 23388 22895 22228 21590 21190 21044 20970 20810 20674
55185 20674 20920 21774 22964 23854 24001 23470 22586 21594 20719 20307 20553 21120 21439 21428 21640 22523 23856 25083
55167 25083 25908 26323 26244 25519 24289 23090 22518 22825 23746 24663 25111 25241 25562 26119 26235 25355 23867 22657
55149 22657 22034 21593 21070 20757 20950 21472 22001 22498 22968 23145 22806 22273 22198 22805 23639 24117 24137 24001 23918 23781
55129B3781l48m16p8N75J201J517J449J119Q31R27J431J881J876J588J422J253
55113D0009N51n96j294r98l25j63m61n10j29J66Q9k9J18L34K85p2n14p41m56L43
55093C5607J116J175M45m61r65j007p75l82J01N55R63J319J385Q99P9n23p17q07
55075C8007q96o82j63N4l79r09q13k13K15J99n1m62j066j462j006K79J480J718
55057C3850R44k02j001j062n02J35M54O25R74J308J122M35j17j65K1J80M64R22
55039C8385J103O68k9m05l36rN55J310J809J561O71l08j013j370j286q28m83o38
55021C9357q47k86J020K059K061J212J06q78j340q28M27J335J128L29J7M31R57
55004D6260J180J216J098O44k3m83o52q40j047q06m9N60N13K18L12O34N22r8o13
$$ plain form
55129 23781 23433 23017 22939 23514 24715 26232 27681 28800 29631 30558 31989 33870 35746 37334 38756 40009
55113 40009 40560 39964 38670 37672 37347 37184 36723 36213 36084 36250 36339 36310 36428 36762 37047 36975 36461 35720 35264 35607
55093 35607 36723 37898 38343 37882 36917 35910 35135 34753 34854 35409 36372 37691 39076 39975 40054 39531 38814 38007
55075 38007 37111 36429 36266 36320 35941 35032 34219 34006 34221 34420 34369 33907 32841 31379 30373 30652 32132 33850
55057 33850 34794 34592 33591 32529 32027 32162 32616 33241 34215 35523 36645 37080 36963 36798 36819 36999 37463 38385
55039 38385 39488 40156 40127 39722 39386 39377 39932 41242 43051 44612 45283 44975 43962 42592 41306 40478 39995 39357
55021 39357 38510 38224 39244 41303 43364 44576 44682 43804 42464 41636 42063 43398 44526 44855 44872 45303 46260
55004 46260 47440 48656 49754 50398 50375 49892 49240 48400 47353 46547 46498 47058 47571 47789 48101 48735 49257 49159 48546
54985D8546o37m30k87j37L6m4l92m17K93J188J323O14n7n2L11M41L17L08M85O19
54965E2028O04N23M57N12R26J709K353K346J957K022K901M146N192N929O431O643
54949I6679O652O830P364P932Q065P546O301M303J885k91j953l460n016o129o386
54934A30322o287o545o918o612n677m981m794m333l156k057k027k784l078k217
54920F8856p78J79K59J9K81J179J931J739Q30L48J214L303N724P487Q004P394
54904A07969O419N793N471M914L988K984J829J24j884l206l472l607m507n722
54890A17093o257o141o241o799p058o391n061l746k898k665k865k944k409j438
54876E4180o93n09o20o83n82k90J60M48K49k26l80m8K88K01k38p63j248j512j311
$$ plain form
54985 48546 47909 47479 47192 47055 47091 47047 46655 46238 46531 47719 49042 49656 49599 49547 49858 50299 50616 50924 51409 52028
54965 52028 52632 53155 53612 54124 55050 56759 59112 61458 63415 65437 68338 72484 77676 83605 90036 96679
54949 96679 103331 110161 117525 125457 133522 141068 147369 151672 153557 153266 151313 147853 142837 136708 130322
54934 130322 124035 117490 110572 103960 98283 93302 88508 84175 81019 78962 76935 74151 71073 68856
54920 68856 68078 68257 68516 68535 68816 69995 71926 73665 74495 74843 76057 79360 85084 92571 100575 107969
54904 107969 114388 120181 125652 130566 134554 137538 139367 139491 137607 134401 130929 127322 122815 117093
54890 117093 110836 104695 98454 91655 84597 78206 73145 69399 66501 63836 60971 58027 55618 54180
54876 54180 53487 52978 52358 51675 51093 50803 50963 51411 51660 51434 51054 51006 51294 51495 51257 50494 49246 47734 46423
54857D6423p52l26k56k14JLn82j355j576j140p09q38j403j927k084j757r45J02
54839C0665Q47Q57L29qK95Q92J153J052J100J363J209L83k95M6R09R88M2p22m03
54820D0702L88O07L08L28Q60J234R90M67J85J96K77L88O80J231J968K731L340
54803E6880L627L541L235L073L426M320N322N956O260O689P440Q100Q124P400
54789A33393O239N037M102L509K914J781K0j788l027l635l850l735l311k819k413
54774A32417j885j138n40k60M26K259M600N794N114L523K303J739J520J572J848
54759A59292J896J416Q67P66P96L33l55l25O31J632J868J409O74k35j261k085
54743A67319k511k817l355m087m870n775o760p412p438p197p171p224o903o239
$$ plain form
54857 46423 45671 45345 45089 44875 44876 44879 44297 42942 41366 40226 39517 38679 37276 35349 33265 31508 30563 30665
54839 30665 31512 32369 32698 32690 32985 33877 35030 36082 37182 38545 39754 40137 39842 39888 40797 41785 41827 41105 40702
54820 40702 41090 41697 42005 42333 43193 44427 45417 45884 46069 46265 46542 46930 47610 48841 50809 53540 56880
54803 56880 60507 64048 67283 70356 73782 78102 83424 89380 95640 102329 109769 117869 125993 133393
54789 133393 139632 144669 148771 152280 155194 156975 156995 155207 152180 148545 144695 140960 137649 134830 132417
54774 132417 130532 129394 128854 128594 129020 131279 135879 141673 146787 150310 152613 154352 155872 157444 159292
54759 159292 161188 162604 163471 164237 165033 165366 165011 164686 165317 166949 168817 170226 170900 170665 169404 167319
54743 167319 164808 161991 158636 154549 149679 143904 137144 129732 122294 115097 107926 100702 93799 87560
54729H7560n598m955l960k779k019j724j271n58m47j468k774l127k415j448o16
54714E2401K67R78Q39j41r32p22R5O07N52L08J34q7m25o63m99J78J107J734J680
54695E7411J203R42J018R02L14k21j96m1m64j251j433o88K82R11J497K384L094
54678F5664K960K243J901K277K700K461J705J077Q81R50J148J577K272L019L608
54663I6443M168N016O202P363Q058Q252Q451R256J0703J2027J2213J0915Q721
54650B07788O495M593K871J177m79k191m098o029p517q382q973r657j0282j0400
54636A54916r812q652p162n690m743m568m768m638l961l160k653k387k111j784
54622H8827j542j400j275j103q66n97m47o49j238j893k159j912j493j369j683
$$ plain form
54729 87560 81962 77007 73047 70268 68249 66525 65254 64696 64249 62781 60007 56880 54465 53017 52401
54714 52401 52668 53646 54485 54344 53412 52690 52785 53392 53944 54252 54386 54299 53874 53211 52712 52890 53997 55731 57411
54695 57411 58614 59556 60574 61476 61790 61569 61373 61332 60868 59617 58184 57496 57778 58689 60186 62570 65664
54678 65664 68624 70867 72768 75045 77745 80206 81911 82988 83869 84819 85967 87544 89816 92835 96443
54663 96443 100611 105627 111829 119192 127250 135502 143953 153209 163912 175939 188152 199067 207788
54650 207788 214283 218876 221747 222924 222445 220254 216156 210127 202610 194228 185255 175598 165316 154916
54636 154916 145104 136452 129290 123600 118857 114289 109521 104883 100922 97762 95109 92722 90611 88827
54622 88827 87285 85885 84610 83507 82641 82044 81597 80948 79710 77817 75658 73746 72253 70884 69201
54607F9201k099k178j858j472j304j255j051o48j97K14N31N69J89l61n96m38l37
54590E6910o46j102j173p45j77J99L78M65M50K98J17P0J60K69M04P39J249J508
54572E9373J126L84N2M34R53R03L73K1J73N91R75J228J258J017Q28J146J909K527
54554G5271K659K589K696K950L196L462L734L823L781M015M694N378N581N368
54540A29197M963M236L084J910J112L74q71k415l454l704l684l911m433n155n975
54525A11274o492o238n339m449l870l346k750k300j971j433q50q86j543j816j103
54510F6888j64Pm01n67l90l38l41Q3P96J161J118J209J472J317N84j54n32p78
54492G0970q97m58M03P57K19l05Q1R64J405J346J334J336Q71N2m79o09p96j146
$$ plain form
54607 69201 67102 64924 63066 61594 60290 59035 57984 57336 57139 57353 57884 58453 58642 58281 57685 57247 56910
54590 56910 56264 55162 53989 53244 53067 53266 53644 54109 54559 54857 54974 55044 55204 55473 55877 56616 57865 59373
54572 59373 60499 60883 60935 61369 62322 63225 63598 63619 63792 64383 65358 66586 67844 68861 69689 70835 72744 75271
54554 75271 77930 80519 83215 86165 89361 92823 96557 100380 104161 108176 112870 118248 123829 129197
54540 129197 134160 138396 141480 143390 144502 144876 144005 141590 138136 134432 130748 126837 122404 117249 111274
54525 111274 104782 98544 93205 88756 84886 81540 78790 76490 74519 73086 72236 71350 69807 67991 66888
54510 66888 66724 66731 66330 65763 65373 65035 64694 64777 65573 66734 67852 69061 70533 71850 72434 72280 71748 70970
54492 70970 70073 69615 70018 70775 70994 70689 70770 71734 73139 74485 75819 77155 78026 78078 77599 76990 76194 75048
54474G5048j238r77p26m93J70J169J638J074O3n75p68q46q14o03n48r69j455j273
54456F7877l60N68Q83O02J37r9J27P02J157J063M78k25q31j283j463j310j088
54439F6935j093j171r16k81M13J017J557J747J139l2p87n63M5J74j22r5N20J172
54421F9659J306R77N54K41O1RL3k1k04l06n0N47J111J302J151R27P06L62M5K65
54401G8675J100J642R06o95j594r85J80N97L02K38O49Q72N78J81o1m43j057j442
54383G9643j383j361j686j796j075O6O20K74l71o94n96k04L17O51N03R6KL40N64
54364G3910K18m24p61n79j85Qj87o32r30p30j37K85J08m86q69o22J25Q79J190
54345G0181R49M03o1j73R6N16P02M01j79m92l28j24l83r26j207j188j350j789
$$ plain form
54474 75048 73810 72833 72107 71614 71784 72953 74591 75665 75728 75153 74385 73539 72725 72122 71574 70605 69150 67877
54456 67877 67517 68085 68968 69570 69707 69608 69735 70437 71594 72657 73135 72910 72079 70796 69333 68023 66935
54439 66935 65842 64671 63755 63474 63887 64904 66461 68208 69347 69315 68528 67965 68010 68184 68062 67967 68487 69659
54421 69659 70965 71942 72496 72737 72798 72807 72840 72819 72615 72309 72259 72806 73917 75219 76370 77297 78003 78365 78410 78675
54401 78675 79775 81417 82323 81628 80034 79049 79229 79826 80128 80366 81015 81887 82465 82646 82585 82142 81085 79643
54383 79643 78260 76899 75213 73417 72342 72408 73028 73302 72931 72237 71641 71437 71754 72405 72908 73004 73006 73346 73910
54364 73910 74128 73704 72943 72364 72179 72187 72000 71368 70438 69708 69571 69856 69964 69478 68609 67987 68112 68991 70181
54345 70181 71130 71533 71472 71299 71395 71911 72613 73014 72835 72343 72015 71891 71508 70582 69375 68187 66837 65048
54327F5048j950j453o24Q2P04J324J524Q88k42j080j320j216r62o06m27p38j245
54310E7707j269o92j59j02k17j33m4j99l26o6L05J94l96q12n89N4N90P31N00J15
54290E5192j50j10J62M57O73Q35Q82O78K37k28n24o48o07k88L84J194J695J536
54272F1370P70j79p89p97l45J65M44N75Q88J509K097K164J668J003M25k25r65
54255F9778j270p19J80M20k26r84j219j116r44l55R28K216K438J503L47l03n64
54238G0110p72q76p19m00n0L64P59P69K47l16l06J79L87j90j205j828j593p96
54220F3764j18K3k50n72p53q20p35l38L62J041J307J044M29k38o63o62k83J31
54202F2669K14k9j89O3M57L42m47j152q56L22J235J015Rq27j101j134j219j257
$$ plain form
54327 65048 63098 61645 61021 61103 61807 63131 64655 65543 65301 64221 62901 61685 60723 60117 59690 58952 57707
54310 57707 56438 55746 55587 55485 55268 55135 55091 54892 54566 54500 54805 54999 54603 53791 53202 53256 53846 54577 55077 55192
54290 55192 55042 54932 55094 55551 56224 57059 57941 58619 58856 58628 58104 57456 56849 56561 56945 58139 59834 61370
54272 61370 62140 61961 61172 60375 60030 60195 60639 61214 62102 63611 65708 67872 69540 70543 70968 70743 69778
54255 69778 68508 67789 67969 68389 68163 67179 65960 64844 63900 63545 64473 66689 69127 70630 70977 70674 70110
54238 70110 69338 68462 67743 67343 67293 67657 68416 69185 69432 69116 68810 68989 69376 69186 67981 66153 64560 63764
54220 63764 63646 63669 63419 62847 62094 61274 60539 60201 60563 61604 62911 63955 64384 64146 63483 62821 62538 62669
54202 62669 62883 62854 62665 62728 63185 63527 63080 61928 61072 61394 62629 63644 63653 62826 61725 60591 59372 58115
54184E8115j054o51k37l6j91n34n79j30K95O9o47j134j186j255j458j195j26J063
54166D9129J405P98k7m51m37k70k22m13p22q86q55q69j052j148q22m8Q89J522
54148D5521J340K91p69p76J75P96L61k39Q2Q99R50M3q17j009q47n62R0R04J026
54129D7459K45m28j86L71J89n94r05l26M20N92L19J94M64Q50R16M82k54r02j197
54110D7709j094o03K23J035J305Q93K97N7K19N45R96J507J649J058J74q6N14J216
54092E7614J234O70J67M6J23J72J84J92K01K97O14J034J170P76J46j68J2K82J72
54073F4938k67n40k67M23J025J091O13J10J98Q65J334R60J16k18K49P91P50L95
54055G2566L47O08O83M34K20L02N73Q65J137J319J383J541K047K707L027K882
$$ plain form
54184 58115 57061 56410 56173 56137 55946 55412 54833 54703 54998 55067 54420 53286 52100 50845 49387 48192 48066 49129
54166 49129 50534 51332 51305 50854 50417 50147 49925 49512 48790 47904 47049 46180 45128 43980 43158 43110 43999 45521
54148 45521 46861 47152 46383 45607 45782 46578 46939 46700 46782 47681 48631 48674 47857 46848 46001 45439 45529 46433 47459
54129 47459 47704 47276 47090 47461 47650 47056 46151 45825 46245 46837 47156 47350 47814 48664 49580 50062 49808 48906 47709
54110 47709 46615 46012 46235 47270 48575 49468 49765 49822 50041 50586 51582 53089 54738 55796 55970 55884 56398 57614
54092 57614 58848 59518 59685 59731 59854 60026 60210 60402 60603 60900 61514 62548 63718 64494 64640 64472 64484 64766 64938
54073 64938 64671 64131 63864 64287 65312 66403 67016 67126 67324 68189 69523 70483 70599 70381 70630 71421 72171 72566
54055 72566 72913 73521 74204 74638 74858 75160 75733 76598 77735 79054 80437 81978 84025 86732 89759 92641
54039I2641K676K680K646K310J973K158K834L400L392K946K485K180J875J469
54025A27665J100R27Q36N66J47j2L91J133J668J636J023k4j208k073k296k051
54009A29428j798j732j744j877k411l297l907l699k901k311k404k868k998k443
53995I3038j588j118j201j298r42m62m54p43n93K8K13m78j167r03j15J9o67j199
53977H0370r64m36j83n1L06P34Q98Q17O69M52J80R0K88M78M13L71P11J221J307
53958H7671P86N3m50n94l85J71R60J706K132K160J948J838K107K636K984K936
53942A08659K752K730K790K823L122M042N372O440O758O197M763K804J231Q91
53928A61374J587K237K184J717J306R85Q05J105J860K342K046J535J724K612L411
$$ plain form
54039 92641 95317 97997 100643 102953 104926 107084 109918 113318 116710 119656 122141 124321 126196 127665
54025 127665 128765 129692 130528 131094 131241 131229 131620 132753 134421 136057 137080 137056 135848 133775 131479 129428
54009 129428 127630 125898 124154 122277 119866 116569 112662 108963 106062 103751 101347 98479 95481 93038
53995 93038 91450 90332 89131 87833 86891 86429 85975 85232 84639 84667 84880 84402 83235 82332 82217 82236 81569 80370
53977 80370 79406 78970 78787 78736 79042 79776 80674 81491 82160 82612 82792 82882 83170 83648 84061 84432 85143 86364 87671
53958 87671 88457 88510 88060 87466 87081 87252 88212 89918 92050 94210 96158 97996 100103 102739 105723 108659
53942 108659 111411 114141 116931 119754 122876 126918 132290 138730 145488 151685 156448 159252 160483 161374
53928 161374 162961 165198 167382 169099 170405 171390 172195 173300 175160 177502 179548 181083 182807 185419 188830
53913A88830L688L708L715L533K984K265J699J434J356J121M42m26p00j01L99
53898B13947m26k467m321m953m627m100l700l532l737m151m292m147m366n117
53884A60011n451m623l423l166l715l707k724j914k119k526k015r48o08j313k161
53869A19598k542k841l406l742l315k494k033k000j874j554j527j976k389k319
53855H5586j958j643j283p56m01n53q54o63j9M70O32R05J396J585J218P88P17
53838H5167O69K10m01o56o26o36n03J45R71J245R68Q70J161J122K91o92r54n50
53820H7801j96j99k19O0N94J221J836K232K203J820J432J290J404J671K020K309
53804A07279K405K380K514K907L287L333L119L000L130L175K736J840Q61j4q83
$$ plain form
53913 188830 192518 196226 199941 203474 206458 208723 210422 211856 213212 214333 214775 214349 213649 213548 213947
53898 213947 213521 211054 206733 201780 197153 193053 189353 185821 182084 177933 173641 169494 165128 160011
53884 160011 154560 149937 146514 143348 139633 135926 133202 131288 129169 126643 124628 123680 123072 121759 119598
53869 119598 117056 114215 110809 107067 103752 101258 99225 97225 95351 93797 92270 90294 87905 85586
53855 85586 83628 81985 80702 79946 79545 78992 78138 77475 77456 77926 78558 79463 80859 82444 83662 84450 85167
53838 85167 85836 86046 85645 84989 84363 83727 83224 83369 84340 85585 86553 87423 88584 89706 89997 89305 88351 87801
53820 87801 87605 87406 87187 87247 87841 89062 90898 93130 95333 97153 98585 99875 101279 102950 104970 107279
53804 107279 109684 112064 114578 117485 120772 124105 127224 130224 133354 136529 139265 141105 141966 141952 141069
53789A41069j637j696o59R09J842J578P39K25R9l21j385k574l116k882k373k000
53773A27818j699j308j015j200j879k654l136l216k927k356j793j619j860k103
53759I9053k045j867j779j570j016m43l28n19m64j58k20r07j613j646j068m95
53743H2915l52n57p15m82L7K65j53o92n36K37P12N43M06P10P64jp98m60P47J417
53723H4007R11n2p11j051j128o58K15O12J02m52MJ174J786J304M65Q7R4J5r6J83
53703H6811Q42J308J224R52J072J634K166K314K156J859J475J177J342J998K504
53688A10834K182J218N26O23J022R21K11l65q2R17J712J590Q46L64N05P76P35
53671A24535O78R79J227P23l29q66l39O19J117J075J005J122J127P31M9n00n90
$$ plain form
53789 141069 139432 137736 137077 137986 139828 141406 142145 142370 142469 142148 140763 138189 135073 132191 129818 127818
53773 127818 126119 124811 123796 122596 120717 118063 114927 111711 108784 106428 104635 103016 101156 99053
53759 99053 97008 95141 93362 91792 90776 90333 90005 89486 89022 88864 88644 87737 86124 84478 83410 82915
53743 82915 82563 82006 81291 80809 80846 81111 80958 80266 79730 79967 80679 81222 81628 82338 83102 83101 82303 81843 82590 84007
53723 84007 84918 84866 84155 83104 81976 81318 81533 82145 82247 81795 81799 82973 84759 86063 86528 86615 86709 86724 86628 86811
53703 86811 87653 88961 90185 91137 92209 93843 96009 98323 100479 102338 103813 104990 106332 108330 110834
53688 110834 113016 114234 114760 115383 116405 117326 117537 117172 117090 118007 119719 121309 122155 122519 123024 123800 124535
53671 124535 125213 126192 127419 128142 127813 126947 126608 127227 128344 129419 130424 131546 132673 133404 133453 132953 132363
53654A32363l19j25k55m05j40M35P92P07M11Q7l16o42m74K63J053J432J437J180
53636A37484N56l43r45q84n68o20j005j152p11K74J559K616K676J521R4l32M13
53619A40633J317J537J192Q02N37L32K55M34Q30J331J904K435K592K075J027J06
53603A59339O4J090K489L250L029K363J792J250O37M91J318K565L059K496J747
53588A86979J540J669J730J832K082K005J168Qo20m93j10J17K00J65n8l40l51
53571A97523l9K46J98j11n11j005j532j692j040L03J568K015J641J053P09N34
53555A99860L54L84Q67J445J384N68j95j58L78M89j86r87j061k46Q88J670J865
53538B07319J670J402J267J307J469J626J683J722J942K299K375J895J277J235
$$ plain form
53654 132363 132044 131919 131664 131259 131119 131554 132346 133053 133464 133551 133235 132593 132119 132382 133435 134867 136304 137484
53636 137484 138040 137697 136752 135868 135300 134680 133675 132523 131812 132086 133645 136261 138937 140458 140552 140220 140633
53619 140633 141950 143487 144679 145481 146018 146350 146605 147039 147869 149200 151104 153539 156131 158206 159233 159339
53603 159339 159403 160493 162982 166232 169261 171624 173416 174666 175303 175794 177112 179677 182736 185232 186979
53588 186979 188519 190188 191918 193750 195832 197837 199005 199013 198393 197900 197790 197907 198107 198272 198214 197874 197523
53571 197523 197484 197730 197928 197817 197306 196301 194769 193077 192037 192340 193908 195923 197564 198617 199326 199860
53555 199860 200214 200598 201465 202910 204294 204862 204667 204509 204887 205376 205190 204203 203142 202896 203784 205454 207319
53538 207319 208989 210391 211658 212965 214434 216060 217743 219465 221407 223706 226081 227976 229253 230488
53524B30488J911K717L136L272L410L539L591L790M357N112N654N856N857N826
53510B88516O026O755P904Q769Q848Q631R071J0332J1572J2028J1843J1646J1798
53497D13739J2253J2838J3421J3919J4336J4740J5160J5625J6194J6749J6852
53486E75826J6167J5023J4209J4120J4488J4956J5513J6153J6475J6087J5216
53475G44233J4541J4440J4532J4076J2782J1290J0702J1412J2521J2682J1561
53464H84772J0116R359R274R131Q426P237N909M752L813K765J222o28k021k561
53450I51566k821l601m884o032o795p508q330q959r219r405r810j0329j0727j0988
53436H42158j1141j1112j0968j1006j1338j1625j1549j1272j1079j0705r548p583
$$ plain form
53524 230488 232399 235116 238252 241524 244934 248473 252064 255854 260211 265323 270977 276833 282690 288516
53510 288516 294542 301297 309201 317970 326818 335449 344520 354852 366424 378452 390295 401941 413739
53497 413739 425992 438830 452251 466170 480506 495246 510406 526031 542225 558974 575826
53486 575826 591993 607016 621225 635345 649833 664789 680302 696455 712930 729017 744233
53475 744233 758774 773214 787746 801822 814604 825894 836596 848008 860529 873211 884772
53464 884772 894888 904247 913521 922652 931078 938315 944224 948976 952789 955554 956776 956148 954127 951566
53450 951566 948745 945144 940260 934228 927433 919925 911595 902636 893417 884012 874202 863873 853146 842158
53436 842158 831017 819905 808937 797931 786593 774968 763419 752147 741068 730363 720815 713232
53424G13232n641m578m400m405m022l275k468j731r83k05M98J076J622K224K884
53409F89828L642M632N852P054P976Q673R444J0491J1806J3220J4404J4935J4776
53396H16733J4598J5241J6747J8323J9368K0197K1441K3125K4674K5641K6100
53385A042188K6427K6981K7946K9192L0312L1032L1522L2120L2857L3469L3749
53374A377795L3636L3040L1975L0785K9914K9372K8726K7634K6135K4410K2579
53363A696001K0814J9297J7909J6251J4058J1402Q439N299K299k55k686n846j0036
53350A792946j4357j7637j9737k1456k3383k5403k7216k8693k9642k9794k9288
53339A526340k8746k8602k8667k8548k8202k7840k7527k7205k6903k6613k6111
$$ plain form
53424 713232 707591 703013 698613 694208 690186 686911 684443 682712 681729 681524 682022 683098 684720 686944 689828
53409 689828 693470 698102 703954 711008 718984 727657 737101 747592 759398 772618 787022 801957 816733
53396 816733 831331 846572 863319 881642 901010 921207 942648 965773 990447 1016088 1042188
53385 1042188 1068615 1095596 1123542 1152734 1183046 1214078 1245600 1277720 1310577 1344046 1377795
53374 1377795 1411431 1444471 1476446 1507231 1537145 1566517 1595243 1622877 1649012 1673422 1696001
53363 1696001 1716815 1736112 1754021 1770272 1784330 1795732 1804171 1809470 1811769 1811514 1808828 1802982 1792946
53350 1792946 1778589 1760952 1741215 1719759 1696376 1670973 1643757 1615064 1585422 1555628 1526340
53339 1526340 1497594 1468992 1440325 1411777 1383575 1355735 1328208 1301003 1274100 1247487 1221376
53328A221376k5171k3986k3067k2645k2355k1598k0189j8529j7167j6235j5380
53317I95054j4226j2751j1271j0139r611r741j0192j0302r761r095r109r803j0312
53304H58741j0007r222q621q317p970p426o761n908m724l425k484k034j676j014
53290G79152r9P53J408K084L110M557O060P187P974Q890J0108J1101J1323J1076
53276H64684J1198J1986J2868J3188J2868J2240J1618J1223J1118J1023J0506
53265I94520R520Q421P380O185M804L636K774J505q90m037o705q146q703r157
53251A001107r961j1163j2676j4291j5684j6623j7109j7258j7132j6748j6139
53240H36323j5386j4670j4247j4250j4554j4953j5318j5492j5212j4442j3692
$$ plain form
53328 1221376 1196205 1172219 1149152 1126507 1104152 1082554 1062365 1043836 1026669 1010434 995054
53317 995054 980828 968077 956806 946667 937056 927315 917123 906821 897060 887965 878856 869053 858741
53304 858741 848734 839512 830891 822574 814604 807178 800417 794509 789785 786360 783876 781842 780166 779152
53290 779152 779053 779806 781214 783298 786408 790965 797025 804212 812186 821076 831184 842285 853608 864684
53276 864684 875882 887868 900736 913924 926792 939032 950650 961873 972991 984014 994520
53265 994520 1004040 1012461 1019841 1026026 1030830 1034466 1037240 1038745 1037855 1033818 1027113 1018967 1010264 1001107
53251 1001107 991146 979983 967307 953016 937332 920709 903600 886342 869210 852462 836323
53240 836323 820937 806267 792020 777770 763216 748263 732945 717453 702241 687799 674107
53229F74107j3587j4129j4711j4846j4531j3852j2773j1492j0590j0338j0239
53218E33019r655q637p722p090o474n842n601n960o542o867o917o992p259p719
53204D33742q349r054r572r700r591r542r604r552r236q777q373q153q114q099
53190C08026p833p243o704o727p335p951q034p581o970o491o225o184o309o398
53176B10041o225n720n002m239l547k958k421k017k106k986m281m983m439l064
53162A56053j850j320j280j356j366j214q93o16n93o42m43j17j29n63r68j075
53146A41628j127j331j469j349j193j172j019n32p6p2l49n14o84j158j629j447
53130A26507o77j33j79k53J43N65K18r52k193k780k522j625m65N25R79P60N2o58
$$ plain form
53229 674107 660520 646391 631680 616834 602303 588451 575678 564186 553596 543258 533019
53218 533019 523364 514727 507005 499915 493441 487599 481998 476038 469496 462629 455712 448720 441461 433742
53204 433742 425393 416339 406767 397067 387476 377934 368330 358778 349542 340765 332392 324239 316125 308026
53190 308026 300193 292950 286246 279519 272184 264233 256199 248618 241648 235157 228932 222748 216439 210041
53176 210041 203816 198096 193094 188855 185308 182350 179929 177912 175806 172820 168539 163556 159117 156053
53162 156053 154203 152883 151603 150247 148881 147667 146774 146158 145565 144923 144480 144363 144234 143671 142703 141628
53146 141628 140501 139170 137701 136352 135159 133987 132968 132436 132360 132288 131939 131425 130741 129583 127954 126507
53130 126507 125830 125697 125518 125265 125408 125973 126191 125239 123046 120266 117744 116119 115654 116179 117158 117918 117970 117312
53112A17312p37J05J355J978J430K33o34p75n81n47p35r43j103j300j513j528
53096A12017j204o99l31k46l48n89r97j379j292o51pJ09o4K9K61oo98p67L76J812
53076A05326K106J071j05l86L0K19k67r44j055m44L01O15O23Q22J220J306R43
53059A11381O86R42J264R45J1q58j206j089p34l04N8L63Q75J697K382K438K089
53042A20940J981K197K117J398M80l6j17q8q7n0J9L5J8N4J54K31J55j67o41r62
53022A27631q63m60q3J54L89O66Q04O98M34J17j65k34K9M27O65P83J032J312J216
53003A34552P11L10L62O03O57N65N55O10N87M90L81K72L09P44J484K000J938J521
52985A48651J049M83j37l01L01J061J038K23l85l6R79J831K033J653J037N51L66
$$ plain form
53112 117312 116575 116680 118035 120013 121443 121676 121042 120267 119686 119139 118404 117461 116358 115058 113545 112017
53096 112017 110813 110114 109783 109537 109189 108600 107603 106224 104932 104281 104274 104383 104319 104348 104609 104603 103905 103138 103514 105326
53076 105326 107432 108503 108398 108012 108042 108261 107994 107050 105995 105551 105852 106467 107090 107912 109132 110438 111381
53059 111381 112067 113009 114273 115218 115229 114371 113165 112076 111342 111038 111096 111459 112334 114031 116413 118851 120940
53042 120940 122921 125118 127235 128633 129113 129077 128960 128872 128785 128735 128754 128789 128807 128861 129015 129246 129401 129234 128593 127631
53022 127631 126768 126308 126225 126379 126768 127434 128238 128936 129370 129487 129322 129088 129117 129544 130209 130992 132024 133336 134552
53003 134552 135263 135573 135935 136538 137195 137760 138315 138925 139512 140002 140383 140655 140964 141708 143192 145192 147130 148651
52985 148651 149700 150183 150046 149745 150046 151107 152145 152368 151983 151947 152926 154757 156790 158443 159480 160031 160397
52968A60397K95K6m09n82j42P22J425J518J093N97K96Om64q44o90q8M41P45J145
52949A65487J594J430M49n12p13n99q85j164n42O09Q95k5q74o56K2J75k8J42N94
52930A65399O86M38M67Q21Q13J15p28j047p83k24M69J123J360Q67j51j102j538
52913A66985j439j077p28n12m03k85r6M8q2m98p95m93K97Q33N93l8k58J19N64
52894A62735O31M34K11Kj34j4K82K76k75r61j215j007o80m24k02pJ58M18Q68J335
52874A62431J556J465J069L17o53j384j558j405j334j358j234j011r55j112j344
52859A53490j697k229k612k425j857j497j461j332j058j172j823k296k031j519
52845A28481j520j815j532o15l5m17j163j351r46n88n11l09K81Q61Q78K90m78
$$ plain form
52968 160397 160692 160718 160309 159727 159585 160307 161732 163250 164343 164940 165236 165242 164778 163934 163244 163156 163597 164342 165487
52949 165487 167081 168511 168960 168448 167735 167136 166251 165087 164545 165154 166049 166024 165150 164494 164516 164691 164663 164805 165399
52930 165399 166085 166523 166990 167811 168624 168739 168011 166964 166181 165957 166426 167549 168909 169776 169625 168523 166985
52913 166985 165546 164469 163741 163229 162826 162541 162445 162493 162411 161913 161118 160625 160922 161755 162348 162310 162052 162171 162735
52894 162735 163366 163800 164011 164013 163879 163865 164147 164423 164148 163187 161972 160965 160285 159861 159659 159652 159810 160228 161096 162431
52874 162431 163987 165452 166521 166838 166185 164801 163243 161838 160504 159146 157912 156901 155946 154834 153490
52859 153490 151793 149564 146952 144527 142670 141173 139712 138380 137322 136150 134327 132031 130000 128481
52845 128481 126961 125146 123614 122999 122964 122547 121384 120033 119087 118499 117988 117679 117960 118821 119699 119989 119511
52828A19511j029j261j279j253j291j304j056n14K9L10M10M82L54j80q21j006
52812A10102o72l34k82k60m9J25J00J56M63O15K33k91k77K47O36N86L99L57L66
52793A12220K89J33j27m48m96J2P21R37N88L12M54O53N96N97R54J308J116M58
52775A20277j18l12k55j60j62k66k24L45J361K088J907J020R6n44r24r39n00j2
52757A22678p8o64j106j017p15n93o24o62q17j129j264q88j71M45Q18J124J395
52740A16732J435J248J186J470J791J658J033M06K04L53N13N64O40Q38J091J331
52724A32493J483J339P42Rj39O16J655K048J587Q88N09L67J38j70l33m21p49j342
52706A40720j689j242l2J312K083J984J222L55l1J95N93O74N87R58J876K522K146
$$ plain form
52828 119511 118482 117221 115942 114689 113398 112094 111038 110524 110553 110863 111273 111755 112109 111929 111108 110102
52812 110102 109430 109096 108814 108554 108505 108630 108730 108886 109349 109964 110197 109906 109629 109876 110512 111098 111497 111854 112220
52793 112220 112509 112642 112515 112067 111571 111583 112304 113241 113829 114141 114595 115248 115844 116441 117395 118703 119819 120277
52775 120277 120159 119847 119592 119432 119270 119004 118780 119125 120486 122574 124481 125501 125597 125053 124129 123190 122690 122678
52757 122678 122600 121936 120830 119813 119098 118505 117881 117219 116402 115273 114009 113121 112950 113395 114213 115337 116732
52740 116732 118167 119415 120601 122071 123862 125520 126553 126959 127163 127516 128029 128593 129233 130071 131162 132493
52724 132493 133976 135315 136057 136066 135927 136543 138198 140246 141833 142721 143230 143597 143735 143565 143232 142811 142062 140720
52706 140720 139031 137789 137757 139069 141152 143136 144358 144713 144682 144877 145470 146144 146731 147689 149565 152087 154233
52689A54233J096K70j45o45j211j057O3J134J102J84o91j226j707j983j566p52
52673A47099n75j272j708r17M61R59J92q24j056n36k9l7l92n53k11L62O09L82
52655A41954J12J09P0l88j001j200r57o79k72Q62K725M293M615L828K663J503
52639A58237M29k51k89r6k81q14j236j558k100k550k099p79L22N14L57N36P64
52622A49106N01M4PJ96%m35l91K26P54Q08N57O5p91j591j540n74M69J020J277
52603A49708J361R23N2l61J60Q88R51N27J97j02o14q47j62R86J447Q80J8n88j088
52584A54336j565j649j146m61o2p6m51j021j376j201q24q44j158j085m92k8k0
52567A40877rK54K40l79r27o99j53k05p59q74l40n9o77j645k039j744j323j130
$$ plain form
52689 154233 155329 155599 155454 154809 153598 152541 152604 153738 154840 155024 154333 153107 151400 149417 147851 147099
52673 147099 146524 145252 143544 142627 143088 144047 144239 143415 142359 141823 141794 141757 141365 140812 140601 140963 141572 141954
52655 141954 142066 142175 142245 141857 140856 139656 138699 138020 137748 138610 141335 145628 150243 154071 156734 158237
52639 158237 158666 158415 158126 158030 157749 156935 155699 154141 152041 149491 147392 146613 146935 147449 147806 148342 149106
52622 149106 149607 149651 149658 149854 149854 149419 149028 149254 150008 150816 151373 151438 150647 149056 147516 146942 147411 148431 149708
52603 149708 151069 151992 152044 151683 151843 152731 153682 154209 154406 154304 153690 152843 152681 153667 155114 155994 156012 155424 154336
52584 154336 152771 151122 149976 149515 149453 149377 148926 147905 146529 145328 144504 143660 142502 141417 140925 140897 140877
52567 140877 140868 141122 141362 140983 140056 139357 139204 138999 138240 137366 137026 136967 136290 134645 132606 130862 129539 128409
52549A28409j074j029j049j081r07m50O5L70M17K68o9n19q21p47m41k81l87n21
52531A20153n20m68l39J43R86J589J333M22k99k84K57P96R64O40km70l61L9k7
52512A24552q68j915k386k098j462r24o82o80p05n28j54K01L66L68K96K03J73
52495A13757K25K23J22K27Q39J611J764J058R5n32r35j433j772j433m62M16N90
52478A14360J68k75l48k19k97n83n30J93J000R65R5n78l74J84K22k58n51k73K88
52459A13189O21L90m26j345j562p87K66O34K10l15m41k99j87k12l41m92m85k94
52441A08124k15m59o57k44P14J534J755J493J010M25q8l21l72n71q85q59l31K87
52423A10340N86O27N72L14j79m86j82N35J071J183J126J128J120J004Q92Q81Q26
$$ plain form
52549 128409 127335 126306 125257 124176 123269 122819 122884 123254 123671 123939 123870 123351 122530 121783 121342 121061 120674 120153
52531 120153 119633 119165 118826 118969 119955 121544 122877 123299 123000 122716 122973 123769 124733 125373 125371 124901 124540 124579 124552
52512 124552 123684 121769 119383 117285 115823 114899 114217 113537 112832 112304 112150 112351 112717 113085 113381 113584 113757
52495 113757 113982 114205 114327 114554 115393 117004 118768 119826 119921 119389 118454 117021 115249 113816 113354 113770 114360
52478 114360 114528 114253 113905 113686 113389 112806 112276 112469 113469 114434 114529 113951 113577 113761 113983 113725 113174 112901 113189
52459 113189 113810 114200 113774 112429 110867 110080 110346 110980 111190 110875 110434 110135 109948 109736 109395 108903 108418 108124
52441 108124 107909 107450 106793 106549 107263 108797 110552 112045 113055 113480 113392 113071 112699 112128 111243 110384 110053 110340
52423 110340 110926 111553 112125 112439 112260 111774 111592 112127 113198 114381 115507 116635 117755 118759 119651 120532 121358
52406A21358M89r3o18q65r72j197j479j446r19j77L82O92Q70R17P63O14P59J136
52388A20214J325J089O43L46L33N43Q35J049J127J220J439J544J167L68l16m75
52372A32451k27R3L11M18M49N38Q38J275J575J639J593J462J154Q69J064J722
52356A47224K120J715R54P50J381K297K875K908K521K053J936K306K639K270J266
52341A77215M57N10J262K082K518K496K124J564R67M57K23M90J245K031K396K453
52325B00490K671L087L296L310L785N012O173O286N528N008N287N931O491P203
52311B69558Q347R540J0232J0532J0956J1573J1928J1848J1795J2251J3101J3892
52299D05553J4411J4771J4978J4813J4191J3488J3228J3477J3735J3562J3136
$$ plain form
52406 121358 121847 121754 121136 120271 119299 118102 116623 115177 114258 114081 114463 115155 116025 116942 117705 118319 119078 120214
52388 120214 121539 122628 123271 123617 123950 124493 125328 126377 127504 128724 130163 131707 132874 133242 132926 132451
52372 132451 132224 132317 132628 133046 133495 134033 134871 136146 137721 139360 140953 142415 143569 144438 145502 147224
52356 147224 149344 151059 152013 152763 154144 156441 159316 162224 164745 166798 168734 171040 173679 175949 177215
52341 177215 177672 178182 179444 181526 184044 186540 188664 190228 191195 191652 191875 192365 193610 195641 198037 200490
52325 200490 203161 206248 209544 212854 216639 221651 227824 234110 239638 244646 249933 255864 262355 269558
52311 269558 277905 287445 297677 308209 319165 330738 342666 354514 366309 378560 391661 405553
52299 405553 419964 434735 449713 464526 478717 492205 505433 518910 532645 546207 559343
52288E59343J2938J2988J2779J1981J0857R788Q789P763O870O202N449M329L168
52275F73244K426J859P99p08j804k006j850k017k456k715k656k364j803r98k08
52260F56743M72J317K329K907K754K700L800N801P364P803P838Q408R527J0564
52246G30327J1150J1380J1476J1661J2023J2297J1950J0801R379Q356P796P118
52234H55714N856M182K696J785J262O98n0q28j675k923m602o133o989p397p908
52219H33688q496q636q282q152q885j0254j1369j1427j0267q504p112o578o489
52206G19237o178n611n258n279n325n111m643l946l119k564k625k960k945k621
52192F61052k544k667k308j402q18j010j286r70m33k93l42j59j16q33j963k560
$$ plain form
52288 559343 572281 585269 598048 610029 620886 630674 639463 647226 654096 660298 665747 670076 673244
52275 673244 675670 677529 678328 677620 675816 673810 671960 669943 667487 664772 662116 659752 657949 656951 656743
52260 656743 657215 658532 660861 663768 666522 669222 673022 678823 686187 693990 701828 710236 719763 730327
52246 730327 741477 752857 764333 775994 788017 800314 812264 823065 832444 840800 848596 855714
52234 855714 861570 865752 868448 870233 871495 872193 872143 871315 869640 866717 862115 855982 848993 841596 833688
52219 833688 825192 816556 808274 800122 791237 780983 769614 758187 747920 739416 732304 725726 719237
52206 719237 713059 707448 702190 696911 691586 686475 681832 677886 674767 672203 669578 666618 663673 661052
52192 661052 658508 655841 653533 652131 651313 650303 649017 648047 647614 647321 646979 646820 646704 645871 643908 641348
52176F41348k426k262k489k759k705k478k387k464k567k570k438k307k390k555
52162F06551k355j794j638k404l374l404k434j429r44o76l93m23q87j262j169
52147E81965r62j144j612j922j921j724j398r47m89j22J45K12j32q10j389j554
52131E66196j511j677k155k645k776k333j394k80P25J652K605L321L372K916K753
52116E68769L365M320M980N461O364P801R222J0285J1284J2505J3615J4084J4023
52103F86078J4169J5031J6344J7499J8202J8561J8718J8694J8496J8026J6999
52092H76817J5285J3271J1562J0315R323Q692Q727Q962Q118N627K655Q46M12J22
$$ plain form
52176 641348 638922 636660 634171 631412 628707 626229 623842 621378 618811 616241 613803 611496 609106 606551
52162 606551 604196 602402 600764 598360 594986 591582 589148 587719 586775 586099 585706 585283 584396 583134 581965
52147 581965 581003 579859 578247 576325 574404 572680 571282 570335 569846 569724 569869 570081 569949 569139 567750 566196
52131 566196 564685 563008 560853 558208 555432 553099 551705 551425 552150 553802 556407 559728 563100 566016 568769
52116 568769 572134 576454 581434 586895 593259 601060 610282 620567 631851 644356 657971 672055 686078
52103 686078 700247 715278 731622 749121 767323 785884 804602 823296 841792 859818 876817
52092 876817 892102 905373 916935 927250 936573 945265 953992 962954 971072 976699 979354 980200 980612 980734
$$ [...]
##END NTUPLES=NMR SPECTRUM
##END=
