##TITLE=NES1033_872015079_9243059_InYdxdyMnh
##JCAMPDX= 6.0         $$ Bruker NMR JCAMP-DX V2.0
##DATA TYPE= NMR SPECTRUM
##DATA CLASS= NTUPLES
##ORIGIN= BRUKER
##OWNER= Administrator
$$ 1.72 TOPSPIN		Version 2.1
$$ 2015-08-24 14:26:28.858 -0700  Administrator@X
$$ Compression mode = diff/dup
##.OBSERVE FREQUENCY= 400.02188249412
##.OBSERVE NUCLEUS= ^1H
##.ACQUISITION MODE= SIMULTANEOUS (DQD)
##.ACQUISITION SCHEME= undefined
##.AVERAGES= 8
##.DIGITISER RES= 22
##SPECTROMETER/DATA SYSTEM= spect
##.PULSE SEQUENCE= zg30
##.SOLVENT NAME= COFFEE_meoh
##.SHIFT REFERENCE= INTERNAL, COFFEE_meoh, 1, 14.98509
##AUDIT TRAIL= $$ (NUMBER, WHEN, WHO, WHERE, PROCESS, VERSION, WHAT)
$$ ##TITLE= Audit trail, TOPSPIN		Version 2.1
$$ ##JCAMPDX= 5.01
$$ ##ORIGIN= Bruker BioSpin GmbH
$$ ##OWNER= Administrator
$$ $$ E:\/data/COFFEE/nmr/NES1033_872015079_9243059_InYdxdyMnh/30/pdata/1/auditp.txt
$$ ##AUDIT TRAIL=  $$ (NUMBER, WHEN, WHO, WHERE, PROCESS, VERSION, WHAT)
(   1,<2015-08-24 14:26:21.623 -0700>,<Administrator>,<X>,<go>,<TOPSPIN 2.1>,
      <created by zg
	started at 2015-08-24 14:25:15.780 -0700,
	POWCHK enabled, PULCHK disabled,
       configuration hash MD5:
       21 0F 79 D6 B3 7B B4 F6 88 20 88 DB 03 48 BD 9F
       data hash MD5: 64K
       36 B4 A2 92 3E 10 D2 1C F4 D6 70 F0 2F 26 38 1F>)
(   2,<2015-08-24 14:26:24.733 -0700>,<Administrator>,<X>,<proc1d>,<TOPSPIN 2.1>,
      <Start of raw data processing
       efp LB = 0 FT_mod = 6 PKNL = 1 PHC0 = 0 PHC1 = 0 SI = 32K 
       data hash MD5: 32K
       99 E5 76 A5 D1 4C 41 04 91 31 6E F1 80 B0 72 96>)
(   3,<2015-08-24 14:26:25.030 -0700>,<Administrator>,<X>,<proc1d>,<TOPSPIN 2.1>,
      <pk PHC0 = 89.11011 PHC1 = 0 
       data hash MD5: 32K
       6E 58 9E 35 31 49 20 18 99 B6 02 1C FC 7F 57 D8>)
(   4,<2015-08-24 14:26:25.139 -0700>,<Administrator>,<X>,<proc1d>,<TOPSPIN 2.1>,
      <abs ABSG = 1 
       data hash MD5: 32K
       B8 98 EA 0B 75 CF 88 2B B9 F6 0A AC F4 01 51 D6>)
(   5,<2015-08-24 14:26:25.201 -0700>,<Administrator>,<X>,<proc1d>,<TOPSPIN 2.1>,
      <abs ABSG = 2 
       data hash MD5: 32K
       DE A2 66 09 25 0D 46 22 E2 D7 12 06 17 3D 09 75>)
(   6,<2015-08-24 14:26:25.264 -0700>,<Administrator>,<X>,<proc1d>,<TOPSPIN 2.1>,
      <abs ABSG = 3 
       data hash MD5: 32K
       5D BE B1 BF B9 C8 DC 27 E8 C7 63 DE 87 C7 EE CD>)
(   7,<2015-08-24 14:26:25.342 -0700>,<Administrator>,<X>,<proc1d>,<TOPSPIN 2.1>,
      <abs ABSG = 4 
       data hash MD5: 32K
       0B 82 BC 0E 50 D8 C8 72 79 B1 C9 6D A1 C6 0A 09>)
(   8,<2015-08-24 14:26:25.389 -0700>,<Administrator>,<X>,<proc1d>,<TOPSPIN 2.1>,
      <abs ABSG = 5 
       data hash MD5: 32K
       B9 CF 04 68 19 F9 45 08 C2 A3 6B A5 FB 99 33 AD>)
$$ ##END=
$$ 
$$ $$ hash MD5
$$ $$ 23 20 74 D3 44 72 0C 54 AB 42 E6 20 B8 FD 93 7E
##$RELAX= 
##$RELAX= 
##$RELAX= 
##$RELAX= 
##$RELAX= 
##$RELAX= 
##$RELAX= 
$$ Bruker specific parameters
$$ --------------------------
##$DU= <E:\>
##$EXPNO= 30
##$NAME= <NES1033_872015079_9243059_InYdxdyMnh>
$$ [...]
150 150 150 150 150 150 150 150
##$TP07= 0
##$TPNAME0= <>
##$TPNAME1= <>
##$TPNAME2= <>
##$TPNAME3= <>
##$TPNAME4= <>
##$TPNAME5= <>
##$TPNAME6= <>
##$TPNAME7= <>
##$TPOAL= (0..7)
0.5 0.5 0.5 0.5 0.5 0.5 0.5 0.5
##$TPOFFS= (0..7)
0 0 0 0 0 0 0 0
##$TUNHIN= 0
##$TUNHOUT= 0
##$TUNXOUT= 0
##$USERA1= <user>
##$USERA2= <user>
##$USERA3= <user>
##$USERA4= <user>
##$USERA5= <user>
##$V9= 5
##$VALIST= <valist>
##$VCLIST= <CCCCCCCCCCCCCCC>
##$VD= 0
##$VDLIST= <DDDDDDDDDDDDDDD>
##$VPLIST= <PPPPPPPPPPPPPPP>
##$VTLIST= <TTTTTTTTTTTTTTT>
##$WBST= 2048
##$WBSW= 25
##$XGAIN= (0..3)
0 0 0 0
##$XL= 0
##$YL= 0
##$YMAX_a= 585789
##$YMIN_a= -497192
##$ZGOPTNS= <>
##$ZL1= 120
##$ZL2= 120
##$ZL3= 120
##$ZL4= 120
##$ABSF1= 14.98509
##$ABSF2= -5.573092
##$ABSG= 5
##$ABSL= 3
##$ALPHA= 0
##$AQORDER= 0
##$ASSFAC= 0
##$ASSFACI= 0
##$ASSFACX= 0
##$ASSWID= 0
##$AUNMP= <proc_prof1d_extract_pilot.lims>
##$AXLEFT= 0
##$AXNAME= <>
##$AXNUC= <1H>
##$AXRIGHT= 0
##$AXTYPE= 0
##$AXUNIT= <>
##$AZFE= 0.1
##$AZFW= 0.1
##$BCFW= 0
##$BC_mod= 0
##$BYTORDP= 0
##$COROFFS= 0
##$CY= 15
##$DATMOD= 1
##$DC= 0
##$DFILT= <>
##$DTYPP= 0
##$F1P= 0
##$F2P= 0
##$FCOR= 0.5
##$FTSIZE= 32768
##$FT_mod= 6
##$GAMMA= 0
##$GB= 0
##$INTBC= 1
##$INTSCL= 1
##$ISEN= 128
##$LB= 0
##$LEV0= 0
##$LPBIN= 0
##$MAXI= 10000
##$MC2= 0
##$MEAN= 0
##$ME_mod= 0
##$MI= 0
##$NCOEF= 0
##$NC_proc= -8
##$NLEV= 6
##$NOISF1= 0
##$NOISF2= 0
##$NSP= 0
##$NTH_PI= 0
##$NZP= 0
##$OFFSET= 14.98509
##$PC= 1
##$PHC0= 89.11011
##$PHC1= 0
##$PH_mod= 1
##$PKNL= yes
##$PPARMOD= 0
##$PPDIAG= 0
##$PPIPTYP= 0
##$PPMPNUM= 2147483647
##$PPRESOL= 1
##$PSCAL= 4
##$PSIGN= 0
##$PYNMP= <proc.py>
##$REVERSE= no
##$SF= 400.02
##$SI= 32768
##$SIGF1= 0
##$SIGF2= 0
##$SINO= 400
##$SIOLD= 32768
##$SPECTYP= <>
##$SREGLST= <1H.CDCl3>
##$SSB= 0
##$STSI= 32768
##$STSR= 0
##$SW_p= 8223.68421052631
##$SYMM= 0
##$S_DEV= 0
##$TDeff= 65536
##$TDoff= 0
##$TI= <>
##$TILT= no
##$TM1= 0
##$TM2= 0
##$TOPLEV= 0
##$USERP1= <user>
##$USERP2= <user>
##$USERP3= <user>
##$USERP4= <user>
##$USERP5= <user>
##$WDW= 1
##$XDIM= 32768
##$YMAX_p= 400339233
##$YMIN_p= -677774
##$CURPLOT= <Network HP LaserJet P1505>
##$CURPRIN= <$Network HP LaserJet P1505>
##$DFORMAT= <normdp>
##$LAYOUT= <+/1D_H.xwp>
##$LFORMAT= <normlp>
##$PFORMAT= <normpl>
##$SURQMSG= 1
$$ End of Bruker specific parameters
$$ ---------------------------------
##NTUPLES= NMR SPECTRUM
##VAR_NAME=  FREQUENCY,     SPECTRUM/REAL,   SPECTRUM/IMAG
##SYMBOL=    X,             R,               I
##VAR_TYPE=  INDEPENDENT,   DEPENDENT,       DEPENDENT
##VAR_FORM=  AFFN,          ASDF,            ASDF
##VAR_DIM=   32768,         32768,           32768
##UNITS=     HZ,            ARBITRARY UNITS, ARBITRARY UNITS
##FACTOR=    0.250966925370066, 1,           1
##FIRST=     8223.43324360094, -48750,       -27369
##LAST=      0,             -103528,         -52517
##MIN=       0,             -677774,         0
##MAX=       8223.43324360094, 400339233,    0
$$ Real data points
##PAGE= N=1
##DATA TABLE= (X++(R..R)), XYDATA
$$ [...]
19500d4960o8978j35790a6023j62097N1545d3323j94338a12964B157a75838n228
19489a81066k5091A59075A7706J36899c18279L3343A13481c00742G9618f8148
19478a04741E313b8393j80688B28223h2613j70630k34040K09551E4753K61153
19468C15906a61279Q0551A1410i4202l12613C0411o463b5668q0940k91733D7281
19456b34429G1705a37152A79216b15152i6310B17404a09326m9081B666e1311Q886
19445d2425H9100a52112A52440a1895k8376o9673A59486K8463K77211b44216J07425
19434a36791H6932C4144Q0186b14989A20885B4375e1971l058r358B7329J88834
19423B16163J0668b39419J18996e3312l3593k2853q3936j04828R2009g5009k86696
$$ plain form
19500 -44960 -113938 -249728 -16023 -178120 -126575 -43323 -237661 -112964 2157 -175838 -181066
19489 -181066 -206157 159075 17706 154605 -318279 -284936 113481 -300742 79618 -68148
19478 -104741 5313 -28393 -209081 228223 -82613 -253243 -487283 -277732 54753 315906
19468 315906 -161279 -80728 11410 -94202 -406815 30411 23948 -25668 -106608 -398341 47281
19456 -234429 71705 -137152 179216 -215152 -96310 217404 -109326 -158407 2666 -51311 -42425
19445 -42425 89100 -152112 152440 -11895 -40271 -109944 159486 187949 465160 -244216 -136791
19434 -136791 86932 34144 114330 -214989 120885 24375 -51971 -55029 -64387 27329 216163
19423 216163 226831 -239419 -120423 -53312 -86905 -109758 -193694 -298522 -206513 -75009 -361705
19412c61705h8389j13552B681a36951L9654A83009i5157B09447b0125k81265R985
19401b91405I3447M3045b54981J04311J8488P617A95166b40432a04513q289c0567
19389a82167H524L3870d7532j88426e3135B2230J16340a65182O5387J7343C4196
19377B86555H955L5605g1936j02926e0466n8310j55213P2419c6873q8545K7979
19366i7439A54683J37776H6212d6817l3491J8768k02584I3767k0740k3566d9556
19354f322A14868b6675A25880c09628F5991O7142f2976a7526B719a99625A37375
19342F7933a336l50764A93823e5151k10891J11385g4011A98079b79013A25617
19331a59739A33518B4020a31919N1795m4912j99284h7337o2012O1075H5768c00690
$$ plain form
19412 -361705 -88389 -201941 2681 -136951 -97297 183009 -95157 209447 -20125 -301390 -291405
19401 -291405 93447 136492 -254981 -150670 -132182 -124565 195166 -240432 -104513 -112802 -30567
19389 -182167 8524 42394 -47532 -235958 -53135 22230 138570 -165182 -99795 -82452 34196
19377 286555 8955 44560 -71936 -174862 -50466 -108776 -263989 -191570 -36873 -125418 -97439
19366 -97439 154683 292459 86212 -46817 -80308 -61540 -264124 93767 73027 49461 -49556
19354 -6322 114868 -26675 125880 -309628 65991 133133 -62976 -17526 2719 -199625 137375
19342 67933 -1336 -352100 193823 -55151 -266042 -154657 -74011 198079 -279013 125617
19331 -159739 133518 24020 -131919 -80124 -125036 -324320 -87337 -149349 -88274 85768 -300690
19319H4276Q419b59227A39503L263a92070H5004b53053R2683j2577j79048a69261
19307A59437o1045b16704R1742R358j0870i790B5487a03754i556F2903k6169N6804
19295I3538a41480n6019B99144j25122C9151a00069g948j76989H1742K3244c46936
19283c28151a59206N5187C03547a37295B38877g0141A80254c31193J34294g7074
19272C85617b0501k84687P3407j07492c0477q0903c776m754j2251n63895a74911
19260b36948B01955I870a300k72273H7636e7717B00559b16407A38191A8826J83272
19249B02098o7690b53123L2732j54142J48595J07593e2262A40103J43894a78924
19238g8585j29388j4757B9900a53648B57458b86519B45332b16455m06a9546B49854
$$ plain form
19319 84276 92695 -259227 139503 142766 -192070 85004 -253053 -160370 -172947 -351995 -169261
19307 159437 98392 -216704 -124962 -115604 -126474 -9790 25487 -103754 -9556 62903 36734 93538
19295 93538 -141480 -197499 299144 174022 39151 -100069 -7948 -184937 81742 104986 -346936
19283 -328151 -159206 -104019 303547 -137295 238877 -70141 180254 -331193 -196899 -77074
19272 385617 -20501 -305188 -231781 -339273 -30477 -111380 -3776 -8530 -20781 -584676 -174911
19260 -236948 201955 9870 -1300 -273573 87636 -57717 200559 -216407 138191 18826 202098
19249 202098 134408 -253123 -220391 -374533 -225938 -118345 -52262 140103 283997 -178924
19238 -78585 -207973 -222730 29900 -153648 257458 -286519 245332 -216455 -216861 -19546 249854
19226d25919J06183K3517K3473A07837a9643F8778b98705e7344p2723l2025O075
19215a56017A05598c0172o9508H3977J99027a7061d975r3245A53144a12695m9349
19204a62044H62J75301b18566a212j03368M6989B08224F4462R7648a61898L0149
19193a31749A14137K8406a72056Q3329c7372E0203O6574P9994c31122A03950b289
19181a80285g1070k7119o8741m8703B6696J02230a38858C0878b09060C09497a01490
19169c27835a48562O611A8887g1117j70523H8346b66126I4448c955j37689G2022
19157e6740k82902J10904Q3983c7320H0224e7695D5681a01518j7280E6481A6676
19145f1706k005B7794a43874D558a5455j05758A93081r0340h7834j96684C3982
$$ plain form
19226 -425919 -319736 -296219 -272746 107837 -19643 68778 -298705 -57344 -130067 -162092 -156017
19215 -156017 105598 -30172 -99680 83977 283004 -17061 -4975 -98220 153144 -112695 -162044
19204 -162044 862 176163 -218566 -1212 -104580 -57591 208224 64462 162110 -161898 -131749
19193 -131749 114137 142543 -172056 -88727 -37372 50203 116777 196771 -331122 103950 -2289
19181 -180285 -71070 -98189 -166930 -215633 26696 128926 -138858 30878 -209060 309497 -101490
19169 -327835 -148562 -141951 18887 -71117 -241640 88346 -266126 94448 -3955 -141644 72022
19157 -56740 -339642 -228738 -144755 -37320 80224 -57695 45681 -101518 -118798 56481 16676
19145 -61706 -63711 27794 -143874 4558 -15455 -121213 193081 102741 -87834 -284518 33982
19133c8444j39059A18574b25904A953Q9857k3580b18597h9171K3977B98513b3976
19121A00906o302a18802d9170j48101B1567f870k9625A91302n5052d65724C98126
19109b04031E4955K6928B2888a0385A66151p3161a34586O5493A8916c51225D108
19097h0468m6640B62242i9422a4381l5149q5312D3313J0258a40320j13499r2219
19086c46038a36869k54151f0561b3388j6550l10931a20910q6995K6123k37A725
19074C762R8688e3092C11564F6346c94559A0317a47054I7079Q4103d76731B13704
19062a15216E3708K1637J72100a33173k4022e9488j69114A46125K47376a67654
19051C18722g0887B53384a62184J6317A1175a16137E9766a07434M3332l56112
$$ plain form
19133 -38444 -177503 118574 -225904 1953 91810 68230 -218597 -89171 -65194 298513 -23976
19121 100906 94604 -118802 -49170 -197271 21567 -6870 -36495 191302 136250 -465724 398126
19109 -204031 54955 81883 22888 -10385 166151 92990 -134586 -69093 18916 -351225 4108
19097 -80468 -127108 262242 -99422 -14381 -49530 -134842 43313 53571 -140320 -253819 -346038
19086 -346038 -136869 -391020 -60561 -23388 -39938 -350869 -120910 -207905 -181782 -182019 1725
19074 3762 102450 -53092 311564 66346 -394559 10317 -147054 97079 181182 -476731 213704
19062 -115216 53708 75345 247445 -133173 -157195 -59488 -228602 146125 393501 -167654
19051 318722 -70887 253384 -162184 -145867 11175 -116137 59766 -107434 -64102 -420214
19041d20214d6536j69092j61167I9635A2185a83054A0386J45554n0094a96309
19030f7131m7051p6114d9170j43939R0088J891k01157B77335A32226D1820J23182
19019A65002b35346E7718D946c2987o9020C6906J03485l3796d4315m8639F0491
19007B26856g2515k08673A66057h5860j04358e6501j19049A20106c85027B7643
18996d3025C07303a0856o395j26340E9695g8890k2009C7956a20778I1610c51619
18984E0021b229k26661B96422b29344A96303a61470k33940D1150j2635a58510
18973a91717P2655p4184B2585f7950D2547L0328b25294J05697A21927b66319J32632
18962a33687b4591j28191K9022k08032A89379n3163c42286a8979o8978K9030l6818
$$ plain form
19041 -420214 -46536 -215628 -376795 99635 12185 -183054 10386 155940 105846 -196309
19030 -67131 -114182 -190296 -49170 -193109 -103021 -101130 -302287 277335 132226 41820 165002
19019 165002 -235346 57718 4946 -32987 -102007 36906 140391 106595 -44315 -92954 60491
19007 226856 -72515 -281188 166057 -85860 -190218 -56501 -175550 120106 -385027 27643
18996 -43025 307303 -10856 -17251 -143591 59695 -78890 -100899 37956 -120778 91610 -351619
18984 50021 -2229 -228890 296422 -229344 196303 -161470 -395410 41150 28515 -158510
18973 -191717 -119062 -193246 22585 -67950 42547 72875 -225294 -119597 121927 -266319 -133687
18962 -133687 -24591 -152782 -123760 -331792 189379 136216 -342286 -18979 -87957 -58927 -95745
18951i5745J5161A28642M0767a12283j83414b8536p4252c2623k33515a01411G3376
18939C27671b34187f3161l0820B9550a89630L2487l05116G2295K5442a99747A7441
18927e9199j36162f5403m5426N2383A57014B8779d6085H3038j952c64917J37049
18916b27868N2659A81267c94194J41338P6282j0094A75520F590B527K79040b5740
18904G4522d1236A78063b86829g2636k89873a41402e8543m9585H9309d76387K04709
18893b71678H2701b71406a7977j86090m4043a04013A76877E4921K0926A2520i6821
18881d3976A10236A7337c7048A70274a07558k50830i8912m0416j62882a17536
18870a20499D1635M1466A8911K15716f9925F9232d63779J34976g0823j7095A30034
$$ plain form
18951 -95745 -80584 128642 169409 -112283 -295697 -28536 -102788 -32623 -266138 -101411 73376
18939 327671 -234187 -63161 -93981 29550 -189630 -157143 -462259 72295 97737 -199747 17441
18927 -59199 -195361 -65403 -110829 -58446 157014 28779 -46085 83038 81086 -364917 -227868
18916 -227868 -175209 181267 -394194 -252856 -176574 -186668 175520 6590 2527 281567 -25740
18904 74522 -41236 178063 -286829 -72636 -362509 -141402 -58543 -108128 89309 -476387 -271678
18893 -271678 82701 -271406 -17977 -204067 -248110 -104013 176877 54921 75847 12520 -96821
18881 -43976 110236 17337 -37048 170274 -107558 -358388 -98912 -139328 -302210 -117536
18870 -120499 41635 83101 18911 234627 -69925 69232 -463779 -328803 -70823 -87918 130034
18858a25887d9136j32969k10827A96907E1902K90393H3025d1436A04002a25230
18847f0775C748J41863a03691j86690F3452g8062A27968a82179A57424e1208k38045
18836b89253g9776a5478g593k86630A88859l6648D8199i575j17459A42241A6998
18824B76358h0154m7180j99866R0892A83079a2948r0674C73173H4986K9524d0070
18812B87354A11105f7907k0333B03882I9833K12202Q743d9683p341I0024J08057
18801A98081a37j0653j44183J2470J8387P444l6880D7607j4898f4628j0146A01457
18788a99198B73437n7251K3623C795R5946R509h0084j43897q4305b6577k37804
18777b64381N9983B54804B0846a11114k3888j76887a40415A46078k1873h1048
$$ plain form
18858 -125887 -49136 -182105 -392932 196907 51902 342295 83025 -41436 104002 -125230
18847 -60775 3748 145611 -103691 -290381 63452 -78062 127968 -182179 157424 -51208 -289253
18836 -289253 -79776 -15478 -7593 -294223 188859 152211 48199 -9575 -127034 142241 16998
18824 276358 -80154 -127334 -327200 -236308 183079 -12948 -103622 373173 84986 114510 -40070
18812 287354 111105 -67907 -88240 203882 99833 312035 320778 -49683 -57024 90024 198081
18801 198081 -137 -10790 -154973 -142503 -124116 -116672 -153552 47607 32709 -64628 -74774 101457
18788 -199198 273437 216186 239809 3795 99741 109250 -80084 -223981 -308286 -26577 -264381
18777 -264381 -204398 254804 20846 -111114 -135002 -311889 -140415 146078 124205 -81048
18766G9585a44844A8614i3840a2967r2173M3464I58b4989B6327a45129j81927
18755c27056B9434a856l7649B50633a55464D338g8143A23948d9074k62394J34395
18744a77073b673G3503J62172d60453a9970l49137a59526A31689b23541B49791
18733A21101b22884h5281a2690A31715e3729j52139M3759A64658a80952A37884
18722I5519c16088a03467k5504k56952J74463o3193A46393e072r5148c6226k56408
18711b92634e6999E8816c7032B18315a57851e0216j13425H2533b04919A15561
18700D2032f1269A33544m559L036f8909l1155D3820J49123a86213r9309A89651
18688d6009I7851a84711l6136c0683F2166b76726A2700F335J55107K1221a95783
$$ plain form
18766 79585 -144844 18614 -93840 -12967 -105140 -61676 958 -24989 26327 -145129 -327056
18755 -327056 29434 -1856 -39505 250633 -155464 4338 -78143 123948 -49074 -311468 -177073
18744 -177073 -2673 73503 235675 -460453 -19970 -369107 -159526 131689 -223541 249791
18733 121101 -222884 -85281 -12690 131715 -53729 -205868 -162109 164658 -180952 137884
18722 95519 -316088 -103467 -128971 -385923 -211460 -274653 146393 -5072 -100220 -36226 -292634
18711 -292634 -56999 58816 -37032 218315 -157851 -50216 -163641 82533 -204919 115561
18700 42032 -61269 133544 128985 132021 -68909 -100064 43820 192943 -186213 -285522 189651
18688 -46009 97851 -184711 -220847 -30683 62166 -276726 12700 6335 161442 182663 -195783
18676i3077H8667K40020a31404j92010A01931I040i9162n2728D2955A2099E185
18664a7331E2314c72102c9658j87259a6122D2664N8398R160b01721A69685b81985
18652a98218g7844A4641J0151c6686B66297a27534K3142e2088e654G3468a15403
18640a43966k7378G7077c29891J55701K5296j04825A21868n2870h3888c3765k25374
18629b59139E5467a17400l6936A15319C6890b78951q0655A4554a8039l19138a67477
18617A0805b54165A1569a4548r657A86565B7763b10917k0328f8560j8258p7798
18606a64616A11540e83333C816a7705k68347A19329a80196H8679b88826J05716
18596a83110o1532B92368a55255L3996B24571c13834f6620h746G3343b62954a23198
$$ plain form
18676 -93077 88667 328687 -131404 -323414 101931 9040 -99162 -151890 42955 12099 5185
18664 -17331 52314 -372102 -39658 -226917 -16122 42664 101062 110222 -201721 169685 -281985
18652 -198218 -77844 14641 24792 -36686 266297 -127534 -104392 -52088 -5654 73468 -115403
18640 -143966 -171344 77077 -329891 -174190 -148894 -253719 121868 68998 -83888 -33765 -259139
18629 -259139 55467 -117400 -154336 115319 36890 -278951 -359606 14554 -18039 -337177 -167477
18617 10805 -254165 11569 -14548 -24205 186565 27763 -210917 -231245 -68560 -86818 -164616
18606 -164616 111540 -583333 3816 -17705 -286052 119329 -180196 88679 -288826 -183110
18596 -183110 -244642 292368 -155255 -121259 224571 -313834 -66620 -8746 73343 -262954 -123198
18584a49358a6101l4598F401a24595q5470P0036H7232J74947a0655C7476O1570
18573I9046b03348a2195B87517a85941P0507j9975j12072a535C4374d7913l10028
18562c57941D2885b21149A17436N1800c6324k38084A26809K26995b00028I7027
18551c63147F483a00432F5365J65364b01918A06035L3771A545J37506A9294P6485
18540I5779L0449b78132c9864j35096N7782j06802p813g2942h928l25354g2282
18528a79738F0589i785f21j43479P0126C9480c35728I1662b32012R1302N8533
18517h2177H836b8582k3588B05631A01821m5397f7001k66189F0136Q2771J63265
18506C06172a61273j9405a1685F7082b82288C86282e4480b337B45197a0209A33462
$$ plain form
18584 -149358 -16101 -50699 6401 -124595 -210065 -140029 87232 262179 -10655 37476 99046
18573 99046 -203348 -12195 287517 -185941 -115434 -135409 -247481 -1535 34374 -47913 -357941
18562 -357941 42885 -221149 117436 169236 -36324 -274408 126809 353804 -200028 97027
18551 -363147 6483 -100432 65365 230729 -201918 106035 139806 1545 139051 19294 95779
18540 95779 126228 -278132 -39864 -174960 -117178 -223980 -231793 -72942 -8928 -334282 -72282
18528 -179738 60589 -9785 -621 -144100 -73974 39480 -335728 91662 -232012 -140710 -82177
18517 -82177 8836 -28582 -52170 205631 101821 56424 -67001 -333190 60136 142907 306172
18506 306172 -161273 -180678 -11685 67082 -282288 386282 -54480 -2337 245197 -10209 133462
18494A07432b21993A75621b92653n3976C74257b18941e9297m1477j34745A45078
18483H2326M7851a78437f601C021M0961K42153n2739j14161j0323m7913b426D9037
18470C7323N6392b92819D054h9505A33741R80c19230e5359j62222M2865f5303
18458b79087C61367A16423b29764B9851J25380a28430f1895j72076a7284k32625
18448b49909Q8270c8123k25920L0915l8540i1942j40669P0677A10329e5801b4792
18436a12541I1453a24190k38159B68509I293A072a43096A42217K8261a74951M53
18425a74498f3895R331A27308b93408I6415m723G765f9044a0975j66123F9290
18413c698D7353K0909a01466A52443b28881c3673n9085B0204b53012J14396A78171
$$ plain form
18494 107432 -221993 175621 -292653 -346629 374257 -218941 -59297 -100774 -235519 145078
18483 82326 130177 -178437 -6601 3021 43982 286135 233396 119235 108912 60999 -2426 49037
18470 37323 93715 -292819 4054 -89505 133741 134721 -319230 -55359 -217581 -174716 -65303
18458 -279087 361367 116423 -229764 29851 155231 -128430 -61895 -233971 -17284 -249909
18448 -249909 -161639 -38123 -264043 -233128 -271668 -91942 -232611 -161934 110329 -55801 -24792
18436 -112541 91453 -124190 -362349 268509 9293 1072 -143096 142217 170478 -174951 -174498
18425 -174498 -63895 -54564 127308 -293408 96415 91692 7765 -69044 -10975 -177098 69290
18413 -3698 47353 68262 -101466 152443 -228881 -33673 -92758 20204 -253012 -138616 178171
18401B0162b88718C5781g8366D9399b24407R1569N0758J5225C18840j14367a11252
18389a7396k51347g9069K7288J3088C65615B9750A3669J04847c6623j62694f3134
18377b3853F7602B3878a513k3990A86117c4139j81449d0901j35094D999b45802
18365A09414C1462N3797a1710r8731H890a07104c6622r0834J921a1781k34501
18354b46282Q5556A39598L8327F4021j447i3799j14152A1028b01548b1900m87774
18343e09674C5076h9627K8628a3967A97741G9155M8729h8775G6636d2150A01811
18331A02292L8156a84787e2685l6808C87611c04775G1332a21199D9746b34583
18320B78226f8399D9355c4582k08304g2639A81659b16568R9382k33812a39425
$$ plain form
18401 20162 -288718 35781 -78366 49399 -224407 -132838 -82080 -66855 318840 204473 -111252
18389 -17396 -268743 -79069 -51781 -38693 365615 29750 13669 118516 -36623 -199317 -63134
18377 -23853 67602 23878 -1513 -25503 186117 -34139 -215588 -40901 -175995 4999 -245802
18365 109414 31462 85259 -11710 -110441 8890 -107104 -36622 -127456 -125535 -11781 -246282
18354 -246282 -160726 139598 177925 64021 62574 -93799 -207951 11028 -201548 -21900 -509674
18343 -509674 35076 -89627 -60999 -13967 197741 79155 127884 -88775 76636 -42150 101811
18331 102292 140448 -184787 -52685 -89493 387611 -304775 71332 -121199 49746 -234583
18320 278226 -68399 49355 -34582 -242886 -72639 181659 -216568 -117186 -350998 -139425
18309d92j24969b5770F5760c18437J58207K8573b9662B81472b2056B42221i5959
18297b54815C06122j46112k8040a24272B47231a10001q5171G4555a83431G8482
18286b34303H5192b37388B40344H2388N0612a81199D5566g2113A1919a90852f2097
18274A22485e5850n7191P571l9181k6144g8639l5352c3697l2200H3815R4381b56048
18261b73206A2376b35319B01408n9445B6851f4542b5734j06160F4978a84326b1614
18249H3140d00799i5190I493a16337k76919a9964E8363a58235A9789J44500a29152
18237C3574a7441m8805B8916b67561C5812c87840l0293f9333p1354r9799F0558
18225I4511A7014K47382b51834A23645L815a57533H981b83424R2137D6345i8469
$$ plain form
18309 -492 -125461 -25770 65760 -318437 -160230 -131657 -29662 281472 -22056 242221 -95959
18297 -254815 306122 160010 131970 -124272 247231 -110001 -195172 74555 -183431 78482
18286 -234303 85192 -237388 240344 82388 133000 -181199 45566 -72113 11919 -190852 -62097
18274 122485 -55850 -113041 -105470 -144651 -170795 -78639 -113991 -33697 -65897 83815 178196 -256048
18261 -273206 12376 -235319 201408 141963 26851 -64542 -25734 -131894 64978 -184326 -21614
18249 83140 -400799 -95190 9493 -116337 -393256 -19964 58363 -158235 19789 164289 -129152
18237 33574 -17441 -66246 28916 -267561 35812 -387840 -418133 -69333 -140687 -240486 60558
18225 94511 17014 264396 -251834 123645 127460 -157533 8981 -283424 -191287 46345 -98469
18213A07658L2118b8524j20283J8992M0248b9991C5286a57775D3693a23860A73616
18201b64984d2253J2618k11897H5902a15600D1192o734L8774c16171A24196b3321
18189D50001A05969J31426N9897A36526b21549a09278p5353E5974A5252a45672
18178D6905r979K8319J27773a09020J2487n9392A10828a75849g1014F2245Q8384
18167A50629E5775A2363b33006C1171O5112h4153C10920j19497H4790A5998J0268
18156B6266a73463a225l87492i752A69750a81107A64582b07965I7542a37941C21576
18144a70795A10524a26844f1517J4658D09934D1777L0596b84680G7949a39729
18133B249b2011C20854k6180b1728A2493b06473c2737A03839L88802i2053a4450
$$ plain form
18213 107658 139776 -28524 -148807 -129815 -89567 -29991 35286 -157775 43693 -123860 173616
18201 -264984 -42253 -29635 -241532 85902 -115600 41192 34458 73232 -316171 124196 -23321
18189 450001 105969 237395 297292 136526 -221549 -109278 -184631 55974 15252 -145672
18178 46905 36926 65245 193018 -109020 -96533 -155925 110828 -175849 -71014 62245 150629
18167 150629 55775 12363 -233006 31171 96283 -84153 310920 191423 84790 15998 26266
18156 26266 -173463 -1225 -388717 -9752 169750 -181107 164582 -207965 97542 -137941 321576
18144 -170795 110524 -126844 -61517 -46859 409934 41777 72373 -284680 77949 -139729
18133 2249 -22011 320854 294674 -21728 12493 -206473 -32737 103839 492641 -92053 -14450
18121A63720h3621A62491o960D9705a07405I269O3464N283a11557m4885F9896
18109g3446l9822o7980A46005l6581l7024R6595b00403j99662h0504A34212h4456
18097A04845C7026e5220b529p706B99519c16155b1991o7967q5798L6030k682d943
18084d66733H1410a42673B05265C1792b82337B4201g1512A64501L36343a46301
18073a54299A03077a55451j4195f3884H2411g475k81562A08055a14021j06735
18063b20756c1341l77507J14026C4426a063o7922A57318a11301n6963A80755b43755
18051G7011k5244a03564L3173D4884b5689F6218B3736a90026N1411B800b53854
18039C33634L230b81302A22086k2374M6243d9886j03082f8323m0677j02588A65750
$$ plain form
18121 163720 -83621 162491 155531 49705 -107405 9269 72733 78016 -111557 -156442 69896
18109 -73446 -113268 -181248 146005 109424 72400 168995 -200403 -400065 -80504 134212 -84456
18097 104845 37026 -55220 -2529 -10235 299519 -316155 -21991 -89958 -175756 -139726 -142408 -4943
18084 -466733 81410 -142673 205265 31792 -282337 24201 -71512 164501 500844 -146301
18073 -154299 103077 -155451 -169646 -63884 82411 -7475 -289037 108055 -114021 -220756
18063 -220756 -31341 -408848 -294822 34426 -1063 -68985 157318 -111301 -168264 180755 -243755
18051 77011 51767 -103564 -70391 44884 -25689 66218 23736 -190026 -138615 2800 -253854
18039 333634 336864 -281302 122086 99712 145955 -49886 -152968 -68323 -109000 -211588 165750
18027E7188a52406J4040f0762C7082e0752A16887A6860K07908b06808C4500b40160
18015B06907B1445c8594j571l772m3059I6534m6539d9373k15679a18F8314Q5366
18003A53680p2564g509j70327A38029d9900g908o652C2311L8606a04596A12100
17991e25125d8299I6939J11082J35095j57933a91067O5029D73393A6147J10401
17981A26548e0324H4397g1296m0900l8752d980A65965F4850j2012A2358J6232
17970B8590c1168H3793b56139A55826b03654Q7309g124j02074A4867a58880M8702
17959a10178C17300m9848e1439K4938j40023F8896b37582a0941F8593c85510d1391
17947b30919B71324a85005A31077a80147P3181k4043e2165C9115N9375a68798
$$ plain form
18027 57188 -152406 -138366 -60762 37082 -50752 116887 16860 224768 -206808 34500 -240160
18015 206907 21445 -38594 -40165 -43937 -86996 96534 49995 -49373 -265052 -118 68314 153680
18003 153680 81116 -7509 -177836 138029 -49900 -7908 -14560 32311 70917 -104596 112100
17991 -525125 -48299 96939 208021 343116 185183 -191067 -126038 473393 16147 126548
17981 126548 -50324 84397 -71296 -112196 -150948 -4980 165965 64850 52838 12358 28590
17970 28590 -31168 83793 -256139 155826 -203654 -116345 -7124 -109198 14867 -158880 -110178
17959 -110178 317300 267452 -51439 -26501 -166524 68896 -237582 -10941 68593 -385510 -41391
17947 -230919 271324 -185005 131077 -180147 -106966 -131009 -52165 39115 98490 -168798
17936f2587H0470h4252K6805l1653o1673j6729A48511a18634A86690B1554b40951
17924e0048A29193a01004B21544B9253K73159b03697h8678d0689B06312n5610
17914A50702K7802a22303M1508a9095B5067K44215a89774m171j05386f7692C2738
17902d2761p5784p7966C43601e3831B17752a89132A77773M4737A08999a55427
17891a42701m7510p239B69917l0451k6738j3155J655l2478j6647F7235J09256
17880A76491J20964E1040J96255i6627A05378j5900C85b61932H4030i7905G3379
17868A41806d402o3314J4319B02410c5901C05539F3331H797K3744J45137m034
17857A73644P7240J166E0354a10200B78375a16154j04160m2245B92286A0692a4703
$$ plain form
17936 -62587 80470 -84252 -57447 -89100 -150773 -167502 148511 -118634 186690 21554 -240951
17924 -50048 129193 -101004 221544 29253 302412 -203697 -88678 -40689 206312 150702
17914 150702 178504 -122303 -80795 -19095 25067 269282 -189774 -193945 -299331 -67692 32738
17902 -42761 -118545 -196511 343601 -53831 217752 -189132 177773 222510 108999 -155427
17891 -142701 -190211 -197450 269917 239466 212728 199573 201228 168750 152103 67235 176491
17880 176491 297455 51040 247295 -96627 105378 89478 385 -261932 84030 -97905 73379
17868 141806 -4402 -67716 -53397 202410 -35901 305539 63331 8797 32541 177678 173644
17857 173644 250884 252050 50354 -110200 278375 -116154 -220314 -262559 292286 10692 -14703
17845h4341j68833B02613a65242K6144a8658B6008b90248J12100r7235C0456L8582
17834F9038a2624G8628e61330d9307r2669p2303m2338p5972D1150L1673a9164
17822E1352P9548b37944A75475a28608n2378c9842B47795m2582M1781a01056A08508
17810a42120M5988j76896c4584I1947J82547G4940a79168A82339a61986B62898
17799A55298L79747j85579a69460B04672h8558B32034K5906o1020D4512d0533
17788a6351C76813b47133a10959J6779I5421R3692A6657c3900o7518G3033J24264
17777A97297B7194J38372b1086A51053i6000A33595F4936i1031A7299J45041a59441
17765B43578J1659H4727j2169K24192p6580i7014L3962A62076C5210e1234N276
$$ plain form
17845 -84341 -253174 202613 -165242 -139098 -18658 26008 -290248 -178148 -275383 30456 69038
17834 69038 -12624 78628 -561330 -49307 -141976 -214279 -256617 -332589 41150 72823 -19164
17822 51352 130900 -237944 175475 -128608 -180986 -39842 247795 205213 246994 -101056 108508
17810 -142120 -96132 -273028 -34584 91947 274494 74940 -179168 182339 -161986 262898
17799 155298 535045 349466 -169460 204672 -88558 232034 257940 196920 44512 -40533
17788 -16351 376813 -247133 -110959 -94180 95421 189113 16657 -33900 -101418 73033 197297
17777 197297 27194 165566 -21086 151053 -96000 133595 64936 -91031 17299 162340 -159441
17765 243578 255237 84727 72558 296750 220170 -97014 -63052 162076 35210 -51234 -45958
17754d5958B6348J55875a08571A30501J0505J0043g7516b0772l52920G3677f9302
17742a24775B00445O065o1311a62500B88331A10442a53112B67981q1950e8187
17731a82800L5260c8767J0088k39665A96636a81895F6283g677A73838G9837b14685
17719A01858J00032C9862d4576k93219I5770R6648d2897I4465k2974Q1874n8506
17708I4859B5121J73871G9319a3053j13168B10380l4498b12684D3958M26518a29830
17696A30096b2346j42212A43437b22485B01839a24797A91524a04086b6367A89371
17685A02540J20541e4192j21926A64534b22323H9449a56230B88511a09246D54795
17674d7211A22113c3105B30604K1346G611J1854h438A03262N5298n9282a28487
$$ plain form
17754 -45958 26348 182223 -108571 130501 141006 151049 -77516 -20772 -373692 73677 -69302
17742 -124775 200445 206510 145199 -162500 288331 110442 -153112 267981 186031 -58187
17731 -182800 -147540 -38767 -28679 -268344 196636 -181895 66283 -7677 173838 79837 -214685
17719 101858 201890 39862 -44576 -337795 95770 192418 -42897 94465 71491 153365 94859
17708 94859 25121 198992 79319 -13053 -126221 210380 175882 -212684 43958 470476 -129830
17696 130096 -22346 -164558 143437 -222485 201839 -124797 191524 -104086 -26367 189371
17685 102540 223081 -54192 -176118 164534 -222323 89449 -156230 288511 -109246 454795
17674 -47211 122113 -33105 230604 251950 7611 19465 -8438 103262 158560 99278 -128487
17662B22484J78971a56635a8994A17886l8684J77712D4581J56168C7439J66757
17652B04196a17222E8571Q1821b24673P1622B32653b3700A48118G2474K23043
17642B95517A36552D9154L11812A21238K533L13408C0902d4228l6817B81153J0086
17631B91239j13467p5048i8540B55812q949d3746K965D516M4526e554F6846e6181
17618a95810H3597j3920a15270B48948G4975M1094b18041R8606B80167H0499f813
17606A8231J16230J5236a64084B63144j15243A4402J34202a71966P3267n6210
17596a54909f641B13982G3191J1641b69296e7990A49511o4595J37489n3704m1101
17585A27600A259K05735H3181e3851E0480b93216A33403m156e6980A91879L747
$$ plain form
17662 222484 401455 -156635 -18994 117886 79202 256914 44581 200749 37439 204196
17652 204196 -117222 58571 140392 -224673 -153051 232653 -23700 148118 72474 295517
17642 295517 136552 49154 360966 121238 123771 437179 30902 -44228 -81045 281153 291239
17631 291239 177772 102724 -98540 255812 246863 -43746 -40781 4516 49042 -5554 66846 -56181
17618 -195810 83597 69677 -115270 248948 74975 116069 -218041 -119435 280167 80499 -6813
17606 18231 134461 149697 -164084 263144 147901 14402 148604 -171966 -98699 -154909
17596 -154909 -6641 213982 73191 84832 -269296 -57990 149511 84916 222405 168701 127600
17585 127600 1259 206994 83181 -53851 50480 -293216 133403 129247 -56980 191879 195626
17574A95626b0554C47949A03478B4467L22481A55746Q2979H9453b39925A43237
17563B1639P4854P6579o2422M5396J3302a07502B68692c61461B41487c5695G9744
17551G7597O259K46044j18898A02103a44510i701B79272l9351j03123j2248C5347
17539B05415a04035C90201C960h8839C93482A40174L8226Q1666m0439i7560G2051
17527C05775f732A44736a16774C69548m2275J12976j47372f6419C40265J52b80187
17515a49007D15095A96827p9041B5981K28801q6006m2062M1206E8749J47405r6294
17504A09860i828A47665J20551j14210i2645G2170K21805P7521N9926B00563q0069
17493A20494J21056J02384b9575A84530E6110J25855l6834E8641O0662G176K13589
$$ plain form
17574 195626 -20554 347949 103478 24467 346948 155746 238725 89453 -239925 143237
17563 21639 96493 173072 110650 156046 169348 -107502 268692 -361461 241487 -35695 79744
17551 77597 83856 329900 211002 102103 -144510 -9701 279272 239921 136798 124550 35347
17539 205415 -104035 390201 3960 -88839 393482 140174 178400 260066 219627 -97560 72051
17527 305775 -6732 144736 -116774 369548 327273 440249 292877 -66419 340265 340417 -280187
17515 -149007 415095 196827 117786 25981 254782 168776 126714 167920 58749 206154 109860
17504 109860 -9828 147665 268216 154006 -92645 72170 293975 371496 431422 200563 120494
17493 120494 241550 343934 -29575 184530 56110 181965 145131 58641 119303 7176 220765
17482B20765O520n7609q1243l6160A01a2948r7642A49026J18305l1096f9374C88760
17469A36281C7239i7407G9312a5201B54798B7409K3957J11203P5391K2413J02766
17458C63139h340C58867H7771K08925A28181J32140a0198D4896M55436k20557
17448B79775J19579a04191F9463K23773N2678A58972J21103j22029R9124J68276
17438D25446j78794p5267J14948L10714d1281A38796J2366L45689E9311K3137
17428H2448o283K46364a00269B24131n9206D9210J22557O4367K62905A80388K54643
17417D35031A31881K25862m6330c7278A33706K59208j91678j3097p0701K36684
17407C54122B4937L5270J101a43593J8339G1654j1431J84420G1883J02770M1485
$$ plain form
17482 220765 227285 169676 88433 52273 101 -12948 -110590 149026 267331 236235 -69374 388760
17469 136281 37239 -97407 79312 -15201 254798 27409 51366 162569 237960 260373 363139
17458 363139 -8340 358867 87771 296696 128181 260321 -10198 44896 500332 279775
17448 279775 399354 -104191 69463 293236 345914 158972 280075 158046 257170 425446
17438 425446 246652 171385 286333 597047 -41281 138796 151162 496851 59311 82448
17428 82448 76165 322529 -100269 224131 164925 49210 171767 236134 499039 180388 435031
17417 435031 131881 357743 311413 -37278 133706 392914 201236 188139 117438 354122
17407 354122 24937 60207 61308 -143593 -125254 71654 60223 244643 71883 174653 216138
17396B16138L3503A3218Q2262I625K83438i1044C68521r5697j778J21761b8746
17384A26718o3022N2838K95677A25740L20716C0939a80732A99031N8654J8788
17374B76473A13096l1376L44278j87814q9144R5801a41281C46023F2398J75886
17364B38284G7587h2283h695A47994f7768D10781j40240p8366K46847j92902a21695
17352B08282b37837C22857j38901J01386A11235a88738C31010R011B4125K41626
17342B65751p2439p5659m8589J60080p9382J6750a0468B63188j12057c7782B12707
17330B06201L5792M8714J53609I0809J95409b4943A02332J30455K4443j00952
17320A56278j7842o7976K18504L2772F9435J08843M905K10156A88415q121F1710
$$ plain form
17396 216138 249641 13218 95480 9625 293063 -91044 368521 272824 271046 392807 -28746
17384 126718 63696 116534 412211 125740 446456 30939 -180732 199031 257685 276473
17374 276473 113096 81720 425998 238184 149040 244841 -141281 346023 62398 238284
17364 238284 77587 -82283 -8695 147994 -67768 410781 270541 192175 439022 246120 -121695
17352 208282 -237837 322857 183956 285342 111235 -188738 331010 340021 24125 265751
17342 265751 193312 117653 69064 229144 149762 166512 -10468 263188 151131 -37782 212707
17330 206201 241993 290707 444316 90809 286218 -24943 102332 232787 257230 156278
17320 156278 138436 70460 288964 321736 69435 178278 183183 393339 188415 180294 61710
17308B37124G7811L4186Q7568j1457J62235H9209K09170e4411B31705j2818j9313
17297A99574K04384A93579b0192A77178E1627L35182n4520j17899a86008I7553
17286E0213e4064C07295A25363K8072h5613B87988j17115l2451R5179J24661A39467
17274C49913A06380Q1640J73974j52276l7949J32472j1583a18283B33744L4085
17264B67829o7074r8190j5457K74457n8871c0961C9098r944N1226R1420Q2018
17253B53818J79130E4248K00925p5717l2345J86339D5015J43459J23585j13647
17243A98412K58337A87252A6877L69082J12909A58846l5065J36039a72077C24610
17232B71276o8522K72318c3324B25771D0973J40193m2862R1350N5973q1539m9426
$$ plain form
17308 237124 77811 111997 199565 188108 350343 89209 298379 -54411 231705 218887 199574
17297 199574 403958 193579 -20192 177178 51627 386809 332289 214390 -186008 97553
17286 50213 -54064 307295 125363 153435 -85613 287988 170873 138422 233601 358262 139467
17274 349913 106380 188020 361994 209718 171769 304241 292658 -118283 233744 267829
17264 267829 200755 102565 87108 361565 302694 -30961 39098 29154 80380 171800 253818
17253 253818 432948 54248 255173 179456 147111 333450 45015 188474 312059 198412
17243 198412 456749 187252 16877 385959 498868 158846 123781 259820 -172077 324610
17232 271276 202754 475072 -33324 225771 40973 181166 138304 229654 285627 204088 154662
17221A54662k6056K79216I9872L25450j46881n3229q1096R061J27298J01838J02019
17210D84332B26530I2740K60271H1969L41539H2949D0044L97380j19910P9279
17200C96793A65783J74430o152J02391n8791j19395R8225j10705J34728J11618
17190D92132R0698j36598F1790K92820A22301N06989A16000K66693J8808K75251
17180F76752I7517K71787J00127j79488F6727K56685m0218n4553J87887A97774
17169A49669J81896j8561K30235P6621j16746o9665M1196j50814K82600J4541
17159F20972B31666K56904k21778K20695A95619J59392J47809B23698J63479j48418
17149B38759J18435K05182B57412r4944L41599L7878j74575K91630k52037l0755
$$ plain form
17221 154662 128606 407822 99872 425322 278441 225212 144116 153177 280475 382313 484332
17210 484332 226530 92740 353011 81969 423508 82949 40044 437424 317514 396793
17200 396793 165783 340213 334061 436452 377661 258266 356491 245786 380514 492132
17190 492132 582830 446232 61790 354610 122301 629290 116000 382693 401501 676752
17180 676752 97517 369304 469431 289943 66727 323412 283194 228641 416528 197774
17169 149669 331565 313004 543239 619860 503114 433449 474645 323831 606431 620972
17159 620972 231666 488570 266792 487487 195619 355011 502820 223698 387177 238759
17149 238759 357194 562376 257412 162468 504067 541945 367370 659000 406963 376208
17139C76208j50175A4154O02196L4115J06903k56184o0615q6609J74469Q5658
17129F14087A57990K58750M3157m7788J57685D986L66267j64140n2599J74856
17119C29370J62130L06561j27292C30402M01383l48618l673k0088n73K84925J1546
17108F55304P504k61589j83364M29650j89849R0833j88040J49849j93044N71757
17098H89011B00716J68808K9872L75955k83294m4855j64192J63076N3863j11781
17088C88168j12595M51847j11992J52325C42430K9548J97855B43460L8172K33852
17078E15484j57873J71640J08552p9587l3494m882M37966k53127J47048l79546
17068D72181O7173K8987p5689J47898l6259R6078j96784J84199Q7912J08157l74071
$$ plain form
17139 376208 226033 14154 616350 650465 757368 501184 440569 353960 528429 614087
17129 614087 157990 416740 459897 412109 569794 4986 371253 207113 154514 329370
17119 329370 491500 798061 670769 330402 731785 383167 379494 359406 358833 643758 655304
17108 655304 662808 401219 217855 647505 457656 548489 360449 510298 317254 889011
17098 889011 200716 369524 399396 775351 492057 447202 283010 446086 499949 388168
17088 388168 275573 727420 615428 767753 342430 371978 569833 243460 281632 515484
17078 515484 357611 529251 637803 558216 524722 519840 957806 704679 851727 472181
17068 472181 539354 568341 492652 640550 604291 700369 503585 687784 775696 883853 509782
17057E09782N93756n22316K1592J39871j39241L00537j33911k64085K64816j05537
17047F65264K08349R106j36680M3254k65149K70213K68925k95147K00365j19791
17037H48709m1103k45581n4487L47745l5044n6042Q2342C97929K37177O9505J62078
17026H66689m6027j01082r552j02049N14146j51970l21756J80808P2602m8411
17016H53398k47729L61445n6868K41048l9503m11222P3721J62742j74759M10362
17006A172635r0136J63138k16213J60932k25700J29444k65483K43633r7370R400
16996I84280n9016K39197j77636K48942R785j82439k84200K36859R8194k26915
16986H87051M29268j21821J27757m53347L41405q4123P6163n756P5867l4070K72261
$$ plain form
17057 509782 1103538 581222 602814 742685 603444 903981 770070 505985 770801 665264
17047 665264 873613 882719 746039 789293 524144 794357 1063282 768135 968500 848709
17037 848709 807606 562025 507538 855283 820239 764197 846539 397929 635106 704611 866689
17026 866689 820662 719580 710028 607979 1122125 970155 648399 829207 901809 853398
17016 853398 605669 967114 910246 1151294 1111791 700569 774290 937032 762273 1172635
17006 1172635 1082499 1245637 1029424 1190356 964656 1094100 828617 1072250 974880 984280
16996 984280 925264 1164461 986825 1235767 1245552 1063113 778913 1015772 1113966 887051
16986 887051 1316319 1194498 1322255 868908 1210313 1126190 1202353 1196597 1272464 1238394 1510655
16975A510655k51626k89250L76908M7231j00237O5998N5803j10126J65771j76995
16965A294132p6101O5888J38613O5891j29940j85128N17143j48243L73950j33760
16955A782445j31855j53013k7468j0853j1294R2507J90492o0101k23022O663L34691
16944A789192k52003L46836k76014J84616K84784j84559j97913l8016J15188K80687
16934B052798m62778L04400K87998j79984K55922k20041L09957l00903j41667
16925A905702J54461J38730l30420J4488L8659O16935l89315J98572J8994j72286
16915B194520J28289K18682p0693M4139K45187l6345l14305n9347L35959m30563
16905B255523O19325l19648K70676J34326o1314q9103k7645Q3451k59334L33836
$$ plain form
16975 1510655 1259029 969779 1346687 1393918 1293681 1359679 1415482 1305356 1471127 1294132
16965 1294132 1218031 1283919 1422532 1488423 1358483 1173355 1690498 1542255 1916205 1782445
16955 1782445 1650590 1497577 1470109 1459256 1447962 1540469 1730961 1670860 1447838 1454501 1789192
16944 1789192 1537189 1884025 1608011 1792627 2077411 1892852 1694939 1656923 1772111 2052798
16934 2052798 1590020 1894420 2182418 2002434 2258356 2038315 2348272 2047369 1905702
16925 1905702 2060163 2198893 1868473 1882961 1921620 2538555 2149240 2347812 2366806 2194520
16915 2194520 2322809 2541491 2470798 2514937 2760124 2723779 2409474 2350127 2686086 2255523
16905 2255523 2874848 2555200 2825876 2960202 2898888 2809785 2782140 2865591 2606257 2940093
16895B940093J09878j02479L05252j93732K49311J81963l03935O54088n08841
16886C331598K32932l53641J61414R9523L42675k61804J44875K90098N4556n0757
16876C991469R1322j55755N3540J66693r4804K50583K6919N6866L01014j63183
16866D524664L63148m46056L46684j20936K09749K0619J86219J75648l7629K18855
16856E440965j26418M44725J4140N4415J74694j40008J41148Q137L64328j94637
16846F181489q0071O27526j23202O46024n3930P7507N2347J58330j6575L97234
16836G866679L2166J71774K81655j04622L92330J93078o2473K73184N00261k59823
16826I284209N96441j0047P1342M30265M87559J34064J52308J28719K93510k4114
$$ plain form
16895 2940093 3049971 2947492 3252744 3059012 3308323 3490286 3186351 3840439 3331598
16886 3331598 3564530 3210889 3372303 3471826 3814501 3552697 3697572 3987670 4042226 3991469
16876 3991469 4082791 3927036 3980576 4147269 4052465 4303048 4329967 4386833 4687847 4524664
16866 4524664 4887812 4441756 4788440 4667504 4877253 4897872 5084091 5259739 5222110 5440965
16856 5440965 5314547 5759272 5773412 5827827 6002521 5862513 6003661 6011798 6376126 6181489
16846 6181489 6101418 6728944 6605742 7251766 7197836 7275343 7327690 7486020 7469445 7866679
16836 7866679 7898845 8070619 8352274 8247652 8639982 8833060 8770587 9043771 9544032 9284209
16826 9284209 9880650 9870603 9941945 10372210 10859769 10993833 11146141 11274860 11568370 11544256
16816A1544256M00161L79226P02475J94937J5695N30706L56423Q5905N66953L18578
16806A5095315K4018R69009P7406O05598L59086M19907J6143R49327L78921M61218
16796A9355948M18078N69282O13266Q70405L46202J034460M59353O74177O19784
16787B4960955O70512O06629O27092J062601N89968J149553P21656J044427P47364
16778C2180757R03607J098337Q71721R48123J485001J176050R51997J312020J114728
16769D2042341J595254J177134J329703J659672J436361J039084J510150J831675
16761E3621374K056110J434461J345176J787079K147691J469781J561999K153078
16753F7576749J563855K234954J632881J945143J885171J821716J993508K151028
$$ plain form
16816 11544256 11944417 12323643 13026118 13221055 13236750 13767456 14123879 14209784 14776737 15095315
16806 15095315 15119333 16088342 16165748 16771346 17130432 17550339 17566482 18515809 18894730 19355948
16796 19355948 19774026 20343308 20956574 21826979 22173181 23207641 23666994 24341171 24960955
16787 24960955 25631467 26238096 26865188 27927789 28517757 29667310 30388966 31433393 32180757
16778 32180757 33084364 34182701 35054422 36002545 37487546 38663596 39615593 40927613 42042341
16769 42042341 43637595 44814729 46144432 47804104 49240465 50279549 51789699 53621374
16761 53621374 55677484 57111945 58457121 60244200 62391891 63861672 65423671 67576749
16753 67576749 69140604 71375558 73008439 74953582 76838753 78660469 80653977 82805005
16745H2805005J510341J610733J474081K124894J284385J497977J452109J292758
16737I5052283J242255Q59187J068138Q12452N81229O28383K42931k75636k48582
16728I9962640k73895m35104q54520r66231j364810j067419j665307j451091j426439
16719I0457824k064375j781083j946974k118129j930972k075867k285587k349984
16711G3904853j627998k331095k059546k172269k425802j899713j761696j890385
16703E7736349j811936k188890j652015j514211j702139j636520j399928j388672
16695D4442038j735835j415677r09682j620879j117934j098218j181568q07491
16687C4554754j433468p20384j483746j45722j329064q10950q04308p63414q95217
$$ plain form
16745 82805005 84315346 85926079 87400160 89525054 90809439 92307416 93759525 95052283
16737 95052283 96294538 97153725 98221863 99034315 99615544 100243927 100486858 100211222 99962640
16728 99962640 99688745 99253641 98399121 97432890 96068080 95000661 93335354 91884263 90457824
16719 90457824 88393449 86612366 84665392 82547263 80616291 78540424 76254837 73904853
16711 73904853 72276855 69945760 67886214 65713945 63288143 61388430 59626734 57736349
16703 57736349 55924413 53735523 52083508 50569297 48867158 47230638 45830710 44442038
16695 44442038 42706203 41290526 40380844 38759965 37642031 36543813 35362245 34554754
16687 34554754 33121286 32400902 30917156 30771434 29442370 28631420 27827112 27063698 26168481
16678B6168481p82321p98767n43932m65051r15269m83085n83739o51411k77590
16669B0667316o66407n63421n91171m14981l28502n03541j62139o29321q1318
16660A6726515p15559k30116m83762r0569n30003j7518n84163m05782k34128p1451
16650A3363464l93161k44480l50608j9838n35702J81779p65710j47640j88942
16641A0899162k17884k42266o8322m68252K05486k38340k87900k30718J6961j19934
16631I247993l58777k47157J19812l61558j08419k07026K73068l96704O405j97026
16621G770611k16868j80010j02074l82597L92056l31384K2598m2263k85844K48951
16611F893176l32702j51464k56289K52153R9110n96771k0132m4662j48409J4242
$$ plain form
16678 26168481 25386160 24587393 24043461 23578410 22663141 22180056 21596317 20944906 20667316
16669 20667316 20000909 19437488 18846317 18431336 18102834 17599293 17437154 16807833 16726515
16660 16726515 16010956 15780840 15297078 15206509 14676506 14658988 14074825 13669043 13434915 13363464
16650 13363464 12970303 12725823 12375215 12355377 11819675 12001454 11235744 11088104 10899162
16641 10899162 10681278 10439012 10370690 9902438 10107924 9869584 9581684 9350966 9367927 9247993
16631 9247993 8889216 8642059 8761871 8400313 8291894 8084868 8357936 7961232 7967637 7770611
16621 7770611 7553743 7373733 7271659 6889062 7281118 6949734 6972332 6930069 6644225 6893176
16611 6893176 6560474 6409010 6152721 6404874 6503984 5907213 5887081 5842419 5694010 5708252
16601E708252j33172N0163l76908K7833K02814m76424J03455J43766l64203J46801
16591E032377k674j23157k26482J21010l28994J53763O1992j36400r8975N0795
16581D503255R4219j84267j64427l6687l05386J37885L6009q046j81807J05278
16571C996026k22871K56167l07038K38762J1948k48718k51697K64527j64372j41588
16561C431146K69592k6690l48373j31300J36491j68528J22846j19882J71379o1871
16551C274810p7762k38893J71945P6888l16987L76410k70080j0179J16368k02140
16541B900380j59489M14004l27467p735k10682R5952R2458J3253j58137r3950
16531B558587L83471m20537J05186j8963J88164Q291k23476n7808m8600K03780
$$ plain form
16601 5708252 5575080 5625243 5248335 5276168 5478982 5002558 5106013 5249779 4885576 5032377
16591 5032377 5029703 4906546 4680064 4801074 4472080 4625843 4687835 4551435 4452460 4503255
16581 4503255 4597474 4413207 4248780 4212093 3906707 4044592 4080601 4072555 3890748 3996026
16571 3996026 3773155 4029322 3722284 3961046 3972994 3724276 3472579 3737106 3572734 3431146
16561 3431146 3700738 3674048 3325675 3194375 3330866 3162338 3285184 3165302 3336681 3274810
16551 3274810 3197048 2958155 3130100 3206988 2890001 3266411 2996331 2986152 3102520 2900380
16541 2900380 2740891 3154895 2827428 2819693 2609011 2704963 2797421 2810674 2652537 2558587
16531 2558587 2942058 2521521 2626707 2607744 2795908 2804199 2580723 2522915 2474315 2678095
16521B678095L7981r3394k08563P5191k37783k8667j2376j5948J63329K22172
16511B580037l81804Q2496J03256l44114J68220J5851o2142L15542m13944K60661
16501B324059k94564J67246L20302l96794K67703n29869J00837o1744K95339n58547
16491A633968L85236J24069n0103k92936K2232L05582m1173j18152l8690J2223
16481A942256j20945j01890j28823L60471o9545J95769l21410k96173N05333k13182
16471A751861k2747k3599k0052p4528J36138J90473J07601m28551K7540O7005
16461A711141q2054N7930k4849k2250k91147M36570k35139N6322k43902P0886
16451A433508q1076P717M46485k73033k4850L8429m06141M43924n4491J99522
$$ plain form
16521 2678095 2716076 2622682 2414119 2489310 2251527 2222860 2210484 2194536 2357865 2580037
16511 2580037 2198233 2280729 2383985 2039871 2208091 2223942 2161800 2477342 2063398 2324059
16501 2324059 2029495 2196741 2517043 2120249 2387952 1858083 1958920 1897176 2192515 1633968
16491 1633968 2019204 2143273 2093170 1800234 1822466 2128048 2086875 1968723 1930033 1942256
16481 1942256 1821311 1719421 1590598 1951069 1881524 2077293 1755883 1459710 1965043 1751861
16471 1751861 1729114 1705515 1685463 1610935 1747073 1937546 2045147 1616596 1644136 1711141
16461 1711141 1629087 1687017 1662168 1639918 1348771 1785341 1550202 1606524 1362622 1433508
16451 1433508 1352432 1360149 1806634 1533601 1508751 1547180 1141039 1584963 1530472 1729994
16441A729994k11668j70360K68708k13116J00903R332j33877r1880J33617l1194
16431A390459K43512n20261L38888p0127J04119k62695J02889k8869p5913K61862
16421A483864J40199j73452r2707K10252l09290K05043j7499P6864j66943l84755
16411I71576K02297J13508j28551R958L4817N2191j95059K44303o0495O9710k05534
16400A108721k8208p034J8667J88544J61001j85458J48379k79474M02878q2970
16390A445046k62225j08661j82388L22595l6173K20111m12109J69214m1348K08445
16380A322507N6031k51346l850O6992J1191p4478p7513P5224K5381j84073N70778
16369A536844n59156K86195J1696j30269N2011J03859k43986J15465K6902p0126
$$ plain form
16441 1729994 1518326 1347966 1616674 1403558 1504461 1513793 1379916 1288036 1421653 1390459
16431 1390459 1633971 1113710 1452598 1382471 1486590 1223895 1326784 1297915 1222002 1483864
16421 1483864 1624063 1450611 1357904 1568156 1258866 1463909 1446410 1523274 1356331 971576
16411 971576 1173873 1287381 1158830 1168788 1203605 1255796 1060737 1305040 1244545 1314255 1108721
16400 1108721 1080513 1073479 1092146 1280690 1441691 1256233 1404612 1125138 1528016 1445046
16390 1445046 1182821 1074160 891772 1214367 1178194 1398305 986196 1155410 1114062 1322507
16380 1322507 1378538 1127192 1123342 1190334 1201525 1127047 1049534 1124758 1150139 966066 1536844
16369 1536844 977688 1263883 1275579 1145310 1197321 1301180 1057194 1172659 1199561 1129435
16359A129435J62465k54664j92961K29333n2505j8184j00415j98629K30981K74537
16349A209393l02762k5100j1726J33639J12070m01065M21237j47378j38604J27071
16339I76775R1232J03680l70197L88670j54414k97390J97791o7367L8487O9561
16329I76828O1309r9927J45759m7892l56779J00549K71110j49369L05968P404
16319A214960n62515L8018K34785j91952R297L23870l49370J25432n8889j66525
16309F17111J56610j00507J47115p720j68319J30836k32953L7783K47694J50579
16299I78229j86657p7372k9168j18966K28545J61539j39966R9484J44946m28659
16289F31955q0488K83514k26476L08085l39380K21481k64931R8404L11926J64645
$$ plain form
16359 1129435 1291900 1037236 844275 1073608 1021103 1002919 902504 703875 934856 1209393
16349 1209393 906631 881531 869805 1003444 1115514 714449 1135686 988308 849704 976775
16339 976775 1068007 1171687 801490 1190160 1035746 738356 936147 868780 907267 976828
16329 976828 1038137 938210 1083969 1036077 679298 779847 1050957 901588 1207556 1214960
16319 1214960 652445 690463 925248 733296 742593 1066463 717093 842525 783636 617111
16309 617111 773721 673214 820329 812609 644290 775126 542173 579956 827650 978229
16299 978229 791572 714200 685032 566066 794611 956150 816184 915668 1060614 631955
16289 631955 551467 834981 608505 916590 577210 798691 533760 632164 944090 1108735
16279A108735m33787k63333J74567Q3053j5947A86737P43596j13131C92323J45265
16269E37588m5945L11710j94544k2816J25188C36296M92362k28306L82126k28184
16259G54294Q0963l35395K00388K9142N9470N6675j61993l4697k8187M42746D25690
16247E11109R0162N9986j53114L68073l8954l81962k8465L88789o1330j06033
16237F48261n6315p6462J43316j5353k1220A20699J51891L22868J04460j15666
16227E84252J9777j36816j44592K54717j60630j3541K2302j2214M4209r1138K62270
16216F28596N7197k28251r7505L04291k28532R4996j9748O2872r1097M0212K28217
16205G51248l39142k8760j3958j22580N03513l20018J83030j67052K20331k991
$$ plain form
16279 1108735 674948 411615 586182 669235 653288 186737 930333 817202 392323 537588
16269 537588 491643 803353 608809 585993 711181 336296 828658 600352 982478 754294
16259 754294 835257 499862 700250 729392 788862 845537 683544 648847 620660 1063406 425690
16247 511109 601271 661257 508143 876216 837262 455300 426835 815624 754294 648261
16237 648261 591946 515484 658800 643447 622227 120699 272590 595458 699918 584252
16227 584252 604029 467213 322621 577338 416708 403167 425469 413255 457464 366326 628596
16216 628596 685793 457542 360037 664328 435796 530792 511044 573916 482819 523031 751248
16205 751248 412106 383346 369388 246808 750321 430303 613333 446281 666612 663621
16195F63621C11046K67216k13086J20350L16750C04281L46557C12852K4103J67104
16185E04059J44051l09386Q6311O9523j93014D207K37465J80591K03439k39069
16175C86633R4250B31825O55193k69833k44119K08214q8411j4A25800l5035K10485
16164C01250J73801k05420J63029J8434A59441K02699L76575o1471B22984K3793
16154B46777J15647m4700K65572l438O3792A88649K23243j58480K35811k00531
16144B88692J32733J40664j34415A23634M72761A75821M2831Q4685P2711j12431
16134B63617j21093L1378F6446M33290j10408A89050b4745B83479d4397H7658
16123B03457K40726j32737L8014j23069b5045A35733r99N1987F0085J65743K58758
$$ plain form
16195 663621 311046 578262 365176 485526 802276 304281 650838 312852 336955 504059
16185 504059 648110 338724 425035 494558 301544 4207 241672 422263 625702 386633
16175 386633 480883 231825 887018 617185 373066 581280 492869 492855 125800 90765 301250
16164 301250 475051 269631 432660 451094 159441 362140 738715 677244 222984 246777
16154 246777 362424 317724 583296 579858 643650 188649 411892 253412 489223 288692
16144 288692 421425 562089 427674 123634 596395 175821 218652 303337 376048 263617
16134 263617 142524 173902 66446 499736 389328 189050 -24745 283479 -44397 87658
16123 203457 444183 311446 349460 226391 -25045 135733 134734 186721 60085 225828 484586
16112D84586A44923K23163k9510n9823J91224f2050B04921J02623D5257a35769
16101C31432A60440L41227A69620J7469h3580H9148N0806J22726r4957J67384
16091C35107m8276M3621L54770B90305j8778A29688L04587j63311q5506j5722
16081A69736D0705J02520N1867m510q6304K58116b11396d194A72880J07907O7417
16070C48204n2357p8833J61118p3696r7978K63240j28892j34850J44995A61922
16059A85838p6397J3226L02136j75297j18761c6508F2473L89449G0310a04001
16048A27479b04529D25066k11088J14121J629E1535j57O3992J23343j741A05571
16036C5422C435a01352B77829c28624f9466D0691L23051A77028h9556b8108B55745
$$ plain form
16112 484586 144923 368086 338576 278753 469977 -62050 204921 307544 45257 -135769
16101 331432 160440 501667 169620 187089 -83580 89148 139954 262680 167723 335107
16091 335107 286831 330452 685222 290305 271527 129688 434275 270964 185458 169736
16081 169736 40705 143225 195092 190582 104278 362394 -211396 -4194 172880 280787 348204
16070 348204 295847 217014 378132 304436 206458 469698 340806 205956 350951 161922
16059 185838 109441 122667 424803 249506 130745 -36508 62473 451922 70310 -104001
16048 127479 -204529 425066 213978 328099 329728 51535 51378 115370 238713 236972 105571
16036 35422 3435 -101352 277829 -328624 -69466 40691 363742 177028 -89556 -28108 255745
16024g3697g225A53673Q9002p2382e9818A13774J55782D6754K0284j0092K32073
16013B89019b22075A38605K40309A5058B868L28527Q8139c7840A78306m4034a3502
16001B06134q3572K65312i735G0807h1365B75422e955C03847e3372C08475i9829
15989A41386J10686l379P4565K5750J6297p2965r0752K26498o9466j52361r8036
15978A08223J18001K48338H9145J67443r9314C6341a66568C57971b82546A89577
15967D0686r857J74981k2139r1673e828j24285L0629B18352j04093a49378F4281
15955h3242J2868B10144H8911c19956H2489l8123K3689h3995r4876A60376P5571
15944B35947e725n4688A53664d0590A02740L5375N5387J0896b95320H20K56381
$$ plain form
16024 -73697 -7225 153673 242675 170293 -59818 113774 269556 46754 67038 56946 289019
16013 289019 -222075 138605 378914 15058 2868 331395 419534 -37840 178306 134272 -13502
16001 206134 122562 387874 -9735 70807 -81365 275422 -5955 303847 -53372 308475 -99829
15989 141386 252072 248693 323258 349008 365305 292340 201588 428086 358620 206259 108223
15978 108223 226224 474562 89145 256588 157274 36341 -166568 357971 -282546 189577
15967 40686 30829 205810 183671 91998 -5828 -130113 -99484 218352 114259 -149378 64281
15955 -83242 -70374 210144 88911 -319956 82489 44366 68055 -83995 -178871 160376 235947
15944 235947 -5725 -60413 153664 -40590 102740 138115 193502 204398 -295320 820 257201
15933B57201d2296J4894l73580H5816M6047b24339P2787A84927a20808A15358
15922G901J93417k7713p9618J9128l7897D388b48740B68913a09739b8588G0277
15910G9174B472J32557R3896M6929G661L56657e4334n4153A41207k5972c8251
15898B03390b42652B8000o460J7527g4935j35097C45893H9892K00039a80781C70919
15886B05789a95369N2629O5981K2061K0339A60430M001h9312B01422h9019p283
15875i6302B6374J32661c53168B742J82830j7613J13808A1622b66451a16035H1236
15863h8875n0437C62545C8004M652J57277Q7166j40769b9767k8883D1817b71800
15851b08055K5679H7963K6570K24023a27654B56099a59151M1367l8778B18543
$$ plain form
15933 257201 -42296 -27402 -400982 85816 131863 -224339 -151552 184927 -120808 115358
15922 7901 201318 173605 93987 113115 75218 4388 -248740 268913 -109739 -28588 70277
15910 79174 2472 135029 228925 275854 7661 364318 -54334 -108487 141207 115235 -38251
15898 203390 -242652 28000 21540 39067 -74935 -210032 345893 89892 289931 -180781 370919
15886 205789 -195369 -142740 -76759 -54698 -34359 160430 164431 -89312 201422 -89019 -96302
15875 -96302 26374 159035 -353168 2742 185572 167959 281767 11622 -266451 -116035 81236
15863 -88875 -139312 362545 38004 42656 199933 287099 146330 -29767 -58650 41817 -271800
15851 -208055 -182376 87963 114533 338556 -127654 256099 -159151 -117784 -156562 218543
15840B08779b23189b2099q1636I2413c9497q4983J5501A07156m1535L2294b59242
15828C98905c2772m06680a3586l11172h4734L1982G5966c7983A67721A4232a20043
15816a9949H531b2145j01457j04987A37456J93921G5503b36809j07438h3403A42163
15804B50492a53054j48087e0389F2835Q682e8159A16822b5783n7294j6511E1403
15792d28617Q1371B913J55306B2977J45678E7983a43830n257f7654D0525I220
15780d531r2335L0445j65803b6004j84484B73583a1928q446A77116i5009D49710
15768f7589A1265a18332d7995b3403j01583k1671F7722c28214A04380D9235c325
15756f0873A61561p6834C4725a5956A47853a7779A58525a06985q6043i5162K9068
$$ plain form
15840 208779 -223189 -22099 -103735 92413 -39497 -124480 -108979 107156 65621 97915 -259242
15828 398905 -32772 -439452 -13586 -324758 -84734 -52752 75966 -37983 167721 14232 -120043
15816 -19949 8531 -22145 -123602 -228589 137456 331377 75503 -236809 -344247 -83403 142163
15804 250492 -153054 -301141 -50389 62835 71517 -58159 116822 -25783 -83077 -99588 51403
15792 -428617 -347246 2913 158219 22977 168655 57983 -143830 -149087 -67654 40525 9220
15780 -4531 -96866 -66421 -232224 -26004 -210488 273583 -11928 -20374 177116 -95009 449710
15768 -67589 11265 -118332 -47995 -23403 -124986 -146657 67722 -328214 104380 49235 -3325
15756 -60873 161561 84727 34725 -15956 147853 -17779 158525 -106985 -193028 -95162 -66094
15745f6094A17832J91864b2534B31575j02095a30869M3196C39336b61204a18604
15734a61855L3988p1182B38077A4771a07913j90189A20235J44844a32224J7247
15724a14977A62067J3844a51560F2696L5602K41250b49985a24888R346A36528
15713F3007B9268B732J81753p0678a86379g1937B01680a368j89538a7334B84444
15701a00095p3641F7909a5268l3116A69385i7046l5830D3533K24644j04939a2289
15689c8673A39448D4938J28852n8476a0456j3787F54a05982B19435N575D5967
15677I4128A6517K19112c43772H9681a12362j13633G290M4695L3752a59917B21252
15665b49646a02232l3322p5985A08180d1525j96406R7824A28025a43135A27357
$$ plain form
15745 -66094 117832 309696 -22534 231575 129480 -130869 -87673 339336 -261204 -118604
15734 -161855 -127867 -199049 238077 14771 -107913 -298102 120235 265079 -132224 -114977
15724 -114977 162067 175911 -151560 62696 98298 339548 -249985 -124888 -115542 136528
15713 63007 29268 2732 184485 113807 -186379 -71937 201680 -1368 -190906 -17334 284444
15701 -100095 -173736 67909 -15268 -48384 169385 -97046 -132876 43533 268177 163238 -12289
15689 -38673 139448 44938 173790 115314 -10456 -24243 654 -105982 219435 225010 45967
15677 94128 16517 235629 -343772 89681 -112362 -225995 7290 51985 85737 -159917 221252
15665 -249646 -102232 -135554 -211539 108180 -41525 -237931 -140107 128025 -143135 127357
15654A86078a81705b9983j33447q5170g2485B69175a98828f9004J3581q7719E2482
15642A84203d32011A5415b40926H5068l767k1219J5936g3983A26552b84064A57253
15630c5671I8173J04351p5934O9666a55597l1228B4618b29396J07895a1491k34368
15619b45859d0567k80657i17m37010A67258g4337O368r6725j1633B81797d22115
15607C44587c040q2125A7811J34759k897b45165A06578c1398j75729j02553D5593
15595a16075B29214a25200B3598b03686B89218a32190B97243a31358A64771b8218
15584G6286J75195a67070H5865b58085Q2200M0432L2170B90157b2183p2261A151
15572a84943A33050b80399a4862A16039b58334I9482M6242E2443d0323E5076a69483
$$ plain form
15654 186078 -181705 -29983 -163430 -248600 -72485 269175 -198828 -69004 -55423 -143142 52482
15642 184203 -432011 15415 -240926 85068 81301 60082 76018 -73983 126552 -284064 157253
15630 -35671 98173 202524 126590 196256 -155597 -186825 24618 -229396 -121501 -11491 -245859
15619 -245859 -40567 -321224 -917 -437927 167258 -74337 -67969 -164694 -176327 281797 -422115
15607 344587 -3040 -85165 17811 152570 149673 -245165 106578 -31398 -207127 -309680 45593
15595 -116075 229214 -125200 23598 -203686 289218 -132190 297243 -131358 164771 -28218
15584 76286 251481 -167070 85865 -258085 -175885 -135453 -103283 290157 -22183 -94444 1151
15572 -184943 133050 -280399 -14862 116039 -258334 99482 145724 52443 -40323 55076 -169483
15560f7955o2705O3273A21236a26388L7578M3995m8263d5289A07634K7709g2496
15548e3183B00180a6471j59314A95688b01977A44870E2431L6086K95139H5739
15537B1770g7638A36437O4156J04275l8880i5534A94950a20130e8018E4310J27381
15526A81691d7899A76200b68726M3722f8582D1766a8502q7791A60976J57092D8101
15514A75236d74467a04092O589j3834f062m14592D7296a15650D1293c01736f7146
15502b0936k9397A03502b129A31136a3911B71343G3781d2938I0992J11309k7944
15491A74357a52109k5145A0456J9285Q3779b1574f618o762A70036G9781f7428
15479a98250A79584I169K02944b72728a07686n2111G2537j8210K76540f5935m0454
$$ plain form
15560 -67955 -130660 -67387 121236 -126388 -88810 -44815 -93078 -45289 107634 135343 -72496
15548 -53183 200180 -16471 -175785 195688 -201977 144870 52431 88517 383656 85739
15537 21770 -77638 136437 200593 304868 265988 -95534 194950 -120130 -58018 54310 181691
15526 181691 -47899 176200 -268726 -225004 -68582 41766 -18502 -106293 160976 318068 48101
15514 175236 -474467 -104092 -97503 -111337 -6062 -420654 47296 -115650 41293 -301736 -67146
15502 -20936 -50333 103502 -2129 131136 -13911 271343 73781 -42938 90992 202301 174357
15491 174357 -152109 -177254 10456 29741 113520 -21574 -6618 -13380 170036 79781 -67428
15479 -198250 179584 9169 212113 -272728 -107686 -159797 72537 54327 330867 -65935 -106389
15468a06389k29076B8701a7488A70008F3a84260o7896c1096o638K020o2354n610
15456a03678k9660G1433b4219B3554R3048N620e4561A1262a73260C7480d2092
15444B10538g7895C57440c87804C73127b9504B42041J550A19222k3265a30351
15433A27121c5714l4443J7909K3348G3149b80287f5826j60607B45964e0344m5136
15422i5480A47954b95417m8058f0439r2763G905J45741c587H5080a73860A38383
15410A21956m1891c5800j50669R2322n5837A1591h7098F1369a66099e3821k37728
15399b91549a43832j32001E9771K4551M2206h2080B50831C8097g9335n9926O0802
15388g8459A70320e840k1152C11314a9255B8147L5656O2468b48105F7252K9669
$$ plain form
15468 -106389 -335465 28701 -17488 170008 63 -184260 -252156 -31096 -37734 -35714 -98068 -103678
15456 -103678 -133338 71433 -24219 23554 116602 122222 -54561 11262 -173260 37480 -42092
15444 210538 -77895 357440 -387804 373127 -29504 242041 243591 119222 95957 -130351
15433 127121 -35714 -70157 -52248 -28900 73149 -280287 -65826 -226433 245964 -50344 -95480
15422 -95480 147954 -295417 -343475 -60439 -153202 7905 153646 -3587 85080 -173860 138383
15410 121956 80065 -35800 -186469 -94147 -149984 11591 -87098 61369 -166099 -53821 -291549
15399 -291549 -143832 -275833 59771 84322 126528 -82080 250831 38097 -79335 -139261 -78459
15388 -78459 170320 -5840 -26992 311314 -19255 28147 63803 126271 -248105 67252 96921
15377I6921O6918D1541J62325c2624B8519J39264l8169A7699K67714a27366c1430
15365E5101K35811a6222o7237E9914J70575b19264B07376q3608b47883D2611A7081
15353B58795a23084D6424J28244c850j67332d9336l6186A65153F3252K00412j08070
15342A55594a16863A33577d9067F8172h671j26796A0279K5949J5421h664j30382
15331a39046a2465E6267K86985J84928k61483H7535J53798B9822a1051k05848
15321b16899f3043D5425J45386H1708j3118a98796A77110O6884E0779K76836j33241
15310A94374i4596F3845a75777C49041A4881J44035l7796J71908m2098b16754
15299A70914A5723b88872R2265d9719j69062e614C3507L35343B1239a93733A08861
$$ plain form
15377 96921 163839 41541 203866 -32624 28519 167783 129614 17699 285413 -127366 -31430
15365 55101 290912 -16222 -83459 59914 230489 -219264 207376 123768 -247883 42611 17081
15353 258795 -123084 46424 174668 -3850 -171182 -49336 -85522 165153 63252 263664 155594
15342 155594 -116863 133577 -49067 68172 -8671 -135467 10279 36228 51649 -8664 -139046
15331 -139046 -12465 56267 343252 528180 266697 87535 241333 29822 -11051 -216899
15321 -216899 -63043 45425 190811 81708 68590 -198796 177110 243994 50779 327615 194374
15310 194374 -94596 63845 -175777 349041 14881 158916 121120 293028 250930 -216754
15299 170914 15723 -288872 -196607 -49719 -218781 -5614 33507 368850 21239 -193733 108861
15287B36515H8420b303D1754i2712A05249b08009i0734I8795g4215B3717g8607
15275d1546a1996H3629K4563j7046c7497J983A55596B0313J57152J52280E9301
15263d2887A91844B9220i7850M1575C63799B6822K46164P0831m6856Q8649n2014
15252C33596J65428j8188J50999J33695N2369J66703k31332l24639A47986G2264
15241d5958C91928A39465m0117J25894H4358N88972a97429r5468E42244a21690
15230A61788k6336M6838i454B03404a7864j8277A76184M3803a8981l6297O994
15219d8284f627A6643c28310A18377d8740J5045I5878K77885f8769A21606m6661
15208G4945a32982B8435c12889D2368g5038A64425b81932a09339H1525J2801J05079
$$ plain form
15287 236515 88420 -2303 41754 -92712 105249 -208009 -90734 98795 -74215 23717 -78607
15275 -41546 -11996 83629 108192 91146 -37497 -35514 155596 20313 177465 329745 59301
15263 -42887 191844 29220 -97850 -56275 363799 26822 272986 343817 296961 385610 333596
15252 333596 499024 480836 631835 765530 817899 984602 753270 428631 147986 72264
15241 -45958 391928 139465 99348 225242 84358 673330 -197429 -292897 542244 -121690
15230 161788 135452 182290 -9454 203404 -17864 -36141 176184 219987 -18981 -55278 -48284
15219 -48284 -6627 16643 -328310 118377 -48740 -33695 95878 373763 -68769 121606 74945
15208 74945 -132982 28435 -312889 42368 -75038 164425 -281932 -109339 81525 94326 199405
15197A99405a33689B2115O1519b09800A8868a54711A60004n9931h1741j7240j19369
15186b18350H6798d2521r8636B30045a01640E4975a9013H4259g9188A63410E6948
15174A46552h2589B0410b33710J04348A45725G605b9703C81795a56394G3486L34241
15163D07727E7194a19449A87023D9842b4666j02806A69927d4242A02543i124E1723
15151B77261k0335g0099B30475c2873C92692j0912a71157f0821B80676j38912
15141A41764c7655G8365N0984O9991D0977j9061K91064C0644J78459D9650K92268
15130C41918j66682b8280q2085B60198A6250J921a00563C42269J3247i9831I8815
15118C31038j43157N6288F9187J72539b12222d1699A36125R1835A03601J49950
$$ plain form
15197 199405 -133689 22115 83634 -209800 18868 -154711 160004 100073 -81741 -98981 -218350
15186 -218350 86798 -42521 -141157 230045 -101640 54975 -19013 84259 -79188 163410 56948
15174 146552 -82589 20410 -233710 -129362 145725 7605 -29703 381795 -156394 73486 407727
15163 407727 57194 -119449 187023 49842 -24666 -127472 169927 -44242 102543 -9124 51723
15151 277261 256926 -70099 230475 -32873 392692 381780 -171157 -60821 280676 141764
15141 141764 -37655 78365 129349 199340 40977 21916 312980 30644 209103 49650 341918
15130 341918 175236 -28280 -110365 260198 16250 18171 -100563 342269 355516 -99831 98815
15118 331038 187881 244169 69187 241726 -212222 -41699 136125 227960 103601 253551
15108B53551F2959J17720M8513A5160K09580K22679h1460B01895i5279C43619
15097D3954K8194K3794J68478G6487a0096G6841K41052H9929K11032A33368k8796
15086A04572M5729P8913b8793B9215b0004D3160J10167j5215J91919b66522A95479
15074F3923K8963J05104L61112A33532M7580n465A4442K62631j36473m1841h3196
15062a2977A64074J07247j19485c6019A38549J64685i3568B55284D3539L27931
15052C71470l385A0818K26812G8908L06461a7310D5922a0746A25915J50205k5039
15041B51081j21635K25923A60169J85216a21095D69370B22480J69031j57129j17010
15031A17372K05625J18216A97357m5957J95936j6825j62553E2658J51924J53988
$$ plain form
15108 253551 62959 180679 229192 15160 224740 447419 -81460 201895 -95279 343619
15097 43954 72148 95942 264420 76487 -10096 76841 317893 89929 300961 133368 104572
15086 104572 150301 229214 -28793 29215 -20004 43160 153327 138112 330031 -266522 195479
15074 63923 92886 197990 559102 133532 181112 175647 14442 277073 140600 98759 -83196
15062 -12977 164074 271321 151836 -36019 138549 303234 -93568 255284 43539 371470
15052 371470 368085 10818 237630 78908 385369 -17310 45922 -10746 125915 276120 251081
15041 251081 129446 355369 160169 345385 -121095 469370 222480 391511 234382 117372
15031 117372 322997 441213 197357 151400 347336 330511 167958 52658 204582 358570
15021C58570A65283J15154k9646n0335N7226K18195A91548P9413m3744C0179J90925
15010B21104L19006B58964P3459H5592K98481I8440J24472J13517I3184K03413
15000B96597A32566K43211P0575A93888B9089L05505j47458K26162e6350C62303
14989C21928Q5903J65027B06424p573c0208C12729O2378A87092J85468r4089J59089
14978D37560J62260A17691M62694k65252n1377C0315K66122n8452K1702J56912
14968D16599j11383K61580A35017K55672j64448J57233I0373L16745E4012L99960
14958D53972B23054J3061K66647B46387J85174A61992J08100j14975O3242c9194
14947B56854J72300N2203B32604j12911J26628O9305M0090r3380K1162J01276
$$ plain form
15021 358570 165283 280437 250791 200456 257682 475877 191548 270961 227217 30179 221104
15010 221104 540110 258964 332423 85592 384073 98440 222912 336429 93184 296597
15000 296597 132566 375777 446352 193888 29089 334594 187136 413298 -56350 362303
14989 321928 407831 572858 206424 198851 -30208 312729 375107 187092 372560 278471 437560
14978 437560 599820 117691 580385 315133 263756 30315 296437 237985 259687 416599
14968 416599 305216 566796 135017 390689 226241 383474 90373 407118 54012 453972
14958 453972 223054 236115 502762 246387 431561 161992 270092 155117 218359 -39194
14947 256854 429154 481357 232604 119693 246321 315626 355716 262336 283498 384774
14937C84774K9501j4451m0685J50969A12388J47611N02283k79135j67813K67900
14927E83234j64905l3044r2948L60749j81662o6129J38574B68976N39240k63155
14917E45061K5551r7583L69997l02766K60830k79764L8425J68020l11207p7568
14907C38996J72683f7776B85068J57370A46785K89089k08044K22206q0025L21532
14897F91543l11412j3041K4593J45888A88147j4502K65078m1277k2Q754L86450
14886G92628C86566J53595j45250q5634J44372J907j56908K04645j5727M264B25206
14874D02108O6379A29998K20347A40155L28793r138Q9603l6715l3107K00367A99480
14862E79570P2773j15458o507k16173L71349j97095E4905J55246J43602K79151
$$ plain form
14937 384774 414275 399824 359139 510108 112388 259999 762282 483147 315334 583234
14927 583234 418329 385285 292337 653086 471424 405295 543869 268976 808216 545061
14917 545061 570612 473029 843026 540260 801090 521326 559751 727771 416564 338996
14907 338996 511679 -67776 285068 442438 146785 435874 227830 450036 370011 691543
14897 691543 380131 367090 391683 537571 188147 173645 438723 397446 397424 406178 792628
14886 792628 386566 540161 394911 309277 453649 455556 298648 503293 487566 491830 225206
14874 402108 468487 129998 350345 140155 468948 459810 549413 512698 479591 679958 199480
14862 579570 652343 536885 530378 314205 685554 488459 54905 210151 353753 632904
14852F32904B29944Q3090K94989o8992k24522O7442J5816m3716n6702J67607m9970
14841D14986J75626j53264J61948k00348K01889j824j75155L55130J76145C33423
14830E85664F6562M82093k7429P6870j94101r8870L92893C39707K24418j27676
14820D36449j3785J85312p3901q4498J08469P1558k23237M27907k00949k41052
14810C92273j02316K02485m776L38530l45110J62507k20900O4513o5157J7445
14800D39494r0612L64404o1025j15031k14493K55496j02196k13670J73369J4563
14790D50299o4201J67851m1513B24228J15050K42545R7462l39139J5421K32144
14780E87711N5827k44766K44708K28999l00399J03774m0907j74094J53072R2323
$$ plain form
14852 632904 229944 313034 608023 539031 314509 381951 397767 354051 297349 464956 414986
14841 414986 590612 437348 599296 398948 600837 599013 423858 778988 955133 333423
14830 585664 66562 548655 521226 598096 403995 305125 698018 339707 564125 436449
14820 436449 422664 607976 534075 449577 558046 629604 406367 834274 633325 392273
14810 392273 289957 492442 487666 826196 481086 643593 422693 487206 422049 439494
14800 439494 348882 713286 652261 537230 322737 578233 476037 262367 435736 450299
14790 450299 386098 553949 512436 224228 339278 581823 679285 340146 355567 587711
14780 587711 643538 398772 643480 872479 572080 675854 634947 460853 613925 706248
14770G06248j72192o355K04793j84985Q0180M9852j96430j90192M98140C21327
14759E38881B22110M31521j77805L69482k38301K3836k87295L60394J213o5218
14749F39937j01203p3764R6804J33715Q2781j75330J39746j80660J73882J36366
14739H72274r7305l45874K81252l5161l3703j20343M3466L94751m8409k27447
14729F83501R7948M0852D03152J55080K57087M984k51188K36502M2780K11982
14719A060379k77007p983R6860j38469J91344P174k39308J47482J36478l25930
14709F51020J21706j9596m714o0762Q7097J8495R539K61719k77594J15952L7900
14698I40762k13599m5924L90137N7777j14441k99789l5862K39675o8712l42188
$$ plain form
14770 706248 534056 527701 732494 547509 627689 677541 481111 290919 789059 321327
14759 538881 222110 653631 475826 845308 607007 630843 343548 703942 705155 639937
14749 639937 538734 464970 561774 695489 778270 602940 742686 562026 735908 872274
14739 872274 774969 429095 710347 675186 641483 521140 564606 959357 910948 683501
14729 683501 781449 822301 403152 558232 815319 820303 569115 805617 848397 1060379
14719 1060379 783372 775389 872249 733780 925124 932298 692990 840472 976950 651020
14709 651020 772726 753130 748416 687654 774751 793246 802785 1064504 786910 902862 940762
14698 940762 727163 681239 1071376 1129153 1014712 714923 679061 918736 850024 507836
14688E07836J18876J47793K76703l52926J46412p2026L07587K493J4379j87615
14678I09512M6001l8198j61497K30081j16851k78072N54064m94782K81535k0563
14668I11230k04188K00119j77752M64906k4595n27750N89815l40280J73456j75905
14658H89056K69669j40658K29381l17096j03516R9068l4220K16610k47806L97915
14648A258403l27948K84735l28772K69288j9190J7913r1681K61177k42802R9832
14638A180955J21819n4584j83688J74508Q773J00452l85534M3738J28811M953
14628A140203j31084M82569l52748J16917O9366r3660K18416k07501M236k4029
14618A222685K8884r5319M22792j5121l33102r5678J83413q169J73915m6176K40493
$$ plain form
14688 507836 626712 774505 1051208 698282 844694 772668 1080255 1082748 1097127 909512
14678 909512 955513 917315 755818 985899 869048 590976 1145040 650258 931793 911230
14668 911230 707042 907161 729409 1194315 1169720 641970 1231785 891505 1064961 889056
14658 889056 1158725 1018067 1247448 930352 826836 925904 891684 1108294 860488 1258403
14648 1258403 930455 1215190 886418 1155706 1136516 1154429 1062748 1323925 1081123 1180955
14638 1180955 1302774 1248190 1064502 1239010 1247783 1348235 962701 1006439 1135250 1140203
14628 1140203 1009119 1491688 1138940 1255857 1325223 1231563 1449979 1242478 1246714 1222685
14618 1222685 1251569 1156250 1579042 1563921 1230819 1135141 1318554 1310385 1484300 1438124 1678617
14607A678617k72204M502J56367J9679K69429k85181J35091k38562K04244j51564
14597A520418M10489k68466j64408P1014J83802J00463j50724P4220K17983l85801
14587A608990L83115j05625J36447p8922p6230L34842O4537m42142M27913l22692
14577A930233K64743K93179K28473j58329l89301M52839l4919J5308j0622N38178
14567C129782R0077P0496N0398k2561J21432K25379o3903K30909L04664j80150
14557C956523M87200K05071r3430N61709O96814M93617P19222J381110K036902
14548A0444738K460779L268168K925390n42041m958893n869906l508937j488486
14540B730812l75423n52913K36167J71382k14921J70463k94848M79074p1559j21110
$$ plain form
14607 1678617 1406413 1410915 1567282 1586961 1856390 1571209 1706300 1467738 1671982 1520418
14597 1520418 1930907 1662441 1498033 1569047 1752849 1853312 1702588 1776808 1994791 1608990
14587 1608990 1992105 1886480 2022927 1944005 1867775 2202617 2267154 1825012 2252925 1930233
14577 1930233 2194976 2488155 2716628 2558299 2168998 2621837 2586918 2602226 2591604 3129782
14567 3129782 3219859 3290355 3340753 3318192 3439624 3665003 3601100 3832009 4136673 3956523
14557 3956523 4443723 4648794 4555364 5117073 5813887 6307504 7026726 8407836 10444738
14548 10444738 12905517 16173685 19099075 18557034 13598141 7728235 4219298 2730812
14540 2730812 2355389 1802476 2038643 2210025 1995104 2165567 1870719 2349793 2278234 2157124
14530B157124J75811k47427M5276L1974L64430m29228L19661m0276r8731j31650
14520B146964K22285J91617m3445k60962L14435M3123M6524O6863k29804L06375
14510B803975J9533N7080j62567K07898q6611K7447M1481J70069q6361J1957j19034
14499B884867J73434J50931j39992k28236L95701L5999J12112J59069k62410M7363
14489C328838J33550L05238j39251j78168R4809J32805O5067l29742K22807J13735
14479C749688O7815M90067l79503n088n2605O0470J39222M24998m58757K36964
14469D273271K7358j45166M8244J86008M60376k23003J08092m5578N8287J93574
14459D941463k49447O2493M37099m00385K89176J42287P3700q6899o3882K79831
$$ plain form
14530 2157124 2332935 2085508 2130784 2162758 2527188 2097960 2417621 2377345 2278614 2146964
14520 2146964 2369249 2560866 2517421 2256459 2570894 2614017 2660541 2727404 2497600 2803975
14510 2803975 2823508 2880588 2718021 2925919 2839308 2866755 2908236 3078305 2991944 3003901 2884867
14499 2884867 3058301 3209232 3069240 2841004 3236705 3272704 3384816 3543885 3281475 3328838
14489 3328838 3462388 3767626 3628375 3450207 3545016 3677821 3742888 3413146 3635953 3749688
14479 3749688 3817503 4307570 3928067 3922979 3870374 3930844 4070066 4495064 4036307 4273271
14469 4273271 4300629 4155463 4203707 4389715 4850091 4627088 4735180 4689602 4747889 4941463
14459 4941463 4692016 4754509 5191608 4791223 5080399 5222686 5296386 5209487 5145605 5425436
14449E425436J51684j79482K715K78648k27025M42250j72139N39923k71417J47531
14439F138124o4592L5123J13077J80340K62709K07531j58696j10075M10587j09163
14429F904965J40039M05892j07528K03376l75085J55860L94998J29589J00415
14420G952521L52250k26166Q8732K23992J21338M27699j60894M08377M3557j00097
14410I131309M28732m5277J48486K44225R9394N1418L27172M2749L41635O2287
14400A0832130L53779J30120N5273M22762J88921J28297L6078L86675M93550j11559
14390A2916026P91692m8570R6290L84641J98229N09037J59648K37767M98381K9892
14380A5773033N43577L30907M64737M15052K27383L91723N99791K8669O90105
$$ plain form
14449 5425436 5577120 5397638 5400353 5679001 5451976 5894226 5722087 6262010 5990593 6138124
14439 6138124 6073532 6108655 6221732 6402072 6664781 6872312 6713616 6603541 7014128 6904965
14429 6904965 7045004 7450896 7343368 7546744 7171659 7327519 7722517 7852106 7952521
14420 7952521 8304771 8078605 8167337 8391329 8512667 8940366 8779472 9187849 9231406 9131309
14410 9131309 9560041 9514764 9663250 9907475 10006869 10058287 10385459 10428208 10769843 10832130
14400 10832130 11185909 11316029 11371302 11794064 11982985 12111282 12147360 12534035 13027585 12916026
14390 12916026 13707718 13659148 13755438 14140079 14338308 14847345 15006993 15244760 15743141 15773033
14380 15773033 16316610 16647517 17112254 17527306 17754689 18146412 18746203 18774872 19464977
14371A9464977N92611K89148L54863O11235N71925M05830L55682P62567O18470
14362B4027308P29851M85269L46218R71829N40217P47822J136850K48695J094819
14353C0328878R86899P36175Q77853O43230J059942Q97825R00981J252688J177455
14344C8861926J228920R93755J330112J452242R73639J293785J348654J606207
14336D9089240J538377J623589J542063J802316K169483J534484J821194J988876
14328F3109622K118824K426471J838366K847490K714586K280405K961274K534101
14320H2831139L290266L007827L531808L245652L892519L608372M125380M465966
14312A11998929M038208M790636M795139M993789N530984N216701N403199O468396
$$ plain form
14371 19464977 20057588 20346736 20701599 21312834 21884759 22290589 22646271 23408838 24027308
14362 24027308 24757159 25242428 25588646 26560475 27100692 27848514 28985364 29234059 30328878
14353 30328878 31315777 32051952 32929805 33573035 34632977 35530802 36431783 37684471 38861926
14344 38861926 40090846 41084601 42414713 43866955 44840594 46134379 47483033 49089240
14336 49089240 50627617 52251206 53793269 55595585 57765068 59299552 61120746 63109622
14328 63109622 65228446 67654917 69493283 72340773 75055359 77335764 80297038 82831139
14320 82831139 86121405 89129232 92661040 95906692 99799211 103407583 107532963 111998929
14312 111998929 116037137 120827773 125622912 130616701 136147685 141364386 146767585 153235981
14304A53235981N866111O496339O769525O844146O766067O176167N990170O269700
14296B04414206O869653O385077N415366O307771P504893P617180O616209N309901
14288B56440256O028406P036401P211895N805549L528448M207530N968168Q101997
14280C04328650Q374683Q873195R581895J0888586J1126338R650709R532313R035402
14272C81391771P163906M426793M239501K369322P47940j196367m572750j0876285
14264C83693831j4752300j5882669j6437074j6457531j6290274j5632467j5197792
14257B73043724j4249926j3365257j2761465j2401974j1580203j0938260j0224787
14250A87521852r780741r124567q295547q182693p277203p224026o371561n978664
$$ plain form
14304 153235981 159102092 165598431 172367956 179212102 185978169 192154336 198144506 204414206
14296 204414206 211283859 217668936 223084302 229392073 236896966 244514146 251130355 256440256
14288 256440256 262468662 269505063 276716958 282522507 286050955 290258485 296226653 304328650
14280 304328650 312703333 321576528 331158423 342047009 353173347 362824056 372356369 381391771
14272 381391771 388555677 392982470 397221971 399591293 400339233 399142866 394570116 383693831
14264 383693831 368941531 353058862 336621788 320164257 303873983 288241516 273043724
14257 273043724 258793798 245428541 232667076 220265102 208684899 197746639 187521852
14250 187521852 177741111 168616544 160320997 152138304 144861101 137637075 131265514 125286850
14242A25286850n889871n679374n123497m773192m359655m174763m325487l686717
14234H7274294l820678l150018l261459k832737k948837k698489k643091k460727
14226F3458258k248251k560817j396122k626053j332271j896600j844807j747811
14218D7805526j589129j174459j611841r93850j444370j131359j406301q83916
14210C7570301j140415q92867r52675j219344n16134j112071p29622j155938o37665
14201B9213570q94731o60395l96656r40756k49999r44112k81256q98371o03522
14192B3343772o08086n25981o13509m67934p1293p89973o39456j95251l81378
14183A9050911m63954k83498m15732m54047l57249k19787o15047k53687J83903
$$ plain form
14242 125286850 119396979 113717605 108594108 103820916 99461261 95286498 90961011 87274294
14234 87274294 83453616 80303598 77042139 74209402 71260565 68562076 65918985 63458258
14226 63458258 61210007 58649190 57253068 54627015 53294744 51398144 49553337 47805526
14218 47805526 46216397 45041938 43430097 42436247 40991877 39860518 38454217 37570301
14210 37570301 36429886 35537019 34584344 33365000 32848866 31736795 31007173 29851235 29213570
14201 29213570 28318839 27658444 27261788 26321032 26071033 25126921 24845665 23947294 23343772
14192 23343772 22735686 22209705 21596196 21128262 21056969 20266996 19627540 19432289 19050911
14183 19050911 18586957 18303459 17887727 17433680 17076431 16856644 16241597 15987910 16171813
14174A6171813l72280p07053r2544q2269j55126n93188l25459k10205l39412K62700
14164A3556977m36602n91626k27625J7127p5663l34756j33481j62488l77191l35277
14154A0899395J92314k41509M8754q12274K26116m9571l08966l37399J12330l59103
14144I370087k20077q0792J16892q9602k22715j49905l31505j20657q5895j45133
14134H040698L96402q71472J93730r664n66769K42594O7497q6834k12328k62772
14124F931082P6710M1320M534l6098j55471q8917m41423j01391L59551k17014
14114F372883l29446k13347K22960m48632J7642J31470j55653L0991m2058J7681
14104E604491j12462R5016m74507p539P0124J20390k30028j5785k6241l17319
$$ plain form
14174 16171813 15799533 15092480 14999936 14917667 14762541 14169353 13843894 13633689 13294277 13556977
14164 13556977 13120375 12528749 12301124 12318251 12242588 11907832 11774351 11611863 11234672 10899395
14154 10899395 11091709 10850200 10898954 10086680 10312796 10263225 9954259 9616860 9729190 9370087
14144 9370087 9150010 9069218 9186110 9096508 8873793 8723888 8392383 8271726 8185831 8040698
14134 8040698 8437100 7565628 7759358 7749694 7182925 7425519 7493016 7406182 7193854 6931082
14124 6931082 7007792 7049112 7053646 7017548 6862077 6773160 6331737 6230346 6589897 6372883
14114 6372883 6043437 5830090 6053050 5604418 5622060 5753530 5597877 5628868 5586810 5604491
14104 5604491 5492029 5587045 5112538 5104999 5175123 5295513 5065485 5049700 5023459 4706140
14094D706140J33578m651k10807L50367k78057l13367J3516j62180j30416L44615
14084D448738O078K7606j46288k01787J72385j61334m5435j91440K11332m40260
14074C679595K06854K32515p34369M76868m6590j26369J73066k27158q6681k22579
14064C325152L51468p0699K19803m2053j53731j99989N3440j67087q9621K00134
14054C426817M888L3231k54087j1451J93293k39044M11950o43120L15099l51585
14044B885991K16866J22960j43068l6130j37462M8721J75716n06194K64555k91410
14034B600545L19459j30801K42390p531k89407o533j70448P8037K6079j77563
14024B484227q9274K95904k18980r638K02152k4219j03828M5533P7203L0477J79030
$$ plain form
14094 4706140 4839718 4835067 4624260 4974627 4696570 4383203 4396719 4234539 4104123 4448738
14084 4448738 4454816 4482422 4336134 4134347 4306732 4145398 4099963 3908523 4119855 3679595
14074 3679595 3886449 4118964 3384595 3861463 3814873 3688504 3861570 3634412 3547731 3325152
14064 3325152 3676620 3605921 3825724 3783671 3629940 3429951 3483391 3316304 3226683 3426817
14054 3426817 3431705 3464936 3210849 3199398 3392691 3153647 3565597 2922477 3237576 2885991
14044 2885991 3102857 3225817 3082749 3046619 2909157 2957878 3133594 2627400 2891955 2600545
14034 2600545 2920004 2789203 3031593 3024062 2734655 2728122 2557674 2635711 2661790 2484227
14024 2484227 2394953 2690857 2471877 2462239 2664391 2640172 2536344 2581877 2659080 2689557 2868587
14013B868587n46968O14521p7818l64866J91234L67533l39606K86226j20142K4507
14003B903208J13853j68465P6645K58773m5922K47576J37658J4631q007N89486
13993D119436J24935N62532Q05791L72138J736469K123428L238344L865289J779998
13984A8728360k656306n145771m131525j973943q43421l76259o54804J06656n87345
13975B465642J38871j71496J9610J80796l16830J34372k87292K24088k39777o2510
13965B085474j31982L9962j86010K45824j27532J61327m59293N25160l98656J74600
13955A928874K5611m50722K68114R8070M0444l16932J07722J05854j16901r6824
13945A593310J38340l59755K10431K03272j18515l61101K67325l504j30173J37221
$$ plain form
14013 2868587 2321619 2936140 2858322 2493456 2684690 3052223 2712617 2998843 2878701 2903208
14003 2903208 3017061 2848596 2925241 3184014 3138092 3385668 3523326 3537957 3529950 4119436
13993 4119436 4244371 4806903 5612694 5984832 7721301 9844729 13083073 16948362 18728360
13984 18728360 16072054 10926283 6794758 4820815 3977394 3601135 2946331 3052987 2465642
13975 2465642 2604513 2433017 2452627 2633423 2316593 2450965 2163673 2387761 2147984 2085474
13965 2085474 1953492 1993454 1807444 2053268 1925736 2087063 1627770 2152930 1754274 1928874
13955 1928874 1954485 1503763 1771877 1869947 1910391 1593459 1701181 1807035 1690134 1593310
13945 1593310 1731650 1371895 1582326 1785598 1667083 1305982 1573307 1569803 1439630 1576851
13935A576851k56721K72849P788n0519j4130j01977r2072k8611J97315L6887j30775
13924A416885k24131J67371m6317j98201M65472j30046J36330k18513l1627o4072
13914A273151P6643j12369J84991j93514J92569p8433L0507l29719l325K25078
13904A265579m4258j76512L07855j40868M5593K8984j26595j44328N72529n09426
13894A078553K25715J7619j72259O823K07595n49044n1346K64119P3250L1552
13884A132577n6197m3530K04570j55887M7588l38128R6153J69311J46034m3338
13874A159153j37272j3125n9397l4069L74488J06549l58088P5490J00543k35138
13864I79134Q521K73845k22899o3186j36940M2638j02973J31522j42372Q9634
$$ plain form
13935 1576851 1320130 1592979 1600767 1550248 1536118 1434141 1342069 1313458 1510773 1547660 1416885
13924 1416885 1192754 1360125 1313808 1115607 1581079 1451033 1587363 1368850 1337223 1273151
13914 1273151 1349794 1237425 1422416 1228902 1421471 1343038 1373545 1043826 1040501 1265579
13904 1265579 1221321 1044809 1352664 1211796 1257389 1286373 1159778 1015450 1587979 1078553
13894 1078553 1304268 1321887 1149628 1156451 1364046 815002 763656 1027775 1101025 1132577
13884 1132577 1076380 1032850 1237420 1081533 1129121 790993 887146 1056457 1202491 1159153
13874 1159153 1021881 1008756 949359 915290 1289778 1396327 1038239 1113729 1214272 979134
13864 979134 987655 1261500 1038601 975415 838475 881113 778140 909662 767290 856924
13854H56924L8313N8997J80316k70838m8628N3571K31885j33494n4410L0986n6355
13843H87267o7627l29859M36036J32881k61560l398L9668j5456P7286l7894j52402
13832G04942P7447J04365k36917J49424N3284j62811J94900K43032k75294q0475
13822G71897J09618K9371k96936j2740N0241K97187l39065L02657m3471p4141
13812G94618k62062M8244L96293l68955L24168k49887N4780j04345Q1261K46281
13802I60396j63758M2864A97402N47449J82414m54867M17347k35619L288J11355
13792G68769o2799j21018L3595J84751n936r4704q231J42899p5405k10695J32182
13781F83408j76517l8389K13618M5360K37496k99757j38567R4439l8025J58810
$$ plain form
13854 856924 895237 954234 1134550 863712 815084 868655 1100540 967046 912636 943622 887267
13843 887267 819640 489781 925817 1058698 797138 793740 833408 817952 895238 857344 704942
13832 704942 782389 886754 649837 799261 852545 689734 884634 1127666 852372 771897
13822 771897 881515 910886 613950 601210 651451 948638 609573 912230 868759 794618
13812 794618 532556 580800 977093 608138 932306 682419 737199 632854 714115 960396
13802 960396 796638 839502 197402 744851 927265 472398 889745 654126 657414 768769
13792 768769 705970 584952 618547 803298 797362 702658 694427 837326 761921 551226 683408
13781 683408 506891 468502 682120 727480 964976 665219 526652 621091 583066 741876
13771G41876l39968O7245R6271J59608K6243l45781J76407m0297p9218K4572J96651
13760F83609k21565l2878J66031q9540j47044L47705j14494n6213J78717O1441
13750G75769k75274K03944j61407j10015J07389J48793j69379J74137k32727j8833
13740D42397J6160J53135B80859J28239j33181K95503B53951J96466J04031N2469
13730F06917J04080k36507J77094B24530J45162R1801J84981k29223N7238K3317
13720D97806k39762Q9153N8385M4756M2911B44107L42108k4264k66819K25976
13710E21108P9264n4406k69691N45532l18747K552k48046L463L44708k61213J63520
13699E08044j69881K99161k38561J07283R2782A55377L50216j42837K01424A02901
$$ plain form
13771 741876 401908 469153 565424 725032 751275 405494 581901 541604 462386 486958 683609
13760 683609 462044 429166 595197 505657 358613 706318 591824 535611 714328 775769
13750 775769 500495 704439 543032 433017 540406 689199 519820 693957 461230 442397
13740 442397 458557 611692 280859 409098 275917 571420 253951 450417 554448 606917
13730 606917 710997 474490 651584 224530 369692 461493 646474 417251 474489 497806
13720 497806 258044 347197 405582 450338 493249 244107 586215 561951 295132 521108
13710 521108 600372 545966 276275 821807 503060 505612 257566 261029 605737 344524 508044
13699 508044 338163 637324 398763 506046 598828 155377 505593 362756 564180 102901
13688B21670K59508m6834J89104B16032K60572k1612L20160B76523L8770P2605
13678C87898J13462j90218o4346o9410L54048k0979j59020O9329N0951j52246
13668C19469j57387N07231k6573k48100J37511B40382K63102j46151J23309j33584
13658C47058L17092A13647L90510B12638K47574l7844j17828L48945k31116J13725
13648E36094J06186B66808Q9681l0441K70212n2273k39400J12402j52950O1565
13638C25604j8546J9555O5483l5781R1349j14460J89649j59348L10867r3409j42267
13627D38696j45897O4763l7513H2457K71741J9044p7031j21844q5397J4648M69320
13616E72938B00516J53282j16349K22394M9075j14662n00J02809k6466A12504
$$ plain form
13688 221670 481178 434344 623448 216032 476604 454992 775152 276523 315293 387898
13678 387898 501360 311142 246796 177386 531434 510455 351435 420764 471715 319469
13668 319469 162082 669313 642740 394640 532151 240382 503484 357333 480642 347058
13658 347058 664150 113647 504157 212638 460212 422368 304540 653485 422369 536094
13648 536094 642280 266808 356489 326048 596260 543987 304587 416989 264039 325604
13638 325604 307058 326613 392096 356315 447664 333204 522853 363505 674372 580963 438696
13627 438696 292799 357562 320049 82457 354198 373242 296211 174367 88970 103618 572938
13616 572938 200516 353798 237449 459843 508918 394256 393756 496565 470099 112504
13605A81653R6769m9193L00289k0601k27575j38692J27979K88962k50593A35223
13594C03537Q0194b7356D59621j57853o9427K712J09620m1497N2285O0204m7424
13583C68241p9522C9206L42645J17659M5120j55294A81224L68010H3591J83762
13573B67353J16595J04592J9747j43156M9690A30548M28861l1713B51525J22870
13563C74395m4967n0557L07075L0345b01B27444A12763K47260j65348K74947L7136
13552E06758k38530n5860J27388J73010j64556O4940o0541A45888J05468J34411
13542C85767n4760j03135L09575F2436J91610N049d0634B35303N2966O7165J69815
13531E25249g6427D49756k18216j3722J40139j11555C2745L58348k6711F9066
$$ plain form
13605 181653 278422 229229 529518 508917 281342 142650 270629 559591 308998 135223
13594 303537 383731 -27356 459621 301768 232341 235053 344673 303176 355461 415665 368241
13583 368241 288719 39206 381851 499510 544630 389336 181224 549234 83591 267353
13573 267353 383948 488540 508287 365131 414821 130548 559409 527696 251525 374395
13563 374395 329428 278871 585946 616291 -201 227444 112763 360023 194675 469622 506758
13552 506758 268228 212368 339756 512766 348210 413150 352609 145888 251356 385767
13542 385767 331007 227872 537447 62436 254046 259095 -40634 235303 288269 355434 525249
13531 525249 -76427 449756 231540 217818 357957 246402 32745 391093 364382 69066
13520A41031K52697r8775h8046C18731j39329Q7984J61480k02964L3652P3223
13510C32777M0057j24129j8612Q7118L0060K19327k75382e4153A00763O0230J71890
13499C32883A38816m4986a36150E1318O2453K0282J42375j05083M9206d0315C93975
13487B30246j00534K20708j61753N3338j06661J48399o1961F8347K62416j22046
13477B08717G5069e2570B26008j11862J13448K3168A06336l9129F559K40087J45240
13466C91886j59874K73161A41770k471K31592j04988E3389K86029l6758A24538
13455A32759n6753J92523e467A38699k7530M8455K99F2879J94914J14184k0989
13444C50988J56308k24262A37396K02881F2789K8156a66627A52180b8177B24213
$$ plain form
13520 141031 393728 294953 -88046 318731 179402 267386 428866 225902 259554 332777
13510 332777 372834 248705 230093 317211 347271 566598 291216 -54153 100763 160993 332883
13499 332883 138816 93830 -136150 51318 113771 134053 276428 171345 220551 -40315 393975
13487 230246 129712 350420 188667 242005 135344 283743 221782 68347 330763 208717
13477 208717 75069 -52570 226008 114146 227594 250762 106336 67207 6559 246646 391886
13466 391886 232012 505173 141770 139299 370891 265903 53389 339418 302660 124538
13455 132759 76006 268529 -5467 138699 111169 159624 159923 62879 257793 371977 350988
13444 350988 507296 283034 137396 340277 62789 90945 -166627 152180 -28177 224213
13433C83098p0436j19687l5707N3882Q653a9202F4928M49643I3410J5116J58779
13422B67305M1569j01619j00499k3634P7821o5270J56312I1944K64931d2078A06079
13410A37698D2941a72348A36417f2752D0381J17383m9114n3852Q9624k8034K29487
13399C45875j4653p8954K7900c2031A70078c26657a20678F3279J45302E6426O5398
13388A21824a385A31443J84539A16538J3763E7705J38380M8851H0442b3747B26446
13376A29175J75088K0984B7072r135L54310i4967C63690o37j40092J20532A3706
13364A32804J33046j08109l6231K79792A39519K05419j59874a26544B77153b5309
13353D83234a56296C43121j62524i1954C35708D2725J81195J3173p4672P9654
$$ plain form
13433 383098 312662 192975 157268 211150 219803 -19202 64928 514571 93410 108526 267305
13422 267305 308874 207255 106756 83122 160943 95673 251985 91944 356875 -42078 106079
13410 137698 42941 -172348 136417 -62752 40381 157764 108650 54798 144422 116388 345875
13399 345875 331222 252268 280168 -32031 170078 -326657 -120678 63279 208581 56426 121824
13388 121824 -1385 131443 315982 116538 130301 57705 196085 244936 80442 -23747 226446
13376 129175 304263 325247 27072 17937 372247 -94967 363690 363053 222961 343493 13706
13364 132804 265850 157741 121510 401302 139519 344938 185064 -126544 277153 -25309
13353 483234 -156296 343121 180597 -91954 335708 42725 223920 237093 162421 242075
13343B42075M51M55563k63865A02780K15504e5323K5527D12767H8136J49907o2704
13332A75339F5919k4342K85644j8468l8451a95115A02201C6577K02610J65221
13322D04408M2130F3273A6445L97225j53248M8664n3352G5182b273G1743J17120
13311A88863o1586D3111b0119A45722N2082Q5541A25012R7197L60445A69843d1005
13299C5391K14038R3731b8828A48454J14818F1519K17930A1485d0916A59049K9274
13288A88323k3293e3911C06791D8344n621j3823N3224K37977E7424d9924A7799
13276d1841a4741A88694J23462p5183O2714A14004J44225j13180N8676I6293c6976
13264B67945A15305B7613K40292a35608A77114F7222a96447B66884b6192A27317
$$ plain form
13343 242075 242526 698089 434224 102780 318284 -55323 -29796 412767 88136 238043 175339
13332 175339 65919 41577 327221 308753 270302 -195115 102201 36577 239187 404408
13322 404408 446538 63273 16445 413670 260422 309086 255734 75182 -2273 71743 188863
13311 188863 127277 43111 -20119 145722 197804 283345 125012 222209 582654 169843 -41005
13299 35391 249429 343160 -28828 148454 263272 61519 279449 11485 -40916 159049 188323
13288 188323 165030 -53911 306791 48344 42723 28900 82124 320101 57424 -49924 17799
13276 -41841 -14741 188694 312156 236973 299687 114004 258229 145049 203725 96293 -36976
13264 267945 115305 27613 267905 -135608 177114 67222 -196447 266884 -26192 127317
13253B14742l240c9293j85927C5459O9726K57479K33674A79241l1790J56097H5571
13241F5554k2197L4230J97634r8324e3501o3542I995K50037A04632a42735M4355
13230i8380L3029A84147g2372C43419b3337C9365O1214l1171B2717C380L70Q706
13218A2456J55355A5451J78741B3486O7512c74212B53071m7429F9151M0395d3122
13206I4026K055J31675K525h910F3399P493L47361A68765q2066J592J20546l6944
13194A71893a12424D7776b2771A54187n2715l0144J04713E4183K3137c1967A44024
13182D42180A62432Q3347n1479n5922K45539a90816c8845I4046O2066i5293A86762
13170A52198J27499a03393C55773a61309K1167I953P6339C9354J35991e6434a2558
$$ plain form
13253 214742 211502 -39293 -225220 35459 105185 362664 596338 179241 147451 303548 85571
13241 65554 43357 77587 275221 176897 -53501 -117043 9995 260032 104632 -142735 -98380
13230 -98380 -65351 184147 -72372 343419 -23337 39365 100579 69408 22717 3380 3750 12456
13218 12456 167811 15451 194192 23486 90998 -374212 253071 205642 69151 109546 -43122
13206 94026 96081 227756 230281 -8910 63399 70892 418253 168765 86699 88291 208837 171893
13194 171893 -112424 47776 -22771 154187 101472 71328 176041 54183 77320 -31967 144024
13182 442180 162432 245779 194300 138378 383917 -190816 -38845 94046 156112 -95293 186762
13170 152198 279697 -103393 355773 -161309 -140142 9953 86292 39354 175345 -56434 -12558
13158G7719L9320O6728a42303E3278K26704j21449e9441C56220G4653e010q726
13147a3736B45853K437P7237B6650K38946J91082A95050m847a19347F9272K11414
13136B80686a49125c800D5978J05631L26494g8991j9868C8334a52309A33162a8054
13124f9931F8951N8853b27586g5682D08670b02418I4191a57716j19987a04983
13113A90761D8783j0854Q1646P7071a25495o3157j4081Q022B29209p5765h996
13101b06978G2184J1152D0095J90427M4319r4439E103a0123B1255a32271e1234
13089B07228c64513C7665J60084J32776l7688A36592b1966A45280n9647k6745
13079E8888O689a35720H6423N52081b43529d9467H6277R6620a30766r1148e7283
$$ plain form
13158 77719 117039 183767 -142303 53278 279982 158533 -59441 356220 74653 -5010 -13736
13147 -13736 245853 248290 325527 26650 265596 456678 195050 190203 -119347 69272 280686
13136 280686 -149125 -3800 45978 151609 478103 -78991 -98859 38334 -152309 133162 -18054
13124 -69931 68951 127804 -227586 -75682 408670 -202418 94191 -157716 -277703 -104983
13113 190761 48783 37929 119575 196646 -125495 -188652 -202733 -194711 229209 153444 -8996
13101 -206978 72184 83336 40095 230522 274841 180402 5103 -10123 21255 -132271 -51234
13089 207228 -364513 37665 197749 330525 292837 136592 -21966 145280 85633 58888
13079 58888 65577 -135720 86423 638504 -243529 -49467 86277 182897 -130766 -221914 -57283
13067F972L32260P073j59489f8413A845Q1531K71459C8326P0303L38346I9941
13055C37776R6464i5016r6953H3871R206L1816J25819A19699E642M7326i5113
13043I6790A6777b06483B11166L0643c4892A58395a77580b7625j0062A97618E3400
13031a2825j32783A5145M12927A55750O0037a10457D6196A7717K61565J70235
13021D49517a58618A96966g8181B55077K8159A00141J9127a96746j0967F5290
13010B25313j2469D8292K06471p6859B8478a03946j22510C6081a21949E0033d4272
12998a74587A37250P6195J48391D7715J73062B8297J22639d8022B1589h186B20850
12986A96042A0187J57177L5536c43972A71903q3912a61079l52879A54536f6398
$$ plain form
13067 6972 339232 346305 186816 -68413 1845 83376 354835 38326 108629 446975 99941
13055 337776 434240 -95016 -191969 83871 93077 124893 250712 119699 5642 52968 -95113
13043 96790 16777 -206483 211166 241809 -34892 158395 -177580 -27625 -37687 197618 53400
13031 -12825 -145608 15145 428072 155750 215787 -110457 46196 17717 279282 449517
13021 449517 -158618 196966 -78181 255077 283236 100141 119268 -196746 -207713 65290
13010 225313 212844 48292 254763 177904 28478 -103946 -226456 36081 -121949 50033 -44272
12998 -174587 137250 213445 361836 47715 220777 28297 150936 -48022 21589 -8186 220850
12986 196042 10187 167364 202900 -343972 171903 87991 -161079 -513958 154536 -66398
12975a8452j47643b0738q27A10663j4030b31520H0466b8798l1957B01802H6458
12963a48003B24584a16171A61626D6529J20783a98855n9358C40166a46858F1279
12952a18697e0195B847i2047j4855A98890G0800M20652a1160A56614e7034H0301
12940A47364g149j30702A78757a07989D5475a12222k0761j98574b6367B22809
12929b4666G5181B8663M4465N7350j4688J56883F5574b50844J12323C53630j18356
12918B35274A144J99218F7860e8292B79354o3981g5062A26797P029K38672A60706
12906C8674J57104a09627B0876K08694b00976D7960L3074N2015F4560e6257F713
12894A36905d8536I0759J95250A26636n9255a02054F9787b6305I4325i751I2326
$$ plain form
12975 -18452 -166095 -20738 -21565 110663 96633 -231520 80466 -28798 -60755 201802 86458
12963 -148003 224584 -116171 161626 46529 167312 -198855 -258213 340166 -146858 61279
12952 -118697 -50195 2847 -92047 -106902 198890 70800 491452 -11160 156614 -57034 80301
12940 147364 -7149 -137851 178757 -107989 45475 -112222 -132983 -331557 -26367 222809
12929 -24666 75181 28663 73128 130478 115790 272673 65574 -250844 -138521 353630 235274
12918 235274 1144 200362 67860 -58292 279354 215373 -75062 126797 133826 372498 160706
12906 38674 195778 -109627 20876 229570 -200976 47960 81034 133049 64560 -56257 6713
12894 136905 -48536 90759 286009 126636 67381 -102054 69787 -26305 94325 -9751 92326
12882B05180b34527c4482o0736E1953b873A35528a64863m3525e8522r6294B13413
12870a07194l7417a1721l7891o8290G5027f7994C73144H0248f1879B97748a2013
12858A24257l1942F528a71802A54458E3098b2702E5036a7102A32241q820g8024
12846d65064D573L1277a23617j1223D993a14784c3245C53956g6594K8419q3259
12835a31434E1994j249Q0717b2913C17692E3447K5672d3227J7430j60284J9522
12824a66559B15627a07262A22943A182L25120j7798q161A15534a0049r9413E2787
12812b7166A92999R9713A03116k6503K5865A7924a94511Q3337B57482p5899b22277
12800a8528A03360a77116b7354m1106A22399J33481A07391O4345n4758b77606
$$ plain form
12882 205180 -234527 -34482 -95218 51953 -2873 135528 -164863 -208388 -58522 -154816 213413
12870 -107194 -144611 -11721 -49612 -117902 75027 -67994 373144 80248 -61879 297748 -12013
12858 124257 92315 6528 -171802 154458 53098 -22702 55036 -17102 132241 123421 -78024
12846 -465064 4573 35850 -123617 -134840 4993 -114784 -33245 353956 -76594 -48175 -131434
12835 -131434 51994 50745 131462 -22913 317692 53447 79119 -43227 -25797 -186081 -166559
12824 -166559 215627 -107262 122943 1182 326302 308504 300343 115534 -10049 -109462 52787
12812 -27166 192999 292712 103116 76613 102478 17924 -194511 -111174 257482 181583 -222277
12800 -18528 103360 -177116 -27354 -68460 122399 255880 107391 171736 116978 -277606
12789B35619E4550J46911e1360k1603j31925f1243j03936q4138h5729B97149d21693
12777A32092o449k5053g2815A26537a11602k10134E2065j2097A954a2796j86906
12766a99702P2398B76119j24522F2840K45346A1596d0683E4737Q1841a97936c464
12754a70487M3899H3455e9636j15737O9692L6119j10330A05564K16018C0191c12562
12742G7731k854M3647N8526d3709J6812B20871n9752n8113b21049R5907B11465
12730C1339J53715l5053A9253g9232J628l1371j10744A56753K94361a68295g907
12718B00929a45470L1675H2732a47243e5125H1433a84839h672A97111J16047j03002
12707B10156e0086m911J9354p2832C10257A11287k3942h5613I9764a29372M1579
$$ plain form
12789 235619 54550 201461 -51360 -72963 -204888 -61243 -165179 -249317 -85729 297149 -421693
12777 132092 125643 100590 -72815 126537 -111602 -321736 52065 39968 1954 -12796 -199702
12766 -199702 -127304 276119 151597 62840 308186 11596 -40683 54737 136578 -197936 -3464
12754 -170487 -126588 83455 -59636 -175373 -105681 -69562 -179892 105564 321582 30191 -312562
12742 77731 74877 118524 177050 -43709 -26897 220871 161119 103006 -221049 -125142 211465
12730 31339 185054 150001 19253 -79232 -77604 -108975 -219719 156753 451114 -168295 -7907
12718 200929 -145470 -113795 82732 -147243 -55125 81433 -184839 -8672 197111 313158 210156
12707 210156 -50086 -54997 -35643 -108475 310257 111287 87345 -85613 99764 -129372 -87793
12696h7793A89291a62697e72A22048m3138d49810a13735B6080a33835A8563K05494
12685B24057G2780c68948A24614N3153b8954g57A85600G2805a33433O667G7558
12673A366c07211h167A32019a49218I5258a10699q1066c7178l6038H5118L92636
12662D77754B19050a48643D32154B05651I516b5725C24238a39553B63300F6352
12651e1718H8155k5791P9337Q5386a32463f781q0153c9657C8262a93918e9411
12639G2103e7983j81015A4825a1641A97503a01753B09984A03937K766J65919j07220
12628A65402b8445C5608D962a3575k43309A0883J29359E7609M730K63256A08868
12616C30282a77736A85929a98060k2709P4770j34339b0554A21680e3669E5941
$$ plain form
12696 -87793 189291 -162697 -572 122048 78910 -449810 -113735 26080 -133835 18563 224057
12685 224057 72780 -368948 124614 177767 -28954 -757 185600 72805 -133433 -126766 77558
12673 1366 -307211 -8167 132019 -149218 95258 -110699 -191765 -37178 -73216 85118 477754
12662 477754 219050 -148643 432154 205651 9516 -25725 324238 -139553 263300 66352
12651 -51718 88155 62364 141701 227087 -132463 -6781 -86934 -39657 38262 -193918 -59411
12639 72103 -57983 -238998 14825 -11641 197503 -101753 209984 103937 106703 272622 165402
12628 165402 -28445 35608 4962 -13575 -256884 10883 140242 57609 62339 325595 108868
12616 330282 -177736 185929 -198060 -220769 -145999 -280338 -20554 121680 -53669 55941
12605A56070b30318A89895E0034L25043j36836p8891P7685m0124B2311b59459
12594a34243a280C1118J55765B686J9350K48511q5931i2091E4336K64224i7095
12582a77268A9595J9978d6905A15081M4230d580E2837i8565C73342D9561b79030
12570A73150O5726b39737B41448j11832a21741j9427H5491a4319j1473N235C9823
12558E2051J76094K11084a39464I5879b52498D2663A4929K22744d2171A4319J04542
12547A18861a6236I3137K87083a76948A72082P2227M8915a9278A55363F6378l487
12536F2891b64432C890J11180b6940A71946a39094q5738f5249D3571b24214A67043
12524D5047L1559K70201D9520c15979A01118K5631m4561a75890B34356F9618A6647
$$ plain form
12605 156070 -230318 189895 50034 375077 238241 159350 237035 196911 22311 -259459
12594 -134243 -1280 31118 186883 2686 22036 270547 184616 -92091 54336 318560 -97095
12582 -177268 19595 39573 -46905 115081 159311 -4580 52837 -98565 373342 49561 -279030
12570 173150 238876 -239737 241448 129616 -121741 -141168 85491 -14319 -25792 -20557 39823
12558 52051 228145 439229 -139464 95879 -252498 42663 14929 237673 -42171 14319 118861
12547 118861 -16236 93137 380220 -176948 172082 244309 293224 -19278 155363 66378 62891
12536 62891 -264432 3890 115070 -26940 171946 -139094 -224832 -65249 43571 -224214 167043
12524 45047 76606 346807 49520 -315979 101118 126749 82188 -175890 234356 69618 16647
12512c80284a36790B26642J24687h7035H6596K34197a49222J8257J2679j47817
12502b66103o8399G1554b0197H2656l5503L6081O2869b03294d3928l3816E7863
12490d89111C29091a89209o2838b0346i134B6186a19736r683B01415b14944b5627
12478c4298I4207b19702E7508b93222b9616l0959G6205a54831O3763a0788j17284
12467a28072m4847H2763J0633f6451l1484K7742H1645a32309O5061i886o0427
12456g0313G5676a02620I7087a75121o3411i8762A4385b50440B84935a88294m1046
12445b29340A36785m9562o740a27896A24202A2867h0489A29602c2014A11145Q566
12434A19711a96030B69759k5250a08360e2177B451g9028J8660C0275J15003L1821
$$ plain form
12512 -380284 -136790 226642 351329 -87035 86596 320793 -149222 -130965 -118286 -266103
12502 -266103 -334502 71554 -20197 82656 47153 83234 146103 -203294 -43928 -77744 57863
12490 -489111 329091 -189209 -252047 -20346 -9134 26186 -119736 -129419 201415 -214944 -25627
12478 -34298 94207 -219702 57508 -293222 -29616 -60575 76205 -154831 -91068 -10788 -128072
12467 -128072 -172919 82763 93396 -66451 -97935 -70193 81645 -132309 -67248 -9886 -70313
12456 -70313 75676 -102620 97087 -175121 -238532 -98762 14385 -250440 284935 -188294 -229340
12445 -229340 136785 87223 80483 -127896 124202 12867 -80489 129602 -32014 111145 119711
12434 119711 -196030 269759 244509 -108360 -52177 2451 -79028 -60368 30275 145278 177099
12423A77099a0205k33218j7634A92287a00930E9685c12279A01751B6750R286a22411
12411C11753F2509J61640H7004a96760L4204I8466f5972m9497b8225j15267A5427
12399a95375b1107C8701K07393m4367Q448b83700C50285b09240I644Q9476B8158
12387A12997a63844A85734a68962N7919q3173Q7506M3220q6005F8230H140K3588
12376C1728J76116E9934K60390g294p1141I8272L919h2446A88900G2758a38093
12364I0592b32637b8932D01723g9790j9436B88232J47931a12272A28448M2358
12354A70806L2970k1120F3410K1847b38300D0835i1487B60507p5989a55961A4208
12342A45345i6590j20578o3126c9056n8947A5605h9473C13270j08704J29744A22042
$$ plain form
12423 177099 -10205 -243423 -261057 192287 -100930 59685 -312279 101751 26750 36036 -122411
12411 311753 62509 224149 87004 -196760 -162556 98466 -65972 -115469 -28225 -143492 15427
12399 -195375 -21107 38701 246094 201727 210175 -283700 350285 -209240 9644 99120 28158
12387 112997 -163844 185734 -168962 -111043 -194216 -106710 -63490 -149495 68230 8140 31728
12376 31728 207844 59934 320324 -7294 -78435 98272 102191 -82446 188900 72758 -138093
12364 90592 -232637 -28932 401723 -79790 -99226 288232 436163 -112272 128448 170806
12354 170806 203776 182656 63410 85257 -238300 40835 -91487 260507 184518 -155961 14208
12342 145345 -96590 -217168 -280294 -39056 -98003 15605 -89473 313270 204566 334310 122042
12330G5554a35923L0856c5204J5512H0229l1644d28065A54231e4823P392B87845
12318A51076h8734A66704a45848C73241C6760c42014F9727j8114a36511D52326
12307b31510e3297C1578A1520O1346a31875N9756A96001a35953I4260C2484f2012
12295A77802d4460D6848J5223m768c37994i6353b28m00064C92021H4962a26757
12283B60171M7631d1543B80117g0658c2176I1465J32045E2982K76750j40591o7535
12272A21606k4535m5752K8514j9038b92304M3130g1043A14547h4509F502h8487
12260A34227a13736H0296C2818a2175E7324e0069A9862O5906N539a17778a7541
12248e7654H930a7615G4367a9665A97150H1700O9023e07701B5027J93008A00491
$$ plain form
12330 75554 -135923 -105067 -35204 -19692 80229 48585 -428065 154231 -54823 -47431 287845
12318 151076 -88734 166704 -145848 373241 36760 -342014 69727 51613 -136511 452326
12307 -231510 -53297 31578 11520 72866 -131875 -72119 196001 -135953 94260 32484 -62012
12295 177802 -44460 46848 62071 57303 -337994 -96353 -228 -400292 392021 84962 -126757
12283 260171 307802 -41543 280117 -70658 -32176 91465 223510 52982 329732 189141 121606
12272 121606 97071 51319 79833 60795 -292304 -249174 -71043 114547 -84509 6502 -88487
12260 134227 -113736 80296 32818 -12175 57324 -50069 19862 85768 91307 -117778 -17541
12248 -57654 8930 -17615 74367 -19665 197150 81700 150723 -507701 25027 218035 100491
12236E2636c9707B78529A7700h086D2601J7477K76228H0285L07371A04607J15965
12225B20572A07597B3955J65050n2959l5683L8341M3494c2591A05842J18806e696
12213C0764L33432E4103J2134A1841K6261K88710A17147K02942a04483D1537h7261
12201A14549R9547N7186B73M45247j90224E4080J77687c143A81188M3646q6597
12190A38237A7828J84932d7387A6649K86907q3632A03988J43699Q4617o8995H7040
12178e4931J6494n7645d673A37006F5401A9195a32400B05448N5242K3024A22194
12166A90241c2066A05431b02565B82659c61519A48813d0736B66594E6434i6114
12155i5720m1023d5826B43140o2001P0493a89966A36003N4697d1483B17047p0844
$$ plain form
12236 52636 -39707 278529 17700 -8086 42601 60078 336306 80285 387656 104607 220572
12225 220572 107597 23955 189005 136046 100363 138704 182198 -32591 105842 224648 -5696
12213 30764 364196 54103 66237 11841 38102 326812 117147 320089 -104483 41537 -87261
12201 114549 214096 271282 273 445520 255296 54080 231767 -3143 181188 224834 138237
12190 138237 17828 202760 -47387 16649 303556 219924 103988 247687 332304 263309 87040
12178 -54931 -38437 -96082 -4673 137006 65401 19195 -132400 205448 260690 283714 122194
12166 190241 -32066 105431 -202565 282659 -361519 148813 -40736 266594 56434 -96114
12155 -95720 -136743 -45826 243140 181139 251632 -189966 136003 190700 -41483 217047 146203
12144A46203f5023a5229B79108q4495F1105h1673m3215B22492q0668c59764a43030
12132E47779a25029B52733a79981F9836f7172H0353J92445I4494b8149j75441
12122b03590A2857i5350B34366c35687B06358a93887q8300a22920D7612f0474
12111A6383d6500A74565a58B50670h0840j15217O0864r9042b1159k04500A91866
12099A03237e1874A78051J1967N299a92551f6441B09827a51931k18600B20316
12088A44359J1481d639I4312a00490r4757A02243m6093J91181j10456a26235B36235
12076a38368L9790B4682R0268A9173a44875E11795c586I3139N5949M4417J33310
12065C26815o1668m214J12872j61722a05936c0636A401b002B79863a55351o8269
$$ plain form
12144 146203 -65023 -15229 279108 194613 61105 -81673 -124888 222492 141824 -359764 -143030
12132 547779 -125029 252733 -179981 69836 -67172 80353 272798 94494 -28149 -203590
12122 -203590 12857 -95350 234366 -335687 206358 -193887 -282187 -122920 47612 -60474
12111 16383 -46500 174565 -158 250670 -80840 -196057 -135193 -234235 -21159 -225659 191866
12099 103237 -51874 178051 190018 195317 -192551 -66441 209827 -151931 -370531 220316
12088 144359 155840 -4639 94312 -100490 -195247 102243 56150 247331 136875 -126235 236235
12076 -138368 -98578 24682 114950 19173 -144875 511795 -3586 93139 149088 193505 326815
12065 326815 265147 260933 373805 212083 -105936 -30636 1401 -2002 279863 -155351 -223620
12054b23620D2295b39532B40692i7592m5436A00020f5088G7528i5345M2780A20963
12042A20689g0864B68981A164d1138A04428a25488B19280c0278q6744o6852B9672
12030A08179R4632a83295h0777k24935D5301h5724A78337i492o7056l0491A10081
12018f5158d051B97540F034J07073f9848q1834B7201a7262q7212A72052b32023
12006F7572h9002j48185C6219F850J80254a89359a7123j28894A8092J13991e9827
11994A24375a58915E9602A4089e7583o9721k5114b7287I235J19488n6674a77275
11982i2314C0594a52432B14685a80690I3449K5198c05355J51208A43934o3830
11972H0104b24414b0508C9084b3769A27386Q4018k7747q838B7476g5802L1327
$$ plain form
12054 -223620 42295 -239532 240692 -97592 -143028 100020 -65088 77528 -95345 -52565 120963
12042 120689 -70864 268981 1164 -41138 104428 -125488 219280 -30278 -117022 -183874 29672
12030 108179 202811 -183295 -80777 -305712 45301 -85724 178337 -9492 -76548 -107039 110081
12018 -65158 -4051 297540 6034 113107 -69848 -151682 27201 -17262 -104474 172052 -232023
12006 67572 -89002 -237187 36219 6850 187104 -189359 -17123 -146017 18092 132083 -59827
11994 124375 -158915 59602 14089 -57583 -127304 -152418 -27287 9235 128723 72049 -177275
11982 -92314 30594 -152432 214685 -180690 93449 118647 -305355 -154147 143934 80104
11972 80104 -224414 -20508 39084 -23769 127386 211404 183657 174819 27476 -75802 -44475
11961d4475q7258a820j4918G3628b09093R4565J3249J8409j25189c8994D43616
11949a29390p198p4000J01834I3528C7509c5652D0461b33791m8507M8275f4070
11937B32872j09744g8080i830m9541H00c00514a06512a4024B26374j6716j03965
11926A05693b38167A27275a57061A34082c28322d8309J5499j3800k23847a6798
11915h4360A35171b1082C4242q145a79451P3433j47668A85603a07452M7812b5687
11903b7736H1142Q683a70876O7760I6153h8038A15759f26j32054B991c9442C16098
11890b72067A15731a72770C18228b56865A79735G0960h5568N29B169J15468A0826
11878f575n4970D77a5159k72197C22293C7916J5829o454O1792e4165k92434A07004
$$ plain form
11961 -44475 -131733 -1820 -16738 73628 -209093 -114528 -101279 -82870 -208059 -38994 443616
11949 -129390 -136588 -210588 -108754 93528 37509 -35652 40461 -233791 -282298 -234023 -64070
11937 232872 123128 -78080 -9830 -59371 800 -300514 -106512 -14024 226374 209658 105693
11926 105693 -238167 127275 -157061 134082 -328322 -48309 -32810 -46610 -270457 -16798
11915 -84360 135171 -21082 34242 26097 -179451 -106018 -253686 185603 -107452 -59640 -25687
11903 -27736 81142 89825 -170876 -103116 96153 -88038 115759 -626 -132680 2991 -39442 316098
11890 -272067 115731 -172770 318228 -256865 179735 70960 -85568 -85039 2169 117637 10826
11878 -6575 -61545 477 -15159 -287356 322293 37916 53745 47291 109083 -54165 -346599 107004
11865A19167J42934F7931Q129c34839h7360m3920N3297m1729c6768o2526L7511
11854f1783l1452J0564E3818j4263L4438a52990l8989k9490h6722L072r22j00732
11842a85304Q4519A54363b29897O4827N6705r1667M8611f8631A63764n8800B698
11830D7864J2852N7264l0892O0800c87074C95619b54626j60043a45860e4564K3367
11819c1197C28708c32731h1353B93117j28729h268I427b46789G99L4947a07285
11807c88635h0370A45641c5763L280G5476h1607p9385G0011f5403j62021J10719
11796a16705n0343j04275A38616k9560b72691B8382O4175a25368H5866d2129k07477
11785b49606E5934J22501q4567r7D4484J39597o0718n5387J05427i6851F1924
$$ plain form
11865 119167 262101 67931 76060 -334839 -87360 -131280 -77983 -119712 -36768 -99294 -61783
11854 -61783 -93235 -82671 53818 39555 73993 -152990 -191979 -221469 -86722 -83650 -84572 -185304
11842 -185304 -100785 154363 -229897 -165070 -108365 -200032 -151421 -68631 163764 104964 2698
11830 47864 60716 117980 87088 147888 -387074 395619 -254626 -414669 -145860 -54564 -31197
11819 -31197 328708 -332731 -81353 293117 164388 -8268 9427 -246789 799 35746 -107285
11807 -388635 -80370 145641 -35763 -32483 75476 -81607 -160992 70011 -65403 -227424 -116705
11796 -116705 -167048 -271323 138616 109056 -272691 28382 92557 -125368 85866 -42129 -249606
11785 -249606 55934 178435 93868 93771 44484 184081 123363 67976 173403 -96851 61924
11773i5248g910B04851a52010p7947j33743b1825D8976a56611N7074J1724m16415
11762e04228g3175A4451g2843k13467C04702d91914i2599A66677B3429g2263j2700
11751h4963A03380E209b30281N5457M5972m5059J2687q7420Q2011F4113K82236
11740C46349G5879N1165P5674e6777D0160a05412b0776p824A27577J30558f2488
11728g6525k02726e6828C75968j48461e0043B37818c0874H6669j6157l4472a4159
11716e6111a567I2985a22884A71827D1833J16323b1454l7315E6102b06268A5336
11704B6859K74868A11112Q0548b61987c0857A49965g0075o0580j918F0664J812
11693F2476k5280J31688J32207C3283b282k02166j64194A83636A808L09856a49211
$$ plain form
11773 -95248 -7910 204851 -152010 -229957 -363700 -21825 48976 -156611 -99537 -87813 -504228
11762 -504228 -73175 14451 -72843 -286310 304702 -491914 -92599 166677 23429 -72263 -84963
11751 -84963 103380 5209 -230281 -174824 -128852 -173911 -161224 -248644 -166633 64113 346349
11740 346349 75879 127044 202718 -56777 40160 -105412 -20776 -28600 127577 258135 -62488
11728 -76525 -279251 -56828 375968 227507 -50043 237818 -30874 86669 70512 36040 -14159
11716 -56111 -1567 92985 -122884 171827 41833 158156 -21454 -58769 56102 -206268 15336
11704 26859 301727 111112 191660 -261987 -30857 149965 -70075 -130655 -132573 60664 62476
11693 62476 37196 168884 301091 33283 -2282 -204448 -368642 183636 1808 311664 -149211
11681E6946a49804A58308a50902H1041a14118A70429J51075j40144a49896I6655
11670d22464A98578N1722P7208C5857a20774A34967d4309B21110q555c43055a5935
11658I5700d0192F9810R936K05696D5119A6449a26295N8136B42552b893k30889
11647b33782c4385G6304B7805J20185M9844b99933A1286J22904D7400L0687J86006
11636B64093I1768A1906J41647b43586F4179J07845B7102b3854k4985a4912o4878
11625g9790A34120a82A10506c3096m9713A10881K7215j6897B266J44732b8794
11613A78840h9856k5271k49754A63373d9176j90003D6045M3341C2619P7110R568
11602A19297a56250j41390B17512D6745O8882b22431H339a30036c9452F4282Q8691
$$ plain form
11681 56946 -149804 158308 -150902 81041 -114118 170429 321504 181360 -149896 96655
11670 -422464 198578 250300 327508 35857 -120774 134967 -44309 221110 212555 -343055 -15935
11658 95700 -40192 69810 79746 285442 45119 16449 -126295 -68159 242552 -2893 -233782
11647 -233782 -34385 76304 27805 147990 197834 -299933 11286 134190 47400 78087 264093
11636 264093 91768 11906 153553 -243586 64179 172024 27102 -23854 -48839 -14912 -79790
11625 -79790 134120 -182 110506 -33096 -82809 110881 138096 121199 2266 146998 -28794
11613 178840 -89856 -115127 -364881 163373 -49176 -239179 46045 89386 32619 109729 119297
11602 119297 -156250 -297640 217512 46745 115627 -222431 8339 -130036 -39452 64282 152973
11591A52973O7873e7372B65838c7381A07778f347A15369l4003k6495J73590b02342
11579C8321a59366F3218J60356c5889C14596G3682i5208j08906e5213B94875b9894
11567a92709a2841m0895C13135B8758a39312C15221M4009A37695b09367F8121
11556A32063c1660C25008A14362b03819A9278K28590j22674J26296A16695b3566
11545a00536C02252j07633m8197b44630i1534E58838a6057A58355A1995f5106
11534C22082A10181a7801j87887H5953j3611f51j02193M3554A50262A0993g4338
11522E4088m519J3889g8144B95961c9974C47234e7294A09617a63773A7382N2108
11511F9490K83838a65877D4646a2318j80580A22413a8659D4789c6116j98714Q3625
$$ plain form
11591 152973 220846 -57372 265838 -37381 107778 -6347 115369 81366 54871 228461 -202342
11579 38321 -159366 63218 223574 -35889 314596 73682 -95208 -204114 -55213 294875 -29894
11567 -192709 -12841 -53736 313135 28758 -139312 315221 359230 137695 -209367 68121
11556 132063 -31660 325008 114362 -203819 19278 247868 125194 251490 116695 -23566
11545 -100536 302252 194619 146422 -244630 -91534 558838 -16057 158355 11995 -65106
11534 322082 110181 -17801 -205688 85953 72342 -651 -102844 -59290 150262 10993 -74338
11522 54088 49569 63458 -78144 295961 -39974 347234 -57294 109617 -163773 17382 69490
11511 69490 353328 -165877 44646 -12318 -192898 122413 -18659 44789 -36116 -234830 -151205
11500a51205A68470b956A59573a04508c2051k06105P8884I4428M8448a10126L1734
11489g8392A01395O3332c5991B93278B4967e7725A55643N3764f8866a3917D1436
11477C37863I6337k3606e4599m0906b6069q7487H8596b67554Q8113a0540A98120
11465A53804a46184A53301k3079b75020G6120L36467h2655c742A15127E4872p026
11454D7846c1011j82463A1773a87815B60713J18973k0373A75810E6842c52885
11443A18417J0731i5275n1234K3142M6422A56429R7605l8129J20806e8617C24503
11431a98419A84567F9622D488c24245a19673G9327a01369A37711i9123L2432F9009
11419A05962O4189J55428h6007A8795J59772q6481a5160A64951a68850B50170
$$ plain form
11500 -151205 168470 -2956 159573 -104508 -32051 -238156 -159272 94428 142876 -110126 -78392
11489 -78392 101395 164727 -35991 293278 24967 -57725 155643 209407 -68866 -13917 41436
11477 337863 96337 72731 -54599 -95505 -26069 -113556 88596 -267554 -179441 -10540 198120
11465 153804 -146184 153301 130222 -275020 76120 412587 -82655 -3742 115127 54872 47846
11454 47846 -31011 -213474 11773 -187815 260713 379686 359313 175810 56842 -352885
11443 118417 129148 -95275 -146509 -123367 -76945 156429 254034 215905 336711 -58617 324503
11431 -198419 184567 69622 4488 -324245 -119673 79327 -101369 137711 -99123 -66691 69009
11419 105962 170151 325579 -86007 18795 178567 92086 -15160 164951 -168850 250170
11408I3559b23537A50690b58040D6706n204b01959a2311k33971a6713A44104n204
11397A38900b88667o2726A39563m350c62710a17022C2900M2566c11359A73076
11386B21021d760q2863i033G0954m554J41647B6757i6035D7498g3762n0333j4962
11374a39057A84842a78328b5329A34959D7075a95099R0120E9014L8855a19310
11363h6596A83994A2794d6293A91123A7201c30753A65505m2003A7338N5295j4258
11352E8375h4510c4472A72466c54867C2064a3783A28501e2166j0867o8390B1241
11340a75767B5737J03385n2591C3182b70277B20912c95147e4866J3584D09651
11329f6518r3492G756P5955K34780c51256i4808H3453A1076J28685a4846C8153
$$ plain form
11408 93559 -223537 150690 -258040 46706 41502 -201959 -12311 -246282 -16713 144104 138900
11397 138900 -288667 -351393 139563 135213 -362710 -117022 32900 75466 -311359 173076
11386 221021 -4760 -87623 -9033 70954 66400 208047 26757 -96035 47498 -73762 -124095 -139057
11374 -139057 184842 -178328 -25329 134959 47075 -195099 -104979 59014 97869 -119310
11363 -86596 183994 12794 -46293 191123 17201 -330753 165505 123502 17338 72633 58375
11352 58375 -84510 -34472 172466 -354867 32064 -13783 128501 -52166 -63033 -131423 21241
11340 -175767 25737 129122 76531 33182 -270277 220912 -395147 -54866 -41282 409651
11329 -66518 -160010 7756 83711 318491 -351256 -94808 83453 11076 139761 -14846 38153
11317A78063H0717d9711j14142G8387a71200g2324K5413A03444o120b48339j436
11306b49775a08253L4176j50678A6396M40516a18048j31799G2712J80950a70760
11295i0410D57517A57881a27930r8929j04788J16276A91407a06053l39861b12161
11284A63345b58402A16077g0433A23155a78057o1529E00087h6241b0407r7131
11274a17538a4330l69535L3001h6076A4356R0262b7863k62360J02711N133g181
11262A88189J9848h8706j36201b2294A6690Q8452b03147g4716k14663B31474F1278
11250A44366a32022m4334B43478d5225l8768N796q3325D62258c6628A03478k1774
11239H1704j8494d9523A48565F5199b50007H2081M7620d4884n2918l51817b7014
$$ plain form
11317 178063 80717 -49711 -163853 78387 -171200 -72324 -46911 103444 97324 -248339 -249775
11306 -249775 -108253 -74077 -224755 16396 456912 -118048 -249847 72712 253662 -170760
11295 -90410 457517 157881 -127930 -226859 -331647 -215371 191407 -106053 -445914 -212161
11284 163345 -258402 116077 -70433 123155 -178057 -239586 500087 -86241 -20407 -117538
11274 -117538 -14330 -383865 -350864 -86076 14356 104618 -27863 -290223 -187512 -182379 -7181
11262 188189 208037 -88706 -224907 -22294 16690 105142 -203147 -74716 -289379 231474 61278
11250 144366 -132022 -176356 243478 -45225 -83993 -78197 -161522 462258 -36628 103478 81704
11239 81704 63210 -49523 148565 65199 -250007 82081 129701 -44884 -97802 -449619 -27014
11227B26242c63824A99209b40053H9979h4446k14235G6294P4907p391m3267f3985
11215F9299a37979j9951B3962J12938a13676j978B2434b09688A07118a90721c6610
11203a02328E8943c03746A9720M5278b09674A43634K9510a46048P2766A52814
11192B32490r4011a25300A60301K2861b60085a23348e2430A53205a55131e1892
11181A22619L927g3156a2715k31972a11678K7865k5358o1768k42431J40538A03513
11169a27176B12549A4436b902G263J37181J79344b43305g2832q425C5540a38900
11157h3041F207J82109b01536M070A26289d33058J68573I6420J23325a01226B43441
11145b99351c0368H5794c17615B12029o9446b10001g8684B22454I3834e3025B81374
$$ plain form
11227 226242 -363824 199209 -240053 89979 -84446 -298681 76294 151201 143810 100543 -63985
11215 69299 -137979 -157930 23962 136900 -113676 -115654 22434 -209688 107118 -190721 -36610
11203 -102328 58943 -303746 19720 64998 -209674 143634 173144 -146048 -73282 152814
11192 232490 138479 -125300 160301 183162 -260085 -123348 -52430 153205 -155131 -51892
11181 122619 126546 -73156 -12715 -244687 -111678 -83813 -109171 -170939 -413370 -272832 103513
11169 -127176 212549 14436 -2902 7263 144444 323788 -243305 -72832 -81257 35540 -138900
11157 -83041 6207 188316 -201536 -197466 126289 -433058 -264485 96420 219745 -101226 243441
11145 -299351 -30368 85794 -317615 212029 142583 -210001 -78684 222454 93834 -53025 281374
11133a74529C4357A4462O6837k5711L51971B03730j5786b73754E4763a15053A01906
11121B3900c07589C79698a48853B66985g7112l5202b935k73005a24831A53835
11110e0495B45011f2928J0291n9917B3982J18076c18807A5971J31706a10758A66483
11098A49384C5308K4934M81495a7966B76741j27125J89965f293A74568b64003
11087a04036B26129K38275A0451K76279B3374K24498D6248R922L25251C5401L3017
11076F8418M9195J91723e3658A54588L25703A25920J72508E3817J07943j644J58482
11065C18598J48123P0843R044A23827R3604J37508R9118j07660J61522F7043K42905
11054C09948K76607Q2896k63347O6826K6821j49139J51747O901J71042o0083k04276
$$ plain form
11133 -174529 34357 14462 81299 55588 407559 203730 187944 -273754 54763 -115053 101906
11121 23900 -307589 379698 -148853 266985 -77112 -112314 -2935 -275940 -124831 153835
11110 -50495 245011 -62928 -52637 -112554 23982 142058 -318807 15971 147677 -110758 166483
11098 149384 35308 60242 541737 -17966 276741 149616 339581 -6293 174568 -264003
11087 -104036 226129 464404 10451 286730 23374 247872 46248 56170 381421 35401 68418
11076 68418 117613 309336 -53658 154588 480291 125920 298428 53817 161760 160116 318598
11065 318598 466721 537564 546608 123827 217431 354939 454057 346397 507919 67043 309948
11054 309948 586555 669451 406104 472930 499751 350612 502359 509260 680302 620219 415943
11043D15943J80152j43436K84290C03236N18252k45502j08374J1122j32963J732
11033C47503L19835A51075K04745l9855p0816J59337P5429P236J26826E5759P36013
11022G91772j03091J3088l28633J09774M7017Q0308k09397Q9672J85096B73294
11011E06161j57923C4140L00686K84298k00576A89158J87089A64861M97298k12202
11001D49957k2602r455R1893A87483P0805N56868A79014l6252K77802l9773J06569
10990D87360K10427M8593j70557J63073j93288K71483k16530j91400L38617K12731
10980I60509J9417j90534L72304l30312M6718K99434j4459J12566J32299k05635
10970A202307N38487j22562j2668j69042q3761M5956K61479n54588L43263n07359
$$ plain form
11043 415943 596095 452659 736949 303236 821488 575986 467612 478734 345771 347503
11033 347503 667338 151075 355820 315965 245149 404486 479915 487151 613977 55759 791772
11022 791772 688681 701769 373136 482910 529927 610235 400838 490510 675606 273294
11011 506161 348238 34140 334826 619124 418548 189158 376247 164861 662159 449957
11001 449957 427355 417900 509793 187483 258288 815156 179014 142762 420564 380791 487360
10990 487360 697787 746380 575823 738896 545608 817091 600561 409161 747778 960509
10980 960509 979926 789392 1161696 831384 878102 1177536 1163077 1275643 1407942 1202307
10970 1202307 1740794 1618232 1605564 1436522 1352761 1398717 1660196 1105608 1448871 941512
10960I41512o5530P1474J41307k34389L86424k82150O6882j92227J5085j6867
10950H31521J98923m37740j7289k30819L3130p3288a9779D22902j77935J04439
10940C49406m0664F5489a15857J1486B60845J4919D8938b82809J10579d9051H2015
10928A12590f0813A17283k9021B9082J11932C0140b89423d8443J698C30929B9925
10916f3024r2986g7394k2194A54929b1475p5557A599b1544r2026N0646F2486R4881
10904A57367K9928A3056P2870a39325e3869B4072b73895L6413N0512G1120l977
10893F7143e8268B5433Q1964O6360o1985R231M9901a8381H6770L32554g1744l24847
10881c96591A00830C9127a9403k39618A21622a37006o6837N0471A0494h2813B63213
$$ plain form
10960 941512 875982 947456 1088763 854374 1240798 958648 1025530 833303 848388 831521
10950 831521 1030444 592704 575415 344596 377726 304438 -19779 422902 244967 349406
10940 349406 308742 65489 -115857 -104371 260845 275764 48938 -282809 -172230 -49051 82015
10928 112590 -60813 117283 88262 29082 141014 30140 -289423 -48443 -46745 330929 29925
10916 -63024 -156010 -77394 -99588 154929 -21475 -97032 1599 -21544 -113570 -62924 62486 157367
10904 157367 187295 13056 85926 -139325 -53869 24072 -273895 -237482 -186970 71120 67143
10893 67143 -58268 25433 107397 173757 111772 121003 170904 -18381 86770 419324 -71744 -396591
10881 -396591 100830 39127 -19403 -259021 121622 -137006 -203843 -153372 10494 -82813 263213
10869a42277E2736J00988c23674B9967b3240k59224B4139i7784F9835K2267a03568
10857E3718J8767N6167b81820A68842k4021f6118A25865c45911a13674A31949
10846D5300M6298d2457A91866a33238b6298B63451a33328f1683k80053I0813a52639
10834a53057o3470n164g6381B2850J63890D3067B0754a54386G0957J29914b16034
10822b35066C3030a89884I163d92479a86218H0362a89104C096J00729M224b5981
10810a54674C5731a26328n4061k07831A82850a2523j85503C9562K25828i6553
10799b65734E0556b76888A76158b43483J2644e0376A93973a57213n6153F8978
10788h974p3727r4296p9457P9754C0499J43636F7472a39565G4942J63199E5501
$$ plain form
10869 -142277 52736 153724 -323674 29967 -23240 -282464 24139 -97784 69835 92102 -103568
10857 53718 72485 128652 -281820 168842 144821 -66118 125865 -345911 -113674 131949
10846 45300 91598 -42457 191866 -133238 -26298 263451 -133328 -61683 -341736 90813 -152639
10834 -153057 -216527 -221691 -76381 22850 186740 43067 20754 -154386 70957 200871 -216034
10822 -235066 33030 -189884 9163 -492479 -186218 80362 -189104 3096 103825 108049 -25981
10810 -154674 35731 -126328 -180389 -388220 182850 -12523 -198026 39562 265390 -96553
10799 -265734 50556 -276888 176158 -243483 -230839 -50376 193973 -157213 -213366 68978
10788 -8974 -82701 -176997 -256454 -176700 30499 174135 67472 -139565 74942 238141 55501
10776b66353R884L6641A53461c1629j18748H4231A829J90466H4887R6276B4179
10764A13784E324K16771a5672j39328B83908a82057d3388k48707p6709A77589
10753G9576A7975a01289k50262a0092E350a42821d9879o4096C2700J19410a89486
10741f22C52457j38572b9517k18297C3519P654O5013i7551p7906A87150a82230
10729a95183O4813E37J62578h7340l1485j9488A76622b63027N3168J6610E3613
10717a12024b0523G8788a43208m1294B2709c0258E5777a44387E3297M711J27421
10706A85429D6642a41002j87136A04281i6008E8321a6574A60246O7668D5464O7081
10695A12545E3524A9739c29519P0743Q5404j77330D6378f7440A3814b64605a24325
$$ plain form
10776 -266353 -256469 -219828 153461 -31629 -150377 84231 1829 192295 84887 181163 24179
10764 113784 5324 222095 -15672 -155000 283908 -182057 -43388 -292095 -368804 177589
10753 79576 17975 -101289 -351551 -10092 5350 -142821 -49879 -113975 32700 152110 -189486
10741 -622 352457 213885 -29517 -247814 33519 41173 106186 -97551 -175457 187150 -182230
10729 -195183 -130370 537 163115 -87340 -118825 -138313 176622 -263027 -209859 -193249 53613
10717 -112024 -20523 78788 -143208 -184502 22709 -30258 55777 -144387 53297 58008 185429
10706 185429 46642 -141002 -328138 104281 -96008 58321 -16574 160246 227914 45464 112545
10695 112545 53524 19739 -329519 -258776 -173372 -350702 46378 -67440 13814 -264605 -124325
10683e14416a0069n2513I2518m2703a31853O4855m835b119D2340f8787l57962
10672d26749d340m032A82118o2247C0308a40416A2052a4061j59116d6747A36912
10660A8979k561d8822C8687i6362j05895L3010p9872o7537g5865I7039a23588
10648H3501L0527a38942H9720c0392k1794r6599H641b36079a10677A08819a33012
10636B60643c42771E1871J10898c1341B10011a96432A12052B8192K13803b4986
10625F3007b12804K223n4089R0818J2487O948A9099J9262Q5284h4994j12371A39443
10612A41809a58616d8862A70790e1969q4922A12623m9221M1157J7664g1607B26920
10600b54788E432a72116B55863a84388H1341M5636a50195j7850q8297E2706a11250
$$ plain form
10683 -514416 -10069 -62582 92518 49815 -131853 -66998 -71833 -2119 42340 -68787 -426749
10672 -426749 -4340 -8372 182118 119871 30308 -140416 12052 -14061 -173177 -46747 136912
10660 18979 16418 -48822 38687 -96362 -202257 -169247 -249119 -316656 -75865 97039 -123588
10648 83501 114028 -138942 89720 -30392 -52186 -148785 8641 -236079 -110677 108819 -133012
10636 260643 -342771 51871 162769 -31341 210011 -196432 112052 28192 241995 -24986
10625 63007 -212804 -210581 -264670 -173852 -161365 -154417 19099 38361 123645 -84994 -197365 139443
10612 141809 -158616 -48862 170790 -51969 -136891 112623 63402 104559 122223 -71607 226920
10600 -254788 5432 -172116 255863 -184388 81341 126977 -150195 -168045 -256342 52706 -111250
10588a88654L3242C73a88347d7556d547p1347A7397a45570F4348g241n8797j24116
10576a90154Q993A62263a33431l3114J9935j07380A94238a08779K833j3017A09147
10564b6176k93372H0146a2830A39093g6955j90468A06719J88646D7708a0778q1818
10553i2596k20935d6555F5491a58732I3992e4634o4346m2049f2056F6943i0024
10541b80930A24991b01795A11290b03853L5285H3728b2201p3C01693a00966A31767
10529b09519a6681k33653L9675i3296k46729h2311l08600J62999a07889K8379
10519g9510B64132b07346E4014a81190O9a684B9248e158o7714k28517B71946a61076
10506C28170a52523b9784k06005F5418P1789m2912i9787M3787B8028B826i9330
$$ plain form
10588 -188654 -155412 373 -188347 -47556 -4547 -75894 17397 -145570 64348 -7241 -66038 -190154
10576 -190154 -181161 162263 -133431 -166545 -146610 -253990 194238 -108779 -105946 -118963 109147
10564 -26176 -319548 80146 -12830 139093 -76955 -267423 106719 295365 47708 -10778 -92596
10553 -92596 -313531 -46555 65491 -158732 93992 -54634 -118980 -161029 -62056 66943 -90024
10541 -280930 124991 -201795 111290 -203853 -168568 83728 -22201 -22274 301693 -100966 131767
10529 -209519 -16681 -250334 -210659 -93296 -340025 -82311 -390911 -227912 -107889 -79510
10519 -79510 264132 -207346 54014 -181190 -181121 -1684 29248 -5158 -72872 -301389 271946 -161076
10506 328170 -152523 -29784 -235789 65418 137207 94295 -99787 -56000 28028 2826 -99330
10494A6720a85249A94038a71126A74656h5575A61757K9260D1876J50428o7866
10484A24438L0012A9745d0771A05388J24684p9504J42443J03573A52159A8462
10473D5173R129L7052N7301b04793a7248B2620b57960A95051b8335A2542e2128
10461a15429H3283b3127j63379C6448a30133b807r0970I0150a38533A37108a40961
10449a46488A43908F4952c19353I156J86967M3405m1244O2337F149K10534d16720
10437b09172R8339m2943g5922G4729c48957a02587c906o1533k05211J07149d7709
10425H52L53411A3354b11086C52972c6749j52215G952N2426M7747P350g4014m2381
10413a16395G9841M5275c0100j35944D8536a93448b5467r3975k5742K3745A61570
$$ plain form
10494 16720 -185249 194038 -171126 174656 -85575 161757 191017 41876 192304 124438
10484 124438 154450 19745 -40771 105388 230072 150568 293011 396584 152159 18462
10473 45173 54302 91354 148655 -204793 -17248 22620 -257960 195051 -28335 12542 -52128
10461 -115429 83283 -23127 -186506 36448 -130133 -2807 -93777 90150 -138533 137108 -140961
10449 -146488 143908 64952 -319353 9156 196123 239528 198284 260621 6149 216683 -416720
10437 -209172 -110833 -153776 -75922 74729 -348957 -102587 -3906 -65439 -270650 -163501 -47709
10425 852 354263 13354 -211086 352972 -36749 -188964 7952 60378 108125 115475 -74014 -116395
10413 -116395 79841 125116 -30100 -166044 48536 -193448 -25467 -119442 -145184 -121439 161570
10401C08472k4581l7294b40670g72B00431O5830f2589q1018A72528k4681g9700
10389C71741j51012D2023a0737E6433K55997j16079m8517C8098b81819B24885
10378A21162l4820J22362I2695a68257j87423a7593B06808J42549B3590K20897
10368B44487A06215M12110j39867j57974J51359F6150J70436o5763J11237b37073
10357B07988Q639q1955K44212j46186J0264K5409r9617G3603K81910j13889K42512
10346D84136j89886K0390J79497B38275K7496P6052a3451A35539B4932J37695
10336A62627D4712J70649l0829G6882m478e997A6105b65227b3585I9570b1466
10324b61015A21340e6570D5399l231J14182a90581B31412a30446B01493E0192
$$ plain form
10401 308472 283891 246597 -240670 -772 200431 266261 -62589 -143607 172528 147847 -79700
10389 371741 220729 42023 -10737 56433 312430 196351 147834 38098 -281819 224885
10378 121162 86342 208704 92695 -168257 -355680 -17593 206808 349357 23590 244487
10368 244487 106215 518325 378458 220484 371843 66150 236586 170823 282060 -237073
10357 207988 216627 134672 378884 232698 242962 268371 168754 73603 355513 241624 484136
10346 484136 294250 314640 494137 238275 265771 341823 -13451 135539 24932 162627
10336 162627 44712 215361 184532 76882 72404 -5997 16105 -265227 -23585 99570 -21466
10324 -261015 121340 -56570 45399 42168 156350 -190581 231412 -130446 201493 50192
10313C7243J31743a78932a4073H4510a0462p1442A24047J49177B7747b39573O2417
10302a77156d1822I5713a4722k43749a16803A1838J41046b31071h4283l03878
10292c88161i7321J1023A32512m2648b240k47557A25113c57471B88062I176R9768
10281A08944a88109e0562a5846p3022A83680C013a98222R6643m5937B9267c1564
10269B61294A15842J8575a79411o1227a4851F9908a29939D0179J80639J31817
10259C52635r1967b2588D23580k09886C3342K78822a55444B34479a53735A96235
10248a87599c0759H1096g5752k06005h3805C22781a2672A06144J92637B7453O6850
10237I4303L3100c1390D066J79142a63400A50904c56800a55064d689j25646j9297
$$ plain form
10313 37243 168986 -178932 -14073 84510 -10462 -81904 124047 273224 27747 -239573 -177156
10302 -177156 -41822 95713 -14722 -258471 -116803 11838 152884 -231071 -84283 -388161
10292 -388161 -97321 -86298 132512 89864 -2240 -249797 125113 -357471 288062 9176 108944
10281 108944 -188109 -50562 -15846 -88868 183680 3013 -198222 -101579 -147516 29267 -31564
10269 261294 115842 134417 -179411 -240638 -14851 69908 -129939 40179 220818 352635
10259 352635 260668 -22588 423580 213694 33342 312164 -155444 234479 -153735 196235
10248 -187599 -30759 81096 -75752 -281757 -83805 322781 -12672 106144 298781 27453 94303
10237 94303 127403 -31390 4066 183208 -163400 150904 -356800 -155064 -4689 -130335 -149632
10226a49632H3364d7726c027P3n3046j7795j34437C2379N6575c279j29193K270
10214a30202j50484a11690l3904A02516l007m741a60503j67859a62085A37089
10203h4418c9284j23881N7376j48161f2157D6240m26a61070J3572N6784r2647
10192a83361k0996a6573A46744a53147b3609H7296a05800H5292C5927Q122a97044
10180a3890l03767a06667b1847j23896p9816M622j10325O4648A6939N595R9069
10169A21603Q6406a29293e1245A25096L8284J45893a49007j57919h0489N529A18745
10157h3795I1K85228K280F3567e7896B1106L3892b26452a3401D2097a49599K0914
10145a28685H882J4522b0899B59105a91185i3173l6596J9385M5925r1190B86844
$$ plain form
10226 -149632 83364 -47726 -3027 -2954 -56000 -73795 -208232 32379 88954 -3279 -132472 -130202
10214 -130202 -280686 -111690 -145594 102516 99509 94768 -160503 -328362 -162085 137089
10203 -84418 -39284 -163165 -105789 -253950 -62157 46240 45814 -161070 -147498 -90714 -183361
10192 -183361 -204357 -16573 146744 -153147 -23609 87296 -105800 85292 35927 44049 -197044
10180 -13890 -317657 -106667 -21847 -145743 -225559 -220937 -331262 -266614 16939 22534 121603
10169 121603 208009 -129293 -51245 125096 163380 309273 -149007 -306926 -80489 -74960 118745
10157 -83795 91 285319 287599 63567 -57896 21106 54998 -226452 -13401 42097 -149599 -128685
10145 -128685 8882 23404 -20899 259105 -191185 -93173 -129769 -110384 -64459 -155649 286844
10133d2698E9153a09640M2558j91012g4899l4388k5366A20183a50956B2690a04861
10121A9809e2303F016a25518G579b956j18300A0220d4715B33398g0519p2916m3585
10109a87020B08495b07226A19714E1869B842J93366b68426P848j1498Q7401j06939
10098b91614I1835l0954a20991o4207h8959k56620B8602c1116B6455a23418M5636
10087g7782D7780A3430f4576A06035C0078a074q0166A70430a36542B0096M2609
10076F2705a12148i97j78558P9712l06350i6980j29545g5107A4661M4949k0025
10065C9585b30162B41982A01335C5412R7799C5735a49639C11619H0731f0352r5649
10054a56001L4896K9972o1454f6175K7186A49410b53448A09532b82155J11433
$$ plain form
10133 -42698 59153 -109640 -67082 -258094 -74899 -109287 -134653 120183 -150956 22690 -104861
10121 19809 -52303 6016 -125518 7579 -2956 -121256 10220 -44715 233398 -70519 -143435 -187020
10109 -187020 208495 -207226 119714 51869 2842 196208 -268426 -260578 -272076 -184675 -291614
10098 -291614 91835 60881 -120991 -185198 -88959 -345579 28602 -31116 26455 -123418 -77782
10087 -77782 47780 13430 -64576 106035 30078 -1074 -81240 170430 -136542 20096 62705
10076 62705 -112148 -997 -179555 -99843 -406193 -96980 -226525 -75107 14661 59610 39585
10065 39585 -230162 241982 101335 35412 133211 35735 -149639 311619 80731 -60352 -156001
10054 -156001 -121105 -91133 -152587 -66175 -38989 149410 -253448 109532 -282155 -170722
10044a70722o8074G1417a52301a8736j66746D0560Q2703a2479j26984p2640l7620
10033b49723A97970G0744P1019F9853a67770d0279l14843a30812B71046E7707
10022a05244J4024k6009e027j64981p3601N9374D856a07409F4743K4242e1181
10010A03922k4465a6780j98187F4936o181a62334n9455d0473j70669k5788B08914
9998a59864o9461q439J16195A84096B9989b1513j4760A07978P1079l7778a99630
9986C3517b25765K6548r505A16c6410n4214A0489i2289r912B0343b57012g0533
9973f6196l07731J15873F8084j8560J35082a34952O5910B4773b3123j32367e7705
9961a04469D2501K17811A7836M1562b82609a8288n71510K17672f6711n3851b2284
$$ plain form
10044 -170722 -238796 71417 -152301 -18736 -185482 40560 123263 -12479 -139463 -212103 -249723
10033 -249723 197970 70744 141763 69853 -167770 -40279 -355122 -130812 271046 57707
10022 -105244 -91220 -117229 -5027 -170008 -243609 -184235 4856 -107409 64743 88985 -51181
10010 103922 79457 -16780 -214967 64936 58755 -162334 -221789 -40473 -211142 -236930 208914
9998 -159864 -229325 -237764 -121569 184096 29989 -21513 -36273 107978 179057 141279 -199630
9986 33517 -225765 -199217 -208722 116 -36410 -90624 10489 -92289 -102201 20343 -257012 -70533
9973 -66196 -373927 -258054 68084 49524 184606 -134952 -69042 24773 -23123 -155490 -57705
9961 -104469 42501 260312 17836 59398 -282609 -18288 -589798 -372126 -66711 -120562 -22284
9949C57453F5892b73992Q454A77418b47477J05804N2552j05105B33377I5743j0959
9938H4784a39016B25438a8886k11138B24168a11411j85305K477p8718f6432E0696
9926E9368f5808c0888r9493B40429A842e89823b43240c0279o1852k85775J43479
9915b34427M5364o5907k25072A46945f9462q7504H783a40496E7835B6527a20234
9903C0168c06694A29572b4859B69816A15977k8899D1310j7065b22875F5622Q5247
9892A50869a73213A57654a05695A43713i2573j70535A28769b28142K4587i4865
9881A66355b89219O6757a03660l7924j35449C9080c47120a2729B69141b74899
9870g9531H8854f7978p3085D8738e2332j41415L5893M2704l2766o2978C8446g1362
$$ plain form
9949 357453 65892 -273992 -265538 177418 -247477 -141673 -89121 -194226 233377 95743 84784
9938 84784 -139016 225438 -18886 -230024 224168 -111411 -296716 -294239 -372957 -66432 50696
9926 59368 -65808 -30888 -130381 240429 1842 -589823 -243240 -30279 -92131 -377906 -234427
9915 -234427 -189063 -254970 -480042 146945 -69462 -156966 8783 -140496 57835 26527 -120234
9903 30168 -306694 129572 -24859 269816 115977 87078 41310 24245 -222875 65622 150869
9892 150869 -173213 157654 -105695 143713 -92573 -263108 128769 -228142 -203555 -94865
9881 166355 -289219 -222462 -103660 -141584 -277033 39080 -347120 -12729 269141 -274899
9870 -79531 88854 -67978 -141063 48738 -52332 -193747 -157854 -115150 -147916 -210894 38446 -71362
9857a05430D0327f1407A58340f3114r82j05436l4172e2577A61955n6229O2747
9846A68473G7957a90715A2386J9337P4573m1654e1675I918J77902B1046K9568
9835E0614c13190D3668R9932b34175Q8293N8624o351r7358A35709c29563J03243
9824b26320B8217f7513C37615G237b55935A2080L8623J12305g6719a8796j38380
9813a57176N6154B88494A00108b12643i702B03871a55710K9849K6933L7623b8403
9801f4643j1202b3238r2633P587E9919a48371j15606h4256A31435d79607a98582
9789c16432A92763K6852a17210B1332J66206o7710a62110b7786j57121c8893j44292
9778a83185j18853i0288A8422c7432k16714j06479i3474k5359A39045J69595b60241
$$ plain form
9857 -105430 40327 -61407 158340 -63114 -64096 -169532 -203704 -52577 161955 105726 168473
9846 168473 77957 -190715 12386 31723 106296 64642 -51675 9918 187820 21046 50614
9835 50614 -313190 43668 143600 -234175 -145882 -87258 -93609 -190967 135709 -329563 -226320
9824 -226320 28217 -67513 337615 7237 -255935 12080 50703 163008 -76719 -18796 -157176
9813 -157176 -101022 288494 100108 -212643 -9702 203871 -155710 -125861 -98928 -61305 -28403
9801 -64643 -75845 -23238 -115871 -108284 59919 -148371 -263977 -84256 131435 -479607 -198582
9789 -316432 192763 219615 -117210 21332 187538 119828 -162110 -27786 -184907 -38893 -183185
9778 -183185 -302038 -90288 18422 -37432 -254146 -360625 -93474 -118833 139045 308640 -260241
9766E1010A5408M9534a91448L6865j89926J17140A1423K18772c51721a69826A09574
9754c29956J1984a0891l66672h7720m3644c2056k62845c3348A49588E2630A067
9742C0423a40206A35279b09871B7817A1059a55419f9094C54954a90053k257A29120
9730b45753b21D8907b24181C7854K15429p1235d6102k01603F3668a8854o0620
9719g9474j22121h1743j32135J02276E8156b8705I5011b13775f5735A39786c2530
9707a69570A0946a80246A16305H330g9164j1309G0569d6125E539i0637k57720
9696c48357D22143b23203e0455A54073b60119J27165M4138m3592j38385E4872
9685c10838C1099h5408A9191a38399D6084B1575a7682q1536m0527f9511K5003
$$ plain form
9766 51010 15408 64942 -191448 -154583 -344509 -227369 11423 230195 -351721 -169826 109574
9754 -329956 -317972 -10891 -377563 -87720 -131364 -32056 -294901 -33348 149588 52630 1067
9742 30423 -140206 135279 -209871 27817 11059 -155419 -69094 354954 -190053 -192310 129120
9730 -245753 -221 48907 -224181 37854 253283 182048 -46102 -247705 63668 -18854 -79474
9719 -79474 -201595 -81743 -213878 -111602 58156 -28705 95011 -213775 -65735 139786 -32530
9707 -169570 10946 -180246 116305 8330 -79164 -90473 70569 -46125 5539 -90637 -348357
9696 -348357 422143 -223203 -50455 154073 -260119 -132954 -88816 -132408 -270793 54872
9685 -310838 31099 -85408 19191 -138399 46084 21575 -17682 -99218 -139745 -69511 -44508
9674d4508l46097J61478J7613c0595n9400n00784E682h0135E1141K30664a42314
9662b15584h6097q206M3997A83789k3570A6630J23534h567l34479J69633Q4399
9651h9014j8309k12321G0217E620g5002j07990L6290n7468H965h3494l6800c2835
9638a57197a7028l5539A05597R7349i0085m8999m7121D718a66035C7254b08896
9626A5849L8341b1141j47879J7188k58873A25535h4005A11725d4875j5925j91520
9615b52320F1419J35968b71439A46850b40856B4762J35497d380r4396b7021A4726
9603H140a29754H0920M376B2511a75956A01805L3424a28077j46770i7816B57110
9591A66804A3062L4323c2571j037F0262k3246a2659l7675k50620O1801D43b04899
$$ plain form
9674 -44508 -390605 -229127 -211514 -30595 -89995 -590779 5682 -80135 51141 281805 -142314
9662 -215584 -86097 -94303 -50306 183789 160219 16630 140164 -8567 -343046 -173413 -89014
9651 -89014 -107323 -319644 70217 5620 -75002 -182992 -146702 -204170 8965 -83494 -120294 -32835
9638 -157197 -17028 -52567 105597 202946 -90085 -139084 -186205 4718 -166035 37254 -208896
9626 15849 54190 -21141 -169020 -151832 -410705 125535 -84005 111725 -44875 -60800 -252320
9615 -252320 61419 197387 -271439 146850 -240856 24762 160259 -4380 -98776 -27021 14726
9603 8140 -129754 80920 85296 22511 -175956 101805 135229 -128077 -274847 -97816 257110
9591 166804 13062 47385 -32571 -33608 60262 37016 -12659 -50334 -300954 -239153 443 -204899
9578c3252j61459B6040J59789h7642l30895H5104J34602a03487o6542A42068J54990
9567B97058a86210b346k35898Q3913q2054p9615h7610p8599B3728J60860J96747
9556C81335a21920A90583c75115B63043c8681B9511i4635j2031K6073A70063d00912
9544B43198D6547d551l0138j59912j10613J21174A10330g6216E7643j968a1292
9532A82061b74583E2416f4209j16778J5752A42206D2633j8972b39944j1970F6909
9520g7671C3709d43127a35988j54554A63378j971a5882k58305D2790A1489a85492
9508a34366r501A8924d57955F6476o897a90125k1046B1074i5023k5406A89740
9496b82988J13349M6607G2610h0401e866n082n4772k74915P362P9453C03933A19437
$$ plain form
9578 -33252 -194711 26040 185829 -87642 -418537 85104 219706 -103487 -170029 142068 297058
9567 297058 -186210 -2346 -238244 -154331 -236385 -316000 -87610 -166209 23728 184588 381335
9556 381335 -121920 190583 -375115 263043 -38681 29511 -94635 -106666 -80593 170063 -400912
9544 243198 46547 -4551 -34689 -194601 -305214 -184040 110330 -76216 57643 55675 -11292
9532 182061 -274583 52416 -64209 -180987 -165235 142206 42633 23661 -239944 -251914 66909
9520 -77671 33709 -443127 -135988 -290542 163378 161407 -15882 -274187 42790 11489 -185492
9508 -134366 -143867 18924 -457955 66476 59579 -190125 -211171 21074 -95023 -120429 189740
9496 -282988 -169639 -123032 72610 -80401 -5866 -10948 -65720 -340635 -333273 -253820 303933 119437
9483A43141b03636Q2108I8438d66768a63282B20955q1552m1246d9955H223b65994
9471a63573H4554a08820B11156F4213a06072a3341j46785m2699f3526m51248b49547
9459A02272C5977M9796d6629A974K8535c4133L280k22787a14908k3756b6633C37460
9446A41277K316A7541e1334b2565r8441F3140a09827D316c2179B09948b32290
9434E935K7646c75073A93096C5448i3513C9052b14364R7278H8567N4909m4053
9423I9423c66290e2313o6356A05413L4229J23523i0033j47029A37958A7408a42509
9411A44720c0527I7090A9764N1585a17808K3256k86390d7541G7660b68045j1810
9400b79855a11114B47197a98721F9314e8377n6117j9651K5876d8527d748j325
$$ plain form
9483 143141 -203636 -121528 98438 -466768 -163282 220955 139403 98157 -49955 8223 -265994
9471 -163573 84554 -108820 211156 64213 -106072 -13341 -160126 -202825 -63526 -514774 -249547
9459 102272 35977 85773 -46629 1974 30509 -34133 -30853 -253640 -114908 -138664 -26633 337460
9446 141277 143593 17541 -51334 -22565 -121006 63140 -109827 4316 -32179 209948 -232290
9434 5935 33581 -375073 193096 35448 -93513 39052 -214364 -117086 88567 143476 99423
9423 99423 -366290 -52313 -118669 105413 139642 263165 -90033 -237062 137958 17408 -142509
9411 144720 -30527 97090 19764 71349 -117808 -94552 -380942 -47541 77660 -268045 -279855
9400 -279855 -111114 247197 -198721 69314 -58377 -114494 -134145 -108269 -48527 -4748 -6073
9389f073E715a62001o613K982G7145B8745J20653b87209E0730J96049D4282a7963
9376h7309F3587J15668b49656I6033j9715d7936r4666j09116B52815r879G9670
9364a90507j08416a9017j6809B9313e0311o3810e5013k36020A84727i861F4984
9352e5769p0839A91691p6747m2664M1702e291l0856j99275F3733b15551C8754
9340a06992B65770a0018j44141c1601n160B2930a07473M0966k2705C4609a18492
9328H185a08036k7845A30540a26460h199l54099c247j20581C9300N1332C036b14544
9315a61184g263G9635a13887R734F3124a54680f584l41307a37366m06523a30877
9303d6903j88994A16565a1193l86515B58305N9291a60778A18393a63041k92433
$$ plain form
9389 -6073 5715 -162001 -168614 -165632 77145 28745 149398 -287209 50730 246779 44282 -17963
9376 -87309 63587 179255 -249656 96033 76318 -47936 -142602 -251718 252815 242936 79670
9364 -190507 -298923 -19017 -35826 29313 -50311 -114121 -55013 -291033 184727 -9861 64984
9352 -55769 -126608 191691 114944 72280 113982 -5291 -36147 -235422 63733 -215551 38754
9340 -106992 265770 -10018 -154159 -31601 -36761 22930 -107473 -66507 -89212 34609 -118492
9328 8185 -108036 -135881 130540 -126460 -8199 -362298 -3247 -123828 39300 90632 3036 -214544
9315 -161184 -7263 79635 -113887 -104153 63124 -154680 -6584 -347891 -137366 -543889 -130877
9303 -46903 -235897 116565 -11193 -397708 258305 317596 -160778 118393 -163041 -455474
9293d55474b07639a1893G6780c59401g6929n3790O1789A406Q9167i8896A38020
9281B18672c96680b1290j30033c0167k65424E0500b29796B66756d9530b024j68692
9270a70716N0753B22204a16303k52195a08638K7055a1199A05881D0262a03028
9259b64480j6593B2306I698O3119l750a16525j09573K5290p3168J35487M6036
9248i2453A73199c7634l2975k53865D7061c97901A79554e9135k07059J00752g4715
9236a0954I3426a439k14193B49807a77121j38054B05980M3697a26274G2153g5995
9224b7453l2096A23213c2430j37736J4956c9857k05543Q6282o687k69301a65542
9212b89089J04264j72466A28393k8300b50734G336K00960j00519Q3466b6437j19806
$$ plain form
9293 -455474 -207639 -11893 76780 -359401 -76929 -130719 -68930 1406 90573 -98896 138020
9281 218672 -396680 -21290 -151323 -30167 -295591 50500 -229796 266756 -49530 -2024 -170716
9270 -170716 -119963 222204 -116303 -368498 -108638 -81583 -11199 105881 40262 -103028
9259 -264480 -281073 22306 9698 72817 69067 -116525 -226098 -200808 -273976 -138489 -92453
9248 -92453 173199 -37634 -70609 -324474 47061 -397901 179554 -59135 -266194 -165442 -74715
9236 -10954 93426 -1439 -215632 249807 -177121 -315175 205980 249677 -126274 72153 -75995
9224 -27453 -59549 123213 -32430 -170166 -155210 -39857 -245400 -159118 -165805 -435106 -165542
9212 -289089 -184825 -357291 128393 100093 -250734 7336 208296 107777 191243 -26437 -146243
9201a46243B30126b3583D61740A55484a93863B84402e3222C6007O0012J552a47140
9189D6029e4602A01199K28906e4854A06493a57342O3374n4400N99D3157j0276
9178C2881g9067l3156n2902D9411f7071a0426A23439D4558c6491j0678q1126D4396
9165c01847A10195b645k17626C9774c69366J08844O267R0894n9056A41415j5644
9154A25771a7525j13267G3306a04291L3940b3849k44730f6256k23151h201E1972
9142B39564m5972D5741e2472l08096a18470D3027L6442f0507A19760a4069A37814
9130b85106h5061H4622A3314b17052B027a13833k26722a9984j62881A60622B4974
9118a36947A92380j3872a1513j87947o3689A4738K07871a05917k07290B6167J390
$$ plain form
9201 -146243 230126 -23583 461740 155484 -193863 284402 -53222 36007 96019 97571 -147140
9189 46029 -54602 101199 330105 -54854 106493 -157342 -93968 -148368 -147769 43157 32881
9178 32881 -79067 -112223 -165125 49411 -67071 -10426 123439 44558 -36491 -47169 -128295 44396
9165 -301847 110195 -2645 -220271 39774 -369366 -260522 -254255 -163361 -222417 141415 125771
9154 125771 -17525 -130792 73306 -104291 -70351 -23849 -268579 -66256 -289407 -8201 51972
9142 239564 193592 45741 -52472 -360568 -118470 43027 79469 -60507 119760 -14069 137814
9130 -285106 -85061 84622 13314 -217052 2027 -113833 -340555 -19984 -182865 160622 24974
9118 -136947 192380 178508 -11513 -199460 -263149 14738 222609 -105917 -313207 26167 27557
9107B7557f8010b2466j37270f3408F599a17551L691g832j88334J982j8113i661
9094a82358P4524a3812l25914A12733q987i1377j87900g4902n4759O2464B6456
9082c34280A79315h3953C362J29772N5067n6607a29590H684h8914B597J39061
9071A41658a84549K2187j0421N0251A3341b26401e7302l5362G3968k6147J47124
9060A94945f791B19063k1951F7556a11914L1756D4804a26863F6713i4305B0720
9048a9108n3968J5035i909k54832A5091L3069A0411K12107m2608m9985a50822
9036A87208g0056a0898j4240j54715J2059B0310J36539a20254b603j35825e8981
9024A24691n3229A9682c6220G0733J2168c38156J04827N0718F5139J5444b00572
$$ plain form
9107 27557 -68010 -22466 -159736 -63408 6599 -117551 -113860 -7832 -196166 -194184 -212297 -9661
9094 -182358 -107834 -13812 -339726 112733 103746 -91377 -279277 -74902 -129661 -67197 26456
9082 -334280 179315 -83953 3362 133134 188201 131594 -129590 8684 -88914 2597 141658
9071 141658 -184549 -162362 -172783 -122532 13341 -226401 -57302 -92664 73968 47821 194945
9060 194945 -6791 219063 197112 67556 -111914 -80158 44804 -126863 66713 -94305 20720
9048 -19108 -73076 -58041 -9909 -264741 15091 48160 10411 222518 179910 129925 -150822
9036 187208 -70056 -10898 -25138 -179853 -167794 20310 156849 -120254 -2603 -138428 -58981
9024 124691 71462 19682 -36220 70733 82901 -338156 -233329 -182611 65139 80583 -200572
9012A00904l3894k6625J51178a65749g1588C0831c73430A14140a39319j26902
9002b66221A98190o9641Q8847j03072b10744E3584e725o1740j21640B36645c8726
8990b95523d2583l53508a50145f8440B58628f5344o1805H3071h8067m3443h983
8978b05207A24890a83235l8007A36929A1147P7524a9774n627C6592Q2965A1644
8966a16477e305p8175c2275q1393j03990N4712C7697a7647p2569M0292m9499D4889
8953i7767A35528i2331p6920A90113J33372b19864a7215A69861F9915N3304B8259
8941b2629n7686a9656k387B01721A1119J0841K00670q6518r508L5468i256k03908
8929b13164C83209D7722J11975P1173O5915G0285N27152n425J40738O19706K08075
$$ plain form
9012 100904 67010 40385 191563 -165749 -71588 30831 -373430 114140 -139319 -266221
9002 -266221 198190 128549 217396 114324 -210744 53584 -5725 -67465 -189105 236645 -38726
8990 -295523 -42583 -396091 -150145 -68440 258628 -65344 -127149 83071 -88067 -131510 -8983
8978 -205207 124890 -183235 -221242 136929 11147 88671 -19774 -25401 36592 119557 11644
8966 -116477 -5305 -83480 -32275 -113668 -217658 -162946 37697 -17647 -90216 -49924 -99423 44889
8953 -97767 135528 -92331 -169251 190113 323485 -219864 -17215 169861 69915 123219 28259
8941 -22629 -80315 -19656 -22043 201721 11119 21960 222630 136112 126604 162072 -9256 -213164
8929 -213164 383209 47722 159697 230870 296785 70285 597437 592012 732750 1352456 1560531
8918A560531n40669D17348H3341J47627H7289C4087a4231q8179m2599f845p5644
8907h2489j5022o6666j7791g5382l83738g9278r002I2282e9856k02591l6011a28244
8894b23834A12868a56489e0209B25753a01836E7947J25771D914a79376A73704
8883A7628k029a3513k06196A77078G0860L3626b12207c907A18377b62670a23850
8871F583g7010A79284b39326a6284A86575a90494q1297f0400k7998A72713c49859
8859A74678i5984P501c0419F9646a39842j0600c9151j82823A67180a9702A19314
8847A52487b27340p0083n3090I4610a0329A44336b6682j40609C5754a03445E7670
8835a36982b4664q9905n2633j83223A50032N0825r5359a12282j27181d4652A00626
$$ plain form
8918 1560531 1019862 417348 83341 230968 87289 34087 -14231 -102410 -145009 -6845 -82489
8907 -82489 -97511 -164177 -181968 -75382 -459120 -79278 -88280 92282 -59856 -262447 -298458 -128244
8894 -223834 112868 -156489 -50209 225753 -101836 57947 183718 4914 -179376 173704
8883 17628 15599 -13513 -219709 177078 70860 104486 -212207 -3907 118377 -262670 -123850
8871 6583 -77010 179284 -239326 -16284 186575 -190494 -271791 -60400 -88398 172713 -349859
8859 174678 -95984 -88483 -30419 69646 -139842 -150442 -39151 -221974 167180 -19702 119314
8847 152487 -227340 -297423 -350513 94610 -10329 144336 -26682 -167291 35754 -103445 57670
8835 -136982 -24664 -114569 -167202 -350425 150032 200857 105498 -112282 -239463 -44652 100626
8823f4658K0485A17036b05252o5131B6523a76491E0069N8993O4991a8172j53400
8812a71572j09589P4634R7884b1210k8754G1540a7436j11576E5027e7758p3277
8801a31035E6948a18163J0988n6872N2273A17436B6641d08911a25485c0204j73891
8790b04095j4397G4794c92104C17186c5765A39470a06266C983a77770A7910J03434
$$ plain form
8823 -64658 -44173 117036 -205252 -270383 26523 -176491 50069 109062 174053 -18172 -171572
8812 -171572 -281161 -206527 -108643 -21210 -49964 71540 -17436 -129012 55027 -57758 -131035
8801 -131035 56948 -118163 -107175 -164047 -111774 117436 26641 -408911 -125485 -30204 -204095
8790 -204095 -218492 74794 -392104 317186 -35765 139470 -106266 3983 -177770 17910 121344
$$ [...]
##END NTUPLES=NMR SPECTRUM
##END=
