##TITLE=NES1033_872015079_9243059_InYdxdyMnh
##JCAMPDX= 6.0         $$ Bruker NMR JCAMP-DX V2.0
##DATA TYPE= NMR SPECTRUM
##DATA CLASS= NTUPLES
##ORIGIN= BRUKER
##OWNER= Administrator
$$ 1.72 TOPSPIN		Version 2.1
$$ 2015-08-24 14:39:33.280 -0700  Administrator@X
$$ Compression mode = diff/dup
##.OBSERVE FREQUENCY= 400.02188249412
##.OBSERVE NUCLEUS= ^1H
##.ACQUISITION MODE= SIMULTANEOUS (DQD)
##.ACQUISITION SCHEME= undefined
##.AVERAGES= 64
##.DIGITISER RES= 22
##SPECTROMETER/DATA SYSTEM= spect
##.PULSE SEQUENCE= noesygpps1d.comp
##.SOLVENT NAME= COFFEE_meoh
##.SHIFT REFERENCE= INTERNAL, COFFEE_meoh, 1, 14.96229
##AUDIT TRAIL= $$ (NUMBER, WHEN, WHO, WHERE, PROCESS, VERSION, WHAT)
$$ ##TITLE= Audit trail, TOPSPIN		Version 2.1
$$ ##JCAMPDX= 5.01
$$ ##ORIGIN= Bruker BioSpin GmbH
$$ ##OWNER= Administrator
$$ $$ E:\/data/COFFEE/nmr/NES1033_872015079_9243059_InYdxdyMnh/32/pdata/1/auditp.txt
$$ ##AUDIT TRAIL=  $$ (NUMBER, WHEN, WHO, WHERE, PROCESS, VERSION, WHAT)
(   1,<2015-08-24 14:39:27.686 -0700>,<Administrator>,<X>,<go>,<TOPSPIN 2.1>,
      <created by zg
	started at 2015-08-24 14:27:57.748 -0700,
	POWCHK enabled, PULCHK disabled,
       configuration hash MD5:
       21 0F 79 D6 B3 7B B4 F6 88 20 88 DB 03 48 BD 9F
       data hash MD5: 64K
       31 CA 0B 17 7A AC A9 9C 6A 3F 02 66 78 7A 0D C6>)
(   2,<2015-08-24 14:39:31.186 -0700>,<Administrator>,<X>,<proc1d>,<TOPSPIN 2.1>,
      <Start of raw data processing
       efp LB = 0.3 FT_mod = 6 PKNL = 1 PHC0 = 0 PHC1 = 0 SI = 128K 
       data hash MD5: 128K
       3E CF 9D 09 E0 B0 9A 34 A6 79 5F C7 15 2A 6B CD>)
(   3,<2015-08-24 14:39:32.061 -0700>,<Administrator>,<X>,<proc1d>,<TOPSPIN 2.1>,
      <pk PHC0 = -88.26965 PHC1 = 0 
       data hash MD5: 128K
       80 B8 CA 35 23 0A 6E 8C 90 FF D5 0C D7 A8 39 C8>)
(   4,<2015-08-24 14:39:32.436 -0700>,<Administrator>,<X>,<proc1d>,<TOPSPIN 2.1>,
      <abs ABSG = 1 
       data hash MD5: 128K
       5F 1E 9E 0F D9 CD E1 EE E8 8A 2E 41 36 FA AC D7>)
(   5,<2015-08-24 14:39:32.530 -0700>,<Administrator>,<X>,<proc1d>,<TOPSPIN 2.1>,
      <abs ABSG = 2 
       data hash MD5: 128K
       E6 DA EA 4F FE CF 36 1A A8 BA 51 E6 CB 9E E4 27>)
(   6,<2015-08-24 14:39:32.623 -0700>,<Administrator>,<X>,<proc1d>,<TOPSPIN 2.1>,
      <abs ABSG = 3 
       data hash MD5: 128K
       DE 91 11 F1 1D FE E2 47 EA 66 A7 EF CF 18 6F A0>)
(   7,<2015-08-24 14:39:32.733 -0700>,<Administrator>,<X>,<proc1d>,<TOPSPIN 2.1>,
      <abs ABSG = 4 
       data hash MD5: 128K
       E9 03 0D D3 FA A6 6C 7E B8 D9 E6 52 39 11 DA 52>)
(   8,<2015-08-24 14:39:32.811 -0700>,<Administrator>,<X>,<proc1d>,<TOPSPIN 2.1>,
      <abs ABSG = 5 
       data hash MD5: 128K
       67 41 D6 FB 56 F9 11 B8 1F A2 98 06 7A 06 FC D7>)
$$ ##END=
$$ 
$$ $$ hash MD5
$$ $$ 72 D2 8D A1 A6 CC 44 79 70 07 7A A2 4B 9D D5 3A
##$RELAX= 
##$RELAX= 
##$RELAX= 
##$RELAX= 
##$RELAX= 
##$RELAX= 
##$RELAX= 
##$RELAX= 
$$ Bruker specific parameters
$$ --------------------------
##$DU= <E:\>
##$EXPNO= 32
$$ [...]
##$TP07= 0
##$TPNAME0= <>
##$TPNAME1= <>
##$TPNAME2= <>
##$TPNAME3= <>
##$TPNAME4= <>
##$TPNAME5= <>
##$TPNAME6= <>
##$TPNAME7= <>
##$TPOAL= (0..7)
0.5 0.5 0.5 0.5 0.5 0.5 0.5 0.5
##$TPOFFS= (0..7)
0 0 0 0 0 0 0 0
##$TUNHIN= 0
##$TUNHOUT= 0
##$TUNXOUT= 0
##$USERA1= <user>
##$USERA2= <user>
##$USERA3= <user>
##$USERA4= <user>
##$USERA5= <user>
##$V9= 5
##$VALIST= <valist>
##$VCLIST= <CCCCCCCCCCCCCCC>
##$VD= 0
##$VDLIST= <DDDDDDDDDDDDDDD>
##$VPLIST= <PPPPPPPPPPPPPPP>
##$VTLIST= <TTTTTTTTTTTTTTT>
##$WBST= 2048
##$WBSW= 25
##$XGAIN= (0..3)
0 0 0 0
##$XL= 0
##$YL= 0
##$YMAX_a= 7642463
##$YMIN_a= -13169582
##$ZGOPTNS= <>
##$ZL1= 120
##$ZL2= 120
##$ZL3= 120
##$ZL4= 120
##$ABSF1= 14.96229
##$ABSF2= -5.595892
##$ABSG= 5
##$ABSL= 3
##$ALPHA= 0
##$AQORDER= 0
##$ASSFAC= 0
##$ASSFACI= 0
##$ASSFACX= 0
##$ASSWID= 0
##$AUNMP= <proc_prof1d_extract.lims>
##$AXLEFT= 0
##$AXNAME= <>
##$AXNUC= <1H>
##$AXRIGHT= 0
##$AXTYPE= 0
##$AXUNIT= <>
##$AZFE= 0.1
##$AZFW= 0.1
##$BCFW= 0
##$BC_mod= 0
##$BYTORDP= 0
##$COROFFS= 0
##$CY= 15
##$DATMOD= 1
##$DC= 0
##$DFILT= <>
##$DTYPP= 0
##$F1P= 0
##$F2P= 0
##$FCOR= 0.5
##$FTSIZE= 131072
##$FT_mod= 6
##$GAMMA= 0
##$GB= 0
##$INTBC= 1
##$INTSCL= 1
##$ISEN= 128
##$LB= 0.3
##$LEV0= 0
##$LPBIN= 0
##$MAXI= 10000
##$MC2= 0
##$MEAN= 0
##$ME_mod= 0
##$MI= 0
##$NCOEF= 0
##$NC_proc= -3
##$NLEV= 6
##$NOISF1= 0
##$NOISF2= 0
##$NSP= 0
##$NTH_PI= 0
##$NZP= 0
##$OFFSET= 14.96229
##$PC= 1
##$PHC0= -88.26965
##$PHC1= 0
##$PH_mod= 1
##$PKNL= yes
##$PPARMOD= 0
##$PPDIAG= 0
##$PPIPTYP= 0
##$PPMPNUM= 2147483647
##$PPRESOL= 1
##$PSCAL= 4
##$PSIGN= 0
##$PYNMP= <proc.py>
##$REVERSE= no
##$SF= 400.020009122056
##$SI= 131072
##$SIGF1= 0
##$SIGF2= 0
##$SINO= 400
##$SIOLD= 131072
##$SPECTYP= <>
##$SREGLST= <1H.CDCl3>
##$SSB= 0
##$STSI= 131072
##$STSR= 0
##$SW_p= 8223.68421052631
##$SYMM= 0
##$S_DEV= 0
##$TDeff= 65536
##$TDoff= 0
##$TI= <>
##$TILT= no
##$TM1= 0
##$TM2= 0
##$TOPLEV= 0
##$USERP1= <user>
##$USERP2= <user>
##$USERP3= <user>
##$USERP4= <user>
##$USERP5= <user>
##$WDW= 1
##$XDIM= 131072
##$YMAX_p= 400714657
##$YMIN_p= -21494
##$CURPLOT= <Network HP LaserJet P1505>
##$CURPRIN= <$Network HP LaserJet P1505>
##$DFORMAT= <normdp>
##$LAYOUT= <+/1D_H.xwp>
##$LFORMAT= <normlp>
##$PFORMAT= <normpl>
##$SURQMSG= 1
$$ End of Bruker specific parameters
$$ ---------------------------------
##NTUPLES= NMR SPECTRUM
##VAR_NAME=  FREQUENCY,     SPECTRUM/REAL,   SPECTRUM/IMAG
##SYMBOL=    X,             R,               I
##VAR_TYPE=  INDEPENDENT,   DEPENDENT,       DEPENDENT
##VAR_FORM=  AFFN,          ASDF,            ASDF
##VAR_DIM=   131072,        131072,          131072
##UNITS=     HZ,            ARBITRARY UNITS, ARBITRARY UNITS
##FACTOR=    0.0627417313425164, 1,          1
##FIRST=     8223.62146879497, 4150,         -106405
##LAST=      0,             9588,            -105186
##MIN=       0,             -21494,          0
##MAX=       8223.62146879497, 400714657,    0
$$ Real data points
##PAGE= N=1
##DATA TABLE= (X++(R..R)), XYDATA
$$ [...]
$$ plain form
63278 669295 672124 675341 679253 683384 686452 688101 690038 694331 700760 707070 711954 716454 721907 727832
63264 727832 733154 738724 746878 758222 770161 779437 785521 790731 797320 805322 813368 820885 828852 838675
63250 838675 850940 865330 881195 897839 914656 931525 949043 967956 988381 1009937 1032528
63239 1032528 1056376 1081123 1105512 1128548 1150806 1174120 1199916 1228103 1257612 1287728 1318507
63228 1318507 1349836 1380401 1408198 1432345 1454014 1475154 1496558 1517717 1538240 1558500 1578768
63217 1578768 1598567 1617222 1634307 1649137 1660605 1668300 1673169 1676219 1676811 1673098 1664014 1650155 1632795
63204 1632795 1612767 1590311 1565303 1537531 1507399 1476485 1446790 1419267 1393587 1369482 1347689
63193 1347689 1329311 1314828 1304005 1296307 1291084 1287906 1287099 1289600 1295895 1305503 1317774 1332666 1350144
$$ packed form
63278F69295K829L217L912M131L068J649J937M293O429O310M884M500N453N925
63264G27832N322N570Q154J1344J1939R276O084N210O589Q002Q046P517P967R823
63250H38675J2265J4390J5865J6644J6817J6869J7518J8913K0425K1556K2591
63239A032528K3848K4747K4389K3036K2258K3314K5796K8187K9509L0116L0779
63228A318507L1329L0565K7797K4147K1669K1140K1404K1159K0523K0260K0268
63217A578768J9799J8655J7085J4830J1468P695M869L050N92l713r084j3859j7360
63204A632795k0028k2456k5008k7772l0132l0914k9695k7523k5680k4105k1793
63193A347689j8378j4483j0823p698n223l178q07K501O295R608J2271J4892J7478
$$ plain form
63180 1350144 1369225 1388292 1406219 1422822 1438541 1454209 1470755 1488284 1505438 1520402 1532603
63169 1532603 1542818 1551639 1558714 1563680 1566958 1568965 1569144 1566436 1560367 1551095 1538800 1523725 1506530
63156 1506530 1487746 1466977 1443567 1418267 1393380 1370733 1350134 1330350 1311072 1293156 1277352
63145 1277352 1263723 1252333 1243563 1237329 1232649 1228458 1224541 1221240 1218697 1216917 1216311 1217367 1219747 1222268
63131 1222268 1224005 1224965 1225533 1225826 1225959 1226395 1227420 1228548 1229145 1229532 1230713 1232804 1234443 1234214 1232358 1230702
63115 1230702 1231176 1234634 1240629 1247758 1254478 1260208 1265668 1271844 1278843 1286252 1294212 1303154 1312457 1320478
63101 1320478 1326416 1331354 1336832 1343058 1349339 1355779 1363509 1373196 1384001 1394225 1402682 1409582 1416440
63088 1416440 1424843 1434851 1444841 1453382 1460883 1468743 1477367 1486155 1495207 1505612 1517625 1529746 1540364
$$ packed form
63180A350144J9081J9067J7927J6603J5719J5668J6546J7529J7154J4964J2201
63169A532603J0215Q821P075M966L278K007J79k708o069r272j2295j5075j7195
63156A506530j8784k0769k3410k5300k4887k2647k0599j9784j9278j7916j5804
63145A277352j3629j1390q770o234m680m191l917l301k543j780o06J056K380K521
63131A222268J737R60N68K93J33M36J025J128N97L87J181K091J639k29j856j656
63115A230702M74L458N995P129O720N730N460O176O999P409P960Q942R303Q021
63101A320478N938M938N478O226O281O440P730R687J0805J0224Q457O900O858
63088A416440Q403J0008R990Q541P501P860Q624Q788R052J0405J2013J2121J0618
$$ plain form
63075 1540364 1549603 1559019 1570189 1584111 1601193 1620977 1642338 1664616 1688148 1713175 1738970 1764830
63063 1764830 1791361 1819774 1850320 1882450 1916239 1952499 1991432 2032218 2074146 2117284 2161809
63052 2161809 2207529 2254422 2302886 2352923 2403583 2453687 2502787 2551059 2598479 2644433 2688003
63041 2688003 2728579 2766398 2802499 2837829 2872324 2905072 2935198 2962112 2985039 3003025 3015670
63030 3015670 3023388 3026678 3025399 3018702 3005195 2983302 2952185 2912517 2865732 2812384 2752072 2685367
63018 2685367 2614936 2543906 2473503 2403124 2332624 2263883 2200004 2143316 2094263 2051940 2015487
63007 2015487 1984870 1960465 1942347 1930329 1924289 1923726 1927094 1932549 1939554 1949046 1961777 1977247 1994497
62994 1994497 2012938 2031735 2049360 2064775 2078565 2091862 2104443 2114750 2121637 2125266 2126310 2124980
$$ packed form
63075A540364R239R416J1170J3922J7082J9784K1361K2278K3532K5027K5795K5860
63063A764830K6531K8413L0546L2130L3789L6260L8933M0786M1928M3138M4525
63052B161809M5720M6893M8464N0037N0660N0104M9100M8272M7420M5954M3570
63041B688003M0576L7819L6101L5330L4495L2748L0126K6914K2927J7986J2645
63030C015670P718L290j279o697j3507k1893l1117l9668m6785n3348o0312o6705
63018B685367p0431p1030p0403p0379p0500o8741o3879n6688m9053m2323l6453
63007B015487l0617k4405j8118j2018o040n63L368N455P005R492J2731J5470J7250
62994A994497J8441J8797J7625J5415J3790J3297J2581J0307O887L629J044j330
$$ plain form
62982 2124980 2120857 2112948 2099776 2079928 2052771 2018548 1978069 1932623 1883736 1832254 1777715 1719283
62970 1719283 1657309 1593525 1529780 1467067 1405637 1345476 1286678 1229916 1176608 1128157 1084902
62959 1084902 1046058 1010579 977785 947420 919585 894432 871627 850438 830752 813448 799029
62948 799029 786463 774291 762422 751728 742216 733041 724192 716642 710646 705319 700305 696351 693583
62935 693583 690696 686832 682899 679804 676519 671533 665564 661111 659378 658978 657828 655219 651783 648328
62921 648328 645114 641790 637822 633323 629344 626940 626052 625707 625074 623741 621341 617774 613790 610580 608689
62906 608689 607853 607833 608658 610028 611322 612386 613645 615222 616652 617705 618875 620670 623038 625839 629282
62891 629282 633387 637513 640980 643824 646389 648523 649841 650679 652052 654488 657317 659423 660459 661090 662175
$$ packed form
62982B124980m123p909j3172j9848k7157l4223m0479m5446m8887n1482n4539n8432
62970A719283o1974o3784o3745o2713o1430o0161n8798n6762n3308m8451m3255
62959A084902l8844l5479l2794l0365k7835k5153k2805k1189j9686j7304j4419
62948G99029j2566j2172j1869j0694r512r175q849p550n996n327n014l954k768
62935F93583k887l864l933l095l285m986n969m453j733m00j150k609l436l455
62921F48328l214l324l968m499l979k404q88l45o33j333k400l567l984l210j891
62906F08689q36k0Q25J370J294J064J259J577J430J053J170J795K368K801L443
62891F29282M105M126L467K844K565K134J318Q38J373K436K829K106J036O31J085
$$ plain form
62876 662175 663936 666055 668375 671243 674992 679335 683538 687125 690114 692631 694714 696608 698870 701895
62862 701895 705467 708941 711733 713564 714466 714752 714889 715277 716157 717604 719388 720950 721966 723004 725122
62847 725122 728588 732462 735783 738767 742353 746848 751589 755872 759714 763678 768341 773961 780323 786786
62833 786786 792767 798249 803611 808997 814235 819517 825754 833892 843965 855022 865891 875822 884502
62820 884502 891973 898918 906849 917282 930180 943538 955189 965086 975173 986879 999575 1012045
62808 1012045 1024701 1039286 1056623 1075688 1094917 1113644 1132194 1151524 1172980 1197439 1224287
62797 1224287 1252069 1280651 1311831 1347188 1386172 1427114 1469295 1513005 1558382 1605633 1655966
62786 1655966 1710732 1769614 1831052 1894537 1960943 2030296 2100908 2171529 2242734 2314835 2385471
$$ packed form
62876F62175J761K119K320K868L749M343M203L587K989K517K083J894K262L025
62862G01895L572L474K792J831R02K86J37L88Q80J447J784J562J016J038K118
62847G25122L466L874L321K984L586M495M741M283L842L964M663N620O362O463
62833G86786N981N482N362N386N238N282O237Q138J0073J1057J0869R931Q680
62820H84502P471O945P931J0433J2898J3358J1651R897J0087J1706J2696J2470
62808A012045J2656J4585J7337J9065J9229J8727J8550J9330K1456K4459K6848
62797A224287K7782K8582L1180L5357L8984M0942M2181M3710M5377M7251N0333
62786A655966N4766N8882O1438O3485O6406O9353P0612P0621P1205P2101P0636
$$ plain form
62775 2385471 2450917 2509283 2561091 2606971 2646010 2676234 2695501 2701944 2694660 2674276 2642087 2598603
62763 2598603 2543773 2478531 2405065 2325401 2240795 2152704 2063105 1973219 1883048 1793135 1705905
62752 1705905 1624156 1548616 1478101 1411841 1350544 1295061 1245051 1199498 1157985 1120786 1087913
62741 1087913 1058650 1032150 1008136 986694 967614 950383 934921 921838 911687 904341 899426 896789
62729 896789 895952 895695 895217 895488 898293 903824 910337 916457 922735 930501 940296 952062 965817 981317
62715 981317 997882 1015469 1035106 1057353 1081245 1105888 1132380 1162744 1197337 1234695 1273682
62704 1273682 1314399 1357051 1401300 1446955 1494152 1542608 1591674 1641149 1690908 1739631 1785080
62693 1785080 1825862 1861653 1891435 1912996 1924947 1928076 1923851 1912483 1893267 1865948 1830888 1788640
$$ packed form
62775B385471O5446N8366N1808M5880L9039L0224J9267O443p284k0384l2189m3484
62763B598603n4830o5242p3466p9664q4606q8091q9599q9886r0171q9913q7230
62752A705905q1749p5540p0515o6260o1297n5483n0010m5553m1513l7199l2873
62741A087913k9263k6500k4014k1442j9080j7231j5462j3083j0151p346m915k637
62729H96789q37k57m78K71K805N531O513O120O278P766R795J1766J3755J5500
62715I81317J6565J7587J9637K2247K3892K4643K6492L0364L4593L7358L8987
62704A273682M0717M2652M4249M5655M7197M8456M9066M9475M9759M8723M5449
62693A785080M0782L5791K9782K1561J1951L129m225j1368j9216k7319l5060m2248
$$ plain form
62681 1788640 1740220 1687161 1630512 1570344 1507009 1442225 1378114 1315791 1255687 1198508 1144718
62670 1144718 1093702 1044738 998645 957315 921651 890933 864075 840426 819283 799708 781233
62659 781233 764143 748864 735605 724525 715469 707425 699059 690107 681758 675342 670962 667449 663363
62646 663363 658117 652465 647734 644342 641565 639216 638623 640814 644324 646390 646263 645819 646784 648888 651202
62631 651202 653587 655959 657577 658323 659638 662863 667296 671161 674009 677058 681560 687958 696275 706137
62617 706137 716505 726442 736181 746608 757846 769362 781328 794778 810254 827291 845423 864728
62605 864728 885121 906129 927875 951505 978053 1007395 1038693 1071266 1104669 1138585 1173156
62594 1173156 1208813 1245293 1281347 1315914 1348837 1379679 1406506 1426893 1439952 1446509 1447468 1442919
$$ packed form
62681A788640m8420n3059n6649o0168o3335o4784o4111o2323o0104n7179n3790
62670A144718n1016m8964m6093m1330l5664l0718k6858k3649k1143j9575j8475
62659G81233j7090j5279j3259j1080r056q044q366q952q349o416m380l513m086
62646F63363n246n652m731l392k777k349n93K191L510K066j27m44R65K104K314
62631F51202K385K372J618P46J315L225M433L865K848L049M502O398Q317R862
62617G06137J0368R937R739J0427J1238J1516J1966J3450J5476J7037J8132J9305
62605H64728K0393K1008K1746K3630K6548K9342L1298L2573L3403L3916L4571
62594A173156L5657L6480L6054L4567L2923L0842K6827K0387J3059O557R59m549
$$ plain form
62582 1442919 1432780 1417231 1396178 1369169 1336407 1299380 1259971 1219285 1177746 1135978 1095041
62571 1095041 1055826 1018532 982803 948320 915382 884978 858114 834973 814909 797312 782128
62560 782128 769394 758648 749132 740373 732268 724768 717817 711454 705724 700608 696217 692787 690080 687109
62546 687109 683047 678386 674658 672976 673303 675113 678131 682245 687264 693103 699823 707210 714744 722249
62532 722249 730145 738799 748117 758162 769552 782680 797096 812442 829487 849275 871504 894894
62520 894894 919181 945525 974608 1005342 1035993 1065641 1093844 1119823 1143137 1164815 1186688
62509 1186688 1209479 1232061 1252461 1268905 1280120 1285611 1286008 1282483 1275382 1263791 1246772 1224757
62497 1224757 1199448 1172560 1144955 1116810 1088228 1059457 1030605 1001455 972021 943392 917583
$$ packed form
62582A442919j0139j5549k1053k7009l2762l7027l9409m0686m1539m1768m0937
62571A095041l9215l7294l5729l4483l2938l0404k6864k3141k0064j7597j5184
62560G82128j2734j0746r516q759q105p500o951o363n730n116m391l430k707k971
62546F87109m062m661l728j682L27J810L018M114N019N839O720P387P534P505
62532G22249P896Q654R318J0045J1390J3128J4416J5346J7045J9788K2229K3390
62520H94894K4287K6344K9083L0734L0651K9648K8203K5979K3314K1678K1873
62509A186688K2791K2582K0400J6444J1215N491L97l525p101j1591j7019k2015
62497A224757k5309k6888k7605k8145k8582k8771k8852k9150k9434k8629k5809
$$ plain form
62486 917583 895971 877882 861162 844187 827039 810706 795649 781464 767651 754370 742427
62475 742427 732720 725680 721093 718294 716444 714705 712530 710110 708358 708123 709339 711122 712611 713601 714537
62460 714537 716283 719735 725125 731607 737816 742973 747341 751772 757129 763963 772141 780745 788760 795895
62446 795895 802352 807997 812471 816042 819431 822537 824296 824215 823146 821893 819955 816610 812521 808984 805868
62431 805868 801668 795776 789567 784779 781708 779600 778220 778135 779588 781792 783651 784975 786683 789746 794183
62416 794183 799331 804887 811074 817646 823547 828185 832654 838861 847565 857808 868141 877762 886585 894976
62402 894976 903601 913028 923282 934128 945570 957530 969270 979977 989884 999858 1009844 1018795 1026492
62389 1026492 1034346 1043735 1054420 1065287 1075840 1086084 1095701 1104472 1113126 1122770 1133737 1145895
$$ packed form
62486I17583k1612j8089j6720j6975j7148j6333j5057j4185j3813j3281j1943
62475G42427r707p040m587k799j850j739k175k420j752k35J216J783J489R90R36
62460G14537J746L452N390O482O209N157M368M431N357O834Q178Q604Q015P135
62446G95895O457N645M474L571L389L106J759q1j069j253j938l345m089l537l116
62431H05868m200n892o209m788l071k108j380q5J453K204J859J324J708L063M437
62416G94183N148N556O187O572N901M638M469O207Q704J0243J0333R621Q823Q391
62402H94976Q625R427J0254J0846J1442J1960J1740J0707R907R974R986Q951P697
62389A026492P854R389J0685J0867J0553J0244R617Q771Q654R644J0967J2158
$$ plain form
62377 1145895 1159738 1175946 1193967 1212351 1230862 1251186 1274994 1302169 1331501 1362339 1394724
62366 1394724 1428448 1462947 1497930 1533185 1567730 1599914 1628699 1654297 1677227 1697122 1712825
62355 1712825 1723394 1728567 1728527 1723829 1715631 1705293 1693265 1678544 1659645 1636080 1608801 1579523
62343 1579523 1549888 1520852 1492242 1463031 1432745 1402598 1374641 1349666 1326673 1304533 1283341
62332 1283341 1263687 1245519 1228517 1212963 1199203 1186532 1173737 1160824 1149350 1140727 1134826 1130453
62320 1130453 1126615 1122983 1119745 1117602 1117637 1120620 1126232 1133146 1140004 1146421 1153122 1160942 1169648 1177936
62306 1177936 1184897 1191215 1198496 1207488 1217488 1227516 1237453 1247663 1257936 1267402 1275485 1282610 1289723
62293 1289723 1297249 1304832 1312317 1320700 1331504 1345018 1359706 1373790 1387030 1400399 1414439 1428724
$$ packed form
62377A145895J3843J6208J8021J8384J8511K0324K3808K7175K9332L0838L2385
62366A394724L3724L4499L4983L5255L4545L2184K8785K5598K2930J9895J5703
62355A712825J0569N173m0m698q198j0338j2028j4721j8899k3565k7279k9278
62343A579523k9635k9036k8610k9211l0286l0147k7957k4975k2993k2140k1192
62332A283341j9654j8168j7002j5554j3760j2671j2795j2913j1474q623n901m373
62320A130453l838l632l238k143L5K983N612O914O858O417O701P820Q706Q288
62306A177936O961O318P281Q992J0000J0028R937J0210J0273R466Q083P125P113
62293A289723P526P583P485Q383J0804J3514J4688J4084J3240J3369J4040J4285
$$ plain form
62281 1428724 1442829 1456968 1471561 1486808 1502889 1519970 1537804 1555931 1574515 1594412 1616171
62270 1616171 1639585 1664632 1692127 1722634 1755175 1787942 1820327 1853391 1887939 1922697 1955098
62259 1955098 1983750 2009450 2033441 2055219 2072738 2084502 2090478 2090762 2084635 2071855 2054048 2033470
62247 2033470 2010756 1985182 1956971 1927762 1898499 1868341 1836421 1803511 1771092 1739825 1710020
62236 1710020 1682763 1659333 1639850 1623568 1610124 1599474 1590890 1583278 1576584 1571844 1569545 1568692 1567859
62223 1567859 1566643 1565845 1566575 1569381 1573964 1579638 1586097 1593495 1601598 1609438 1616399 1623226 1631148 1640281
62209 1640281 1649712 1658956 1668365 1678085 1687706 1697162 1706997 1717357 1727619 1737584 1748253 1760681 1774631
62196 1774631 1789060 1803499 1818138 1832874 1847226 1861339 1876377 1893430 1912191 1930957 1948000
$$ packed form
62281A428724J4105J4139J4593J5247J6081J7081J7834J8127J8584J9897K1759
62270A616171K3414K5047K7495L0507L2541L2767L2385L3064L4548L4758L2401
62259A955098K8652K5700K3991K1778J7519J1764N976K84o127j2780j7807k0578
62247B033470k2714k5574k8211k9209k9263l0158l1920l2910l2419l1267k9805
62236A710020k7257k3430j9483j6282j3444j0650q584p612o694m740k299q53q33
62223A567859j216p98P30K806M583N674O459P398Q103P840O961O827P922R133
62209A640281R431R244R409R720R621R456R835J0360J0262R965J0669J2428J3950
62196A774631J4429J4439J4639J4736J4352J4113J5038J7053J8761J8766J7043
$$ plain form
62185 1948000 1963068 1977646 1993636 2011582 2030252 2048148 2065318 2083408 2103880 2126457 2149512
62174 2149512 2171873 2193950 2217035 2241810 2267668 2293058 2315956 2334343 2347311 2355959 2362347 2366898
62162 2366898 2367544 2362271 2351932 2339414 2326283 2311465 2293361 2272039 2248809 2224571 2199397 2173328
62150 2173328 2146914 2121022 2096324 2072832 2050053 2028029 2007993 1991114 1976569 1962065 1946774
62139 1946774 1932497 1920975 1911095 1900263 1888086 1877071 1869488 1864894 1861195 1856933 1851691 1845175 1837282
62126 1837282 1828990 1822109 1817638 1814841 1812341 1809824 1808083 1807468 1806889 1804763 1800677 1795676 1790934 1786491
62112 1786491 1781326 1774375 1765474 1755601 1746239 1738154 1730703 1722559 1713028 1702273 1690377 1676992 1662225
62099 1662225 1647312 1633929 1623117 1615164 1610048 1607523 1607087 1608312 1610948 1614425 1617725 1620204 1622156
$$ packed form
62185A948000J5068J4578J5990J7946J8670J7896J7170J8090K0472K2577K3055
62174B149512K2361K2077K3085K4775K5858K5390K2898J8387J2968Q648O388M551
62162B366898O46n273j0339j2518j3131j4818j8104k1322k3230k4238k5174k6069
62150B173328k6414k5892k4698k3492k2779k2024k0036j6879j4545j4504j5291
62139A946774j4277j1522r880j0832j2177j1015p583m594l699m262n242o516p893
62126A837282q292o881m471k797k500k517j741o15n79k126m086n001m742m443
62112A786491n165o951q901r873r362q085p451q144r531j0755j1896j3385j4767
62099A662225j4913j3383j0812p953n116k525m36J225K636L477L300K479J952
$$ plain form
62086 1622156 1624089 1625968 1627880 1631005 1636882 1645736 1656382 1667761 1679668 1691847 1703423 1713873
62074 1713873 1723909 1734745 1746716 1758996 1770332 1779631 1786077 1789218 1789058 1785951 1780487 1773439 1765385
62061 1765385 1755930 1743542 1726613 1704884 1679705 1652873 1625312 1596841 1567056 1536267 1505415
62050 1505415 1475085 1444923 1414337 1383665 1354226 1327095 1302125 1278399 1255486 1234065 1215279
62039 1215279 1199495 1185680 1172164 1158254 1145072 1134520 1127418 1122788 1118897 1114625 1109828 1104766
62027 1104766 1099437 1093393 1086262 1078606 1071991 1067650 1065103 1062697 1059653 1056863 1055425 1055123 1055034 1055071 1056040
62012 1056040 1058348 1061518 1065092 1069258 1074258 1079621 1084474 1088492 1092362 1097275 1103880 1111522 1118522 1123492
61998 1123492 1126425 1128350 1130088 1131749 1133429 1135744 1139275 1143837 1148806 1154039 1160028 1167062 1174609 1181742
$$ packed form
62086A622156J933J879J912L125N877Q854J0646J1379J1907J2179J1576J0450
62074A713873J0036J0836J1971J2280J1336R299O446L141j60l107n464p048q054
62061A765385r455j2388j6929k1729k5179k6832k7561k8471k9785l0789l0852
62050A505415l0330l0162l0586l0672k9439k7131k4970k3726k2913k1421j8786
62039A215279j5784j3815j3516j3910j3182j0552p102m630l891m272m797n062
62027A104766n329o044p131p656o615m341k547k406l044k790j438l02q9L7R69
62012A056040K308L170L574M166N000N363M853M018L870M913O605P642P000M970
61998A123492K933J925J738J661J680K315L531M562M969N233N989P034P547P133
$$ plain form
61984 1181742 1188053 1193956 1200166 1207060 1214572 1222508 1230792 1239490 1248783 1258972 1270217 1282181 1294289
61971 1294289 1306626 1320270 1336130 1353510 1370524 1386187 1401497 1418054 1436120 1454686 1473114
61960 1473114 1491862 1511512 1531838 1552262 1572751 1593797 1615716 1638397 1661715 1685906 1711445
61949 1711445 1738692 1767723 1798467 1830882 1864902 1900224 1936316 1972781 2009479 2046181 2082520
61938 2082520 2118749 2156214 2196220 2238326 2280516 2321342 2361169 2401047 2441274 2481866 2523683
61927 2523683 2567901 2614534 2662557 2711630 2762952 2818261 2878631 2944392 3015426 3091182 3170897
61916 3170897 3254227 3341427 3432820 3528491 3628585 3733391 3842918 3956786 4074611 4195945
61906 4195945 4319622 4443669 4566062 4685018 4798453 4903949 4999609 5084157 5155668 5211022
$$ packed form
61984A181742O311N903O210O894P512P936Q284Q698R293J0189J1245J1964J2108
61971A294289J2337J3644J5860J7380J7014J5663J5310J6557J8066J8566J8428
61960A473114J8748J9650K0326K0424K0489K1046K1919K2681K3318K4191K5539
61949A711445K7247K9031L0744L2415L4020L5322L6092L6465L6698L6702L6339
61938B082520L6229L7465M0006M2106M2190M0826L9827L9878M0227M0592M1817
61927B523683M4218M6633M8023M9073N1322N5309O0370O5761P1034P5756P9715
61916C170897Q3330Q7200R1393R5671J00094J04806J09527J13868J17825J21334
61906D195945J23677J24047J22393J18956J13435J05496R5660Q4548P1511N5354
$$ plain form
61896 5211022 5247388 5263556 5258892 5231769 5180518 5105962 5011656 4901129 4775761 4635947 4483626
61885 4483626 4322966 4158847 3995278 3835080 3680319 3532529 3392713 3261596 3140125
61876 3140125 3029429 2929908 2840525 2759488 2685714 2619210 2560140 2508207 2463047 2424360 2391320
61865 2391320 2362816 2339003 2321656 2311917 2308193 2307415 2308014 2310643 2316350 2325433 2338040 2354442 2374113
61852 2374113 2395540 2417397 2439202 2460461 2479984 2496608 2510150 2521442 2531899 2543106 2555951
61841 2555951 2569839 2583325 2595751 2607568 2619141 2630340 2641611 2654269 2669065 2685388 2702502
61830 2702502 2720497 2739147 2756881 2772152 2785200 2797257 2808413 2817465 2823611 2827151 2828755 2829206
61818 2829206 2829862 2832047 2835634 2839233 2842382 2846876 2855417 2869343 2887973 2909740 2933542 2959311 2987673
$$ packed form
61896E211022L6366J6168m664k7123n1251p4556r4306j10527j25368j39814j52321
61885D483626j60660j64119j63569j60198j54761j47790j39816j31117j21471
61876C140125j10696r9521q9383q1037p3774o6504n9070n1933m5160l8687l3040
61865B391320k8504k3813j7347r739l724p78N99K629N707R083J2607J6402J9671
61852B374113K1427K1857K1805K1259J9523J6624J3542J1292J0457J1207J2845
61841B555951J3888J3486J2426J1817J1573J1199J1271J2658J4796J6323J7114
61830B702502J7995J8650J7734J5271J3048J2057J1156R052O146L540J604M51
61818B829206O56K185L587L599L149M494Q541J3926J8630K1767K3802K5769K8362
$$ plain form
61805 2987673 3019275 3054517 3093878 3138044 3187218 3240619 3297308 3357429 3422079 3492044 3567292
61794 3567292 3647730 3733605 3824788 3920324 4019324 4122253 4231004 4347800 4473998 4609661
61784 4609661 4754017 4906387 5066696 5235007 5410733 5592708 5780093 5972912 6171444
61775 6171444 6375103 6581805 6788197 6990505 7185328 7369600 7539752 7691167 7818738
61766 7818738 7917853 7984723 8016095 8009116 7961498 7871851 7740444 7570059 7365582 7132161 6874123
61755 6874123 6596236 6305129 6007984 5709740 5412825 5119813 4835088 4563279 4307036
61746 4307036 4067052 3843393 3635861 3443625 3265650 3101550 2951438 2814858 2690328
61737 2690328 2575941 2470118 2371923 2280991 2197175 2120105 2049112 1983689 1923818 1869631 1820785
$$ packed form
61805B987673L1602L5242L9361M4166M9174N3401N6689O0121O4650O9965P5248
61794C567292Q0438Q5875R1183R5536R9000J02929J08751J16796J26198J35663
61784D609661J44356J52370J60309J68311J75726J81975J87385J92819J98532
61775F171444K03659K06702K06392K02308J94823J84272J70152J51415J27571
61766G818738R9115O6870L1372o979m7618q9647j31407j70385k04477k33421k58038
61755F874123k77887k91107k97145k98244k96915k93012k84725k71809k56243
61746D307036k39984k23659k07532j92236j77975j64100j50112j36580j24530
61737B690328j14387j05823r8195r0932q3816p7070p0993o5423n9871n4187m8846
$$ plain form
61726 1820785 1776141 1734022 1693036 1653097 1615505 1581496 1550772 1522047 1494913 1470154 1448014
61715 1448014 1427232 1406460 1385826 1366235 1347813 1329949 1312436 1295565 1279260 1262990 1246492
61704 1246492 1229919 1213464 1197533 1183042 1170587 1159363 1147781 1135232 1122377 1109647 1096560
61693 1096560 1082970 1070097 1059566 1051917 1046583 1042722 1039376 1035288 1029625 1023035 1017303 1013647 1011619
61680 1011619 1009815 1007281 1003919 999745 994301 987097 978454 969454 960970 953015 945227 937573 930175 922782
61666 922782 915096 907665 901802 898370 897005 896692 896706 896817 897031 897557 898783 900941 903900 907354 910868 913651
61650 913651 914851 914535 913927 914066 914515 914009 912234 910160 908562 906961 904356 900477 895916 891390 887313
61635 887313 883913 881395 880040 880221 882027 884619 886362 886094 884224 882218 881150 881171 882205 884450 888023
$$ packed form
61726A820785m4644m2119m0986l9939l7592l4009l0724k8725k7134k4759k2140
61715A448014k0782k0772k0634j9591j8422j7864j7513j6871j6305j6270j6498
61704A246492j6573j6455j5931j4491j2455j1224j1582j2549j2855j2730j3087
61693A096560j3590j2873j0531p649n334l861l346m088n663o590n732l656k028
61680A011619j804k534l362m174n444p204q643r000q484p955p788p654p398p393
61666I22782p686p431n863l432j365l13J4J11K14N26J226K158K959L454L514K783
61650I13651J200l16o08J39M49n06j775k074j598j601k605l879m561m526m077
61635H87313l400k518j355J81J806K592J743k68j870k006j068K1J034K245L573
$$ plain form
61620 888023 892691 898188 904285 910228 914722 917205 918774 921126 924637 928242 931201 934113 937764 941763
61606 941763 945175 948122 951771 956622 961622 965484 968442 972081 977554 984590 992352 1000624 1009682 1019369
61592 1019369 1028990 1038164 1047167 1056249 1065202 1074038 1083642 1095039 1108166 1122026 1136118 1151063 1167621
61579 1167621 1185614 1204184 1222710 1241051 1259267 1277671 1297185 1319068 1343881 1370643 1397287
61568 1397287 1422291 1446025 1470293 1496317 1523440 1550146 1575934 1601445 1626951 1651770 1675379
61557 1675379 1697967 1719224 1737564 1751676 1762405 1771990 1781585 1790495 1797856 1804009 1809891 1815869 1821681
61544 1821681 1827098 1832227 1837383 1842874 1848748 1854638 1860097 1865065 1869856 1874807 1880311 1886872 1894503 1902189
61530 1902189 1908893 1915377 1924135 1936867 1952521 1968551 1983822 1999558 2017514 2038036 2060379 2084434
$$ packed form
61620H88023M668N497O097N943M494K483J569K352L511L605K959K912L651L999
61606I41763L412K947L649M851N000L862K958L639N473P036P762Q272R058R687
61592A019369R621R174R003R082Q953Q836R604J1397J3127J3860J4092J4945J6558
61579A167621J7993J8570J8526J8341J8216J8404J9514K1883K4813K6762K6644
61568A397287K5004K3734K4268K6024K7123K6706K5788K5511K5506K4819K3609
61557A675379K2588K1257J8340J4112J0729R585R595Q910P361O153N882N978N812
61544A821681N417N129N156N491N874N890N459M968M791M951N504O561P631P686
61530A902189O704O484Q758J2732J5654J6030J5271J5736J7956K0522K2343K4055
$$ plain form
61518 2084434 2111312 2141927 2175553 2210555 2246594 2285342 2328568 2376160 2426716 2479655 2535843
61507 2535843 2596366 2661614 2731485 2805500 2882496 2961169 3041225 3123300 3207482 3292715 3377860
61496 3377860 3462290 3544937 3623762 3696961 3763963 3824548 3877720 3922214 3957328 3982440 3996584
61485 3996584 3999743 3993998 3982112 3965319 3943630 3917830 3889604 3859818 3828347 3796025 3765256 3737909
61473 3737909 3713520 3690338 3667384 3644785 3622637 3600198 3575928 3548189 3516390 3481830 3446922
61462 3446922 3413332 3381248 3350423 3321107 3293810 3269135 3248256 3232585 3222303 3216047 3212809 3213377
61450 3213377 3219026 3229508 3243508 3260624 3281642 3306828 3335079 3365040 3396258 3428853 3462549
61439 3462549 3496332 3528845 3559028 3586543 3611361 3632672 3648577 3657389 3659060 3654859 3646199 3634701
$$ packed form
61518B084434K6878L0615L3626L5002L6039L8748M3226M7592N0556N2939N6188
61507B535843O0523O5248O9871P4015P6996P8673Q0056Q2075Q4182Q5233Q5145
61496C377860Q4430Q2647P8825P3199O7002O0585N3172M4494L5114K5112J4144
61485C996584L159n745j1886j6793k1689k5800k8226k9786l1471l2322l0769k7347
61473C737909k4389k3182k2954k2599k2148k2439k4270k7739l1799l4560l4908
61462C446922l3590l2084l0825k9316k7297k4675k0879j5671j0282o256l238N68
61450C213377N649J0482J4000J7116K1018K5186K8251K9961L1218L2595L3696
61439C462549L3783L2513L0183K7515K4818K1311J5905Q812J671m201q660j1498
$$ plain form
61427 3634701 3622997 3613923 3608332 3604519 3600338 3595174 3589559 3583937 3578781 3575193 3574011 3574303 3573733 3570705
61413 3570705 3565295 3557610 3545916 3527352 3500622 3467549 3431673 3395533 3359551 3323363 3287671 3254388
61401 3254388 3225187 3200407 3179464 3161882 3147554 3136203 3127238 3120458 3116713 3117487 3123654 3134776
61389 3134776 3149719 3167877 3189623 3215732 3246708 3282702 3323606 3368903 3417710 3469409 3524208
61378 3524208 3582685 3644669 3708815 3773380 3837252 3900205 3962226 4022644 4079799 4131578 4176279
61367 4176279 4212817 4240172 4257131 4262963 4258003 4243068 4218462 4184086 4140295 4087864 4027112 3957878
61355 3957878 3880726 3797528 3710570 3621678 3532608 3445415 3361579 3281102 3203213 3127795 3055512
61344 3055512 2986974 2922660 2863569 2810856 2764562 2723510 2686827 2654840 2628029 2605872 2587489
$$ packed form
61427C634701j1704r074n591l813m181n164n615n622n156l588j182K92n70l028
61413C570705n410p685j1694j8564k6730l3073l5876l6140l5982l6188l5692l3283
61401C254388k9201k4780k0943j7582j4328j1351q965o780l745P74O167J1122
61389C134776J4943J8158K1746K6109L0976L5994M0904M5297M8807N1699N4799
61378C524208N8477O1984O4146O4565O3872O2953O2021O0418N7155N1779M4701
61367D176279L6538K7355J6959N832m960j4935k4606l4376m3791n2431o0752o9234
61355C957878p7152q3198q6958q8892q9070q7193q3836q0477p7889p5418p2283
61344C055512o8538o4314n9091n2713m6294m1052l6683l1987k6811k2157j8383
$$ plain form
61333 2587489 2572925 2562871 2557245 2554964 2555309 2558748 2566009 2576788 2589899 2604493 2620732 2639292
61321 2639292 2660443 2683524 2707126 2729872 2751262 2771711 2791586 2810412 2827334 2842162 2855430
61310 2855430 2867412 2877686 2885889 2892383 2897746 2902049 2905185 2907630 2910274 2913544 2917204 2920888 2924217
61297 2924217 2926392 2926355 2923614 2918566 2911977 2904707 2897911 2892518 2888023 2882499 2874616 2865247 2856491 2849490
61283 2849490 2843930 2839250 2835349 2832139 2829341 2826994 2825518 2825004 2824963 2824987 2825079 2825084 2824280 2821952 2818057 2813024 2807170
61266 2807170 2800489 2792690 2783210 2771598 2758331 2745217 2734730 2728791 2727907 2731165 2737209 2745790 2758275
61253 2758275 2776054 2798521 2823540 2850104 2879545 2913599 2952233 2994093 3038062 3083239 3128149
61242 3128149 3171352 3212518 3251444 3286090 3312996 3329813 3336125 3331619 3315178 3286729 3248685 3204329
$$ packed form
61333B587489j4564j0054n626k281L45L439P261J0779J3111J4594J6239J8560
61321B639292K1151K3081K3602K2746K1390K0449J9875J8826J6922J4828J3268
61310B855430J1982J0274Q203O494N363M303L136K445K644L270L660L684L329
61297B924217K175l7k741n048o589p270o796n393m495n524p883r369q756p001
61283B849490n560m680l901l210k798k347j476n14m1K4R2Nq04k328l895n033n854
61266B807170o681p799r480j1612j3267j3114j0487n939q84L258O044Q581J2485
61253B758275J7779K2467K5019K6564K9441L4054L8634M1860M3969M5177M4910
61242C128149M3203M1166L8926L4646K6906J6817O312m506j6441k8449l8044m4356
$$ plain form
61230 3204329 3155506 3103007 3048439 2994253 2942153 2892773 2847047 2806731 2773064 2745452 2721847
61219 2721847 2700027 2678464 2656495 2633948 2610360 2584522 2555191 2522406 2487700 2452828 2418501
61208 2418501 2384546 2351065 2319174 2290481 2265756 2244110 2223706 2203303 2182861 2162713 2142953
61197 2142953 2124038 2107051 2092335 2078380 2063298 2047275 2032283 2019286 2007014 1993860 1979604
61186 1979604 1964478 1947857 1929155 1909224 1889474 1869957 1849700 1828852 1809125 1791766 1776193
61175 1776193 1761264 1747072 1734606 1723962 1713737 1702449 1690190 1678564 1668980 1661235 1653962 1646348
61163 1646348 1638872 1632127 1625433 1617227 1606695 1594431 1581513 1568432 1555022 1540911 1525779 1509486
61151 1509486 1492353 1475353 1459875 1447092 1437278 1429588 1422774 1416351 1410936 1407311 1405503 1405078 1405949
$$ packed form
61230C204329m8823n2499n4568n4186n2100m9380m5726m0316l3667k7612k3605
61219B721847k1820k1563k1969k2547k3588k5838k9331l2785l4706l4872l4327
61208B418501l3955l3481l1891k8693k4725k1646k0404k0403k0442k0148j9760
61197B142953j8915j6987j4716j3955j5082j6023j4992j2997j2272j3154j4256
61186A979604j5126j6621j8702j9931j9750j9517k0257k0848j9727j7359j5573
61175A776193j4929j4192j2466j0644j0225j1288j2259j1626r584p745p273p614
61163A646348p476o745o694q206j0532j2264j2918j3081j3410j4111j5132j6293
61151A509486j7133j7000j5478j2783r814p690o814o423n415l625j808m25Q71
$$ plain form
61138 1405949 1408375 1412489 1418435 1426704 1437494 1449826 1462109 1473770 1485576 1498244 1511651 1525764
61126 1525764 1541498 1559899 1580987 1604051 1628669 1654748 1681840 1709143 1736159 1762841 1789088
61115 1789088 1814576 1839077 1862506 1884559 1904781 1923349 1941619 1961448 1983702 2007340 2030153
61104 2030153 2050629 2069118 2087197 2106111 2126070 2146723 2167671 2188462 2208614 2227938 2246673
61093 2246673 2265350 2284779 2305893 2328923 2352835 2376363 2399729 2424462 2451381 2479798 2509098
61082 2509098 2539932 2573012 2607702 2642976 2679164 2717554 2758574 2801429 2845355 2890268 2936307
61071 2936307 2983686 3032914 3084296 3137297 3191211 3246274 3303200 3361840 3421487 3482325 3545111
61060 3545111 3609112 3671851 3731724 3789909 3848919 3909991 3972511 4035165 4096872 4157242 4216959
$$ packed form
61138A405949K426M114N946Q269J0790J2332J2283J1661J1806J2668J3407J4113
61126A525764J5734J8401K1088K3064K4618K6079K7092K7303K7016K6682K6247
61115A789088K5488K4501K3429K2053K0222J8568J8270J9829K2254K3638K2813
61104B030153K0476J8489J8079J8914J9959K0653K0948K0791K0152J9324J8735
61093B246673J8677J9429K1114K3030K3912K3528K3366K4733K6919K8417K9300
61082B509098L0834L3080L4690L5274L6188L8390M1020M2855M3926M4913M6039
61071B936307M7379M9228N1382N3001N3914N5063N6926N8640N9647O0838O2786
61060C545111O4001O2739N9873N8185N9010O1072O2520O2654O1707O0370N9717
$$ plain form
61049 4216959 4277399 4339349 4402493 4466486 4531693 4598172 4664722 4730014 4794437 4860100 4929366
61038 4929366 5004056 5085535 5174461 5270526 5373157 5482326 5598067 5719803 5847415 5982846
61028 5982846 6129262 6288253 6458843 6639590 6830540 7032594 7246302 7472917 7716586
61019 7716586 7984259 8282751 8616038 8985600 9393272 9843689 10344006 10901290 11519977
61010 11519977 12201479 12945594 13752067 14621792 15558593 16571598 17675332 18883526 20195898
61001 20195898 21584153 22988465 24331235 25540643 26565750 27372986 27935384 28234786
60993 28234786 28278501 28107669 27778819 27331413 26772865 26092687 25283654 24343892 23263187
60984 23263187 22019455 20597924 19015471 17324932 15596597 13896193 12275762 10775333
$$ packed form
61049D216959O0440O1950O3144O3993O5207O6479O6550O5292O4423O5663O9266
61038D929366P4690Q1479Q8926R6065J02631J09169J15741J21736J27612J35431
61028E982846J46416J58991J70590J80747J90950K02054K13708K26615K43669
61019G716586K67673K98492L33287L69562M07672M50417N00317N57284O18687
61010A1519977O81502P44115Q06473Q69725R36801J013005J103734J208194J312372
61001B0195898J388255J404312J342770J209408J025107Q07236N62398K99402
60993B8234786M3715j70832l28850m47406n58548o80178q09033r39762j080705
60984B3263187j243732j421531j582453j690539j728335j700404j620431j500429
$$ plain form
60976 10775333 9424335 8239045 7221202 6361395 5644413 5052605 4567221 4169662 3842874
60967 3842874 3571933 3344176 3149740 2981902 2836001 2707627 2592193 2486304 2388901 2300501
60957 2300501 2221351 2150325 2085167 2023494 1963856 1906286 1851668 1800312 1751274 1703364 1656510
60946 1656510 1611597 1569070 1528408 1489156 1451885 1417680 1386985 1359287 1333744 1309916 1288119
60935 1288119 1269342 1254558 1243747 1235736 1229141 1223160 1217334 1211143 1204544 1198400 1193473 1189121 1184010
60922 1184010 1178130 1173034 1169630 1166707 1162360 1156167 1149119 1141941 1134477 1126525 1118326 1110221 1102590 1096154
60908 1096154 1091369 1087286 1081919 1074392 1066132 1059220 1053950 1048862 1043062 1037559 1033921 1032113 1030295 1026692
60894 1026692 1021324 1015773 1011518 1008707 1006552 1004576 1003074 1002285 1001541 999652 996022 991017 985323 979466
$$ packed form
60976A0775333j350998j185290j017843q59807p16982n91808m85384l97559l26788
60967C842874k70941k27757j94436j67838j45901j28374j15434j05889r7403q8400
60957B300501p9150p1026o5158o1673n9638n7570n4618n1356m9038m7910m6854
60946A656510m4913m2527m0662l9252l7271l4205l0695k7698k5543k3828k1797
60935A288119j8777j4784j0811q011o595n981n826o191o599o144m927m352n111
60922A184010n880n096l404k923m347o193p048p178p464p952q199q105p631o436
60908A096154m785m083n367p527q260o912n270n088n800n503l638j808j818l603
60894A026692n368n551m255k811k155j976j502p89p44j889l630n005n694n857
$$ plain form
60880 979466 974114 970191 968127 967294 966713 966167 966047 966246 965989 964872 963335 961693 959458 956221 952758 950453
60864 950453 949713 949556 948744 946813 943989 940627 937013 933470 930419 928208 926632 924587 920730 914829 908107
60849 908107 901903 896521 891786 888024 885541 883690 881532 879068 876640 873447 868172 861098 853972 847509
60835 847509 840716 833305 826945 822991 820545 818238 816705 817564 820693 824230 826775 828161 828586 828630 829713
60820 829713 832798 836669 839139 839919 840626 841885 842371 841288 839998 840233 842030 844392 846793 849001 850355
60805 850355 850330 849195 847368 844780 841497 838142 835037 831838 828761 827063 827229 827729 826888 825149 823940
60790 823940 823021 820768 816849 812652 808838 804315 798282 791821 786444 782184 778121 773942 769875 765615
60776 765615 760464 754430 748392 743101 738644 734781 731266 727824 724422 721655 720403 720856 722286 723888
$$ packed form
60880I79466n352l923k064q33n81n46j20J99k57j117j537j642k235l237l463k305
60864I50453p40j57q12j931k824l362l614l543l051k211j576k045l857n901o722
60849I08107o204n382m735l762k483j851k158k464k428l193n275p074p126o463
60835H47509o793p411o360l954k446k307j533Q59L129L537K545J386M25M4J083
60820H29713L085L871K470P80P07J259M86j083j290K35J797K362K401K208J354
60805H50355k5j135j827k588l283l355l105l199l077j698J66N00q41j739j209
60790H23940r19k253l919m197l814m523o033o461n377m260m063m179m067m260
60776G65615n151o034o038n291m457l863l515l442l402k767j252M53J430J602
$$ plain form
60762 723888 725491 727229 728996 730745 733028 736452 740450 743241 743561 742135 740974 741387 743178 745602 748233
60747 748233 750637 751924 751407 749530 747579 746373 745570 744260 741957 738876 735565 732442 729645 727086 724549
60732 724549 721814 718812 715713 712687 709590 706164 702742 700340 699544 699518 698671 696258 692783 688942 684990
60717 684990 681212 678105 675670 673392 671400 670826 672253 674485 675786 675859 675691 675853 676057 676182 676505 676764
60701 676764 676108 674371 672602 671920 672562 674400 677603 682070 686745 690291 692433 694187 696824 700834 705781
60686 705781 710810 715254 718935 722050 724912 727870 731204 734758 737868 740086 741852 743981 746584 749137
60672 749137 751614 754759 758891 763097 766045 767190 766886 765865 765092 765557 767469 769825 771370 771865 771986
60657 771986 772187 772288 772140 772097 772654 773988 775992 778337 780414 781456 781057 779498 777511 775771 774523 773491
$$ packed form
60762G23888J603J738J767J749K283L424L998K791L20j426j161M13J791K424K631
60747G48233K404J287n17j877j951j206q03j310k303l081l311l123k797k559k537
60732G24549k735l002l099l026l097l426l422k402p96k6q47k413l475l841l952
60717F84990l778l107k435k278j992n74J427K232J301P3j68J62K04J25L23K59
60701F76764o56j737j769o82O42J838L203M467M675L546K142J754K637M010M947
60686G05781N029M444L681L115K862K958L334L554L110K218J766K129K603K553
60672G49137K477L145M132M206K948J145l04j021p73M65J912K356J545M95J21
60657G71986K01J01j48m3N57J334K004K345K077J042l99j559j987j740j248j032
$$ plain form
60641 773491 772081 769781 766502 762558 758448 754695 751808 750251 750435 752574 756246 760078 762418 762741 762142
60626 762142 761993 762318 761989 760449 758604 757870 758804 760879 763053 764234 763660 761522 759092 757719 757635 758246
60610 758246 759582 762701 768135 774361 778708 779952 779550 780030 782608 786667 791133 795553 799806 803487 806192
60595 806192 808217 810506 813842 818299 823489 828926 833886 837264 838296 837679 837495 839445 843242 847306 850972
60580 850972 855225 860951 867237 872235 875391 878022 881721 886922 893126 899826 906890 914514 923086 932752
60566 932752 942911 952570 961415 970167 979691 990224 1001684 1013997 1026538 1037929 1047396 1056215 1066897
60553 1066897 1080713 1096655 1112993 1129268 1146268 1164567 1183851 1203746 1224807 1248206 1274481
60542 1274481 1302975 1332714 1363661 1396703 1432440 1470381 1509502 1549101 1588720 1627403 1663390
$$ packed form
60641G73491j410k300l279l944m110l753k887j557J84K139L672L832K340L23n99
60626G62142j49L25l29j540j845p34R34K075K174J181n74k138k430j373q4O11
60610G58246J336L119N434O226M347J244m02M80K578M059M466M420M253L681K705
60595H06192K025K289L336M457N190N437M960L378J032o17j84J950L797M064L666
60580H50972M253N726O286M998L156K631L699N201O204O700P064P624Q572R666
60566I32752J0159R659Q845Q752R524J0533J1460J2313J2541J1391R467Q819J0682
60553A066897J3816J5942J6338J6275J7000J8299J9284J9895K1061K3399K6275
60542A274481K8494K9739L0947L3042L5737L7941L9121L9599L9619L8683L5987
$$ plain form
60531 1663390 1694495 1718634 1734298 1741026 1739433 1730556 1715121 1693522 1666153 1633552 1596616 1557216
60519 1557216 1518327 1482820 1452048 1425995 1404649 1388495 1377646 1371380 1369069 1371057 1378080 1390114
60507 1390114 1406278 1425633 1447641 1472031 1498785 1528211 1560473 1594801 1629557 1663357 1695885
60496 1695885 1727184 1756252 1780885 1799206 1811092 1817637 1819429 1816013 1807327 1795055 1782050 1770747
60484 1770747 1762696 1759277 1761871 1770969 1785802 1805286 1829177 1857964 1891853 1930036 1970648 2011099
60472 2011099 2048431 2079528 2101215 2110657 2106207 2087913 2056782 2013585 1958836 1893842 1820987 1742735
60460 1742735 1661093 1578426 1497937 1422451 1352978 1289118 1230581 1177732 1130951 1090277 1055683
60449 1055683 1027064 1003974 985727 971568 960291 950228 940581 932549 928000 926849 926705 925378 922736
$$ packed form
60531A663390L1105K4139J5664O728j593q877j5435k1599k7369l2601l6936l9400
60519A557216l8889l5507l0772k6053k1346j6154j0849o266k311J988P023J2034
60507A390114J6164J9355K2008K4390K6754K9426L2262L4328L4756L3800L2528
60496A695885L1299K9068K4633J8321J1886O545J792l416q686j2272j3005j1303
60484A770747q051l419K594R098J4833J9484K3891K8787L3889L8183M0612M0451
60472B011099L7332L1097K1687R442m450j8294l1131m3197n4749o4994p2855p8252
60460A742735q1642q2667q0489p5486o9473o3860n8537n2849m6781m0674l4594
60449A055683k8619k3090j8247j4159j1277j0063r647q032m549j151j44j327k642
$$ plain form
60436 922736 919805 917242 915430 915047 916339 918401 920165 921698 923558 925271 925738 925110 925116 927195 931126 935593
60420 935593 939192 940783 940118 938781 939461 943340 948865 953921 958523 964191 971263 978333 984460 990579 998181
60405 998181 1007658 1018484 1030117 1041973 1053278 1063900 1074910 1087438 1101317 1115686 1130480 1146100
60393 1146100 1161730 1175463 1186632 1196813 1207695 1218842 1228588 1236494 1243700 1251011 1257832 1263155
60381 1263155 1266663 1268540 1269050 1268912 1269518 1272036 1276224 1280483 1283185 1284014 1284169 1285241 1287742 1290801 1293370
60366 1293370 1295252 1296469 1296239 1293821 1290401 1288814 1290665 1294605 1298129 1300249 1301561 1302525 1303059 1303487 1304537
60351 1304537 1306181 1307433 1307492 1306260 1303526 1298659 1291639 1283803 1276959 1272007 1268641 1265975 1263166 1259786
60337 1259786 1256019 1252440 1249549 1247515 1246163 1244848 1242638 1239179 1235217 1231590 1227938 1223311 1217924 1213147
$$ packed form
60436I22736k931k563j812l83J292K062J764J533J860J713M67o28OK079L931M467
60420I35593L599J591o65j337O80L879N525N056M602N668P072P070O127O119P602
60405I98181R477J0826J1633J1856J1305J0622J1010J2528J3879J4369J4794J5620
60393A146100J5630J3733J1169J0181J0882J1147R746P906P206P311O821N323
60381A263155L508J877N10j38O06K518M188M259K702Q29J55J072K501L059K569
60366A293370J882J217k30k418l420j587J851L940L524K120J312R64N34M28J050
60351A304537J644J252N9j232k734m867p020p836o844m952l366k666k809l380
60337A259786l767l579k891k034j352j315k210l459l962l627l652m627n387m777
$$ plain form
60323 1213147 1209571 1206393 1203297 1201646 1202703 1205509 1207717 1208121 1207481 1207293 1208707 1212282 1217853 1224778 1232987
60308 1232987 1243303 1255845 1268690 1279441 1287966 1296271 1305672 1315448 1324528 1333072 1341592 1349544 1355781
60295 1355781 1359857 1362136 1362893 1361943 1358988 1354000 1347376 1339869 1332103 1324239 1316544 1310222 1306871 1306913 1309273
60280 1309273 1312953 1318253 1325987 1336086 1347540 1359324 1370971 1382589 1394736 1407924 1422035 1436650
60268 1436650 1452096 1469353 1488525 1508108 1526403 1543123 1559135 1575274 1592064 1609845 1628230
60257 1628230 1645957 1662282 1678222 1695469 1714299 1733502 1752154 1770428 1788703 1807013 1825734
60246 1825734 1845960 1868698 1894115 1921737 1950954 1981309 2012912 2046604 2083036 2121449 2160083
60235 2160083 2198139 2236816 2278024 2322442 2369039 2416194 2463113 2510420 2559437 2610751 2663862
$$ packed form
60323A213147l576l178l096j651J057K806K208M04o40j88J414L575N571O925Q209
60308A232987J0316J2542J2845J0751Q525Q305R401R776R080Q544Q520P952O237
60295A355781M076K279P57r50k955m988o624p507p766p864p695o322l351M2K360
60280A309273L680N300P734J0099J1454J1784J1647J1618J2147J3188J4111J4615
60268A436650J5446J7257J9172J9583J8295J6720J6012J6139J6790J7781J8385
60257A628230J7727J6325J5940J7247J8830J9203J8652J8274J8275J8310J8721
60246A825734K0226K2738K5417K7622K9217L0355L1603L3692L6432L8413L8634
60235B160083L8056L8677M1208M4418M6597M7155M6919M7307M9017N1314N3111
$$ plain form
60224 2663862 2718676 2776746 2839840 2907333 2976250 3044105 3110450 3175172 3236813 3293844 3346636
60213 3346636 3396687 3444194 3487649 3525728 3558486 3586652 3610761 3631177 3648064 3661010 3669515
60202 3669515 3674290 3677429 3680682 3684039 3686648 3688802 3692308 3698836 3708581 3720951 3736199 3755753 3780782
60189 3780782 3810886 3844686 3881612 3922516 3968200 4017709 4068584 4118785 4167897 4216274 4263314
60178 4263314 4306905 4344578 4375034 4398461 4415570 4426601 4431274 4429236 4420113 4403413 4379014 4347852
60166 4347852 4311494 4270833 4225814 4176872 4125959 4075493 4026723 3979960 3936191 3897482 3865627
60155 3865627 3841183 3823980 3813709 3809535 3809918 3813747 3821403 3834042 3851859 3873564 3897441 3922290
60143 3922290 3947244 3971211 3992916 4011334 4025916 4036596 4043733 4047992 4050116 4050783 4050499 4049346 4046981
$$ packed form
60224B663862N4814N8070O3094O7493O8917O7855O6345O4722O1641N7031N2792
60213C346636N0051M7507M3455L8079L2758K8166K4109K0416J6887J2946Q505
60202C669515M775L139L253L357K609K154L506O528R745J2370J5248J9554K5029
60189C780782L0104L3800L6926M0904M5684M9509N0875N0201M9112M8377M7040
60178D263314M3591L7673L0456K3427J7109J1031M673k038r123j6700k4399l1162
60166D347852l6358m0661m5019m8942n0913n0466m8770m6763m3769l8709l1855
60155C865627k4444j7203j0271m174L83L829P656J2639J7817K1705K3877K4849
60143C922290K4954K3967K1705J8418J4582J0680P137M259K124O67k84j153k365
$$ plain form
60130 4046981 4043477 4040442 4040848 4047231 4060208 4079223 4104456 4137291 4178858 4228986 4287052 4353292
60118 4353292 4428548 4512990 4605733 4705601 4811655 4922997 5038727 5158329 5281444 5406837
60108 5406837 5531868 5653352 5768740 5876326 5974738 6062618 6138441 6200072 6244779 6270397
60098 6270397 6276658 6264979 6236890 6193118 6134254 6061551 5976548 5880263 5773404 5657479 5535375
60087 5535375 5410827 5287443 5168092 5054681 4948241 4849329 4758559 4676650 4603982 4540410
60077 4540410 4485785 4440482 4405034 4379259 4362090 4352367 4349410 4352575 4360536 4371373 4383295 4395040
60065 4395040 4405743 4414810 4421811 4426000 4425913 4419890 4407207 4388244 4363325 4331959 4293841 4250285 4203891
60052 4203891 4156529 4108095 4057512 4004649 3950955 3898362 3848027 3800424 3756471 3718016 3686694
$$ packed form
60130D046981l504l035M06O383J2977J9015K5233L2835M1567N0128N8066O6240
60118D353292P5256Q4442R2743R9868J06054J11342J15730J19602J23115J25393
60108E406837J25031J21484J15388J07586R8412Q7880P5823O1631M4707K5618
60098F270397O261j1679k8089m3772n8864p2703q5003r6285j06859j15925j22104
60087E535375j24548j23384j19351j13411j06440r8912r0770q1909p2668o3572
60077D540410n4625m5303l5448k5775j7169r723k957L165P961J0837J1922J1745
60065D395040J0703R067P001M189q7o023j2683j8963k4919l1366l8118m3556m6394
60052D203891m7362m8434n0583n2863n3694n2593n0335m7603m3953l8455l1322
$$ plain form
60041 3686694 3662426 3643674 3629525 3621091 3620352 3627937 3642756 3663707 3690845 3724574 3764468 3809509
60029 3809509 3858941 3912080 3967571 4023797 4080099 4136730 4193179 4247233 4296215 4338632 4373889
60018 4373889 4400834 4417536 4422672 4416537 4400610 4376683 4346413 4310940 4270526 4225212 4176252 4126371
60006 4126371 4078202 4033121 3992137 3957050 3929577 3909817 3896806 3890490 3891878 3901252 3917639 3940495
59994 3940495 3970556 4008274 4052594 4102297 4157670 4219652 4287936 4361043 4437813 4517583 4599237
59983 4599237 4681260 4762494 4841640 4916195 4983320 5041855 5091953 5132491 5160650 5175113 5178266
59972 5178266 5173827 5163055 5144570 5117261 5081993 5040696 4995291 4947808 4900490 4855219 4813264
59961 4813264 4775637 4743227 4716653 4696678 4684711 4682120 4688933 4703951 4726230 4755686 4792071 4834335
$$ packed form
60041C686694k4268j8752j4149q434p39P585J4819K0951K7138L3729L9894M5041
60029C809509M9432N3139N5491N6226N6302N6631N6449N4054M8982M2417L5257
60018D373889K6945J6702N136o135j5927k3927l0270l5473m0414m5314m8960m9881
60006D126371m8169m5081m0984l5087k7473j9760j3011o316J388R374J6387K2856
59994C940495L0061L7718M4320M9703N5373O1982O8284P3107P6770P9770Q1654
59983D599237Q2023Q1234P9146P4555O7125N8535N0098M0538K8159J4463L153
59972E178266m439j0772j8485k7309l5268m1297m5405m7483m7318m5271m1955
59961D813264l7627l2410k6574j9975j1967k591O813J5018K2279K9456L6385M2264
$$ plain form
59949 4834335 4881441 4932994 4988470 5046660 5106617 5168388 5231789 5295014 5355707 5413165 5468103
59938 5468103 5520245 5567713 5609498 5647283 5683682 5719369 5753072 5784021 5813212 5842352 5872732
59927 5872732 5905578 5942693 5986048 6036899 6095421 6160868 6232124 6308789 6391919 6482940 6581271
59916 6581271 6683482 6785251 6883708 6977457 7065154 7145054 7215494 7274530 7319082 7345685 7352531
59905 7352531 7339973 7308705 7258504 7189461 7103685 7004916 6896929 6783078 6666849 6551753
59895 6551753 6440607 6335594 6238871 6152358 6076949 6012644 5959517 5917903 5887667 5868246 5859681
59884 5859681 5862866 5878328 5905317 5942372 5988161 6041380 6100536 6164326 6231588 6300259 6367098
59873 6367098 6429290 6485897 6536706 6579949 6612163 6630286 6632924 6619551 6589665 6543315 6481705
$$ packed form
59949D834335M7106N1553N5476N8190N9957O1771O3401O3225O0693N7458N4938
59938E468103N2142M7468M1785L7785L6399L5687L3703L0949K9191K9140L0380
59927E872732L2846L7115M3355N0851N8522O5447P1256P6665Q3130R1021R8331
59916F581271J02211J01769R8457R3749Q7697P9900P0440N9036M4552K6603O846
59905G352531j2558l1268n0201o9043q5776r8769j07987j13851j16229j15096
59895F551753j11146j05013r6723q6513p5409o4305n3127m1614l0236j9421q565
59884E859681L185J5462K6989L7055M5789N3219N9156O3790O7262O8671O6839
59873F367098O2192N6607N0809M3243L2214J8123K638j3373k9886m6350o1610
$$ plain form
59862 6481705 6406692 6320089 6223825 6120289 6012078 5901745 5791984 5685499 5584314 5489713
59852 5489713 5403178 5326695 5261484 5206962 5161638 5124557 5095135 5072169 5054216 5040960 5033204
59841 5033204 5031434 5035308 5044674 5059946 5080975 5106483 5135379 5167953 5204917 5245665 5288307 5331238
59829 5331238 5373808 5415460 5454996 5491130 5523286 5551312 5574428 5590757 5598226 5596149 5585924 5569904
59817 5569904 5549421 5524121 5493381 5458108 5420726 5383485 5347120 5311229 5275581 5240757 5207571
59806 5207571 5176256 5146536 5118502 5092956 5070566 5051013 5033532 5018140 5005504 4995533 4987043 4979444
59794 4979444 4974063 4972921 4976587 4984177 4995285 5010864 5031924 5058258 5089133 5125028 5168156 5221135
59782 5221135 5285074 5358802 5440015 5527368 5621422 5723439 5833620 5951002 6074684 6204151
$$ packed form
59862F481705p5013q6603r6264j03536j08211j10333j09761j06485j01185r4601
59852E489713q6535p6483o5211n4522m5324l7081k9422k2966j7953j3256p756
59841E033204j770L874R366J5272K1029K5508K8896L2574L6964M0748M2642M2931
59829E331238M2570M1652L9536L6134L2156K8026K3116J6329P469k077j0225j6020
59817E569904k0483k5300l0740l5273l7382l7241l6365l5891l5648l4824l3186
59806E207571l1315k9720k8034k5546k2390j9553j7481j5392j2636r971q490p599
59794D979444n381j142L666P590J1108J5579K1060K6334L0875L5895M3128N2979
59782E221135O3939P3728Q1213Q7353R4054J02017J10181J17382J23682J29467
$$ plain form
59772 6204151 6338228 6474492 6610144 6742759 6869523 6986185 7087540 7168988 7227411 7260977
59762 7260977 7269090 7252910 7215546 7161350 7095011 7021356 6945713 6873810 6810744 6759679 6721517
59751 6721517 6695880 6682339 6680722 6690632 6711270 6741886 6782113 6831675 6889941 6955908 7028592 7107442
59739 7107442 7192493 7284060 7382218 7486843 7598337 7717980 7847011 7985485 8132538 8287666
59729 8287666 8451180 8623634 8805656 8998381 9202981 9419347 9646049 9882080 10127689
59720 10127689 10382728 10644988 10911296 11179879 11450553 11722585 11993189 12258279 12514142
59711 12514142 12758532 12990782 13210873 13417886 13609370 13782728 13937206 14074211 14196160
59702 14196160 14305694 14405458 14497197 14580637 14654183 14717243 14771264 14818149 14858214 14890116 14912355
$$ packed form
59772F204151J34077J36264J35652J32615J26764J16662J01355Q1448N8423L3566
59762G260977Q113j6180l7364n4196o6339p3655p5643p1903o3066n1065l8162
59751F721517k5637j3541j617R910K0638L0616M0227M9562N8266O5967P2684P8850
59739G107442Q5051R1567R8158J04625J11494J19643J29031J38474J47053J55128
59729H287666J63514J72454J82022J92725K04600K16366K26702K36031K45609
59720A0127689K55039K62260K66308K68583K70674K72032K70604K65090K55863
59711A2514142K44390K32250K20091K07013J91484J73358J54478J37005J21949
59702A4196160J09534R9764R1739Q3440P3546O3060N4021M6885M0065L1902K2239
$$ plain form
59691 14912355 14924526 14927650 14923761 14914993 14902773 14888156 14872909 14859873 14852131 14852248 14862313 14883937
59679 14883937 14917882 14964281 15023620 15096980 15184999 15287118 15402157 15528877 15665334 15808196
59669 15808196 15953348 16096725 16233860 16359059 16465893 16548413 16601325 16619241 16596690 16529118
59659 16529118 16413576 16248724 16034978 15774885 15472934 15134794 14766846 14376062 13969629
59650 13969629 13554327 13136308 12721092 12313164 11915489 11529606 11155877 10793163 10438473
59641 10438473 10087702 9737046 9384009 9027887 8670177 8314189 7963373 7620073 7286538
59632 7286538 6966577 6664758 6383753 6123698 5884480 5667251 5472824 5299712 5145051
59623 5145051 5006984 4884998 4778232 4684596 4601767 4528221 4463058 4405405 4354370 4309201 4269164
$$ packed form
59691A4912355J2171L124l889q768j2220j4617j5247j3036p742J17J0065K1624
59679A4883937L3945M6399N9339P3360Q8019J02119J15039J26720J36457J42862
59669A5808196J45152J43377J37135J25199J06834Q2520N2912J7916k2551o7572
59659A6529118j15542j64852k13746k60093l01951l38140l67948l90784m06433
59650A3969629m15302m18019m15216m07928l97675l85883l73729l62714l54690
59641A0438473l50771l50656l53037l56122l57710l55988l50816l43300l33535
59632G286538l19961l01819k81005k60055k39218k17229j94427j73112j54661
59623E145051j38067j21986j06766r3636q2829p3546o5163n7653n1035m5169m0037
$$ plain form
59612 4269164 4233321 4200565 4169970 4141233 4114750 4090959 4069339 4048261 4026127 4002651 3978927
59601 3978927 3956372 3935666 3916429 3897662 3878523 3858828 3838893 3819211 3800594 3784284 3771161
59590 3771161 3760712 3751504 3742789 3734912 3727943 3720969 3713553 3707207 3704496 3706930 3714178 3724786 3736977
59577 3736977 3749490 3762694 3778592 3798728 3822368 3847618 3873964 3902546 3934202 3968716 4006129
59566 4006129 4047284 4092453 4140574 4190571 4242596 4297348 4354990 4415393 4478696 4544866 4613323
59555 4613323 4683727 4756579 4832261 4909947 4988278 5066877 5146492 5227860 5311036 5395541 5480430
59544 5480430 5564196 5645138 5721753 5792410 5855028 5907806 5950299 5983239 6007225 6021833 6025870
59533 6025870 6018203 5998686 5968875 5931633 5889407 5842856 5791532 5735644 5676529 5615520 5553285
$$ packed form
59612D269164l5843l2756l0595k8737k6483k3791k1620k1078k2134k3476k3724
59601C978927k2555k0706j9237j8767j9139j9695j9935j9682j8617j6310j3123
59590C771161j0449r208q715p877o969o974p416o346k711K434P248J0608J2191
59577C736977J2513J3204J5898K0136K3640K5250K6346K8582L1656L4514L7413
59566D006129M1155M5169M8121M9997N2025N4752N7642O0403O3303O6170O8457
59555D613323P0404P2852P5682P7686P8331P8599P9615Q1368Q3176Q4505Q4889
59544E480430Q3766Q0942P6615P0657O2618N2778M2493L2940K3986J4608M037
59533F025870p667j9517k9811l7242m2226m6551n1324n5888n9115o1009o2235
$$ plain form
59522 5553285 5490576 5429030 5370692 5317008 5268545 5225576 5188784 5159428 5138916 5128169 5127446 5136794
59510 5136794 5156384 5186275 5226210 5275902 5335115 5403030 5477871 5557757 5641628 5728601 5816460
59499 5816460 5901583 5980525 6051078 6111626 6160041 6193535 6209250 6204940 6179651 6134148 6070440
59488 6070440 5990687 5896787 5790993 5676450 5556936 5436365 5318547 5206842 5103553 5009780
59478 5009780 4925970 4852411 4789281 4736771 4695461 4666097 4648598 4641461 4642486 4650035 4663440 4682308
59466 4682308 4705480 4730525 4754177 4773531 4786925 4793660 4793087 4784346 4766893 4740710 4705865 4662191
59454 4662191 4609476 4547691 4477134 4398817 4314700 4227027 4137371 4046703 3956262 3867765 3782792
59443 3782792 3702561 3628113 3559724 3496132 3435617 3378343 3326568 3281892 3243443 3209687 3180943
$$ packed form
59522E553285o2709o1546n8338n3684m8463m2969l6792k9356k0512j0747p23R348
59510E136794J9590K9891L9935M9692N9213O7915P4841P9886Q3871Q6973Q7859
59499E816460Q5123P8942P0553O0548M8415L3494J5715m310k5289m5503o3708
59488F070440p9753r3900j05794j14543j19514j20571j17818j11705j03289r3773
59478E009780q3810p3559o3130n2510m1310k9364j7499p137J025P549J3405J8868
59466D682308K3172K5045K3652J9354J3394O735n73q741j7453k6183l4845m3674
59454D662191n2715o1785p0557p8317q4117q7673q9656r0668r0441q8497q4973
59443C782792q0231p4448o8389o3592o0515n7274n1775m4676l8449l3756k8744
$$ plain form
59432 3180943 3158624 3142594 3130946 3122575 3118603 3120669 3128672 3140810 3155328 3171659 3190066 3210780
59420 3210780 3233788 3259190 3287280 3317903 3349992 3382185 3413778 3444500 3473585 3500148 3524643
59409 3524643 3548828 3573736 3598767 3623524 3649318 3677560 3707536 3737373 3766761 3797009 3828484
59398 3828484 3859762 3889960 3920548 3953972 3991261 4031759 4074719 4120412 4169918 4224358 4284365
59387 4284365 4349985 4420777 4495787 4573564 4652961 4734341 4819385 4909139 5002923 5099896 5200871
59376 5200871 5307231 5418414 5531995 5646286 5761668 5879341 6000166 6125013 6254998
59367 6254998 6390899 6533372 6683934 6844474 7015315 7194946 7382127 7577040 7779722
59358 7779722 7988577 8201151 8415160 8627799 8835101 9033052 9218608 9388885 9540449
$$ packed form
59432C180943k2319j6030j1648q371l972K066Q003J2138J4518J6331J8407K0714
59420C210780K3008K5402K8090L0623L2089L2193L1593L0722K9085K6563K4495
59409C524643K4185K4908K5031K4757K5794K8242K9976K9837K9388L0248L1475
59398C828484L1278L0198L0588L3424L7289M0498M2960M5693M9506N4440O0007
59387D284365O5620P0792P5010P7777P9397Q1380Q5044Q9754R3784R6973J00975
59376E200871J06360J11183J13581J14291J15382J17673J20825J24847J29985
59367F254998J35901J42473J50562J60540J70841J79631J87181J94913K02682
59358G779722K08855K12574K14009K12639K07302J97951J85556J70277J51564
$$ plain form
59349 9540449 9670447 9777490 9860382 9916972 9945635 9946987 9922552 9872203 9794520 9689380 9558605
59338 9558605 9403908 9225542 9023303 8798061 8552254 8289756 8015265 7733152 7446824
59329 7446824 7159544 6875075 6596610 6325724 6063623 5812894 5576547 5355585 5149074
59320 5149074 4956557 4778827 4616214 4467713 4332178 4208959 4096926 3994360 3900504 3815990
59310 3815990 3741053 3674515 3615213 3563112 3518051 3478584 3443306 3412434 3386789 3365771 3347526
59299 3347526 3330633 3314387 3297855 3280165 3262022 3245781 3233418 3224932 3219112 3215369 3214348 3217005
59287 3217005 3223606 3233875 3247783 3265733 3287795 3313248 3341267 3371806 3405185 3440941 3477611
59276 3477611 3513586 3547688 3579148 3607697 3633596 3656909 3676912 3692839 3704746 3712532 3714548 3708684
$$ packed form
59349I540449J29998J07043Q2892N6590K8663J352k4435n0349p7683j05140j30775
59338I558605j54697j78366k02239k25242k45807k62498k74491k82113k86328
59329G446824k87280k84469k78465k70886k62101k50729k36347k20962k06511
59320E149074j92517j77730j62613j48501j35535j23219j12033j02566r3856q4514
59310C815990p4937o6538n9302n2101m5061l9467l5278l0872k5645k1018j8245
59299C347526j6893j6246j6532j7690j8143j6241j2363q486n820l743j021K657
59287C217005O601J0269J3908J7950K2062K5453K8019L0539L3379L5756L6670
59276C477611L5975L4102L1460K8549K5899K3313K0003J5927J1907P786K016n864
$$ plain form
59264 3708684 3694860 3674891 3649791 3618992 3582617 3542412 3499494 3453154 3403346 3352706 3304384
59253 3304384 3259217 3216712 3177398 3142033 3109553 3078346 3049232 3024902 3006421 2992304 2981062
59242 2981062 2972633 2967156 2964417 2964927 2969597 2977826 2987769 2999201 3014171 3033856 3056692 3080996 3107790
59229 3107790 3139146 3174814 3212411 3250532 3290069 3332524 3378436 3427640 3479903 3534777 3591531
59218 3591531 3649826 3710463 3775261 3845985 3923203 4006275 4094750 4189388 4291178 4399629 4512983
59207 4512983 4629991 4750269 4872702 4994900 5114917 5232345 5346743 5455817 5555927
59198 5555927 5643514 5715203 5767475 5797593 5804453 5787652 5746390 5680400 5591407 5482365 5355634
59187 5355634 5213173 5058249 4895405 4728503 4560049 4392825 4230942 4078406 3937186
$$ packed form
59264C708684j3824j9969k5100l0799l6375m0205m2918m6340m9808n0640m8322
59253C304384m5167m2505l9314l5365l2480l1207k9114k4330j8481j4117j1242
59242B981062q429n477k739N10M670Q229R943J1432J4970J9685K2836K4304K6794
59229C107790L1356L5668L7597L8121L9537M2455M5912M9204N2263N4874N6754
59218C591531N8295O0637O4798P0724P7218Q3072Q8475R4638J01790J08451J13354
59207D512983J17008J20278J22433J22198J20017J17428J14398J09074J00110
59198E555927Q7587P1689N2272L0118O860j6801m1262o5990q8993j09042j26731
59187E355634j42461j54924j62844j66902j68454j67224j61883j52536j41220
$$ plain form
59178 3937186 3807378 3688971 3582841 3489933 3409784 3340337 3279537 3226948 3183172 3147740 3118497
59167 3118497 3093438 3072082 3054302 3038870 3024309 3010397 2997454 2984631 2970272 2953583 2934435
59156 2934435 2911878 2884681 2853561 2820957 2787966 2753015 2714509 2673445 2632400 2592973 2555330
59145 2555330 2519514 2485961 2455170 2427843 2405023 2387201 2373456 2362240 2352858 2345575 2340537 2337383
59133 2337383 2335932 2336513 2339382 2344162 2350080 2356665 2364071 2372748 2382735 2393397 2404017 2414436 2424735
59120 2424735 2434556 2443348 2451244 2458953 2466760 2474432 2482266 2491208 2501446 2511759 2520895 2528898 2536445
59107 2536445 2543680 2550528 2557454 2564860 2572195 2578748 2585144 2593016 2603110 2614620 2626486 2638583 2651379
59094 2651379 2665132 2679808 2695491 2712598 2731703 2753009 2775762 2798478 2820168 2841175 2862416
$$ packed form
59178C937186j29808j18407j06130r2908q0149o9447o0800n2589m3776l5432k9243
59167C118497k5059k1356j7780j5432j4561j3912j2943j2823j4359j6689j9148
59156B934435k2557k7197l1120l2604l2991l4951l8506m1064m1045l9427l7643
59145B555330l5816l3553l0791k7327k2820j7822j3745j1216r382p283n038l154
59133B337383j451N81K869M780N918O585P406Q677R987J0662J0620J0419J0299
59120B424735R821Q792P896P709P807P672P834Q942J0238J0313R136Q003P547
59107B536445P235O848O926P406P335O553O396P872J0094J1510J1866J2097J2796
59094B651379J3753J4676J5683J7107J9105K1306K2753K2716K1690K1007K1241
$$ plain form
59083 2862416 2884117 2905729 2926717 2946719 2965129 2981354 2995381 3007308 3016288 3020881 3020603 3016177
59071 3016177 3007800 2994103 2973737 2947606 2918557 2888719 2857691 2823599 2785564 2744790 2703378
59060 2703378 2662603 2622659 2583767 2546778 2512477 2480833 2451391 2423907 2398060 2373033 2348347
59049 2348347 2325070 2305227 2289647 2276980 2265193 2253564 2242833 2233850 2226631 2220682 2215766 2212078
59037 2212078 2209650 2207791 2205547 2202976 2201549 2202692 2206067 2209882 2212919 2215556 2218609 2221874 2224365 2225603
59023 2225603 2226176 2227176 2229492 2233565 2239433 2246883 2255668 2265647 2276773 2289014 2302241 2316099 2330143
59010 2330143 2344275 2358915 2374538 2391219 2408967 2428226 2449500 2472516 2496326 2520356 2544941
58999 2544941 2570792 2598421 2628067 2659592 2692363 2725896 2760892 2798894 2840471 2884244 2928171
$$ packed form
59083B862416K1701K1612K0988K0002J8410J6225J4027J1927Q980M593k78m426
59071C016177q377j3697k0366k6131k9049k9838l1028l4092l8035m0774m1412
59060B703378m0775l9944l8892l6989l4301l1644k9442k7484k5847k5027k4686
59049B348347k3277j9843j5580j2667j1787j1629j0731q983p219n949m916l688
59037B212078k428j859k244k571j427J143L375L815L037K637L053L265K491J238
59023B225603N73J000K316M073N868P450Q785R979J1126J2241J3227J3858J4044
59010B330143J4132J4640J5623J6681J7748J9259K1274K3016K3810K4030K4585
58999B544941K5851K7629K9646L1525L2771L3533L4996L8002M1577M3773M3927
$$ plain form
58988 2928171 2971357 3014091 3056619 3098590 3139490 3178936 3216412 3251106 3282050 3308270 3329042
58977 3329042 3344351 3354927 3361468 3363902 3361754 3355087 3344737 3331698 3316713 3300574 3284521 3270112
58965 3270112 3258584 3250203 3244234 3239791 3236904 3236579 3239724 3246261 3255414 3266563 3279506 3294205 3310642
58952 3310642 3328825 3348669 3370008 3392859 3417394 3443447 3470472 3498354 3527881 3559872 3594168
58941 3594168 3630020 3667234 3706243 3747283 3790211 3835058 3881908 3930156 3978827 4028050 4079449
58930 4079449 4134502 4193057 4254092 4317416 4383753 4453431 4525976 4601174 4679665 4761901 4847004
58919 4847004 4933198 5019116 5104163 5187877 5269695 5349424 5427229 5502794 5575212 5644426 5712415
58908 5712415 5782134 5855394 5932469 6013649 6100036 6192516 6290990 6395365 6506570 6625579 6751816
$$ packed form
58988B928171M3186M2734M2528M1971M0900L9446L7476L4694L0944K6220K0772
58977C329042J5309J0576O541K434k148o667j0350j3039j4985j6139j6053j4409
58965C270112j1528q381n969m443k887l25L145O537R153J1149J2943J4699J6437
58952C310642J8183J9844K1339K2851K4535K6053K7025K7882K9527L1991L4296
58941C594168L5852L7214L9009M1040M2928M4847M6850M8248M8671M9223N1399
58930D079449N5053N8555O1035O3324O6337O9678P2545P5198P8491Q2236Q5103
58919D847004Q6194Q5918Q5047Q3714Q1818P9729P7805P5565P2418O9214O7989
58908E712415O9719P3260P7075Q1180Q6387R2480R8474J04375J11205J19009J26237
$$ plain form
58897 6751816 6883509 7019547 7160078 7305210 7453995 7604974 7756996 7908955 8059092
58888 8059092 8204939 8343790 8472997 8590141 8693306 8781159 8852699 8906978 8943098 8960201
58878 8960201 8957530 8934839 8892911 8833396 8757915 8667329 8561745 8440937 8304939 8154846 7993254
58867 7993254 7823403 7647523 7466339 7280431 7091578 6902375 6714962 6530761 6351160
58858 6351160 6177613 6010932 5851088 5697996 5552030 5413512 5282171 5157646 5040364
58849 5040364 4931379 4831248 4739541 4655691 4579966 4513076 4454916 4404255 4359850 4321397 4288970
58838 4288970 4261938 4239141 4220076 4205211 4194928 4188785 4186161 4187055 4191664 4199578 4210078 4223106
58826 4223106 4239316 4259175 4282596 4309500 4340092 4374374 4411912 4452426 4496061 4542681 4591313
$$ packed form
58897F751816J31693J36038J40531J45132J48785J50979J52022J51959J50137
58888H059092J45847J38851J29207J17144J03165Q7853P1540N4279L6120J7103
58878H960201k671k2691m1928n9515p5481r0586j05584j20808j35998j50093j61592
58867G993254j69851j75880j81184j85908j88853j89203j87413j84201j79601
58858F351160j73547j66681j59844j53092j45966j38518j31341j24525j17282
58849E040364j08985j00131r1707q3850p5725o6890n8160n0661m4405l8453l2427
58838D288970k7032k2797j9065j4865j0283o143k624Q94M609P914J0500J3028
58826D223106J6210J9859K3421K6904L0592L4282L7538M0514M3635M6620M8632
$$ plain form
58815 4591313 4640928 4691641 4744561 4800486 4859180 4920030 4982998 5048817 5118526 5192980 5272577
58804 5272577 5357265 5446860 5541385 5641033 5745998 5856474 5972627 6094112 6219607 6347286
58794 6347286 6475943 6605423 6735945 6867305 6998652 7128387 7253980 7372461 7481572
58785 7481572 7580236 7667550 7741620 7799690 7839125 7858016 7855309 7830861 7785046 7717778 7628270
58774 7628270 7516373 7383806 7233341 7067072 6886406 6693671 6492609 6286909 6079071
58765 6079071 5871021 5664973 5463073 5266745 5076960 4894842 4721496 4557533 4403111
58756 4403111 4258284 4123093 3997562 3881592 3774400 3674196 3579378 3490366 3409382 3337748
58746 3337748 3274141 3216130 3162608 3113799 3069642 3029546 2993495 2962079 2935212 2911811 2890968
$$ packed form
58815D591313M9615N0713N2920N5925N8694O0850O2968O5819O9709P4454P9597
58804E272577Q4688Q9595R4525R9648J04965J10476J16153J21485J25495J27679
58794F347286J28657J29480J30522J31360J31347J29735J25593J18481J09111
58785G481572R8664Q7314P4070N8070L9435J8891k707k4448m5815o7268q9508
58774G628270j11897j32567j50465j66269j80666j92735k01062k05700k07838
58765F079071k08050k06048k01900j96328j89785j82118j73346j63963j54422
58756D403111j44827j35191j25531j15970j07192j00204r4818q9012q0984p1634
58746C337748o3607n8011n3522m8809m4157m0096l6051l1416k6867k3401k0843
$$ plain form
58735 2890968 2872647 2856964 2843494 2831695 2821562 2813682 2809012 2808416 2811582 2816298 2819723 2820751 2820428
58722 2820428 2819663 2817305 2811038 2799423 2782143 2758726 2728112 2689693 2644092 2592707 2536864 2477595
58710 2477595 2415862 2352728 2289442 2227521 2168661 2114344 2065413 2021906 1983398 1949676 1921157
58699 1921157 1898387 1881023 1867716 1857360 1850301 1847643 1849170 1852413 1854167 1852758 1848499 1842191 1833755
58686 1833755 1822366 1807293 1788348 1766059 1741852 1717631 1694605 1672699 1651562 1631812 1614642
58675 1614642 1600590 1589652 1582444 1580007 1582136 1586927 1592508 1598453 1605081 1612385 1620166 1628140 1634992
58662 1634992 1638389 1637236 1633192 1628629 1623612 1616300 1605927 1593755 1581142 1568299 1555203 1542297
58650 1542297 1529754 1517328 1505435 1495236 1487108 1480205 1474284 1470742 1470819 1473599 1476972 1480081 1483794
$$ packed form
58735B890968j8321j5683j3470j1799j0133p880m670n96L166M716L425J028l23
58722B820428p65k358o267j1615j7280k3417l0614l8419m5601n1385n5843n9269
58710B477595o1733o3134o3286o1921n8860n4317m8931m3507l8508l3722k8519
58699A921157k2770j7364j3307j0356p059k658J527L243J754j409m259o308q436
58686A833755j1389j5073j8945k2289k4207k4221k3026k1906k1137j9750j7170
58675A614642j4052j0938p208k437K129M791N581N945O628P304P781P974O852
58662A634992L397j153m044m563n017p312j0373j2172j2613j2843j3096j2906
58650A542297j2543j2426j1893j0199q128o903n921l542P7K780L373L109L713
$$ plain form
58637 1483794 1489064 1495840 1503500 1511568 1519865 1528421 1537362 1546714 1556454 1566759 1577760 1588924 1599270
58624 1599270 1608604 1618002 1628716 1641066 1654767 1669555 1684878 1699676 1713483 1727391 1743049 1760796
58612 1760796 1779623 1798884 1819203 1841470 1865627 1890781 1916202 1941974 1968867 1997763 2029166
58601 2029166 2063181 2099754 2138601 2178936 2219809 2261037 2303332 2347195 2391933 2436144 2478821
58590 2478821 2519621 2558284 2594172 2626196 2652992 2673465 2687471 2695626 2698220 2694697 2684482 2667945
58578 2667945 2646198 2620386 2591505 2560420 2527732 2494021 2460408 2428167 2397498 2367491 2337779
58567 2337779 2309216 2282295 2256021 2229497 2203608 2179639 2156834 2132998 2107283 2080817 2054606
58556 2054606 2028357 2001593 1974508 1947350 1920131 1893282 1867334 1841505 1813925 1783999 1753616
$$ packed form
58637A483794N270O776P660Q068Q297Q556Q941R352R740J0305J1001J1164J0346
58624A599270R334R398J0714J2350J3701J4788J5323J4798J3807J3908J5658J7747
58612A760796J8827J9261K0319K2267K4157K5154K5421K5772K6893K8896L1403
58601B029166L4015L6573L8847M0335M0873M1228M2295M3863M4738M4211M2677
58590B478821M0800L8663L5888L2024K6796K0473J4006Q155K594l523j0215j6537
58578B667945k1747k5812k8881l1085l2688l3711l3613l2241l0669l0007k9712
58567B337779k8563k6921k6274k6524k5889k3969k2805k3836k5715k6466k6211
58556B054606k6249k6764k7085k7158k7219k6849k5948k5829k7580k9926l0383
$$ plain form
58545 1753616 1725356 1700317 1678183 1658219 1639305 1619909 1599234 1577996 1557312 1537366 1517955
58534 1517955 1499665 1483409 1469094 1455749 1442870 1430783 1419785 1409874 1401371 1394954 1390792 1388247
58522 1388247 1386624 1385693 1385354 1385405 1386011 1387807 1391012 1394769 1397959 1400664 1404372 1410612 1419669 1430643 1442271
58507 1442271 1453359 1462906 1470695 1478031 1487285 1500034 1515690 1532194 1547978 1562997 1578109 1593920
58495 1593920 1610194 1626027 1640506 1653380 1665069 1675959 1685915 1694663 1702247 1708724 1713808 1717431
58483 1717431 1720374 1723604 1727086 1729960 1731924 1733669 1735881 1738463 1740934 1743034 1744775 1746418 1748468 1751207
58469 1751207 1754290 1757428 1761248 1766457 1772165 1776308 1778164 1779273 1781300 1784198 1787369 1791451 1797564 1805419
58455 1805419 1813651 1821831 1830940 1841817 1854147 1867135 1880337 1893711 1907507 1922291 1938499 1955934
$$ packed form
58545A753616k8260k5039k2134j9964j8914j9396k0675k1238k0684j9946j9411
58534A517955j8290j6256j4315j3345j2879j2087j0998r911q503o417m162k545
58522A388247j623r31l39N1O06J796L205L757L190K705L708O240R057J0974J1628
58507A442271J1088R547P789P336R254J2749J5656J6504J5784J5019J5112J5811
58495A593920J6274J5833J4479J2874J1689J0890R956Q748P584O477N084L623
58483A717431K943L230L482K874J964J745K212K582K471K100J741J643K050K739
58469A751207L083L138L820N209N708M143J856J109K027K898L171M082O113P855
58455A805419Q232Q180R109J0877J2330J2988J3202J3374J3796J4784J6208J7435
$$ plain form
58443 1955934 1974122 1992928 2012133 2030653 2047275 2062405 2078213 2096545 2117280 2139051 2160915
58432 2160915 2182745 2204544 2226195 2247799 2269697 2292031 2314615 2337288 2360180 2383467 2407114
58421 2407114 2431026 2455461 2480932 2507519 2534421 2560588 2585855 2611152 2637450 2664831 2692774
58410 2692774 2721038 2750050 2780675 2813773 2849597 2887374 2925839 2964462 3003609 3043225 3082134
58399 3082134 3119450 3156077 3193783 3233008 3272629 3311826 3351043 3390989 3431750 3473267 3515719
58388 3515719 3558886 3601946 3644552 3687522 3731877 3777702 3824497 3872189 3921137 3971510 4023168
58377 4023168 4075859 4129064 4182074 4234772 4288075 4343109 4400361 4460040 4522540 4587669 4653929
58366 4653929 4719712 4785150 4851851 4920932 4992293 5065764 5141734 5220306 5300891 5383129 5467317
$$ packed form
58443A955934J8188J8806J9205J8520J6622J5130J5808J8332K0735K1771K1864
58432B160915K1830K1799K1651K1604K1898K2334K2584K2673K2892K3287K3647
58421B407114K3912K4435K5471K6587K6902K6167K5267K5297K6298K7381K7943
58410B692774K8264K9012L0625L3098L5824L7777L8465L8623L9147L9616L8909
58399C082134L7316L6627L7706L9225L9621L9197L9217L9946M0761M1517M2452
58388C515719M3167M3060M2606M2970M4355M5825M6795M7692M8948N0373N1658
58377D023168N2691N3205N3010N2698N3303N5034N7252N9679O2500O5129O6260
58366D653929O5783O5438O6701O9081P1361P3471P5970P8572Q0585Q2238Q4188
$$ plain form
58355 5467317 5553503 5641078 5729956 5821242 5915926 6013621 6113531 6216039 6322264 6432359 6545304
58344 6545304 6660212 6776884 6895130 7014645 7135760 7259502 7386576 7516771 7649526
58335 7649526 7784677 7922720 8064849 8212509 8366240 8525141 8688285 8856350 9030740
58326 9030740 9211277 9396344 9585656 9781337 9985525 10198163 10418128 10645228 10879817
58317 10879817 11121303 11368518 11621140 11879701 12144692 12416637 12696314 12983467 13275852
58308 13275852 13571148 13869660 14173555 14483437 14797311 15113266 15431593 15753706 16080354
58299 16080354 16411850 16749025 17093046 17444915 17805790 18177103 18559510 18952014 19352329
58290 19352329 19757563 20164315 20569098 20969346 21363614 21750756 22130125 22503492 22876021
$$ packed form
58355E467317Q6186Q7575Q8878R1286R4684R7695R9910J02508J06225J10095J12945
58344F545304J14908J16672J18246J19515J21115J23742J27074J30195J32755
58335G649526J35151J38043J42129J47660J53731J58901J63144J68065J74390
58326I030740J80537J85067J89312J95681K04188K12638K19965K27100K34589
58317A0879817K41486K47215K52622K58561K64991K71945K79677K87153K92385
58308A3275852K95296K98512L03895L09882L13874L15955L18327L22113L26648
58299A6080354L31496L37175L44021L51869L60875L71313L82407L92504M00315
58290A9352329M05234M06752M04783M00248L94268L87142L79369L73367L72529
$$ plain form
58281 22876021 23254541 23645334 24054007 24486131 24946297 25436652 25957413 26508578 27090009
58272 27090009 27699877 28334135 28987923 29656849 30336797 31023262 31711371 32396479 33074906
58263 33074906 33744584 34405045 35056583 35700000 36338112 36977352 37626773 38294891 38987894
58254 38987894 39710834 40469231 41268135 42109444 42990393 43904132 44840974 45789409 46737608
58245 46737608 47675571 48596436 49495760 50369943 51215890 52032086 52819430 53581245 54323717
58236 54323717 55057046 55795317 56553572 57343616 58171355 59036458 59934004 60858294 61808401
58227 61808401 62792239 63825823 64928698 66119666 67415013 68828344 70371090 72053848
58219 72053848 73887862 75885519 78060433 80428041 83004839 85804359 88833080 92091619
$$ packed form
58281B2876021L78520L90793M08673M32124M60166M90355N20761N51165N81431
58272B7090009O09868O34258O53788O68926O79948O86465O88109O85108O78427
58263C3074906O69678O60461O51538O43417O38112O39240O49421O68118O93003
58254C8987894P22940P58397P98904Q41309Q80949R13739R36842R48435R48199
58245D6737608R37963R20865Q99324Q74183Q45947Q16196P87344P61815P42472
58236E4323717P33329P38271P58255P90044Q27739Q65103Q97546R24290R50107
58227F1808401R83838J033584J102875J190968J295347J413331J542746J682758
58219G2053848J834014J997657K174914K367608K576798K799520L028721L258539
$$ plain form
58211 92091619 95580413 99303344 103267410 107484430 111978578 116793897 121993910 127654035
58203 127654035 133854751 140680840 148224882 156588662 165876034 176175603 187540313 199976209
58195 199976209 213447612 227895394 243258884 259490496 276550218 294368017 312772876
58188 312772876 331405290 349646953 366610390 381220296 392373850 399110491 400714657
58181 400714657 396745371 387061069 371887336 351876217 328060297 301683034 273996147
58174 273996147 246124443 219013459 193411242 169851789 148649661 129920151 113618463
58167 113618463 99584383 87587268 77368089 68671123 61261243 54931060 49503114
58160 49503114 44828246 40781363 37258075 34173149 31458043 29056644 26922049 25015744
$$ packed form
58211I2091619L488794L722931L964066M217020M494148M815319N200013N660125
58203A27654035O200716O826089P544042Q363780R287372J0299569J1364710J2435896
58195A99976209J3471403J4447782J5363490J6231612J7059722J7817799J8404859
58188C12772876J8632414J8241663J6963437J4609906J1153554O736641J604166
58181D00714657l969286r684302j5173733k0011119k3815920k6377263k7686887
58174B73996147k7871704k7110984k5602217k3559453k1202128j8729510j6301688
58167A13618463j4034080j1997115j0219179q696966p409880o330183n427946
58160D9503114m674868m046883l523288l084926k715106k401399k134595j906305
$$ plain form
58152 25015744 23306830 21769813 20382732 19127006 17987485 16951276 16006414 15141644
58144 15141644 14347004 13614228 12936743 12309226 11726871 11184977 10679213 10205825 9761463
58135 9761463 9343333 8949815 8580198 8233326 7907187 7600301 7312549 7043755 6792310
58126 6792310 6556175 6334420 6126483 5930622 5744658 5567997 5401479 5245266 5098172
58117 5098172 4959002 4827106 4701371 4579977 4461788 4347191 4237234 4132544 4033135 3938509
58107 3938509 3847841 3760814 3678256 3601051 3528436 3458487 3390509 3325854 3266017 3210865 3159261
58096 3159261 3110489 3064379 3020535 2978127 2936176 2893808 2850585 2806879 2763480 2720611 2677659
58085 2677659 2633989 2589740 2545833 2503625 2464229 2427371 2390978 2352975 2313759 2275932 2241191
$$ packed form
58152B5015744j708914j537017j387081j255726j139521j036209r44862q64770
58144A5141644p94640p32776o77485o27517n82355n41894n05764m73388m44362
58135I761463m18130l93518l69617l46872l26139l06886k87752k68794k51445
58126F792310k36135k21755k07937j95861j85964j76661j66518j56213j47094
58117E098172j39170j31896j25735j21394j18189j14597j09957j04690r9409r4626
58107C938509r0668q7027q2558p7205p2615o9949o7978o4655n9837n5152n1604
58096C159261m8772m6110m3844m2408m1951m2368m3223m3706m3399m2869m2952
58085B677659m3670m4249m3907m2208l9396l6858l6393l8003l9216l7827l4741
$$ plain form
58074 2241191 2208507 2176027 2143703 2112833 2083532 2054120 2023276 1991704 1961009 1931532 1902213
58063 1902213 1872599 1844059 1818307 1795116 1772536 1749518 1727317 1707604 1690061 1672951 1655710
58052 1655710 1639702 1626324 1615371 1605505 1595494 1584646 1572861 1560743 1549194 1538551 1528513
58041 1528513 1519009 1510479 1502911 1495284 1486597 1477220 1468805 1462824 1459364 1457146 1454704 1451666 1448803 1446696
58027 1446696 1444808 1442368 1439662 1437509 1435649 1432913 1429176 1425964 1424566 1424546 1424788 1425155 1426249 1428254 1431034
58012 1431034 1435036 1441076 1449128 1458013 1466445 1474008 1481133 1488485 1496537 1505578 1515915 1527861 1541321
57999 1541321 1555698 1570661 1586810 1604970 1624894 1645531 1666697 1689560 1715031 1742496 1770681
57988 1770681 1799118 1828139 1858038 1888951 1921015 1953970 1986976 2019386 2051276 2082620 2112529
$$ packed form
58074B241191l2684l2480l2324l0870k9301k9412l0844l1572l0695k9477k9319
58063A902213k9614k8540k5752k3191k2580k3018k2201j9713j7543j7110j7241
58052A655710j6008j3378j0953r866j0011j0848j1785j2118j1549j0643j0038
58041A528513r504q530p568p627q687r377q415n981l460k218k442l038k863k107
58027A446696j888k440k706k153j860k736l737l212j398k0K42L67J094K005K780
58012A431034M002O040Q052Q885Q432P563P125P352Q052R041J0337J1946J3460
57999A541321J4377J4963J6149J8160J9924K0637K1166K2863K5471K7465K8185
57988A770681K8437K9021K9899L0913L2064L2955L3006L2410L1890L1344K9909
$$ plain form
57977 2112529 2140001 2164796 2186590 2203804 2214504 2218333 2216358 2208863 2194361 2171112 2138834 2098707
57965 2098707 2052607 2002755 1951273 1899361 1847271 1795469 1745374 1698483 1655306 1615734 1580069
57954 1580069 1548963 1522368 1499263 1478608 1460170 1444280 1431191 1420955 1413603 1408982 1406485 1405239
57942 1405239 1404593 1404181 1403561 1402235 1400193 1398013 1396063 1393996 1391576 1389674 1389657 1391690 1394393 1396455 1398026
57927 1398026 1400169 1403557 1408238 1414251 1421758 1430607 1440254 1450101 1459618 1468251 1475514 1481110 1484670 1485457
57913 1485457 1482616 1475700 1464772 1450089 1431909 1410558 1386497 1360406 1333282 1306210 1279873 1254538
57901 1254538 1230653 1209090 1190407 1174094 1158927 1144049 1129515 1115961 1103933 1093361 1083557
57890 1083557 1073956 1064892 1057171 1050702 1044228 1036894 1029446 1023156 1018093 1013366 1008788 1005215 1003224 1002408
$$ packed form
57977B112529K7472K4795K1794J7214J0700L829j975p495j4502k3249l2278m0127
57965B098707m6100m9852n1482n1912n2090n1802n0095m6891m3177l9572l5665
57954A580069l1106k6595k3105k0655j8438j5890j3089j0236p352m621k497j246
57942A405239o46m12o20j326k042k180j950k067k420j902j7K033K703K062J571
57927A398026K143L388M681O013P507Q849R647R847R517Q633P263N596L560P87
57913A485457k841o916j0928j4683j8180k1351k4061k6091k7124k7072k6337k5335
57901A254538k3885k1563j8683j6313j5167j4878j4534j3554j2028j0572r804
57890A083557r601r064p721o469o474p334p448o290n063m727m578l573j991q16
$$ plain form
57876 1002408 1002255 1002963 1005051 1008709 1013812 1020086 1027002 1034057 1041340 1049320 1057771 1065433 1071166 1075085
57862 1075085 1078244 1081576 1085489 1089927 1094215 1097054 1097469 1095946 1094234 1093812 1094659 1095608 1095698 1095042 1094443 1094416
57846 1094416 1094860 1095757 1097698 1101208 1105703 1109877 1113336 1117135 1122149 1127469 1131291 1133191 1134492 1136212
57832 1136212 1137638 1137634 1136665 1136537 1138291 1141369 1144887 1148695 1152738 1156349 1159174 1162221 1166840 1172730 1177991
57817 1177991 1181326 1183351 1185576 1189164 1195164 1204766 1218147 1233512 1248335 1261616 1274339 1288064
57805 1288064 1303816 1322105 1342958 1365690 1389381 1413779 1439024 1464302 1487599 1507443 1524421
57794 1524421 1540216 1555179 1567332 1573921 1573731 1567707 1557363 1542951 1523683 1499778 1473523 1447602
57782 1447602 1422625 1397033 1369416 1340264 1311414 1284549 1260507 1239386 1220721 1203820 1188312
$$ packed form
57876A002408j53P08K088L658N103O274O916P055P283P980Q451P662N733L919
57862A075085L159L332L913M438M288K839M15j523j712m22Q47R49R0o56n99k7
57846A094416M44Q97J941L510M495M174L459L799N014N320L822J900J301J720
57832A136212J426mr69j28J754L078L518L808M043L611K825L047M619N890N261
57817A177991L335K025K225L588O000R602J3381J5365J4823J3281J2723J3725
57805A288064J5752J8289K0853K2732K3691K4398K5245K5278K3297J9844J6978
57794A524421J5795J4963J2153O589j90o024j0344j4412j9268k3905k6255k5921
57782A447602k4977k5592k7617k9152k8850k6865k4042k1121j8665j6901j5508
$$ plain form
57771 1188312 1174328 1162141 1151928 1143846 1137837 1133258 1129209 1125439 1122467 1120676 1119928 1120306 1122438 1126516
57757 1126516 1131719 1137299 1143581 1150884 1157971 1162958 1165921 1169386 1175721 1184868 1195167 1205489 1215658
57744 1215658 1225500 1234695 1243657 1253519 1264979 1277780 1291504 1305986 1320440 1333124 1343001 1351440
57732 1351440 1361111 1372994 1385425 1396355 1405618 1414437 1423671 1433482 1444048 1455316 1466085 1474493
57720 1474493 1479839 1483300 1486610 1490681 1495693 1501722 1508714 1516269 1524126 1532754 1543015 1555198 1568571
57707 1568571 1581883 1594358 1606372 1619188 1633889 1650596 1668764 1687801 1706977 1725288 1742479
57696 1742479 1760146 1780693 1804787 1830757 1856927 1883566 1911819 1941760 1972695 2004802 2039198
57685 2039198 2076446 2116098 2157781 2201810 2248607 2298435 2351946 2410155 2473406 2540934 2611907
$$ packed form
57771A188312j3984j2187j0213q082o009m579m049l770k972j791p48L78K132M078
57757A126516N203N580O282P303P087M987K963L465O335R147J0299J0322J0169
57744A215658R842R195Q962R862J1460J2801J3724J4482J4454J2684R877Q439
57732A351440R671J1883J2431J0930R263Q819R234R811J0566J1268J0769Q408
57720A474493N346L461L310M071N012O029O992P555P857Q628J0261J2183J3373
57707A568571J3312J2475J2014J2816J4701J6707J8168J9037J9176J8311J7191
57696A742479J7667K0547K4094K5970K6170K6639K8253K9941L0935L2107L4396
57685B039198L7248L9652M1683M4029M6797M9828N3511N8209O3251O7528P0973
$$ plain form
57674 2611907 2686318 2764420 2845812 2929775 3016184 3105139 3195381 3283551 3365457 3437964 3499287
57663 3499287 3547514 3579421 3591327 3581142 3549412 3498687 3432559 3355369 3271824 3185986 3100672
57652 3100672 3018085 2940449 2869271 2804295 2744125 2688018 2636547 2590589 2550387 2515689 2485988
57641 2485988 2460289 2437349 2416629 2398677 2384274 2373512 2365951 2361188 2358967 2359126 2361815 2367419 2375978
57628 2375978 2387068 2400508 2416622 2435236 2454996 2474572 2494412 2516454 2541979 2570337 2599999
57617 2599999 2630273 2661644 2694765 2729597 2765515 2802060 2839423 2878058 2917812 2957714 2996800
57606 2996800 3034861 3072035 3107899 3141477 3172037 3199287 3222778 3241716 3255546 3264227 3267708 3265669
57594 3265669 3258095 3245656 3229139 3208956 3185681 3160650 3135399 3110745 3086899 3064177 3042793
$$ packed form
57674B611907P4411P8102Q1392Q3963Q6409Q8955R0242Q8170Q1906P2507O1323
57663C499287M8227L1907J1906j0185l1730n0725o6128p7190q3545q5838q5314
57652C100672q2587p7636p1178o4976o0170n6107n1471m5958m0202l4698k9701
57641B485988k5699k2940k0720j7952j4403j0762p561m763k221J59K689N604Q559
57628B375978J1090J3440J6114J8614J9760J9576J9840K2042K5525K8358K9662
57617B599999L0274L1371L3121L4832L5918L6545L7363L8635L9754L9902L9086
57606B996800L8061L7174L5864L3578L0560K7250K3491J8938J3830Q681L481k039
57594C265669p574j2439j6517k0183k3275k5031k5251k4654k3846k2722k1384
$$ plain form
57583 3042793 3022245 3001974 2982864 2967107 2955929 2948090 2941360 2935142 2930886 2930084 2932663 2937532 2944087
57570 2944087 2952659 2963656 2976589 2990204 3003697 3017713 3033860 3053026 3074428 3096527 3118596
57559 3118596 3140992 3164224 3188435 3213816 3240786 3269453 3299311 3329732 3360485 3391675 3423676
57548 3423676 3457321 3493548 3532285 3572145 3611861 3651800 3693347 3736909 3781320 3825355 3869110
57537 3869110 3913552 3959388 4007002 4057102 4110563 4167423 4226427 4285870 4344800 4403421 4462533
57526 4462533 4522761 4584304 4647294 4712168 4779503 4849390 4921253 4994435 5068883 5144969 5222772
57515 5222772 5301861 5381796 5462426 5543515 5624363 5704152 5782404 5858757 5932435 6002487 6068691
57504 6068691 6131802 6192698 6251464 6307512 6360285 6409730 6456366 6501300 6545959 6591284 6637085
$$ packed form
57583C042793k0548k0271j9110j5757j1178p839o730o218m256q02K579M869O555
57570B944087Q572J0997J2933J3615J3493J4016J6147J9166K1402K2099K2069
57559C118596K2396K3232K4211K5381K6970K8667K9858L0421L0753L1190L2001
57548C423676L3645L6227L8737L9860L9716L9939M1547M3562M4411M4035M3755
57537C869110M4442M5836M7614N0100N3461N6860N9004N9443N8930N8621N9112
57526D462533O0228O1543O2990O4874O7335O9887P1863P3182P4448P6086P7803
57515E222772P9089P9935Q0630Q1089Q0848P9789P8252P6353P3678P0052O6204
57504F068691O3111O0896N8766N6048N2773M9445M6636M4934M4659M5325M5801
$$ plain form
57493 6637085 6682523 6727334 6772468 6819507 6869657 6923283 6980191 7040218 7103661 7171083 7242621
57482 7242621 7317643 7395455 7476277 7561149 7650793 7744895 7842607 7943399 8047243 8154389 8265269
57471 8265269 8380330 8499536 8622067 8746780 8872918 9000264 9128971 9259623 9393330
57462 9393330 9531256 9673861 9820676 9970699 10122807 10276017 10429958 10585271 10743220
57453 10743220 10904522 11068603 11234081 11399945 11566165 11733204 11901073 12068971 12235962
57444 12235962 12401863 12567152 12731909 12895257 13056319 13215482 13374100 13532914 13691415
57435 13691415 13849104 14006851 14166361 14328631 14493714 14662067 14835220 15014462 15199405
57426 15199405 15388656 15581775 15779599 15982400 16188740 16396977 16607322 16821312 17039378
$$ packed form
57493F637085M5438M4811M5134M7039N0150N3626N6908O0027O3443O7422P1538
57482G242621P5022P7812Q0822Q4872Q9644R4102R7712J00792J03844J07146J10880
57471H265269J15061J19206J22531J24713J26138J27346J28707J30652J33707
57462I393330J37926J42605J46815J50023J52108J53210J53941J55313J57949
57453A0743220J61302J64081J65478J65864J66220J67039J67869J67898J66991
57444A2235962J65901J65289J64757J63348J61062J59163J58618J58814J58501
57435A3691415J57689J57747J59510J62270J65083J68353J73153J79242J84943
57426A5199405J89251J93119J97824K02801K06340K08237K10345K13990K18066
$$ plain form
57417 17039378 17259950 17481198 17702839 17925919 18151829 18382087 18618247 18860877 19108902
57408 19108902 19360794 19616282 19876160 20140714 20409381 20682008 20959350 21241840 21528677
57399 21528677 21818850 22112504 22410692 22714138 23022952 23337370 23658028 23985319 24318817
57390 24318817 24657504 25000337 25346552 25695600 26046873 26399605 26753262 27108220 27465709
57381 27465709 27826611 28190339 28555418 28921267 29288963 29659958 30034527 30412054 30792675
57372 30792675 31177783 31568597 31964778 32365064 32768879 33176426 33587150 33999064 34410150
57363 34410150 34819768 35227906 35633448 36034195 36428614 36816623 37198432 37573513 37941363
57354 37941363 38302672 38658976 39011447 39360725 39707735 40053735 40399366 40744376 41088830
$$ packed form
57417A7039378K20572K21248K21641K23080K25910K30258K36160K42630K48025
57408A9108902K51892K55488K59878K64554K68667K72627K77342K82490K86837
57399B1528677K90173K93654K98188L03446L08814L14418L20658L27291L33498
57390B4318817L38687L42833L46215L49048L51273L52732L53657L54958L57489
57381B7465709L60902L63728L65079L65849L67696L70995L74569L77527L80621
57372C0792675L85108L90814L96181M00286M03815M07547M10724M11914M11086
57363C4410150M09618M08138M05542M00747L94419L88009L81809L75081L67850
57354C7941363L61309L56304L52471L49278L47010L46000L45631L45010L44454
$$ plain form
57345 41088830 41434282 41783302 42138005 42499329 42867606 43243332 43627197 44019583 44420158
57336 44420158 44827705 45239824 45652721 46061534 46461336 46848224 47219784 47575002 47913993
57327 47913993 48237794 48548068 48846834 49136507 49420021 49700398 49979916 50259892 50541572
57318 50541572 50826986 51118346 51416453 51720174 52027885 52339305 52655641 52978265 53307816
57309 53307816 53644690 53989704 54343679 54706402 55076303 55451074 55828292 56205607 56580888
57300 56580888 56952584 57319928 57682735 58041016 58394650 58743025 59084904 59418797 59743470
57291 59743470 60057802 60360168 60648368 60920351 61174712 61410581 61627865 61828178 62014987
57282 62014987 62191958 62361087 62522855 62678028 62828744 62977845 63127600 63279089 63432255
$$ packed form
57345D1088830L45452L49020L54703L61324L68277L75726L83865L92386M00575
57336D4420158M07547M12119M12897M08813L99802L86888L71560L55218L38991
57327D7913993L23801L10274K98766K89673K83514K80377K79518K79976K81680
57318E0541572K85414K91360K98107L03721L07711L11420L16336L22624L29551
57309E3307816L36874L45014L53975L62723L69901L74771L77218L77315L75281
57300E6580888L71696L67344L62807L58281L53634L48375L41879L33893L24673
57291E9743470L14332L02366K88200K71983K54361K35869K17284K00313J86809
57282F2014987J76971J69129J61768J55173J50716J49101J49755J51489J53166
$$ plain form
57273 63432255 63586348 63740557 63894416 64047621 64199956 64352010 64505824 64664173 64829074
57264 64829074 65001402 65181811 65371176 65569873 65777276 65992394 66214423 66442334 66674482
57255 66674482 66909237 67145760 67383823 67623199 67863725 68105638 68349175 68593746 68837875
57246 68837875 69079958 69318717 69552623 69778826 69992652 70188390 70361084 70507807 70627109
57237 70627109 70717454 70776723 70803507 70798593 70765459 70710307 70642078 70571514 70509190 70464368 70445751
57226 70445751 70462114 70520756 70625299 70775934 70971820 71212429 71496367 71819754 72176179 72557500
57216 72557500 72954157 73355209 73749055 74124691 74472563 74784764 75055471 75282375 75468650
57207 75468650 75623759 75761703 75897590 76044818 76213746 76410236 76633003 76871522 77106832
$$ packed form
57273F3432255J54093J54209J53859J53205J52335J52054J53814J58349J64901
57264F4829074J72328J80409J89365J98697K07403K15118K22029K27911K32148
57255F6674482K34755K36523K38063K39376K40526K41913K43537K44571K44129
57246F8837875K42083K38759K33906K26203K13826J95738J72694J46723J19302
57237G0627109R0345N9269K6784m914l3134n5152o8229p0564o2324m4822j8617
57226G0445751J6363N8642J04543J50635J95886K40609K83938L23387L56425L81321
57216G2557500L96657M01052L93846L75636L47872L12201K70707K26904J86275
57207G5468650J55109J37944J35887J47228J68928J96490K22767K38519K35310
$$ plain form
57198 77106832 77314946 77471008 77553715 77550289 77460427 77296697 77081235 76840912 76602026 76384227
57188 76384227 76195194 76029241 75870684 75698996 75493092 75235060 74913945 74528033 74084084
57179 74084084 73594446 73073777 72535452 71987627 71431141 70861459 70273554 69666284 69044338
57170 69044338 68418257 67802856 67213438 66660260 66143911 65654254 65173260 64679661 64153132
57161 64153132 63577208 62941547 62243865 61490435 60693859 59868814 59028066 58180168 57328591
57152 57328591 56472121 55606950 54729598 53838484 52933533 52015942 51089198 50158905 49229184
57143 49229184 48297773 47354293 46382920 45366936 44293109 43155376 41956636 40706812
57135 40706812 39418314 38103076 36773741 35447073 34146290 32900971 31744064 30704752
$$ packed form
57198G7106832K08114J56062Q2707l426q9862j63730k15462k40323k38886k17799
57188G6384227j89033j65953j58557j71688k05904k58032l21115l85912m43949
57179G4084084m89638n20669n38325n47825n56486n69682n87905o07270o21946
57170F9044338o26081o15401n89418n53178n16349m89657m80994m93599n26529
57161F4153132n75924o35661o97682p53430p96576q25045q40748q47898q51577
57152E7328591q56470q65171q77352q91114r04951r17591r26744r30293r29721
57143D9229184r31411r43480r71373j015984j073827j137733j198740j249824
57135D0706812j288498j315238j329335j326668j300783j245319j156907j039312
$$ plain form
57127 30704752 29797411 29011060 28305927 27620876 26890122 26063765 25124852 24096439 23036007
57118 23036007 22020371 21127602 20421128 19937923 19681506 19621419 19700721 19850381 20005814
57109 20005814 20119706 20167767 20148360 20079354 19994143 19936343 19952615 20085235 20366678 20816541
57099 20816541 21439853 22227161 23158309 24210424 25367116 26624507 27991344 29483818
57091 29483818 31118345 32906582 34855129 36968449 39250672 41703531 44321792 47089074
57083 47089074 49974317 52927018 55871414 58703683 61297140 63516737 65239174 66371423
57075 66371423 66860479 66691496 65878384 64454756 62469639 59985638 57075491 53817641
57067 53817641 50294700 46595178 42813682 39045796 35379668 31889075 28629857 25638510
$$ packed form
57127C0704752r07341p86351p05133o85051p30754q26357r38913j028413j060432
57118B3036007j015636q92769p06474m83205k56417o0087P9302J49660J55433
57109B0005814J13892M8061j9407o9006q5211n7800J6272J32620K81443M49863
57099B0816541O23312P87308R31148J052115J156692J257391J366837J492474
57091B9483818J634527J788237J948547K113320K282223K452859K618261K767282
57083D7089074K885243K952701K944396K832269K593457K219597J722437J132249
57075F6371423M89056j68983q13112j423628j985117k484001k910147l257850
57067E3817641l522941l699522l781496l767886l666128l490593l259218k991347
$$ plain form
57059 25638510 22932440 20512767 18369166 16484218 14835762 13398540 12146604 11055769
57051 11055769 10104430 9272842 8542745 7898375 7327731 6822335 6375286 5979348 5626853
57042 5626853 5311285 5028590 4776595 4553164 4355229 4179549 4023849 3886644 3766094
57033 3766094 3659704 3565511 3483150 3412965 3353703 3301359 3250624 3197228 3138412 3071402 2992561
57022 2992561 2898985 2790812 2671437 2545563 2417516 2291172 2170290 2058040 1956183 1864906
57012 1864906 1783222 1709506 1642225 1580722 1525106 1475134 1429614 1387348 1348189 1312406 1279277
57001 1279277 1247307 1216031 1186702 1160660 1137631 1116251 1095832 1077000 1060815 1047955 1038655
56990 1038655 1032711 1029256 1026967 1024833 1022633 1020629 1019145 1018557 1019209 1020798 1021916 1020629 1015748 1007333
$$ packed form
57059B5638510k706070k419673k143601j884948j648456j437222j251936j090835
57051A1055769r51339q31588p30097o44370n70644n05396m47049l95938l52495
57042E626853l15568k82695k51995k23431j97935j75680j55700j37205j20550
57033C766094j06390r4193q2361p0185n9262n2344n0735n3396n8816o7010p8841
57022B992561r3576j08173j19375j25874j28047j26344j20882j12250j01857r1277
57012A864906q1684p3716o7281o1503n5616m9972m5520m2266l9159l5783l3129
57001A279277l1970l1276k9329k6042k3029k1380k0419j8832j6185j2860r300
56990A038655n944l455k289k134k200k004j484n88O52J589J118j287m881q415
$$ plain form
56976 1007333 995951 981783 964863 946055 927108 909368 892690 876138 859644 844359 831281
56965 831281 820212 810520 802451 797034 794847 795400 797619 800407 802839 804491 805733 807142 808326 807743
56951 807743 803858 796192 785287 772339 759080 747174 737033 727662 718284 709686 703264 699204 696515
56938 696515 694675 694248 695775 699004 703556 709555 717109 725722 734607 743050 750089 754417 755181 752509 746756
56923 746756 737661 724880 709066 691823 674665 658482 643657 629987 616685 603289 590620 580108
56911 580108 572087 565508 559511 554432 550805 548169 545587 542968 541127 540688 541446 542707 543860 544818 546221
56896 546221 548920 552832 556751 560017 563947 570525 579604 588585 595305 600314 605587 611831 618051 623351
56882 623351 627992 632639 637424 642033 646059 649042 650624 650908 650256 648630 645856 642926 642326 646249 654628
$$ packed form
56976A007333j1382j4168j6920j8808j8947j7740j6678j6552j6494j5285j3078
56965H31281j1069r692q069n417k187N53K219K788K432J652J242J409J184n83
56951H07743l885p666j0905j2948j3259j1906j0141r371r378q598o422m060k689
56938F96515j840m27J527L229M552N999P554Q613Q885Q443P039M328P64k672n753
56923G46756r095j2781j5814j7243j7158j6183j4825j3670j3302j3396j2669j0512
56911E80108q021o579n997n079l627k636k582k619j841m39P58J261J153R58J403
56896E46221K699L912L919L266L930O578R079Q981O720N009N273O244O220N300
56882F23351M641M647M785M609M026K983J582K84o52j626k774k930o00L923Q379
$$ plain form
56867 654628 665545 677494 690642 705863 723290 742150 761478 780409 798088 813994 828486
56856 828486 842416 855761 866865 873518 874801 871588 865346 857024 847387 837813 829952 824638 821791
56843 821791 821462 824382 831210 841847 855872 873161 893555 916285 940374 965332 990683 1014888
56831 1014888 1035580 1051162 1061511 1066761 1066028 1057919 1042045 1019530 992239 962009 930511 899347
56819 899347 870078 844308 823525 808449 798603 792958 791021 792861 798127 805734 814865 825606 837902
56806 837902 850301 860563 867438 870927 870566 864378 850243 827936 799209 766225 730586 693678
56794 693678 657063 622197 590175 561885 538012 518806 504226 494269 488630 486139 485438 486439 490208
56781 490208 496857 504383 510383 514208 516395 516511 512916 504716 492772 478427 462097 443575 423173
$$ packed form
56867F54628J0917J1949J3148J5221J7427J8860J9328J8931J7679J5906J4492
56856H28486J3930J3345J1104O653J283l213o242q322r637r574p861n314k847
56843H21791l29K920O828J0637J4025J7289K0394K2730K4089K4958K5351K4205
56831A014888K0692J5582J0349N250p33q109j5874k2515k7291l0230l1498l1164
56819H99347k9269k5770k0783j5076r846n645j937J840N266P607R131J0741J2296
56806H37902J2399J0262O875L489l61o188j4135k2307k8727l2984l5639l6908
56794F93678l6615l4866l2022k8290k3873j9206j4580r957n639k491p01J001L769
56781D90208O649P526O000L825K187J16l595q200j1944j4345j6330j8522k0402
$$ plain form
56768 423173 402150 382369 365544 352195 341153 330727 320532 311611 304667 299151 294451 290936
56756 290936 288914 287293 284402 279940 275239 271666 269481 268126 266869 265111 262816 260848 260278 261148 262362
56741 262362 262964 262998 262850 262350 261124 259534 258594 258799 259509 259824 259745 260005 260840 261533 261495 261293 262003 263811 265938
56722 265938 267845 269650 271290 272223 272473 273087 274720 276290 275955 273235 269529 266757 266160 268060 271748
56707 271748 275590 278192 279805 281893 285059 288087 289412 288975 288121 288111 289302 291532 294751 299155 304914
56692 304914 311741 318654 324295 327787 329404 330375 332002 334815 338435 342132 345472 348291 350236 350872 350522
56677 350522 350465 351639 353341 353869 352467 350068 348052 346956 346699 347436 349477 352426 355006 356133 356080 356237
56661 356237 357536 359396 360608 360883 360704 359805 357209 353332 350578 350428 350886 348604 343115 337147 332867
$$ packed form
56768D23173k1023j9781j6825j3349j1042j0426j0195q921o944n516m700l515
56756B90936k022j621k891m462m701l573k185j355j257j758k295j968n70Q70J214
56741B62362O02L4j48n00j226j590r40K05P10L15p9K60Q35O93l8k02P10J808K127
56722B65938J907J805J640R33K50O14J633J570l35k720l706k772n97J900L688
56707B71748L842K602J613K088L166L028J325m37q54j0J191K230L219M404N759
56692C04914O827O913N641L492J617R71J627K813L620L697L340K819J945O36l50
56677C50522n7J174J702N28j402k399k016j096k57P37K041K949K580J127n3J57
56661C56237J299J860J212K75j79q99k596l877k754j50M58k282n489n968m280
$$ plain form
56646 332867 329856 327215 325393 324798 324313 322808 320892 319622 318389 315830 312233 309306 307827 307145 306873
56631 306873 307216 307337 305298 300696 296158 295045 298160 303536 308845 313044 316008 317731 318270 317864 316692
56616 316692 314696 311907 308870 306497 305389 305338 305542 305205 303852 301311 297947 294901 293482 293886 294882 295221
56600 295221 295032 295354 296674 298604 300761 303130 305544 307586 309242 310939 312660 313694 313778 313999 315911
56585 315911 319967 325235 330430 334683 337461 338527 338412 338497 339921 342302 343992 343988 343291 343889 346437 349623
56569 349623 351995 353782 356272 359886 363629 366381 368069 369485 371491 374469 378071 381346 383448 384274
56555 384274 384066 382679 379992 376996 375409 375646 375975 374400 370865 366852 363308 359984 356622 353562 350802
56540 350802 347329 342110 335405 328509 322416 317178 312437 307971 303633 299226 294773 290704 287498 285194
$$ packed form
56646C32867l011k641j822n95m85j505j916j270j233k559l597k927j479o82k72
56631C06873L43J21k039m602m538j113L115N376N309M199K964J723N39m06j172
56616C16692j996k789l037k373j108n1K04l37j353k541l364l046j419M04R96L39
56600B95221j89L22J320J930K157K369K414K042J656J697J721J034Q4K21J912
56585C15911M056N268N195M253K778J066j15Q5J424K381J690mo97N98K548L186
56569C49623K372J787K490L614L743K752J688J416K006K978L602L275K102Q26
56555C84274k08j387k687k996j587K37L29j575l535m013l544l324l362l060k760
56540C50802l473n219o705o896o093n238m741m466m338m407m453m069l206k304
$$ plain form
56526 285194 283450 282025 280980 280445 280337 280403 280361 279962 279050 277708 276293 275178 274410 273646 272557 271392 271040
56509 271040 272231 274637 277147 279211 281410 284246 286810 287510 286087 284030 282782 282282 281629 280579 279914
56494 279914 280761 283755 288293 292306 293572 291897 289445 288390 288947 290312 292495 295908 299815 302804 304757
56479 304757 306918 309847 312698 314844 316809 318974 320627 321328 322212 324730 328596 332102 334247 335524 336661
56464 336661 337624 338223 338984 340635 342860 344094 343008 340123 337570 337047 338363 340245 342077 344123 346381
56449 346381 348237 349368 349983 349872 348243 345161 342387 341878 343732 346274 347903 348301 348041 347669 347282 346704
56433 346704 346007 345804 346731 348596 350450 351582 351969 351744 351016 350449 351015 352509 353174 351727 349225 347995
56417 347995 348997 351082 352652 353259 353743 355445 359125 364073 368480 371283 373255 375677 378445 380462 381377
$$ packed form
56526B85194j744j425j045n35j08O6m2l99r12j342j415j115p68p64j089j165l52
56509B71040J191K406K510K064K199K836K564P00j423k057j248n00o53j050o65
56494B79914Q47K994M538M013J266j675k452j055N57J365K183L413L907K989J953
56479C04757K161K929K851K146J965K165J653P01Q84K518L866L506K145J277J137
56464C36661R63N99P61J651K225J234j086k885k553n23J316J882J832K046K258
56449C46381J856J131O15j11j629l082k774n09J854K542J629L98k60l72l87n78
56433C46704o97k03R27J865J854J132L87k25p28n67N66J494O65j447k502j230
56417C47995J002K085J570O07M84J702L680M948M407K803J972K422K768K017R15
$$ plain form
56402 381377 381790 381984 381865 382198 384460 388998 394428 399445 404083 408575 412085 413792 414698 417124 422306
56387 422306 429166 435549 440196 443421 446262 449287 452254 454760 456900 458984 460943 462555 464152 466405
56373 466405 469327 472234 475018 478802 484730 492377 499821 505250 508376 510514 513385 517532 521827 524863
56359 524863 526828 529415 533769 539366 545330 552022 560335 569780 578346 584492 588701 592853 598402 605395
56345 605395 612894 620039 626675 633144 639679 646214 652737 659577 667190 675738 685036 694818 705077 716091
56331 716091 727834 739337 749126 756793 763711 771489 780053 788244 796171 805584 817492 830670 843370
56318 843370 855629 868791 883395 898582 913228 926673 938528 948816 958377 968441 979685 992196
56306 992196 1006008 1020931 1036043 1050247 1063528 1076903 1091006 1105297 1118851 1131427 1143696
$$ packed form
56402C81377M13J94j19L33K262M538N430N017M638M492L510J707R06K426N182
56387D22306O860O383M647L225K841L025K967K506K140K084J959J612J597K253
56373D66405K922K907K784L784N928P647P444N429L126K138K871M147M295L036
56359E24863J965K587M354N597N964O692Q313R445Q566O146M209M152N549O993
56345F05395P499P145O636O469O535O535O523O840P613Q548R298R782J0259J1014
56331G16091J1743J1503R789P667O918P778Q564Q191P927R413J1908J3178J2700
56318H43370J2259J3162J4604J5187J4646J3445J1855J0288R561J0064J1244J2511
56306I92196J3812J4923J5112J4204J3281J3375J4103J4291J3554J2576J2269
$$ plain form
56295 1143696 1156771 1171368 1186913 1201704 1214541 1226042 1237662 1249911 1262621 1276615 1293416
56284 1293416 1312954 1333085 1352158 1370946 1391355 1414434 1440558 1470248 1503251 1537623 1571380
56273 1571380 1604893 1640333 1678960 1720269 1763733 1809877 1859282 1911792 1967309 2026414 2089578
56262 2089578 2156457 2226569 2300099 2377495 2458722 2543286 2630514 2719414 2808671 2897259 2984704
56251 2984704 3070461 3153453 3232437 3306204 3372995 3430291 3475960 3509458 3531537 3543081 3544501
56240 3544501 3535738 3516289 3485661 3444448 3394685 3338604 3277372 3211616 3142641 3072208 3001285
56229 3001285 2929830 2857725 2785253 2712880 2641480 2572581 2507377 2445479 2385661 2327946 2273890
56218 2273890 2224683 2180169 2140118 2105175 2075791 2051331 2031077 2015103 2003195 1994018 1986695 1982452
$$ packed form
56295A143696J3075J4597J5545J4791J2837J1501J1620J2249J2710J3994J6801
56284A293416J9538K0131J9073J8788K0409K3079K6124K9690L3003L4372L3757
56273A571380L3513L5440L8627M1309M3464M6144M9405N2510N5517N9105O3164
56262B089578O6879P0112P3530P7396Q1227Q4564Q7228Q8900Q9257Q8588Q7445
56251B984704Q5757Q2992P8984P3767O6791N7296M5669L3498K2079J1544J420
56240C544501q763j9449l0628m1213m9763n6081o1232o5756o8975p0433p0923
56229C001285p1455p2105p2472p2373p1400o8899o5204o1898n9818n7715n4056
56218B273890m9207m4514m0051l4943k9384k4460k0254j5974j1908r177p323m243
$$ plain form
56206 1982452 1982982 1987471 1992881 1997379 2002048 2008787 2017787 2027820 2038114 2049083 2061612 2076181 2092507
56193 2092507 2109766 2127488 2146318 2167319 2190324 2213668 2236037 2258082 2281524 2306962 2333271
56182 2333271 2359302 2385686 2414546 2447361 2483250 2519695 2555095 2590305 2627366 2667122 2708748
56171 2708748 2751500 2795937 2843145 2893398 2946084 3000530 3056435 3113829 3173072 3234792 3299590
56160 3299590 3367872 3439981 3516233 3596837 3682170 3773071 3870233 3973181 4080600 4192093 4308994
56149 4308994 4433027 4564719 4703587 4849193 5001092 5157846 5316780 5474658 5628323
56140 5628323 5774999 5912480 6038935 6152425 6251279 6335445 6406758 6466974 6515944 6552656
56130 6552656 6577654 6593181 6600964 6600913 6592118 6574018 6546435 6509648 6464967 6414216 6357934 6295021
$$ packed form
56206A982452N30M489N410M498M669O739R000J0033J0294J0969J2529J4569J6326
56193B092507J7259J7722J8830K1001K3005K3344K2369K2045K3442K5438K6309
56182B333271K6031K6384K8860L2815L5889L6445L5400L5210L7061L9756M1626
56171B708748M2752M4437M7208N0253N2686N4446N5905N7394N9243O1720O4798
56160C299590O8282P2109P6252Q0604Q5333R0901R7162J02948J07419J11493J16901
56149D308994J24033J31692J38868J45606J51899J56754J58934J57878J53665
56140E628323J46676J37481J26455J13490R8854Q4166P1313O0216M8970L6712
56130F552656K4998J5527P783n1q795j8100k7583l6787m4681n0751n6282o2913
$$ plain form
56118 6295021 6225048 6150414 6075491 6004182 5939032 5881971 5834674 5798276 5773803 5762977 5767672
56107 5767672 5788249 5823132 5870215 5928045 5995368 6070397 6151303 6237191 6328053 6423954 6524714
56096 6524714 6630236 6740703 6856405 6977574 7104256 7236154 7372785 7514115 7660737
56087 7660737 7813045 7970431 8131895 8297322 8467539 8643067 8823530 9008552 9198579
56078 9198579 9394417 9596416 9804536 10018773 10239122 10465563 10698630 10939482 11188727
56069 11188727 11445417 11707901 11975477 12248572 12527528 12811972 13101153 13394012 13689031
56060 13689031 13985173 14283247 14585507 14893645 15208117 15529618 15859886 16200125 16549549
56051 16549549 16906384 17269535 17638032 18009369 18379899 18747207 19111322 19473490 19834649
$$ packed form
56118F295021o9973p4634p4923p1309o5150n7061m7297l6398k4473j0826M695
56107E767672K0577L4883M7083N7830O7323P5029Q0906Q5888R0862R5901J00760
56096F524714J05522J10467J15702J21169J26682J31898J36631J41330J46622
56087G660737J52308J57386J61464J65427J70217J75528J80463J85022J90027
56078I198579J95838K01999K08120K14237K20349K26441K33067K40852K49245
56069A1188727K56690K62484K67576K73095K78956K84444K89181K92859K95019
56060A3689031K96142K98074L02260L08138L14472L21501L30268L40239L49424
56051A6549549L56835L63151L68497L71337L70530L67308L64115L62168L61159
$$ plain form
56042 19834649 20195628 20558370 20926529 21304871 21698070 22109686 22541934 22996064 23472618
56033 23472618 23971335 24491356 25031775 25591613 26168983 26760856 27364050 27975947 28593822
56024 28593822 29214277 29834471 30453856 31074125 31697641 32326484 32962705 33608858 34268651
56015 34268651 34947796 35653514 36391674 37163936 37968132 38800919 39658678 40535856 41424032
56006 41424032 42313478 43195068 44060756 44903969 45720995 46511635 47277787 48021970 48748073
55997 48748073 49463153 50177673 50904045 51655100 52442688 53275558 54157280 55086455 56059756
55988 56059756 57075571 58135841 59245759 60412536 61644076 62947573 64328360 65790293
55980 65790293 67338444 68982591 70738721 72627862 74674192 76903416 79339735 82000920
$$ packed form
56042A9834649L60979L62742L68159L78342L93199M11616M32248M54130M76554
56033B3472618M98717N20021N40419N59838N77370N91873O03194O11897O17875
56024B8593822O20455O20194O19385O20269O23516O28843O36221O46153O59793
56015C4268651O79145P05718P38160P72262Q04196Q32787Q57759Q77178Q88176
56006D1424032Q89446Q81590Q65688Q43213Q17026P90640P66152P44183P26103
55997D8748073P15080P14520P26372P51055P87588Q32870Q81722R29175R73301
55988E6059756J015815J060270J109918J166777J231540J303497J380787J461933
55980F5790293J548151J644147J756130J889141K046330K229224K436319K661185
$$ plain form
55972 82000920 84895299 88024611 91390781 95000861 98868496 103015887 107478716 112310376
55964 112310376 117580177 123365445 129743129 136786762 144569034 153163730 162639793 173047785
55956 173047785 184408127 196710565 209924954 224015929 238954393 254719812 271284028
55949 271284028 288567286 306368944 324293248 341703429 357737026 371394828 381675791
55942 381675791 387699288 388775106 384443526 374540524 359293687 339375307 315834446
55935 315834446 289917531 262869507 235798661 209616490 185017871 162476421 142254106
55928 142254106 124427838 108928193 95583691 84165538 74425910 66123557 59037148
55921 59037148 52971414 47759198 43260040 39357094 35954537 32974812 30354323 28039209
$$ packed form
55972H2000920K894379L129312L366170L610080L867635M147391M462829M831660
55964A12310376N269801N785268O377684P043633P782272Q594696R476063J0407992
55956A73047785J1360342J2302438J3214389J4090975J4938464J5765419J6564216
55949B71284028J7283258J7801658J7924304J7410181J6033597J3657802J0280963
55942C81675791O023497J075818m331580r903002j5246837j9918380k3540861
55935C15834446k5916915k7048024k7070846k6182171k4598619k2541450k0222315
55928A42254106j7826268j5499645j3344502j1418153r739628q302353p086409
55921E9037148o065734n212216m499158l902946l402557k979725k620489k315114
$$ plain form
55913 28039209 25983624 24149608 22506033 21026790 19690078 18478381 17377271 16373498
55905 16373498 15454648 14610452 13833515 13118313 12459581 11851478 11287817 10763124 10273694
55896 10273694 9817456 9392612 8996729 8627237 8282113 7959537 7657427 7373941 7108013
55887 7108013 6858732 6624540 6403660 6194979 5997794 5810894 5632470 5460770 5294411
55878 5294411 5132498 4975069 4823029 4676861 4535726 4398701 4266592 4141392 4023851
55869 4023851 3912604 3805950 3703582 3606109 3513667 3425768 3342181 3263335 3189802 3121586 3057835
55858 3057835 2997091 2937937 2879636 2822325 2766700 2713461 2662745 2613845 2565529 2516814 2467372
55847 2467372 2417287 2366877 2316940 2268642 2222753 2179255 2138037 2099509 2064102 2031523 2001032
$$ packed form
55913B8039209k055585j834016j643575j479243j336712j211697j101110j003773
55905A6373498r18850q44196p76937p15202o58732o08103n63661n24693m89430
55896A0273694m56238m24844l95883l69492l45124l22576l02110k83486k65928
55887G108013k49281k34192k20880k08681j97185j86900j78424j71700j66359
55878E294411j61913j57429j52040j46168j41135j37025j32109j25200j17541
55869D023851j11247j06654j02368r7473r2442q7899q3587p8846p3533o8216o3751
55858C057835o0744n9154n8301n7311n5625n3239n0716m8900m8316m8715m9442
55847B467372n0085n0410m9937m8298m5889m3498m1218l8528l5407l2579l0491
$$ plain form
55836 2001032 1972071 1944164 1916752 1889905 1864791 1842476 1822517 1803661 1785688 1769367 1754634
55825 1754634 1740099 1724813 1709499 1695390 1682633 1670400 1657924 1644722 1630225 1613770 1594721
55814 1594721 1572452 1546699 1518304 1489103 1460665 1433396 1407035 1381326 1355902 1330290 1304670
55803 1304670 1280161 1257792 1237691 1219688 1203949 1190261 1177462 1164746 1153070 1144065 1137627 1131863
55791 1131863 1125452 1118743 1111999 1103899 1092819 1079022 1064437 1050426 1036631 1022130 1006940 991922
55779 991922 977573 963516 949280 935213 922269 911003 901114 892031 883541 875711 868618 862541 857971
55766 857971 854839 852010 848295 843927 840184 837354 833856 827839 819027 808422 796761 784035 770263
55753 770263 755801 740801 725111 708991 693354 678836 664993 650902 636453 622557 610039
$$ packed form
55836B001032k8961k7907k7412k6847k5114k2315j9959j8856j7973j6321j4733
55825A754634j4535j5286j5314j4109j2757j2233j2476j3202j4497j6455j9049
55814A594721k2269k5753k8395k9201k8438k7269k6361k5709k5424k5612k5620
55803A304670k4509k2369k0101j8003j5739j3688j2799j2716j1676r005o438n764
55791A131863o411o709o744q100j1080j3797j4585j4011j3795j4501j5190j5018
55779I91922j4349j4057j4236j4067j2944j1266r889r083q490p830p093o077m570
55766H57971l132k829l715m368l743k830l498o017q812j0605j1661j2726j3772
55753G70263j4462j5000j5690j6120j5637j4518j3843j4091j4449j3896j2518
$$ plain form
55742 610039 598723 587883 577277 567354 558441 550171 541976 533893 526520 520259 514959 510291 506039
55729 506039 501856 497225 492075 487177 483435 480794 478252 474925 470795 466428 462424 459199 456784 454563
55715 454563 451662 447995 444632 442680 442010 441492 440385 438951 437805 437263 437507 438923 441860 446216 451401
55700 451401 456519 460601 463112 464500 465829 467618 469275 469957 469592 468723 467818 467303 467882 470015 473140 476109
55684 476109 478393 480228 481637 482218 482145 482534 484382 487760 492371 498077 504256 509538 513164 516038 519303
55669 519303 522232 522875 520876 518342 517266 517019 515183 510426 503804 497445 492557 488877 485642 482750 480723
55654 480723 479644 478717 477337 476100 475899 476329 476116 475290 475681 478628 483338 488406 493985 501123 509404 516646
55638 516646 520967 522125 520803 517712 513681 509645 505945 502210 498187 494092 489858 484766 478295 470767
$$ packed form
55742F10039j1316j0840j0606r923q913q270q195q083p373o261n300m668m252
55729E06039m183m631n150m898l742k641k542l327m130m367m004l225k415k221
55715D54563k901l667l363j952o70n18j107j434j146n42K44J416K937M356N185
55700D51401N118M082K511J388J329J789J657O82l65q69r05n15N79K133L125K969
55684D76109K284J835J409N81p3L89J848L378M611N706O179N282L626K874L265
55669E19303K929O43j999k534j076k47j836m757o622o359m888l680l235k892k027
55654D80723j079r27j380j237k01M30k13q26L91K947M710N068N579P138Q281P242
55638E16646M321J158j322l091m031m036l700l735m023m095m234n092o471p528
$$ plain form
55624 470767 462769 454557 446469 439292 433525 428730 424253 420117 416314 411553 403879 392784 379977 367687
55610 367687 356748 346627 336654 326589 316238 305252 293551 281559 269736 258042 246304 235241
55598 235241 226672 222098 220974 220825 219322 216006 211884 207918 204391 201327 198735 196347 193770 191075
55584 191075 188836 187384 186477 185925 186068 187072 188009 187351 184678 181402 179338 178703 178168 176963 176150 177099
55568 177099 179278 180753 180982 181755 184635 188456 190624 190444 189838 190750 192954 194766 194964 193593 191653 190564
55552 190564 191423 194235 197988 201533 204059 204932 204066 202686 202611 204117 205396 204918 203442 202642 202437 201138
55536 201138 197981 194073 190663 187792 185153 183168 182343 182148 181324 179186 176253 173769 172795 173385 174439
55521 174439 174694 174058 173662 174444 176172 178073 179814 181455 182975 184492 186662 190166 194889 200024 204844
$$ packed form
55624D70767p998q212q088p177n767m795m477m136l803m761p674j1095j2807j2290
55610C67687j0939j0121r973j0065j0351j0986j1701j1992j1823j1694j1738j1063
55598B35241q569m574j124j49j503l316m122l966l527l064k592k388k577k695
55584A91075k239j452r07n52J43J004R37o58k673l276k064o35n35j205q13R49
55568A77099K179J475K29P73K880L821K168j80o06R12K204J812J98j371j940j089
55552A90564Q59K812L753L545K526Q73q66j380p5J506J279m78j476q00k05j299
55536B01138l157l908l410k871k639j985q25j95q24k138k933k484r74N90J054
55521A74439K55o36l96P82J728J901J741J641J520J517K170L504M723N135M820
$$ plain form
55506 204844 208980 212196 214612 217187 221236 227135 233788 239672 244190 247897 251628 255547 258870 260365
55492 260365 259194 255312 248977 240111 228625 215412 202398 191120 181509 172536 163844 156058 149452
55479 149452 142996 135394 126775 118785 112946 109319 106793 104182 100819 96608 92096 88333 86177 85589
55465 85589 85842 86298 86651 86562 85614 83789 81521 79171 76799 74482 72355 70223 67780 65520 64722 65974
55449 65974 68246 70040 70921 71172 70524 68483 65787 64194 64376 65029 64690 63680 63485 64786 66840 68508
55433 68508 69156 68712 67562 66463 66019 66068 65814 64647 62610 60194 57991 56474 55683 55052 53892 52227
55417 52227 50903 50716 51580 52673 53235 53013 52081 50576 48810 47471 47276 48244 49524 50239 50368 50479 50707
55400 50707 50456 49267 47579 46404 46404 47323 48051 47322 44895 42171 41030 41773 42832 42860 42311 42303 42722 42685 42475
$$ packed form
55506B04844M136L216K416K575M049N899O653N884M518L707L731L919L323J495
55492B60365j171l882o335q866j1486j3213j3014j1278r611q973q692p786o606
55479A49452o456p602q619p990n839l627k526k611l363m211m512l763k156n88
55465H5589K53M56L53q9r48j825k268k350k372k317k127k132k443k260p98J252
55449F5974K272J794Q81K51o48k041k696j593J82O53l39j010j95J301K054J668
55433F8508O48m44j150j099m44M9k54j167k037k416k203j517p91o31j160j665
55417E2227j324j87Q64J093N62k22r32j505j766j339j95R68J280P15J29J11K28
55400E0707k51j189j688j175%R19P28p29k427k724j141P43J059K8n49qM19l7k10
$$ plain form
55381 42475 43470 45877 47859 47719 46178 45505 46776 48832 49917 49609 48804 48236 47581 46163 44190 42731
55365 42731 42350 42375 41925 41259 41405 42593 43823 44013 43031 41559 40581 40994 42917 45207 46382 46327 46333 47152
55347 47152 47869 47316 45765 44366 43499 42663 41690 41073 41137 41700 42645 44085 45841 47372 48442 49370 50420
55330 50420 51405 52056 52387 52410 51843 50390 48185 45770 43669 42085 40919 39996 39252 38688 38274 38053 38327
55313 38327 39480 41592 44313 47039 48904 48942 47002 44526 43465 43935 43839 41532 38241 36946 39184 43739
55297 43739 48138 50587 50622 48946 46920 45663 45376 45605 45905 45962 45580 45095 45280 46154 46437 45080 42824
55280 42824 41200 40546 40191 40099 40705 41391 40977 39864 39840 41291 42481 42371 42402 44203 47116 49333 50279 50338
55262 50338 49267 46702 43594 41474 40528 39822 39151 39299 40619 42734 45569 49258 52906 54774 54128 51962
$$ packed form
55381D2475R95K407J982j40j541o73J271K056J085l08q05n68o55j418j973j459
55365D2731l81K5m50o66J46J188J230J90r82j472r78M13J923K290J175n5OQ19
55347D7152P17n53j551j399q67q36r73o17O4N63R45J440J756J531J070R28J050
55330E0420R85O51L31K3n67j453k205k415k101j584j166r23p44n64m14k21K74
55313C8327J153K112K721K726J865L8j940k476j061M70r6k307l291j295K238M555
55297D3739M399K449L5j676k026j257k87K29L00N7l82m85J85Q74K83j357k256
55280D2824j624o54l55r2O06O86m14j113k4J451J190j10L1J801K913K217R46N9
55262E0338j071k565l108k120r46p06o71J48J320K115K835L689L648J868o46k166
$$ plain form
55246 51962 49718 48210 47870 48746 49850 49630 47694 45270 43443 41835 39637 37077 34972 33396 31701
55231 31701 29640 27751 26725 26976 28717 31820 35510 38598 40271 40575 40219 40067 40619 41592 42059 41386
55215 41386 40180 39984 41731 44615 46821 47392 47005 46820 47019 46949 46311 45492 44745 43804 42575 41576 41238 41275
55197 41275 41187 41070 41485 42753 44628 46315 46721 45352 43279 42417 43226 43831 42205 38707 35590 34497
55181 34497 35318 37076 38860 40069 40661 41035 41085 39948 37640 36136 37279 40017 41478 40672 39273 38567
55165 38567 37854 36686 36600 39032 42802 45322 45578 44585 43537 42827 42458 42246 41746 40892 40398 40747 41194 40730
55147 40730 39666 39319 40325 42175 44205 46117 47583 48185 47794 46465 44225 41660 40274 41230 43804
55132 43804 46131 47398 48317 49500 50606 51358 52173 53228 53873 53687 53306 53496 54056 54464 55032 56527 58914
$$ packed form
55246E1962k244j508l40Q76J104k20j936k424j827j608k198k560k105j576j695
55231C1701k061j889j026K51J741L103L690L088J673L04l56j52N52R73M67o73
55215D1386j206j96J747K884K206N71l87j85J99p0o38q19p47r41j229r99l38L7
55197D1275q8j17M15J268J875J687M06j369k073q62Q09O05j626l498l117j093
55181C4497Q21J758J784J209N92L74N0j137k308j504J143K738J461q06j399p06
55165C8567p13j168q6K432L770K520K56r93j048p10l69k12n00q54m94L49M47m64
55147D0730j064l47J006J850K030J912J466O02l91j329k240k565j386R56K574
55132D3804K327J267R19J183J106P52Q15J055O45j86l81J90N60M08N68J495K387
$$ plain form
55115 58914 61351 63326 65003 66396 67035 66734 66123 66066 66917 68558 70637 72345 72430 70226 66690 63758
55099 63758 62505 62280 61815 60690 59442 58707 58707 59277 59910 59975 59359 58723 58680 58903 58565 57535 56562 56426 57438
55080 57438 59661 62841 66171 68898 71200 73678 75937 76699 75570 73642 71900 70052 67633 65297 64141
55065 64141 64390 65581 67349 69220 70324 70347 70278 71229 72920 74267 74943 75259 74979 73637 71822 70742 70504
55048 70504 70106 69308 69061 69744 70269 69751 68968 69322 70962 72789 73839 74061 74035 74484 75750 77332 78123 77522
55030 77522 76114 75054 74971 75630 76334 76592 76679 77622 80204 83849 86896 88106 87576 86261 85177 85039 85897
55013 85897 86865 86831 85812 85047 85527 86967 88501 89711 90629 91385 92416 94372 97163 99485 100044 99059 98038
54996 98038 98180 99371 100588 100906 100180 98966 97768 96460 94882 93807 94482 96925 99568 101099 101992 103549
$$ packed form
55115E8914K437J975J677J393O39l01o11n7Q51J641K079J708Q5k204l536k932
55099F3758j253k25m65j125j248p35%N70O33O5o16o36m3K23l38j030r73j36J012
55080E7438K223L180L330K727K302K478K259P62j129j928j742j848k419k336j156
55065F4141K49J191J768J871J104K3o9R51J691J347O76L16k80j342j815j080k38
55048G0504l98p98k47O83N25n18p83L54J640J827J050K22k6M49J266J582P91o01
55030G7522j408j060q3O59P04K58Q7R43K582L645L047J210n30j315j084j38Q58
55013H5897R68l4j019p65M80J440J534J210R18P56J031J956K791K322N59r85j021
54996I8038J42J191J217L18p26j214j198j308j578j075O75K443K643J531Q93J557
$$ plain form
54980 103549 106169 109300 112459 115224 116624 115772 113158 110489 109101 109162 110350 112451 115125 117808 120162
54965 120162 122091 123252 123147 122025 121168 121867 124286 127497 130393 132519 134328 136678 139787 142800 144826
54950 144826 146346 148926 153405 159052 164818 170757 177655 185704 194189 202317 209737 216210 221360 224899
54936 224899 226814 227081 225349 221060 213986 204764 194967 186403 179872 174547 168828 162008 154858 148506
54922 148506 143101 138011 133129 129258 126945 125494 123786 121868 121051 122296 125004 127645 129208 129749 129989
54907 129989 130823 133001 136687 141212 145640 149688 153941 159143 165468 172385 178961 184324 188238 191274
54893 191274 194103 196471 197286 195889 192787 188664 183065 174843 163898 151774 140286 130174 121437
54880 121437 114214 108519 103548 98337 93245 89862 89133 90296 91974 93506 94702 95149 94695 94218 94854
$$ packed form
54980A03549K620L131L159K765J400q52k614k669j388O1J188K101K674K683K354
54965A20162J929J161j05j122q57O99K419L211K896K126J809K350L109L013K026
54950A44826J520K580M479N647N766N939O898Q049Q485Q128P420O473N150L539
54936B24899J915K67j732m289p074r222r797q564o531n325n719o820p150o352
54922A48506n405n090m882l871k313j451j708j918q17J245K708K641J563N41K40
54907A29989Q34K178L686M525M428M048M253N202O325O917O576N363L914L036
54893A91274K829K368Q15j397l102m123n599q222j0945j2124j1488j0112q737
54880A21437p223n695m971n211n092l383p29J163J678J532J196M47m54m77O36
$$ plain form
54865 94854 96578 98274 99102 99121 98701 98203 98130 98683 99040 98029 95763 93725 92809 92168 90577 88245 86566
54848 86566 86511 87811 89325 89670 87910 84318 80363 77546 76346 76454 77565 79539 82208 85527 89617
54833 89617 94224 98425 101390 103154 104190 104551 104051 103131 102869 103936 105887 107552 108069 107590 107016 106946 107025
54816 107025 106678 106285 106895 108754 110992 113061 115550 119060 123107 126838 130105 133182 136116 139037 142306
54801 142306 145579 147647 148276 149395 153115 159192 165736 171779 177585 182953 187167 190705 195297 201895
54787 201895 209965 218907 228610 238217 245964 250959 253876 255340 254990 252798 249932 247387 244970 242480
54773 242480 240644 239795 238789 236589 233947 232268 231655 231504 232303 235122 239552 243772 246805 249366 252282
54758 252282 255214 257322 258290 258298 257591 256368 254540 251467 246494 240027 233626 228868 226388 225915 226709 227858
$$ packed form
54865I4854J724J696Q28J9m20m98p3N53L57j011k266k038r16o41j591k332j679
54848H6566n5J300J514L45j760l592l955k817j200J08J111J974K669L319M090
54833H9617M607M201K965J764J036L61n00r20k62J067J951J665N17m79n74p0P9
54816A07025l47l93O10J859K238K069K489L510M047L731L267L077K934K921L269
54801A42306L273K068O29J119L720O077O544O043N806N368M214L538M592O598
54787B01895Q070Q942R703R607P747M995K917J464l50k192k866k545k417k490
54773B42480j836q49j006k200k642j679o13j51P99K819M430M220L033K561K916
54758B52282K932K108R68Qp07j223j828l073m973o467o401m758k480m73P94J149
$$ plain form
54742 227858 228592 228584 227915 226853 225813 225116 224376 222408 218298 212325 205406 198053 190514 183559 178061 173772
54726 173772 169475 164546 159528 154894 150112 144552 138707 133776 130285 127711 125335 122989 120877 119111
54712 119111 117624 116408 115543 114947 114304 113465 112875 113267 114876 117188 119571 121809 123920 125872 127770 129851
54696 129851 131934 133290 133484 132980 132432 131923 131563 132275 134883 138567 141338 142266 142379 143101 144671 146529
54680 146529 148483 150852 153837 157215 160453 162931 164444 165675 167675 170590 173404 175308 176778 178868
54666 178868 181987 186003 191070 197449 204574 211198 216783 222233 228800 236608 244612 251935 258890 266587
54652 266587 275745 285993 296173 305097 312027 316753 319457 320443 319862 317716 314177 309637 304284 297865
54638 297865 290052 280775 269960 257374 243328 229287 217070 207371 199598 193080 187668 183006 178099
$$ packed form
54742B27858P34qo69j062j040o97p40j968m110n973o919p353p539o955n498m289
54726A73772m297m929n018m634m782n560n845m931l491k574k376k346k112j766
54712A19111j487j216q65n96o43q39n90L92J609K312K383K238K111J952J898K081
54696A29851K083J356J94n04n48n09l60P12K608L684K771R28J13P22J570J858
54680A46529J954K369K985L378L238K478J513J231K000K915K814J904J470K090
54666A78868L119M016N067O379P125O624N585N450O567P808Q004P323O955P697
54652B66587R158J0248J0180Q924O930M726K704R86n81k146l539m540n353o419
54638B97865p813r277j0815j2586j4046j4041j2217r699p773o518n412m662m907
$$ plain form
54625 178099 172232 165928 160448 156500 153699 151047 147807 144246 141719 141492 143145 144525 143737 140826 137196
54610 137196 133937 131358 129608 128764 128287 127335 125807 124483 123840 123339 122233 120573 118976 117778 116976 116817
54594 116817 117765 119723 121742 122869 123161 123526 124556 125794 126269 125518 123901 122113 120733 120149 120435 121149
54578 121149 121628 121777 122263 123579 125205 126221 126716 127890 130436 133255 134402 133245 131166 129955 129995 130366
54562 130366 130331 130007 129657 129171 128691 129084 131099 134332 137657 140402 142462 143642 144049 145216 149474 157358
54546 157358 166441 173702 178595 182906 187999 193404 198093 201982 205687 209576 213701 218119 222614 226300
54532 226300 228113 227767 225835 222905 218933 213488 206277 197383 187300 176994 167682 160201 154588 150403
54518 150403 147357 145241 143369 140788 137456 134794 134324 135766 137063 136496 134339 132181 131037 130530 129741
$$ packed form
54625A78099n867o304n480l948k801k652l240l561k527k27J653J380p88k911l630
54610A37196l259k579j750q44m77r52j528j324o43n01j106j660j597j198q02j59
54594A16817R48J958K019J127K92L65J030J238M75p51j617j788j380n84K86P14
54578A21149M79J49M86J316J626J016M95J174K546K819J147j157k079j211M0L71
54562A30366l5l24l50m86m80L93K015L233L325K745K060J180M07J167M258P884
54546A57358R083P261M893M311N093N405M689L889L705L889M125M418M495L686
54532B26300J813l46j932k930l972n445p211q894j0083j0306r312p481n613m185
54518A50403l046k116j872k581l332k662m70J442J297n67k157k158j144n07p89
$$ plain form
54503 129741 128383 126995 126188 125959 125869 125729 125800 126163 126347 126011 125681 126140 127215 127930 127824 127304 126584 125387
54485 125387 124257 124970 128546 133387 136631 137166 136229 135250 134297 132948 131522 130801 131040 131749 132054 131053
54469 131053 128490 125498 124169 125787 129624 133752 136679 137896 137422 135658 133575 132336 132387 133151 133673
54454 133673 133356 132144 130373 128645 127607 127568 128233 128943 129366 129989 131763 134981 138539 140739 140992 140372
54438 140372 140167 140264 139536 137736 136204 136363 138017 139634 140023 139125 137337 134937 132559 131437 132423 134984
54422 134984 137829 140409 143023 145405 146227 144563 141308 138457 137262 137654 139149 141533 144531 147441 149430
54407 149430 150021 149300 147922 146906 146993 148043 149250 149989 150264 150323 150124 149329 147715 145561 143723 143113 143911
54390 143911 145334 146322 146290 145070 142665 139562 136903 135611 135405 135344 135206 135511 136178 136125 134661 132598 131435
$$ packed form
54503A29741j358j388q07k29r0j40P1L63J84l36l30M59J075P15j06n20p20j197
54485A25387j130P13L576M841L244N35r37r79r53j349j426p21K39P09L05j001
54469A31053k563k992j329J618L837M128K927J217m74j764k083j239N1P64N22
54454A33673l17j212j771j728j038l9O65P10M23O23J774L218L558K200K53o20
54438A40372k05R7p28j800j532J59J654J617L89q98j788k400k378j122R86K561
54422A34984K845K580K614K382Q22j664l255k851j195L92J495K384K998K910J989
54407A49430N91p21j378j016Q7J050J207P39K75N9j99p95j614k154j838o10P98
54390A43911J423R88l2j220k405l103k659j292k06o1j38L05O67n3j464k063j163
$$ plain form
54373 131435 131724 132525 132112 129152 123940 118862 116996 119570 124976 130514 134571 136873 137508 136788 135686
54358 135686 135342 135954 136685 136725 135943 134599 133046 131814 131371 131562 131639 131133 130446 130393 131306 132650 133438 133030
54340 133030 131679 130290 129523 129222 128727 127571 125767 123743 122300 122345 124108 126601 128219 127998 126152 123534
54324 123534 120958 119060 118374 119113 120765 122017 121481 118988 116126 115012 116186 118052 118602 117341 115206
54309 115206 113166 111516 110215 109080 107649 105470 102765 100477 99571 100405 102611 105189 106993 107667 108027
54294 108027 109022 110314 110503 108870 106314 104384 103851 104529 106033 108166 110602 112630 113549 113411 113162 113652
54278 113652 114461 114223 112359 109954 108464 108069 107974 107941 108617 110427 113005 115841 118768 121675 124284 126317
54262 126317 127486 127458 126484 125835 126758 129049 131573 134075 137219 140612 142254 140797 137305 133799 130883
$$ packed form
54373A31435K89Q01m13k960n212n078j866K574N406N538M057K302O35p20j102
54358A35686l44O12P31M0p82j344j553j232m43J91P7n06o87n3R13J344P88m08
54340A33030j351j389p67l01m95j156j804k024j443M5J763K493J618k21j846k618
54324A23534k576j898o86P39J652J252n36k493k862j114J174J866N50j261k135
54309A15206k040j650j301j135j431k179k705k288r06Q34K206K578J804O74L60
54294A08027R95J292J89j633k556j930n33O78J504K133K436K028R19j38k49M90
54278A13652Q09k38j864k405j490l95r5l3O76J810K578K836K927K907K609K033
54262A26317J169k8r74o49R23K291K524K502L144L393J642j457l492l506k916
$$ plain form
54247 130883 127851 124560 121924 120609 120174 119655 118509 116968 115767 115421 115655 115862 116223 117623 120063 122067
54231 122067 122361 121356 120027 118153 115034 111498 109552 109890 111183 112142 112892 113651 113379 111002 107360 104590
54215 104590 103561 102877 100666 96801 92988 91005 91189 92550 93991 95198 96435 97862 99296 100432 100984
54200 100984 100646 99329 97513 96061 95389 94976 94035 92679 92127 93400 95869 97600 97440 96437 96652 98739
54184 98739 101382 103063 103585 103556 103267 102729 102180 101759 101043 99716 98398 97985 98282 98095 96684 94460 92167
54167 92167 90178 88754 88322 89114 90870 93044 94945 95800 95344 94507 94799 96634 98765 99749 99471 98797 98105
54150 98105 96857 94546 91624 89306 88515 89044 89647 89005 86768 83844 81852 82158 84892 88597 91204 91939
54134 91939 92071 93314 95716 97747 98352 98075 98010 98417 98795 98760 98384 97885 97401 96980 96723 96953 98045 99761
$$ packed form
54247A30883l032l291k636j315m35n19j146j541j201l46K34K07L61J400K440K004
54231A22067K94j005j329j874l119l536j946L38J293R59P50P59k72k377l642k770
54215A04590j029o84k211l865l813j983J84J361J441J207J237J427J434J136N52
54200A00984l38j317j816j452o72m13r41j356n52J273K469J731j60j003K15K087
54184I8739K643J681N22k9k89n38n49m21p16j327j318m13K97j87j411k224k293
54167I2167j989j424m32P92J756K174J901Q55m56q37K92J835K131R84k78o74o92
54150I8105j248k311k922k318p91N29O03o42k237k924j992L06K734L705K607P35
54134I1939J32J243K402K031O05k77o5M07L78l5l76m99m84m21k57K30J092J716
$$ plain form
54116 99761 101092 101419 101613 103047 105411 106588 105256 102737 101549 102643 104824 106460 106976 106877 107077 108234
54100 108234 110248 112246 113303 113246 112707 112584 113495 115376 117441 118868 119718 120727 122075 122956 122841 122531
54084 122531 123322 125474 128092 130217 131477 131957 132094 132505 133300 133748 133194 132191 132024 133318 135741 138907
54068 138907 142699 146614 149728 151718 153245 154876 156141 156214 155160 153917 153218 153080 153424 154657 157201
54053 157201 160615 163626 165304 166002 166886 168712 171395 174582 178014 181264 183842 186000 188896 193404 199053
54038 199053 204519 208814 211650 213165 213945 214938 216749 219228 222259 226372 231712 236887 240019 240830 240595
54023 240595 240101 238937 236992 235240 234342 233588 232121 230328 229024 227871 225668 221909 217109 211902 206783
54008 206783 202635 200454 200191 200494 199925 198025 195102 191599 188063 185228 183406 181770 178759 173594 167319
$$ packed form
54116I9761J331L27J94J434K364J177j332k519j188J094K181J636N16r9K00J157
54100A08234K014J998J057n7n39j23R11J881K065J427Q50J009J348Q81j15l10
54084A22531P91K152K618K125J260M80J37M11P95M48n54j003j67J294K423L166
54068A38907L792L915L114J990J527J631J265P3j054j243o99j38L44J233K544
54053A57201L414L011J678O98Q84J826K683L187L432L250K578K158K896M508N649
54038A99053N466M295K836J515P80R93J811K479L031M113N340N175L132Q11k35
54023B40595m94j164j945j752q98p54j467j793j304j153k203l759m800n207n119
54008B06783m148k181k63L03n69j900k923l503l536k835j822j636l011n165o275
$$ plain form
53993 167319 162093 159402 159084 160027 161287 162300 162626 162386 162708 164681 167597 169233 168432 166474 165131 164260
53977 164260 162565 160231 159201 160712 163912 167339 170549 173630 176213 178072 179975 182747 185785 187635
53963 187635 188032 188306 189505 191036 191575 190657 188931 187351 186739 187720 190433 194295 198451 202402 206038 209391
53947 209391 212740 216709 221582 226566 230301 232313 233688 236102 240385 246062 252030 257631 263202 269471
53933 269471 276237 282014 285526 287296 288985 291251 293362 295154 297986 302744 307855 310851 311700 313082
53919 313082 316999 322389 326800 329492 331784 334675 337247 337815 336029 333324 331379 330527 329829 328492 326819
53904 326819 325661 325309 325334 325282 324987 324065 321630 317004 310582 303643 297240 291445 285782 280216 275489 272339
53888 272339 270359 267823 262894 255159 246039 237670 231343 226921 223640 221291 220327 220744 221197 219822 216015
$$ packed form
53993A67319n226k691l18R43J260J013L26k40L22J973K916J636q01j958j343q71
53977A64260j695k334j030J511L200L427L210L081K583J859J903K772L038J850
53963A87635L97K74J199J531N39r18j726j580o12R81K713L862M156L951L636L353
53947B09391L349L969M873M984L735K012J375K414M283N677N968N601N571O269
53933B69471O766N777L512J770J689K266K111J792K832M758N111K996Q49J382
53919C13082L917N390M411K692K292K891K572N68j786k705j945q52o98j337j673
53904C26819j158l52K5n2k95r22k435m626o422o939o403n795n663n566m727l150
53888B72339j980k536m929p735r120q369o327m422l281k349r64M17M53j375l807
$$ plain form
53873 216015 211001 206510 203341 201327 199979 198557 196048 191926 186858 182054 178060 174784 172401 171132
53859 171132 169995 167045 161703 156218 153839 155558 159168 161444 160809 158050 155109 153423 153158 153689 154577
53844 154577 155776 156853 156642 154450 151545 150613 153249 158253 162849 165473 167000 169271 172841 176386 178137
53829 178137 177676 176322 175812 176534 177207 176499 174894 174475 176642 180582 184394 187227 189574 191864 193814 195221
53813 195221 196341 197171 197316 197089 197857 200489 204084 207013 208717 209767 210775 212122 214308 217492 220959
53798 220959 224014 227140 231201 235622 238584 239175 238291 237312 236897 237157 237732 237398 234950 231153 228654 229058
53782 229058 230922 231524 229852 227007 224391 222495 220950 218765 214885 209441 204086 200217 197215 193555
53768 193555 189323 186260 185171 184701 183333 181514 180729 181088 181013 179357 176889 175192 174716 174613 174216 173747
$$ packed form
53873B16015n014m491l169k014j348j422k509m122n068m804l994l276k383j269
53859A71132j137k950n342n485k379J719L610K276o35k759k941j686k65N31Q88
53844A54577J199J077k11k192k905r32K636N004M596K624J527K271L570L545J751
53829A78137m61j354n10P22O73p08j605m19K167L940L812K833K347K290J950J407
53813A95221J120Q30J45k27P68K632L595K929J704J050J008J347K186L184L467
53798B20959L055L126M061M421K962N91q84r79m15K60N75l34k448l797k499M04
53782B29058J864O02j672k845k616j896j545k185l880n444n355l869l002l660
53768A93555m232l063j089m70j368j819p85L59p5j656k468j697m76j03l97m69
$$ plain form
53752 173747 173308 172067 169322 166007 164189 164926 167301 169590 170664 170192 168462 166497 165620 166172 167150 167516
53736 167516 167396 167509 168064 168944 170444 172968 176178 179250 181761 183675 184598 183942 182021 180303 180243 182058
53720 182058 184724 186896 187905 188161 188615 189704 190987 192042 193348 195715 198976 201720 202529 201325 199504
53705 199504 198816 199948 202095 204013 205453 207259 210187 214294 219464 225577 231734 236245 238250 238758 239309
53690 239309 240119 240461 240456 241348 243956 247612 250793 252424 252733 253187 255262 258787 261928 263334 263720 264600 266153
53673 266153 267417 268138 269104 270777 272723 274394 275402 275152 273414 271363 270783 271920 273155 273170 272415 272151
53657 272151 273114 275533 279338 283704 287249 289411 290989 292879 295086 297437 300215 303139 304552 302860
53643 302860 298588 294140 291662 291816 294346 298771 304159 308927 311617 312036 311411 311175 311657 312172 312336 312717
$$ packed form
53752A73747m39j241k745l315j818P37K375K289J074m72j730j965q77N52R78L66
53736A67516j20J13N55Q80J500K524L210L072K511J914R23o56j921j718o0J815
53720A82058K666K172J009K56M54J089J283J055J306K367L261K744Q09j204j821
53705A99504o88J132K147J918J440J806K928M107N170O113O157M511K005N08N51
53690B39309Q10L42nQ92K608L656L181J631L09M54K075L525L141J406L86Q80J553
53673B66153J264P21R66J673J946J671J008k50j738k051n80J137J235J5p55k64
53657B72151R63K419L805M366L545K162J578J890K207K351K778K924J413j692
53643C02860m272m448k478J54K530M425N388M768K690M19o25k36M82N15J64L81
$$ plain form
53627 312717 313942 315899 318430 322054 326930 331719 334898 336998 339897 343738 346394 346710 346563 348420 352119
53612 352119 355683 358567 362370 368368 375665 382139 386462 388961 390964 393545 396815 400422 404518 409496
53598 409496 414758 418818 421344 424158 429176 435901 442015 446166 449089 452045 455273 458270 460838 463391
53584 463391 466551 470595 475114 479210 482172 483911 484717 485008 485533 487295 490700 495001 499038 502310 505033
53569 505033 507452 509550 511225 512500 513828 516230 520412 525370 528777 529538 529291 530489 533577 537100 540197
53554 540197 543652 548520 554812 561828 568915 575539 581258 585946 589710 592580 594755 597138 600963 606660
53540 606660 613409 619956 625685 631057 637283 645300 654718 664077 672504 680666 689535 698959 708383 718431
53526 718431 730395 744241 758344 771367 783267 794459 805263 816637 830096 845999 862785
$$ packed form
53627C12717J225J957K531L624M876M789L179K100K899L841K656L16j47J857L699
53612C52119L564K884L803N998P297O474M323K499K003K581L270L607M096M978
53598D09496N262M060K526K814N018O725O114M151K923K956L228K997K568K553
53584D63391L160M044M519M096K962J739Q06K91N25J762L405M301M037L272K723
53569E05033K419K098J675J275J328K402M182M958L407P61k47J198L088L523L097
53554E40197L455M868O292P016P087O624N719M688L764K870K175K383L825N697
53540F06660O749O547N729N372O226Q017R418R359Q427Q162Q869R424R424J0048
53526G18431J1964J3846J4103J3023J1900J1192J0804J1374J3459J5903J6786
$$ plain form
53515 862785 878759 893972 909609 926117 942883 959366 975653 992015 1008707 1026269 1045357
53504 1045357 1066066 1087761 1109768 1132024 1154967 1178892 1203495 1228108 1252472 1277137 1302781
53493 1302781 1329200 1355376 1380632 1405204 1429458 1453097 1475704 1497762 1520513 1544671 1569656
53482 1569656 1594238 1617704 1640290 1662644 1685072 1707273 1728666 1748803 1767507 1784787 1800834
53471 1800834 1816047 1830840 1845310 1859186 1872165 1884202 1895392 1905618 1914509 1921835 1927798 1932652
53459 1932652 1936009 1936958 1935184 1931698 1927982 1924466 1920296 1914462 1906692 1897362 1887224 1877228 1867899 1858610
53445 1858610 1848070 1835707 1821947 1807200 1791570 1775814 1761367 1748786 1737256 1726344 1717015
53434 1717015 1709738 1702724 1693688 1682881 1672828 1665307 1660047 1656234 1653806 1653013 1653928 1656677 1661173 1666517
$$ packed form
53515H62785J5974J5213J5637J6508J6766J6483J6287J6362J6692J7562J9088
53504A045357K0709K1695K2007K2256K2943K3925K4603K4613K4364K4665K5644
53493A302781K6419K6176K5256K4572K4254K3639K2607K2058K2751K4158K4985
53482A569656K4582K3466K2586K2354K2428K2201K1393K0137J8704J7280J6047
53471A800834J5213J4793J4470J3876J2979J2037J1190J0226Q891P326N963M854
53459A932652L357R49j774l486l716l516m170n834p770r330j0138r996r329r289
53445A858610j0540j2363j3760j4747j5630j5756j4447j2581j1530j0912r329
53434A717015p277p014r036j0807j0053p521n260l813k428p93R15K749M496N344
$$ plain form
53420 1666517 1671671 1676861 1683401 1692071 1702616 1714709 1728190 1742298 1756040 1769757 1785181 1803514
53408 1803514 1824382 1846946 1870851 1895717 1920842 1945909 1971008 1995609 2018797 2041149 2065124
53397 2065124 2092746 2123790 2156898 2191391 2227182 2264003 2301799 2341172 2382456 2425011 2468198
53386 2468198 2512323 2557754 2603850 2649644 2694922 2739752 2783672 2826292 2868036 2909237 2949056
53375 2949056 2986319 3020974 3053805 3085245 3115323 3144124 3171123 3194675 3213473 3228171 3240337
53364 3240337 3250117 3256304 3258513 3257750 3254609 3248207 3237323 3221650 3201596 3177664 3150349 3119889 3085788
53351 3085788 3047127 3003596 2955832 2904862 2851849 2798325 2745806 2694925 2645342 2596612 2548679
53340 2548679 2501601 2455373 2410010 2365410 2321289 2277714 2235361 2194700 2155388 2117225 2081107
$$ packed form
53420A666517N154N190O540Q670J0545J2093J3481J4108J3742J3717J5424J8333
53408A803514K0868K2564K3905K4866K5125K5067K5099K4601K3188K2352K3975
53397B065124K7622L1044L3108L4493L5791L6821L7796L9373M1284M2555M3187
53386B468198M4125M5431M6096M5794M5278M4830M3920M2620M1744M1201L9819
53375B949056L7263L4655L2831L1440L0078K8801K6999K3552J8798J4698J2166
53364C240337R780O187K209p63l141o402j0884j5673k0054k3932k7315l0460l4101
53351C085788l8661m3531m7764n0970n3013n3524n2519n0881m9583m8730m7933
53340B548679m7078m6228m5363m4600m4121m3575m2353m0661l9312l8163l6118
$$ plain form
53329 2081107 2047909 2016828 1986106 1955265 1925285 1896779 1869660 1844761 1823816 1806856 1791178
53318 1791178 1774228 1756445 1739981 1725518 1712005 1699131 1688220 1680096 1673191 1664619 1652769 1638450
53306 1638450 1623783 1610496 1599126 1589295 1580314 1571678 1563445 1556401 1551549 1549214 1548830 1549735 1551763 1554792
53292 1554792 1558318 1562092 1566760 1573091 1580831 1589160 1598047 1608129 1619280 1630460 1641320 1652913 1666202
53279 1666202 1680612 1694605 1707170 1718240 1728264 1737955 1747998 1758291 1767620 1774604 1778925 1781453
53267 1781453 1783371 1785368 1787336 1788455 1787556 1783622 1776106 1765065 1751195 1735338 1717516 1696830 1672955
53254 1672955 1647394 1622204 1597575 1571696 1543190 1512550 1480975 1449066 1417328 1386776 1357956
53243 1357956 1329963 1301365 1271771 1241878 1212456 1183936 1156559 1130241 1104633 1079821 1056514
$$ packed form
53329B081107l3198l1081l0722l0841k9980k8506k7119k4899k0945j6960j5678
53318A791178j6950j7783j6464j4463j3513j2874j0911q124o905q572j1850j4319
53306A638450j4667j3287j1370r831q981q636q233p044m852k335l84R05K028L029
53292A554792L526L774M668O331P740Q329Q887J0082J1151J1180J0860J1593J3289
53279A666202J4410J3993J2565J1070J0024R691J0043J0293R329O984M321K528
53267A781453J918J997J968J119q99l934p516j1041j3870j5857j7822k0686k3875
53254A672955k5561k5190k4629k5879k8506l0640l1575l1909l1738l0552k8820
53243A357956k7993k8598k9594k9893k9422k8520k7377k6318k5608k4812k3307
$$ plain form
53232 1056514 1035019 1014472 993711 972493 951357 930846 911412 893487 876916 860854 844964
53221 844964 830101 817043 805153 793242 781123 769157 756916 743765 730559 719183 710204 702135
53209 702135 693189 682582 669952 655034 638495 621916 606170 590604 574454 558176 542658 527928
53197 527928 513556 499767 487208 475878 465087 454355 443689 433089 422389 411738 401758 393081
53185 393081 385698 378686 370649 360885 350314 340809 333384 327384 321679 316038 310932 306614 303079 300464
53171 300464 298615 296503 292953 288025 283005 278920 275731 273040 270768 268729 266279 263049 259688 257183
53157 257183 255600 254048 251858 249258 246784 244682 243233 243024 244133 245205 244289 241032 237429 235761 236120
53142 236120 236633 235926 234430 233093 231844 230101 228232 227434 228173 229568 230585 231166 231830 232579 232765 231813
$$ packed form
53232A056514k1495k0547k0761k1218k1136k0511j9434j7925j6571j6062j5890
53221H44964j4863j3058j1890j1911j2119j1966j2241j3151j3206j1376q979q069
53209G02135q946j0607j2630j4918j6539j6579j5746j5566j6150j6278j5518j4730
53197E27928j4372j3789j2559j1330j0791j0732j0666j0600j0700j0651r980q677
53185C93081p383p012q037r764j0571r505p425o000n705n641n106m318l535k615
53171C00464j849k112l550m928n020m085l189k691k272k039k450l230l361k505
53157B57183j583j552k190k600k474k102j449k09J109J072r16l257l603j668L59
53142B36120N13p07j496j337j249j743j869p98P39J395J017N81O64P49J86r52
$$ plain form
53126 231813 229691 226743 223510 220712 219037 218652 219053 219473 219404 218740 217650 216383 215116 213845 212515 211235
53110 211235 210203 209399 208596 207798 207383 207527 207695 207143 205863 204660 204317 205050 206680 208682 209904 209075 206262
53093 206262 203417 202703 204347 206674 208054 208169 207412 205970 203907 201533 199258 197410 196476 197011 198880
53078 198880 200999 202419 203317 204326 205114 204528 202336 200100 199821 201963 205177 207805 209358 210480 211820
53063 211820 213197 214038 214350 214715 215179 214708 212411 209029 206413 205504 205578 205736 206317 208233 211357 214362 216104
53046 216104 216759 217552 219536 222518 224974 225349 223733 221990 221873 223335 225097 226456 227869 229904 232416
53031 232416 234846 236728 237785 238090 238226 238755 239519 239996 240384 241497 243336 244658 244542 243812 244234 246668
53015 246668 250538 254720 258330 260882 262313 262943 263105 262938 262663 262644 262896 263004 262901 263136 263815 263945 262769
$$ packed form
53126B31813k122k948l233k798j675l85M01M20o9o64j090j267j267j271j330j280
53110B11235j032q04q03p98m15J44J68n52j280j203l43P33J630K002J222q29k813
53093B06262k845p14J644K327J380J15p57j442k063k374k275j848r34N35J869
53078A98880K119J420Q98J009P88n86k192k236k79K142L214K628J553J122J340
53063B11820J377Q41L12L65M64m71k297l382k616r09P4J58N81J916L124L005J742
53046B16104O55P93J984K982K456L75j616j743j17J462J762J359J413K035K512
53031B32416K430J882J057L05J36N29P64M77L88J113J839J322j16p30M22K434
53015B46668L870M182L610K552J431O30J62j67k75j9K52J08j03K35O79J30j176
$$ plain form
52998 262769 261351 261677 264160 266956 267970 266828 264781 263415 263713 265677 268400 270794 272469 273793 275290
52983 275290 277372 280300 283706 286384 287423 287439 287729 288284 287852 286150 284643 284488 284974 284915 284588 285066 286260
52966 286260 286861 286061 284366 282842 282372 283468 285947 288707 290481 290971 290852 290843 291244 292169 293550 294893 295548
52949 295548 295227 293960 291799 289113 286931 286270 287087 288481 289837 291164 292237 292098 289820 285641 281265
52934 281265 279047 280390 284380 288241 289830 289662 289874 291398 293001 293194 292123 291058 290665 290437 289638 288312
52918 288312 287299 287386 288447 289467 289513 288442 286562 284023 281107 278752 277976 278727 279934 280654 280541 279351
52902 279351 276997 274214 272215 271223 270135 268127 265871 264700 265208 267154 269947 272530 273561 272745 271534
52887 271534 271479 272168 271843 269935 267851 267051 267395 267948 268589 269964 272193 274420 275804 276513 277491 279327 281464
$$ packed form
52998B62769j418L26K483K796J014j142k047j366K98J964K723K394J675J324J497
52983B75290K082K928L406K678J039J6K90N55m32j702j507j55M86n9l27M78J194
52966B86260O01q00j695j524m70J096K479K760J774M90j19rM01R25J381J343O55
52949B95548l21j267k161k686k182o61Q17J394J356J327J073j39k278m179m376
52934B81265k218J343L990L861J589j68K12J524J603J93j071j065l93k28p99j326
52918B88312j013Q7J061J020M6j071j880k539k916k355p76P51J207P20j13j190
52902B79351k354k783j999r92j088k008k256j171N08J946K793K583J031q16j211
52887B71534n5O89l25j908k084q00L44N53O41J375K229K227J384P09R78J836K137
$$ plain form
52870 281464 282564 281678 279089 276009 273527 271831 270328 268278 265327 261602 257493 253404 249702 246660
52856 246660 244182 241622 238198 233799 229160 225105 221819 219168 217427 217157 218224 219459 219666 218864 218187
52841 218187 218508 219388 219561 218383 216610 215731 216604 218693 220549 220965 219902 218340 217246 216743 216407 216095
52825 216095 215889 215310 213424 210247 207272 205841 205452 204637 203129 202023 201866 201911 201636 201719 202741 203808 203424
52808 203424 201302 198601 196789 196820 198836 201879 204412 205916 207550 210293 212975 213405 211322 208845 207737
52793 207737 207510 206790 205439 204333 203792 203302 202470 201402 200172 198721 197392 197026 198296 201199 205146 209168
52777 209168 212054 212954 212189 211109 210692 210466 209274 206981 204826 203946 204204 204873 205966 207985 210576 212460
52761 212460 213099 213606 215385 218363 221232 223039 223729 223472 222515 221781 222532 224837 227092 227726 226980 226410 226952
$$ packed form
52870B81464J100q86k589l080k482j696j503k050k951l725m109m089l702l042
52856B46660k478k560l424m399m639m055l286k651j741k70J067J235K07q02o77
52841B18187L21Q80J73j178j773q79Q73K089J856M16j063j562j094n03l36l12
52825B16095k06n79j886l177k975j431l89q15j508j106j57M5k75Q3J022J067l84
52808B03424k122k701j812L1K016L043K533J504J634K743K682M30k083k477j108
52793B07737k27p20j351j106n41m90q32j068j230j451j329l66J270K903L947M022
52777B09168K886R00p65j080m17k26j192k293k155q80K58O69J093K019K591J884
52761B12460O39N07J779K978K869J807O90k57r57p34P51K305K255O34p46n70N42
$$ plain form
52744 226952 228191 229337 230129 230698 231184 231850 233088 234909 236687 237886 238874 240634 243652 247424 251019
52729 251019 253771 255408 256084 256569 257912 260323 262639 263469 262833 262119 262448 263696 265212 266699 267991 268621
52713 268621 268266 267301 266336 265452 264489 263795 263950 264744 265151 264599 263738 263657 264632 265817 265935 264247 261219 258398
52695 258398 257226 257648 258070 256942 254315 251707 250597 251220 252798 254715 257243 260825 264782 267389 267721
52680 267721 266824 266248 265792 263974 260843 258757 259440 261420 261844 260219 258743 258889 259351 258039 254872 251514
52664 251514 249131 247585 246553 246209 246620 247339 247942 248404 248771 248975 249179 249685 250167 249645 247860 246206 246559
52647 246559 249343 253327 257072 259853 261337 261381 260487 259885 260681 263107 266526 269714 271234 270370 267900 265269
52631 265269 262815 259740 256092 253510 253137 253864 253843 253030 252760 253265 253233 251934 250342 249752 250496 252482 255754
$$ packed form
52744B26952J239J146P92N69M86O66J238J821J778J199R88J760L018L772L595
52729B51019K752J637O76M85J343K411K316Q30o36p14L29J248J516J487J292O30
52713B68621l55r65r65q84r63o94J55P94M07n52q61q1R75J185J18j688l028k821
52695B58398j172M22M22j128k627k608j110O23J578J917K528L582L957K607L32
52680B67721q97n76m56j818l131k086O83J980M24j625j476J46M62j312l167l358
52664B51514k383j546j032l44M11P19O03M62L67K04K04N06M82n22j785j654L53
52647B46559K784L984L745K781J484M4q94o02P96K426L419L188J520q64k470k631
52631B65269k454l075l648k582l73P27k1q13k70N05l2j299j592n90P44J986L272
$$ plain form
52614 255754 259779 263075 264468 264204 263242 262130 261251 261443 263260 265854 267558 267694 267143 267063 267604 268086 268007
52597 268007 267545 267172 266966 266483 265424 264249 263757 264151 264972 265953 267271 268728 269403 268644 266861 264847 262884
52580 262884 261093 260005 259857 259669 258076 255059 251949 249632 247666 245463 243510 242843 243747 245424 246699
52565 246699 246724 245360 243284 241504 240328 238880 236018 231883 228225 226981 228533 231513 234256 236137 237421
52550 237421 238255 238388 237661 236114 233568 229957 226365 224861 226405 229381 231109 230657 229395 228872 229027 228693
52534 228693 227153 224782 222573 221327 221069 221139 220951 220605 220486 220474 220067 219203 218391 217999 217859 217580 216801 215200
52516 215200 212870 210683 209618 209662 210057 210640 212005 214086 215647 215836 215432 215625 216197 215859 214173 212177
52500 212177 211043 210840 210826 210480 210060 210355 211944 214518 216983 218395 218574 217742 215980 213470 210936 209340
$$ packed form
52614B55754M025L296J393k64r62j112q79J92J817K594J704J36n51q0N41M82p9
52597B68007m62l73k06m83j059j175m92L94Q21R81J318J457O75p59j783k014j963
52580B62884j791j088j48j88j593l017l110k317j966k203j953o67R04J677J275
52565B46699K5j364k076j780j176j448k862m135l658j244J552K980K743J881J284
52550B37421Q34J33p27j547k546l611l592j504J544K976J728m52j262n23J55l34
52534B28693j540k371k209j246k58P0j88l46j19j2m07q64q12l92j40k79p79j601
52516B15200k330k187j065M4L95N83J365K081J561J89m04J93N72l38j686j996
52500B12177j134k03j4l46m20K95J589K574K465J412J79q32j762k510k534j596
$$ plain form
52484 209340 209156 210270 212304 214603 216243 216684 216391 216234 216359 216246 215876 216121 217639 219911 221776 222692
$$ packed form
52484B09340j84J114K034K299J640M41k93j57J25j13l70K45J518K272J865R16
$$ [...]
##END NTUPLES=NMR SPECTRUM
##END=
