##TITLE=NES1034_872015080_9242822_nGXDxCP1Qb
##JCAMPDX= 6.0         $$ Bruker NMR JCAMP-DX V2.0
##DATA TYPE= NMR SPECTRUM
##DATA CLASS= NTUPLES
##ORIGIN= BRUKER
##OWNER= Administrator
$$ 1.72 TOPSPIN		Version 2.1
$$ 2015-07-01 19:39:10.227 -0700  Administrator@X
$$ Compression mode = diff/dup
##.OBSERVE FREQUENCY= 400.02188249412
##.OBSERVE NUCLEUS= ^1H
##.ACQUISITION MODE= SIMULTANEOUS (DQD)
##.ACQUISITION SCHEME= undefined
##.AVERAGES= 8
##.DIGITISER RES= 22
##SPECTROMETER/DATA SYSTEM= spect
##.PULSE SEQUENCE= zg30
##.SOLVENT NAME= COFFEE_meoh
##.SHIFT REFERENCE= INTERNAL, COFFEE_meoh, 1, 14.98509
##AUDIT TRAIL= $$ (NUMBER, WHEN, WHO, WHERE, PROCESS, VERSION, WHAT)
$$ ##TITLE= Audit trail, TOPSPIN		Version 2.1
$$ ##JCAMPDX= 5.01
$$ ##ORIGIN= Bruker BioSpin GmbH
$$ ##OWNER= Administrator
$$ $$ E:\/data/COFFEE/nmr/NES1034_872015080_9242822_nGXDxCP1Qb/20/pdata/1/auditp.txt
$$ ##AUDIT TRAIL=  $$ (NUMBER, WHEN, WHO, WHERE, PROCESS, VERSION, WHAT)
(   1,<2015-07-01 19:39:02.899 -0700>,<Administrator>,<X>,<go>,<TOPSPIN 2.1>,
      <created by zg
	started at 2015-07-01 19:37:56.992 -0700,
	POWCHK enabled, PULCHK disabled,
       configuration hash MD5:
       21 0F 79 D6 B3 7B B4 F6 88 20 88 DB 03 48 BD 9F
       data hash MD5: 64K
       5D 30 D7 C8 A1 FF FC 04 AC C4 C4 8C 49 B7 C0 4D>)
(   2,<2015-07-01 19:39:06.086 -0700>,<Administrator>,<X>,<proc1d>,<TOPSPIN 2.1>,
      <Start of raw data processing
       efp LB = 0 FT_mod = 6 PKNL = 1 PHC0 = 0 PHC1 = 0 SI = 32K 
       data hash MD5: 32K
       0A EA EC A5 B3 D5 73 F0 28 A6 54 C8 78 4F AC D5>)
(   3,<2015-07-01 19:39:06.414 -0700>,<Administrator>,<X>,<proc1d>,<TOPSPIN 2.1>,
      <pk PHC0 = 95.39978 PHC1 = 0 
       data hash MD5: 32K
       80 9A 06 B3 CE 64 0D 76 40 34 9A 21 ED FF 87 F1>)
(   4,<2015-07-01 19:39:06.524 -0700>,<Administrator>,<X>,<proc1d>,<TOPSPIN 2.1>,
      <abs ABSG = 1 
       data hash MD5: 32K
       E9 5D 30 16 35 BE CE BB 94 36 B4 7F 9E F8 97 11>)
(   5,<2015-07-01 19:39:06.586 -0700>,<Administrator>,<X>,<proc1d>,<TOPSPIN 2.1>,
      <abs ABSG = 2 
       data hash MD5: 32K
       43 6B F6 EB CE 9C C2 6E 56 5B 18 B9 55 E3 5F EC>)
(   6,<2015-07-01 19:39:06.633 -0700>,<Administrator>,<X>,<proc1d>,<TOPSPIN 2.1>,
      <abs ABSG = 3 
       data hash MD5: 32K
       8E E7 E8 8C 3B 20 2C 1A F5 D7 84 16 22 04 64 55>)
(   7,<2015-07-01 19:39:06.695 -0700>,<Administrator>,<X>,<proc1d>,<TOPSPIN 2.1>,
      <abs ABSG = 4 
       data hash MD5: 32K
       F5 1A F5 91 5A D1 5B 57 C2 3D 89 D9 64 33 A1 73>)
(   8,<2015-07-01 19:39:06.758 -0700>,<Administrator>,<X>,<proc1d>,<TOPSPIN 2.1>,
      <abs ABSG = 5 
       data hash MD5: 32K
       4B 0E A7 EA 5B E0 90 38 24 D6 87 94 EB 95 5A 52>)
$$ ##END=
$$ 
$$ $$ hash MD5
$$ $$ 31 40 8D 65 0C 1E F7 9A 94 13 3E EB F4 2E 66 1E
##$RELAX= 
##$RELAX= 
##$RELAX= 
##$RELAX= 
##$RELAX= 
##$RELAX= 
##$RELAX= 
$$ Bruker specific parameters
$$ --------------------------
##$DU= <E:\>
##$EXPNO= 20
##$NAME= <NES1034_872015080_9242822_nGXDxCP1Qb>
$$ [...]
150 150 150 150 150 150 150 150
##$TP07= 0
##$TPNAME0= <>
##$TPNAME1= <>
##$TPNAME2= <>
##$TPNAME3= <>
##$TPNAME4= <>
##$TPNAME5= <>
##$TPNAME6= <>
##$TPNAME7= <>
##$TPOAL= (0..7)
0.5 0.5 0.5 0.5 0.5 0.5 0.5 0.5
##$TPOFFS= (0..7)
0 0 0 0 0 0 0 0
##$TUNHIN= 0
##$TUNHOUT= 0
##$TUNXOUT= 0
##$USERA1= <user>
##$USERA2= <user>
##$USERA3= <user>
##$USERA4= <user>
##$USERA5= <user>
##$V9= 5
##$VALIST= <valist>
##$VCLIST= <CCCCCCCCCCCCCCC>
##$VD= 0
##$VDLIST= <DDDDDDDDDDDDDDD>
##$VPLIST= <PPPPPPPPPPPPPPP>
##$VTLIST= <TTTTTTTTTTTTTTT>
##$WBST= 2048
##$WBSW= 25
##$XGAIN= (0..3)
0 0 0 0
##$XL= 0
##$YL= 0
##$YMAX_a= 574694
##$YMIN_a= -480543
##$ZGOPTNS= <>
##$ZL1= 120
##$ZL2= 120
##$ZL3= 120
##$ZL4= 120
##$ABSF1= 14.98509
##$ABSF2= -5.573092
##$ABSG= 5
##$ABSL= 3
##$ALPHA= 0
##$AQORDER= 0
##$ASSFAC= 0
##$ASSFACI= 0
##$ASSFACX= 0
##$ASSWID= 0
##$AUNMP= <proc_prof1d_extract_pilot.lims>
##$AXLEFT= 0
##$AXNAME= <>
##$AXNUC= <1H>
##$AXRIGHT= 0
##$AXTYPE= 0
##$AXUNIT= <>
##$AZFE= 0.1
##$AZFW= 0.1
##$BCFW= 0
##$BC_mod= 0
##$BYTORDP= 0
##$COROFFS= 0
##$CY= 15
##$DATMOD= 1
##$DC= 0
##$DFILT= <>
##$DTYPP= 0
##$F1P= 0
##$F2P= 0
##$FCOR= 0.5
##$FTSIZE= 32768
##$FT_mod= 6
##$GAMMA= 0
##$GB= 0
##$INTBC= 1
##$INTSCL= 1
##$ISEN= 128
##$LB= 0
##$LEV0= 0
##$LPBIN= 0
##$MAXI= 10000
##$MC2= 0
##$MEAN= 0
##$ME_mod= 0
##$MI= 0
##$NCOEF= 0
##$NC_proc= -8
##$NLEV= 6
##$NOISF1= 0
##$NOISF2= 0
##$NSP= 0
##$NTH_PI= 0
##$NZP= 0
##$OFFSET= 14.98509
##$PC= 1
##$PHC0= 95.39978
##$PHC1= 0
##$PH_mod= 1
##$PKNL= yes
##$PPARMOD= 0
##$PPDIAG= 0
##$PPIPTYP= 0
##$PPMPNUM= 2147483647
##$PPRESOL= 1
##$PSCAL= 4
##$PSIGN= 0
##$PYNMP= <proc.py>
##$REVERSE= no
##$SF= 400.02
##$SI= 32768
##$SIGF1= 0
##$SIGF2= 0
##$SINO= 400
##$SIOLD= 32768
##$SPECTYP= <>
##$SREGLST= <1H.CDCl3>
##$SSB= 0
##$STSI= 32768
##$STSR= 0
##$SW_p= 8223.68421052631
##$SYMM= 0
##$S_DEV= 0
##$TDeff= 65536
##$TDoff= 0
##$TI= <>
##$TILT= no
##$TM1= 0
##$TM2= 0
##$TOPLEV= 0
##$USERP1= <user>
##$USERP2= <user>
##$USERP3= <user>
##$USERP4= <user>
##$USERP5= <user>
##$WDW= 1
##$XDIM= 32768
##$YMAX_p= 402826921
##$YMIN_p= -710733
##$CURPLOT= <Network HP LaserJet P1505>
##$CURPRIN= <$Network HP LaserJet P1505>
##$DFORMAT= <normdp>
##$LAYOUT= <+/1D_H.xwp>
##$LFORMAT= <normlp>
##$PFORMAT= <normpl>
##$SURQMSG= 1
$$ End of Bruker specific parameters
$$ ---------------------------------
##NTUPLES= NMR SPECTRUM
##VAR_NAME=  FREQUENCY,     SPECTRUM/REAL,   SPECTRUM/IMAG
##SYMBOL=    X,             R,               I
##VAR_TYPE=  INDEPENDENT,   DEPENDENT,       DEPENDENT
##VAR_FORM=  AFFN,          ASDF,            ASDF
##VAR_DIM=   32768,         32768,           32768
##UNITS=     HZ,            ARBITRARY UNITS, ARBITRARY UNITS
##FACTOR=    0.250966925370066, 1,           1
##FIRST=     8223.43324360094, 40948,        -238498
##LAST=      0,             -136964,         176637
##MIN=       0,             -710733,         0
##MAX=       8223.43324360094, 402826921,    0
$$ Real data points
##PAGE= N=1
##DATA TABLE= (X++(R..R)), XYDATA
$$ [...]
19482a23391L883j19781D9317a6998A82458C3908b2588A3174a24128c502k66690
$$ -123391 -119508 -239289 49317 -16998 182458 33908 -22588 13174 -124128 -3502 -270192
19471b70192A18665b34661D8558e32114b65679i110n1086j64778A35518J908k4676
$$ -270192 118665 -234661 48558 -532114 -265679 -9110 -60196 -224974 135518 137426 112750
19460A12750J35063a49211K0426j43596f4814I3324a86880j1511D4087A8423K76164
$$ 112750 247813 -149211 -128785 -272381 -64814 93324 -186880 -198391 44087 18423 294587
19449B94587O473a55772c7544j65906o7221A48030M1169h4138D9239a41417D88718
$$ 294587 301060 -155772 -37544 -203450 -270671 148030 189199 -84138 49239 -141417 488718
19437A9519O6768a910A40578D2766R4156G533a09940b520m6507H0886C5133a96449
$$ 19519 86287 -1910 140578 42766 136922 7533 -109940 -2520 -49027 80886 35133 -196449
19424A3366d8868F3735b2693A42231n694a47728N0222b3127l6490j07097B407
$$ 13366 -48868 63735 -22693 142231 136537 -147728 -97506 -23127 -59617 -166714 2407
19412a44555L3773j17247A44342d2431p2964A82416G5834d25887f9096a620I4008
$$ -144555 -110782 -228029 144342 -42431 -115395 182416 75834 -425887 -69096 -1620 94008
19400a32412A20710b23352D0095e1248k0861l1350j73051B2337n598a28503j41060
$$ -132412 120710 -223352 40095 -51248 -72109 -103459 -276510 22337 16739 -128503 -269563
19389b69563k1150A62646J54800B7457J46299e8570G7023J70851b22134P8076
$$ -269563 -290713 162646 317446 27457 173756 -58570 77023 247874 -222134 -144058
19379a44058c5232F0199K0897d09757b6704k03028F5062d23676a29116j51782
$$ -144058 -35232 60199 81096 -409757 -26704 -229732 65062 -423676 -129116 -280898
19369b80898J8422D71183h1799j14943D84J45052a30908A38296i9701m9616O9273
$$ -280898 -262476 471183 -81799 -196742 484 145536 -130908 138296 -99701 -149317 -80044
19358h0044C2689L098J54825f2461j41779q2328P795a17575m8891f2267l3060
$$ -80044 32689 35787 190612 -62461 -204240 -286568 -278773 -117575 -166466 -62267 -95327
19347i5327J1964A8767K5617L0414b9020A68339a07557A77483h2417M0495B10191
$$ -95327 -83363 18767 44384 74798 -29020 168339 -107557 177483 -82417 -41922 210191
19335d97096A35666d6969j37861g2900j10670B18477c33384L5434P8308k04170
$$ -497096 135666 -46969 -184830 -72900 -183570 218477 -333384 -297950 -219642 -423812
19325d23812a12401J0721D35800h3419j25424P757O4556l31863B1527c45485a72573
$$ -423812 -112401 -101680 435800 -83419 -208843 -201086 -136530 -468393 21527 -345485 -172573
19313b76632J550B4540J65815b30101e0044l48904E3333J92931a1013q6667M7178
$$ -276632 -275082 24540 190355 -230101 -50044 -398948 53333 246264 -11013 -97680 -50502
19302e0502k8663j16800q2670A00937L1226b24785J08817E0793A9839b5825n7803
$$ -50502 -79165 -195965 -278635 100937 132163 -224785 -115968 50793 19839 -25825 -83628
19291h3628o2400D8386K45102a38914j20904i3011j197d0002k3901k94462a65637
$$ -83628 -146028 48386 293488 -138914 -259818 -93011 -94208 -40002 -63903 -358365 -165637
19279A04620j0556a92684A39792g3765j57797B8999d06156J36022C6365a57464
$$ 104620 94064 -192684 139792 -73765 -231562 28999 -406156 -270134 36365 -157464
19268a72441A56062h6409b5041O043o1152J39D9044b61403A67051G5738a6815
$$ -172441 156062 -86409 -25041 -18998 -80150 -80011 49044 -261403 167051 75738 -16815
19256a57426A42914K4753E2510Q2429g4819B89843A44119c01386C17835b38844
$$ -157426 142914 167667 52510 134939 -74819 289843 144119 -301386 317835 -238844
19245a31971k04521a53467D83923b41192q8108C76966f1626A09099A1308L01530
$$ -131971 -336492 -153467 483923 -241192 -329300 376966 -61626 109099 11308 312838
19235C12838M7301a83834A39478d30727H8165c54877j49232F7628B0542J08354
$$ 312838 360139 -183834 139478 -430727 88165 -354877 -504109 67628 20542 128896
19225A28896A3416N0125d2761J5869j77861l7138F0409b75669l6263c6833J3744
$$ 128896 13416 63541 -42761 -26892 -204753 -241891 60409 -275669 -311932 -36833 -23089
19214b3089j74622Q2720C02308g5003D31855b23067A21187g5501D0044b02008
$$ -23089 -197711 -114991 302308 -75003 431855 -223067 121187 -75501 40044 -202008
19203B19842A06384B5518c63045D6902N5523Q4902a7493k20044j47317J13544
$$ 219842 106384 25518 -363045 46902 102425 187327 -17493 -237537 -384854 -271310
19193b71310J8341j59022B90831a10653j517M0366F3437K40341H645c7487j88857
$$ -271310 -252969 -411991 290831 -110653 -112170 -71804 63437 303778 8645 -37487 -226344
19182b26344b4240A2650a48789e6187r4284e0607j55728J5819c1655j8387C22899
$$ -226344 -24240 12650 -148789 -56187 -150471 -50607 -206335 -190516 -31655 -50042 322899
19170a76255a0646j22451l03629B41587e8848j18665h6594j49949F2316k0964
$$ -176255 -10646 -133097 -436726 241587 -58848 -177513 -86594 -236543 62316 41352
19160D1352M8284b97310G8371c2253A06961a57168A0372J71666D935L1536b66699
$$ 41352 89636 -297310 78371 -32253 106961 -157168 10372 182038 4935 36471 -266699
19148B7453i8669B25949E7376a61514L648K3708j36039h9426j55115P1060E4147
$$ 27453 -98669 225949 57376 -161514 -157866 -134158 -270197 -89426 -244541 -173481 54147
19136a45259q586A18622g6810F8690a88307k7584H0280J90471A31436c17341G6072
$$ -145259 -153845 118622 -76810 68690 -188307 -215891 80280 270751 131436 -317341 76072
19124a95835b9352k38229d5729B42511b77929n6885G5477J08519B406N0319a91413
$$ -195835 -29352 -267581 -45729 242511 -277929 -334814 75477 183996 2406 52725 -191413
19112a27876E0577b66868E4204a45031G1436b10556n6551a18004l1729b3750k11372
$$ -127876 50577 -266868 54204 -145031 71436 -210556 -267107 -118004 -149733 -23750 -235122
19101b35122q5478F9345f7545D2110a64352k59017a79531B64647j10598n1948
$$ -235122 -320600 69345 -67545 42110 -164352 -423369 -179531 264647 154049 102101
19091A02101m5986c03116I5519a03726j5185b5092Q011n4071j86187C6274a37111
$$ 102101 56115 -303116 95519 -103726 -118911 -25092 -17081 -71152 -257339 36274 -137111
19079C8717e4992a7767A44126b53444h5454d0376A84882b15264i8548m863D597
$$ 38717 -54992 -17767 144126 -253444 -85454 -40376 184882 -215264 -98548 -103411 4597
19067b96080k61959A83893a65875n072e0118E2802J54493r4897g1071C84937j74976
$$ -296080 -558039 183893 -165875 -170947 -50118 52802 207295 112398 -71071 384937 209961
19056B09961F7818o788h4760j79307g2206C4073f9387k53397O8634d3592B44376
$$ 209961 67818 61030 -84760 -264067 -72206 34073 -69387 -322784 -254150 -43592 244376
19044b58545H2617a07966O074q3739A13800l1037O9682B0419J6449d1619l0746
$$ -258545 82617 -107966 -101892 -185631 113800 82763 152445 20419 36868 -41619 -72365
19033g2365k58509A91477H8353J62675o7806g3140D5611f8195B19237a13831k49174
$$ -72365 -330874 191477 88353 251028 183222 -73140 45611 -68195 219237 -113831 -363005
19022c63005A70194a60862A46724a25465b1147o0333b2387E5434d8013I6575e7918
$$ -363005 170194 -160862 146724 -125465 -21147 -81480 -22387 55434 -48013 96575 -57918
19010C2494a39864A31767a94216D2603h1489F8206g9065H2126b92281Q8445j07261
$$ 32494 -139864 131767 -194216 42603 -81489 68206 -79065 82126 -292281 -203836 -311097
18999c11097a54776m4290A13965h5813D0264J2798A6667a04117C07262a05348
$$ -311097 -154776 -199066 113965 -85813 40264 53062 16667 -104117 307262 -105348
18988b21187i9453B11013a26338A90065a48803N6315A97892g2404j95872m5570
$$ -221187 -99453 211013 -126338 190065 -148803 -92488 197892 -72404 -268276 -313846
18978c13846a39956B7386a74475c8615k10316J17367B39414d50489C53562D8683
$$ -313846 -139956 27386 -174475 -38615 -248931 -131564 239414 -450489 353562 48683
18967E49J28221e52237A90402a54769I6736J29184J9396F10c31898A92075a71355
$$ 549 128770 -552237 190402 -154769 96736 225920 245316 610 -331898 192075 -171355
18955a1391B99050G8549J23589a0705m20655a30562A30443g9223n1051L3636E97
$$ -11391 299050 78549 202138 -10705 -431360 -130562 130443 -79223 -130274 -96638 597
18943A21125A1440a01387C2178a6964j7093j8367j27984C97478A16494o75a1392
$$ 121125 11440 -101387 32178 -16964 -34057 -52424 -180408 397478 116494 115819 -11392
18931a88079C371c8396A0256b61652a0964G294b57702J02377A07652a57667b798
$$ -188079 3371 -38396 10256 -261652 -10964 7294 -257702 -155325 107652 -157667 -2798
18919d2203m165B98795c30417R3669A62991a67953F6647Q0110c04579B15460h8038
$$ -42203 -46368 298795 -330417 -236748 162991 -167953 66647 146757 -304579 215460 -88038
18907H9720f3802j38051B63815B0980h6080l10999a84299A73608e7159j03537
$$ 89720 -63802 -201853 263815 20980 -86080 -397079 -184299 173608 -57159 -160696
18897a60696q8631a08762A79781L0470f4775j83577c802k11586m8899E6346Q1939
$$ -160696 -249327 -108762 179781 210251 -64775 -248352 -3802 -215388 -264287 56346 138285
18886A38285d78783B34794r3046a61891c5876h679l5866J8945k62172H3617b64418
$$ 138285 -478783 234794 141748 -161891 -35876 -8679 -44545 -25600 -287772 83617 -264418
18874C7994a65628A60678a08564o5522F4207b85192B90567I2270a51845f2908
$$ 37994 -165628 160678 -108564 -174086 64207 -285192 290567 92270 -151845 -62908
18863b55676F7311f8059N33A68486F8204a30719C9991L6756a40230j16821J3164
$$ -255676 67311 -68059 -67526 168486 68204 -130719 39991 76747 -140230 -257051 -243887
18852b43887A93077b1035C0738K50080A16097a2921H1419Q5100E6443e9690A59862
$$ -243887 193077 -21035 30738 280818 116097 -12921 81419 166519 56443 -59690 159862
18840a09658H3422M9127b73923a0835B6068E549L5180K02122b95162B15488a34428
$$ -109658 83422 132549 -273923 -10835 26068 5549 40729 242851 -295162 215488 -134428
18828b51721J3384A44257c53338B44570a52515E8280a29114C10844b70352D6637
$$ -251721 -238337 144257 -353338 244570 -152515 58280 -129114 310844 -270352 46637
18817C01536h9161q8946d8302a4162A46426f2525C52343c58073C1880a86514o3873
$$ 301536 -89161 -178107 -48302 -14162 146426 -62525 352343 -358073 31880 -186514 -250387
18806b50387D4871K115b36584f4628A1541K35770n9804d64777b24734K2604N5129
$$ -250387 44871 46986 -236584 -64628 11541 247311 187507 -464777 -224734 -202130 -147001
18795a47001K1317I7274a1795m5183n8512E63J7245b5584G2821a32230e1874l55351
$$ -147001 -125684 97274 -11795 -56978 -115490 563 17808 -25584 72821 -132230 -51874 -407225
18783d07225c5318k7472C0105b17962p498K8148r159B6755L066g2528k2221c5625
$$ -407225 -35318 -62790 30105 -217962 -225460 -197312 -206471 26755 29821 -72528 -94749 -35625
18770a23880B10683c3193l75288a04147A68009a04238o706l6450G105d1818H1432
$$ -123880 210683 -33193 -408481 -104147 168009 -104238 -110944 -147394 7105 -41818 81432
18758b40132I7939h1431K4813q5319H0033A8523c02030D82739A41295a41856C0823
$$ -240132 97939 -81431 -56618 -141937 80033 18523 -302030 482739 141295 -141856 30823
18746b2778k11905A34941J14753g7229B16695F4304b93130c5296m6836k4370k41576
$$ -22778 -234683 134941 249694 -77229 216695 64304 -293130 -35296 -82132 -106502 -348078
18735c48078G9530a6479j38566o2803j66505f1971o0378a5007j14578A44156c69710
$$ -348078 79530 -16479 -155045 -217848 -384353 -61971 -122349 -15007 -129585 144156 -369710
18723g6779k46607A29334R4653B8116K61316a32342A04662k4003a61369k92174
$$ -76779 -323386 129334 223987 28116 289432 -132342 104662 80659 -161369 -453543
18713d53543b02856A47433e33607J69139h4474r7321B5535g2591k46034i4574
$$ -453543 -202856 147433 -533607 -364468 -84474 -181795 25535 -72591 -318625 -94574
18702A7106M8309R4193b98497R3355B6797a83228A39582a28940l3887L6772c7540
$$ 17106 65415 159608 -298497 -205142 26797 -183228 139582 -128940 -162827 -126055 -37540
18690A02056b12778o2654G7477b16670G363a37790c1916C04422a26449p2368r4373
$$ 102056 -212778 -275432 77477 -216670 7363 -137790 -31916 304422 -126449 -198817 -293190
18679b93190e4491j87631a13747A44547L4864a12029B06793O2405F716K73309
$$ -293190 -54491 -242122 -113747 144547 179411 -112029 206793 269198 6716 280025
18669B80025A37013b28235O3635g3138j52863f3568b1706k02608B66606b16914
$$ 280025 137013 -228235 -164600 -73138 -226001 -63568 -21706 -224314 266606 -216914
18658B29768f0755A4857a40880n8289i0830k52040i1541l03471B7113b08491B4640
$$ 229768 -60755 14857 -140880 -199169 -90830 -342870 -91541 -395012 27113 -208491 24640
18646a61538g0573r4017Q040N3487A77805b49624B20214b22924H1351g6041L4792
$$ -161538 -70573 -164590 -156550 -103063 177805 -249624 220214 -222924 81351 -76041 -41249
18635d1249k99092J54645e60j03617J8556L4214p2059B971L65733A03764a94309
$$ -41249 -340341 -185696 -560 -104177 -85621 -51407 -123466 2971 368704 103764 -194309
18623a36107J1349B07705c6663H8867k0486M9093E755O2651a09368C1777c26068
$$ -136107 -124758 207705 -36663 88867 68381 117474 5755 68406 -109368 31777 -326068
18611b69171a27386B67763o8674a4957A77121f6662j19839i646j36978M4316I4207
$$ -269171 -127386 267763 199089 -14957 177121 -66662 -186501 -9646 -146624 -102308 94207
18599F8302a06193k25238a4232p4114M618r6507B5627J19046d86279A50378c6066
$$ 68302 -106193 -331431 -14232 -88346 -83728 -180235 25627 144673 -486279 150378 -36066
18587C00882b66509A14832d0865j5727C0666a6777c467D2881a667k21870G8345
$$ 300882 -266509 114832 -40865 -56592 30666 -16777 -3467 42881 -1667 -223537 78345
18575A73436a73745A1159J7065a91469b9342F2293b25041h3718j58146F8914E548
$$ 173436 -173745 11159 28224 -191469 -29342 62293 -225041 -83718 -241864 68914 5548
18563d3243B10310a49183L2347r1860A61730a65379c7805O199B20508d48270b5746
$$ -43243 210310 -149183 -116836 -208696 161730 -165379 -37805 -31606 220508 -448270 -25746
18551a01808I8801h178l35047A19302i4857a0346j6665o3705j82636c9505G3691
$$ -101808 98801 -8178 -343225 119302 -94857 -10346 -27011 -90716 -273352 -39505 73691
18539f5914D6272b35234a7153M65m6317H5034k0374M23575k33332a07335j9262
$$ -65914 46272 -235234 -17153 -16688 -63005 85034 64660 488235 254903 -107335 -126597
18528a26597m9474B36650A6731a95031C6880L76538a09337A93507g2543j57675
$$ -126597 -176071 236650 16731 -195031 36880 413418 -109337 193507 -72543 -230218
18518b30218i514j71821g5694j82424p5528i9039A17872D0382h4546A53068a64652
$$ -230218 -9514 -181335 -75694 -258118 -333646 -99039 117872 40382 -84546 153068 -164652
18506b58119l3811j1467A44465J50059c01221B82674i3625A4433J62557f1903
$$ -258119 -291930 -303397 144465 294524 -301221 282674 -93625 14433 176990 -61903
18495b80623b9829k44977A36420d6764D122a55125d260B32743M6891b935j51311
$$ -280623 -29829 -274806 136420 -46764 4122 -155125 -4260 232743 279634 -2935 -154246
18484a54246F4080J85174i7105A44045a3022B6958J11950J60021k1852a09635
$$ -154246 64080 249254 -97105 144045 -13022 26958 138908 298929 277077 -109635
18473b03410M1362N3849p5460n5138h3471l703k48207c8887j85749h6610k20868
$$ -203410 -162048 -108199 -183659 -238797 -83471 -87174 -335381 -38887 -224636 -86610 -307478
18462c07478A81582h3998J0267A44148d9297j33348K042K6059A04863d9785B58446
$$ -307478 181582 -83998 -73731 144148 -49297 -182645 -180603 -154544 104863 -49785 258446
18450g8232k7564A27338b07413E4788o245b72929B66228A29841d24368a56041
$$ -78232 -105796 127338 -207413 54788 48543 -272929 266228 129841 -424368 -156041
18439a59946F1265J40939c57551P1981e9103I1231H921E63J32028b35369a03807
$$ -159946 61265 202204 -357551 -285570 -59103 91231 8921 563 132591 -235369 -103807
18427I2884f8055a2983k13792A46391F8230b45244a16522k17035a41182l3181
$$ 92884 -68055 -12983 -226775 146391 68230 -245244 -116522 -333557 -141182 -174363
18417a74363g9559m2255A99260b75192J27832N9801I7604a33561A24509I573a44973
$$ -174363 -79559 -121814 199260 -275192 -147360 -87559 97604 -133561 124509 9573 -144973
18405d7250C57965B2433b76834C9535K50495d51360J86575B83799d16386h0663
$$ -47250 357965 22433 -276834 39535 290030 -451360 -264785 283799 -416386 -80663
18394b14638K1454g7722j3205B18366a41442j79174d4868P678j44073Q2880j92282
$$ -214638 -193184 -77722 -90927 218366 -141442 -320616 -44868 -37190 -181263 -98383 -290665
18383b90665P2911R9825m7412H4008L1561A2734b6943m05155g8699C39533F8079
$$ -290665 -217754 -117929 -165341 84008 115569 12734 -26943 -432098 -78699 339533 68079
18371C45992b60186A22621b27620b3708j2009j48531m5872a0496B06109f8608
$$ 345992 -260186 122621 -227620 -23708 -35717 -184248 -230120 -10496 206109 -68608
18360a35274A11355J01262a29586j29526A26215e5793C92603g6213A08233i6494
$$ -135274 111355 212617 -129586 -259112 126215 -55793 392603 -76213 108233 -96494
18349b06298j09618a06601d4784j38682m2058A47022b01182I1002J48136b27098
$$ -206298 -315916 -106601 -44784 -183466 -225524 147022 -201182 91002 239138 -227098
18338I5431a23158C767i871q7443B83547B4827J89314n4480a71228m3585h6031
$$ 95431 -123158 3767 -9871 -97314 283547 24827 214141 159661 -171228 -214813 -86031
18326B64695i8012E1641J04706c7930A1907a13715F4817P1047b2244D0201J9202
$$ 264695 -98012 51641 156347 -37930 11907 -113715 64817 135864 -22244 40201 59403
18315E9403a96154c9612A7078J6455a79522B1251b13792A24798a7829F0202Q2174
$$ 59403 -196154 -39612 17078 33533 -179522 21251 -213792 124798 -17829 60202 142376
18304A42376P4631b76830C9869F248b0186A33987b8344j33394j50771i1339A53258
$$ 142376 217007 -276830 39869 6248 -20186 133987 -28344 -161738 -312509 -91339 153258
18292a28648J534I9500g6233k38752M098E2989J30561b9213j99002J4323A75167
$$ -128648 -127114 99500 -76233 -314985 -310887 52989 183550 -29213 -228215 -213892 175167
18280f5117A26610a18080e6440P6r2348A22013c5170j01963B0237b07602j95948
$$ -65117 126610 -118080 -56440 -56364 -148712 122013 -35170 -137133 20237 -207602 -403550
18269d03550A96283d1487j93122I5596B1434c41718A23750m5314d21400H9697
$$ -403550 196283 -41487 -234609 95596 21434 -341718 123750 78436 -421400 89697
18258G7973K57712A63177a61449K2692f5961j23939A09005I072c31976o2726a12397
$$ 77973 335685 163177 -161449 -138757 -65961 -189900 109005 9072 -331976 -394702 -112397
18246i7046d55j14910A53825B9238J38383R2241a03204B12644c8450q2998M7496
$$ -97046 -455 -115365 153825 29238 167621 259862 -103204 212644 -38450 -121448 -73952
18235g3952F3014M4365c8661J643l1610A09337f9531I9611a71182f1884k14926
$$ -73952 63014 107379 -38661 -37018 -68628 109337 -69531 99611 -171182 -61884 -276810
18224b76810a34795I051a93701M8142b3062A96606D5725N0128m3098d3959l88074
$$ -276810 -134795 9051 -193701 -145559 -23062 196606 45725 95853 52755 -43959 -432033
18213d32033d8130j29285a854j95834R1274A28195b26665J08878C2463j1839n206
$$ -432033 -48130 -177415 -1854 -197688 -106414 128195 -226665 -117787 32463 20624 15418
18202A5418i9618K4672j0528B96239h6306j57979E2617a4713B13549a82536B52778
$$ 15418 -99618 -74946 -85474 296239 -86306 -244285 52617 -14713 213549 -182536 252778
18190b57927F2226Q6447o5864h198p2885B18665a80474D0655K5133f2476a8276
$$ -257927 62226 148673 82809 -8198 -81083 218665 -180474 40655 65788 -62476 -18276
18178a34106B36689q3208n0060b68432b4435k43158B18412c5084D8342a49734
$$ -134106 236689 153481 103421 -268432 -24435 -267593 218412 -35084 48342 -149734
18167c913C41126G3196a88726f5659A02617D4327a04138o850A97557p6671L26896
$$ -3913 341126 73196 -188726 -65659 102617 44327 -104138 -110988 197557 120886 447782
18156D47782e1075A77507D1743i7170I99b906A29623J28175D2726c06769l4702
$$ 447782 -51075 177507 41743 -97170 999 -2906 129623 257798 42726 -306769 -341471
18145c41471A60477E2540J94675d2971m009A92769b4117D5431c62993h6106k84137
$$ -341471 160477 52540 247215 -42971 -46980 192769 -24117 45431 -362993 -86106 -370243
18134c70243C5362j165a45618C26480e4045F4612K28639c5598j08435K9883A95544
$$ -370243 35362 34197 -145618 326480 -54045 64612 293251 -35598 -144033 -114150 195544
18122A39903E2107h8436o9208m083q0562a1549j01772D7322L20564A59204J18860
$$ 139903 52107 -88436 -157644 -161727 -242289 -11549 -113321 47322 367886 159204 278064
18111B78064a15849G0101c04997h101B4780g6304B8089c04443a9244j11906A49801
$$ 278064 -115849 70101 -304997 -8101 24780 -76304 28089 -304443 -19244 -131150 149801
18099A77046g2660j17743A77784Q1464E5249b54259O619I8445h3911G8760a11163
$$ 177046 -72660 -190403 177784 259248 55249 -254259 -247640 98445 -83911 78760 -111163
18087G214a3283j54646D2832b2748A40735m8154B5386L3496a39594A61261I681
$$ 7214 -13283 -167929 42832 -22748 140735 92581 25386 58882 -139594 161261 9681
18075G6112L53706b53732l619a11093j24059e4900k92098G0385a30968F8207O8793
$$ 76112 429818 -253732 -257351 -111093 -235152 -54900 -346998 70385 -130968 68207 137000
18064A37000M0895b36120e4842j35861A3117b00429e7094A87983a2381j82498
$$ 137000 177895 -236120 -54842 -190703 13117 -200429 -57094 187983 -12381 -194879
18054a94879n209B6519H554J69734O6963b14728A15761a00845J0970k6509C03876
$$ -194879 -200088 26519 8554 178288 245251 -214728 115761 -100845 -89875 -116384 303876
18042a73825F0123K871c51163Q9869K1304B04809e1033A51474D5051c21495E851
$$ -173825 60123 62994 -351163 -261294 -239990 204809 -51033 151474 45051 -321495 5851
18030a83377h3474k13057a22546q2725c7400F9855M8532D16J34261b82724a35596
$$ -183377 -83474 -296531 -122546 -205271 -37400 69855 118387 416 134677 -282724 -135596
18018A54607B3594b93941a16632c635C4376K34916h3281k0818A2078d46845E006
$$ 154607 23594 -293941 -116632 -3635 34376 269292 -83281 -104099 12078 -446845 5006
18006A71041A0665h5027B59295a44504A54134m2157a34192j75568D9532a26380
$$ 171041 10665 -85027 259295 -144504 154134 111977 -134192 -309760 49532 -126380
17995G7334K7246h9133c236k2274k06071A26761c42359g1817j15833o5753A14135
$$ 77334 104580 -89133 -3236 -25510 -231581 126761 -342359 -71817 -187650 -253403 114135
17983A54793n1972J4831a1078B4207c67216B53830a90534b9729B37164a71031
$$ 154793 102821 117652 -11078 24207 -367216 253830 -190534 -29729 237164 -171031
17972b45831a02497D3893K24684a36317j33756g0562A11174J81074j11468q6341
$$ -245831 -102497 43893 268577 -136317 -270073 -70562 111174 292248 180780 94439
17962I4439a61773B18656j9935n6184J63016E8531f4632A08486P4014a55701c1681
$$ 94439 -161773 218656 198721 142537 305553 58531 -64632 108486 182500 -155701 -31681
17950c34827J61392G2207K11383H4758J32356b86735G3700A6400J71212a73994
$$ -334827 -173435 72207 283590 84758 217114 -286735 73700 16400 187612 -173994
17939C03883a84515C431a79034a7320j27716B45588b37977A34503c02082A73088
$$ 303883 -184515 3431 -179034 -17320 -145036 245588 -237977 134503 -302082 173088
17928h4386A35577c8844D2730M7035G778K27183O74r6572a19115B14744a13558
$$ -84386 135577 -38844 42730 89765 7778 234961 235635 139063 -119115 214744 -113558
17916B36393b22972A5061c2602I7569l7146a81386B85102a44810M6183j0138b5690
$$ 236393 -222972 15061 -32602 97569 60423 -181386 285102 -144810 -98627 -108765 -25690
17904h1633B71918D6202M5263M5890a49299b4773H1459c72647D09799e2105m0047
$$ -81633 271918 46202 91465 137355 -149299 -24773 81459 -372647 409799 -52105 -92152
17893i2152A34082K33105H1126c12058E8905a92313c4160I8786J51526F9003K41057
$$ -92152 134082 367187 81126 -312058 58905 -192313 -34160 98786 250312 69003 310060
17882C10060a42090C76542C0284K7006B2591d75684A09711a89233d8985D5542
$$ 310060 -142090 376542 30284 57290 22591 -475684 109711 -189233 -48985 45542
17871C96514b06359A7593f4863E1170J96623n4867a6606k3981C23577D6476e4825
$$ 396514 -206359 17593 -64863 51170 247793 192926 -16606 -40587 323577 46476 -54825
17859b27314D5841K3317b62302J07680e877B54773R948c6421F0271M8135c5411
$$ -227314 45841 69158 -262302 -154622 -5877 254773 264721 -36421 60271 108406 -35411
17847g0951C356N148a49201B04722m1769a46785A54541N7400A7124J8212b4919
$$ -70951 3356 8504 -149201 204722 162953 -146785 154541 211941 17124 35336 -24919
17835c6665F0254b75935h170j06232o7603A71712b9464A95904G8195a65622C9797
$$ -36665 60254 -275935 -8170 -114402 -182005 171712 -29464 195904 78195 -165622 39797
17823f6352A34777B7944N5246a76013L0524A16078N23377a76441A00933i1828
$$ -66352 134777 27944 83190 -176013 -145489 116078 639455 -176441 100933 -91828
17812c70813A92984H4927K5183O72M4751J1013m2925d27052D67897a71895F5720
$$ -370813 192984 84927 110110 110782 155533 166546 123621 -427052 467897 -171895 65720
17800a85907E774K296J59570h6199f773A53308i9520c351k09278E8032a80031
$$ -185907 5774 8070 167640 -86199 -6773 153308 -99520 -3351 -212629 58032 -180031
17788d1292d68C28574F3002J41610l1897a93769B2558K85558f1922j01214a3905
$$ -41292 -468 328574 63002 204612 172715 -193769 22558 308116 -61922 -163136 -13905
17776f0721m2638b531o4339k4378C68896n152e593F7076J52984r683O4726c6375
$$ -60721 -103359 -2531 -66870 -91248 368896 363744 -5593 67076 220060 210377 275103 -36375
17763a8800A98003B7298J26871a464B02142i1494F2651J6920J98001e4091E1041
$$ -18800 198003 27298 154169 -1464 202142 -91494 62651 79571 277572 -54091 51041
17751a22200D2873l306Q6430P516a47422M606O3209K968A29605h1351A00248k1472
$$ -122200 42873 39567 125997 133513 -147422 -142816 -79607 -76639 129605 -81351 100248 78776
17739G8776L06518m3977A9146h0520B22580a39223k14728e6506D5328d4367j775
$$ 78776 385294 341317 19146 -80520 222580 -139223 -353951 -56506 45328 -44367 -46142
17728d6142B93562a58160A9191R7210J5950J35768i9070H0560K28575f4338I747
$$ -46142 293562 -158160 19191 116401 132351 268119 -99070 80560 309135 -64338 9747
17716B92978b5896n6528k20288B88971j15861l8232D7167J71174h0022n8175L9717
$$ 292978 -25896 -82424 -302712 288971 173110 134878 47167 218341 -80022 -138197 -98480
17705i8480k0260D60792h9658C36566j20019b46797A64941q0758r885K05402G5369
$$ -98480 -118740 460792 -89658 336566 216547 -246797 164941 84183 74298 279700 75369
17693B27256p7737l6831R0195d47292d5881k26188A99256K73592B02769f7583
$$ 227256 149519 112688 202883 -447292 -45881 -272069 199256 472848 202769 -67583
17682e9840p8178D9052J88212c4635A3979J39581F2587B1972i7510G195K48736
$$ -59840 -138018 49052 237264 -34635 13979 153560 62587 21972 -97510 7195 255931
17671B55931A18983b1017j03238N68E8929J73900B4981J42634J02451A02685J59148
$$ 255931 118983 -21017 -124255 -123687 58929 232829 24981 167615 270066 102685 261833
17660B61833K3313a33558a3519C12907C536K08522G4739J84523f6471j18239Q1528
$$ 261833 285146 -133558 -13519 312907 3536 212058 74739 259262 -66471 -184710 -103182
17649a03182c5544A52553J29578a80265j05146b9338C09677j30577b23410j4162
$$ -103182 -35544 152553 282131 -180265 -285411 -29338 309677 179100 -223410 -237572
17639b37572i4345B64029m9631o4397d7421C63517a68982B71895f721B5751Q4032
$$ -237572 -94345 264029 214398 150001 -47421 363517 -168982 271895 -6721 25751 109783
17628A09783K28790A38337M1284d5906H6069F304K3775J323e2618A01144J38216
$$ 109783 338573 138337 179621 -45906 86069 6304 30079 31402 -52618 101144 239360
17617B39360B2109P8210R3247J10709F4799a8170A38050A1597b88870e158C02969
$$ 239360 22109 100319 193566 304275 64799 -18170 138050 11597 -288870 -5158 302969
17605H234L55087A6645d2880A64353c0633A17187M31754A74744a41310d0425A33438
$$ 8234 363321 16645 -42880 164353 -30633 117187 548941 174744 -141310 -40425 133438
17593B03629G6095b0050B7159a26530I8921J43015h30A39740j0748f297G5476
$$ 203629 76095 -20050 27159 -126530 98921 241936 -830 139740 128992 -6297 75476
17581c0282B07908d5179B01907J94319j97230j2885g331k27409h9896B97965A01825
$$ -30282 207908 -45179 201907 396226 198996 186111 -7331 -234740 -89896 297965 101825
17569b7730E02064H8112a61572D03573c40536K8462C6394O4700D3549J11618R3924
$$ -27730 502064 88112 -161572 403573 -340536 -312074 36394 101094 43549 155167 249091
17558B49091a38322C1043c08j96246A1769Q2317k9967K87597p9337a01290A16237
$$ 249091 -138322 31043 -308 -196554 11769 94086 64119 351716 272379 -101290 116237
17546c5237C90366j67252a28512A14723J43098q002a01160A42056B9970a97859
$$ -35237 390366 223114 -128512 114723 257821 249819 -101160 142056 29970 -197859
17535i393H1322K56551R0796A89640D710N1721K39081a913o9923o3457A02452
$$ -9393 81322 337873 428669 189640 4710 56431 295512 -1913 -71836 -135293 102452
17523A75909o6098K03613J17819O1863m251p1227A85904d1545B55892m1122G8605
$$ 175909 109811 313424 431243 493106 488855 417628 185904 -41545 255892 214770 78605
17511F3076r174O0893K09824F711J93703J61544J21495j05192o7268Q0952n1028
$$ 63076 53902 114795 324619 6711 200414 361958 483453 378261 310993 391945 340917
17500C40917A8052M53788p5208K0347k3200j08635g4155G1993a07776G5681j7932
$$ 340917 18052 471840 396632 416979 393779 285144 -74155 71993 -107776 75681 57749
17489E7749K33000R0352r3452B850L0645J78895J1206J21908j46204K1045G0128
$$ 57749 290749 381101 287649 2850 33495 212390 223596 345504 199300 220345 70128
17477C61149o2393i16B72335b1248C29669a58691C33047R952m9329A06821A9879
$$ 361149 298756 -916 272335 -21248 329669 -158691 333047 342999 293670 106821 19879
17465C35940K03941A73042G2569J99852G8427J9861K73221I9771J87087Q0774
$$ 335940 539881 173042 72569 272421 78427 98288 371509 99771 286858 367632
17455C67632b2242A78559Q1306a07654B05775g7976A74259K73709B01373J2536
$$ 367632 -22242 178559 259865 -107654 205775 -77976 174259 447968 201373 213909
17445B13909j7520c04915H2328O1897B9591J40797L5406j01419K09036l9504m4144
$$ 213909 196389 -304915 82328 144225 29591 170388 205794 104375 313411 273907 229763
17434B29763K40949j08316a255B76628f81C28669A47292J07421H1266M7337c21648
$$ 229763 470712 362396 -1255 276628 -681 328669 147292 254713 81266 128603 -321648
17422B87598E1557L78101A63355K21069q8254a03781C38030K9723f8230a858A33504
$$ 287598 51557 429658 163355 384424 296170 -103781 338030 367753 -68230 -1858 133504
17410B58667G1041n558J66895L8727J6809J2845q5795p697L25627A09712K21915
$$ 258667 71041 65483 232378 271105 287914 300759 214964 207267 532894 109712 331627
17399C31627A26960J43307j34788K61989k6793A55179R1598n9300o8363O7952
$$ 331627 126960 270267 135479 397468 370675 155179 246777 187477 119114 187066
17389A87066r3435J9217e7029E3574I80a9857C36989j06904b64133H4666m57N4848
$$ 187066 93631 112848 -57029 53574 980 -19857 336989 230085 -264133 84666 84209 139057
17377A39057o662M30296I9324j6855K95701L5981A88411H1846L09187A56626l9167
$$ 139057 132395 562691 99324 82469 378170 414151 188411 81846 391033 156626 117459
17366A17459k7185b2354C33818P7031A38053J36452J13149j45036Q0349P37q3434
$$ 117459 90274 -22354 333818 410849 138053 274505 387654 242618 322967 323704 240270
17355B40270J09104A24820a25488A36284O2558r3572a03037I3604M14708b4325
$$ 240270 349374 124820 -125488 136284 198842 105270 -103037 93604 508312 -24325
17344H2511K88281J27720B00029K22349r2088b9564A64793K07272r5431n7686
$$ 82511 370792 498512 200029 422378 330290 -29564 164793 372065 276634 218948
17334B18948K1491j16228M45410B60015A01164J44999M1926o4961L35790A45409
$$ 218948 240439 124211 569621 260015 101164 246163 288089 223128 558918 145409
17323C97932j96493n0149K57897A72470K49847R7864B07072l4644m3274K25536
$$ 397932 201439 151290 409187 172470 422317 520181 207072 172428 129154 354690
17313C54690A75360P3023D5770d2026B54395o7048k6335E844L56177j7401j15493
$$ 354690 175360 248383 45770 -42026 254395 187347 161012 5844 362021 344620 229127
17302B29127J73906j50743a89909A1703L58655A16928L45729e7781C12567A5068
$$ 229127 403033 252290 -189909 11703 370358 116928 462657 -57781 312567 15068
17291C25188L2157j37284q5414k0387a17224B44079K6070a63886B90388H6782
$$ 325188 357345 220061 134647 114260 -117224 244079 270149 -163886 290388 86782
17280A09829O6085K14145j44307E7394N3017J16524M967l7887J21911R5002D3477
$$ 109829 175914 390059 245752 57394 110411 226935 231902 194015 315926 410928 43477
17268F43808A82563J16188e8233D07635a3906A94436L02963F0506Q2531D1651
$$ 643808 182563 298751 -58233 407635 -13906 194436 497399 60506 143037 41651
17257B05053J09729J54777j83011J60254J06994k04483J21122k10380B3834K08504
$$ 205053 314782 469559 286548 446802 553796 349313 470435 260055 23834 232338
17247B32338f7503D3773M15785B29531J1822J55273n7575r532K9694f9308C53338
$$ 232338 -67503 43773 459558 229531 241353 396626 339051 329519 359213 -69308 353338
17235A80120K74929r1118a8632B93000B2873N28648A53345J39605O9799Q3656
$$ 180120 455049 363931 -18632 293000 22873 551521 153345 292950 362749 446405
17225D46405r2337O9256A58122l607O310M93371d4891C33803j16476l4181k6182
$$ 446405 354068 423324 158122 154515 160825 654196 -44891 333803 217327 183146 156964
17214A56964L07150K9748B06637J22996A24122J40741J97224j35220A47324K79019
$$ 156964 464114 493862 206637 329633 124122 264863 462087 326867 147324 426343
17204D26343j38663j0970J95957B03331J74622J4777O1043p3957j11287A20742
$$ 426343 287680 276710 472667 203331 377953 392730 453773 379816 268529 120742
17193E03335B38638L6872e3317A81134K71152A87574M72893b2783C21888j42782
$$ 503335 238638 275510 -53317 181134 452286 187574 660467 -22783 321888 179106
17183A79106K27679j5014j56086l0197L46240B74579K39917k13965j04027J49394
$$ 179106 406785 391771 235685 205488 551728 274579 514496 300531 196504 345898
17173C45898J82563J49451j42312P114p2294j69312J90126l2195K25166C10410
$$ 345898 528461 677912 535600 542714 470420 301108 491234 459039 684205 310410
17162I3912J35735L32007J26884k34767j07182p1226k4234J05400j54763L1095
$$ 93912 229647 561654 688538 453771 346589 275363 251129 356529 201766 232861
17152B32861K98160j754N6786j25411J8924A58259K92748j31456O168P7185j33245
$$ 232861 531021 529267 586053 460642 479566 158259 451007 319551 325719 402904 269659
17141B69659K20733j03370K80274j56413k8916O1582J30885j23496j01446k19595
$$ 269659 490392 387022 667296 510883 481967 543549 674434 550938 449492 229897
17131B29897L05630B53168Q8713L30769j27795r1410L35346l0739k00650B5599
$$ 229897 535527 253168 341881 672650 544855 453445 788791 758052 557402 25599
17120C51153R5535M12423l70837k14327J11803J78855B80523K88413J05230j40945
$$ 351153 446688 859111 488274 273947 385750 564605 280523 568936 674166 533221
17110E33221M1135l1255B33304J84553K54298k57152J10823K4584M9935j34234
$$ 533221 574356 543101 233304 417857 672155 415003 525826 550410 600345 466111
17100D66111K72454J3683C50157K42625k16690J38291n1089J89390j14148j72503
$$ 466111 738565 752248 350157 592782 376092 514383 463294 652684 538536 366033
17090C66033M4414K72065j87526J54076O7734C30392J51567m7529N37506k68049
$$ 366033 410447 682512 494986 649062 716796 330392 481959 434430 971936 703887
17080G03887o6650K01024k12390B81155L43124K06326B75283M91060m5844K1320
$$ 703887 637237 838261 625871 281155 624279 830605 275283 766343 720499 741819
17070G41819j07478L8456J29369r0230k37123L30070P011j51274k4220j42055
$$ 741819 634341 672797 802166 711936 474813 804883 811894 660620 636400 494345
17060D94345J37930r5965J64001K08017j49936K27684k37400J37428l1956j60593
$$ 494345 632275 536310 700311 908328 758392 986076 748676 886104 854148 693555
17050F93555L8551r2383L62588l54130J02721k27499L66411j11787K25070P2158
$$ 693555 732106 639723 1002311 648181 750902 523403 889814 778027 1003097 1075255
17040A075255D41241K11984j37743N46311j76058j84038L63651n20364N62983
$$ 1075255 441241 653225 515482 1061793 885735 701697 1065348 544984 1107967
17031A107967l94725J6224J28858J11859n6425k9964k60335N39873l66776p3318
$$ 1107967 713242 729466 858324 970183 913758 883794 623459 1163332 796556 723238
17021G23238M13845n00190J90454K81673M1335J35981l33321J6669m5888J92294
$$ 723238 1137083 636893 827347 1109020 1150355 1286336 953015 969684 923796 1116090
17011A116090L39868p11415K87429J7372j32539Q3796J75463l66612L93662k01550
$$ 1116090 1455958 744543 1031972 1049344 916805 1000601 1176064 809452 1203114 1001564
17001A001564N6567J93314o4060j7132j75067L30195J50665o09072M36116n36890
$$ 1001564 1058131 1251445 1187385 1170253 995186 1325381 1476046 866974 1303090 766200
16991G66200N48394q0747l7739j33081K23074j6253j79507k5467K80739l76547
$$ 766200 1314594 1233847 1196108 1063027 1286101 1269848 1090341 1064874 1345613 969066
16981I69066M23582n8517L3005r6778N0140M39344k48357j27508M8835j8881k7492
$$ 969066 1392648 1334131 1367136 1270358 1320498 1759842 1511485 1383977 1432812 1413931 1386439
16970A386439j18775N05779o37810L56709J23216j52259L30898m13264O07699
$$ 1386439 1267664 1773443 1135633 1492342 1615558 1463299 1794197 1380933 1988632
16961A988632j09353k98437L74081m44989N1354K07716j82577K73266O9772r1540
$$ 1988632 1879279 1580842 1954923 1509934 1561288 1769004 1586427 1859693 1929465 1837925
16951A837925L2219r3487l31034J22952K22653j54048n1676L73681j54574P8133
$$ 1837925 1870144 1776657 1445623 1568575 1791228 1637180 1585504 1959185 1804611 1882744
16941A882744k1099N4012K9707o8050p3927L35098k68796K31404K08659l86862
$$ 1882744 1861645 1915657 1945364 1877314 1803387 2138485 1869689 2101093 2309752 1922890
16931A922890K78545M5948j24961j26955K70077J20940k64953L3505L1685K70720
$$ 1922890 2201435 2247383 2122422 1995467 2265544 2386484 2121531 2155036 2186721 2457441
16921B457441k79321K19565K83795j12837L0525l29559K79237J23879l60161M18646
$$ 2457441 2178120 2397685 2681480 2568643 2599168 2269609 2548846 2672725 2312564 2731210
16911B731210n11748L81247J79772l009k62032K84878R4241r9663J83631l27428
$$ 2731210 2219462 2600709 2780481 2777472 2515440 2800318 2894559 2794896 2978527 2651099
16901B651099M54914l22829J86025J05081K2939L09556k06240L9133J58951J44977
$$ 2651099 3106013 2783184 2969209 3074290 3097229 3406785 3200545 3239678 3398629 3543606
16891C543606j40306L75278n73453P4726J30362J62098P1255K55155p8571j33515
$$ 3543606 3403300 3778578 3205125 3279851 3410213 3572311 3643566 3898721 3820150 3686635
16881C686635J11372j41662K15789L61159l79091N4132J48001J82229l5249K70401
$$ 3686635 3798007 3656345 3872134 4233293 3854202 3908334 4056335 4238564 4203315 4473716
16871D473716k52808J36001J92418q8818N66936l88387j97261M83330K1328L70715
$$ 4473716 4220908 4356909 4549327 4460509 5027445 4639058 4441797 4925127 4946455 5317170
16861E317170j07599m7776j798j6416J51091K02591j18325L24870j29073J54610
$$ 5317170 5209571 5161795 5159997 5143581 5294672 5497263 5378938 5703808 5574735 5729345
16851E729345K73578K7618o310l6111K90455j76579K52797M00579N5784R6661
$$ 5729345 6002923 6030541 6024231 5988120 6278575 6101996 6354793 6755372 6811156 6907817
16841F907817K85020k79214L15579L13425l41696M25840j47745L37663K10109
$$ 6907817 7192837 6913623 7229202 7542627 7200931 7626771 7479026 7816689 8026798
16832H026798K47377J45336l61568N88016J72997k34840L91496L39243L5888l9918
$$ 8026798 8274175 8419511 8057943 8645959 8818956 8584116 8975612 9314855 9350743 9310825
16822I310825K33081L06732L60888K80635l5407N67026n8940L20078J03735M72970
$$ 9310825 9543906 9850638 10211526 10492161 10456754 11023780 10964840 11284918 11388653 11861623
16812A1861623K88732p1609M27464N11633P759K08209N15369J89543M13463R6998
$$ 11861623 12150355 12078746 12506210 13017843 13025602 13233811 13749180 13938723 14352186 14449184
16802A4449184O97388J41373K75569O35461M15581J03862L60489M78890N68144
$$ 14449184 15146572 15287945 15563514 16198975 16614556 16718418 17078907 17557797 18125941
16793A8125941J99138O96466P03160L69453M91341M58868P24964P11801M79168
$$ 18125941 18325079 19021545 19724705 20094158 20585499 21044367 21769331 22481132 22960300
16784B2960300O56638K23323P76863M80582Q29743Q51561Q48901P24843P81436
$$ 22960300 23616938 23840261 24617124 25097706 25927449 26779010 27627911 28352754 29134190
16775B9134190O71701P03760J166399M94026J395674R16110J080948J029731Q12203
$$ 29134190 29805891 30509651 31676050 32170076 33565750 34481860 35562808 36592539 37404742
16766C7404742J184562J273139J309242P74050J297336J444262J139341J664418
$$ 37404742 38589304 39862443 41171685 41945735 43243071 44687333 45826674 47491092
16758D7491092J246903J433560J607760J573665J293411J826791J243553K051822
$$ 47491092 48737995 50171555 51779315 53352980 54646391 56473182 57716735 59768557
16750E9768557J502391J319608J807433J526030J492493J787965J481204J670286
$$ 59768557 61270948 62590556 64397989 65924019 67416512 69204477 70685681 72355967
16742G2355967J346689J741826J319757J418750J257745J655745P84847J071759
$$ 72355967 73702656 75444482 76764239 78182989 79440734 81096479 81881326 82953085
16734H2953085Q64352J101146L07819J099165J13022M58192K77470Q1199m33832
$$ 82953085 83817437 84918583 85226402 86325567 86438589 86896781 87174251 87255450 86821618
16725H6821618k40713r0477p20810n70739r46325q98216p43417j365433j154993
$$ 86821618 86580905 86490428 85769618 85198879 84252554 83354338 82610921 81245488 80090495
16716H0090495j103162j511473j200279j396338j301780j925101j158449j794515
$$ 80090495 78987333 77475860 76275581 74879243 73577463 71652362 70493913 68699398
16708F8699398j600383j595007j670438j241658j671361j680186j277681j554088
$$ 68699398 67099015 65504008 63833570 62591912 60920551 59240365 57962684 56408596
16700E6408596j632336j624501j150036j721035j275750j580344p93939j350182
$$ 56408596 54776260 53151759 52001723 50280688 49004938 47424594 46630655 45280473
16692D5280473r89389j945295m36209j509816j171795r48538r24651j119845j043215
$$ 45280473 44291084 42345789 41909580 40399764 39227969 38279431 37354780 36234935 35191720
16683C5191720p87477j258419n13323j090197p60693j113257m20828o70411q19778
$$ 35191720 34404243 33145824 32632501 31542304 30781611 29668354 29247526 28577115 27757337
16674B7757337o99241p73367o75836l60590n29868o54277o77526l49693j163642
$$ 27757337 27058096 26284729 25608893 25248303 24718435 24064158 23386632 23036939 21873297
16665B1873297k09392l04571l36025n68874n16390n84245l23444k91824o31637
$$ 21873297 21663905 21359334 21023309 20454435 19938045 19353800 19030356 18738532 18106895
16656A8106895m98723J07124p78332k75882l28769j88336l33426m61218j11702
$$ 18106895 17608172 17715296 16936964 16661082 16332313 16143977 15810551 15349333 15237631
16647A5237631p50880r4376j476o56059r345j12401k73837k44246p06389j12146
$$ 15237631 14486751 14392375 14390899 13734840 13725495 13613094 13339257 13095011 12388622 12276476
16637A2276476j80432l82788l0646l26459L40210o72438l54111P4301m33929N6402
$$ 12276476 12096044 11713256 11682610 11356151 11696361 11023923 10669812 10744113 10310184 10366586
16627A0366586m15972J62460j70853o6908j62094k52766j88745j68335l00392
$$ 10366586 9950614 10113074 9942221 9875313 9713219 9460453 9271708 9103373 8802981
16618H802981L1067j62320J08214r2469m97365J09345j75331k71585k50552M07187
$$ 8802981 8834048 8671728 8779942 8687473 8190108 8299453 8124122 7852537 7601985 8009172
16608H009172m5939j91290m63731k08460J76995m03865K445j7507J75425n0922
$$ 8009172 7963233 7771943 7308212 7099752 7276747 6872882 6875327 6857820 7033245 6982323
16598F982323o78997J94714j07492m2071k41425M07141m70769k87547J21581Q007
$$ 6982323 6303326 6498040 6390548 6348477 6107052 6514193 6043424 5755877 5877458 5885465
16588E885465N0725O2021l53671l957K09507l52642o2553k6972P7836k86569l42646
$$ 5885465 5936190 5998211 5644540 5640583 5850090 5497448 5434895 5407923 5485759 5199190 4856544
16577D856544J86047M0040j06736j83826R6747L49572k97019m54551j34763K68648
$$ 4856544 5042591 5082631 4975895 4792069 4888816 5238388 4941369 4486818 4352055 4620703
16567D620703j14280j07501K07037k46689J77925j38819k0782m6396j29375r0085
$$ 4620703 4506423 4398922 4605959 4359270 4537195 4398376 4377594 4331198 4201823 4111738
16557D111738j52846L01474L9088K34592n94900J73373l45931J99041k25514k90
$$ 4111738 3958892 4260366 4299454 4534046 3939146 4112519 3766588 3965629 3740115 3739825
16547C739825J1909k77589p0924J09875O5298L1595k24111l77471N08714k06443
$$ 3739825 3751734 3474145 3403221 3513096 3578394 3609989 3385878 3008407 3517121 3310678
16537C310678J6022O1480l64903j53056M11468j75407r3403M36712l66069l5890
$$ 3310678 3326700 3388180 3023277 2870221 3281689 3106282 3012879 3449591 3083522 3047632
16527C047632k36192J90617J98358j21528J30840k22505J28053j03048l7762J50669
$$ 3047632 2811440 3002057 3200415 3078887 3209727 2987222 3115275 3012227 2974465 3125134
16517C125134n66716L55325k74625N47193j09958n57063L39892l16935K89089
$$ 3125134 2558418 2913743 2639118 3186311 3076353 2519290 2859182 2542247 2831336
16508B831336l68567K45901K25116n06199J53410L76948o3487m98168M4880J62042
$$ 2831336 2462769 2708670 2933786 2427587 2580997 2957945 2894458 2396290 2441170 2603212
16498B603212k15578M11009l24442k45107L75410m21406O11878k65627l12458
$$ 2603212 2387634 2798643 2474201 2229094 2604504 2183098 2794976 2529349 2216891
16489B216891J17152Q767J74569m99034J39283j64287J31804L27602m40928L74958
$$ 2216891 2334043 2342810 2517379 2018345 2157628 1993341 2125145 2452747 2011819 2386777
16479B386777k10239J01946o290r697J98171J67018m76426m34498J89857J87763
$$ 2386777 2176538 2278484 2272194 2262497 2460668 2627686 2151260 1716762 1906619 2094382
16469B094382q488j79550K71639n24856J91479L8932J70537N6342n7915J07978
$$ 2094382 2085894 1906344 2177983 1653127 1844606 1883538 2054075 2110417 2052502 2160480
16459B160480o5649o052j82751J48452m06519M03155j07699n20525M69753k49648
$$ 2160480 2094831 2088779 1906028 2054480 1647961 2051116 1943417 1422892 1892645 1642997
16449A642997L8178J40221j37432K83160j23177J68442k60452K20308R9370k86945
$$ 1642997 1681175 1821396 1683964 1967124 1843947 2012389 1751937 1972245 2071615 1784670
16439A784670K07543k44646o2421J6367j47018q8381M23205j91641J99015M7270
$$ 1784670 1992213 1747567 1685146 1701513 1554495 1466114 1889319 1697678 1896693 1943963
16429A943963l44523N574o2989J69067j26462q9023r106J98995l35412L83408
$$ 1943963 1599440 1605014 1542025 1711092 1584630 1495607 1486501 1685496 1350084 1733492
16419A733492l47789K57453l33016j69857K97080R0701j40413J41025j44923K08318
$$ 1733492 1385703 1643156 1310140 1140283 1437363 1528064 1387651 1528676 1383753 1592071
16409A592071k9527k54727R0021J32727j12926M8813J86508p7078r223p5081j18915
$$ 1592071 1562544 1307817 1397838 1530565 1417639 1466452 1652960 1575882 1566659 1491578 1372663
16398A372663L38432l56213J66069j79401j94388m768k1236J8925K01331L0160
$$ 1372663 1711095 1354882 1520951 1341550 1147162 1142394 1121158 1140083 1341414 1371574
16388A371574O4270k91083O1115J73988j5457n7148R0701k79930J51380J97231
$$ 1371574 1435844 1144761 1205876 1379864 1364407 1307259 1397960 1118030 1269410 1466641
16378A466641j28571m3785Q6914j10423k34384O4552J25730N0075j30342J61217
$$ 1466641 1338070 1294285 1381199 1270776 1036392 1100944 1226674 1276749 1146407 1307624
16368A307624m29014M03090l44838K6963K90912J06240q4423K0123j82593K2936
$$ 1307624 878610 1281700 936862 963825 1254737 1360977 1276554 1296677 1114084 1137020
16358A137020j22584k5808K93735J823j78473j65626K85169m67761J68957M78175
$$ 1137020 1014436 988628 1282363 1284186 1105713 940087 1225256 757495 926452 1404627
16348A404627n21662J41352k1221K90632j15251J9230L9874l38132N8275K11448
$$ 1404627 882965 1024317 1003096 1293728 1178477 1197707 1237581 899449 957724 1169172
16338A169172l155k53504L12649p8398l59918M29626j79158k2664L1089j1523
$$ 1169172 1166017 912513 1225162 1146764 786846 1216472 1037314 1014650 1045739 1034216
16328A034216Q2859J24473j71981r3023L7765k6322m4339j42527K25028l00346
$$ 1034216 1117075 1241548 1069567 976544 1014309 987987 943648 801121 1026149 725803
16318G25803M02690m63872L85040k62291J70282K48556m15933Q0941j81807K97466
$$ 725803 1128493 664621 1049661 787370 957652 1206208 790275 871216 689409 986875
16308I86875k07981j47498N38156j14259k59760J62973J23811m84930J90190J83617
$$ 986875 778894 631396 1169552 1055293 795533 958506 1082317 597387 787577 971194
16298I71194k21690J73808k07105M7775O2072J89465l65038k0549L78141R2244
$$ 971194 749504 923312 716207 763982 826054 1015519 650481 629932 1008073 1100317
16288A100317k76362k7765J64265j88939k13597J68050l5036j56159K84596j47718
$$ 1100317 823955 796190 960455 771516 557919 725969 690933 534774 819370 671652
16278F71652N69589D57247O85370m44542K20226q8525k92001L62207k48169J91574
$$ 671652 1241241 457247 1142617 698075 918301 829776 537775 899982 651813 843387
16268H43387j63989J81662l06495L53007n6609j81510M53514n36556M3711K95248
$$ 843387 679398 861060 554565 907572 850963 669453 1122967 586411 630122 925370
16258I25370k72692J13315r5595l690Q7058o3056o3495R7562J56543k68122J30725
$$ 925370 652678 765993 670398 666708 753766 690710 627215 724777 881320 613198 743923
16247G43923k52996r4429M32911n7605J86486k00323j66262M5355L36736l84260
$$ 743923 490927 396498 829409 771804 958290 757967 591705 637060 973796 589536
16237E89536l3244J53408N2576l15937J71768j45743K1802P1193l9335K08525
$$ 589536 556292 709700 762276 446339 618107 472364 494166 565359 526024 734549
16227G34549l7000k90273K67814q4190j35836L49597l13370k3023O7579r2545
$$ 734549 697549 407276 675090 590900 455064 804661 491291 468268 535847 443302
16217D43302J94898R9617k52682J73885k47304J13424J92359q6156J88711j43265
$$ 443302 638200 737817 485135 659020 411716 525140 717499 631343 820054 676789
16207F76789A51301P50878D50387o4805M48161C97113M58307J20520D23979R7549
$$ 676789 151301 902179 450387 385582 833743 397113 855420 975940 423979 521528
16197E21528j51466J18609j3805R6882m7723J64206k80960J99742K25191l36225
$$ 521528 370062 488671 474866 571748 524025 688231 407271 607013 832204 495979
16187D95979Q8789J30904l56605J03890r218K91857l33095A78103K60861A43960
$$ 495979 584768 715672 359067 462957 453739 745596 412501 178103 438964 143960
16176G08521B25491J93142p7629L20910C30668E2579M78672j61420l8434L1528
$$ 708521 225491 418633 341004 661914 330668 52579 531251 369831 331397 362925
16166C62925N5505K05050k03519l7212H7537M49374j14467K54010k25003p2174
$$ 362925 418430 623480 419961 382749 87537 536911 422444 676454 451451 379277
16156C79277J84719j26909A30311Q5248J67288m0450D0028P27661C5489h759C92223
$$ 379277 563996 437087 130311 215559 382847 342397 40028 767689 35489 -8759 392223
16144C31706m6781q3056J67681J17761q3404J11727r5863A43141K7193L67297
$$ 331706 284925 201869 369550 487311 403907 515634 419771 143141 170334 537631
16134E37631R9245A53788l0434K03116k8394k6547R3795l2657M09778C34086P0698
$$ 537631 636876 153788 123354 326470 298076 271529 365324 332667 742445 334086 404784
16123D04784A47733m0173K64457M5431J34502f2499F25981A33653J68277A29301
$$ 404784 147733 107560 372017 417448 551950 -62499 625981 133653 301930 129301
16112E21509A85291K24446j66770G1299J79087K599G8084K8029K56897J92658
$$ 521509 185291 409737 242967 71299 250386 252985 78084 106113 363010 555668
16102E55668k26502j0704k7237L1764J39868A09964J08691p6429j7965K04669
$$ 555668 329166 318462 291225 322989 462857 109964 218655 142226 124261 328930
16092C28930M1258a0589A98020L1414k4356f3508B44985j20768K00494H1976K37244
$$ 328930 370188 -10589 198020 229434 205078 -63508 244985 124217 324711 81976 319220
16081C19220n0767B4234O4171L26470j23986o6758P6318j36001c03755B90202
$$ 319220 268453 24234 88405 414875 290889 224131 300449 164448 -303755 290202
16070B39922A1300K43308J58872e9823A90396M09381C2773L23398j73574J71668
$$ 239922 11300 254608 413480 -59823 190396 599777 32773 356171 182597 354265
16060C54265A42972A4888O2864K65322h1496A70032K0657B649K56051J29664A29911
$$ 354265 142972 14888 77752 343074 -81496 170032 190689 2649 258700 388364 129911
16048C96204A34156J38408J62125M2849A37256M9969K47724a8482A93321p114
$$ 396204 134156 272564 434689 477538 137256 187225 434949 -18482 193321 186207
16038A86207L7431n2369G0535Q3360k1219M37067j43668A34884K89898A2415K53714
$$ 186207 223638 171269 70535 153895 132676 569743 426075 134884 424782 12415 266129
16027B66129L35248A62740M6087e2301j7911B29255C6040R8873Q92L32772I6046
$$ 266129 601377 162740 208827 -52301 -70212 229255 36040 134913 135805 468577 96046
16015A94461m6665K59854A62975m1804f0835j12006b0580A15419P0289L34852
$$ 194461 147796 407650 162975 121171 -60835 -172841 -20580 115419 185708 520560
16005E20560c2261A68995l7476J05570a40767b7430E6012K64923M5554a51560
$$ 520560 -32261 168995 131519 237089 -140767 -27430 56012 320935 366489 -151560
15994B45463K8449j20792b3853C27167J96184I974L58000J52278N48128n03401
$$ 245463 273912 153120 -23853 327167 523351 9974 367974 520252 1068380 564979
15984E64979k4113j88491a91226A67023b3853C21518a44577C99655A85330K64805
$$ 564979 540866 352375 -191226 167023 -23853 321518 -144577 399655 185330 450135
15974D50135k8126a49168M8769D06449A33915C4633J03363n6777K26260c2612
$$ 450135 422009 -149168 -100399 406449 133915 34633 137996 81219 307479 -32612
15963f529A93600E2574b30473B12610a18940B88638F7338K38453a1060B34122
$$ -6529 193600 52574 -230473 212610 -118940 288638 67338 305791 -11060 234122
15952C64626j49447e3832m0283n5954f6202k79203B19230a3113j9685k30113D2949
$$ 364626 215179 -53832 -94115 -150069 -66202 -345405 219230 -13113 -32798 -262911 42949
15940f4835j22540B9507d5255A02022f129m23856B6001R2471A3016L67139N2534
$$ -64835 -187375 29507 -45255 102022 -6129 -429985 26001 118472 13016 380155 432689
15929D32689A87689L02297H8622K14926j5632a110C41809G0805M3045J07687a0533
$$ 432689 187689 489986 88622 303548 287916 -1110 341809 70805 113850 221537 -10533
15917A27360a9849C34811h9533B99996R65m5764b30030F9522J88712J61326b55015
$$ 127360 -19849 334811 -89533 299996 300961 255197 -230030 69522 258234 419560 -255015
15905b9717A03374C2560K5222K14273E2704O790a05820B77009A0192K64727j22183
$$ -29717 103374 32560 57782 272055 52704 59494 -105820 277009 10192 274919 152736
15894A52736b28225J7708P1583L2305b8005A28991J42508A15794l5193B6541K42946
$$ 152736 -228225 -210517 -138934 -106629 -28005 128991 271499 115794 80601 26541 269487
15883B69487K31525F6158a28443j99241e8032j3527m9790A38909A9510d810F2432
$$ 269487 501012 66158 -128443 -327684 -58032 -71559 -121349 138909 19510 -4810 62432
15871a0045C10924a31068A32829j5382J93935a4442A19445n2708J6732J33861
$$ -10045 310924 -131068 132829 117447 311382 -14442 119445 66737 83469 217330
15861B17330C5841i6416k01273A88052a44891A18386b51705b6197A97102b2784
$$ 217330 35841 -96416 -297689 188052 -144891 118386 -251705 -26197 197102 -22784
15850a43888r4580c7094k44830m8462N3515B2136a88394B48325a50470g3916A71021
$$ -143888 -238468 -37094 -281924 -330386 -276871 22136 -188394 248325 -150470 -73916 171021
15838B84562a92365B0108i6756k07479e5575j87110C30334b47447h4959A7760
$$ 284562 -192365 20108 -96756 -304235 -55575 -242685 330334 -247447 -84959 17760
15827B67025a74117k26934k308C7558A7849d3302A16513a21104r1831a5767A55482
$$ 267025 -174117 -401051 -403359 37558 17849 -43302 116513 -121104 -212935 -15767 155482
15815B30115a25351a1125j91319Q7884A47435b26391A81694k3846o099o1900l84
$$ 230115 -125351 -11125 -202444 -114560 147435 -226391 181694 157848 151749 89849 89465
15804H9465b9159A12405b15783I9176K4335c9991C25638j22294K5460f767A93418
$$ 89465 -29159 112405 -215783 99176 123511 -39991 325638 203344 228804 -6767 193418
15792A86113c609j20261a1552j78036a2298D5277a20054r9378B54677j09848p2002
$$ 186113 -3609 -123870 -11552 -189588 -12298 45277 -120054 -219432 254677 144829 72827
15781G2827Q1880j3589L9043a6734B69336a25910B13990H0713N340g59j01160
$$ 72827 154707 141118 180161 -16734 269336 -125910 213990 80713 86053 -759 -101919
15770a01919B13565B3612N4425f8129h178C72264d3815k1696A0861i0641B4664
$$ -101919 213565 23612 78037 -68129 -8178 372264 -43815 -65511 10861 -90641 24664
15758B10591b2960D54832b2983l55987D1232a79404G1275a38913k51041A4172
$$ 210591 -22960 454832 -22983 -378970 41232 -179404 71275 -138913 -389954 14172
15747a7578j3161D119c1089j61956L4650o4123A32396J15687d4844k28876B52650
$$ -17578 -30739 4119 -31089 -193045 -158395 -222518 132396 248083 -44844 -273720 252650
15735A57196n9973J87067o3553a3584j1110l96256J83984Q9371r4292E6674A527
$$ 157196 97223 284290 220737 -13584 -24694 -420950 -236966 -147595 -241887 56674 1527
15723a74998G7281b56908d8660G921d24938a11892D1903J78398b6849n8922j60920
$$ -174998 77281 -256908 -48660 7921 -424938 -111892 41903 220301 -26849 -85771 -246691
15712b46691J02270d8157h558A00375B3504c64659B85487b360A65377b5424B32357
$$ -246691 -144421 -48157 -8558 100375 23504 -364659 285487 -2360 165377 -25424 232357
15700h6279E181d2372r7076G9449P54b15718B02752J46015g684B10732B810L51644
$$ -86279 5181 -42372 -139448 79449 80203 -215718 202752 348767 -7684 210732 2810 354454
15688C54454c8909a8954m262A08036a58316A637J7844L6114A8477e1249k70397
$$ 354454 -38909 -18954 -23216 108036 -158316 1637 19481 55595 18477 -51249 -321646
15677c21646a46424J0234A36465j6390C5551i6845B44363a3719j37143l4338E0223
$$ -321646 -146424 -136190 136465 120075 35551 -96845 244363 -13719 -150862 -185200 50223
15665a52916A62913a889A62401a26106H9140K7111a55302g0533m4906C91776j50752
$$ -152916 162913 -1889 162401 -126106 89140 116251 -155302 -70533 -115439 391776 241024
15654B41024j4582a40287a3049G7326g8651q7132L5714j2429A62721O4566c6918
$$ 241024 226442 -140287 -13049 77326 -78651 -165783 -130069 -142498 162721 227287 -36918
15642b3805l4890b0101q4151k57054A84458o4335a58029A52241P4769j02045O0433
$$ -23805 -58695 -20101 -104252 -361306 184458 120123 -158029 152241 227010 124965 185398
15631A85398a63758j3182B62877J1494a18850j04203P5353B19525h1299O178k23071
$$ 185398 -163758 -176940 262877 274371 -118850 -223053 -147700 219525 -81299 -75121 -298192
15620b98192B38932a03197j05970p9032E1483L0860c20244A18790Q7717a28936
$$ -298192 238932 -103197 -209167 -288199 51483 82343 -320244 118790 206507 -128936
15609a71794j8312G7432A0627M20359f5443A35141c7381A1463a86417F2807A8400
$$ -171794 -190106 77432 10627 430986 -65443 135141 -37381 11463 -186417 62807 18400
15597a08936g789k87762H9745J11363f2853b0364k59376f4309n7080B3949a428
$$ -108936 -7789 -295551 89745 201108 -62853 -20364 -279740 -64309 -121389 23949 -1428
15585a7517j12434l3446A03906d9584j48907A68514a05788d1381a2984C28297
$$ -17517 -129951 -163397 103906 -49584 -198491 168514 -105788 -41381 -12984 328297
15574B31148b87292A70383J4049b51248h2501A47197a0847B03130r5380b0561
$$ 231148 -287292 170383 184432 -251248 -82501 147197 -10847 203130 107750 -20561
15563B06865B4018L38069a61289D6905a4746A19719A0702c5717l39412a3189F3433
$$ 206865 24018 362087 -161289 46905 -14746 119719 10702 -35717 -375129 -13189 63433
15551A99291g9414B07195m5889a04405L3278A30064b5157k68778e5838q238D11482
$$ 199291 -79414 207195 161306 -104405 -71127 130064 -25157 -293935 -55838 -64076 411482
15539b46567A38712a22690k4250B48260C4394R3597i3288j1125C9621L4561P9294
$$ -246567 138712 -122690 -146940 248260 34394 127991 -93288 -104413 39621 74182 153476
15528A53476F2327a50158A04547D627L1563O1366a46834a5956j09733F9607B1040
$$ 153476 62327 -150158 104547 4627 36190 97556 -146834 -15956 -125689 69607 21040
15516A73566C1482f1276C59230g8765B15000p1360b08562b14o9216A49623C3936
$$ 173566 31482 -61276 359230 -78765 215000 143640 -208562 -214 -69430 149623 33936
15504a54471B73403E7711R5812e9496n3594H4095m490O1868P1116A8079g3996
$$ -154471 273403 57711 153523 -59496 -113090 84095 79605 141473 212589 18079 -73996
15492b35700J07998c7543k02061O2710A56525I891K0364D309R0073L9415n1701
$$ -235700 -127702 -37543 -239604 -176894 156525 9891 30255 4309 94382 133797 82096
15481H2096c25686B20949J08930j23212R1106G1610f2382C56166b6692A78891
$$ 82096 -325686 220949 329879 206667 297773 71610 -62382 356166 -26692 178891
15470B8197a72190B5918a10771B25488b06437D5120b6870I2886e8277A84501q1081
$$ 28197 -172190 25918 -110771 225488 -206437 45120 -26870 92886 -58277 184501 103420
15459A03420f0081A02645K05142c25578a21123r5645A99074J77353b01167C122
$$ 103420 -60081 102645 307787 -325578 -121123 -216768 199074 376427 -201167 3122
15448e4615G7743f3114B37953K90235G4976L90923j87877L41133A10050b99289
$$ -54615 77743 -63114 237953 528188 74976 465899 278022 619155 110050 -299289
15437B1197K40422F963L85216A56624c124k20124K9687E3932A6402J40519J9283
$$ 21197 261619 6963 392179 156624 -3124 -223248 -193561 53932 16402 156921 176204
15426A76204e4650F756J19488K97238d979D7950J11037a69129I2159f6246k97607
$$ 176204 -54650 6756 126244 423482 -4979 47950 158987 -169129 92159 -66246 -363853
15415c63853B17788b51806A09143M733a25441m321A85522a11831e1650F5533b88758
$$ -363853 217788 -251806 109143 113876 -125441 -129762 185522 -111831 -51650 65533 -288758
15403B9632h0335m6612A23332B150a55405L051B13492f2091C35427n7060A7619
$$ 29632 -80335 -126947 123332 2150 -155405 -152354 213492 -62091 335427 278367 17619
15391i8839C0372J74084l1535a0459j0118B60555L6266c3581D89c7296B60167
$$ -98839 30372 204456 172921 -10459 -20577 260555 296821 -33581 489 -37296 260167
15379A87295E7951O4438J88266B3035b44823C61937A49907m9874K95490L370a7125
$$ 187295 57951 122389 310655 23035 -244823 361937 149907 100033 395523 398893 -17125
15367A68977I077i0340D73808A7965R0471b05700A22704L22022D5398a8749B4146
$$ 168977 9077 -90340 473808 17965 108436 -205700 122704 444726 45398 -18749 24146
15355c84382b2989A61445p8655R9524A3505a0777k5597D63251c04568C54987a20002
$$ -384382 -22989 161445 82790 182314 13505 -10777 -36374 463251 -304568 354987 -120002
15343A84181p7617j0332l1624K79864E1000I555K27522r1323b12266A28190f3167
$$ 184181 106564 96232 64608 344472 51000 9555 237077 145754 -212266 128190 -63167
15331a64500D4665J41711j0187Q5913G7690K88757E2583a71808H3707K9959m9723
$$ -164500 44665 186376 176189 262102 77690 366447 52583 -171808 83707 113666 63943
15320F3943b54950B7026E827b68350A37167k654J99661A61615P8407F3081Q101
$$ 63943 -254950 27026 5827 -268350 137167 134513 334174 161615 240022 63081 71182
15309G1182J02730q5000O651J76296r7394l3327Q0804b29963B73534K3938C6501
$$ 71182 173912 88912 95563 271859 174465 141138 221942 -229963 273534 297472 36501
15297a43377r5523D6379K21182a06589H8277h1265l261A27571B2275K57734F869
$$ -143377 -238900 46379 267561 -106589 88277 -81265 -84526 127571 22275 280009 6869
15285b87126D710b32509H7061l7334h0646A86935c23141A98822b30569B21346
$$ -287126 4710 -232509 87061 49727 -80646 186935 -323141 198822 -230569 221346
15274E5972L02101f431B22375A4877K3290A5645J5339A3557N1682Q1536b419B85322
$$ 55972 358073 -6431 222375 14877 38167 15645 30984 13557 65239 146775 -2419 285322
15261A75837B9851K59353G0570f6250F1166L8757B1831P5898k0463c0103B16862
$$ 175837 29851 289204 70570 -66250 61166 99923 21831 97729 77266 -30103 216862
15249E65891L28365N64011L8304m71830M62126C78598l3837b2371n6183B37265
$$ 565891 894256 1458267 1496571 1024741 1486867 378598 344761 -22371 -78554 237265
15238A50054f3705H9515l592R150K30452A61640b3069j04950M5791b1345B56243
$$ 150054 -63705 89515 85923 95073 325525 161640 -23069 -128019 -82228 -21345 256243
15226a37256A26228N6363q7402a59323A40120R3396F7095P511b60592A71105O5319
$$ -137256 126228 182591 95189 -159323 140120 233516 67095 74606 -260592 171105 236424
15215B36424j12438h8151c9754A13305J07733k6330M8656a89510G5143J07175
$$ 236424 123986 -88151 -39754 113305 221038 194708 243364 -189510 75143 182318
15205A82318a08585B9634L90795j16295a3526j90411A04436c39502B51943D6880
$$ 182318 -108585 29634 420429 304134 -13526 -203937 104436 -339502 251943 46880
15194G8239k341h3368B38702A8452L82351b14232f0218j2365B49293K00428e04128
$$ 78239 75898 -83368 238702 18452 400803 -214232 -60218 -72583 249293 449721 -504128
15182b81387G7076R9246R2119a6136k29457A99831r4910h7043B90740p8600a39438
$$ -281387 77076 176322 268441 -16136 -245593 199831 104921 -87043 290740 212140 -139438
15170C1022K90020c1447l0536C23450e19689A18448c8951A51679B2051J5594P8911
$$ 31022 321042 -31447 -61983 323450 -519689 118448 -38951 151679 22051 37645 116556
15159A16556J701K21908g6216C8033R542R5794a70877a1480C96774a09509n9525
$$ 116556 118257 340165 -76216 38033 47575 143369 -170877 -11480 396774 -109509 -169034
15148a69034C9171Q0226J70154G1112e2367A97124j4773H8536L43724j75118C410
$$ -169034 39171 119397 289551 71112 -52367 197124 182351 88536 432260 257142 3410
15136i386J65B17360N287p7074d6112C04648A38238J66637I5974M4771g7866A86715
$$ -9386 -9221 217360 222647 145573 -46112 304648 138238 304875 95974 140745 -77866 186715
15123c6035C27428F7420M8278J18636m1156K1148J09053E678K2001J74578J59871
$$ -36035 327428 67420 115698 234334 193178 214326 323379 5678 27679 202257 362128
15112C62128j54200J53984A22097k519p048D7851J71616Q5903A51887m9719a27290
$$ 362128 207928 361912 122097 119578 112530 47851 219467 305370 151887 102168 -127290
15100A4042K33038a46435A35681D693J49707K88662r8940A07229K25966A66156
$$ 14042 247080 -146435 135681 4693 154400 443062 344122 107229 333195 166156
15089A79420J69700A73502f7605H8685J18871g864C43182B7351J54450J83219
$$ 179420 349120 173502 -67605 88685 207556 -7864 343182 27351 181801 365020
15079C65020b6580H5166J70995D5047a11799B43244B7794g4422F1087f2382F3295
$$ 365020 -26580 85166 256161 45047 -111799 243244 27794 -74422 61087 -62382 63295
15067C11913j17275k0439J39525d6140j9216H0556r893K60239A51924F9426K52476
$$ 311913 194638 174199 313724 -46140 -65356 80556 70663 330902 151924 69426 321902
15056C21902k2470j09180J94404c5649B82674p8143Q4670J34884P6080A61975
$$ 321902 299432 190252 384656 -35649 282674 204531 289201 424085 500165 161975
15045E1595J52319M1575J18500j29044e5491A06205P5437R6269J95680A87963
$$ 51595 203914 245489 363989 234945 -55491 106205 181642 277911 473591 187963
15034H408M39760A93466R0011J27810n6572K5565r9463L79740j55937j43404D4129
$$ 8408 448168 193466 283477 411287 354715 380280 280817 660557 504620 361216 44129
15022D55234m4824p8799j25258P8550e9175B29841K38541B26526H8094J27398
$$ 455234 410410 331611 206353 284903 -59175 229841 468382 226526 88094 215492
15012B15492I8815K3733J41263H1314K60176c9913B26868J36283A48592L20224
$$ 215492 98815 122548 263811 81314 341490 -39913 226868 363151 148592 468816
15002D68816A33578K03383G7166L77551F9016J40400Q2208Q587J37249J29129
$$ 468816 133578 336961 77166 454717 69016 209416 291624 300211 437460 566589
14992E66589j66153d5747A24417J8259K61411A99279K83042r1341N5118J9513
$$ 566589 400436 -45747 124417 142676 404087 199279 482321 390980 446098 465611
14982D65611j53820M3113N9301m7480O9709j2586Q4839n0141M69088A32774c12853
$$ 465611 311791 354904 414205 366725 436434 423848 508687 458546 927634 132774 -312853
14970E76310B66432J62218J48617k08255P5542j01833L00938c5205C88212K2055
$$ 576310 266432 428650 577267 369012 444554 342721 643659 -35205 388212 410267
14960D10267j23342J6010K38540B2210K61710K45144J08661k14089n9050k0209
$$ 410267 286925 302935 541475 22210 283920 529064 637725 423636 364586 344377
14950C44377j25867R1984p4671K31080A27308K76934K57191j15886k26442J84640
$$ 344377 218510 310494 235823 466903 127308 404242 661433 545547 319105 503745
14940E03745A48899K25476L2513j34872K69519A15246N41966k26559j80069L07916
$$ 503745 148899 374375 406888 272016 541535 115246 657212 430653 250584 558500
14930E58500J92823K95097k61087j93729N9373J01172J03698M1055k83825J56695
$$ 558500 751323 1046420 785333 591604 650977 752149 855847 896902 613077 769772
14920G69772N1082J07678k82928K63480K67515k14030n5703j49928n9021K88596
$$ 769772 820854 928532 645604 909084 1176599 962569 906866 756938 697917 986513
14910I86513D58881J23014B45152K16345q1645a17229I632K51206P8713j55677
$$ 986513 458881 581895 245152 461497 379852 -117229 9632 260838 339551 183874
14900A83874K88060k26093L23522k00544A33805L12929A99967L63205J85028l08890
$$ 183874 471934 245841 569363 368819 133805 446734 199967 563172 748200 439310
14890D39310A90806J32602L55575j45044r7996K07553C04621K87077m853j25877
$$ 439310 190806 323408 678983 533939 435943 643496 304621 591698 586845 460968
14880D60968A48928R3622J0221K13525j94022J39009K28453B26230L49885k76924
$$ 460968 148928 242550 252771 466296 272274 411283 639736 226230 576115 299191
14870B99191L89091p9567J35080j54074k94731m0502J15138R3935A83298K72266
$$ 299191 688282 608715 743795 589721 294990 254488 369626 463561 183298 455564
14860D55564j53665B459M12919J91085k88601j44001K39591j41874M33789B24973
$$ 455564 301899 2459 415378 606463 317862 173861 413452 271578 705367 224973
14849C33893J21296j9982J60875j8276k02362o0908L56419B90732N23160k5216
$$ 333893 455189 435207 596082 577806 375444 314536 670955 290732 813892 788676
14839G88676k46829M9927J04299r2019k0340A92123N52820j99372B16591J60439
$$ 788676 541847 591774 696073 604054 583714 192123 744943 545571 216591 377030
14829C77030N9721A69624L14728J91288B60514J8340K37168Q6875j88687K00458
$$ 377030 436751 169624 484352 675640 260514 278854 516022 602897 414210 614668
14819F14668l1187J56171l33679k589J38206j36531J81691k74034J73664J00739
$$ 614668 583481 739652 405973 403384 541590 405059 586750 312716 486380 587119
14809E87119r6759O7222J1104j32586J46372N3973l7516n2568r8165L27538k79624
$$ 587119 490360 557582 568686 436100 582472 636445 598929 546361 448196 775734 496110
14798D96110J03584j19311j11222j16655J83042K12579p9799r41L2879B54571
$$ 496110 599694 480383 369161 252506 435548 648127 568328 567387 600266 254571
14787H6110K14546K76016k30133p1101J14479R3018R0847J26404q723r137j83691
$$ 86110 300656 576672 346539 275438 389917 482935 573782 700186 691463 682326 498635
14776D98635J23156P8529l031L419l43647K09015j03893J89230M6692j95090j95501
$$ 498635 621791 700320 697289 700708 357061 566076 462183 651413 698105 503015 307514
14765C07514K7721L19542J68743B56366N71108l37606n9625K22295j51170J56754
$$ 307514 335235 654777 823520 256366 827474 489868 430243 652538 501368 658122
14755F58122O7082j69487M0543K3172K81808m25096K11991J58474l95458O9196
$$ 658122 725204 555717 596260 619432 901240 476144 688135 846609 451151 520347
14745E20347r0438L66954j25657j6504O6008L21023r2533l57690N32929k16959
$$ 520347 429909 796863 671206 654702 720710 1041733 949200 591510 1124439 907480
14735I07480m10341O749K40290O771J67428r6625q279n7598R0279P6605j32995
$$ 907480 497139 503888 744178 750949 918377 821752 813473 755875 846154 922759 789764
14724G89764j6036k2498J49305R5053J41265k31581M2825J02608k73640L15941
$$ 789764 773728 751230 900535 995588 1136853 905272 948097 1050705 777065 1093006
14714A093006k01376n7428m6543j28450J61412J08451l36631L06252l7401j61201
$$ 1093006 891630 834202 787659 659209 820621 929072 592441 898693 861292 700091
14704G00091j4396L41727m11090L24668J14926r4403O5410o4010k1356J87342
$$ 700091 685695 1027422 616332 941000 1055926 961523 1026933 962923 941567 1128909
14694A128909J1017j68028p0036j50116K87111J5030j99882k12044L67787j36197
$$ 1128909 1139926 971898 901862 751746 1038857 1053887 854005 641961 1009748 873551
14684H73551J41725j41279k4506J63278M1699j40781j69589N7826N24928p9600
$$ 873551 1015276 873997 849491 1012769 1054468 913687 744098 801924 1326852 1247252
14674A247252E44075L89646J4375Q5235N2677n1592j58382j28466L43797l60907
$$ 1247252 544075 933721 948096 1033331 1086008 1034416 876034 747568 1091365 730458
14664G30458K44830K84766j74301k75987K00544J40016j8524j5640K0359j44387
$$ 730458 975288 1260054 1085753 809766 1010310 1150326 1131802 1116162 1136521 992134
14654I92134k407l14708M49162k1962Q7307j01919J60315J01293k34272j46246
$$ 992134 989727 675019 1124181 1102219 1189526 1087607 1247922 1349215 1114943 968697
14644I68697K85010k55229p4739O9585M07150j05921k91093q6066L81941l16251
$$ 968697 1253707 998478 923739 993324 1400474 1294553 1003460 917394 1299335 983084
14634I83084J87738k36286K83684j75641j2018K73721l42524J30763P4622P6141
$$ 983084 1170822 934536 1218220 1042579 1030561 1304282 961758 1092521 1167143 1243284
14624A243284k73734J87799J43706q367j80108J49483k44223J2062N12602L8004
$$ 1243284 969550 1157349 1301055 1292688 1112580 1262063 1017840 1029902 1542504 1580508
14614A580508l79306J03348K01614j59259r4635k9795l5527J45209L26493k28935
$$ 1580508 1201202 1304550 1506164 1346905 1252270 1222475 1186948 1332157 1658650 1429715
14604A429715j01814K2599J64529m55180N37874L0370k73258J28857J1268K76658
$$ 1429715 1327901 1350500 1515029 1059849 1597723 1628093 1354835 1483692 1494960 1771618
14594A771618k28944j16595p1608L29974r0723J73566K45119k09021k78146l1509
$$ 1771618 1542674 1426079 1354471 1684445 1593722 1767288 2012407 1803386 1525240 1493731
14584A493731K39487J09900j53021K87904j70615l47725L79798j34025l61958
$$ 1493731 1733218 1843118 1690097 1978001 1807386 1459661 1839459 1705434 1343476
14575A343476N14465J30124l50488M95864j2002l04794M10284Q0752j87189J38339
$$ 1343476 1857941 1988065 1637577 2133441 2121439 1816645 2226929 2307681 2120492 2258831
14565B258831j00140l0061N1905L62274j76101P66783l08402J1721J60572J76849
$$ 2258831 2158691 2128630 2180535 2542809 2366708 3133491 2825089 2836810 2997382 3174231
14555C174231K3682M36516L33233K28729J011302J755510J603781K886773N746741
$$ 3174231 3197913 3634429 3967662 4196391 5207693 6963203 8566984 11453757 17200498
14546A7200498R538056M78695j0111355p297330m269726j476162p71679l53003
$$ 17200498 26738554 27217249 17105894 9808564 5538838 4062676 3290997 2937994
14538B937994m63005l82358L04953n20946L97343j10766j21238o118k3383L7175
$$ 2937994 2474989 2092631 2397584 1876638 2273981 2163215 2041977 2035859 2012476 2049651
14528B049651J97572j37411j72316K76257k88370K97424k46982K79390r4626L09623
$$ 2049651 2247223 2109812 1937496 2213753 1925383 2222807 1975825 2255215 2160589 2470212
14518B470212L69868o50759K07038K1397M3360J5826J67542l10098J28297L24738
$$ 2470212 2840080 2189321 2396359 2417756 2461116 2476942 2644484 2334386 2462683 2787421
14508B787421m27982L54084J10289k32256K83467r6982k09444K83382J65900k26246
$$ 2787421 2359439 2713523 2823812 2591556 2875023 2778041 2568597 2851979 3017879 2791633
14498B791633K06010K42460q2500l77379K77360N2727L6070J70720j65672l6053
$$ 2791633 2997643 3240103 3157603 2780224 3057584 3110311 3146381 3317101 3151429 3115376
14488C115376J03286r9269K67724j08319M01122m06463m6569Q0675K73001m8279
$$ 3115376 3218662 3119393 3387117 3278798 3679920 3273457 3226888 3307563 3580564 3532285
14478C532285L54125l08021J96325l53027K64023K56968m42503N45723l70140
$$ 3532285 3886410 3578389 3774714 3421687 3685710 3942678 3500175 4045898 3675758
14469C675758L82608J48368j63610K29054j90928K05317k38715L1231L30287j66512
$$ 3675758 4058366 4206734 4043124 4272178 4081250 4286567 4047852 4079083 4409370 4242858
14459D242858K15606J06120L06142j87687m16025L17239K42092p4346Q3802J78413
$$ 4242858 4458464 4564584 4870726 4683039 4267014 4584253 4826345 4751999 4835801 5014214
14449E014214P3826q057p077L61020p8180K68039k03923L87L4599L40360m12866
$$ 5014214 5088040 5079983 5072906 5433926 5355746 5623785 5419862 5420249 5454848 5795208 5382342
14438E382342L87917J41780P0784j53419K48628p0849K47626k17762J86164K62604
$$ 5382342 5770259 5912039 5982823 5829404 6078032 6007183 6254809 6037047 6223211 6485815
14428F485815m14062J46594N94051R785l7282J32335P1362M9049J73663K95477
$$ 6485815 6071753 6218347 6812398 6822183 6784901 6917236 6988598 7037647 7211310 7506787
14418G506787l59942K80759P67610m15459J21966M37416n19106K54208L7789n9597
$$ 7506787 7146845 7427604 8195214 7779755 7901721 8339137 7820031 8074239 8112028 8052431
14408H052431M34285Q4399J32069J64117J15428K49219N6458j12748O59565j0030
$$ 8052431 8486716 8571115 8703184 8867301 8982729 9231948 9288406 9175658 9835223 9825193
14398I825193K3397N25952K79579j03740K03654k58863M78888L3656o0320O22559
$$ 9825193 9848590 10374542 10654121 10550381 10754035 10495172 10974060 11007716 10947396 11569955
14388A1569955J4631K36243K74173K84531K8302K49238J48808O01867J8746M6635
$$ 11569955 11584586 11820829 12095002 12379533 12407835 12657073 12805881 13407748 13426494 13473129
14378A3473129N87518N7993M09530o7738L10157N29038N85092j60982N68757L12683
$$ 13473129 14060647 14118640 14528170 14460432 14770589 15299627 15884719 15723737 16292494 16605177
14368A6605177Q7454O85847k3748N80839O29420K41299L63043K44190O18884R1649
$$ 16605177 16692631 17378478 17354730 17935569 18564989 18806288 19169331 19413521 20032405 20124054
14358B0124054L92353R22150k43796J102750K81149N46415O30562M73106L29979
$$ 20124054 20516407 21438557 21194761 22297511 22578660 23125075 23755637 24228743 24558722
14349B4558722Q23264M98125P86379J025673M75321N65333N20289Q20510R21210
$$ 24558722 25381986 25880111 26666490 27692163 28167484 28732817 29253106 30073616 30994826
14340C0994826Q88913M80818J178531P92726J256335Q20440J177732J161756J291303
$$ 30994826 31883739 32364557 33543088 34335814 35592149 36412589 37590321 38752077 40043380
14331D0043380J086217J264533J120354J527540J518849J759790J170596J624109
$$ 40043380 41129597 42394130 43514484 45042024 46560873 48320663 49491259 51115368
14323E1115368J978509J825168J794308J603808K363606J843454K517722K640285
$$ 51115368 53093877 54919045 56713353 58317161 60680767 62524221 65041943 67682228
14315F7682228K377058L082052K318494L377223K827431L517450L560134L508511
$$ 67682228 70059286 73141338 75459832 78837055 81664486 85181936 88742070 92250581
14307I2250581M114858L858509L977060M501271M984937M858677N294034N369344
$$ 92250581 96365439 100223948 104201008 108702279 113687216 118545893 123839927 129209271
14299A29209271O108984O501068O455259P036509P543628P684861Q066396Q954037
$$ 129209271 135318255 141819323 148274582 155311091 162854719 170539580 178605976 187560013
14291A87560013Q839950R634679J0270969J0238669J0580192J0948575J1303395
$$ 187560013 196399963 206034642 216305611 226544280 237124472 248073047 259376442
14284B59376442J1906683J1856454J2202681J1935223J2486352J2142456J1784303
$$ 259376442 271283125 283139579 295342260 307277483 319763835 331906291 343690594
14277C43690594J1427770J0263538R564250P707746O730425N145119L609109L667453
$$ 343690594 355118364 365381902 374946152 382653898 389384323 394529442 398138551 401806004
14269D01806004J020917l460479o016725o230849p820993r668879j0699842j1065833
$$ 401806004 402826921 399366442 393349717 387118868 379297875 369628996 358929154 347863321
14261C47863321j1827838j2396252j2563523j3267804j2936432j3026795j2906172
$$ 347863321 336035483 323639231 311075708 297807904 284871472 271844677 258938505
14254B58938505j1576671j1742526j1399228j0679750j0669420r674149r775014
$$ 258938505 247361834 235619308 224220080 213540330 202870910 193196761 183421747
14247A83421747q817235q464130p634132p625263o766658o950525o324302n713382
$$ 183421747 174604512 166140382 158506250 150880987 144114329 137163804 130839502 125126120
14239A25126120n850595m937431n283990m536748m570749l765545m295521l497229
$$ 125126120 119275525 114338094 109054104 104517356 99946607 96181062 91885541 88388312
14231H8388312l272461l472189l272145k989271l162509k544643k442621k551363
$$ 88388312 85115851 81643662 78371517 75382246 72219737 69675094 67232473 64681110
14223F4681110k395331k085656k072328k058522k057744j381252j972363j531226
$$ 64681110 62285779 60200123 58127795 56069273 54011529 52630277 50657914 49126688
14215D9126688j609959j453616j137871j497960j637501q51781j270461j011040
$$ 49126688 47516729 46063113 44925242 43427282 41789781 40938000 39667539 38656499
14207C8656499q76534j285968j151597j021586j148609p55735r48342m91509q20905
$$ 38656499 37779965 36493997 35342400 34320814 33172205 32416470 31468128 30976619 30155714
14198C0155714o95176r54330o74181p08663p45506m89586q63388l64745n66626
$$ 30155714 29460538 28506208 27832027 27123364 26377858 25888272 25024884 24660139 24093513
14189B4093513o57906n76029m91709p89056j80484n84223l87845o31283l21470
$$ 24093513 23435607 22859578 22367869 21578813 21398329 20814106 20426261 19794978 19473508
14180A9473508o51962k29802j20913o52165l00251l00839l89676l44474l72489
$$ 19473508 18821546 18591744 18470831 17818666 17518415 17217576 16827900 16483426 16110937
14171A6110937k40900n90191J67156m04441l57285J0457p13329j55557k92250
$$ 16110937 15870037 15279846 15447002 15042561 14685276 14695733 13982404 13826847 13534597
14162A3534597j00817k77092m39939j40716j55190J05080o16799j09908l33268
$$ 13534597 13433780 13156688 12716749 12576033 12420843 12525923 11909124 11799216 11465948
14153A1465948J37809l88571j08395j82594k33315m18j59452l18060N1522k07874
$$ 11465948 11603757 11215186 11106791 10924197 10690882 10690464 10531012 10212952 10264474 10056600
14143A0056600l90053j79768q5972j78999k29151j46607L73767l13650J33694
$$ 10056600 9666547 9486779 9400807 9221808 8992657 8846050 9219817 8906167 9039861
14134I039861o26095N1803p6386k84991j15701o8667q4089k03342l87541L07832
$$ 9039861 8413766 8465569 8389183 8104192 7988491 7919824 7835735 7632393 7244852 7552684
14124G552684l6703k42250j91044K26736l02951M1372m70645L7720j5165p5791
$$ 7552684 7515981 7273731 7082687 7309423 7006472 7047844 6577199 6614919 6599754 6523963
14114F523963J96219n38823j20698L26064j13962k82555o4988j86108K35162M8807
$$ 6523963 6720182 6181359 6060661 6386725 6272763 5990208 5925220 5739112 5974274 6023081
14104F023081l14336k23946K5517l9534j19949q7690j30118Q0752p7878j96595
$$ 6023081 5708745 5484799 5510316 5470782 5350833 5263143 5133025 5213777 5135899 4939304
14094D939304L93364k42999l33678K09887o1760J06786n14817J67895K30630k51565
$$ 4939304 5332668 5089669 4755991 4965878 4904118 5010904 4496087 4663982 4894612 4643047
14084D643047k38249K3315j91720M16096j61821k42513j92989k7746L81019O5307
$$ 4643047 4404798 4428113 4236393 4652489 4490668 4248155 4055166 4027420 4408439 4473746
14074D473746m7901m20220R4599r0032n9738J9556k92052j92571L20993O2239
$$ 4473746 4425845 4005625 4100224 4010192 3950454 3970010 3677958 3485387 3806380 3868619
14064C868619o5375J06458j86203k89181M69245j66214R8978m48284k67074j519
$$ 3868619 3803244 3909702 3723499 3434318 3903563 3737349 3836327 3388043 3120969 3119450
14054C119450L81908o33321L47710K91876p48474N56472Q1054m09781K3248K23799
$$ 3119450 3501358 2868037 3215747 3507623 2759149 3315621 3396675 2986894 3010142 3233941
14044C233941k42826n4709r1262k9323N0693O5296j17167K8928R6339L2345k54770
$$ 3233941 2991115 2936406 2845144 2815821 2866514 2931810 2814643 2843571 2939910 2972255 2717485
14033B717485K64283m10111M42644k23046l72398K89937L97949o00672r6147J6594
$$ 2717485 2981768 2571657 3014301 2791255 2418857 2708794 3106743 2506071 2409924 2426518
14023B426518P4964q6906J09280k7000K20904m20089L27548l26312K31813K50172
$$ 2426518 2501482 2414576 2523856 2496856 2717760 2297671 2625219 2298907 2530720 2780892
14013B780892n58897n5619j09118J16004o4700J57600J9088M1511K2005J7642
$$ 2780892 2221995 2166376 2057258 2173262 2108562 2266162 2285250 2326761 2348766 2366408
14003B366408K1367k79680K15994l2071k2744k44966L53960J21613k42274K26359
$$ 2366408 2387775 2108095 2324089 2292018 2269274 2024308 2378268 2499881 2257607 2483966
13993B483966K84592K49451K97181Q33314J335907J950628M508573R191567P497874
$$ 2483966 2768558 3018009 3315190 4148504 5484411 7435039 11943612 21135179 28633053
13984B8633053q624887p405620m127793k265011j580356l23524m95214m31701
$$ 28633053 20008166 12602546 8474753 6209742 4629386 4305862 3810648 3378947
13976C378947m76562k64635J87649M8112m47221L21924k59972j02898o267r8847
$$ 3378947 2902385 2637750 2825399 2873511 2426290 2748214 2488242 2385344 2379077 2280230
13966B280230j38980J5167j26077P80o4822K02827l37867J65304j90656p918K28706
$$ 2280230 2141250 2156417 2030340 2031120 1966298 2169125 1831258 1996562 1805906 1797988 2026694
13955B026694J27574n09209J62948L07157m68846k47237N16100l45553K88682
$$ 2026694 2154268 1645059 1808007 2115164 1646318 1399081 1915181 1569628 1858310
13946A858310q351N3987l86063Q8394Q8951L75595l20332r7304j9144p8915M6163
$$ 1858310 1849959 1903946 1517883 1606277 1695228 2070823 1750491 1653187 1634043 1555128 1601291
13935A601291J14117J61701o30371J30638J23173k56896L10645l2633l16618r075
$$ 1601291 1715408 1877109 1246738 1377376 1500549 1243653 1554298 1521665 1205047 1195972
13925A195972L31526k19440L14396l87908K63185K4040l51822K04689j07226J73052
$$ 1195972 1527498 1308058 1622454 1234546 1497731 1521771 1169949 1374638 1267412 1440464
13915A440464j17660Q5012n3642k63931M01974l56484L57910m40226L92447q4969
$$ 1440464 1322804 1407816 1354174 1090243 1492217 1135733 1493643 1053417 1445864 1360895
13905A360895l67155K61851P5056k76662L8066K5398M48406j26595k26427J8710
$$ 1360895 993740 1255591 1330647 1053985 1092051 1117449 1565855 1439260 1212833 1231543
13895A231543L84240o35927L83183o5529k26988J21623k10655K49830J35861o24895
$$ 1231543 1615783 979856 1363039 1297510 1070522 1192145 981490 1231320 1367181 742286
13885G42286M31245J78697o59686M15997q9169L4305K17621j92091k54330K50676
$$ 742286 1173531 1352228 692542 1108539 1019370 1053675 1271296 1079205 824875 1075551
13875A075551J4885K9988n8491J4543j98009m452K47305k56236m1444O13927l75373
$$ 1075551 1090436 1120424 1061933 1076476 878467 874015 1121320 865084 823640 1437567 1062194
13864A062194M7153Q6917k47959Q6607R2453k73006K42081j99750j66177J62630
$$ 1062194 1109347 1196264 948305 1034912 1127365 854359 1096440 896690 730513 893143
13854H93143k8549R917j57996j56109M70050M427l15171J25767k94381O09035
$$ 893143 864594 874511 716515 560406 1030456 1034883 719712 845479 551098 1160133
13844A160133l84174J90138O9655k66345J4070K15397j24793l1816J51273k64948
$$ 1160133 775959 966097 1035752 769407 783477 998874 874081 842265 993538 728590
13834G28590q0672M02756j87686L12157L935n13375L52994J62724j79747r4936
$$ 728590 647918 1050674 862988 1175145 1179080 665705 1018699 1181423 1001676 906740
13824I06740k2247j37072q8893j49640L04492r8228J76641j49375L10217k77827
$$ 906740 884493 747421 658528 508888 813380 715152 891793 742418 1052635 774808
13814G74808o9199O7476P7023C73494K97401J53930j68075n7332L93238D59935
$$ 774808 705609 773085 850108 373494 670895 824825 656750 599418 992656 459935
13803H03376J43294J0760l52574n6862q1944O4050K888P8790j01502M27417n3098
$$ 803376 946670 957430 604856 547994 466050 530100 532988 611778 510276 937693 884595
13792H84595j35715j93663K51103j26594C07117L70111J91914m02744K37286j87467
$$ 884595 748880 555217 806320 679726 307117 677228 869142 466398 703684 516217
13782E16217J71784P3450p5423p1904j2143p4340J74999N3865l41125l0601K23490
$$ 516217 688001 761451 686028 614124 601981 527641 702640 756505 415380 384779 608269
13771F08269k85983P0529O21648C97707j13934J33853J75116M4650k0313P992
$$ 608269 322286 392815 1014463 397707 283773 417626 592742 637392 617079 625071
13761F25071K58234j71129j28716Q9714J5705B02379L52313L68761p8774l16393
$$ 625071 883305 712176 583460 673174 688879 202379 554692 923453 844679 528286
13751E28286j5147k1813Q5407k13462J52262j30704K87683Q7983k15452J50819
$$ 528286 513139 491326 576733 363271 515533 384829 672512 760495 545043 695862
13741F95862m6929C12844r8605K16786m2620o2068L82544j97035Q1987M1473j80853
$$ 695862 648933 312844 214239 431025 388405 326337 708881 511846 593833 635306 454453
13730D54453j28136M30468k23720N7904j26761j16406K47963k34847M04241C69984
$$ 454453 326317 756785 533065 590969 464208 347802 595765 360918 765159 369984
13719B08417K68223J5202B23929N85341l14032J32152j29564p4460P1076l8301
$$ 208417 476640 491842 223929 809270 495238 627390 497826 423366 494442 456141
13709D56141p4347K34157k27723M364J72527k1491k45651L98204j56155L9838
$$ 456141 381794 615951 388228 392592 565119 543628 297977 696181 540026 579864
13699E79864A62184J95076n894J70911k633k24343J79061B35855N05385r6487
$$ 579864 162184 357260 351366 522277 519644 295301 474362 235855 741240 644753
13689F44753q1616j56511J13085k4787L22977k87099j29319J85361A48601M59980
$$ 644753 563137 406626 519711 494924 817901 530802 401483 586844 148601 608581
13679F08581j45509K04304l32254K19826j48096L16917l56530J7979J87922L6811
$$ 608581 463072 667376 335122 554948 406852 723769 367239 385218 573140 609951
13669F09951k31949R0204k0158M87282C65240J18550A67188M41759G8784K49564
$$ 609951 378002 468206 448048 935330 365240 483790 167188 608947 78784 328348
13659C28348L63863k40916k16580l1631j0102L76559k38438R8407k2557Q1660
$$ 328348 692211 451295 234715 203084 192982 569541 331103 429510 406953 488613
13649D88613J510j92830L22736C05673J22575J21569j11524A54379K72190j27852
$$ 488613 490123 297293 620029 305673 428248 549817 438293 154379 426569 298717
13639B98717O3115N9732j22013r1071K42421l0526A39314L93702A37631m0149
$$ 298717 361832 421564 299551 208480 450901 420375 139314 533016 137631 97482
13629I7482L7170N14198m3681k31402A53108a46413E99021r1606m8723A36255
$$ 97482 134652 648850 605169 373767 153108 -146413 599021 507415 458692 136255
13618B33379F7542J49430L90872l0397B08186q8971M4385N7520m7010M00292B09037
$$ 233379 67542 216972 607844 577447 208186 119215 163600 221120 174110 574402 209037
13606A13896N5455K45955J2815K29408B97251o1111G5368K18787o5925L68235
$$ 113896 169351 415306 428121 657529 297251 236140 75368 294155 228230 596465
13596E96465B39740K49862L1941j24622H8066K77492K64563G1587K60751q2723
$$ 596465 239740 489602 521543 396921 88066 365558 630121 71587 332338 249615
13586B49615L97869A22325d4060C24735g9462E89534F2423J68182L14713j49899
$$ 249615 647484 122325 -44060 324735 -79462 589534 62423 230605 545318 395419
13576C95419l5029j39762o4103K61715j09492n5624J80128p7283O3766j04578
$$ 395419 360390 220628 156525 418240 308748 253124 433252 355969 419735 315157
13566C15157m28p4328k1065J35882J57899j58520q2744K35747A59079R5212j9294
$$ 315157 314729 240401 219336 355218 513117 354597 271853 507600 159079 254291 234997
13555B34997k908K43283j12090f736A43033N2672K50308R4363F5741L58419A75849
$$ 234997 232089 475372 363282 -6736 143033 195705 446013 540376 65741 424160 175849
13543C55208J06417B03861J65183a850D00762M9818A69113A4846K59655J70558
$$ 355208 461625 203861 369044 -1850 400762 450580 169113 14846 274501 445059
13533D45059A41372L9883N9918K42000M0301k59592N4489Q0281j85983k502K26756
$$ 445059 141372 181255 241173 483173 523474 263882 318371 398652 212669 210167 436923
13522D36923e7426C92370A08350K21820I7672J20293b10697D61963k28804A13893
$$ 436923 -57426 392370 108350 330170 97672 217965 -210697 461963 233159 113893
13511a16123A90146K20640j95523F4853j3154K69946J59725j78597D2194L75450
$$ -116123 190146 410786 215263 64853 51699 321645 481370 302773 42194 417644
13501D17644D6740K95404j32401O0243L38609A79586K23931o8864C3600f5127
$$ 417644 46740 342144 209743 269986 608595 179586 403517 334653 33600 -65127
13490F64388A32788K76515a07598A70582L54952B02580k1708q9021P7160P3419
$$ 664388 132788 409303 -107598 170582 525534 202580 180872 91851 169011 242430
13480B42430P3760H8671E38K60398l6266k9717p878C339M6678K56882n2596I1734
$$ 242430 316190 88671 538 260936 224670 194953 187075 3339 50017 306899 254303 91734
13467A13035L39786G9181J57262m8554F7125J74852K04977a00071q5738H0330
$$ 113035 452821 79181 236443 187889 67125 241977 446954 -100071 -185809 80330
13456C52849j60081J57474A23325L15339j08328n5220j16188O614E759P3538J67318
$$ 352849 192768 350242 123325 438664 330336 275116 158928 165542 5759 79297 246615
13445B46615f5385F1533a1157B09370K43859B06643I0749a73698C33903J68080
$$ 246615 -65385 61533 -11157 209370 453229 206643 90749 -173698 333903 501983
13435E01983k19446a36048C01687K9056j2252j58349J90856K17773b5196B67889
$$ 501983 282537 -136048 301687 330743 318491 160142 350998 568771 -25196 267889
13424B06093C0983q609J03558C8874K72391j15537k7697O9227o760a1250B93734
$$ 206093 30983 22374 125932 38874 311265 195728 168031 237258 230498 -11250 293734
13412B29440K03239j84636o1605J97392L348j87625a35499B92225N0445b21422
$$ 229440 432679 248043 186438 383830 387178 199553 -135499 292225 342670 -221422
13401A98376k256D2002K44367A38480a644A11979K06599A30293k4603k6601a61230
$$ 198376 196120 42002 286369 138480 -1644 111979 318578 130293 105690 79089 -161230
13389B7744L36623a1807B23610H226c4934j02527D10130A91822A8262K06232b23633
$$ 27744 364367 -11807 223610 8226 -34934 -137461 410130 191822 18262 224494 -223633
13377I4848J43565A14235R7848L2300q7598a7030B02367c4444C00084A02727P3583
$$ 94848 238413 114235 212083 244383 156785 -17030 202367 -34444 300084 102727 176310
13366A76310p4968b1389B22649E9487J26777q3096J19332I097K27818f1493P770
$$ 176310 101342 -21389 222649 59487 186264 103168 222500 9097 236915 -61493 -53723
13355e3723j48856R1286N1469A96573N06950C08225k3244E1904J40182i9882B68826
$$ -53723 -202579 -111293 -59824 196573 703523 308225 284981 51904 192086 -99882 268826
13343A5417K28919E3195K79733j32272a02172B76711F828K24400K4619K4304o2964
$$ 15417 244336 53195 332928 200656 -102172 276711 6828 231228 255847 280151 217187
13332B17187a18219B12859J41269A4666O7299e2909E352N59303j98761D1117J26253
$$ 217187 -118219 212859 354128 14666 81965 -52909 5352 564655 365894 41117 167370
13321A67370R1946I9177K76320j63341e9498B23361B1729J73276j8424I43J65301
$$ 167370 259316 99177 375497 212156 -59498 223361 21729 195005 176581 943 166244
13310A66244J77740f7928A73781o5504k3778P8023L3a17500A18135N8817h461
$$ 166244 343984 -67928 173781 108277 84499 162522 162555 -117500 118135 176952 -8461
13298E47231h879G8661a97001A71047K31717A90409J8832K0790I745K71919I6383
$$ 547231 -8879 78661 -197001 171047 402764 190409 209241 230031 9745 281664 96383
13286C53410a00606B54693P3900r3892p4085F2563J52325a91050d417G8298i5195
$$ 353410 -100606 254693 328593 234701 160616 62563 214888 -191050 -4417 78298 -95195
13274I0980J32153c5230a3517B21442H5879o641D126K00185K8027B3384L7988
$$ 90980 223133 -35230 -13517 221442 85879 79238 4126 204311 232338 23384 61372
13263F1372J65583a8962F8989J00974K44289A40231K28020h6837B93747A3282
$$ 61372 226955 -18962 68989 169963 414252 140231 368251 -86837 293747 13282
13252i4619A22797A4993a29701j512E4573M14772k34367F3000k394J61486L4170
$$ -94619 122797 14993 -129701 -131213 54573 469345 234978 63000 60606 222092 256262
13241B56262E8934d0022C44297j59725J93081j79417f0245A70362J07589Q1230
$$ 256262 58934 -40022 344297 184572 377653 198236 -60245 170362 277951 359181
13231C59181q5760j237O863J19615j61087K02080c06823B27544i706A78778g1707
$$ 359181 273421 272184 279047 398662 237575 439655 -306823 227544 -9706 178778 -71707
13219I6050J87059A1608J35341a9713A16261a54010A49913j5512J83654A50017
$$ 96050 283109 11608 146949 -19713 116261 -154010 149913 134401 318055 150017
13208A54549g110n8584A26224M6578j9784C4113J70716m4773K38498a23347H4072
$$ 154549 -7110 -65694 126224 172802 153018 34113 204829 160056 398554 -123347 84072
13196A60139I851g0161b4201q4615k5367L9579j35399C0230O2442a68841D5447
$$ 160139 9851 -70161 -24201 -108816 -134183 -94604 -230003 30230 92672 -168841 45447
13184A18582D1513L57372a96227A63651b17299O5117D0806J83213F413e1301m6628
$$ 118582 41513 398885 -196227 163651 -217299 -152182 40806 224019 6413 -51301 -97929
13173i7929A70362b04150f2523B5697L19871d0065l7568C05685a11888b8582D35400
$$ -97929 170362 -204150 -62523 25697 345568 -40065 -77633 305685 -111888 -28582 435400
13161h4970B74491D2907J74955a89810d4757I7438J05553j6722i5858A56343i4177
$$ -84970 274491 42907 217862 -189810 -44757 97438 202991 186269 -95858 156343 -94177
13149G2429c1808k8416B44945C0635N7780d95705B77981C2079b12055f3372B10124
$$ 72429 -31808 -60224 244945 30635 88415 -495705 277981 32079 -212055 -63372 210124
13137f903D12014k00637C6726K4010K7139b4738l46011A60560P4882h641A07450
$$ -6903 412014 211377 36726 60736 87875 -24738 -370749 160560 235442 -8641 107450
13125B35399o4785a01373q04B81683O8016F5914J20868b31627D52587j44589d9529
$$ 235399 170614 -101373 -102177 281683 349699 65914 186782 -231627 452587 307998 -49529
13113A75853E2283L64105b5106B09270b05165A42632K37111A28887E046R6191
$$ 175853 52283 416388 -25106 209270 -205165 142632 379743 128887 5046 101237
13103A01237b33525e7871F2242a31607G9009K8269a70152q5179A3130d437B54805
$$ 101237 -233525 -57871 62242 -131607 79009 107278 -170152 -255331 13130 -4437 254805
13091b6162k35122A12480q830G074b74408A74386R373a76735D2686c14804e7774
$$ -26162 -261284 112480 103650 7074 -274408 174386 183759 -176735 42686 -314804 -57774
13079B20396j00768n1621B9460P1773K59160b19208C0227N910K84744E2353K01656
$$ 220396 119628 68007 29460 101233 360393 -219208 30227 36137 320881 52353 254009
13068B54009F7212J02976a4237G4914O2498B2530K26047J21808A05600D2676R4524
$$ 254009 67212 170188 -14237 74914 137412 22530 248577 370385 105600 42676 137200
13057A37200a04346B03650K88753a97497i230K47l5322k16697Q9139B22561F8090
$$ 137200 -104346 203650 492403 -197497 -9230 -8983 -44305 -261002 -171863 222561 68090
13045F6421l1186J3554O8544D4833f1026j08346d1226A12196e33387A95650D1325
$$ 66421 35235 48789 117333 44833 -61026 -169372 -41226 112196 -533387 195650 41325
13033C45393H4652J89733b21346A45654i0251G9519b74116a30296j01425A84852
$$ 345393 84652 274385 -221346 145654 -90251 79519 -274116 -130296 -231721 184852
13022B70962b28707A71292O04j9401a92610m8216a18880H6152L5280a67587A72660
$$ 270962 -228707 171292 171896 152495 -192610 -240826 -118880 86152 121432 -167587 172660
13010A38867f6997L511B55900j24953R838N4558E3136a1105A18786m9404N2357
$$ 138867 -66997 -63486 255900 130947 140785 195343 53136 -11105 118786 69382 121739
12999A21739l385R4391o261e4379f787A96785G1304i8996B07796d420j95035C7221
$$ 121739 118354 212745 206484 -54379 -6787 196785 71304 -98996 207796 -4420 -199455 37221
12986B332b01664O2800N5861J913A34236B1330J21318K17189f6306R564o0619
$$ 2332 -201664 -138864 -83003 -81090 134236 21330 142648 359837 -66306 -56742 -117361
12975a17361A44431c12828A80657b67082A54497A2179d1864k54347B40922F0295
$$ -117361 144431 -312828 180657 -267082 154497 12179 -41864 -296211 240922 60295
12964B40796H2986K26572j05685H9441C5160N9368R862O4893g0450b3710E1722
$$ 240796 82986 309558 203873 89441 35160 94528 104390 169283 -70450 -23710 51722
12952b81965i4778A12877a5223K442B40658I4997b2945D63821a56434D2368h9994
$$ -281965 -94778 112877 -15223 -12781 240658 94997 -22945 463821 -156434 42368 -89994
12940B7649j2548J64140a29678B31933i9934C12109e2303E3188d05052I3221g697
$$ 27649 15101 179241 -129678 231933 -99934 312109 -52303 53188 -405052 93221 -7697
12928A0429K91953a93135A51421N207c49473B55361B6359b56832B78902j9655
$$ 10429 302382 -193135 151421 156628 -349473 255361 26359 -256832 278902 259247
12918B59247b6420k19003a7491A63412c60724a02509b4405C1281L3007c726o3938
$$ 259247 -26420 -245423 -17491 163412 -360724 -102509 -24405 31281 64288 -3726 -67664
12907f7664b4567E5517J25244K75406a94603j07653A1112J98762b21598j26668
$$ -67664 -24567 55517 180761 456167 -194603 -302256 11112 209874 -221598 -348266
12897c48266A63688C0660a83548A13188L6803F5313b00007j63517j41044b4080
$$ -348266 163688 30660 -183548 113188 149991 65313 -200007 -363524 -504568 -24080
12886b1249A17304c2405C47507e8117g827k28514e8929D77703a73633G8809L0003
$$ -21249 117304 -32405 347507 -58117 -7827 -236341 -58929 477703 -173633 78809 108812
12875A08812Q764D546L24688A36981J9437A6865b6197A8784h7345B11102g4594
$$ 108812 117576 4546 329234 136981 156418 16865 -26197 18784 -87345 211102 -74594
12863B06408c098p2103j13020G695K1838a53197I9654b12648F3875a07683l0466
$$ 206408 -3098 -75201 -188221 7695 29533 -153197 99654 -212648 63875 -107683 -138149
12852a38149A18484A6779O1881b81841I8243K00482f9406a6647A00851c8681o296
$$ -138149 118484 16779 78660 -281841 98243 298725 -69406 -16647 100851 -38681 -44977
12841d4977j67751F5858d2548F0054a626k02746B94546F5183a81290a7957C71318
$$ -44977 -212728 65858 -42548 60054 -1626 -204372 294546 65183 -181290 -17957 371318
12829A19647Q056J7082m6655c5079A1368a09498l6292B33549g96j77544e7510
$$ 119647 127703 144785 98130 -35079 11368 -109498 -145790 233549 -796 -178340 -57510
12817d031j35353B4675J4330b521k15374l6141B79853g8968B5649p715b1909E3363
$$ -4031 -139384 24675 39005 -2521 -217895 -254036 279853 -78968 25649 17934 -21909 53363
12804a48438B85079n4812a55719C665M807K32737a329A04131b67547K3408a11283
$$ -148438 285079 230267 -155719 3665 8472 241209 -1329 104131 -267547 -244139 -111283
12792a91156A05761B7520J89243B0854J33225k7056a3391A21110b05755e4875
$$ -191156 105761 27520 216763 20854 154079 127023 -13391 121110 -205755 -54875
12781a47242B7099O9004a5148A55483A1603K7962d20148A37436C1339F273K60258
$$ -147242 27099 96103 -15148 155483 11603 39565 -420148 137436 31339 6273 266531
12770B66531b75829k4627c1281A14926f5618K3256B64047b94654D4322r698M9391
$$ 266531 -275829 -300456 -31281 114926 -65618 -42362 264047 -294654 44322 34624 84015
12759H4015a05389a4232B36218r4159a68439j90445f1958j75102C30284a71018
$$ 84015 -105389 -14232 236218 142059 -168439 -358884 -61958 -237060 330284 -171018
12748a63915D1223a6056G4404K1062R2471a15916B0853b5056C07233A22929G447
$$ -163915 41223 -16056 74404 95466 187937 -115916 20853 -25056 307233 122929 7447
12736B6603c8925I2377c46342J36067G9686L0239f9003k0157p3161r0954A5800
$$ 26603 -38925 92377 -346342 -210275 79686 109925 -69003 -89160 -162321 -253275 15800
12724a67685a9159k89379J30480E6904G079e1513C22064c25983c3544D6152c40513
$$ -167685 -19159 -308538 -178058 56904 7079 -51513 322064 -325983 -33544 46152 -340513
12712A83917h7671B0720J6455J08201e1846H3512l0323J29121F7145K57368I7683
$$ 183917 -87671 20720 37175 145376 -51846 83512 53189 182310 67145 324513 97683
12700B32582a20386E86773a33214G7506K54096A16018C7577a40500A51791A9533
$$ 232582 -120386 586773 -133214 77506 331602 116018 37577 -140500 151791 19533
12689B98304A45102K3036b38732a10142p369B01415j9450E0733a8984C27372A51305
$$ 298304 145102 168138 -238732 -110142 -117511 201415 181965 50733 -18984 327372 151305
12677H3621P6090J17238d4432g330C1077a11249d9697A2982f232D89780k40665
$$ 83621 159711 276949 -44432 -7330 31077 -111249 -49697 12982 -6232 489780 249115
12666B49115l0677i968q2681F7383f4526L237k5237H245K88094a64803B01975
$$ 249115 218438 -9968 -92649 67383 -64526 -61289 -86526 8245 296339 -164803 201975
12654i0300n2830B71351d5513l9638J283p6880A59907b02042q0611O0178B57168
$$ -90300 -143130 271351 -45513 -85151 -83868 -160748 159907 -202042 -282653 -222475 257168
12642a2634j79435A88683r1206J35730b4259B19506f1412j90721C97813K4709
$$ -12634 -192069 188683 97477 233207 -24259 219506 -61412 -252133 397813 422522
12632D22522A22072l5930J86680p1506j3102b25620B60044I2245c1356C12424
$$ 422522 122072 86142 272822 201316 188214 -225620 260044 92245 -31356 312424
12621f2043B02500N2428A06651b29137B6000a5090k9026a1277B16358A06968A671
$$ -62043 202500 254928 106651 -229137 26000 -15090 -44116 -11277 216358 106968 1671
12609i5554A558a84763l2828A34831K9207F733a27356b5125A19187C7605a08804
$$ -95554 1558 -184763 -217591 134831 164038 6733 -127356 -25125 119187 37605 -108804
12597f201F1587R8734B1191L804K03244n4712f9397A7969K55909b8815j15831
$$ -6201 61587 160321 21191 24995 228239 173527 -69397 17969 273878 -28815 -144646
12586a44646C17787f331l8538j60237B8402j2564K72079a43001B3188J04799A1726
$$ -144646 317787 -6331 -44869 -205106 28402 15838 287917 -143001 23188 127987 11726
12574c5640H4111B6505P2873d3696C06958o8808d2047j20602M635e8257B32579
$$ -35640 84111 26505 99378 -43696 306958 238150 -42047 -162649 -158014 -58257 232579
12562H7323P9746o5760j6103O6489b2985j41442j84426I1463a62240g405k4153
$$ 87323 167069 101309 85206 151695 -22985 -164427 -348853 91463 -162240 -7405 -31558
12551c1558A31715a06281B18959q6785b92635B71948A21296b07310A07277i7559
$$ -31558 131715 -106281 218959 132174 -292635 271948 121296 -207310 107277 -97559
12540B60106b12263C8885a82569A99487b54975J15946G9789c28410d272q7660
$$ 260106 -212263 38885 -182569 199487 -254975 -139029 79789 -328410 -4272 -91932
12530i1932K4547C5609C79K05026a60921A07584b8212D0144Q8309C4223E448b59782
$$ -91932 -67385 35609 379 205405 -160921 107584 -28212 40144 128453 34223 5448 -259782
12517b23796C39651F2144A4909d2867C57700a70735m5554h771C22620a24599L0756
$$ -223796 339651 62144 14909 -42867 357700 -170735 -216289 -8771 322620 -124599 -93843
12506i3843E0901a07999B11923a70766c1057a2954l50431i3188D3420J74043p3210
$$ -93843 50901 -107999 211923 -170766 -31057 -12954 -363385 -93188 43420 217463 144253
12495A44253b3917j09846j05306g3418I7683J8429D2940b22339B51968c06770
$$ 144253 -23917 -133763 -239069 -73418 97683 116112 42940 -222339 251968 -306770
12484C0944J75747a04448I7413L14746I3610J62098c17987A5572J66296G9083
$$ 30944 206691 -104448 97413 412159 93610 255708 -317987 15572 181868 79083
12473C29446e3713D6314h4679A4786L26281a79673A37855a41941J6875A25895
$$ 329446 -53713 46314 -84679 14786 341067 -179673 137855 -141941 -125066 125895
12462g4187G7332b88334h7434K3079p8011B90293H7500l1389b26548A56036Q0857
$$ -74187 77332 -288334 -87434 -64355 -142366 290293 87500 56111 -226548 156036 236893
12451B36893i4660B90825g480k10233i3056d4035C9169c5080j24518B57739i664
$$ 236893 -94660 290825 -7480 -217713 -93056 -44035 39169 -35080 -159598 257739 -9664
12439i8194j78093A17913a74195A02906d03930B70603a93937e6745C4981a21714
$$ -98194 -276287 117913 -174195 102906 -403930 270603 -193937 -56745 34981 -121714
12428A98773f8640A3053K75496b72630C8576e47441i5329L0217J9576A60923B0440
$$ 198773 -68640 13053 288549 -272630 38576 -547441 -95329 -65112 -45536 160923 20440
12416F4899e3247l0570A89407o4289b05296q8373E0787a24909D8800b09387R2945
$$ 64899 -53247 -83817 189407 125118 -205296 -293669 50787 -124909 48800 -209387 -116442
12405a16442m2091I5736R4613e7935A96899d5035A53497M0057I2289a5968j60546
$$ -116442 -158533 95736 190349 -57935 196899 -45035 153497 193554 92289 -15968 -176514
12394a76514A61301a66814C7102R2535b54993A46156P5618i4872j73714a592D973
$$ -176514 161301 -166814 37102 129637 -254993 146156 221774 -94872 -268586 -1592 4973
12382g935l7581j95415G156e0266I3742a39995C93883E4240a137l04723B00036
$$ -7935 -45516 -240931 7156 -50266 93742 -139995 393883 54240 -1137 -305860 200036
12370E7097J893a2393O34B49686p2144F9223L33072a65710C6862M3018c5552A2673
$$ 57097 58990 -12393 -11759 249686 177542 69223 402295 -165710 36862 79880 -35552 12673
12357A6800J3801q059L25804a11474k05010B23476l6613e316C09875Q5660I4768
$$ 16800 30601 22542 348346 -111474 -316484 223476 186863 -5316 309875 395535 94768
12345a74655a6496A46294a8948j17284n9501A45460D8496P1552h7146k9834A35023
$$ -174655 -16496 146294 -18948 -136232 -195733 145460 48496 120048 -87146 -116980 135023
12333b1103B79914b8863j96276f5209j03584a1241j36154B7178O9160k8362B3626
$$ -21103 279914 -28863 -225139 -65209 -168793 -11241 -147395 27178 96338 67976 23626
12321i0522A14816h4643A29938g7090A39522B278a12028B23217E8772K7559J95690
$$ -90522 114816 -84643 129938 -77090 139522 2278 -112028 223217 58772 86331 282021
12310B82021b9236j15276d5751j12847L4550A48858R791d4103q4248C1136a42757
$$ 282021 -29236 -144512 -45751 -158598 -124048 148858 158649 -44103 -128351 31136 -142757
12298b7281J055l09675H3054a67115J9042k179j024A3404e910m9702A17825g7309
$$ -27281 -26226 -335901 83054 -167115 -148073 -150252 -151276 13404 -5910 -55612 117825 -77309
12285A78964F7797i9268j4703c3284A40276d4395k9716D9861P8564L6437n2609
$$ 178964 67797 -99268 -113971 -33284 140276 -44395 -74111 49861 128425 164862 112253
12274A12253B8698K1739R3311Q0740n7001E1034B4039a196H285b77953C3727d6660
$$ 112253 28698 50437 143748 224488 167487 51034 24039 -1196 8285 -277953 33727 -46660
12261a45479B2951R2814J38582f7428a61F67f8821B25685l0136p6501b86166B23012
$$ -145479 22951 115765 254347 -67428 -161 667 -68821 225685 195549 119048 -286166 223012
12248a98073a0644r9617B64003c96767C3962i3050c852n029k08619A20761a73458
$$ -198073 -10644 -110261 264003 -396767 33962 -93050 -3852 -8881 -217500 120761 -173458
12236b65603E6032L4759b7185j52017D3915A8648N2273k6035M5210M991a30768
$$ -265603 56032 90791 -27185 -179202 43915 18648 70921 44886 90096 95087 -130768
12224B14267j01369K82009o6581k8411j43467a36900B54918n5847m062B7079J72681
$$ 214267 112898 394907 328326 299915 156448 -136900 254918 199071 195009 27079 199760
12213A99760h0621A50664a63675B42304A16187N6994k2297J83572A46895c09A96525
$$ 199760 -80621 150664 -163675 242304 116187 173181 150884 334456 146895 -309 196525
12201A41000a67869A28626K7232d08436D09836c55571c0604C23451J8354C6071
$$ 141000 -167869 128626 155858 -408436 409836 -355571 -30604 323451 341805 36071
12190A00521L05677j32487j14393j65%p3471b07807K185C19689B7278d8328B77141
$$ 100521 406198 273711 159318 159153 159153 85682 -207807 -205622 319689 27278 -48328 277141
12177b4350f254A40816J85322D2140O7871o194R2187o5882o1365Q3143J08605
$$ -24350 -6254 140816 326138 42140 110011 103817 196004 130122 68757 151900 260505
12166B60505j28281n8379h5147k0715j01070A10724K34532q4269a0082j77632
$$ 260505 132224 73845 -85147 -105862 -206932 110724 345256 260987 -10082 -187714
12156a87714j85427B24470o0648g8402j7149i45B63122b9678C943a53315D40524
$$ -187714 -373141 224470 163822 -78402 -95551 -945 263122 -29678 3943 -153315 440524
12144b83728A40455B6801L10530A16810k8272j2696G275M1658a08041k8338B28318
$$ -283728 140455 26801 337331 116810 88538 75842 7275 48933 -108041 -136379 228318
12132I5102J12051n2015p4333a57079A09205a44114A40553O6990a02151l7357
$$ 95102 207153 155138 80805 -157079 109205 -144114 140553 207543 -102151 -139508
12122a39508b6160A61636j2183C4459a6459B06644L4728J95300a3273j73900A3206
$$ -139508 -26160 161636 149453 34459 -16459 206644 241372 436672 -13273 -187173 13206
12110A87386b35358H0057c46408C91907B5027L0329g4053e880A38331o629a45569
$$ 187386 -235358 80057 -346408 391907 25027 55356 -74053 -5880 138331 131702 -145569
12098F3392i6437j41399D17087A45791a78685L9491B58788a53260j23240b9068
$$ 63392 -96437 -237836 417087 145791 -178685 -139194 258788 -153260 -276500 -29068
12087A84148k7075f5284B05830b08420Q718h660r9184B74245j06490c19556A66075
$$ 184148 157073 -65284 205830 -208420 -199702 -8660 -107844 274245 167755 -319556 166075
12075e2571G3454a20016H9507j3091P1130R8412r8757l4750g8981D0010J13125
$$ -52571 73454 -120016 89507 76416 147546 245958 147201 112451 -78981 40010 153135
12064A53135a12674C04153K92327A49952a19966D60731a38142A46592J07296A15536
$$ 153135 -112674 304153 596480 149952 -119966 460731 -138142 146592 253888 115536
12053a09721j8789A08298a55572P2718m9547j01512b5444B18614d13284A17607
$$ -109721 -128510 108298 -155572 -82854 -132401 -233913 -25444 218614 -413284 117607
12042G7939b08811J5120h8551o1958A16957J25689b00949A6613a16382g387B97182
$$ 77939 -208811 -193691 -88551 -150509 116957 242646 -200949 16613 -116382 -7387 297182
12030B1095a98569Q0033b198B65009a76974C76357A74553p7213A9339J87686o0852
$$ 21095 -198569 -118536 -2198 265009 -176974 376357 174553 97340 19339 207025 146173
12019A46173c04473a46936G4139k8722o690a80111j98132a08162l10826J89569
$$ 146173 -304473 -146936 74139 45417 38727 -180111 -378243 -108162 -418988 -229419
12009b29419a12217B22621A00335b91210L3051b4193q4178J9315b0322j50978
$$ -229419 -112217 222621 100335 -291210 -258159 -24193 -108371 -89056 -20322 -171300
11999a71300I9352h6995a6544A18603E65a64689G6618r526d32030A94514i4215
$$ -171300 99352 -86995 -16544 118603 565 -164689 76618 67092 -432030 194514 -94215
11987B67422e3457F0479a8526k19397A51906a12785N6063j39778A1487f7211K3726
$$ 267422 -53457 60479 -18526 -237923 151906 -112785 -56722 -196500 11487 -67211 -43485
11976d3485B62003h1273J2299A34008l8433K5183f2097k5324A18471e0840j41632
$$ -43485 262003 -81273 -68974 134008 95575 120758 -62097 -87421 118471 -50840 -192472
11965a92472f296m03292J65393P8478A4518i809l10765c5022r0099f972J153p5529
$$ -192472 -6296 -409588 -244195 -165717 14518 -9809 -320574 -35022 -125121 -6972 -5819 -81348
11953h1348m5957j60846A00127a46770A33881b21205h3193L2860A6323a60565
$$ -81348 -127305 -288151 100127 -146770 133881 -221205 -83193 -50333 16323 -160565
11942E6019J643J85279M5133a8088A2486h7295f777l3365j42826M9253G2921f2975
$$ 56019 57662 242941 288074 -18088 12486 -87295 -6777 -40142 -182968 -133715 72921 -62975
11929B94318j22897a42142E9108b67689m0473a26742F8948f3223I569K36733a72780
$$ 294318 171421 -142142 59108 -267689 -308162 -126742 68948 -63223 9569 246302 -172780
11917H7324K3901c24369F6774J6237f6225q8613l5498A77887p4952k3683B4996
$$ 87324 111225 -324369 66774 83011 -66225 -154838 -190336 177887 102935 79252 24996
11905a62633m9481M197L9158A18708J92958i8295j21682r5555B51976o6485b28844
$$ -162633 -212114 -207917 -168759 118708 311666 -98295 -219977 -315532 251976 185491 -228844
11893b0158I9882C209K10006b69515A54570L5533m0718d41131e4585l8110k6388
$$ -20158 99882 3209 213215 -269515 154570 190103 149385 -441131 -54585 -92695 -119083
11882a19083B9525c34115H9202a08340b9692A21524b12407A3721K32274H5008
$$ -119083 29525 -334115 89202 -108340 -29692 121524 -212407 13721 245995 85008
11871H2988d01470J39825J06989p7772o874Q4588j59032F8980a9852f932j48590
$$ 82988 -401470 -261645 -154656 -232428 -239302 -154714 -313746 68980 -19852 -6932 -155522
11860a55522K2237a6951p5268I3632J83766i0742m6318b4196k57073R5916O6350
$$ -155522 -133285 -16951 -92219 93632 277398 -90742 -137060 -24196 -281269 -185353 -119003
11849a19003J542I1914i2936D8606J78754a35982A97406c1416l55441e6577E9422
$$ -119003 -117461 91914 -92936 48606 227360 -135982 197406 -31416 -386857 -56577 59422
11837b92972Q2956F7660k7973f6353D769a11240A51030a89355A19682a89937C25491
$$ -292972 -210016 67660 39687 -66353 4769 -111240 151030 -189355 119682 -189937 325491
11825A01571A6749O4647L0711a69997P9429A8783b68357A52745a90312J2585B87691
$$ 101571 16749 81396 112107 -169997 -90568 18783 -268357 152745 -190312 -177727 287691
11813a62149l578j70774A02312b9816l69495B27853c96440g3933n4388C37276
$$ -162149 -165727 -336501 102312 -29816 -399311 227853 -396440 -73933 -128321 337276
11802F469O3133a99871A30160f4584l3137B55816a33962j1029G4959j9262M3488
$$ 6469 69602 -199871 130160 -64584 -97721 255816 -133962 -144991 74959 55697 99185
11791I9185b84609Q3387N8204G1849c9889A09501b34826i9205q1445J9761b790
$$ 99185 -284609 -201222 -143018 71849 -39889 109501 -234826 -99205 -180650 -160889 -2790
11779F1255O0481a58135F046K14206E8186g8081I7510a51377A364c6005A17618
$$ 61255 121736 -158135 6046 220252 58186 -78081 97510 -151377 1364 -36005 117618
11767b0815B04291c16965j54373A04019a03813A3531a08688j32910A32303P9929
$$ -20815 204291 -316965 -471338 104019 -103813 13531 -108688 -241598 132303 212232
11757B12232O8892A4524a05656b7288q5291A39609B4648a36155G9230C6963K59389
$$ 212232 281124 14524 -105656 -27288 -112579 139609 24648 -136155 79230 36963 296352
11746B96352A14117A2757c49141j9059a84088d0659j5375j2380D13635F5472R0521
$$ 296352 114117 12757 -349141 -368200 -184088 -40659 -56034 -68414 413635 65472 155993
11735A55993i8409a1648q0565n6902A6141c01758g7732C0451a64251A50880d6999
$$ 155993 -98409 -11648 -92213 -149115 16141 -301758 -77732 30451 -164251 150880 -46999
11723E3079j0192a96333A297N121d04773k289D2359d1027A2146K07871r0525a6203
$$ 53079 42887 -196333 1297 6418 -404773 -407062 42359 -41027 12146 220017 129492 -16203
11710A90428M4087b6024C11758q6595a63845O0722c6432a2439H3435J89835a1488
$$ 190428 234515 -26024 311758 225163 -163845 -103123 -36432 -12439 83435 273270 -11488
11698H9999O7301J01102A01994h9896j1552M82A13469b5956B37000e6219G7795
$$ 89999 157300 258402 101994 -89896 -101448 -100966 113469 -25956 237000 -56219 77795
11686H0031B7737b14649M838k5300A33499i3005D0056J13008k5649b39190g2017
$$ 80031 27737 -214649 -209811 -235111 133499 -93005 40056 153064 127415 -239190 -72017
11674E4683k4014g210F2646j9102N0381g6576I4223a6362E5922h315A10801a41006
$$ 54683 30669 -7210 62646 43544 93925 -76576 94223 -16362 55922 -8315 110801 -141006
11661i3983F4072J73723i1687C5177M4728b4727A88544c38567L4785g838j8848
$$ -93983 64072 237795 -91687 35177 79905 -24727 188544 -338567 -303782 -7838 -26686
11650b6686k42355A03180a34465A04803B7784a20915j75618A99684b07754N6510
$$ -26686 -269041 103180 -134465 104803 27784 -120915 -296533 199684 -207754 -151244
11640a51244I0983C5712P0972b52078r968c2104j68716F3445b05926m6639a8408
$$ -151244 90983 35712 106684 -252078 -262046 -32104 -200820 63445 -205926 -252565 -18408
11628A7533b19779g9841G3939K6979a45296B17977I9491k9349Q1824a42988p0010
$$ 17533 -219779 -79841 73939 100918 -145296 217977 99491 70142 151966 -142988 -212998
11617b12998E3149c51563D2655f6005A36539c88536A75261a89043A57076O6187
$$ -212998 53149 -351563 42655 -66005 136539 -388536 175261 -189043 157076 223263
11607B23263e49163A38533J02319m3122a42314C3744N5477c08892A73393C6491
$$ 223263 -549163 138533 240852 197730 -142314 33744 89221 -308892 173393 36491
11596a16992B51997b55598d1104p1186r661L9905k00725H8888g4341I0552k3585
$$ -116992 251997 -255598 -41104 -112290 -121951 -82046 -282771 88888 -74341 90552 66967
11585F6967a17756j39952B94708d8457A35368a9009C10838G1823a85353A83737
$$ 66967 -117756 -257708 294708 -48457 135368 -19009 310838 71823 -185353 183737
11574B56214A8194m484b9770A70892m0531a25499N2840G3958K17499j38815a08712
$$ 256214 18194 13710 -29770 170892 130361 -125499 -72659 73958 291457 152642 -108712
11562B89539a03071j46329D27463A86110N967b40357O2212N9237G70J98140b316
$$ 289539 -103071 -249400 427463 186110 192077 -240357 -178145 -118908 770 198910 -2316
11550b5609l6266G8478K3318J3429c16566L4184a13831A97290B7393K3580j8632
$$ -25609 -61875 78478 101796 115225 -316566 -282382 -113831 197290 27393 50973 32341
11539C2341L34252A0072K98735p9188E4850a22818J0641A44802Q5838C6095a57343
$$ 32341 366593 10072 308807 229619 54850 -122818 -112177 144802 230640 36095 -157343
11527a77863B12334E6880J89682J79359H777M7303R1111l5533a81216A20372a03893
$$ -177863 212334 56880 246562 425921 8777 56080 147191 111658 -181216 120372 -103893
11515a59552B54342e2557D740R6490e6489o4994j45516C1883K93527h4577D39633
$$ -159552 254342 -52557 4740 101230 -56489 -121483 -266999 31883 325410 -84577 439633
11503d1485B60729k3391a76788g0897j08806O0946K9253E3294J4869R3447Q0693
$$ -41485 260729 237338 -176788 -70897 -179703 -118757 -89504 53294 68163 161610 242303
11492B42303F94a80938n6852b9744G4791K78992J4478A28437b51666B27827b9827
$$ 242303 694 -180938 -237790 -29744 74791 353783 368261 128437 -251666 227827 -29827
11480b2908B7804K08050r3986e3509j41370P1650C31800C5259g9407j14410G6237
$$ -22908 27804 235854 141868 -53509 -194879 -123229 331800 35259 -79407 -193817 76237
11468g2575B49040b85729A08155P8144a42B63393A09223M3922b22658C02271r0490
$$ -72575 249040 -285729 108155 186299 -142 263393 109223 153145 -222658 302271 211781
11457B11781a58539L9970C5566J54531a21332p5727D74055j73210o0059A09227
$$ 211781 -158539 -118569 35566 190097 -121332 -197059 474055 300845 240786 109227
11446A55678k6683a06530A93301b44521a14850j50244h9209I1757J06874Q8525
$$ 155678 128995 -106530 193301 -244521 -114850 -265094 -89209 91757 198631 287156
11436B87156m8114q618D2298n602i3106A25054E3215a60767N9662E16664a93583
$$ 287156 239042 230424 42298 36696 -93106 125054 53215 -160767 -101105 516664 -193583
11424A87316k6072K8647a78815A32366Q6167b9988A28930A3929a29355M9779K7843
$$ 187316 161244 189891 -178815 132366 218533 -29988 128930 13929 -129355 -79576 -51733
11413e1733J806C33203l7624b20214N9324j84996b721p8044B09530B4954J0703
$$ -51733 -49927 333203 295579 -220214 -160890 -345886 -2721 -80765 209530 24954 35657
11402C5657h4458A42150h6635A18204K26776c03345o3496J82961B303J83763b47135
$$ 35657 -84458 142150 -86635 118204 344980 -303345 -366841 -183880 2303 186066 -247135
11390E2361J50050i088o5614B26504b51492h6975B7390K0236J45016b60926a25782
$$ 52361 202411 -9088 -74702 226504 -251492 -86975 27390 47626 192642 -260926 -125782
11378a57054j10292i7480j3952A7551b05181h7652k24611J41037j5056C1522a98520
$$ -157054 -267346 -97480 -111432 17551 -205181 -87652 -312263 -171226 -186282 31522 -198520
11366f0529p7177D51060B0664K84404d1898j0157G4424P1751c68081c7371j34048
$$ -60529 -137706 451060 20664 305068 -41898 -52055 74424 146175 -368081 -37371 -171419
11355a71419I9155A6687d4822A51459c29910a64850q6447A00741c13537D4601
$$ -171419 99155 16687 -44822 151459 -329910 -164850 -251297 100741 -313537 44601
11344c09557A11334c19971a20293j31639j98453B60067a8884E1008R13J0348J83281
$$ -309557 111334 -319971 -120293 -251932 -450385 260067 -18884 51008 51921 62269 245550
11333B45550e164D16744b32712k0117A33634a47203B00944a24742H6710b1864
$$ 245550 -5164 416744 -232712 -252829 133634 -147203 200944 -124742 86710 -21864
11322B6342a96007E797O1192d816A73628a21322e7815m422K8772C2316K5691f5745
$$ 26342 -196007 5797 66989 -4816 173628 -121322 -57815 -62237 -33465 32316 58007 -65745
11309a19700e7599A34462f2279A52673e5583B13299a32468C04044d2222p5427
$$ -119700 -57599 134462 -62279 152673 -55583 213299 -132468 304044 -42222 -117649
11299a17649j64310a38269l3913b8022A4515i7062q8307b6262k3932C5382m274
$$ -117649 -281959 -138269 -172182 -28022 14515 -97062 -185369 -26262 -50194 35382 31108
11288C1108h7197B40878f4713H8876b74700a32144B32959a17267M3578A19337
$$ 31108 -87197 240878 -64713 88876 -274700 -132144 232959 -117267 -73689 119337
11277B60355B9751a31929m6688j8485r2657A03052e1336A56449f6838j29037N1302
$$ 260355 29751 -131929 -178617 -197102 -289759 103052 -51336 156449 -66838 -195875 -144573
11266a44573d8710O880l38280R7848c8058G6394J25241D668b69558J30690A31201
$$ -144573 -48710 -41830 -380110 -282262 -38058 76394 201635 4668 -269558 -138868 131201
11254f3126j89884R9440l4975J8979L5070b4200F8932b05307A58826a05247D4031
$$ -63126 -253010 -153570 -188545 -169566 -134496 -24200 68932 -205307 158826 -105247 44031
11242b7630B468L72464b14145G3345k4055K01033c9934F1894a76153A00699i3733
$$ -27630 2468 374932 -214145 73345 49290 250323 -39934 61894 -176153 100699 -93733
11230B72465A08602E2154b17298B28498a73413a4775m00780a74493O4477A2805
$$ 272465 108602 52154 -217298 228498 -173413 -14775 -415555 -174493 -110016 12805
11219A87099J71711p3048h2864F3662c04511C31947b64392C382c65460g2217j81591
$$ 187099 358810 285762 -82864 63662 -304511 331947 -264392 3382 -365460 -72217 -253808
11208b53808J16963f8022j63360j12601L5249f0936A5571K46503b44695j22690
$$ -253808 -136845 -68022 -231382 -343983 -308734 -60936 15571 262074 -244695 -367385
11198c67385a30387C2953J26370J45355q4390C3500e8511B64895c9909M86k58755
$$ -367385 -130387 32953 159323 304678 220288 33500 -58511 264895 -39909 -39423 -298178
11187b98178e9195A17900a66234C7058a11438j59831d1913J3742D2712a85660
$$ -298178 -59195 117900 -166234 37058 -111438 -271269 -41913 -28171 42712 -185660
11176a33286b5473j11570N0565j55842G1455a51448B41026p9396a55992B81117
$$ -133286 -25473 -137043 -86478 -242320 71455 -151448 241026 161630 -155992 281117
11165e5521j54531L8138j36569a23401C7901A7730c26028A21554n103C6358K9499
$$ -55521 -210052 -171914 -308483 -123401 37901 17730 -326028 121554 116451 36358 65857
11154F5857a34299A07200a44240A51993M0500a66586A68650Q69D4739a64809j3294
$$ 65857 -134299 107200 -144240 151993 192493 -166586 168650 169519 44739 -164809 -178103
11143a78103C5863a67219A68226a47316m9640L4740A10043b16134k842A78188
$$ -178103 35863 -167219 168226 -147316 -196956 -162216 110043 -216134 -218976 178188
11132A76462K89376f9559k38648A80732D3918a21395d8364j77194B4971J16964
$$ 176462 465838 -69559 -308207 180732 43918 -121395 -48364 -225558 24971 141935
11122A41935b24086A76097a38392p969d2534j7760d505j25199A3818i0125c8871
$$ 141935 -224086 176097 -138392 -146361 -42534 -60294 -4505 -129704 13818 -90125 -38871
11110B77807a35373m21789F447a19417C56655a34538B39194J14450E7591J47488
$$ 277807 -135373 -557162 6447 -119417 356655 -134538 239194 353644 57591 205079
11100B05079a0164I6689g5o6127A44498J1650G2381K82632A51446A573J66682
$$ 205079 -10164 96689 -75 -66202 144498 156148 72381 355013 151446 1573 168255
11089A68255a69379G1733a17111B4915J81114D5456Q2093b144B74617H1973d3716
$$ 168255 -169379 71733 -117111 24915 206029 45456 127549 -2144 274617 81973 -43716
11077e7961C30311g9009E6199L7001k8973L5940C8459J75953o0320K39246E8095
$$ -57961 330311 -79009 56199 93200 64227 100167 38459 214412 154092 393338 58095
11065A95924A0433K60909J72613A33269J24820A26970J48200c7734C91086b2270
$$ 195924 10433 271342 443955 133269 258089 126970 275170 -37734 391086 -22270
11054B01878L36851k48933J75577j4467l9836J36118j38183J3876I1516L00065
$$ 201878 538729 289796 465373 450906 411070 547188 409005 422881 91516 391581
11044C91581P6583j03785j01231J49532k5572A29979M37357E838O24110B62652
$$ 391581 468164 364379 263148 412680 387108 129979 567336 5838 629948 262652
11033E54210B44981K63376j62994Q323J350j72788M30600B06111a60741B30792
$$ 554210 244981 508357 345363 353686 355036 182248 612848 206111 -160741 230792
11022E16567J06479k13481j0602J11155j64330j29557L07011k18928k98D7199
$$ 516567 623046 409565 398963 510118 345788 216231 523242 304314 304016 47199
11011E53973J60042k70540o066j32512A35517R4443b54116E06967A97056m5287
$$ 553973 714015 443475 437409 304897 135517 229960 -254116 506967 197056 151769
11001A51769K93267j11313K0364M6797r4440J24334j94367K69040B45197m2342
$$ 151769 445036 333723 354087 400884 306444 430778 236411 505451 245197 202855
10991B02855K74576A20826K79579K07685k37642N9373K35342Q1891k51777n8176
$$ 202855 477431 120826 400405 608090 370448 429821 665163 747054 495277 437101
10981D37101J92363L08017D30914J04622K7502J45461J61319p2617K1123Q7315
$$ 437101 629464 937481 430914 535536 563038 708499 869818 797201 818324 905639
10971I05639J75665O7339L85039k39603K08368J3293l23587K59338N8660l34653
$$ 905639 1081304 1148643 1533682 1294079 1502447 1515740 1192153 1451491 1510151 1175498
10961A175498k67720L20731L7336l29081r8472j91717L97461l37490L26627j56849
$$ 1175498 907778 1228509 1265845 936764 838292 646575 1044036 706546 1033173 876324
10951H76324J38962k16244K7040J90997m15975J38241j40961p8605D4383M04686
$$ 876324 1015286 799042 826082 1017079 601104 739345 598384 519779 44383 449069
10941D49069A82334J09278o1973h8780B18474e579B43416o3867J69615C1054K23196
$$ 449069 182334 291612 229639 -88780 218474 -5579 243416 179549 349164 31054 254250
10930B54250b1525k88385A26575n4979a80953d9708a0708B98955I2441l5605a48114
$$ 254250 -21525 -309910 126575 71596 -180953 -49708 -10708 298955 92441 56836 -148114
10918b62446M7768C84253j77723f8890C52005A14183K9633B3851c2022m0669j6112
$$ -262446 -214678 384253 206530 -68890 352005 114183 143816 23851 -32022 -72691 -88803
10907h8803A1492b77364A75559c87036C13494c74018G3022P0015J18534J7809
$$ -88803 11492 -277364 175559 -387036 313494 -374018 73022 143037 261571 279380
10897B79380a94495B59402g4394J6721a1498m5000n8250K9663l0644B07298h524
$$ 279380 -194495 259402 -74394 -57673 -11498 -56498 -114748 -85085 -115729 207298 -8524
10885a5324p0400B21524h9406A85128a41491G9011a42325o8840f2263k5523A68538
$$ -15324 -85724 221524 -89406 185128 -141491 79011 -142325 -211165 -62263 -87786 168538
10873a70217H6730c00626K9216A99311c61235G7916a93140B54008a49964B23319
$$ -170217 86730 -300626 -271410 199311 -361235 77916 -193140 254008 -149964 223319
10862a55027c5922J1123B49260r4556f9478J1001D45075a97497j76202a47441
$$ -155027 -35922 -24799 249260 154704 -69478 -58477 445075 -197497 -373699 -147441
10851a8410A18156c10260P3525b2259C18439a97681B85058C8865K04072g584A8119
$$ -18410 118156 -310260 -236735 -22259 318439 -197681 285058 38865 242937 -7584 18119
10839b439D24762a96792j6159e8709J4192l21088a755l2051l44190C12045b7420
$$ -2439 424762 -196792 -212951 -58709 -44517 -365605 -1755 -33806 -377996 312045 -27420
10827b9961k3659k67445A79561d134l90582B18635D3742a59570l1785r7571d8671
$$ -29961 -53620 -321065 179561 -4134 -394716 218635 43742 -159570 -191355 -288926 -48671
10815a30722b669B43258r6721F4791f2486j751l4285d0328j18010O1505m0846
$$ -130722 -2669 243258 146537 64791 -62486 -64237 -98522 -40328 -158338 -96833 -137679
10804a37679K6560J9845o5536H4021R3500B8831i0295m05759A24380b35141Q4765
$$ -137679 -111119 -91274 -156810 84021 177521 28831 -90295 -496054 124380 -235141 -150376
10793a50376G8911J38210c39303C58789a75171b3025m5999H5777c36439a02721
$$ -150376 78911 217121 -339303 358789 -175171 -23025 -69024 85777 -336439 -102721
10782b35866j56410a04056m5388f6228a1857A85949M0596a22372J1193M2362A03174
$$ -235866 -392276 -104056 -149444 -66228 -11857 185949 226545 -122372 -111179 -68817 103174
10770B17140i6709B50188i037A4502A961L85210b73140J08729O9415j16025A08679
$$ 217140 -96709 250188 -9037 14502 1961 387171 -273140 -164411 -94996 -211021 108679
10758c36415J09625F6828a22885E01482k08971b99289B10420a11534A85716c59810
$$ -336415 -226790 66828 -122885 501482 292511 -299289 210420 -111534 185716 -359810
10747C8785a53339A09296k3669b90725g042r7187j1117d9528I613Q1993c0701
$$ 38785 -153339 109296 85627 -290725 -7042 -104229 -115346 -49528 9613 91606 -30701
10735i9182j3382A11734c3429k43170a11960A0439e9845b3406l5662A80372i2246
$$ -99182 -112564 111734 -33429 -276599 -111960 10439 -59845 -23406 -59068 180372 -92246
10723g2052j1480A15288J4075l2997b55896P6354M3473n6880e3236A1822B271
$$ -72052 -83532 115288 129363 96366 -255896 -179542 -136069 -192949 -53236 11822 2271
10711b7289A67551a41624B36749m2434a47269O8303A27966J35799e4322K2658
$$ -27289 167551 -141624 236749 194315 -147269 -78966 127966 263765 -54322 -31664
10701c1664l5967k61246a62356D1418J50525a21072q009K7831A371c35928R6862
$$ -31664 -67631 -328877 -162356 41418 191943 -121072 -129081 -101250 1371 -335928 -239066
10690b39066i9803b4679A19625N7882J5783R8181d31255a68595F32841A23452
$$ -239066 -99803 -24679 119625 177507 193290 291471 -431255 -168595 632841 123452
10679b08161k57702f5960l657G9675a76284A42037J48807j41244a05638e1695
$$ -208161 -465863 -65960 -69617 79675 -176284 142037 290844 149600 -105638 -51695
10668C68473C9782f2383p4435B92076E3595b47650B05894b15411B0994M12789
$$ 368473 39782 -62383 -136818 292076 53595 -247650 205894 -215411 20994 433783
10658D33783a82426d4339j58570A44280c5807k6532l925a7766k62846j67680A91492
$$ 433783 -182426 -44339 -202909 144280 -35807 -62339 -66264 -17766 -280612 -448292 191492
10646a18296E106b46486C26132a05038A29014J37355f8384q6880A55023b30472
$$ -118296 5106 -246486 326132 -105038 129014 266369 -68384 -155264 155023 -230472
10635H721a58158K7918A69992d15337a8859n7136C60336A0296c05650b5157j76383
$$ 8721 -158158 -130240 169992 -415337 -18859 -75995 360336 10296 -305650 -25157 -201540
10624b01540A01475B4689K2010b5066k52283Q2677C6760b06491Q5416B1719a74820
$$ -201540 101475 24689 46699 -25066 -277349 -194672 36760 -206491 -121075 21719 -174820
10612c9369j83667F9926G174g4930A57864c11040b1981l42066E5706a74232M8176
$$ -39369 -223036 69926 7174 -74930 157864 -311040 -21981 -364047 55706 -174232 -126056
10601a26056l12539M743a27064B1220L3459c68391J38171g0283A8952d0481H0136
$$ -126056 -438595 -433852 -127064 21220 54679 -368391 -230220 -70283 18952 -40481 80136
10589E7663k3080f5676l37435E6931g9066A08971a22472B82812i7958D856e4048
$$ 57663 34583 -65676 -403111 56931 -79066 108971 -122472 282812 -97958 4856 -54048
10577d3885k11845E9526d50011a67335I6386A8408h9258A90534b20674q509r9077
$$ -43885 -255730 59526 -450011 -167335 96386 18408 -89258 190534 -220674 -229183 -328260
10566c28260d860p9501j67112I8746B2479c6642A08371p464a10693d9617j11006
$$ -328260 -4860 -84361 -251473 98746 22479 -36642 108371 100907 -110693 -49617 -160623
10555a60623b9534m4087E3271a5831C31485h7650A5469e78513B08614a38225k32176
$$ -160623 -29534 -73621 53271 -15831 331485 -87650 15469 -578513 208614 -138225 -370401
10544c70401J16227e629l392n6988C3021a00667B4069g442j03820j45937P2397
$$ -370401 -254174 -5629 -9021 -66009 33021 -100667 24069 -7442 -111262 -257199 -184802
10533a84802K0328A17469D4599h9881A47653c96119d2338A71320d4526a0491m9251
$$ -184802 -164474 117469 44599 -89881 147653 -396119 -42338 171320 -44526 -10491 -59742
10522e9742j06982b1357A25904c881C7675b47941a059k17649E9242c0422j43612
$$ -59742 -166724 -21357 125904 -3881 37675 -247941 -1059 -218708 59242 -30422 -174034
10511a74034A41935c51134A2851J15408g0090A18486b9328l14720M0898a07495
$$ -174034 141935 -351134 12851 128259 -70090 118486 -29328 -344048 -303150 -107495
10500b95206g8850B02588b74387D3158A5332K53695a04358N1974k789m1829A52659
$$ -295206 -78850 202588 -274387 43158 15332 269027 -104358 -52384 -55173 -97002 152659
10488b20581B18195b68271B71185m3683n8394b48934N2518R1248B19625b8253
$$ -220581 218195 -268271 271185 227502 169108 -248934 -196416 -105168 219625 -28253
10477B67836C5572J3844Q6170D2916J79675K0499H6348i5612C62614b98552C6397
$$ 267836 35572 49416 135586 42916 222591 243090 86348 -95612 362614 -298552 36397
10465g9924A06731j9452a49190m4673F6351P4907F7559b48817a2963o5382A74220
$$ -79924 106731 87279 -149190 -193863 66351 141258 67559 -248817 -12963 -78345 174220
10453A79620b35348I8967a68141k99869a18975j01522d3810k51296l0102A35012
$$ 179620 -235348 98967 -168141 -468010 -118975 -220497 -43810 -295106 -325208 135012
10442h0047f62A12159a24121A34093c2322q9358b777j45524H4072b99754d3721
$$ -80047 -662 112159 -124121 134093 -32322 -121680 -2777 -148301 84072 -299754 -43721
10430H8993b05267E9328h0357j19109L3933A86311a88984H9814b94995F5497a87018
$$ 88993 -205267 59328 -80357 -199466 -165533 186311 -188984 89814 -294995 65497 -187018
10418a46878B3714g4086H4892J48875g1331j62282F5500a5205C7660Q0328J47522
$$ -146878 23714 -74086 84892 233767 -71331 -233613 65500 -15205 37660 117988 265510
10407B65510B2325c9311J4631j42979k31363B41314h8317A68991d0925j80299
$$ 265510 22325 -39311 -24680 -167659 -399022 241314 -88317 168991 -40925 -221224
10397b21224G6857N7496J19742b6705o4957M5428l47014C43324f5515B87539d3346
$$ -221224 76857 134353 254095 -26705 -91662 -46234 -393248 343324 -65515 287539 -43346
10385d8578r12j15535B45693K18429d9769p1392A99964a08827k00336J22558B50192
$$ -48578 -49490 -165025 245693 464122 -49769 -121161 199964 -108827 -309163 -186605 250192
10373B14844r9753c78754A26511k2853J48114b28420d4182A01507M719p652J09748
$$ 214844 115091 -378754 126511 103658 251772 -228420 -44182 101507 106226 98574 208322
10362B08322J01737I2107P3860o2551d0942A33752M3225J60266A01062c96488
$$ 208322 310059 92107 165967 103416 -40942 133752 176977 337243 101062 -396488
10351C28330P517j0991F4508J43214J44796J24496B28781j3924K6062J93866J8363
$$ 328330 335847 324856 64508 207722 352518 477014 228781 214857 240919 434785 453148
10340D53148j60044j16482J69247P35j63981K8476c8272G7860f6691k3989o2404
$$ 453148 293104 176622 345869 346604 182623 211099 -38272 77860 -66691 -90680 -153084
10329a53084b0207A28003E8550L1973a0828A30538a674F0131B0197J97059A2760
$$ -153084 -20207 128003 58550 90523 -10828 130538 -1674 60131 20197 217256 12760
10317E7830K39686c3880F2627b50598B19821I8477b87065D6764A4511c935j29127
$$ 57830 297516 -33880 62627 -250598 219821 98477 -287065 46764 14511 -3935 -133062
10306a33062d4887A53458O5476q5466D0597f4820l36747A29168j5720e8154j41856
$$ -133062 -44887 153458 218934 133468 40597 -64820 -401567 129168 113448 -58154 -200010
10295b00010I3062B6113b1447j8710j42283b2883E0106d1510k89913A11701k4165
$$ -200010 93062 26113 -21447 -40157 -182440 -22883 50106 -41510 -331423 111701 87536
10284H7536n319c77597B34827D0395a79280O2206L5311m4652l94819b58798O1155
$$ 87536 82217 -377597 234827 40395 -179280 -117074 -81763 -126415 -521234 -258798 -197643
10273a97643A26505b71634E6650g9136A73600C965K01135J88035c75415a48028
$$ -197643 126505 -271634 56650 -79136 173600 3965 205100 393135 -375415 -148028
10262b93520C5531e6066A45022l581n8646i3105B43585J39590j84045n386J40181
$$ -293520 35531 -56066 145022 141441 82795 -93105 243585 383175 199130 193744 333925
10251C33925r1509h5581B26147B7810R504a72745B04304q4572J71223G7191b46781
$$ 333925 242416 -85581 226147 27810 37314 -172745 204304 119732 290955 77191 -246781
10239c7073B3923F650J15825a26125B9494b43253F4576l0151b85448B8909c61205
$$ -37073 23923 6650 122475 -126125 29494 -243253 64576 34425 -285448 28909 -361205
10227b68299J805f9814K8240G9410N685g5809k05980a33868a3533k21284h6395
$$ -268299 -266494 -69814 -41574 79410 85095 -75809 -281789 -133868 -13533 -234817 -86395
10215c1821E4901a35756k77008A42364q891h8876d0803B89353f6848l2282a3979
$$ -31821 54901 -135756 -412764 142364 133473 -88876 -40803 289353 -66848 -99130 -13979
10203f412l53196I3974A0036c42590a400n1461A24965c4442B45829a17177c4239
$$ -6412 -359608 93974 10036 -342590 -1400 -52861 124965 -34442 245829 -117177 -34239
10191A18941h8526g806B24590c76028d0791j75979c6195E9347C536h3596A46115
$$ 118941 -88526 -7806 224590 -376028 -40791 -216770 -36195 59347 3536 -83596 146115
10179A50979k2965a22099G5603f5366D7599a55787C0055H461d3159k59287k5851
$$ 150979 128014 -122099 75603 -65366 47599 -155787 30055 8461 -43159 -302446 -328297
10168c28297a18723B5086d1936l21593J20252A31876d61774d2024F803d1009p214
$$ -328297 -118723 25086 -41936 -363529 -243277 131876 -461774 -42024 6803 -41009 -48223
10157d8223k41649a12587a167k72822a8546j97144A84866H3159P9312k2128D7412
$$ -48223 -289872 -112587 -1167 -273989 -18546 -215690 184866 83159 162471 140343 47412
10145A4734J03379b76172g5105B18746q5450a95495h342k89958C499e9329k05577
$$ 14734 118113 -276172 -75105 218746 133296 -195495 -8342 -298300 3499 -59329 -264906
10134b64906f5688k48068O6786C93449b8183G537d0295J1043l01102h4097m5374
$$ -264906 -65688 -313756 -246970 393449 -28183 7537 -40295 -29252 -330354 -84097 -129471
10123a29471A72245E4317a82403F0794a95730k0463O2293k1296d8148j26095P9832
$$ -129471 172245 54317 -182403 60794 -195730 -216193 -153900 -175196 -48148 -174243 -94411
10112i4411k04263g6891j39834a03806j9479M2456j05590N9814d6939I8161f2276
$$ -94411 -298674 -76891 -216725 -103806 -123285 -80829 -186419 -126605 -46939 98161 -62276
10100f7505q2077m5115L1456g9413q2433c676B45590p0104c0035j2406o0629A58040
$$ -67505 -149582 -194697 -163241 -79413 -161846 -3676 245590 175486 -30035 -42441 -103070 158040
10087A13840e5592q1123K2312j12806h7897j8692A09469B4632f2628k36890d1939
$$ 113840 -55592 -136715 -114403 -227209 -87897 -106589 109469 24632 -62628 -299518 -41939
10075H6753a33892N3958C6794h3128j9277A67075b30977A13326a3000D20095E0863
$$ 86753 -133892 -79934 36794 -83128 -102405 167075 -230977 113326 -13000 420095 50863
10063b09362M9184A10756k2704a29920f0439m2286B32092c26974a29302l58793
$$ -209362 -160178 110756 88052 -129920 -60439 -102725 232092 -326974 -129302 -488095
10053d88095a52875e9498H5294e9979j26346g4826A1221B709J26422D0434c36930
$$ -488095 -152875 -59498 85294 -59979 -186325 -74826 11221 2709 129131 40434 -336930
10041E1882j9645b56569c8404G7850b7554B2207d6244A04437D2492M7689f7384
$$ 51882 32237 -256569 -38404 77850 -27554 22207 -46244 104437 42492 90181 -67384
10029A01449J40830G0965M5807a77657q4004G5975M7236a85098B06422r8499g215
$$ 101449 242279 70965 116772 -177657 -261661 75975 123211 -185098 206422 107923 -7215
10017G7548c25360e6417O636A44234f2691B6558J44862a87433I8593g0337j2553
$$ 77548 -325360 -56417 -49781 144234 -62691 26558 171420 -187433 98593 -70337 -82890
10006h2890B2332a31341d358l2640F1858c78176i2850n5715j59091F6821i1179
$$ -82890 22332 -131341 -4358 -36998 61858 -378176 -92850 -148565 -307656 66821 -91179
9994B4048J19679d67319a79715Q6939F8548d85320H2630j9786J28432A07a46295
$$ 24048 143727 -467319 -179715 -92776 68548 -485320 82630 62844 191276 107 -146295
9982a67759A9299P31M1711a33611b1369C06386h6774L7024j32205B95546e4911
$$ -167759 19299 20030 61741 -133611 -21369 306386 -86774 -49750 -181955 295546 -54911
9970a88066a973j9820k51498a10198j08699A77107i7364K5478k30492G049c1964
$$ -188066 -1973 -21793 -273291 -110198 -218897 177107 -97364 -71886 -302378 7049 -31964
9958A69748a49103f454j40365c6241l82359G5853a44861A94178K38321c7270A32312
$$ 169748 -149103 -6454 -146819 -36241 -418600 75853 -144861 194178 432499 -37270 132312
9946B98247I4249J33039a75902k01533C07084A45576K1368E8743i7939j80873
$$ 298247 94249 227288 -175902 -377435 307084 145576 166944 58743 -97939 -278812
9936b78812A71521C9908L6873f1198j34501a4803l33678q976J14951j23751B34667
$$ -278812 171521 39908 76781 -61198 -195699 -14803 -348481 -357457 -242506 -366257 234667
9924b93313F808c25289M8135J10600l5404N7731A870e6037j7325B2795a17818
$$ -293313 6808 -325289 -277154 -166554 -201958 -144227 1870 -56037 -73362 22795 -117818
9912c47440A85827b16658f4752p1075M5495j25806k29369g1525J6130j27094g291
$$ -347440 185827 -216658 -64752 -135827 -90332 -216138 -445507 -71525 -55395 -182489 -7291
9900h9431K2865A14519A5174J7005J84179h0926l54551A19992c9908k41957a4155
$$ -89431 -66566 114519 15174 32179 216358 -80926 -435477 119992 -39908 -281865 -14155
9888f6872j89753A53570f8698L429G6949c07762A15102j6031a54888d7736j2496
$$ -66872 -256625 153570 -68698 -65269 76949 -307762 115102 99071 -154888 -47736 -60232
9877f0232j64575B0420i7905m6241A00869c05155Q8029p2631B35645C3997R569
$$ -60232 -224807 20420 -97905 -144146 100869 -305155 -217126 -289757 235645 33997 43566
9866D3566a26425N1436j27116A47163a44244k33401G1596R8019a60806d2165o7697
$$ 43566 -126425 -74989 -202105 147163 -144244 -377645 71596 169615 -160806 -42165 -109862
9855a09862B37470f5956j27555j13664Q2023G8852b05346M4816c7390q7024M5175
$$ -109862 237470 -65956 -193511 -307175 -225152 78852 -205346 -160530 -37390 -124414 -79239
9844g9239K3389C3188c08384j5847A1923J83665b4114o9232j1312p1622O2113
$$ -79239 -55850 33188 -308384 -324231 11923 195588 -24114 -93346 -104658 -176280 -114167
9833a14167K2443j27386C9176a05425e0224B0811b01889F2107a95729F9223a66898
$$ -114167 -91724 -219110 39176 -105425 -50224 20811 -201889 62107 -195729 69223 -166898
9821A45540J38945b30316E06a37942f4935k50081Q701B02090b5964G1996P3402
$$ 145540 284485 -230316 506 -137942 -64935 -315016 -306315 202090 -25964 71996 145398
9810A45398a12130d4138c073p9810A1281a69292k862o5299A4686a85693i2019
$$ 145398 -112130 -44138 -3073 -82883 11281 -169292 -172154 -237453 14686 -185693 -92019
9798d32549a50719B81954e5272C85899c2763D3946j2125j3485b30440I2868g7849
$$ -432549 -150719 281954 -55272 385899 -32763 43946 31821 18336 -230440 92868 -77849
9786G6526l2460d2348F5327I174J79959a53098A10569c30561a36735j70287C33493
$$ 76526 44066 -42348 65327 9174 189133 -153098 110569 -330561 -136735 -307022 333493
9774c47613a2247m7587n5494n5001q7997O8718e6493A0160c97690a02085j65304
$$ -347613 -12247 -59834 -115328 -170329 -258326 -189608 -56493 10160 -397690 -102085 -267389
9763b67389f4240A1866b70734J18767n7871k84690e6140B26291C2197a89175A27185
$$ -267389 -64240 11866 -270734 -151967 -209838 -494528 -56140 226291 32197 -189175 127185
9751H8507L1876a72645E0649B183b164j83942n7117a07078M9023C2490i7863M6538
$$ 88507 120383 -172645 50649 2183 -2164 -186106 -243223 -107078 -58055 32490 -97863 -51325
9739e1325k21892b6196p306F4821J13667M4769a36375k0572K8134F2909k579L531
$$ -51325 -273217 -26196 -33502 64821 178488 223257 -136375 -156947 -128813 62909 60330 63861
9727F3861J23012I2890N061b436p0376K018l58729J64845H2230a06357k9971j9017
$$ 63861 186873 92890 97951 -2436 -72812 -70794 -429523 -264678 82230 -106357 -136328 -155345
9715a55345H4510b03890g113k27316Q1137j77570Q9405F9077b33195r7269h0742
$$ -155345 84510 -203890 -7113 -234429 -153292 -330862 -241457 69077 -233195 -330464 -80742
9703A43066c35287e7256k1471A52183b10890b1296l84955h0169A3468a56579A5924
$$ 143066 -335287 -57256 -78727 152183 -210890 -21296 -406251 -80169 13468 -156579 15924
9691a84682j45208B32780j01780d7276j40319P900A32990c947j94343d7920C7309
$$ -184682 -329890 232780 131000 -47276 -187595 -179695 132990 -3947 -198290 -47920 37309
9679a09413E6485a06459B90467b39065P819A8681a50812j53017I9730L91728B06859
$$ -109413 56485 -106459 290467 -239065 -231246 18681 -150812 -303829 99730 491458 206859
9667h0389G5342J6721a51141O5668k32139a10592q774H2939l0840L2076e9075
$$ -80389 75342 92063 -151141 -85473 -317612 -110592 -119366 82939 52099 84175 -59075
9655a72085j4640l1638A62338i7082j889j4822q4724A74885F7738b06067c9753
$$ -172085 -186725 -218363 162338 -97082 -98971 -113793 -198517 174885 67738 -206067 -39753
9643A03434a69790j24154J20986n497g009J806k58708E1397a52016j09954J01077
$$ 103434 -169790 -293944 -172958 -178455 -7009 -5203 -263911 51397 -152016 -261970 -160893
9632a60893f2968j26286l8218C14961c01103A16081b60411d2103n4727j6958J1936
$$ -160893 -62968 -189254 -227472 314961 -301103 116081 -260411 -42103 -96830 -113788 -101852
9621a01852j22726a4308C21308g2212C5427J74487m8339a14599B9899J75279f5398
$$ -101852 -224578 -14308 321308 -72212 35427 209914 161575 -114599 29899 205178 -65398
9609a04449j65713c2817j07307n7241N1351H2369f9286b1745j90500A72289Q5383
$$ -104449 -270162 -32817 -140124 -197365 -146014 82369 -69286 -21745 -212245 172289 257672
9598B57672C5046g6538B1097b65051k0537B68894a24335p604c981k46978F2794
$$ 257672 35046 -76538 21097 -265051 -285588 268894 -124335 -131939 -3981 -250959 62794
9586b57745A87301f0659k872A09716d39938g0548j72743o2565B41415q363C887
$$ -257745 187301 -60659 -63531 109716 -439938 -70548 -243291 -305856 241415 233052 3887
9574b40589n4733B14870b15462i369o1079I1903j4655b10510d7463D3694b52287
$$ -240589 -295322 214870 -215462 -9369 -70448 91903 77248 -210510 -47463 43694 -252287
9562d3018Q868A10115M3991o915m2035O596B7252a36484E5984a41857k84983A26015
$$ -43018 -34150 110115 154106 147191 105156 111752 27252 -136484 55984 -141857 -426840 126015
9549a40766o1551H4492m2218b21629e1721D0655a51863G1767b90842e4556m8478
$$ -140766 -202317 84492 42274 -221629 -51721 40655 -151863 71767 -290842 -54556 -103034
9538a03034C94645q7218c7168C4587i2608L2213o4127n9766F7278c3532D8907
$$ -103034 394645 307427 -37168 34587 -92608 -60395 -124522 -184288 67278 -33532 48907
9526f9441k60844J21311g2502B70388b37920O6820A5690b69452G3677b17208C74702
$$ -69441 -330285 -208974 -72502 270388 -237920 -171100 15690 -269452 73677 -217208 374702
9514a57644G0833c73378c8557m0222o5222k01048C48328a58189C115g3550a9152
$$ -157644 70833 -373378 -38557 -78779 -144001 -345049 348328 -158189 3115 -73550 -19152
9502b78771F7885L8672a0771A19619c06978b1972p5646h030j92631J3030n0981
$$ -278771 67885 106557 -10771 119619 -306978 -21972 -97618 -8030 -200661 -187631 -238612
9491b38612e2014r4410A41902a54395c6565J6067j58087G4112a20138K0888q5211
$$ -238612 -52014 -146424 141902 -154395 -36565 -20498 -178585 74112 -120138 -99250 -184461
9480a84461B54672A27142a05691G2303b0014B9026a78942l50186A58288F4330
$$ -184461 254672 127142 -105691 72303 -20014 29026 -178942 -529128 158288 64330
9469F5035a98372O6082K0256A98941C8744N6663a78226B14659a1485l87900a81514
$$ 65035 -198372 -132290 -112034 198941 38744 95407 -178226 214659 -11485 -399385 -181514
9457b56652J25370j07877L6541h2513j20860q5468a16028A01380c17949F6406
$$ -256652 -131282 -239159 -202618 -82513 -203373 -288841 -116028 101380 -317949 66406
9446C0052d300q7919a3474C4143J77886a58641N1340k88632h4080l11938A1907
$$ 30052 -4300 -92219 -13474 34143 212029 -158641 -107301 -395933 -84080 -396018 11907
9434G9538c4903j9800D4863a41382k31486C4478L64108A95421b70160E4390J52157
$$ 79538 -34903 -54703 44863 -141382 -372868 34478 398586 195421 -270160 54390 206547
9423B06547a61142B54841a69786F7304e7676j84069r6531a4473r3813A66033a14117
$$ 206547 -161142 254841 -169786 67304 -57676 -241745 -338276 -14473 -108286 166033 -114117
9411b30592J00825k7322e9595l23650B29774a00270a1832j39395N1382C11219
$$ -230592 -129767 -157089 -59595 -383245 229774 -100270 -11832 -151227 -99845 311219
9400a55708D3998j4346j1326c83154A71678b69557K435i4178J2774j17007a8536
$$ -155708 43998 29652 18326 -383154 171678 -269557 -267122 -94178 -81404 -198411 -18536
9388I5301a65741A03726M8565c33876A02533d3498j02305A80114b33063B44113
$$ 95301 -165741 103726 152291 -333876 102533 -43498 -145803 180114 -233063 244113
9377a14235B75274f4198K8829A6451a44761C0978d66623a60124g5068B3853b845
$$ -114235 275274 -64198 -35369 16451 -144761 30978 -466623 -160124 -75068 23853 -2845
9365a04423e131n8496E4128a93429E7276A5367d07897B30373g3038A46328b2967
$$ -104423 -5131 -63627 54128 -193429 57276 15367 -407897 230373 -73038 146328 -22967
9353b24136F6717J30355e802E1534f9962m4579L1924A69542J74002A70782k0375
$$ -224136 66717 197072 -5802 51534 -69962 -114541 -82617 169542 343544 170782 150407
9342A50407a51037J0986M1646j28063A20906c09495R7337B65951a69706j94906
$$ 150407 -151037 -140051 -98405 -226468 120906 -309495 -212158 265951 -169706 -364612
9332c64612I724O6259O1139a62761B80752j39870c57462g5659E9438d0782E9371
$$ -364612 9724 75983 137122 -162761 280752 140882 -357462 -75659 59438 -40782 59371
9320e28144K38692f6710o2331G8168e54871a65474A25172c8563A61592d3300a6424
$$ -528144 -289452 -66710 -129041 78168 -554871 -165474 125172 -38563 161592 -43300 -16424
9308G6211a57366B00447c778k22148h5976G6502b2571l5848o52314g9130B78443
$$ 76211 -157366 200447 -3778 -225926 -85976 76502 -22571 -58419 -710733 -79130 278443
9296c6344j45680C4548Q518g5932A6760i2603B9091e01831a05644j24102a11036
$$ -36344 -182024 34548 43066 -75932 16760 -92603 29091 -501831 -105644 -229746 -111036
9284a22861k07164d1951l01309H1733N549a28786m4512l2067e5601A69555J226
$$ -122861 -330025 -41951 -343260 81733 87282 -128786 -173298 -205365 -55601 169555 170781
9273A70781b23078a07576A21508N8195A2861P8995a35054A79957e8018k48068
$$ 170781 -223078 -107576 121508 179703 12861 91856 -135054 179957 -58018 -306086
9263c06086M5251A02320e4816r688l23063a41451A94945c0363B31543d5986k50623
$$ -306086 -260835 102320 -54816 -64504 -387567 -141451 194945 -30363 231543 -45986 -296609
9252b96609J03769m7262d0307B8818P5415b9817A17517D6213e94337b70521B64642
$$ -296609 -192840 -240102 -40307 28818 104233 -29817 117517 46213 -594337 -270521 264642
9240c22180A78306K9302A00720f1552G9730a73936J3285a5819k42277L412a07308
$$ -322180 178306 207608 100720 -61552 79730 -173936 -160651 -15819 -258096 -254684 -107308
9228a76799k39626A72839p1345b1246n4790A56181n1631E2189e01334a34573f0117
$$ -176799 -416425 172839 101494 -21246 -76036 156181 104550 52189 -501334 -134573 -60117
9216b02544f698k12968O1040b2558k2651j3125B8866a02187k78189b1993j2827
$$ -202544 -6698 -219666 -158626 -22558 -45209 -58334 28866 -102187 -380376 -21993 -34820
9205c4820j8510q5204k016A17585a77446A28253R1123d458l12464A36577K9858
$$ -34820 -53330 -138534 -140550 117585 -177446 128253 219376 -4458 -316922 136577 166435
9194A66435j8308k8301J16359p7877b63098j40480A57577a44809j27463c3598
$$ 166435 148127 119826 236185 158308 -263098 -403578 157577 -144809 -272272 -33598
9183b68579P7765B31818a94897B6727O5031b44098L6558L7885j0857K086k64365
$$ -268579 -190814 231818 -194897 26727 91758 -244098 -207540 -169655 -180512 -178426 -442791
9172d42791a83194G9725K2854E0859c2726J0330D69838a18089B28173a01026K9964
$$ -442791 -183194 79725 102579 50859 -32726 -22396 469838 -118089 228173 -101026 -71062
9161g1062j69860a02612k10261a54146B82554F5501b88355L1794a7538l7672n8947
$$ -71062 -240922 -102612 -312873 -154146 282554 65501 -288355 -256561 -17538 -55210 -114157
9150a14157Q89A15642e985k889k66642a29681L8284M4918E6374d121k14443M6907
$$ -114157 -113268 115642 -5985 -8874 -275516 -129681 -91397 -46479 56374 -4121 -218564 -171657
9138a71657Q3902q0455C0668b63103A41634g4934A9141b55323E2333b5626k8729
$$ -171657 -87755 -168210 30668 -263103 141634 -74934 19141 -255323 52333 -25626 -54355
9127e4355j99628A78040e6932B02358b41984g1685c4661J5539j86288p2668j43667
$$ -54355 -253983 178040 -56932 202358 -241984 -71685 -34661 -19122 -205410 -278078 -421745
9116d21745A2915O4807K4890c01709B2711r85F467a48481M6370j3660N1355K8884
$$ -421745 12915 77722 102612 -301709 22711 21726 6467 -148481 -102111 -115771 -64416 -35532
9104c5532j9128A12389d44978J51475A24955d2524j1342o2699j64425J38069q4945
$$ -35532 -54660 112389 -444978 -293503 124955 -42524 -53866 -116565 -280990 -142921 -227866
9093b27866A43886b60975A95854a83515j6087P497a6526H7590M3595b79724B11265
$$ -227866 143886 -260975 195854 -183515 -199602 -192105 -16526 87590 131185 -279724 211265
9081A29100n337c9101k11828I8802M4463g3430j71006F9755M4204n1730J00302
$$ 129100 123763 -39101 -250929 98802 143265 -73430 -244436 69755 113959 62229 162531
9070A62531a18885A94689J20878F2731f1614F3599a17025d4492q821j3280i091
$$ 162531 -118885 194689 315567 62731 -61614 63599 -117025 -44492 -53313 -66593 -9091
9058F6958M1818i1623B7184b71810H4899d5919A46260D2856e9846M505n7733D8630
$$ 66958 108776 -91623 27184 -271810 84899 -45919 146260 42856 -59846 -55341 -113074 48630
9045F2148B3915L431C840g4991A39111a86649F435J83845a28786j77524B24091
$$ 62148 23915 27346 3840 -74991 139111 -186649 6435 190280 -128786 -306310 224091
9033b57199d4788m3379j2212B63775a9622B35784a357j70134A44095l4914m8823
$$ -257199 -44788 -88167 -100379 263775 -19622 235784 -1357 -171491 144095 109181 60358
9022F0358a4694E9001J50905a2289j98020Q4257E14143a63896O6212l05233E9764
$$ 60358 -14694 59001 209906 -12289 -210309 -126052 514143 -163896 -97684 -402917 59764
9010d07967i201j24469L1606C0930M2222g1613n0858L7714A96277b77027j5054
$$ -407967 -9201 -133670 -102064 30930 73152 -71613 -122471 -84757 196277 -277027 -292081
8999b92081a25943L9565j43595A86742b4139j71814r6452M2570R5325B00428l5456
$$ -292081 -125943 -86378 -229973 186742 -24139 -195953 -292405 -249835 -154510 200428 164972
8988A64972a00127B09047h1091q2543e8548b8708j84326A14691b93201j2717B3809
$$ 164972 -100127 209047 -81091 -163634 -58548 -28708 -213034 114691 -293201 -305918 23809
8976f3041m6043j59004R6161d4772k31120L9931j89160a98296i7290J2399k8403
$$ -63041 -109084 -268088 -171927 -44772 -275892 -235961 -425121 -198296 -97290 -84891 -113294
8965a13294A47490D6971b4262F7858G225h3893c4648B66718c17959A15576pJ79736
$$ -113294 147490 46971 -24262 67858 7225 -83893 -34648 266718 -317959 115576 115569 295305
8953B95305F6047b13502c1329j35892I0437c93044b0744k73129A0522O7683i4034
$$ 295305 66047 -213502 -31329 -167221 90437 -393044 -20744 -293873 10522 78205 -94034
8941A4767b19123A83690d166A016a77178N4411A46247D9229b9427C3809a03299
$$ 14767 -219123 183690 -4166 1016 -177178 -122767 146247 49229 -29427 33809 -103299
8929A32933F6453K0328i1945D1046c38632a185A61827E6494d6187B9466N09411
$$ 132933 66453 86781 -91945 41046 -338632 -1185 161827 56494 -46187 29466 538877
8918E38877k4035i0200I8319K39180i4188A34014A6361c46037f9084A36132K4107
$$ 538877 514842 -90200 98319 337499 -94188 134014 16361 -346037 -69084 136132 160239
8907A60239p3183b87946A72806a38165N6991k34403a5298k32602b2014A85287
$$ 160239 87056 -287946 172806 -138165 -81174 -315577 -15298 -247900 -22014 185287
8896c30369g0232k05977j15865D92078c03180b6329p7678C6766g4695k19895E293
$$ -330369 -70232 -276209 -392074 492078 -303180 -26329 -104007 36766 -74695 -294590 5293
8884f8719F9449a37082b4925I2419b46700J08829B08992a80085o396A58647o3748
$$ -68719 69449 -137082 -24925 92419 -246700 -137871 208992 -180085 -186481 158647 94899
8873I4899a50128A73363a66318C0449J42204f2300A84204A4688a39719j07010
$$ 94899 -150128 173363 -166318 30449 172653 -62300 184204 14688 -139719 -246729
8863b46729L5695j20742g9253k65412C2707c76748a0718B2894g2778q5143b5280
$$ -246729 -211034 -331776 -79253 -344665 32707 -376748 -10718 22894 -72778 -157921 -25280
8851C43466I2651b09466H0374Q8950a13343C69768b03868J5198j07723h2175b9417
$$ 343466 92651 -209466 80374 169324 -113343 369768 -203868 -188670 -296393 -82175 -29417
8839a66076d1568k26257N3261Q2024A36508D5536c62942N5104B5339R0158b81353
$$ -166076 -41568 -267825 -214564 -132540 136508 45536 -362942 -307838 25339 115497 -281353
$$ [...]
##END NTUPLES=NMR SPECTRUM
##END=
