##TITLE=NES1034_872015080_9242822_nGXDxCP1Qb
##JCAMPDX= 6.0         $$ Bruker NMR JCAMP-DX V2.0
##DATA TYPE= NMR SPECTRUM
##DATA CLASS= NTUPLES
##ORIGIN= BRUKER
##OWNER= Administrator
$$ 1.72 TOPSPIN		Version 2.1
$$ 2015-07-01 19:52:14.164 -0700  Administrator@X
$$ Compression mode = diff/dup
##.OBSERVE FREQUENCY= 400.02188249412
##.OBSERVE NUCLEUS= ^1H
##.ACQUISITION MODE= SIMULTANEOUS (DQD)
##.ACQUISITION SCHEME= undefined
##.AVERAGES= 64
##.DIGITISER RES= 22
##SPECTROMETER/DATA SYSTEM= spect
##.PULSE SEQUENCE= noesygpps1d.comp
##.SOLVENT NAME= COFFEE_meoh
##.SHIFT REFERENCE= INTERNAL, COFFEE_meoh, 1, 14.96279
##AUDIT TRAIL= $$ (NUMBER, WHEN, WHO, WHERE, PROCESS, VERSION, WHAT)
$$ ##TITLE= Audit trail, TOPSPIN		Version 2.1
$$ ##JCAMPDX= 5.01
$$ ##ORIGIN= Bruker BioSpin GmbH
$$ ##OWNER= Administrator
$$ $$ E:\/data/COFFEE/nmr/NES1034_872015080_9242822_nGXDxCP1Qb/22/pdata/1/auditp.txt
$$ ##AUDIT TRAIL=  $$ (NUMBER, WHEN, WHO, WHERE, PROCESS, VERSION, WHAT)
(   1,<2015-07-01 19:52:08.305 -0700>,<Administrator>,<X>,<go>,<TOPSPIN 2.1>,
      <created by zg
	started at 2015-07-01 19:40:38.664 -0700,
	POWCHK enabled, PULCHK disabled,
       configuration hash MD5:
       21 0F 79 D6 B3 7B B4 F6 88 20 88 DB 03 48 BD 9F
       data hash MD5: 64K
       C0 0C 55 A2 C4 CE 1B 23 30 4A DE F6 B8 BD D9 4B>)
(   2,<2015-07-01 19:52:11.617 -0700>,<Administrator>,<X>,<proc1d>,<TOPSPIN 2.1>,
      <Start of raw data processing
       efp LB = 0.3 FT_mod = 6 PKNL = 1 PHC0 = 0 PHC1 = 0 SI = 128K 
       data hash MD5: 128K
       8E F3 4E A0 D3 E4 FB 33 B1 8E 5A 21 5A 86 05 3C>)
(   3,<2015-07-01 19:52:12.617 -0700>,<Administrator>,<X>,<proc1d>,<TOPSPIN 2.1>,
      <pk PHC0 = -83.04016 PHC1 = 0 
       data hash MD5: 128K
       22 CD 41 0F 18 42 19 7B E3 EE 2E 28 2F E9 05 1D>)
(   4,<2015-07-01 19:52:13.008 -0700>,<Administrator>,<X>,<proc1d>,<TOPSPIN 2.1>,
      <abs ABSG = 1 
       data hash MD5: 128K
       9F ED C1 DE 00 D2 B7 C3 F6 30 C6 FF 41 B4 6F 4C>)
(   5,<2015-07-01 19:52:13.117 -0700>,<Administrator>,<X>,<proc1d>,<TOPSPIN 2.1>,
      <abs ABSG = 2 
       data hash MD5: 128K
       AB 97 B8 D1 A3 B3 B1 4E DF 1F 9D C9 80 76 80 C1>)
(   6,<2015-07-01 19:52:13.195 -0700>,<Administrator>,<X>,<proc1d>,<TOPSPIN 2.1>,
      <abs ABSG = 3 
       data hash MD5: 128K
       9F 41 96 AB 73 EC 42 2D 4C AD 8D EE 3F 80 6A 36>)
(   7,<2015-07-01 19:52:13.289 -0700>,<Administrator>,<X>,<proc1d>,<TOPSPIN 2.1>,
      <abs ABSG = 4 
       data hash MD5: 128K
       E6 70 A6 9F 8B 87 9A 00 3D 5E 54 30 60 A1 74 D3>)
(   8,<2015-07-01 19:52:13.430 -0700>,<Administrator>,<X>,<proc1d>,<TOPSPIN 2.1>,
      <abs ABSG = 5 
       data hash MD5: 128K
       4E 04 A1 38 3F 58 ED 5C 90 C1 D4 B9 C0 26 C2 1C>)
$$ ##END=
$$ 
$$ $$ hash MD5
$$ $$ DE CD DB 72 57 A3 3E D0 81 80 00 F0 D5 1E F6 C5
##$RELAX= 
##$RELAX= 
##$RELAX= 
##$RELAX= 
##$RELAX= 
##$RELAX= 
##$RELAX= 
##$RELAX= 
$$ Bruker specific parameters
$$ --------------------------
##$DU= <E:\>
##$EXPNO= 22
$$ [...]
##$TP07= 0
##$TPNAME0= <>
##$TPNAME1= <>
##$TPNAME2= <>
##$TPNAME3= <>
##$TPNAME4= <>
##$TPNAME5= <>
##$TPNAME6= <>
##$TPNAME7= <>
##$TPOAL= (0..7)
0.5 0.5 0.5 0.5 0.5 0.5 0.5 0.5
##$TPOFFS= (0..7)
0 0 0 0 0 0 0 0
##$TUNHIN= 0
##$TUNHOUT= 0
##$TUNXOUT= 0
##$USERA1= <user>
##$USERA2= <user>
##$USERA3= <user>
##$USERA4= <user>
##$USERA5= <user>
##$V9= 5
##$VALIST= <valist>
##$VCLIST= <CCCCCCCCCCCCCCC>
##$VD= 0
##$VDLIST= <DDDDDDDDDDDDDDD>
##$VPLIST= <PPPPPPPPPPPPPPP>
##$VTLIST= <TTTTTTTTTTTTTTT>
##$WBST= 2048
##$WBSW= 25
##$XGAIN= (0..3)
0 0 0 0
##$XL= 0
##$YL= 0
##$YMAX_a= 6638262
##$YMIN_a= -13139597
##$ZGOPTNS= <>
##$ZL1= 120
##$ZL2= 120
##$ZL3= 120
##$ZL4= 120
##$ABSF1= 14.96279
##$ABSF2= -5.595392
##$ABSG= 5
##$ABSL= 3
##$ALPHA= 0
##$AQORDER= 0
##$ASSFAC= 0
##$ASSFACI= 0
##$ASSFACX= 0
##$ASSWID= 0
##$AUNMP= <proc_prof1d_extract.lims>
##$AXLEFT= 0
##$AXNAME= <>
##$AXNUC= <1H>
##$AXRIGHT= 0
##$AXTYPE= 0
##$AXUNIT= <>
##$AZFE= 0.1
##$AZFW= 0.1
##$BCFW= 0
##$BC_mod= 0
##$BYTORDP= 0
##$COROFFS= 0
##$CY= 15
##$DATMOD= 1
##$DC= 0
##$DFILT= <>
##$DTYPP= 0
##$F1P= 0
##$F2P= 0
##$FCOR= 0.5
##$FTSIZE= 131072
##$FT_mod= 6
##$GAMMA= 0
##$GB= 0
##$INTBC= 1
##$INTSCL= 1
##$ISEN= 128
##$LB= 0.3
##$LEV0= 0
##$LPBIN= 0
##$MAXI= 10000
##$MC2= 0
##$MEAN= 0
##$ME_mod= 0
##$MI= 0
##$NCOEF= 0
##$NC_proc= -2
##$NLEV= 6
##$NOISF1= 0
##$NOISF2= 0
##$NSP= 0
##$NTH_PI= 0
##$NZP= 0
##$OFFSET= 14.96279
##$PC= 1
##$PHC0= -83.04016
##$PHC1= 0
##$PH_mod= 1
##$PKNL= yes
##$PPARMOD= 0
##$PPDIAG= 0
##$PPIPTYP= 0
##$PPMPNUM= 2147483647
##$PPRESOL= 1
##$PSCAL= 4
##$PSIGN= 0
##$PYNMP= <proc.py>
##$REVERSE= no
##$SF= 400.020008919125
##$SI= 131072
##$SIGF1= 0
##$SIGF2= 0
##$SINO= 400
##$SIOLD= 131072
##$SPECTYP= <>
##$SREGLST= <1H.CDCl3>
##$SSB= 0
##$STSI= 131072
##$STSR= 0
##$SW_p= 8223.68421052631
##$SYMM= 0
##$S_DEV= 0
##$TDeff= 65536
##$TDoff= 0
##$TI= <>
##$TILT= no
##$TM1= 0
##$TM2= 0
##$TOPLEV= 0
##$USERP1= <user>
##$USERP2= <user>
##$USERP3= <user>
##$USERP4= <user>
##$USERP5= <user>
##$WDW= 1
##$XDIM= 131072
##$YMAX_p= 304069626
##$YMIN_p= -11759
##$CURPLOT= <Network HP LaserJet P1505>
##$CURPRIN= <$Network HP LaserJet P1505>
##$DFORMAT= <normdp>
##$LAYOUT= <+/1D_H.xwp>
##$LFORMAT= <normlp>
##$PFORMAT= <normpl>
##$SURQMSG= 1
$$ End of Bruker specific parameters
$$ ---------------------------------
##NTUPLES= NMR SPECTRUM
##VAR_NAME=  FREQUENCY,     SPECTRUM/REAL,   SPECTRUM/IMAG
##SYMBOL=    X,             R,               I
##VAR_TYPE=  INDEPENDENT,   DEPENDENT,       DEPENDENT
##VAR_FORM=  AFFN,          ASDF,            ASDF
##VAR_DIM=   131072,        131072,          131072
##UNITS=     HZ,            ARBITRARY UNITS, ARBITRARY UNITS
##FACTOR=    0.0627417313425164, 1,          1
##FIRST=     8223.62146879497, -401,         -45531
##LAST=      0,             1563,            -45716
##MIN=       0,             -11759,          0
##MAX=       8223.62146879497, 304069626,    0
$$ Real data points
##PAGE= N=1
##DATA TABLE= (X++(R..R)), XYDATA
$$ [...]
60994A9170607K090176J795652J298157P18346K00780j44170k67413j81876M1510
$$ 19170607 21260783 23056435 24354592 25072938 25273718 25129548 24862135 24680259 24721769
60985B4721769K80994L93591K72280r9615o38247j203199j663809j945568k038527
$$ 24721769 25002763 25396354 25668634 25569019 24930772 23727573 22063764 20118196 18079669
60976A8079669j978223j819205j614255j403115j209548j043489r05049p88817
$$ 18079669 16101446 14282241 12667986 11264871 10055323 9011834 8106785 7317968
60968G317968o88235n98954n19629m50290l90624l39789k97108k62059k33558
$$ 7317968 6629733 6030779 5511150 5060860 4670236 4330447 4033339 3771280 3537722
60959C537722k09862j89452j71763j56758j43922j32157j20746j09990j00511
$$ 3537722 3327860 3138408 2966645 2809887 2665965 2533808 2413062 2303072 2202561
60950B202561r2355q5262p9559p5830p3597p1080o6845o1196n5422n0193m5336
$$ 2202561 2110206 2024944 1945385 1869555 1795958 1724878 1658033 1596837 1541415 1491222 1445886
60939A445886m0781l6884l3777l1136k8756k6758k5113k3525k2003k1006k0720
$$ 1445886 1405105 1368221 1334444 1303308 1274552 1247794 1222681 1199156 1177153 1156147 1135427
60928A135427k0507j9507j7544j5253j3498j2846j3306j4202j4550j3909j2822
$$ 1135427 1114920 1095413 1077869 1062616 1049118 1036272 1022966 1008764 994214 980305 967483
60917I67483j2149j2102j2228j2169j2057j2035j1855j1195j0220r485r317r457
$$ 967483 955334 943232 931004 918835 906778 894743 882888 871693 861473 851988 842671 833214
60905H33214r428r111q857q967r200q988q106o991o254o004n859n517n106m849
$$ 833214 823786 814675 805818 796851 787651 778663 770557 763566 757312 751308 745449 739932 734826 729977
60891G29977m643m179l427k771k565k686k668k159j190l8R65J482J288N36k14
$$ 729977 725334 721155 717728 714957 712392 709706 707038 704879 703689 703651 704616 706098 707386 707922 707708
60876G07708m28j86j07o25j452j954j953j867k069k336k142j268O4J505K723L373
$$ 707708 707280 707094 706987 706362 704910 702956 701003 699136 697067 694731 692589 691321 691385 692890 695613 698986
60860F98986L244K486J375m1j672k845k713j418k34p6m83o88j089k730n510q021
$$ 698986 702230 704716 706091 706050 704378 701533 698820 697402 697168 697092 696609 695921 694832 692102 686592 678571
60844F78571r290r728j0049j0180r763r015q366p677o574n226m194l633l203k674
$$ 678571 669281 659553 649504 639324 629561 620546 612180 604503 597929 592703 588509 584876 581673 578999
60830E78999k142j706j386j266j358j393j070m82M0L69N89O69N35L05J45Kj86
$$ 578999 576857 575151 573765 572499 571141 569748 568678 568196 568236 568605 569194 569863 570398 570703 570848 570850 570664
60813E70664k57j17o0k79l63J44Q79J043N73J46K3k63q69j150o75l8n7o58j127
$$ 570664 570407 570290 570230 569951 569588 569732 570611 571654 572227 572373 572396 572133 571264 570114 569439 569401 569344 568686 567559
60794E67559j158j068j186j524j938k290k441k394k372k596l007l360l441l136
$$ 567559 566401 565333 564147 562623 560685 558395 555954 553560 551188 548592 545585 542225 538784 535648
60780E35648k551k142k368k968l012j986n46J80j44q66j179q23j10L97L28j47
$$ 535648 533097 530955 528587 525619 522607 520621 520075 520255 520111 519245 518066 517243 517133 517530 517858 517711
60764E17711n37p22j054j547j501m67P99J146N61J07L63P66P28N33O89R95Q10
$$ 517711 517174 516452 515398 513851 512350 511883 512682 513828 514389 514496 514859 515625 516353 516886 517575 518570 519380
60747E19380m9j147k003k408k372k096j915j967k031j895j731j810k023k010j704
$$ 519380 519331 518184 516181 513773 511401 509305 507390 505423 503392 501497 499766 497956 495933 493923 492219
60732D92219j407j337j430j659k138k752l040k748k312k350k780k888k371j880
$$ 492219 490812 489475 488045 486386 484248 481496 478456 475708 473396 471046 468266 465378 463007 461127
60718D61127k166l026l583l438l015k750k529k178j971k157k342j904r15j08O2
$$ 461127 458961 455935 452352 448914 445899 443149 440620 438442 436471 434314 431972 430068 429153 429045 429107
60703D29107j58l73m97m92j05P89J854K547K614K139J355O38M55J007J949K717
$$ 429107 428949 428576 428079 427587 427482 428271 430125 432672 435286 437425 438780 439418 439873 440880 442829 445546
60687D45546L057L141L214L333L416L403L329L319L470L655L587L194K752K533
$$ 445546 448603 451744 454958 458291 461707 465110 468439 471758 475228 478883 482470 485664 488416 490949
60673D90949K407K026J335O56L04L24N50P66P70N24K74L36P13J072J169J117J133
$$ 490949 493356 495382 496717 497373 497677 498001 498551 499317 500087 500611 500885 501221 501934 503006 504175 505292 506425
60656E06425J191J138R96R67J088J053M76p42k270l613m452m746m552l905k963
$$ 506425 507616 508754 509750 510717 511805 512858 513334 512592 510322 506709 502257 497511 492959 489054 486091
60641D86091k127j777j883k113k323k649l030l014k380j642j500j880k037j611
$$ 486091 483964 482187 480304 478191 475868 473219 470189 467175 464795 463153 461653 459773 457736 456125
60627D56125j101j066j392j671j889k229k501k372k064k177k706k820j927m67
$$ 456125 455024 453958 452566 450895 449006 446777 444276 441904 439840 437663 434957 432137 430210 429743
60613D29743P01J286J515J421Q37J5l89j56J89J67O3M93J471K321K466J945J121
$$ 429743 430444 431730 433245 434666 435503 435518 435129 434973 435162 435329 435392 435885 437356 439677 442143 444088 445209
60596D45209K89k97l23L07J119J387R01K13l8J36K27L5o5K71P97R90P64N24O33
$$ 445209 445498 445201 444878 445185 446304 447691 448592 448805 448767 448903 449130 449165 449100 449371 450168 451158 451922 452446 453079
60577D53079J049J577K160K771L216L268K966K639K582K774K952K896K639K372
$$ 453079 454128 455705 457865 460636 463852 467120 470086 472725 475307 478081 481033 483929 486568 488940
60563D88940K143J843J487J403J902K778L461L729L998M669N467N742N457N444
$$ 488940 491083 492926 494413 495816 497718 500496 503957 507686 511684 516353 521820 527562 533019 538463
60549E38463O486Q375J0189J1387J2323J3624J5413J7427J9614K2257K5443K8841
$$ 538463 544949 553324 563513 574900 587223 600847 616260 633687 653301 675558 701001 729842
60537G29842L2161L5487L8893M1925M3820M4055M2384L8483L2045K3349J3239
$$ 729842 762003 797490 836383 878308 922128 966183 1008567 1047050 1079095 1102444 1115683
60526A115683K539q219j8313k6656l2423l5543l6318l4898l1648k7623k4020k1135
$$ 1115683 1118222 1110003 1091690 1065034 1032611 997068 960750 925852 894204 866581 842561 821426
60514H21426j8310j4972j1262p627m252j125J772M537P388J0364J3282J6183J9554
$$ 821426 803116 788144 776882 769255 765003 763878 765650 770187 777575 787939 801221 817404 836958
60501H36958K3803K8696L3520L7656M0763M2477M2270L9644L4411K6877J7882
$$ 836958 860761 889457 922977 960633 1001396 1043873 1086143 1125787 1160198 1187075 1204957
60490A204957Q574k0p261j2682j5762j6132j3954r883m625J399Q046J5248K2803
$$ 1204957 1213531 1213511 1206250 1193568 1177806 1161674 1147720 1137837 1133212 1134611 1142657 1157905 1180708
60477A180708L0351L7441M3596M8133N0104M8751M3964L5927K4420R165q852k7069
$$ 1180708 1211059 1248500 1292096 1340229 1390333 1439084 1483048 1518975 1543395 1552560 1543708 1516639
60465A516639m2947n5425o4370o9400p0272o8056o4645o0929n6420n0820m5000
$$ 1516639 1473692 1418267 1353897 1284497 1214225 1146169 1081524 1020595 964175 913355 868355
60454H68355l9997l5960l2601k9843k7419k4537k0803j6988j4117j2201j0584
$$ 868355 828358 792398 759797 729954 702535 677998 657195 640207 626090 613889 603305
60443F03305r085p958p062n963m713l717k900j826o05J40K69L04N02M81m5q73
$$ 603305 594220 586262 579200 573237 568524 564807 561907 560081 559476 559616 559885 560189 560691 561172 561127 560254
60427E60254j822k923l874m089l533k845k308j524l59N90J016J552K716L979M588
$$ 560254 558432 555509 551635 547546 544013 541168 538860 537336 536977 537567 538583 540135 542851 546830 551418
60412E51418M675M723M614M145L950M759O047O653O623P200Q915J0849J2032J2525
$$ 551418 556093 560816 565430 569575 573525 578284 584331 590984 597607 604807 613722 624571 636603 649128
60398F49128J2678J2420J1864J1684J2125J2311J1357R621Q096P007N908M828
$$ 649128 661806 674226 686090 697774 709899 722210 733567 743188 751284 758291 764199 769027
60386G69027M332M438M404L810L149K979L039K657J691O21j89q24j460j962k060
$$ 769027 773359 777797 782201 786011 789160 792139 795178 797835 799526 800147 799958 799134 797674 795712 793652
60371G93652j751j386j316j606k057k395k371j767o19O14J244R63J04p08j145
$$ 793652 791901 790515 789199 787593 785536 783141 780770 779003 778384 778998 780242 781205 781309 780601 779456
60356G79456j284j255j059p19m30l90n33o31p21j169k193l426m239m457m485m668
$$ 779456 778172 776917 775858 775139 774709 774319 773786 773155 772434 771265 769072 765646 761407 756950 752465 747797
60340G47797m863m771m395l950l606l514l782m107l862k942k179k376l231l910
$$ 747797 742934 738163 733768 729818 726212 722698 718916 714809 710947 708005 705826 703450 700219 696309
60326F96309m340n081n979o052m964l690l189l208k956k306j702j372j302j554
$$ 696309 691969 686888 680909 674857 669893 666203 663014 659806 656850 654544 652842 651470 650168 648614
60312F48614j987k038j439p66o47p30j68J137K573L838N092O227O837P086P626
$$ 648614 646627 644589 643150 642384 641737 641007 640839 641976 644549 648387 653479 659706 666543 673629 681255
60297F81255Q487Q688P371M723J595j329l698n400o599p502p880p252n728m121
$$ 681255 689742 698430 705801 710524 712119 710790 707092 701692 695093 687591 679711 672459 666731 662610
60283F62610l007k159j174j20Q18J773K866L796M286M566M970N393N576N655N941
$$ 662610 659603 657444 656270 656150 656968 658741 661607 665403 669689 674255 679225 684618 690194 695849 701790
60268G01790O363O636O782P160P998R234J0629J1882J2800J3559J4400J4985J4634
$$ 701790 708153 714789 721571 728731 736729 745963 756592 768474 781274 794833 809233 824218 838852
60255H38852J3481J2652J2758J2956J2373J1703J2250J3791J4826J4825J4872
$$ 838852 852333 864985 877743 890699 903072 914775 927025 940816 955642 970467 985339
60244I85339J5831J7220J8394J9580K1097K2558K3759K5450K8279L1551L4115
$$ 985339 1001170 1018390 1036784 1056364 1077461 1100019 1123778 1149228 1177507 1209058 1243173
60233A243173L6015L8345M1750M5936N0428N4809N8378O0522O1566O2453O3491
$$ 1243173 1279188 1317533 1359283 1405219 1455647 1510456 1568834 1629356 1690922 1753375 1816866
60222A816866O4159O4120O3621O2708O0883N7868N3941M9217M3374L6549K9772
$$ 1816866 1881025 1945145 2008766 2071474 2132357 2190225 2244166 2293383 2336757 2373306 2403078
60211B403078K3886J8587J3200P959L690N48k185m978p365q537q186o744m954
$$ 2403078 2426964 2445551 2458751 2466710 2470400 2470948 2468763 2463785 2456420 2447883 2439697 2432953 2427999
60198B427999l205r95K656P950J3746J8729K2910K7319L2353L7303M1569M5514
$$ 2427999 2424794 2423799 2426455 2434405 2448151 2466880 2489790 2517109 2549462 2586765 2628334 2673848
60186B673848M9683N3674N6355N6825N4856N0774M5344L9370L3041K5829J7415
$$ 2673848 2723531 2777205 2833560 2890385 2945241 2996015 3041359 3080729 3113770 3139599 3157014
60175C157014Q352o34r698j9506k9899l9580m7268n2752n6603n9288o0811o0897
$$ 3157014 3165366 3164732 3155034 3135528 3105629 3066049 3018781 2966029 2909426 2850138 2789327 2728430
60163B728430n9296n5999n1344m5749l9280l1704k3143j4415o527J77O180J2065
$$ 2728430 2669134 2613135 2561791 2516042 2476762 2445058 2421915 2407500 2400973 2401150 2407330 2419395
60151B419395J7719K2186K4387K4061K1975J9120J5784J1674O827J902k580o799
$$ 2419395 2437114 2459300 2483687 2507748 2529723 2548843 2564627 2576301 2583128 2585030 2582450 2575651
60139B575651j1028j4802j7248j8179j8222j7781j6383j3409r053m091J210P366
$$ 2575651 2564623 2549821 2532573 2514394 2496172 2478391 2462008 2448599 2439546 2435455 2436665 2444031
60127B444031J4816K3183L1674L9914M8184N6936O6370P6407Q6723R6870J06530
$$ 2444031 2458847 2482030 2513704 2553618 2601802 2658738 2725108 2801515 2888238 2985108 3091638
60116C091638J15738J24553J32570J39046J43686J46806J48470J47806J43690
$$ 3091638 3207376 3331929 3464499 3603545 3747231 3894037 4042507 4190313 4334003
60107D334003J35950J25400J12774R8200Q1748O3898M5102K5348M567j6654l7134
$$ 4334003 4469953 4595353 4708127 4806327 4888075 4951973 4997075 5022423 5026990 5010336 4973202
60096D973202n5847p2378q6781r9129j09180j16303j19967j20431j18742j15776
$$ 4973202 4917355 4844977 4758196 4659067 4549887 4433584 4313617 4193186 4074444 3958668
60086C958668j11448j05186r7052q7910p8505o8781n8274m6910l5182k3744j2979
$$ 3958668 3847220 3742034 3644982 3557072 3478567 3409786 3351512 3304602 3269420 3245676 3232697
60075C232697k955O342J4652K1436K6297K9370L1031L1264K9572K5646J9840J2841
$$ 3232697 3229742 3236084 3250736 3272172 3298469 3327839 3358870 3390134 3419706 3445352 3465192 3478033
60063C478033N086l219j1730j9926k7540l4747m1804m8597n4645n9578o3459o6521
$$ 3478033 3483119 3479900 3468170 3448244 3420704 3385957 3344153 3295556 3240911 3181333 3117874 3051353
60051C051353o8631o9218o7880o4891o0884n6122n0487m4082l7433l0878k4128
$$ 3051353 2982722 2913504 2845624 2780733 2719849 2663727 2613240 2569158 2531725 2500847 2476719
60040B476719j6719q565J24R189J8307K6787L4151M0819M7595N4346N9766O2657
$$ 2476719 2460000 2451435 2451559 2460748 2479055 2505842 2539993 2580812 2628407 2682753 2742519 2805176
60028B805176O3004O1428N8109N2753M5353L6474K6792J6752O651l345j3217k2899
$$ 2805176 2868180 2929608 2987717 3040470 3085823 3122297 3149089 3165841 3172492 3169147 3155930 3133031
60016C133031l2005m0085m7034n2965n7644o0500o1191n9813n6534n1509m5293
$$ 3133031 3101026 3060941 3013907 2960942 2903298 2842798 2781607 2721794 2665260 2613751 2568458
60005B568458l8808l2526k6147j9345j2373n485J816J0163J9176K7665L4996M1657
$$ 2568458 2529650 2497124 2470977 2451632 2439259 2433774 2435590 2445753 2464929 2492594 2527590 2569247
59993B569247M8379N5342O2425O9570P6426Q2054Q5461Q6282Q4661Q0714P4428
$$ 2569247 2617626 2672968 2735393 2804963 2881389 2963443 3048904 3135186 3219847 3300561 3374989
59982C374989O5961N5733M4319L2418K0602Q914l016j5213k6918l7280m6184n3925
$$ 3374989 3440950 3496683 3541002 3573420 3594022 3602936 3599920 3584707 3557789 3520509 3474325 3420400
59970C420400o0298o4494o5937o4734o1305n6025m9330m1789l3886k5876j7888
$$ 3420400 3360102 3295608 3229671 3164937 3103632 3047607 2998277 2956488 2922602 2896726 2878838
59959B878838r945j880O475J4964K3207L0951L8029M4168M9226N3529N7410O0341
$$ 2878838 2868893 2867013 2873488 2888452 2911659 2942610 2980639 3024807 3074033 3127562 3184972 3245313
59947C245313O1161N9454N6175N2588M9025M5030M0255L4718K8523K2024J6087
$$ 3245313 3306474 3365928 3422103 3474691 3523716 3568746 3609001 3643719 3672242 3694266 3710353
59936C710353J1661R000P652P207P663R193J2020J6615K3519L2663M3096N3692
$$ 3710353 3722014 3731014 3738666 3745873 3753536 3762729 3774749 3791364 3814883 3847546 3890642 3944334
59924C944334O4098P4827Q6466R8840J11020J22009J31309J38681J43606J45295
$$ 3944334 4008432 4083259 4169725 4268565 4379585 4501594 4632903 4771584 4915190 5060485
59914E060485J43153J36883J26099J10443R0282O6842M1296J4245j3480m0064
$$ 5060485 5203638 5340521 5466620 5577063 5667345 5734187 5775483 5789728 5776248 5736184
59904E736184o3562q3269r9388j11619j19025j21441j20036j16058j09713j00790
$$ 5736184 5672622 5589353 5489965 5378346 5259321 5137880 5017844 4901786 4792073 4691283
59894D691283q9848p8118o6503n5101m3439l0863j6997k303J2064K5287L7550
$$ 4691283 4601435 4523317 4456814 4401713 4358274 4327411 4310414 4308111 4320175 4345462 4383012
59883D383012M9487O1208P2387Q2773R1956R8810J01916J00692R5486Q6408P2674
$$ 4383012 4432499 4493707 4566094 4648867 4740823 4839633 4941549 5042241 5137727 5224135 5296809
59872E296809N3541K9661L196k3260m7685o8862q6167r9437j08924j15143j18572
$$ 5296809 5350350 5380011 5383207 5359947 5312262 5243400 5157233 5057796 4948872 4833729 4715157
59861D715157j19445j17917j14355j09309j03232r6365q8872q0763p1683o1224
$$ 4715157 4595712 4477795 4363440 4254131 4150899 4054534 3965662 3884899 3813216 3751992
59851C751992m9725l8328k7840j7902p770K335J1268J8241K3448K7422L0508L3204
$$ 3751992 3702267 3663939 3636099 3618197 3610427 3612762 3624030 3642271 3665719 3693141 3723649 3756853
59839C756853L6388M0628M5448M9486N1256M9639M4037L4484K1713P005p983k1530
$$ 3756853 3793241 3833869 3879317 3928803 3980059 4029698 4073735 4108219 4129932 4136937 4128954 4107424
59827D107424l2462m0672m6770n1195n3936n5119n5351n5273n5166n5189n5553
$$ 4107424 4074962 4034290 3987520 3936325 3882389 3827270 3771919 3716646 3661480 3606291 3550738
59816C550738n6093n6064n4863n2696n0187m7531m4516m1190l8000l5323l3205
$$ 3550738 3494645 3438581 3383718 3331022 3280835 3233304 3188788 3147598 3109598 3074275 3041070
59805C041070l1572l0299k9131k7836k6462k5110k3552k1371j8497j5177j1441
$$ 3041070 3009498 2979199 2950068 2922232 2895770 2870660 2847108 2825737 2807240 2792063 2780622
59794B780622o888j213N350J2288J9463K7364L6628M7254N8424O9389Q0491R2772
$$ 2780622 2773734 2772521 2777871 2790159 2809622 2836986 2873614 2920868 2979292 3048681 3129172 3221944
59782C221944J06431J20209J32639J43146J50988J53608J47309J29888J02086
$$ 3221944 3328375 3448584 3581223 3724369 3875357 4028965 4176274 4306162 4408248
59773D408248O6608K6763j3733n0888q1450j03725j17164j21889j19145j11556
$$ 4408248 4474856 4501619 4487886 4436998 4355548 4251823 4134659 4012770 3893625 3782069
59763C782069j01915r1599q0587o8722n6460m4570l3720k4321j6267q828j319
$$ 3782069 3680154 3588555 3507968 3439246 3382786 3338216 3304496 3280175 3263908 3255080 3253761
59752C253761O136J2866J8710K4333L0363L6659M2695M8427N4414O1125O8377
$$ 3253761 3259897 3272763 3291473 3315806 3346169 3382828 3425523 3473950 3528364 3589489 3657866
59741C657866P5675Q3037R1222J00855J11492J22005J31951J42060J53178J65309
$$ 3657866 3733541 3816578 3907800 4008655 4120147 4242152 4374103 4516163 4669341 4834650
59731D834650J78039J91366K05444K19856K33805K46865K58832K68887K75666
$$ 4834650 5012689 5204055 5409499 5629355 5863160 6110025 6368857 6637744 6913410
59722F913410K78176K76186K69668K58629K43727K26559K09074J92915J79287
$$ 6913410 7191586 7467772 7737440 7996069 8239796 8466355 8675429 8868344 9047631
59713I047631J68819J61346J56407J54043J54535J57061J59403J59423J56483
$$ 9047631 9216450 9377796 9534203 9688246 9842781 9999842 10159245 10318668 10475151
59704A0475151J51025J43430J33807J22363J09241R4356P8011O1401M5834L1764
$$ 10475151 10626176 10769606 10903413 11025776 11135017 11229373 11307384 11368785 11414619 11446383
59694A1446383J9312R384L322J428K893P336J5530K8096M4354O3090Q3865J06746
$$ 11446383 11465695 11475079 11478401 11479829 11482722 11490058 11505588 11533684 11578038 11641128 11724993 11831739
59682A1831739J31165J55928J80267K04113K27150K48280K66179K79758K87688
$$ 11831739 11962904 12118832 12299099 12503212 12730362 12978642 13244821 13524579 13812267
59673A3812267K88009K78932K59817K30806J91708J42135Q3083J7627n0456j18235
$$ 13812267 14100276 14379208 14639025 14869831 15061539 15203674 15286757 15304384 15253928 15135693
59663A5135693j83324k42680k92931l31988l59545l75898l81358l77320l66974
$$ 15135693 14952369 14709689 14416758 14084770 13725225 13349327 12967969 12590649 12223675
59654A2223675l54127l41839l32833l30244l36359l50379l68481l86311m00768
$$ 12223675 11869548 11527709 11194876 10864632 10528273 10177894 9809413 9423102 9022334
59645I022334m09562m10690m03489l89530l71471l51105l29067l06053k83382
$$ 9022334 8612772 8202082 7798593 7409063 7037592 6686487 6357420 6051367 5767985
59636E767985k62164k42492k23769k05583j88127j71795j56613j42126j28048
$$ 5767985 5505821 5263329 5039560 4833977 4645850 4474055 4317442 4175316 4047268
59627D047268j14780j02994r2676q3101p3922o5734n9197n4104m9843m6357m3960
$$ 4047268 3932488 3829494 3736818 3653717 3579795 3514061 3454864 3400760 3350917 3304560 3260600
59616C260600m2375m0759l8712l6672l5185l4364l4182l4647l5458l6023l6186
$$ 3260600 3218225 3177466 3138754 3102082 3066897 3032533 2998351 2963704 2928246 2892223 2856037
59605B856037l6486l7282l8020l7783l6385l4431l2400l0242k7860k5616k4089
$$ 2856037 2819551 2782269 2744249 2706466 2670081 2635650 2603250 2573008 2545148 2519532 2495443
59594B495443k3413k3001k2035k0226j8043j6083j4309j2166r413o456l753j325
$$ 2495443 2472030 2449029 2426994 2406768 2388725 2372642 2358333 2346167 2336754 2330298 2326545 2325220
59582B325220R86L153N220P535J0321J3253J5919J8431K1029K3361K4899K6068
$$ 2325220 2326206 2329359 2334579 2342114 2352435 2365688 2381607 2400038 2421067 2444428 2469327 2495395
59570B495395K8167L1884L6473M0724M4210M7213N0016N2826N6113O0191O4616
$$ 2495395 2523562 2555446 2591919 2632643 2676853 2724066 2774082 2826908 2883021 2943212 3007828
59559C007828O8564P1940P5535P9933Q4731Q9125R2836R5997R8457R9772R9925
$$ 3007828 3076392 3148332 3223867 3303800 3388531 3477656 3570492 3666489 3764946 3864718 3964643
59548C964643R9523R8969R7629R4096Q7205P6662O2991M7269L1003J5732K377
$$ 3964643 4064166 4163135 4260764 4354860 4442065 4518727 4581718 4628987 4659990 4675722 4678099
59537D678099r080j9223k8614l7535m5956n3481n9566o4000o7005o8623o8298
$$ 4678099 4669019 4649796 4621182 4583647 4537691 4484210 4424644 4360644 4293639 4225016 4156718
59526D156718o5525o0727n4849m8173m0157l0504j9732q371L757J7044L1298M5949
$$ 4156718 4091193 4030466 3975617 3927444 3887287 3856783 3837051 3828680 3832437 3849481 3880779 3926728
59514C926728O0662P5150Q8681J00369J09791J16696J20180J18851J11933R9810
$$ 3926728 3987390 4062540 4151221 4251590 4361381 4478077 4598257 4717108 4829041 4928851
59504D928851Q3339O3109L9549J3393j4194m1783o7871r1123j10586j25554j35404
$$ 4928851 5012190 5075299 5114848 5128241 5114047 5072264 5004393 4913270 4802684 4677130 4541726
59493D541726j39934j39833j36341j30328j22015j11652r9988q7822p5478o3032
$$ 4541726 4401792 4261959 4125618 3995290 3873275 3761623 3661635 3573813 3498335 3435303
59483C435303n0701l8720k7003j5288l513Q056J8904K8421L6313M2915M8715N3362
$$ 3435303 3384602 3345882 3318879 3303591 3300078 3308134 3327038 3355459 3391772 3434687 3483402 3536764
59471C536764N5635N4789N1451M6586M0061L1017J9454O558o737k0623l5449n0464
$$ 3536764 3592399 3647188 3698639 3745225 3785286 3816303 3835757 3842315 3835578 3814955 3779506 3729042
59459C729042o4204p5793q5299r2922r8448j01700j03039j03095j02178j00197
$$ 3729042 3664838 3589045 3503746 3410824 3312376 3210676 3107637 3004542 2902364 2802167
59449B802167r7114r3177q8677q3733p8475p3207o8189o3306n8262n3114m8358
$$ 2802167 2705053 2611876 2523199 2439466 2360991 2287784 2219595 2156289 2098027 2044913 1996555
59438A996555m4301m0617l6732l2526k8407k4686k1134j7306j3199r393o423m131
$$ 1996555 1952254 1911637 1874905 1842379 1813972 1789286 1768152 1750846 1737647 1728254 1721831 1717700
59426A717700j750J312M972Q806J2423J5243J6208J4492J0625O382L303J650R86
$$ 1717700 1715950 1717262 1722234 1731040 1743463 1758706 1774914 1789406 1800031 1806413 1809716 1811366 1812352
59413A812352J242K741N582R459J3950J8414K1743K2766K1255J8321J5743J4919
$$ 1812352 1813594 1816335 1821917 1831376 1845326 1863740 1885483 1908249 1929504 1947825 1963568 1978487
59401A978487J6212J9075K2695K6643L0834L5016L8790M2307M6379N1452N6850
$$ 1978487 1994699 2013774 2036469 2063112 2093946 2128962 2167752 2210059 2256438 2307890 2364740
59390B364740O1659O6100P1236P7468Q3975Q9808R4871R9622J04324J08912J13238
$$ 2364740 2426399 2492499 2563735 2641203 2725178 2814986 2909857 3009479 3113803 3222715 3335953
59379C335953J17242J21030J24955J29449J34917J41984J51583J64158J78844
$$ 3335953 3453195 3574225 3699180 3828629 3963546 4105530 4257113 4421271 4600115
59370D600115J94043K08844K23291K37143K49176K57970K62792K63305K59181
$$ 4600115 4794158 5003002 5226293 5463436 5712612 5970582 6233374 6496679 6755860
59361F755860K50516K38160K23064K05638J86200J65568J44545J23096J00611
$$ 6755860 7006376 7244536 7467600 7673238 7859438 8025006 8169551 8292647 8393258
59352H393258P6749N1528K4841l516l3471o4932r8121j32893j67783k00456k29293
$$ 8393258 8470007 8521535 8546376 8542860 8509389 8444457 8346336 8213443 8045660 7845204 7615911
59341G615911k53861k73716k87579k94362k94494k89579k80894k68743k53401
$$ 7615911 7362050 7088334 6800755 6506393 6211899 5922320 5641426 5372683 5119282
59332E119282k36178k19159k03897j90538j78286j66546j55457j45432j36558
$$ 5119282 4883104 4663945 4460048 4269510 4091224 3924678 3769221 3623789 3487231
59323C487231j28535j20899j13150j04964r6565q8677q1802p5695o9838o4082
$$ 3487231 3358696 3237797 3124647 3019683 2923118 2834441 2752639 2676944 2607106 2543024
59313B543024n8543n3118m7691m2635l8464l4958l1227k6833k2291j8222j4425
$$ 2543024 2484481 2431363 2383672 2341037 2302573 2267615 2236388 2209555 2187264 2169042 2154617
59302B154617j0232n409l38M527R022J3111J6564J8774J8978J6881J3326J0052
$$ 2154617 2144385 2138976 2138638 2143165 2152187 2165298 2181862 2200636 2219614 2236495 2249821 2259873
59290B259873Q521Q984J0849J3678J7502K2226K7182L1460L4550L6470L7450L7603
$$ 2259873 2268394 2277378 2288227 2301905 2319407 2341633 2368815 2400275 2434825 2471295 2508745 2546348
59278B546348L6851L4988L1762K6984K0683J3105M581m501j3560k1906k9210l5712
$$ 2546348 2583199 2618187 2649949 2676933 2697616 2710721 2715302 2710801 2697241 2675335 2646125 2610413
59266B610413m1649m6546m9624n0985n1764n2769n3472n2884n0969m8564m6106
$$ 2610413 2568764 2522218 2472594 2421609 2369845 2317076 2263604 2210720 2159751 2111187 2065081
59255B065081m3291l9910l6311l2807k9323k5819k2544j9517j6259j2455q428
$$ 2065081 2021790 1981880 1945569 1912762 1883439 1857620 1835076 1815559 1799300 1786845 1778417
59244A778417m625j017K572N906Q606J0809J3056J5646J8501K1528K4718K7962
$$ 1778417 1773792 1772775 1775347 1781253 1789859 1800668 1813724 1829370 1847871 1869399 1894117 1922079
59232A922079L1136L4372L7890M1671M5609M9898N4844O0350O5980P1622P7744
$$ 1922079 1953215 1987587 2025477 2067148 2112757 2162655 2217499 2277849 2343829 2415451 2493195
59221B493195Q4846R2968J01788J10912J19981J28830J37603J46455J54997J62323
$$ 2493195 2578041 2671009 2772797 2883709 3003690 3132520 3270123 3416578 3571575 3733898
59211C733898J67552J69924J68336J61380J48344J29825J06915Q0148M9789J6854
$$ 3733898 3901450 4071374 4239710 4401090 4549434 4679259 4786174 4866322 4916111 4932965
59201D932965j6853m9729q0736j08746j32205j49947j61884j68600j70663j68681
$$ 4932965 4916112 4866383 4785647 4676901 4544696 4394749 4232865 4064265 3893602 3724921
59191C724921j63532j55995j46395j35157j23389j12233j01687r0892p9648o9008
$$ 3724921 3561389 3405394 3258999 3123842 3000453 2888220 2786533 2695641 2615993 2546985
59181B546985n9948n2188m4701l7053k9612k2849j6953j2110q542o227m869m295
$$ 2546985 2487037 2434849 2390148 2353095 2323483 2300634 2283681 2271571 2263029 2256802 2251933 2247638
59169B247638m696o566j0389j6132k2790k8822l3438l7238m1109m4760m7040m7506
$$ 2247638 2242942 2236376 2225987 2209855 2187065 2158243 2124805 2087567 2046458 2001698 1954658 1907152
59157A907152m6873m5833m4279m1987l9338l6757l3991l0563k6716k3310k0908
$$ 1907152 1860279 1814446 1770167 1728180 1688842 1652085 1618094 1587531 1560815 1537505 1516597
59146A516597j9350j8087j6501j4026j0524o617l326j264k48L06R53K058L670
$$ 1516597 1497247 1479160 1462659 1448633 1438109 1431492 1428166 1426902 1426654 1426960 1427913 1429971 1433641
59133A433641N408O641O980O539N796N243N118N327N614N891O283O821P266P470
$$ 1433641 1439049 1445690 1452670 1459209 1465005 1470248 1475366 1480693 1486307 1492198 1498481 1505302 1512568 1520038
59119A520038P662Q201R070R938J0551J0894J1025J1080J1291J1691J1884J1503
$$ 1520038 1527700 1535901 1544971 1554909 1565460 1576354 1587379 1598459 1609750 1621441 1633325 1644828
59107A644828J0905J0972J2048J3441J4251J4416J4667J5583J6989J8259J9140
$$ 1644828 1655733 1666705 1678753 1692194 1706445 1720861 1735528 1751111 1768100 1786359 1805499
59096A805499K0131K2000K4841K7689K9367K9703K9730L0592L2522L4809L6441
$$ 1805499 1825630 1847630 1872471 1900160 1929527 1959230 1988960 2019552 2052074 2086883 2123324
59085B123324L6596L4909L1648K7489K2807J7325J0704L292m120j1159j8023k4729
$$ 2123324 2159920 2194829 2226477 2253966 2276773 2294098 2304802 2308094 2303974 2292815 2274792 2250063
59073B250063l0773l5735l9843m3581m6858m8976m9352m8118m6032m3979m2412
$$ 2250063 2219290 2183555 2143712 2100131 2053273 2004297 1954945 1906827 1860795 1816816 1774404
59062A774404m1056l9215l6629l3949l2116l1247l0495k9093k7201k5597k4651
$$ 1774404 1733348 1694133 1657504 1623555 1591439 1560192 1529697 1500604 1473403 1447806 1423155
59051A423155k3884k2455j9999j7085j4791j3647j2980j1738r926q739q905r583
$$ 1423155 1399271 1376816 1356817 1339732 1324941 1311294 1298314 1286576 1276650 1267911 1259006 1249423
59039A249423r445q475p784p814p675o589n041l973l388k505j023M70J314J514
$$ 1249423 1239978 1231503 1223719 1215905 1208230 1201641 1196600 1192627 1189239 1186734 1185711 1186181 1187495 1189009
59025A189009J615K165L369M939O234O760O633O482O883P923R262J0508J1625
$$ 1189009 1190624 1192789 1196158 1201097 1207331 1214091 1220724 1227206 1234089 1242012 1251274 1261782 1273407
59012A273407J2969J4771J6603J7662J7805J7899J8871K0701K2809K5070K7822
$$ 1273407 1286376 1301147 1317750 1335412 1353217 1371116 1389987 1410688 1433497 1458567 1486389
59001A486389L0929L3614L5454L6927L8681M0607M1992M2273M1270L8920L5224
$$ 1486389 1517318 1550932 1586386 1623313 1661994 1702601 1744593 1786866 1828136 1867056 1902280
58990A902280L0381K4650J8111J0864L397l568r616j4780j9060k2122k3686k4021
$$ 1902280 1932661 1957311 1975422 1986286 1989683 1986115 1976499 1961719 1942659 1920537 1896851 1872830
58978A872830k3819k3613k3526k3481k3400k3098k2307k0980j9396j7738j5720
$$ 1872830 1849011 1825398 1801872 1778391 1754991 1731893 1709586 1688606 1669210 1651472 1635752
58967A635752j2962r664o505l789j121J830M559O189O513O225O127O456P041P721
$$ 1635752 1622790 1613126 1606621 1602832 1601711 1603541 1608100 1614289 1620802 1627027 1633154 1639610 1646651 1654372
58953A654372Q460R214R937J0682J1634J2958J4634J6406J8010J9533K1367K3666
$$ 1654372 1662832 1672046 1681983 1692665 1704299 1717257 1731891 1748297 1766307 1785840 1807207 1830873
58941A830873K6009K7892K9398L1131L3561L6800M0879M5753N0955N5713N9737
$$ 1830873 1856882 1884774 1914172 1945303 1978864 2015664 2056543 2102296 2153251 2208964 2268701
58930B268701O3442O7116P0154P1508P0692O7949O3678N8291N2603M7811M4794
$$ 2268701 2332143 2399259 2469413 2540921 2611613 2679562 2743240 2801531 2854134 2901945 2946739
58919B946739M3791M4796M7896N2822N8609O4313P0015P6597Q4464R2921J01091
$$ 2946739 2990530 3035326 3083222 3136044 3194653 3258966 3328981 3405578 3490042 3582963 3684054
58908C684054J09044J17579J27077J36990J46549J55561J64398J73387J82369
$$ 3684054 3793098 3910677 4037754 4174744 4321293 4476854 4641252 4814639 4997008
58899D997008J90685J97501K02209K04617K04677K02136J96657J88285J77468
$$ 4997008 5187693 5385194 5587403 5792020 5996697 6198833 6395490 6583775 6761243
58890F761243J64634J49976J33698J16058R7005P6162N3488K9577N049j9989m5460
$$ 6761243 6925877 7075853 7209551 7325609 7422614 7498776 7552264 7581841 7586890 7566901 7521441
58879G521441p0645r4542j16693j37060j55185j70123j81350j89175j94240j97092
$$ 7521441 7450796 7356254 7239561 7102501 6947316 6777193 6595843 6406668 6212428 6015336
58869F015336j98292j98321j97049j93860j88647j82297j75775j69096j61717
$$ 6015336 5817044 5618723 5421674 5227814 5039167 4856870 4681095 4511999 4350282
58860D350282j53619j45423j37586j29952j22105j13856j05380r7197q9951q3831
$$ 4350282 4196663 4051240 3913654 3783702 3661597 3547741 3442361 3345164 3255213 3171382
58850C171382p8164p2032o5295n8674n2717m7163m1603l6282l1750k7912k4025
$$ 3171382 3093218 3021186 2955891 2897217 2844500 2797337 2755734 2719452 2687702 2659790 2635765
58839B635765j9751j5608j2123q928n186p80L546P193J0393J3678J7103K0440
$$ 2635765 2616014 2600406 2588283 2579355 2574169 2573389 2576935 2584128 2594521 2608199 2625302 2645742
58827B645742K3821K7711L2194L6705M0577M3615M6103M8413N0748N3136N5526
$$ 2645742 2669563 2697274 2729468 2766173 2806750 2850365 2896468 2944881 2995629 3048765 3104291
58816C104291N7905O0346O2961O5930O9600P4391Q0452Q7514R5242J03550J12432
$$ 3104291 3162196 3222542 3285503 3351433 3421033 3495424 3575876 3663390 3758632 3862182 3974614
58805C974614J21646J30870J40038J49232J58326J67001J75067J82400J88657
$$ 3974614 4096260 4227130 4367168 4516400 4674726 4841727 5016794 5199194 5387851
58796E387851J93273J95741J95541J92006J84688J73846J60040J43287J23061
$$ 5387851 5581124 5776865 5972406 6164412 6349100 6522946 6682986 6826273 6949334
58787F949334R9212P2428M3747J4192j4956m2316o7190q9919j11082j30840j49247
$$ 6949334 7048546 7120974 7164721 7178913 7163957 7121641 7054451 6964532 6853450 6722610 6573363
58776F573363j66616j82975j97451k08796k16330k20011k19912k16161k09307
$$ 6573363 6406747 6223772 6026321 5817525 5601195 5381184 5161272 4945111 4735804
58767D735804k00240j89832j78917j68400j58802j49760j40508j30933j21770
$$ 4735804 4535564 4345732 4166815 3998415 3839613 3689853 3549345 3418412 3296642
58758C296642j13685j06568r9856r3170q6407p9493p2421o5514n9292n3957m9093
$$ 3296642 3182957 3076389 2976533 2883363 2796956 2717463 2645042 2579528 2520236 2466279 2417186
58747B417186m4167l9293l5159l2080k9408k6353k2994j9944j7149j3846r821
$$ 2417186 2373019 2333726 2298567 2266487 2237079 2210726 2187732 2167788 2150639 2136793 2126972
58736B126972n877k659K56L554P008R610J0441Q915M728j707r161j6551k3773
$$ 2126972 2121095 2118436 2118692 2122246 2129254 2138864 2149305 2158220 2162948 2161241 2152080 2135529 2111756
58723B111756l0972l7455m2146m4847m6175m6460m5656m4198m2952m2034m0626
$$ 2111756 2080784 2043329 2001183 1956336 1910161 1863701 1818045 1773847 1730895 1688861 1648235
58712A648235l8170l5049l1788k8373k4646k0724j6597j1957o847j963K041N057
$$ 1648235 1610065 1575016 1543228 1514855 1490209 1469485 1452888 1440931 1434084 1432121 1434162 1439219
58700A439219O975P186N059N94n750j3287k0852k6895l0561l2343l3099l2819
$$ 1439219 1446194 1453380 1458439 1459033 1453283 1439996 1419144 1392249 1361688 1329345 1296246 1263427
58688A263427l0904k7430k3386j9734j6755j4265j1878r068n500j513K113M943
$$ 1263427 1232523 1205093 1181707 1161973 1145218 1130953 1119075 1110007 1104507 1102994 1105107 1110050
58676A110050P159R037J0486J1312J1644J1894J2412J3274J4321J5216J5470J4431
$$ 1110050 1117209 1126246 1136732 1148044 1159688 1171582 1183994 1197268 1211589 1226805 1242275 1256706
58664A256706J1362N763k130j1140j9538k5831k9411l0674l0498k9433k7466k4649
$$ 1256706 1268068 1273831 1271701 1260561 1241023 1215192 1185781 1155107 1124609 1095176 1067710 1043061
58652A043061k1672j9351j7588j5497j2721j0002q064o527m591k360p32o8K21
$$ 1043061 1021389 1002038 984450 968953 956232 946230 938166 931639 927048 924688 923956 923888 924109
58639I24109P22J354J940K814M329O101P208P166O384N661N489N829O388O963
$$ 924109 924831 926185 928125 930939 935268 941369 948577 955743 962127 967788 973277 979106 985494 992457
58625I92457P591Q460R688J1186J2779J4415J6160J7923J9350K0248K1070K2579
$$ 992457 1000048 1008508 1018196 1029382 1042161 1056576 1072736 1090659 1110009 1130257 1151327 1173906
58613A173906K4858K7010K8258K9036L0395L2510L4571L6289L8633M2444M6993
$$ 1173906 1198764 1225774 1254032 1283068 1313463 1345973 1380544 1416833 1455466 1497910 1544903
58602A544903N0679N2854N4220N5507N6583N6947N6347N4623N1418M6505M0110
$$ 1544903 1595582 1648436 1702656 1758163 1814746 1871693 1928040 1982663 2034081 2080586 2120696
58591B120696L2592K4024J4383M035o317j6071k4866l2313l7913m1426m3228m4023
$$ 2120696 2153288 2177312 2191695 2195730 2189413 2173342 2148476 2116163 2078250 2036824 1993596 1949573
58579A949573m4141m3319m1319l8564l5883l3673l1669k9605k7662k6062k4584
$$ 1949573 1905432 1862113 1820794 1782230 1746347 1712674 1681005 1651400 1623738 1597676 1573092
58568A573092k2966k1391k0159j9000j7386j5413j3866j3233j3183j3277j3658
$$ 1573092 1550126 1528735 1508576 1489576 1472190 1456777 1442911 1429678 1416495 1403218 1389560
58557A389560j4652j6005j7067j7669j8370j9694k1431k2927k3883k4646k5517
$$ 1389560 1374908 1358903 1341836 1324167 1305797 1286103 1264672 1241745 1217862 1193216 1167699
58546A167699k6166k5973k4908k3596k2360k0764j8520j6386j5417j5500j5387
$$ 1167699 1141533 1115560 1090652 1067056 1044696 1023932 1005412 989026 973609 958109 942722
58535I42722j4321j2846j1730j0852r714q493p821p715p504o727n606m497l474
$$ 942722 928401 915555 903825 892973 883259 874766 866945 859230 851726 844999 839393 834896 831422
58522H31422k506j738j265r35m40M04J557K688L384L606L863M646N771O668P250
$$ 831422 828916 827178 825913 824978 824538 824942 826499 829187 832571 836177 840040 844686 850457 857125 864375
58507H64375P973Q984R763R900R676R515R261Q482P181N703M139K323M41j015
$$ 864375 872348 881332 891095 900995 910671 920186 929447 937929 945110 950813 954952 957275 957716 956701
58493I56701j929k750l819m871n425n354m907m439m303m758n669o474o647o174
$$ 956701 954772 952022 948203 943332 937907 932553 927646 923207 918904 914146 908477 902003 895356 889182
58479H89182n411m750m499m868n671o229n964n084m377m287m484m359l766l079
$$ 889182 883771 879021 874522 869654 863983 857754 851790 846706 842329 838042 833558 829199 825433 822354
58465H22354k762k993l541l895l606k649j426l53L70O46L95j70m38R6J246K312
$$ 822354 819592 816599 813058 809163 805557 802908 801482 801129 801499 802145 802540 802370 801932 802028 803274 805586
58449H05586K901L211L491L570L221K705K489K533K348J837J591K023K633K564
$$ 805586 808487 811698 815189 818759 821980 824685 827174 829707 832055 833892 835483 837506 840139 842703
58435H42703J747R68Q80J396K071K614K872K733K401K383K902L526L731L636L819
$$ 842703 844450 845418 846298 847694 849765 852379 855251 857984 860385 862768 865670 869196 872927 876563 880382
58420H80382M461N146N513N747O182O694O805O326N603N093M855M685M631M984
$$ 880382 884843 889989 895502 901249 907431 914125 920930 927256 932859 937952 942807 947492 952123 957107
58406I57107N709O173N796M823M094M068M460M766M784M581M390M591N369O273
$$ 957107 962816 968989 974785 979608 983702 987770 992230 996996 1001780 1006361 1010751 1015342 1020711 1026984
58392A026984O609O412O513P335Q274Q562Q276P870P414O828O468O584O581N662
$$ 1026984 1033593 1040005 1046518 1053853 1062127 1070689 1078965 1086835 1094249 1101077 1107545 1114129 1120710 1126372
58378A126372M149L271L638M645N415N664N547N323N387N948O600O755O558O791
$$ 1126372 1130521 1133792 1137430 1142075 1147490 1153154 1158701 1164024 1169411 1175359 1181959 1188714 1195272 1202063
58364A202063P641Q330Q225P680P457P807Q537R428J0219J0580J0503J0362J0350
$$ 1202063 1209704 1218034 1226259 1233939 1241396 1249203 1257740 1267168 1277387 1287967 1298470 1308832 1319182
58351A319182J0219R837R587R826J0365J0806J1157J1701J2475J3177J3439J3141
$$ 1319182 1329401 1339238 1348825 1358651 1369016 1379822 1390979 1402680 1415155 1428332 1441771 1454912
58339A454912J2638J2658J3580J4849J5573J5702J5981J6684J7255J7374J7555
$$ 1454912 1467550 1480208 1493788 1508637 1524210 1539912 1555893 1572577 1589832 1607206 1624761
58328A624761J8266J9233K0157K1355K3063K4704K5602K5934K6302K6808K7239
$$ 1624761 1643027 1662260 1682417 1703772 1726835 1751539 1777141 1803075 1829377 1856185 1883424
58317A883424K7689K8294K8635K8133K6810K5013K2854K0524J8785J8263J8486
$$ 1883424 1911113 1939407 1968042 1996175 2022985 2047998 2070852 2091376 2110161 2128424 2146910
58306B146910J8450J8076J8265J9498K1197K2539K3376K4084K5007K6206K7555
$$ 2146910 2165360 2183436 2201701 2221199 2242396 2264935 2288311 2312395 2337402 2363608 2391163
58295B391163K8980L0696L2933L5307L6961L7620L8101L9260M0941M2457M3692
$$ 2391163 2420143 2450839 2483772 2519079 2556040 2593660 2631761 2671021 2711962 2754419 2798111
58284B798111M5012M6541M8225N0309N2968N5773N8241O0592O3186O5632O7299
$$ 2798111 2843123 2889664 2937889 2988198 3041166 3096939 3155180 3215772 3278958 3344590 3411889
58273C411889O8465O9894P1463P2346P2481P2728P3393P3833P3911P4758P7413
$$ 3411889 3480354 3550248 3621711 3694057 3766538 3839266 3912659 3986492 4060403 4135161 4212574
58262D212574Q1384Q5340Q8784R2407R6921J02021J06766J10834J15126J20788
$$ 4212574 4293958 4379298 4468082 4560489 4657410 4759431 4866197 4977031 5092157 5212945
58252E212945J27732J34663J40765J46628J53125J60231J67640J75731J84986
$$ 5212945 5340677 5475340 5616105 5762733 5915858 6076089 6243729 6419460 6604446
58243F604446J94953K04831K14650K24963K35775K46790K58344K71019K84799
$$ 6604446 6799399 7004230 7218880 7443843 7679618 7926408 8184752 8455771 8740570
58234H740570K99642L16319L35422L56057L77037L98999M23858M52311M83516
$$ 8740570 9040212 9356531 9691953 10048010 10425047 10824046 11247904 11700215 12183731
58225A2183731N16963N53043N91858O33329O78561P29348P86090Q47868R14766
$$ 12183731 12700694 13253737 13845595 14478924 15157485 15886833 16672923 17520791 18435557
58216A8435557R88440J070322J161219J262969J378453J509532J656884J822430
$$ 18435557 19423997 20494319 21655538 22918507 24296960 25806492 27463376 29285806
58208B9285806K009916K222697K463108K734654L042746L392762L789807M241468
$$ 29285806 31295722 33518419 35981527 38716181 41758927 45151689 48941496 53182964
58200E3182964M758876N354780O043193O841195P767835Q840772J0077945J1503626
$$ 53182964 57941840 63296620 69339813 76181008 83948843 92789615 102867560 114371186
58192A14371186J3147389J5030562J7142894J9400112K1567171K3177611K3547180
$$ 114371186 127518575 142549137 159692031 179092143 200659314 223836925 247384105
58185B47384105K1969330J8051172J2001535M663484k770128r212699j4050940
$$ 247384105 269353435 287404607 299406142 304069626 301299498 292086799 278035859
58178B78035859j7226837j9039760j9857341j9940267j9439457j8473082j7172893
$$ 278035859 260809022 241769262 221911921 201971654 182532197 164059115 146886222
58171A46886222j5675918j4101951j2545065j1073373r728176q526297p467886
$$ 146886222 131210304 117108353 104563288 93489915 83761739 75235442 67767556
58164F7767556o543838n739878n040478m432542l905368l448227l050805k705942
$$ 67767556 61223718 55483840 50443362 46010820 42105452 38657225 35606420 32900478
58156C2900478k409307k155871j938658j751105j588616j447488j324130j215731
$$ 32900478 30491171 28335300 26396642 24645537 23056921 21609433 20285303 19069572
58148A9069572j120049j034194r55039q81146q12960p50898o94379o42711n95439
$$ 19069572 17949523 16915329 15960290 15079144 14266184 13515286 12820907 12178196 11582757
58139A1582757n51629n10164m71157m35960m05538l79754l58174l40329l25020
$$ 11582757 11031128 10520964 10049807 9613847 9208309 8828555 8470381 8130052 7805032
58130G805032l10624k96458k82766k69257k54862k39319k23854k09817j97498
$$ 7805032 7494408 7197950 6915184 6645927 6391065 6151746 5927892 5718075 5520577
58121E520577j86594j76887j67976j59244j50526j42163j34246j26532j19308
$$ 5520577 5333983 5157096 4989120 4829876 4679350 4537187 4402941 4276409 4157101
58112D157101j13359j08752j04523r9941r5231r0742q6365q2183p8725p5912p2767
$$ 4157101 4043742 3934990 3830467 3730526 3635295 3544553 3458188 3376005 3297280 3221368 3148601
58101C148601o8825o5036o2411o0503n8201n5439n3062n1416n0081m8842m7876
$$ 3148601 3079776 3014740 2952329 2891826 2833625 2778186 2725124 2673708 2623627 2574785 2526909
58090B526909m6933m5285m2773m0201l8399l7419l6933l6792l6838l6618l5877
$$ 2526909 2479976 2434691 2391918 2351717 2313318 2275899 2238966 2202174 2165336 2128718 2092841
58079B092841l5077l4944l5496l5948l5655l4678l3367l1812l0090k8616k7748
$$ 2092841 2057764 2022820 1987324 1951376 1915721 1881043 1847676 1815864 1785774 1757158 1729410
58068A729410k7122k5964k4129k2350k1260k0671k0029j9188j8397j7847j7538
$$ 1729410 1702288 1676324 1652195 1629845 1608585 1587914 1567885 1548697 1530300 1512453 1494915
58057A494915j7384j7200j6810j6371j6263j6465j6390j5686j4767j4187j3869
$$ 1494915 1477531 1460331 1443521 1427150 1410887 1394422 1378032 1362346 1347579 1333392 1319523
58046A319523j3437j2902j2492j2125j1656j1312j1267j1067j0151q770p665o999
$$ 1319523 1306086 1293184 1280692 1268567 1256911 1245599 1234332 1223265 1213114 1204344 1196679 1189680
58034A189680o340n602n246n518o185p010p801q032p246n905n032m805m413l447
$$ 1189680 1183340 1177738 1172492 1166974 1160789 1153779 1145978 1137946 1130700 1124795 1119763 1114958 1110545 1107098
58020A107098k585k406k379j668l36R33J811K463K997L470M124N145O261P074
$$ 1107098 1104513 1102107 1099728 1098060 1097724 1098657 1100468 1102931 1105928 1109398 1113522 1118667 1124928 1132002
58006A132002P656Q478R811J1452J3051J4551J6240J8407K0792K2626K3525K4113
$$ 1132002 1139658 1148136 1157947 1169399 1182450 1197001 1213241 1231648 1252440 1275066 1298591 1322704
57994A322704K5289K6948K8191K8731K9282L0333L1387L1834L1761L1415L0547
$$ 1322704 1347993 1374941 1403132 1431863 1461145 1491478 1522865 1554699 1586460 1617875 1648422
57983A648422K8991K7314K6145K5272K4014K2148J9830J6919J3043Q007J620o460
$$ 1648422 1677413 1704727 1730872 1756144 1780158 1802306 1822136 1839055 1852098 1860105 1861725 1855265
57971A855265j5974k5552l3777m0409m5784m9379n0183m8439m5769m3294m0623
$$ 1855265 1839291 1813739 1779962 1739553 1693769 1644390 1594207 1545768 1499999 1456705 1416082
57960A416082l7019l2717k8448k4497k0785j7408j4531j2119j0182q847p797o210
$$ 1416082 1379063 1346346 1317898 1293401 1272616 1255208 1240677 1228558 1218376 1209529 1201732 1195522
57948A195522l849j684q08r93j130p87n68q30r74l10J011K365L542M765O101P450
$$ 1195522 1191673 1189989 1189181 1188188 1187058 1186271 1185703 1184873 1183899 1183589 1184600 1186965 1190507 1195272 1201373 1208823
57932A208823R017J1272J4220J7025J8767J9332J9203J8432J6285J2122O298j55
$$ 1208823 1217840 1229112 1243332 1260357 1279124 1298456 1317659 1336091 1352376 1364498 1370796 1370641
57920A370641o548j2821j8892k4214k8204l0728l1974l2051l1073k9372k7295
$$ 1370641 1364093 1351272 1332380 1308166 1279962 1249234 1217260 1185209 1154136 1124764 1097469
57909A097469k4884k2106j9329j7158j5763j4724j3645j2602j1773j1054j0313
$$ 1097469 1072585 1050479 1031150 1013992 998229 983505 969860 957258 945485 934431 924118
57898I24118r784r781j0138j0330j0084r508q732p871p319p446p866p569o144
$$ 924118 914334 904553 894415 884085 874001 864493 855761 847890 840571 833125 825259 817690 811546
57885H11546m303k794j424K47J719K135J782J961L151M323M515M198M446N402
$$ 811546 807243 804449 803025 803272 804991 807126 808908 810869 814020 818343 822858 827056 831502 836904
57871H36904O298O631O540O250N750N025M008K497N41j252k339k977l728m410
$$ 836904 843202 849833 856373 862623 868373 873398 877406 879903 880444 879192 876853 873876 870148 865738
57857H65738m307l442k807l078l817m279m327m118l462k192q15n2R9L54J195K395
$$ 865738 861431 857989 855182 852104 848287 844008 839681 835563 832101 829909 829094 829042 829141 829495 830690 833085
57841H33085L403L785L400K465J610J409J752J903J281K8j202j775j431l95O57
$$ 833085 836488 840273 843673 846138 847748 849157 850909 852812 854093 854121 852919 851144 849713 849318 849975
57826H49975J012O11K42R11K864N313P152P995Q470R453J1090J2762J3936J4718
$$ 849975 850987 851598 851840 852751 855615 860928 868080 876075 884545 893998 905088 917850 931786 946504
57812I46504J5372J5613J4836J3050J1234J0683J2029J4913J8360K1503K4096
$$ 946504 961876 977489 992325 1005375 1016609 1027292 1039321 1054234 1072594 1094097 1118193
57801A118193K6371K8349K9463K9049K6961K3285J7710R869M48q702j5990k1300
$$ 1118193 1144564 1172913 1202376 1231425 1258386 1281671 1299381 1309250 1309698 1300996 1285006 1263706
57789A263706k5436k8738l0752l1097l0131k8685k7472k6754k6345k5870k5096
$$ 1263706 1238270 1209532 1178780 1147683 1117552 1088867 1061395 1034641 1008296 982426 957330
57778I57330k4000k2456k0242j7579j5335j4084j3231j1667r321p361o678o783
$$ 957330 933330 910874 890632 873053 857718 843634 830403 818736 809415 802054 795376 788593
57766G88593o590n700m422l023j620o47o16j277j602r34L01J220J558J699J967
$$ 788593 782003 776303 771881 768858 767238 766591 765975 764698 763096 762162 762463 763683 765241 766940 768907
57751G68907K361K983M109N617O766P019O815P038P807Q368Q290Q038Q074P978
$$ 768907 771268 774251 778360 783977 790743 797762 804577 811615 819422 827790 836080 844118 852192 860170
57737H60170P105N625M201K872J192o07j572j369q14n87l23M85J404J702J579
$$ 860170 867275 872900 877101 879973 881165 880558 878986 877617 876803 876216 875893 876378 877782 879484 881063
57722H81063J799K455L006L372M059N139O014O373O626P029P194O874O676P348
$$ 881063 882862 885317 888323 891695 895754 900893 906907 913280 919906 926935 934129 941003 947679 955027
57708I55027Q771J0189J1159J1864J2584J3319J3886J4153J4208J4458J5367J6958
$$ 955027 963798 973987 985146 997010 1009594 1022913 1036799 1050952 1065160 1079618 1094985 1111943
57696A111943J8791K0514K2225K4130K6164K8242L0549L3247L6162L9071M2115
$$ 1111943 1130734 1151248 1173473 1197603 1223767 1252009 1282558 1315805 1351967 1391038 1433153
57685A433153M5580M9500N3794N8442O3226O7561P1177P4647P8639Q2811Q6211
$$ 1433153 1478733 1528233 1582027 1640469 1703695 1771256 1842433 1917080 1995719 2078530 2164741
57674B164741Q8687R1035R3675R6031R7533R8083R6689R0222P4685M8080J1985
$$ 2164741 2253428 2344463 2438138 2534169 2631702 2729785 2826474 2916696 2991381 3039461 3051446
57663C051446k8940o8336r9863j19571j27646j27458j22459j14322j03926r2941
$$ 3051446 3022506 2954170 2854307 2734736 2607090 2479632 2357173 2242851 2138925 2045984
57653B045984q3287p5448o8351o1024n3720m7200m1652l6675l1900k7197k2566
$$ 2045984 1962697 1887249 1818898 1757874 1704154 1656954 1615302 1578627 1546727 1519530 1496964
57642A496964j8184j4393j1341q700n962k937K37L385O329Q817J0745J2489J4614
$$ 1496964 1478780 1464387 1453046 1444346 1438384 1435447 1435684 1439069 1445398 1454215 1464960 1477449 1492063
57629A492063J7233J9878K2070K3847K5634K7806L0426L3212L5715L7680L9339
$$ 1492063 1509296 1529174 1551244 1575091 1600725 1628531 1658957 1692169 1727884 1765564 1804903
57618A804903M1132M3024M4242M3869M1640L8083L3839K9022K3176J5914P458
$$ 1804903 1846035 1889059 1933301 1977170 2018810 2056893 2090732 2119754 2142930 2158844 2166302
57607B166302j534j0587j9559k8071l5205m0210m3316m5416m7029m8026m8323
$$ 2166302 2164768 2154181 2134622 2106551 2071346 2031136 1987820 1942404 1895375 1847349 1799026
57596A799026m8127m7341m5445m2406l9213l6883l5242l3340l0878k8543k6903
$$ 1799026 1750899 1703558 1658113 1615707 1576494 1539611 1504369 1471029 1440151 1411608 1384705
57585A384705k5660k4247k2652k1207j9876j8207j6013j3738j2043j1090j0353
$$ 1384705 1359045 1334798 1312146 1290939 1271063 1252856 1236843 1223105 1211062 1199972 1189619
57574A189619r152p377n601m453l964l648l154k581k159j867j560j286j216j283
$$ 1189619 1180467 1173090 1167489 1163036 1159072 1155424 1152270 1149689 1147530 1145663 1144103 1142817 1141601 1140318
57560A140318j143n48M03J427K409L375M296N018N433N603N732O066O812P894
$$ 1140318 1139175 1138627 1139030 1140457 1142866 1146241 1150537 1155555 1160988 1166591 1172323 1178389 1185201 1193095
57546A193095Q896R395R432R433R686J0170J0940J2241J3992J5591J6692J7812
$$ 1193095 1201991 1211386 1220818 1230251 1239937 1250107 1261047 1273288 1287280 1302871 1319563 1337375
57534A337375J9689K2183K4488K6259K7881K9573L1021L2150L3541L5546L7471
$$ 1337375 1357064 1379247 1403735 1429994 1457875 1487448 1518469 1550619 1584160 1619706 1657177
57523A657177L8252L7671L6460L5330L4254L2575K9507K4631J8321J1606N303
$$ 1657177 1695429 1733100 1769560 1804890 1839144 1871719 1901226 1925857 1944178 1955784 1961087
57512A961087o57o888j3606k0212k5731k9456l1336l1993l2241l2466l2476l1946
$$ 1961087 1960430 1953542 1939936 1919724 1893993 1864537 1833201 1801208 1768967 1736501 1704025 1672079
57500A672079l0836k9213k7102k4677k2368k0480j8917j7452j5982j4423j2637
$$ 1672079 1641243 1612030 1584928 1560251 1537883 1517403 1498486 1481034 1465052 1450629 1437992
57489A437992j0711q876o969m480j502R49K146K712L803N647P590R272J0849J2304
$$ 1437992 1427281 1418405 1411436 1406956 1405454 1406403 1408549 1411261 1415064 1420711 1428301 1437573 1448422 1460726
57475A460726J3395J4355J5785J7741J9663K1260K2825K4500K5994K7169K8354
$$ 1460726 1474121 1488476 1504261 1522002 1541665 1562925 1585750 1610250 1636244 1663413 1691767
57464A691767K9822L1452L3036L4308L4625L3337L0582K7123K3174J8175J1920
$$ 1691767 1721589 1753041 1786077 1820385 1855010 1888347 1918929 1946052 1969226 1987401 1999321
57453A999321N124j463p764j3838j9416k4422k9124l3233l5685l6055l5451l5203
$$ 1999321 2004445 2002982 1995218 1981380 1961964 1937542 1908418 1875185 1839500 1803445 1767994 1732791
57441A732791l5195l4447l2817l1081k9600k7981k6024k4063k2348k0792j9454
$$ 1732791 1697596 1663149 1630332 1599251 1569651 1541670 1515646 1491583 1469235 1448443 1428989
57430A428989j8500j7624j6146j3939j1674j0013q968q262p767p424p027o370
$$ 1428989 1410489 1392865 1376719 1362780 1351106 1341093 1332125 1323863 1316096 1308672 1301645 1295275
57418A295275n438m414l619l271l115k533j436o55r57j843k131j524q17n59l57
$$ 1295275 1289837 1285423 1281804 1278533 1275418 1272885 1271449 1270794 1269837 1267994 1265863 1264339 1263522 1262963 1262606
57403A262606J84P17P65M55J72m4k52k12K91J045J762K529L441M094M011L421
$$ 1262606 1262790 1263507 1264272 1264727 1264899 1264855 1264603 1264391 1264682 1265727 1267489 1270018 1273459 1277553 1281564 1284985
57387A284985L078L297L661L711L547L549L795M007L991L860L809L756L438K867
$$ 1284985 1288063 1291360 1295021 1298732 1302279 1305828 1309623 1313630 1317621 1321481 1325290 1329046 1332484 1335351
57373A335351K497K714L279L567L341K951K741K660K596K688L028L311L154K680
$$ 1335351 1337848 1340562 1343841 1347408 1350749 1353700 1356441 1359101 1361697 1364385 1367413 1370724 1373878 1376558
57359A376558K359K388K465K316K091K105K327K370K052J801K272L541M959N859
$$ 1376558 1378917 1381305 1383770 1386086 1388177 1390282 1392609 1394979 1397031 1398832 1401104 1404645 1409604 1415463
57345A415463O209O329O300O048N791N823N944N662N070M879N381N933N872N418
$$ 1415463 1421672 1428001 1434301 1440349 1446140 1451963 1457907 1463569 1468639 1473518 1478899 1484832 1490704 1496122
57331A496122N240N515N951O369O757O933O767O593O882P545Q041Q135Q094Q168
$$ 1496122 1501362 1506877 1512828 1519197 1525954 1532887 1539654 1546247 1553129 1560674 1568715 1576850 1584944 1593112
57317A593112Q406Q959R987J1141J1740J1636J1430J1578J1865J2048J2412J3194
$$ 1593112 1601518 1610477 1620464 1631605 1643345 1654981 1666411 1677989 1689854 1701902 1714314 1727508
57305A727508J3840J3643J2859J2594J3449J4835J5755J5844J5475J5232J5421
$$ 1727508 1741348 1754991 1767850 1780444 1793893 1808728 1824483 1840327 1855802 1871034 1886455
57294A886455J5835J5819J4834J3143J1616J0712R918Q506O523M649L255K092
$$ 1886455 1902290 1918109 1932943 1946086 1957702 1968414 1978332 1986838 1993361 1998010 2001265 2003357
57282B003357R39P0j01M59J463K634L871N116O325P419Q264Q808R300J0209J1789
$$ 2003357 2004296 2004366 2004265 2004724 2006187 2008821 2012692 2017808 2024133 2031552 2039816 2048624 2057924 2068133 2079922
57267B079922J3857J6047J8123J9927K1278K2150K2751K3319K3958K4894K6564
$$ 2079922 2093779 2109826 2127949 2147876 2169154 2191304 2214055 2237374 2261332 2286226 2312790
57256B312790K9155L2140L4605L5989L6413L6413L6583L7294L8451L9620M0590
$$ 2312790 2341945 2374085 2408690 2444679 2481092 2517505 2554088 2591382 2629833 2669453 2710043
57245B710043M1657M3131M4887M6750M8962N1676N4244N5689N5786N4947N3156
$$ 2710043 2751700 2794831 2839718 2886468 2935430 2987106 3041350 3097039 3152825 3207772 3260928
57234C260928M9918M5412M0842L7228L4613L2710L1523L0817K9813K8233K6956
$$ 3260928 3310846 3356258 3397100 3434328 3468941 3501651 3533174 3563991 3593804 3622037 3648993
57223C648993K6893K7734K8675K9831L1814L4270L6048L6816L7384L8244L8862
$$ 3648993 3675886 3703620 3732295 3762126 3793940 3828210 3864258 3901074 3938458 3976702 4015564
57212D015564L8766L8348L8063L7554L6283L4363L2289L0234K8229K6640K5872
$$ 4015564 4054330 4092678 4130741 4168295 4204578 4238941 4271230 4301464 4329693 4356333 4382205
57201D382205K5788K5999K6477K7453K8826L0150L1207L2188L3336L4728L6249
$$ 4382205 4407993 4433992 4460469 4487922 4516748 4546898 4578105 4610293 4643629 4678357 4714606
57190D714606L7513L7816L6635L4165L1190K8350K5787K3481K1600K0407J9949
$$ 4714606 4752119 4789935 4826570 4860735 4891925 4920275 4946062 4969543 4991143 5011550 5031499
57179E031499K0018K0384K0954K1728K2594K3360K4047K5036K6610K8410K9726
$$ 5031499 5051517 5071901 5092855 5114583 5137177 5160537 5184584 5209620 5236230 5264640 5294366
57168E294366L0435L1179L2425L3693L4127L3639L3064L3352L4819L7130L9517
$$ 5294366 5324801 5355980 5388405 5422098 5456225 5489864 5522928 5556280 5591099 5628229 5667746
57157E667746M1168M1609M0675L7973L2837K5437J7712J2376J0604J1093J1520
$$ 5667746 5708914 5750523 5791198 5829171 5862008 5887445 5905157 5917533 5928137 5939230 5950750
57146E950750J0546Q326N817M025L568M318N513O534P366P999P678N377J133l652
$$ 5950750 5961296 5969622 5975439 5979464 5983032 5987350 5992863 5999397 6006763 6014762 6022440 6027817 6028950 6025298
57132F025298p461r896j1463j2425j2306j0538p230l083J349O197J2027J9147
$$ 6025298 6017837 6007941 5996478 5984053 5971747 5961209 5953979 5950896 5952245 5958442 5970469 5989616
57120E989616K7206L5527M3734N1940O0440O9437P9300R0824J04756J20906J38061
$$ 5989616 6016822 6052349 6096083 6148023 6208463 6277900 6357200 6448024 6552780 6673686 6811747
57109F811747J55213J72868J92866K16951K45862K79865L19656L66289M20311
$$ 6811747 6966960 7139828 7332694 7549645 7795507 8075372 8395028 8761317 9181628
57100I181628M81289N48179O20128O97295P81581Q76711R87063J115765J263451
$$ 9181628 9662917 10211096 10831224 11528519 12310100 13186811 14173874 15289639 16553090
57091A6553090J428327J606651J792625J977656K149463K291422K382911K402205
$$ 16553090 17981417 19588068 21380693 23358349 25507812 27799234 30182145 32584350
57083C2584350K332626K169848J925681J624555J293402R50590O00980K40233
$$ 32584350 34916976 37086824 39012505 40637060 41930462 42881052 43482032 43722265
57075D3722265j35225n20009q98511j249766j553886j796600j971034k077447
$$ 43722265 43587040 43067031 42168520 40918754 39364868 37568268 35597234 33519787
57067C3519787k121583k112484k060714j977179j871970j753104j626108j494908
$$ 33519787 31398204 29285720 27225006 25247827 23375857 21622753 19996645 18501737
57059A8501737j362950j233494j109310r92805q86291p91472p08358o35317n70553
$$ 18501737 17138787 15905293 14795983 13803178 12916887 12125415 11417057 10781740 10211187
57050A0211187n13299m63305m19703l81074l46444l15655k88703k65298k45122
$$ 10211187 9697888 9234583 8814880 8433806 8087362 7771707 7483004 7217706 6972584
57041F972584k27901k12981j99288j86058j73302j61367j50378j40270j30898
$$ 6972584 6744683 6531702 6332414 6146356 5973054 5811687 5661309 5521039 5390141
57032E390141j21758j12107j01794r1521q1750p1779o0433m7175l1789j3851N654
$$ 5390141 5268383 5156276 5054482 4962961 4881211 4809432 4748999 4701824 4670035 4656184 4661838
57021D661838K1872K7214J6648p992l9315o9400r3313j09213j17099j18074j13883
$$ 4661838 4683710 4710924 4727572 4719580 4680265 4610865 4517552 4408339 4291240 4173166 4059283
57010D059283j06374r7360q8620q1369p5529p0048o4183n8222n2876m8444m4833
$$ 4059283 3952909 3855549 3766929 3685560 3610031 3539983 3475800 3417578 3364702 3316258 3271425
56999C271425m1965l9743l7808l5677l3223l0843k9085k8077k7361k6293k4700
$$ 3271425 3229460 3189717 3151909 3116232 3083009 3052166 3023081 2995004 2967643 2941350 2916650
56988B916650k2946k1255j9251j6532j3566j1478j0899j1462j2618j4440j7173
$$ 2916650 2893704 2872449 2853198 2836666 2823100 2811622 2800723 2789261 2776643 2762203 2745030
56977B745030k0235k2302k2521k1376k0181j9792j9950j9828j9063j8038j7178
$$ 2745030 2724795 2702493 2679972 2658596 2638415 2618623 2598673 2578845 2559782 2541744 2524566
56966B524566j6287j4896j3069j1394j0214r186p794n878l598j314J93j49k783
$$ 2524566 2508279 2493383 2480314 2468920 2458706 2449520 2441726 2435848 2432250 2430936 2431129 2430980 2428197
56953B428197o868j0999j4467j7408j9846k1271k1347k0477j9308j8001j6471
$$ 2428197 2421329 2410330 2395863 2378455 2358609 2337338 2315991 2295514 2276206 2258205 2241734
56942B241734j5028j4176j3735j2688j0291p021m082k052m13J535L729N481O269
$$ 2241734 2226706 2212530 2198795 2186107 2175816 2168795 2164713 2162661 2162248 2163783 2167512 2172993 2179262
56929B179262N923M165N08n007j1250j6600k0197k2410k3963k4907k4694k3197
$$ 2179262 2185185 2189350 2189858 2184851 2173601 2157001 2136804 2114394 2090431 2065524 2040830 2017633
56917B017633k1194j9653j8734j7862j6665j5438j4596j4095j3623j3038j2281
$$ 2017633 1996439 1976786 1958052 1940190 1923525 1908087 1893491 1879396 1865773 1852735 1840454
56906A840454j1154r677q454q126q455q548q074p681p885q182p710o451n149m169
$$ 1840454 1829300 1819623 1811169 1803043 1794588 1786040 1777966 1770285 1762400 1754218 1746508 1740057 1734908 1730739
56892A730739l079j470L20J601K255K921M174N626O032M523J638j145k938m178
$$ 1730739 1727660 1726190 1726510 1728111 1730366 1733287 1737461 1743087 1749119 1753642 1755280 1754135 1751197 1747019
56878A747019n595o998p585p234o752o685o537n542l790k014m51J395L769O069
$$ 1747019 1741424 1734426 1726841 1719607 1712855 1706170 1699633 1694091 1690301 1688287 1687836 1689231 1693000 1699069
56864A699069P624Q771J0579J3479J6650J8853J9374J7932J4221Q222Q96o135
$$ 1699069 1706693 1715464 1726043 1739522 1756172 1775025 1794399 1812331 1826552 1834774 1835670 1829535
56852A829535j1665j5407j7540j8241j7772j6378j3998j0545o614l297r71J167
$$ 1829535 1817870 1802463 1784923 1766682 1748910 1732532 1718534 1707989 1701375 1698078 1697107 1698274
56840A698274M003P535J1347J5409J9800K4185K8195L1600L3287L0891K2882J0844
$$ 1698274 1702277 1709812 1721159 1736568 1756368 1780553 1808748 1840348 1873635 1904526 1927408 1938252
56828A938252j636j2326k1331k8781l3424l4355l2746l0550k8312k5357k1619
$$ 1938252 1936616 1924290 1902959 1874178 1840754 1806399 1773653 1743103 1714791 1689434 1667815
56817A667815j7922j4647j1292p401l135J254N805J0424J4619J7849J9789K0128
$$ 1667815 1649893 1635246 1623954 1616553 1613418 1614672 1620477 1630901 1645520 1663369 1683158 1703286
56805A703286J8417J4231P408j699j1878k1175k7880l1458l2397l1431k9273k6727
$$ 1703286 1721703 1735934 1743342 1741643 1729765 1708590 1680710 1649252 1616855 1585424 1556151 1529424
56793A529424k4273k1613j8231j4452j1234q866o611l895j120J156L182N503P811
$$ 1529424 1505151 1483538 1465307 1450855 1439621 1430755 1424144 1420249 1419129 1420285 1423467 1428970 1436781
56780A436781R041Q520O443L210j141o460j1868j6104j8615j9951k0891k1378
$$ 1436781 1445822 1454342 1460785 1463995 1462854 1456394 1444526 1428422 1409807 1389856 1368965 1347587
56768A347587k0779j9076j7248j6216j5857j5469j4770j3938j2990j1847j0797
$$ 1347587 1326808 1307732 1290484 1274268 1258411 1242942 1228172 1214234 1201244 1189397 1178600
56757A178600j0162r531q157o225m830m478m509m361m476n222n823n348m174l455
$$ 1178600 1168438 1158907 1150750 1144525 1139695 1135217 1130708 1126347 1121871 1116649 1110826 1105478 1101304 1097849
56743A097849l421l369l103l234l842m026l206k064j587j850k309k759l235l452
$$ 1097849 1094428 1091059 1087956 1084722 1080880 1076854 1073648 1071584 1069997 1068147 1065838 1063079 1059844 1056392
56729A056392l067k375k064k223k246j823j519k074l422m718n192m782l947l104
$$ 1056392 1053325 1050950 1048886 1046663 1044417 1042594 1041075 1039001 1035579 1030861 1025669 1020887 1016940 1013836
56715A013836k315j475o45j25j07l80n19l64k29m82j043j378j058k61L99N34L60
$$ 1013836 1011521 1010046 1009401 1009276 1009169 1008789 1008270 1007906 1007677 1007195 1006152 1004774 1003716 1003455 1003854 1004388 1004748
56698A004748L83Q09J384J715J625J195O24J11k16l64m78p54j286j966k467k482
$$ 1004748 1005131 1005940 1007324 1009039 1010664 1011859 1012483 1012594 1012378 1012014 1011536 1010782 1009496 1007530 1005063 1002581
56682A002581k041j505j157r73q68r98j488k034k175j918j674j607j480j296j542
$$ 1002581 1000540 999035 997878 996905 996037 995039 993551 991517 989342 987424 985750 984143 982663 981367 979825
56667I79825k418l322l577l436l702m535n206n154m678m332m144l854l589l756
$$ 979825 977407 974085 970508 967072 963370 958835 953629 948475 943797 939465 935321 931467 927878 924122
56653I24122m354m842m794m388m069l990l964l816l562l274k965k644k347k038
$$ 924122 919768 914926 910132 905744 901675 897685 893721 889905 886343 883069 880104 877460 875113 873075
56639H73075j661j344j369j791k176k013j310o43m87p89j170j378j368j181r93
$$ 873075 871414 870070 868701 866910 864734 862721 861411 860768 860281 859492 858322 856944 855576 854395 853402
56624H53402j133j787k665l202l213l114l380l885l994l319k270j674j905k507
$$ 853402 852269 850482 847817 844615 841402 838288 834908 831023 827029 823710 821440 819766 817861 815354
56610H15354k700k168j223l81N7J00n8j32M6L52M95L95K64L50O69J004R98K98
$$ 815354 812654 810486 809263 808882 808939 809039 808981 808849 808895 809247 809742 810137 810401 810751 811420 812424 813422 813720
56592H13720j076k481l064k584j615q38n03o09j127j785k057j776j467j562j711
$$ 813720 812644 810163 807099 804515 802900 802062 801559 800950 799823 798038 795981 794205 792738 791176 789465
56577G89465j271k86O37J159J329J049J74q37j106l50P98J594J839J665J307J181
$$ 789465 788194 787908 788545 789704 791033 792082 792256 791419 790313 789963 790761 792355 794194 795859 797166 798347
56561G98347J529J832J234k29j510k020k382l276m278m569m235m036m302m755
$$ 798347 799876 801708 802942 802713 801203 799183 796801 793525 789247 784678 780443 776407 772105 767350
56547G67350n139n319n038m351m009m608n531n598m678l832l753l993l958l788
$$ 767350 762211 756892 751854 747503 743494 738886 733355 727757 723079 719247 715494 711501 707543 703755
56533G03755l805l750l161k205j574j651k088k181j579o97l14o26r82q75q47j723
$$ 703755 699950 696200 693039 690834 689260 687609 685521 683340 681761 681064 680750 680124 679142 678267 677420 675697
56517F75697l164l910l472k678k312k158j866j800k323k935k935k501k295k409
$$ 675697 672533 668623 665151 662473 660161 658003 656137 654337 652014 649079 646144 643643 641348 638939
56503F38939k416k159j782j279p23o35j284j830j211K62J174R60M97M74L66l49
$$ 638939 636523 634364 632582 631303 630580 629945 628661 626831 625620 625882 627056 628016 628513 628987 629353 629004
56487F29004r50m58P45J315P91K4j60J09L41M49N19M13Q4n5M39J284J644J058
$$ 629004 628054 627596 628341 629656 630447 630471 630311 630420 630761 631210 631729 632142 632226 632171 632610 633894 635538 636596
56469F36596r9j138j724j947j959j831j606j259p26j63q5q20j811j975r39L84
$$ 636596 636497 635359 633635 631688 629729 627898 626292 625033 624307 624144 624059 623239 621428 619453 618514 618898
56453F18898Q58M44l3j47k87p69j175r90m73m15j199k361l097l012k444k137k460
$$ 618898 619756 620200 620167 620020 619733 618964 617789 616799 616326 615911 614712 612351 609254 606242 603798 601661 599201
56436E99201k894k523j242q7o5q90j394j076o09p36j248j453j191q94q31p99n47
$$ 599201 596307 593784 592542 592455 592390 591500 590106 589030 588421 587685 586437 584984 583793 582899 582068 581269 580722
56419E80722r0M80J096J578J629J234P77O06N67K74l05p80q20m83n3K94N40O99
$$ 580722 580632 581112 582208 583786 585415 586649 587426 588032 588599 588873 588568 587788 586968 586485 586432 586726 587266 587965
56401E87965P58P16O47O41O72M83k19j292k038j808p97L9Rn65q19m27O5Po13j319
$$ 587965 588723 589439 590086 590727 591399 591882 591663 590371 588333 586525 585728 585767 585776 585211 584392 583965 584030 584037 583424 582105
56381E82105j796k057k051j508m03O78J040O81L22N31J095J398J176P12M33N65
$$ 582105 580309 578252 576201 574693 574290 574968 576008 576689 577011 577542 578637 580035 581211 581923 582356 582921
56365E82921J041J504J482Q22o1n80n36j29M06Q84J032P12L13M14J005J483J544
$$ 582921 583962 585466 586948 587770 587709 587129 586593 586464 586870 587754 588786 589498 589811 590225 591230 592713 594257
56348E94257J611K075K561K396J578Q45Q27J442K110K292J903J363J243J749K594
$$ 594257 595868 597943 600504 602900 604478 605323 606150 607592 609702 611994 613897 615260 616503 618252 620846
56333F20846L380L856L871L440L022L202L812L900L047K210K571L919M988N224
$$ 620846 624226 628082 631953 635393 638415 641617 645429 649329 652376 654586 657157 661076 666064 671288
56319F71288N212N406N405M862M251M117M239M119L842L787L869L712L431L482
$$ 671288 676500 681906 687311 692173 696424 700541 704780 708899 712741 716528 720397 724109 727540 731022
56305G31022L847L925L402K663K193J979J811J816K371L526M761N461N524N514
$$ 731022 734869 738794 742196 744859 747052 749031 750842 752658 755029 758555 763316 768777 774301 779815
56291G79815O093P336Q706R680J0263J0772J1378J2109J3069J4378J5908J7412
$$ 779815 785908 793244 801950 811630 821893 832665 844043 856152 869221 883599 899507 916919
56279I16919J8888K0508K2274K4049K5963K8369L1262L4243L7207M0618M4775
$$ 916919 935807 956315 978589 1002638 1028601 1056970 1088232 1122475 1159682 1200300 1245075
56268A245075M9214N3353N7461O2316O8000P3676P8677Q3256Q8002R2964R7604
$$ 1245075 1294289 1347642 1405103 1467419 1535419 1609095 1687772 1771028 1859030 1951994 2049598
56257B049598J01230J03181J02932J00401R5922Q9662Q1427P1350O0258M8861
$$ 2049598 2150828 2254009 2356941 2457342 2553264 2642926 2724353 2795703 2855961 2904822
56247B904822L6951K4099J0810j812j3403k4347l4442m2722m9011n4648o0847
$$ 2904822 2941773 2965872 2976682 2974870 2961467 2937120 2902678 2859956 2810945 2756297 2695450
56236B695450o7061p1851p4855p6927p8671p9817q0097p9774p9125p8063p6520
$$ 2695450 2628389 2556538 2481683 2404756 2326085 2246268 2166171 2086397 2007272 1929209 1852689
56225A852689p4611p2186o8827o4581o0176n6217n2493m8464m4082l9826l6151
$$ 1852689 1778078 1705892 1637065 1572484 1512308 1456091 1403598 1355134 1311052 1271226 1235075
56214A235075l3247l1060k9287k7421k5113k2415j9635j7146j5325j4324j3685
$$ 1235075 1201828 1170768 1141481 1114060 1088947 1066532 1046897 1029751 1014426 1000102 986417
56203I86417j2566j0646q541o960n783m479l184k673l137l613l056j588k69K79
$$ 986417 973851 963205 954664 947704 941921 937442 934258 931585 928448 924835 921779 920191 919922 920201
56189I20201N21J156K107K741K875L084L833M821N531O112P194Q847J0352J1135
$$ 920201 920722 921878 923985 926726 929601 932685 936518 941339 946870 952982 960176 969023 979375 990510
56175I90510J1487J2035J2848J3551J4030J4591J5376J6131J6729J7551J8993
$$ 990510 1001997 1014032 1026880 1040431 1054461 1069052 1084428 1100559 1117288 1134839 1153832
56164A153832K0752K2040K2620K3266K4910K7481L0106L2426L5223L9469M5190
$$ 1153832 1174584 1196624 1219244 1242510 1267420 1294901 1325007 1357433 1392656 1432125 1477315
56153A477315N1829N9387O8482P9263R0889J02385J13392J23558J31503J34988
$$ 1477315 1529144 1588531 1657013 1736276 1827165 1929550 2042942 2166500 2298003 2432991
56143B432991J32287J23358J09837R4280P9327O7051N8374N2736M8295M2755L4404
$$ 2432991 2565278 2688636 2798473 2892753 2972080 3039131 3097505 3150241 3198536 3241291 3275695
56132C275695K2798Q858n377j7353k5268k9439l2383l7121m5383n7400p2615q9691
$$ 3275695 3298493 3307351 3301974 3284621 3259353 3229914 3197531 3160410 3115027 3057627 2985012 2895321
56120B895321j06060j18657j25561j26616j22546j14303j03316r1371p9631o8391
$$ 2895321 2789261 2670604 2545043 2418427 2295881 2181578 2078262 1986891 1907260 1838869
56110A838869n8052m9465m2748l6661l0096k3523j8071j3751r766o133l655k277
$$ 1838869 1780817 1731352 1688604 1651943 1621847 1598324 1580253 1566502 1556736 1550603 1546948 1544671
56098A544671q23J302L246M040L872L464K960K191J448J246J581K033K456K945
$$ 1544671 1543848 1545150 1548396 1552436 1556308 1559772 1562732 1564923 1566371 1567617 1569198 1571231 1573687 1576632
56084A576632L386L615L977N059O748Q073Q380Q298R120J1279J3806J5433J5943
$$ 1576632 1580018 1583633 1587610 1592669 1599417 1607490 1615870 1624168 1633288 1644567 1658373 1673806 1689749
56071A689749J6142J6650J7248J7551J7815J8553J9634K0404K0768K1473K3009
$$ 1689749 1705891 1722541 1739789 1757340 1775155 1793708 1813342 1833746 1854514 1875987 1898996
56060A898996K4794K5955K6535K7283K8412K9312K9611K9860L0745L2043L2932
$$ 1898996 1923790 1949745 1976280 2003563 2031975 2061287 2090898 2120758 2151503 2183546 2216478
56049B216478L3137L3205L3671L4526L5652L7273L9552M2067M4163M5692M7009
$$ 2216478 2249615 2282820 2316491 2351017 2386669 2423942 2463494 2505561 2549724 2595416 2642425
56038B642425M8360M9715N1136N2775N4484N5895N7020N8360O0231O2403O4647
$$ 2642425 2690785 2740500 2791636 2844411 2898895 2954790 3011810 3070170 3130401 3192804 3257451
56027C257451O7185P0275P3649P6833P9797Q2978Q6726R0945R5196R8962J02001
$$ 3257451 3324636 3394911 3468560 3545393 3625190 3708168 3794894 3885839 3981035 4079997 4181998
56016D181998J04594J07335J10555J14231J18374J23174J28518J33991J39638
$$ 4181998 4286592 4393927 4504482 4618713 4737087 4860261 4988779 5122770 5262408
56007E262408J46151J53759J61493J68314J74639J81988J91171K01581K12242
$$ 5262408 5408559 5562318 5723811 5892125 6066764 6248752 6439923 6641504 6853746
55998F853746K22823K33501K44608K56752K70709K86668L03909L21666L40265
$$ 6853746 7076569 7310070 7554678 7811430 8082139 8368807 8672716 8994382 9334647
55989I334647L60968L84730M11264M39543M69062N00347N34295N71392O11915
$$ 9334647 9695615 10080345 10491609 10931152 11400214 11900561 12434856 13006248 13618163
55980A3618163O56564P06226P61221Q21398Q87094R59419J039606J128854J229012
$$ 13618163 14274727 14980953 15742174 16563572 17450666 18410085 19449691 20578545 21807557
55971B1807557J342554J471509J617238J781736J968279K180376K421047K693792
$$ 21807557 23150111 24621620 26238858 28020594 29988873 32169249 34590296 37284088
55963C7284088L003627L356713L760381M224305M760704N382698O103641O938479
$$ 37284088 40287715 43644428 47404809 51629114 56389818 61772516 67876157 74814636
55955G4814636P903754R015731J0291723J1755193J3435593J5355603J7505360
$$ 74814636 82718390 91734121 102025844 113781037 127216630 142572233 160077593
55948A60077593J9794875K1970576K3526131K3713869K1760767J7246430J0420773
$$ 160077593 179872468 201843044 225369175 249083044 270843811 288090241 298511014
55941B98511014K223909o031820j3125214j8278750k1267872k2319761k1914671
$$ 298511014 300734923 294703103 281577889 263299139 242031267 219711506 197796835
55934A97796835k0591781j8815286j6914135j5080135j3397985j1885002j0527397
$$ 197796835 177205054 158389768 141475633 126395498 112997513 101112511 90585114
55927I0585114r305430q204691p216801o336437n558933m878827m288934l780311
$$ 90585114 81279684 73074993 65858192 59521755 53962822 49083995 44795061 41014750
55919D1014750l343117k967558k644462k365658k124110j913827j729791j567897
$$ 41014750 37671633 34704075 32059613 29693955 27569845 25656018 23926227 22358330
55911B2358330j424783j297721j184804j084849r96541r17827q46728p82438p24838
$$ 22358330 20933547 19635826 18451022 17366173 16369632 15451805 14605077 13822639 13097801
55902A3097801o73045o25418n81134n40652n04200m70730m39000m08959l81402
$$ 13097801 12424756 11799338 11218204 10677552 10173352 9702622 9263622 8854663 8473261
55893H473261l56695l34465l14096k95033k76928k59845k44029k29265k14955
$$ 8473261 8116566 7782101 7468005 7172972 6896044 6636199 6392170 6162905 5947950
55884E947950k01021j88123j76604j65908j55484j45703j37307j30595j25733
$$ 5947950 5746929 5558806 5382202 5216294 5060810 4915107 4777800 4647205 4521472
55875D521472j23169j22859j23447j23065j20902j17380j13094j08282j03158
$$ 4521472 4398303 4275444 4151997 4028932 3908030 3790650 3677556 3569274 3466116
55866C466116r8052r3171q8651q4724q1344p7872p3792o9569o6211o3985o2220
$$ 3466116 3368064 3274893 3186242 3101518 3020174 2942302 2868510 2798941 2732730 2668745 2606525
55855B606525o0261n7977n5285n1960m8168m4689m2215m0711l9639l8507l7061
$$ 2606525 2546264 2488287 2433002 2381042 2332874 2288185 2245970 2205259 2165620 2127113 2090052
55844B090052l5284l3430l1889l0790k9867k8759k7276k5460k3558k1937k0794
$$ 2090052 2054768 2021338 1989449 1958659 1928792 1900033 1872757 1847297 1823739 1801802 1781008
55833A781008j9931j9070j8279j7823j7687j7629j7711j8395j9866k1552k2600
$$ 1781008 1761077 1742007 1723728 1705905 1688218 1670589 1652878 1634483 1614617 1593065 1570465
55822A570465k2755k2592k2885k3809k4802k5182k4787k3913k2812k1587k0537
$$ 1570465 1547710 1525118 1502233 1478424 1453622 1428440 1403653 1379740 1356928 1335341 1314804
55811A314804k0034j9854j9112j7324j5223j3916j3466j2857j1362r367p764o939
$$ 1314804 1294770 1274916 1255804 1238480 1223257 1209341 1195875 1183018 1171656 1162289 1154525 1147586
55799A147586o559o126n594n482o276p615q457q364q214r062j0685j1947j2518
$$ 1147586 1141027 1134901 1129307 1123825 1117549 1109934 1101477 1093113 1084899 1075837 1065152 1053205 1040687
55786A040687j3215j4515j5623j5454j3867j1503q920o432m397l110k488k222
$$ 1040687 1027472 1012957 997334 981880 968013 956510 947590 941158 936761 933651 931163 928941
55774I28941k119k195k629l752n719q080j0082j1573j3091j4819j6114j6475j6378
$$ 928941 926822 924627 921998 918246 912527 904447 894365 882792 869701 854882 838768 822293 805915
55761H05915j6541j6800j6515j5731j5089j4761j4319j3672j3322j3487j3721
$$ 805915 789374 772574 756059 740328 725239 710478 696159 682487 669165 655678 641957
55750F41957j3655j3499j3412j2979j1797j0212q888p876o634m953l376k467k069
$$ 641957 628302 614803 601391 588412 576615 566403 557515 549639 543005 538052 534676 532209 530140
55737E30140j622j063r54j537k109j825r32n12r57j393j067n93j111k603l901
$$ 530140 528518 527455 526501 524964 522855 521030 520098 519586 518629 517236 516169 515576 514465 511862 507961
55722E07961m216l833l323k888k600k521k345j550k39Q03J129J147J332J620J936
$$ 507961 503745 499912 496589 493701 491101 488580 486235 484685 484446 485249 486378 487525 488857 490477 492413
55707D92413K583L579M242M181M051M566N233N025L942K962K554K264J784J450
$$ 492413 494996 498575 502817 506998 511049 515615 520848 525873 529815 532777 535331 537595 539379 540829
55693E40829J494J627J681J902K283K243J502O88N77J071J436J235O47r2j081
$$ 540829 542323 543950 545631 547533 549816 552059 553561 554249 554826 555897 557333 558568 559215 559123 558042
55678E58042k508m215n576n988n593n318n843o711o906o177n232m690m476m349
$$ 558042 555534 551319 545743 539755 534162 528844 523001 516290 509384 503207 497975 493285 488809 484460
55664D84460m221l847k869j502m50J56J011K444L820M680N615P223Q881R534R160
$$ 484460 480239 476392 473523 472021 471571 471727 472738 475182 479002 483682 489297 496520 505401 514935 524095
55649E24095Q447P423N606L228J190k59j726l445m848n527n734n602m831l464
$$ 524095 532542 539965 545571 548799 549989 549730 548004 544559 539711 534184 528450 522848 518017 514553
55635E14553k230j594j197o54k53l71q63j573k887n070p554r522j0932j2187j3134
$$ 514553 512323 510729 509532 508878 508625 508254 507391 505818 502931 497861 490307 480785 469853 457666 444532
55620D44532j3148j2214j1219j0900j0990j0674r617q266p296o942o931o850o495
$$ 444532 431384 419170 407951 397051 386061 375387 365770 357504 350208 343266 336335 329485 322990
55607C22990n831m871l825l153l134l453l574l484l588l861l712k889j949j471
$$ 322990 317159 312288 308463 305310 302176 298723 295149 291665 288077 284216 280504 277615 275666 274195
55593B74195j343j186j045j161j447j613j634j519r75J94J493K140K006J616J322
$$ 274195 272852 271666 270621 269460 268013 266400 264766 263247 262272 262466 263959 266099 268105 269721 271043
55578B71043J034P91J014J897L010L779M120M359M694M946M833M303L598K947
$$ 271043 272077 272868 273882 275779 278789 282568 286688 291047 295741 300687 305520 309823 313421 316368
55564C16368K302J480N54j70n82q62j007o79J33O85J90j225k750l857m506m528
$$ 316368 318670 320150 320704 320534 319952 319090 318083 317404 317537 318222 318412 317187 314437 310580 306074 301546
55548C01546l670k372j784k597m198n360n476m764l709k715k144k155k494k692
$$ 301546 297876 295504 293720 291123 286925 281565 276089 271325 267616 264901 262757 260602 258108 255416
55534B55416k604k493k572k705k613k227j686j116n04J65Q56J540K220K809L140
$$ 255416 252812 250319 247747 245042 242429 240202 238516 237400 236896 237061 237917 239457 241677 244486 247626
55519B47626L192L237L565M072M427M643N128O057O978P383P388P440P486O929
$$ 247626 250818 254055 257620 261692 266119 270762 275890 281947 288925 296308 303696 311136 318622 325551
55505C25551N492L655J952K36j980m550o669p898q751r863j0928j1064j0162r203
$$ 325551 331043 334698 336650 336886 334906 330356 323687 315789 307038 297175 286247 275183 265021 255818
55491B55818q908q769p957o672n741n207m302k880j882k018k762l173l041k725
$$ 255818 246910 238141 230184 223512 217771 212564 208262 205382 203500 201482 198720 195547 192506 189781
55477A89781k413k131k037k168k228k129k245k643k646j778p08l96p66j010q20
$$ 189781 187368 185237 183200 181032 178804 176675 174430 171787 169141 167363 166655 166259 165493 164483 163663
55462A63663m68k2M90M58n77j723j527m5J086Q83K6o53j336k209k562j896r67
$$ 163663 163195 163173 163663 164121 163544 161821 160294 160249 161335 162218 162244 161591 160255 158046 155484 153588 152621
55445A52621o83o99j91N72O60O8k74jK24j00o43q86p62m49j04Ll83r97j178o91
$$ 152621 151938 151239 151048 151620 152280 152348 152074 152073 152297 152197 151554 150668 149906 149457 149353 149356 148973 147976 146798 146107
55425A46107r4j3l77o09l79J18M86N58N19O05P91Q25N87K36p3m15q46j215j380
$$ 146107 146013 146000 145623 145014 144635 144753 145239 145797 146316 146921 147712 148537 149124 149360 149287 148872 148026 146811 145431
55406A45431j419j427j328j085q80q07o44k03L03N48N84O25N54P8p59j572k085
$$ 145431 144012 142585 141257 140172 139292 138485 137841 137638 137941 138489 139073 139698 140252 140330 139571 137999 135914
55389A35914k213j869j100l23Q4L50R96J906K279J641M39n58j035j130j065j060
$$ 135914 133701 131832 130732 130409 130493 130843 131839 133745 136024 137665 138104 137546 136511 135381 134316 133256
55373A33256j314j743j940j679j254j080j108r36m02J88M58L50R2o9J5L58P82
$$ 133256 131942 130199 128259 126580 125326 124246 123138 122202 121800 121988 122446 122796 122888 122819 122834 123192 123974
55356A23974R62O71O6m02m69l30l55o17q81r93r71p89l80Q8K91K40L15O40Q03
$$ 123974 124936 125607 125673 125271 124802 124472 124117 123500 122619 121626 120655 119866 119486 119574 119865 120105 120420 121060 121863
55337A21863M26k79r04j399j841j904j164J68J257J528J146O52M10M82P01Q00
$$ 121863 122289 122010 121106 119707 117866 115962 114798 114966 116223 117751 118897 119549 119959 120441 121142 121942
55321A21942N81K8p54j583k135k116j649j156p18L1J036J486R06M8o5L76L90j16
$$ 121942 122523 122551 121797 120214 118079 115963 114314 113158 112440 112471 113507 114993 115899 115947 115882 116258 116648 116532
55303A16532j67O78J533J447N93k28o66q81r90r77q67o47k80J3j18n29n37J91
$$ 116532 116365 117043 118576 120023 120616 120388 119722 118841 117851 116874 116007 115360 115080 115093 114975 114446 113909 114100
55285A14100J120J493J115K72o69j294j247o93k40p8K30Q09R42J30r41j239q31
$$ 114100 115220 116713 117828 118100 117431 116137 114890 114197 113957 113879 114109 114918 115860 115990 115049 113810 112979
55268A12979o22q86r67m63J40K17j91n95o19k11M00P56N35m2m29m28l79o50j198
$$ 112979 112357 111471 110504 110041 110181 110398 110207 109612 108993 108782 109182 109938 110473 110431 110002 109574 109195 108545 107347
55249A07347j726j925j575p07K25N86J39p04j240r89OJ169J814J759J470J347
$$ 107347 105621 103696 102121 101414 101639 102225 102364 101660 100420 99431 99437 100606 102420 104179 105649 106996
55233A06996J164N23l45q14p16l90N8Q04J517J301r1j562j845j017k66k86n29
$$ 106996 108160 108683 108338 107524 106808 106418 106476 107280 108797 110098 110007 108445 106600 105583 105317 105031 104502
55216A04502j92O04R95N52k06n37m30m78r11j241r90m36j72k35j58K76Q30J322
$$ 104502 104310 104914 105909 106461 106255 105718 105288 104810 103899 102658 101668 101232 101060 100825 100667 100943 101773 103095
55198A03095J749J851J178j49j228j286n10L29P18O15J60l94o65n03k49l25o94
$$ 103095 104844 106695 107873 107724 106496 105210 104700 105029 105747 106362 106522 106128 105463 104960 104711 104386 103692
55181A03692j003j123j136r30k45P93J573J543P88j03n37l72P5M27O84J083J521
$$ 103692 102689 101566 100430 99500 99255 100048 101621 103164 103952 103849 103312 102940 103015 103442 104126 105209 106730
55164A06730J416M73p04j162o88K3K43j00n57n79O6R25R59l77k135k647j526k09
$$ 106730 108146 108619 107915 106753 106065 106088 106331 106231 105674 105095 105161 106086 107045 106668 104533 101886 100360 100151
55146A00151j07q88j252p95j67K76P80J206Q30l48j146o69M04P96L87Q4K82M37
$$ 100151 100044 99156 97904 97109 96942 97218 97998 99204 100034 99686 98540 97871 98275 99071 99458 99542 99824 100261
55128A00261J78p3P7L64M26M33O75R50Q55L96p3k96j54M33J194J412O83l41n84
$$ 100261 100439 100366 100443 100807 101233 101666 102341 103291 104146 104542 104469 104173 104019 104452 105646 107058 107741 107400 106816
55109A06816J45R91J230R47N09J6l92l07L93J063R86L15j46m1J76L2k88k85J70
$$ 106816 106961 107952 109182 110129 110638 110654 110262 109955 110348 111411 112397 112712 112566 112525 112701 112733 112445 112160 112330
55090A12330P52J079R50K74q18j769j872r93J24N70K04l93p93j123j450j316l36
$$ 112330 113082 114161 115111 115385 114567 112798 110926 109933 110057 110627 110831 110438 109645 108522 107072 105756 105420
55073A05420J022J785J526O56k58r38j170p51O9N36K16m86q64p76n72m36k19J22
$$ 105420 106442 108227 109753 110409 110151 109213 108043 107292 107361 107897 108113 107627 106763 105987 105415 104979 104760 104882
55055A04882L05K9o49j295j415q79j13L36M74P61J262J374P14j15k26L72Q97R08
$$ 104882 105187 105216 104567 103272 101857 100978 100865 101201 101675 102436 103698 105072 105786 105671 105445 105817 106714 107622
55037A07622O71M96L68L88Q17J497J766J326O90L78J68l17p92o86j17K01J0j92
$$ 107622 108293 108789 109157 109545 110362 111859 113625 114951 115641 116019 116187 115870 115078 114392 114275 114476 114486 114294
55019A14294L2M58O62N31J06o98j759k461k209j181j70K95L89M72N89O07N93O72
$$ 114294 114326 114784 115446 115977 116083 115385 113626 111165 108956 107775 107605 107900 108289 108761 109350 109957 110550 111222
55001A11222O84K83m87j011p21J89Q39N51m56j274j185k36R44J792K157K187K027
$$ 111222 111906 112189 111702 110691 109970 110159 110998 111549 111093 109819 108634 108398 109342 111134 113291 115478 117505
54984A17505J722J286P62K36j74l94m97o54q44p65k40M25P30O65P81J440K319
$$ 117505 119227 120513 121275 121511 121337 120943 120446 119792 118948 118183 117943 118368 119098 119763 120544 121984 124303
54967A24303K870L035L151L332L346L167L221L917N075O084O526O538O644P306
$$ 124303 127173 130208 133359 136691 140037 143204 146425 150342 155417 161501 168027 174565 181209 188515
54953A88515Q557R921J0646J0178Q486O016L347Q33j486l744o032q253j0033j0835
$$ 188515 197072 206993 217639 227817 236303 242319 245666 246499 245013 241269 235237 226984 216951 206116
54939B06116j0372r095q049p823p700o393l813j550j091k011k617k126j395j420
$$ 206116 195744 186649 178600 170777 163077 156684 152871 151321 150230 148219 145602 143476 142081 140661
54925A40661j952k034j332l06O01J371K149L008L975M966N673N864N763N886O509
$$ 140661 138709 136675 135343 135037 135638 137009 139158 142166 146141 151107 156780 162644 168407 174293 180802
54910A80802P482Q445R015Q808P659N820L712J445j137l953o564q589r909j0433
$$ 180802 188284 196729 205744 214552 222211 228031 231743 233188 232051 228098 221534 212945 203036 192603
54896A92603j0082r138q238p695p165o264n183m329l699l088k678k787l070k689
$$ 192603 182521 173383 165145 157450 150285 144021 138838 134509 130810 127722 125044 122257 119187 116498
54882A16498j492l50n3l07l03J68O97J013J151J012M26l76q76r64j007j144j062
$$ 116498 115006 114656 114603 114296 113993 114161 114858 115871 117022 118034 118460 118084 117208 116244 115237 114093 113031
54865A13031o66m25o76j072j104q11n77n14m75m33m07k83j08l48j299k458k968
$$ 113031 112365 111940 111264 110192 109088 108277 107700 107186 106711 106278 105871 105588 105480 105132 103833 101375 98407
54848I8407k624j906j211n99k14k28l33l1M96M87j97p17m52J26K42m9j44J85O87
$$ 98407 95783 93877 92666 92067 91853 91625 91292 91261 91757 92244 92047 91330 90878 91004 91246 91197 91053 91238 91925
54829I1925J133J401J301Q65O15J009J749K101J812J268Q86P49P64Q26Q47R12
$$ 91925 93058 94459 95760 96625 97240 98249 99998 102099 103911 105179 106065 106814 107578 108404 109251 110163
54813A10163J267J911K473K770L120L729M146L979L766M370N702O829P320P692
$$ 110163 111430 113341 115814 118584 121704 125433 129579 133558 137324 141694 147396 154225 161545 169237
54799A69237Q452R396J0057J0130R386P764N680L672J581j114m097o194o921p166
$$ 169237 177689 187085 197142 207272 216658 224422 230102 233774 235355 234241 230144 223950 217029 209863
54785B09863p808q464q273p268o112m972l562k054j040o66m84j88J12L42O85J253
$$ 209863 202055 193591 185318 178050 171938 166966 163404 161350 160310 159644 159160 158972 159084 159426 160111 161364
54769A61364J963K761L609M315M693M829M813M492L860L465L815M524M755M468
$$ 161364 163327 166088 169697 174012 178705 183534 188347 192839 196699 200164 203979 208503 213258 217726
54755B17726M456N049N549N285M482L518J941r67m834q166r810j0074j0096j0464
$$ 217726 222182 227231 232780 238065 242547 246065 248006 247039 242205 234039 224229 214155 204059 193595
54741A93595j0742j0251r009p661o657n833m878l889l156k641k091j575j465j787
$$ 193595 182853 172602 163593 155932 149275 143442 138564 134675 131519 128878 126787 125212 123747 121960
54727A21960k023j811j471j557k022k212j675p26r1q8l45l69k35m48j093j510
$$ 121960 119937 118126 116655 115098 113076 110864 109189 108463 108372 108284 107939 107570 107335 106887 105794 104284
54711A04284j065k3P58Q51N54K55pk26j77K20O11O02K61j6j9J31K42K55K13J49
$$ 104284 103219 103196 103954 104805 105359 105614 105607 105381 105204 105424 106035 106637 106898 106882 106863 106994 107236 107491 107704 107853
54691A07853M0j69l97l28K88J219J838J807J441J289J502J781J785J405Q11L51
$$ 107853 107893 107724 107327 106999 107287 108506 110344 112151 113592 114881 116383 118164 119949 121354 122165 122516
54675A22516L52Q24J439J860K005J923J600J080O51P16J404K413L219L495L410
$$ 122516 122868 123692 125131 126991 128996 130919 132519 133599 134250 134966 136370 138783 142002 145497 148907
54660A48907L475L988M681N096N158N158N183N028M699M519M510M127K893J009
$$ 148907 152382 156370 161051 166147 171305 176463 181646 186674 191373 195892 200402 204529 207422 208431
54646B08431r83k840m496n651o008n783n550n522n408m977m406l966l733l615
$$ 208431 207448 204608 200112 194461 188453 182670 177120 171598 166190 161213 156807 152841 149108 145493
54632A45493l475l168k713k429k574k875k719j934j088q63j312j868j971j560
$$ 145493 142018 138850 136137 133708 131134 128259 125540 123606 122518 121655 120343 118475 116504 114944
54618A14944j042p72o38k56L45N84J06o00p94n33m89p59o56P5N91R2r36j377j106
$$ 114944 113902 113130 112492 112236 112581 113165 113271 112671 111877 111344 110855 110096 109440 109515 110106 110198 109262 107885 106779
54599A06779j065j665j984j097M42J131M65m59m64J61K33n28j076n07P42J556
$$ 106779 105714 104049 102065 100968 101410 102541 103006 102547 102083 102244 102477 101949 100873 100366 101108 102664
54583A02664J519J030M27k95r29j042o38k24j5L34Q43P89k72j540j782r28r1o1
$$ 102664 104183 105213 105640 105345 104416 103374 102736 102512 102497 102831 103674 104463 104191 102651 100869 99941 99850 99789
54565I9789m64n07j3N94Q93P53K83k27m39k39J80N84R31J277J624J923K086K003
$$ 99789 99325 98818 98805 99399 100292 101045 101328 101101 100662 100423 100603 101187 102118 103395 105019 106942 109028 111031
54547A11031J714J537J791K409K997L347L549L549K997J827O08n1k51o19j469
$$ 111031 112745 114282 116073 118482 121479 124826 128375 131924 134921 136748 137356 137305 137054 136435 134966
54532A34966k511l367l927m168m011l540l116k944k729k075j122n24o47j114j311
$$ 134966 132455 129088 125161 120993 116982 113442 110326 107382 104653 102578 101456 100932 100285 99171 97860
54517I7860j151r93q94m06O56J641J663P62r2j60K33K70l06j005j218p60R4Q14
$$ 97860 96709 95716 94822 94416 95072 96713 98376 99138 99046 98886 99119 99389 99083 98078 96860 96100 96194 97008
54499I7008R36M37j90m97n56o45o15n9R06J538J416J002R35J127R82L73j37q3
$$ 97008 97944 98381 98191 97694 97138 96493 95878 95819 96725 98263 99679 100681 101616 102743 103725 104098 103961 103878
54481A03878K50K46k67q41j033q57n91l12N9L39J16n73r26k67R47J545J113M32
$$ 103878 104128 104374 104107 103266 102233 101376 100785 100473 100532 100871 100987 100414 99488 99221 100168 101713 102826 103258
54463A03258K72M02K96J48M03P09K69p85j359r68m21n33q81o07J28L71j11n13
$$ 103258 103530 103932 104228 104376 104779 105488 105757 104972 103613 102645 102224 101691 100810 100203 100331 100702 100591 100078
54445A00078k89lm47j379j707q45N49J297R74K61L4L57N59K13l04m02o5K98N15
$$ 100078 99789 99786 99339 97960 96253 95408 95957 97254 98228 98489 98523 98880 99439 99652 99348 98946 98881 99179 99694
54426I9694P38R75J062J104J399J800J690Q49q9m43l12j62J6N28J211J523J431
$$ 99694 100432 101407 102469 103573 104972 106772 108462 109311 109222 108779 108467 108305 108321 108849 110060 111583 113014
54409A13014J451J726J645Q06k42o53l58J9R7O6J53K61J70k20q90j602j857j255
$$ 113014 114465 116191 117836 118642 118400 117747 117389 117408 117505 117571 117724 117985 118155 117935 117045 115443 113586 112331
54391A12331j06P15O51O1k96j54P9j03p52j465j790j603j148p40m98l62k66k03
$$ 112331 112225 112940 113591 113652 113356 113202 113281 113178 112426 110961 109171 107568 106420 105680 105182 104820 104554 104351
54373A04351j20K7K04L41M18L92K09Q2M38J296J870J419L75l6O27J535J844J641
$$ 104351 104231 104258 104462 104803 105221 105613 105822 105904 106342 107638 109508 110927 111302 111266 111893 113428 115272 116913
54355A16913J290O36l87j097q85k67k13o94q29l28K06L72L83K95j64p96r50p05
$$ 116913 118203 118839 118452 117355 116470 116203 115990 115296 114467 114139 114345 114717 115100 115395 115231 114435 113485 112780
54337A12780r87j998k554j736l83M0o01j262j399j341j256q62k16J24m3k87l55
$$ 112780 111793 109795 107241 105505 105122 105162 104561 103299 101900 100559 99303 98441 98225 98349 98306 98019 97664
54320I7664n66j094j557j555j211q94q12r87j263j196m63N20R15O01L79P13R00
$$ 97664 97098 96004 94447 92892 91681 90787 89975 88988 87725 86529 86066 86586 87501 88102 88481 89194 90094
54303I0094M2j587k750k583j289L31J557K082K113K097K118J745P37m03j002j102
$$ 90094 90136 88549 85799 83216 81927 82258 83815 85897 88010 90107 92225 93970 94707 94304 93302 92200
54287I2200j219j421j264n98J19M42L69R2k25k93J02O46P32M02M07J031J520J204
$$ 92200 90981 89560 88296 87698 87817 88259 88628 88720 88495 88202 88304 88950 89682 90084 90491 91522 93042 94246
54269I4246N84N14P55L54o58j095l70N59N66n5j85M29R49P75L34L62R11J372J189
$$ 94246 94830 95344 96099 96453 95795 94700 94330 94889 95455 95400 95215 95644 96593 97368 97702 98064 98975 100347 101536
54250A01536L37p14j379j386r49m98l22m71q35j116r57l31L09N59O01Q37J143
$$ 101536 101873 101159 99780 98394 97445 96947 96625 96154 95319 94203 93246 92915 93224 93783 94384 95221 96364
54233I6364R50J55o07p55m14p6P8J76K51J66j49n32o57k97L28N28j30j066j166
$$ 96364 97314 97469 96862 96107 95693 95617 95695 95871 96122 96288 96139 95607 94950 94653 94981 95509 95379 94313 93147
54214I3147j62R27J040L08l68n48n14n50n80m75k73k3L41Q05J220J407J242P41
$$ 93147 92985 93912 94952 95260 94892 94344 93830 93280 92700 92225 91952 91929 92270 93075 94295 95702 96944 97685
54196I7685J61j83k98m84p89q70o32n52r66j423j253n33P0J66j11n45r42j000
$$ 97685 97846 97663 97365 96881 96092 95222 94590 94038 93072 91649 90396 89863 89933 90099 89988 89443 88501 87501
54178H7501o22l14o41j370j709j334o21K4M74N49J41l50l25J34L41P4j92j44l5
$$ 87501 86879 86565 85924 84554 82845 81511 80890 80914 81388 81937 82078 81728 81403 81537 81878 81952 81760 81616 81581
54159H1581K0L46R78J285Q26o3p65j038q23p9P97R91K11r23j697k005j919j277
$$ 81581 81601 81947 82925 84210 85036 84973 84208 83170 82347 82268 83065 84056 84267 83344 81647 79642 77723 76446
54141G6446k00O35Q75R79J297J306N55l72o68n51p21j031q04k30k49j023j570
$$ 76446 76246 76881 77756 78735 80032 81338 81893 81521 80853 80302 79581 78550 77746 77516 77267 76244 74674
54124G4674j065K32J528K224K059J199L27j4j62p64j524j426k63R41J362J286
$$ 74674 73609 73841 75369 77593 79652 80851 81178 81164 81002 80238 78714 77288 77025 77966 79328 80614
54108H0614J212R31J41p06r00m91j25j40l62n56o29m60K1N93Q70O71J89j09J86
$$ 80614 81826 82757 82898 82192 81292 80801 80676 80536 80174 79618 78989 78529 78550 79143 80013 80684 80873 80764 80950
54089H0950J017J711J632R51L95J74j99q96j267p89L0L36R2o8R4K73L92P62J344
$$ 80950 81967 83678 85310 86261 86656 86830 86631 85735 84468 83679 83709 84045 84137 84069 84163 84436 84828 85590 86934
54070H6934J586J213P36O84Q32O19Q5r5L82J028J214J005R12J078J086O16q5n07
$$ 86934 88520 89733 90469 91153 91985 92604 92689 92594 92976 94004 95218 96223 97135 98213 99299 99915 99830 99323
54052I9323l77K37J049J643J683J297R92J095J463J888K390K811K703K024J561
$$ 99323 98946 99183 100232 101875 103558 104855 105847 106942 108405 110293 112683 115494 118197 120221 121782
54037A21782K005K904L267K950K674K842L168L494L936M163L499K202J554K166
$$ 121782 123787 126691 129958 132908 135582 138424 141592 145086 149022 153185 156684 158886 160440 162606
54023A62606K937K531J163J27l6J02j9k33k02P5L21K62k77j152j859k046j946
$$ 162606 165543 168074 169237 169364 169328 169430 169411 169178 168976 169051 169372 169634 169357 168205 166346 164300 162354
54006A62354k083k589l134l329k995k228j507j464k186k931k940k314j755j663
$$ 162354 160271 157682 154548 151219 148224 145996 144489 143025 140839 137908 134968 132654 130899 129236
53992A29236j932k373k830k970k537j763j104o52j74L05N02L71J96K02L89O99
$$ 129236 127304 124931 122101 119131 116594 114831 113727 113075 112901 113206 113708 114079 114275 114477 114866 115565
53976A15565R57P84P5o07o27j87rk39l40j23n0l42n38k97k8j87n09m55m6L49P16
$$ 115565 116522 117306 117381 116774 116147 115960 115951 115712 115372 115249 115199 114857 114319 114022 113994 113807 113298 112843 112797 113146 113862
53955A13862J292J923K109J760J435J618K104K319K109J958K383L260L967M165
$$ 113862 115154 117077 119186 120946 122381 123999 126103 128422 130531 132489 134872 138132 142099 146264
53941A46264M187M455M782M690M235L992M170M259L778K922K212J815J569J406
$$ 146264 150451 154906 159688 164378 168613 172605 176775 181034 184812 187734 189946 191761 193330 194736
53927A94736J385J387J188Q55P64J174J880K375K309J822J370J313J665K272L031
$$ 194736 196121 197508 198696 199551 200315 201489 203369 205744 208053 209875 211245 212558 214223 216495 219526
53912B19526L767M163M012L460K740J943J292J236J755J933J012l69q87m71m02
$$ 219526 223293 227456 231468 234928 237668 239611 240903 242139 243894 245827 246839 246470 245583 245112 244710
53897B44710j264k037j841j433j981l186l857l810l915m437m628m114l599l759
$$ 244710 243446 241409 239568 238135 236154 232968 229111 225301 221386 216949 212321 208207 204608 200849
53883B00849m264m321l687k826k399k790l763m486m317l549k959k705k316j780
$$ 200849 196585 192264 188577 185751 183352 180562 176799 172313 167996 164447 161488 158783 156467 154687
53869A54687j763k515l324l484l142k725k231j634j398j875k562k680k195j621
$$ 154687 152924 150409 147085 143601 140459 137734 135503 133869 132471 130596 128034 125354 123159 121538
53855A21538j091l72L86O77M58K26J82j1n30j021j197j229j259j025l77K12J20
$$ 121538 120447 120075 120461 121138 121596 121822 122004 121993 121463 120442 119245 118016 116757 115732 115355 115567 115687
53838A15687n42j024q18j97J70m9n80q54o23j71K9j04k51j45J81O10J046J313
$$ 115687 115145 114121 113303 113106 113276 113227 112647 111793 111170 110999 111028 110924 110673 110528 110709 111319 112365 113678
53820A13678J226J018J238K013K630K331J358P23R16J353J244O33K16M21J050
$$ 113678 114904 115922 117160 119173 121803 124134 125492 126215 127131 128484 129728 130361 130577 130998 132048
53805A32048J730K317K734K805K555K393K658L058K949K275J761J964K515K660
$$ 132048 133778 136095 138829 141634 144189 146582 149240 152298 155247 157522 159283 161247 163762 166422
53791A66422K277J864J728J674J480J131N97j79q87j083r03r86j437j565j077
$$ 166422 168699 170563 172291 173965 175445 176576 177173 176994 176107 175024 174121 173135 171698 170133 169056
53776A69056q19j587k797l239k791k398k492k517k145j915k221k536k270j718
$$ 169056 168237 166650 163853 160614 157823 155425 152933 150416 148271 146356 144135 141599 139329 137611
53762A37611j556j842k146k335k593k865k892k607k125j485q66p87j473k206j949
$$ 137611 136055 134213 132067 129732 127139 124274 121382 118775 116650 115165 114299 113512 112039 109833 107884
53747A07884p09L34K54o10j248j165o39j47Q7J06J11K78N69P04M57m0l71k13L74
$$ 107884 107175 107509 107763 107153 105905 104740 104101 103954 104041 104147 104258 104536 105105 105809 106266 106226 105855 105642 106016
53728A06016R70J136P98L25J88N25J081J511J649J530J232P50Jr85j871k209j882
$$ 106016 106986 108122 108920 109245 109433 109958 111039 112550 114199 115729 116961 117711 117712 116727 114856 112647 110765
53711A10765j258p15k71J99N42M93J51k5K50Q26J403J798J915J716J372J214J413
$$ 110765 109507 108792 108521 108720 109262 109755 109906 109881 110131 110957 112360 114158 116073 117789 119161 120375 121788
53694A21788J785K031K011J762J369R19N56M08M97O48O09L43J65M40J086J574
$$ 121788 123573 125604 127615 129377 130746 131665 132221 132629 133126 133774 134383 134726 134891 135331 136417 137991
53678A37991J556J260J105J165J199J056P15K11k08j31M26P32J83p80j119n15
$$ 137991 139547 140807 141912 143077 144276 145332 146047 146258 146050 145919 146345 147077 147260 146480 145361 144846
53662A44846L73Q98J053J014P63M12L32O12Q25O39J96k74p56j060o76M82J591
$$ 144846 145219 146117 147170 148184 148947 149359 149691 150303 151128 151767 151963 151689 150933 149873 149197 149679 151270
53645A51270J667O68n85j303j243n71L26R57J059Q07N27L51K45K36L82P40J351
$$ 151270 152937 153605 153020 151717 150474 149903 150229 151186 152245 153052 153579 153930 154175 154411 154793 155533 156884
53628A56884K001K060J072m15j184p70P3N60P98J080J116O57K37L78O83N85N08
$$ 156884 158885 160945 162017 161602 160418 159648 159721 160281 161079 162159 163275 163932 164169 164547 165230 165815 166323
53611A66323J138J995J973J122O33R66J308J132R48J093R95M05J93J073K324K788
$$ 166323 167461 169456 171429 172551 173184 174150 175458 176590 177538 178631 179626 180031 180224 181297 183621 186409
53595A86409K507K397K723K967K970L117L393L141K050P78K59P14J550K056K019
$$ 186409 188916 191313 194036 197003 199973 203090 206483 209624 211674 212452 212711 213425 214975 217031 219050
53580B19050J808J825J935J600P44P9K70J021J371Q25j98r19r20m03K2j61q37
$$ 219050 220858 222683 224618 226218 226962 227041 227311 228332 229703 230528 230330 229411 228491 228088 228110 227949 227112
53563B27112j357j289q62m07J95J074J678J264Kj018j091o57n14p40p71l27J41
$$ 227112 225755 224466 223604 223197 223392 224466 226144 227408 227410 226392 225301 224644 224130 223390 222619 222292 222433
53546B22433Rp42j393j151M4J449K225K113J402N74J25M16J302K072K146J727
$$ 222433 222442 221700 220307 219156 219200 220649 222874 224987 226389 226963 227088 227504 228806 230878 233024 234751
53530B34751J438J438J426J334J508K049K576K809K944L191L392L398L494M024
$$ 234751 236189 237627 239053 240387 241895 243944 246520 249329 252273 255464 258856 262254 265748 269772
53516B69772M793N225N005M422M073M446N533O700P185O922O665P009P669Q121
$$ 269772 274565 279790 284795 289217 293290 297736 303269 309969 317154 324076 330741 337750 345419 353540
53502C53540Q583R649J1034J1604J0915J0021J0226J1505J2832J3640J4189J4631
$$ 353540 362123 371772 382806 394410 405325 415346 425572 437077 449909 463549 477738 492369
53490D92369J4639J4207J4075J4749J5618J5675J4890J4209J4265J4680J4746
$$ 492369 507008 521215 535290 550039 565657 581332 596222 610431 624696 639376 654122
53479F54122J4245J3472J2847J2711J3159J3810J4040J3691J3235J3064J2914
$$ 654122 668367 681839 694686 707397 720556 734366 748406 762097 775332 788396 801310
53468H01310J2331J1408J0687J0481J0610J0751J0736J0569J0322R979R293Q059
$$ 801310 813641 825049 835736 846217 856827 867578 878314 888883 899205 909184 918477 926536
53456I26536O613N637N219M564K989Q81r18k227l373m279m579m576n113o321p342
$$ 926536 933149 938786 944005 948569 951558 952439 951521 949294 945921 941642 937063 932487 927374 921053 913711
53441I13711p607p580p924q558r079r473r868j0115j0122j0208j0560j0739j0369
$$ 913711 906104 898524 890600 882042 872963 863490 853622 843507 833385 823177 812617 801878 791509
53428G91509r856r790r891r377q229p340p241p390o910n570l819k277j395j216
$$ 791509 781653 771863 761972 752595 744366 737026 729785 722395 715485 709915 706096 703819 702424 701208
53414G01208j292r87m3J241K472L542M547N522O289O539O161N685O096P777R840
$$ 701208 699916 698929 698886 700127 702599 706141 710688 716210 722499 729038 735199 740884 746980 754757 764597
53399G64597J1040J1285J1662J2875J4394J5379J5851J6379J7120J7808J8420
$$ 764597 775637 786922 798584 811459 825853 841232 857083 873462 890582 908390 926810
53388I26810J9257K0376K1521K2722K4343K6314K7806K8144K7800K8006K9288
$$ 926810 946067 966443 987964 1010686 1035029 1061343 1089149 1117293 1145093 1173099 1202387
53377A202387L0884L1693L1490L0903L0482L0244L0051K9916K9774K9310K8296
$$ 1202387 1233271 1264964 1296454 1327357 1357839 1388083 1418134 1448050 1477824 1507134 1535430
53366A535430K6876K5323K3805K2514K1639K0947J9730J7647J5288J3443J2028
$$ 1535430 1562306 1587629 1611434 1633948 1655587 1676534 1696264 1713911 1729199 1742642 1754670
53355A754670J0317Q071N787L712J377j734n569r764j4020j7955k1065k3193k4715
$$ 1754670 1764987 1773058 1778845 1782557 1783934 1782200 1776631 1766867 1752847 1734892 1713827 1690634 1665919
53342A665919k5979k6892k7297k7392k7500k7695k7935k8151k7998k6979k5230
$$ 1665919 1639940 1613048 1585751 1558359 1530859 1503164 1475229 1447078 1419080 1392101 1366871
53331A366871k3741k3371k3896k4518k4933k5308k5496k5077k4081k3047k2211
$$ 1366871 1343130 1319759 1295863 1271345 1246412 1221104 1195608 1170531 1146450 1123403 1101192
53320A101192k1195j9683j7976j6703j6153j6021j5612j4380j2519j0866j0021
$$ 1101192 1079997 1060314 1042338 1025635 1009482 993461 977849 963469 950950 940084 930063
53309I30063r711r432r336r860j0666j0824j0130r398r147q826p784o389n495
$$ 930063 920352 910920 901584 891724 881058 870234 860104 850706 841559 832733 824949 818560 813065
53296H13065n227n027m554l951l317k552j706r15J3J432L138M359M696M689N110
$$ 813065 807838 802811 798257 794306 790989 788437 786731 785816 785829 787261 790399 794758 799454 804143 809253
53281H09253O013O836P317P832Q792J0022J1001J1516J1834J2198J2516J2566
$$ 809253 815266 822102 829419 837251 846043 856065 867066 878582 890416 902614 915130 927696
53269I27696J2356J2006J1439J0471R237Q243P832P788P595O942N867M478K774
$$ 927696 940052 952058 963497 973968 983205 991448 999280 1007068 1014663 1021605 1027472 1031950 1034724
53256A034724P70j364l349m970o165o996p626q348r509j1212j3097j4565j5309
$$ 1034724 1035494 1034130 1030781 1025811 1019646 1012650 1005024 996676 987167 975955 962858 948293 932984
53243I32984j5520j5609j5870j6437j7192j7629j7197j6054j5127j5017j5256
$$ 932984 917464 901855 885985 869548 852356 834727 817530 801476 786349 771332 756076
53232G56076j5038j4416j4012j3880j3469j2747j2472j3072j3951j4284j3947
$$ 756076 741038 726622 712610 698730 685261 672514 660042 646970 633019 618735 604788
53221F04788j3333j2761j2428j2398j2320j1618j0397r549r529r592q810p332
$$ 604788 591455 578694 566266 553868 541548 529930 519533 509984 500455 490863 482053 474721
53209D74721n995n141m592m389m747n482o252p178q401r342r279q586q376q836
$$ 474721 468726 463585 458993 454604 449857 444375 438123 430945 422544 413202 403923 395337 386961 378125
53195C78125q999q385p832q130q745q587p528o410n875n862o000o001n731n299
$$ 378125 369126 360741 352909 344779 336034 327447 319919 313509 307634 301772 295772 289771 284040 278741
53181B78741n008n029n233n464n736o055o289o397o359n939m908l672l121l453
$$ 278741 273733 268704 263471 258007 252271 246216 239927 233530 227171 221232 216324 212652 209531 206078
53167B06078l757l253k430k317k976l490l277k682k229j966j712j473j317j159
$$ 206078 202321 199068 196638 194321 191345 187855 184578 181896 179667 177701 175989 174516 173199 172040
53153A72040r32p95r64j380j681j470p04J88N97K86m27j051j382j544j750k067
$$ 172040 171108 170313 169349 167969 166288 164818 164114 164302 164899 165185 164758 163707 162325 160781 159031 156964
53137A56964k295k056j300n70m21n83l10L98O66O7o87q68p84r61j036l81N89Q54
$$ 156964 154669 152613 151313 150743 150322 149739 149429 149827 150493 150560 149873 149005 148221 147260 146224 145843 146432 147286
53119A47286K98k66m33n63p68o60l31n09j362j952j487l89L52L07k79r46j178
$$ 147286 147584 147318 146885 146322 145554 144894 144563 144054 142692 140740 139253 138864 139216 139523 139244 138298 137120
53102A37120o73J75N51K99R8K56J32o82j453j310n37k3M6M3q4o27j244j257p27
$$ 137120 136447 136622 137173 137472 137570 137826 137958 137276 135823 134513 133976 133953 133999 134042 133958 133331 132087 130830 130103
53083A30103l37k56l1M45P53Q19R81J096N32o41j408j178n75l43k57K22Q98J255
$$ 130103 129766 129510 129479 129924 130677 131496 132477 133573 134105 133464 132056 130878 130303 129960 129703 129925 130823 132078
53065A32078J415J808K199J886Q48p9k00L97J228J898K096J646Q30K52J50J38
$$ 132078 133493 135301 137500 139386 140234 140155 139955 140352 141580 143478 145574 147220 148050 148302 148452 148590
53049A48590j46m16j05P82J530J478P35K7j39L6Mm16q44r13p12n46m62k82L1K55
$$ 148590 148444 148028 147923 148705 150235 151713 152448 152475 152336 152372 152376 151960 151116 150203 149491 148945 148483 148201 148232 148487
53029A48487K26j3l09m77k85L83J216J588J210N13J44J63L2n41j085q73J99J526
$$ 148487 148713 148700 148391 147914 147629 148012 149228 150816 152026 152539 152683 152846 152878 152337 151252 150379 150578 152104
53011A52104K473K779K384J322Nq08o78K1O14Q76R82R52O99N12P62J145Q98l5
$$ 152104 154577 157356 159740 161062 161067 160259 159581 159602 160216 161092 162074 163026 163725 164237 164999 166144 167042 167007
52993A67007p49o22k03k41m41N3J288K357K573K090J374P92O99J272J994J991
$$ 167007 166258 165636 165433 165192 164751 164804 166092 168449 171022 173112 174486 175278 175977 177249 179243 181234
52977A81234J104J30k98m44p64j015p19m6L56L00J84K58L14J75K0J15N04J060
$$ 181234 182338 182468 182170 181726 180962 179947 179228 179182 179538 179838 180022 180280 180594 180769 180789 180904 181408 182468
52959A82468J559J692J260M92j41m05m03k07J87N71O43N02N84Q70P07j59r16o72
$$ 182468 184027 185719 186979 187471 187330 186925 186522 186315 186502 187073 187716 188218 188802 189672 190379 190220 189304 188632
52941A88632K08N28o5o09k21P54J365J263Q18L70n2m67q64j280j607j420m95N98
$$ 188632 188840 189368 189303 188694 188473 189227 190592 191855 192673 193043 192991 192524 191660 190380 188773 187353 186858 187456
52923A87456R07J83q14j239j008n59k38j39k36k94R2R79J726J608P80K84Q72K037
$$ 187456 188363 188546 187732 186493 185485 184926 184688 184549 184313 184019 184111 185090 186816 188424 189204 189488 190360 192397
52905A92397K469J536L5o86k93K43m8q79j261r30o30r23j388j387j006p80q42
$$ 192397 194866 196402 196437 195751 195458 195701 195653 194774 193513 192583 191953 191030 189642 188255 187249 186469 185627
52888A85627r02q62r46j202j327j057m42K02M50M3o92r74m25L30L99k02n54j8
$$ 185627 184725 183863 182917 181715 180388 179331 178889 179091 179541 179584 178892 177918 177493 177823 178222 178020 177466 177448
52870A77448J104K020K137J285j52j325j618j409j596k351k958k997k918l084
$$ 177448 178552 180572 182709 183994 183842 182517 180899 179490 177894 175543 172585 169588 166670 163586
52856A63586k960j963o03j5n87j636k341k424j976j193m24r3l57j037j837k486
$$ 163586 160626 158663 158060 158045 157458 155822 153481 151057 149081 147888 147464 147371 147014 145977 144140 141654
52840A41654k701k282j329k54M58M92j20r01j264j103r23j187j693j815j232k34
$$ 141654 138953 136671 135342 135088 135546 136038 135918 135017 133753 132650 131727 130540 128847 127032 125800 125566
52824A25566O07Q96O99M68N44P08M82j40o44p73p88p68l02O58J301J007L63L15
$$ 125566 126173 127069 127768 128236 128780 129488 129970 129830 129186 128413 127625 126857 126555 127213 128514 129521 129884 130199
52806A30199P11N78k56q89o88l6M42O20O11M46L34N92J094J374J396J607K023
$$ 130199 130910 131488 131232 130343 129655 129619 130061 130681 131292 131738 132072 132664 133758 135132 136528 138135 140158
52789A40158K022J410R17J111J515J366P70L31J82L7j07lK30K26Qj2L19P24R47
$$ 140158 142180 143590 144507 145618 147133 148499 149269 149600 149782 149819 149712 149709 149939 150165 150173 150161 150480 151204 152151
52770A52151R44O56O7n72r01q74p83q44j055j360j634j597j069k94K32K45j54
$$ 152151 153095 153751 153818 153246 152345 151471 150688 149844 148789 147429 145795 144198 143129 142835 143067 143312 143158
52753A43158p21j152j114n44J90O60Q30Q74Q00O00N97J080J684J638P41l31q15
$$ 143158 142437 141285 140171 139627 139817 140477 141307 142181 142981 143581 144178 145258 146942 148580 149321 148990 148175
52736A48175n93j16J20j10n62o43O4J255K198K561K623K671K608K296J859J432
$$ 148175 147582 147466 147586 147476 146914 146271 146335 147590 149788 152349 154972 157643 160251 162547 164406 165838
52720A65838R37L72Q0L74J080J636J625J101N02K55M03N68M20P1j58k16k54j81
$$ 165838 166775 167147 167227 167601 168681 170317 171942 173043 173545 173800 174203 174771 175191 175262 175104 174888 174634 174453
52702A74453K09O79O79J44l39l98l43m41l19L69J096J065M20J37O75J438J693
$$ 174453 174662 175341 176020 176164 175825 175427 175084 174643 174324 174693 175789 176854 177274 177411 178086 179524 181217
52685A81217J460J151Q42L99k8o7K28K71l85j435k102j943j270p46p58j241j980
$$ 181217 182677 183828 184670 185069 185041 184974 185202 185473 185088 183653 181551 179608 178338 177592 176834 175593 173613
52668A73613k799l463l697l438k910k288j517n77J84L32j54q45j297j306q52o5
$$ 173613 170814 167351 163654 160216 157306 155018 153501 152924 153108 153440 153286 152441 151144 149838 148986 148921
52652A48921P41J174J067N48p0l70J2R83J801J758J050O22R37J360J068J61m69
$$ 148921 149662 150836 151903 152451 152381 152011 152023 153006 154807 156565 157615 158237 159174 160534 161602 161763 161294
52635A61294k43O36J585K090J796P57l24n40K01R75Q83N1p20r83j006j135j325
$$ 161294 161051 161687 163272 165362 167158 167915 167591 167051 167252 168227 169110 169161 168441 167458 166452 165317 163992
52618A63992j353j266j311j559j762j648j306j131j272j303o91M39J342J589J492
$$ 163992 162639 161373 160062 158503 156741 155093 153787 152656 151384 150081 149390 149829 151171 152760 154252
52603A54252J457J269N80k73n73k24J56J73P8R4l9n57j179j497j490j303r06l28
$$ 154252 155709 156978 157558 157285 156712 156488 156644 156817 156895 156989 156950 156393 155214 153717 152227 150924 150018 149690
52585A49690O3Jk33j90Q0J66q2m73r09j431j867j877j373n81K60R52J161O45l55
$$ 149690 149753 149754 149521 149331 149411 149577 149495 149022 148113 146682 144815 142938 141565 140984 141244 142196 143357 144002 143647
52566A43647j338k115k734k896k062m16R07J034M22K97J085J909J660L19j055
$$ 143647 142309 140194 137460 134564 132502 132086 132993 134027 134449 134746 135831 137740 139400 139719 138664
52551A38664j501j166r40j242j516j137l57P2N8J85O65R12M76j99l86m1K35M9
$$ 138664 137163 135997 135057 133815 132299 131162 130805 130877 130935 131120 131785 132697 133173 132974 132588 132547 132782 132831
52533A32831m56r27j115r88p47p41j045j284j082n87k46j47N7N65J050J043M67
$$ 132831 132375 131448 130333 129345 128598 127857 126812 125528 124446 123859 123613 123466 123523 124088 125138 126181 126648
52516A26648l17r07j175j203j010n08K08O69M42k97q07o68l08l97q67r40j49J000
$$ 126648 126331 125424 124249 123046 122036 121528 121736 122405 122847 122550 121743 121075 120767 120370 119503 118563 118414 119414
52498A19414J612J442J029Q40O48Mr60j636j765j665j547j131l38K66K17j3L24
$$ 119414 121026 122468 123497 124337 124985 124989 124029 122393 120628 118963 117416 116285 115947 116213 116430 116417 116741
52481A16741R81R55k3j096j458j178o14J40Q85J130Q16N80Q43J176J102Q37O47
$$ 116741 117722 118677 118654 117558 116100 114922 114308 114448 115333 116463 117279 117859 118702 119878 120980 121817 122464
52464A22464J99o83j231p10L04O87M16L25M77P9r29j524j194o74o57p55l90J73
$$ 122464 122663 121980 120749 120039 120343 121030 121446 121771 122248 122327 121398 119874 118680 118006 117349 116594 116204 116377
52446A16377L94L01J11l28r69j114l42O02Q02N39P39J345J429Q20M88R49J375
$$ 116377 116771 117072 117183 116855 115886 114772 114430 115032 115834 116373 117112 118457 119886 120706 121194 122143 123518
52429A23518Q12m75j456j618j161l94M27R31Q95O37O26P87O63K28k1J72M47M03
$$ 123518 124330 123855 122399 120781 119620 119226 119653 120584 121479 122116 122742 123529 124192 124420 124399 124571 125018 125421
52411A25421J46l7j23j41J78J008J863J911R22m19j268j326p86K4P30R77O86J51
$$ 125421 125567 125530 125407 125266 125444 126452 128315 130226 131148 130729 129461 128135 127349 127373 128103 129080 129766 129917
52393A29917k44k79J88J143K104K265J343L8p05p30n80n58l75K23R78J412J331
$$ 129917 129673 129394 129582 130725 132829 135094 136437 136475 135770 135040 134460 133902 133527 133750 134728 136140 137471
52376A37471R50P07R56J594K016J710Q93K56J18K33M23Q38J403J529Q47r4l22
$$ 137471 138421 139128 140084 141678 143694 145404 146297 146553 146671 146904 147327 148165 149568 151097 151944 151850 151528
52359A51528M14J374J737J445J043R42J032J022R32J041J346J410R75N14P62J747
$$ 151528 151942 153316 155053 156498 157541 158483 159515 160537 161469 162510 163856 165266 166241 166755 167517 169264
52343A69264K683K811K091R91L6l54KP69J346J509J616J949K309K491K743L277
$$ 169264 171947 174758 176849 177840 177876 177522 177524 178293 179639 181148 182764 184713 187022 189513 192256 195533
52327A95533L695L483K808K309K197K177K259K875M031M987N144M848M789N026
$$ 195533 199228 202711 205519 207828 210025 212202 214461 217336 221367 226354 231498 236346 241135 246161
52313B46161N180N365O104P221P633O752N601N694P059Q228Q291P981Q307Q894
$$ 246161 251341 256706 262810 270031 277664 284416 290017 295711 302770 310998 319289 327270 335577 344471
52299C44471Q706P915P797Q754R624R472R087R812J1508J2614J2134J0691R597
$$ 344471 353177 361092 368889 377643 387267 396739 405826 415638 427146 439760 451894 462585 472182
52286D72182R510J0220J1182J1859J1884J1286J0453R751R128Q276P143O151N791
$$ 472182 481692 491912 503094 514953 526837 538123 548576 558327 567455 575731 582874 589025 594816
52273E94816N984O025N410M561M317M731M892M217L330L195L691L821L088K079
$$ 594816 600800 606825 612235 616796 621113 625844 630736 634953 638283 641478 645169 648990 652078 654157
52259F54157J499J351J230J031R44J048J214J288J228J140J271J805K629L479
$$ 654157 655656 657007 658237 659268 660212 661260 662474 663762 664990 666130 667401 669206 671835 675314
52245F75314M305N271O352P219P693P997Q413Q852R017Q835Q543Q403Q483Q678
$$ 675314 679619 684890 691242 698461 706154 714151 722564 731416 740433 749268 757811 766214 774697 783375
52231G83375Q873R062R290R418R028P827O206N091N052N694O059N586M508L414
$$ 783375 792248 801310 810600 820018 829046 836873 843079 848170 853222 858916 864975 870561 875069 878483
52217H78483K543J576J09j714l194l845m021m508n525o506o844o507n856n236
$$ 878483 881026 882602 882711 880997 877803 873958 869937 865429 859904 853398 846554 840047 834191 828955
52203H28955m905n026n436n632n329m802m463m354m312m351m469m334l640k758
$$ 828955 824050 819024 813588 807956 802627 797825 793362 789008 784696 780345 775876 771542 767902 765144
52189G65144k453k897l401l259k542j811j440j427j631j869j935j829j897k477
$$ 765144 762691 759794 756393 753134 750592 748781 747341 745914 744283 742414 740479 738650 736753 734276
52175G34276l412m067l918l088k259k097k656l316l365k746k129k167k771l257
$$ 734276 730864 726797 722879 719791 717532 715435 712779 709463 706098 703352 701223 699056 696285 693028
52161F93028l141k586k160k262k806l277l189k601k185k505l212l339k462j254
$$ 693028 689887 687301 685141 682879 680073 676796 673607 671006 668821 666316 663104 659765 657303 656049
52147F56049o69q83j404j877k295k524k300j769j508j725j919j636j157j036j303
$$ 656049 655380 654497 653093 651216 648921 646397 644097 642328 640820 639095 637176 635540 634383 633347 632044
52132F32044j602j894k374k849k807k218j687j601j561j029j34M74M39J2l51l95
$$ 632044 630442 628548 626174 623325 620518 618300 616613 615012 613451 612422 612288 612762 613201 613213 612862 612467
52116F12467j62J68N17J045J984L267M426M991M896M471M246M705N965P510Q599
$$ 612467 612305 612473 612990 614035 616019 619286 623712 628703 633599 638070 642316 647021 652986 660496 669095
52101F69095R128R789J1101J2582J3289J2995J2402J2287J2828J3705J4454J4670
$$ 669095 678223 688012 699113 711695 724984 737979 750381 762668 775496 789201 803655 818325
52089H18325J4321J3954J4159J4799J5047J4356J3071J1881J1031J0207Q997P268
$$ 818325 832646 846600 860759 875558 890605 904961 918032 929913 940944 951151 960148 967416
52077I67416N396M111L835L979L404J777M1q46j141j697k561l007k884l003l940
$$ 967416 972812 976923 980758 984737 988141 989918 989959 989113 987972 986275 983714 980707 977823 974820 970880
52062I70880n155n791n773n622n471m978m038l124k780l110l805m374m353l590
$$ 970880 965725 959934 954161 948539 943068 938090 934052 930928 928148 925038 921233 916859 912506 908916
52048I08916k439j455q17k39M86J154J516J623J613J382Q91N46P74J270J214M29
$$ 908916 906477 905022 904205 903966 904452 905606 907122 908745 910358 911740 912631 913177 913951 915221 916435 916864
52032I16864k07J44J199K029K229K054J609O83n47j446j831k340l422m558n046
$$ 916864 916657 916801 918000 920029 922258 924312 925921 926604 926057 924611 922780 920440 917018 912460 907414
52017I07414n102n459o184o701o879p260q088q915r433j0041j1140j2461j3538
$$ 907414 902312 896853 890669 883968 877089 869829 861741 852826 843393 833352 822212 809751 796213
52004G96213j4434j5435j6397j6931j7057j7111j7184j7144j7113j7368j7749
$$ 796213 781779 766344 749947 733016 715959 698848 681664 664520 647407 630039 612290
51993F12290j7680j6936j5935j5167j4700j4433j4415j4615j4638j4142j3404
$$ 612290 594610 577674 561739 546572 531872 517439 503024 488409 473771 459629 446225
51982D46225j3123j3563j4104j3857j2666j1314j0647j0680j0714j0296r680r316
$$ 446225 433102 419539 405435 391578 378912 367598 356951 346271 335557 325261 315581 306265
51970C06265r171q837q092p121o281n816n692n580n154m488l948l605l160k611
$$ 306265 297094 288257 280165 273044 266763 260947 255255 249675 244521 240033 236085 232480 229320 226709
51956B26709k466k951l496l554l383l330k951j791o54q37k121k821k123j132j053
$$ 226709 224243 221292 217796 214242 210859 207529 204578 202787 202133 201296 199175 196354 194231 193099 192046
51941A92046j527j594j353j556k171k443k106j644j461j531j714j814j500p49
$$ 192046 190519 188925 187572 186016 183845 181402 179296 177652 176191 174660 172946 171132 169632 168883
51927A68883j14pl9K59M69j05j158j721j620j546j662j270j31R13J103O95K64
$$ 168883 168769 168762 168723 168982 169451 169346 168188 166467 164847 163301 161639 160369 160238 161151 162254 162949 163213
51910A63213j94q06j186r25l31L5J86N31J099J505J502J126M41l79r03p88j99
$$ 163213 163019 162213 161027 160102 159771 159806 159992 160523 161622 163127 164629 165755 166196 165817 164914 164126 163927
51893A63927M85J168J868K258J931J121O17Q72J556K127K445K699L047L572M304
$$ 163927 164412 165580 167448 169706 171637 172758 173375 174247 175803 177930 180375 183074 186121 189693 193997
51878A93997N036N334N043M722N206O754Q797J0624J2010J3111J4025J4787J5518
$$ 193997 199033 204367 209410 214132 219338 226092 234889 245513 257523 270634 284659 299446 314964
51865C14964J6160J6030J4213J0533N797Q53m081q875j2754j4851j5245j4845
$$ 314964 331124 347154 361367 371900 377697 378550 374469 365594 352840 337989 322744 307899
51853C07899j4277j3475j2398j1453j0954j0646j0106r260q282p199n932m567
$$ 307899 293622 280147 267749 256296 245342 234696 224590 215330 207048 199849 193917 189350
51841A89350l465l110l685m666m928l828j999o99l92n49p09r43j188r68k00M42
$$ 189350 185885 182775 179090 174424 169496 165668 163669 162970 162578 162029 161320 160377 159189 158221 158021 158463
51825A58463M24O8j10j68l51n06m86o16j081j290o11N94J383J445J190Q69L52
$$ 158463 158887 158955 158845 158677 158326 157820 157334 156718 155637 154347 153736 154330 155713 157158 158348 159217 159569
51808A59569k98p64r64r74n68M78J643K032J547R71P54M60k72r53q62p9N75M06
$$ 159569 159271 158507 157543 156569 156001 156479 158122 160154 161701 162672 163426 163886 163614 162661 161799 161720 162295 162701
51790A62701n27j440j463m87O13R76Q03R14J365J289K69r60j524j421j067n06
$$ 162701 162174 160734 159271 158784 159397 160373 161176 162090 163455 164744 165013 164053 162529 161108 160041 159535
51774A59535K39N87j9j103j535q84J50P74R99J282J716J933J650J061N90L82K28
$$ 159535 159774 160361 160342 159239 157704 156820 156970 157744 158743 160025 161741 163674 165324 166385 166975 167357 167585
51757A67585k7j75L9M56O60N42L26M5n08j191j399q55j06J53l5j17O0R5k97q88
$$ 167585 167558 167383 167422 167878 168538 169080 169406 169451 168943 167752 166353 165498 165392 165545 165510 165393 165453 165548 165251 164363
51737A64363j286j345j136p65l41l9l1l67r12j397j641j696j681j481q59J27J074
$$ 164363 163077 161732 160596 159831 159490 159451 159420 159053 158141 156744 155103 153407 151726 150245 149386 149513 150587
51720A50587J625J703J302M35n55j065q57l61j9K50O64R87Q64M27P4k40q31j513
$$ 150587 152212 153915 155217 155652 155097 154032 153175 152814 152795 153045 153709 154696 155560 155987 156061 155821 154990 153477
51702A53477j624r79k49j21m64o24k56M05R12J005P93O37P65R43P15J1p47j179
$$ 153477 151853 150874 150625 150504 150040 149416 149160 149565 150477 151482 152275 152912 153677 154620 155335 155346 154599 153420
51684A53420j342j442j445j242r64p91o22k15L91Q33Q88O73L76M5k35k01K46P16
$$ 153420 152078 150636 149191 147949 146985 146194 145572 145357 145748 146581 147469 148142 148518 148563 148328 148127 148373 149089
51666A49089O69J15k68Q2R02J435J313Q90O96Q36J071J185J091P28J47l86n55
$$ 149089 149758 149873 149605 149687 150589 152024 153337 154227 154923 155759 156830 158015 159106 159834 159981 159595 159040
51649A59040l70j96l71q57j309j412j158p90m98k60m2l3m73j216j735j684j267
$$ 159040 158670 158474 158103 157246 155937 154525 153367 152577 152079 151819 151777 151744 151271 150055 148320 146636 145369
51632A45369r28q32q47q01o06j84M29J028J412J543J355O73l98j186r79J25J237
$$ 145369 144441 143609 142762 141961 141355 141171 141600 142628 144040 145583 146938 147611 147213 146027 145048 145173 146410
51615A46410J561J070K72l51o28o57n84l51L12J402K364K588K143J607J216O83
$$ 146410 147971 149041 149313 148962 148334 147677 147093 146742 147054 148456 150820 153408 155551 157158 158374 159057
51599A59057p1o31p06n17k68K70J161J789J540P75M34P69J149J113J006J296J827
$$ 159057 158986 158355 157649 157132 156864 157134 158295 160084 161624 162399 162833 163602 164751 165864 166870 168166 169993
51582A69993K077J826J250O51M06Q65J880K643K411J423O94Q36J413J610J200
$$ 169993 172070 173896 175146 175797 176203 177068 178948 181591 184002 185425 186119 186955 188368 189978 191178
51567A91178O06K57K11M20Q87J446J641J162L00l23m78n30p65q81m51K60M67j31
$$ 191178 191784 192041 192252 192672 193559 195005 196646 197808 198108 197785 197307 196777 196012 195131 194680 194940 195407 195276
51549A95276q24p15K09J134J408J078M60l56j304j952j828j020j74K19K28J17
$$ 195276 194452 193737 193946 195080 196488 197566 198026 197670 196366 194414 192586 191566 191392 191611 191839 191956
51533A91956o9m02p71j032j274j640j970j963j718j719k118k354j801o13L79N33
$$ 191956 191887 191485 190714 189682 188408 186768 184798 182835 181117 179398 177280 174926 173125 172512 172891 173424
51517A73424q7r34j427j198l44M78N46r1n82l22K69L97J0k80k97n89j427k152
$$ 173424 173337 172403 170976 169778 169434 169912 170458 170367 169785 169463 169732 170129 170139 169859 169562 168973 167546 165394
51499A65394k038j359r72j080j122q41p01j007j229p69M1K59l69j007p73K21J062
$$ 165394 163356 161997 161025 159945 158823 157982 157281 156274 155045 154276 154317 154576 154207 153200 152427 152648 153710
51482A53710J124O45K53K07L51O26J254K200K880K752K054J445J057N60J38N74
$$ 153710 154834 155479 155732 155939 156290 156916 158170 160370 163250 166002 168056 169501 170558 171118 171256 171830
51466A71830J937K962K472R64j38m85j041k360l662m088l951m095m518m479l684
$$ 171830 173767 176729 179201 180165 180027 179542 178501 176141 172479 168391 164440 160345 155827 151348 147664
51451A47664k667j996j678j480j401j522j637j345n58K80N77K63j20o2L16N07
$$ 147664 144997 143001 141323 139843 138442 136920 135283 133938 133380 133660 134237 134500 134380 134318 134634 135141
51435A35141L47J56K04L97N13M06q1r04j508j252l88K3m83j016n80M67R21M18
$$ 135141 135488 135644 135848 136245 136758 137164 137083 136179 134671 133419 133031 133054 132571 131555 130975 131442 132363 132781
51417A32781k27k79L4Mp63k121l465m026l576k844k631k615j770q1J073N84r89
$$ 132781 132554 132275 132309 132313 131550 129429 125964 121938 118362 115518 112887 110272 108502 108421 109494 110078 109089
51400A09089k135k043j018J74Q83Q37L63O3P5p5n28o12J99J364J909J592Q68J48
$$ 109089 106954 104911 103893 104067 104950 105787 106150 106213 106288 106213 105685 105073 105272 106636 108545 110137 111005 111153
51382A11153l06p9Q92J839J967J561J440J559J158K66j50K73O14N5r89j543j231
$$ 111153 110847 110768 111660 113499 115466 117027 118467 120026 121184 121450 121300 121573 122187 122242 121253 119710 118479
51365A18479k71R21J630J086n31j898k010j300p37n00k60j49m92r48r16n80n87
$$ 118479 118208 119129 120759 121845 121314 119416 117406 116106 115369 114869 114609 114460 113968 113020 112104 111524 110937
51348A10937q64p05p6K12k69j025j540j846j891j195L61K012K927L093K871K277
$$ 110937 110073 109368 109292 109504 109235 108210 106670 104824 102933 101738 102099 104111 107038 110131 113002 115279
51332A15279J194J6o01m93j09M0k02o81j065j051o65k60r0p8n6j6L2J46K70K46
$$ 115279 116473 116489 115888 115395 115286 115326 115124 114443 113378 112327 111662 111402 111312 111234 111178 111162 111194 111340 111610 111856
51312A11856J15Q0j3o26j692k328j850p39p1k37p33j016r92p44l01K91R67J728
$$ 111856 111971 112051 112038 111412 109720 107392 105542 104803 104732 104495 103762 102746 101754 101010 100709 101000 101967 103695
51294A03695K377K419J644O61L37P49J229J370J415J562J645J636J932K701L407
$$ 103695 106072 108491 110135 110796 111133 111882 113111 114481 115896 117458 119103 120739 122671 125372 128779
51279A28779L392K633J656R12N48M69L94%o41j050j003r83j522k355k637k015
$$ 128779 132171 134804 136460 137372 137920 138389 138783 138783 138142 137092 136089 135106 133584 131229 128592 126577
51263A26577j037m84o13j112j525j533j095m59N3L58O20R45J208J261J122R20
$$ 126577 125540 125056 124443 123331 121806 120273 119178 118719 118772 119130 119750 120695 121903 123164 124286 125206
51247A25206P44O58P17Q21P04K43k95m81j74M42J202J990K477K196J179J69j83
$$ 125206 125950 126608 127325 128146 128850 129093 128798 128317 128143 128585 129787 131777 134254 136450 137629 137798 137615
51230A37615j33m04j038j274o53L07Q28Q34Q11J015J285J405J255Q16L47L49Q77
$$ 137615 137482 137078 136040 134766 134113 134420 135248 136082 136893 137908 139193 140598 141853 142669 143016 143365 144242
51213A44242J118K48j330k274j940j093q03j182j550j347n63L50O54j25j442j943
$$ 144242 145360 145608 144278 142004 140064 138971 138168 136986 135436 134089 133526 133876 134530 134405 132963 131020
51197A31020r78M55Q95L25L1O27J123M20r97j634r47K9J05n57q02j6J146J637
$$ 131020 130042 130497 131392 131717 131748 132375 133498 133918 132921 131287 130340 130369 130474 129917 129115 129099 130245 131882
51179A31882J175L36k30l29j59p0l80j061j556j310n55j39m19p95o79l66m71r01
$$ 131882 133057 133393 133163 132834 132675 132605 132225 131164 129608 128298 127743 127604 127185 126390 125711 125345 124874 123973
51161A23973j043p85n61m43QQ10J257R52N12P15J345J589J274J069J452K028K055
$$ 123973 122930 122145 121584 121141 121149 121959 123216 124168 124680 125395 126740 128329 129603 130672 132124 134152 136207
51144A36207J315L34r2M22J368J596M19j451k435j699J7J293J494J053P07Q04
$$ 136207 137522 137856 137764 138186 139554 141150 141569 140118 137683 135984 136001 137294 138788 139841 140548 141352
51128A41352J246J718J881J630J238J067J129J126R07O61N69N01K50j10k99k23
$$ 141352 142598 144316 146197 147827 149065 150132 151261 152387 153294 153955 154524 155025 155275 155165 154866 154643
51112A54643j25l97j159k034k341j728o20J33J50j34r1L59Q28J010Q75M90J9j82
$$ 154643 154518 154121 152962 150928 148587 146859 146239 146372 146522 146388 146297 146656 147484 148494 149369 149859 149878 149696
51094A49696J19O13O44j0q31j114o62J61Q91J328J572J826K112K181J820J212
$$ 149696 149815 150428 151072 151062 150231 149117 148455 148616 149507 150835 152407 154233 156345 158526 160346 161558
51078A61558Q10Q44J156J494J723J715J335O44r2p01j191j477j298o80j81l89
$$ 161558 162368 163212 164368 165862 167585 169300 170635 171279 171187 170486 169295 167818 166520 165840 165659 165270
51062A65270j247k022j954q82O12J571J432N95M1K13N53L68j53j91N41J370J520
$$ 165270 164023 162001 160047 159165 159777 161348 162780 163375 163416 163629 164182 164550 164397 164206 164747 166117 167637
51045A67637J007M77L41L48J03k23L4J128K377K902K754K727L040K942J991J061
$$ 167637 168644 169121 169462 169810 169913 169690 169724 170852 173229 176131 178885 181612 184652 187594 189585 190646
51029A90646J289K406K970K279J194Q99J536K443L148L639L890L726L156K534
$$ 190646 191935 194341 197311 199590 200784 201683 203219 205662 208810 212449 216339 220065 223221 225755
51015B25755K268K484K993L484L797L998M264M689N259N895O415O622O597O739
$$ 225755 228023 230507 233500 236984 240781 244779 249043 253732 258991 264886 271301 277923 284520 291259
51001B91259P307Q062Q634R110R894J1073J2241J2974J3205J3162J3203J3682
$$ 291259 298566 306628 315262 324372 334266 345339 357580 370554 383759 396921 410124 423806
50989D23806J4594J5481J6020J6541J7533J8768J9650K0379K1941K4678K7646
$$ 423806 438400 453881 469901 486442 503975 522743 542393 562772 584713 609391 637037
50978F37037K9833L1411L3220L5502L7753L9462M0496M0911M0861M0495L9640
$$ 637037 666870 698281 731501 767003 804756 844218 884714 925625 966486 1006981 1046621
50967A046621L7895L5302L2497K9803K6733K2907J8881J5394J2257Q959N872L801
$$ 1046621 1084516 1119818 1152315 1182118 1208851 1231758 1250639 1266033 1278290 1287249 1293121 1296922
50955A296922K564J255j10m71M41J386J309O37J60m77k217n101q323j1401j4391
$$ 1296922 1299486 1300741 1300631 1300160 1300601 1301987 1303296 1303933 1304093 1303616 1301399 1296298 1287975 1276574 1262183
50940A262183j7236j9798k2408k5592k9176l2369l4785l6746l8531l9910m0595
$$ 1262183 1244947 1225149 1202741 1177149 1147973 1115604 1080819 1044073 1005542 965632 925037
50929I25037m0571l9791l8096l5655l3095l0853k8748k6484k4168k2081k0160
$$ 925037 884466 844675 806579 770924 737829 706976 678228 651744 627576 605495 585335
50918E85335j8060j5681j3325j1467j0347r708q861p315n442m128l651l204j942
$$ 585335 567275 551594 538269 526802 516455 506747 497886 490571 485129 481001 477350 474146 472204
50905D72204k13P62L40p91j411r89K6R05J385J764K412L319M208M941N604O239
$$ 472204 471991 472753 473093 472302 470891 469902 469928 470833 472218 473982 476394 479713 483921 488862 494466 500705
50889E00705O787P381Q312R530J0444J0653J0609J1129J2369J3705J4662J5463
$$ 500705 507492 514873 523185 532715 543159 553812 564421 575550 587919 601624 616286 631749
50877F31749J6621J8308K0330K2443K4483K6469K8616L1130L3862L6465L8997
$$ 631749 648370 666678 687008 709451 733934 760403 789019 820149 854011 890476 929473
50866I29473M2050M6056N0773N5730O0847O6264P1722P6658Q0906Q4872Q8827
$$ 929473 971523 1017579 1068352 1124082 1184929 1251193 1322915 1399573 1480479 1565351 1654178
50855A654178R2364R4779R5803R5662R4389R1382Q5823P7550O7334N6264M5023
$$ 1654178 1746542 1841321 1937124 2032786 2127175 2218557 2304380 2381930 2449264 2505528 2550551
50844B550551L3855K3029J3016M262k903q158j1289j2485j2165j0498p500l756
$$ 2550551 2584406 2607435 2620451 2624713 2621810 2613652 2602363 2589878 2577713 2567215 2559715 2555959
50832B555959m68J589K701L318K874J55n324j2912k1716l1272m1306n1499o1618
$$ 2555959 2555491 2557080 2559781 2563099 2565973 2566128 2560804 2547892 2526176 2494904 2453598 2402099 2340481
50819B340481p1365p9941q6392r0592r3345r5200r5635r3857q9961q4797p9101
$$ 2340481 2269116 2189175 2102783 2012191 1918846 1823646 1728011 1634154 1544193 1459396 1380295
50808A380295p3233o7525o2187n6953n1360m5412l9578l4154k9082k4450k0663
$$ 1380295 1307062 1239537 1177350 1120397 1069037 1023625 984047 949893 920811 896361 875698
50797H75698j7881j5667j3422j1032q791o984n734n179n366n943o231n844n041
$$ 875698 857817 842150 828728 817696 808905 801921 796187 791008 785642 779699 773468 767624 762583
50784G62583m426m235m207m041l769l571l498l551l773m009l860l161k343j847
$$ 762583 758157 753922 749715 745674 741905 738334 734836 731285 727512 723503 719643 716482 714139 712292
50770G12292j365l28R73J548J203J028J964L594M957N927O973P986Q376Q239Q521
$$ 712292 710927 710599 711572 713120 714323 715351 717315 720909 725866 731793 738766 746752 755128 763367 771888
50755G71888R836J1864J4101J6527J9284K2250K5269K8368L1455L4188L6435L8577
$$ 771888 781724 793588 807689 824216 843500 865750 891019 919387 950842 985030 1021465 1060042
50743A060042M1091M4043M7193N0243N2816N4532N5340N5521N5109N3625N0572
$$ 1060042 1101133 1145176 1192369 1242612 1295428 1349960 1405300 1460821 1515930 1569555 1620127
50732A620127M5951M0046L3037K5100J6654Q218J64p203j3506j8420k1714k3107
$$ 1620127 1666078 1706124 1739161 1764261 1780915 1789133 1789297 1782094 1768588 1750168 1728454 1705347
50720A705347k2399k0001j6862j3605j0060o060k233M21J446R63r55m327q918
$$ 1705347 1682948 1662947 1646085 1632480 1622420 1616360 1614127 1614548 1615994 1616957 1616002 1611675 1602757
50707A602757j4370k0614k7634l4876m1435m6744n0659n3058n3887n3497n2237
$$ 1602757 1588387 1567773 1540139 1505263 1463828 1417084 1366425 1313367 1259480 1205983 1153746
50696A153746m9801m5776m0900l6802l4187l2017k9046k5355k1815j8701j5638
$$ 1153746 1103945 1058169 1017269 980467 946280 914263 885217 859862 838047 819346 803708
50685H03708j2481r390o308l147l75J434K650M416P222J0225J2217J2758J2097
$$ 803708 791227 781837 775529 772382 772007 773441 776091 780507 787729 797954 810171 822929 835026
50672H35026J0673R093Q150Q141Q393P974O894O121O341P162P746P829P769P821
$$ 835026 845699 854792 862942 871083 879476 887450 894344 900465 906806 913968 921714 929543 937312 945133
50658I45133P864P916Q455R924J2036J3972J5210J5932J6559J7279J8099J9046
$$ 945133 952997 960913 969368 979292 991328 1005300 1020510 1036442 1053001 1070280 1088379 1107425
50646A107425J9993K0558K0519K0222K0176K0276J9837J8476J6549J4542J2407
$$ 1107425 1127418 1147976 1168495 1188717 1208893 1229169 1249006 1267482 1284031 1298573 1310980
50635A310980R792O724L732J311m95k044l797o008q448j0432j1345j1184j0531
$$ 1310980 1320772 1327496 1331228 1332539 1332044 1330000 1326203 1320195 1311747 1301315 1289970 1278786 1268255
50622A268255r964r654r471r269q974q506p792o861n882n105m655m374l936l347
$$ 1268255 1258291 1248637 1239166 1229897 1220923 1212417 1204625 1197764 1191882 1186777 1182122 1177748 1173812 1170465
50608A170465l182m056n821p709r351j1343j4382j8163k1574k3937k5527k6858
$$ 1170465 1167283 1163227 1157406 1149697 1140346 1129003 1114621 1096458 1074884 1050947 1025420 998562
50596I98562k7930k8452k8388k7836k6645k4608k1941j9248j6905j4795j2677
$$ 998562 970632 942180 913792 885956 859311 834703 812762 793514 776609 761814 749137
50585G49137j0574q658o972n322l487j541QN59J94j83K36J222J965K364L116M465
$$ 749137 738563 729905 722933 717611 714124 712583 712591 713150 713344 713161 713397 714619 716584 718948 722064 726529
50569G26529N577N788N725O531Q342J0349J2157J4161J6454J8296J9032J8968
$$ 726529 732106 737894 743619 750150 758492 768841 780998 795159 811613 829909 848941 867909
50557H67909J8788J8615J8134J7343J6595J6055J5637J5400J5641J6469J7631
$$ 867909 886697 905312 923446 940789 957384 973439 989076 1004476 1020117 1036586 1054217
50546A054217J8820J9975K1269K2955K5197K7842L0440L2737L5108L8155M1892
$$ 1054217 1073037 1093012 1114281 1137236 1162433 1190275 1220715 1253452 1288560 1326715 1368607
50535A368607M5631M8786N1406N3761N5718N6849N6990N6353N5099N3081M9987
$$ 1368607 1414238 1463024 1514430 1568191 1623909 1680758 1737748 1794101 1849200 1902281 1952268
50524A952268M5531L9500L1908K3202J4076N009l893j2505k0459k7515l3893l9888
$$ 1952268 1997799 2037299 2069207 2092409 2106485 2111494 2107601 2095096 2074637 2047122 2013229 1973341
50512A973341m5189m9032n1063n1696n1441n0290m7981m4568m0364l5601l0510
$$ 1973341 1928152 1879120 1828057 1776361 1724920 1674630 1626649 1582081 1541717 1506116 1475606
50501A475606k5500k0797j6030j0715n140j64L883P498J0953J3615J4784J4606
$$ 1475606 1450106 1429309 1413279 1402564 1397424 1397260 1401143 1408641 1419594 1433209 1447993 1462599
50489A462599J3525J1182O633l29q728j7328k5462l2866l9267m4451m8357n0811
$$ 1462599 1476124 1487306 1493939 1493610 1484882 1467554 1442092 1409226 1369959 1325508 1277151 1226340
50477A226340n1509n0530m8557m6272m3750m0754l7388l4076l0926k7603k3901
$$ 1226340 1174831 1124301 1075744 1029472 985722 944968 907580 873504 842578 814975 791074
50466G91074k0162j6951j4484j2511j0560q225n411k498j54J284K187L220M589
$$ 791074 770912 753961 739477 726966 716406 708181 702770 700272 700118 701402 703589 706809 711398
50453G11398O002P282Q667J0256J1645J2463J2950J3486J3712J2862J1028R380
$$ 711398 717400 724682 733349 743605 755250 767713 780663 794149 807861 820723 831751 841131
50441H41131Q756Q707Q341P668P413P836Q432Q717Q695Q580Q614R103J0137J1335
$$ 841131 849887 858594 866935 874603 882016 889852 898284 907001 915696 924276 932890 941993 952130 963465
50427I63465J2330J3464J5344J7677J9419K0228K0997K2494K4232K5278K5609
$$ 963465 975795 989259 1004603 1022280 1041699 1061927 1082924 1105418 1129650 1154928 1180537
50416A180537K5851K6144K6039K5341K4314K3047K1330J9121J6541J3366R166
$$ 1180537 1206388 1232532 1258571 1283912 1308226 1331273 1352603 1371724 1388265 1401631 1410797
50405A410797M095j018n691j0361j5656k1431k6889l1372l4719l7058l8619l9673
$$ 1410797 1414892 1413874 1408183 1397822 1382166 1360735 1333846 1302474 1267755 1230697 1192078 1152405
50393A152405m0360m0536l9929l8392l5944l2735k9104k5502k2124j8676j4767
$$ 1152405 1112045 1071509 1031580 993188 957244 924509 895405 869903 847779 829103 814336
50382H14336j0437o177k364J010M068O733Q824J0300J1218J1421J0506Q146M491
$$ 814336 803899 797722 795358 796368 800436 807169 815993 826293 837511 848932 859438 867584 872075
50369H72075K21l811p108r798j2426j5356j8360k0777k2077k2288k1928k1670
$$ 872075 872296 868485 861377 851579 839153 823797 805437 784660 762583 740295 718367 696697
50357F96697k1902k2354k2170k0673j8204j5894j4399j3190j1449r297p558o463
$$ 696697 674795 652441 630271 609598 591394 575500 561101 547911 536462 527165 519607 513144
50345E13144n393l936k510j556p91K30J286J860K059K450L089L424L308L452M482
$$ 513144 507751 503815 501305 499749 498958 499188 500474 502334 504393 506843 509932 513356 516664 520116 524598
50330E24598N964O801O497N589M872M574M499M636N213O065O460N882M726L832
$$ 524598 530562 537363 543860 549449 554321 558895 563394 568030 573243 579308 585768 591650 596376 600208
50316F00208L516L448L387L454L627L655L620L995M867N698O240P018Q451J0094
$$ 600208 603724 607172 610559 614013 617640 621295 624915 628910 633777 639475 645715 652733 661184 671278
50302F71278J1343J2208J2627J1609Q146K738k966p882j1880j4710j5786j5267
$$ 671278 682621 694829 707456 719065 727211 729949 726983 719101 707221 692511 676725 661458
50290F61458j4224j3345j2380j1149j0153r627q933p583o128n369n241n123m648
$$ 661458 647234 633889 621509 610360 600207 590580 581647 574064 567936 562567 557326 552203 547555
50277E47555l708k216o11O5n39j249o72R77K336K842L150L768M372M691N026N500
$$ 547555 543847 541631 541020 541085 540546 539297 538625 539602 541938 544780 547930 551698 556070 560761 565787 571287
50261E71287N571M846L859L460L761M126M036L538K983K624K439K224J739Q81
$$ 571287 576858 581704 585563 589023 592784 596910 600946 604484 607467 610091 612530 614754 616493 617374
50247F17374k43j326j988k107k024k207k665k909k699k381k342k497k676k983
$$ 617374 617131 615805 613817 611710 609686 607479 604814 601905 599206 596825 594483 591986 589310 586327
50233E86327l363l268k363j241o82m92J78J507K836L790M730N950P277Q556R801
$$ 586327 582964 579696 577333 576092 575410 574918 575096 576603 579439 583229 587959 593909 601186 609742 619543
50218F19543J0719J0927J0906J1781J3740J5566J6325J6655J7567J8801J9347
$$ 619543 630262 641189 652095 663876 677616 693182 709507 726162 743729 762530 781877
50207G81877J9112J8929J9090J8970J8162J7010J5734J3880J0997P452M150J820
$$ 781877 800989 819918 839008 857978 876140 893150 908884 922764 933761 941213 945363 947183
50195I47183O78M04J44j090l679p095j0519j3604j6514j9475k2436k5047k6816
$$ 947183 947861 948265 948409 947319 943640 936545 926026 912422 895908 876433 853997 828950 802134
50182H02134k7415k7031k6306k5781k5379k4465k2511j9689j6844j4842j3857
$$ 802134 774719 747688 721382 695601 670222 645757 623246 603557 586713 571871 558014
50171E58014j3360j2724j1729j0424q847p169n895n453n627n731n456n180n307
$$ 558014 544654 531930 520201 509777 500930 493761 487866 482413 476786 471055 465599 460419 455112
50158D55112n623n612n176m741m679m897n024m846m457m033l610l135k715k639
$$ 455112 449489 443877 438701 433960 429281 424384 419360 414514 410057 406024 402414 399279 396564 393925
50144C93925l015l463l428k811k119j881k050k147j884j439j119r55p43l51J79
$$ 393925 390910 387447 384019 381208 379089 377208 375158 373011 371127 369688 368569 367614 366871 366520 366699
50129C66699P96J585K590L568M123M165M084M287M669M743M301L704L430L604
$$ 366699 367495 369080 371670 375238 379361 383526 387610 391897 396566 401309 405610 409314 412744 416348
50115D16348M111N007O389P905Q880R122R295J0141J1478J2423J2600J2661J3436
$$ 416348 420459 425466 431855 439760 448640 457762 467057 477198 488676 501099 513699 526360 539796
50102E39796J4916J6438J7595J8598J9814K1405K3392K5699K7958K9659L0772
$$ 539796 554712 571150 588745 607343 627157 648562 671954 697653 725611 755270 786042
50091G86042L2029L4176L7023L9423M0380L9921L8768L7292L5145L2071K8758
$$ 786042 818071 852247 889270 928693 969073 1008994 1047762 1085054 1120199 1152270 1181028
50080A181028K6349K5111K4053K2199J9672J7017J3903R299K999l900j0313j6295
$$ 1181028 1207377 1232488 1256541 1278740 1298412 1315429 1329332 1338631 1341630 1337730 1327417 1311122
50068A311122k2417k8454l3305l6059l6708l5934l4509l2848l0876k8446k5907
$$ 1311122 1288705 1260251 1226946 1190887 1154179 1118245 1083736 1050888 1020012 991566 965659
50057I65659k3945k2651k1215j8949j6265j4108j2705j1407r739q009o870o670
$$ 965659 941714 919063 897848 878899 862634 848526 835821 824414 814675 806666 799796 793126
50045G93126p271q117q573q480q266q251q106p513o992p249p947q019p221o450
$$ 793126 785855 777738 769165 760685 752419 744168 736062 728549 721557 714308 706361 698342 691121 684671
50031F84671o312o341o038n689n544n061l780k275j326p08K53J265J371N08l23
$$ 684671 678359 672018 665980 660291 654747 649686 645906 643631 642305 641597 641850 643115 644486 644994 644671
50016F44671n42o42j036j245p82j53j75p28q71j57P27P99j37j394k285k844l569
$$ 644671 644129 643487 642451 641206 640424 640271 640096 639368 638497 638340 639067 639866 639729 638335 636050 633206 629637
49999F29637m543n186n076m719n027o166p317p655p093o085n094m399m045l754
$$ 629637 625094 619908 614832 610113 605086 598920 591603 583948 576855 570770 565676 561277 557232 553478
49985E53478l161k254j313l82Q00K258L687N004O494Q111R274R823J0588J2409
$$ 553478 550317 548063 546750 546368 547168 549426 553113 558117 564611 572722 581996 591819 602407 614816
49971F14816J4910J6984J8254J9300K0515K1479K1605K0764J9130J6931J4537
$$ 614816 629726 646710 664964 684264 704779 726258 747863 768627 787757 804688 819225
49960H19225J2312J0261Q114N940M140K734J139j100l915p257j1485j6669k1980
$$ 819225 831537 841798 849912 855852 859992 862726 863865 862765 858850 851593 840108 823439 801459
49947H01459k6310k9257l0993l1504l0634k8718k6554k4543k2394j9811j7096
$$ 801459 775149 745892 714899 683395 652761 624043 597489 572946 550552 530741 513645
49936E13645j4830j3303j2367j1683j0943j0045r146q426p730o751n507m456l923
$$ 513645 498815 485512 473145 461462 450519 440474 431328 422902 415172 408421 402914 398458 394535
49923C94535l718l475l219l357m115n137n657n151l902k832k667l241l735l492
$$ 394535 390817 387342 384123 380766 376651 371514 365857 360706 356804 353972 351305 348064 344329 340837
49909C40837k537j382o50p18j374j834j485o37j22j64j91M3p3r94k096k424k062
$$ 340837 338300 336918 336268 335550 334176 332342 330857 330220 330098 329934 329743 329786 329713 328719 326623 324199 322137
49892C22137j889k148k116j336l66L1j09k48j87j70k92l84l88m68o68p74n83k13
$$ 322137 320248 318100 315984 314648 314282 314313 314204 313956 313769 313599 313307 312923 312535 312067 311399 310625 310042 309829
49874C09829Nj16l84m28j21K11J55k48m65q1P21J376J543J403J470K117L206M123
$$ 309829 309834 309718 309334 308906 308785 308996 309151 308903 308438 308357 309078 310454 311997 313400 314870 316987 320193 324316
49856C24316M306L735K774J679N51k56k94L27Q54Q36O53P03N52l73j543j710n39
$$ 324316 328622 332357 335131 336810 337361 337105 336811 337138 337992 338828 339481 340184 340736 340363 338820 337110 336571
49839C36571R12J533J251N37l94j336j733j328p53p57j145j152p04m15m03oJ096
$$ 336571 337483 339016 340267 340804 340410 339074 337341 336013 335260 334503 333358 332206 331502 331087 330684 330678 331774
49822C31774K195K442J860J032L00k91o12n85m47n43r06j404j997k502k441j601
$$ 331774 333969 336411 338271 339303 339603 339312 338700 338115 337668 337125 336219 334815 332818 330316 327875 326274
49806C26274n72j28k41l14k77o94j624k243j966j333j170j395j303q05n81j023
$$ 326274 325702 325574 325333 325019 324742 324048 322424 320181 318215 316882 315712 314317 313014 312209 311628 310605
49790C10605j646j772j377r19o48l89M5N07P13N85L28J73J44J25l0m58j153j707
$$ 310605 308959 307187 305810 304891 304243 303854 303899 304406 305119 305704 306032 306205 306349 306474 306444 305986 304833 303126
49772C03126j442j85J212J642J036M34O36J358J996K546L267L913L949L302K282
$$ 303126 301684 301499 302711 304353 305389 305823 306459 307817 309813 312359 315626 319539 323488 326790 329072
49757C29072J030l55j353j485j114j024j233j034l24J31Mj4M68O46j81j181j020
$$ 329072 330102 329747 328394 326909 325795 324771 323538 322504 322180 322311 322315 322301 322769 323415 323234 322053 321033
49740C21033R3N74l00j436j498n24N01R49R05O52M38N49J077J640J660R87O4n64
$$ 321033 321126 321700 321400 319964 318466 317942 318443 319392 320297 320949 321387 321936 323013 324653 326313 327300 327364 326800
49722C26800p80q48r08o95R7J166J710J438J071J450K297K522J708O12M7m9r9
$$ 326800 326020 325172 324264 323569 323666 324832 326542 327980 329051 330501 332798 335320 337028 337640 337687 337638 337539
49705C37539n9K93O87P08N58Q56J640K251K223J859J685J769J840J777J760J995
$$ 337539 337480 337773 338460 339168 339726 340582 342222 344473 346696 348555 350240 352009 353849 355626 357386 359381
49689C59381K490K983L064K506J586R25R03J331J689J596J074N74O81J540K502
$$ 359381 361871 364854 367918 370424 372010 372935 373838 375169 376858 378454 379528 380102 380783 382323 384825
49674C84825K682J927R61M61L80L64M19O58P79L81k16j87O20J335J239P88R87
$$ 384825 387507 389434 390395 390856 391236 391600 392019 392677 393456 393837 393621 393434 394054 395389 396628 397416 398403
49657C98403K044L289M253N190O378P485Q055Q151Q052P535O016L416M02k298
$$ 398403 400447 403736 407989 413179 419557 427042 435097 443248 451300 458835 464851 468267 468669 466371
49643D66371m389n717n987n162l842k835k454k471k573k546k138j234j78N03O49
$$ 466371 461982 456265 450278 445116 441274 438439 435985 433514 430941 428395 426257 425023 424845 425348 425997
49628D25997M88J44l62o45n8J386K753L178K867K665K927L254L181K649J916J359
$$ 425997 426485 426629 426267 425622 425564 426950 429703 432881 435748 438413 441340 444594 447775 450424 452340 453699
49612D53699J352J956K808L519M100M624M798M367L765L714M127M186L628L204
$$ 453699 455051 457007 459815 463334 467434 472058 476856 481223 484988 488702 492829 497015 500643 503847
49598E03847L503M023L973L445L164L349L639L873M305M915N217M866M120L489
$$ 503847 507350 511373 515346 518791 521955 525304 528943 532816 537121 542036 547253 552119 556239 559728
49584E59728L329L769M680N504N546M681L564K950L006L389L755L970M014L946
$$ 559728 563057 566826 571506 577010 582556 587237 590801 593751 596757 600146 603901 607871 611885 615831
49570F15831L897L966M139M335M382L995L038J925J414J784K509K935L028L156
$$ 615831 619728 623694 627833 632168 636550 640545 643583 645508 646922 648706 651215 654150 657178 660334
$$ [...]
##END NTUPLES=NMR SPECTRUM
##END=
