##TITLE=NES1034_872015080_9242822_nGXDxCP1Qb
##JCAMPDX= 6.0         $$ Bruker NMR JCAMP-DX V2.0
##DATA TYPE= NMR SPECTRUM
##DATA CLASS= NTUPLES
##ORIGIN= BRUKER
##OWNER= Administrator
$$ 1.72 TOPSPIN		Version 2.1
$$ 2015-08-24 22:20:49.748 -0700  Administrator@X
$$ Compression mode = diff/dup
##.OBSERVE FREQUENCY= 400.02188249412
##.OBSERVE NUCLEUS= ^1H
##.ACQUISITION MODE= SIMULTANEOUS (DQD)
##.ACQUISITION SCHEME= undefined
##.AVERAGES= 8
##.DIGITISER RES= 22
##SPECTROMETER/DATA SYSTEM= spect
##.PULSE SEQUENCE= zg30
##.SOLVENT NAME= COFFEE_meoh
##.SHIFT REFERENCE= INTERNAL, COFFEE_meoh, 1, 14.98509
##AUDIT TRAIL= $$ (NUMBER, WHEN, WHO, WHERE, PROCESS, VERSION, WHAT)
$$ ##TITLE= Audit trail, TOPSPIN		Version 2.1
$$ ##JCAMPDX= 5.01
$$ ##ORIGIN= Bruker BioSpin GmbH
$$ ##OWNER= Administrator
$$ $$ E:\/data/COFFEE/nmr/NES1034_872015080_9242822_nGXDxCP1Qb/30/pdata/1/auditp.txt
$$ ##AUDIT TRAIL=  $$ (NUMBER, WHEN, WHO, WHERE, PROCESS, VERSION, WHAT)
(   1,<2015-08-24 22:20:42.467 -0700>,<Administrator>,<X>,<go>,<TOPSPIN 2.1>,
      <created by zg
	started at 2015-08-24 22:19:36.217 -0700,
	POWCHK enabled, PULCHK disabled,
       configuration hash MD5:
       21 0F 79 D6 B3 7B B4 F6 88 20 88 DB 03 48 BD 9F
       data hash MD5: 64K
       6C 84 26 12 50 F8 F5 59 82 61 BE 91 D3 75 C3 A1>)
(   2,<2015-08-24 22:20:45.592 -0700>,<Administrator>,<X>,<proc1d>,<TOPSPIN 2.1>,
      <Start of raw data processing
       efp LB = 0 FT_mod = 6 PKNL = 1 PHC0 = 0 PHC1 = 0 SI = 32K 
       data hash MD5: 32K
       6D DF 95 79 3D C5 98 78 25 10 7D 73 D1 96 8F DF>)
(   3,<2015-08-24 22:20:45.889 -0700>,<Administrator>,<X>,<proc1d>,<TOPSPIN 2.1>,
      <pk PHC0 = 94.22974 PHC1 = 0 
       data hash MD5: 32K
       36 AC 36 4C DD C0 5E A3 C0 0C 5B 1F AF D5 1A 9C>)
(   4,<2015-08-24 22:20:45.998 -0700>,<Administrator>,<X>,<proc1d>,<TOPSPIN 2.1>,
      <abs ABSG = 1 
       data hash MD5: 32K
       9D C2 2F DF DF D5 20 71 3D 33 A6 E2 34 DA E2 E1>)
(   5,<2015-08-24 22:20:46.061 -0700>,<Administrator>,<X>,<proc1d>,<TOPSPIN 2.1>,
      <abs ABSG = 2 
       data hash MD5: 32K
       CE 4D A2 D0 5D E2 7D AA 3A 66 B2 D9 E9 F5 E0 04>)
(   6,<2015-08-24 22:20:46.123 -0700>,<Administrator>,<X>,<proc1d>,<TOPSPIN 2.1>,
      <abs ABSG = 3 
       data hash MD5: 32K
       3E C6 F3 F9 E6 26 A4 A1 BF CF B5 BC 57 D1 AE 6A>)
(   7,<2015-08-24 22:20:46.201 -0700>,<Administrator>,<X>,<proc1d>,<TOPSPIN 2.1>,
      <abs ABSG = 4 
       data hash MD5: 32K
       B6 39 94 D5 30 5A EE 57 D7 09 08 CB D3 CD B6 0F>)
(   8,<2015-08-24 22:20:46.248 -0700>,<Administrator>,<X>,<proc1d>,<TOPSPIN 2.1>,
      <abs ABSG = 5 
       data hash MD5: 32K
       61 A0 EC 9A A8 5C 25 31 03 6E F5 F4 B0 CF A7 E4>)
$$ ##END=
$$ 
$$ $$ hash MD5
$$ $$ E5 65 A9 73 3B A5 F2 4A 2A 52 80 80 EC 61 6D 64
##$RELAX= 
##$RELAX= 
##$RELAX= 
##$RELAX= 
##$RELAX= 
##$RELAX= 
##$RELAX= 
$$ Bruker specific parameters
$$ --------------------------
##$DU= <E:\>
##$EXPNO= 30
##$NAME= <NES1034_872015080_9242822_nGXDxCP1Qb>
$$ [...]
##$TP= (0..7)
150 150 150 150 150 150 150 150
##$TP07= 0
##$TPNAME0= <>
##$TPNAME1= <>
##$TPNAME2= <>
##$TPNAME3= <>
##$TPNAME4= <>
##$TPNAME5= <>
##$TPNAME6= <>
##$TPNAME7= <>
##$TPOAL= (0..7)
0.5 0.5 0.5 0.5 0.5 0.5 0.5 0.5
##$TPOFFS= (0..7)
0 0 0 0 0 0 0 0
##$TUNHIN= 0
##$TUNHOUT= 0
##$TUNXOUT= 0
##$USERA1= <user>
##$USERA2= <user>
##$USERA3= <user>
##$USERA4= <user>
##$USERA5= <user>
##$V9= 5
##$VALIST= <valist>
##$VCLIST= <CCCCCCCCCCCCCCC>
##$VD= 0
##$VDLIST= <DDDDDDDDDDDDDDD>
##$VPLIST= <PPPPPPPPPPPPPPP>
##$VTLIST= <TTTTTTTTTTTTTTT>
##$WBST= 2048
##$WBSW= 25
##$XGAIN= (0..3)
0 0 0 0
##$XL= 0
##$YL= 0
##$YMAX_a= 569505
##$YMIN_a= -479848
##$ZGOPTNS= <>
##$ZL1= 120
##$ZL2= 120
##$ZL3= 120
##$ZL4= 120
##$ABSF1= 14.98509
##$ABSF2= -5.573092
##$ABSG= 5
##$ABSL= 3
##$ALPHA= 0
##$AQORDER= 0
##$ASSFAC= 0
##$ASSFACI= 0
##$ASSFACX= 0
##$ASSWID= 0
##$AUNMP= <proc_prof1d_extract_pilot.lims>
##$AXLEFT= 0
##$AXNAME= <>
##$AXNUC= <1H>
##$AXRIGHT= 0
##$AXTYPE= 0
##$AXUNIT= <>
##$AZFE= 0.1
##$AZFW= 0.1
##$BCFW= 0
##$BC_mod= 0
##$BYTORDP= 0
##$COROFFS= 0
##$CY= 15
##$DATMOD= 1
##$DC= 0
##$DFILT= <>
##$DTYPP= 0
##$F1P= 0
##$F2P= 0
##$FCOR= 0.5
##$FTSIZE= 32768
##$FT_mod= 6
##$GAMMA= 0
##$GB= 0
##$INTBC= 1
##$INTSCL= 1
##$ISEN= 128
##$LB= 0
##$LEV0= 0
##$LPBIN= 0
##$MAXI= 10000
##$MC2= 0
##$MEAN= 0
##$ME_mod= 0
##$MI= 0
##$NCOEF= 0
##$NC_proc= -8
##$NLEV= 6
##$NOISF1= 0
##$NOISF2= 0
##$NSP= 0
##$NTH_PI= 0
##$NZP= 0
##$OFFSET= 14.98509
##$PC= 1
##$PHC0= 94.22974
##$PHC1= 0
##$PH_mod= 1
##$PKNL= yes
##$PPARMOD= 0
##$PPDIAG= 0
##$PPIPTYP= 0
##$PPMPNUM= 2147483647
##$PPRESOL= 1
##$PSCAL= 4
##$PSIGN= 0
##$PYNMP= <proc.py>
##$REVERSE= no
##$SF= 400.02
##$SI= 32768
##$SIGF1= 0
##$SIGF2= 0
##$SINO= 400
##$SIOLD= 32768
##$SPECTYP= <>
##$SREGLST= <1H.CDCl3>
##$SSB= 0
##$STSI= 32768
##$STSR= 0
##$SW_p= 8223.68421052631
##$SYMM= 0
##$S_DEV= 0
##$TDeff= 65536
##$TDoff= 0
##$TI= <>
##$TILT= no
##$TM1= 0
##$TM2= 0
##$TOPLEV= 0
##$USERP1= <user>
##$USERP2= <user>
##$USERP3= <user>
##$USERP4= <user>
##$USERP5= <user>
##$WDW= 1
##$XDIM= 32768
##$YMAX_p= 428739550
##$YMIN_p= -776534
##$CURPLOT= <Network HP LaserJet P1505>
##$CURPRIN= <$Network HP LaserJet P1505>
##$DFORMAT= <normdp>
##$LAYOUT= <+/1D_H.xwp>
##$LFORMAT= <normlp>
##$PFORMAT= <normpl>
##$SURQMSG= 1
$$ End of Bruker specific parameters
$$ ---------------------------------
##NTUPLES= NMR SPECTRUM
##VAR_NAME=  FREQUENCY,     SPECTRUM/REAL,   SPECTRUM/IMAG
##SYMBOL=    X,             R,               I
##VAR_TYPE=  INDEPENDENT,   DEPENDENT,       DEPENDENT
##VAR_FORM=  AFFN,          ASDF,            ASDF
##VAR_DIM=   32768,         32768,           32768
##UNITS=     HZ,            ARBITRARY UNITS, ARBITRARY UNITS
##FACTOR=    0.250966925370066, 1,           1
##FIRST=     8223.43324360094, -104775,      68659
##LAST=      0,             -27885,          -50518
##MIN=       0,             -776534,         0
##MAX=       8223.43324360094, 428739550,    0
$$ Real data points
##PAGE= N=1
##DATA TABLE= (X++(R..R)), XYDATA
$$ [...]
19524a63236B13585p2274N5299A4478a15926D334J47316a80726A1191b05793O5127
19513a40666C83355a33854r6985j52075A1696J33611h7565A38770n954a60734
19502b94071a28179A5358c5082o8006j5253o1411f0180G3549a83056R0085B07304
19490a69593c5544l58694C6711g2355J7709d906k44011N949i7002E9439F574h8273
19477b51681A11298e8218A8207e3987j34014A12655e9530r298k18343Q0256l0436
19466b37351F5174B444g76534f9461B64844a98458r3372a2361A24714b15436R9379
19455a16057A48050e8365o4918a1343l35012A45105h6219A78170a94296g4580
19444b68076h6355C15254b84776P2513I9999J0989d4799j91228B6149a41795k6271
$$ plain form
19524 -163236 213585 141311 196610 14478 -115926 4334 151650 -180726 11191 -205793 -140666
19513 -140666 383355 -133854 -230839 -382914 11696 145307 -87565 138770 132816 -160734
19502 -294071 -128179 15358 -35082 -103088 -118341 -179752 -60180 73549 -183056 -92971 207304
19490 -169593 -35544 -394238 36711 -72355 -54646 -4906 -248917 -242968 -97002 59439 6574 -88273
19477 -251681 111298 -58218 18207 -53987 -188001 112655 -59530 -68828 -287171 -206915 -237351
19466 -237351 65174 2444 -776534 -69461 264844 -198458 -291830 -12361 124714 -215436 -116057
19455 -116057 148050 -58365 -123283 -11343 -346355 145105 -86219 178170 -194296 -74580
19444 -268076 -86355 315254 -284776 -212263 99999 110988 -44799 -236027 26149 -141795 -168066
19433a68066C43097d5744A39802a16711n6626I0186a63081A2976N0606R8109G207
19421A2729c9244a0613I2356A3391L0260H958e6834a753n6933b010j11377F2572
19408I3467b4858q5475M643g878A51529a63995J8575O4718L7610o772B9388g3933
19395a98106g0266A30586A0991f3269l982j4336L7174A02127N2063D3040L6488
19384G9528a9877j02288B09664b15280j6654A3722K16744J951d10091a75736c3101
19372h4416j14558p0104K7373A54747A7879J84061a96934j07521P9794J9651j1222
19361b16232A24302b56251J02479D4151K17838a15223A0825L45613j44368c1817
19350a16471A74251b40814h2850l32291R7081J58745k63240d1791A8827J13281
$$ plain form
19433 -168066 343097 -45744 139802 -116711 -173337 90186 -163081 12976 63582 161691 7207
19421 12729 -39244 -10613 92356 13391 43651 8958 -56834 -1753 -58686 -2010 -113387 62572
19408 93467 -24858 -110333 -105690 -7878 151529 -163995 -145420 -80702 -43092 -49864 29388 -73933
19395 -198106 -70266 130586 10991 -63269 -67251 -81587 -44413 102127 154190 43040 79528
19384 79528 -19877 -122165 209664 -215280 -231934 13722 230466 232417 -410091 -175736 -33101
19372 -84416 -198974 -269078 -241705 154747 17879 201940 -196934 -304455 -224661 -205010 -216232
19361 -216232 124302 -256251 -153772 44151 261989 -115223 10825 356438 212070 -31817
19350 -116471 174251 -240814 -82850 -415141 -318060 -159315 -422555 -41791 18827 132108
19340A32108l3896D5201a38864r1373h6542B19137a04040n9854k41584J56673
19330b48805J07291k519j33639e6090m2525E0856L8517G367d25479e9326K5323
19319c4003k30824A8966o422d3265p919o1008D7468a36311o3837l4447d8051a5406
19306C7009a23038d3433q4053E5902g3811L2364A29037o1443c9367l5000m1440
19295a15807f273R21k97956q0536r9689i7252l2471A46424I374K51761a27712
19283C72757a51486D1825L6282a65991o4501e4779k12281c4102j25374A22759
19272B98296Q3956a66270J1840o8893g9490l23072i613j62846A54451A9012c3514
19260G9537d09966B0022K71280f0960F056b03028i758j06077k65982f6462p8113
$$ plain form
19340 132108 98212 45201 -138864 -230237 -86542 219137 -104040 -163894 -405478 -248805
19330 -248805 -141514 -144033 -277672 -56090 -98615 50856 89373 7367 -425479 -59326 -34003
19319 -34003 -264827 18966 12544 -43265 -51184 -112192 47468 -136311 -200148 -234595 -48051 -15406
19306 37009 -123038 -43433 -127486 55902 -73811 -41447 129037 67594 -39367 -74367 -115807
19295 -115807 -6273 -5352 -303308 -383844 -483533 -97252 -129723 146424 9374 261135 -127712
19283 372757 -151486 41825 78107 -165991 -230492 -54779 -267060 -34102 -159476 122759
19272 298296 382252 -166270 -154430 -223323 -79490 -402562 -9613 -172459 154451 19012 -33514
19260 79537 -409966 20022 291302 -60960 6056 -203028 -9758 -115835 -381817 -66462 -144575
19249a44575e2702q1999k50166a12207j32302J15536J3924l9283N1583B11617
19238F2856J22868P303D7072a681k68433a1004m4171A60276n7789P2385K33936
19227D08808q2906d0279j66516K1933f3152r4630A35857c81895a41702d8016A28765
19215f1844E9294b43416O111N8277b0567k8649A84726i7853o2677G9604b20979
19203E7508i895j28280A38473J3987c60515B5004O0949b41024A61452k5226B2649
19191f5243A5782c66107d7786F6212J38425a77509A71306a3195j94541r4778g1279
19179A68027a93795C6768J30417a09065C99441c5598H0955l2724M1825f0162A86419
19167C5094a44041F7491d2083C00414A45393o6296c92748e0238I0820D113a40525
$$ plain form
19249 -144575 -52702 -134701 -384867 -112207 -244509 -128973 -115049 -154332 -102749 211617
19238 62856 185724 193027 47072 -1681 -270114 -11004 -55175 160276 102487 174872 408808
19227 408808 325902 -40279 -206795 -184862 -63152 -157782 135857 -381895 -141702 -48016 128765
19215 -61844 59294 -243416 -237305 -179028 -20567 -49216 184726 -97853 -160530 79604 -220979
19203 57508 -9895 -138175 138473 152460 -360515 25004 85953 -241024 161452 136226 22649
19191 -65243 15782 -366107 -47786 66212 204637 -177509 171306 -13195 -207736 -302514 -71279
19179 168027 -193795 36768 167185 -109065 399441 -35598 80955 48231 90056 -60162 186419
19167 35094 -144041 67491 -42083 300414 145393 79097 -392748 -50238 90820 4113 -140525
19155b08667E1712O0012b59328O9642k8854K7593h2264J5663A73013q4579h3918
19143b84800h3590m6735c6188C4753b5680l21938j5313O3365c9090k0643q7291
19132a47024I1912a15800A22524c63681P4805A16063N0124h0268A96105b5444
19121a83480M8461e7957o515k6106c3006o2529C7986K26102a61896H7065J52605
19110B39670f1947l0648B146L00748g7940j9378D2849L693i6755j21387G7270
19098h8189b3290B4931I88c4439j81596c8560B90284a05312m246D2149g4406a4002
19085D1473P2228a58335b2459k36266A51397c42857J54809P8472L4518D1314a37508
19073E0213e1391G0985i4694l21830I907h6378j818q3645B56870H4284b50051
$$ plain form
19155 -208667 51712 111724 -259328 -189686 -218540 -190947 -82264 -66601 173013 88434 -83918
19143 -284800 -83590 -130325 -36188 34753 -25680 -347618 -362931 -299566 -39090 -59733 -147024
19132 -147024 91912 -115800 122524 -363681 -288876 116063 166187 -80268 196105 -25444
19121 -183480 -135019 -57957 -64472 -90578 -33006 -95535 37986 264088 -161896 87065 239670
19110 239670 -61947 -92595 2146 302894 -77940 -97318 42849 46542 -96755 -218142 77270
19098 -88189 -23290 24931 988 -34439 -216035 -38560 290284 -105312 -109558 42149 -74406 -14002
19085 41473 113701 -158335 -22459 -258725 151397 -342857 -188048 -109576 -75058 41314 -137508
19073 50213 -51391 70985 -94694 -416524 9907 -86378 -88196 -171841 256870 84284 -250051
19061B6177d8126p8645O2723l4408m7597A10053e04888D9929P8212Q7808b02604
19049a49715A32061A5587b6094j89372C3356d23877A95982E3700K60428j28147
19039A85981a11495C848c48418e0571j61621N2373k0207e2645A92116a92687b0077
19027C81495A45988g9057e466j27616A50373i3553J0725L4031l4813k65048A88023
19015a40511l3784J7922j04621I601b8875m2524l9612m1933l8299l893A0277a62744
19002A61468b25247A52392F6841a25501o1520c4876E23039I8804k2840a0176j21597
18991a31773k875L3276j86961b2424A45604a11986A2273J51874D8411c42813g1018
18979d0073j0814h754r7727l4097B56051b1654N952A92390b15182B06620b10844
$$ plain form
19061 26177 -48126 -126771 -64048 -98456 -146053 110053 -504888 49929 128141 215949 -202604
19049 -149715 132061 15587 -26094 -215466 33356 -423877 195982 53700 314128 185981
19039 185981 -111495 3848 -348418 -50571 -212192 -159819 -180026 -52645 192116 -192687 -20077
19027 381495 145988 -79057 -5466 -133082 150373 -93553 -82828 -48797 -83610 -348658 188023
19015 -140511 -174295 -156373 -260994 9601 -28875 -71399 -111011 -152944 -191243 -195136 10277 -162744
19002 161468 -225247 152392 66841 -125501 -187021 -34876 523039 98804 75964 -10176 -131773
18991 -131773 -134648 -101372 -288333 -22424 145604 -111986 12273 164147 48411 -342813 -71018
18979 -40073 -50887 -8754 -106481 -140578 256051 -21654 -15702 192390 -215182 206620 -210844
18967H9010Q0748c753j579q1482k1131L2575j85209D7453d5204l23535A4287a66406
18954d7604B35052b7455J3143A43952b55705E7102b56542I587h9087j53399G1265
18942A32167b80160a05667A07039e1059C7184a7607l143j66070A82697e8224m32065
18931d90289C8009J69824H4996a19738E6009a2507k00352B10261c46185c301I0001
18919A71846D486K2498g8128o0138a4233l49311d1727j52415N2932H4303b57528
18907E4218a72424B71323n6763d7736l6392C17397b67909B93244A33442E2811
18896i2822B4188a12739C82149d1359A002M7174J19338g4549j46337A36846m4244
18885I2602b64568g9118K6808A75590C3898k960a18182A54480a35539P797j87171
$$ plain form
18967 89010 169758 -3753 -5332 -86814 -107945 -75370 -260579 47453 -45204 -368739 14287 -166406
18954 -47604 235052 -27455 -14312 143952 -255705 57102 -256542 9587 -89087 -242486 71265
18942 132167 -280160 -105667 107039 -51059 37184 -17607 -20750 -186820 182697 -58224 -490289
18931 -490289 38009 207833 84996 -119738 56009 -12507 -212859 210261 -346185 -3301 90001
18919 171846 4486 26984 -78128 -138266 -14233 -363544 -41727 -194142 -141210 84303 -257528
18907 54218 -172424 271323 214560 -47736 -84128 317397 -267909 293244 133442 52811
18896 -92822 24188 -112739 382149 -41359 1002 48176 167514 -74549 -220886 136846 92602
18885 92602 -264568 -79118 -52310 175590 33898 30938 -118182 154480 -135539 -127742 -314913
18874c14913J22031R2825C29650B5333J64270p0362K8428K24849a85362A71960
18863B97873H9603m1814b82001f8703K7497j10572A81158a06782c9441F2307a14268
18851a56434g0996o8665e5738B05170l3974o0871Q0917a62700A87064a45453j96494
18840c41947L5186J44509A06778b05040l7801J02381B28362a11911F7468a56275
18829a03624B13226D6919d53013c4859j94077B25965G9191J06751b9479J3057
18819a6422B11799a05493C3692a59425j44232B80719g4021A13737E0207J97256
18809B47463L5781f7352b7366j38139l3256e7196I0615A6098a87022l4878D7358
18797f9682j20598d636C00989h5624k3718I7916h7803C00554G5610e0098n478
$$ plain form
18874 -314913 -192882 -100057 329650 25333 189603 119241 147669 372518 -185362 171960
18863 297873 89603 47789 -282001 -68703 -41206 -151778 181158 -106782 -39441 62307 -114268
18851 -156434 -70996 -139661 -55738 205170 171196 110325 191242 -162700 187064 -145453 -341947
18840 -341947 -306761 -162252 106778 -205040 -242841 -140460 228362 -111911 67468 -156275
18829 -103624 213226 46919 -453013 -34859 -228936 225965 79191 185942 -29479 -16422
18819 -16422 211799 -105493 33692 -159425 -303657 280719 -74021 113737 50207 247463
18809 247463 283244 -67352 -27366 -165505 -198761 -57196 90615 16098 -187022 -221900 47358
18797 -69682 -190280 -4636 300989 -85624 -109342 97916 -87803 300554 75610 -50098 -55576
18786e5576j44017H125c36651J55252g2405I7190c64672a28403E910M7299a92071
18774d2393j39886o6258d5640I166J90599a57272E6556a09676L8953A21878O1736
18763A83614g8748B15325D5666M1179N161b316j48557I8111a3259k16188B2420
18751d9455A60937a05567d5210H8223a70338C6051a39740G4720c06234h8747E1391
18739c53172B5714K2729a81400p5242d3407k69177a27749a2526l81919d5564J6955
18728b8609A77351m8833F1872K44821F335c79308c8263B40426b12595Q0089N6327
18717g6179a2899G0152J69399p5194b24347e4465E7839a08932n5486e2841q526
18706f1367l42912C0669i9l16108B07384E6920N3438b2153A71498d17172J73120
$$ plain form
18786 -55576 -199593 8125 -336651 -181399 -72405 97190 -364672 -128403 5910 53209 -192071
18774 -42393 -182279 -248537 -45640 9166 199765 -157272 56556 -109676 -70723 121878 183614
18763 183614 -78748 215325 45666 86845 92006 -2316 -150873 98111 -13259 -229447 22420
18751 -49455 160937 -105567 -45210 88223 -170338 36051 -139740 74720 -306234 -88747 51391
18739 -353172 25714 48443 -181400 -256642 -43407 -312584 -127749 -12526 -394445 -45564 -28609
18728 -28609 177351 128518 61872 306693 6335 -379308 -38263 240426 -212595 -132506 -76179
18717 -76179 -12899 70152 239551 164357 -224347 -54465 57839 -108932 -164418 -52841 -61367
18706 -61367 -404279 30669 -99 -316207 207384 56920 110358 -22153 171498 -417172 -244052
18695b44052F0835a87132B04018H1085h3680k6411r2775H7298b99453c7545I925
18683d0668A2816d8613j34643j61745a49117E85120b37287J05627C69398A69992
18672c87704B14994a29586A44905A4064J68938E9421a18595B19591g4982A38982
18661b23635A67369a43550F5497B4490N3136n350c2778B45909J20522j51935n3249
18650A61247a35618j78245B82687b09069q2409C2514a97707c2415j68268h5279
18639c3094j28026G8248a65704A29377b28591H5388g4129k82736a44095E7575
18628E5645a66859G3598e7690k20253b8317p6623d065j4395E913b33975A44245
18616a71530A88833a60498e9549m2945l95687a71011A89445A468d06474a40114
$$ plain form
18695 -244052 60835 -187132 204018 81085 -83680 -110091 -202866 87298 -299453 -37545 9925
18683 -40668 12816 -48613 -183256 -345001 -149117 585120 -237287 -131660 369398 169992
18672 -387704 214994 -129586 144905 14064 183002 59421 -118595 219591 -74982 138982
18661 -223635 167369 -143550 65497 24490 77626 72276 -32778 245909 366431 214496 161247
18650 161247 -135618 -313863 282687 -209069 -291478 32514 -197707 -32415 -200683 -85279
18639 -33094 -161120 78248 -165704 129377 -228591 85388 -74129 -356865 -144095 57575
18628 55645 -166859 73598 -57690 -277943 -28317 -104940 -4065 -18460 5913 -233975 144245
18616 -171530 188833 -160498 -59549 -102494 -498181 -171011 189445 1468 -406474 -140114
18605b21766D4159G608K7361j3400P1158f3139n9297B929d9197j13997e753j6483
18593b2236B36046c48276B4231b22756B28862F0959c94972a01665M0502K5066
18583c6097j79299i490j5045k50235f8439n5673k6766H608K5611a00147p7166
18572a77313l178D5705N7673C1701e4922q5483M5104A60378b12064c4559j32699
18561a67258I1295d10602A86606c4551j22854m8951B4060J1584R0529b08942P0547
18550a38395k1815k891q094A96636b10887A413a97532e4672B67110a19340I0382
18538c51441C4922c6804A92234J4782k2940M6050c7663j71166a03783b5886l7014
18527f2900B29796d7957q230p719l32419b5870A7443c0924C0584R1117H856C418
$$ plain form
18605 -221766 44159 7608 34969 21569 92727 -63139 -122436 2929 -49197 -163194 -5753 -22236
18593 -22236 236046 -348276 24231 -222756 228862 60959 -394972 -101665 -61163 -36097
18583 -36097 -215396 -9490 -24535 -274770 -68439 -124112 -150878 8608 34219 -100147 -177313
18572 -177313 -180491 45705 103378 31701 -54922 -140405 -95301 160378 -212064 -34559 -167258
18561 -167258 91295 -410602 186606 -34551 -157405 -206356 24060 35644 126173 -208942 -138395
18550 -138395 -160210 -163101 -171195 196636 -210887 1413 -197532 -54672 267110 -119340 90382
18538 -351441 34922 -36804 192234 207016 184076 230126 -37663 -208829 -103783 -25886 -62900
18527 -62900 229796 -47957 -56187 -63906 -396325 -25870 17443 -30924 30584 121701 8856 3418
18514H8487g5909C6992e8005E2856K6179K0661i4526c5780p888B10328a51317
18502b17882N4853k60720B23835d6129k7808A0667b9712H6614b14499C2002a12990
18490a29937h950l16208A12294a80378g329n0787n1684K334b6691H3900c02616
18478e3253L863o3904d5495p195l15919J78846C167a032B17417h3439k88086A0642
18465A92500G3026d1450j9894B08876G3869l1827c6138n1662B52082j25273h2322
18453d017A12471O4632e138k92750c9793F0004a00567i753B3868R8506g0326j01033
18441a71359B6907J18494a58746j16236m8810A31712a17148D220g496I6948i7359
18429A28067a10333j5168F2423q694a39257l9269P2452k4995J1195B1553J2370
$$ plain form
18514 88487 -75909 36992 -58005 52856 79035 99696 -94526 -35780 -43668 210328 -151317
18502 -217882 -163029 -423749 223835 -46129 -73937 10667 -29712 86614 -214499 32002 -112990
18490 -129937 -8950 -325158 112294 -180378 -7329 -58116 -109800 -107466 -26691 83900 -302616
18478 -53253 -49390 -113294 -45495 -52690 -368609 -189763 3167 -1032 217417 -83439 -371525 10642
18465 192500 73026 -41450 -61344 208876 73869 42042 -36138 -87800 252082 126809 -82322
18453 -4017 112471 177103 -5138 -297888 -39793 60004 -100567 -9753 23868 122374 -70326 -171359
18441 -171359 26907 145401 -158746 -274982 -323792 131712 -117148 4220 -7496 96948 -97359
18429 128067 -110333 -125501 62423 53729 -139257 -178526 -106074 -131069 -119874 21553 33923
18418C3923J40325c15685a6012D68262A87001b59490A31959A9268N9320d7025
18407a82645K419D9018J60154l535a62649a6228C3614J01863N6653b01578c4274
18395C02207A05886K50841b83696J01344G3552f6151o2347A11395J78524c1389
18384f995A07555a13079D05276G7078b1723j1991B47719a10174c1680l05552I3619
18372e1157j90864M2139E4729J92977c3815H1584O4124c0815a0219B08891c3831
18360A17542l8487L6539g8161j15034h8512j99264D4581g8849j55074a1802A16206
18348d8418l28388A73869C3065F316b42636H3935a28388i042C1596K6351a14408
18336A23639B2098e1103B64820C7556a38281A55286a35387j48838o1369R5182
$$ plain form
18418 33923 174248 -315685 -16012 468262 187001 -259490 131959 19268 78588 -47025
18407 -182645 -180226 49018 209172 205637 -162649 -16228 33614 135477 192130 -201578 -34274
18395 302207 105886 356727 -283696 -182352 73552 -66151 -128498 111395 289919 -31389
18384 -6995 107555 -113079 405276 77078 -21723 -33714 247719 -110174 -31680 -337232 93619
18372 -51157 -242021 -199882 54729 247706 -33815 81584 145708 -30815 -10219 208891 -33831
18360 117542 79055 115594 -78161 -193195 -88512 -287776 44581 -78849 -233923 -11802 116206
18348 -48418 -376806 173869 33065 6316 -242636 83935 -128388 -9042 31596 57947 -114408
18336 123639 22098 -51103 264820 37556 -138281 155286 -135387 -284225 -345594 -250412
18326b50412j2443a7924k64431B1498K82965a98243E5030L7669k6629a48334m3293
18315a91627H8603i4107j41482H6983D1920i5105C7161J19061b26898A77665a15062
18303a70320e9764N382J9275p15D4963L9525a1146C98683A98180h1855n257A09316
18290F3618a17126B9185b36350e4343A00103K46764j47927r944m5735e7033j49783
18279b06816l5585e7154F380L579i1524A01543g1406j388B41512b23997R8732
18268a25265o0500p5582A94080J58642b62490R4183N6527j50452P0003n134R8515
18257i8848b3717F3142Q4234E5499R2517f3153B1675J47200L7312b12950d8781
18245A41903a82286E2772c935B16743b92295R1845P5638K1860E8442a9941o7666
$$ plain form
18326 -250412 -262855 -17924 -282355 21498 304463 -198243 55030 92699 66070 -148334 -191627
18315 -191627 88603 -94107 -235589 86983 41920 -95105 37161 156222 -226898 177665 -115062
18303 -170320 -59764 -54382 -35107 -35822 44963 84488 -11146 398683 198180 -81855 -87112 109316
18290 63618 -117126 29185 -236350 -54343 100103 346867 198940 188996 143261 -57033 -206816
18279 -206816 -242401 -57154 6380 9959 -91524 101543 -71406 -72794 241512 -223997 -125265
18268 -125265 -185765 -261347 194080 352722 -262490 -168307 -111780 -262232 -192229 -197363 -98848
18257 -98848 -23717 63142 147376 55499 148016 -63153 21675 168875 206187 -212950 -48781
18245 141903 -182286 52772 -3935 216743 -292295 -200450 -124812 -102952 58442 -19941 -87607
18234h7607H3493J19324e0544j0827C13823F8768i8845K9285j53086B70491a66743
18222a86076f2952B83538b63499R0789A18303c37508i1315E8343f170k81359a31144
18210C91729h5051L3672o173C9918b32226A37074O0880e6700b2087B546a35153
18198F0783a82735A46574a76631D6030a8507j31550G654a14599o4385A2273J4741
18187B7014b02999K9825h0177A3228h6249r8090B7188a86500P7244a0296n2409
18176f2705q2512B5129a32487l1712A7064a58430E604a37705J9566j58141I6933
18164a06779d4797q1403D1538a87890C7876a33028H7247f4069j06331A83273e8778
18152A05094J11465O183C0680F430a24868j18737A04839d0721j21657g7875C6923
$$ plain form
18234 -87607 83493 202817 -50544 -61371 313823 68768 -98845 -69560 -222646 270491 -166743
18222 -186076 -62952 283538 -263499 -172710 118303 -337508 -91315 58343 -6170 -287529 -131144
18210 391729 -85051 -51379 -57552 39918 -232226 137074 197954 -56700 -22087 2546 -135153
18198 60783 -182735 146574 -176631 46030 -18507 -150057 7654 -114599 -178984 12273 27014
18187 27014 -202999 -173174 -80177 13228 -86249 -184339 27188 -186500 -109256 -10296 -62705
18176 -62705 -145217 25129 -132487 -164199 17064 -158430 5604 -137705 -118139 -276280 96933
18164 -106779 -44797 -126200 41538 -187890 37876 -133028 87247 -64069 -170400 183273 -58778
18152 105094 216559 222742 30680 6430 -124868 -243605 104839 -40721 -162378 -77875 36923
18140c09012B3271g3169B98438a24762j09485D3147g0290j75655A80947a15634
18129d0206a8320a350j74162K5062A02025l7974b51277A80326a91245C0369c69301
18117A2762b36446D4191b44945A30992K29215E1953a24336A36667f2311A13849
18106a5820E9739P1032A8312a07384D2440a6850B00013E4431O2281a86112O2091
18095a24021A25625a08451c424j08029J2196A34704J32218b56073I6618b15315
18084B18153a10690A35079a27059E9511q330Q2596k5029b70719B0390J50733a69277
18072b60870A09222K16135A18808a24805h034A20048i3696J7437A3924J13523
18062A27447J74568a04910B38876a88980l7303E9110K6200l2952J72416a73650
$$ plain form
18140 -309012 23271 -73169 298438 -124762 -234247 43147 -70290 -245945 180947 -115634
18129 -40206 -18320 -1350 -175512 -150450 102025 64051 -251277 180326 -191245 30369 -369301
18117 12762 -236446 44191 -244945 130992 360207 51953 -124336 136667 -62311 113849
18106 -15820 59739 130771 18312 -107384 42440 -16850 200013 54431 116712 -186112 -124021
18095 -124021 125625 -108451 -3424 -111453 -99257 134704 266922 -256073 96618 -215315
18084 218153 -110690 135079 -127059 59511 51181 133777 108748 -270719 20390 171123 -169277
18072 -260870 109222 325357 118808 -124805 -8034 120048 -93696 -76259 13924 127447
18062 127447 302015 -104910 238876 -188980 -226283 59110 85310 52358 224774 -173650
18051I2521c2819r650A42311J8570a31129D44308a70674A275i1340k88073d1511
18039G6550a61659B60545c75947E5064L9946e2380H1753a7332A17713I574K61014
18028B70588G957J83824G0867B3010a44220A3331a21367b1514j23093j51904B46517
18016A5929N749L14869j35860b24049J0147D5190K63754o7360a25584D2906d875
18004a60542K7995A61569m0886g4993A90866a83100N9343J2904o6561b3038j90871
17993b13909i1299b4190k71315a15779L3086B39092b68957A70408G9398O0390
17983A39788E0184J5736e0247I144a46646A90648a91536k46394d1706A66105c66145
17971G7062J64214F9589B9825b286H2716K84218A36591b1350j99787j98380f5366
$$ plain form
18051 92521 -32819 -42469 142311 160881 -131129 444308 -170674 1275 -91340 -379413 -41511
18039 76550 -161659 260545 -375947 55064 95010 -52380 81753 -17332 117713 9574 270588
18028 270588 7957 191781 70867 23010 -144220 13331 -121367 -21514 -144607 -296511 246517
18016 15929 21678 336547 200687 -224049 -213902 45190 308944 241584 -125584 42906 -4875
18004 -160542 -132547 161569 120683 -74993 190866 -183100 -123757 -110853 -177414 -23038 -213909
17993 -213909 -91299 -24190 -295505 -115779 -82693 239092 -268957 170408 79398 139788
17983 139788 50184 65920 -50247 9144 -146646 190648 -191536 -437930 -41706 166105 -366145
17971 77062 241276 69589 29825 -2286 82716 366934 136591 -21350 -221137 -419517 -65366
17959b93606I5470J8499J29490k0314g3123H96b19621a8553l12731C5063F532
17947a12746e3124k20420c8658A77245c5772o3225A87360E2157b23949A13345
17936h0493B4840c37367A37758a46035n3384A43367A695e9331l24872E2720c48768
17924E1571j3349g4369D0401a33576n8460r3817R5999I6915P7000D7630J60278
17913B07908d88782B1207a550k906r5180I859a5011j25396A23056M1976b28805
17901E69972c96708A3250N35205b55676B75399f6643j54680B33038a70868b1306
17890A7282K20374q8358c00570A39167f7605C84780D5187L36789c81044C1744
17879e6184B9074f213A51603g5514B47612a63788m510C38722n2240i8657D923
$$ plain form
17959 -293606 95470 113969 243459 223145 -73123 896 -219621 -18553 -331284 35063 6532
17947 -112746 -53124 -273544 -38658 177245 -35772 -98997 187360 52157 -223949 113345
17936 -80493 24840 -337367 137758 -146035 -199419 143367 1695 -59331 -384203 52720 -348768
17924 51571 38222 -74369 40401 -133576 -192036 -285853 -189854 96915 173915 47630 207908
17913 207908 -488782 21207 -1550 -4456 -99636 9859 -15011 -140407 123056 165032 -228805
17901 569972 -396708 13250 548455 -255676 275399 -66643 -221323 233038 -170868 -21306
17890 17282 237656 149298 -300570 139167 -67605 384780 45187 381976 -381044 31744
17879 -56184 29074 -6213 151603 -75514 247612 -163788 -168298 338722 286482 -98657 4923
17867b22524A34191e864A32626E9477J31390a2932H852J50756m6097K3796b24198
17855d8542o0923h03A69088a66897I1830K02480b82589f5673A6210a84421j8306
17844b02727g3747k9864l67278A0651K19882a00321c4527p6049A08986a25626
17833a1736j07721A52969J87185A60521k8478L2781j0371j9262D6961P0600A2470
17821a53235D5185J03886g425o0017B8266K03593b18722C3300A1317a10945A76141
17809B57903b4279E6088k158b27194a04813B48072a68481N4284Q346D9369G900
17797a9175j93209H7868b39556A55J99331g6836b3552A69413k3801j9908e8645
17785a64996d9408A16538a66395B58707r1808C1283L29502f6351D6757M4933L9214
$$ plain form
17867 -222524 134191 -5864 132626 59477 190867 -12932 8852 159608 113511 137307 -224198
17855 -48542 -109465 -803 169088 -166897 91830 294310 -282589 -65673 16210 -184421 -202727
17844 -202727 -73747 -103611 -470889 10651 230533 -100321 -34527 -110576 108986 -125626
17833 -11736 -119457 152969 340154 160521 132043 164824 154453 135191 46961 117561 12470
17821 -153235 45185 149071 -7425 -67442 28266 231859 -218722 33300 11317 -110945 176141
17809 257903 -24279 56088 53930 -227194 -104813 248072 -168481 -114197 -105851 49369 7900
17797 -19175 -212384 87868 -239556 155 199486 -76836 -23552 169413 145612 125704 -58645
17785 -164996 -49408 116538 -166395 258707 166899 31283 360785 -66351 46757 91690 130904
17774A30904a67118A20153K8933h4803j30804f2714B50703r8276D8117L623d1996
17762b0000A34544g1718A78837F4426a63716A8246a90905f6592D56771b4787B00688
17750B46509n2623I1610K39416G0031j7947c346A03679L10975A30392l7881g7995
17738A33943a50793C4485j3031c51029G1778A1481J92475o6702N2896d7697C27904
17726D3823a73569M6960B3923K07082i6802A96091f7838j02016H0153f5743j06379
17715a72122c8295A44702a76715F5303b77440a33012k3343A98180E582a67067
17704b58747E80165F7477l2501b51483A0965b7211k18688C0094L88908D9400K30146
17693B79546j11562J03547Q7566o7539a21729C3917f5504A69760C9994f0749a1641
$$ plain form
17774 130904 -167118 120153 149086 -84803 -215607 -62714 250703 152427 48117 51740 -41996
17762 -20000 134544 -71718 178837 64426 -163716 18246 -190905 -66592 456771 -24787 200688
17750 246509 193886 91610 331026 70031 52084 -3346 103679 414654 130392 92511 -77995
17738 133943 -150793 34485 21454 -351029 71778 11481 203956 137254 190150 -47697 327904
17726 43823 -173569 -126609 23923 231005 -96802 196091 -67838 -169854 80153 -65743 -172122
17715 -172122 -38295 144702 -176715 65303 -277440 -133012 -156355 198180 5582 -167067
17704 -258747 580165 67477 34976 -251483 10965 -27211 -245899 30094 419002 49400 279546
17693 279546 167984 271531 359097 291558 -121729 33917 -65504 169760 39994 -60749 -11641
17681B39071F1287b14173A05631M3530J4087b83457A79975o5794A984L45778A26624
17669f2197j0977A7789D889f1955F6052g3864C1892a10685A64494h0226K1876
17658e8350P356A78093b08283C73282e2933B54124b65269I4384m2517a52522A12115
17646A99199r2675D0896K71711q5053j7759E0364i5576A12311B7321j1333J96041
17635B12029N7444a39044q961C31914A5077b34532D3203L7329J28664n086J87827
17624C91937c31878G6504h5600A84183f024k72413J31844C24421M2156j43877
17614B22700R4396a4895A72891a57421n7714B08570C6788h9300A41513M81J15358
17603B57352A2600d8773I7842B9455J40118p4026J06792N6964J9163D0873a82364
$$ plain form
17681 239071 61287 -214173 105631 149161 163248 -283457 179975 114181 1984 347762 126624
17669 -62197 -73174 17789 4889 -61955 66052 -73864 31892 -110685 164494 -80226 -58350
17658 -58350 -50994 178093 -208283 373282 -52933 254124 -265269 94384 51867 -152522 112115
17646 199199 106524 40896 312607 227554 209795 50364 -95576 112311 27321 15988 212029
17635 212029 269473 -139044 -148005 331914 15077 -234532 43203 80532 209196 204110 391937
17624 391937 -331878 76504 -85600 184183 -6024 -278437 -146593 324421 366577 222700
17614 222700 317096 -14895 172891 -157421 -215135 208570 36788 -89300 141513 141994 257352
17603 257352 12600 -48773 97842 29455 169573 95547 202339 259303 278466 40873 -182364
17591b91669D8710g4132B96072d74o3358A7976g33m20764C21554J67274I8315
17579d3246k8431C9980R0652k4080K26103d87004D2687a4625B21867R767I960
17567I0918B829Q4038K60938H8921N4178k8289J45932A22674p441N2238i2744
17555a66749D14321k7584A3956a72414L2177d2962B91426E4689c3493A80076a46445
17543A97330l3777b0597m5850A48670g4043B31102g3121B33546q9988E4415J54636
17532B09051E7000P3605L55307A81762N0117F2769J03583m0353P5599o1516L33285
17521D73367J62870F3002K58362A11902O5737k637b729C64506c9443C95825j29386
17510B66439D5202J52499k9111J84249P4950J22466B70325J95180I7890N8143
$$ plain form
17591 -291669 48710 -74132 296072 -474 -63832 17976 -733 -421497 321554 488828 98315
17579 -43246 -71677 39980 130632 106552 332655 -487004 42687 -14625 221867 231634 9960
17567 90918 2829 86867 347805 88921 143099 114810 260742 122674 115233 167471 -92744
17555 -166749 414321 386737 13956 -172414 -140237 -42962 291426 54689 -33493 180076 -146445
17543 197330 163553 -20597 -66447 148670 -74043 231102 -73121 233546 143558 54415 209051
17532 209051 57000 130605 485912 181762 231879 62769 166352 125999 201598 140082 473367
17521 473367 636237 63002 321364 111902 177639 175002 -2729 364506 -39443 395825 266439
17510 266439 45202 197701 168590 352839 427789 550255 270325 465505 97890 156033
17500A56033J93709E7859J72853a7885j23662A37773J46723O4429f1375F7040
17489H6565P6824j9861a06874j19262C59793F502J21532j2019m2763J68774A1715
17477c6039A15981d7423B92546a39643A2407K62366j11042C9949M52192A07160
17466f732B62755b34156E7719A816J14271D3753a31319A56009O2464Q4744j3751
17455B89466J72380A3195L8429J71374p640J34979A49227M01329F8827K02008
17445B70835l3591r9802J85348J39386B19412c6742D36658j60517c5544A46861
17434E22888j34802j7019j06790g7979A32647J84538a62152A71946p3194J79947
17424B78699j0450j09529A6243K12926C6634K63778R8547a01691A61124p2053
$$ plain form
17500 156033 349742 57859 230712 -17885 -141547 137773 284496 348925 -61375 67040
17489 86565 163389 143528 -106874 -226136 359793 6502 128034 116015 73252 242026 11715
17477 -36039 115981 -47423 292546 -139643 12407 274773 163731 39949 492141 107160
17466 -6732 262755 -234156 57719 1816 116087 43753 -131319 156009 218473 303217 289466
17455 289466 461846 13195 51624 222998 215358 350337 149227 550556 68827 270835
17445 270835 237244 137442 322790 462176 219412 -36742 436658 276141 -35544 146861
17434 522888 388086 371067 264277 -77979 132647 317185 -162152 171946 98752 278699
17424 278699 268249 158720 16243 229169 36634 300412 398959 -101691 161124 89071
17414H9071K61348j3120j9530Q9632B00419b28681E7700d32062B83733J2978q8243
17403B08468K35428a73295A31083L03704b85114C8671K97059j10827J70011I5948
17392A7192J36101K17109j11139a53312A96880a51824c1714A63607K81522A66318
17381b1815C68387D367a2983B6787E447K89165E7363J63773b81216A23612d448
17369a84493A41699j5929C0002K99398i2438A52443O2895K47704A29042M0154
17359A69196a17996A90953m5547J28422J33989a00676B49701A18646j8294E0095
17348a35404G16557B80828a0081C82545E4083J26512J6210p3730J4223M7433K19009
17337D03740A11111j890C5512J81926L1814d2506n5172C08281A40230O6645R5159
$$ plain form
17414 89071 350419 337299 317769 407401 200419 -228681 57700 -432062 283733 296711 208468
17403 208468 443896 -173295 131083 434787 -285114 38671 335730 224903 394914 95948
17392 17192 153293 370402 259263 -153312 196880 -151824 -31714 163607 445129 166318
17381 -21815 368387 4367 -12983 26787 5447 294612 57363 221136 -281216 123612 -4448
17369 -184493 141699 125770 30002 329400 -92438 152443 215338 463042 129042 169196
17359 169196 -117996 190953 145406 273828 407817 -100676 249701 118646 100352 50095
17348 -135404 716557 280828 -10081 382545 54083 180595 196805 123075 137298 184731 403740
17337 403740 111111 109221 35512 217438 249252 -42506 -97678 308281 140230 206875 302034
17326C02034J32047j48889Q0345D0462K86224o4114l7675M54691B81251b31637
17315A60819J0342J14836M4681j02702q9705a1191q7177B66319A22784J69669
17305B92453A33840J95753j21651M16225E3368J61392D0436J13010J96762A10306
17294C31304J8263j39238J15584j45576f7396J6635B58107I3826J11584B6654
17283B23955Q0692j44769m8615O0081G6342N13952H1380B4621L94420b4925A97528
17271F17908a00405A98457J15253E5131K97822f1711A65563P4056J81196A66721
17260B22387k8327j6407J59074a23919b0921C98849j41326J51909A33178J61965
17250B95143o5607A01890J1985h3477G8069K8632K49018j51963l0834a49101a8947
$$ plain form
17326 302034 434081 285192 365537 40462 326686 262572 224897 679588 281251 -231637
17315 160819 171161 285997 330678 227976 138271 -11191 -98368 266319 122784 292453
17305 292453 133840 329593 207942 624167 53368 214760 40436 153446 350208 110306
17294 331304 349567 210329 325913 180337 -67396 -50761 258107 93826 205410 26654
17283 223955 304647 159878 111263 171344 76342 590294 81380 24621 419041 -24925 197528
17271 617908 -100405 198457 313710 55131 352953 -61711 165563 239619 420815 166721
17260 222387 194060 177653 336727 -123919 -20921 398849 257523 409432 133178 295143
17250 295143 229536 101890 113875 -83477 78069 106701 355719 203756 172922 -149101 -18947
17238B43977K22348Q0030A93045O0098A00128D2945K80684a70326C60317n8507
17228C01810A14953R8743O4107A10308J15675J1255j08236n0328N13908B389M63312
17217D65701j66607J08092F6262L58638r9917M8462A71966R3739r7083O9925G1744
17205D26553M0046k27213K58769H7123K71718j05236J33930o9452j12612o7498
17195A37973f6239C68811n509A79349p7165K28607K14042B66685O8454j1509N1804
17184C75434M5612O6473k18427k2092O4056R4595j32183F0962M41261k8926A62027
17172E86460k24311A32547L08869A92770K73348A81335M13897B62467N7322A41829
17161D64582p0665p7363N3351M6671m4265A49356L43622j84582B6101L22256j24011
$$ plain form
17238 243977 466325 546355 193045 253143 100128 42945 323629 -170326 360317 301810
17228 301810 114953 213696 277803 110308 225983 237238 129002 78674 592582 2389 465701
17217 465701 299094 407186 66262 424900 324983 373445 171966 265705 168622 238547 71744
17205 426553 466599 239386 498155 87123 358841 253605 387535 318083 205471 137973
17195 137973 -66239 368811 363302 179349 102184 330791 544833 266685 335139 323630 375434
17184 375434 421046 487519 269092 247000 311056 405651 273468 60962 502223 473297 162027
17172 586460 362149 132547 441416 192770 466118 181335 595232 262467 319789 141829
17161 464582 393917 316554 369905 416576 372311 149356 492978 308396 26101 348357 224346
17150B24346J34300K0551J58609f3514C70192j83046M53454k59539J48376k04508
17140C24929q0553J58223Q8526B17841J5393K02706A53995J63529J49469j96139
17130B70854J81220P8293k4531J18925k34975n9994L10283k01473j53729K17399
17120E02272L1698j0444k04013J13953k781J20453j58969N200j0802Q1467O9617
17109E37651j18768A69062N28708B23505K23253J00740q3561j49067K14823K1194
17099E50887n6176k43804K5984J33215O731j9182L26928L3158C67993J70911N9150
17088E98054n0886A21520M06047A64199L95042j6474k37231J82638J03587j21558
17078D70203l0094j25813M38756k90025B12351L88104j66889j26659N80841l53281
$$ plain form
17150 224346 358646 379197 537806 -63514 370192 187146 640600 381061 529437 324929
17140 324929 244376 402599 491125 217841 233234 435940 153995 317524 466993 270854
17130 270854 452074 530367 505836 624761 389786 329792 640075 438602 284873 502272
17120 502272 533970 523526 319513 433466 430685 551138 392169 397369 386567 468034 537651
17109 537651 418883 169062 697770 223505 446758 547498 463937 314870 529693 550887
17099 550887 494711 250907 276891 410106 416837 397655 724583 757741 367993 538904 598054
17088 598054 547168 121520 527567 164199 559241 542767 305536 488174 591761 470203
17078 470203 440109 314296 753052 463027 212351 600455 433566 306907 887748 534467
17068E34467J1881j92210J1992M9687r5127J5596N9837L51826l17069o7987J66183
17057E29076R2325o6354R0538j79323j12517J21038K32512M6281K3564l36266
17047D40874K47253j5746j00444j87600K20355R0371C13050N26493r3515r8639
17037F47389j09798N38950k66201k23771j06268M29302j69568k45162K86848J254
17027G82975k18955L34485k49575m4926N3668o174k4335L84865p4336k47866J51562
17016H41388J97535l64159K87532o980N5224k49697M01462j18001k94950K22804
17006I72158P9768j89896J64977l14183R4226j70134L09237l4861j98726K2788
16996G35354P8966K1130N532k3716K78321r5790N2635P2686m02692M71074k82363
$$ plain form
17068 534467 546348 354138 366130 415817 320690 336286 396123 747949 430880 362893 529076
17057 529076 621401 555047 645585 466262 353745 474783 707295 753576 777140 440874
17047 440874 688127 672381 571937 384337 604692 695063 313050 839543 746028 647389
17037 647389 537591 1076541 810340 586569 480301 909603 740035 494873 781721 782975
17027 782975 564020 898505 648930 604004 657672 651498 627163 1012028 937692 689826 841388
17016 841388 1038923 674764 962296 955316 1010540 760843 1162305 1044304 749354 972158
17006 972158 1051926 862030 1027007 712824 807050 636916 946153 911292 712566 735354
16996 735354 814320 835450 840982 817266 1095587 999797 1052432 1125118 722426 1193500 911137
16985I11137K89180p2093K73006m48215R455L36116j29558N5306l85633K11823
16975A050524K03122m39612K50864o2977m9273O5353k8049p751M83349m34437
16965A031113J95558k53101L0636L48444j11115k35496L44370R631j92151J07866
16955A275755j48560J46073P8084K67515j57153n5303Q7656j56986j20973K45585
16945A461693j08810K453J63408n5393n4293L1732k081M1494k42327J38006J17625
16934A493507k2599j46421M70522j37192l03258K71586J82244L2880j80142P7072
16924A738199j46729K72763j80861L8067l06880L62219K59760k06484J972O7499
16914A899525M3516J68767m4716m0193p7916L42240J41013l99229J43431K66832
$$ plain form
16985 911137 1200317 1128224 1401230 953015 962470 1298586 1169028 1224334 838701 1050524
16975 1050524 1253646 814034 1064898 1001921 952648 1018001 989952 982201 1465550 1031113
16965 1031113 1226671 973570 1004206 1352650 1241535 1006039 1350409 1360040 1167889 1275755
16955 1275755 1127195 1273268 1351352 1618867 1461714 1406411 1494067 1337081 1216108 1461693
16945 1461693 1352883 1355336 1518744 1463351 1409058 1440790 1438709 1480203 1237876 1375882 1493507
16934 1493507 1470908 1324487 1795009 1657817 1354559 1626145 1808389 1841269 1661127 1738199
16924 1738199 1591470 1864233 1683372 1721439 1414559 1776778 2036538 1830054 1832026 1899525
16914 1899525 1943041 2111808 2067092 2026899 1948983 2291223 2432236 2033007 2176438 2443270
16904B443270n00701R1383L32112J17498r2291P9249m5915J31158j24316k06035
16894B225412o2453M55312k31153J65607K51679j75229k43402J88565K77424K31924
16884C083686j03896j758J64409k70835j68163N93161j67929l75029N87124j99095
16874C141675J748m7486J71536k443K30914K54544n4701n233j93485L19804J08877
16863C925750m5988M1422R1980q4205M6853L60733o6655J13395j34733K97531
16853D546083o7994O8718M9855J80543j04203r3548K24079L20486k6055M1820
16843E139784J29538n9646L21930k32659L38377J17533K64077J29632j12813J69076
16833F204829J27185P5518N9051M02787L1023Q7918j6793M79992n6212J10796
$$ plain form
16904 2443270 1942569 2033952 2366064 2483562 2391271 2470520 2424605 2555763 2431447 2225412
16894 2225412 2162959 2618271 2387118 2552725 2804404 2629175 2385773 2574338 2851762 3083686
16884 3083686 2979790 2978032 3142441 2871606 2703443 3296604 3128675 2753646 3340770 3141675
16874 3141675 3143423 3095937 3267473 3265030 3495944 3750488 3695787 3690554 3497069 3816873 3925750
16863 3925750 3879762 3921184 4013164 3928959 3975812 4336545 4269890 4383285 4248552 4546083
16853 4546083 4478089 4546807 4596662 4777205 4673002 4579454 4803533 5124019 5097964 5139784
16843 5139784 5269322 5209676 5531606 5298947 5637324 5754857 6018934 6148566 6035753 6204829
16833 6204829 6332014 6407532 6466583 6869370 6900393 6988311 6971518 7451510 7395298 7506094
16823G506094K77157K68478K6729K42042k36821N37729L09724K0241K44406R8372
16813I294151J81073K13320M58969K03183J22664M31782J89579L33523L04825
16804A1733069l28365P19442R4491O43946Q0795L26663M88433L02368J03207O36441
16794A4800490M70996P5123O85747M88547M98865N62224J3073Q44511O60604J66921
16784A9267101O56021Q17290L70443N79451R96466N49264J089671K43023J011393
16775B5580123Q07482O47689Q73631Q24198J186391J061021P72501J316985R90706
16766C4060727J374403J314160J248504J586575J199333J390401J642270J702417
16758D5518790J914416J375663K000329J420903J928895K328595J672158K415218
$$ plain form
16823 7506094 7783251 8051729 8078458 8320500 8083679 8621408 8931132 8951373 9195779 9294151
16813 9294151 9475224 9688544 10147513 10350696 10473360 10905142 11094721 11428244 11733069
16804 11733069 11404704 12124146 12218637 12862583 12943378 13270041 13758474 14060842 14164049 14800490
16794 14800490 15271486 15346609 16032356 16520903 17019768 17581992 17595065 18439576 19100180 19267101
16784 19267101 19923122 20740412 21110855 21690306 22686772 23236036 24325707 24568730 25580123
16775 25580123 26387605 27035294 27908925 28733123 29919514 30980535 31753036 33070021 34060727
16766 34060727 35435130 36749290 37997794 39584369 40783702 42174103 43816373 45518790
16758 45518790 47433206 48808869 50809198 52230101 54158996 56487591 58159749 60574967
16750F0574967K152690K139350K191023K351543K228935K274106K433845K581326
16742G8927785K739246K067253K270663K643476J891574K484101J820144J827015
16734I6671257J680438J408766J527353P55864J069283P44285K54348J39088K28306
16725A04478988n18047n98905n61684j014923j399188j376770j535732j361285
16717I6112454k229089j963052k285693k362566j916815k504945k384146k286741
16709G8179407k443348k103846k582860j992485k233890j920229k075017k554833
16701F0272899j717883k128535j843857j698058j738970j873350j717460j573005
16693D5981781j294320j602876j375232j212686j434580j199567j459865q06172
$$ plain form
16750 60574967 62727657 64867007 67058030 69409573 71638508 73912614 76346459 78927785
16742 78927785 81667031 83734284 86004947 88648423 90539997 93024098 94844242 96671257
16734 96671257 98351695 99760461 101287814 102043678 103112961 103857246 104111594 104250682 104478988
16725 104478988 103960941 103362036 102800352 101785429 100386241 99009471 97473739 96112454
16717 96112454 93883365 91920313 89634620 87272054 85355239 82850294 80466148 78179407
16709 78179407 75736059 73632213 71049353 69056868 66822978 64902749 62827732 60272899
16701 60272899 58555016 56426481 54582624 52884566 51145596 49272246 47554786 45981781
16693 45981781 44687461 43084585 41709353 40496667 39062087 37862520 36402655 35596483
16685C5596483r53629j416372j039554j038846o54770j164148r60370n71042q91772
16676B6905980p50125r07361m83577n32967r20050r05490k14058r13686o48723
16667B0629943j93367o94579n81504j84903o20940n19188m30690j69076m65091
16658A6770605n96556j27938n99970k3607r33962k04363j77167k29500k18597
16649A3658945k18255p26216K56722q17692l56280L44951j70648q24801j7850
16640A1128876N5836l36695n11949O9105K37915p44323L206n10553j6079r311
16630I366028n31410K07376k56606l24847N8977j40825j11536n24524K4755k62950
16620G504438K8931k2698l28108n8961K13238k61245n30452J04213K09954J5577
$$ plain form
16685 35596483 34642854 33226482 32186928 31148082 30493312 29329164 28368794 27797752 26905980
16676 26905980 26155855 25248494 24764917 24231950 23311900 22406410 22192352 21278666 20629943
16667 20629943 20436576 19741997 19160493 18975590 18354650 17835462 17404772 17235696 16770605
16658 16770605 16174049 16046111 15446141 15422534 14488572 14284209 14107042 13877542 13658945
16649 13658945 13440690 12714474 12971196 12153504 11797224 12142175 11971527 11146726 11128876
16640 11128876 11184712 10848017 10336068 10405173 10643088 9898765 9901971 9391418 9375339 9366028
16630 9366028 8834618 9041994 8785388 8460541 8519518 8378693 8267157 7742633 7767388 7504438
16620 7504438 7533369 7510671 7182563 7123602 7336840 7075595 6545143 6649356 6859310 6874887
16610F874887m08367k13078k22225K68344k4602k07018k36195j66103K93419k88428
16600E670634R6401l24380K26603k76324J3462O5866j89653k44642J44984J09446
16590E292397l27276P5379k28917l82416J54539J59052k0515l21719l031N7911
16580D455404j83306j2660k76185N99260m94930k50879K28829j08684j02371J11904
16570C966382j12818m1707j44141J32941j62008k4404L86915j91836k16211o0734
16560C532379N2719l45405K04767k24796j8595J01587j3664j2652k24972K62005
16550C313373k91998m8700K15559j35992J48250k66015J28375J52639n41439K50078
16540B924130j12132n0334M1225j94985K02449k981k40244L24983n08060L20183
$$ plain form
16610 6874887 6466520 6253442 6031217 6299561 6274959 6067941 5831746 5665643 5959062 5670634
16600 5670634 5767035 5442655 5669258 5392934 5406396 5472262 5282609 5037967 5182951 5292397
16590 5292397 4965121 5040500 4811583 4429167 4583706 4742758 4722243 4400524 4397493 4455404
16580 4455404 4272098 4259438 3983253 4582513 4087583 3836704 4065533 3956849 3854478 3966382
16570 3966382 3853564 3811857 3667716 3800657 3638649 3614245 4001160 3809324 3593113 3532379
16560 3532379 3585098 3239693 3444460 3219664 3201069 3302656 3288992 3276340 3051368 3313373
16550 3313373 3021375 2972675 3188234 3052242 3200492 2934477 3062852 3215491 2674052 2924130
16540 2924130 2811998 2761664 2802889 2607904 2810353 2807372 2567128 2892111 2384051 2704234
16530B704234j06285p1707J50860j86474K58801k57115J49618l6207J44811l64853
16520B385683K00843k29451Q6094j86906j8118m6835L82788k57813n2464R1556
16510B355377q0068j40828J08501J21140m18612K40573N428j87098J80623k43971
16500A941065L8946K12362J6334J0704m04684o2470O55418n62113J07768Q7058
16490B040388J32645m52092J58774Q1364J90182l95273Q0581O5393j15314j58754
16480A627894M2399L51543p3000p7584K27790k39454J31609k61856M2319K15689
16470A987349k11154k80610j4093L61629n0087j5474K7789q7387n4804K09574
16460A872732k62019L9174L43765l04357N7548R1363k32623L38437l74598R510
$$ plain form
16530 2704234 2597949 2526242 2677102 2490628 2749429 2492314 2641932 2605725 2750536 2385683
16520 2385683 2586526 2357075 2443169 2256263 2238145 2191310 2574098 2316285 2263821 2355377
16510 2355377 2275309 2134481 2242982 2364122 1945510 2186083 2191511 2004413 2185036 1941065
16500 1941065 1980011 2192373 2208707 2219411 1814727 1752257 2407675 1845562 1953330 2040388
16490 2040388 2173033 1720941 1879715 1961079 2151261 1755988 1836569 1901962 1786648 1627894
16480 1627894 1670293 2021836 1948836 1871252 2099042 1859588 1991197 1729341 1771660 1987349
16470 1987349 1776195 1495585 1481492 1843121 1793034 1777560 1805349 1717962 1663158 1872732
16460 1872732 1610713 1649887 1993652 1689295 1746843 1838206 1605583 1944020 1569422 1578932
16450A578932J10117j66819j56531L90799Q4005l08653J08592k41627j54879N1780
16440A295716K23944P5208l28688K64566l7100k97521K12055j7478l4267R9227
16430A455662P1141J25713k75865L3967j48587K9609K02908J2861P4326k47031
16420A334704l05506Q03384m34946J06746n09094K51703j12151K76657k99638
16411A111859N54445k80409j34687K46576q5314l62926r2704K19230r2918L29116
16401A412268J81484k24071j03882k58709K75351q1535o3496l42018M53945K4480
16391A273817J69517l71817k4167K78169p7726l771j65390k49680M08779o1141
16381A176590k12118J41017K06281m76550K31493O1315j45953k1941k03373M80900
$$ plain form
16450 1578932 1689049 1522230 1365699 1756498 1840503 1531850 1640442 1398815 1243936 1295716
16440 1295716 1519660 1594868 1266180 1530746 1493646 1196125 1408180 1390702 1356435 1455662
16430 1455662 1526803 1652516 1376651 1410618 1262031 1291640 1494548 1507409 1581735 1334704
16420 1334704 1029198 1832582 1397636 1504382 995288 1246991 1134840 1411497 1111859
16411 1111859 1666304 1385895 1251208 1497784 1412470 1049544 956840 1176070 1083152 1412268
16401 1412268 1593752 1369681 1265799 1007090 1282441 1200906 1137410 795392 1249337 1273817
16391 1273817 1443334 1071517 1047350 1325519 1247793 1244022 1078632 828952 1237731 1176590
16381 1176590 964472 1105489 1311770 835220 1066713 1128028 982075 960134 756761 1237661
16371A237661p4703m4351J08091E19016L72948M1604P0665K7986J0466J20542
16361A163227m12533J70702k2140k8811L47315l02438k7106q1066Q3704j083K4316
16350I14087J03910N5163l4759R0465k0086j13999l7342r7644O1410j18876J62513
16339I64842J89786m6752k64112L70137J4462l12947M0220j37922R4301q5763
16329H26252J7190M7652J80105M6634l47605J59068k1641O0962l34077K03506
16319H38046N2262J153P9231k03060j18174J84129j7788q8140N1268N0834k2439
16308H07322K33871j24741j19896K16055m40829L53908Q1155K14935l68447r2505
16298G60828K16915k28900j2214Q0385k34702L06146J08865k43086R359j11261
$$ plain form
16371 1237661 1162958 1118607 1226698 519016 891964 933568 1004233 1032219 1042685 1163227
16361 1163227 750694 921396 899256 870445 1217760 915322 888216 807150 890854 889771 914087
16350 914087 1017997 1073160 1038401 1128866 1108780 994781 957439 859795 921205 802329 964842
16339 964842 1154628 1107876 843764 1213901 1228363 915416 955636 817714 912015 826252
16329 826252 843442 891094 1071199 1117833 770228 929296 907655 968617 634540 838046
16319 838046 890308 891461 970692 767632 649458 833587 815799 727659 778927 829761 807322
16308 807322 1041193 916452 796556 1012611 571782 925690 1006845 1221780 853333 760828
16298 760828 977743 748843 736629 817014 582312 888458 997323 754237 763596 652335
16288F52335p501K68059k84569M91838j81598j16923D05013L27100N7589J500
16278G91202o3242q0706P9235J78547j89502m3131J96927k83298J01852M064Q2220
16267G74168J08553L6454n0101l19936Q3461J85011o6790C56731L94782j11723
16257F39790q3356K81850k14608j47546M13706k82320J35551J07895p3093q6215
16247F91654R2666k31638J3355Q5612q1272R4442p173q8811K92703k55704k28035
16236C77799J68335K1291L28759k95084j85802G0053P66874C91788q4227A12257
16225G50522j35349p5438K59804j82769J26236l32067L8345J20885j21549N69293
16215A017913l15455l7634l15431J86672Q8969n4263j0100j27337K76501k32650
$$ plain form
16288 652335 644834 912893 628324 1120162 938564 821641 405013 732113 789702 791202
16278 791202 727960 647254 726489 905036 715534 672403 869330 586032 687884 691948 774168
16267 774168 882721 919175 869074 549138 632599 817610 750820 356731 751513 639790
16257 639790 556434 838284 623676 476130 889836 607516 743067 850962 777869 691654
16247 691654 784320 552682 566037 651649 570377 664819 657646 568835 861538 605834 377799
16236 377799 546134 567425 896184 601100 415298 70053 836927 391788 307561 112257
16225 750522 615173 539735 799539 616770 743006 410939 449284 570169 448620 1017913
16215 1017913 702458 664824 349393 536065 625034 570771 560671 433334 709835 477185
16205D77185M7018j48643K74677j89720L05978M3447B00966M02236N9890K05C17878
16193D79543k01890L55476r8045M3141m0524m7944l9469K6095A88066L63183O8649
16182F19898l06260j7657L55602m0002j93091J06508A12837N92660A27365K98041
16172D25406r1265j55119M88785k41013j40607M63445k35039A50517K8478K93291
16162D72286B14821M32664j98613l7956a7443G06389A67673M11800j48062J22494
16152E53905O6209K2110k39194L43280j00316j38217J02520k76076J83668B10686
16141C60795O8046j50173N5672j52752m4780M72635k40026J02158N9818E0103
16130B90149J03998K01359I4525R3589L52594H7352n111J61523I8647M8968L27592
$$ plain form
16205 477185 524203 375560 650237 460517 766495 809942 200966 603202 663092 663297 317878
16193 479543 277653 633129 535084 578225 537701 489757 450288 476383 188066 551249 619898
16182 619898 313638 295981 651583 611581 418490 524998 112837 705497 127365 425406
16172 425406 334141 179022 667807 426794 286187 749632 514593 150517 178995 472286
16162 472286 214821 647485 448872 410916 -17443 706389 167673 579473 431411 553905
16152 553905 620114 642224 403030 746310 645994 507777 610297 334221 517889 210686
16141 360795 428841 278668 334340 181588 136808 609443 369417 471575 531393 50103
16130 290149 394147 595506 94525 188114 540708 87352 82241 243764 98647 147615 475207
16119D75207p0373j53665J15416j36920N0093P9881A09009K53713f341C17257
16108B80070j23908K2617N1328K65021L9070I3722E824L36305I9200a74447B82586
16096D91226A38584J96667j54205G0919L33799j77333m0174d1468A65056k0107
16086A44949P2754Q6820b0285A86944c7901l23110A69087n0483K98649A04619
16075A80917N2546Q0513q9J23120A67901C10K50722F3372J04987M1875D0065L43100
16063C83165A9830K04362b4082A38778a1923B46096K9874q6021J69029a28099
16052A39101K69951A83583N4967n923d1498F8560L2423J04124F9745N28645k95577
16041C02813r4034p0024j420B4755J15279n1093Q2389J00227j16171E0205K67541
$$ plain form
16119 475207 404834 251169 366585 229665 279758 359639 109009 362722 -6341 317257
16108 280070 156162 178779 230107 495128 534198 93722 5824 342129 99200 -174447 282586
16096 491226 138584 335251 181046 70919 404718 227385 187211 -41468 165056 144949
16086 144949 217703 304523 -20285 186944 -37901 -361011 169087 118604 417253 104619
16075 180917 233463 313976 313887 437007 167901 310 251032 63372 168359 210234 40065 383165
16063 383165 19830 224192 -24082 138778 -11923 246096 275970 189949 358978 -128099
16052 139101 409052 183583 238550 232627 -41498 68560 100983 205107 69745 598390 302813
16041 302813 208779 138755 137335 24755 140034 88941 171330 271557 155386 50205 317746
16030C17746c8933A21100L980K26778B6913L54709L1741p8080j11858p8688o021
16019A38716a33746B32827a6486C14570d1791A02764N2112Q927n9937k7032C1750
16007B21692e5725m6157L8272B4727K48124I1078R5957E4247K6878J67593r4615
15996A54103h1779B20719a74744c4240j20229C40449j37649p0800L13783Q7269
15986E33052j74978K43278l4374n1951A73682K63665A80121M0710e1393D65737
15975C30390h5455k35341A11948g7103A32728b58830B47665N285a967j8633m4251
15964f4851A57513J90423j16577A5179N7332l1579J4284M8828f4322j36621l36457
15953e37400c3777A76817b39275h6708B82173a51707D40207a85576A48702J08323
$$ plain form
16030 317746 -38933 121100 125080 351858 26913 381622 413363 335283 223425 144737 138716
16019 138716 -133746 232827 -16486 314570 -41791 102764 154876 163803 103866 76834 31750
16007 221692 -55725 -101882 -63610 24727 272851 91078 187035 54247 81125 248718 154103
15996 154103 -81779 220719 -174744 -34240 -154469 340449 202800 132000 445783 533052
15986 533052 358074 601352 566978 515027 173682 437347 180121 220831 -51393 465737
15975 330390 -85455 -320796 111948 -77103 132728 -258830 247665 252950 -1967 -20600 -64851
15964 -64851 157513 347936 231359 15179 72511 40932 55216 104044 -64322 -200943 -537400
15953 -537400 -33777 176817 -239275 -86708 282173 -151707 440207 -185576 148702 257025
15943B57025N0178E9362c05749a03510b092j84909B92947A01074o171f8813A07905
15931C6924L3011a61529P6319E1195c3587j25315A15425g1825m4788r8890B2601
15919D55974a4687C4057P9193b12794a03245j4696A9724f6049o3203A31161c11519
15907G4999g8870A1761d7515b3345j5238C91665j75147n3068E0572K18371I7204
15895E6205K1293a76331L4505e9225I086a02589A9867a6194A83615L8756L3467
15884B55838b7604B1613J52434f4949k06031F2099a59462o0615B23206j7733a07492
15872a29044l216c0891E0121a23631L2791A87593b02907A10409b05040B39097
15861A08052d02653a15912A52771i0806B9874c5448l3127f21j40862O6631C25126
$$ plain form
15943 257025 307203 59362 -305749 -103510 -2092 -187001 292947 101074 94903 -68813 107905
15931 36924 69935 -161529 -85210 51195 -33587 -158902 115425 -71825 -116613 -215503 22601
15919 455974 -14687 34057 113250 -212794 -103245 -117941 19724 -66049 -129252 131161 -311519
15907 74999 -78870 11761 -47515 -23345 -38583 391665 216518 163450 50572 268943 97204
15895 56205 77498 -176331 -141826 -59225 9086 -102589 19867 -16194 183615 222371 255838
15884 255838 -27604 21613 174047 -64949 -270980 62099 -159462 -220077 223206 205473 -107492
15872 -129044 -132260 -30891 50121 -123631 -90840 187593 -202907 110409 -205040 239097
15861 108052 -402653 -115912 152771 -90806 29874 -35448 -68575 -621 -141483 -74852 325126
15849a534j79609C35405G4817l6344O9088K5011f738B31336r4665J93350E1488
15837a30419B85359I2370f4242j08535Q2756j19547A18291J0346K933k8563K24811
15826C27818a10805C8714J1274J35330I1739j7195J06497J42185B0644o307b4837
15814A64843e473r9793o5657P1425I2780N1816c05144i9949L5118D5570N0581
15803I6151A8305K9132A7506P8048N2468G414h5476C4053b23068h5286k53032
15792c38318D3639l464b7720j80526A06887O5104a0270n4314C18298G4703a10712
15780A29064N401i4247B3140J22366J4014n6677a33824C64026j59475L1540C3753
15768b77891A22801g0504B5159J51306i462A90390D0959P8550b46963a09811g744
$$ plain form
15849 -1534 -181143 335405 74817 38473 107561 132572 -6738 231336 136671 330021 51488
15837 -130419 285359 92370 -64242 -172777 -90021 -209568 118291 128637 131570 103007 327818
15826 327818 -110805 38714 49988 185318 91739 74544 181041 323226 20644 14337 -24837
15814 164843 -5473 -105266 -170923 -99498 92780 144596 -305144 -99949 -64831 45570 96151
15803 96151 18305 47437 17506 95554 148022 7414 -85476 34053 -223068 -85286 -338318
15792 -338318 43639 40175 -27720 -208246 106887 171991 -10270 -64584 318298 74703 -110712
15780 129064 134465 -94247 23140 145506 159520 102843 -133824 364026 204551 236091 33753
15768 -277891 122801 -70504 25159 176465 -9462 190390 40959 119509 -246963 -109811 -7744
15756a84224C75630A82612H0712a11344A32099a89561h5108l6616E9671O73a64573
15744d0458E19199r5048a65975b5194p5370k9377M7755B58811E4225a52029N1206
15733a00823l35697B53603E2491B3122a37288M8245m4764L0702b9101A55939g0666
15721c34441R9111R5500e7972l58172i0912A52615a38992k4531c8948m5580A53692
15709a4842j7860A26297a15830H3258B4206a13401J7775r8739f1234C8873J12989
15698A51862b53232N9106i973l3530A3626Q2787K0474c95064J78909B26555g8567
15686a4393A10065a34813H9793a64162d7218m46653a18917c8903j17751J5985
15676a40669k30466a00420B22951C9829J22656a07155k0054J4522I9581C4362
$$ plain form
15756 -184224 375630 182612 80712 -111344 132099 -189561 -85108 -121724 59671 60344 -164573
15744 -40458 519199 424151 -165975 -25194 -100564 -129941 -82186 258811 54225 -152029 -100823
15733 -100823 -436520 253603 52491 23122 -137288 -89043 -133807 -103105 -29101 155939 -70666
15721 -334441 -235330 -139830 -57972 -416144 -90912 152615 -138992 -163523 -38948 -84528 153692
15709 -14842 -32702 126297 -115830 83258 24206 -113401 -95626 -194365 -61234 38873 151862
15698 151862 -253232 -194126 -9973 -43503 13626 96413 116887 -395064 -216155 226555 -78567
15686 -14393 110065 -134813 89793 -164162 -47218 -493871 -118917 -38903 -156654 -140669
15676 -140669 -371135 -100420 222951 39829 162485 -107155 -127209 -112687 99581 34362
15665a1299B2455m835a08508a0240A93778a9232o7285A13358d08925i1508k26
15654i1734F497h5716F0055d43809A82983D5686a05089f852A73553g173B23748
15642C1525c8119B17594c4162B12959I5205L9046a48104B01700E8454J62563a10025
15630A51773b5242F5028b95060Q2876j29672g0845q5470L7146A81904J28537a98994
15618B6241R242O8339B9397b90104c4806F6723a62905I0564B498L06295I3105
15606c86590i5902m1649m4248C6972c0923k01258C05182I6499J23670f2810O912
15595e5898B35087a39733L0186L163A57056f4480j00707C3873c1207o8748I8675
15583f5627j82626M1781d6313A22099b8439G5739E554P6416b40316l2095A40208
$$ plain form
15665 -11299 22455 17620 -108508 -10240 193778 -19232 -86517 113358 -408925 -91508 -91734
15654 -91734 6497 -85716 60055 -443809 182983 45686 -105089 -6852 173553 -7173 223748
15642 31525 -38119 217594 -34162 212959 95205 134251 -148104 201700 58454 221017 -110025
15630 151773 -25242 65028 -295060 -212184 -341856 -70845 -156315 -119169 181904 310441 -198994
15618 26241 35483 103822 29397 -290104 -34806 66723 -162905 90564 2498 308793 93105
15606 -386590 -95902 -137551 -181799 36972 -30923 -232181 305182 96499 220169 -62810 -55898
15595 -55898 235087 -139733 -109547 -106384 157056 -64480 -165187 33873 -31207 -99955 98675
15583 -65627 -248253 -206472 -46313 122099 -28439 75739 5554 81970 -240316 -272411 140208
15571a5457l17751C28899k0264i2511H763K92933G4538f1263M035j14301A75777
15559B82425J1419K8102j19685K8365e3173B68996a95175q8175B73049k8373d7024
15547A04582a13411A28799a09569a4397C0550Q2800b61602L4882A02864b85633
15536H2677l0796J46469b1814j48811j71805A9526J76457a04737A38825J25965
15526B64790g5579l2704j76098Q7172G2040J88249M2067e8599A54435b27924M0062
15515a87862c1045B89127i9780L8464k74317a29986D62652G5588j0819A6873a14503
15503A47456g4492j8668A05193D9288i2427A3307e2245A37761P4588a70741k04964
15492c75705J67939A71213l2189d29243a33973I8612a60350A23441m5620a22964
$$ plain form
15571 -15457 -333208 328899 308635 -92511 8763 301696 74538 -61263 -57228 -171529 175777
15559 282425 293844 321946 202261 230626 -53173 268996 -195175 -283350 273049 244676 -47024
15547 104582 -113411 128799 -109569 -14397 30550 113350 -261602 -226720 102864 -285633
15536 82677 51881 198350 -21814 -170625 -342430 19526 195983 -104737 138825 264790
15526 264790 -75579 -108283 -284381 -197209 72040 260289 302356 -58599 154435 -227924 -187862
15515 -187862 -31045 289127 -99780 -61316 -335633 -129986 462652 75588 64769 16873 -114503
15503 147456 -74492 -93160 105193 49288 -92427 13307 -52245 137761 212349 -170741 -375705
15492 -375705 -207766 171213 139024 -429243 -133973 98612 -160350 123441 77821 -122964
15481h6620m7963K3915a5653A49763J069a39410I5115K52005J94159A19161a03818
15469d1843E8907p305a1005n9363b0767B4537A0515K44880a18428A75790M2892
15458B18682e7386q451C7826a7396j03045l5242B22530F6456L84354C9330K29580
15447B68910j0855J89925A89530l7393P3749I469J15998J20471a75876A75244
15436A47183a48880j68371K4275B753K74415a13695B4665b12790B54344b14485
15425A90990d9306A74915o1186J99372a75611A46063l5293e4258B61284e6142
15414H990a0519D6212a02740I3824j536J33179a97798L6540B5367M5642b8462
15402B38796d6913F6036b19010H5555l1076K42559a04300B08162F8602c16263
$$ plain form
15481 -86620 -134583 -110668 -15653 149763 150832 -139410 95115 347120 541279 119161 -103818
15469 -41843 58907 51602 -11005 -70368 -20767 24537 10515 255395 -118428 175790 218682
15458 218682 -57386 -65837 37826 -17396 -120441 -155683 222530 66456 450810 39330 268910
15447 268910 258055 447980 189530 152137 225886 9469 125467 245938 -175876 175244
15436 147183 -148880 -317251 -292976 2753 277168 -113695 24665 -212790 254344 -214485
15425 190990 -49306 174915 113729 313101 -175611 146063 110770 -54258 261284 -56142
15414 8990 -10519 46212 -102740 93824 92288 225467 -197798 -161258 25367 71009 -28462
15402 238796 -46913 66036 -219010 85555 54479 297038 -104300 208162 68602 -316263
15391C65797g028p6874H8015b29371F7916J04976a06035l6442A11807b4835p7483
15380a02318A75318d18780d1339D03069j56766A1448k571J01523C8816J98319
15370B37135k7834E8981g8704C83805j69529B2529Q8889m5676a52434B37157H7086
15358c2799G1091O4184L9996k0653C1092K87328E5366a77849b7429C91541A57384
15346B58632e8327C65046l9166a58147B04293d6814a1753C08697h2023K6788k20185
15335b75420A51822d5276F7949b4146m9051I7919l4674g4569B32956J56429q5370
15324C04015o8153E0104h8143E2857f4800o1671I9237O7069K04700a54073J2353
15313a41720K9154l31495B59580D0418K29498b00989A52367J09998A14095i1410
$$ plain form
15391 365797 -7028 -83902 88015 -229371 67916 172892 -106035 -142477 111807 -24835 -102318
15380 -102318 175318 -418780 -41339 403069 246303 11448 8877 110400 38816 237135
15370 237135 209301 58981 -78704 383805 214276 22529 111418 65742 -152434 237157 87086
15358 -32799 71091 135275 175271 154618 31092 318420 55366 -177849 -27429 391541 157384
15346 258632 -58327 365046 325880 -158147 204293 -46814 -11753 308697 -82023 -55235 -275420
15335 -275420 151822 -45276 67949 -24146 -73197 97919 63245 -74569 232956 389385 304015
15324 304015 235862 50104 -88143 52857 -64800 -126471 99237 166306 371006 -154073 -141720
15313 -141720 -112566 -444061 259580 40418 269916 -200989 152367 262365 114095 -91410
15302G4516P4977m850l2304a1657H3773a18867A1528P2284B5064a32277a8188
15290a45298M9324A23905a10602b6634k70414E9260a24982f1639F1781g7156b8931
15278a67295L4239C36240j50909c38051C4448b90352A54470b82711a13805A25431
15267d6429k03386A93785J9201P0254H0604K8137k9997e8313A65874c17597D44796
15255A1752J197K4021h7901B26332q7948L50392Q61239k81929M9194M82683F23139
15243D35882a29445B93139A2140R0498J0189P3111b9096j13825a6972j36138P596
15232a45514K6909A40168D0542b79902k5527A75376b00108N0024A32100J23601
15222B55701g0646B7137K166a41939A11906h6380l12796a5172A94787C7192i1087
$$ plain form
15302 74516 149493 144643 112339 -11657 83773 -118867 11528 83812 25064 -132277 -18188
15290 -145298 -95974 123905 -110602 -26634 -297048 59260 -124982 -61639 61781 -77156 -28931
15278 -167295 -133056 336240 185331 -338051 34448 -290352 154470 -282711 -113805 125431
15267 -46429 -249815 193785 212986 283240 80604 108741 78744 -58313 165874 -317597 444796
15255 11752 12949 36970 -87901 226332 138384 488776 1350015 1068086 1117280 1599963 623139
15243 435882 -129445 293139 12140 102638 112827 185938 -29096 -142921 -16972 -153110 -145514
15232 -145514 -118605 140168 40542 -279902 -305429 175376 -200108 -150084 132100 255701
15222 255701 -70646 27137 29303 -141939 111906 -86380 -399176 -15172 194787 37192 -91087
15210G4908J07797J18532a93729b168G5045K04779j19915m9792a31970B55231
15199C30033A4076b7182j42157J7113G236i4630c002B51035i6657B39142j06125
15188A33017L9401K1821a49885B72126B0404a54169H6463K11284f0584l54135
15178d14719F3374J40346E4832N530g7953L1027C84212a29136j70353I6853g554
15166A27936B8405L81256A64270e956A20451n1016l1872J75766g3896A01410J13048
15155B14458f6128j22959b5264A74772D6722K43621j20509K6253c72522J32868
15145b39654f6243G5980k4068a27521L8603q378B33721a46831O9614l0878B64879
15133B39132j02713D152N736b00001A49587K9696a10831B73568J11123j71249
$$ plain form
15210 74908 182705 301237 -193729 -2168 75045 279824 159909 110117 -131970 255231
15199 330033 14076 -27182 -169339 -152226 7236 -94630 -3002 251035 -96657 239142 133017
15188 133017 172418 194239 -149885 272126 20404 -154169 86463 297747 -60584 -414719
15178 -414719 63374 203720 54832 60362 -77953 -46926 384212 -129136 -299489 96853 -7554
15166 127936 28405 409661 164270 -5956 120451 69435 37563 213329 -73896 101410 214458
15155 214458 -66128 -189087 -25264 174772 46722 290343 169834 196087 -372522 -239654
15145 -239654 -66243 75980 51912 -127521 -88918 -97296 233721 -146831 -77217 -108095 264879
15133 239132 136419 4152 9888 -200001 149587 179283 -110831 273568 384691 213442
15123B13442K27492a27474A73472J75233A65183K1816a7473n9559C67148R7928
15113D65076A17061N7657C8775Q6305l51A8978i4764A96588I7013J63776r0788
15102A70001b69846B68728a98260A37992N056h5352B70724l7906n5739K36917
15092D13996e7129k836A74896J25984k8439g5974B10055F3810K74297a86830B84411
15080G6868F960K04470r5405a04751B7249Q6842K5696L5277J4607E5804K4843
15069H0647J40330k4506d5569D21506i0165j18405C93216A91461R3275A20269
15058A30076N107J18295F215K84226B8703e0818F79815B04084L9138O1673A36452
15046D12260j96009M8669J81302A98606J63904G1702J24842J04865d8036A22240
$$ plain form
15123 213442 440934 -127474 173472 348705 165183 186999 -17473 -77032 367148 465076
15113 465076 117061 174718 38775 125080 124729 18978 -94764 196588 97013 260789 170001
15102 170001 -269846 268728 -198260 137992 143048 -85352 270724 232818 177079 413996
15092 413996 -57129 -59965 174896 300880 272441 -75974 210055 63810 338107 -186830 284411
15080 76868 6960 211430 116025 -104751 27249 114091 139787 175064 189671 55804 80647
15069 80647 220977 196471 -45569 421506 -90165 -208570 393216 191461 284736 120269
15058 130076 135183 253478 6215 290441 28703 -50818 679815 204084 243222 304895 136452
15046 412260 216251 264920 446222 198606 362510 71702 196544 301409 -48036 122240
15035H0016D934K6711J1394J74716J49612D8825g5635B49607b0806A59615L95227
15024E54842j86334J9717A50491K41987A69271H2487J29409J46467K36864k15821
15014C79406J79139B08260J06285j18425j4301B2599j1007M9972i1847a6429B54930
15002B25371L1865l4848o2822N3213O1645Q3840j23611I4592K92261j69280j5155
14991B02418M6877J2263a76698A38108L82393j15290j07221Q1064j340A84932
14980A18657k9642b57326C97623R1323j14174j33131m1395J45523i0134C38600
14969B12981p3429K74446f8118C68361R9356j55865k3714O0815q2729j00843k8193
14958A37188J70410n0172J9254l7972J0736b9541A35189K1116K54876j96696J64587
$$ plain form
15035 80016 4934 31645 43039 217755 367367 48825 -75635 249607 -20806 159615 554842
15024 554842 368508 388225 150491 392478 169271 82487 211896 358363 595227 379406
15014 379406 558545 208260 314545 196120 181819 22599 11592 61564 -91847 -16429 254930
15002 225371 257236 222388 159566 212779 274424 358264 234653 94592 386853 217573 202418
14991 202418 249295 261558 -176698 138108 520501 405211 297990 379054 377714 184932
14980 118657 89015 -257326 397623 488946 374772 241641 200246 345769 -90134 338600
14969 212981 139552 413998 -68118 368361 467717 311852 288138 348953 266224 165381 137188
14958 137188 307598 257426 276680 238708 249444 -29541 135189 156305 411181 214485 379072
14947C79072Q4060L8154j75308J62024I9702N22098j97424k09932K46900Q0505
14937E41849o6132k08287J07144A20528E3147K90671j48454L84560j08304F7088
14926E62592K4740K71430o1767k23623q0992M80052j77916r2846j02326J81712
14916G81056O8838l97437L53454Q3182m42587K17431J21761A14904J17725K24345
14906D56974A5784N17568j05561J15238A21198J67882K52929M5567A80476Q6439
14896B66915j19854J04588j7653Q7915j15062J72677p5421L60732A71314G4678
14885B95442M12063B35517D8935J51473O7293G493M13627j13578j7856N7002j42861
14874B03827L0821L29556j50005J32017j54660A56785J29753L9625j36489J26375
$$ plain form
14947 379072 463132 501286 325978 488002 99702 621800 424376 214444 461344 541849
14937 541849 475717 267430 374574 120528 53147 343818 195364 579924 471620 67088
14926 562592 587332 858762 796995 573372 492380 972432 794516 701670 599344 781056
14916 781056 849894 452457 805911 889093 446506 663937 785698 114904 232629 456974
14906 456974 15784 533352 427791 543029 121198 289080 542009 587576 180476 266915
14896 266915 147061 251649 233996 321911 206849 379526 304105 664837 171314 74678
14885 295442 707505 235517 48935 200408 267701 7493 421120 307542 289686 346688 203827
14874 203827 234648 564204 414199 546216 391556 156785 286538 326163 189674 316049
14864C16049M7906k9896K38453B42301O3220j5662o7037N787r0831J69619Q6311
14853C93708A70504N06412k05032j00226A73831K28906K82648B87643n7878N9523
14843B89288Q3023O5835j12289J30138O032j68376K52412J73198k39580Q7754
14833E67435K86045l5690k36597j27999j58563J69526q5367H7466K83331k405
14823C68392j38049M96916j86785j23354J00717k43056K82043J94741k79254Q2091
14813E54402j32161J0539J38779Q4294A68033J90041N4081j63559K68123j86020
14803C30699J89410k26401J84167J50221l07153L9538K60293B32251K60788L77841
14793H70880j29077J16733l76702K0951k16129L57765m0592p1953j86069K01852
$$ plain form
14864 316049 363955 334059 572512 242301 305521 289859 222822 228609 137778 307397 393708
14853 393708 170504 676916 471884 371658 173831 402737 685385 287643 229765 289288
14843 289288 372311 438146 325857 455995 462027 293651 546063 719261 479681 567435
14833 567435 853480 817790 581193 453194 294631 464157 378790 87466 370797 368392
14823 368392 230343 727259 540474 417120 517837 274781 556824 751565 472311 554402
14813 554402 422241 432780 571559 655853 168033 358074 412155 248596 516719 330699
14803 330699 520109 293708 477875 628096 320943 360481 620774 232251 493039 870880
14793 870880 741803 858536 481834 502785 286656 644421 603829 531876 345807 547659
14783E47659J7534J56393B55139K33098J02356J1250r6850J21107j95709j65537
14773B64854N4441M49142l19229K51445j35913M8767j31713J02840R5393l35486
14763C44541j614K62474j61857A09169K06232R5839P4707k1888j78081M85614
14753G71592k87861p3820O9875P0473j00538J16753m4704m6659L39177J15453
14743I29741l35049m1614N8649k62530K93165p3285n8935L01385l15406o5083
14733D31038j31679R2644K88949k33075L12280l4124P4852L564L4987o8158j07466
14722F63812r9872N44676k55537J88356j64606n3201O9007Q0274l37089j77402
14712D58418L53816J82378j07615k90214K54715j71381k0235m875k9297K46916
$$ plain form
14783 547659 565193 721586 255139 488237 590593 601843 504993 626100 430391 264854
14773 264854 319295 768437 449208 700653 564740 613507 481794 584634 680027 344541
14763 344541 342927 605401 443544 109169 315401 411240 485947 464059 285978 771592
14753 771592 483731 409911 479786 550259 449721 566474 521770 475111 814288 929741
14743 929741 594692 553078 611727 349197 642362 569077 510142 811527 496121 431038
14733 431038 299359 392003 680952 447877 760157 726033 800885 804449 839436 771278 663812
14722 663812 563940 1108616 853079 1041435 876829 823628 892635 972909 635820 458418
14712 458418 812234 994612 886997 596783 851498 680117 659882 655007 625710 872626
14702H72626K578k5690K101J08100J631J40545l33198L09441p0432J34167k18279
14691I23590r3767L64456m47542l071J71960k28086k90244J58804L54762l77143
14681E33719L97073o6868J89072k70126R0743Q3308j63005J35775J0996L60389
14671A301076m58745k21007J11658L57160P3774m48718M325o5795J92152j6217
14661H29663j77814M8977P9088O380L19624j53064K79791n30178L03953k85005
14651G21415Q7940j01185J02188J25255l8298m5774R6329k49300M07477r804E29214
14639I50719N8035p2997M17737k55411J02448j03977l2646k5314j96546J65014
14629A007062K1121o3527K45157k38427j92098J96368K98116j93799k32745M45161
$$ plain form
14702 872626 875204 849514 851615 959715 961346 1101891 768693 1078134 1007702 1141869 923590
14691 923590 829823 1194279 746737 743666 915626 687540 397296 556100 910862 533719
14681 533719 930792 863924 1052996 782870 873613 956921 793916 929691 940687 1301076
14671 1301076 842331 621324 732982 1090142 1163916 715198 719523 653728 845880 829663
14661 829663 651849 700826 779914 786294 1105918 952854 1232645 702467 1006420 721415
14651 721415 809355 708170 810358 935613 897315 851541 947870 698570 1106047 1096243 529214
14639 950719 1008754 935757 1353494 1098083 1200531 1096554 1063908 1038594 842048 1007062
14629 1007062 1028183 964656 1209813 971386 779288 975656 1273772 1079973 847228 1292389
14619A292389O4989m38044M86059j44195J87694l00198R1381j83877J11200q6525
14609A080873m6782K27429j57759o69K78201O8583k37329Q5375O6189j40149K4490
14598A248452K51872k91266K0201K13734j26158J60283J01100j41282N5442j30637
14588A361741L28669l86977j28452J21084j7826P5133M19984l21984K23086j98524
14578A475934P1625j91660L31430j69534J14633M1971K83419m79141J11096j93854
14568A395919K97430J93857M23M63840k15718k12246K78100Q4881j04088J23534
14558B305932J26025Q4724O1603M46773n65J78738N85648Q48985R35033K428752
14548H001648M127849O998716J2721604J054302j5937503q181251l517210k148144
$$ plain form
14619 1292389 1357378 919334 1405393 1261198 1448892 1148694 1240075 1056198 1167398 1080873
14609 1080873 1034091 1261520 1103761 1103092 1381293 1449876 1212547 1297922 1364111 1223962 1248452
14598 1248452 1500324 1209058 1229259 1442993 1316835 1477118 1578218 1436936 1492378 1361741
14588 1361741 1690410 1303433 1174981 1296065 1278239 1353372 1773356 1451372 1674458 1475934
14578 1475934 1547559 1355899 1687329 1517795 1632428 1674399 1957818 1478677 1589773 1395919
14568 1395919 1693349 1887206 1887629 2351469 2135751 1923505 2201605 2286486 2182398 2305932
14558 2305932 2431957 2516681 2578284 3025057 3024492 3203230 3788878 4637863 5572896 8001648
14548 8001648 12129497 19128213 31849817 32904119 16966616 8785365 5268155 3120011
14540C120011m52716o00876J49112n78821M2222j2909L58113l43778J59255J43420
14530A983033K5712p5944L2005R8248L3079j43178J2704J84916l60228R014Q5571
14519A884932M34299l63972J83120L210J5834Q1494p8673k60417J81594L62730
14509B444151p7679n4744P7370J2691J93814n9499J56836r5691j78830j36560
14499B281859L32754k44982J83036K02360j91751k93425O26161j69431R4884j36514
14489B684951J31345j38312N40102l50007J50075N5966N7102l83180P6990L31510
14479C156542n8836M3602l4630O9869M41365N1322m28122L52558j78115k2161
14469C393394Q1861L5009J4824M78445k98479K37614k6123j34203l9942K68501
$$ plain form
14540 3120011 2667295 2066419 2215531 1636710 1678932 1666023 2024136 1680358 1839613 1983033
14530 1983033 2008745 1932801 1964806 2063054 2096133 1952955 1965659 2150575 1790347 1799361 1884932
14519 1884932 2319231 1955259 2138379 2141589 2157423 2238917 2160244 1899827 2081421 2444151
14509 2444151 2366472 2311728 2389098 2401789 2595603 2536104 2692940 2597249 2418419 2281859
14499 2281859 2614613 2369631 2552667 2755027 2563276 2269851 2896012 2726581 2821465 2684951
14489 2684951 2816296 2677984 3218086 2868079 3018154 3074120 3131222 2748042 2825032 3156542
14479 3156542 3097706 3141308 3106678 3176547 3617912 3669234 3241112 3593670 3415555 3393394
14469 3393394 3475255 3510264 3525088 4003533 3705054 3942668 3916545 3782342 3742400 4010901
14459D010901l54241L34162j11942K17722J06801L5979p4080J32962J31943p5521
14449D354686J57532r9089J18040K89369j86736M55477m36073K94155n9773J33809
14439E021397K2577J36213m4460N831m5695N19054l04970J21851J10569j6799
14429E525568L46314p9742J10514P2866K17368k04933L19513q7353j74231L26525
14419F372409J13820M8602K83703L90093O0390l73119K03440M28983j07290J72820
14409G593851j67003J46695L52671l51434M60503R6611p0588L14810m9866O45200
14399H971450k03833O5034J78115J80801O7093J10359M88801q1806J63475K94874
14389A0234363J28866J31195l0837L46142P9003J00026J91772N79146J3306J28379
$$ plain form
14459 4010901 3656660 3990822 3878880 4096602 4203403 4239382 4165302 4298264 4430207 4354686
14449 4354686 4512218 4413129 4531169 4820538 4633802 5089279 4653206 4947361 4887588 5021397
14439 5021397 5043974 5180187 5135727 5141558 5095863 5614917 5309947 5431798 5542367 5525568
14429 5525568 5871882 5792140 5902654 5975520 6192888 5987955 6307468 6220115 6045884 6372409
14419 6372409 6486229 6534831 6818534 7208627 7269017 6895898 7099338 7528321 7421031 7593851
14409 7593851 7426848 7573543 7926214 7574780 8035283 8131894 8061306 8376116 8326250 8971450
14399 8971450 8767617 8832651 9010766 9191567 9258660 9369019 9857820 9776014 9939489 10234363
14389 10234363 10363229 10494424 10463587 10809729 10888732 10988758 11180530 11759676 11772982 11901361
14379A1901361K30127M89752j44054N86511J50098K5285O58931M5925Q7287O46134
14369A4677357L17344K14930M22655l8403N96066N48037N5483M46050J46553L89580
14359A7775652M64265K72639P25003L20695N23186M52794M41108Q10213L10007
14350B2095562O16210P3835O20346N66008P76880O45128P11090O41747O72942
14341B7419748Q66088P28481P29503P67290J018631J047262N80607J127479P12290
14332C4997379J369384J160669J241559J021292R03872J603162J236108J398754
14324D4932179K124539J106537K217282J230602K110558J587280J965470K092245
14316E9366692K695016J989359K632691K818249K574022L290852K786236L420696
$$ plain form
14379 11901361 12131488 12621240 12477186 13063697 13213795 13239080 13898011 13943936 14031223 14677357
14369 14677357 14994701 15209631 15632286 15593883 16189949 16737986 16793469 17239519 17386072 17775652
14359 17775652 18239917 18512556 19237559 19558254 20081440 20534234 20975342 21785555 22095562
14350 22095562 22711772 22785607 23405953 23971961 24748841 25393969 26105059 26746806 27419748
14341 27419748 28285836 29014317 29743820 30511110 31529741 32577003 33157610 34285089 34997379
14332 34997379 36366763 37527432 38768991 39790283 40694155 42297317 43533425 44932179
14324 44932179 47056718 48163255 50380537 51611139 53721697 55308977 57274447 59366692
14316 59366692 62061708 64051067 66683758 69502007 72076029 75366881 78153117 81573813
14308H1573813L590359L416184M018492M372030M500997M656704M990343N153854
14300A16272776O075494N866190O688705O891407P264078P930085Q491027Q764954
14292A74244716R506044J0311446J0396976J1527010J1941931J2753868J3141705
14285B53823696J3698890J4317576J4848889J5028582J5248400J4757248J4897780
14278C56621061J4582321J3728281J2590067J1270030Q303501M533976J926213
14271D23555450K154849K390205O39046l762948l609871m901260p601601r337179
14263C99526691j1765015j3360875j4291007j5253196j5245986j5575283j5499286
14256B98536043j4560274j3806072j3856425j3333188j2474982j2047010j1352639
$$ plain form
14308 81573813 85164172 88580356 92598848 96970878 101471875 106128579 111118922 116272776
14300 116272776 122348270 128214460 134903165 141794572 149058650 156988735 165479762 174244716
14292 174244716 183750760 194062206 204459182 215986192 227928123 240681991 253823696
14285 253823696 267522586 281840162 296689051 311717633 326966033 341723281 356621061
14278 356621061 371203382 384931663 397521730 408791760 417095261 421629237 423555450
14271 423555450 425710299 428100504 428739550 424976602 421366731 416465471 408863870 399526691
14263 399526691 387761676 374400801 360109794 344856598 329610612 314035329 298536043
14256 298536043 283975769 270169697 256313272 242980084 230505102 218458092 207105453
14249B07105453j0855244j0135061r730516q963950q601744p167299p676582p244339
14241A36730718o596859n987138n898849m924462n498473m916324m559452m426914
14233I3922247l842919l604965l395501l675709l092958l468671k422229k947778
14225F7471517k657849k400947k309199k114784k072574j830595k016040j823417
14217E0246112j724911j746811j301257j515216j083426j608799j416026j110479
14209C8739187j175064j029559j112698q99887j048500j006315q86950p35308
14201C0844906p61345r26577o17255p83874j019975l39984n25234o93464r35882
14192B4241316m28569p98795m95002p51463l0168o44252m25514n21788l40790
$$ plain form
14249 207105453 196250209 186115148 176384632 167420682 158818938 151651639 143975057 136730718
14241 136730718 130133859 124146721 118247872 113323410 107824937 102908613 98349161 93922247
14233 93922247 90079328 86474363 83078862 79403153 76310195 72841524 70419295 67471517
14225 67471517 64813668 62412721 60103522 57988738 55916164 54085569 52069529 50246112
14217 50246112 48521201 46774390 45473133 43957917 42874491 41265692 39849666 38739187
14209 38739187 37564123 36534564 35421866 34521979 33473479 32467164 31580214 30844906
14201 30844906 30083561 29156984 28539729 27755855 26735880 26395896 25870662 25177198 24241316
14192 24241316 23812747 23013952 22518950 21767487 21737319 21093067 20667553 20145765 19804975
14183A9804975p45528l65474l26533l55001m33726j17816o50258k48228k60545
14174A6301866m18814o36495j27934k63619j23342n58740k3765k10139m43520
14165A3495498L54026r54859k46910l72606j0935J71084q20397j71848k0617l43762
14155A1078674j81919j1384j06831m32204k24343R2965j41021j11929k87915j46143
14145I527950o2514l80417j3149r6899m37381K52264k46132j85658n0817j96790
14135H110457j40411j07807k48197q1450j42847J36783p9229k84751J67061n72578
14125F757031k5375K86696r7322m04362M7470K1407J86006o77281L05027l52627
14115F046670J27971k19m34550N340J52318j75706N3056o36760J44828O8370j04254
$$ plain form
14183 19804975 19059447 18693973 18367440 18012439 17578713 17460897 16810639 16562411 16301866
14174 16301866 15883052 15246557 15118623 14855004 14731662 14172922 14149157 13939018 13495498
14165 13495498 13849524 12894665 12647755 12275149 12264214 12435298 11614901 11443053 11422436 11078674
14155 11078674 10896755 10885371 10778540 10346336 10121993 10214958 10073937 9962008 9674093 9527950
14145 9527950 9465436 9085019 9071870 8974971 8537590 8789854 8543722 8358064 8307247 8110457
14135 8110457 7970046 7862239 7614042 7532592 7389745 7526528 7447299 7162548 7329609 6757031
14125 6757031 6731656 7018352 6921030 6516668 6564138 6585545 6771551 6094270 6399297 6046670
14115 6046670 6174641 6174422 5739872 5745212 5897530 5721824 5774880 5138120 5282948 5351318 5247064
14104E247064J62736l88142n6644K65499l24563J66619k58788K5994R8229l29753
14094D608251j48016J17439K3237l03660j01522J31802m6295L36356m81131K5825
14084D162286k42710M06650J20813k49876J34107k74420J2542k74691J83912k35091
14074C743522K90615m89457J48815k0594j22529q7169K43068o00965J73693L06961
14064C585960o9697J35299o960j08035l06194Q7555p9746k3763j1966n2049J22008
14053C272412l66910J89689j74734j47547L09513k51360Q0747J49784k93501P0545
14043B838638K5888O5744j00560l3409l00979J94027l95306N04764P3757l21708
14033B550856K5010J36264m31735M70136r7000k39058j11553j79503K54434R9233
$$ plain form
14104 5247064 5409800 5021658 4965014 5230513 4905950 5072569 4813781 4839775 4938004 4608251
14094 4608251 4460235 4577674 4600911 4297251 4195729 4327531 4281236 4617592 4136461 4162286
14084 4162286 3919576 4326226 4447039 4197163 4331270 4056850 4069392 3794701 3978613 3743522
14074 3743522 4034137 3544680 3693495 3672901 3550372 3463203 3706271 3105306 3278999 3585960
14064 3585960 3516263 3651562 3644602 3536567 3230373 3317928 3238182 3214419 3202453 3150404 3272412
14053 3272412 2905502 3095191 2920457 2772910 3082423 2831063 2911810 3061594 2768093 2838638
14043 2838638 2864526 2930270 2829710 2796301 2495322 2689349 2294043 2798807 2872564 2550856
14033 2550856 2575866 2712130 2280395 2750531 2653531 2414473 2302920 2123417 2377851 2477084
14023B477084l8848n2504o6841j94861J29241k17723J02022j72267J02556q0498
14013A987361j03923L62369k31494Q4226q9421k55418O6290J08984q344O4813
14003A985443k92655J95878Q8059n02898L56588j04834J9051M2647l0158Q1630
13993A838751K48827o4689J54227Q90323J251687L334441N242316J1836429Q641160
13984C3373472j1889921q391741m539855k458516j195345j137604p87215N5088
13976C028363K6879l02292k65089j00054n9867j1178j40222Q7922j72p1912j0017
13965B182361k11901J09256l63561j00253j61961M45771l12097K05718k84418
13956A508915K92672m54754L71383j26304j62501K29198k38058J00349K66304
$$ plain form
14023 2477084 2438236 2385732 2318891 2124030 2253271 2035548 2137570 1965303 2067859 1987361
14013 1987361 1883438 2245807 2014313 2098539 2009118 1753700 1819990 1928974 1920630 1985443
14003 1985443 1692788 1888666 1976725 1473827 1830415 1725581 1744632 1787279 1757121 1838751
13993 1838751 2087578 2022889 2177116 3067439 4319126 7653567 12895883 24732312 33373472
13984 33373472 21483551 13091810 8551955 6093439 4898094 3760490 2973275 3028363
13976 3028363 3055242 2752950 2487861 2387807 2327940 2316762 2176540 2264462 2264290 2192378 2182361
13965 2182361 1970460 2079716 1716155 1615902 1453941 1899712 1587615 1793333 1508915
13956 1508915 1801587 1346833 1718216 1591912 1429411 1658609 1420551 1520900 1787204
13947A787204j53557j58448P3451M1878O4137j10834j35403J77058k54049K12257
13937A543694n3748j71601R9843j44535J8090k75496K38156J07947N8221J68698
13927A589269j47360k46625j45583J88836J2198k11482Q4197q658J6205L35889
13917A466886k13563k3513k11627L80685l29170M9964k59547L32910K31433l41311
13907A083147J39564M2631l01375p8339M5323r9076M41483j52441l01665J67885
13897I87137J72679k17105j83739K70926N2728k18696J01753M720M90958k99477
13887A161884m14150K45153J41657o7706q0375K80166j18994k2581k34929J09574
13877I99699R9897O0205k95098N43267C24987P55464N1931J46336m19757J19736
$$ plain form
13947 1787204 1633647 1475199 1548650 1590528 1654665 1543831 1408428 1585486 1331437 1543694
13937 1543694 1489946 1318345 1418188 1273653 1291743 1016247 1254403 1362350 1420571 1589269
13927 1589269 1441909 1195284 1049701 1238537 1250735 1039253 1123450 1114792 1130997 1466886
13917 1466886 1253323 1229810 1018183 1398868 1069698 1119662 860115 1193025 1424458 1083147
13907 1083147 1222711 1265342 963967 885628 930951 831875 1273358 1120917 819252 987137
13897 987137 1159816 942711 758972 1029898 1082626 863930 965683 970403 1461361 1161884
13887 1161884 747734 992887 1134544 1066838 986463 1266629 1147635 1125054 890125 999699
13877 999699 1099596 1159801 864703 1407970 324987 1080451 1132382 1278718 858961 978697
13867I78697l35863J21267J56816j13225K11578J43383r4617J03231q9206l77052
13857G05009K96574J19011m72935O3203j2981K18213k05848K22036k89019J13257
13847G56520K64169k52921J63052m3846j77064L30784j03042j16238j72046M63556
13837A112924l86501J29598R027j14598L42469l52733k29636K10192J703J5402
13827G37847K7792j21647j82872N2675L31859k87687K71053o6608k0718J75077
13817I16771o0472k9345j13071L6035K5182Q5717A76763N23234M869N8503o8640
13806F94729N1195C48576K51665r1316L33215L20370E02965q0799L47508k09132
13796E60542L78759k74106p6641M6814J96629k84469K17910j62600k1803O6229
$$ plain form
13867 978697 642834 764101 920917 807692 1019270 1162653 1068036 1171267 1082061 705009
13857 705009 1001583 1120594 647659 710862 697881 916094 710246 932282 643263 756520
13847 756520 1020689 767768 930820 886974 709910 1040694 937652 821414 649368 1112924
13837 1112924 726423 856021 865048 750450 1092919 740186 510550 720742 722445 737847
13827 737847 765639 643992 461120 513795 845654 557967 829020 762412 741694 916771
13817 916771 856299 826954 713883 749918 775100 860817 176763 699997 704866 763369 694729
13806 694729 745924 348576 600241 508925 842140 1162510 502965 422166 769674 560542
13796 560542 939301 665195 588554 635368 831997 547528 765438 602838 581035 647264
13786F47264l8276p9121o9095B20779M90706k20800J67946O066K86559D44547
13775H82032k49278o6202j46132K06185L1126k8023j85258p4899K08121J31238
13765G08910j178k14142k35768O6153J46858L02180k96488m2479J71089k01053
13755D04082A89422P7636N26164R638C98416j37060L64378l2859j82596K18870
13745F29149m5857k31935O9907K41719p9277j62192M9984n7562O4724J49916k46870
13734C81706M42355l78674N9341n2939j45293L99615B62436L23356o0223j49461
13724C76108J18812B16101K67521K91396m3676l64155N3399j28864K16892j44673
13714C63941J65790J680j35421D8743L86437R523P114j59068M59421O095l24316
$$ plain form
13786 647264 608988 529867 460772 220779 711485 490685 658631 664697 951256 444547
13775 882032 632754 566552 420420 626605 657731 629708 444450 369551 577672 708910
13765 708910 707732 493590 257822 323975 470833 773013 476525 434046 605135 404082
13755 404082 189422 267058 793222 802860 398416 261356 625734 592875 410279 629149
13745 629149 583292 351357 421264 662983 583706 421514 471498 413936 478660 628576 381706
13734 381706 824061 445387 504728 451789 306496 706111 262436 585792 525569 376108
13724 376108 494920 216101 483622 775018 731342 367187 420586 291722 508614 363941
13714 363941 529731 531411 395990 48743 435180 444703 451817 292749 752170 758265 433949
13703D33949K5824P3382J17187k51192j79908J81050K8333k267L8731A91808J25257
13692C17065J07181O3248j56951J63607J64837j49536j07501k575j43129L17888
13682E74134j22109j50463l0578N6553N8812m8156M13056B17197J37590J96310
13672E51097r4816J91582k47400m7964p7359P2859j28992J64400P7706O6969A81900
13660E99562o2814J33387B79363f7496b1665B24660J06664a3237A46918N08504
13650F55422k84309m6206n5129m1832A6251K80205J16914K2111q3669J96731k58461
13639B90082j1471C9539J67581L11733k21823Q2537J90598j50736k07053A5995
13628C41568P9022L8726j9422l5973p191I0875N54054A80694K43557j10483j24344
$$ plain form
13703 433949 459773 533155 650342 399150 219242 400292 428625 426358 465089 191808 317065
13692 317065 424246 487494 330543 494150 658987 509451 401950 399375 256246 574134
13682 574134 452025 301562 270984 327537 386349 338193 751249 217197 354787 551097
13672 551097 456281 647863 400463 352499 275140 347999 219007 383407 461113 528082 181900
13660 599562 536748 670135 279363 -67496 -21665 224660 331324 -13237 146918 655422
13650 655422 371113 324907 269778 227946 16251 296456 413370 435481 351812 548543 290082
13639 290082 278611 39539 207120 518853 297030 379567 570165 419429 212376 15995
13628 341568 420590 459316 439894 403921 396730 90875 644929 180694 424251 313768 189424
13617A89424O5492L9566q7844J11123Q8318j77912O3183M7871k1506J07594k06580
13606B18729J47257j8335P3617o4632L9790j66902F0593L22898j09601J37413
13596D11303n2965r1006M0373o5050I318N56576A46258J80209I0149K65339j32260
13585B23228a0226D06547j1042A87211J489o2410K26053F9573K11067O7645B7597
13573I8968N0480O607Q7680l6265J59374P5107A28762M3550h609D43152j84383
13562B58769E6574K71905K8753j64589Q6238R0993h4629A96472J0020J21991b8564
13550D03139A22126l9416Q7579l6668L08507l5157F3682R0022K12214j73376K52917
13539D45459k20500n7774J35328b411A45753B206M02894B1638M18976I6896J65301
$$ plain form
13617 189424 254916 294482 206638 317761 406079 228167 291350 339221 317715 425309 218729
13606 218729 365986 347651 421268 356636 396426 229524 60593 383491 273890 411303
13596 411303 358338 267332 307705 242655 9318 565894 146258 326467 90149 355488 223228
13585 223228 -10226 406547 395505 187211 188700 126290 352343 69573 280640 348285 27597
13573 98968 149448 156055 243735 207470 366844 441951 128762 172312 -8609 443152 258769
13562 258769 56574 328479 357232 192643 278881 369874 -84629 196472 206492 328483 -28564
13550 403139 122126 82710 170289 133621 442128 406971 63682 153704 365918 192542 445459
13539 445459 224959 167185 302513 -2411 145753 2206 405100 21638 440614 96896 262197
13528B62197J51278d4984D80456B04148K2866J43608A7689K34286N8174L5247
13518C45396j65266m6609J04614r2421E7764K01349o6448J58127e2105A9709K36602
13507B56311K36679j62539m4329C9617L0285J25447K9099a3567C37234A06613
13496a37858C16982i255B99911o7616J35025n371l9865D2661K7593L88270A37612
13484A27892P5195N8618G1270P8697O9921a43677A23353J23822a40287C84807
13473A28612M5922n6156F734L55096M7581B4340M47563A49352J59390j05318L31288
13462E34712B12978N9917J38148A64861P0181J5470R3834q5162n6589J0966m9893
13451A63668Q1671o5431K08669B5314N8472K0100a5933j81805B83062N4484G6472
$$ plain form
13528 262197 413475 -44984 480456 204148 227014 370622 17689 251975 310149 345396
13518 345396 180130 133521 238135 145714 57764 259113 192665 350792 -52105 19709 256311
13507 256311 492990 330451 286122 39617 69902 195349 224448 -13567 337234 106613
13496 -137858 316982 -9255 299911 232295 367320 361949 322084 42661 70254 458524 137612
13484 127892 203087 261705 71270 149967 219888 -143677 123353 247175 -140287 384807
13473 128612 174534 118378 6734 361830 409411 24340 471903 149352 308742 203424 534712
13462 534712 212978 272895 411043 164861 235042 250512 344346 259184 202595 213561 163668
13451 163668 245339 179908 388577 25314 83786 103886 -15933 -197738 283062 337546 76472
13439D2108J16430b05025B12732a5285b827C78690D1328M29428A33547A6049g1374
13427A66970c08944C23787j49166k1644K53156n4371a5405A19204f6663F1552
13416C97906j45934p0925m6382K30832b71345D8937J91430I0448K8273J69562
13406B88283E6750R2895m2706g3156C17475i0207j1821B66916o5420L0334L3172
13395B65002l3980J34165I6984b4221B81288K2330e3054A21387D1603J48660g7391
13383A06433K2941J70749A31333k4227a27018j30168D7506a60763C76079A35449
13372B1233N2298K82689j20795I6212A6665i4432D22920b98847A81162J07905
13362B89067D7777N802a36457d287E0764r746k504N04178k03217C345K67044j24491
$$ plain form
13439 42108 158538 -205025 212732 -15285 -2827 378690 41328 470756 133547 16049 -71374
13427 166970 -308944 323787 174621 152977 406133 351762 -15405 119204 -66663 61552
13416 397906 251972 181047 134665 365497 -271345 48937 240367 90448 118721 288283
13406 288283 56750 149645 106939 -73156 317475 -90207 -102028 266916 201496 231830 265002
13395 265002 231022 365187 96984 -24221 281288 303618 -53054 121387 41603 190263 -77391
13383 106433 129374 300123 131333 107106 -127018 -257186 47506 -160763 376079 135449
13372 21233 73531 356220 235425 96212 16665 -94432 422920 -298847 181162 289067
13362 289067 47777 53579 -136457 -4287 50764 41018 38514 542692 339475 3345 270389 145898
13350A45898M53296k46685A52853J73027p8828r9352F0341j3439K07000j3166
13340B40736k8381G9051L58934e548C27381J87303c9033B86177C7454R8104B1376
13328A89075K5469P2691K8126J17592B13852A00842J22921H6563b0376A35251
13317A46946p1462Q1587K6863O8844m2398Q6287A28177J27689j13997a86938A42872
13305B0653a5874j7256p1783D2719P6737b06724C86868E0362J41284J42243l8679
13294B95210j08657i79C16832K9711C4719J63317B8031a23290q0404B64475C9765
13282A16246A5799a9672F7644B9496L22286d3315r5822j83574c1020A7213K64885
13271B82098I5450l9763R5830a21722A53213C8065K68213A29256J12381e378j15718
$$ plain form
13350 145898 599194 352509 152853 325880 247052 147700 60341 46902 253902 240736
13340 240736 212355 79051 437985 -5548 327381 514684 -39033 286177 37454 135558 21376
13328 189075 214544 287235 315361 432953 213852 100842 223763 86563 -20376 135251
13317 146946 75484 157071 183934 252778 210380 296667 128177 255866 141869 -186938 142872
13305 20653 -15874 -33130 -104913 42719 119456 -206724 386868 50362 191646 333889 295210
13294 295210 186553 -979 316832 346543 34719 198036 28031 -123290 -203694 264475 39765
13282 116246 15799 -19672 67644 29496 351782 -43315 -139137 -322711 -31020 17213 282098
13271 282098 95450 55687 151517 -121722 153213 38065 306278 129256 241637 -5378 -121096
13260a21096j08149H7569N8199J65128l5383l3409p9322a8799j34080C63824j43929
13249B19895J59799A85126R3123a00418D4450R8641a5368j71699D633a02158C1944
13237A26691O6426n918f9705E68898G4066b8371A5855b85678F7643c46459A74807
13225B16028F3241f5055i053j39595A69605a20518j9476A43078b8979A25439f0583
13213A26409i210a679j12298A35357E0056i2163G1587a91507j16306A80057l6630
13202A43427R342J763K7112B5880g0120a8212j09633A66948e8513A39926D9992
13190I4242a21424A64824J03974p9508n3007b41816a20224b3189E4652J29320
13180A83972b1443H6602p529K36514H3126J43086a18309b400B06884l3095j5828
$$ plain form
13260 -121096 -229245 87569 145768 310896 275513 242104 162782 -18799 -152879 363824 219895
13249 219895 379694 185126 278249 -100418 44450 143091 -15368 -187067 4633 -102158 31944
13237 126691 193117 187199 -69705 568898 74066 -28371 15855 -285678 67643 -346459 174807
13225 216028 63241 -65055 -9053 -148648 169605 -120518 -139994 143078 -28979 125439 -60583
13213 126409 -9210 -1679 -113977 135357 50056 -92163 71587 -191507 -307813 180057 143427
13202 143427 152769 154532 181644 25880 -70120 -18212 -127845 166948 -58513 139926 49992
13190 94242 -121424 164824 268798 189290 136283 -241816 -120224 -23189 54652 183972
13180 183972 -21443 86602 79073 315587 83126 226212 -118309 -2400 206884 173789 157961
13169A57961P6852n1396j8788e7648A04231K00527g6064B08194M582L7186d5469
13157D0786J24185R5943j12731N069L24653a83701P7409K1939B04765F0907k4563
13146C6344Q3269n686c1092j39159A46014h555B68977j27962k4914R5590B255
13134c515A52861K854d3938a6693l1802l30965a41436A03264O9475a64337B74233
13122G5476a66903c2664D701a89622H2259K48055a37529C34603F9682k7103a19820
13110A36876n1603J83126J50678b38212C3337e0223A93094G1516l4035L91329
13100D28810a340I9670d060A28742a3073q9437B8504g88A90677a31940A20341
13088A18032R0980h3829B246L1606Q5964m3276K78927a33416C49131a4280A82650
$$ plain form
13169 157961 234813 183417 164629 -57648 104231 304758 -76064 208194 212776 249962 -45469
13157 40786 164971 260914 148183 153252 477905 -183701 -106292 -84353 204765 60907 36344
13146 36344 119613 113927 -31092 -170251 146014 -8555 268977 141015 116101 211691 2255
13134 -3515 152861 155715 -43938 -16693 -48495 -379460 -141436 103264 172739 -164337 274233
13122 75476 -166903 -32664 4701 -189622 82259 330314 -137529 334603 69682 42579 -119820
13110 136876 85273 268399 419077 -238212 33337 -50223 193094 71516 37481 428810
13100 428810 -1340 99670 -4060 128742 -13073 -102510 28504 -788 190677 -131940 120341
13088 118032 209012 -83829 2246 33852 119816 76540 355467 -133416 349131 -14280 182650
13076G3264c9354o141o908B07448a107j98088I1944I692a67657G8951k935A6239
13063A0214J37845a06055B7468J93739c5549B67576G5313C2360J20807i1148C4207
13051i4668B95683b2808A22972E1881O5710K28968j18258d359H2477l5628J50716
13040A97565J380l9866D3767J80670A0208i11I3948K7288a45458i995K161B85778
13027a47077M4609A61686o5969l3056L5139k2380f3457c0595j21562f738C48853
13015a7699G8117g7014j83715F501K32341I1607a7406O280A65779J8630a43508
13003c0884J4796l9195C3713J6163d2053j18746B41359a44440n9387H558K92208
12992C00766F1435f5151r3362B75030C4208J44919G1249P1963n9365a00574D5207
$$ plain form
13076 73264 -39354 -45495 -52403 207448 -1107 -199195 91944 9692 -167657 78951 76016 16239
13063 10214 148059 -106055 27468 221207 -35549 267576 75313 32360 153167 -91148 34207
13051 -94668 295683 -22808 122972 51881 117591 346559 228301 -4359 82477 46849 197565
13040 197565 198945 159079 43767 224437 10208 -911 93948 121236 -145458 -9995 -7834 285778
13027 -147077 -102468 161686 95717 62661 97800 75420 -63457 -30595 -152157 -6738 348853
13015 -17699 78117 -77014 -260729 6501 238842 91607 -17406 -11126 165779 184409 -143508
13003 -30884 -16088 -55283 33713 49876 -42053 -160799 241359 -144440 -203827 8558 300766
12992 300766 61435 -65151 -158513 275030 34208 179127 71249 143212 83847 -100574 45207
12980C53697A45820c18622A85777d5748B63568i0203E7611M8472Q0254c04085
12969b1425B7496J31532a4832k7315A92802K06214A04760C1593K31224g7925j63917
12958b41842A54590K04643E7861a65577N3409C90727j59642j08102k73a0861A07222
12946a12898G6439c89081J31957h782j0820C2690c0146C2307J1274a06811C62045
12934h119r9344a6387A28335Q2909m6107a51254d0444m2215G5640J2288A1742
12922B411a66160A67813Q0870D2308a3165A37068M2074J9471a28755j16768e8907
12910I9762D6658i5605B43480F8088a31206p00B37522j09385P36B171K51166b02166
12897B05291g6189m9559n2009j2116H504f1309q7406A10880J4760c04A37837b93353
$$ plain form
12980 353697 145820 -318622 185777 -45748 263568 -90203 57611 106083 186337 -304085
12969 -21425 27496 159028 -14832 -42147 192802 399016 104760 31593 262817 -77925 -241842
12958 -241842 154590 359233 57861 -165577 -112168 390727 231085 122983 122710 -10861 107222
12946 -112898 76439 -389081 -257124 -8782 -19602 32690 -30146 32307 43581 -106811 362045
12934 -8119 -107463 -16387 128335 211244 165137 -151254 -40444 -82659 75640 87928 11742
12922 2411 -166160 167813 248683 42308 -13165 137068 179142 198613 -128755 -245523 -58907
12910 99762 46658 -95605 243480 68088 -131206 -131906 237522 128137 128873 2171 253337 -202166
12897 205291 -76189 -125748 -177757 -189873 8504 -61309 -148715 110880 125640 -304 137837 -293353
12884G9944J48449a75436L6853F6935O9274A2230J44010a52723M4739B38119b62331
12872a42439k08690G8691d14278A8680L4172K5106I183J19138a04738G5555k0430
12861E5125b90190j53457a51149b9277C36673j33565b62995f178r643C0977b76086
12849A16841k9626j3149J13740F2439i1418C01685a21103l3233j7035C274b50516
12837b77646B8785J29402Q9321a85995e465p8847j1046k21308a2179j40456g2240
12825C23340A16818J40312G8607c5386A92689a47954A39780F0999k2099A7169
12814g0365a9346A88806b0752p1756l3559o5431j2544C864e2001A33378c3069
12802A17978d7778j66112h4164A10105m0835A0114K21216b34170D8841L6613f3035
$$ plain form
12884 79944 228393 -175436 -138583 66935 136209 12230 156240 -152723 -107984 238119 -262331
12872 -142439 -351129 78691 -414278 18680 52852 77958 9183 128321 -104738 75555 55125
12861 55125 -290190 -443647 -151149 -29277 336673 203108 -262995 -6178 -15821 30977 -276086
12849 116841 87215 74066 187806 62439 -91418 301685 -121103 -154336 -171371 3274 -250516
12837 -277646 28785 158187 247508 -185995 -5465 -84312 -95358 -316666 -12179 -152635 -72240
12825 323340 116818 257130 78607 -35386 192689 -147954 139780 60999 38900 17169
12814 -70365 -19346 188806 -20752 -92508 -126067 -191498 -204042 3864 -52001 133378 -33069
12802 117978 -47778 -213890 -84164 110105 69270 10114 231330 -234170 48841 85454 -63035
12790a21408l1215N6019C1505K46799a04315A1288L51635b9124j30244E3307J69481
12779B22788b4844A45650a72228F467L9776P5162g3361a1960C54834d8321B28524
12767b49707o8182H1324a26659b8472L922B29833m8446b26090f3152j04395N1025
12756a16522B55051a38427A60456E4401a05521L9058A6000a76378A69606b30500
12745E0290b67449E1116b49541e7353J0184j06632C67618j55266D5257d772C21109
12733B13156F6194P6507K08622a06252k89659e815D8374P885K19603a50710G392
12721I9603K72872j82369L7356a3703C3147M4343J5813K03386B1679r585J71666
12710A83760a90004C10956o9939q198G7479B9845K50972A39654c4222B81603m2426
$$ plain form
12790 -121408 -152623 -96604 31505 278304 -104315 11288 362923 -29124 -159368 53307 222788
12779 222788 -24844 145650 -172228 6467 46243 121405 -73361 -11960 354834 -48321 228524
12767 -249707 -317889 81324 -126659 -28472 -24550 229833 181387 -226090 -63152 -167547 -116522
12756 -116522 255051 -138427 160456 54401 -105521 -66463 16000 -176378 169606 -230500
12745 50290 -267449 51116 -249541 -57353 -47169 -153801 367618 212352 45257 -4772 321109
12733 213156 66194 142701 351323 -106252 -395911 -5815 48374 56259 275862 -150710 7392
12721 99603 372475 190106 227462 -13703 33147 77490 93303 296689 21679 12094 183760
12710 183760 -190004 310956 241017 232819 77479 29845 280817 139654 -34222 281603 239177
12699B39177a34918A61163F4415N7842g486A07455h9519j50463I4187D0890a0473
12687i2138C60093a63004C04877A44048b01902g2210A26480K49611h3970b5512
12676A78444a32622B97519o2220A01943c42848C48738c19850I7882a56319M4003
12666a12316B53481a49250j33127A15748J39622p7542C3310J73140G6069M3053
12656A19122R0315a54663A84025F4941J50094l9961d5704H9418J98797H0041K2204
12645A02245d7056k1862A84286H7379j9980a75102j40660G6779B4918O3461a17404
12633b7188A78559k1953g065C05219j05287A5086g7188B73787c4733j62491A75551
12621F903J44685a01722B04139J01776d6708B00047b30689a2760J101q279B25972
$$ plain form
12699 239177 -134918 161163 64415 122257 -7486 107455 -89519 -239982 94187 40890 -10473
12687 -92138 360093 -163004 304877 144048 -201902 -72210 126480 376091 -83970 -25512
12676 178444 -132622 297519 235299 101943 -342848 348738 -319850 97882 -156319 -112316
12666 -112316 253481 -149250 -282377 115748 255370 177828 33310 206450 76069 119122
12656 119122 209437 -154663 184025 64941 215035 175074 -45704 89418 288215 80041 102245
12645 102245 -47056 -68918 184286 87379 67399 -175102 -315762 76779 24918 88379 -117404
12633 -27188 178559 156606 -7065 305219 199932 15086 -77188 273787 -34733 -197224 175551
12621 6903 151588 -101722 204139 305915 -46708 200047 -230689 -12760 -11659 -19938 225972
12609a51782G7126h4028j090l744C2267r513h239j03095n6488k3297D3625K405
12597D6030b72390C34751c4386B41770a69502B12442h7022l2479C960N5950b23308
12585a93384f0755C8133a22119j40598G4884a10711k6104n3821C17531a67054
12574b4533B9698e4459C70124h0843A48388E1862B5073K33941J91795c9476C7250
12562C62221a55461E916M3432a069D9847b98759A62688O9749a8860A37799e3524
12550A5698c9705A79294a94180B5222a22354B22687a03444B6017Q7454a91055
12539B8596J10690c10253Q5613m523F8604a52562A33882a8395p0066M2407j54534
12528b00588A12940K52846d6019l52919B05140a28829K4730C53548b36249I6476
$$ plain form
12609 -151782 77126 -84028 -85118 -88862 32267 22754 -8239 -111334 -167822 -191119 43625 46030
12597 46030 -272390 334751 -34386 241770 -169502 212442 -87022 -119501 3960 59910 -223308
12585 -193384 -60755 38133 -122119 -262717 74884 -110711 -136815 -190636 317531 -167054
12574 -24533 29698 -54459 370124 -80843 148388 51862 25073 259014 450809 -39476 37250
12562 362221 -155461 5916 49348 -1069 49847 -298759 162688 232437 -18860 137799 -53524
12550 15698 -39705 179294 -194180 25222 -122354 222687 -103444 26017 113471 -191055
12539 28596 139286 -310253 -224640 -229163 68604 -152562 133882 -18395 -88461 -46054 -200588
12528 -200588 112940 365786 -46019 -398938 205140 -128829 -104099 353548 -236249 96476
12517b24347g8640k711A17299a73380B73156d6191B93695o6823A3591J07721h7746
12505D1111f7032A70712a93477A3420Q5705m077a08425d8138B22712a83898c5543
12493c03185H3224J21749e9995q1899B84044C8443J21943f9783C07401I8557c9832
12481a86589C63972b24652i7976r4268A09281Q9274D2141d4907I4904C3296b97125
12469a45652k3823c8173B85000C5500g7617C62021a9385A44661i4895A38436a20214
12457a69115B77723b80996b4359j71846n6506A10408A2294Q5091l6715A8122P2179
12446I0301f2689k51615d0587a8380A56582g7905A40258n8500N0331c1756G3854
12434I2452a64463C08714e7400B02756b3789A5894d8006m1977A79291A9878i7373
$$ plain form
12517 -224347 -78640 -81351 117299 -173380 273156 -46191 293695 226872 13591 121312 -87746
12505 41111 -67032 170712 -193477 13420 99125 95048 -108425 -48138 222712 -183898 -35543
12493 -303185 83224 204973 -59995 -141894 284044 38443 160386 -69783 307401 98557 -39832
12481 -186589 363972 -224652 -97976 -192244 109281 198555 42141 -44907 94904 33296 -297125
12469 -145652 -169475 -38173 285000 35500 -77617 362021 -19385 144661 -94895 138436 -120214
12457 -169115 277723 -280996 -24359 -196205 -252711 110408 12294 97385 60670 18122 90301
12446 90301 -62689 -314304 -40587 -18380 156582 -77905 140258 81758 132089 -31756 73854
12434 92452 -164463 308714 -57400 202756 -23789 15894 -48006 -89983 179291 19878 -97373
12422b82287J01798B55800D5397b00296N1160j44675A20469i9531A11330e3567
12411A20980J5544F0525e09299A63434B3254a5146n1783j00643h1307j8963C9778
12399c9617B4358K8760O348q089b20118I1162h6734m6517o781M9566j13021j59103
12387c62590b9019H1106M6909O202e4942E8780J01911a735j18095I5300a04017
12375A80571a94913f036j46783G3749g4865F300K1358e1476j140F7597M386a17206
12362a95114D17575a94275A9477J56761a13102N452K6870j04885j88206A48317
12351F9147j3573h7041c9606C32810h4238k15735B9530a6196B90450a09881A58263
12339A49734b31097d1694A14367g8579B20083b770A09721g7054R077A21543k0097
$$ plain form
12422 -282287 -180489 255800 45397 -200296 -149136 -293811 120469 -99531 111330 -53567
12411 120980 136524 60525 -509299 163434 23254 -15146 -66929 -167572 -81307 -100270 39778
12399 -39617 24358 53118 59466 51377 -220118 91162 -86734 -133251 -140032 -90466 -203487 -362590
12387 -362590 -29019 81106 128015 134217 -54942 58780 160691 -1735 -119830 95300 -104017
12375 180571 -194913 -6036 -152819 73749 -74865 6300 27658 -51476 -52616 67597 71983 -117206
12362 -195114 417575 -194275 19477 176238 -113102 -107650 -80780 -185665 -373871 148317
12351 69147 55574 -87041 -39606 332810 -84238 -299973 29530 -16196 290450 -109881 158263
12339 149734 -231097 -41694 114367 -78579 220083 -2770 109721 -77054 -67977 121543 101446
12328A01446d4656H4379J09496H3478n308M7620o695a1348p6598A03631h9740
12316A43877E9244j8213b46867N6796B91829a41778N9325M700A70546h410C01268
12304B5555h2401C00715b7502j57694B13784b00563P2599D1055L97368k06010
12294B32413I69J0301L52807a64304e8594a0603n0017p5483I6491i0560K3634
12283f6926A30760M1635b8249A1486J26705h5427B53690a89182A38706a6713c907
12271c1457r9756K8473B8770a17753B52437g8300A05855e4146j32664N1009k49731
12260c85532a51103e8975A75795n8441B2069K56631e0525r4197A74940N5839b57287
12248B29294B3539b65270c9008A81843J0195d3648p2850C79108E7578J35276J50902
$$ plain form
12328 101446 -44656 84379 193875 83478 78170 125790 119095 -11348 -87946 103631 -89740
12316 143877 59244 41031 -246867 -190071 291829 -141778 -82453 -77753 170546 -8410 301268
12304 25555 -82401 300715 -27502 -185196 213784 -200563 -127964 41055 438423 232413
12294 232413 969 11270 364077 -164304 -58594 -10603 -60620 -136103 96491 -90560 -66926
12283 -66926 130760 172395 -28249 11486 138191 -85427 253690 -189182 138706 -16713 -3907
12271 -31457 -131213 -102740 28770 -117753 252437 -78300 105855 -54146 -186810 -135801 -385532
12260 -385532 -151103 -58975 175795 117354 22069 278700 -50525 -144722 174940 230779 -257287
12248 229294 23539 -265270 -39008 181843 192038 -43648 -116498 379108 57578 192854 343756
12237C43756c15138J28901B03007a05292C7893n887J01345i8289B43037J17746
12227C60783A18136a30305B71888e1801j7387A11998b01760Q8383M5743D89167
12216a43651A55639J29932j07731o6622C2980J00157J02750j00524C7987J37112
12206A75099J81557i3250B41721d5740A33767J7273d813l3074B16472a56373I0376
12194D3369a2427H6339C6079M6968J33226j01936P9065H02d4926E5969B4041J33473
12182A57514m2191K49733A76767H783a93563G2449J20101g255G673a04208r6175
12171b00383c2117A54046A8771b99410M7575B75665c3022k05586B09572o7418
12161A42154B8839M7738a96574c0164A63655k7939E9250O390a58272B16239e5541
$$ plain form
12237 343756 -315138 -186237 203007 -105292 37893 32006 133351 -98289 243037 360783
12227 360783 118136 -130305 271888 -51801 -69188 111998 -201760 -113377 -67634 489167
12216 -143651 155639 285571 177840 111218 32980 133137 235887 135363 37987 175099
12206 175099 356656 -93250 241721 -45740 133767 151040 -4813 -37887 216472 -156373 90376
12194 43369 -12427 86339 36079 83047 216273 114337 193402 802 -44926 55969 24041 157514
12182 157514 115323 365056 176767 8783 -193563 72449 192550 -7255 7673 -104208 -200383
12171 -200383 -32117 154046 18771 -299410 -251835 275665 -33022 -238608 209572 142154
12161 142154 28839 76577 -196574 -30164 163655 135716 59250 65640 -158272 216239 -55541
12149c9848B42145M3802j35344a25261C7418a10693M1219j41744C55566b33445
12138A6026a28098H5758K4691b00478B25761a67205F1105c9626A66048a27710
12127A64194E5481J2344b77313A67297b08691g5176r7629N7235b528D4964F517
12115C11837C9890f3641j791l6870c1736j72520k05253B00731b61171A91141e9227
12103A79365P7036b63452A6170n837K23837q243l1214c97213a75650d0420k3857
12092f4277I0106J75056E8137J55538c51978A92468a62866A09178c2386j36558
12082a68944D24806G033J7154L5473k5405O5647J19195a26587a9165r7234j10118
12071b26517c6497A71612a3283j685k02190G0326j4872L8523J34239J67922K80307
$$ plain form
12149 -39848 242145 285947 150603 -125261 37418 -110693 -69474 -211218 355566 -233445
12138 16026 -128098 85758 110449 -200478 225761 -167205 61105 -39626 166048 -127710
12127 164194 55481 67825 -277313 167297 -208691 -75176 -172805 -115570 -2528 44964 6517
12115 311837 39890 -63641 -65432 -102302 -31736 -204256 -409509 200731 -261171 191141 -59227
12103 179365 256401 -263452 16170 10333 234170 225927 194713 -397213 -175650 -40420 -64277
12092 -64277 90106 265162 58137 213675 -351978 192468 -162866 109178 -32386 -168944
12082 -168944 424806 7033 24187 59660 34255 99902 219097 -126587 -19165 -116399 -226517
12071 -226517 -36497 171612 -13283 -14968 -217158 70326 55454 93977 228216 396138 676445
12060F76445k75934K31890A68102a87072C30938A16223C3621a36263A13448f1302
12049a29881j1047A59499b4899b546A03027c91869C1566K9955l483f5143m5677
12038a10820q9036J2026N3583j37517g0581B04938J46091A42345j0805d3659B8425
12026f432A38755J8649Q0579N2588P0882c24552A3392J2171e5196C62091a1866
12014g1316K3824J1895o57j22618i495F6017j1381g2989A30452a72107j3983O4980
12002a21110B36660N090e8928E0921a96609g4307C970a36400A41123f2746C7781
11990a57051a9840l68655f4095A63862e1569j60676j3366B39567c08455A10743
11979I6245b32866p4948M2449b4385B74707e5958k46272g1952k055j70377e9848
$$ plain form
12060 676445 400511 632401 168102 -187072 330938 116223 33621 -136263 113448 -61302
12049 -129881 -140928 159499 -24899 -2546 103027 -391869 31566 61521 58038 -65143 -110820
12038 -110820 -199856 -187830 -134247 -271764 -70581 204938 351029 142345 131540 -43659 28425
12026 -6432 138755 157404 237983 290571 361453 -324552 13392 25563 -55196 362091 -11866
12014 -71316 -47492 -35597 -36254 -158872 -9495 66017 54636 -72989 130452 -172107 -186090 -121110
12002 -121110 236660 241750 -58928 50921 -196609 -74307 3970 -136400 141123 -62746 37781
11990 -157051 -19840 -388495 -64095 163862 -51569 -212245 -225611 239567 -308455 110743
11979 96245 -232866 -307814 -265365 -24385 274707 -55958 -302230 -71952 -74007 -244384 -59848
11967F9869a79002a2369A89100h6556J5367A6085g237k45066O5985h3181n6361
11956a39542q2639g0972G202O3292K9957k1569b04816g7344A42094b57790H3001
11944a25085j10761C80892B9159J03763J02962D9599d1217q6696A05569k9617
11934G5952b57597P9620P7654F188Q6444a79071F2636L23775i6146j23939o5790
11923b85875b4141o2260a1919A71885a87920J6391m7617L1032O4897A28140D5035
11911A24277E4591c44560a33544j70360M3689B23311f9189q1055M9303G8189J01760
11900A79949a37974i478A25279c7097B76426C9292a66735f6858k31016D18744
11889d2338q3992N3585B327a67501d1319l28966A35053M4553D7789a49910j0178
$$ plain form
11967 69869 -179002 -12369 189100 -86556 -71189 16085 -7237 -252303 -186318 -83181 -139542
11956 -139542 -222181 -70972 7202 70494 100451 78882 -204816 -77344 142094 -257790 83001
11944 -125085 -235846 380892 29159 132922 235884 49599 -41217 -127913 105569 75952
11934 75952 -257597 -177977 -100323 6188 92632 -179071 62636 386411 -96146 -220085 -285875
11923 -285875 -24141 -86401 -11919 171885 -187920 -171529 -219146 -188114 -123217 128140 45035
11911 124277 54591 -344560 -133544 -303904 -260215 223311 -69189 -150244 -100941 78189 179949
11900 179949 -137974 -9478 125279 -37097 276426 39292 -166735 -66858 -297874 418744
11889 -42338 -126330 -72745 2327 -167501 -41319 -370285 135053 179606 47789 -149910 -160088
11878a60088a1928j34618A28624C025g5638C1747i6386K120L8455o3589l702A25734
11865g5744A56710B3034b11556i9481K0256E6052J21384a73059I160J67993k9836
11854A47317a18559a7777k5666A50194a42078A08246l7350a54082f3468H619h9781
11842C5043L81018D1813b57088a13907C28763H8566a32818j15242N0990i3214
11831a13671c3198B60800p4116c30616d3461j30891l4047M2520C8443b31929A74697
11819a47658G578b88417a13790m2183j42456H1791b96730L0484C01264b60590
11808a92911P4688e1183p1308j92294e0013Q883f302j6654j49611a712l5665A34191
11795G2590C223M2011b90966A0569f4950k0272L3557j71647A32269a96282B20573
$$ plain form
11878 -160088 -11928 -146546 128624 3025 -75638 31747 -96386 -94266 -55811 -119400 -123102 125734
11865 -75744 156710 23034 -211556 -99481 -79225 56052 177436 -173059 9160 177153 147317
11854 147317 -118559 -17777 -43443 150194 -142078 108246 70896 -154082 -63468 8619 -89781
11842 35043 416061 41813 -257088 -113907 328763 88566 -132818 -248060 -197070 -93214
11831 -113671 -33198 260800 186684 -330616 -43461 -174352 -208399 -165879 38443 -231929 174697
11819 -147658 7578 -288417 -113790 -155973 -298429 81791 -296730 -266246 301264 -260590
11808 -192911 -118223 -51183 -122491 -314785 -50013 -41130 -6302 -22956 -172567 -1712 -37377 134191
11795 72590 3223 45234 -290966 10569 -64950 -85222 -51665 -223312 132269 -196282 220573
11783a99328C00606b96413J40680K9730a3727A32056b63056I8375g203j21719
11773a28922G8621K053L5435h0110H8976J49457j08301l5160C3319b6950B37659
11761A2895J16078F3935Q6018a1231o2750j53496J08190B663b41415I06a47659
11749I4718a35103A07361J18814d3424B0022P3162G458a83624j7187b1059A86289
11737a05729M7534I1188k5K9463a73648E9867a24794e8045A47671D5310K2478
11726F7788c24720A66274a25525c0064A08115f6223l889A93124F3137N2589i117
11714e4448A10001h6474J7665j47556p374A4260a12629e4921D3416d9549A01692
11702b16079d0910p8742A45774a76658i392k43894A84613l772h1647A33893a22067
$$ plain form
11783 -199328 300606 -296413 -155733 -126003 -13727 132056 -263056 98375 -7203 -128922
11773 -128922 78621 80674 116109 -80110 88976 238433 130132 94972 33319 -26950 237659
11761 12895 128973 63935 149953 -11231 -73981 -227477 -119287 2663 -241415 906 -147659
11749 94718 -135103 107361 226175 -43424 20022 93184 7458 -183624 -200811 -21059 186289
11737 -105729 -58195 91188 91163 120626 -173648 59867 -124794 -58045 147671 45310 67788
11726 67788 -324720 166274 -125525 -30064 108115 -66223 -70112 193124 63137 115726 -9117
11714 -54448 110001 -86474 -68809 -216365 -223739 14260 -112629 -54921 43416 -49549 101692
11702 -216079 -40910 -119652 145774 -176658 -9392 -253286 184613 180841 -81647 133893 -122067
11690G0186a30538m8815A49932A8110M8147c16816A09461b3735k39792I1840B7174
11678A20945a9423D2308L2606K6659m862a49707a7305l887A8136J31288a53877
11666h0686k85902a07432A8452b58750g5639H910e5222F7911a23059p3187k9071
11655b25317A006Q4952c59092a21972N278C28997A57491f0868I1652h3498A99628
11643a45850G1785J36050A3076K4710C628J54948e8627C5636c0580j44936I627
11631c8421E8506b04284A93595a96190A70927O1805C1299M1298A2074J72341O0931
11620B45346C666b3041j9019r1160B992b49227a16676k43598a20029B36619H895
11608b60975h3048K9883j08680a3769q527A57116j6459a70881j9018i1209q842
$$ plain form
11690 70186 -130538 -179353 149932 18110 66257 -316816 109461 -23735 -263527 91840 27174
11678 120945 -19423 42308 74914 101573 96711 -149707 -17305 -21192 18136 149424 -153877
11666 -80686 -366588 -107432 18452 -258750 -75639 8910 -55222 67911 -123059 -196246 -225317
11655 -225317 1006 85958 -359092 -121972 -116694 328997 157491 -60868 91652 -83498 199628
11643 -145850 71785 207835 13076 37786 3628 158576 -58627 35636 -30580 -175516 9627
11631 -38421 58506 -204284 193595 -196190 170927 232732 31299 72597 12074 184415 245346
11620 245346 3666 -23041 -42060 -133220 2992 -249227 -116676 -360274 -120029 236619 8895
11608 -260975 -83048 -53165 -161845 -13769 -22296 157116 140657 -170881 -189899 -91209 -100051
11597a00051L3521j25878L9529F881c5817j28828g4377A95565A6931J36048M3219
11586A96198d3969j99180L2833C42953IQ2849J12047a28485m0509A83667J65863
11575C49530b5210A48070p0235J29708q6109K09161l4285c9300B82467b5918j19142
11564a45060B9297b51293A79763a66417F1867J06123B7598i7334A85574a45102
11553B56501M4562a99090A73748b77656k18178F596e1319k6241L2713A28510G868
11541a07293c8733n3808I6857h788D24644j68758a06861A85804N8128F7430R1093
11530A58523E4863d1337k65901A09831e4803J9958C81063f7320A7453H540O4062
11519G2602a00881D73728h8887A55398E5653i4489j56621b9486B27028d3800K0119
$$ plain form
11597 -100051 -66530 -192408 -152879 6881 -35817 -164645 -74377 195565 16931 152979 196198
11586 196198 -43969 -243149 -210316 342953 9 82858 194905 -128485 -168994 183667 349530
11575 349530 -25210 148070 77835 207543 121434 330595 296310 -39300 282467 -25918 -145060
11564 -145060 29297 -251293 179763 -166417 61867 167990 27598 -97334 185574 -145102
11553 256501 301063 -199090 173748 -277656 -495834 6596 -51319 -77560 -44847 128510 7868
11541 -107293 -38733 -92541 96857 -8788 424644 255886 -106861 185804 243932 67430 158523
11530 158523 54863 -41337 -307238 109831 -54803 -34845 381063 -67320 17453 8540 72602
11519 72602 -100881 473728 -88887 155398 55653 -94489 -251110 -29486 227028 -43800 -23681
11508b3681q0895k4390A56118Q2225G1781i4078K9559L31A96276F3188g3811I2650
11495B12033l0575e6068l2702C00518p5525G8752a10096B45117A14554P763a1389
11483a28771B47965p1037b52519A51571N4168N7683D9722Q003J75180r8891K1276
11472A55290a45297B04680L16395G9780b69381E6005K21973j36967D1614J71557
11462B13171a34612O1438H5120a05753d5665j27324B24322A5845g6074A21161
11451c5711A64960n8840a92481D14139j59603F4478b7108k9149A75697a04732
11440C43793B8479L84612A84947B6451a88283M2178a5399m2893b3573k48969F7399
11428g9920A6060J27156a67668P3629L5849K8420B16430h3999A94201g1045j09766
$$ plain form
11508 -23681 -104576 -128966 156118 238343 71781 -94078 -64519 -64188 196276 63188 -73811 92650
11495 212033 181458 -56068 -88770 300518 224993 78752 -110096 245117 114554 122317 -11389
11483 -128771 247965 176928 -252519 151571 205739 263422 49722 57725 232905 134014 155290
11472 155290 -145297 204680 521075 79780 -269381 56005 277978 141011 41614 213171
11462 213171 -134612 -73174 85120 -105753 -45665 -172989 224322 15845 -76074 121161
11451 -35711 164960 106120 -192481 414139 254536 64478 -27108 -56257 175697 -104732
11440 343793 28479 413091 184947 26451 -188283 -146105 -15399 -58292 -23573 -272542 67399
11428 -79920 16060 143216 -167668 -94039 -58190 -29770 216430 -83999 194201 -71045 -180811
11417a80811A1316K92959a71131f2481k58889i5083P539C3221a36339M5560k63815
11406c54594B0421P6697J05176a35943d2293q3422O1421H6785f8322l17527a49890
11394d6954C947b94227o8076a06401B2588a03012B7521a18378A12957c9882j9039
11383e8921J639B24549a003C2469K7915j1858e190j41991A01614a19874B15505
11371G8976N4695o4042N3573E0578a16618A29101a67278E8177b03206C0544a79357
11359c94894A86531f7966A08409e8668A9480K09612m1501e4790H2890h6162A73446
11347c03655e0472A25611a1724k42915a6911l6112o0963d9853C4798J09897a57340
11335F0634a63002r902A21704a4999k6506j48610g1969r46H7258b64803C32963
$$ plain form
11417 -180811 11316 304275 -171131 -62481 -321370 -95083 -87544 33221 -136339 -90779 -354594
11406 -354594 20421 97118 202294 -135943 -42293 -125715 -64294 86785 -68322 -385849 -149890
11394 -46954 3947 -294227 -362303 -106401 22588 -103012 27521 -118378 112957 -39882 -58921
11383 -58921 -57282 224549 -1003 32469 60384 48526 -5190 -147181 101614 -119874 215505
11371 78976 133671 69629 123202 50578 -116618 129101 -167278 58177 -203206 30544 -179357
11359 -394894 186531 -67966 108409 -58668 19480 229092 187591 -54790 82890 -86162 173446
11347 -303655 -50472 125611 -11724 -254639 -16911 -53023 -113986 -49853 34798 144695 -157340
11335 60634 -163002 -172904 121704 -14999 -41505 -190115 -71969 -72915 87258 -264803 332963
11323I2918P4960f1706F7526Q3995g2783F7094A7253J43030a14077a0157c92j35710
11311a36102k00381a21089H5925c76476B9758a40123a3121D6819j0754J78670
11301B14735d05675B3454O9355b4555B23057D9051q282e603j65729j00222E0955
11289d16982i1203b6546E9792a13170C27246c48864B3661M7798R2026m3185n6604
11278F3696c4703A09253e0834D3728a86050E3453J34072J36282b50403A58158
11267b20069D2665J17312d5079C02808G0876b2875k86193C04164b08308H9402
11256b2725r841m7746I6712D3118B1437G308b72818A40072J51845A42616L7683
11245A80299a98560d3631k73393a31253l9252P6000C5360a67528j69075g3838
$$ plain form
11323 92918 167878 -61706 67526 151521 -72783 67094 17253 160283 -114077 -10157 -392 -136102
11311 -136102 -336483 -121089 85925 -376476 29758 -140123 -13121 46819 36065 214735
11301 214735 -405675 23454 92809 -24555 223057 49051 40769 -5603 -171332 -271554 50955
11289 -416982 -91203 -26546 59792 -113170 327246 -348864 23661 71459 163485 120300 63696
11278 63696 -34703 109253 -50834 43728 -186050 53453 187525 323807 -250403 158158
11267 -220069 42665 159977 -45079 302808 70876 -22875 -309068 304164 -208308 89402
11256 -22725 -32566 -80312 96712 43118 21437 7308 -272818 140072 291917 142616 180299
11245 180299 -198560 -43631 -317024 -131253 -170505 -94505 35360 -167528 -336603 -73838
11234B17814a4147j7903j63868c4375o803E1572h7969A2529a12099A7088j214
11223A5874a46103p1181j1179d6126D1770k261b74559A42769b6986A33159b27764
11211b3811B04851a82767g6462A62997D8868M4293A4611Q7906F376J69660h502
11199c70534C5840a72610B00110g7571j12819e3015I9439J6597c9428j46300B45807
11187e3616G3056b71855k4763J41178j77713B55244o3865l6282d3059n3279k5374
11176a21712j39860B3654c71227c2340A09370A6538K6481Q5909k223E1704k1470
11165C0234d3827o3661A96105l7410b2127j70021k9173a0652B41200g5576F414
11153a82687j4025j56285F5521d8518B4345P2098Q2910b40341j3046h1344j1021
$$ plain form
11234 217814 -14147 -32050 -195918 -34375 -41178 51572 -87969 12529 -112099 17088 15874
11223 15874 -146103 -217284 -228463 -46126 41770 39509 -274559 142769 -26986 133159 -227764
11211 -23811 204851 -182767 -76462 162997 48868 93161 14611 102517 6376 176036 -8502
11199 -370534 35840 -172610 200110 -77571 -190390 -53015 99439 116036 -39428 -185728 245807
11187 -53616 73056 -271855 -296618 -155440 -333153 255244 191379 155097 -43059 -96338 -121712
11176 -121712 -261572 23654 -371227 -32340 109370 16538 43019 128928 126705 51704 30234
11165 30234 -43827 -107488 196105 158695 -22127 -192148 -221321 -10652 241200 -75576 6414
11153 -182687 -196712 -352997 65521 -48518 24345 96443 179353 -240341 -253387 -81344 -92365
11142i2365B61195a96525J3717e1536C4629d7370A06744B9715L5715c9930A02073
11130C1746q468K78763B5909J60532f3746j75419c6154r4946d6136q4125A92952
11118A28189a78145a4460k10662j4142A52799p4027e3768A97365n3210K29048
11108C73203L6372A71102M7758h496K48l0157B44489o4335d5856A99539f1152
11096A53616N9078B0252a13630I8710J9698D9084b70336B05190A1380J89316d1958
11084C73730a33767M7112A58180O6623n5813J1962d5885D3768R8019m9449m495
11073H7843k2280L43305A09401E0383K1890i0491B9661a30413B70280J057n4847
11062B16490B2620P0457J75345l3000J60662n2746L13909B37776K50119N1744
$$ plain form
11142 -92365 261195 -196525 -182808 -51536 34629 -47370 106744 29715 65430 -39930 102073
11130 31746 23278 302041 25909 186441 -63746 -239165 -36154 -131100 -46136 -130261 192952
11118 128189 -178145 -14460 -225122 -239264 152799 78772 -53768 197365 144155 373203
11108 373203 409575 171102 218860 -8496 -8248 -38405 244489 180154 -45856 199539 -61152
11096 153616 212694 20252 -113630 98710 118408 49084 -270336 205190 11380 200696 -41958
11084 373730 -133767 -86655 158180 224803 168990 180952 -45885 43768 141787 92338 87843
11073 87843 65563 408868 109401 50383 72273 -90491 29661 -130413 270280 271337 216490
11062 216490 22620 93077 268422 235422 396084 343338 657247 237776 487895 539639
11052E39639A74773P9214K03694o0085J65836j91568N6489l1340j02412J41955
11042D36556j8652n1116m5750A06031A9936N40292k03146K53003j98146J26188
11032E38127j7221q9465e3367D11601J4519m4k00675L95960A48433J83682J14831
11021D46946J21835j68175j34844k1868K00368j43072n1081K1464N3395J64971
11011D89939H1456Q5156Q3853m2952R7692l1361N0861j124j12956I9424M43324
11000E42748A55188J35888L44887n9658j59832p6710R3233j81252J1088P5383
10990C38215J2835K9135J82287J7627p2676n4615O4157j58773J93565r6915q9970
10979C64872M38953j30204j08471K91727J28695k01104J69375m6560M34018L39205
$$ plain form
11052 539639 174773 253987 457681 397596 563432 371864 428353 397013 294601 436556
11042 436556 417904 366788 321038 106031 19936 560228 357082 610085 411939 538127
11032 538127 520906 431441 -53367 411601 426120 426076 225401 621361 148433 332115 446946
11021 446946 568781 400606 265762 243894 444262 301190 250109 271573 324968 489939
11011 489939 81456 166612 250465 207513 305205 273844 324705 323581 210625 99424 542748
11000 542748 155188 291076 635963 576305 416473 339763 432996 251744 262832 338215
10990 338215 351050 380185 562472 580099 507423 452808 516965 358192 551757 454842 364872
10979 364872 803825 673621 565150 856877 985572 784468 953843 907283 1341301 1680506
10969A680506n04927P46210m19657J75036n07457L9883j30769J07509j05676j57783
10959I22875J30131l69826N85211R9341j70702j77922j2592j01259l6584j0627
10949H58046k89483J03428j64781P9009l8648r4975m9871j73788C1950J33899
10939A65849B6880L22060k1386A7592J45606c56163D652a09687M8708A30785E5141
10927A48567F660e1175F1913J4273a58092j50972B74844O6473a82335A75814q5241
10916I0573k9085J04506a05234b7893A6473c12197a54990F0004Q2754c38383A43790
10904c7828j25970d5313a2513j07842D02680I2368R6964k5117J03097r3636E2147
10892e3739p5928q1756A1471a11651I9679A9723a03888p5821A09292i0421m4029
$$ plain form
10969 1680506 1175579 1921789 1502132 1677168 1169711 1209594 1078825 1186334 1080658 922875
10959 922875 1053006 683180 1268391 1367732 1197030 1019108 1006516 905257 868673 858046
10949 858046 568563 671991 507210 586219 547571 452596 402725 228937 31950 165849
10939 165849 26880 348940 327554 17592 163198 -356163 4652 -109687 -60979 130785 55141
10927 148567 6660 -51175 61913 76186 -158092 -309064 274844 341317 -182335 175814 90573
10916 90573 61488 165994 -105234 -27893 16473 -312197 -154990 60004 142758 -338383 143790
10904 -37828 -163798 -45313 -12513 -120355 402680 92368 189332 164215 267312 173676 52147
10892 -53739 -129667 -211423 11471 -111651 99679 19723 -103888 -179709 109292 -90421 -134450
10881a34450b4879l16231e0801A31747n0536K9506J67695a64783c603n7727A00893
10869A0626a91552N0798c8592l3322A44767J39810a49863B69011h4326n5851B94609
10857C7973h7788k08306a07356A32420B2259a11062A32381M4148A9423a01110
10846G9129b8834p5957H9774c0110C6377J2754J57213n6995d29064h1694A80010
10834a0637l36126B19833a8738n6666k12157A35468a2540k12515L282h8717m5476
10823a34193b1261E0226g9624r7620A5753i4288F4856C0173b72375a03008b8851
10811g1951m4581N1366B51281g5385B24760b15366E5331K07805C1643L4618O4415
10800A30676b30566l1325c0883D0466d0764C8066n315A1065N8696a10978k41474
$$ plain form
10881 -134450 -24879 -341110 -50801 131747 81211 110717 278412 -164783 -3603 -61330 100893
10869 10626 -191552 -140754 -38592 -71914 144767 284577 -149863 269011 -84326 -140177 294609
10857 37973 -87788 -296094 -107356 132420 22259 -111062 132381 176529 19423 -101110
10846 79129 -28834 -104791 89774 -30110 36377 49131 206344 149349 -429064 -81694 180010
10834 -10637 -346763 219833 -18738 -75404 -287561 135468 -12540 -225055 -221773 -88717 -134193
10823 -134193 -21261 50226 -79624 -177244 15753 -94288 64856 30173 -272375 -103008 -28851
10811 -71951 -116532 -65166 251281 -75385 224760 -215366 55331 263136 31643 66261 130676
10800 130676 -230566 -261891 -30883 40466 -40764 38066 32751 11065 69761 -110978 -352452
10789c52452J36859I5483h8479j98232c3417r9045J9194P084H7235a36289G7621
10777C47464b49244G4026a25932k7415p5832F5668B6398i9186L7724b830k27044
10766b29874B41003i3148r4295A73438a92225P7538j81290a2925j05601a1484
10755E1337f8915l0089a391r7171C18223A01744D6836b08228Q4643a0690B8892
10743e4452B3299k661c6958D8967K18904c2016A00911a78846A81461a76225C7694
10731D3445K01650c1958B25648b14950P6596B93632K5899h2911J6380D4936a79835
10719A59114b9640A08466J44305g9845K101m5937k09564a26508A71231d4102j35823
10708a79925C6717b5768m9010A59789b4502n2321F5998b07285B73995a45974H968
$$ plain form
10789 -352452 -215593 95483 -88479 -286711 -33417 -132462 -113268 -106184 87235 -136289 77621
10777 347464 -249244 74026 -125932 -153347 -229179 65668 26398 -99186 -61462 -2830 -229874
10766 -229874 241003 -93148 -187443 173438 -192225 -114687 -295977 -12925 -118526 -11484
10755 51337 -68915 -99004 -1391 -98562 318223 101744 46836 -208228 -123585 -10690 28892
10743 -54452 23299 20638 -36958 48967 267871 -32016 100911 -178846 181461 -176225 37694
10731 43445 245095 -31958 225648 -214950 -138354 293632 319531 -82911 -66531 44936 -179835
10719 159114 -29640 108466 252771 -79845 -77744 -123681 -333245 -126508 171231 -44102 -179925
10708 -179925 36717 -25768 -74778 159789 -24502 -76823 65998 -207285 273995 -145974 8968
10696C8111b39679O3227j9403E9720k7432A2984c34636i6927B7214a88139Q7897
10685a00242k60294G8165M3652g2767j50654A48692b40324A50702d52526g4460
10674H1495b78976B97168E0669a85384b601j2798m2786l68514j56899I1518l2847
10663E8671a02419H6870A6527b13910B6905a17019J995l1286E9816J52118j0797
10652B01137l9737h4537l3744j09055f775k30271o2885B9717a54160e6821a0429
10640a17499A19858a58393k8346h9225k66182i5780c1740G063a3053F5141b35084
10628a35091j96880i516n2684A69017O2941f4297j25558A2714c48979A97789a3130
10616B27886n3499b45944N4869E8266h8109j10157B72220r4526J36921q4065r6986
$$ plain form
10696 38111 -239679 -176452 -195855 59720 32288 12984 -334636 -96927 27214 -188139 -100242
10685 -100242 -360536 78165 121817 -72767 -223421 148692 -240324 150702 -452526 -74460
10674 81495 -278976 297168 50669 -185384 -2601 -15399 -58185 -426699 -583598 91518 58671
10663 58671 -102419 86870 16527 -213910 26905 -117019 -115024 -146310 59816 211934 201137
10652 201137 161400 -84537 -118281 -227336 -6775 -237046 -299931 29717 -154160 -56821 -10429
10640 -117499 119858 -158393 -186739 -89225 -355407 -95780 -31740 7063 -13053 65141 -235084
10628 -135091 -331971 -9516 -62200 169017 231958 -64297 -189855 12714 -348979 197789 -13130
10616 227886 174387 -245944 -191075 58266 -88109 -198266 272220 177694 314615 230550 133564
10605A33564d2412k53556A22376k8263j9714i1731m5058D9311Q5889i3945A11917
10593f6633k01650N7901j00391A11332c95444A55256F3396b01328A6916d9337
10582B23140b90278J12361r2792A81667c04292J51534C5894g3013A45094a60516
10571F0983a58859k5909C40370b11138A68430e9050j59709P0530d3217E6439i6852
10559a30886B4505a91157M7792B0326b57164P1347j8625A4330b02223k08641a48282
10547I3665R6069a14323A07435g8787B44226c20572R7455k9225A28010i4299C0330
10535B55516a62949n0066a7388A07578J13056a52078b3835A02803b15364o4778
10525b80142A00437c4577B78581A667b21866B53166a77298A17866d49430B04661
$$ plain form
10605 133564 -42412 -295968 122376 94113 74399 -91731 -136789 49311 135200 -93945 111917
10593 -66633 -268283 -210382 -310773 111332 -395444 155256 63396 -201328 16916 -49337
10582 223140 -290278 -177917 -270709 181667 -304292 -152758 35894 -73013 145094 -160516
10571 60983 -158859 -184768 340370 -211138 168430 -59050 -218759 -148229 -43217 56439 -96852
10559 -130886 24505 -191157 -143365 20326 -257164 -185817 -204442 14330 -202223 -410864 -148282
10547 93665 189734 -114323 107435 -78787 244226 -320572 -223117 -252342 128010 -94299 30330
10535 255516 -162949 -213015 -17388 107578 220634 -152078 -23835 102803 -215364 -280142
10525 -280142 100437 -34577 278581 1667 -221866 253166 -177298 117866 -449430 204661
10514h3732C36309P4849f5077k13572e4475k07419j81717c8690G8446c86012a89505
10502D7380b65795A49802c25396J55646A07277a76820B38882C186i9713B11404
10491i4798j02022O8764D5412b12097E4554g033A40450D1846b54440B29407o8279
10480A61128K11105j09593P9039P3485A68206J14084A07152K8842R2429H018b09962
10468d3899L936A96052A9938b2825j2514A10825Q2725a82399D92111b67167A44592
10456b24030g2956B23483C7450a5848B5730h8756j67275m7538a39294e5395j50886
10445b06281B16570l7331a54920k09797a13144A10968E248a19131l8869g4309
10434C5490a35359K8956n8414O081A37918b15548M9440A12441a08379M5097j73465
$$ plain form
10514 -83732 336309 411158 -65077 -278649 -54475 -261894 -443611 -38690 78446 -386012 -189505
10502 47380 -265795 149802 -325396 -169750 107277 -176820 238882 3186 -99713 211404
10491 -94798 -196820 -128056 45412 -212097 54554 -7033 140450 41846 -254440 229407 161128
10480 161128 372233 262640 341679 415164 168206 282290 107152 135994 228423 8018 -209962
10468 -43899 -39963 196052 19938 -22825 -35339 110825 193550 -182399 492111 -267167 144592
10456 -224030 -72956 223483 37450 -15848 25730 -88756 -256031 -303569 -139294 -55395 -206281
10445 -206281 216570 179239 -154920 -364717 -113144 110968 5248 -119131 -158000 -74309
10434 35490 -135359 -106403 -164817 -158736 137918 -215548 -166108 112441 -108379 -63282 -236747
10423b36747A50636a20269d8396j12987G1511b15704C09010a87741j76305B07874
10412A48075a1724C01056b3664B15192C5423Q1428p958a59298r6665E1218a69074
10400a58794j93537A1220f3419A86789O1190b42677H8688a26399c7028k1175A79655
10388A97230i2294A22447a19147N6233K3410g81A19970m2653f7133K0948A02590
10376b19911B3128a22839N4758k9970B84653g3925F5180M38813F6081A7049c1673
10364E48973E1270M6838J70450b9888M218H5334L23216o5698j28722m3023d3477
10352A61306m9023P4698r2960J87680q7223P4052k8692m0088P8940n6781K39171
10341D61080I1211K43301j34942K1655N834J8172g6667D3476b0973B88608j24330
$$ plain form
10423 -236747 150636 -120269 -48396 -161383 71511 -215704 309010 -187741 -364046 207874
10412 148075 -11724 301056 -23664 215192 35423 116851 108893 -159298 -255963 51218 -169074
10400 -158794 -352331 11220 -63419 186789 247979 -242677 88688 -126399 -37028 -58203 179655
10388 197230 -92294 122447 -119147 -62914 -39504 -781 119970 77317 -67133 -46185 102590
10376 -219911 23128 -122839 -68081 -98051 284653 -73925 65180 503993 66081 17049 -31673
10364 548973 51270 98108 268558 -29888 -25670 85334 408550 342852 214130 171107 -43477
10352 161306 112283 186981 94021 281701 194478 268530 239838 199750 278690 221909 461080
10341 461080 91211 334512 199570 221225 227059 245231 -76667 43476 -20973 288608 164278
10330A64278E797b19771G4240b2550j48908b1052j22539A16481c7025C6859J67202
10319B04061g823B39052j1916a60365A37172R2460J09909A06553A9960a04634
10308B1979c7726m08718c9819D2835a27794D38284c4721A35039b19331A08036
10297B67792g7269k8948A2877g4858j06634A12068m3566J31588n3683a18600G8324
10285G2667J3800C46J36247L30953a39960A12664O0946G8767a00740J5378j56835
10274b42197a16418i854n5827J1759j22595A27084m1454a22614j93358C2266a95663
10262a66071f8129J2274k3658C05563I7390e9889B96985p7867J40220n9668F2706
10250B53370J77626b00123I97a13658j63346A64242i470B8361a77742c4778k58187
$$ plain form
10330 164278 5797 -219771 74240 -22550 -171458 -21052 -143591 116481 -37025 36859 204061
10319 204061 -7823 239052 227136 -160365 137172 229632 339541 106553 19960 -104634
10308 21979 -37726 -446444 -39819 42835 -127794 438284 -34721 135039 -219331 108036
10297 267792 -77269 -106217 12877 -74858 -181492 112068 68502 200090 146407 -118600 78324
10285 72667 86467 346 136593 467546 -139960 112664 173610 78767 -100740 -85362 -242197
10274 -242197 -116418 -9854 -65681 -53922 -176517 127084 85630 -122614 -315972 32266 -195663
10262 -166071 -68129 -55855 -79513 305563 97390 -59889 296985 219118 359338 299670 62706
10250 253370 430996 -200123 997 -113658 -277004 164242 -9470 28361 -177742 -34778 -292965
10239b92965B21078d40844N8775e0995B90046b90650B7733K1306e0050G6013B8063
10227b51430A39469G812b18566l8194e1753q6157j25672A79282h6513j46568D9380
10215f4785a566k65777c0626D6236c43310a08772j74921A86291d498n9001A7065
10203b07646p0296i3372A4117b35325R5459j4941E4873J25088F5863g3585j44193
10192b17778I937L79702c0540k65271c4535o706j58109B9509a01747k25067A63194
10180c37672E5949a87358a5304F4306f0077j00694A06701g5091k44418A8744p33
10169A8011a37965j63182d303H8362m3923a16038A19564b8619j14432e6581k2675
10158g9256A47763b29268b493B641J58940g4681A35000J4774m0379a89843G5190
$$ plain form
10239 -292965 221078 -440844 -382069 -50995 290046 -290650 27733 49039 -50050 76013 28063
10227 -251430 139469 7812 -218566 -256760 -51753 -137910 -263582 179282 -86513 -233081 49380
10215 -64785 -1566 -267343 -30626 46236 -343310 -108772 -283693 186291 -4498 -63499 17065
10203 -207646 -277942 -93372 14117 -235325 -139866 -154807 54873 179961 65863 -73585 -217778
10192 -217778 9937 389639 -30540 -295811 -34535 -41241 -199350 29509 -101747 -326814 163194
10180 -337672 55949 -187358 -15304 64306 -60077 -160771 106701 -75091 -319509 18744 18011
10169 18011 -137965 -301147 -4303 88362 44439 -116038 119564 -28619 -143051 -56581 -79256
10158 -79256 147763 -229268 -2493 2641 161581 -74681 135000 149774 109395 -189843 75190
10146F2477b04854A27679l6899b1319G3588b31704A22086a73759B8483a89751
10135A87379a17620a8199p9852M3382k88337D2253b40766N7085A26912i0894A39212
10123a92745R5801K4030k51027a2235l9674B41109a78070f9697r244A54314a20497
10111E2012K60714a07446j16049F261i1038A74562b57881B61192c5719l11476
10101c47195J72554l3618C2383h4467A27369a93491Q937L6876A82611o0671b15089
10089a0856B75823a05274G9726c53442B35391H0945K09785A35670a66655A61156
10078a07369A36243J899a94929R3941a5775j70116l0278c2343j46427l628n0681
10067b33079f7084j6353H6966e1199l00068C12597a8237E3466a68397B31990e7349
$$ plain form
10146 62477 -204854 127679 90780 -21319 73588 -231704 122086 -173759 28483 -189751
10135 187379 -117620 -18199 -98051 -54669 -343006 42253 -240766 -183681 126912 -90894 139212
10123 -192745 -96944 -72914 -323941 -12235 -51909 241109 -178070 -69697 -78941 154314 -120497
10111 52012 312726 -107446 -223495 6261 -91038 174562 -257881 261192 -35719 -347195
10101 -347195 -174641 -208259 32383 -84467 127369 -193491 -184554 -147678 182611 121940 -215089
10089 -10856 275823 -105274 79726 -353442 235391 80945 290730 135670 -166655 161156
10078 -107369 136243 138142 -194929 -100988 -15775 -185891 -216169 -32343 -178770 -182398 -233079
10067 -233079 -67084 -83437 86966 -51199 -351267 312597 -18237 53466 -168397 231990 -57349
10055D5285N0735a36569j58729a41771L1903o2549J319C33036C8875a80729H638
10043b46126H0595J32110A9455a28515e2196H9732f8031n6662L0089B7492b39698
10031a70079A58291l1609C469a8148G897c42948j5266J76792J4378D4764O5066
10020A09830b9820j47880k81786J06861D2958b25227J11379b7924G5048b86556
10009a19731k38274C245a21422A58066m1417b04613A03N2046i9329k94785D136
9997A39728g8617j49734P9244f5284j81417e1983C9252J49616b18502A5241g6644
9985a21406k60982E7248b0643l7113A20167e8643B23139b3088k09239a2887D4811
9973B6922O9728C0228a07161B2732a13604l2667a189C8833e3195k5186j46790
$$ plain form
10055 45285 96020 -136569 -295298 -141771 -109868 -172417 -171098 333036 38875 -180729 8638
10043 -246126 80595 212705 19455 -128515 -52196 89732 -68031 -124693 -94604 27492 -239698
10031 -170079 158291 126682 3469 -18148 7897 -342948 -358214 -181422 -167044 44764 109830
10020 109830 -29820 -177700 -459486 -352625 42958 -225227 -113848 -27924 75048 -286556
10009 -119731 -358005 3245 -121422 158066 116649 -204613 103 52149 -99329 -394114 4136
9997 139728 -78617 -228351 -149107 -65284 -246701 -51983 39252 188868 -218502 15241 -76644
9985 -121406 -382388 57248 -20643 -57756 120167 -58643 223139 -23088 -232327 -12887 44811
9973 26922 96650 30228 -107161 22732 -113604 -146271 -1189 38833 -53195 -78381 -225171
9962b25171A82170c8562M376k45913A64794A175J36009b66972F7875f6571m8280
9951a14851d882j99168d3920A99292a34088j52931A06162B792A091N8030B761
9939a52114c5832l1080j05714o045A45578J59799b35549B1684a12868j39926D964
9927b00475I0531b49658J09785I2507J1746d5248j79542j6524R0108B8325e6132
9915a33574A20466f0677j609A20244g7745j49828A74699C1803c46077E3526a0301
9903a36711A53384b58497n6806F01287F5700a23260C40166b0183K677k06949A93149
9891c85116B54801a5753A0136g035B2563h1852L3899j62763f0788A71571b07374
9879b81084A04277N8106d3492A11202c70335a60447A3522i6154H9028J79002p7381
$$ plain form
9962 -225171 182170 -38562 -34186 -280099 164794 1175 137184 -266972 67875 -66571 -114851
9951 -114851 -4882 -204050 -43920 199292 -134088 -287019 106162 2792 1091 59121 2761
9939 -152114 -35832 -66912 -172626 -178671 145578 305377 -235549 21684 -112868 -252794 4964
9927 -200475 90531 -249658 -139873 92507 104253 -45248 -224790 -241314 -151206 28325 -56132
9915 -133574 120466 -60677 -62286 120244 -77745 -227573 174699 31803 -346077 53526 -10301
9903 -136711 153384 -258497 -315303 601287 65700 -123260 340166 -20183 -17506 -224455 193149
9891 -385116 254801 -15753 10136 -7035 22563 -81852 -47953 -210716 -60788 171571 -207374
9879 -281084 104277 162383 -43492 111202 -370335 -160447 13522 -96154 89028 268030 190649
9868A90649C2958i4867F6353a62467o5232E424a25565f0500J4785k45525k5146
9857c16386A76508G1751b37441j82746b2615O164k58011C03007h0607j8693L8631
9846f0669B6857a62110K9388A00645L7630g1479l3311n9705f5033A85342e9387
9834b12039M4576a813l24736f745j65383A16736b94409J44110b1882m4553G2638
9822H442a19236c3518B8842K04764b00693A6541O785J00912f0331n5172r3087
9811b08590g9374c1791l39114J34155O244f227k2423j17968d2011n367C20956
9799b53207J01309n3206J8515a4748j07588A11994c54700A25047a02089c8171
9788a90973A79038d09926a16788m2879O5488B880a88104j64167A82318a59895
$$ plain form
9868 190649 32958 -94867 66353 -162467 -227699 5424 -125565 -60500 -45715 -291240 -316386
9857 -316386 176508 71751 -237441 -420187 -22615 -16451 -274462 303007 -80607 -99300 -60669
9846 -60669 26857 -162110 -132722 100645 138275 -71479 -104790 -164495 -65033 185342 -59387
9834 -212039 -167463 -1813 -326549 -6745 -172128 116736 -294409 -150299 -21882 -66435 72638
9822 8442 -119236 -33518 28842 233606 -200693 16541 23326 124238 -60331 -115503 -208590
9811 -208590 -79374 -31791 -370905 -236750 -230506 -6227 -28650 -146618 -42011 -47378 320956
9799 -253207 -151898 -205104 -186589 -14748 -122336 111994 -354700 125047 -102089 -38171
9788 -190973 179038 -409926 -116788 -159667 -94179 2880 -188104 -352271 182318 -159895
9777A7108e14499A8877a66942e0128a2305k23980A01214c80350B3451b69776J01669
9766a68107A45275c66093h2087k46868C15978j27371K03951a33130j3465N4317
9756i2278j83458d2167j04071A45288A9283J08008g2939K9019J2986A49758b04515
9744A34187a86427G2832d46348d3552k07787f4043B53113a67441D3026e1878a3638
9732A78325h9283n689F608J67699d5411A013b7041l76025A43916b34934c0057
9720g9559B07049h2320k4966J0169J9083B77900A08826a34365d7728A7809a17911
9708g5520H751N7844a50597L85m5139H3543a85223C36318B8061b78773A78947
9696e303A89570a62167O3342d6629A54140a19375d2602A70187K630a24213n0589
$$ plain form
9777 17108 -514499 18877 -166942 -50128 -12305 -236285 101214 -380350 23451 -269776 -168107
9766 -168107 145275 -366093 -82087 -328955 315978 188607 392558 -133130 -146595 -92278
9756 -92278 -275736 -42167 -146238 145288 19283 127291 -72939 -43920 -30934 149758 -204515
9744 134187 -186427 72832 -446348 -43552 -251339 -64043 253113 -167441 43026 -51878 -13638
9732 178325 -89283 -94972 6608 174307 -45411 1013 -27041 -403066 143916 -234934 -30057
9720 -79559 207049 -82320 -107286 -97117 -78034 277900 108826 -134365 -47728 17809 -117911
9708 -75520 8751 66595 -150597 -150212 -195351 83543 -185223 336318 28061 -278773 178947
9696 -5303 189570 -162167 -98825 -46629 154140 -119375 -42602 170187 172817 -124213 -174802
9685a74802H5117J08041m7479c77443C713a02532J2892k25322B69782a37377A52660
9673b15217d2483j92044D8848g6060a6931C50372c40040J65593K5510k00341A83047
9661B61030b29231a05324l9092f4231D3054M5196a3627j46935g1081D9719a66512
9649c32149H1532a60045D291e9770j05915a4804j88474A288a94726B63058A01805
9637b67850i6951k15896E249a74062j5068d0245A55999b52218F4431b1904j61500
9626a83404M8013A02882b24564j30879Q6211M9820a03207B63938a50607m4606
9616a95213c6656J2860A15341C9541h9279B16080D1290O6774j1177a57155j75172
9605c32327a64558O0954o7889a267B6201a99536B60901e470o9669k72565h7470
$$ plain form
9685 -174802 85117 193158 145679 -377443 3713 -102532 -89640 -314962 269782 -137377 152660
9673 -215217 -42483 -234527 48848 -76060 -16931 350372 -340040 -174447 -148937 -349278 183047
9661 261030 -229231 -105324 -144416 -64231 43054 88250 -13627 -160562 -71081 49719 -166512
9649 -332149 81532 -160045 4291 -59770 -165685 -14804 -203278 1288 -194726 263058 101805
9637 -267850 -96951 -312847 5249 -174062 -189130 -40245 155999 -252218 64431 -21904 -183404
9626 -183404 -135391 102882 -224564 -355443 -269232 -219412 -103207 263938 -150607 -195213
9616 -195213 -36656 -23796 115341 39541 -89279 216080 41290 108064 96887 -157155 -332327
9605 -332327 -164558 -103604 -171493 -1267 26201 -199536 260901 -5470 -75139 -347704 -87470
9593d1804B38849k9216b46351F5470L4702Q6757a8006D0971e5462j37275D9020
9581h113F4943K66797j65008c1665m1897n8754k01529i141j69222M3380C9473
9569g8700f398F0207j6627J7934K3939a7910j96598B9251e543m914j28345A5857
9556E3244g3509c1145G8323b63639c9898j01633B74221b37924J8837A22660a67341
9544i7457a8422A44579a30048F421N347J8576b3429A93548C8099a4560m1560A0938
9531A33961a9435B25013E7648a19983B31518J73540E4493d22855a89849d9313
9520h5707j29460A23921E6577M7072c9250j35340D9376J90842a1146A79363g6873
9508D6258D722R9110a43382k28605J52317F7595d238k20285N2745h1859A51073
$$ plain form
9593 -41804 238849 209633 -246351 65470 100172 186929 -18006 40971 -55462 -192737 49020
9581 -8113 64943 331740 166732 -31665 -73562 -132316 -333845 -9141 -178363 -134983 39473
9569 -78700 -6398 60207 43580 61514 85453 -17910 -214508 29251 -5543 -10457 -138802 15857
9556 53244 -73509 -31145 78323 -263639 -39898 -141531 274221 -237924 -219087 122660 -167341
9544 -97457 -18422 144579 -130048 6421 11768 30344 -23429 193548 38099 -14560 -56120 10938
9531 133961 -19435 225013 57648 -119983 231518 405058 54493 -422855 -189849 -49313
9520 -85707 -215167 123921 56577 103649 -39250 -174590 49376 240218 -11146 179363 -76873
9508 46258 4722 103832 -143382 -371987 -219670 67595 -4238 -224523 -171778 -81859 151073
9496A4000J26813b7678A18730b86804a37883A302b54937O9528j31047R5639J6534
9485b04283A14165B5704b40131o9526b3157l39980P9627B05799B7628b0530k42701
9474b63231J0871a0232l08284j77030h53j11686d8771l0752G4440K8446J25290
9463B28176D2674b42445g0250J1049K9256F2102k5046J52664f9412j9046j18702
9452b07160j25334J36775j05G9079b26551L3651H150a61052l9629i2412a7884
9440a10755P173A41365a21234K6237m9403A57433b64088A43470A710b8373j13888
9429a42261N1996M684k32519g4231A20433a54475J38C8485a24298c5650A53558
9417a26698G95b02537A6537K34495h1147H7964e7714I0873J15009c09311a49650
$$ plain form
9496 14000 140813 -27678 118730 -286804 -137883 1302 -254937 -185409 -316456 -220817 -204283
9485 -204283 114165 25704 -240131 -309657 -23157 -363137 -283510 205799 27628 -20530 -263231
9474 -263231 -252360 -10232 -318516 -495546 -853 -112539 -48771 -79523 74440 102886 228176
9463 228176 42674 -242445 -70250 -59201 -29945 62102 37056 189720 -69412 -88458 -207160
9452 -207160 -332494 -195719 -195824 79079 -226551 -192900 8150 -161052 -200681 -92412 -17884
9440 -110755 -103582 141365 -121234 -94997 -144400 157433 -264088 143470 1710 -28373 -142261
9429 -142261 -90265 -85581 -318100 -74231 120433 -154475 -154337 38485 -124298 -35650 153558
9417 -126698 795 -202537 16537 251032 -81147 87964 -57714 90873 205882 -309311 -149650
9405b71901d4442F621b1676I7790D4332h1275A73a22637n7198A82508i9828A58878
9392I1768J12097a76095f8600j0833I1861J00875a59919e897l19240l5067A78117
9380A55324N2628n491b66994R3883B48893d7916b3232B34403b8771A15546b87092
9368a56531k5615L5409f2412A00509a35462p3956D468a53190B8937P4635K16219
9357C19791K3829A8712d9934m4654j48961B26479b77765A83771c2558j983q3872
9346a18413H0157c8852j79517N9925C81190d6064k20194f8797j0224l6307A84288
9334A99200d6587m4501n2984G5175b64010F3191j6424a12245A11853a66782j35253
9323c02035d9619j91134K921A2043c03669i7174b5558A06881f8202L3072k41797
$$ plain form
9405 -271901 -44442 6621 -21676 97790 44332 -81275 173 -122637 -179835 182508 -99828 158878
9392 91768 203865 -176095 -68600 -79433 91861 192736 -159919 -5897 -325137 -360204 178117
9380 155324 207952 202461 -266994 -173111 248893 -47916 -23232 234403 -28771 115546 -287092
9368 -156531 -182146 -146737 -62412 100509 -135462 -209418 4468 -153190 28937 103572 319791
9357 319791 343620 18712 -49934 -94588 -243549 226479 -277765 183771 -32558 -34541 -118413
9346 -118413 80157 -38852 -218369 -158444 381190 -46064 -266258 -68797 -79021 -115328 184288
9334 199200 -46587 -91088 -144072 75175 -264010 63191 46767 -112245 111853 -166782 -302035
9323 -302035 -49619 -240753 -237832 12043 -303669 -97174 -25558 106881 -68202 -35130 -276927
9312b76927a29388C1499J1684g8359m9550l1575b741E7532c79360d3129A1038
9300B01110H7873c35262J39911K9203L9891A1602b29836J8724O1620m448A51649
9288A41856L060e22710A17780g2053A00357a80226f1719b1897j64520r0217F047
9276I8404d25578A06728c90479a55301A16080a45732m4157A81980a39338M6475
9266i2863n191O852E672L2300A8485b74671A64535d01190a21108A79668a16812
9254B05222c8519j65356A13140a58939M1627C3386A0778i0943j2433D0465L11035
9243C51500e9502r6624R034A3334b61737F0346J74952a3998k86900P3863F122
9231B5038g282E2605n777P030A4852P1750c40912J09121I5815a13516n9238b9404
$$ plain form
9312 -276927 -129388 31499 43183 -78359 -127909 -159484 -2741 57532 -379360 -43129 11038
9300 201110 87873 -335262 -195351 -166148 -126257 11602 -229836 -211112 -149492 -153940 151649
9288 141856 144916 -522710 117780 -72053 100357 -180226 -61719 -21897 -186417 -276634 6047
9276 98404 -425578 106728 -390479 -155301 116080 -145732 -189889 181980 -139338 -92863
9266 -92863 -98054 -91202 5672 37972 18485 -274671 164535 -401190 -121108 179668 -116812
9254 205222 -38519 -203875 113140 -158939 -117312 33386 10778 -90943 -103376 40465 351500
9243 351500 -59502 -156126 -147092 13334 -261737 60346 235298 -13998 -300898 -227035 6122
9231 25038 -7282 52605 46828 53858 14852 86602 -340912 -231791 95815 -113516 -172754 -29404
9218A69017b20847j31075J8906c9881F2803J16541b8429d934k89731h4556B93935
9206b56024K1645B02192B5711a33465j49017B08072d24433a8532m0698k14539
9196b73769H4559a8965j66344I7868A4303f7088J716j14341o8080f5295p5291
9185a40586N1449A56124I353b84390c4862k30557D4532b66616A74623h3273H6616
9173b71926A72600a53001l04939J64784A76288a11069A12350J10242L3931B2421
9162c9230A07339b4998m2603G5817P6687K35877a9253p8262n13I771J51123o2426
9150I8468b05700l8469A83680j1535a42705N4435b7213j07215c3341j02927A04304
9138f1268j54763c2337E3650a35924A26092a10296q7736c3714B53853b63887P9750
$$ plain form
9218 169017 -220847 -351922 -333016 -39881 62803 179344 -28429 -4934 -294665 -84556 293935
9206 -256024 -234379 202192 25711 -133465 -282482 208072 -424433 -18532 -59230 -273769
9196 -273769 84559 -18965 -185309 97868 14303 -67088 -65372 -179713 -247793 -65295 -140586
9185 -140586 -89137 156124 9353 -284390 -34862 -265419 44532 -266616 174623 -83273 86616
9173 -271926 172600 -153001 -457940 -293156 176288 -111069 112350 222592 256523 22421
9162 -39230 107339 -24998 -67601 75817 152504 388381 -19253 -97515 -98028 9771 160894 98468
9150 98468 -205700 -244169 183680 172145 -142705 -88270 -27213 -134428 -33341 -136268 104304
9138 -61268 -216031 -32337 53650 -135924 126092 -110296 -198032 -33714 253853 -263887 -184137
9127a84137H9103d1471j16487a6788j78813c2561B46392g7201n1764m3816Q1621
9116i1160j03217o1089a6594A20011B0580c2449q1635J9941D10034B8378K3979
9105E2357J40660a57556h71A85788O324a33982A0365c1809l999k97595c3517k62420
9093b95937d8597C3240g8112j92280C8762c8132k07842A52219a15991k58169B18781
9081a32731p0343h9560A97208b56963A1733K46320b10275g9974k58771Q2180g0435
9069a14235B2895K03870A0511c65452h817j19812c9860A52787b23699B3586J57060
9058A80646a85022A1281L28786d8339F6092a47451d7933k56388a09955F9860j2546
9047E7314b62335J00963A69053b04267B9025b3722j63042P9766d5693A22346B314
$$ plain form
9127 -184137 89103 -41471 -157958 -16788 -195601 -32561 246392 -77201 -128965 -172781 -91160
9116 -91160 -194377 -255466 -16594 120011 20580 -32449 -114084 -94143 410034 28378 52357
9105 52357 193017 -157556 -871 185788 192112 -133982 10365 -31809 -35808 -333403 -33517 -295937
9093 -295937 -48597 33240 -78112 -270392 38762 -38132 -245974 152219 -115991 -374160 218781
9081 -132731 -203074 -89560 197208 -256963 11733 258053 -210275 -79974 -338745 -256565 -70435
9069 -114235 22895 226765 10511 -365452 -8817 -128629 -39860 152787 -223699 23586 180646
9058 180646 -185022 11281 340067 -48339 66092 -147451 -47933 -304321 -109955 69860 57314
9047 57314 -262335 -161372 169053 -204267 29025 -23722 -186764 -106998 -45693 122346 2314
9035i1137j38899A5806b2296D511a8262A28309B3623J17735c03811g3630j08354
9024a81984N2009C3440a03080b9891j07885M5647j50528I2353c55706J06645a6929
9012f1416G7304K77O997K08331b29102A05094m9118a86600B7542c0799k27329
9001b58128L1880M6858j350A27274l1052h9671B49052j11697A4124b85843B4373
8989c2188D88827e0863A34446b68690H5782C687b80169a25952I1407d7098o3229
8978a10327j27646g2854L2170B12645d2792E3067a75008c4635J7087o5480C1480
8966d7705A45698c42527i2837o5805c1672E1445G10K84696C4095e8373G5663K3025
8954I8688h2860J0845G2938f6832C23616d4772j03840b5529p0224A20172d6120
$$ plain form
9035 -91137 -230036 15806 -22296 4511 -18262 128309 23623 141358 -303811 -73630 -181984
9024 -181984 -129975 33440 -103080 -29891 -137776 -92129 -242657 92353 -355706 -249061 -16929
9012 -61416 77304 77581 84578 292909 -229102 105094 55976 -186600 27542 -30799 -258128
9001 -258128 -226248 -179390 -180740 127274 96222 -89671 249052 137355 14124 -285843 24373
8989 -32188 488827 -50863 134446 -268690 85782 3687 -280169 -125952 91407 -47098 -110327
8978 -110327 -237973 -72854 -40684 212645 -42792 53067 -175008 -34635 -17548 -83028 31480
8966 -47705 145698 -342527 -92837 -158642 -31672 51445 710 285406 34095 -58373 75663 98688
8954 98688 -82860 -72015 72938 -66832 323616 -44772 -148612 -25529 -95753 120172 -46120
8942a48698M4580A9039a15943p2849M7492A91664J64267a38725k6260j96706J64628
8931a97063L4492p6679L5569B4764r216e5887j24636g7803i504E25765j29259
8920C96506J561475K157322A074139l87475B66147c94324c3273E7697d205l1118
8910c5323H6931K59633E9132J44437G7461J66115a41426k3324A26832b36098e5927
8898B9085c07125R1512P4620r2522a11591A9358a45261I5677N0259o5359N1456
8887A32033a03915B449J53218D7822L18195g9488A38418F8328h4475M794j116
8876h0797j6208E436c04411A39378B6654b25709C37770a23421I949K7011d10400
8864F5724i7669m7455o6789C5255b40911J1230B17571a65158p429A02304J61222
$$ plain form
8942 -148698 -104118 19039 -115943 -188792 -141300 191664 355931 -138725 -164985 -361691 -197063
8931 -197063 -162571 -239250 -203681 24764 15548 -55887 -180523 -77803 -9504 525765 396506
8920 396506 1957981 4115303 1074139 686664 266147 -394324 -33273 57697 -4205 -35323
8910 -35323 86931 346564 59132 203569 77461 243576 -141426 -164750 126832 -236098 -55927
8898 29085 -307125 -215613 -140993 -233515 -111591 19358 -145261 95677 145936 80577 132033
8887 132033 -103915 2449 155667 47822 366017 -79488 138418 68328 -84475 -79681 -80797
8876 -80797 -97005 5436 -304411 139378 26654 -225709 337770 -123421 9949 36960 -410400
8864 65724 -97669 -145124 -211913 35255 -240911 -229681 217571 -165158 -172587 102304 263526
8853B63526A12343i2047j9780j17318B2041b30574C7755a82513A28478L5374k0339
8842A43513E7868R00Q1994b12343m90I7810d1898k45258f9370A04300n0914a57408
8829a04158B25416B4058a9741A82639f0338k59742f7825k24885A05510b4358A45604
$$ plain form
8853 263526 112343 -92047 -111827 -229145 22041 -230574 37755 -182513 128478 163852 143513
8842 143513 57868 58768 140762 -212343 -212833 97810 -41898 -287156 -69370 104300 53386 -157408
8829 -104158 225416 24058 -19741 182639 -60338 -320080 -67825 -292710 105510 -24358 145604
$$ [...]
##END NTUPLES=NMR SPECTRUM
##END=
