##TITLE=NES1034_872015080_9242822_nGXDxCP1Qb
##JCAMPDX= 6.0         $$ Bruker NMR JCAMP-DX V2.0
##DATA TYPE= NMR SPECTRUM
##DATA CLASS= NTUPLES
##ORIGIN= BRUKER
##OWNER= Administrator
$$ 1.72 TOPSPIN		Version 2.1
$$ 2015-08-24 22:33:54.280 -0700  Administrator@X
$$ Compression mode = diff/dup
##.OBSERVE FREQUENCY= 400.02188249412
##.OBSERVE NUCLEUS= ^1H
##.ACQUISITION MODE= SIMULTANEOUS (DQD)
##.ACQUISITION SCHEME= undefined
##.AVERAGES= 64
##.DIGITISER RES= 22
##SPECTROMETER/DATA SYSTEM= spect
##.PULSE SEQUENCE= noesygpps1d.comp
##.SOLVENT NAME= COFFEE_meoh
##.SHIFT REFERENCE= INTERNAL, COFFEE_meoh, 1, 14.96225
##AUDIT TRAIL= $$ (NUMBER, WHEN, WHO, WHERE, PROCESS, VERSION, WHAT)
$$ ##TITLE= Audit trail, TOPSPIN		Version 2.1
$$ ##JCAMPDX= 5.01
$$ ##ORIGIN= Bruker BioSpin GmbH
$$ ##OWNER= Administrator
$$ $$ E:\/data/COFFEE/nmr/NES1034_872015080_9242822_nGXDxCP1Qb/32/pdata/1/auditp.txt
$$ ##AUDIT TRAIL=  $$ (NUMBER, WHEN, WHO, WHERE, PROCESS, VERSION, WHAT)
(   1,<2015-08-24 22:33:48.951 -0700>,<Administrator>,<X>,<go>,<TOPSPIN 2.1>,
      <created by zg
	started at 2015-08-24 22:22:19.264 -0700,
	POWCHK enabled, PULCHK disabled,
       configuration hash MD5:
       21 0F 79 D6 B3 7B B4 F6 88 20 88 DB 03 48 BD 9F
       data hash MD5: 64K
       D5 8D 05 CE CD B7 1C 68 76 18 F6 E7 72 BA C5 49>)
(   2,<2015-08-24 22:33:52.170 -0700>,<Administrator>,<X>,<proc1d>,<TOPSPIN 2.1>,
      <Start of raw data processing
       efp LB = 0.3 FT_mod = 6 PKNL = 1 PHC0 = 0 PHC1 = 0 SI = 128K 
       data hash MD5: 128K
       6D E7 2C 30 DD 65 F6 F2 CD C7 01 CD 17 3A F4 24>)
(   3,<2015-08-24 22:33:53.061 -0700>,<Administrator>,<X>,<proc1d>,<TOPSPIN 2.1>,
      <pk PHC0 = -83.4906 PHC1 = 0 
       data hash MD5: 128K
       D5 7C EA CB C8 30 38 3D 03 6F 1E 36 E5 20 32 61>)
(   4,<2015-08-24 22:33:53.436 -0700>,<Administrator>,<X>,<proc1d>,<TOPSPIN 2.1>,
      <abs ABSG = 1 
       data hash MD5: 128K
       1F D1 4D 31 AE C6 64 F7 4E ED 39 F5 5A 49 C3 43>)
(   5,<2015-08-24 22:33:53.545 -0700>,<Administrator>,<X>,<proc1d>,<TOPSPIN 2.1>,
      <abs ABSG = 2 
       data hash MD5: 128K
       0D FB 2F A5 39 18 6B BB 38 97 07 F9 57 A6 99 B7>)
(   6,<2015-08-24 22:33:53.623 -0700>,<Administrator>,<X>,<proc1d>,<TOPSPIN 2.1>,
      <abs ABSG = 3 
       data hash MD5: 128K
       73 C5 60 C1 FA D0 36 96 E3 63 09 78 C1 49 CF 7D>)
(   7,<2015-08-24 22:33:53.717 -0700>,<Administrator>,<X>,<proc1d>,<TOPSPIN 2.1>,
      <abs ABSG = 4 
       data hash MD5: 128K
       F7 73 C5 BE 8C 75 A0 47 83 60 83 76 88 55 D0 7F>)
(   8,<2015-08-24 22:33:53.795 -0700>,<Administrator>,<X>,<proc1d>,<TOPSPIN 2.1>,
      <abs ABSG = 5 
       data hash MD5: 128K
       37 F1 22 1C BD 7F 10 8D AA 05 3F 84 DE 55 31 47>)
$$ ##END=
$$ 
$$ $$ hash MD5
$$ $$ 81 A4 DF 3A 44 3E 26 9D E9 E2 CF 7B BE DB B4 B2
##$RELAX= 
##$RELAX= 
##$RELAX= 
##$RELAX= 
##$RELAX= 
##$RELAX= 
##$RELAX= 
##$RELAX= 
$$ Bruker specific parameters
$$ --------------------------
##$DU= <E:\>
##$EXPNO= 32
$$ [...]
##$TP07= 0
##$TPNAME0= <>
##$TPNAME1= <>
##$TPNAME2= <>
##$TPNAME3= <>
##$TPNAME4= <>
##$TPNAME5= <>
##$TPNAME6= <>
##$TPNAME7= <>
##$TPOAL= (0..7)
0.5 0.5 0.5 0.5 0.5 0.5 0.5 0.5
##$TPOFFS= (0..7)
0 0 0 0 0 0 0 0
##$TUNHIN= 0
##$TUNHOUT= 0
##$TUNXOUT= 0
##$USERA1= <user>
##$USERA2= <user>
##$USERA3= <user>
##$USERA4= <user>
##$USERA5= <user>
##$V9= 5
##$VALIST= <valist>
##$VCLIST= <CCCCCCCCCCCCCCC>
##$VD= 0
##$VDLIST= <DDDDDDDDDDDDDDD>
##$VPLIST= <PPPPPPPPPPPPPPP>
##$VTLIST= <TTTTTTTTTTTTTTT>
##$WBST= 2048
##$WBSW= 25
##$XGAIN= (0..3)
0 0 0 0
##$XL= 0
##$YL= 0
##$YMAX_a= 5385671
##$YMIN_a= -10690025
##$ZGOPTNS= <>
##$ZL1= 120
##$ZL2= 120
##$ZL3= 120
##$ZL4= 120
##$ABSF1= 14.96225
##$ABSF2= -5.595932
##$ABSG= 5
##$ABSL= 3
##$ALPHA= 0
##$AQORDER= 0
##$ASSFAC= 0
##$ASSFACI= 0
##$ASSFACX= 0
##$ASSWID= 0
##$AUNMP= <proc_prof1d_extract.lims>
##$AXLEFT= 0
##$AXNAME= <>
##$AXNUC= <1H>
##$AXRIGHT= 0
##$AXTYPE= 0
##$AXUNIT= <>
##$AZFE= 0.1
##$AZFW= 0.1
##$BCFW= 0
##$BC_mod= 0
##$BYTORDP= 0
##$COROFFS= 0
##$CY= 15
##$DATMOD= 1
##$DC= 0
##$DFILT= <>
##$DTYPP= 0
##$F1P= 0
##$F2P= 0
##$FCOR= 0.5
##$FTSIZE= 131072
##$FT_mod= 6
##$GAMMA= 0
##$GB= 0
##$INTBC= 1
##$INTSCL= 1
##$ISEN= 128
##$LB= 0.3
##$LEV0= 0
##$LPBIN= 0
##$MAXI= 10000
##$MC2= 0
##$MEAN= 0
##$ME_mod= 0
##$MI= 0
##$NCOEF= 0
##$NC_proc= -2
##$NLEV= 6
##$NOISF1= 0
##$NOISF2= 0
##$NSP= 0
##$NTH_PI= 0
##$NZP= 0
##$OFFSET= 14.96225
##$PC= 1
##$PHC0= -83.4906
##$PHC1= 0
##$PH_mod= 1
##$PKNL= yes
##$PPARMOD= 0
##$PPDIAG= 0
##$PPIPTYP= 0
##$PPMPNUM= 2147483647
##$PPRESOL= 1
##$PSCAL= 4
##$PSIGN= 0
##$PYNMP= <proc.py>
##$REVERSE= no
##$SF= 400.020009137741
##$SI= 131072
##$SIGF1= 0
##$SIGF2= 0
##$SINO= 400
##$SIOLD= 131072
##$SPECTYP= <>
##$SREGLST= <1H.CDCl3>
##$SSB= 0
##$STSI= 131072
##$STSR= 0
##$SW_p= 8223.68421052631
##$SYMM= 0
##$S_DEV= 0
##$TDeff= 65536
##$TDoff= 0
##$TI= <>
##$TILT= no
##$TM1= 0
##$TM2= 0
##$TOPLEV= 0
##$USERP1= <user>
##$USERP2= <user>
##$USERP3= <user>
##$USERP4= <user>
##$USERP5= <user>
##$WDW= 1
##$XDIM= 131072
##$YMAX_p= 350837619
##$YMIN_p= -10957
##$CURPLOT= <Network HP LaserJet P1505>
##$CURPRIN= <$Network HP LaserJet P1505>
##$DFORMAT= <normdp>
##$LAYOUT= <+/1D_H.xwp>
##$LFORMAT= <normlp>
##$PFORMAT= <normpl>
##$SURQMSG= 1
$$ End of Bruker specific parameters
$$ ---------------------------------
##NTUPLES= NMR SPECTRUM
##VAR_NAME=  FREQUENCY,     SPECTRUM/REAL,   SPECTRUM/IMAG
##SYMBOL=    X,             R,               I
##VAR_TYPE=  INDEPENDENT,   DEPENDENT,       DEPENDENT
##VAR_FORM=  AFFN,          ASDF,            ASDF
##VAR_DIM=   131072,        131072,          131072
##UNITS=     HZ,            ARBITRARY UNITS, ARBITRARY UNITS
##FACTOR=    0.0627417313425164, 1,          1
##FIRST=     8223.62146879497, 4133,         -39492
##LAST=      0,             5951,            -38500
##MIN=       0,             -10957,          0
##MAX=       8223.62146879497, 350837619,    0
$$ Real data points
##PAGE= N=1
##DATA TABLE= (X++(R..R)), XYDATA
$$ [...]
63552D26566m561o277o616n986n076m113k906j489l12J88j62j397l375n685p916
63537C70883r918j1460j1970j1192r910r350r866j0724j1186j1204j0998j0597
63525B42508r986r248q423p557o882o518o066n098l982l557l857l911l095j984
63511A62344j460j586j841j998k179k352k271j819j080k52L57M61J90N7L61Q41
63495A47773J127J233J337J483J673J947K162K047J715J658J917J839J062K58
63481A69231K64Q64J109O08j93q40j286j526j482j335j406j569j291m50M09Q02
63465A61909R13J242J906K590K910K727K218J826J954K605L417M030M310M273
63451A98830M040L899M152M787N498O057O526P095P899R004J0344J1645J2624
$$ y = [426566, 422005, 415728, 409112, 403126, 398050, 393937, 391031, 389542, 389230, 389418, 389256, 387859, 384484, 378799, 370883, 360965, 349505, 337535, 326343, 316433, 307083, 297217, 286493, 275307, 264103, 253105, 242508, 232522, 223274, 214851, 207294, 200412, 193894, 187828, 182730, 178748, 175191, 171334, 167423, 164328, 162344, 160884, 159298, 157457, 155459, 153280, 150928, 148657, 146838, 145758, 145506, 145863, 146324, 146514, 146571, 146932, 147773, 148900, 150133, 151470, 152953, 154626, 156573, 158735, 160782, 162497, 164155, 166072, 167911, 168973, 169231, 169495, 170359, 171468, 172076, 171883, 171043, 169757, 168231, 166749, 165414, 164008, 162439, 161148, 160698, 161107, 161909, 162822, 164064, 165970, 168560, 171470, 174197, 176415, 178241, 180195, 182800, 186217, 190247, 194557, 198830, 202870, 206769, 210921, 215708, 221206, 227263, 233789, 240884, 248783, 257787, 268131, 279776, 292400]
63438B92400J3346J4193J5496J7324J9539K1748K3267K3566K2886K2010K1209
63427E06984J9777J6909J2713Q013L467o68m024o021o525o126n548m932m089l208
63413E26722k905l538m890o614q735j1353j4073j6153j7211j7491j7369j6897
63401C89493j6015j4865j3633j2219j0459q545o930n796m844l691k262p66O26
63388B90094J919L273M771O235P347Q020Q584R345J0080J0261R815R390R727J0918
63374C99779J2477J3903J5067J6057J6903J7376J7064J5640J3162J0065O794L540
63362E57827L17k717n164o541o562n367l644k391k271l069l957m471n054o474
63348E00462q829j1429j3664j5534j7110j7894j7227j5271j3097j1650j0946j0386
$$ y = [292400, 305746, 319939, 335435, 352759, 372298, 394046, 417313, 440879, 463765, 485775, 506984, 526761, 543670, 556383, 564396, 567863, 567195, 563171, 557150, 550625, 544499, 538951, 534019, 529930, 526722, 523817, 520279, 515389, 508775, 500040, 488687, 474614, 458461, 441250, 423759, 406390, 389493, 373478, 358613, 344980, 332761, 322302, 313757, 306827, 301031, 296187, 292496, 290234, 289468, 290094, 292013, 295286, 300057, 306292, 313639, 321659, 330243, 339588, 349668, 359929, 369744, 379134, 388861, 399779, 412256, 426159, 441226, 457283, 474186, 491562, 508626, 524266, 537428, 547493, 554287, 557827, 558144, 555427, 550263, 543722, 537160, 531793, 528149, 525758, 523487, 520418, 516461, 511990, 506936, 500462, 491633, 480204, 466540, 451006, 433896, 416002, 398775, 383504, 370407, 358757, 347811, 337425]
63336C37425r519q337p084o070n480n177m778m181l752l807m096m127l899l858
63322B63260m149m285l761k708j742j248j075q43l82K53J028J994L026L718L722
63307B56808L086K089Q57n64j841k532k636k585k593k526k459k784l420l590k868
63292B32442j935j675j959k061j896j978k352k470k124j691j359r29m46k83l62
63277B08922j21M66O50J05m31k32L44M79N7l96n37l60J38Q96J632K185K684L033
63259B19514K717J666P91R95J979K744K994L267L900M627N110N241N037M838N268
63244B70688O367P071O585N932O913R557J1876J2490J2220J2511J3489J4429J5176
63231D05304J6003J6648J6581J5998J5679J5993J6652J7245J7447J6936J5834
$$ y = [337425, 327906, 319569, 312485, 306415, 300935, 295758, 290980, 286799, 283047, 279240, 275144, 271017, 267118, 263260, 259111, 254826, 251065, 248357, 246615, 245367, 244292, 243449, 243067, 243320, 244348, 246342, 249368, 253086, 256808, 259894, 261983, 262840, 262276, 260435, 257903, 255267, 252682, 250089, 247563, 245104, 242320, 238900, 235310, 232442, 230507, 228832, 226873, 224812, 222916, 220938, 218586, 216116, 213992, 212301, 210942, 210013, 209567, 209284, 208922, 208801, 209267, 209917, 210022, 209591, 209359, 209703, 210182, 210239, 209843, 209306, 208946, 209084, 209980, 211612, 213797, 216481, 219514, 222231, 223897, 224688, 225683, 227662, 230406, 233400, 236667, 240567, 245194, 250304, 255545, 260582, 265420, 270688, 277055, 284126, 290711, 296643, 303556, 313113, 324989, 337479, 349699, 362210, 375699, 390128, 405304, 421307, 437955, 454536, 470534, 486213, 502206, 518858, 536103, 553550, 570486, 586320]
63220E86320J5018J5306J6410J7313J7563J7555J7519J6977J5383J2743R437N877
63208G63421K447o96l869p502j1441j4962j7615j9579k1076k1900k1774k0807
63196F04647j9263j7209j4653j1866r220o829m514k041O51L399N932Q152J0234
63183E47420J2271J3950J4996J5726J6738J7987J8726J8539J7904J7482J7349
63172G29088J7231J7053J6839J6404J5589J4582J3551J2202J0037O952L224q22
63160H71930m866q530j1765j5020j8535k1656k3464k4014k4271k4626k4214k2138
63148F48831j8925j6180j4874j4408j3450j1467r170p546o708n930m677l157j731
63135E20608l08J289K616K939K174R98rq52j705k496l123l690m235m504m237l535
$$ y = [586320, 601338, 616644, 633054, 650367, 667930, 685485, 703004, 719981, 735364, 748107, 757544, 763421, 765868, 765172, 761303, 753801, 742360, 727398, 709783, 690204, 669128, 647228, 625454, 604647, 585384, 568175, 553522, 541656, 532436, 525607, 521093, 519052, 519703, 523102, 529034, 537186, 547420, 559691, 573641, 588637, 604363, 621101, 639088, 657814, 676353, 694257, 711739, 729088, 746319, 763372, 780211, 796615, 812204, 826786, 840337, 852539, 862576, 869528, 872752, 871930, 867064, 858534, 846769, 831749, 813214, 791558, 768094, 744080, 719809, 695183, 670969, 648831, 629906, 613726, 598852, 584444, 570994, 559527, 550357, 542811, 536103, 530173, 525496, 522339, 520608, 520300, 521589, 524205, 527144, 529318, 530316, 530307, 529455, 527750, 525254, 522131, 518441, 514206, 509702, 505465, 501930]
63119E01930k786k330k306k552k613k105j211n53m26m17l6N92R60R47R47J306
63103D89347J858K160K031J811K020K724L342L295K760K461K687K947K726K145
63089E24314J601J166P92P42J277K010K192J679J183J348J983K435K497K591L130
63074E50940L974M611M752M672M918N747O882P817Q302Q581R191J0478J2205J3723
63060F56793J4727J5705J7272J9158K0385K0604K0757K2043K4593K7539L0027
63049H89603L1712L2528L2614L2493L2702L3157L3183L2334L0895K9594K9004
63038A239819K9269L0036L0665L0786L0565L0209K9348K7449K4647K1517J7937
63027A542247J2929O019j924r685j7028k4400l1660l7889m2409m5376m7208m7899
$$ y = [501930, 499144, 496814, 494508, 491956, 489343, 487238, 486027, 485474, 485048, 484631, 484595, 485187, 486147, 487094, 488041, 489347, 491205, 493365, 495396, 497207, 499227, 501951, 505293, 508588, 511348, 513809, 516496, 519443, 522169, 524314, 525915, 527081, 527873, 528615, 529892, 531902, 534094, 535773, 536956, 538304, 540287, 542722, 545219, 547810, 550940, 554914, 559525, 564277, 568949, 573867, 579614, 586496, 594313, 602615, 611196, 620387, 630865, 643070, 656793, 671520, 687225, 704497, 723655, 744040, 764644, 785401, 807444, 832037, 859576, 889603, 921315, 953843, 986457, 1018950, 1051652, 1084809, 1117992, 1150326, 1181221, 1210815, 1239819, 1269088, 1299124, 1329789, 1360575, 1391140, 1421349, 1450697, 1478146, 1502793, 1524310, 1542247, 1555176, 1561195, 1559271, 1549586, 1532558, 1508158, 1476498, 1438609, 1396200, 1350824, 1303616, 1255717]
63015A255717m7166m4957m1671l7899l4018k9920k5214j9884j4539r720n166k54
63003I45309M824Q999J1725J3949J7051K1121K4845K7081K7971K8362K8696K8865
62991A188798K8791K8591K8282K7743K7051K6389K5518K3751K0745J6959J2921
62980A455539Q231J882o367j5392k3697l0658l6565m1836m6573n0628n3699n5341
62968A104896n5393n4396n3131n1658m9251m5541m1312l7676l4783l1964k8979
62957F20812k6397k4567k2955k0983j8954j7496j6397j4816j2659j0908j0259
62946D24421j0093r289p696o194n505n474n510n212m473l460k656k534k924l026
62932C50375k404j718j994l290m527m786m255l721l430k968k119j329j159j633
$$ y = [1255717, 1208551, 1163594, 1121923, 1084024, 1050006, 1020086, 994872, 974988, 960449, 950729, 945563, 945309, 950133, 959132, 970857, 984806, 1001857, 1022978, 1047823, 1074904, 1102875, 1131237, 1159933, 1188798, 1217589, 1246180, 1274462, 1302205, 1329256, 1355645, 1381163, 1404914, 1425659, 1442618, 1455539, 1463770, 1465652, 1459285, 1443893, 1420196, 1389538, 1352973, 1311137, 1264564, 1213936, 1160237, 1104896, 1049503, 995107, 941976, 890318, 841067, 795526, 754214, 716538, 681755, 649791, 620812, 594415, 569848, 546893, 525910, 506956, 489460, 473063, 458247, 445588, 434680, 424421, 414328, 405039, 397343, 391149, 385644, 380170, 374660, 369448, 364975, 361515, 358859, 356325, 353401, 350375, 347971, 346253, 344259, 340969, 336442, 331656, 327401, 323680, 320250, 317282, 315163, 313834, 312675, 311042]
62918C11042k325k842l008k841k559k471k620k636k244j775j751k088k119j475
62904B78288n77k8P2M0J03K72N07P63R57J037R96P14K8r36j697j911j698j382
62886B75548j116r66j012j130r61l95J64L42L08M16O12O77P74J126J414J098L04
62869B77203l06n07o33o76j24R71J600J049r9p91r00j098j635k101k253k338k528
62852B64834k612k456k236k068j782j310r22q61r99j110j154j067o24J60P36O21
62836B47150J46N8M90Q46P87P04R42J151R39O74R26J433J396P58L76O90J097J006
62818B61569Q62J371K318K905L018L277L802L850K984J904J608K131K694K890
62804B97183L170M068N415O631P570Q617R916J0895J1015J0757J1340J3345J6091
$$ y = [311042, 308717, 305875, 302867, 300026, 297467, 294996, 292376, 289740, 287496, 285721, 283970, 281882, 279763, 278288, 277711, 277683, 277755, 277795, 277898, 278170, 278677, 279440, 280397, 281434, 282430, 283144, 283172, 282236, 280539, 278628, 276930, 275548, 274432, 273466, 272454, 271324, 270363, 269968, 270132, 270474, 270782, 271198, 271810, 272487, 273261, 274387, 275801, 276899, 277203, 276897, 276390, 275757, 275081, 274957, 275928, 277528, 278577, 278478, 277687, 276787, 275689, 274054, 271953, 269700, 267362, 264834, 262222, 259766, 257530, 255462, 253680, 252370, 251448, 250587, 249588, 248478, 247324, 246257, 245633, 245793, 246529, 247150, 247296, 247354, 247844, 248690, 249477, 250181, 251123, 252274, 253213, 253887, 254813, 256246, 257642, 258400, 258776, 259466, 260563, 261569, 262431, 263802, 266120, 269025, 272043, 275320, 279122, 282972, 285956, 287860, 289468, 291599, 294293, 297183, 300353, 304421, 309836, 316467, 324037, 332654, 342570, 353465, 364480, 375237, 386577, 399922, 416013]
62791D16013J8601K0706K2834K5128K7401K9765L2631L6085L9784M3529M7417
62780G59894N1294N4611N7063N8918O0345O0747N9249N5604N0297M3774L6012
62769A347808K6896J6755O287l965j3817k3170l1734l9212m5576n0866n4828n7108
62757A077470n7890n7839n7256n5723n2901m9239m5499m1949l8503l5295l2476
62746E52900k9766k6846k4083k2092k0702j9070j6851j4555j2656j1035r503q197
62734C37544p226o461n862n469m892l534j578j09J87j45j51L63J003J571K241
62719C07482L163M342N727P149Q442R756J1416J3387J5306J7122J9125K1272K3228
62706D66917K5260K8257L2432L6798M0474M3736M7182N0633N3598N6090N8161
$$ y = [416013, 434614, 455320, 478154, 503282, 530683, 560448, 593079, 629164, 668948, 712477, 759894, 811188, 865799, 922862, 981780, 1042125, 1102872, 1162121, 1217725, 1268022, 1311796, 1347808, 1374704, 1391459, 1397746, 1393781, 1379964, 1356794, 1325060, 1285848, 1240272, 1189406, 1134578, 1077470, 1019580, 961741, 904485, 848762, 795861, 746622, 701123, 659174, 620671, 585376, 552900, 523134, 496288, 472205, 450113, 429411, 410341, 393490, 378935, 366279, 355244, 345741, 337544, 330318, 323857, 317995, 312526, 307634, 304100, 302522, 302413, 302600, 302455, 302304, 302667, 303670, 305241, 307482, 310645, 314987, 320714, 327863, 336305, 346061, 357477, 370864, 386170, 403292, 422417, 443689, 466917, 492177, 520434, 552866, 589664, 630138, 673874, 721056, 771689, 825287, 881377, 939538]
62695I39538N9250N8815N7056N4121M9331M2211L3721K5153J6247N859n762j6810
62683A318730k6144l4221m1551m7617n1953n5050n7374n8410n7488n4982n1955
62672G81985m9059m6343m3691m0890l7585l3725k9767k6168k2919j9958j7566
62661D14314j5989j4970j4042j3007j1919j0876j0094r743r463q478o658n015
62649B84060m601n227n742n439m624l955l718l756l715l311k635k131k100k299
62635B30807k275j959j647j499j426j363j351j319j135q76p72p56m10M06J188
62620B15613J359J100J207K046L010L319L102L202M016M996N553N868O486P421
62606B68298Q226Q723R168R809J0771J2385J4961J8127K0893K2685K3938K5428
$$ y = [939538, 998788, 1057603, 1114659, 1168780, 1218111, 1260322, 1294043, 1319196, 1335443, 1341302, 1335540, 1318730, 1292586, 1258365, 1216814, 1169197, 1117244, 1062194, 1004820, 946410, 888922, 833940, 781985, 732926, 686583, 642892, 602002, 564417, 530692, 500925, 474757, 451838, 431880, 414314, 398325, 383355, 369313, 356306, 344387, 333511, 323417, 313674, 304211, 295733, 289075, 284060, 279459, 274232, 268490, 263051, 258427, 254472, 250754, 246998, 243283, 239972, 237337, 235206, 233106, 230807, 228532, 226573, 224926, 223427, 222001, 220638, 219287, 217968, 216833, 215957, 215185, 214429, 214019, 214425, 215613, 216972, 218072, 219279, 221325, 224335, 227654, 230756, 233958, 237974, 242970, 248523, 254391, 260877, 268298, 276524, 285247, 294415, 304224, 314995, 327380, 342341, 360468, 381361, 404046, 427984, 453412]
62594D53412K7325K9179L0541L1204L0956K9440K6433K2135J7160J2116P147J950
62582G18998l611r011j3500j6907j9720k2363k4706k6301k6827k6275k5074k3932
62570D80771k3187k2341k0680j8386j6431j5283j4361j3022j1445j0087q825p255
62558B99468n485m040l150k720k775l411m289m787m680m294l908l440k875k518
62544B47096k565k698k421j692r64n72k71M33J593K590K775K263J938K564M020
62529B54089N582O786P803Q944J0082J0844J1293J2159J4090J6826J9415K1280
62517C99193K2827K4815K7458L0346L2970L4940L5819L5281L3514L1093K8308
62506G36564K4857K0262J4489Q098J933l440q159j2794j7483k1516k4167k5596
$$ y = [453412, 480737, 509916, 540457, 571661, 602617, 632057, 658490, 680625, 697785, 709901, 717048, 718998, 715387, 706376, 692876, 675969, 656249, 633886, 609180, 582879, 556052, 529777, 504703, 480771, 457584, 435243, 414563, 396177, 379746, 364463, 350102, 337080, 325635, 315548, 306723, 299468, 293983, 289943, 286793, 284073, 281298, 277887, 273598, 268811, 264131, 259837, 255929, 252489, 249614, 247096, 244531, 241833, 239412, 237720, 236756, 236184, 235913, 236346, 237939, 240529, 243304, 245567, 247505, 250069, 254089, 259671, 266457, 274260, 283204, 293286, 304130, 315423, 327582, 341672, 358498, 377913, 399193, 422020, 446835, 474293, 504639, 537609, 572549, 608368, 643649, 677163, 708256, 736564, 761421, 781683, 796172, 804270, 806203, 802763, 794604, 781810, 764327, 742811, 718644, 693048]
62494F93048k6496k7053k6949k6276k5606k5015k3901k2067k0280j9215j8488
62483D31702j7290j5529j3756j2268j0912r571q390p557p193p249p293o723n565
62470C02406m616m363m201l270j771n99PO03J322J515R56N20J078K316L298L855
62454B99056M592N650O331O180N799O013O666O897O496O148O150N661L818J097
62440C76554j185k491l468m726o052p002p541p763p536o920o473o684p318p707
62426B93688p484o690n457l943k452j287n43j75p1N3M68J005J207J051J138J778
62410B72286K446K581K438K638L196L691M088M715N511N941N723N145M650M561
62396C29610N055N979O654O436N506M637M200L841L262K718K542K605K536K300
$$ y = [693048, 666552, 639499, 612550, 586274, 560668, 535653, 511752, 489685, 469405, 450190, 431702, 414412, 398883, 385127, 372859, 361947, 352376, 343986, 336429, 329236, 321987, 314694, 307971, 302406, 297790, 293427, 289226, 285956, 284185, 283586, 283593, 284196, 285518, 287033, 287989, 288509, 289587, 291903, 295201, 299056, 303648, 309298, 315629, 321809, 327608, 333621, 340287, 347184, 353680, 359828, 365978, 371639, 375457, 376554, 375369, 372878, 369410, 364684, 358632, 351630, 344089, 336326, 328790, 321870, 315397, 308713, 301395, 293688, 286204, 279514, 274057, 270114, 267662, 266375, 265832, 265657, 265586, 265639, 266107, 267112, 268319, 269370, 270508, 272286, 274732, 277313, 279751, 282389, 285585, 289276, 293364, 298079, 303590, 309531, 315254, 320399, 325049, 329610, 334665, 340644, 347298, 353734, 359240, 363877, 368077, 371918, 375180, 377898, 380440, 383045, 385581, 387881]
62382C87881K231K639L543M713N936P194Q608J0142J1548J2755J4111J6032J8501
62369E05834K1161K3803K6487K9244L1840L3887L5072L5399L5132L4291L2210
62358H44360K8174K2615J7139J2933R657O373K970r0k903o059r595j2957j6008
62345H96609j9181k2473k5055k6218k6149k5521k4827k4260k3732k2795k1093
62334F35305j8990j7352j6455j5786j5039j4604j4725j4791j4102j2822j1680
62323D68959j1005j0553j0027r236p938o051l967k324j441j216j349j394p90O06
62309D02274K142K940K871K600K661K901L043L254L777M275M090L204K452K563
62295D45047L283L798L843L902M378N017N314N089M430L489K654K523L239M089
$$ y = [387881, 390112, 392751, 396294, 401007, 406943, 414137, 422745, 432887, 444435, 457190, 471301, 487333, 505834, 526995, 550798, 577285, 606529, 638369, 672256, 707328, 742727, 777859, 812150, 844360, 872534, 895149, 912288, 925221, 934878, 941251, 944221, 944131, 941228, 935169, 925574, 912617, 896609, 877428, 854955, 829900, 803682, 777533, 752012, 727185, 702925, 679193, 656398, 635305, 616315, 598963, 582508, 566722, 551683, 537079, 522354, 507563, 493461, 480639, 468959, 457954, 447401, 437374, 428138, 420200, 414149, 410182, 407858, 406417, 405201, 403852, 402458, 401668, 402274, 404416, 407356, 410227, 412827, 415488, 418389, 421432, 424686, 428463, 432738, 436828, 440032, 442484, 445047, 448330, 452128, 455971, 459873, 464251, 469268, 474582, 479671, 484101, 487590, 490244, 492767, 496006, 500095]
62281E00095M273L947L995M808N872O619P186Q076R454J1115J2917J4950J7301
62268F10608J9795K2142K4301K6618K9407L2399L4849L6327L6938L6649L4807
62257I44840L0943K5680K0328J5659J1554P713M079N35l291p682j2523j7328k1417
62244I99090k4302k6210k7895k9496l0053k8780k6374k4158k2294j9962j7218
62233G22348j5194j4157j2823j0394q077p452q167q449p504o191n416n016m452
62220F09056l691k968k201j162j3P57R39Q61R70J250J283R32O41Q12J151J026
62204F09643L94j68k55O9P79K030L557M630M934M978N314N896O592P661R206J0570
62188F75830J1028J0688J0161R615Q889Q260Q350R232J0381J1614J3446J6215
$$ y = [500095, 504368, 508315, 512310, 517118, 522990, 529609, 536795, 544871, 554325, 565440, 578357, 593307, 610608, 630403, 652545, 676846, 703464, 732871, 765270, 800119, 836446, 873384, 910033, 944840, 975783, 1001463, 1021791, 1037450, 1049004, 1056717, 1060796, 1061331, 1058040, 1050358, 1037835, 1020507, 999090, 974788, 948578, 920683, 891187, 861134, 832354, 805980, 781822, 759528, 739566, 722348, 707154, 692997, 680174, 669780, 661703, 654251, 646084, 637635, 630131, 623940, 618524, 613508, 609056, 605365, 602397, 600196, 599034, 599021, 599778, 600717, 601578, 602548, 603798, 605081, 606013, 606654, 607466, 608617, 609643, 610037, 609869, 609614, 609683, 610462, 612492, 616049, 620679, 625613, 630591, 635905, 641801, 648393, 656054, 665260, 675830, 686858, 697546, 707707, 717322, 726211, 734471, 742821, 752053, 762434, 774048, 787494, 803709]
62176H03709J9414K2226K4429K6376K8269K9768L0397K9990K8633K6332K3056
62165A092599J9093J5059J1320P688L985O74j621l137m960p742j0908j3363j4654
62152A094033j5229j5792j6604j7213j6819j5116j2799j0822r272p562n742m786
62140I46277n175n986n980n123m394m419m934n342n238m565l607k766j992q13
62126H85943Q80K427L311M015N440P660R748J0534R185N541O27l506n291m948
62112I31566l774k398o74Q98Q60j611n579r366j2118j3853j4488j3630j1362q685
62098H35786o776n980n684n082l943k618j545q68l85L10J472K766L466L456L701
62083H18076N070O893P656P152O905Q076R987J1356J2061J2827J3886J4911J5806
$$ y = [803709, 823123, 845349, 869778, 896154, 924423, 954191, 984588, 1014578, 1043211, 1069543, 1092599, 1111692, 1126751, 1138071, 1145759, 1149744, 1150418, 1148797, 1145660, 1140700, 1132958, 1122050, 1108687, 1094033, 1078804, 1063012, 1046408, 1029195, 1012376, 997260, 984461, 973639, 964367, 956805, 951063, 946277, 941102, 935116, 929136, 924013, 919619, 915200, 910266, 904924, 899686, 895121, 891514, 888748, 886756, 885943, 886823, 889250, 892561, 896576, 902016, 909676, 919424, 929958, 939143, 944684, 945311, 941805, 936514, 931566, 927792, 925394, 924720, 925618, 926478, 924867, 919288, 909922, 897804, 883951, 869463, 855833, 844471, 835786, 829010, 823030, 817346, 812264, 808321, 805703, 804158, 803290, 802905, 803215, 804687, 807453, 810919, 814375, 818076, 823146, 830039, 837695, 844847, 851752, 859828, 869815, 881171, 893232, 906059, 919945, 934856, 950662]
62070I50662J6576J6762J5889J4169J2030R312N771J986j244m025o900r588j1372
62057A010028j2480j3859j5657j7225j8592k0470k2585k3578k3040k2275k2243
62046G98024k2076k0615j8333j6509j5329j4021j2362j0904r885r025q264p868
62034F32833p729p388o772o372o534p070p595p871p772p299o666o164n925n955
62020E35721o214o478o399n953n557n438n224m560l817l622l885l896l328k590
62006D68760k167k088k196k493k927l117k621j512n03m18j384k591l033k602k221
61991D36887k720l830m579m476l922l540l508l605l576l331l007k842k834k515
61977C88602j403K53J488J629J098Q92J397K063K319K417L018M115M896M779M187
$$ y = [950662, 967238, 984000, 999889, 1014058, 1026088, 1035400, 1041171, 1043157, 1041913, 1037888, 1030988, 1021400, 1010028, 997548, 983689, 968032, 950807, 932215, 911745, 889160, 865582, 842542, 820267, 798024, 775948, 755333, 737000, 720491, 705162, 691141, 678779, 667875, 657990, 648965, 640701, 632833, 625104, 617716, 610944, 604572, 598038, 590968, 583373, 575502, 567730, 560431, 553765, 547601, 541676, 535721, 529507, 523029, 516630, 510677, 505120, 499682, 494458, 489898, 486081, 482459, 478574, 474678, 471350, 468760, 466593, 464505, 462309, 459816, 456889, 453772, 451151, 449639, 449136, 448718, 447334, 444743, 441710, 439108, 436887, 434167, 430337, 425758, 421282, 417360, 413820, 410312, 406707, 403131, 399800, 396793, 393951, 391117, 388602, 387199, 387452, 388940, 390569, 391667, 392559, 393956, 396019, 398338, 400755, 403773, 407888, 412784, 417563, 421750]
61962D21750L931M127M255M182M428N258O059O141N762N825O651P668Q337Q840
61948E03214R578J0463J1163J1824J2929J4487J5892J6720J7261J7890J8376J8345
61936F78142J8098J8381J9321K0244K0669K0857K1134K1312K1236K1405K2451
61925I03250K4254K6142K7842K9758L2430L6129M0837M6143N1402N6447O2006
61914A336640O8814P6425Q3584Q9849R6072J03092J10627J17848J24472J30758
61904B338181J36627J41348J43984J43839J40441J33327J22006J06213Q6217O2753
61894C554936L6577Q360k0796m9098p4800r6986j15287j29166j38246j43124j45034
61883B687336j44535j41367j35741j28899j21881j14522j06212r7233q8649q1222
$$ y = [421750, 425681, 429808, 434063, 438245, 442673, 447931, 453990, 460131, 465893, 471718, 478369, 486037, 494374, 503214, 512792, 523255, 534418, 546242, 559171, 573658, 589550, 606270, 623531, 641421, 659797, 678142, 696240, 714621, 733942, 754186, 774855, 795712, 816846, 838158, 859394, 880799, 903250, 927504, 953646, 981488, 1011246, 1043676, 1079805, 1120642, 1166785, 1218187, 1274634, 1336640, 1405454, 1481879, 1565463, 1655312, 1751384, 1854476, 1965103, 2082951, 2207423, 2338181, 2474808, 2616156, 2760140, 2903979, 3044420, 3177747, 3299753, 3405966, 3492183, 3554936, 3591513, 3599873, 3579077, 3529979, 3455179, 3358193, 3242906, 3113740, 2975494, 2832370, 2687336, 2542801, 2401434, 2265693, 2136794, 2014913, 1900391, 1794179, 1696946, 1608297, 1527075]
61873A527075p4926o9275o3726n7913n1949m6310m1291l6762l2601k8963k5888
61862I97471k3025k0064j7086j4183j1189q096n250k731j07K716M893N614N277
61849I14240M863M526L656K199R60L50k12j325k639l322l016j932l81J427L282
61834I22676N078O892Q743J0397J1550J2063J1797J0461P958M793J771q22l411
61821A009946o276q766r763q974p421o389o093n629m118j574J347M082O532Q869
61807I65773J1182J3283J4974J6583J8963K2564K6623K9801L1655L3083L5123
61796A219607L7953M1218M4831M8923N3383N8050O3233O9441P6614Q4004R1072
61785A888329R8223J06488J16500J27922J39921J52136J64986J78856J93200K06810
$$ y = [1527075, 1452149, 1382874, 1319148, 1261235, 1209286, 1162976, 1121685, 1084923, 1052322, 1023359, 997471, 974446, 954382, 937296, 923113, 911924, 903828, 898578, 895847, 895740, 898456, 903349, 908963, 914240, 919103, 923629, 927285, 929484, 930444, 930794, 930582, 929257, 926618, 923296, 920280, 918348, 917967, 919394, 922676, 927754, 934646, 943389, 953786, 965336, 977399, 989196, 999657, 1007615, 1012408, 1014179, 1013357, 1009946, 1003670, 994904, 985141, 976167, 968746, 962357, 956264, 950635, 946517, 944943, 946290, 950372, 956904, 965773, 976955, 990238, 1005212, 1021795, 1040758, 1063322, 1089945, 1119746, 1151401, 1184484, 1219607, 1257560, 1298778, 1343609, 1392532, 1445915, 1503965, 1567198, 1636639, 1713253, 1797257, 1888329, 1986552, 2093040, 2209540, 2337462, 2477383, 2629519, 2794505, 2973361, 3166561, 3373371]
61775C373371K18975K29920K39962K48553K54329K55847K51977K41719K23940
61766E538593J97549J62283J19489P1823K1760k9384q0439j28778j70757k04081
61756E498058k28969k46703k57813k62219k60403k53639k43403k31058k17801
61747C296050k04320j90686j76953j63588j50939j38781j26909j15778j05958
61738A922138r7276q9111q1339p4394o8498o3414n8780n4300m9761m5328m1603
61727A198334l8921l6759l4332l1536k8872k6681k4942k3585k2467k1219j9683
61716H89337j8232j7171j6165j4828j3542j2923j2854j2793j2769j3073j3212
61705G31775j2304j0556r257r081r367r380r262r260q972q054p030o675p000p360
$$ y = [3373371, 3592346, 3822266, 4062228, 4310781, 4565110, 4820957, 5072934, 5314653, 5538593, 5736142, 5898425, 6017914, 6089737, 6111497, 6082113, 6001674, 5872896, 5702139, 5498058, 5269089, 5022386, 4764573, 4502354, 4241951, 3988312, 3744909, 3513851, 3296050, 3091730, 2901044, 2724091, 2560503, 2409564, 2270783, 2143874, 2028096, 1922138, 1824862, 1735751, 1654412, 1580018, 1511520, 1448106, 1389326, 1335026, 1285265, 1239937, 1198334, 1159413, 1122654, 1088322, 1056786, 1027914, 1001233, 976291, 952706, 930239, 909020, 889337, 871105, 853934, 837769, 822941, 809399, 796476, 783622, 770829, 758060, 744987, 731775, 719471, 708915, 699658, 690577, 681210, 671830, 662568, 653308, 644336, 636282, 629252, 622577, 615577, 608217]
61691F08217p327o926o322n595m771l856l068k898l475l926l177j567q05j863
61677E52641l710m741m790m892n620o619p524q352q956q932q361p915p939p898
61663D56392p112n709m401l542k838j943r60r4Q66K335M086N056M318K175n3j349
61647D47227j836k273l125m214n068n335n061m678m613m798m750m192l391k740
61633C91153k237j669j060o67n72o13p00r40j337j550j199l67L88O23M46L03M16
61616C80418N94N61K17l71j014j442j534j594k008k607k747k151j343r82j163
61601C62834j621k195k714k808k285j447o07L31J382J993J680R60R13J933L398
61586C61747M523N016N030N013N461O314O845O672O507P201Q389R069R266R969
$$ y = [608217, 600890, 593964, 587642, 582047, 577276, 573420, 570352, 567454, 563979, 560053, 556876, 555309, 554504, 552641, 548931, 544190, 539400, 534508, 528888, 522269, 514745, 506393, 497437, 488505, 480144, 472229, 464290, 456392, 449280, 443571, 439170, 435628, 432790, 430847, 429887, 429793, 430659, 432994, 437080, 442136, 446454, 448629, 448576, 447227, 445391, 443118, 439993, 435779, 430711, 425376, 420315, 415637, 411024, 406226, 401476, 397284, 393893, 391153, 388916, 387247, 386187, 385520, 384948, 384335, 383635, 382695, 381358, 379808, 378609, 378242, 378630, 379253, 379699, 380002, 380418, 381012, 381573, 381790, 381419, 380405, 378963, 377429, 375835, 373827, 371220, 368473, 366322, 364979, 363997, 362834, 361213, 359018, 356304, 353496, 351211, 349764, 349157, 349488, 350870, 352863, 354543, 355503, 356416, 358349, 361747, 366270, 371286, 376316, 381329, 386790, 393104, 399949, 406621, 413128, 420329, 428718, 437787, 447053, 457022]
61572D57022J1460J2900J3742J4455J5456J6431J7212J8333K0018K1486K1863
61561F40378K1130J9629J7415J4647J1906R464O914M182K119J280Q81j10j399
61548G48436j954j664j282j021l89N48R08K07r63j774k034k032k085k446l206
61533G29249m113m800n173n239m751l601k385j894j989j693n27R76K302L790N954
61518G06106Q563J0901J2643J4054J5565J7528K0185K3485K7061L0670L4527L8919
61506I60207M3676M8421N3180N8308O3795O9100P3780P7858Q1314Q3676Q4611
61495A697926Q4588Q4252Q3148P9741P3015O3495N2364M0210K7214J4118K134
61484B302205p995j6217k2509k6743k9185l0343l0202k8319k4935k1264j8302
$$ y = [457022, 468482, 481382, 495124, 509579, 525035, 541466, 558678, 577011, 597029, 618515, 640378, 661508, 681137, 698552, 713199, 725105, 734569, 741483, 745665, 747784, 749064, 749945, 749835, 748436, 746482, 744818, 743536, 742515, 742126, 742674, 743582, 743789, 742826, 741052, 739018, 736986, 734901, 732455, 729249, 725136, 720336, 715163, 709924, 705173, 701572, 699187, 697293, 695304, 693611, 693084, 694060, 696362, 700152, 706106, 714669, 725570, 738213, 752267, 767832, 785360, 805545, 829030, 856091, 886761, 921288, 960207, 1003883, 1052304, 1105484, 1163792, 1227587, 1296687, 1370467, 1448325, 1529639, 1613315, 1697926, 1782514, 1866766, 1949914, 2029655, 2102670, 2166165, 2218529, 2258739, 2285953, 2300071, 2302205, 2294210, 2277993, 2255484, 2228741, 2199556, 2169213, 2139011, 2110692, 2085757, 2064493, 2046191]
61473B046191j6016j4097j2852j2770j3804j5700j8605k2663k7283l1426l4474
61462A826501l6328l6871l5970l3807l0749k6939k2470j7800j3509r739o207k691
61450A553421Q55M467Q059J1429J4704J8499K3122K7928L2026L5418L8705M1742
61438A810375M3237M1741L6623K8253J7924P582j057p423j1782j4169j4319j2580
61426A924405j0126p928n999l904j396J697N560R955J4003J6728J7507J5773J0858
61413A987133K670p692j8385k7746l4693l8725m0030l9445l7836l5543l2616k9346
61401A647746k6255k3653k1528j9718j7963j5923j3552j1294r551q031n990l127
61389A471161K04L750P742J2385J7307K2044K6751L1961L7695M3319M8427N3420
$$ y = [2046191, 2030175, 2016078, 2003226, 1990456, 1976652, 1960952, 1942347, 1919684, 1892401, 1860975, 1826501, 1790173, 1753302, 1717332, 1683525, 1652776, 1625837, 1603367, 1585567, 1572058, 1562319, 1556112, 1553421, 1554276, 1558743, 1566802, 1578231, 1592935, 1611434, 1634556, 1662484, 1694510, 1729928, 1768633, 1810375, 1853612, 1895353, 1931976, 1960229, 1978153, 1985735, 1984678, 1977255, 1965473, 1951304, 1936985, 1924405, 1914279, 1906351, 1900352, 1896448, 1895052, 1896749, 1902309, 1912264, 1926267, 1942995, 1960502, 1976275, 1987133, 1989803, 1982111, 1963726, 1935980, 1901287, 1862562, 1822532, 1783087, 1745251, 1709708, 1677092, 1647746, 1621491, 1597838, 1576310, 1556592, 1538629, 1522706, 1509154, 1497860, 1488309, 1480278, 1474288, 1471161, 1471365, 1475115, 1482857, 1495242, 1512549, 1534593, 1561344, 1593305, 1631000, 1674319, 1722746, 1776166]
61377A776166N8874O4608O9687P3263P5191P5823P5501P4213P1548O6903N9923
61366B541700N0771M0028K8380J6488M856o400j7495k8506l9025m8487n6611o3240
61354B422459o8096p1120p2865p3899p4087p3042p1186o9431o7790o5229o1248
61343A654466n6685n2518m8684m4697m0636l6742l2668k8051k3418j9588j6452
61332A254327j3289j0069p493n627l495k99L605P312J0370J2866J4877J6358J7416
61319A296859J8415J9610K0694K0810J9276J6398J3254J0562Q202O024M545M268
61307A458917M740N064N041N179N661N995N734M892L648K165P81j44o97j375k516
61292A503085m044n646o916p472p378p232p399p484p078o672p007p745p770o724
$$ y = [1776166, 1835040, 1899648, 1969335, 2042598, 2117789, 2193612, 2269113, 2343326, 2414874, 2481777, 2541700, 2592471, 2632499, 2660879, 2677367, 2682223, 2675823, 2658328, 2629822, 2590797, 2542310, 2485699, 2422459, 2354363, 2283243, 2210378, 2136479, 2062392, 1989350, 1918164, 1848733, 1780943, 1715714, 1654466, 1597781, 1545263, 1496579, 1451882, 1411246, 1374504, 1341836, 1313785, 1290367, 1270779, 1254327, 1241038, 1230969, 1223476, 1217849, 1214354, 1214055, 1217660, 1224972, 1235342, 1248208, 1263085, 1279443, 1296859, 1315274, 1334884, 1355578, 1376388, 1395664, 1412062, 1425316, 1435878, 1444080, 1450104, 1454649, 1458917, 1463657, 1468721, 1473762, 1478941, 1484602, 1490597, 1496331, 1501223, 1504871, 1507036, 1507817, 1507673, 1506976, 1505601, 1503085, 1499041, 1493395, 1486479, 1479007, 1471629, 1464397, 1456998, 1449514, 1442436, 1435764, 1428757, 1421012, 1413242, 1406518]
61278A406518n333m053k455k56J917L260L639L232J942l07l070n614p369q032
61264A384019p729p185p127p250o349l834n08K547N231Q139J1541J5283J9267
61251A406045K3435K7488L1192L4823L8945M3818M9361N5372O1273O5778O7207
61240A904737O4182N6014M2851K5933P572r708k4215l5390m3304m8232n0583n0867
61228A838990m9538m6838m2853l7762l2019k6117k0111j3710p240k225m94k744
61216A557339q362j6344k5586l4349m0484m2795m1755l8639l4481k9938k5468
61205A219138k1240j7381j4484j3190j2929j2051r799p290n823m986l522j479
61193A094964k15m53j470k329k929l619m581n947p809r812j1290j2155j3128j4661
$$ y = [1406518, 1401185, 1397132, 1394677, 1394421, 1396338, 1399598, 1403237, 1406469, 1408411, 1408104, 1405034, 1399420, 1392051, 1384019, 1376290, 1369105, 1361978, 1354728, 1348379, 1344545, 1344037, 1346584, 1351815, 1359954, 1371495, 1386778, 1406045, 1429480, 1456968, 1488160, 1522983, 1561928, 1605746, 1655107, 1710479, 1771752, 1837530, 1904737, 1968919, 2024933, 2067784, 2093717, 2101289, 2091581, 2067366, 2031976, 1988672, 1940440, 1889857, 1838990, 1789452, 1742614, 1699761, 1661999, 1629980, 1603863, 1583752, 1570042, 1562802, 1560577, 1560083, 1557339, 1548977, 1532633, 1507047, 1472698, 1432214, 1389419, 1347664, 1309025, 1274544, 1244606, 1219138, 1197898, 1180517, 1166033, 1152843, 1139914, 1127863, 1118064, 1110774, 1104951, 1099965, 1096443, 1094964, 1094749, 1094296, 1092826, 1090497, 1087568, 1083949, 1079368, 1073421, 1065612, 1055800, 1044510, 1032355, 1019227, 1004566]
61179A004566j6119j6499j5669j4435j3524j2949j2365j1568j0526r231p763o384
61167H57534n282m367l423k480j799j574j961l373o239j0254j4258j7239j9090
61154G66195k0111k0273j9588j8744j8446j8305j7309j5460j3948j3471j3386
61143E77154j2884j2104j1459j0678r283p526o020m883l950l382l312l177k284
61130D86212q59K24P03J133J852K535K979L563M636N924O992P841Q706R508R850
61115E51799R359P790N087J752j014k131j769j205j303j535r70J40O44K47NO47
61099E67543J338R66n6l81K18N94L4q64j382j697k229k827l191l446l769l920
61083E46931l638l119k667k313k032j905j791j361p37m95p37q27l98M0k2k60r5
$$ y = [1004566, 988447, 971948, 956279, 941844, 928320, 915371, 903006, 891438, 880912, 871681, 863918, 857534, 852252, 847885, 844462, 841982, 840183, 838609, 836648, 833275, 827036, 816782, 802524, 785285, 766195, 746084, 725811, 706223, 687479, 669033, 650728, 633419, 617959, 604011, 590540, 577154, 564270, 552166, 540707, 530029, 520746, 513220, 507200, 502317, 498367, 494985, 491673, 488496, 486212, 485353, 485577, 486280, 487413, 489265, 491800, 494779, 498342, 502978, 508902, 515894, 523735, 532441, 541949, 551799, 561158, 568948, 574035, 575787, 574773, 572642, 570873, 569668, 568365, 566830, 565860, 566000, 566644, 566891, 566896, 567543, 568881, 569847, 569791, 569410, 569628, 570222, 570256, 569392, 568010, 566313, 564084, 561257, 558066, 554620, 550851, 546931, 543293, 540174, 537507, 535194, 533162, 531257, 529466, 528105, 527368, 526873, 526136, 525309, 524911, 524951, 524929, 524669, 524574]
61066E24574M80J195K054L068L912M441N004N770O253O042N480N079M858M758
61052E82968N070N833O472O679P015P984R171J0044J0908J2162J3391J4118J4893
61039G06708J6497J8649K0600K2540K5281K8824L2417L5729L8830M1210M2128
61028A029413M1964M2210M4031M7589N2709N9324O7326P6654Q7330R8909J10496
61017A757955J22297J36720J56994J85052K21423K66209L18939L78324M44057
61008C987970N18824O07857P17861Q58436J043396J286257J588225J921249K211900
60999A4741975K342108K189764J707527R87186K41281l03827n23118m28626j22872
60990B0831398K57992N62877O36652L73201k07812r40961j596381k006843k138342
$$ y = [524574, 525054, 526249, 528303, 531371, 535283, 539724, 544728, 550498, 556751, 562793, 568273, 573352, 578210, 582968, 588038, 593871, 600343, 607022, 614037, 622021, 631192, 641236, 652144, 664306, 677697, 691815, 706708, 723205, 741854, 762454, 784994, 810275, 839099, 871516, 907245, 946075, 987285, 1029413, 1071377, 1113587, 1157618, 1205207, 1257916, 1317240, 1384566, 1461220, 1548550, 1647459, 1757955, 1880252, 2016972, 2173966, 2359018, 2580441, 2846650, 3165589, 3543913, 3987970, 4506794, 5114651, 5832512, 6690948, 7734344, 9020601, 10608826, 12530075, 14741975, 17084083, 19273847, 20981374, 21968560, 22209841, 21906014, 21382896, 20954270, 20831398, 21089390, 21652267, 22288919, 22662120, 22454308, 21513347, 19916966, 17910123, 15771781]
60981A5771781k061425j873355j645374j417011j208732j027726q70394p30366
60973D937398o06046m99194m09653l35256k75066k28846j94081j66692j44459
60964B078105j27318j14489j03804r3901q4934p6797o8563o0029n2218m5986m1413
60953A208653l8665l8019l8735l9246l8890l8275l7784l6902l5335l3534l1661
60942H01607k9167k5910k2762k0470j8635j6391j3538j0520p810n643m075k973
60930F23713k196j880k118k533k651k589k804l225l306k939k593k540k533k436
60916E87370k468k764l219l880m887n961o501o299n714n139m787m813n073m932
60902E20933m003k964k834l451l681l142k706l019l548l551l122k709k315j837
$$ y = [15771781, 13710356, 11837001, 10191627, 8774616, 7565884, 6538158, 5667764, 4937398, 4331352, 3832158, 3422505, 3087249, 2812183, 2583337, 2389256, 2222564, 2078105, 1950787, 1836298, 1732494, 1638593, 1553659, 1476862, 1408299, 1348270, 1296052, 1250066, 1208653, 1169988, 1131969, 1093234, 1053988, 1015098, 976823, 939039, 902137, 866802, 833268, 801607, 772440, 746530, 723768, 703298, 684663, 668272, 654734, 644214, 636404, 630761, 626686, 623713, 621517, 619637, 617519, 614986, 612335, 609746, 606942, 603717, 600411, 597472, 594879, 592339, 589806, 587370, 584902, 582138, 578919, 575039, 570152, 564191, 557690, 551391, 545677, 540538, 535751, 530938, 525865, 520933, 516930, 513966, 511132, 507681, 504000, 500858, 498152, 495133, 491585, 488034, 484912, 482203, 479888, 478051]
60888D78051j622k033k800l374l574l480l011k103j063k73L13J002J837K524K785
60873D63179K599K223K110K569L375L903L778L275K943L083L548L862L449K056
60859E05952R0j601k403k245j322R9J561K423K197Q54j161l227m922o211p129
60844D82955p355o619n597n620o978q210p899o561n787n956o017n328m380l597
60830C97051k620j277k07j2m67j041j496j709j563j354j584k007j725n33O01Q65
60814C80922N90L72J60j80j97M53J298J812K282L019L449K879J771J197J349J543
60798D02719J457J422J520J344P55J24k58m15l45p8j1n39j293j448q65l16m53
60781D03320j129j854k313k258j571o63l05p40j376j674j826k181k453k078j181
$$ y = [478051, 476429, 474396, 471596, 468222, 464648, 461168, 458157, 456054, 454991, 454718, 455031, 456033, 457870, 460394, 463179, 465778, 468001, 470111, 472680, 476055, 479958, 483736, 487011, 489954, 493037, 496585, 500447, 503896, 505952, 506042, 504441, 502038, 499793, 498471, 498570, 500131, 502554, 504751, 505605, 504444, 501217, 496295, 490084, 482955, 475600, 468981, 463384, 457764, 450786, 442576, 434677, 428116, 422329, 416373, 410356, 405028, 400648, 397051, 394431, 393154, 392947, 392935, 392468, 391427, 389931, 388222, 386659, 385305, 383721, 381714, 379989, 379456, 380057, 380922, 381512, 381884, 382044, 381864, 381667, 382120, 383418, 385230, 387512, 390531, 393980, 396859, 398630, 399827, 401176, 402719, 404176, 405598, 407118, 408462, 409217, 409341, 409083, 408668, 408323, 408245, 408234, 407695, 406402, 404954, 404089, 403773, 403320, 402191, 400337, 398024, 395766, 394195, 393532, 393227, 392487, 391111, 389437, 387611, 385430, 382977, 380899, 379718]
60766C79718n43n99r05q18l47k9j17k57n3L74N88M44J38j92n27o49j72Q50J707
60747C78611J698Q31l11j120j278q86n21p64j447j712j232q17j268k061k012j041
60731C64670l61q21j869k491k440k092j663j116o65o85j140j542j585j497j634
60716C43069j951k164k300k730l499l994l662k906k729l362l822l145j672o51
60702C04482p80j652k468k767k491j806j048n41k86J4N68J309K063K707L116L153
60686C03573K748J948J037O25J262K657L667L529K846K772L406L750L259K561
60672C39640K380K494K280J761J416J358J304J208J322J619J755J622J536J674
60658C63369J779J667J665K220L195L944M011L440K421J050m49j577k042k193
$$ y = [379718, 379175, 378576, 377671, 376853, 376506, 376477, 376360, 376103, 376050, 376424, 377012, 377456, 377594, 377402, 376875, 376226, 376054, 376904, 378611, 380309, 381140, 380829, 379709, 378431, 377545, 377024, 376260, 374813, 373101, 371869, 371052, 369784, 367723, 365711, 364670, 364309, 363488, 361619, 359128, 356688, 354596, 352933, 351817, 351152, 350467, 349327, 347785, 346200, 344703, 343069, 341118, 338954, 336654, 333924, 330425, 326431, 322769, 319863, 317134, 313772, 309950, 306805, 305133, 304482, 303702, 302050, 299582, 296815, 294324, 292518, 291470, 290929, 290643, 290657, 291225, 292534, 294597, 297304, 300420, 303573, 306321, 308269, 309306, 309931, 311193, 313850, 317517, 321046, 323892, 326664, 330070, 333820, 337079, 339640, 342020, 344514, 346794, 348555, 349971, 351329, 352633, 353841, 355163, 356782, 358537, 360159, 361695, 363369, 365148, 366815, 368480, 370700, 373895, 377839, 381850, 385290, 387711, 388761, 388312, 386735, 384693, 382500]
60644C82500k663l592m577n274n622n448m439k775j357r17j173j309j054q16q97
60629C40587j129j300j420j483j372j122r37q28n78k93n28j584k924l579l119
60614C18391j948q04j66j00l89p03p28l25L57Q74P58j6q77j137o58K3K67j11q59
60595C11849j688k441k960k897j947l62R65J261P54L87O50J066J109J021J330
60580C08097J922K236K178K108K102J851J372J094J099R20M10J24N53J417K115
60565C29598K478K674K727K564K317K228K341K569K892L327L866M576N504O411
60551C76072O952P188P551Q163Q804R732J1761J5045J8536K1372K4171K8099L3047
60538E76493L7835M1865M5419M8142M8483M5105L8091K8347J6578L487r639k1325
$$ y = [382500, 379837, 376245, 371668, 366394, 360772, 355324, 350885, 348110, 346753, 345836, 344663, 343354, 342300, 341484, 340587, 339458, 338158, 336738, 335255, 333883, 332761, 331824, 330996, 330418, 330125, 329597, 328013, 325089, 321510, 318391, 316443, 315639, 315473, 315373, 314984, 314281, 313553, 313228, 313585, 314459, 315217, 315201, 314324, 313187, 312529, 312552, 312819, 312708, 311849, 310161, 307720, 304760, 301863, 299916, 299554, 300519, 301780, 302534, 302921, 303571, 304637, 305746, 306767, 308097, 310019, 312255, 314433, 316541, 318643, 320494, 321866, 322960, 324059, 324979, 325389, 325513, 326066, 327483, 329598, 332076, 334750, 337477, 340041, 342358, 344586, 346927, 349496, 352388, 355715, 359581, 364157, 369661, 376072, 383024, 390212, 397763, 405926, 414730, 424462, 436223, 451268, 469804, 491176, 515347, 543446, 576493, 614328, 656193, 701612, 749754, 798237, 843342, 881433, 909780, 926358, 929845, 920206, 898881]
60526H98881l0697l7494m1547m2736m1335l7954l3312k8288k3868k0531j7795
60515E43324j4746j1037p064l377k82K123M072O260R367J3269J7110K0433K3855
60502F03307K8373L4128M0117M4867M7179M6317M2097L4992K5973J6061O046l303
60490I66154j0989j6007j7882j6862j3509q162q80Q093J7958K7659L6576M4760
60478A016909N2173N7772N9702N6555M8152L5010J7642k959k4410m3483n7972
60467A215091o7628p3160p4969p3306o9029o3430n7404n1311m5467m0214l5526
60456E63647l1130k7005k3350k0065j6880j3944j1763j0399r316q231p482p227
60444C76855o819n574l788k465k123k306k216j489l53P05J393J813K150K315K120
$$ y = [898881, 868184, 830690, 789143, 746407, 705072, 667118, 633806, 605518, 581650, 561119, 543324, 528578, 517541, 510477, 507100, 506818, 508941, 513013, 519273, 528640, 541909, 559019, 579452, 603307, 631680, 665808, 705925, 750792, 797971, 844288, 886385, 921377, 947350, 963411, 969457, 966154, 955165, 939158, 921276, 904414, 890905, 882743, 881863, 889956, 907914, 935573, 972149, 1016909, 1069082, 1126854, 1186556, 1243111, 1291263, 1326273, 1343915, 1340956, 1316546, 1273063, 1215091, 1147463, 1074303, 999334, 926028, 856999, 793569, 736165, 684854, 639387, 599173, 563647, 532517, 505512, 482162, 462097, 445217, 431273, 419510, 409111, 399795, 391564, 384082, 376855, 370036, 364462, 360674, 358209, 356086, 353780, 351564, 350075, 349722, 350427, 351820, 353633, 355783, 358098, 360218]
60429C60218J792J714J598O11j290k840k946k103j581j632j443o44J92O13Q53
60414C53112J097J105R57J332K474L542L691L232L129L664M360M921N561O431
60400C98608P394Q336R269J0036J0414J0518J0736J1146J1397J1170J0448R302
60388E18774P846O492N770N689N559M771L524K508K044J867J617J274J014Q86
60374E69635Q03P33P25P45O41L12j21m78p73j110j434j551j479j422j354r92l51
60357E62529K1k50p88j000q81p40m44L26J115R42k82j398j491j099j344k490l985
60340E48741n445o702p230o456m794l472l117l178l002k814l138l853m414m693
60326D86433m998n413n665n621n445n224m892m531m319m036l172j759p18q76j830
$$ y = [360218, 362010, 363724, 365322, 365933, 364643, 361803, 358857, 356754, 355173, 353541, 352098, 351454, 351646, 352259, 353112, 354209, 355314, 356271, 357603, 360077, 363619, 367310, 370542, 373671, 377335, 381695, 386616, 392177, 398608, 406002, 414338, 423607, 433643, 444057, 454575, 465311, 476457, 487854, 499024, 509472, 518774, 526620, 533112, 538882, 544571, 550130, 554901, 558425, 560933, 562977, 564844, 566461, 567735, 568749, 569635, 570438, 571171, 571896, 572641, 573282, 573594, 573473, 572995, 572222, 571112, 569678, 568127, 566648, 565226, 563872, 562880, 562529, 562550, 562300, 561512, 560512, 559631, 558891, 558447, 558773, 559888, 560830, 560548, 559150, 557659, 556560, 555216, 552726, 548741, 543296, 536594, 529364, 522908, 518114, 514642, 511525, 508347, 505345, 502531, 499393, 495540, 491126, 486433, 481435, 476022, 470357, 464736, 459291, 454067, 449175, 444644, 440325, 436289, 433117, 431358, 430640, 429764, 427934]
60311D27934k236j270N41K059K794L217M026N341O717P721Q342Q737Q786Q112
60297D90821O584M529K277k59l280o452q984j0395j0848j0684r973q784p510o547
60283D20495n808m903l743k600j617o85K08Q34J108J342J918K914M106N187N883
60268D24639O091O031O080O310O422O206N857N647N562N506N562N755N752N257
60254E06677M575M296M466M524M231M123M789N974O919P364P855Q993J0708J2373
60240E97867J3494J4086J4535J5226J6283J7598J9004K0385K1759K3297K5274
60229G98808K7854L0890L4049L7223M0613M4387M8371N2242N5794N8775O0564
60218A289570O0498N8637N5853N2856M9441M5053L9850L4679K9947K5109J9537
$$ y = [427934, 425698, 424428, 424969, 427028, 429822, 433039, 437065, 442406, 449123, 456844, 465186, 473923, 482709, 490821, 497405, 501934, 504211, 503952, 500672, 494220, 485236, 474841, 463993, 453309, 443336, 434552, 427042, 420495, 414687, 409784, 406041, 403441, 401824, 401139, 401347, 402181, 403289, 404631, 406549, 409463, 413569, 418756, 424639, 430730, 436761, 442841, 449151, 455573, 461779, 467636, 473283, 478845, 484351, 489913, 495668, 501420, 506677, 511252, 515548, 520014, 524538, 528769, 532892, 537681, 543655, 550574, 557938, 565793, 574786, 585494, 597867, 611361, 625447, 639982, 655208, 671491, 689089, 708093, 728478, 750237, 773534, 798808, 826662, 857552, 891601, 928824, 969437, 1013824, 1062195, 1114437, 1170231, 1229006, 1289570, 1350068, 1408705, 1464558, 1517414, 1566855, 1611908, 1651758, 1686437, 1716384, 1741493, 1761030]
60207A761030J3469P663K449k328o589r818j1735j2616j2736j1920r987p286m321
60194A695275j036L062Q063J3431J8608K3511K8250L2783L7057M1219M5360M9194
60182A994777N2201N4039N4527N3406N0452M5873M0198L3713K6223J7599Q262
60171B431270j129j0370j9734k9261l8315m5917n1431n4835n6585n7204n6843
60160B009646n5078n1386m5977l9870l3911k7931k1283j4027p022q19M943J0795
60148A728080J6522K1359K4719K6328K5977K3739K0362J6830J3374R305M021k224
60136A928392q700j4913k0599k5250k8106k8708k7249k4351k0613j6228j0878
60125A702797m069M190J3130K1903L0500L9647M9670N9903O9487P8533Q7974R8295
$$ y = [1761030, 1774499, 1782162, 1784611, 1782283, 1775694, 1765876, 1754141, 1741525, 1728789, 1716869, 1706882, 1699596, 1695275, 1694239, 1697301, 1705364, 1718795, 1737403, 1760914, 1789164, 1821947, 1859004, 1900223, 1945583, 1994777, 2046978, 2101017, 2155544, 2208950, 2259402, 2305275, 2345473, 2379186, 2405409, 2423008, 2431270, 2430141, 2419771, 2400037, 2370776, 2332461, 2286544, 2235113, 2180278, 2123693, 2066489, 2009646, 1954568, 1903182, 1857205, 1817335, 1783424, 1755493, 1734210, 1720183, 1713161, 1712342, 1717285, 1728080, 1744602, 1765961, 1790680, 1817008, 1842985, 1866724, 1887086, 1903916, 1917290, 1926595, 1930616, 1928392, 1919692, 1904779, 1884180, 1858930, 1830824, 1802116, 1774867, 1750516, 1729903, 1713675, 1702797, 1698728, 1702918, 1716048, 1737951, 1768451, 1808098, 1857768, 1917671, 1987158, 2065691, 2153665, 2251960]
60113B251960J08842J18529J26875J33968J39623J43063J43483J40614J34630
60104C441587J25780J14336J00612Q4818O7013M7571K7437P522j2157l2195n2403
60093C919921p1179q6745r8739j08084j15374j20151j21874j20922j18057j13324
60083B845472j06248r7020q6740p6241o5300n3491m1343l0004j9937j0598j486
60072B257064P075J4459K0504K5343K8766L0215K9445K6837K3047J8483J3195
60061B494433P094K63o833j3538j9543k5174l0902l6659m1879m6258n0126n3814
60049B177064n6986n8880n9148n8098n6101n3089m8921m3922l8656l3202k7070
60038A642991k0004j2544n405J405Q470J6051K3808L1468L9199M7035N4378O0489
$$ y = [2251960, 2360802, 2479331, 2606206, 2740174, 2879797, 3022860, 3166343, 3306957, 3441587, 3567367, 3681703, 3782315, 3867133, 3934146, 3981717, 4009154, 4016676, 4004519, 3972324, 3919921, 3848742, 3761997, 3663258, 3555174, 3439800, 3319649, 3197775, 3076853, 2958796, 2845472, 2739224, 2642204, 2555464, 2479223, 2413923, 2360432, 2319089, 2289085, 2269148, 2258550, 2257064, 2264139, 2278598, 2299102, 2324445, 2353211, 2383426, 2412871, 2439708, 2462755, 2481238, 2494433, 2501527, 2501790, 2494957, 2481419, 2461876, 2436702, 2405800, 2369141, 2327262, 2281004, 2230878, 2177064, 2120078, 2061198, 2002050, 1943952, 1887851, 1834762, 1785841, 1741919, 1703263, 1670061, 1642991, 1622987, 1610443, 1605038, 1606443, 1614913, 1630964, 1654772, 1686240, 1725439, 1772474, 1826852, 1887341]
60026A887341O5182O8553P0239O9436O5623N8866M9562L8380K6375J4526K937
60015B417020q898k0870l1887m1103m8911n6073o2226o5946o6286o3679n9315
60004A891826n4149m8575m2528l5685k7988k0045j2728o171L74P475J4797K1753
59992A688356K8496L5665M3407N1315N9227O7345P5268Q1573Q4908Q5218Q3369
59981B384147P9701P3556O4414N2977M0745K8689J6806M813p177j8856l0188m1203
59969B648424n1442o0028o6271o9929p0824o8736o4004n7759n1098m4107l6202
59958B008024k7312j8161r329o64Q133J6804K4819L2077L8880M5314N0983N5312
59946B224880N7877N8635N7978N6395N3889M9975M4591L8618L3057K7953K2702
$$ y = [1887341, 1952523, 2021076, 2091315, 2160751, 2226374, 2285240, 2334802, 2373182, 2399557, 2414083, 2417020, 2408122, 2387252, 2355365, 2314262, 2265351, 2209278, 2147052, 2081106, 2014820, 1951141, 1891826, 1837677, 1789102, 1746574, 1710889, 1682901, 1662856, 1650128, 1643957, 1644331, 1651806, 1666603, 1688356, 1716852, 1752517, 1795924, 1847239, 1906466, 1973811, 2049079, 2130652, 2215560, 2300778, 2384147, 2463848, 2537404, 2601818, 2654795, 2695540, 2724229, 2741035, 2745848, 2738671, 2719815, 2689627, 2648424, 2596982, 2536954, 2470683, 2400754, 2329930, 2261194, 2197190, 2139431, 2088333, 2044226, 2008024, 1980712, 1962551, 1953222, 1952558, 1960691, 1977495, 2002314, 2034391, 2073271, 2118585, 2169568, 2224880, 2282757, 2341392, 2399370, 2455765, 2509654, 2559629, 2604220, 2642838, 2675895, 2703848, 2726550]
59935B726550J7256J2242P978M151P55j425j573M47M492J0634J8692K7846L7374
59922B865419M7457N8664P0806Q2999R4649J05639J15460J22931J27042J27614
59912C818680J24783J18155J06944R0790P0250M6555K1081m911l0212n3583p3992
59901D234540r0919j04187j13416j18000j17859j13938j07558r9514r0184q0168
59891C198797p0106n9963m9258l8116k7343j7216o925M218J5671K6399L6236M5715
59879C058109N4782O2679O9108P4608P9332Q2269Q2292P9410P4189O6296N4594
59868C837668L8808K0190J90k0729m2266o2963q0654r4134j03518j09031j10357
59857C273204j07513j01558r3882q5251p6004o6615n7589m9228m1989l6655l3433
$$ y = [2726550, 2743806, 2756048, 2764026, 2768177, 2768932, 2767507, 2765934, 2766381, 2770873, 2781507, 2800199, 2828045, 2865419, 2912876, 2971540, 3042346, 3125345, 3219994, 3325633, 3441093, 3564024, 3691066, 3818680, 3943463, 4061618, 4168562, 4259352, 4329602, 4376157, 4397238, 4392327, 4362115, 4308532, 4234540, 4143621, 4039434, 3926018, 3808018, 3690159, 3576221, 3468663, 3369149, 3278965, 3198797, 3128691, 3068728, 3019470, 2981354, 2954011, 2936795, 2929870, 2934088, 2949759, 2976158, 3012394, 3058109, 3112891, 3175570, 3244678, 3319286, 3398618, 3480887, 3563179, 3642589, 3716778, 3783074, 3837668, 3876476, 3896666, 3896856, 3876127, 3833861, 3770898, 3690244, 3596110, 3492592, 3383561, 3273204, 3165691, 3064133, 2970251, 2885000, 2808996, 2742381, 2684792, 2635564, 2593575, 2556920, 2523487]
59846B523487l1214k8431k4467j9630j4088p718r66N049R541J2538J4357J5398
59834B453856J6566J9044K3136K7856L2008L5138L7161L7629L5922L1751K5209
59823B775276J6667O938k889j2106k0498k7580l2445l4785l5518l5821l5999l5874
59811B525366l5691l5907l6395l6678l6734l6827l6730l5897l4347l2665l1071
59800B136424k9241k7117k5221k3957k3185k2700k2570k2732k2704k2058k0839
59789A874100j9201j6873j3332q387k375M169J0944J8087K5979L4812M4410N4517
59777B006850O5079P6057Q7240R8584J10523J23421J36592J48093J55232J54997
59767C162668J44306J21105Q5856M1957n351n0357q7822j14103j28439j32859
$$ y = [2523487, 2492273, 2463842, 2439375, 2419745, 2405657, 2397939, 2396973, 2402022, 2411563, 2424101, 2438458, 2453856, 2470422, 2489466, 2512602, 2540458, 2572466, 2607604, 2644765, 2682394, 2718316, 2750067, 2775276, 2791943, 2798881, 2795992, 2783886, 2763388, 2735808, 2703363, 2668578, 2633060, 2597239, 2561240, 2525366, 2489675, 2453768, 2417373, 2380695, 2343961, 2307134, 2270404, 2234507, 2200160, 2167495, 2136424, 2107183, 2080066, 2054845, 2030888, 2007703, 1985003, 1962433, 1939701, 1916997, 1894939, 1874100, 1854899, 1838026, 1824694, 1816307, 1813932, 1818101, 1829045, 1847132, 1873111, 1907923, 1952333, 2006850, 2071929, 2147986, 2235226, 2333810, 2444333, 2567754, 2704346, 2852439, 3007671, 3162668, 3306974, 3428079, 3513935, 3555892, 3550541, 3500184, 3412362, 3298259, 3169820, 3036961]
59757C036961j30254j22539j10816r6662q2231o8991n6972m5621l5006k5792j8276
59746B243801j1977o365j494K491O211J0751J6386K2242K7557L2772L8841M5886
59734B427102N3213O0347O7369P4367Q1473Q9401R9053J10290J21891J33118J44705
59723C462329J57791J72444J87788K03118K18221K32744K45753K55901K61827
59714E397916K62583K58000K48556K34891K17722J98245J78179J59179J42519
59705G297790J29309J20187J14435J10053J05390J00260R5038Q9371Q2447P4090
59695H318370O4668N4246M2673L0327J8047O384m312j3298j9696k3270k4231k2394
59683H427514j7267q884K389J6718L4486N4980P6543R8287J20640J43785J66669
$$ y = [3036961, 2906707, 2784168, 2673352, 2576690, 2494459, 2425468, 2368496, 2322875, 2287869, 2262077, 2243801, 2231824, 2225459, 2223965, 2226456, 2232667, 2243418, 2259804, 2282046, 2309603, 2342375, 2381216, 2427102, 2480315, 2540662, 2608031, 2682398, 2763871, 2853272, 2952325, 3062615, 3184506, 3317624, 3462329, 3620120, 3792564, 3980352, 4183470, 4401691, 4634435, 4880188, 5136089, 5397916, 5660499, 5918499, 6167055, 6401946, 6619668, 6817913, 6996092, 7155271, 7297790, 7427099, 7547286, 7661721, 7771774, 7877164, 7977424, 8072462, 8161833, 8244280, 8318370, 8383038, 8437284, 8479957, 8510284, 8528331, 8534715, 8530403, 8517105, 8497409, 8474139, 8449908, 8427514, 8410247, 8401363, 8403752, 8420470, 8454956, 8509936, 8586479, 8684766, 8805406, 8949191, 9115860]
59672I115860J88154K08112K26472K41908K52453K56797K54143K43328K23259
59663A1210486J93905J55966J09748N5459n297o9133j32033j90369k41040k81805
59653A0805887l11916l31681l41190l40109l28993l10139k86719k61745k38392
59644H055003k20624k12464k16285k31704k55601k82807l07366l24376l31433
59635E672343l28679l17781l00984k80680k59002k37321k16085j95234j74809
59626C361768j55331j37655j22384j09324r7629q6506p5768o5735n6842m9414
59616B405180m3541l8998l5414l2578l0443k8802k7305k5922k4951k4355k3523
59605B069348k2119k0804k0620k1741k3353k4631k5370k5651k5410k4547k3162
$$ y = [9115860, 9304014, 9512126, 9738598, 9980506, 10232959, 10489756, 10743899, 10987227, 11210486, 11404391, 11560357, 11670105, 11725564, 11720267, 11651134, 11519101, 11328732, 11087692, 10805887, 10493971, 10162290, 9821100, 9480991, 9151998, 8841859, 8555140, 8293395, 8055003, 7834379, 7621915, 7405630, 7173926, 6918325, 6635518, 6328152, 6003776, 5672343, 5343664, 5025883, 4724899, 4444219, 4185217, 3947896, 3731811, 3536577, 3361768, 3206437, 3068782, 2946398, 2837074, 2739445, 2652939, 2577171, 2511436, 2454594, 2405180, 2361639, 2322641, 2287227, 2254649, 2224206, 2195404, 2168099, 2142177, 2117226, 2092871, 2069348, 2047229, 2026425, 2005805, 1984064, 1960711, 1936080, 1910710, 1885059, 1859649, 1835102, 1811940]
59594A811940k1591k0338j9908k0258k0557j9928j8524j7428j7272j7425j6765
59583A601946j4890j2317r776p618n719l675j239J339L567N395P288R469J1552
59570A585322J3200J4791J6815J9047K0906K2500K4598K7467L0439L2930L5301
59559A843316L8220M1596M4761M7539N0528N4092N7684O0571O2984O5986P0122
59548B437399P4684P8638Q1930Q5444Q9569R3173R4000Q9958Q0324O6409N1277
59537C322805L8114K8148K0104J1896K645p040j6310k4853l2672l9761m6227n2263
59525C204586n7786o2332o5506o7257o7625o6454o3541n8939n2950m5927l8142
59514B558127k9711k0566j0597K25J1911K4548L7971N1508O4385P6475Q8250R9773
$$ y = [1811940, 1790349, 1770011, 1750103, 1729845, 1709288, 1689360, 1670836, 1653408, 1636136, 1618711, 1601946, 1587056, 1574739, 1564963, 1557345, 1551626, 1547951, 1546712, 1548051, 1551618, 1557013, 1564301, 1573770, 1585322, 1598522, 1613313, 1630128, 1649175, 1670081, 1692581, 1717179, 1744646, 1775085, 1808015, 1843316, 1881536, 1923132, 1967893, 2015432, 2065960, 2120052, 2177736, 2238307, 2301291, 2367277, 2437399, 2512083, 2590721, 2672651, 2758095, 2847664, 2940837, 3034837, 3124795, 3205119, 3271528, 3322805, 3360919, 3389067, 3409171, 3421067, 3423712, 3416672, 3400362, 3375509, 3342837, 3303076, 3256849, 3204586, 3146800, 3084468, 3018962, 2951705, 2884080, 2817626, 2754085, 2695146, 2642196, 2596269, 2558127, 2528416, 2507850, 2497253, 2497478, 2509389, 2533937, 2571908, 2623416, 2687801, 2764276, 2852526, 2952299]
59502B952299J10071J17730J21837J22110J18264J09678R5849P7072N4640L0282
59492C909832N322j9618m4006o6684q6100j01251j12065j18830j21675j20713
59482C124212j16269j08658r8176q5660p2583o0102m8200l6238k4143j2490j585
59471B460108Q745J8378K6622L3069L8139M2270M4953M5115M2321L7109L0179
59460B827008K1804J2102J433r811k1546l3784m6110n7646o7517p5223q0604q3723
59448B386383q4984q5135q4857q4242q2814q0113p6188p1576o6882o2459n8340
59437A548793n4288m9996m5424m1008l7330l4437l1587k7958k3601j9478j6439
59426A167247j4316j2143r126n119l66M854J0257J5404J9501K1153J8711J1697
$$ y = [2952299, 3062370, 3180100, 3301937, 3424047, 3542311, 3651989, 3747838, 3824910, 3879550, 3909832, 3915154, 3895536, 3851530, 3784846, 3698746, 3597495, 3485430, 3366600, 3244925, 3124212, 3007943, 2899285, 2801109, 2715449, 2642866, 2582764, 2534564, 2498326, 2474183, 2461693, 2460108, 2468853, 2487231, 2513853, 2546922, 2585061, 2627331, 2672284, 2717399, 2759720, 2796829, 2827008, 2848812, 2860914, 2862347, 2852536, 2830990, 2797206, 2751096, 2693450, 2625933, 2550710, 2470106, 2386383, 2301399, 2216264, 2131407, 2047165, 1964351, 1884238, 1808050, 1736474, 1669592, 1607133, 1548793, 1494505, 1444509, 1399085, 1358077, 1320747, 1286310, 1254723, 1226765, 1203164, 1183686, 1167247, 1152931, 1140788, 1131662, 1126543, 1126177, 1131031, 1141288, 1156692, 1176193, 1197346, 1216057, 1227754]
59414A227754K203n911r834r669p296m009J22N085J0222J4584J7065J6178J0886
59401A267380K303o153j1052j1369q472m335j97L579P178J0902J4797J8639K2353
59388A305553K6149L0096L3942L7549M1087M4576M7781N0936N4897N9995O5249
59377A797810O9386P2194P4210P5558P6136P6715P8667Q2586Q7994R4546J02576
59366B688378J12342J23649J36520J51338J67841J84728K00761K15628K29242
59357D210427K40752K48816K52332K50533K43002K30217K13641J94680J73884
59348F258284J51570J28516J05313Q1610N6904L1713O953j7672m3527p1240r9916
59337F588508j28298j55766j81807k05363k25299k40993k51995k57597k57400
$$ y = [1227754, 1229957, 1224046, 1214212, 1204543, 1197247, 1193238, 1193360, 1198445, 1208667, 1223251, 1240316, 1256494, 1267380, 1269683, 1263530, 1252478, 1241109, 1232637, 1228302, 1228105, 1231684, 1238862, 1249764, 1264561, 1283200, 1305553, 1331702, 1361798, 1395740, 1433289, 1474376, 1518952, 1566733, 1617669, 1672566, 1732561, 1797810, 1867196, 1939390, 2013600, 2089158, 2165294, 2242009, 2320676, 2403262, 2491256, 2585802, 2688378, 2800720, 2924369, 3060889, 3212227, 3380068, 3564796, 3765557, 3981185, 4210427, 4451179, 4699995, 4952327, 5202860, 5445862, 5676079, 5889720, 6084400, 6258284, 6409854, 6538370, 6643683, 6725293, 6782197, 6813910, 6820863, 6803191, 6759664, 6688424, 6588508, 6460210, 6304444, 6122637, 5917274, 5691975, 5450982, 5198987, 4941390, 4683990]
59328D683990k52095k43094k31465k17677k02347j86699j72034j58843j46745
59319B872991j35270j24446j14466j04964r5232q5200p5747o7628o0503n3608
59309A955927m6961m1112l5908l0408k4219j8051j2705q319n151m284o667j1676
59297A710466j7303k1626k3733k3580k1670j8821j5658j2250q548m982k043O06
59285A540858L975Q452J3225J7210K0252K3071K6244K9603L2520L4569L5747L6140
59273A821866L5575L3746L0669K6690K1961J6195R217J437o534j4503k2463k9988
59261A923868l6341m1233m4977m7911n0074n1433n2000n1631n0183m7918m5321
59250A404846m2521l9319l5915l2863l0190k7149k3315j9340j6157j3845j1855
$$ y = [4683990, 4431895, 4188801, 3957336, 3739659, 3537312, 3350613, 3178579, 3019736, 2872991, 2737721, 2613275, 2498809, 2393845, 2298613, 2213413, 2137666, 2070038, 2009535, 1955927, 1908966, 1867854, 1831946, 1801538, 1777319, 1759268, 1746563, 1738244, 1733093, 1728809, 1722142, 1710466, 1693163, 1671537, 1647804, 1624224, 1602554, 1583733, 1568075, 1555825, 1547277, 1542295, 1540252, 1540858, 1544833, 1553285, 1566510, 1583720, 1603972, 1627043, 1653287, 1682890, 1715410, 1749979, 1785726, 1821866, 1857441, 1891187, 1921856, 1948546, 1970507, 1986702, 1995919, 1997356, 1990822, 1976319, 1953856, 1923868, 1887527, 1846294, 1801317, 1753406, 1703332, 1651899, 1599899, 1548268, 1498085, 1450167, 1404846, 1362325, 1323006, 1287091, 1254228, 1224038, 1196889, 1173574, 1154234, 1138077, 1124232, 1112377]
59239A112377r914q112o269l941j098J691L886N453O781Q360J0510J3098J5576
59226A148398J7540J9262K1359K4067K7131L0350L3831L7706M1916M6422N1351
59215A499333N6902O3222P0404P8363Q6797R5494J04655J14624J25305J36033
59205B431132J46010J54533J60888J64361J64439J60708J52461J38825J19428
59196C792785R4753O5797L3731P2l3172o4074r1593j15602j36009j52015j62351
59185C232322j66358j64734j59115j50946j40931j29543j17626j06110r5284q4746
59175A916929p4133o3612n3631m4410l5784k7467j9556j2690p532m012j324J121
59163A573899L127M274M535L835J563k654p939j2766j6585k0082k3820k7430l0282
$$ y = [1112377, 1102463, 1094351, 1088082, 1084141, 1083043, 1084734, 1088620, 1094073, 1100854, 1109214, 1119724, 1132822, 1148398, 1165938, 1185200, 1206559, 1230626, 1257757, 1288107, 1321938, 1359644, 1401560, 1447982, 1499333, 1556235, 1619457, 1689861, 1768224, 1855021, 1950515, 2055170, 2169794, 2295099, 2431132, 2577142, 2731675, 2892563, 3056924, 3221363, 3382071, 3534532, 3673357, 3792785, 3887538, 3953335, 3987066, 3987138, 3953966, 3889892, 3798299, 3682697, 3546688, 3394673, 3232322, 3065964, 2901230, 2742115, 2591169, 2450238, 2320695, 2203069, 2096959, 2001675, 1916929, 1842796, 1779184, 1725553, 1681143, 1645359, 1617892, 1598336, 1585646, 1578114, 1574102, 1572778, 1573899, 1577026, 1581300, 1585835, 1589670, 1591233, 1588579, 1580640, 1567874, 1551289, 1531207, 1507387, 1479957, 1449675]
59150A449675l2075l2563l1514k9438k7566k6611k6063k5103k3601k1763j9542
59139A153836j7024j4758j3025j1293r095o898n266l689j297J522L323L501L013
59126A082850L054L790M626N074N029M676M401M450M583M416M035L857L954M080
59112A142875M258M676M999M564L360K174J525J238J238J946L377M655N066N015
59098A190966N285N899O438P078Q431J0508J2680J4612J6571J8734K0810K2487
59086A340499K3802K4933K5985K7066K8166K8924K8866K7895K6192K3597J9689
59075A625614J4552R046L978o20n213j0171j5609k1410k6966l1314l3972l5476
59063A472439l6649l7545l7575l6497l4750l2893l1202k9842k8860k7930k6608
$$ y = [1449675, 1417600, 1385037, 1353523, 1324085, 1296519, 1269908, 1243845, 1218742, 1195141, 1173378, 1153836, 1136812, 1122054, 1109029, 1097736, 1088641, 1081743, 1076477, 1072788, 1071491, 1073013, 1076336, 1079837, 1082850, 1085904, 1089694, 1094320, 1099394, 1104423, 1109099, 1113500, 1117950, 1122533, 1126949, 1130984, 1134841, 1138795, 1142875, 1147133, 1151809, 1156808, 1161372, 1164732, 1166906, 1168431, 1169669, 1170907, 1172853, 1176230, 1180885, 1185951, 1190966, 1196251, 1202150, 1208588, 1215666, 1224097, 1234605, 1247285, 1261897, 1278468, 1297202, 1318012, 1340499, 1364301, 1389234, 1415219, 1442285, 1470451, 1499375, 1528241, 1556136, 1582328, 1605925, 1625614, 1640166, 1649212, 1653190, 1652570, 1647357, 1637186, 1621577, 1600167, 1573201, 1541887, 1507915, 1472439, 1435790, 1398245, 1360670, 1324173, 1289423, 1256530, 1225328, 1195486, 1166626, 1138696, 1112088]
59052A112088k5007k3672k2636k1222j9227j7565j7135j7473j7343j6356j5172
59041H99280j4217j3128j1592r899q365o852n266l921l019k306j714j750k731
59028H14520m013m652m479l906l045j793n48Lq0K9P49J519J731J709K291L740
59012H03775N371O166N690M521L807M174N138N844O237O982Q327R720J0759J1838
58998H98349J3451J5439J7470J9745K2595K5582K7837K9269L0837L3292L6137
58987A170003L8104L8451L7472L5848L3819L1041K7012K1511J4715P238J01n668
58975A449647r813j3177j6805k0661k3636k4929k5064k5125k5346k4972k3430
58964A216689k1113j8831j6861j4863j2548j0178q294p131o401n600m463l095
$$ y = [1112088, 1087081, 1063409, 1040773, 1019551, 1000324, 982759, 965624, 948151, 930808, 914452, 899280, 885063, 871935, 860343, 850444, 842079, 835227, 829961, 826040, 823021, 820715, 819001, 817251, 814520, 810507, 805855, 801376, 797470, 794425, 792632, 792084, 792087, 792007, 792036, 792785, 794304, 796035, 797744, 800035, 803775, 809146, 815312, 821002, 825523, 829330, 833504, 838642, 844486, 850723, 857705, 866032, 875752, 886511, 898349, 911800, 927239, 944709, 964454, 987049, 1012631, 1040468, 1069737, 1100574, 1133866, 1170003, 1208107, 1246558, 1284030, 1319878, 1353697, 1384738, 1411750, 1433261, 1447976, 1455214, 1455315, 1449647, 1439834, 1426657, 1409852, 1389191, 1365555, 1340626, 1315562, 1290437, 1265091, 1240119, 1216689, 1195576, 1176745, 1159884, 1145021, 1132473, 1122295, 1114001, 1106870, 1100469, 1094869, 1090406, 1087311]
58952A087311j772p00J00P47J396K108K881L845N244P095Q998J0580J2004J3726
58938A153563J5661J7097J7654J7949J8969K0916K3092K4888K6492K8562L1451
58927A396294L5024L9102M3837M9465N5691O1499O5740O7883O7931O5744O0923
58916B009133N3742M5740L8873L4082L1203L0122L1305L4883L9951M5467N1487
58905B445988N8755O7120P5269Q2327Q8964R6338J04490J12526J20136J27987
58895C379900J36610J45611J54292J62342J69476J74805J77095J75396J69209
58886D844736J58426J43598J26083J07435Q8730P0580N3317L6716J9912K263j5857
58875E635939l3687n1174o8677q5720j00950j13602j24158j33319j40993j46741
$$ y = [1087311, 1085539, 1084839, 1084939, 1085686, 1087082, 1089190, 1092071, 1095916, 1101160, 1108255, 1117253, 1127833, 1139837, 1153563, 1169224, 1186321, 1203975, 1221924, 1240893, 1261809, 1284901, 1309789, 1336281, 1364843, 1396294, 1431318, 1470420, 1514257, 1563722, 1619413, 1680912, 1746652, 1814535, 1882466, 1948210, 2009133, 2062875, 2108615, 2147488, 2181570, 2212773, 2242895, 2274200, 2309083, 2349034, 2394501, 2445988, 2504743, 2571863, 2647132, 2729459, 2818423, 2914761, 3019251, 3131777, 3251913, 3379900, 3516510, 3662121, 3816413, 3978755, 4148231, 4323036, 4500131, 4675527, 4844736, 5003162, 5146760, 5272843, 5380278, 5469008, 5539588, 5592905, 5629621, 5649533, 5651796, 5635939, 5602252, 5551078, 5482401, 5396681, 5295731, 5182129, 5057971, 4924652, 4783659, 4636918]
58865D636918j50567j52701j53052j51487j48483j44878j41124j37113j32684
58856C324829j27936j23009j17853j12243j05957r9103r2265q6131q0759p5517
58846B304056o9866o3969n8351n3252m8545m4064l9634l5036l0266k5717k1847
58835A813509j8671j5829j2971r970o890l982j536N06K603N100P892J0816J4015
58822A784592J7501K0697K3010K4741K6827K9552L2066L3426L3762L4115L5311
58811B095600L7284L9428M1432M3640M6626N0625N5500O1211O7923P5423Q2883
58800B697575Q9637R6040J03095J11215J19854J28336J36442J43881J49815J53543
58790C929433J55408J56331J56394J54451J49420J41355J30933J18281J02970
$$ y = [4636918, 4486351, 4333650, 4180598, 4029111, 3880628, 3735750, 3594626, 3457513, 3324829, 3196893, 3073884, 2956031, 2843788, 2737831, 2638728, 2546463, 2460332, 2379573, 2304056, 2234190, 2170221, 2111870, 2058618, 2010073, 1966009, 1926375, 1891339, 1861073, 1835356, 1813509, 1794838, 1779009, 1766038, 1756068, 1749178, 1745196, 1743660, 1744166, 1746769, 1751869, 1759761, 1770577, 1784592, 1802093, 1822790, 1845800, 1870541, 1897368, 1926920, 1958986, 1992412, 2026174, 2060289, 2095600, 2132884, 2172312, 2213744, 2257384, 2304010, 2354635, 2410135, 2471346, 2539269, 2614692, 2697575, 2787212, 2883252, 2986347, 3097562, 3217416, 3345752, 3482194, 3626075, 3775890, 3929433, 4084841, 4241172, 4397566, 4552017, 4701437, 4842792, 4973725, 5092006, 5194976]
58781E194976Q4960O4836M3088J9781m817k9901n4790p9354j03257j25205j43636
58770D866681j57885j68080j74254j76406j75311j72408j68594j63748j57594
58761C352401j50332j42321j33836j25392j17580j10298j02865r5286q8591q3366
58751B202534p8718p3437o7579o1971n6704n1078m4958l9211l4716l1632k9615
58740A632915k8088k6290k3763k1039j9197j8483j7834j6024j2873r138n557k264
58728A432365J091M990R613J4566J8930K1689K2016J9340J3426M588o212j7513
58716A538889k7746l5765m1303m4874m7115m8261m8238m7059m4983m2424l9745
58705A071376l6928l3459k8884k3617j8778j4982j1692q030l770P77N403R853
$$ y = [5194976, 5279936, 5344772, 5387860, 5407641, 5402824, 5372923, 5318133, 5238779, 5135522, 5010317, 4866681, 4708796, 4540716, 4366462, 4190056, 4014745, 3842337, 3673743, 3509995, 3352401, 3202069, 3059748, 2925912, 2800520, 2682940, 2572642, 2469777, 2374491, 2285900, 2202534, 2123816, 2050379, 1982800, 1920829, 1864125, 1813047, 1768089, 1728878, 1694162, 1662530, 1632915, 1604827, 1578537, 1554774, 1533735, 1514538, 1496055, 1478221, 1462197, 1449324, 1440186, 1434629, 1432365, 1433456, 1438446, 1448059, 1462625, 1481555, 1503244, 1525260, 1544600, 1558026, 1562614, 1556402, 1538889, 1511143, 1475378, 1434075, 1389201, 1342086, 1293825, 1245587, 1198528, 1153545, 1111121, 1071376, 1034448, 1000989, 972105, 948488, 929710, 914728, 903036, 895006, 891236, 892013, 897416, 907269]
58693I07269J3385J4993J4116J0763N252j791r380j6553k2755k7579l0525l1310
58681H25885l0134k7311k3100j8196j3778j0448p642m720j980J81K415N553R049
58668G05774J1594J3045J4310J5363J4812J1859P367K535k362p235j1332j4034
58656G61696j5756j7232j8446j8966j8851j8438j7644j6147j4038j1782r734q059
58644E76603o838n883m777l434k275j481n81P94K151K725K549K338K533K968L348
58629E70740L529L384K885K412K567L548M846N694N782N549N713O493P417Q070
58615F38629Q736R974J1749J3529J5068J6490J7673J8340J8838J9986K1903K3808
58603H34723K5316K7057K9483L1971L3887L5758L8420M1446M3526M4232M4424
$$ y = [907269, 920654, 935647, 949763, 960526, 965778, 963987, 954607, 938054, 915299, 887720, 857195, 825885, 795751, 768440, 745340, 727144, 713366, 702918, 695276, 690556, 688576, 688757, 691172, 696725, 705774, 717368, 730413, 744723, 760086, 774898, 786757, 794124, 796659, 794297, 787062, 775730, 761696, 745940, 728708, 710262, 691296, 672445, 654007, 636363, 620216, 606178, 594396, 584662, 576603, 569765, 563882, 559105, 555671, 553396, 551915, 551334, 552128, 554279, 557004, 559553, 561891, 564424, 567392, 570740, 574269, 577653, 580538, 582950, 585517, 589065, 593911, 599605, 605387, 610936, 616649, 623142, 630559, 638629, 647365, 657339, 669088, 682617, 697685, 714175, 731848, 750188, 769026, 789012, 810915, 834723, 860039, 887096, 916579, 948550, 982437, 1018195, 1056615, 1098061, 1141587, 1185819, 1230243]
58592A230243M4880M5305M4877M3147M0184L6183L1177K4971J7435R003O36p004
58580A561037j4018k0609k6346l0598l3382l5139l5880l5284l3598l1663k9961
58569A234559k8248k6310k4457k3008k1746k0358j9037j8226j7889j7406j6244
58558A001630j4573j3122j2476j2540j2720j2614j2378j2486j3220j4485j5870
58547H55146j6783j6746j5778j4399j3152j2323j2109j2704j3898j4984j5375
58536F96895j5245j5131j5213j5316j5426j5628j5551j4522j2464j0273q920q442
58524E34764q071p287o317n602n082m370l449k775k465j905n30J272K491K670
58510D93344K242J860J915K616L896N105N525N397N764O935P877P646O853O905
$$ y = [1230243, 1275123, 1320428, 1365305, 1408452, 1448636, 1484819, 1515996, 1540967, 1558402, 1567405, 1568041, 1561037, 1547019, 1526410, 1500064, 1469466, 1436084, 1400945, 1365065, 1329781, 1296183, 1264520, 1234559, 1206311, 1180001, 1155544, 1132536, 1110790, 1090432, 1071395, 1053169, 1035280, 1017874, 1001630, 987057, 973935, 961459, 948919, 936199, 923585, 911207, 898721, 885501, 871016, 855146, 838363, 821617, 805839, 791440, 778288, 765965, 753856, 741152, 727254, 712270, 696895, 681650, 666519, 651306, 635990, 620564, 604936, 589385, 574863, 562399, 552126, 543206, 534764, 526693, 519406, 513089, 507487, 502405, 498035, 494586, 491811, 489346, 487441, 486911, 488183, 490674, 493344, 495586, 497446, 499361, 501977, 505873, 510978, 516503, 521900, 527664, 534599, 542476, 550122, 556975, 563880]
58496E63880Q137R415R508Q270O432M759L475K343J135np94j332j966k705l232
58481F07320l573m115m795n034m842n166o529q013q406p719o847o247n917o157
58467E23960p207q263q068o517m801l812l374l103l129l522l869l910l987m413
58453D55985m847m767m140l323k612k227k317k599k333j095O23J966K740L483
58439D34537M540N488N688N217M912N459O531P114O629N520M629M213L813L015
58425E07305J986J244R66P41R2p78j045l17P60J346J563K145L066L497L251L286
58409E29108M222N261N321M623M293M802N632O119N979N239M378M188M829N313
58395E99307M754L687L299L644L782L545L829M957N945N979N592N642N851N265
$$ y = [563880, 572017, 581432, 590940, 599210, 605642, 610401, 613876, 616219, 617354, 617349, 616555, 615223, 613257, 610552, 607320, 603747, 599632, 594837, 589803, 584961, 579795, 573266, 565253, 556847, 549128, 542281, 536034, 530117, 523960, 516753, 508490, 500422, 493905, 489104, 485292, 481918, 478815, 475686, 472164, 468295, 464385, 460398, 455985, 451138, 446371, 442231, 438908, 436296, 434069, 431752, 429153, 426820, 425725, 426348, 428314, 431054, 434537, 439077, 444565, 450253, 455470, 460382, 465841, 472372, 479486, 486115, 491635, 496264, 500477, 504290, 507305, 509291, 510535, 511501, 512242, 512334, 511556, 510511, 510194, 510954, 512300, 513863, 516008, 519074, 522571, 525822, 529108, 533330, 538591, 543912, 548535, 552828, 557630, 563262, 569381, 575360, 580599, 584977, 589165, 593994, 599307, 604061, 607748, 611047, 614691, 618473, 622018, 625847, 630804, 636749, 642728, 648320, 653962, 659813, 665078]
58381F65078L734K065Q14l08j592k502k199o88J025K005K243K262K270K218K371
58366F78796L096M119M757M994N513O475P150P106O846O824O756O555O900Q085
58352G63972R110R060Q466Q309Q319P695O828O867P838Q616Q627Q265P765P027
58338H76764O534P044Q216Q854Q723Q855R770J0635J0663J0249J0205J0771J1787
58325I99070J3016J3976J4283J4357J4978J6045J6732J7011J7798J9269K0332
58314A176867K0334K0185K0908K1995K2121K0874J8982J7179J5590J4031J2452
58303A381518J1131J0474J0509J0708J0743J1067J2118J3302J3740J3810J4803
58292A513923J7046J9481K1255K2551K3675K4472K4993K5678K6507K6977K7163
$$ y = [665078, 668812, 670877, 671691, 671383, 669791, 667289, 665090, 664402, 665427, 667432, 669675, 671937, 674207, 676425, 678796, 681892, 686011, 690768, 695762, 701275, 707750, 714900, 722006, 728852, 735676, 742432, 748987, 755887, 763972, 773082, 782142, 790608, 798917, 807236, 814931, 821759, 828626, 836464, 845080, 853707, 861972, 869737, 876764, 883298, 890342, 898558, 907412, 916135, 924990, 934760, 945395, 956058, 966307, 976512, 987283, 999070, 1012086, 1026062, 1040345, 1054702, 1069680, 1085725, 1102457, 1119468, 1137266, 1156535, 1176867, 1197201, 1217386, 1238294, 1260289, 1282410, 1303284, 1322266, 1339445, 1355035, 1369066, 1381518, 1392649, 1403123, 1413632, 1424340, 1435083, 1446150, 1458268, 1471570, 1485310, 1499120, 1513923, 1530969, 1550450, 1571705, 1594256, 1617931, 1642403, 1667396, 1693074, 1719581, 1746558, 1773721]
58281A773721K7848K9242L0702L1947L3468L5323L6776L7639L8831M1043M3790
58270B160330M6418M9015N1709N3997N5444N6347N7231N8269N9451O0614O1185
58259B770010O0837O0402O1232O3571O6630P0110P4252P8557Q2105Q5270Q9424
58248C562400R4722R9968J04895J10569J17105J23139J28381J34580J42861J52038
58238D770658J60675J69127J78398J88636J99797K12263K25854K39875K54806
58229F600089K72126K91734L11785L31977L54530L80763M09283M39078M71884
58220I863249N09691N52333N99438O52435P12736P80316Q56084R43329J044752
58211A6514363J160582J291736J442135J615631J813926K040740K305890K623024
$$ y = [1773721, 1801569, 1830811, 1861513, 1893460, 1926928, 1962251, 1999027, 2036666, 2075497, 2116540, 2160330, 2206748, 2255763, 2307472, 2361469, 2416913, 2473260, 2530491, 2588760, 2648211, 2708825, 2770010, 2830847, 2891249, 2952481, 3016052, 3082682, 3152792, 3227044, 3305601, 3387706, 3472976, 3562400, 3657122, 3757090, 3861985, 3972554, 4089659, 4212798, 4341179, 4475759, 4618620, 4770658, 4931333, 5100460, 5278858, 5467494, 5667291, 5879554, 6105408, 6345283, 6600089, 6872215, 7163949, 7475734, 7807711, 8162241, 8543004, 8952287, 9391365, 9863249, 10372940, 10925273, 11524711, 12177146, 12889882, 13670198, 14526282, 15469611, 16514363, 17674945, 18966681, 20408816, 22024447, 23838373, 25879113, 28185003, 30808027]
58203C0808027L006772L474796M047481M739243N551908O481819P533274Q723514
58195G4366834J0080919J1646767J3476847J5630645J8148881K1026306K4166307
58188A88543506K7292600K9834127L0877903K9326798K4325164J5808960M828561
58181C50837619o682397j6662112k3742143k7609448k8774272k8063463k6237713
58174A93066071k3860534k1305702j8789463j6413604j4223165j2246629j0500034
58167G5726940q980622p673746o562380n626007m838743m176067l620109l155216
58159C1094050k763807k430799k147678j908283j703966j526040j369603j231824
58151A6012050j109256r99445r02308q17270p41339o72032o09709n54914n05966
$$ y = [30808027, 33814799, 37289595, 41337076, 46076319, 51628227, 58110046, 65643320, 74366834, 84447753, 96094520, 109571367, 125202012, 143350893, 164377199, 188543506, 215836106, 245670233, 276548136, 305874934, 330200098, 346009058, 350837619, 344155222, 327493110, 303750967, 276141519, 247367247, 219303784, 193066071, 169205537, 147899835, 129110372, 112696768, 98473603, 86226974, 75726940, 66746318, 59072572, 52510192, 46884185, 42045442, 37869375, 34249266, 31094050, 28330243, 25899444, 23751766, 21843483, 20139517, 18613477, 17243874, 16012050, 14902794, 13903349, 13001041, 12183771, 11442432, 10770400, 10160691, 9605777, 9099811]
58142I099811m61390m22409l90693l65446l44564l26784l10898k94778k77293
58133E905556k59751k43740k28928k14479k00971j89256j78780j68637j59024
58124D061990j50271j41722j32920j24647j17577j11192j05150j00256r6762r3265
58114B888228q8644q3798p9951p6586p2602o8314o4671o1485n8068n4751n2210
58103B127148n0104m7773m5625m4345m3405m1783l9646l7935l6800l5671l4500
58092A669561l3662l3006l2070l0943k9901k8672k7038k5647k5212k5298k5025
58081A353087k4502k4521k5088k5351k4852k3961k3167k2622k2251k1684k0491
58070A094597j8930j8039j8324j8935j8813j7997j7114j6258j5345j4856j5121
$$ y = [9099811, 8638421, 8216012, 7825319, 7459873, 7115309, 6788525, 6477627, 6182849, 5905556, 5645805, 5402065, 5173137, 4958658, 4757687, 4568431, 4389651, 4221014, 4061990, 3911719, 3769997, 3637077, 3512430, 3394853, 3283661, 3178511, 3078255, 2981493, 2888228, 2799584, 2715786, 2635835, 2559249, 2486647, 2418333, 2353662, 2292177, 2234109, 2179358, 2127148, 2077044, 2029271, 1983646, 1939301, 1895896, 1854113, 1814467, 1776532, 1739732, 1704061, 1669561, 1635899, 1602893, 1570823, 1539880, 1509979, 1481307, 1454269, 1428622, 1403410, 1378112, 1353087, 1328585, 1304064, 1278976, 1253625, 1228773, 1204812, 1181645, 1159023, 1136772, 1115088, 1094597, 1075667, 1057628, 1039304, 1020369, 1001556, 983559, 966445, 950187, 934842, 919986, 904865]
58059I04865j5422j4886j3861j3265j3062j2624j2218j2667j3666j3830j2671
58048G56693j1196j0310r750r051q476q313q096p266o143n550n689n935n645m851
58034F50422m139l986m340m820n283n950o929p871q310q059p207o020n025m726
58020E67757m982n050m559l983l816l735l080j764k62R84J767K041K075K345K927
58005E48665L489M096N341P212Q690R191R591J0863J2415J2989J2741J3062J4550
57992F72895J6393J7863J9200K0848K2806K4998K7474K9942L1919L3528L5327
57981I53193L7236L8391L8402L7863L7308L6341L4268L0899K6345K0458J3016
57970A303720M140n725j5939k5690l4287m1464m6999n0176n0431m8473m5834m3082
$$ y = [904865, 889443, 874557, 860696, 847431, 834369, 821745, 809527, 796860, 783194, 769364, 756693, 745497, 735187, 725437, 716386, 707910, 699597, 691501, 684235, 678092, 672542, 666853, 660918, 655273, 650422, 646283, 642297, 637957, 633137, 627854, 621904, 614975, 607104, 598794, 590735, 583528, 577508, 572483, 567757, 562775, 557725, 553166, 549183, 545367, 541632, 538552, 536788, 536526, 537510, 539277, 541318, 543393, 545738, 548665, 552154, 556250, 561591, 568803, 577493, 586684, 596275, 607138, 619553, 632542, 645283, 658345, 672895, 689288, 707151, 726351, 747199, 770005, 795003, 822477, 852419, 884338, 917866, 953193, 990429, 1028820, 1067222, 1105085, 1142393, 1178734, 1213002, 1243901, 1270246, 1290704, 1303720, 1307860, 1302135, 1286196, 1260506, 1226219, 1184755, 1137756, 1087580, 1037149, 988676, 942842, 899760]
57958H99760l9516l4967l0748k8004k5987k3113j9160j5285j2187r426o633m301
57946F50433k906k085j203l35m5m43r44j013p05m09k94k76k86k26K45J454L155
57929F44117M644N696O960R031J1531J3641J5254J6803J8150J8501J7533J5800
57917G97661J3639J0496N801j3n937j1384j6244k0349k3470k5579k6631k6393
57905F71597k4945k3101k1705k0691j9465j8049j7129j6970j6968j6451j5431
57894D60692j4373j3657j3422j3500j3298j2239j0478q823p733o848n753m702
57882C35866m094l707l004j971j062m12L26J366K473L383M082M628N004N331N785
57867C53994O177N999N116M049L322K830K150J210K50o09j381j946k212k438l004
$$ y = [899760, 860244, 825277, 794529, 766525, 740538, 717425, 698265, 682980, 670793, 661367, 654734, 650433, 647527, 645442, 644239, 643904, 643859, 643416, 642472, 641459, 640754, 640345, 640051, 639775, 639489, 639263, 639508, 640962, 644117, 648761, 654457, 661417, 670448, 681979, 695620, 710874, 727677, 745827, 764328, 781861, 797661, 811300, 821796, 827597, 827584, 821647, 810263, 794019, 773670, 750200, 724621, 697990, 671597, 646652, 623551, 601846, 581155, 561690, 543641, 526512, 509542, 492574, 476123, 460692, 446319, 432662, 419240, 405740, 392442, 380203, 369725, 360902, 353169, 346321, 340568, 335866, 331772, 328065, 325061, 323090, 322028, 321616, 321942, 323308, 325781, 329164, 333246, 337874, 342878, 348209, 353994, 360171, 366170, 371286, 375335, 378657, 381487, 383637, 384847, 385097, 384488, 383107, 381161, 378949, 376511, 373507]
57852C73507l827m448m672m691m549l998l062k276k000j828j100J58J214J508
57838C39936J242R84R45Q81O64O56J239K083K270J394J93l05k1L19L80N49J090
57821C54499J798K778M665P389R396R059O554L571J298k89j241r04J012L476N144
57806D08205O044P450J0145J3519J6552J9107K1793K4789K7371K8629K8280K6593
57794F38477K3775J9781J4647Q606J855n457j2810j9164k3584k5922k6684k6375
57782E67145k5280k3826k2659k2170k2083k1779k0921j9635j8212j6800j5399
57771C38381j4014j2682j1448j0368r498q757p840o474m797l344k557k404k564
57758B41634k745k718k292j547r07o82o91o42n41l92K03J452K632K798K260K348
$$ y = [373507, 369680, 365232, 360560, 355869, 351320, 347322, 344260, 341984, 339984, 338156, 337056, 337214, 338428, 339936, 341178, 342162, 343107, 343988, 344652, 345308, 346547, 348630, 350900, 352294, 352487, 352182, 352161, 352480, 352860, 353409, 354499, 356297, 359075, 363740, 371129, 380525, 389584, 396138, 399709, 401007, 400718, 399477, 398573, 399585, 403061, 408205, 414249, 421699, 431844, 445363, 461915, 481022, 502815, 527604, 554975, 583604, 611884, 638477, 662252, 682033, 696680, 705286, 707141, 701684, 688874, 669710, 646126, 620204, 593520, 567145, 541865, 518039, 495380, 473210, 451127, 429348, 408427, 388792, 370580, 353780, 338381, 324367, 311685, 300237, 289869, 280371, 271614, 263774, 257300, 252503, 249159, 246602, 244198, 241634, 238889, 236171, 233879, 232332, 231425, 230743, 230052, 229410, 228869, 228477, 228680, 230132, 232764, 235562, 237822, 240170]
57742B40170L533M705M848M457M539M993N003M554M471N067N691N662M929L776
57728C06398K492J399O93J66m19q32p44n03q27j769k622k884k650k043j016J53
57712B94992Q70J019J078J305J436J483K011L190M258M502M220M140M386M591
57698C33481M653M717M811N004N679P033Q511R359R653J0167J1346J2910J4437
57685D41761J5900J7573J9828K2964K6885L1008L4878L8834M3611M9340N5471
57674G98053O1796O9100P8516R0579J05051J21203J37427J50195J53679J41632
57664A907231J11304O6607J7213k6415n8086p7098q6008q8193q6787q4117q1130
57653A514521p7715p3846p0024o6488o2799n8679n4637n1214m8093m4610m0791
$$ y = [240170, 243703, 248408, 253256, 257713, 262252, 267245, 272248, 276802, 281273, 286340, 292031, 297693, 302622, 306398, 308890, 310289, 310982, 311148, 310729, 309897, 309153, 308650, 307823, 306054, 303432, 300548, 297898, 295855, 294839, 294992, 295862, 296881, 297959, 299264, 300700, 302183, 304194, 307384, 311642, 316144, 320364, 324504, 328890, 333481, 338134, 342851, 347662, 352666, 358345, 365378, 373889, 383248, 392901, 403068, 414414, 427324, 441761, 457661, 475234, 495062, 518026, 544911, 575919, 610797, 649631, 693242, 742582, 798053, 859849, 928949, 1007465, 1098044, 1203095, 1324298, 1461725, 1611920, 1765599, 1907231, 2018535, 2085142, 2102355, 2075940, 2017854, 1940756, 1854748, 1766555, 1679768, 1595651, 1514521, 1436806, 1362960, 1292936, 1226448, 1163649, 1104970, 1050333, 999119, 951026, 906416, 865625]
57642H65625l7153l3766l0249k6574k3170k0162j7261j4516j2411j1002r597p718
57630F22046n753m198k701o61J700L536M586N528P002Q905J0759J2358J3786J5206
57616F92099J6854J9001K1692K4640K7498K9990L1868L3040L3862L4856L5963
57605A001363L6422L5599L3628L0882K7245K2251J5813Q408P07o670j3273j9093
57593A173282k4560k9903l4589l7866l9681m0575m0780m0065l8562l7098l6324
57582G73279l5966l5217l3622l1231k8311k5276k2644k0671j9096j7550j6075
57571D87620j4942j4114j3291j2418j1705j1095j0141q648p074o019n473m890
57559C67810l942k841j929j290r05q68j178j468j328q39m46k99p8L93Q28R78J099
$$ y = [865625, 828472, 794706, 764457, 737883, 714713, 694551, 677290, 662774, 650363, 639361, 629764, 622046, 616293, 612095, 609394, 608733, 610433, 613969, 618555, 624083, 631085, 639990, 650749, 663107, 676893, 692099, 708953, 727954, 749646, 774286, 801784, 831774, 863642, 896682, 930544, 965400, 1001363, 1037785, 1073384, 1107012, 1137894, 1165139, 1187390, 1203203, 1211611, 1212318, 1205648, 1192375, 1173282, 1148722, 1118819, 1084230, 1046364, 1006683, 966108, 925328, 885263, 846701, 809603, 773279, 737313, 702096, 668474, 637243, 608932, 583656, 561012, 540341, 521245, 503695, 487620, 472678, 458564, 445273, 432855, 421150, 410055, 399914, 391266, 384192, 378173, 372700, 367810, 363868, 361027, 359098, 357808, 356903, 356035, 354857, 353389, 352061, 351222, 350776, 350477, 350399, 350792, 351620, 352598, 353697]
57542C53697J517K025K171K057K281L082L958M391M559N086O368Q272J0358J2074
57528D21896J2910J2763J2229J2310J3612J5817J8024J9632K0788K1976K3355
57517F05312K4748K6097K7576K9170L0466L1005L0651K9513K7766K5617K3109
57506I11030J9837J5282R605L654k118q062j4268j9742k3430k5644k7506k9289
57494H09349l0276l0172k9582k8930k7926k6405k4814k3428k1883j9898j7842
57483E28193j6063j4327j2345j0408q890p671o502n476m596l403j584M37K017
57470D39382L113M098N116O128P269Q630R993J1229J2660J4481J6233J7459J8525
57457E74316K0167K2358K4307K5428K5779K5678K5415K5207K4965K4231K2700
$$ y = [353697, 355214, 357239, 359410, 361467, 363748, 366830, 370788, 375179, 379738, 384824, 391192, 399464, 409822, 421896, 434806, 447569, 459798, 472108, 485720, 501537, 519561, 539193, 559981, 581957, 605312, 630060, 656157, 683733, 712903, 743369, 774374, 805025, 834538, 862304, 887921, 911030, 930867, 946149, 955754, 959408, 957290, 949228, 934960, 915218, 891788, 866144, 838638, 809349, 779073, 748901, 719319, 690389, 662463, 636058, 611244, 587816, 565933, 546035, 528193, 512130, 497803, 485458, 475050, 466160, 458489, 451987, 446511, 441915, 438512, 436928, 437365, 439382, 442495, 446593, 451709, 457837, 465106, 473736, 483729, 494958, 507618, 522099, 538332, 555791, 574316, 594483, 616841, 641148, 666576, 692355, 718033, 743448, 768655, 793620, 817851, 840551]
57446H40551K0495J7549J3264P420R61m926j0164j5330k0259k4153k6903k9148
57434G69357l1035l2000l1937l1441l0766k9604k8091k6908k6009k4462k2083
57423D55021k0037j9054j8210j6450j4307j2952j2280j1304r932r043q926q883
57411B93643q433p843p309o525n366m235l517l191l112l119k875k285k008k750
57397B31075m001m350l387k296k121k372k064j329j019j162r39l2R07J232R96
57382B09138N21l7m71m93j45J78L44O40J178J632J903K399L291L939L646K670
57366B30333J813J386J094Q24P63Q21O24J25l73r24j877l031l564l183k681k835
57350B19315l391l647l502l281k973k434k018k171k546k278j209j92l6p29j694
$$ y = [840551, 861046, 878595, 891859, 899279, 900240, 895314, 885150, 869820, 849561, 825408, 798505, 769357, 738322, 706322, 674385, 642944, 612178, 582574, 554483, 527575, 501566, 477104, 455021, 434984, 415930, 397720, 381270, 366963, 354011, 341731, 330427, 320495, 311452, 302526, 293643, 285210, 277367, 270058, 263533, 258167, 253932, 250415, 247224, 244112, 240993, 238118, 235833, 233825, 231075, 227074, 222724, 219337, 217041, 214920, 212548, 210484, 209155, 208136, 206974, 206035, 206003, 206910, 208142, 209138, 209659, 209622, 209151, 208658, 208513, 208691, 209035, 209675, 210853, 212485, 214388, 216787, 220078, 224017, 227663, 230333, 232146, 233532, 234626, 235450, 236213, 237034, 237658, 237783, 237410, 236486, 234609, 231578, 228014, 224831, 222150, 219315, 215924, 212277, 208775, 205494, 202521, 200087, 198069, 195898, 193352, 191074, 189865, 189673, 189637, 188908, 187214]
57335A87214k285k040r75J52M78L7l45k21M3J41M81J470K709L385L173K355J377
57318A97149O35M62Q75J497K006K488L108L719M057M155M208M246M220M214M351
57303B41390M630N120O014P190Q045Q149P878P931Q438Q967R260R434R509R306
57289C51261Q884Q532Q233P611O582N626N042M386L044J072r31k662m328o083
57275C96269p734r198j0782j2635j4171j4531j3620j2287j1290j0520r437p949
57263B62115o434n146m063l271k954k951k796k317j822j542j328j084r75r53n36
57248B23943M42J229R20l13j286j107m1R97J425J348J221J341J616J767J738J765
57232B37005J984K253K480K765L003K707J669N33K06P63J413J537J282J113J267
$$ y = [187214, 184929, 182889, 181914, 182066, 182544, 182581, 182236, 182015, 182058, 182199, 182680, 184150, 186859, 190244, 193417, 195772, 197149, 197784, 198246, 199121, 200618, 202624, 205112, 208220, 211939, 215996, 220151, 224359, 228605, 232825, 237039, 241390, 246020, 251140, 257154, 264344, 272389, 280538, 288416, 296347, 304785, 313752, 323012, 332446, 341955, 351261, 360145, 368677, 376910, 384521, 391103, 396729, 401771, 406157, 409201, 410273, 409342, 406680, 402352, 396269, 388535, 379337, 368555, 355920, 341749, 327218, 313598, 301311, 290021, 279501, 270064, 262115, 255681, 250535, 246472, 243201, 240247, 237296, 234500, 232183, 230361, 228819, 227491, 226407, 225432, 224479, 223943, 224385, 225614, 226534, 226221, 224935, 223828, 223787, 224784, 226209, 227557, 228778, 230119, 231735, 233502, 235240, 237005, 238989, 241242, 243722, 246487, 249490, 252197, 253866, 254399, 254605, 255368, 256781, 258318, 259600, 260713, 261980]
57217B61980J669K004J797R05k0k0J055K345L057L203L068K565J629Q28R06J832
57201B88803K867L499L822L977L760L036K176J793K141K915L563L708L435L221
57187C32716L467M015M301M063L717L777M105M163L950M147N093O035N967N013
57173C94529M381M888O146P398Q531R807J0987J1520J1417J1317J1525J1603J1156
57160E15205J0544J0498J1250J2408J3490J4290J4813J5156J5459J5769J6007
57149F64889J6157J6473J7273J8579K0118K1635K3062K4332K5293K5961K6789
57138I00561K8347L0726L3412L5991L8759M2291M6435N0182N2885N5228N8575
57127A373392O3406O8935P4155P8817Q3172Q7281R0989R4319R7537J00868J04409
$$ y = [261980, 263649, 265653, 267450, 268355, 268335, 268315, 269370, 271715, 274772, 277975, 281043, 283608, 285237, 286065, 286971, 288803, 291670, 295169, 298991, 302968, 306728, 309764, 311940, 313733, 315874, 318789, 322352, 326060, 329495, 332716, 336183, 340198, 344499, 348562, 352279, 356056, 360161, 364324, 368274, 372421, 377514, 383549, 389516, 394529, 398910, 403798, 409944, 417342, 425873, 435680, 446667, 458187, 469604, 480921, 492446, 504049, 515205, 525749, 536247, 547497, 559905, 573395, 587685, 602498, 617654, 633113, 648882, 664889, 681046, 697519, 714792, 733371, 753489, 775124, 798186, 822518, 847811, 873772, 900561, 928908, 959634, 993046, 1029037, 1067796, 1110087, 1156522, 1206704, 1259589, 1314817, 1373392, 1436798, 1505733, 1579888, 1658705, 1741877, 1829158, 1920147, 2014466, 2112003, 2212871, 2317280]
57116B317280J08282J12667J17696J23407J29844J37091J45370J55155J67073
57107C513865J81576J98909K19554K44485K74754L10976L53593M03702M63347
57098F164761N35011O20941P22775Q41175R75368J123150J281504J447151J616291
57089A5328127J783611J941313K078882K184078K245318K254413K207710K104663
57081C2128115J945281J729274J457855J136453P75734L90335l448l89572p53638
57072C8416389j084006j372643j615356j811276j961647k068227k131895k152432
57064B4218907k129832k066256j967066j840235j694903j540110j384020j233214
57056A0363271j092066r62656q45582p40954o48740n68398m98655m37967l85176
$$ y = [2317280, 2425562, 2538229, 2655925, 2779332, 2909176, 3046267, 3191637, 3346792, 3513865, 3695441, 3894350, 4113904, 4358389, 4633143, 4944119, 5297712, 5701414, 6164761, 6699772, 7320713, 8043488, 8884663, 9860031, 10983181, 12264685, 13711836, 15328127, 17111738, 19053051, 21131933, 23316011, 25561329, 27815742, 30023452, 32128115, 34073396, 35802670, 37260525, 38396978, 39172712, 39563047, 39559599, 39170027, 38416389, 37332383, 35959740, 34344384, 32533108, 30571461, 28503234, 26371339, 24218907, 22089075, 20022819, 18055753, 16215518, 14520615, 12980505, 11596485, 10363271, 9271205, 8308549, 7462967, 6722013, 6073273, 5504875, 5006220, 4568253, 4183077]
57047D183077l39505k99981k65302k34422k07033j83174j62502j44190j27481
57038B219487j12043r7814q4760p2766o1357m9463l5768j9486m86K1093M3965
57027A750602O3347P0392N6694K1415k5985p1104j03205j19446j22644j17133
57017A402933j06817r4970q3776p3880o5048n7206n0452m4539l9172l4663l1495
57006G20915k9282k6932k4045k1322j9428j8172j7160j6448j6079j5553j4496
56995E01998j3313j2568j2083j1297j0148q833p115m720k288q72l79M84K398M294
56981D25558M519K613n50l810o408p980q525q374p913p326o596n596m089k062
56967C63461p9J100J483J990L371N438P631R841J2161J4253J5457J5325J3599
$$ y = [4183077, 3843572, 3543591, 3278289, 3043867, 2836834, 2653660, 2491158, 2346968, 2219487, 2107444, 2009630, 1924870, 1852104, 1790747, 1741284, 1705516, 1686030, 1685544, 1706637, 1750602, 1813949, 1884341, 1941035, 1962450, 1936465, 1865361, 1762156, 1642710, 1520066, 1402933, 1296116, 1201146, 1117370, 1043490, 978442, 921236, 870784, 826245, 787073, 752410, 720915, 691633, 664701, 640656, 619334, 599906, 581734, 564574, 548126, 532047, 516494, 501998, 488685, 476117, 464034, 452737, 442589, 433756, 426641, 421921, 419633, 418761, 418382, 418866, 421264, 425558, 430077, 432690, 432140, 428330, 421922, 413942, 405417, 397043, 389130, 381804, 375208, 369612, 365523, 363461, 363382, 364482, 365965, 367955, 371326, 376764, 384395, 394236, 406397, 420650, 436107, 451432, 465031]
56954D65031J0001M693j251o462j0288j2859j4322j4661j4113j3055j1538r444
56942C71732p129n174l498j395J274L745N454O865Q701J0981J3321J5562J7360
56929D37799J7539J4782R059J855n016j0465j4217j6517j7901j8788j9091j8464
56917C60575j6922j4911j2811j0811r266q561q496q289p487o451n660m940l850
56904B42120k467j301n90j52J49L17N54J245K413L527M040L998L975M520N698
56889B68046P096Q270R191J0138J0986J0944R324O453L319M39k427n357p691q724
56875C20007q468p390n734l598j331O83K552M692P111R323J1067J2773J5213J8794
56861C75694K3145K7115K9225K8470K4824J8923J1430L033n183j1923j6456j8813
$$ y = [465031, 475032, 479725, 478474, 472012, 461724, 448865, 434543, 419882, 405769, 392714, 381176, 371732, 364603, 359429, 355931, 354536, 355810, 359555, 365009, 371874, 380575, 391556, 404877, 420439, 437799, 455338, 470120, 479179, 481034, 476018, 465553, 451336, 434819, 416918, 398130, 379039, 360575, 343653, 328742, 315931, 305120, 295854, 287293, 278797, 270508, 263021, 256570, 250910, 245970, 242120, 239653, 238352, 237762, 237610, 237759, 238076, 238630, 239875, 242288, 245815, 249855, 253853, 257828, 262348, 268046, 275142, 283412, 292603, 302741, 313727, 324671, 333995, 340448, 343767, 344206, 341779, 336422, 328731, 320007, 311539, 304149, 298415, 294817, 293486, 294169, 296721, 301413, 308524, 317847, 328914, 341687, 356900, 375694, 398839, 425954, 455179, 483649, 508473, 527396, 538826, 541859, 536676, 524753, 508297, 489484]
56849D89484j9233j7796j4829j1166p570m076k98L819P878J1667J5507J9867K4809
56836D98063K9962L4938L9554M3384M5027M2278L3591J9647L311j2125k4545l3167
56824G19918l7962l9481l8797l6850l3683k8880k2816j6865j2091q146l928R74
56812D41393O042J0963J6241K2278K8262L2364L3008K9620K2476J2386O97j0878
56800F44852k0806k8086l2223l3213l1762k9053k5948k2585j8942j5426j2454
56789C74354r768o701l036P98M344P481J0226J2582J4597J6142J6526J4781J0486
56776D62812M102l363j0681j6519j9964k1163k1074k0374j9076j7218j5336j3904
56764B88242j2743j1365r647p904o546n878n911o233o301n974n449m744l795l012
$$ y = [489484, 470251, 452455, 437626, 426460, 418890, 414814, 414516, 418335, 426213, 437880, 453387, 473254, 498063, 528025, 562963, 602517, 645901, 690928, 733206, 766797, 786444, 789755, 777630, 753085, 719918, 681956, 642475, 603678, 566828, 533145, 504265, 481449, 464584, 452493, 444347, 440419, 441393, 447435, 458398, 474639, 496917, 525179, 557543, 590551, 620171, 642647, 655033, 655730, 644852, 624046, 595960, 563737, 530524, 498762, 469709, 443761, 421176, 402234, 386808, 374354, 364586, 357885, 354849, 355647, 359991, 367472, 377698, 390280, 404877, 421019, 437545, 452326, 462812, 466914, 463551, 452870, 436351, 416387, 395224, 374150, 353776, 334700, 317482, 302146, 288242, 275499, 264134, 254487, 246583, 240037, 234159, 228248, 222015, 215714, 209740, 204291, 199547, 195752, 192740]
56750A92740l000l507l500k629j802j764j955j517p25m41o72o93k65K30O53J176
56734A72329J624J621J336J242J216Q02K25J53M52K43n55q47N7J408K078J851
56718A85235J164L16m51p29m35j10j59l01j93p8k52m20k38m5l24p27m59N44J536
56699A83874J946J882J657J413J324J599K139K574K727K763K863L004L094L064
56685B15923K853K512K246K117J898J472J133J136J132O21k02o09l44J56N81J073
56669B33698J589J654J200R94J603K351K159J155O02J083J617J058k32q97n14
56654B49120j72r25k307k993k626k201k565l188l007k072j641k479l721l887k710
56639B12626j388j039j540j989j921j544j170r06q66j127j386j085j30Q71J315
$$ y = [192740, 189740, 186233, 182733, 180104, 178302, 176538, 174583, 173066, 172341, 171900, 171228, 170535, 170270, 170500, 171153, 172329, 173953, 175574, 176910, 178152, 179368, 180170, 180395, 180548, 181000, 181243, 180688, 179841, 179898, 181306, 183384, 185235, 186399, 186715, 186264, 185535, 185100, 184990, 184831, 184530, 184337, 184259, 184007, 183587, 183349, 183304, 182980, 182253, 181794, 182338, 183874, 185820, 187702, 189359, 190772, 192096, 193695, 195834, 198408, 201135, 203898, 206761, 209765, 212859, 215923, 218776, 221288, 223534, 225651, 227549, 229021, 230154, 231290, 232422, 233043, 232841, 232232, 231888, 232044, 232625, 233698, 235287, 236941, 238141, 239135, 240738, 243089, 245248, 246403, 247005, 248088, 249705, 250763, 250531, 249634, 249120, 248948, 248023, 245716, 242723, 240097, 237896, 235331, 232143, 229136, 227064, 225423, 222944, 219223, 215336, 212626, 211238, 210199, 208659, 206670, 204749, 203205, 202035, 201129, 200263, 199136, 197750, 196665, 196535, 197406, 198721]
56624A98721J251J092R35N72K4l49k70Q9K51j53r79j547j257l85M4n53j582k065
56606A93839j841j481j345j323j285j184p03M74J973K881K773K104J505J166J037
56591A98590J070J095R57Q89J225J655J478P53M23Q74J210N71n56j102r19o18
56575B07595k96N18J745K506K220J346P58Q43J367J793J722J248R91J474K486
56560B28316L318L508L111K415J776J638K116K668K517J570M42l16p37j111j614
56545B49617k243k813l007k793k737l402m471m968m487l653l182l036k829k555
56531B03441k479k578k577k428k340k351k163j528o58j49m44j313j969j821j073
56516A77570m47l49n89q52j073j236j116n78J17M96L80j1l35l83j05L96Q63R65
$$ y = [198721, 199972, 201064, 201999, 202571, 202595, 202246, 201976, 202065, 202316, 202163, 201184, 199637, 198380, 197995, 198039, 197486, 195904, 193839, 191998, 190517, 189172, 187849, 186564, 185380, 184677, 185151, 187124, 190005, 192778, 194882, 196387, 197553, 198590, 199660, 200755, 201712, 202601, 203826, 205481, 206959, 207712, 208135, 209009, 210219, 210790, 210234, 209132, 208213, 207595, 207299, 207817, 209562, 212068, 214288, 215634, 216392, 217235, 218602, 220395, 222117, 223365, 224356, 225830, 228316, 231634, 235142, 238253, 240668, 242444, 244082, 246198, 248866, 251383, 252953, 253395, 253079, 252342, 251231, 249617, 247374, 244561, 241554, 238761, 236024, 232622, 228151, 223183, 218696, 215043, 211861, 208825, 205996, 203441, 200962, 198384, 195807, 193379, 191039, 188688, 186525, 184997, 184339, 184190, 183746, 182433, 180464, 178643, 177570, 177123, 176774, 176185, 175333, 174260, 173024, 171908, 171330, 171447, 171943, 172323, 172312, 171977, 171594, 171489, 171885, 172748, 173713]
56498A73713N76qk43J35P25Q10J62o53r28o46m12o96j287j531j004M1Q14P44J37
56479A70449j33L12Q77Q56M88O45J615K642K775J875O40m6J89R54J477J354Q84
56462A87853N45L78J89P4K39M33J42n85j012o62Q0N39N69N07N39M88J50k99l49
56443A89818K74J111J260M27n97q60l65J57L26K62j60j244k575k988k025o74j60
56426A81987n15q58o87k54Q7K92M49O04Q12R87Q75M03j23m09n34o65o62l52M3
56407A81480J58K8n2l3l2J28P93J844K699L064L207L398L392K872K023J353J009
56390B07331P00K80R1N26J360J865J561O95j35o30q65r27p62m04j6K75L80J51
56372B11476l88p10k10Q94J556J062q0q00p03k67j2N9K08N27R06J208J372J438
$$ y = [173713, 174289, 174281, 174038, 174173, 174898, 175708, 175870, 175217, 174289, 173643, 173231, 172535, 171248, 169717, 168713, 168754, 169568, 170312, 170449, 170316, 170628, 171505, 172361, 172849, 173494, 175109, 177751, 180526, 182401, 183041, 182995, 183184, 184138, 185615, 186969, 187853, 188398, 188776, 188965, 189039, 189278, 189711, 189853, 189268, 188256, 187594, 187674, 188213, 188782, 189289, 189828, 190316, 190466, 190167, 189818, 190092, 191203, 192463, 192890, 192293, 191433, 191068, 191225, 191551, 191813, 191653, 190409, 187834, 184846, 182821, 182147, 181987, 181472, 180614, 179927, 179673, 179760, 180052, 180501, 181105, 181917, 182904, 183779, 184182, 184059, 183650, 183116, 182451, 181789, 181437, 181480, 181638, 181666, 181614, 181581, 181549, 181677, 182470, 184314, 187013, 190077, 193284, 196682, 200074, 202946, 204969, 206322, 207331, 208031, 208311, 208402, 208928, 210288, 212153, 213714, 214409, 214274, 213644, 212779, 211852, 211090, 210686, 210670, 210945, 211325, 211476, 211088, 210378, 210168, 211062, 212618, 213680, 213600, 212800, 212097, 211830, 211818, 211877, 212085, 212612, 213518, 214726, 216098, 217536]
56354B17536J488J527J446J179Q01M33K02K75Q32J780K664K977K541J624P98O51
56338B38754J348K399L030K906K335J809J598J798K358K868K770J951R70M65N90
56323B67949J104J681K019K068K281L190M557N427N280M633M182L957L768L826
56309C15922M246M448L897L147L244M279N291N554N230M733M248L946L976M082
56295C76243L799L192K795K729K558K156K074K687L568M128M400M851N733O970
56281D27883Q333R462J0052J0267J0682J1625J2904J4365J6184J8359K0427K2179
56269E92722K4183K7075L0667L4334L8053M2404M7616N3243N8877O4650P0862
56258A084686P7450Q4040R0263R5873J00666J04327J06360J06297J04082J00090
$$ y = [217536, 219024, 220551, 221997, 223176, 223977, 224410, 224612, 224887, 225719, 227499, 230163, 233140, 235681, 237305, 238103, 238754, 240102, 242501, 245531, 248437, 250772, 252581, 254179, 255977, 258335, 261203, 263973, 265924, 266894, 267359, 267949, 269053, 270734, 272753, 274821, 277102, 280292, 284849, 290276, 295556, 300189, 304371, 308328, 312096, 315922, 320168, 324616, 328513, 331660, 334904, 339183, 344474, 350028, 355258, 359991, 364239, 368185, 372161, 376243, 380042, 383234, 386029, 388758, 391316, 393472, 395546, 398233, 401801, 405929, 410329, 415180, 420913, 427883, 436216, 445678, 455730, 465997, 476679, 488304, 501208, 515573, 531757, 550116, 570543, 592722, 616905, 643980, 674647, 708981, 747034, 789438, 837054, 890297, 949174, 1013824, 1084686, 1162136, 1246176, 1336439, 1432312, 1532978, 1637305, 1743665, 1849962, 1954044, 2054134]
56248B054134R4462Q6689P6226O3442M9521L5372K1167P046o343j8395k9260l9541
56236B394520m9355n8076o5025p0065p3613p6257p8468q0371q1723q2213q1880
56225A597474q1017p9680p7530p4294p0270o6134o2291n8597n4762n0897m7466
56214H74536m4650m1961l8675l4712l0789k7526k4700k1700j8576j6039j4393
56203E60815j3016j1154q835o647m983l858l189k788k293j526p76l57j02K55M71
56188E02017K00j64J94J277K161K282K151K376K730K732K613L048M082N036N423
56173E38158N539N974O935Q124R182J0055J0916J1778J2402J2755J3301J4545
56161F59664J6336J8092J9639K1395K3754K6747L0339L4481L8977M3875N0029
$$ y = [2054134, 2148596, 2235285, 2311511, 2374953, 2424474, 2459846, 2481013, 2488059, 2481716, 2463321, 2434061, 2394520, 2345165, 2287089, 2222064, 2151999, 2078386, 2002129, 1923661, 1843290, 1761567, 1679354, 1597474, 1516457, 1436777, 1359247, 1284953, 1214683, 1148549, 1086258, 1027661, 972899, 922002, 874536, 829886, 787925, 749250, 714538, 683749, 656223, 631523, 609823, 591247, 575208, 560815, 547799, 536645, 527810, 521163, 516180, 512322, 509133, 506345, 504052, 502526, 501750, 501393, 501291, 501546, 502017, 502217, 502053, 502247, 503524, 505685, 507967, 510118, 512494, 515224, 517956, 520569, 523617, 527699, 532735, 538158, 543697, 549671, 556606, 564730, 573912, 583967, 594883, 606661, 619063, 631818, 645119, 659664, 676000, 694092, 713731, 735126, 758880, 785627, 815966, 850447, 889424, 933299, 983328]
56150I83328N8512O9270Q1128R3257J05615J17494J26582J30246J27096J17003
56140B009531J00839Q1286O3028N0300M4060M2023M0968L8162L1415J9775M790
56129B526177r897k0840k6599k7832k6838k7155l2417m4519o2572q3341j02489
56118B061678j16175j22634j22562j17534j08421r5950q2118o9537n9271n0386
56108A117090m1915l4080k7371k1632j6636j2621r580o831l960j489MR21K128
56095I44028L851N629P008P800Q065Q194Q717R680J0593J1215J1859J2664J3144
56082A062447J2878J2122J1265J0210Q837P537O766O328N766N167N106N812O963
56069A167204Q142R166R974J0548J0971J1419J2078J3047J4237J5372J6323J7271
$$ y = [983328, 1041840, 1111110, 1192238, 1285495, 1391110, 1508604, 1635186, 1765432, 1892528, 2009531, 2110370, 2191656, 2254684, 2304984, 2349044, 2391067, 2432035, 2470197, 2501612, 2521387, 2526177, 2516280, 2495440, 2468841, 2441009, 2414171, 2387016, 2354599, 2310080, 2247508, 2164167, 2061678, 1945503, 1822869, 1700307, 1582773, 1474352, 1378402, 1296284, 1226747, 1167476, 1117090, 1075175, 1041095, 1013724, 992092, 975456, 962835, 953255, 946424, 942464, 940975, 940979, 941900, 944028, 947879, 953508, 960516, 968316, 976381, 984575, 993292, 1002972, 1013565, 1024780, 1036639, 1049303, 1062447, 1075325, 1087447, 1098712, 1108922, 1117759, 1125296, 1132062, 1138390, 1144156, 1149323, 1154429, 1160241, 1167204, 1175346, 1184512, 1194486, 1205034, 1216005, 1227424, 1239502, 1252549, 1266786, 1282158, 1298481, 1315752]
56057A315752J8265J8888J8841J8684J9316K0724K2034K2812K3501K4353K4960
56046A548130K5164K5614K6756K7969K8455K8390K8505K8969K9394K9633K9998
56035A856977L0850L2421L4737L7289L9223M0369M1710M4226M7577N0537N2566
56024B308482N4261N6373N8974O1693O4174O6218O7779O9126P0735P2867P5345
56013C026027P7866Q0560Q4002Q8508R3567R8369J02821J07575J12886J18172
56003C990353J23104J28306J34308J40556J46427J52582J60170J69173J78769
55994E323748J88983K00510K13259K26596K40931K57367K75680K94462L13542
55985G535078L34497L58316L84354M12269M43231M78261N17037N59394O06652
$$ y = [1315752, 1334017, 1352905, 1371746, 1390430, 1409746, 1430470, 1452504, 1475316, 1498817, 1523170, 1548130, 1573294, 1598908, 1625664, 1653633, 1682088, 1710478, 1738983, 1767952, 1797346, 1826979, 1856977, 1887827, 1920248, 1954985, 1992274, 2031497, 2071866, 2113576, 2157802, 2205379, 2255916, 2308482, 2362743, 2419116, 2478090, 2539783, 2603957, 2670175, 2737954, 2807080, 2877815, 2950682, 3026027, 3103893, 3184453, 3268455, 3356963, 3450530, 3548899, 3651720, 3759295, 3872181, 3990353, 4113457, 4241763, 4376071, 4516627, 4663054, 4815636, 4975806, 5144979, 5323748, 5512731, 5713241, 5926500, 6153096, 6394027, 6651394, 6927074, 7221536, 7535078, 7869575, 8227891, 8612245, 9024514, 9467745, 9946006, 10463043, 11022437, 11629089]
55976A1629089O60339P20922P88899Q65909R53816J053842J167642J298205J449076
55967B0587739J624041J828515K070185K358104K703017L119104L622621M226599
55959D2139925M937604N758471O693297P751058Q949544J0319967J1907238J3763491
55951A12220595J5937805J8459666K1302201K4311558K7108630K9009031K9059249
55944B77408735K6295897K0214921J1213122O50761r613843j7963175k3559709
55937B84646709k6405693k7034182k6139045k4343826k2115529j9756657j7436940
55930A21414837j5244272j3226894j1411015r805188q406123p204000o182501
55923D9934844n319026m589789l974498l455608l016405k642403k322971k049965
$$ y = [11629089, 12289428, 13010350, 13799249, 14665158, 15618974, 16672816, 17840458, 19138663, 20587739, 22211780, 24040295, 26110480, 28468584, 31171601, 34290705, 37913326, 42139925, 47077529, 52836000, 59529297, 67280355, 76229899, 86549866, 98457104, 112220595, 128158400, 146618066, 167920267, 192231825, 219340455, 248349486, 277408735, 303704632, 323919553, 335132675, 335783436, 326169593, 308206418, 284646709, 258241016, 231206834, 205067789, 180723963, 158608434, 138851777, 121414837, 106170565, 92943671, 81532656, 71727468, 63321345, 56117345, 49934844, 44615818, 40026029, 36051531, 32595923, 29579518, 26937115, 24614144, 22564179]
55915B2564179j815837j613969j439285j287555j155153j039705r39483q51875
55907A2421317p73872p04041o42315n87859n38971m95008m56324m22028l90012
55898G410887l59660l32418l09033k88248k68888k51224k35347k20092k04753
55889D941224j90249j77392j65358j53053j40802j29739j20614j14142j11310
55880C638565j12040j14411j16120j16197j14630j11355j06485j00750r4852q8974
55870B562751q3376p8635p4662p0447o5529o0818n7266n4564n2005m9686m7869
55859A867894m5984m3423m0755l9058l8388l7902l7195l6578l6153l5581l4726
55848A442151l3872l3186l2507l1644l0583k9402k8258k7271k6275k4899k3122
$$ y = [22564179, 20748342, 19134373, 17695088, 16407533, 15252380, 14212675, 13273192, 12421317, 11647445, 10943404, 10301089, 9713230, 9174259, 8679251, 8222927, 7800899, 7410887, 7051227, 6718809, 6409776, 6121528, 5852640, 5601416, 5366069, 5145977, 4941224, 4750975, 4573583, 4408225, 4255172, 4114370, 3984631, 3864017, 3749875, 3638565, 3526525, 3412114, 3295994, 3179797, 3065167, 2953812, 2847327, 2746577, 2651725, 2562751, 2479375, 2400740, 2326078, 2255631, 2190102, 2129284, 2072018, 2017454, 1965449, 1915763, 1867894, 1821910, 1778487, 1737732, 1698674, 1660286, 1622384, 1585189, 1548611, 1512458, 1476877, 1442151, 1408279, 1375093, 1342586, 1310942, 1280359, 1250957, 1222699, 1195428, 1169153, 1144254, 1121132]
55837A121132k1362j9826j8218j6367j4624j3297j2108j0669r044p484n963m489
55825I67681l471l224l462l712m012m704n790o981q241r788j1602j3318j4608
55812H74768j5387j5726j5772j5755j5849j5979j5835j5122j3958j2942j2593
55801G09850j2559j1819j0015q090p016o375n090l209j758r21K81K130L272K362
55787F51043l00l509o704r940j2893j4831j5330j4543j3029j1614j0895j0458
55775E26997r255p147n337m662m367l365j909r08k39R99K788M002L887K799J338
55760E05621k77j982l720n740q256j0809j2593j3506j4144j4719j4752j4033j3109
55747C77981j2471j1880j0892r540q162o936n994n552n574n563n138m567m373
$$ y = [1121132, 1099770, 1079944, 1061726, 1045359, 1030735, 1017438, 1005330, 994661, 985617, 978133, 972170, 967681, 964210, 960986, 957524, 953812, 949800, 945096, 939306, 932325, 924084, 914296, 902694, 889376, 874768, 859381, 843655, 827883, 812128, 796279, 780300, 764465, 749343, 735385, 722443, 709850, 697291, 685472, 675457, 667367, 660351, 653976, 648886, 645677, 643919, 642998, 643279, 645409, 648681, 651043, 650743, 647234, 640530, 630590, 617697, 602866, 587536, 572993, 559964, 548350, 537455, 526997, 517742, 510595, 505258, 500596, 496229, 492864, 490955, 490047, 489808, 490807, 493595, 497597, 501484, 504283, 505621, 505344, 503362, 499642, 493902, 485646, 474837, 462244, 448738, 434594, 419875, 405123, 391090, 377981, 365510, 353630, 342738, 333198, 325036, 318100, 312106, 306554, 300980, 295417, 290279, 285712, 281339]
55734B81339m534m457l713k556j586j121j058j245j737k509l172l332l211l387
55720B43721l880l953l134j929j092o80l47j77m41p79m17O90J623J644J049P34
55704B32632J210K239L090L106K299J425J190J430J447J058Q06J158K092L425
55690B58607M976O181O284N289M219M060M740N477N710N341M474L374K469K019
55676C23220J892J831J686J224J56j309k412k838l278m453n883o470o021n484
55662B91861n578o078o612p349q483r525r665q575o621m584l308l162l418k690
55648B06213m30K336M295N383O426P594Q221Q126Q078Q552Q819P838N583K884
55634B89918M07j678l212l936l902l569l389l468l543l151j986m35N08L08l67
$$ y = [281339, 276805, 272348, 268635, 266079, 264493, 263372, 262314, 261069, 259332, 256823, 253651, 250319, 247108, 243721, 239841, 235888, 232754, 230825, 229733, 229053, 228706, 228529, 228088, 227309, 226892, 227582, 229205, 230849, 231898, 232632, 233842, 236081, 239171, 242277, 244576, 246001, 247191, 248621, 250068, 251126, 251932, 253090, 255182, 258607, 263583, 269764, 276048, 281337, 285556, 289616, 294356, 299833, 305543, 310884, 315358, 318732, 321201, 323220, 325112, 326943, 328629, 329853, 330009, 328700, 326288, 323450, 320172, 315719, 309836, 303366, 297345, 291861, 286283, 280205, 273593, 266244, 257761, 248236, 238571, 229996, 223375, 218791, 215483, 212321, 208903, 206213, 205783, 208119, 212414, 217797, 224223, 231817, 240038, 248164, 256242, 264794, 273613, 281451, 287034, 289918, 290325, 288647, 285435, 281499, 277597, 274028, 270639, 267171, 263628, 260477, 258491, 258056, 258564, 258872, 258505]
55619B58505m36P7k8j608m120o387p895q898r632r977r899r761r888j0099r845
55604A60109q881p591o507n713m909m014l315k938k583k016j515j427j585j588
55590A05527j491j660k104k444k502k395k016j087J90J081J199R70R34J051J004
55575I6257Q40R18J435K227K925L164K821K202J687J236N45k77p15o77p40j278
55559A12570j862j895j445r52n23jN55R55J260J602J836J775J619J673J794J587
55543A20548J083P33O98N37k35j567k880l501l163k343j988k632l756m250l583
55528I3701k313j413j286j486j341p89m56q43j600j921j495p07J17J031J914K296
55512H3409K131K153K879L736L801L147K764L295M448N613O462O884O837O411
$$ y = [258505, 258069, 258146, 258118, 256510, 252390, 246003, 238108, 229210, 219578, 209601, 199702, 189941, 180053, 169954, 160109, 151228, 143637, 137130, 131417, 126508, 122494, 119179, 116241, 113658, 111642, 110127, 108700, 107115, 105527, 104036, 102376, 100272, 97828, 95326, 92931, 90915, 89828, 90018, 91099, 92298, 93268, 94202, 95253, 96257, 97097, 98015, 99450, 101677, 104602, 107766, 110587, 112789, 114476, 115712, 116257, 115980, 115265, 114588, 113848, 112570, 110708, 108813, 107368, 106416, 105893, 105892, 106447, 107402, 108662, 110264, 112100, 113875, 115494, 117167, 118961, 120548, 121631, 122364, 123062, 123599, 123364, 121797, 118917, 115416, 112253, 109910, 107922, 105290, 101534, 97284, 93701, 91388, 89975, 88689, 87203, 85862, 85073, 84617, 83774, 82174, 80253, 78758, 78051, 78168, 79199, 81113, 83409, 85540, 87693, 90572, 94308, 98109, 101256, 104020, 107315, 111763, 117376, 123838, 130722, 137559, 143970]
55498A43970N802N173M698M496M293L415J488j062l547n727p543q649q850q713
55484A29244q915r181q693p428o213n326m174k633j740k390l966m999m806l881
55470E4899k951k296j847j453r67l88L3L0l45p47q76p36n83o44p78n49J77P96
55452D0775N43n18j403j357o87l01o17j244j586j452j112q93q38p82o72o00m82
55435B6774K0R83J868K012J390N62Jk36k96m40r37j615j688o73O87J149O10J46
55417C0317L16M20j33p29o12k51o04j503j814j082n5N12O63P27P32P13R17J318
55399B9852J341O29l24p05l71J23L31K69O6l16q36j234j332j263j179q82o4J127
55381B5232J954J673K90j291j940j294j52K72m41j574k194k131j820j502j036
$$ y = [143970, 149772, 154945, 159643, 164139, 168432, 171847, 173335, 172273, 168726, 162999, 155456, 146807, 137957, 129244, 120329, 111148, 102455, 95027, 88814, 83488, 79314, 76681, 74941, 72551, 68585, 63586, 58780, 54899, 51948, 49652, 47805, 46352, 45385, 44997, 45030, 45060, 44715, 43968, 43092, 42356, 41773, 41129, 40351, 39802, 39979, 40775, 41318, 40800, 39397, 38040, 37353, 37052, 36435, 35191, 33605, 32153, 31041, 30148, 29310, 28528, 27856, 27256, 26774, 26794, 27777, 29645, 31657, 33047, 33609, 33610, 33374, 33078, 32638, 31701, 30086, 28398, 27725, 28412, 29561, 30171, 30317, 30633, 31053, 30920, 30191, 29579, 29328, 28724, 27221, 25407, 24325, 24270, 24782, 25445, 26172, 26904, 27617, 28534, 29852, 31193, 31822, 31498, 30793, 30422, 30545, 30876, 31145, 31211, 30895, 30059, 28825, 27493, 26230, 25051, 24169, 24105, 25232, 27186, 28859, 29149, 27858, 25918, 24624, 24472, 24744, 24303, 22729, 20535, 18404, 16584, 15082, 14046]
55366A4046l22M86J225J694J468M01p16o71O30J820J699O34j54j96k1j84p78j647
55348A9414k398k281q29J292K642K407J130Kk52J68N10K96j04R1R09J399R43J17
55330B5456l22o59j450k089j474J02J073Q16L84O52R94N01m95j027q95o25n47
55313B0395o43r15j192r95j93N68O85M31L72M29K29J8K92P56N67l27r66o72R1
55294A8930N17N30O34J051J450J450J039M78J6k18j50J97O07P84O97O50P94P81
55276C0237K27o45j192j196j053j107j223j118p07%R29J696J739R28k62j223j614
55259B4416j323n35J83L56K05K50L62m8q77j253q95n74q25j101q01k53P1N02J428
55240A9288K246K112J267O25L92P7m51q24r92j213j321q93k13j05o84j060n57
$$ y = [14046, 13724, 14210, 15435, 17129, 18597, 18998, 18282, 17611, 18241, 20061, 21760, 22394, 22240, 22044, 22023, 21839, 21061, 19414, 17016, 14735, 13906, 15198, 17840, 20247, 21377, 21379, 21127, 21295, 21805, 22101, 21997, 22088, 22997, 24396, 25339, 25456, 25134, 24475, 23025, 20936, 19462, 19564, 20637, 21453, 21837, 22489, 23483, 23984, 23489, 22462, 21567, 20942, 20395, 19752, 18837, 17645, 16650, 16457, 17025, 17710, 18141, 18513, 18942, 19171, 19189, 19481, 20237, 20804, 20477, 19511, 18839, 18930, 19447, 19977, 20611, 21662, 23112, 24562, 25601, 26079, 26095, 25877, 25727, 25924, 26531, 27315, 28012, 28662, 29456, 30237, 30464, 29819, 28627, 27431, 26378, 25271, 24048, 22930, 22223, 22223, 23152, 24848, 26587, 27515, 27253, 26030, 24416, 23093, 22558, 22741, 23097, 23302, 23552, 23914, 23866, 22989, 21736, 20841, 20267, 19442, 18341, 17540, 17287, 17358, 17860, 19288, 21534, 23646, 24913, 25538, 25930, 26007, 25556, 24732, 23740, 22527, 21206, 20313, 20100, 19995, 19311, 18251, 17694]
55223A7694M40J083R73K64o45j280j332r47n54l78l00j35K24P71J248J269Q68
55206A9263N99P45Q46N08J52L16O18L39l14n02j39P7n2j4K51J16m99p09l3P43
55186B2311P07J58K7N11R39P93K35k37k80M2L01J12l49n03r9M23M91%p15j227
55166B3640j245q08l34j96k81k38j04j92n18p81r05r67p42J0Q09Q67L09J36P20
55147A9180J281J191Q81Q61P24k8r31j141p17l60k62l3M04O83O86O95P84O99L96
55128B4993J90K73M01K44k31p51r60o84j70J16N8L3K85M98K87j27j81K74Q94J344
55108B6786J469J160M18m40r90j029n10N53J743K214J546M52l3J12N6m63p54l04
55090C1986M42Q30Q43P39M19k73j003j271j090p95l91K79R35J059P35N91P35N30
$$ y = [17694, 18134, 19217, 20190, 20454, 19809, 18529, 17197, 16250, 15696, 15318, 15018, 14883, 15107, 15878, 17126, 18395, 19263, 19862, 20607, 21453, 21961, 22113, 22429, 23047, 23386, 23072, 22570, 22431, 22508, 22456, 22442, 22693, 22809, 22310, 21601, 21568, 22311, 23018, 23176, 23203, 23714, 24653, 25446, 25681, 25444, 25164, 25206, 25507, 25619, 25270, 24767, 24668, 25091, 25582, 25582, 24867, 23640, 22395, 21587, 21253, 21057, 20776, 20538, 20434, 20242, 19724, 18943, 18038, 17071, 16329, 16339, 17148, 18015, 18324, 18460, 19180, 20461, 21652, 22533, 23394, 24118, 24090, 23159, 22018, 21301, 20941, 20679, 20646, 21050, 21733, 22419, 23114, 23898, 24597, 24993, 25183, 25456, 25857, 26101, 25870, 25119, 24159, 23475, 23305, 23421, 23479, 23512, 23797, 24295, 24582, 24455, 24274, 24548, 25442, 26786, 28255, 29415, 29833, 29393, 28403, 27374, 26864, 27417, 29160, 31374, 32920, 33372, 33339, 33451, 33507, 33044, 32290, 31986, 32428, 33258, 34101, 34840, 35259, 34986, 33983, 32712, 31622, 30827, 30436, 30715, 31650, 32709, 33444, 34035, 34770, 35300]
55072C5300k98j004q44k38j50o38q06j78O76R63M78m88j402j555o14N94O65n52
55054B9909j493q79N83J281Q88L49J11l72j316j944j555m48O53J408J774J627
55038C0576R62Q2o41j012r44n02k2K38N31J190J830J713R23L55L42K25l61p26
55020C4759l22J73j72j055j401r36l66j01K70J040J704J594Q38K61M11R62J156
55003C8815P47K74K57M94N14L96N57P88M03n99j308j152n99k72j14O4j5m98q51
54984C7901n89j04Lj03R0M82N68L50K78N34R80J549K086K159J646J159J155J137
54966E1281M91l21m58j95m73j214j388p45j59J1M97J582K277J827J080J312K474
54949E7879L479L850M140M970O439Q302J0098J1165J1081J0167R058P898O281
$$ y = [35300, 35002, 33998, 33154, 32916, 32766, 32128, 31322, 31144, 31820, 32783, 33261, 32773, 31371, 29816, 29202, 29796, 30461, 29909, 28416, 27537, 28120, 29401, 30289, 30638, 30749, 30377, 29061, 27117, 25562, 25114, 25767, 27175, 28949, 30576, 31538, 31620, 30979, 29967, 29023, 28521, 28499, 28737, 29268, 30458, 32288, 34001, 34924, 35279, 35621, 35846, 35485, 34759, 34437, 34610, 34438, 33383, 31982, 31046, 30680, 30579, 30849, 31889, 33593, 35187, 36025, 36286, 36697, 37659, 38815, 39562, 39836, 40093, 40587, 41101, 41497, 42054, 42842, 43245, 42646, 41338, 40186, 39587, 39315, 39201, 39265, 39250, 38752, 37901, 37312, 37208, 37211, 37108, 37198, 37680, 38248, 38598, 38876, 39410, 40390, 41939, 44025, 46184, 47830, 48989, 50144, 51281, 51772, 51451, 50993, 50798, 50325, 49111, 47723, 46978, 46819, 46830, 47327, 48909, 51186, 53013, 54093, 55405, 57879, 61358, 65208, 69348, 74318, 80757, 89059, 99157, 110322, 121403, 131570, 140628, 148526, 154807]
54936A54807L938J061k019n042p657r399j0025r742q959q001p062o312n860n611
54922G4117n281m646l785k935k179j442q34p05j096j370p74P13K307L283L601
54907E8974L739M053M434M512M215M126N013O904Q873J0000J0207R868Q950P070
54893A50938M288J239j574m104o386q276r622j0345j0298r414q032o748n875n362
54879G0429n127n043m700l723k436j654j647j786j408o07O5L29K82R2j08j51O3
54862D2870M48P93Q86O30J29l14n11n98p81j000j080j037r51p23l40j59m70r52
54844C6840j091j004j266j959k478k299j438k09R41J391Q75Ql22j25j16m28m24
54827B6896J02M94L80L08P40J244J280J015P94M36j80m52J99J350K030J898J357
$$ y = [154807, 158745, 159806, 157787, 152745, 145088, 135689, 125664, 115922, 106963, 98962, 91900, 85588, 79728, 74117, 68836, 64190, 60405, 57470, 55291, 53849, 53015, 52310, 51214, 49844, 49070, 49783, 52090, 55373, 58974, 62713, 66766, 71200, 75712, 79927, 84053, 89066, 95970, 104843, 114843, 125050, 134918, 143868, 150938, 155226, 156465, 154891, 150787, 144401, 136125, 126503, 116158, 105860, 96446, 88414, 81666, 75791, 70429, 65302, 60259, 55559, 51836, 49400, 47746, 46099, 44313, 42905, 42298, 42363, 42692, 42974, 43066, 42958, 42807, 42870, 43318, 44111, 44997, 45627, 45756, 45442, 44931, 44333, 43552, 42552, 41472, 40435, 39484, 38761, 38421, 38262, 37792, 36840, 35749, 34745, 33479, 31520, 29042, 26743, 25305, 25096, 26037, 27428, 28303, 28311, 27989, 27864, 27748, 27320, 26896, 26998, 27492, 27872, 28180, 28920, 30164, 31444, 32459, 33253, 33689, 33509, 33057, 33256, 34606, 36636, 38534, 39891]
54810C9891P48P8n86j007r61l44O88J521J551J050R97J641K062J694J408K230
54794E2661L727M758N297O282P870R116R463R404R468R471R065Q208O810M588
54780A56188J641j416m085o265p768q253p879p352o972o206m609k665j241n73
54766I2545k61L7L16N15O39P16Q17J107J599K002J996J628J328J469J939K167
54750A10559J694P83K84P54J918L211M547O042P266P401O168M063J595j115l812
54735A51358n857o867p192p379p488p383p281p497p796p569o657n558m714l995
54721E8125l106k159j570j447j460j337j205j253j323j141q84r90j369j302m42
54706C7137N40P94M76M76J067J521J206M24q5o3K19M93O52N60J61k78l40N5N42
$$ y = [39891, 40639, 40717, 40131, 39124, 38163, 37819, 38507, 40028, 41579, 42629, 43626, 45267, 47329, 49023, 50431, 52661, 56388, 61146, 66443, 72725, 80595, 89711, 99174, 108578, 118046, 127517, 136582, 144790, 151600, 156188, 157829, 156413, 152328, 146063, 138295, 130042, 122163, 114811, 107839, 101633, 97024, 94359, 93118, 92545, 92284, 92321, 92637, 93152, 93791, 94507, 95324, 96431, 98030, 100032, 102028, 103656, 104984, 106453, 108392, 110559, 112253, 113036, 113320, 114074, 115992, 119203, 123750, 129792, 137058, 144459, 150627, 154690, 156285, 155170, 151358, 145501, 138634, 131442, 124063, 116575, 109192, 101911, 94414, 86618, 79049, 72392, 66834, 62120, 58125, 55019, 52860, 51290, 49843, 48383, 47046, 45841, 44588, 43265, 42124, 41240, 40250, 38881, 37579, 37137, 37677, 38471, 38947, 39423, 40490, 42011, 43217, 43641, 43556, 43493, 43712, 44205, 44857, 45417, 45578, 45300, 44960, 45015, 45557]
54687D5557P39O36M92M83N65O47P79R99J155J053Q45R28J305J377P19j52k75M95
54669E8347J217J044K31l23k25J14K17J67L41P73J065R25O44Q14J635K675L447
54652G3108M006M790N992P270Q075Q098P409O322N125L838K243K64j776l372m259
54637A27133m524m414m239m307m697n084m974m122k762j476r32j411k420l020
54623G8751k773k136j696j350p52k05l61j075j380q65l74q51j933k370j671o88
54607E8271m55r74j452j516j570j912k064j427l07L56K56mRl2l25l06L80R58M94
54588D8380o14j060m64K58L58J20P8K65N49R10J035L64r89j945j664n95J20j21
54570D4985j037j909k026j112K31R36O28K6r8J81M49O82R27Q31K20k68Q0R41J352
$$ y = [45557, 46296, 46932, 47424, 47907, 48472, 49119, 49898, 50897, 52052, 53105, 53950, 54878, 56183, 57560, 58279, 58127, 57852, 58347, 59564, 60608, 60839, 60516, 60291, 60405, 60622, 60789, 61130, 61903, 62968, 63893, 64537, 65351, 66986, 69661, 73108, 77114, 81904, 87896, 95166, 103241, 111339, 118748, 125070, 130195, 134033, 136276, 136540, 134764, 131392, 127133, 122609, 118195, 113956, 109649, 104952, 99868, 94894, 90772, 88010, 86534, 85602, 84191, 81771, 78751, 75978, 73842, 72146, 70796, 70044, 69839, 69478, 68403, 67023, 66158, 65784, 64933, 63000, 60630, 58959, 58271, 57816, 56842, 55390, 53874, 52304, 50392, 48328, 46901, 46594, 46950, 47206, 47202, 47211, 47179, 46854, 46548, 46928, 47886, 48380, 47766, 46706, 46242, 46500, 46858, 46978, 47056, 47321, 47870, 48780, 49815, 50179, 49190, 47245, 45581, 44986, 45106, 44985, 43948, 42039, 40013, 38901, 39132, 40068, 40696, 40722, 40624, 40805, 41254, 41936, 42863, 43694, 43914, 43646, 43726, 44667, 46019]
54551D6019J062P33P86Q66N66P2j55P4O40J334J957K460L012L717M315M414M007
54534G5879L391K666J697N25n95j595k573l285l168k164j145j040j720k166j737
54519F2970r48p68j391k059k077j623j323j305j207r48r04j183j234n70N19J313
54503D7262J457J055L02n33r63o99p2L28L93M38N22L23k17o22m58J26O16P35O25
54484E0618N98P81R86R20N59J85k2k31n97r13r38q93j185j654j546m35J110J995
54466D9338J647M99m89o45m2P25J079Q13R3o39q55l72L32N96L88K94O34J004Q90
54447E5290K35p50j842k487j944k99J193J441Q32M56M70J35p31j349j149m32K83
54430D9352Q68J274J295R87P72Q16P98N30L54N98J059J315J273J114R33O74K94
$$ y = [46019, 47081, 47814, 48600, 49466, 50032, 50104, 49949, 50023, 50663, 51997, 53954, 56414, 59426, 63143, 67458, 71872, 75879, 79270, 81936, 83633, 84158, 83563, 81968, 79395, 76110, 72942, 70778, 69633, 68593, 66873, 64707, 62970, 62022, 61254, 59863, 57804, 55727, 54104, 52781, 51476, 50269, 49321, 48417, 47234, 46000, 45430, 45949, 47262, 48719, 49774, 50076, 49543, 48580, 47881, 47809, 48137, 48530, 48968, 49490, 49813, 49596, 48974, 48516, 48642, 49258, 49993, 50618, 51216, 51997, 52983, 53903, 54462, 54647, 54625, 54394, 53797, 52884, 51946, 51053, 49868, 48214, 46668, 46233, 47343, 49338, 50985, 51484, 50995, 50350, 50308, 51033, 52112, 52925, 53018, 52379, 51524, 51152, 51484, 52080, 52468, 52762, 53396, 54400, 55290, 55525, 54775, 52933, 50446, 48502, 48203, 49396, 50837, 51669, 52125, 52595, 52730, 51999, 50650, 49501, 49069, 49352, 50220, 51494, 52789, 53776, 54548, 55364, 56162, 56692, 57046, 57644, 58703, 60018, 61291, 62405, 63338, 64012, 64306]
54413F4306p6j45K93R98J440J534J756K161J909N35q37p53M17Q72l3r94q64j87
54395G2332%l29p62j398k250k507j543j15M57n3q14j236j299r62k25M21M19k7
54377F0109k46r4K0j11l54o50r05p38k7N61M02m7P6O50Q32N70O38J127J217O67
54357F3697L88R41J556J348O84N26J015J496J523J154N06k76q30q96p04o57p66
54340G0705q02q45j163j637j798j430r26p95j106j452j419r77m44q9O2Rm15j266
54322E4212k135k405j841p48L68R83O80l96j329j292n87k56o17q82m29L24O74
54305D4324N56K97m5m82p28n31r9K87P05J209J438J123O10L04l1p12j271r68m0
54286D5946M79J34m67p12o55m68M5R20J618J611J038L76j65n36n11K1O27P74N88
$$ y = [64306, 64230, 64085, 64378, 65376, 66816, 68350, 70106, 72267, 74176, 74711, 73874, 73121, 73538, 74410, 74377, 73383, 72519, 72332, 72332, 72003, 71241, 69843, 67593, 65086, 63543, 63428, 63885, 63832, 63018, 61782, 60483, 59521, 59296, 59717, 60136, 60109, 59863, 59769, 59789, 59678, 59324, 58674, 57769, 57031, 57004, 57565, 57967, 57920, 57996, 58646, 59478, 60048, 60686, 61813, 63030, 63697, 64085, 65026, 66582, 67930, 68614, 69140, 70155, 71651, 73174, 74328, 74834, 74558, 73728, 72832, 72128, 71471, 70705, 69903, 69058, 67895, 66258, 64460, 63030, 62104, 61309, 60203, 58751, 57332, 56355, 55911, 55822, 55884, 55893, 55478, 54212, 52077, 49672, 47831, 47083, 47451, 48434, 49114, 48718, 47389, 46097, 45510, 45254, 44637, 43755, 43326, 43650, 44324, 44880, 45177, 45132, 44650, 43922, 43391, 43292, 43579, 44284, 45493, 46931, 48054, 48664, 48968, 48937, 48225, 46954, 45986, 45946, 46425, 46559, 46092, 45380, 44725, 44257, 44302, 45222, 46840, 48451, 49489, 49865, 49700, 49164, 48653, 48674, 49301, 50075, 50663]
54267E0663O98J262J647J282M21k66o11r95j543j785j337n19M2K14L23M75M56
54250E0427L31N06R58J019L57l07r8O75Q50J1r28r41j27O23P44M39K12L49P82
54231E5882J145J065M84k25o20n89l19LK96L63j08j143k135k251j294LP23O65
54213E1945K93Mk12m74p61j031j187r79l93m3n69j514j590l59J108J672J411Q81
54195D8202l4j411k208j282P27J921J568P92O58Q44O70K61K5j98o73j179j435
54178D7248j606j798j665j025l37m0L2Q9q5m71m32K93Q61M72l75o77m57l99m96
54159C9132j84L74M09p7k41J93N54M35K29J12l31j158j637j348q51o68m68J22
54141C4597O84P47P22J217J912J968J286N39J34j31m30o20n90l83OM76O18J56
$$ y = [50663, 51361, 52623, 54270, 55552, 55973, 55707, 55096, 54101, 52558, 50773, 49436, 48917, 48959, 49173, 49496, 49971, 50427, 50758, 51264, 52222, 53241, 53598, 53291, 53193, 53868, 54718, 54729, 53801, 52860, 52733, 53356, 54100, 54539, 54751, 55100, 55882, 57027, 58092, 58576, 58351, 57731, 57142, 56823, 56826, 57122, 57485, 57377, 56234, 54099, 51848, 50554, 50557, 51280, 51945, 52238, 52242, 52030, 51556, 50795, 49764, 48577, 47598, 47205, 47162, 46593, 45079, 43489, 43130, 44238, 45910, 47321, 48202, 48168, 46757, 44549, 43267, 43994, 45915, 47483, 48275, 48933, 49777, 50447, 50708, 50733, 50535, 49862, 48683, 47248, 45642, 43844, 42179, 41154, 40817, 40777, 40809, 40898, 40813, 40342, 39910, 40203, 41064, 41536, 41161, 40484, 40027, 39628, 39132, 38948, 39322, 39731, 39654, 39413, 39606, 40160, 40595, 40824, 40936, 40605, 39447, 37810, 36462, 35611, 34943, 34475, 34597, 35281, 36028, 36750, 37967, 39879, 41847, 43133, 43672, 43806, 43675, 43245, 42625, 42035, 41652, 41658, 42134, 42752, 42908]
54123D2908m73n50r0J96n8m20m36k40j15P4N22R24P45l2p69r41p00n36n29k32
54103C9248N90J340J134k4j016q97j9N30L94K56O91J326J417Q40J55o2L48J163
54085D7414J922K117J586P20J23jN4o2l86o93p45m44J07N79O07J75k93l64j01
54066E2315N1p0r8L37J051J511J560J520J556J357O72j33m16r9K50K15O2L46J130
54047F3117J873K082J886J837K227K719K757K278J826J974K722L557L967L801
54033I8623L237K640K320K353K532K624K573K454K271J980J638J357J152R72Q23
54018A29549O64K68n89j727k613k913k814k704k711k680k532k365k321k470k761
54003I9281l045l102k839k401k037j865j847j929k015j874j311m85R5O2m11q10
$$ y = [42908, 42435, 41885, 41795, 41991, 41933, 41513, 41077, 40837, 40722, 40796, 41318, 42242, 42987, 42955, 42186, 41245, 40545, 40009, 39480, 39248, 39838, 41178, 42312, 42288, 41272, 40375, 40356, 40886, 41280, 41536, 42227, 43553, 44970, 45810, 45965, 45903, 46251, 47414, 49336, 51453, 53039, 53759, 53882, 53881, 53935, 53873, 53487, 52794, 52049, 51605, 51712, 52291, 52898, 53073, 52780, 52416, 52315, 52366, 52296, 52198, 52535, 53586, 55097, 56657, 58177, 59733, 61090, 61762, 61629, 61213, 61114, 61364, 61579, 61641, 61987, 63117, 64990, 67072, 68958, 70795, 73022, 75741, 78498, 80776, 82602, 84576, 87298, 90855, 94822, 98623, 101860, 104500, 106820, 109173, 111705, 114329, 116902, 119356, 121627, 123607, 125245, 126602, 127754, 128726, 129549, 130213, 130481, 129892, 128165, 125552, 122639, 119825, 117121, 114410, 111730, 109198, 106833, 104512, 102042, 99281, 96236, 93134, 90295, 87894, 85857, 83992, 82145, 80216, 78201, 76327, 75016, 74531, 74626, 74688, 74277, 73467]
53987G3467q25n34j55J54K22j00p25j246j355j211j199j343j237o25J78O45O28
53970F4739M09K22J2k82m25j18N85J267J601J613J467J190Q17O16Q21J174J197
53953G6905Q97Q50J316J780J693J327J297J581J634J453J699K679L855M648N098
53938A08712N387N297M666L931L614L587L323K717K052J431P83L17L66Q03J130
53923A48116J231J476K035K580K808K725K392J794J262J441K589M136N198N260
53909A85043M336K801J315M34Q1l06r54j466j584j637j891j980j550j040j178
53894A80424j932k701l323m112m924n089m485l915l996m349m345m079l918l569
53880A25687k493j093n67j337k427k764k469k303k380k230j864j881k391k663
$$ y = [73467, 72642, 72108, 71953, 72107, 72329, 72229, 71504, 70258, 68903, 67692, 66493, 65150, 63913, 63288, 63466, 64111, 64739, 65148, 65370, 65382, 65100, 64675, 64557, 65142, 66409, 68010, 69623, 71090, 72280, 73097, 73713, 74534, 75708, 76905, 77802, 78652, 79968, 81748, 83441, 84768, 86065, 87646, 89280, 90733, 92432, 95111, 98966, 103614, 108712, 114099, 119396, 124062, 127993, 131607, 135194, 138517, 141234, 143286, 144717, 145500, 145817, 146183, 146986, 148116, 149347, 150823, 152858, 155438, 158246, 160971, 163363, 165157, 166419, 167860, 170449, 174585, 179783, 185043, 189379, 192180, 193495, 193929, 194010, 193704, 192750, 191284, 189700, 188063, 186172, 184192, 182642, 181602, 180424, 178492, 175791, 172468, 168356, 163432, 158343, 153858, 149943, 145947, 141598, 137253, 133174, 129256, 125687, 123194, 122101, 121534, 120197, 117770, 115006, 112537, 110234, 107854, 105624, 103760, 101879, 99488, 96825]
53866I6825k219j586j461j704j761j692j915k184j812r12n59j271k165k186j488
53851G1910r41p31l67K18M88K96K48P23J117O19p14j985k412j846o49N80J202
53834F7756R48K27k11o5K46J61l62q57r08m78K46J067J787K156K043J662J464
53817G6882J659J942J821J205N91N94J336K357L058L164K775K164J665J562J914
53802A04689K415K612K395K100K070K239K304K219K219K410K464J982J002Q0k22
53787A32978O5K91j69j248k249k565k144j290l85J11k25j258k251k674k824l150
53771A11013l275k468j008j77o83j814k516k613k509k352k146k156k449k444j693
53756H0710p29l94m95k02M11K72r21j951j698o76j65m37o44k73K24J97m30j267
$$ y = [96825, 94606, 93020, 91559, 89855, 88094, 86402, 84487, 82303, 80491, 79579, 79020, 77749, 75584, 73398, 71910, 70969, 70238, 69871, 70089, 70577, 70873, 71121, 71844, 72961, 73580, 72866, 70881, 68469, 66623, 65974, 66554, 67756, 68704, 68931, 68720, 68655, 68901, 69062, 68700, 67843, 66935, 66457, 66703, 67770, 69557, 71713, 73756, 75418, 76882, 78541, 80483, 82304, 83509, 84100, 84694, 86030, 88387, 91445, 94609, 97384, 99548, 101213, 102775, 104689, 107104, 109716, 112111, 114211, 116281, 118520, 120824, 123043, 125262, 127672, 130136, 132118, 133120, 133200, 132978, 133043, 133334, 133165, 131917, 129668, 127103, 124959, 123669, 123284, 123395, 123170, 121912, 119661, 116987, 114163, 111013, 107738, 105270, 104262, 104085, 103402, 101588, 99072, 96459, 93950, 91598, 89452, 87296, 84847, 82403, 80710, 79981, 79587, 79092, 78890, 79301, 79573, 78652, 76701, 75003, 74327, 74162, 73725, 73081, 72808, 73032, 73229, 72799, 71532]
53738G1532j811j653p51K96O90L15j94k99j14J27N69J254J544P06r19k022j762
53721F7508o36L12O74P80R53J144J163Q53J59o55r64m12N39J114J229J445J961
53704G7167K279K018J454J005P35O94J105J754J760O79n82o58O50K245L101L082
53688I8488K569K003J777J961K053J559P94M64N29K86l60n59J80J116J275O95
53672A14830J44P2L57P09Q27M54k37n91k69K06J60l02n80n05l67k75j36p2k92
53653A14133n37l77K0J9n02r35q70o14n14m36j82P4K10N22J172J636J354O47L66
53634A15186O42O67n0q83r38k97K05K99O69J766K812K639J224j92o32l89l07n27
53616A21894m73K23J309K302K829K714K146J764K040K637K772K320J957K074K202
$$ y = [71532, 69721, 68068, 67317, 67613, 68303, 68618, 68424, 68125, 68011, 68138, 68707, 69961, 71505, 72211, 71292, 69270, 67508, 66872, 67184, 67858, 68638, 69591, 70735, 71898, 72751, 72910, 72255, 71291, 70879, 71418, 72532, 73761, 75206, 77167, 79446, 81464, 82918, 83923, 84658, 85352, 86457, 88211, 89971, 90650, 90068, 89410, 90060, 92305, 95406, 98488, 101057, 103060, 104837, 106798, 108851, 110410, 111204, 111668, 112197, 112483, 112123, 111564, 111744, 112860, 114135, 114830, 114974, 115046, 115403, 116112, 116939, 117393, 117156, 116565, 116296, 116502, 116662, 116360, 115780, 115275, 114908, 114633, 114497, 114425, 114133, 113596, 113219, 113239, 113258, 112756, 111821, 110951, 110337, 109823, 109387, 109205, 109279, 109489, 110011, 111183, 112819, 114173, 114820, 115186, 115828, 116495, 116445, 115562, 114624, 114327, 114532, 114831, 115500, 117266, 120078, 122717, 123941, 123749, 123117, 122728, 122421, 121894, 121421, 121644, 122953, 125255, 128084, 130798, 132944, 134708, 136748, 139385, 142157, 144477, 146434, 148508, 150710]
53601A50710J834J269J113J341J522J589J822K146K175J919J802J904J832J508
53587A74486J416J709J749J041J20j44K12M38K89K13L18L1r20j840j926j290o78
53570A75224m67m59m28l95m01m58o19p84o18nN37M18j52m00j03J75K8j94j06j4
53550A70779m12j097j310o98L07J026J188R92Q04Q02Q55P87O63P05Q70R34R98
53533A78193J552K699L711L803L114K492K387K482K352K097K143K727L640M364
53519B17756M464M058L851M421N590O638P133P206P186P312P773Q644R721J0627
53505C12380J1174J1438J1539J1603J1838J2342J2896J3239J3493J3872J4171
53494D49985J4075J3907J4374J5415J5976J5362J4214J3703J4108J4758J5036
$$ y = [150710, 152544, 153813, 154926, 156267, 157789, 159378, 161200, 163346, 165521, 167440, 169242, 171146, 172978, 174486, 175902, 177611, 179360, 180401, 180521, 180377, 180589, 181027, 181316, 181529, 181847, 181878, 180958, 179118, 177192, 175902, 175224, 174757, 174298, 173870, 173475, 173074, 172616, 171997, 171213, 170595, 170590, 171127, 171545, 171393, 170993, 170890, 171065, 171093, 170899, 170793, 170779, 170367, 169270, 167960, 167262, 167569, 168595, 169783, 170775, 171579, 172381, 173236, 174023, 174686, 175391, 176261, 177195, 178193, 179745, 182444, 186155, 189958, 193072, 195564, 197951, 200433, 202785, 204882, 207025, 209752, 213392, 217756, 222220, 226278, 230129, 234550, 240140, 246778, 253911, 261117, 268303, 275615, 283388, 292032, 301753, 312380, 323554, 334992, 346531, 358134, 369972, 382314, 395210, 408449, 421942, 435814, 449985, 464060, 477967, 492341, 507756, 523732, 539094, 553308, 567011, 581119, 595877, 610913]
53483F10913J4911J4618J4349J4283J4564J5098J5542J5524J4837J3590J2252
53472G70481J1345J0911J0549J0092R928J0349J0971J1171J0775R952Q646O720
53460H91890M502K649J422N35l44j430l007n184p330q432q307p965q416r551j0540
53445H30492j0970j1094j1191j1270j1337j1533j1912j2314j2585j2664j2520
53434G01102j2197j1900j1791j1663j1107j0102r118q439p685o313m505l080k454
53421E90748k162j575q44n85p88n96O39K420L643L898L936M798O698Q855J0300
53406F29385J0776J0840J1169J1847J2480J2928J3542J4621J5920J7002J7813
53395G78323J8610J9524K0623K2167K4315K6599K8278K9319L0448L2043L3503
$$ y = [610913, 625824, 640442, 654791, 669074, 683638, 698736, 714278, 729802, 744639, 758229, 770481, 781826, 792737, 803286, 813378, 823306, 833655, 844626, 855797, 866572, 876524, 885170, 891890, 896392, 899041, 900463, 900998, 900654, 899224, 896217, 891033, 883703, 875271, 866964, 858999, 850583, 841032, 830492, 819522, 808428, 797237, 785967, 774630, 763097, 751185, 738871, 726286, 713622, 701102, 688905, 677005, 665214, 653551, 642444, 632342, 623224, 614785, 607100, 600787, 596282, 593202, 590748, 588586, 587011, 586167, 585582, 584794, 584198, 584837, 587257, 590900, 594798, 598734, 603532, 610230, 619085, 629385, 640161, 651001, 662170, 674017, 686497, 699425, 712967, 727588, 743508, 760510, 778323, 796933, 816457, 837080, 859247, 883562, 910161, 938439, 967758, 998206, 1030249, 1063752]
53384A063752L4112L4038L4021L4341L4730L5012L5328L5617L5493L4714L3451
53373A444609L2001L0548K9285K8364K7524K6164K4016K1495J9132J6942J4633
53362A714713J2237J0068Q158O111L575M97l132p401j2194j7024k1392k5132k8262
53349A640822l0668l2221l3071l3499l3606l3361l2971l2798l2796l2328l0866
53338A282637k8673k6622k5361k4928k5036k5448k6019k6612k7089k7278k6860
53327I92711k5498k3266k0815j8925j7838j7108j6143j4730j3074j1489j0199
53316H03626r346q982q979r029q919q737q714q907r089r033q727q261p605o671
53302F82627n532m437l573k854j995p49Q90K603L884M400M254L957M072M873O250
$$ y = [1063752, 1097864, 1131902, 1165923, 1200264, 1234994, 1270006, 1305334, 1340951, 1376444, 1411158, 1444609, 1476610, 1507158, 1536443, 1564807, 1592331, 1618495, 1642511, 1664006, 1683138, 1700080, 1714713, 1726950, 1737018, 1745176, 1751287, 1754862, 1755359, 1752227, 1744826, 1732632, 1715608, 1694216, 1669084, 1640822, 1610154, 1577933, 1544862, 1511363, 1477757, 1444396, 1411425, 1378627, 1345831, 1313503, 1282637, 1253964, 1227342, 1201981, 1177053, 1152017, 1126569, 1100550, 1073938, 1046849, 1019571, 992711, 967213, 943947, 923132, 904207, 886369, 869261, 853118, 838388, 825314, 813825, 803626, 794280, 785298, 776319, 767290, 758371, 749634, 740920, 732013, 722924, 713891, 705164, 696903, 689298, 682627, 677095, 672658, 669085, 666231, 664236, 663487, 664377, 666980, 670864, 675264, 679518, 683475, 687547, 692420, 698670]
53287F98670P833R258J0400J1373J2290J3108J3753J4308J4953J5696J6328J6590
53275H54560J6385J5792J4989J4100J3052J1679J0060Q593P514O486M980L057
53263I81247J354K81m76j472k921m771o973r270j1050j1921j2336j3198j4836
53250H93658j6679j8003j8631j8865j9042j9320j9586j9461j8679j7529j6663
53239F91200j6268j5785j4719j3441j2791j3049j3743j4321j4653j4746j4507
53228E33177j3877j3026j2179j1474j1053j1015j1101j0743r706q476p635p105
53216D05787o373n377m639m481m588m610m744n413o578p703q317q339q020p780
53202C18825p994q662r326r508r126q305p081n622m526m313m640m647m185m092
$$ y = [698670, 706503, 715761, 726161, 737534, 749824, 762932, 776685, 790993, 805946, 821642, 837970, 854560, 870945, 886737, 901726, 915826, 928878, 940557, 950617, 959210, 966724, 973210, 978190, 981247, 982601, 982882, 982406, 980934, 978013, 973242, 966269, 956999, 945949, 934028, 921692, 908494, 893658, 876979, 858976, 840345, 821480, 802438, 783118, 763532, 744071, 725392, 707863, 691200, 674932, 659147, 644428, 630987, 618196, 605147, 591404, 577083, 562430, 547684, 533177, 519300, 506274, 494095, 482621, 471568, 460553, 449452, 438709, 429003, 420527, 412892, 405787, 399414, 394037, 389398, 384917, 380329, 375719, 370975, 365562, 358984, 351281, 342964, 334625, 326605, 318825, 310831, 302169, 292843, 283335, 274209, 265904, 258823, 253201, 248675, 244362, 239722, 235075, 230890, 226798]
53188B26798m914n938o057n180m237l954m230m586m676m276l327k249j729j975
53174A69470k468k697k797l145l587l512k643j459p25q11j425j903j783j245r66
53159A38304j328j895j949j500j265j564j794j372p56q41j550j857j308p09q46
53144A17770j240r87k60n4n66r29o65l81o13q18l00N96R85P60N41N60N01L35M12
53125A15647O79N73o7p06j014j298j723j817j256n91m72o59m83M0K86N9k82o26
53107A06290j227j935k010j148r4J85l92j152j609j795j874j858j745j557j184
53092H6895m69M47J109J211R44P35P20O46K75k33m72k90L2J18l7j05J01M21O60
53073I2708R24J364J710J438N30l04m75l12n58j199j404q16k45n65j371j515p64
$$ y = [226798, 221884, 215946, 209889, 204709, 200472, 196518, 192288, 187702, 183026, 178750, 175423, 173174, 171445, 169470, 167002, 164305, 161508, 158363, 154776, 151264, 148621, 147162, 146437, 145626, 144201, 142298, 140515, 139270, 138304, 136976, 135081, 133132, 131632, 130367, 128803, 127009, 125637, 124881, 124040, 122490, 120633, 119325, 118616, 117770, 116530, 115543, 115283, 115229, 114663, 113734, 113069, 112688, 112075, 111257, 110957, 111553, 112538, 113298, 113839, 114399, 114900, 115235, 115647, 116326, 116899, 116832, 116126, 115112, 113814, 112091, 110274, 109018, 108427, 107955, 107296, 106813, 106853, 107139, 107198, 106916, 106290, 105063, 103128, 101118, 99970, 99876, 100061, 99669, 98517, 96908, 95113, 93239, 91381, 89636, 88079, 86895, 86426, 86873, 87982, 89193, 90137, 90872, 91592, 92238, 92513, 92280, 91808, 91518, 91550, 91668, 91631, 91526, 91627, 92048, 92708, 93632, 94996, 96706, 98144, 98674, 98370, 97895, 97583, 97025, 95826, 94422, 93606, 93361, 92796, 91425, 89910, 89146]
53056H9146r4j67l55K51J432K094J637M83o20j219j142m43M50R34Q15M66L29N13
53038I4510Q90J344J731J874J764J590J480J380J310J510K142K933L353L129K424
53023A23364J589Q04M2o76j066q13n4N57M76j19o12p28p25p77o61k09K60L12k4
53004A20940l49m39m46n78q09r11o99k41J22J15m9J71R19J615J566P99j2l26j84
52985A21204Q7L07N17P84J026J057Q14N77O85J046J149P45K12p5l15q06j179p99
52967A27036J38O58L19j93r6M64Q79J016J108J046N18k62n93j92M22O46M59K50
52949A33623L02O49J120J368J120N96L54N60O78K10n66j010r98q84p50l42J48
52932A36178M0q22j525j235l37J84K03M53J145J436P02m34q97m88J28M36L87k1
$$ y = [89146, 89052, 88885, 88530, 88781, 90213, 92307, 93944, 94427, 93807, 92588, 91446, 91003, 91453, 92387, 93202, 93668, 93997, 94510, 95400, 96744, 98475, 100349, 102113, 103703, 105183, 106563, 107873, 109383, 111525, 114458, 117811, 120940, 123364, 124953, 125757, 125799, 125123, 124057, 123244, 123190, 123747, 124223, 124104, 123492, 122764, 122039, 121262, 120601, 120392, 120652, 120964, 120940, 120591, 120152, 119706, 119128, 118319, 117408, 116709, 116468, 116590, 116705, 116656, 116827, 117746, 119361, 120927, 121726, 121714, 121388, 121204, 121291, 121598, 122115, 122899, 123925, 124982, 125796, 126373, 127058, 128104, 129253, 129998, 130210, 130135, 129820, 129014, 127835, 127036, 127174, 127832, 128151, 127958, 127862, 128326, 129205, 130221, 131329, 132375, 132893, 132631, 132038, 131846, 132268, 132914, 133373, 133623, 133925, 134574, 135694, 137062, 138182, 138778, 139132, 139692, 140370, 140580, 140014, 139004, 138006, 137122, 136372, 136030, 136178, 136218, 135396, 133871, 132636, 132299, 132483, 132686, 133139, 134284, 135720, 136422, 135988, 135091, 134603, 134731, 135167, 135554, 135533]
52914A35533p46j331j234o60m58r29j375j141n97n11q58r60n55j03N8K18P16J331
52896A26398J572J336Q98M24j76q92j410j377p76PM97N27L30K67M58P49R36R54
52878A30722Q40P07Q32J496K513L113K663J519P40Q68J275R35l99k076l361m013
52862A38374m098l708l015k316j799j482j424j805k539l070k836j964j161r23
52848A06234j077j209j210j268j427j419j024m37j71n06j113j390j183r98j319
52833I0483j918k127j653q17l1N57Q54P16K50j14j26K2J08K27M01K14o09j505
52815H4932j595q34j7L89P78J517K201K220J622R01K89k33n37m91l16k58o3N71
52797I1076J194J011J75j94L82R48M90n70j042o53j88j75l43l80m01m67l21N7
$$ y = [135533, 134787, 133456, 132222, 131562, 131104, 130175, 128800, 127659, 127062, 126551, 125693, 124733, 124178, 124075, 124133, 124351, 125067, 126398, 127970, 129306, 130204, 130628, 130452, 129560, 128150, 126773, 125997, 126004, 126501, 127028, 127358, 127625, 128083, 128832, 129768, 130722, 131562, 132269, 133101, 134597, 137110, 140223, 142886, 144405, 145145, 146013, 147288, 148223, 147824, 145748, 142387, 138374, 134276, 130568, 127553, 125237, 123438, 121956, 120532, 118727, 116188, 113118, 110282, 108318, 107157, 106234, 105157, 103948, 102738, 101470, 100043, 98624, 97600, 97163, 96992, 96486, 95373, 93983, 92800, 91802, 90483, 88565, 86438, 84785, 83968, 83937, 84494, 85348, 86064, 86314, 86200, 86074, 86096, 86204, 86431, 86832, 87046, 86437, 84932, 83337, 82503, 82486, 82875, 83653, 85170, 87371, 89591, 91213, 92114, 92403, 92170, 91633, 91142, 90826, 90568, 90505, 91076, 92270, 93281, 93456, 93262, 93644, 94592, 95082, 94512, 93470, 92817, 92629, 92454, 92111, 91731, 91330, 90863, 90542, 90599]
52779I0599K85K52L99R87J569J689J587J694J831J527R04N16M73L84J45J52N93
52762A05586J067J109P13K02j43j46J71N56P71Q80R57O97j67j155j447j046q02
52745A07803j063j151n78J29M44Q40J838K710K300Q32k81l73j22j20j6N19R97
52728A14708R79R01J341J972K013J344M87j43l89k6R31J797J789J056M69M16M49
52711A30094K29Q2L29O82O94M12J27j52n44q35o96k48pj53k82J7N94Q68M66l86
52691A31291j014q26J53J264J824J761J585J681J863J661Q81k25j233j823j885
52676A36958j560j171r96j022j071j144j451j986k308j997j317j082j698k579
52662A15576k774k088j281j125j539j777j336m02M47P67M97p8m94m69j52J5j84
$$ y = [90599, 90884, 91136, 91535, 92522, 94091, 95780, 97367, 99061, 100892, 102419, 103323, 103839, 104312, 104696, 104841, 104993, 105586, 106653, 107762, 108475, 108677, 108534, 108388, 108559, 109115, 109886, 110766, 111723, 112420, 112253, 111098, 109651, 108605, 107803, 106740, 105589, 105011, 105140, 105584, 106424, 108262, 110972, 113272, 114104, 113823, 113450, 113328, 113208, 113192, 113711, 114708, 115687, 116588, 117929, 119901, 121914, 123258, 123745, 123602, 123213, 123187, 124118, 125915, 127704, 128760, 129229, 129645, 130094, 130323, 130405, 130734, 131416, 132110, 132522, 132649, 132497, 131953, 131118, 130422, 130174, 130167, 130014, 129732, 129749, 130343, 131211, 131677, 131291, 130277, 129451, 129604, 130868, 132692, 134453, 136038, 137719, 139582, 141243, 142124, 141899, 140666, 138843, 136958, 135398, 134227, 133231, 132209, 131138, 129994, 128543, 126557, 124249, 122252, 120935, 119853, 118155, 115576, 112802, 110714, 109433, 108308, 106769, 104992, 103656, 103254, 103701, 104468, 104965, 104887, 104393, 103924, 103772, 103787, 103603]
52645A03603n12n87k91K86J081J997K737K985K762K299J652P25k74q02o31k26
52629A16804j83m82o05k69L25Q42J073R09L96j18k83j93k69n64o31k45J31km07
52610A16229m64q2K70L79N81J080J503J457J144R58P84K03o57j055o19O1J95j60
52592A21807l07j0J62k89j048j500j545j537j570j360q55m20l10l30k69l13o74
52575A09632j090j089o37j46J04J73J21r0l06j65L26N61O0q09j222r82p57j090
52557A02594j597j500p43j11j67n13l87K29N81J75o04j023q87n35j95K24P24J021
52539I7286R21N98L03l1n83j210j481j189n63K3M09N61L45l50j269j811j547o82
52521H9730J01K59j73o91q19m87l9P2l25r51j342j277r16n54l24j80m7J18L31
$$ y = [103603, 103091, 102504, 102213, 102499, 103580, 105577, 108314, 111299, 114061, 116360, 118012, 118737, 118463, 117661, 117030, 116804, 116621, 116139, 115534, 115265, 115590, 116432, 117505, 118414, 118810, 118692, 118409, 118216, 117947, 117383, 116752, 116507, 116638, 116636, 116229, 115765, 115683, 115953, 116332, 116913, 117993, 119496, 120953, 122097, 123055, 123839, 124042, 123385, 122330, 121711, 121772, 121967, 121807, 121500, 121490, 121652, 121363, 120315, 118815, 117270, 115733, 114163, 112803, 111948, 111528, 111218, 110888, 110619, 110306, 109632, 108542, 107453, 106816, 106670, 106774, 106947, 107068, 106978, 106672, 106507, 106833, 107394, 107454, 106645, 105423, 104441, 103684, 102594, 100997, 99497, 98754, 98643, 98476, 97963, 97576, 97805, 98386, 98561, 97957, 96934, 96047, 95512, 95317, 95541, 96265, 97286, 98207, 98805, 99108, 99077, 98494, 97284, 95803, 94614, 94051, 94074, 94483, 95044, 95389, 95039, 93770, 91959, 90412, 89730, 89831, 90090, 89917, 89226, 88407, 87920, 87881, 87953, 87628, 86677, 85335, 84058, 83142, 82588, 82264, 82084, 82037, 82155, 82486]
52502H2486N37N76L95J77J46K19R2k96n60l38J76M36K45l3m9L0j09k95l0O74J070
52481H5549O06k58n81j83J37k67j019j251o80J45N57L91l1k49nN87J156J413J325
52462H7342R57L73k03l60M8O29R11Q59O69K40o06j466j540o34M51P82K46n25q75
52443H7298n52K45R41J002M97Q3K01N14M17j38o70q76r09j022j168j116p65k33
52425H3749K94P88J313J711J520N32o44j039m52K66K83k41n05p5P65J446J548
52408I1259J048M56M00R05J365J414J346J286O83o84j768j378O0R38N81q9j61
52391I7661J29J82J6j20l17o04o25k40R2P0J78Q37J554J613J219J123J382J351
52373A05501Q09K88K70P12J418K198K566K003P74j04l1N14P63O91Q42J447K152
$$ y = [82486, 83023, 83599, 83994, 84171, 84317, 84536, 84628, 84332, 83772, 83434, 83610, 84046, 84291, 84258, 84209, 84239, 84130, 83835, 83805, 84479, 85549, 86155, 85897, 85316, 85133, 85270, 85003, 83984, 82733, 82053, 82198, 82755, 83146, 83115, 82866, 82861, 83448, 84604, 86017, 87342, 88299, 88672, 88469, 88109, 88157, 88786, 89697, 90556, 91225, 91465, 90859, 89393, 87853, 87219, 87670, 88452, 88698, 88173, 87298, 86746, 86991, 87932, 88934, 89431, 89514, 89715, 90229, 90646, 90508, 89838, 88962, 88053, 87031, 85863, 84747, 83982, 83749, 84043, 84831, 86144, 87855, 89375, 89907, 89263, 88224, 87772, 88038, 88321, 88080, 87575, 87500, 88265, 89711, 91259, 92307, 92763, 93163, 94068, 95433, 96847, 98193, 99479, 100162, 99478, 97710, 96332, 96392, 97330, 97911, 97822, 97661, 97790, 97972, 97988, 97868, 97551, 96947, 96322, 96082, 96174, 96244, 96422, 97259, 98813, 100426, 101645, 102768, 104150, 105501, 106310, 106598, 106868, 107580, 108998, 111196, 113762, 115765, 116539, 116435, 116404, 116918, 117681, 118372, 119214, 120661, 122813]
52356A22813K475K189J330K04o25o52P6R37J345J307J260J375J354J009O56O29
52340A37682O74L92J11O27J867K680K341J595J586K285K768K665K430K389K453
52325A64545K729L534M612N236N286N505O350P274P631P564P589P818Q153Q717
52311B52543R471R870R537R001R095R839J0594J1041J1353J1499J1221J0843J1238
52298C87145J2623J3960J4078J3039J1912J1415J1276J0897J0127R246Q501P977
52286E22196P695P489O823N117K564K54q48q99p75q37o53j4M34j4j163k235k820
52269E42314l040k933k284j112J32R66J247J130R34J124K046L526N018O206P250
52254E62524Q298R073R140Q531P822P638Q144R028R915J0663J1314J1757J1620
$$ y = [122813, 125288, 127477, 128807, 129011, 128386, 127734, 127810, 128747, 130092, 131399, 132659, 134034, 135388, 136397, 137053, 137682, 138356, 138748, 138859, 139486, 141353, 144033, 146374, 147969, 149555, 151840, 154608, 157273, 159703, 162092, 164545, 167274, 170808, 175420, 180656, 185942, 191447, 197797, 205071, 212702, 220266, 227855, 235673, 243826, 252543, 262014, 271884, 281421, 290422, 299517, 309356, 319950, 330991, 342344, 353843, 365064, 375907, 387145, 399768, 413728, 427806, 440845, 452757, 464172, 475448, 486345, 496472, 505718, 514219, 522196, 529891, 537380, 544203, 549320, 551884, 552138, 551290, 550391, 549616, 548779, 548126, 548112, 548546, 548532, 547369, 545134, 542314, 539274, 536341, 534057, 532945, 533077, 534043, 535290, 536420, 537354, 538478, 540524, 544050, 549068, 555274, 562524, 570822, 579895, 589035, 597566, 605388, 613026, 621170, 630198, 640113, 650776, 662090, 673847, 685467]
52241F85467J0607Q871O970N421M383L686L080K415J702J024L99k02p40j178j608
52226G30297k188k914l665m493n496o341o369n447m379l974m024l817l425l662
52212F70103m722n592n301m254l703m189m982n071m222k933j738q31k48l9j65
52197F22113l31j41M62J078J202O80j79q63r92n65mJ56k07p12r51r39r54j128
52179F17725j412j752k089k307k450k792l470m112m189l657k979k577k522k670
52165E78747k779k541j852j041n57n51r63j798k890l644l576l031k769k892k823
52150E45040k336j862j672j533j409j688k331k580j997j198r16r91r08q14j122
52135E21683j558j500j023q13j060j331j420j594j799j449k96J085K050K650L291
$$ y = [685467, 696074, 704945, 711915, 717336, 721719, 725405, 728485, 730900, 732602, 733626, 734025, 733823, 733083, 731905, 730297, 728109, 725195, 721530, 717037, 711541, 705200, 698831, 693384, 689005, 685031, 681007, 677190, 673765, 670103, 665381, 659789, 654488, 650234, 646531, 642342, 637360, 632289, 628067, 625134, 623396, 622565, 622317, 622278, 622113, 621782, 621641, 622103, 623181, 624383, 625063, 624884, 624021, 623029, 622464, 622460, 622616, 622409, 621697, 620746, 619807, 618853, 617725, 616313, 614561, 612472, 610165, 607715, 604923, 601453, 597341, 593152, 589495, 586516, 583939, 581417, 578747, 575968, 573427, 571575, 570534, 569977, 569426, 568463, 566665, 563775, 560131, 556555, 553524, 550755, 547863, 545040, 542704, 540842, 539170, 537637, 536228, 534540, 532209, 529629, 527632, 526434, 525518, 524527, 523619, 522805, 521683, 520125, 518625, 517602, 516789, 515729, 514398, 512978, 511384, 509585, 508136, 507840, 508925, 510975, 513625, 516916]
52120E16916M031M583M838N052N574O486P518Q322Q914R705J0907J2098J2752
52107F17696J2960J3252J3756J4103J4181J4366J4869J5375J5553J5458J5173
52096G76742J4466J3299J2190J1612J1179J0006P877N634M213L564K774J172q53
52083H73875k305k718k694l130m181n269n957o389o838p232p392p323p091o542
52069G98814n489m054k667j767j556j864k135j769o68O70J747K597L518M468N048
52054G94893N091M959N108N498N679N381M843M478M350M267M198M288M360L840
52040H61233K442O46q60j933k853l700m381n038n866o637p020p270p963q941r399
52025G92460r110q848r282j0169j1045j1951j2879j3243j2664j1798j1572j2012
$$ y = [516916, 520947, 525530, 530368, 535420, 540994, 547480, 554998, 563320, 572234, 581939, 592846, 604944, 617696, 630656, 643908, 657664, 671767, 685948, 700314, 715183, 730558, 746111, 761569, 776742, 791208, 804507, 816697, 828309, 839488, 849494, 857371, 863005, 867218, 870782, 873556, 874728, 873875, 871570, 868852, 866158, 863028, 858847, 853578, 847621, 841232, 834394, 827162, 819770, 812447, 805356, 798814, 793325, 789271, 786604, 784837, 783281, 781417, 779282, 777513, 776845, 777515, 779262, 781859, 785377, 789845, 794893, 799984, 804943, 810051, 815549, 821228, 826609, 831452, 835930, 840280, 844547, 848745, 853033, 857393, 861233, 863675, 864321, 863461, 861528, 858675, 854975, 850594, 845556, 839690, 833053, 826033, 818763, 810800, 801859, 792460, 783350, 774502, 765220, 755051, 744006, 732055, 719176, 705933, 693269, 681471, 669899, 657887]
52013F57887j2547j3029j3630j4008j3663j3027j3102j3903j4247j3463j2415
52002E10853j2313j3130j3891j3970j3538j3025j2728j2837j3314j3726j3524
51991C64857j2621j1480j0683j0400j0275r721q462o847n546m956n010n513o321
51978B57022p180p747p948q051q236q279p856o913n687m485l598l167l030k900
51964A71945k720k651k691k647k549k661k906k757j960r58k85Q5L03Q0q56k021
51948A44751k616k511k204j845j157l45k28j038j831j645q07l58o11r05p69n30
51932A25351o33r29r98q09o49o09m73j34K36M13L53J33j43l30k66L4L26K76k71
$$ y = [657887, 645340, 632311, 618681, 604673, 591010, 577983, 564881, 550978, 536731, 523268, 510853, 498540, 485410, 471519, 457549, 444011, 430986, 418258, 405421, 392107, 378381, 364857, 352236, 340756, 330073, 319673, 309398, 299677, 291215, 284368, 278822, 273866, 268856, 263343, 257022, 249842, 242095, 234147, 226096, 217860, 209581, 201725, 194812, 189125, 184640, 181042, 177875, 174845, 171945, 169225, 166574, 163883, 161236, 158687, 156026, 153120, 150363, 148403, 147445, 147160, 147245, 147548, 147628, 146772, 144751, 142135, 139624, 137420, 135575, 134418, 134073, 133845, 132807, 130976, 129331, 128524, 128166, 127555, 126650, 125881, 125351, 124718, 123789, 122791, 121982, 121333, 120724, 120251, 120117, 120353, 120766, 121119, 121252, 121109, 120779, 120513, 120547, 120873, 121149, 120878]
$$ [...]
##END NTUPLES=NMR SPECTRUM
##END=
