##TITLE=NES1035_50200289_9243015_XzrnRGQSAB
##JCAMPDX= 6.0         $$ Bruker NMR JCAMP-DX V2.0
##DATA TYPE= NMR SPECTRUM
##DATA CLASS= NTUPLES
##ORIGIN= BRUKER
##OWNER= Administrator
$$ 1.72 TOPSPIN		Version 2.1
$$ 2015-07-01 21:42:22.211 -0700  Administrator@X
$$ Compression mode = diff/dup
##.OBSERVE FREQUENCY= 400.02188249412
##.OBSERVE NUCLEUS= ^1H
##.ACQUISITION MODE= SIMULTANEOUS (DQD)
##.ACQUISITION SCHEME= undefined
##.AVERAGES= 64
##.DIGITISER RES= 22
##SPECTROMETER/DATA SYSTEM= spect
##.PULSE SEQUENCE= noesygpps1d.comp
##.SOLVENT NAME= COFFEE_meoh
##.SHIFT REFERENCE= INTERNAL, COFFEE_meoh, 1, 14.96275
##AUDIT TRAIL= $$ (NUMBER, WHEN, WHO, WHERE, PROCESS, VERSION, WHAT)
$$ ##TITLE= Audit trail, TOPSPIN		Version 2.1
$$ ##JCAMPDX= 5.01
$$ ##ORIGIN= Bruker BioSpin GmbH
$$ ##OWNER= Administrator
$$ $$ E:\/data/COFFEE/nmr/NES1035_50200289_9243015_XzrnRGQSAB/22/pdata/1/auditp.txt
$$ ##AUDIT TRAIL=  $$ (NUMBER, WHEN, WHO, WHERE, PROCESS, VERSION, WHAT)
(   1,<2015-07-01 21:42:16.961 -0700>,<Administrator>,<X>,<go>,<TOPSPIN 2.1>,
      <created by zg
	started at 2015-07-01 21:30:47.289 -0700,
	POWCHK enabled, PULCHK disabled,
       configuration hash MD5:
       21 0F 79 D6 B3 7B B4 F6 88 20 88 DB 03 48 BD 9F
       data hash MD5: 64K
       6B EE 7D B0 A1 9D 38 F1 B1 3E 3B 0A BD 92 F5 A2>)
(   2,<2015-07-01 21:42:20.149 -0700>,<Administrator>,<X>,<proc1d>,<TOPSPIN 2.1>,
      <Start of raw data processing
       efp LB = 0.3 FT_mod = 6 PKNL = 1 PHC0 = 0 PHC1 = 0 SI = 128K 
       data hash MD5: 128K
       49 06 D4 65 85 25 AE 85 A9 75 E3 2B 95 4C AF 64>)
(   3,<2015-07-01 21:42:21.024 -0700>,<Administrator>,<X>,<proc1d>,<TOPSPIN 2.1>,
      <pk PHC0 = -84.24866 PHC1 = 0 
       data hash MD5: 128K
       CF D7 BD A6 99 31 CF BC CF 4C 12 DE 10 6E 03 E4>)
(   4,<2015-07-01 21:42:21.414 -0700>,<Administrator>,<X>,<proc1d>,<TOPSPIN 2.1>,
      <abs ABSG = 1 
       data hash MD5: 128K
       71 E5 82 57 25 3A FA F9 A8 D9 FA 96 06 5C 58 7B>)
(   5,<2015-07-01 21:42:21.508 -0700>,<Administrator>,<X>,<proc1d>,<TOPSPIN 2.1>,
      <abs ABSG = 2 
       data hash MD5: 128K
       14 C7 A2 F2 71 BD 2B 37 6A B2 40 5F F7 66 03 A7>)
(   6,<2015-07-01 21:42:21.602 -0700>,<Administrator>,<X>,<proc1d>,<TOPSPIN 2.1>,
      <abs ABSG = 3 
       data hash MD5: 128K
       07 C9 43 A6 28 12 E0 D7 D0 D4 6A 24 B7 83 38 FC>)
(   7,<2015-07-01 21:42:21.680 -0700>,<Administrator>,<X>,<proc1d>,<TOPSPIN 2.1>,
      <abs ABSG = 4 
       data hash MD5: 128K
       32 A1 18 6E DF F9 85 9E 5E 2A 86 C7 89 10 7B F6>)
(   8,<2015-07-01 21:42:21.852 -0700>,<Administrator>,<X>,<proc1d>,<TOPSPIN 2.1>,
      <abs ABSG = 5 
       data hash MD5: 128K
       7C 32 1B 24 C0 A4 F7 76 89 A0 F4 84 BC 71 63 4D>)
$$ ##END=
$$ 
$$ $$ hash MD5
$$ $$ 35 EB 19 FF 72 71 B3 45 03 66 4A BB D9 41 7E 4C
##$RELAX= 
##$RELAX= 
##$RELAX= 
##$RELAX= 
##$RELAX= 
##$RELAX= 
##$RELAX= 
##$RELAX= 
$$ Bruker specific parameters
$$ --------------------------
##$DU= <E:\>
##$EXPNO= 22
$$ [...]
##$TP07= 0
##$TPNAME0= <>
##$TPNAME1= <>
##$TPNAME2= <>
##$TPNAME3= <>
##$TPNAME4= <>
##$TPNAME5= <>
##$TPNAME6= <>
##$TPNAME7= <>
##$TPOAL= (0..7)
0.5 0.5 0.5 0.5 0.5 0.5 0.5 0.5
##$TPOFFS= (0..7)
0 0 0 0 0 0 0 0
##$TUNHIN= 0
##$TUNHOUT= 0
##$TUNXOUT= 0
##$USERA1= <user>
##$USERA2= <user>
##$USERA3= <user>
##$USERA4= <user>
##$USERA5= <user>
##$V9= 5
##$VALIST= <valist>
##$VCLIST= <CCCCCCCCCCCCCCC>
##$VD= 0
##$VDLIST= <DDDDDDDDDDDDDDD>
##$VPLIST= <PPPPPPPPPPPPPPP>
##$VTLIST= <TTTTTTTTTTTTTTT>
##$WBST= 2048
##$WBSW= 25
##$XGAIN= (0..3)
0 0 0 0
##$XL= 0
##$YL= 0
##$YMAX_a= 5555852
##$YMIN_a= -10859697
##$ZGOPTNS= <>
##$ZL1= 120
##$ZL2= 120
##$ZL3= 120
##$ZL4= 120
##$ABSF1= 14.96275
##$ABSF2= -5.595431
##$ABSG= 5
##$ABSL= 3
##$ALPHA= 0
##$AQORDER= 0
##$ASSFAC= 0
##$ASSFACI= 0
##$ASSFACX= 0
##$ASSWID= 0
##$AUNMP= <proc_prof1d_extract.lims>
##$AXLEFT= 0
##$AXNAME= <>
##$AXNUC= <1H>
##$AXRIGHT= 0
##$AXTYPE= 0
##$AXUNIT= <>
##$AZFE= 0.1
##$AZFW= 0.1
##$BCFW= 0
##$BC_mod= 0
##$BYTORDP= 0
##$COROFFS= 0
##$CY= 15
##$DATMOD= 1
##$DC= 0
##$DFILT= <>
##$DTYPP= 0
##$F1P= 0
##$F2P= 0
##$FCOR= 0.5
##$FTSIZE= 131072
##$FT_mod= 6
##$GAMMA= 0
##$GB= 0
##$INTBC= 1
##$INTSCL= 1
##$ISEN= 128
##$LB= 0.3
##$LEV0= 0
##$LPBIN= 0
##$MAXI= 10000
##$MC2= 0
##$MEAN= 0
##$ME_mod= 0
##$MI= 0
##$NCOEF= 0
##$NC_proc= -2
##$NLEV= 6
##$NOISF1= 0
##$NOISF2= 0
##$NSP= 0
##$NTH_PI= 0
##$NZP= 0
##$OFFSET= 14.96275
##$PC= 1
##$PHC0= -84.24866
##$PHC1= 0
##$PH_mod= 1
##$PKNL= yes
##$PPARMOD= 0
##$PPDIAG= 0
##$PPIPTYP= 0
##$PPMPNUM= 2147483647
##$PPRESOL= 1
##$PSCAL= 4
##$PSIGN= 0
##$PYNMP= <proc.py>
##$REVERSE= no
##$SF= 400.020008937262
##$SI= 131072
##$SIGF1= 0
##$SIGF2= 0
##$SINO= 400
##$SIOLD= 131072
##$SPECTYP= <>
##$SREGLST= <1H.CDCl3>
##$SSB= 0
##$STSI= 131072
##$STSR= 0
##$SW_p= 8223.68421052631
##$SYMM= 0
##$S_DEV= 0
##$TDeff= 65536
##$TDoff= 0
##$TI= <>
##$TILT= no
##$TM1= 0
##$TM2= 0
##$TOPLEV= 0
##$USERP1= <user>
##$USERP2= <user>
##$USERP3= <user>
##$USERP4= <user>
##$USERP5= <user>
##$WDW= 1
##$XDIM= 131072
##$YMAX_p= 331621958
##$YMIN_p= -12344
##$CURPLOT= <Network HP LaserJet P1505>
##$CURPRIN= <$Network HP LaserJet P1505>
##$DFORMAT= <normdp>
##$LAYOUT= <+/1D_H.xwp>
##$LFORMAT= <normlp>
##$PFORMAT= <normpl>
##$SURQMSG= 1
$$ End of Bruker specific parameters
$$ ---------------------------------
##NTUPLES= NMR SPECTRUM
##VAR_NAME=  FREQUENCY,     SPECTRUM/REAL,   SPECTRUM/IMAG
##SYMBOL=    X,             R,               I
##VAR_TYPE=  INDEPENDENT,   DEPENDENT,       DEPENDENT
##VAR_FORM=  AFFN,          ASDF,            ASDF
##VAR_DIM=   131072,        131072,          131072
##UNITS=     HZ,            ARBITRARY UNITS, ARBITRARY UNITS
##FACTOR=    0.0627417313425164, 1,          1
##FIRST=     8223.62146879497, 4462,         -41051
##LAST=      0,             6136,            -40108
##MIN=       0,             -12344,          0
##MAX=       8223.62146879497, 331621958,    0
$$ Real data points
##PAGE= N=1
##DATA TABLE= (X++(R..R)), XYDATA
$$ [...]
63541B29572p857o562n729n728n821n315m537m250m580n057n400n677n843n645
63527A51571m967l930k689j453o05n00j041j731k126k041j470o54j15k50q51j293
63511A25855j216p79k76J32L04J08l17n44l03K70Q57J292J594J846K164K596L034
63494A36617L286L281L092K785K422K124J977J922J913J939J752Q80o48j881j822
63479A59639o29O44J374J800K255K702L164L761M190L961L393L510M454M995M249
63464B03462L045K719L290L753L676L397L062K636K646L748N537O770P004P034
63450B61779P541Q243Q747R431J0880J3072J5478J7544J8701J8451J6898J4795
63438D21560J2636J0098O708K809n71k671l616m167m929n652n420l860j978j264
$$ y = [229572, 221715, 215153, 209424, 203696, 197875, 192560, 188023, 183773, 179193, 174136, 168736, 163059, 157216, 151571, 146604, 142674, 139985, 138532, 137927, 137427, 136386, 134655, 132529, 130488, 129018, 128364, 128249, 127999, 127148, 125855, 124639, 123860, 123584, 123716, 124020, 124128, 123811, 123267, 122964, 123234, 124091, 125383, 126977, 128823, 130987, 133583, 136617, 139903, 143184, 146276, 149061, 151483, 153607, 155584, 157506, 159419, 161358, 163110, 163990, 163342, 161461, 159639, 159010, 159654, 161028, 162828, 165083, 167785, 170949, 174710, 178900, 182861, 186254, 189764, 194218, 199213, 203462, 206507, 209226, 212516, 216269, 219945, 223342, 226404, 229040, 231686, 235434, 240971, 247741, 254745, 261779, 269320, 277563, 286310, 295741, 306621, 319693, 335171, 352715, 371416, 389867, 406765, 421560, 434196, 444294, 451002, 453811, 453240, 450569, 446953, 442786, 437857, 432205, 426785, 422925, 420947, 419683]
63424D19683k082l540m926o387q057r487j0437j1336j2369j2871j2382j1591j1354
63411C02864j1313j0507q916p424o412n471m403l510k757j618m0J315J995K338
63397B46141K754L167L471L921M706N669O789Q329J0072J1060J0777J0094J0309
63384C37259J1560J2854J3528J3821J3972J3490J1702Q580M777J089j873l810
63372D36949m779n105n074m809m416m046l732l307k675k059j897k476l678n043
63358C83853o134o953p897r209j0496j1022j0493r295p973o689n390m190l348
63345B84764k903k594k110j375o74n99j649l701n836o982o753n659m508l750l296
63330B32375k822k234j851k069k790l333l129k377j738j475j172m17N74J209J221
$$ y = [419683, 417601, 414061, 409135, 402748, 394691, 385204, 374767, 363431, 351062, 338191, 325809, 314218, 302864, 291551, 281044, 272128, 264704, 258292, 252821, 248418, 244908, 242151, 240533, 240493, 241808, 243803, 246141, 248895, 252062, 255533, 259454, 264160, 269829, 276618, 284947, 295019, 306079, 316856, 326950, 337259, 348819, 361673, 375201, 389022, 402994, 416484, 428186, 436766, 441543, 442632, 440759, 436949, 432170, 427065, 421991, 417182, 412766, 408720, 404988, 401681, 399006, 396947, 395050, 392574, 388896, 383853, 377719, 370766, 362869, 353660, 343164, 332142, 321649, 312354, 304381, 297692, 292302, 288112, 284764, 281861, 279267, 277157, 275782, 275108, 274509, 272860, 269159, 263323, 256341, 249588, 243929, 239421, 235671, 232375, 229553, 227319, 225468, 223399, 220609, 217276, 214147, 211770, 210032, 208557, 207385, 206968, 207542, 208751, 209972]
63315B09972R46Q56R56Q37L32l8L65J323J834J357N12J21N9k66o86n30kk23j545
63296B16180k795k813j976j465j623j820j607j178q10o04o59r55j104p42j48N3
63280A95934l11q54j106p03O12K461L609L102J585O61R28J526J660J552J599J580
63264B13835J308J346K181L256L499K718J841J860K909M255M984M829M522N081
63250B58424O641Q343R386R791R931R993J0198J0963J2322J3698J4689J5630J6836
63237D06845J7835J8046J7787J7861J8415J8954J9255J9475J9470J8818J7562
63226F10323J6246J5186J4339J3963J4625J6279J7919J8489J7769J6240J4483
63215G85861J2882J1420R468O179J391m041r069j3281j6856j9964k2493k4165
$$ y = [209972, 210918, 211774, 212730, 213567, 213899, 213861, 214226, 215549, 217383, 218740, 219252, 219373, 219432, 219166, 218480, 217950, 217948, 217725, 216180, 213385, 210572, 208596, 207131, 205508, 203688, 202081, 200903, 200093, 199489, 198830, 197875, 196771, 196029, 195881, 195934, 195623, 194769, 193663, 192960, 193572, 196033, 199642, 202744, 204329, 204990, 205918, 207444, 209104, 210656, 212255, 213835, 215143, 216489, 218670, 221926, 225425, 228143, 229984, 231844, 234753, 239008, 243992, 248821, 253343, 258424, 265065, 273408, 282794, 292585, 302516, 312509, 322707, 333670, 345992, 359690, 374379, 390009, 406845, 424680, 442726, 460513, 478374, 496789, 515743, 534998, 554473, 573943, 592761, 610323, 626569, 641755, 656094, 670057, 684682, 700961, 718880, 737369, 755138, 771378, 785861, 798743, 810163, 819631, 825810, 827201, 823160, 814091, 800810, 783954, 763990, 741497, 717332]
63203G17332k4728k4186k2858k1110j8964j6227j3010r833p144n006l218j455
63191E49593P14L491O391Q604R964J1174J2774J4329J5089J5097J5163J5781J6601
63178F94765J7024J6974J6807J6668J6217J5117J3603J2370J1833J1650J1081
63167H54109R612P129L714l04m265p609j0409j3146j5916j8290j9942k0941k1283
63154G42459k0739j9423j8001j6882j5622j3678j1413r769q998q383p319o115
63142E86117n388n103m619l602k433j640j197p46l45n52j497k326k070r21o7j69
63126E53442o77p99n50l24NP87J702J985J549J127J102R30J34p22o87L10J452
63109E60766K186K679L116L171K515J479P32N02N09N31O81J081J600K059K409
$$ y = [717332, 692604, 668418, 645560, 624450, 605486, 589259, 576249, 566416, 559272, 554266, 551048, 549593, 550307, 553798, 560189, 568793, 578757, 589931, 602705, 617034, 632123, 647220, 662383, 678164, 694765, 711789, 728763, 745570, 762238, 778455, 793572, 807175, 819545, 831378, 843028, 854109, 863721, 870850, 874564, 874260, 869995, 862386, 851977, 838831, 822915, 804625, 784683, 763742, 742459, 721720, 702297, 684296, 667414, 651792, 638114, 626701, 616932, 607934, 599551, 592232, 586117, 580729, 575626, 571007, 567405, 564972, 563332, 562135, 561389, 561044, 560492, 558995, 556669, 554599, 553678, 553611, 553442, 552765, 551966, 551416, 551092, 551097, 551884, 553586, 555571, 557120, 558247, 559349, 560279, 560413, 559691, 559004, 559314, 560766, 562952, 565631, 568747, 571918, 574433, 575912, 576644, 577146, 577655, 578186, 578867, 579948, 581548, 583607, 586016]
63094E86016K620K658K704L053L680M114M060L881M057M385M192L351K564K496
63080F33831L031L656M203M849N555N963N895N677N811O478P493Q660R974J1473
63066G22549J2999J4341J5535J6902J8659K0659K2627K4525K6500K8565L0541
63055I54402L2341L4095L5966L7866L9445M0261M0118L9375L8751L8638L8640
63044A369898L8066L6766L5190L3747L2513L1650L1494L1954L2197L1332K9179
63033A733986K6016K1771J6002Q687N12p829j6322k5242l4228m2164m8120n2152
63021A580917n4933n6747n7200n5885n2997m9135m4775m0149l5378l0455k5256
63010A078007j9921j4987j0820p051l021J383N750R917J4031J7775K0271K1162
$$ y = [586016, 588636, 591294, 593998, 597051, 600731, 604845, 608905, 612786, 616843, 621228, 625420, 628771, 631335, 633831, 636862, 640518, 644721, 649570, 655125, 661088, 666983, 672660, 678471, 684949, 692442, 701102, 711076, 722549, 735548, 749889, 765424, 782326, 800985, 821644, 844271, 868796, 895296, 923861, 954402, 986743, 1020838, 1056804, 1094670, 1134115, 1174376, 1214494, 1253869, 1292620, 1331258, 1369898, 1407964, 1444730, 1479920, 1513667, 1546180, 1577830, 1609324, 1641278, 1673475, 1704807, 1733986, 1760002, 1781773, 1797775, 1806462, 1806974, 1799145, 1782823, 1757581, 1723353, 1681189, 1633069, 1580917, 1525984, 1469237, 1412037, 1356152, 1303155, 1254020, 1209245, 1169096, 1133718, 1103263, 1078007, 1058086, 1043099, 1032279, 1025228, 1022207, 1023590, 1029340, 1039257, 1053288, 1071063, 1091334, 1112496]
62998A112496K1256K1634K2492K3283K3687K3833K3732K3124K1984K0738J9715
62987A357974J8636J6830J3844R750M908m18o162j2286j8636k5076l1545l7863
62975A289956m3533m7912n0667n1900n1959n1234n0032m8359m5907m2581l8955
62964G66917l5850l3493l1435k9249k6858k4250k1416j8740j6845j5797j4880
62953D98104j3491j1778j0250r148q485q250q226q024p564p125o717n985m994
62940C88067m409m447m407l757k997k687k396j651j153j817l000l129k035j233
62926C48949j684k616k960k794k725k829k900k996l094k847k282k121k769l569
62912C10763l622k907k012j306r62j214j858j960r48L81P80K25k56k43m02j172
$$ y = [1112496, 1133752, 1155386, 1177878, 1201161, 1224848, 1248681, 1272413, 1295537, 1317521, 1338259, 1357974, 1376610, 1393440, 1407284, 1417034, 1421942, 1421524, 1415362, 1403076, 1384440, 1359364, 1327819, 1289956, 1246423, 1198511, 1147844, 1095944, 1043985, 992751, 942719, 894360, 848453, 805872, 766917, 731067, 697574, 666139, 636890, 610032, 585782, 564366, 545626, 528781, 512984, 498104, 484613, 472835, 462585, 453437, 444952, 436702, 428476, 420452, 412888, 405763, 399046, 393061, 388067, 383658, 379211, 374804, 371047, 368050, 365363, 362967, 361316, 360163, 358346, 355346, 352217, 350182, 348949, 347265, 344649, 341689, 338895, 336170, 333341, 330441, 327445, 324351, 321504, 319222, 317101, 314332, 310763, 307141, 304234, 302222, 300916, 299954, 298740, 296882, 294922, 293974, 294355, 295135, 295360, 295104, 294861, 294459, 293287]
62896B93287j947j937j199m49k04m70q49q01p1Q57J138N59j56k26K95P24N65j07
62878B89009q76j313j254q61l93Q0N75Q65O43J24mN48J191J178N40l7r6J81K85
62859B90385j31j000j830k057j669j280j372j676j663j331j057q44m21qk46j187
62843B72613j972j927j402j082r75o60j28K60M93R00J463J753J645J522J599J562
62827B75664J121N92O08J450K795L961M333L811K994K651K928L330L496L613L999
62812C17346M622N304N946O385O417O233O435P229Q118Q754R658J1501J4041J6373
62798D34362J8039J9207K0131K1129K2944K6154L0219L3950L7071M0519M4961
62787G48686M9881N4524N8860O2989O6351O8325O9085O9034O7728O4295N8743
$$ y = [293287, 291340, 289403, 288204, 287755, 287551, 287081, 286232, 285431, 285360, 286217, 287355, 287914, 287758, 287532, 287827, 288551, 289116, 289009, 288133, 286820, 285566, 284705, 284312, 284392, 284967, 285832, 286475, 286599, 286595, 287143, 288334, 289512, 290052, 290015, 289919, 290100, 290385, 290254, 289254, 287424, 285367, 283698, 282418, 281046, 279370, 277707, 276376, 275319, 274475, 274054, 274046, 273800, 272613, 270641, 268714, 267312, 266230, 265255, 264595, 264467, 264727, 265220, 266120, 267583, 269336, 270981, 272503, 274102, 275664, 276785, 277377, 277985, 279435, 282230, 286191, 290524, 294335, 297329, 299980, 302908, 306238, 309734, 313347, 317346, 321968, 327272, 333218, 339603, 346020, 352253, 358688, 365917, 374035, 382789, 392447, 403948, 417989, 434362, 452401, 471608, 491739, 512868, 535812, 561966, 592185, 626135, 663206, 703725, 748686, 798567, 853091, 911951, 974940, 1041291, 1109616, 1178701, 1247735, 1315463, 1379758, 1438501]
62776A438501N1965M4390L5465K4705J2594J34j1935k3174l3218m1963m9649n6336
62764A391479o1543o4752o6117o6220o5296o3176o0019n6597n3604n0962m8057
62753G35136m4543m0680l6952l3638l0744k8149k5679k3174k0565j7910j5355
62742D17747j3110j1416j0357r668q862p748o625n895n506m971l884k296o51N49
62728C27307J060J084J200J923L326N123O999Q684R844J0301J0432J1011J2490
62715D10784J4614J6863J9056K1330K3791K6390K9044L1683L4328L7243M0800
62704G05926M4867M8553N0868N1657N1541N1002M9840M7527M3700L8157L0811
62693A214449K1919J2209K425p106j6295k4873l2442l8851m4178m8319n0969n2079
$$ y = [1438501, 1490466, 1534856, 1570321, 1595026, 1607620, 1607754, 1595819, 1572645, 1539427, 1497464, 1447815, 1391479, 1329936, 1265184, 1199067, 1132847, 1067551, 1004375, 944356, 887759, 834155, 783193, 735136, 690593, 649913, 612961, 579323, 548579, 520430, 494751, 471577, 451012, 433102, 417747, 404637, 393221, 382864, 373196, 364334, 356586, 349961, 344066, 338560, 333589, 329705, 327409, 326758, 327307, 328367, 329451, 330651, 332574, 335900, 341023, 348022, 356706, 366550, 376851, 387283, 398294, 410784, 425398, 442261, 461317, 482647, 506438, 532828, 561872, 593555, 627883, 665126, 705926, 750793, 799346, 850214, 901871, 953412, 1004414, 1054254, 1101781, 1145481, 1183638, 1214449, 1236368, 1248577, 1251002, 1243896, 1227601, 1202728, 1170286, 1131435, 1087257, 1038938, 987969, 935890]
62681I35890n2032n1245m9812m7729m5175m2344l9197l5675l2114k9106k6889
62670D84572k5048k2937k0251j7301j4802j3313j2714j2248j1278r838q355p037
62658C09450n905n194n181n594n782n538n265n147m813m031l208k692k170j307
62644B47623n61o08j259j634j332q27o32p49r56j158j240j064p91p75j026j040
62628B31971l94P04J602J817J445J104J362K137K833L242L876N045O079O182N734
62613B74739N933P224Q916J0426J1958J3800J5722J7525J9443K1633K3863K6045
62601D57227K8447L1089L3458L5206L6378L6617L5049L1518K7198K3174J9101
62590G94462J4118Q391K733k834q842j4928j9833k3034k5342k7547k9385l0254
$$ y = [935890, 883858, 832613, 782801, 735072, 689897, 647553, 608356, 572681, 540567, 511461, 484572, 459524, 436587, 416336, 399035, 384233, 370920, 358206, 345958, 334680, 324842, 316487, 309450, 303545, 298351, 293170, 287576, 281794, 276256, 270991, 265844, 261031, 257000, 253792, 251100, 248930, 247623, 247062, 246454, 245195, 243561, 242229, 241402, 240770, 240021, 239065, 237907, 236667, 235603, 234812, 234037, 233011, 231971, 231577, 232281, 233883, 235700, 237145, 238249, 239611, 241748, 244581, 247823, 251699, 256744, 262823, 269005, 274739, 280672, 287896, 296812, 307238, 319196, 332996, 348718, 366243, 385686, 407319, 431182, 457227, 485674, 516763, 550221, 585427, 621805, 658422, 693471, 724989, 752187, 775361, 794462, 808580, 816971, 819704, 816870, 808028, 793100, 773267, 750233, 724891, 697344, 667959, 637705]
62578F37705l0186k9575k8479k6776k4762k3041k1856k0793j9245j7112j4937
62567C80943j3257j1897j0213q136o467n815n754n550n300n583o285o636o329
62554B83721n827n417m837m001l287k835k279j541j250j798k506k350j197J91
62540B44787J181J768K231K697L170L665M311N256O455P554Q304R052J0431J2493
62526C23355J4605J6404J8265K0552K2886K4727K6230K7891K9549L0447L0310
62515E85221K9692K9030K7803K5083K0643J5252R836M603q14o561j2102j6705
62503G10981k0232k3101k5510k7017k7114k5994k4510k3381k2647k1874k0692
62492D48909j9136j7384j5386j2909j0158q035p307p546p483o502n318m801m706
$$ y = [637705, 607519, 577944, 549465, 522689, 497927, 474886, 453030, 432237, 412992, 395880, 380943, 367686, 355789, 345576, 337440, 330973, 325158, 319404, 313854, 308554, 302971, 296686, 290050, 283721, 277894, 272477, 267640, 263639, 260352, 257517, 255238, 253697, 252447, 250649, 248143, 245793, 244596, 244787, 245968, 247736, 249967, 252664, 255834, 259499, 263810, 269066, 275521, 283075, 291379, 300431, 310862, 323355, 337960, 354364, 372629, 393181, 416067, 440794, 467024, 494915, 524464, 554911, 585221, 614913, 643943, 671746, 696829, 717472, 732724, 742560, 747163, 746349, 739788, 727686, 710981, 690749, 667648, 642138, 615121, 588007, 562013, 537503, 514122, 491475, 469601, 448909, 429773, 412389, 397003, 384094, 373936, 365901, 358594, 351048, 343565, 337063, 331745, 326944, 322238]
62479C22238m171l116k385k488k840k582j639o47q3J65M27Q62J442K142K969L809
62463C14103M432M639M439M050L791L998M919O459Q058Q948Q753P757O513N276
62449C96135L806J818n60k738m151m830n426o531p977q950q915q271p962q442
62435C27006r133q984p500n209l163k103k067k551k826k259p91Q58J756J771J645
62420B86450J882K072J712J311J878L462M941N413N149M929N019N234N518N957
62406C40927O407O570O379N981N480M942M544M431M425M152L489K687K102J879
62392D04395J905J884J575J054P76J174K166L242M059M894O332Q475J0730J2491
62378D65152J3890J5520J7485J9291K0745K2405K4710K7127K8762K9451K9576
$$ y = [322238, 318067, 314951, 312566, 310078, 307238, 304656, 303017, 302370, 302287, 302452, 302879, 303741, 305183, 307325, 310294, 314103, 318535, 323174, 327613, 331663, 335454, 339452, 344371, 350830, 358888, 367836, 376589, 384346, 390859, 396135, 399941, 401759, 401199, 398461, 394310, 389480, 384054, 377523, 369546, 360596, 351681, 343410, 335448, 327006, 317873, 308889, 301389, 296180, 293017, 290914, 288847, 286296, 283470, 281211, 280420, 281278, 283034, 284805, 286450, 288332, 290404, 292116, 293427, 295305, 298767, 303708, 309121, 314270, 319199, 324218, 329452, 334970, 340927, 347334, 353904, 360283, 366264, 371744, 376686, 381230, 385661, 390086, 394238, 397727, 400414, 402516, 404395, 406300, 408184, 409759, 410813, 411589, 412763, 414929, 418171, 422230, 427124, 433456, 441931, 452661, 465152, 479042, 494562, 512047, 531338, 552083, 574488, 599198, 626325, 655087, 684538, 714114]
62367G14114K9114K7602K5011K1821J8283J4328J0244O611L446K78k754m897o197
62354H57004p903j0780j3927j6056j7147j8020j8938j9603k0006k0241j9852j8405
62342F56126j6518j5312j4949j4592j3713j2586j1547j0683j0274j0575j1092
62331E14285j0886r855q884q561q509q155p381o210m593k875j674j026l49M54
62317D35781P56M53N21J670L202L942L724L143K451J605J015J240K025K462K142
62302D66132J483R73P41Q41J328J911K087J821J637J949K628L324L788L852L521
62287D98016L192L439M333N317N896O201O731P781R291J1019J2678J4078J5266
62274F03238J6511J8123K0317K3112K6115K8492K9534K9356K8699K7973K6758
$$ y = [714114, 743228, 770830, 795841, 817662, 835945, 850273, 860517, 867128, 870574, 870852, 868098, 863201, 857004, 849101, 838321, 824394, 808338, 791191, 773171, 754233, 734630, 714624, 694383, 674531, 656126, 639608, 624296, 609347, 594755, 581042, 568456, 556909, 546226, 535952, 525377, 514285, 503399, 493544, 484660, 476099, 467590, 459435, 452054, 445844, 441251, 438376, 436702, 435676, 435327, 435781, 436537, 436990, 437511, 439181, 442383, 446325, 450049, 453192, 455643, 457248, 458263, 459503, 461528, 463990, 466132, 467615, 468588, 469329, 470170, 471498, 473409, 475496, 477317, 478954, 480903, 483531, 486855, 490643, 494495, 498016, 501208, 504647, 508980, 514297, 520193, 526394, 533125, 540906, 550197, 561216, 573894, 587972, 603238, 619749, 637872, 658189, 681301, 707416, 735908, 765442, 794798, 823497, 851470, 878228]
62263H78228K4395K0825J6650J2575Q979N791K644p46m147o977r101j1172j3869
62250I24075j6943j9399k0595k0772k0466j9792j8465j6354j3817j1569j0203
62239G35700r670r186p917n847l840k735k602k954l294l297k794k036j682k094
62225F75752k765k932k639k611l054l284k754j884j408j450j684j985k347k419
62211F42536j803o65M81J503K575L474L614K991K430K644L532M679O019P512Q599
62196F90121Q643P848P204P417Q203Q812Q936Q920R171R631J0000J0325J1094
62183H06325J2602J4505J6257J7837J9598K1470K2806K3135K2617K1522J9723
62172A018397J7086J4050J1338R228P414N527L453J292p24k356l678n174p146
$$ y = [878228, 902623, 923448, 940098, 952673, 961652, 967443, 970087, 969341, 965194, 958217, 949116, 937944, 924075, 907132, 887733, 867138, 846366, 825900, 806108, 787643, 771289, 757472, 745903, 735700, 726030, 716844, 708927, 703080, 699240, 696505, 693903, 690949, 687655, 684358, 681564, 679528, 677846, 675752, 672987, 670055, 667416, 664805, 661751, 658467, 655713, 653829, 652421, 650971, 649287, 647302, 644955, 642536, 640733, 640068, 640549, 642052, 644627, 648101, 651715, 654706, 657136, 659780, 663312, 667991, 674010, 681522, 690121, 698764, 706612, 713816, 721233, 729436, 738248, 747184, 756104, 765275, 774906, 784906, 795231, 806325, 818927, 833432, 849689, 867526, 887124, 908594, 931400, 954535, 977152, 998674, 1018397, 1035483, 1049533, 1060871, 1070099, 1077513, 1083040, 1086493, 1087785, 1087061, 1084705, 1081027, 1075853, 1068707]
62159A068707r113j0273j0524j0578j0893j1005j0238q704p125n876m735l619
62147I66024l043l482m574n371n386n037n023n535o238o810p137p154o789o127
62133H88318n424m910m682m712m800m602l944l102k547k425k544k794l225l648
62119H34959l637l127k650k760l411m098m413m252l763l296l223l580m045m338
62105G84366m413m236l762l237l009k887k262j167n17p75j091n11N45J021R94
62090G59059J479K626L413L391L454M352N483N957O065O749Q184R685J0813J1656
62076H42366J2127J1721J0116P580M634J721q67l023m864o501p836q781r554j0491
62062H38348j1650j2850j3977j4964j5658j5983j6085j6049j5655j4805j3897
$$ y = [1068707, 1059594, 1049321, 1038797, 1028219, 1017326, 1006321, 996083, 987379, 980254, 974378, 969643, 966024, 962981, 959499, 954925, 949554, 944168, 939131, 934108, 928573, 922335, 915525, 908388, 901234, 894445, 888318, 882894, 877984, 873302, 868590, 863790, 859188, 855244, 852142, 849595, 847170, 844626, 841832, 838607, 834959, 831322, 828195, 825545, 822785, 819374, 815276, 810863, 806611, 802848, 799552, 796329, 792749, 788704, 784366, 779953, 775717, 771955, 768718, 765709, 762822, 760560, 759393, 758876, 758101, 757010, 756499, 757044, 758065, 759059, 760538, 763164, 766577, 769968, 773422, 777774, 783257, 789214, 795279, 802028, 810212, 819897, 830710, 842366, 854493, 866214, 876330, 883910, 888544, 890265, 889398, 886375, 881511, 875010, 867174, 858393, 848839, 838348, 826698, 813848, 799871, 784907, 769249, 753266, 737181, 721132, 705477, 690672, 676775]
62051F76775j3324j2815j1853j0595r644q966p839o119m735m460m838m901m515
62038E72171m348m753n346n602n361m749m020l530l484l704l908m180m694n109
62024E09383m771l664k664k519l014l426l528l654l928l927l244k111j262j239
62010D66432j858k356k078j079mN84N99K21m29j142j494j294j092j704l130m313
61994D45863m273l248k431k665l671m443m214l027j594o89m84m97j57N91J316
61979D16377J692J832K039K442K953L447L809L947L956M160M753N447N779N795
61965D68428O120P097Q242Q897R215R923J1154J2145J2367J2311J2716J3433J3781
61952F05829J3796J4328J5908J8133K0293K1977K2902K2887K2447K2794K4497
$$ y = [676775, 663451, 650636, 638783, 628188, 618544, 609578, 601739, 595620, 590885, 586425, 581587, 576686, 572171, 567823, 563070, 557724, 552122, 546761, 542012, 537992, 534462, 530978, 527274, 523366, 519186, 514492, 509383, 504612, 500948, 498284, 495765, 492751, 489325, 485797, 482143, 478215, 474288, 471044, 468933, 467671, 466432, 464574, 462218, 460140, 459061, 459057, 459641, 460240, 460461, 460032, 458890, 457396, 456102, 455010, 453306, 450176, 445863, 441590, 438342, 435911, 433246, 429575, 425132, 420918, 417891, 416297, 415608, 415124, 414627, 414470, 415061, 416377, 418069, 419901, 421940, 424382, 427335, 430782, 434591, 438538, 442494, 446654, 451407, 456854, 462633, 468428, 474548, 481645, 489887, 498784, 507999, 517922, 529076, 541221, 553588, 565899, 578615, 592048, 605829, 619625, 633953, 649861, 667994, 688287, 710264, 733166, 756053, 778500, 801294, 825791]
61941H25791K6636K7856K8056K8222K8953K9998L1214L2933L5106L7032L8528
61930A170325M0677M4592M9907N5271O0127O5193P1252P8289Q5966R4249J03175
61919A919023J12493J21987J31797J41989J52081J61424J69876J77600J84236
61910C272506J88787J90363J88555J82874J72293J55858J33601J06413P5129M0275
61900D706654K870l4937p0552j02208j29384j52096j70143j83151j91095j94465
61890C481493j93916j89917j82852j73413j62683j51731j41098j30801j20749
61881B034333j10976j01471r2136q3090p4801o7590o1145n4957m9117m4240m0450
61870A254360l6921l2793k8209k4083k0960j8567j6334j3915j1193q234n425l301
$$ y = [825791, 852427, 880283, 908339, 936561, 965514, 995512, 1026726, 1059659, 1094765, 1131797, 1170325, 1211002, 1255594, 1305501, 1360772, 1420899, 1486092, 1557344, 1635633, 1721599, 1815848, 1919023, 2031516, 2153503, 2285300, 2427289, 2579370, 2740794, 2910670, 3088270, 3272506, 3461293, 3651656, 3840211, 4023085, 4195378, 4351236, 4484837, 4591250, 4666379, 4706654, 4709524, 4674587, 4604035, 4501827, 4372443, 4220347, 4050204, 3867053, 3675958, 3481493, 3287577, 3097660, 2914808, 2741395, 2578712, 2426981, 2285883, 2155082, 2034333, 1923357, 1821886, 1729750, 1646660, 1571859, 1504269, 1443124, 1388167, 1339050, 1294810, 1254360, 1217439, 1184646, 1156437, 1132354, 1111394, 1092827, 1076493, 1062578, 1051385, 1043151, 1037726, 1034425]
61858A034425j965r30K25J306J844J807J582J360R48K61l88o78o67n72m31k10
61842A037917o0j17m0P54K310L815M387M027L543L621M126M389L976L118K472
61827A078238K532L190L932M410M803N487O567P881R473J1614J4277J6905J8977
61814A188286K0680K2689K5421K8689L2005L4935L7306L9429M2080M5874N0491
61803A567885N4986N9023O3349O8775P5096Q1540Q7954R5056J03521J13362J24225
61792B494772J35840J48117J61181J75378J90837K07015K23122K39129K55763
61783D231154K73236K90513L06136L19238L29184L34660L33854L25343L08253
61774G051571K81784K45383J99445J45321Q4680J9538m7072j11366j70229k21948
$$ y = [1034425, 1032460, 1031530, 1031755, 1033061, 1034905, 1036712, 1038294, 1039654, 1040602, 1040863, 1040475, 1039797, 1039130, 1038558, 1038127, 1037917, 1037857, 1037740, 1037700, 1038454, 1040764, 1044579, 1048966, 1052993, 1056536, 1060157, 1064283, 1068672, 1072648, 1075766, 1078238, 1080770, 1083960, 1087892, 1092302, 1097105, 1102592, 1109159, 1117040, 1126513, 1138127, 1152404, 1169309, 1188286, 1208966, 1231655, 1257076, 1285765, 1317770, 1352705, 1390011, 1429440, 1471520, 1517394, 1567885, 1622871, 1681894, 1745243, 1814018, 1889114, 1970654, 2058608, 2153664, 2257185, 2370547, 2494772, 2630612, 2778729, 2939910, 3115288, 3306125, 3513140, 3736262, 3975391, 4231154, 4504390, 4794903, 5101039, 5420277, 5749461, 6084121, 6417975, 6743318, 7051571, 7333355, 7578738, 7778183, 7923504, 8008184, 8027722, 7980650, 7869284, 7699055, 7477107]
61764G477107k65395k99261l22707l36349l41875l40867l34412l23550l09441
61755D603250k93055k75054k56078k36890k18291k01008j85492j71539j58375
61746B607468j45492j33196j22010j11817j02161r3185q5537p9306p3747o8264
61736A592753o3081n8584n4572n0608m6672m2999l9561l6218l3129l0525k8209
61725A108595k5824k3517k1774k0562j9235j7604j6472j6572j7325j7369j6250
61714H96091j4910j4342j4405j4359j4092j4043j4201j3864j2598j0869r549r080
61702G39779r342r867j0016r376q305p664p725p804p323o723o674o868o460n489
61688F30143m846m869m894m511m291m807n702o348o835p613q548r039q868q318
$$ y = [7477107, 7211712, 6912451, 6589744, 6253395, 5911520, 5570653, 5236241, 4912691, 4603250, 4310195, 4035141, 3779063, 3542173, 3323882, 3122874, 2937382, 2765843, 2607468, 2461976, 2328780, 2206770, 2094953, 1992792, 1899607, 1814070, 1734764, 1661017, 1592753, 1529672, 1471088, 1416516, 1365908, 1319236, 1276237, 1236676, 1200458, 1167329, 1136804, 1108595, 1082771, 1059254, 1037480, 1016918, 997683, 980079, 963607, 947035, 929710, 912341, 896091, 881181, 866839, 852434, 838075, 823983, 809940, 795739, 781875, 769277, 758408, 748859, 739779, 730437, 720570, 710554, 701178, 692873, 685209, 677484, 669680, 662357, 655634, 648960, 642092, 635632, 630143, 625297, 620428, 615534, 611023, 606732, 601925, 596223, 589875, 583040, 575427, 566879, 557840, 548972, 540654]
61674E40654p685p162p049p406p649p103n965n122n001n131n010m797m813m883
61660D55878m594l999l602l707m107m357m183l523k456j249m16m54j347k449k976
61645D12459k694j978j273p53n27p42j233j430r96l50j98o51j181j327j080p13
61629C95333n80r79j718j957j077L55J103Q07L43M08N69J43o78j255j585k130
61613C87102k801k892k070q28J04L72J8n98q99n76n1j7m42n64K0Q29J287J485
61595C79479J762K047K106K137K528L236L886M390M953N577N983O086O122O258
61581D36550O502O922P584Q243Q619R010J0106J1993J3861J5024J5700J6512J7678
61568E84304J9151K1011K3056K4354K4047K2515K0998J9994J8720J6364J3236
$$ y = [540654, 532969, 525807, 518758, 511352, 503703, 496600, 490635, 485513, 480512, 475381, 470371, 465574, 460761, 455878, 451284, 447285, 443683, 439976, 435869, 431512, 427329, 423806, 421350, 420101, 419685, 419231, 417884, 415435, 412459, 409765, 407787, 406514, 405761, 405234, 404492, 403259, 401829, 400833, 400483, 400285, 399634, 398453, 397126, 396046, 395333, 394753, 393774, 392056, 390099, 389022, 389377, 390480, 391287, 391630, 392038, 392607, 392750, 392072, 390817, 389232, 387102, 384301, 381409, 379339, 378511, 378615, 378987, 379005, 378407, 377508, 376932, 376881, 376864, 376422, 375858, 375878, 376707, 377994, 379479, 381241, 383288, 385394, 387531, 390059, 393295, 397181, 401571, 406524, 412101, 418084, 424170, 430292, 436550, 443052, 449974, 457558, 465801, 474420, 483430, 493536, 505529, 519390, 534414, 550114, 566626, 584304, 603455, 624466, 647522, 671876, 695923, 718438, 739436, 759430, 778150, 794514, 807750]
61557H07750J0329Q218O758N584M503L585L009K707K156R28m71q34L64K244L515
61542H60345L804L572L172K534J588M03r79k395l315l279k575k054k195k709l020
61527H52897k746j779l42R92J842K659M357P189J0366J3003J4921J6399J7662
61514I37420J8949K0726K3389K6896L0893L5114L9418M3727M8143N2888N8028
61503A335591O3407O9013P4999Q1168Q6848R1541R5345R8407J00363J00790R9788
61492B297260R7547R3657Q7528P9361P0047O0125M9483L8176K6830J6086O163
61481B922263k793j0457j6652k1507k5044k7183k8458l0104l2909l6390l9692
61470B651074m2860m6550n0687n4267n6541n7594n7584n6153n3120m9171m5286
$$ y = [807750, 818079, 826297, 833055, 838639, 843142, 846727, 849736, 852443, 854599, 855527, 855056, 854222, 854586, 856830, 860345, 864149, 867721, 870893, 873427, 875015, 875418, 874439, 872044, 868729, 865450, 862875, 860821, 858626, 855917, 852897, 850151, 848372, 848030, 849022, 850864, 853523, 857880, 865069, 875435, 888438, 903359, 919758, 937420, 956369, 977095, 1000484, 1027380, 1058273, 1093387, 1132805, 1176532, 1224675, 1277563, 1335591, 1398998, 1468011, 1543010, 1624178, 1711026, 1802567, 1897912, 1996319, 2096682, 2197472, 2297260, 2394807, 2488464, 2575992, 2655353, 2725400, 2785525, 2835008, 2873184, 2900014, 2916100, 2922263, 2919470, 2909013, 2892361, 2870854, 2845810, 2818627, 2790169, 2760065, 2727156, 2690766, 2651074, 2608214, 2561664, 2510977, 2456710, 2400169, 2342575, 2284991, 2228838, 2175718, 2126547, 2081261]
61459B081261m1626l7515l2413k6512k0419j4661r546n162j270K578O695J1050
61447A912460J5385J9402K2892K6002K9343L3577L8693M3891M8152N0746N1163
61436B291706M8966M4015L6646K7498J7428P697k81n789r128j0766j0625q737
61424B428630o092l897k196k04K139M111N814Q402J1965J4354J3213Q356J049
61411B485644q180j9399l1228m0760m6038m7482m6523m3933m0089l5805l1879
61400B094328k8309k4683k1023j7720j4964j2711j0812q775n953k504L97K034
61388A949305L435O352J1145J6589K1625K6435L1644L7389M3493M9983N6915O4068
61376B318378P1120P7823Q3882Q8965R3059R6411R8847R9514R7643R3278Q6920
$$ y = [2081261, 2039635, 2002120, 1969707, 1943195, 1922776, 1908115, 1898569, 1893407, 1892137, 1894715, 1901410, 1912460, 1927845, 1947247, 1970139, 1996141, 2025484, 2059061, 2097754, 2141645, 2189797, 2240543, 2291706, 2340672, 2384687, 2421333, 2448831, 2466259, 2473956, 2473675, 2467886, 2458758, 2447992, 2437367, 2428630, 2422538, 2418641, 2416445, 2416241, 2418380, 2422491, 2428305, 2436707, 2448672, 2463026, 2476239, 2484595, 2485644, 2477464, 2458065, 2426837, 2386077, 2340039, 2292557, 2246034, 2202101, 2162012, 2126207, 2094328, 2066019, 2041336, 2020313, 2002593, 1987629, 1974918, 1964106, 1955331, 1949378, 1946874, 1947271, 1949305, 1952740, 1959092, 1970237, 1986826, 2008451, 2034886, 2066530, 2103919, 2147412, 2197395, 2254310, 2318378, 2389498, 2467321, 2551203, 2640168, 2733227, 2829638, 2928485, 3027999, 3125642, 3218920, 3305840]
61365C305840P8579O7619N3559L6836J8774Q97j5740l0784m4250n6140o6423p5179
61353C273588q2486q8146r1901r4033r5373r6518r7142r6360r3659q9389q4408
61342B264173p9397p4444o9282o3820n8330n2996m7507m1500l5246k9494k4578
61331A687579k0095j5579j1028o576k042K836P907J2660J6601J9504K1459K2729
61319A735955K3292K2554J9997J6127J2235R057O359M136L219L987N289N713N438
61306A873358N721O839P816Q169Q619R753J1016J1616J1441J0568Q720N945L213
61293A982794J457M47o78k152l625n100o946r040j0705j1602j1992j2038j1498
61280A899322j0271q742p257n802m442l679m002n288p022q868j0760j2502j3665
$$ y = [3305840, 3384419, 3452038, 3505597, 3542433, 3561207, 3562104, 3546364, 3515580, 3471330, 3415190, 3348767, 3273588, 3191102, 3102956, 3011055, 2917022, 2821649, 2725131, 2627989, 2531629, 2437970, 2348581, 2264173, 2184776, 2110332, 2041050, 1977230, 1918900, 1865904, 1818397, 1776897, 1741651, 1712157, 1687579, 1667484, 1651905, 1640877, 1634301, 1632259, 1635095, 1643002, 1655662, 1672263, 1691767, 1713226, 1735955, 1759247, 1781801, 1801798, 1817925, 1830160, 1839217, 1845576, 1849712, 1852931, 1856918, 1862207, 1867920, 1873358, 1879079, 1885918, 1893734, 1901903, 1910522, 1920275, 1931291, 1942907, 1954348, 1964916, 1973636, 1979581, 1982794, 1984251, 1984698, 1984020, 1981868, 1978243, 1973143, 1966197, 1957157, 1946452, 1934850, 1922858, 1910820, 1899322, 1889051, 1880309, 1873052, 1867250, 1862808, 1859129, 1855127, 1849839, 1842817, 1833949, 1823189, 1810687, 1797022]
61267A797022j3892j3214j2005j0615r101p263n018k631m33J611L852O486R391
61254A744190J2482J5856J9490K3019K6139K9075L2476L6900M2613M9614N7551
61243B089405O5526P2301P6758P8045P5290O7667N5091L8773K0851L337j2476
61232B630568k5915l6642m4713n0554n4568n6783n7045n5453n2307m7749m1767
61221B107072l4623k7006j9730j3612r790r521j3193j9650k6924l3565l8940m2608
61209A817910m4131m3727m2415m1079l9627l7440l4324l0653k6758k2782j9048
61198A435926j6091j4093j2631j1288j0324j0408j1682j3315j4148j3748j2759
61187A295439j2196j2472j3203j3834j4203j4438j4644j4854j5122j5324j5084
$$ y = [1797022, 1783130, 1769916, 1757911, 1747296, 1738195, 1730932, 1725914, 1723283, 1722850, 1724461, 1728313, 1734799, 1744190, 1756672, 1772528, 1792018, 1815037, 1841176, 1870251, 1902727, 1939627, 1982240, 2031854, 2089405, 2154931, 2227232, 2303990, 2382035, 2457325, 2524992, 2580083, 2618856, 2639707, 2643044, 2630568, 2604653, 2568011, 2523298, 2472744, 2418176, 2361393, 2304348, 2248895, 2196588, 2148839, 2107072, 2072449, 2045443, 2025713, 2012101, 2002311, 1992790, 1979597, 1959947, 1933023, 1899458, 1860518, 1817910, 1773779, 1730052, 1687637, 1646558, 1606931, 1569491, 1535167, 1504514, 1477756, 1454974, 1435926, 1419835, 1405742, 1393111, 1381823, 1371499, 1361091, 1349409, 1336094, 1321946, 1308198, 1295439, 1283243, 1270771, 1257568, 1243734, 1229531, 1215093, 1200449, 1185595, 1170473, 1155149, 1140065]
61176A140065j4216j3165j2547j2276j1587j0074q175o439m816l075j553r19j417
61163A039806k883n294q713j2696j6430j9536k2228k4487k5749k5707k4846k3787
61151H27450k2559k0986j9335j8021j6991j6013j5333j5315j5506j4862j3117
61140F39412j1278j0473j0735j1210j1111j0178q602o876n574m807m063k824j215
61127E40466J96J193K206L778N948Q181R794J0421J0055Q756O446L224k14k847
61113F07603m186m642m904n137m959m114k910k015j879k307k616k369j867j762
61099E61936k206k714k859k711k511k328k270k614l438m391n103n532n665n330
61085E12264m593m014m027m386m618m699m772m612m060l651l991m627m459l361
$$ y = [1140065, 1125849, 1112684, 1100137, 1087861, 1076274, 1066200, 1058025, 1051586, 1046770, 1043695, 1042142, 1041223, 1039806, 1036923, 1031629, 1022916, 1010220, 993790, 974254, 952026, 927539, 901790, 876083, 851237, 827450, 804891, 783905, 764570, 746549, 729558, 713545, 698212, 682897, 667391, 652529, 639412, 628134, 617661, 606926, 595716, 584605, 574427, 565825, 558949, 553375, 548568, 544505, 541681, 540466, 540662, 541855, 544061, 547839, 553787, 561968, 571762, 582183, 592238, 600994, 607440, 610664, 610450, 607603, 603417, 598775, 593871, 588734, 583775, 579661, 576751, 574736, 572857, 570550, 567934, 565565, 563698, 561936, 559730, 557016, 554157, 551446, 548935, 546607, 544337, 541723, 538285, 533894, 528791, 523259, 517594, 512264, 507671, 503657, 499630, 495244, 490626, 485927, 481155, 476543, 472483, 468832, 464841, 460214, 455755, 452394]
61071D52394k460k497k830k570j912j592j563j145l05J49k47r11j008m97l1j27
61055D32848p01j309j580j436j099q77q43p65m58j25j67n98r14o79k8N97J026
61038D22892J351J564J595J633J965K449K721K984L894N443O654O987P361Q942
61024D78435J1478J3687J5100J6509J8602K1218K4153K7789L2519L8330M5300
61013G43120N3665O2663O9745P1717O6570N4226L6362J6422p29j0564j1336m951
61001A146910M334J1946J4218Q858m484k3466m3138n7857o4370o3429n8217n1223
60989H20082m3049l3905k4996j7719j2248p754l783o64J285K317K960L565M225
60976F90316M767M887M517L946L388K661J632O56J31j89q93k036l057l616m015
$$ y = [452394, 449934, 447437, 444607, 442037, 440125, 438533, 436970, 435825, 435520, 435669, 435422, 434511, 433503, 433006, 432975, 432848, 432147, 430838, 429258, 427822, 426723, 425846, 425003, 424238, 423780, 423655, 423488, 422890, 421976, 421297, 421269, 421866, 422892, 424243, 425807, 427402, 429035, 431000, 433449, 436170, 439154, 443048, 448491, 455145, 462132, 469493, 478435, 489913, 503600, 518700, 535209, 553811, 575029, 599182, 626971, 659490, 697820, 743120, 796785, 859448, 929193, 1000910, 1067480, 1121706, 1158068, 1174490, 1173761, 1163197, 1151861, 1146910, 1151244, 1163190, 1177408, 1186266, 1181782, 1158316, 1115178, 1057321, 992951, 929522, 871305, 820082, 777033, 743128, 718132, 700413, 688165, 680411, 676628, 675964, 677249, 679566, 682526, 686091, 690316, 695083, 699970, 704487, 708433, 711821, 714482, 716114, 716770, 716901, 716712, 715819, 713783, 710726, 707110, 703095]
60961G03095m735n824o892p457p365p008p041p737q818j0061j1613j3319j4268
60948E90957j3710j2109j0533r240p641n622l833k512j018J117L425N300O771
60935E41352P856P920O560M716L892M300M661L981K745J994J796J320J77r73j388
60920E90909j374j907l258m508m776m433m604n663o762o989o347n461m734m112
60906E25981l412k526j544r60j396k865m447n121m798m251m113m370m759n177
60892D76242n491n321m400l068k076j773j690j094Q0J087J241P00K50M24J012
60877D56123J393J136L35m87p47k96M54Q88P30J17o10j134j255j049p76n04n5
60860D54263M89N88J7n43k92M50O04j23q67r84q88j139j534j742k193l447n067
$$ y = [703095, 698360, 692536, 685644, 678187, 670822, 663814, 656773, 649036, 640218, 630157, 618544, 605225, 590957, 577247, 565138, 554605, 545365, 537724, 532102, 528269, 525757, 524739, 525856, 529281, 534581, 541352, 549208, 557128, 563688, 568404, 572296, 576596, 581257, 585238, 587983, 589977, 591773, 593093, 593270, 592297, 590909, 589535, 587628, 584370, 579862, 575086, 570653, 566049, 560386, 553624, 546635, 540288, 534827, 530093, 525981, 522569, 520043, 518499, 517539, 516143, 513278, 508831, 503710, 498912, 494661, 490548, 486178, 481419, 476242, 470751, 465430, 461030, 457962, 455886, 454113, 452423, 451329, 451409, 452496, 453737, 454437, 454687, 455111, 456123, 457516, 458652, 458987, 458500, 457753, 457457, 457911, 458799, 459529, 459646, 459036, 457902, 456647, 455598, 454822, 454318, 454263, 454752, 455340, 455357, 454814, 454522, 454972, 455576, 455453, 454586, 453602, 452714, 451575, 450041, 448299, 446106, 442659, 437592]
60843D37592o013n992n686n620n454m672l347k072j348j278j564j708j380p04
60829C90754j29l9m62j069j326r52k89L8n1lM02N69J47j00O89J950K249J317M38
60810C94133M97Q55P06N50J338K720L314K565J394Q20P72N94K02J70Q41J743J980
60793D15194J149j88j022r84p02r30j582k024k092k272k747k971k538j927j878
60778C92486k315k502k146j683j465j278r59q71j370k101k313j778r90n06m42
60763C69767n19l79J77R29J333J094O42O90J359K116K533K627K478J973J171M62
60747C88453N3l23r07j519j943k307k659k582j754o31M8J84K31L61L68K97L66
60730C75736K75n61j864k457j819r71j139k162k930k997k894k990l025k860k885
$$ y = [437592, 431579, 425587, 419901, 414281, 408827, 404155, 400808, 398736, 397388, 396110, 394546, 392838, 391458, 390754, 390625, 390586, 390124, 389055, 387729, 386777, 386488, 386526, 386475, 386472, 386874, 387443, 387590, 387490, 388179, 390129, 392378, 393695, 394133, 394630, 395485, 396191, 396741, 398079, 400799, 404113, 406678, 408072, 408892, 409664, 410258, 410460, 410630, 411471, 413214, 415194, 416343, 416155, 415133, 414149, 413447, 412517, 410935, 408911, 406819, 404547, 401800, 398829, 396291, 394364, 392486, 390171, 387669, 385523, 383840, 382375, 381097, 380138, 379267, 377897, 375796, 373483, 371705, 370715, 370209, 369767, 369248, 368869, 369046, 369975, 371308, 372402, 373044, 373734, 375093, 377209, 379742, 382369, 384847, 386820, 387991, 388453, 388506, 388183, 387276, 385757, 383814, 381507, 378848, 376266, 374512, 373881, 373929, 374113, 374344, 374705, 375073, 375370, 375736, 376011, 375450, 373586, 371129, 369310, 368339, 367200, 365038, 362108, 359111, 356217, 353227, 350202, 347342, 344457]
60715C44457l372l909l913l326k555k046k086k714l508l781l265k411j755j307
60701C04509q16k89J91P63J405J523O51n74q94K0J274K123K838L783M498M359
60685C25364L661L195L148L128L024L034K998K543J906J755K067J977J066pm32
60670C58427j89L99J328K458L026K410J161N52J075K008K466K355K249K621L373
60655C85719L899L627K637J571Q24N8j169k608l587l903l895l789l497l087k883
60640C69917k974l009k643j863q82m0J95l74j175j251l72N83P25K02q0L55J098
60623C58412J444J142N56J87J79K43J18r8j40J1K03M64Q89J179Q10k13j170j441
60605C62775j184r53r72j138j382j638j600j036k63R2j01l19j85m2l99j002q89
$$ y = [344457, 341085, 337176, 333263, 329937, 327382, 325336, 323250, 320536, 317028, 313247, 309982, 307571, 305816, 304509, 303693, 303404, 303595, 304358, 305763, 307286, 307937, 307363, 306469, 306489, 307763, 309886, 312724, 316507, 321005, 325364, 329025, 332220, 335368, 338496, 341520, 344554, 347552, 350095, 352001, 353756, 355823, 357800, 358866, 358859, 358427, 358238, 358637, 359965, 362423, 365449, 367859, 369020, 369572, 370647, 372655, 375121, 377476, 379725, 382346, 385719, 389618, 393245, 395882, 397453, 398277, 398335, 397166, 394558, 390971, 387068, 383173, 379384, 375887, 372800, 369917, 366943, 363934, 361291, 359428, 358546, 358506, 358701, 358327, 357152, 355901, 355529, 356112, 356837, 357039, 356959, 357314, 358412, 359856, 360998, 361554, 361741, 361920, 362163, 362281, 362183, 362043, 362054, 362257, 362721, 363610, 364789, 365599, 365386, 364216, 362775, 361591, 360638, 359666, 358528, 357146, 355508, 353908, 352872, 352609, 352701, 352600, 352281, 352096, 352054, 351655, 350653, 349764]
60588C49764M65K332L397L185K523K441K931L106K409J240L87K66Q45J916L100
60573C80307L885M008L748L591L698L850L869L821L863M071M440M897N322N632
60559D39002N954O620P969J0169J3117J6486J9857K3025K6135K9573L3615L8258
60547F69780M3347M8863N4918O1314O7118P0862P1268O7603N9409M6402K9117
60536A290001R341j0559k8789m4339n6346o3907o6711o5368o0970n4680m7664
60525H00009m0852l4423k7951k1338j5147r838n158o69L622P622J1767J6669K2328
60512G06641K8216L4035M0004M6473N3557O0905O7430P1449P1482O6898N7652
60501A304742M3939K6655P826j0133k5571l7555m5115m7454m4886l8761l0207
$$ y = [349764, 350229, 352561, 355958, 359143, 361666, 364107, 367038, 370144, 372553, 373793, 374180, 374446, 375291, 377207, 380307, 384192, 388200, 391948, 395539, 399237, 403087, 406956, 410777, 414640, 418711, 423151, 428048, 433370, 439002, 444956, 451576, 459545, 469714, 482831, 499317, 519174, 542199, 568334, 597907, 631522, 669780, 713127, 761990, 816908, 878222, 945340, 1016202, 1087470, 1155073, 1214482, 1260884, 1290001, 1299342, 1288783, 1259994, 1215655, 1159309, 1095402, 1028691, 963323, 902353, 847673, 800009, 759157, 724734, 696783, 675445, 660298, 650460, 645302, 644633, 648255, 655877, 667644, 684313, 706641, 734857, 768892, 808896, 855369, 908926, 969831, 1037261, 1108710, 1180192, 1247090, 1304742, 1348681, 1375336, 1383162, 1373029, 1347458, 1309903, 1264788, 1217334, 1172448, 1133687, 1103480]
60490A103480j9655p612M902J7061K8642L9264M7788N2899N3800N0069M1442K8380
60478A440460J2297n400k4068m2904n9755p1968p8527q0572p9691p6510p1236
60467H62126o4647n7764n0951m4062l7318l1402k6620k2577j8958j6135j4557
60456D77135j3809j2849j1203r419q174p394o580n655m919m416l831l088k488
60443C83310k091j536o62Q0K58K21P57K084L524M159L620K285R71L21L17L87R0
60426C98095m39q07r31r42q40m84P3O12J062J530K098K829L782M752N171M755
60410D20316M172M486N803P010P094O336N850O346P705R518J1492J3279J4397
60397E23804J4514J3779J2690J1684J0871J0155R509Q976Q421P559O400N360M598
$$ y = [1103480, 1083825, 1076213, 1081115, 1098176, 1126818, 1166082, 1213870, 1266769, 1320569, 1370638, 1412080, 1440460, 1452757, 1447357, 1423289, 1380385, 1320630, 1248662, 1170135, 1089563, 1009872, 933362, 862126, 797479, 739715, 688764, 644702, 607384, 575982, 549362, 526785, 507827, 491692, 477135, 463326, 450477, 439274, 429855, 421681, 414287, 407707, 402052, 397133, 392717, 388886, 385798, 383310, 381219, 379683, 379021, 379101, 379359, 379580, 380337, 382421, 385945, 390104, 393724, 396009, 396980, 397301, 397618, 398005, 398095, 397656, 396849, 395918, 394976, 394136, 393652, 393725, 394337, 395399, 396929, 399027, 401856, 405638, 410390, 415561, 420316, 424488, 428974, 434777, 441787, 448881, 455217, 461067, 467413, 475118, 484636, 496128, 509407, 523804, 538318, 552097, 564787, 576471, 587342, 597497, 607006, 615982, 624403, 631962, 638362, 643722, 648320]
60384F48320L532J645l92j184m12O37P36K31J82O64Q67N55L91P03R17N52Qj10
60366F57842J13K40K93O25J181J423R91j9j365k906m422n535o030o064n997o025
60350F24345o091o053n835n454m983m497m057l673l319k954k629k414k289k205
60336E67892k331k957l989m789m862m509m417m704m918m881m973n344n540n187
60322E04491m573m140l867l559l319l178k681j463l7P34Q46J153K155L429M387
60307D90378M993N507N952O081N552M035J518j352l689n286o716q310r529r625
60293D79509q577p047n677m711m006l121j661J89J689K405K656K897L020K783
60279D60348K529K762L255L312K934K988L966N255N985O123O259O696P338Q183
$$ y = [648320, 651852, 653497, 653105, 651921, 651509, 652146, 652882, 653113, 653295, 653959, 654826, 655381, 655772, 656475, 657392, 657944, 657952, 657842, 657955, 658195, 658488, 659113, 660294, 661717, 662708, 662689, 661324, 658418, 653996, 648461, 642431, 636367, 630370, 624345, 618254, 612201, 606366, 600912, 595929, 591432, 587375, 583702, 580383, 577429, 574800, 572386, 570097, 567892, 565561, 562604, 558615, 553826, 548964, 544455, 540038, 535334, 530416, 525535, 520562, 515218, 509678, 504491, 499918, 495778, 491911, 488352, 485033, 481855, 479174, 477711, 477674, 478408, 479254, 480407, 482562, 485991, 490378, 495371, 500878, 506830, 512911, 518463, 522498, 524016, 522664, 518975, 513689, 506973, 498663, 489134, 479509, 470932, 463885, 458208, 453497, 449491, 446370, 444709, 444898, 446587, 448992, 451648, 454545, 457565, 460348, 462877, 465639, 468894, 472206, 475140, 478128, 482094, 487349, 493334, 499457, 505716, 512412, 519750, 527933]
60265E27933R328J0448J0878J0437R751R486R588R637R653J0019J0687J1078J0890
60252F59813J0513J0346J0132R426Q450P950Q365R478J0788J1804J2178J2114
60240G81357J2619J4651J7923K1177K3810K6518L0002L3773L6951L9729M3209
60229A081719M7872N2966N7446O1011O4057O7028P0012P2730P4739P5661P5243
60218A800484P3272O9742O5184O0403N5541M9853M2872L5343K8385K2046J5494
60207B318619Q464J680m216r200j3188j5770j7021j7697j8008j6975j3826r376
60195B193486n026q39M316J0859J7944K4952L2410M0810M9423N6999O3080O7799
60183B556213P0899P1930P1103O8983O5248N8800M9414L8388K7046J5332K575
$$ y = [527933, 537261, 547709, 558587, 569024, 578775, 588261, 597849, 607486, 617139, 627158, 637845, 648923, 659813, 670326, 680672, 690804, 700230, 708680, 716630, 724995, 734473, 745261, 757065, 769243, 781357, 793976, 808627, 826550, 847727, 871537, 898055, 928057, 961830, 998781, 1038510, 1081719, 1129591, 1182557, 1240003, 1301014, 1365071, 1432099, 1502111, 1574841, 1649580, 1725241, 1800484, 1873756, 1943498, 2008682, 2069085, 2124626, 2174479, 2217351, 2252694, 2281079, 2303125, 2318619, 2327083, 2328763, 2324547, 2315347, 2302159, 2286389, 2269368, 2251671, 2233663, 2216688, 2202862, 2193486, 2188460, 2187621, 2191937, 2202796, 2220740, 2245692, 2278102, 2318912, 2368335, 2425334, 2488414, 2556213, 2627112, 2699042, 2770145, 2839128, 2904376, 2963176, 3012590, 3050978, 3078024, 3093356, 3095931]
60172C095931j0990k4289l6649m8101n8566o7596p4857q0125q2753q2019p8218
60161B451768p2642o6199n8735m9980m0352l0342j9848q826K060J2081K1256K9752
60149B169993L7039M2313M5368M6156M4017L8436L0324K1357J2103K017q666j8343
60137B462114k5889l1858l7082m0962m2149m0334l6483l1511k5553j8326r625
60126B122342M55J1328K2105L2460M3080N4789O7409Q0047R2328J04648J17226
60115B748217J29546J41001J51509J61134J69424J75507J78736J78966J76264
60106D210304J70588J61738J49466J33693J14748R3506P1055M7991K4126q56k6368
60095E149991n0886p3087r2739j10171j25217j37272j46181j52353j55766j55544
$$ y = [3095931, 3084941, 3060652, 3024003, 2975902, 2917336, 2849740, 2774883, 2694758, 2612005, 2529986, 2451768, 2379126, 2312927, 2254192, 2204212, 2163860, 2133518, 2113670, 2104844, 2106904, 2118985, 2140241, 2169993, 2207032, 2249345, 2294713, 2340869, 2384886, 2423322, 2453646, 2475003, 2487106, 2489123, 2480457, 2462114, 2436225, 2404367, 2367285, 2326323, 2284174, 2243840, 2207357, 2175846, 2150293, 2131967, 2122342, 2122797, 2134125, 2156230, 2188690, 2231770, 2286559, 2353968, 2434015, 2526343, 2630991, 2748217, 2877763, 3018764, 3170273, 3331407, 3500831, 3676338, 3855074, 4034040, 4210304, 4380892, 4542630, 4692096, 4825789, 4940537, 5034043, 5105098, 5153089, 5177215, 5176359, 5149991, 5099105, 5026018, 4933279, 4823108, 4697891, 4560619, 4414438, 4262085, 4106319, 3950775]
60085C950775j50962j42585j31944j20293j07930r4620q0338o5582n1034l6975
60075B968512k3108r231M055J5670K5093L2599L8415M2227M3754M3228M0933L6708
60063C258855L0385K2319J3103L045p518j7840k7256l5835m3977n1613n8396o4417
60051C020855o9960p4655p7673p8817p8648p7271p3874o7934o0338n2566m5074
60040B264045l7016k7538j6797n667N274J6126K7206L8383M9067N8666O6880P3471
60028B512100P8072Q0469Q0830P9348P5761O9585O0744M9667L6862K2781Q083
60017C154302o357j9932l2530m4276n5229o5257p3806p9844q2571q2303q0255
60006B531942p7153p2520o5693n7021m7513l7581k6866j5359l941O548J6308K6158
$$ y = [3950775, 3799813, 3657228, 3525284, 3404991, 3297061, 3202441, 3122103, 3056521, 3005487, 2968512, 2945404, 2936173, 2940228, 2955898, 2980991, 3013590, 3052005, 3094232, 3137986, 3181214, 3222147, 3258855, 3289240, 3311559, 3324662, 3327707, 3320189, 3302349, 3275093, 3239258, 3195281, 3143668, 3085272, 3020855, 2950895, 2876240, 2798567, 2719750, 2641102, 2563831, 2489957, 2422023, 2361685, 2309119, 2264045, 2227029, 2199491, 2182694, 2177027, 2182301, 2198427, 2225633, 2264016, 2313083, 2371749, 2438629, 2512100, 2590172, 2670641, 2751471, 2830819, 2906580, 2976165, 3036909, 3086576, 3123438, 3146219, 3154302, 3147945, 3128013, 3095483, 3051207, 2995978, 2930721, 2856915, 2777071, 2694500, 2612197, 2531942, 2454789, 2382269, 2316576, 2259555, 2212042, 2174461, 2147595, 2132236, 2128295, 2134843, 2151151, 2177309]
59994B177309L6384M6535N6332O6139P6238Q6103R4857J02200J08300J12840J14798
59983C078035J13279J08165R9724Q8211P4238N9047M3745K8385J2274m904k2645
59972C677554m0135n6656p1449q3661r2565r7722r8991r6633r1350q3871p4586
59961B789935o3811n2201m0392k8346j5686k673R736K0964L1418M1684N1554O0220
59949B802402O7093P2153P5623P7522P7525P5236P0715O4703N8012N0781M2668
59938C534433L3732K4619J5938P942R50m499q082r828r655p268k674L807J2243
59925C591658K3088L6179N0455O5149Q0557R6896J13141J27856J40681J52029
59915D477689J61568J68078J70638J68960J62501J50285J32054J08818Q1936N2263
$$ y = [2177309, 2213693, 2260228, 2316560, 2382699, 2458937, 2545040, 2639897, 2742097, 2850397, 2963237, 3078035, 3191314, 3299479, 3399203, 3487414, 3561652, 3620699, 3664444, 3692829, 3705103, 3700199, 3677554, 3637419, 3580763, 3509314, 3425653, 3333088, 3235366, 3136375, 3039742, 2948392, 2864521, 2789935, 2726124, 2673923, 2633531, 2605185, 2589499, 2586826, 2596562, 2617526, 2648944, 2690628, 2742182, 2802402, 2869495, 2941648, 3017271, 3094793, 3172318, 3247554, 3318269, 3382972, 3440984, 3491765, 3534433, 3568165, 3592784, 3608722, 3616664, 3617614, 3613115, 3605033, 3595205, 3585550, 3578282, 3575608, 3579415, 3591658, 3614746, 3650925, 3701380, 3766529, 3847086, 3943982, 4057123, 4184979, 4325660, 4477689, 4639257, 4807335, 4977973, 5146933, 5309434, 5459719, 5591773, 5700591, 5782527, 5834790]
59905E834790K0552j1865m3266p2071r6942j16803j31125j40034j43928j43299
59895D956009j38913j31646j21885j09634r5352q0172o4925m9529l3706j7771
59885D112476k119J3494K9413M5268O0447P5074Q9538J03028J13507J19403J20610
59874D880139J17531J09797R6584P7830N4654K8786J919k4571m9659p2544r2457
59863E128009j08844j21757j31708j38903j42891j43244j40237j34637j27083
59854C938705j17979j07700r6506q4503p2033n9843m8443l7583k6917j6973q733
59843C261492k344L141Q648J4409K0334K6276L1583L5151L6347L5424L2653K7673
59831C530787K0223J0986J077q838j8308k6372l2074l5562l7915l9734m0599m0050
$$ y = [5834790, 5855342, 5843477, 5800211, 5728140, 5631198, 5514395, 5383270, 5243236, 5099308, 4956009, 4817096, 4685450, 4563565, 4453931, 4358579, 4278407, 4213482, 4163953, 4130247, 4112476, 4110357, 4123851, 4153264, 4198532, 4258979, 4334053, 4423591, 4526619, 4640126, 4759529, 4880139, 4997670, 5107467, 5204051, 5281881, 5336535, 5365321, 5367240, 5342669, 5293010, 5220466, 5128009, 5019165, 4897408, 4765700, 4626797, 4483906, 4340662, 4200425, 4065788, 3938705, 3820726, 3713026, 3616520, 3532017, 3459984, 3400141, 3351698, 3314115, 3287198, 3270225, 3261492, 3259148, 3262289, 3270937, 3285346, 3305680, 3331956, 3363539, 3398690, 3435037, 3470461, 3503114, 3530787, 3551010, 3561996, 3563073, 3554235, 3535927, 3509555, 3477481, 3441919, 3404004, 3364270, 3323671, 3283621]
59819C283621l8565l7187l6612l6810l7254l7319l6657l5440l4184l3347l3151
59808B887095l3572l4285l4798l4942l5042l5296l5209l4174l2335l0281k7942
59797B519219k4550j9744j3940p435K02R454K0137L1826M4518N8453P3612Q9863
59785B781615J07298J25959J45386J64686J82748J97861K07138K06750J93124
59776D312565J64354J21162O7082P692n0689j02146j42064j68044j80419j81545
59766C847948j74233j60905j43814j25127j06296q7895p0395n4588m0868k8725
59756B855102j7550p499J029Q311J5079K1566K7466L2607L7155M1338M5545N0463
59744C110612N6461O3009O9443P6186Q4508R4962J06779J18965J31398J44542
$$ y = [3283621, 3245056, 3207869, 3171257, 3134447, 3097193, 3059874, 3023217, 2987777, 2953593, 2920246, 2887095, 2853523, 2819238, 2784440, 2749498, 2714456, 2679160, 2643951, 2609777, 2577442, 2547161, 2519219, 2494669, 2474925, 2460985, 2453550, 2453752, 2463206, 2483343, 2515169, 2559687, 2618140, 2691752, 2781615, 2888913, 3014872, 3160258, 3324944, 3507692, 3705553, 3912691, 4119441, 4312565, 4476919, 4598081, 4665163, 4672855, 4622166, 4520020, 4377956, 4209912, 4029493, 3847948, 3673715, 3512810, 3368996, 3243869, 3137573, 3049678, 2979283, 2924695, 2883827, 2855102, 2837552, 2830053, 2831082, 2839393, 2854472, 2876038, 2903504, 2936111, 2973266, 3014604, 3060149, 3110612, 3167073, 3230082, 3299525, 3375711, 3460219, 3555181, 3661960, 3780925, 3912323, 4056865]
59734D056865J58687J73824J89974K07184K25288K43748K61708K78170K92224
59725F087672L03054L09704L11122L06657K96224K79860K57702K31094K03266
59716H586355J77978J57366J41645J30631J24591J23434J25998J30631J35935
59707I834564J40660J43483J43443J40231J33857J24397J12329R8654Q4299O9618
59697A1025535N4745M0172K6784J5681Q045M766N936J1138K0335L3949N1874P3065
59685A1372025R6580J22413J50776J81056K12055K42833K72582K99907L23055
59676A3273282L40732L52023L55447L48805L30175K98767K54789J99105J33349
59667A5886474O0081j7487r5884j71569k41065l01162l49113l82981m02235m08128
$$ y = [4056865, 4215552, 4389376, 4579350, 4786534, 5011822, 5255570, 5517278, 5795448, 6087672, 6390726, 6700430, 7011552, 7318209, 7614433, 7894293, 8151995, 8383089, 8586355, 8764333, 8921699, 9063344, 9193975, 9318566, 9442000, 9567998, 9698629, 9834564, 9975224, 10118707, 10262150, 10402381, 10536238, 10660635, 10772964, 10871618, 10955917, 11025535, 11080280, 11120452, 11147236, 11162917, 11170962, 11175728, 11181664, 11192802, 11213137, 11247086, 11298960, 11372025, 11468605, 11591018, 11741794, 11922850, 12134905, 12377738, 12650320, 12950227, 13273282, 13614014, 13966037, 14321484, 14670289, 15000464, 15299231, 15554020, 15753125, 15886474, 15946555, 15929068, 15833184, 15661615, 15420550, 15119388, 14770275, 14387294, 13985059, 13576931]
59657A3576931m03339l91336l76226l62892l56422l60546l76225m01254m30868
59648A0117823m58951m79751m89645m87872m75781m55475m29221l99562l69140
59639F072425l39738l11679k84620k58867k35379k14393j94855j75811j57862
59630C899221j42304j29032j16353j03188r0458p9676p0945o3156n5709m9105
59620B999295m3918m0076l7197l4999l3106l1103k9072k7675k7428k8095k9025
59609B637601k9845l0611l1511l2589l3669l4423l4612l4279l3602l2549l0985
59598B278926k9108k7454k6304k5370k4326k3289k2470k1455j9459j6325j2845
59587B030521r878p434m931k146N71K919M970O782Q196R428J1352J4640J8722
$$ y = [13576931, 13173592, 12782256, 12406030, 12043138, 11686716, 11326170, 10949945, 10548691, 10117823, 9658872, 9179121, 8689476, 8201604, 7725823, 7270348, 6841127, 6441565, 6072425, 5732687, 5421008, 5136388, 4877521, 4642142, 4427749, 4232894, 4057083, 3899221, 3756917, 3627885, 3511532, 3408344, 3317886, 3238210, 3167265, 3104109, 3048400, 2999295, 2955377, 2915301, 2878104, 2843105, 2809999, 2778896, 2749824, 2722149, 2694721, 2666626, 2637601, 2607756, 2577145, 2545634, 2513045, 2479376, 2444953, 2410341, 2376062, 2342460, 2309911, 2278926, 2249818, 2222364, 2196060, 2170690, 2146364, 2123075, 2100605, 2079150, 2059691, 2043366, 2030521, 2020643, 2013209, 2008278, 2006132, 2006703, 2009622, 2014592, 2021374, 2029570, 2038998, 2050350, 2064990, 2083712]
59574B083712K2248K4638K6613K9054L1970L4997L8362M2626M7641N2439N6367
59563B490667N9918O4096O9185P4439P9020Q2966Q7066R1880R7139J02182J06656
59552C405214J10605J13983J16352J16817J14019J06676R4737P9997O4927N0792
59542D374119L7427K4574J2517J182j0276k2374l4421m5349n4862o3185p0328
59531D149024p6258q1192q4909q6358q4830q1012p5930o9292o0147m8824l6803
59520C363469k4584j1089M468K1318L8297N5213P2394Q9706J06674J22950J37876
59509C976692J50144J58435J62054J60545J53210J39540J19746R4536O4850L2165
59499E211917j583l4911o7093r7145j23158j43318j57083j64732j66441j62613
$$ y = [2083712, 2105960, 2130598, 2157211, 2186265, 2218235, 2253232, 2291594, 2334220, 2381861, 2434300, 2490667, 2550585, 2614681, 2683866, 2758305, 2837325, 2920291, 3007357, 3099237, 3196376, 3298558, 3405214, 3515819, 3629802, 3746154, 3862971, 3976990, 4083666, 4178403, 4258400, 4323327, 4374119, 4411546, 4436120, 4448637, 4449819, 4439543, 4417169, 4382748, 4337399, 4282537, 4219352, 4149024, 4072766, 3991574, 3906665, 3820307, 3735477, 3654465, 3578535, 3509243, 3449096, 3400272, 3363469, 3338885, 3327796, 3332264, 3353582, 3391879, 3447092, 3519486, 3609192, 3715866, 3838816, 3976692, 4126836, 4285271, 4447325, 4607870, 4761080, 4900620, 5020366, 5114902, 5179752, 5211917, 5210334, 5175423, 5108330, 5011185, 4888027, 4744709, 4587626, 4422894, 4256453, 4093840]
59489D093840j54539j43678j30575j15265r8482q1458o4750m8186l1897j6511
59479C208499k273J1100K3547L4456M3400N0360N5124N7295N6971N4636N0176
59468C643291M2826L2341J9445M869j1157k8130m4855o0334p4349q6687r6626
59457C340634j03854j09108j13090j15396j15322j13221j10066j06166j01317
59448B353094r5895r0676q5685q0304p4578o9303o4601n9490n3339m6886m1302
59437A591035l6850l3040k9452k5819k1787j7331j3056r513o353k702J789O694
59425A403615J1375J5147J7041J6095J2228O538O51m022o561o643m564r49L662
59412A463613Q739J3309J6110J6353J4187J0371N916K092K15Q50L400O804J0480
$$ y = [4093840, 3939301, 3795623, 3665048, 3549783, 3451301, 3369843, 3305093, 3256907, 3225010, 3208499, 3206226, 3217326, 3240873, 3275329, 3318729, 3369089, 3424213, 3481508, 3538479, 3593115, 3643291, 3686117, 3718458, 3737903, 3742772, 3731615, 3703485, 3658630, 3598296, 3523947, 3437260, 3340634, 3236780, 3127672, 3014582, 2899186, 2783864, 2670643, 2560577, 2454411, 2353094, 2257199, 2166523, 2080838, 2000534, 1925956, 1856653, 1792052, 1732562, 1679223, 1632337, 1591035, 1554185, 1521145, 1491693, 1465874, 1444087, 1426756, 1413700, 1404187, 1397834, 1395132, 1396921, 1403615, 1414990, 1430137, 1447178, 1463273, 1475501, 1482039, 1482690, 1478668, 1472107, 1465464, 1460900, 1459951, 1463613, 1472352, 1485661, 1501771, 1518124, 1532311, 1542682, 1548598, 1550690, 1550905, 1551755, 1555155, 1561959, 1572439]
59399A572439J4337J8271K2175K6309L1054L6187M0926M4893M8639N2939N7913
59388A966082O3140O8314P3469P8704Q4096Q9724R5434J00653J04846J08241J11804
59377B944507J16414J22392J29835J39073J50596J64783J81789K01380K22601
59368D373370K43996K64378K83193K99908L13386L22272L25715L23283L14560
59359G064061K99553K79441K56138K30849K03568J74109J43011J11157P9016M6576
59349H887479J3554k0717n6990r5117j33734j71447k07955k43307k76425l05061
59339G390280l27130l41508l47832l46470l38744l26356l10365k91346k70509
59330D490020k49722k30187k11930j94860j79451j65820j53081j40392j28080
$$ y = [1572439, 1586776, 1605047, 1627222, 1653531, 1684585, 1720772, 1761698, 1806591, 1855230, 1908169, 1966082, 2029222, 2097536, 2171005, 2249709, 2333805, 2423529, 2518963, 2619616, 2724462, 2832703, 2944507, 3060921, 3183313, 3313148, 3452221, 3602817, 3767600, 3949389, 4150769, 4373370, 4617366, 4881744, 5164937, 5464845, 5778231, 6100503, 6426218, 6749501, 7064061, 7363614, 7643055, 7899193, 8130042, 8333610, 8507719, 8650730, 8761887, 8840903, 8887479, 8901033, 8880316, 8823326, 8728209, 8594475, 8423028, 8215073, 7971766, 7695341, 7390280, 7063150, 6721642, 6373810, 6027340, 5688596, 5362240, 5051875, 4760529, 4490020, 4240298, 4010111, 3798181, 3603321, 3423870, 3258050, 3104969, 2964577, 2836497]
59321B836497j16941j06963r7624q8998q1618p5389o9505o3491n7613n2221m7353
59310A978781m2959l8959l5018l0905k7036k3991k1484j8463j4420r938n765j987
59298A707856J668N275Q820J2362J5785J8811K1511K4458K8039L2019L5869L9228
59286A951701M1899M3954M5961M8464N0949N1966N0683M7797M4414M0592L5452
59275B453832K8320J9203Q655k293j2528k1797l0785l9716m7409n2579n5566n7726
59263B189611n9427n9882n8854n7298n5955n4468n2333m9818m7272m4320m0504
59252A609480l6276l2582k9732k7247k4580k1534j8101j4487j1136q286n508k149
59240A377862J809N617Q540J0542J2261J4502J7696K1530K5158K7982L0279L2968
$$ y = [2836497, 2719556, 2612593, 2514969, 2425971, 2344353, 2268964, 2199459, 2135968, 2078355, 2026134, 1978781, 1935822, 1896863, 1861845, 1830940, 1803904, 1779913, 1758429, 1739966, 1725546, 1715608, 1709843, 1707856, 1709524, 1714799, 1723619, 1735981, 1751766, 1770577, 1792088, 1816546, 1844585, 1876604, 1912473, 1951701, 1993600, 2037554, 2083515, 2131979, 2182928, 2234894, 2285577, 2333374, 2377788, 2418380, 2453832, 2482152, 2501355, 2510010, 2507717, 2495189, 2473392, 2442607, 2402891, 2355482, 2302903, 2247337, 2189611, 2130184, 2070302, 2011448, 1954150, 1898195, 1843727, 1791394, 1741576, 1694304, 1649984, 1609480, 1573204, 1540622, 1510890, 1483643, 1459063, 1437529, 1419428, 1404941, 1393805, 1385519, 1380011, 1377862, 1379671, 1385288, 1393828, 1404370, 1416631, 1431133, 1448829, 1470359, 1495517, 1523499, 1553778, 1586746]
59228A586746L6737M1572M7049N2894N9236O6388P4488Q3381R2868J02962J13774
59217B358095J25258J37292J49991J63485J77247J90021K00573K08209K12230
59208C922401K11430K04561J91114J71177J44838J12350P4854L4247p703m9631
59198E009638q9896j26384j57347j81984j99939k10761k14408k11893k04830j94504
59188C217692j81806j67761j53433j39317j25375j11736r8770q6505p4632o3243
59178B015114n2902m3731l5184k7161k0614j6275j3312j0195o669l933k927l423
59166A778788m930p551j1431j6119k1001k5786l0120l3336l5180l6214l6874l6614
59154A483632l4803l2000k9420k7395k5344k3145k1350j9947j7977j4894j1418
$$ y = [1586746, 1623483, 1665055, 1712104, 1764998, 1824234, 1890622, 1965110, 2048491, 2141359, 2244321, 2358095, 2483353, 2620645, 2770636, 2934121, 3111368, 3301389, 3501962, 3710171, 3922401, 4133831, 4338392, 4529506, 4700683, 4845521, 4957871, 5032725, 5066972, 5059269, 5009638, 4919742, 4793358, 4636011, 4454027, 4254088, 4043327, 3828919, 3617026, 3412196, 3217692, 3035886, 2868125, 2714692, 2575375, 2450000, 2338264, 2239494, 2152989, 2078357, 2015114, 1962212, 1918481, 1883297, 1856136, 1835522, 1819247, 1805935, 1795740, 1789071, 1785138, 1782211, 1778788, 1773858, 1766307, 1754876, 1738757, 1717756, 1691970, 1661850, 1628514, 1593334, 1557120, 1520246, 1483632, 1448829, 1416829, 1387409, 1360014, 1334670, 1311525, 1290175, 1270228, 1252251, 1237357, 1225939]
59143A225939q460n890l082p9K542M595O394Q105R629J0939J2007J2513J2216
59130A287368J1511J1073J0889J0242Q698O682M875L499K469J797J571J658J739
59117A364071J610J312J079J212J869K952M207N481O697P716Q414Q966R714J0697
59103A435997J1486J1747J1784J2327J3758J5726J7504J8677J9486K0549K2251
59092A611292K4405K6574K8661L0941L3474L5698L6889L6959L6472L5795L4459
59081A971619L1649K7175K1670J5825R752L274l482j0193j6879k3838l0853l6949
59069A958770m1237m3845m5619m7030m7781m7466m6216m4487m2634m0890l9537
59058A472028l8644l7668l5854l3170l0492k8630k7359k5848k3785k1592j9537
$$ y = [1225939, 1217479, 1211589, 1208507, 1208428, 1210970, 1215565, 1221959, 1230064, 1239693, 1250632, 1262639, 1275152, 1287368, 1298879, 1309952, 1320841, 1331083, 1339781, 1346463, 1351338, 1354837, 1357306, 1359103, 1360674, 1362332, 1364071, 1365681, 1366993, 1368072, 1369284, 1371153, 1374105, 1378312, 1383793, 1390490, 1398206, 1406620, 1415586, 1425300, 1435997, 1447483, 1459230, 1471014, 1483341, 1497099, 1512825, 1530329, 1549006, 1568492, 1589041, 1611292, 1635697, 1662271, 1690932, 1721873, 1755347, 1791045, 1827934, 1864893, 1901365, 1937160, 1971619, 2003268, 2030443, 2052113, 2067938, 2077690, 2080964, 2077482, 2067289, 2050410, 2026572, 1995719, 1958770, 1917533, 1873688, 1828069, 1781039, 1733258, 1685792, 1639576, 1595089, 1552455, 1511565, 1472028, 1433384, 1395716, 1359862, 1326692, 1296200, 1267570, 1240211, 1214363, 1190578, 1168986, 1149449]
59047A149449j7302j4688j2226j0543r510q634q000q159r074r949j0301j0495
59035A020568j0908j1224j0997j0469j0156r987r464q545p703p211o776n976m656
59022I06496k878r21P06J609J942K225K734L449M464N955P650Q856R313R620J0567
59007I71787J2236J4049J5523J6766J8290K0483K3271K6192K8864L1242L3364
58996A212067L5113L6542L8207M0574M3062M4260M3282M0543L6921L2673K7590
58985A630834K1722J5445Q998K485l680q875j2951j6431j9828k2966k5257k6517
58973A542979k7268k8012k8405k7502k4973k1729j8998j6969j4803j1851q283
58962A314186m502o40K994N604O649O637O673P281Q111Q654Q834Q925R239R989
$$ y = [1149449, 1132147, 1117459, 1105233, 1094690, 1085180, 1076546, 1068546, 1060387, 1051313, 1041364, 1031063, 1020568, 1009660, 998436, 987439, 976970, 966814, 956827, 947363, 938818, 931115, 923904, 917128, 911152, 906496, 903618, 902697, 903403, 905012, 906954, 909179, 911913, 915362, 919826, 925781, 933431, 942287, 951600, 961220, 971787, 984023, 998072, 1013595, 1030361, 1048651, 1069134, 1092405, 1118597, 1147461, 1178703, 1212067, 1247180, 1283722, 1321929, 1362503, 1405565, 1449825, 1493107, 1533650, 1570571, 1603244, 1630834, 1652556, 1668001, 1676999, 1679484, 1675804, 1666929, 1653978, 1637547, 1617719, 1594753, 1569496, 1542979, 1515711, 1487699, 1459294, 1431792, 1406819, 1385090, 1366092, 1349123, 1334320, 1322469, 1314186, 1309684, 1309044, 1312038, 1317642, 1324291, 1330928, 1337601, 1344882, 1352993, 1361647, 1370481, 1379406, 1388645, 1398634]
58948A398634J1215J2757J4406J6011J7418J8567J9725K1330K3412K5548K7729
58937A606752L0736L5184M0538M5776N0764N6136O1803O6386O8378O7315O3642
58926B193410N8019N1143M3848L6998L1436K7985K7163K8781L2229L7179M3517
58915B611708N0652N7743O4816P2830Q2042R1211R9228J06791J15436J25335J35269
58904C613061J44634J54184J64547J75122J84967J93742K01058K05687K06434
58895E243436K03550J98486J92414J85557J77888J69608J60808J51150J40181
58886F823078J27655J13456R7493P9758O0235L8739J5238r598l4555n8746q1994
58875G170759j04151j24525j42354j57608j70793j82060j90928j96941k00306
$$ y = [1398634, 1409849, 1422606, 1437012, 1453023, 1470441, 1489008, 1508733, 1530063, 1553475, 1579023, 1606752, 1637488, 1672672, 1713210, 1758986, 1809750, 1865886, 1927689, 1994075, 2062453, 2129768, 2193410, 2251429, 2302572, 2346420, 2383418, 2414854, 2442839, 2470002, 2498783, 2531012, 2568191, 2611708, 2662360, 2720103, 2784919, 2857749, 2939791, 3031002, 3130230, 3237021, 3352457, 3477792, 3613061, 3757695, 3911879, 4076426, 4251548, 4436515, 4630257, 4831315, 5037002, 5243436, 5446986, 5645472, 5837886, 6023443, 6201331, 6370939, 6531747, 6682897, 6823078, 6950733, 7064189, 7161682, 7241440, 7301675, 7340414, 7355652, 7346054, 7311499, 7252753, 7170759, 7066608, 6942083, 6799729, 6642121, 6471328, 6289268, 6098340, 5901399, 5701093]
58866E701093k01729k01798k00600j97885j93546j87868j81291j73933j65695
58857C996748j56761j47694j38885j30204j21573j13367j05881r8715r1253q3557
58847B808858p6181o9259o2484n5904m9961m4612l9216l3541k8095k3146j8216
58836B308243j3089q512n116k261J136N046Q541J1397J4492J8557K3328K8103
58824B389865L2456L6273L9616M2779M6026M9117N1574N3410N5175N7236N9618
58813B913145O2606O6831P2504P9069Q5952R3198J01168J10045J19873J30545
58803C834936J41412J51512J60533J69087J77662J85767J92573J97897K01905
58794E413284K04182K03782K00072J92978J82451J68268J50359J28956J04426
$$ y = [5701093, 5499364, 5297566, 5096966, 4899081, 4705535, 4517667, 4336376, 4162443, 3996748, 3839987, 3692293, 3553408, 3423204, 3301631, 3188264, 3082383, 2983668, 2892415, 2808858, 2732677, 2663418, 2600934, 2545030, 2495069, 2450457, 2411241, 2377700, 2349605, 2326459, 2308243, 2295154, 2286642, 2281526, 2279265, 2280401, 2285447, 2293988, 2305385, 2319877, 2338434, 2361762, 2389865, 2422321, 2458594, 2498210, 2540989, 2587015, 2636132, 2687706, 2741116, 2796291, 2853527, 2913145, 2975751, 3042582, 3115086, 3194155, 3280107, 3373305, 3474473, 3584518, 3704391, 3834936, 3976348, 4127860, 4288393, 4457480, 4635142, 4820909, 5013482, 5211379, 5413284, 5617466, 5821248, 6021320, 6214298, 6396749, 6565017, 6715376, 6844332, 6948758]
58785F948758P7363M8787J9932q310l5599o1934q7425j12096j35674j57722j78078
58774F318002j96729k12972k25198k32169k34253k32819k28613k21494k11637
58765D322118k00258j88816j78019j67770j57628j47246j36759j26928j18456
58756B900238j11084j03792r6007q8142q0770p3838o6969o0128n3565m7439m1807
58745B076697l6725l2041k7351k2487j7743j3359r060m479J86M411Q100J1662
58733A937811J5254J8192J9190J7092J1550L300o188j5509k3891l1001l6480l9982
58721A869338m1639m2207m2625m3430m4491m5244m5257m4640m3881m3165m2050
58710A390709l9840l6171l1221k5580j9965j4785r736m306J037M530M561J174
$$ y = [6948758, 7026121, 7074908, 7094840, 7086530, 7050931, 6988997, 6901572, 6789476, 6653802, 6496080, 6318002, 6121273, 5908301, 5683103, 5450934, 5216681, 4983862, 4755249, 4533755, 4322118, 4121860, 3933044, 3755025, 3587255, 3429627, 3282381, 3145622, 3018694, 2900238, 2789154, 2685362, 2589355, 2501213, 2420443, 2346605, 2279636, 2219508, 2165943, 2118504, 2076697, 2039972, 2007931, 1980580, 1958093, 1940350, 1926991, 1917931, 1913452, 1913638, 1918049, 1926149, 1937811, 1953065, 1971257, 1990447, 2007539, 2019089, 2022389, 2016201, 2000692, 1976801, 1945800, 1909320, 1869338, 1827699, 1785492, 1742867, 1699437, 1654946, 1609702, 1564445, 1519805, 1475924, 1432759, 1390709, 1350869, 1314698, 1283477, 1257897, 1237932, 1223147, 1213411, 1209105, 1210142, 1214672, 1219233, 1220407]
58698A220407m321j1031j8935k7532l5074l9776m1384m0937l9309l6636l3024
58687H92448k9030k5213k1652j8200j4779j1236p322l148O47L613O160R006J2092
58674G93386J4676J6524J8327K0668K3142K4930K5777K5836K4791K1825J6449
58663A026331Q913j89j0078j9515k6967l1566l3666l4251l3900l2586l0172k6884
58651G55470k3266j9903j7065j4554j1925r007o143l852k344j347l54R86K521
58638F49217L656L948L590L230L322L883M676N339N433M900M433M888O194P417
58624G14126Q033Q513R390J0440J1321J2396J4159J6276J8004J9410K1322K4052
58612H87442K6895K9122L0857L2702L4954L7554M0426M3488M6501M9182N1479
$$ y = [1220407, 1216086, 1205055, 1186120, 1158588, 1123514, 1083738, 1042354, 1001417, 962108, 925472, 892448, 863418, 838205, 816553, 798353, 783574, 772338, 765016, 761868, 762515, 766128, 772288, 781294, 793386, 808062, 824586, 842913, 863581, 886723, 911653, 937430, 963266, 988057, 1009882, 1026331, 1035244, 1035055, 1024977, 1005462, 978495, 946929, 913263, 879012, 845112, 812526, 782354, 755470, 732204, 712301, 695236, 680682, 668757, 659750, 653607, 649755, 647411, 646064, 645710, 646696, 649217, 652873, 656821, 660411, 663641, 666963, 670846, 675522, 680861, 686294, 691194, 695627, 700515, 706709, 714126, 722159, 730672, 740062, 750502, 761823, 774219, 788378, 804654, 822658, 842068, 863390, 887442, 914337, 943459, 974316, 1007018, 1041972, 1079526, 1119952, 1163440, 1209941, 1259123, 1310602]
58601A310602N3577N5603N7414N8687N9242N9159N8374N6294N2180M6107L9089
58590A906328L1917K4258J5333N249m907j4114k2007k8524l3597l7296l9790m1085
58578A761765m1151m0286l8918l7068l4597l1910k9827k8573k7554k6303k5057
58567A400521k4186k3604k3136k2886k2854k2591k1649k0112j8430j7062j6401
58556A167610j6467j6483j5537j4122j4231j7117k1569k5305k7606k9477l1489
58545I38207l2784l2395l0532k8062k5546k3285k1594k0430j9148j7253j5166
58534F72012j3707j3089j2753j2120j1067r879r013q811r051q873p594n601l995
58521E46459l339l141k741k223k038k036j518j89J415K689L674M723N764O360
$$ y = [1310602, 1364179, 1419782, 1477196, 1535883, 1595125, 1654284, 1712658, 1768952, 1821132, 1867239, 1906328, 1938245, 1962503, 1977836, 1983085, 1978178, 1964064, 1942057, 1913533, 1879936, 1842640, 1802850, 1761765, 1720614, 1680328, 1641410, 1604342, 1569745, 1537835, 1508008, 1479435, 1451881, 1425578, 1400521, 1376335, 1352731, 1329595, 1306709, 1283855, 1261264, 1239615, 1219503, 1201073, 1184011, 1167610, 1151143, 1134660, 1119123, 1105001, 1090770, 1073653, 1052084, 1026779, 999173, 969696, 938207, 905423, 873028, 842496, 814434, 788888, 765603, 744009, 723579, 704431, 687178, 672012, 658305, 645216, 632463, 620343, 609276, 599397, 590384, 581573, 572522, 563649, 556055, 550454, 546459, 543120, 539979, 537238, 535015, 532977, 530941, 529423, 529234, 530649, 533338, 537012, 541735, 547499, 553859]
58507E53859O427O418O759P458Q323R173R718R582Q809Q019P711P506O483M282
58493F60527J620l88j251j402j571k054k634l098l657m596n752o603o932p009
58479F15200p146p381p712q196q640q598p957p220o840o653o284n798n522n478
58465E15775n480n533n607n313m367l257k712k683k533k213k324k886k889j655
58451D66323J09J158J219J008J127J534J948K252K525K978L755M493M450L457
58437D98336K441K365K830K497R56o18j029n89m52q88j022k59Q05J235J018R92
58421E08618J760L078M318N017M961M188L179K723L153L920M179L749L164K869
58407E58876K761K584K376K398K798L484M180M504M226L533K953K871L180L433
$$ y = [553859, 560286, 566704, 573463, 580921, 589244, 598417, 608135, 617717, 626526, 634545, 642256, 649762, 656245, 660527, 662147, 661759, 660508, 659106, 657535, 655481, 652847, 649749, 646092, 641496, 635744, 629141, 622209, 615200, 608054, 600673, 592961, 584765, 576125, 567527, 559570, 552350, 545510, 538857, 532573, 526775, 521253, 515775, 510295, 504762, 499155, 493842, 489475, 486218, 483506, 480823, 478290, 476077, 473753, 470867, 467978, 466323, 466432, 467590, 468809, 469817, 470944, 472478, 474426, 476678, 479203, 482181, 485936, 490429, 494879, 498336, 500777, 503142, 505972, 508469, 509425, 508807, 507778, 507189, 506737, 505849, 504827, 504568, 505373, 506608, 507626, 508618, 510378, 513456, 517774, 522791, 527752, 531940, 535119, 537842, 540995, 544915, 549094, 552843, 556007, 558876, 561637, 564221, 566597, 568995, 571793, 575277, 579457, 583961, 588187, 591720, 594673, 597544, 600724, 604157]
58393F04157L255K642J989J788K118K517K521K262K274K778L502M181M847N502
58379F46333N879N754N241M646M195M013M100M169L864L315L155L692M333M237
58365G06926L389K643K724L555M639N751O936P972Q260P503O304N657N839O247
58351G84345O408O647P270P790P629P252P643Q716R310Q898Q330Q500R192R720
58337H97650R925R923R580Q993Q883R713J0900J1649J2147J3038J4182J4851J4972
58324A046406J5165J5681J6218J6754J7671J8852J9595J9562J9169J8809J8397
58313A242279J7870J7410J6887J5800J4103J2528J1678J1340J1061J0964J1492
58302A393412J2671J4027J5060J5607J5944J6623J7937J9494K0660K1417K2256
$$ y = [604157, 607412, 610054, 612043, 613831, 615949, 618466, 620987, 623249, 625523, 628301, 631803, 635984, 640831, 646333, 652212, 657966, 663207, 667853, 672048, 676061, 680161, 684330, 688194, 691509, 694664, 698356, 702689, 706926, 710315, 712958, 715682, 719237, 723876, 729627, 736563, 744535, 752795, 760298, 766602, 772259, 778098, 784345, 790753, 797400, 804670, 812460, 820089, 827341, 834984, 843700, 853010, 861908, 870238, 878738, 887930, 897650, 907575, 917498, 927078, 936071, 944954, 954667, 965567, 977216, 989363, 1002401, 1016583, 1031434, 1046406, 1061571, 1077252, 1093470, 1110224, 1127895, 1146747, 1166342, 1185904, 1205073, 1223882, 1242279, 1260149, 1277559, 1294446, 1310246, 1324349, 1336877, 1348555, 1359895, 1370956, 1381920, 1393412, 1406083, 1420110, 1435170, 1450777, 1466721, 1483344, 1501281, 1520775, 1541435, 1562852, 1585108]
58291A585108K3199K3678K3626K3926K5265K7169K8716K9834L1221L3259L5636
58280A890637L7878L9739M1180M2348M3567M4990M6340M7226M7583M7551M7090
58269B376129M6081M4687M3413M2848M3418M5144M7445M9502N1064N2661N4801
58258B897193N7311N9753O2136O4806O7925P1500P5680Q0548Q5740R0762R5630
58247C708984J00733J06162J11636J17071J22800J29085J35775J42645J49855
58238D824746J57829J66784J76480J86484J96687K07544K19766K33797K49634
58229F619751K67036K85642L05022L25083L46453L70121L96505M25323M56451
58220I797387M90515N28523N71332O19714O74400P35799Q04185Q80653R67538
$$ y = [1585108, 1608307, 1631985, 1655611, 1679537, 1704802, 1731971, 1760687, 1790521, 1821742, 1855001, 1890637, 1928515, 1968254, 2009434, 2051782, 2095349, 2140339, 2186679, 2233905, 2281488, 2329039, 2376129, 2422210, 2466897, 2510310, 2553158, 2596576, 2641720, 2689165, 2738667, 2789731, 2842392, 2897193, 2954504, 3014257, 3076393, 3141199, 3209124, 3280624, 3356304, 3436852, 3522592, 3613354, 3708984, 3809717, 3915879, 4027515, 4144586, 4267386, 4396471, 4532246, 4674891, 4824746, 4982575, 5149359, 5325839, 5512323, 5709010, 5916554, 6136320, 6370117, 6619751, 6886787, 7172429, 7477451, 7802534, 8148987, 8519108, 8915613, 9340936, 9797387, 10287902, 10816425, 11387757, 12007471, 12681871, 13417670, 14221855, 15102508, 16070046]
58211A6070046J067608J183346J317506J474020J657837J873896K126399K418857
58203B9189515K755308L142874L594140M126566M758531N505111O376579P380367
58195F6828991Q526446R834822J1340052J3086416J5113544J7436110K0013203
58188A62179584K2696926K5168700K6906719K7239234K5503832K1276805J4593002
58181C25564802O057156l236846j1990754j9087041k3892285k6339165k6788678
58174B20287189k5795171k3907425k1564781j9074677j6633009j4355983j2306249
58167H6649894j0508732q961256p645169o535011n603675m823984m170322l620940
58159C4780805l158662k769398k440661k161462j922890j718083j541500j388151
$$ y = [16070046, 17137654, 18321000, 19638506, 21112526, 22770363, 24644259, 26770658, 29189515, 31944823, 35087697, 38681837, 42808403, 47566934, 53072045, 59448624, 66828991, 75355437, 85190259, 96530311, 109616727, 124730271, 142166381, 162179584, 184876510, 210045210, 236951929, 264191163, 289694995, 310971800, 325564802, 331621958, 328385112, 316394358, 297307317, 273415032, 247075867, 220287189, 194492018, 170584593, 149019812, 129945135, 113312126, 98956143, 86649894, 76141162, 67179906, 59534737, 52999726, 47396051, 42572067, 38401745, 34780805, 31622143, 28852745, 26412084, 24250622, 22327732, 20609649, 19068149, 17679998]
58151A7679998j253499j134076j027883r33663q49757p74082p05242o42994n87341
58142I771461n37628m92913m52721m16939l85247l57071l31914l09351k88800
58133F198877k69746k52159k36327k22234k09403j97419j86390j76627j67929
58124D280643j59473j50593j41578j33364j26415j20228j14166j08375j03387
58115C123064r9124r4954r0646q6586q2943p9316p5533p2068o9243o6512o3245
58104B242894n9785n6994n4846n2356m9006m5591m3218m1897m0698l8948l6856
58093A722699l4948l3434l2256l1365l0724l0244k9928k9907l0066k9896k9064
58082A380867k7992k7445k7542k7699k7494k7061k6502k5586k4344k3410k3192
$$ y = [17679998, 16426499, 15292423, 14264540, 13330877, 12481120, 11707038, 11001796, 10358802, 9771461, 9233833, 8740920, 8288199, 7871260, 7486013, 7128942, 6797028, 6487677, 6198877, 5929131, 5676972, 5440645, 5218411, 5009008, 4811589, 4625199, 4448572, 4280643, 4121170, 3970577, 3828999, 3695635, 3569220, 3448992, 3334826, 3226451, 3123064, 3023940, 2928986, 2838340, 2751754, 2668811, 2589495, 2513962, 2441894, 2372651, 2306139, 2242894, 2183109, 2126115, 2071269, 2018913, 1969907, 1924316, 1881098, 1839201, 1798503, 1759555, 1722699, 1687751, 1654317, 1622061, 1590696, 1559972, 1529728, 1499800, 1469893, 1439827, 1409931, 1380867, 1352875, 1325430, 1297888, 1270189, 1242695, 1215634, 1189132, 1163546, 1139202, 1115792, 1092600]
58071A092600k3152k2501k1300k0216j9440j8556j7341j5979j4577j3138j1997
58060H94403j1548j1486j1037j0144r602r854j0381j0651j0863j1229j1304j0708
58048G65596r948r718r779r390q560q032q063q099p691p084o601o131n478m779
58034F56243m279l990l878m019m345m519m317m007m000m296m499m346l949l508
58020E98291l017k365j585q06L2J192K735M242N191N569N838O298O819P312Q058
58005F43804R294J0780J2213J3775J5728J7629J8610J8631J8773J9965K1871K3559
57993H44632K4911K6686K9232L1825L3516L4213L4553L4971L5275L5109L4398
57982A199321L3321L1987L0336K8187K5328K1635J7085J1498M357m736j5228k5571
$$ y = [1092600, 1069448, 1046947, 1025647, 1005431, 985991, 967435, 950094, 934115, 919538, 906400, 894403, 882855, 871369, 860332, 850188, 840586, 830732, 820351, 809700, 798837, 787608, 776304, 765596, 755648, 745930, 736151, 726761, 718201, 710169, 702106, 694007, 686316, 679232, 672631, 666500, 661022, 656243, 651964, 647974, 644096, 640077, 635732, 631213, 626896, 622889, 618889, 614593, 610094, 605748, 601799, 598291, 595274, 592909, 591324, 590518, 590550, 591742, 594477, 598719, 603910, 609479, 615317, 621615, 628434, 635746, 643804, 653098, 663878, 676091, 689866, 705594, 723223, 741833, 760464, 779237, 799202, 821073, 844632, 869543, 896229, 925461, 957286, 990802, 1025015, 1059568, 1094539, 1129814, 1164923, 1199321, 1232642, 1264629, 1294965, 1323152, 1348480, 1370115, 1387200, 1398698, 1403055, 1398319, 1383091, 1357520]
57970A357520l4332m1246m6805n1080n3452n3554n1900m9280m5922m1553l6167
57959H52229l0358k4926k0288j6333j2709r269o223l820k019o02N30J441K422
57946G30075L721M956N300M469L135K083J363N44m61j314j716j534o38R52K858
57931G53793M683O487Q586J0962J3230J5023J6019J5695J3654J0187N979J239
57919H75537m341j0632j6780k2097k6608l0268l2302l2090l0337k8482k6988k5005
57907E89607k1902j8331j5422j3453j1917j0486r279q336p462o682o304o368o481
57894D47184o482o789p735q839r308q964q263p452o374n098m121l701l417k750
57880C57891j702n58O61K179M121O402Q743J0558J1224J0790J0056R557Q856P319
$$ y = [1357520, 1323188, 1281942, 1235137, 1184057, 1130605, 1077051, 1025151, 975871, 929949, 888396, 852229, 821871, 796945, 776657, 760324, 747615, 738346, 732123, 728303, 726284, 725682, 726212, 727653, 730075, 733796, 738752, 744052, 748521, 751656, 753739, 755102, 755646, 755185, 753871, 752155, 750621, 749983, 750935, 753793, 758476, 764963, 773549, 784511, 797741, 812764, 828783, 844478, 858132, 868319, 874298, 875537, 871196, 860564, 843784, 821687, 795079, 764811, 732509, 700419, 670082, 641600, 614612, 589607, 567705, 549374, 533952, 520499, 508582, 498096, 488817, 480481, 473019, 466337, 460033, 453665, 447184, 440702, 433913, 426178, 417339, 408031, 399067, 390804, 383352, 376978, 371880, 367759, 364058, 360641, 357891, 356189, 355631, 356292, 358471, 362592, 368994, 377737, 388295, 399519, 410309, 420365, 429922, 438778, 446097]
57866D46097N293L748K885J903K59j593l024m120n347o747p948q787r399r805
57852D03415r732q963p646o283n290m628l828k537r20O20K027L470M704N060M288
57837C73757L064K295K161K121J695R05Jr25j945l027l907m256l987l360k701
57822C61891k095j458p01L05J762L544N015N729O176P267R037J0548J1315J2093
57808D30428J3814J6330J8808K0965K3190K5731K8376L0854L2812L3472L1924
57797G06704K8003K2452J6119R317K059n415j2544j8615k3039k5730k7161k7850
57785F44300k7881k7251k6452k6076k5921k5193k3730k2312k1501k0797j9421
57774C77765j7378j5246j3331j1638j0272r283q328p092n871n143m735m046l058
$$ y = [446097, 451390, 455138, 458023, 459926, 460185, 458592, 455568, 451448, 446101, 439354, 431406, 422619, 413220, 403415, 393683, 384720, 377074, 370791, 365501, 360873, 357045, 354508, 353588, 354208, 356235, 359705, 364409, 369469, 373757, 376821, 379116, 381277, 383398, 385093, 385998, 385999, 385074, 383129, 380102, 376195, 371939, 367952, 364592, 361891, 359796, 358338, 357637, 357942, 359704, 363248, 368263, 373992, 380168, 387435, 396472, 407020, 418335, 430428, 444242, 460572, 479380, 500345, 523535, 549266, 577642, 608496, 641308, 674780, 706704, 734707, 757159, 773278, 782595, 784654, 779239, 766695, 748080, 725041, 699311, 672150, 644300, 616419, 589168, 562716, 536640, 510719, 485526, 461796, 439484, 417983, 397186, 377765, 360387, 345141, 331810, 320172, 309900, 300617, 292289, 285197, 279326, 274183, 269448, 265402, 262344]
57761B62344k356k135j902j359q53o56m64j8L98N79R34J828K808L217L275L780
57745B69420M859N822O272O582P050P299O856N904M995M397L986L575L013K244
57731C42274J424Q53N47J94l48p35o10n1O43J346K041K592K960L396M104M870
57715C65500N283N254N089N162N668O470P096P182P083P627R017J0458J1248J1680
57701D69817J2393J3315J4048J4879J6546J9070K1717K4047K6309K8733L1252
57690F92126L3964L7150M0682M4181M7812N2131N7002O1614O5822P0484P5887
57679A278855Q0867Q4265Q6492Q8734R1203R3302R5186R8024J02499J07675J11288
57668B318390J10362J01433Q1155M7866L262m7126r5261j33427j57084j65977
$$ y = [262344, 259988, 257853, 255951, 254592, 253739, 253083, 252619, 252601, 252999, 253578, 254512, 256340, 259148, 262365, 265640, 269420, 274279, 280101, 286373, 292955, 300005, 307304, 314160, 320064, 325059, 329456, 333442, 337017, 340030, 342274, 343698, 344551, 345098, 345292, 344944, 344209, 343599, 343548, 344191, 345537, 347578, 350170, 353130, 356526, 360630, 365500, 370783, 376037, 381126, 386288, 391956, 398426, 405522, 412704, 419787, 427414, 436431, 446889, 458137, 469817, 482210, 495525, 509573, 524452, 540998, 560068, 581785, 605832, 632141, 660874, 692126, 726090, 763240, 803922, 848103, 895915, 948046, 1005048, 1066662, 1132484, 1202968, 1278855, 1359722, 1443987, 1530479, 1619213, 1710416, 1803718, 1898904, 1996928, 2099427, 2207102, 2318390, 2428752, 2530185, 2611340, 2659206, 2662468, 2615342, 2520081, 2386654, 2229570, 2063593]
57658B063593j62973j52126j37405j21977j07505r4130q1573p0192o0600n2709
57648A022403m5726l9094l2869k7278k2385j8194j4640j1439q317n273k352O43
57636G95479L840O911R529J2000J4919J8279K1493K4152K6306K8165L0072L2596
57624A023741L5974L9565M2563M5025M7516M9765N0749N0119M8544M6310M2689
57613A522560L7151L0305K2940J4968O054l414j2809k2141l1474l9895m6148n0179
57601A427918n3122n5675n7402n7755n6944n5441n3307n0537m7602m5087m3009
57590H52037m0924l8553l5942l3089k9893k6584k3827k2103k1114k0075j8545
57579E41388j6755j5131j3811j2722j1814j0890r556p685n885m977n006n159m738
$$ y = [2063593, 1900620, 1748494, 1611089, 1489112, 1381607, 1287477, 1205904, 1135712, 1075112, 1022403, 976677, 937583, 904714, 877436, 855051, 836857, 822217, 810778, 802461, 797188, 794836, 795479, 799319, 806230, 815759, 827759, 842678, 860957, 882450, 906602, 932908, 961073, 991145, 1023741, 1059715, 1099280, 1141843, 1186868, 1234384, 1284149, 1334898, 1385017, 1433561, 1479871, 1522560, 1559711, 1590016, 1612956, 1627924, 1633978, 1630564, 1617755, 1595614, 1564140, 1524245, 1478097, 1427918, 1374796, 1319121, 1261719, 1203964, 1147020, 1091579, 1038272, 987735, 940133, 895046, 852037, 811113, 772560, 736618, 703529, 673636, 647052, 623225, 601122, 580008, 559933, 541388, 524633, 509502, 495691, 482969, 471155, 460265, 450709, 443024, 437139, 432162, 427156, 421997, 417259]
57566D17259l880l183k997l190l355l008j931m65P19J335J747K375L130L664L946
57551D12166M299M950N827O720P522Q339R422J0863J2346J3408J3975J4451J5231
57538E39519J6438J8111K0227K2416K4121K5367K6951K9491L2589L5303L7186
57527H27719L8468L9443M0157M0677M1104M1210M0377L8115L4477K9948K4893
57516A236588J9235J2602M876l467j1727j9507k6624l2624l6968l9766m1763m3294
57504A017561m3792m2737m0599l8340l6310l4247l2016k9743k7390k4837k2301
57493F45249k0105j8044j5575j2665r932p820o105m353k461n70J176K698M074
57480E55567N646P717J0104J2326J4219J6066J8012J9838K1412K3033K5099K7637
$$ y = [417259, 413379, 410196, 407199, 404009, 400654, 397646, 395715, 395250, 395969, 397304, 399051, 401426, 404556, 408220, 412166, 416465, 421415, 427242, 433962, 441484, 449823, 459245, 470108, 482454, 495862, 509837, 524288, 539519, 555957, 574068, 594295, 616711, 640832, 666199, 693150, 722641, 755230, 790533, 827719, 866187, 905630, 945787, 986464, 1027568, 1068778, 1109155, 1147270, 1181747, 1211695, 1236588, 1255823, 1268425, 1273301, 1269834, 1258107, 1238600, 1211976, 1179352, 1142384, 1102618, 1060855, 1017561, 973769, 931032, 890433, 852093, 815783, 781536, 749520, 719777, 692387, 667550, 645249, 625144, 607100, 591525, 578860, 568928, 561108, 555003, 550650, 548189, 547619, 548795, 551493, 555567, 561213, 568930, 579034, 591360, 605579, 621645, 639657, 659495, 680907, 703940, 729039, 756676]
57468G56676L0265L2426L3718L4267L4727L5545L6274L5974L4348L1917K8978
57457A125115K4976J9295J2224M670k821j0316j7908k5286l1927l7441m1643m4458
57445I74480m5940m6376m6252m5925m5205m3554m0922l8121l5957l4194l1922
57434E20112k8959k6180k4296k2949k1427j9741j8382j7333j6046j4322j2683
57423B97794j1678j1179j0568r461q102p097o816p032p077o440n222m078l674
57410A99370m073m613m542l837l195l112l258l112k823k858l015k565j441n39
57396A56387n37j047j293j078o46m6P44J439J683J486J040L83l94q78p55k33L14
57379A56569Q32J287J324Q42N05Q20J083J27j821l128k798j655j063j281j639
$$ y = [756676, 786941, 819367, 853085, 887352, 922079, 957624, 993898, 1029872, 1064220, 1096137, 1125115, 1150091, 1169386, 1181610, 1186280, 1183459, 1173143, 1155235, 1129949, 1098022, 1060581, 1018938, 974480, 928540, 882164, 835912, 789987, 744782, 701228, 660306, 622185, 586228, 552034, 520112, 491153, 464973, 440677, 417728, 396301, 376560, 358178, 340845, 324799, 310477, 297794, 286116, 274937, 264369, 254908, 246806, 239709, 232893, 225861, 218784, 212344, 207122, 203044, 199370, 195297, 190684, 186142, 182305, 179110, 175998, 172740, 169628, 166805, 163947, 160932, 158367, 156926, 156387, 155850, 154803, 153510, 152432, 151786, 151740, 152484, 153923, 155606, 157092, 158132, 158515, 158121, 157243, 156488, 156255, 156569, 157401, 158688, 160012, 160854, 161359, 162179, 163262, 163389, 161568, 158440, 155642, 153987, 152924, 151643, 150004]
57364A50004j724j650j511j237q58n04k32j25l87r92j485j484j238j252j523j589
57348A32213j260q45n96l62P3O20R77R70O45K30L7K37P05J171J563K019K537K819
57330A43753K554J789R24M46O15J350K303L175L850M306M467M333M082L858L565
57315A85370L216L287M284N876P038P265P201P741Q878R929J0511J0748J0639
57302B81983R995R075Q636Q987R410Q933P414N649M472M003L559K203m02l477
57288C60440n748o790p539r114j1435j3372j4111j3838j3167j2432j1701j1029
57276B30164j0411r715q840p850o841n844m928m171l514k864k312k024j810j222
57262A57818k13O25P24J72n00r41j082r03m39P7M69Q55J301J422Q19j38m68K83
$$ y = [150004, 148280, 146630, 145119, 143882, 143024, 142520, 142288, 142163, 141776, 140784, 139299, 137815, 136577, 135325, 133802, 132213, 130953, 130108, 129512, 129150, 129223, 129843, 130820, 131790, 132435, 132665, 132702, 132939, 133644, 134815, 136378, 138397, 140934, 143753, 146307, 148096, 149020, 149466, 150081, 151431, 153734, 156909, 160759, 165065, 169532, 173865, 177947, 181805, 185370, 188586, 191873, 196157, 202033, 209071, 216336, 223537, 231278, 240156, 250085, 260596, 271344, 281983, 291978, 301053, 309689, 318676, 328086, 337019, 344433, 350082, 354554, 358557, 362116, 364319, 363917, 360440, 354692, 347902, 340363, 331249, 319814, 306442, 292331, 278493, 265326, 252894, 241193, 230164, 219753, 210038, 201198, 193348, 186507, 180663, 175735, 171564, 168050, 165186, 162874, 160850, 159040, 157818, 157605, 158230, 158954, 159126, 158626, 157685, 156603, 155700, 155261, 155338, 155807, 156662, 157963, 159385, 160204, 160066, 159598, 159881]
57244A59881J474K202K323K289K292K072J572J305J745K699L515L857L911L910
57230A95047L749L314K892L027L917N145O043O235N916N701O154P200Q071Q052
57216B70463P362P026P754R159J0239J0470J0215J0210J0835J1873J2802J3273
57204C91681J3341J3263J3115J2852J2738J3300J4602J5846J6186J5869J6064
57193E48857J7419J9191K0134J9899J9233J8918J9005J9175J9428K0024K0943
57182G62226K1827K2546K3407K4649K5982K6980K7641K8178K8388K7825K6729
57171A046378K6253K7403K9974L2757L4563L4735L3034K9655K5471K1848J9816
57160A361887J9337J9336J8561J6701J4751J4059J4818J5761J5643J4700J4181
$$ y = [159881, 161355, 163557, 165880, 168169, 170461, 172533, 174105, 175410, 177155, 179854, 183369, 187226, 191137, 195047, 198796, 202110, 205002, 208029, 211946, 217091, 223134, 229369, 235285, 240986, 247140, 254340, 262411, 270463, 277825, 284851, 292605, 301764, 312003, 322473, 332688, 342898, 353733, 365606, 378408, 391681, 405022, 418285, 431400, 444252, 456990, 470290, 484892, 500738, 516924, 532793, 548857, 566276, 585467, 605601, 625500, 644733, 663651, 682656, 701831, 721259, 741283, 762226, 784053, 806599, 830006, 854655, 880637, 907617, 935258, 963436, 991824, 1019649, 1046378, 1072631, 1100034, 1130008, 1162765, 1197328, 1232063, 1265097, 1294752, 1320223, 1342071, 1361887, 1381224, 1400560, 1419121, 1435822, 1450573, 1464632, 1479450, 1495211, 1510854, 1525554, 1539735]
57149A539735J4667J5429J5554J5052J4576J4462J4544J4678J4972J5491J6026
57138A705186J6339J6483J6726J7194J7744J8284J9076K0407K1957K2928K3084
57127A915408K3337K4792K7357K9859L1545L2924L4842L7290L9570M1386M3243
57116B281553M5919M9959N5622O2882P1236P9880Q8318R6797J06075J16870J29694
57105C184805J45104J63869J86812K14650K48158K88500L37174L95648M65170
57096E629890N47053O42773P53194Q77463J013054J157298J308762J466616J628347
57087A5024450J788126J937279K065861K163286K217751K216172K146440K001111
57079C1560476J780110J490581J144416P55504L38313r2004n18895r24388j290505
$$ y = [1539735, 1554402, 1569831, 1585385, 1600437, 1615013, 1629475, 1644019, 1658697, 1673669, 1689160, 1705186, 1721525, 1738008, 1754734, 1771928, 1789672, 1807956, 1827032, 1847439, 1869396, 1892324, 1915408, 1938745, 1963537, 1990894, 2020753, 2052298, 2085222, 2120064, 2157354, 2196924, 2238310, 2281553, 2327472, 2377431, 2433053, 2495935, 2567171, 2647051, 2735369, 2832166, 2938241, 3055111, 3184805, 3329909, 3493778, 3680590, 3895240, 4143398, 4431898, 4769072, 5164720, 5629890, 6176943, 6819716, 7572910, 8450373, 9463427, 10620725, 11929487, 13396103, 15024450, 16812576, 18749855, 20815716, 22979002, 25196753, 27412925, 29559365, 31560476, 33340586, 34831167, 35975583, 36731087, 37069400, 36977396, 36458501, 35534113, 34243608]
57070C4243608j601924j848564k026561k137054k183886k172122k108391k001950
57062A8163156j864530j708323j543770j378892j219919j071631r36989q17077
57054G622025p11808o20613n42435m75700m18879l70996l31342k98796k71732
57045C579724k48538k28034k09566j92860j77700j63615j50036j36859j24589
57036A947927j13698j04046r5196q6980p9486p2789o6999o2292n8429n4672n0645
57025A102695m6990m4492m2806m0769l7903l4825l2227l0228k8842k8209k8018
57014G07386k7438k6098k4559k3447k2640k1757k0882k0258j9635j8611j7330
57003D64731j6351j5896j5667j5282j4582j3642j2700j1915j1061r721p983o479
$$ y = [34243608, 32641684, 30793120, 28766559, 26629505, 24445619, 22273497, 20165106, 18163156, 16298626, 14590303, 13046533, 11667641, 10447722, 9376091, 8439102, 7622025, 6910217, 6289604, 5747169, 5271469, 4852590, 4481594, 4150252, 3851456, 3579724, 3331186, 3103152, 2893586, 2700726, 2523026, 2359411, 2209375, 2072516, 1947927, 1834229, 1730183, 1634987, 1548007, 1468521, 1395732, 1328733, 1266441, 1208012, 1153340, 1102695, 1055705, 1011213, 968407, 927638, 889735, 854910, 822683, 792455, 763613, 735404, 707386, 679948, 653850, 629291, 605844, 583204, 561447, 540565, 520307, 500672, 482061, 464731, 448380, 432484, 416817, 401535, 386953, 373311, 360611, 348696, 337635, 327914, 319931, 313452]
56991C13452n495m468k803p60J031K583M474O844R104J0536J0794R895Q179O164
56977C69530M025J386j889m910o391o060m912m024l623l368k960k273j322k94
56963C32915O68J724L104M622N864O815P798Q754R143Q668P518N716K899r37m938
56948D00333q109j0145j1211j1353j0581r210p617n844l828j808p1J524L273N044
56934C30397O512P922J0030J3037J5965J7327J6258J2898P979K349l215q079j1871
56921D17509j4572j6439j7750j8521j8492j7414j5380j2849j0431q646p697p327
56909B51991o925o041m762l565k786k344k012j725j624j794k152k490k572k205
56895B08994j273J56J770L129M018M681N609P000Q465R396R555R251Q840Q177
$$ y = [313452, 307957, 303489, 300686, 299926, 300957, 303540, 308014, 314858, 323962, 334498, 345292, 355187, 363366, 369530, 373555, 374941, 373052, 368142, 361751, 355691, 350779, 346755, 343132, 339764, 336804, 334531, 333209, 332915, 333583, 335307, 338411, 343033, 348897, 355712, 363510, 372264, 381407, 390075, 397593, 403309, 406208, 405271, 400333, 392224, 382079, 370868, 359515, 348934, 339724, 332107, 326263, 322435, 320627, 320556, 322080, 325353, 330397, 336909, 344831, 354861, 367898, 383863, 401190, 417448, 430346, 438325, 440674, 437459, 429380, 417509, 402937, 386498, 368748, 350227, 331735, 314321, 298941, 286092, 275661, 267015, 259318, 251991, 245066, 239025, 234263, 230698, 227912, 225568, 223556, 221831, 220207, 218413, 216261, 213771, 211199, 208994, 207721, 207877, 209647, 212776, 216794, 221475, 227084, 234084, 242549, 251945, 261500, 270751, 279591, 287768]
56881B87768O703M070O65k517m500m965m462l984m105m357l669j571J226L678
56867B69980N550P288R003J0399J1702J3819J7111K0624K3086K4158K3984K2120
56855D58824J7881J1596M556k302q733j4136j7241j7417j5581j3174j0746q030
56843C85497m866j347K568O907J1269J5226J9024K3334K8271L3121L7013L9338
56831E95355L9494L6694L0376K0646Q360m967j7334k6910l2874l5607l5874l4025
56819E43334l0139k4779j9176j4423j0531o605k022K780P023J0826J5144K0310
56807D91742K5218K8289K8807K6875K2498J5479O182m173j4196k2895k9595l3685
56795E40546l4770l2969k9016k4186j9768j6229j2970r297n495k423j39K338N654
$$ y = [287768, 294471, 298541, 299206, 296689, 292189, 287224, 282762, 278778, 274673, 270316, 266647, 265076, 266302, 269980, 275530, 282818, 291821, 302220, 313922, 327741, 344852, 365476, 388562, 412720, 436704, 458824, 476705, 488301, 492857, 490555, 481822, 467686, 450445, 433028, 417447, 404273, 393527, 385497, 380631, 379284, 381852, 388759, 400028, 415254, 434278, 457612, 485883, 519004, 556017, 595355, 634849, 671543, 701919, 722565, 730925, 725958, 708624, 681714, 648840, 613233, 577359, 543334, 513195, 488416, 469240, 454817, 444286, 437681, 435659, 438439, 445462, 456288, 471432, 491742, 516960, 545249, 574056, 600931, 623429, 638908, 645090, 640917, 626721, 603826, 574231, 540546, 505776, 472807, 443791, 419605, 399837, 383608, 370638, 361341, 355846, 353423, 353284, 355622, 361276]
56782C61276R235J2106J3997J5067J4976J2973Q832L191k995q918j3927j7554
56770D08259j9753k0799k0908k0114j8576j6695j4808j3031j1425j0145r233q427
56758B24345p353n970m728m222m522m892m343k733j083n59j171j858j805j267
56744A77839r27q45n08K52Q53O09m18j434j676j072j54N09P12N73K87K7j00j54
56726A74373l35o41o87j35P29J187R84O03M57K80l10r46q67m4P82J201J660K543
56708A80834L347L381K853K643L043L416L248K957L350M540N774O243N792M869
56694B36290L976L277K699K187J755J336Q00K75J43N58J068J108P08M47O92J230
56678B58549J673J853J756J406R81P13N75L14n2j56J12K84q1q36j546k062k407
$$ y = [361276, 370511, 382617, 396614, 411681, 426657, 439630, 448462, 451653, 448658, 439740, 425813, 408259, 388506, 367707, 346799, 326685, 308109, 291414, 276606, 263575, 252150, 242005, 232772, 224345, 216992, 211022, 206294, 202072, 197550, 192658, 188315, 185582, 184499, 183940, 182769, 180911, 179106, 177839, 176912, 176067, 175559, 175811, 176664, 177273, 176855, 175421, 173745, 172673, 172519, 173028, 173740, 174313, 174600, 174627, 174527, 174373, 174038, 173397, 172710, 172575, 173304, 174491, 175475, 176078, 176535, 176815, 176505, 175559, 174692, 174648, 175430, 176631, 178291, 180834, 184181, 187562, 190415, 193058, 196101, 199517, 202765, 205722, 209072, 213612, 219386, 225629, 231421, 236290, 240266, 243543, 246242, 248429, 250184, 251520, 252320, 252595, 252738, 253296, 254364, 255472, 256180, 256627, 257319, 258549, 260222, 262075, 263831, 265237, 266218, 266931, 267506, 267820, 267768, 267612, 267724, 268008, 267927, 267091, 265545, 263483, 261076]
56661B61076k433k097j811k003k461k643k528k583k907l092k924k656k430k099
56647B26409j806k054k799l150k540j656j498j904j808q04M08J160J624K168K550
56632B14300K243J242J00o83r84q98n04J25Q40J331J166J32j357k456k688k360
56616B09549k067j952j800j627j663j771j373k14J147J927J983J805J780J833
56602B07557J751J562J461J559J838K208K495K486K092J461R30Q32J228J720J674
56587B32854R30J59J21O50Q40L71K4M64J063O61p45j848j657n46M45P81N59R4
56569B35220j94J81J241K335K825K806K697K400J485J37q11r51q15r94j335j356
56553B44871j072q83r57j241j834k808l695l828l283k879l079l445l496l503l882
$$ y = [261076, 258643, 256546, 254735, 252732, 250271, 247628, 245100, 242517, 239610, 236518, 233594, 230938, 228508, 226409, 224603, 222549, 219750, 216600, 214060, 212404, 210906, 209002, 207194, 206390, 206798, 207958, 209582, 211750, 214300, 216543, 217785, 217885, 217202, 216218, 215320, 214816, 214941, 215781, 217112, 218278, 218410, 217053, 214597, 211909, 209549, 207482, 205530, 203730, 202103, 200440, 198669, 197296, 197082, 198229, 200156, 202139, 203944, 205724, 207557, 209308, 210870, 212331, 213890, 215728, 217936, 220431, 222917, 225009, 226470, 227400, 228232, 229460, 231180, 232854, 233784, 233943, 234064, 234714, 235554, 235925, 235949, 236413, 237476, 238137, 237392, 235544, 233887, 233341, 233786, 234567, 235126, 235220, 235026, 235207, 236448, 238783, 241608, 244414, 247111, 249511, 250996, 251133, 250322, 249371, 248556, 247562, 246227, 244871, 243799, 242916, 241959, 240718, 238884, 236076, 232381, 228553, 225270, 222391, 219312, 215867, 212371, 208868, 204986]
56538B04986m279m054l417l284l850m158l433k188j491j509j459q02J18O38M97
56523A72315o3n59n46P1Q79J289J149P43K93k37p68r82q06o57q43j000n33L78
56505A70123P61k8j462k389k311j807j682j938j901j196k60K67M00O51J201J594
56489A60023J383P51K58J78L05L61L70N60R75J266J027L22k24k5Q42J783K278
56472A72433K214J783J408J584K308K734J970L45p47n39J48J18n70q56k84M06
56456A84455L00n98j483j567p37L59Q34M43j83l61k41m23r27j148q46n39p19j173
56438A75446j397j271j038r00q87r68j045j010r17q77p66l46K68O15N36M06M81
56421A66330M88J50k30j84K48O67R39J165J289J144R01R26J189J259R70P23R32
$$ y = [204986, 200707, 196653, 193236, 189952, 186102, 181944, 178511, 176323, 174832, 173323, 171864, 171062, 171180, 171818, 172315, 172252, 171693, 171147, 171218, 172097, 173386, 174535, 175278, 175571, 175334, 174566, 173584, 172778, 172121, 171278, 170278, 169745, 170123, 170884, 170856, 169394, 167005, 164694, 162887, 161205, 159267, 157366, 156170, 155910, 156177, 156577, 157228, 158429, 160023, 161406, 162157, 162415, 162593, 162898, 163259, 163629, 164189, 165164, 166430, 167457, 167779, 167555, 167530, 168372, 170155, 172433, 174647, 176430, 177838, 179422, 181730, 184464, 186434, 186779, 186032, 185493, 185641, 185759, 185189, 184333, 184049, 184455, 184755, 184157, 182674, 181107, 180370, 180729, 181563, 182006, 181823, 181462, 181221, 180798, 179871, 178723, 177877, 177338, 176619, 175446, 174049, 172778, 171740, 170840, 169953, 168985, 167940, 166930, 166013, 165136, 164370, 164024, 164292, 164907, 165443, 165849, 166330, 166818, 166968, 166738, 166554, 166802, 167469, 168408, 169573, 170862, 172006, 172907, 173833, 175022, 176281, 177251, 177974, 178906]
56404A78906J502K013K192K046J701J345J167J288J600J838J738J270P11L89K87
56389A99993Q1l82q11q57n75l08k46l78o69r90r94n02J60N05N49O39P56N10l9
56370A96442k16L72J219J610J632J927K616K939K171O70k81K15J601K360J704
56355B16981N10J78Q62J420J093M13K25N23P97R89J400J897K030J861J979K562
56339B35720L053K960K600K657L232L693L433K619K068K347L091L387K917K368
56325B76145K523L192L516L130K588K556L041L567L735L491L049K768K900L305
56311C19506L528L218K476J763J545J880K259J985J031K81N29J422J910J673J425
56296C46431J722K167K232K150K470L173L900M712N884P127P728P578P418P848
$$ y = [178906, 180408, 182421, 184613, 186659, 188360, 189705, 190872, 192160, 193760, 195598, 197336, 198606, 199317, 199706, 199993, 200074, 199692, 198881, 198024, 197449, 197141, 196895, 196517, 195848, 194858, 193864, 193362, 193522, 194027, 194576, 195215, 195971, 196481, 196442, 196226, 196598, 197817, 199427, 201059, 202986, 205602, 208541, 210712, 211382, 211101, 211316, 212917, 215277, 216981, 217491, 217669, 218531, 219951, 221044, 221457, 221682, 222205, 223002, 223991, 225391, 227288, 229318, 231179, 233158, 235720, 238773, 241733, 244333, 246990, 250222, 253915, 257348, 259967, 262035, 264382, 267473, 270860, 273777, 276145, 278668, 281860, 285376, 288506, 291094, 293650, 296691, 300258, 303993, 307484, 310533, 313301, 316201, 319506, 323034, 326252, 328728, 330491, 332036, 333916, 336175, 338160, 339191, 339472, 340001, 341423, 343333, 345006, 346431, 348153, 350320, 352552, 354702, 357172, 360345, 364245, 368957, 374841, 381968, 389696, 397274, 404692, 412540]
56282D12540Q700R626J0798J2511J4415J5706J6130J6356J7223J8917K1073K3426
56270E97421K6038K8995L2319L6273M1257M7125N2983N8161O3234O9418P6994
56259A130218Q4941R2248R8955J05519J11732J16849J20426J22375J22390J19821
56249B225474J14204J05527R4021P9995O3827M5876K6608O968j1691k8476m3518
56238B678815n7173o9034p8389q5411r1063r5858r9433j01450j02013j01097r8459
56227A699435r4496r0315q6394q2000p6529p0726o5686o1250n6475n1257m6460
56216I17847m2460l8669l4731l1143k8352k5975k3485k1037j9094j7606j6176
56205F19119j4734j3502j2465j1335j0017q699p481o289n209m518m221l860l011
$$ y = [412540, 421240, 430866, 441664, 454175, 468590, 484296, 500426, 516782, 534005, 552922, 573995, 597421, 623459, 652454, 684773, 721046, 762303, 809428, 862411, 920572, 983806, 1053224, 1130218, 1215159, 1307407, 1406362, 1511881, 1623613, 1740462, 1860888, 1983263, 2105653, 2225474, 2339678, 2445205, 2539226, 2619221, 2683048, 2728924, 2755532, 2762500, 2750809, 2722333, 2678815, 2621642, 2552608, 2474219, 2388808, 2297745, 2201887, 2102454, 2001004, 1898991, 1797894, 1699435, 1604939, 1514624, 1428230, 1346230, 1269701, 1198975, 1133289, 1072039, 1015564, 964307, 917847, 875387, 836718, 801987, 770844, 742492, 716517, 693032, 671995, 652901, 635295, 619119, 604385, 590883, 578418, 567083, 557066, 548367, 540886, 534597, 529388, 524870, 520649, 516789, 513778]
56192E13778j801p39j49N0J01K61Q29J963L332M209M234L915M045M790N664O400
56176E50882P297Q535R694J0383J1002J2189J3644J4253J3558J2592J2759J4146
56164F90934J5461J5645J5122J5238J6712J9012K1236K3254K5725K9139L3373
56153I20851L8268M4262N2039O1826P3525Q7448J04172J23348J42984J60233J72652
56142A981608J78416J75970J64571J45607J22877J00948Q2995P0049O1572N5912
56132C140525N0339M1575K7521Q932j0659k7032l7808m3578m7169n2012o0894
56121B989740p5370r5309j18429j40693j57942j67716j69544j63907j51673j34659
56111A614498j15775r7676q1373o6614n3340m2019l2755k5037j8534j3459r816
$$ y = [513778, 511977, 511238, 511089, 511139, 511240, 511501, 512330, 514293, 517625, 521834, 526068, 529983, 534028, 538818, 544482, 550882, 558179, 566714, 576408, 586791, 597793, 609982, 623626, 637879, 651437, 664029, 676788, 690934, 706395, 722040, 737162, 752400, 769112, 788124, 809360, 832614, 858339, 887478, 920851, 959119, 1003381, 1055420, 1117246, 1190771, 1278219, 1382391, 1505739, 1648723, 1808956, 1981608, 2160024, 2335994, 2500565, 2646172, 2769049, 2869997, 2952992, 3023041, 3084613, 3140525, 3190864, 3232439, 3259960, 3268892, 3258233, 3231201, 3193393, 3149815, 3102646, 3050634, 2989740, 2914370, 2819061, 2700632, 2559939, 2401997, 2234281, 2064737, 1900830, 1749157, 1614498, 1498723, 1401047, 1319674, 1253060, 1199720, 1157701, 1124946, 1099909, 1081375, 1067916, 1058100]
56100A058100o979m344j958r1J304K256K417J609L72n63j057j364j461j180o96
56085A046365l21L4O20J270J722K277L416M869N836O175O526P201P816Q234Q997
56070A111037J0351J1645J2267J2520J2960J3452J3611J3748J4486J5710J6665
56059A258452J7119J7652J8669J9784K0361K0249J9747J9256J9234K0055K1597
56048A472175K3128K3972K4266K4773K5935K7395K8540K9364L0454L2191L4315
56037A776508L6326L8035L9394M0192M0392M0576M1434M2810M3871M4355M4998
56026B228891M6407M8225M9839N1361N3275N5516N7630N9605O1759O3954O5695
56015B842157O7106O9103P2285P6170P9816Q2858Q5655Q8789R2736R7729J03565
$$ y = [1058100, 1051121, 1046777, 1044819, 1044728, 1046032, 1048288, 1050705, 1052314, 1052686, 1052123, 1051066, 1049702, 1048241, 1047061, 1046365, 1046044, 1046078, 1046698, 1047968, 1049690, 1051967, 1055383, 1060252, 1066088, 1072263, 1078789, 1085990, 1093806, 1102040, 1111037, 1121388, 1133033, 1145300, 1157820, 1170780, 1184232, 1197843, 1211591, 1226077, 1241787, 1258452, 1275571, 1293223, 1311892, 1331676, 1352037, 1372286, 1392033, 1411289, 1430523, 1450578, 1472175, 1495303, 1519275, 1543541, 1568314, 1594249, 1621644, 1650184, 1679548, 1710002, 1742193, 1776508, 1812834, 1850869, 1890263, 1930455, 1970847, 2011423, 2052857, 2095667, 2139538, 2183893, 2228891, 2275298, 2323523, 2373362, 2424723, 2477998, 2533514, 2591144, 2650749, 2712508, 2776462, 2842157, 2909263, 2978366, 3050651, 3126821, 3206637, 3289495, 3375150, 3463939, 3556675, 3654404, 3757969]
56004C757969J09627J15325J20558J25668J31179J37619J45358J54321J63999
55995D961623J73935J84170J95033K06680K19136K32664K47647K63996K81120
55986F966004K98802L17889L39558L63995L90331M17965M47398M79576N14988
55977A0536506N53954N97317O46162P01201P63155Q33623R14738J008094J115043
55968A7669793J238253J382078J551144J749678J982964K258969K588237K983031
55960C3404147L456750M022365M689434N462668O344696P341537Q467473R748121
55952H2937191J1220821J2929805J4914202J7188506J9711004K2333320K4740365
55945B05975214K6420401K6717168K4986034K0819808J4262408N911298l167673
$$ y = [3757969, 3867596, 3982921, 4103479, 4229147, 4360326, 4497945, 4643303, 4797624, 4961623, 5135558, 5319728, 5514761, 5721441, 5940577, 6173241, 6420888, 6684884, 6966004, 7264806, 7582695, 7922253, 8286248, 8676579, 9094544, 9541942, 10021518, 10536506, 11090460, 11687777, 12333939, 13035140, 13798295, 14631918, 15546656, 16554750, 17669793, 18908046, 20290124, 21841268, 23590946, 25573910, 27832879, 30421116, 33404147, 36860897, 40883262, 45572696, 51035364, 57380060, 64721597, 73189070, 82937191, 94158012, 107087817, 122002019, 139190525, 158901529, 181234849, 205975214, 232395615, 259112783, 284098817, 304918625, 319181033, 325092331, 321924658]
55938C21924658j1717092j8655435k3366148k5778233k6237319k5280639k3443482
55931A67446310k1156348j8721344j6330952j4099209j2088118j0323423q803948
55924F5922968p511174o419440n502428m734788m092394l553675l100754k719019
55916B8289296k396096k121476j886541j684494j510091j359156j227830j112239
55908A4991373j009112r16451q33159p58109o90121o28685n73979n25838m83169
55899H572750m44701m09913l78944l51731l27596l05572k84977k65652k47793
55890E555871k31518k16655k02919j90231j78691j68347j59201j51414j45137
55881C911758j39982j34901j28975j22287j15776j10155j05167j00078r4700q9622
$$ y = [321924658, 310207566, 291552131, 268185983, 242407750, 216170431, 190889792, 167446310, 146289962, 127568618, 111237666, 97138457, 85050339, 74726916, 65922968, 58411794, 51992354, 46489926, 41755138, 37662744, 34109069, 31008315, 28289296, 25893200, 23771724, 21885183, 20200689, 18690598, 17331442, 16103612, 14991373, 13982261, 13065810, 12232651, 11474542, 10784421, 10155736, 9581757, 9055919, 8572750, 8128049, 7718136, 7339192, 6987461, 6659865, 6354293, 6069316, 5803664, 5555871, 5324353, 5107698, 4904779, 4714548, 4535857, 4367510, 4208309, 4056895, 3911758, 3771776, 3636875, 3507900, 3385613, 3269837, 3159682, 3054515, 2954437, 2859737, 2770115]
55871B770115q5423q1938p8544p4989p1613o8783o6414o4114o1550n8590n5363
55860B002794n2333n0076m8633m7273m5169m2314l9454l7179l5342l3431l1273
55849A540317k9178k7500k6215k4966k3475k1827k0271j8803j7149j5234j3443
55838A302256j2164j1225j0110q641p217o358o296p042q493j0317j2037j3467
55826A188889j4904j6697j8635k0121k0842k1131k1549k2241k2843k2935k2587
55815I64404k2283k2315k2335k1684k0107j8001j5922j4034j2212j0455q977p909
55803G68170p028n878m119j856L76K080L178L768L521J767j592n622r208j2094
55789G35463j4560j6301j6398j4550j1697r024o823m732k638p66Q83K562M271
$$ y = [2770115, 2684692, 2602754, 2524210, 2449221, 2377608, 2308825, 2242411, 2178297, 2116747, 2058157, 2002794, 1950461, 1900385, 1851752, 1804479, 1759310, 1716996, 1677542, 1640363, 1605021, 1571590, 1540317, 1511139, 1483639, 1457424, 1432458, 1408983, 1387156, 1366885, 1348082, 1330933, 1315699, 1302256, 1290092, 1278867, 1268757, 1260116, 1252899, 1246541, 1240245, 1233203, 1224710, 1214393, 1202356, 1188889, 1173985, 1157288, 1138653, 1118532, 1097690, 1076559, 1055010, 1032769, 1009926, 986991, 964404, 942121, 919806, 897471, 875787, 855680, 837679, 821757, 807723, 795511, 785056, 776079, 768170, 761142, 755264, 751145, 749289, 749665, 751745, 754923, 758691, 762212, 763979, 762387, 756765, 747557, 735463, 720903, 704602, 688204, 673654, 661957, 652933, 646110, 641378, 638740, 637974, 638857, 641419, 645690]
55776F45690N672O504O631N765L706R14j743m021o519r606j2687j5056j6873j8592
55762E89785j9816j9655j8265j7081j7154j7911j8042j7111j5715j4381j3069
55751D01585j1706j0552r796r183q329p208o115n320m879m637m332l851l463l571
55737C08643m106m418m058l387l074l128k938k248j538j236j072o28j95n12j697
55722B74408l002l680l695l381k864k170j546j271j158p05K15J116J486J397J391
55707B56541J854K691L526M052M191M065L923M007M341M655M590M066L388K961
55693C08851K968L429M297N337N952N616M566L731L704M108M165L659K884J912
55679C65179M62j441l259m534n314n813o060o149o372o772o864o278n330m548
$$ y = [645690, 651362, 657866, 664497, 670262, 673968, 674882, 673139, 669118, 662599, 652993, 640306, 625250, 608377, 589785, 569969, 550314, 532049, 514968, 497814, 479903, 461861, 444750, 429035, 414654, 401585, 389879, 379327, 369531, 360348, 352019, 344811, 338696, 333376, 328497, 323860, 319528, 315677, 312214, 308643, 304537, 300119, 296061, 292674, 289600, 286472, 283534, 281286, 279748, 278512, 277440, 276812, 276617, 276105, 274408, 271406, 267726, 264031, 260650, 257786, 255616, 254070, 252799, 251641, 250936, 251151, 252267, 253753, 255150, 256541, 258395, 261086, 264612, 268664, 272855, 276920, 280843, 284850, 289191, 293846, 298436, 302502, 305890, 308851, 311819, 315248, 319545, 324882, 330834, 336450, 341016, 344747, 348451, 352559, 356724, 360383, 363267, 365179, 365641, 364200, 360941, 356407, 351093, 345280, 339220, 333071, 326699, 319927, 313063, 306785, 301455, 296907]
55665B96907l774k381l74J431K476L222M485O424Q477J0075J1122J1931J2916
55652C62937J4178J5160J4997J3469J1395R597P760M884Q46l091n556o398o416
55639D33762o255o012n645n110m173k612q05L19J72q70j995k845l647m716o242
55624C83326q413j1211j4036j5985j6782j7051j7363j7426j6650j5196j3776j2510
55612B06927j0809q596o862o465o887o849n918m742l910l279k623k205k341k807
55598A32634l067k878k405j958j795j975k215k061j449q50p23r80j201j128p25
55583A07224l4P12J123J082R57J080J226J025O64O71J079J352J128O07J27k35
55567A19788n19o99p46o26k53L14O99O67O10J054J713J705Q71J42L09J005J367
$$ y = [296907, 293133, 290752, 290378, 291809, 294285, 297507, 301992, 308416, 316893, 326968, 338090, 350021, 362937, 377115, 392275, 407272, 420741, 432136, 441733, 449493, 454377, 455223, 452132, 446576, 440178, 433762, 427507, 421495, 415850, 410740, 406567, 403955, 403150, 403469, 403641, 402771, 400776, 397931, 394284, 389568, 383326, 374913, 363702, 349666, 333681, 316899, 299848, 282485, 265059, 248409, 233213, 219437, 206927, 196118, 187522, 180660, 174195, 167308, 160459, 154541, 149799, 145889, 142610, 139987, 137782, 135441, 132634, 129567, 126689, 124284, 122326, 120531, 118556, 116341, 114280, 112831, 111981, 111258, 110278, 109077, 107949, 107224, 107190, 107902, 109025, 110107, 111064, 112144, 113370, 114395, 115059, 115730, 116809, 118161, 119289, 119896, 120023, 119788, 119269, 118570, 117824, 117198, 116945, 117259, 117958, 118625, 119235, 120289, 122002, 123707, 124578, 124720, 125029, 126034, 127401]
55550A27401J142O24r2j088k117k695k703k453k223k046j898j805j775j809j900
55535A04563j858j455q49m93m01O1J181K252K419J900J618J996K767L789N138
55520A22628O447O998O698O283O416P166Q431J0096J1611J2136J1537J0666J0251
55507B37364J0052R428Q101N980K930p62m227o981r543j2435j4962j5842j4870
55494A94233j3207j1998j1404j0937j0181r028p702o693o288o111n525m491l614
55481H7054l269l139k761k136j580j333j500k059k728l015k650j822r13k05P8
55466E8022k50j016j628j662j404j499k024k316j803q14k42n01j077j217p98k98
55450C9473p9k8O4J15n2l52m92k81K11P48J031R38O53M28J66m15j135j308o68
$$ y = [127401, 128543, 129167, 129075, 127987, 125870, 123175, 120472, 118019, 115796, 113750, 111852, 110047, 108272, 106463, 104563, 102705, 101250, 100401, 99908, 99507, 99568, 100749, 103001, 105420, 107320, 108938, 110934, 113701, 117490, 122628, 129075, 136073, 142771, 149054, 155470, 162636, 171067, 181163, 192774, 204910, 216447, 227113, 237364, 247416, 256844, 264945, 270925, 273855, 273093, 268866, 261885, 252342, 239907, 224945, 209103, 194233, 181026, 169028, 157624, 146687, 136506, 127478, 119776, 113083, 106795, 100684, 95159, 90668, 87054, 83785, 80646, 77885, 75749, 74169, 72836, 71336, 69277, 66549, 63534, 60884, 59062, 58149, 57944, 58022, 57772, 56756, 55128, 53466, 52062, 50563, 48539, 46223, 44420, 43606, 43364, 42863, 41786, 40569, 39771, 39473, 39394, 39366, 39430, 39545, 39493, 39141, 38649, 38368, 38579, 39327, 40358, 41296, 41949, 42377, 42543, 42128, 40993, 39685, 39017]
55431C9017O6R1l47l64J82M45j20r26j073n12O6K04J29K18M38M00j11q30j271
55412C5702j231q99m20L36J330J947J541L93m36l57M1j86j112j855j578l29R88
55395C3875J365N87n57j061q14n77q49j134p29J29M77n3p46p55j75K13j3m99p13
55376B7971o41o56r38j221j186q30m33k61l81o39o85k66M42R51J037R64R55Q01
55358B4984M01K57Q07J494J281J66o92o07k30l35n21N0J133J641J197N20J95n9
55340C1682o18j196j309j035p40m43K5M36L88J8n7L26N69K15l34m59l10m81q98
55321B5779p99K0P02N32q4l16j63j58l03j21L12L87M6l7L53M99m3n82k45P29J334
55300B7842J032O9j023j689j452m52M14M78J28O9J23l64j233j546r31L1Q26J484
$$ y = [39017, 39083, 39174, 38827, 38463, 38645, 39090, 38970, 38044, 36971, 36459, 36525, 36729, 36858, 37076, 37514, 37914, 37803, 36973, 35702, 34471, 33572, 33152, 33488, 34818, 36765, 38306, 38699, 38263, 37906, 37947, 37761, 36649, 34794, 33216, 32887, 33875, 35240, 35827, 35270, 34209, 33395, 32818, 31969, 30835, 30106, 30235, 30712, 30659, 29913, 29158, 28983, 29196, 29183, 28684, 27971, 27330, 26674, 25736, 24515, 23329, 22499, 22066, 21805, 21424, 20785, 20100, 19834, 20276, 21227, 22264, 23228, 24183, 24984, 25385, 25642, 26449, 27943, 29224, 29390, 28698, 28091, 27861, 27526, 27005, 27055, 28188, 29829, 31026, 31546, 31741, 31682, 31064, 29868, 28559, 27524, 26784, 26341, 26366, 26802, 27190, 27208, 27151, 27477, 28046, 28261, 27927, 27468, 27158, 26677, 25779, 24980, 25000, 25702, 26234, 26150, 25834, 25671, 25513, 25210, 25089, 25401, 25788, 25834, 25797, 26150, 26649, 26606, 26024, 25779, 26508, 27842, 28874, 28943, 27920, 26231, 24779, 24327, 24741, 25219, 25347, 25416, 25539, 25175, 23942, 22396, 21465, 21496, 22322, 23806]
55282B3806J828J247k56j574j753j185r32j193j202m27P62J689K063J941J408
55267B6222O02j27m27l09j86l88p19o99k53J34J23j9M2O3m17j234j685j430p57
55248A8536LP46J223J059L25m19q30j049j116p83r6M29N47O04P86O71O0m44k36
55229B0016L96Q11R71J162J200P03j23p20j005j183j030j77R62J452J036L41j70
55212B4642n97q97p10r8K36p0n77q50j008j109o91M58J622J967J599J229J107
55195B6253Q80L37k71o45p12n40l17l16n50o59l69R5L27K20j37p08j229j045J48
55176B0762J590K089J372K91k85k81r6k1j00k12j76m4k05q41j423j302p08n24
55158A9886j005j427j185n69q3L37R36J462J464J016O21O12R71J545K043K086
$$ y = [23806, 25634, 26881, 26625, 25051, 23298, 22113, 21181, 19988, 18786, 18359, 19121, 20810, 22873, 24814, 26222, 26824, 26697, 26270, 25961, 25775, 25387, 24668, 23969, 23716, 23850, 23973, 23954, 23996, 24059, 23642, 22408, 20723, 19293, 18536, 18539, 19285, 20508, 21567, 21892, 21473, 20643, 19594, 18478, 17695, 17599, 18028, 18575, 19179, 19965, 20636, 20696, 20252, 20016, 20412, 21223, 22194, 23356, 24556, 25259, 25136, 24416, 23411, 22228, 21198, 21021, 21983, 23435, 24471, 24812, 24642, 24045, 23148, 22438, 22340, 22576, 22506, 21929, 21079, 20071, 18962, 18271, 18729, 20351, 22318, 23917, 25146, 26253, 27133, 27470, 27199, 26554, 25842, 25302, 24985, 24669, 24119, 23460, 23091, 23186, 23513, 23733, 23596, 22888, 21659, 20614, 20762, 22352, 24441, 25813, 26104, 25819, 25538, 25442, 25421, 25321, 25109, 24933, 24889, 24684, 23843, 22420, 21118, 20410, 19886, 18881, 17454, 16269, 15700, 15617, 15954, 16890, 18352, 19816, 20832, 21453, 22065, 23036, 24581, 26624, 28710]
55142B8710J619J046O48K06m49r35r06p50j010j440j378q73n66n33j83O23J226
55125B5055J205R71R06P62L35O7L72R37J267J443J711J815J401P45M07M32M72
55108D0303M09K17m30j595k477k222j172m13k12L3L80R1q95j469r02J15O56Q44
55090C1261J136J192N50k21j86M42O27J63j21J94N54M73J98k2l73q21q20k51J12
55071C4087k67o73o6J345K239J809N63m73p39l29L12O57M07k24p49r58j017j002
55053C4922o83J0O65Q02M76K51M94R62J146Q67L98L6k28n39q42r20p03k71L86
55034C7229J292K143K393J926J285J013R79P74M25K82L36K16j46l76l05k11k29
55017D9026m3M87Q95P51L10m0n97j801l041k995j453O0J10q57j222m17N08N00
$$ y = [28710, 30329, 31375, 32023, 32229, 31780, 30845, 29939, 29189, 28179, 26739, 25361, 24488, 23922, 23389, 23206, 23829, 25055, 26260, 27231, 28137, 28899, 29234, 29301, 29673, 30610, 31877, 33320, 35031, 36846, 38247, 38992, 39399, 39831, 40303, 40712, 40929, 40499, 38904, 36427, 34205, 33033, 32620, 32408, 32441, 32821, 32912, 32017, 30548, 29646, 29761, 30417, 31261, 32397, 33589, 34139, 33918, 33732, 34174, 34801, 34964, 34843, 35037, 35591, 36064, 36262, 36240, 35867, 35046, 34226, 33975, 34087, 33820, 33147, 33081, 34426, 36665, 38474, 39037, 38564, 37825, 37496, 37808, 38465, 38872, 38648, 37899, 36941, 35924, 34922, 34239, 34249, 34914, 35716, 36192, 36443, 36937, 37899, 39045, 39912, 40310, 40346, 40118, 39579, 38737, 37817, 37114, 36843, 37229, 38521, 40664, 43057, 44983, 46268, 47281, 48260, 49034, 49459, 49741, 50077, 50293, 50147, 49771, 49466, 49255, 49026, 48983, 49470, 50365, 51116, 51426, 51386, 50789, 48988, 45947, 42952, 41499, 41559, 41669, 40812, 39590, 39173, 39681, 40181]
54999D0181j77n37k12L61P11P42N57L16K46M34O12M93K11J50L21L70K17J86L95
54980D5577M73K12J0K18M62J52n05o56J00J292K298K926L200L054K563K097J996
54963F5469K291K933L878M939N851O744P988R367R975R452Q790R164J0274J0559
54949A67674Q991N895K131j716n134p563q931r783j0513j0894j0685j0177r645
54936I9650q778p258n555m497m187l949l321k512j835j159k22Q71J645J707J195
54921F1795P90J268K708M316N221N387N476N988O838P766Q662R381R568Q927P468
54906A51559N454L132O38j988m644p016q722r740j0378j0678j0158q619o834n821
54892G6185n605n341m592l726l009k231j406j056j290j376p35K32Q40J015R65
$$ y = [40181, 40004, 39467, 39255, 39616, 40327, 41069, 41626, 41942, 42188, 42622, 43234, 43727, 43938, 44088, 44409, 44779, 44996, 45182, 45577, 46050, 46262, 46272, 46490, 46952, 47104, 46599, 45943, 46043, 47335, 49633, 52559, 55759, 58813, 61376, 63473, 65469, 67760, 70693, 74571, 79510, 85361, 92105, 100093, 109460, 119435, 128887, 137677, 146841, 157115, 167674, 176665, 182560, 184691, 182975, 177841, 170278, 161347, 151564, 141051, 130157, 119472, 109295, 99650, 90872, 83614, 78059, 73562, 69375, 65426, 62105, 59593, 57758, 56599, 56377, 57248, 58893, 60600, 61795, 62585, 63853, 66561, 70877, 76098, 81485, 86961, 92949, 99787, 107553, 116215, 125596, 135164, 144091, 151559, 157013, 160145, 160783, 158795, 154151, 147135, 138413, 128673, 118295, 107617, 97459, 88840, 82006, 76185, 70580, 65239, 60647, 56921, 53912, 51681, 50275, 49219, 47929, 46553, 45818, 46050, 46890, 47905, 48870]
54877D8870N68j47m80O4P50M58o27j218p19R3L43O8l51q86j571k109k228k014
54859C8864j594r85m59n10j058j276o72J25K06l72p93o34k16J19M25P73Q98N20
54841C3361k50r16j027n72K8L76N81J012J626J825J215J80o03q93r11q03n08J2
54823C3733O67J317J735J690J290R96J055J188J111J036J243J511J546J662K360
54808E4140L391M016M191M649N715O818P489Q096R095J0172J0673J0413R496P819
54794A56173N374K723M81j499l745o095p728q229p986p454o707n915n552n706
54780I8135n741n073l971l042k341j535o65j13J80P56J718K398K272J810J920
54765H6708K833L967M818N493O395P736R436J1182J2459J2881J2678J2459J2293
$$ y = [48870, 49438, 49291, 48811, 48875, 49625, 50083, 49456, 48238, 47519, 47612, 47955, 48023, 47672, 46786, 45215, 43106, 40878, 38864, 37270, 36285, 35826, 35316, 34258, 32982, 32310, 32435, 32641, 32269, 31476, 30842, 30626, 30745, 31170, 31943, 32841, 33361, 33111, 32195, 31168, 30596, 30624, 31000, 31581, 32593, 34219, 36044, 37259, 37439, 36836, 35943, 35032, 34229, 33721, 33733, 34400, 35717, 37452, 39142, 40432, 41428, 42483, 43671, 44782, 45818, 47061, 48572, 50118, 51780, 54140, 57531, 61547, 65738, 70387, 76102, 82920, 90409, 98505, 107600, 117772, 128445, 138858, 148354, 156173, 161547, 164270, 164751, 163252, 159507, 153412, 145684, 137455, 129469, 122015, 115308, 109393, 103841, 98135, 92394, 87321, 83350, 80308, 77967, 76432, 75767, 75654, 75834, 76590, 78308, 80706, 82978, 84788, 86708, 89541, 93508, 98326, 103819, 110214, 117950, 127386, 138568, 151027, 163908, 176586, 189045, 201338]
54752B01338J1241Q288L594j561n959r198j1336j2419j2661j2621j2752j2894
54740A33060j2520j1434r913q313o857n756n183m972m625l770k494j177k11J41
54726E5976j78q57j394j547j511j503j417j058n77l31l62k75K70J149J791J596
54710D9772M33j068j838j355k70K26k40q98r15l88M9K34N32J019J141M66n89j126
54692D5185p82j04J39j25k31L92J496K268K221J651J183J069J095R27M44k33q04
54675E5791r38n27J94Q53J236J320J105O57K47J87N23R75J222J142Q69P14R81
54658F6551J609K104K089J848K047K917M089N261O559Q037R221R580R245Q889
54644A40046Q995R438R698R143P330M394J126j665l902o029q085r426r607r071
$$ y = [201338, 212579, 220867, 224461, 222900, 216941, 207743, 196407, 183988, 171327, 158706, 145954, 133060, 120540, 109106, 99193, 90880, 84023, 78267, 73084, 68112, 63487, 59717, 57223, 56046, 55835, 55976, 55798, 54941, 53547, 52000, 50489, 48986, 47569, 46511, 45934, 45603, 45241, 44966, 45236, 46385, 48176, 49772, 50205, 49137, 47299, 45944, 45674, 45900, 45660, 44762, 43847, 43459, 43508, 43742, 44274, 45293, 46434, 46900, 46311, 45185, 44403, 44299, 44438, 44313, 44082, 44474, 45970, 48238, 50459, 52110, 53293, 54362, 55457, 56384, 56828, 56595, 55791, 54853, 54326, 54520, 55373, 56609, 57929, 59034, 59691, 59938, 60125, 60648, 61623, 62845, 63987, 64856, 65570, 66551, 68160, 70264, 72353, 74201, 76248, 79165, 83254, 88515, 95074, 103111, 112332, 121912, 131157, 140046, 149041, 158479, 168177, 177320, 184650, 189044, 190170, 188505, 184603, 178574, 170489, 161063, 151456, 142385]
54630A42385q626q482q160p320o160n063m181l573l347l409l294k680j904j590
54616G4596j775j845j438r74r57j245j354j213j106j077r78r84j461k196k445
54601E3548j918j187q25o92m96m42p90j177j082o67m26k33M24J286J391N11k96
54584D6929j24M63K85p73j655j600r78n74o10p06m65Q7N43M91k4m98n21k67j32
54565C9871q4J68M76L22k52m21K68J066R87J88k93o0K38J15J6N25J441K143K423
54546D9137K407K055J363Q52J131K057K858L172L331L635L902L996M220M774N204
54531I4094M857L741K506J638R25j86j856l508m326m126l623l642m183m569m390
54516G3352l861l303k757k299k226k641l165l281k769j705m08N04N23r9n08l00
$$ y = [142385, 133759, 125277, 117117, 109797, 103637, 98574, 94393, 90820, 87473, 84064, 80770, 78090, 76186, 74596, 72821, 70976, 69538, 68564, 67607, 66362, 65008, 63795, 62689, 61612, 60634, 59650, 58189, 55993, 53548, 51630, 50443, 49618, 48926, 48430, 47988, 47198, 46021, 44939, 44272, 43846, 43613, 44037, 45323, 46714, 47225, 46929, 46805, 47268, 47553, 46780, 45125, 43525, 42547, 41973, 41363, 40657, 40192, 40279, 40822, 41313, 41289, 40791, 40270, 40003, 39871, 39787, 39955, 40431, 40753, 40501, 40080, 40348, 41414, 42401, 42589, 42296, 42236, 42474, 42589, 42605, 43130, 44571, 46714, 49137, 51544, 53599, 54962, 55814, 56945, 59002, 61860, 65032, 68363, 71998, 75900, 79896, 84116, 88890, 94094, 98951, 102692, 105198, 106836, 107761, 107575, 105719, 102211, 97885, 93759, 90136, 86494, 82311, 77742, 73352, 69491, 66188, 63431, 61132, 58906, 56265, 53100, 49819, 47050, 45345, 44937, 45441, 45964, 45865, 45357, 45057]
54500D5057J07K98M22O37O84M58L54M81K72m49q24k10N61L45m69n75J23M22j80
54481D7514q41r61r69j143r55j83M68N63P35J427J866J294M21M60J277J617R07
54464E3497j97r58j336j541j596j444j076m79J42L37K1j72K67Q32O51k19q96r73
54446D4860q35p07k47N97J103O49m05j141j061l82M07R05R89Q34P22O99N96L50
54428D7933J10J1R3M33R91J385J191N65J39J83K28j88q06r70m68L28R96J470J849
54409E5473K161K355K369K117J505N71l18o16r4P75J152O61k70r73j204j120q71
54392F3673n23k59k83n73r20j194j307j090m75K71P51Q61P11L23l03r06j198j315
54374E6244j538j679j247l52J83j57q79j116n98K68J000J335J223Q97P65R58J158
$$ y = [45057, 45164, 45462, 45884, 46521, 47205, 47663, 48017, 48498, 48770, 48321, 47497, 47287, 47848, 48193, 47724, 47149, 47272, 47694, 47514, 46673, 45712, 44743, 43600, 42645, 42462, 42930, 43493, 44228, 45655, 47521, 48815, 49236, 49696, 50973, 52590, 53497, 53300, 52342, 51006, 49465, 47869, 46425, 45349, 44870, 45012, 45349, 45370, 45198, 45465, 46297, 46948, 46729, 45833, 44860, 44025, 43318, 43071, 43668, 44771, 45420, 45015, 43874, 42813, 42431, 42838, 43743, 44732, 45566, 46288, 46987, 47583, 47933, 48043, 48054, 48147, 48580, 49571, 50956, 52147, 52712, 52851, 53034, 53262, 53074, 52268, 51298, 50830, 51158, 52154, 53624, 55473, 57634, 59989, 62358, 64475, 65980, 66551, 66233, 65617, 65523, 66298, 67450, 68111, 67841, 66868, 65664, 64544, 63673, 63150, 62891, 62608, 62035, 61115, 59921, 58614, 57524, 57049, 57320, 58071, 58932, 59643, 59966, 59663, 58757, 57559, 56244, 54706, 53027, 51780, 51428, 51611, 51454, 50575, 49459, 48861, 49129, 50129, 51464, 52687, 53584, 54349, 55307, 56465]
54357E6465J118J090J388J738J581R72O56J052J623J581R20L53L06M94N16M44
54341G2297M76L99j80j106j744j778j553j412j198o99k09k64r96k030k799k778
54325E4426j817n74k02j025j941j714n86K06J78o7j60n30j325j830j509q36m71
54308D0223k35L60J039J074M51j0K65R88J510J514J087N09J17J54N54R34Q65K34
54290E1633n56q62m83q4n00j625k326j764l90O64Q93P14O98R11J007O73Ln19m42
54271D7645J32O33O48K83j43m70n77l30J51M46L43J08M7Q6M9L0J75M23P54J331
54251E1764K013K103J150k66j079r72n42l81m90n50l29K18Q15R26K77o51j116
54234E2890j010q77j067j297j166o99k33q7l55q40j168j128r18q26p95n79j44
$$ y = [56465, 57583, 58673, 60061, 61799, 63380, 64352, 65008, 66060, 67683, 69264, 70184, 70537, 70843, 71337, 71853, 72297, 72773, 73172, 72992, 71886, 70142, 68364, 66811, 65399, 64201, 63502, 63293, 63029, 62033, 60003, 57204, 54426, 52609, 52035, 51833, 50808, 48867, 47153, 46567, 46773, 46951, 46884, 46724, 46194, 44869, 43039, 41530, 40694, 40223, 39988, 40348, 41387, 42461, 42912, 42902, 43167, 44155, 45665, 47179, 48266, 48775, 48892, 49046, 49600, 50534, 51399, 51633, 51077, 50215, 49732, 49648, 49148, 47523, 45197, 43433, 43043, 43707, 44600, 45314, 46012, 46923, 47930, 48603, 48606, 48087, 47645, 47777, 48410, 49058, 49341, 49198, 48728, 48151, 47821, 47972, 48418, 48761, 48869, 48916, 49002, 49051, 49081, 49256, 49679, 50433, 51764, 53777, 55880, 57030, 56764, 55685, 54713, 54171, 53790, 53300, 52750, 52421, 52639, 53454, 54380, 54657, 54006, 52890, 51880, 51003, 49936, 48639, 47473, 46774, 46541, 46454, 46099, 45259, 44091, 42963, 42045, 41219, 40424, 39845, 39701]
54217C9701K96N48M09l56j592k451k128q46L29P08N56M44N45P29Q66Q72P37O66
54199D0033Q87J254J374J188J057J164J209Q57J88m71r40j211j309j264j065o72
54183D2279k00m8m78j199j611j490j081n99o4L77M34J07k09j79J80P06J183J253
54165C9361O37m08j178j223o63J01O51O04r9r09j153q04l40O7N41Q11L79m72p43
54146C5160j63L04j14q39q34lR40J535J789J754J505J264J003L28p48j376r34
54129D0571n3J85k38m12N2O25Q59R09R48P80L32n0r6N3J18k5l64p02n86K39J252
54108D4397J503P68r3k16K53M57jn83m55M98J479J686J265R93J036O41n86j754
54090E1288j727o79K26M12K93J97o8m27k65N85J313J127J79q36j511j694j176
$$ y = [39701, 39997, 40545, 40954, 40598, 39006, 36555, 34427, 33581, 33910, 34618, 35174, 35618, 36163, 36892, 37758, 38630, 39367, 40033, 40920, 42174, 43548, 44736, 45793, 46957, 48166, 49023, 49211, 48740, 47800, 46589, 45280, 44016, 42951, 42279, 42079, 42031, 41553, 40354, 38743, 37253, 36172, 35573, 35509, 35886, 36320, 36427, 36218, 36039, 36219, 36925, 38108, 39361, 39998, 39590, 38412, 37189, 36526, 36627, 37278, 37882, 37783, 36874, 35721, 34917, 34577, 34644, 35185, 35996, 36375, 35903, 35160, 34997, 35301, 35187, 34348, 33514, 33511, 34451, 35986, 37775, 39529, 41034, 42298, 43301, 43629, 42881, 41505, 40571, 40518, 40703, 40465, 40053, 40105, 40730, 41589, 42498, 43446, 44226, 44558, 44508, 44412, 44465, 44583, 44558, 44194, 43492, 42906, 43145, 44397, 45900, 46668, 46575, 46359, 46612, 47069, 47068, 46485, 46030, 46528, 48007, 49693, 50958, 51951, 52987, 53628, 53042, 51288, 49561, 48882, 49108, 49520, 49813, 50010, 49942, 49515, 49250, 49835, 51148, 52275, 52454, 51618, 50107, 48413, 47237]
54073D7237r8P25N91j22l54L76J554K438K763K599K037J226N25K89N75J029J196
54056F4586R72P74J110J946K660K749K414K276K678L447M182M627M743M674M543
54041A08381M315L851L165K529K137J834J284M53k57m05M7O77J004Q24J61q99
54025A29101k145l097l336l098l148l811m454m312l520k835k591k531k554k791
54011H4878k941k307q69L28L29o80j846k636k894k401j151K15Q79P48L03k60j083
53994F8612j850j786p44L00L49l76q30n52j32k39p23r37o75l55l20l90k59pM7
53975E9133j72m76p50j023j146q06L5R99J654J840J618J145P24O03O88P19Q29
53958F5614J428K368K696J793L70j95N73J805K396K096J482J216J528K205K936
$$ y = [47237, 47139, 47864, 48455, 48333, 47979, 48355, 49909, 52347, 55110, 57709, 59746, 60972, 61497, 61786, 62361, 63390, 64586, 65558, 66332, 67442, 69388, 72048, 74797, 77211, 79487, 82165, 85612, 89794, 94421, 99164, 103838, 108381, 112696, 116547, 119712, 122241, 124378, 126212, 127496, 127949, 127692, 127287, 127334, 128011, 129015, 129839, 130000, 129101, 126956, 123859, 120523, 117425, 114277, 110466, 106012, 101700, 98180, 95345, 92754, 90223, 87669, 84878, 81937, 79630, 78761, 79089, 79418, 78738, 76892, 74256, 71362, 68961, 67810, 68025, 68904, 69652, 69955, 69695, 68612, 66762, 64976, 64232, 64532, 64881, 64505, 63675, 63123, 62991, 62752, 62029, 61092, 60417, 60062, 59742, 59352, 59093, 59086, 59133, 58961, 58485, 57735, 56712, 55566, 54760, 54795, 55794, 57448, 59288, 60906, 62051, 62775, 63378, 64066, 64785, 65614, 67042, 69410, 72106, 73899, 74269, 74074, 74647, 76452, 78848, 80944, 82426, 83642, 85170, 87375, 90311]
53943I0311L621M355N114N679N918N995O132O381O791P400P929P815O960O089
53929A76490N908O116N808M689L389K617K498K748K958K650J595J99q18j296j746
53914B13805k558l513m218m541m421l739k656j695j237j199j513k430l963n395
53900A70727n887n425m763m500m620m843m975m849m284l288k193j441j284j633
53886A16742k122k369k246j905j550j299j292j666k370l112l576l534k808j482
53872H5411k72j24j179k397k678k038j281q85p77r84j683k500k533j437OP60O72
53855F6081L38K12K68L47L48J74j98n07m12O2N23O82O09N13M62M28L80K87J14
53836G0711o1j27j21k30m83o51n83l89j71K09Q34J396J574J584J934K598K985
$$ y = [90311, 93932, 98287, 103401, 109080, 114998, 120993, 127125, 133506, 140297, 147697, 155626, 163441, 170401, 176490, 182398, 188514, 194322, 199011, 202400, 205017, 207515, 210263, 213221, 215871, 217466, 217665, 216847, 215551, 213805, 211247, 207734, 203516, 198975, 194554, 190815, 188159, 186464, 185227, 184028, 182515, 180085, 176122, 170727, 164840, 159415, 154652, 150152, 145532, 140689, 135714, 130865, 126581, 123293, 121100, 119659, 118375, 116742, 114620, 112251, 110005, 108100, 106550, 105251, 103959, 102293, 99923, 96811, 93235, 89701, 86893, 85411, 85139, 85015, 83836, 81439, 78761, 76723, 75442, 74557, 73780, 72796, 71113, 68613, 66080, 64643, 64649, 65409, 66081, 66419, 66631, 66899, 67246, 67594, 67768, 67570, 67063, 66651, 66713, 67236, 67918, 68527, 69040, 69502, 69930, 70310, 70597, 70711, 70650, 70523, 70402, 70172, 69689, 69038, 68455, 68066, 67895, 68104, 68938, 70334, 71908, 73492, 75426, 78024, 81009]
53819H1009K814K530K538K544K132J602J624K233K803K995L126L453L688L481
53805A18572K933K310J633Q49J41k53l73l22NO69J270J215L70p59j556j850j970
53788A22884k338k925l146k513j472j176k199l827m936n193m948m335l175j702
53774G8999o73m82o75n65m5L73J87n54j186j019j69L68j80j359k068j926j537
53757F7489j391j292r89o45m33k35r7l50r03j049m53K28L04N5J14L42J79k72m24
53738F0178l08n29j108j320q79l96l01j44N56J385J533Q66m9o30o29pR50J634
53720F0802J641J249J051J168J268J176J062R75O42p6p96r56m59J82L96J02l03
53703F9124m64m32m23m26k18K76Q55J324J677J994K305K592K771K729K517K372
$$ y = [81009, 83823, 86353, 88891, 91435, 93567, 95169, 96793, 99026, 101829, 104824, 107950, 111403, 115091, 118572, 121505, 123815, 125448, 126297, 126438, 126185, 125812, 125490, 125495, 126164, 127434, 128649, 129019, 128260, 126704, 124854, 122884, 120546, 117621, 114475, 111962, 110490, 109314, 107115, 103288, 98352, 93159, 88211, 83876, 80701, 78999, 78326, 77844, 77169, 76604, 76559, 76932, 77119, 76565, 75379, 74360, 74191, 74559, 74379, 73020, 70952, 69026, 67489, 66098, 64806, 63817, 63172, 62739, 62504, 62407, 62057, 61154, 60105, 59652, 59880, 60184, 60239, 60353, 60695, 60874, 60602, 60178, 59870, 59341, 58233, 56913, 56034, 55638, 55337, 55193, 55749, 57134, 58667, 59533, 59484, 58854, 58225, 58218, 59168, 60802, 62443, 63692, 64743, 65911, 67179, 68355, 69417, 70392, 71034, 70958, 70162, 69206, 68747, 68929, 69325, 69427, 69124, 68660, 68228, 67805, 67379, 67161, 67437, 68292, 69616, 71293, 73287, 75592, 78184, 80955, 83684, 86201, 88573]
53687H8573K299J787M17j274k085j484j50R85J671K006J878J230N20K15J87J41
53671I6916L25J088J978K071J201P5p87j463j902j620n44N83J132J336J610J675
53655A03674J007j00o97l16N25R75O88J2l66K0R15J420R03k49j003q07p1M06J74
53636A07110o50j526j730q23Q24K088J997P03n79p61j1N14J53l91J8J317K244
53619A10497J995J150O96O80N63L40N04J136J773K135K264J937Q61m42p78K13
53603A25524J461J827J474J273J485J730J888K159K454K490K436K667K914K469
53589A54251J354M80M31P75R55J101J479J735J402P39L19J08l11p99p39j00L70
53572A63550J72k94m78m87p39j168j293r35m73l80o85r81q88m83j91j27J51R63
$$ y = [88573, 90872, 92659, 93076, 91802, 89717, 88233, 88083, 89068, 90739, 92745, 94623, 95853, 96373, 96588, 96775, 96916, 97241, 98329, 100307, 102378, 103579, 103654, 102867, 101404, 99502, 97882, 97338, 97921, 99053, 100389, 101999, 103674, 104681, 104581, 103884, 103568, 104093, 105068, 105756, 105768, 105402, 105422, 106337, 107757, 108660, 108411, 107408, 106601, 106530, 106936, 107110, 106460, 104934, 103204, 102381, 103205, 105293, 107290, 107993, 107414, 106653, 106642, 107156, 107309, 106918, 106936, 108253, 110497, 112492, 113642, 114338, 115018, 115581, 115921, 116425, 117561, 119334, 121469, 123733, 125670, 126531, 126089, 125311, 125524, 126985, 128812, 130286, 131559, 133044, 134774, 136662, 138821, 141275, 143765, 146201, 148868, 151782, 154251, 155605, 156085, 156516, 157291, 158246, 159347, 160826, 162561, 163963, 164702, 165021, 165129, 164818, 164019, 163280, 163180, 163550, 163722, 163428, 162950, 162463, 161724, 160556, 159263, 158328, 157855, 157475, 156790, 155809, 154921, 154438, 154247, 154120, 154271, 155234]
53554A55234J771J713Q67K97N74R60N04n69j243j020k70N04J009R78M42O9N04
53537A62324J338J463N95k88l03K85P45J020J528K260K635K264J394O52N56J112
53521A79580J785K086K242K847L816M265L846L500M219N544O136N656N208N842
53507B36572P332Q668R175Q877Q218P754P839Q415R171R993J0946J1893J2494
53494C57347J2640J2585J2506J2347J2161J2253J2717J3140J3054J2508J2053
53483D95311J2220J3093J4187J4778J4554J3978J3701J3690J3339J2463J1608
53472F42922J1256J1223J1176J1144J1121J0733R845R072R006R249Q936Q075P504
53459G71262P543P463O603N229L939K727J222n59k193l500m670n832o792p283
$$ y = [155234, 157005, 158718, 159585, 159882, 160456, 161416, 161920, 161351, 160108, 159088, 158818, 159322, 160331, 161309, 161751, 161820, 162324, 163662, 165125, 165720, 165432, 165129, 165414, 166159, 167179, 168707, 170967, 173602, 175866, 177260, 177912, 178468, 179580, 181365, 183451, 185693, 188540, 192356, 196621, 200467, 203967, 208186, 213730, 219866, 225522, 230730, 236572, 243904, 252572, 261747, 270624, 278842, 286596, 294435, 302850, 312021, 322014, 332960, 344853, 357347, 369987, 382572, 395078, 407425, 419586, 431839, 444556, 457696, 470750, 483258, 495311, 507531, 520624, 534811, 549589, 564143, 578121, 591822, 605512, 618851, 631314, 642922, 654178, 665401, 676577, 687721, 698842, 709575, 719420, 728492, 737498, 746747, 755683, 763758, 771262, 778805, 786268, 792871, 798100, 802039, 804766, 805988, 805429, 803236, 799736, 795066, 789234, 782442, 775159]
53445G75159p248o908o685o972p748q499q728q536q463q786r232r443r447r553
53431F58911r908j0350j0603j0472r891q934p784o607n447m316l280k402j608
53418E67309p99n3M10N90P71J135J440J338R85J055K046L675N138N884O081O342
53402F03347P107Q310R532J0432J1004J1489J2093J2937J4113J5590J6998J7801
53390G50753J7966J8271J9546K1617K3348K3951K3891K4189K5096K5934K6206
53379A000768K6291K6827K7819K8732K9223K9377K9285K8852K8069K7166K6329
53368A308738K5494K4496K3248K1748K0156J8848J8060J7320J5745J3096J0222
53357A517171Q047O439M486J666j796n503r237j2739j5723j8238k0553k2582k3924
$$ y = [775159, 767911, 761003, 754318, 747346, 739598, 731099, 722371, 713835, 705372, 696586, 687354, 677911, 668464, 658911, 649003, 638653, 628050, 617578, 607687, 598753, 590969, 584362, 578915, 574599, 571319, 568917, 567309, 566510, 566457, 566867, 567457, 568228, 569363, 570803, 572141, 573126, 574181, 576227, 579902, 585040, 590924, 597005, 603347, 610454, 618764, 628296, 638728, 649732, 661221, 673314, 686251, 700364, 715954, 732952, 750753, 768719, 786990, 806536, 828153, 851501, 875452, 899343, 923532, 948628, 974562, 1000768, 1027059, 1053886, 1081705, 1110437, 1139660, 1169037, 1198322, 1227174, 1255243, 1282409, 1308738, 1334232, 1358728, 1381976, 1403724, 1423880, 1442728, 1460788, 1478108, 1493853, 1506949, 1517171, 1525218, 1531657, 1536143, 1537809, 1536013, 1530510, 1521273, 1508534, 1492811, 1474573, 1454020, 1431438, 1407514]
53344A407514k4589k5110k5702k5901k5400k4733k4590k4831k4781k4186k3284
53333A134407k2166k0742j9377j8790j9158j9823k0167k0296k0560k0854k0718
53322I11756j9935j8633j6998j5201j3447j1833j0192q403o762n775n613o033
53310G72931o774p721q654r215r338r375r555r581r056q165p505p248o950o224
53296F57570n218m193k997j427J54J047J098R80J413K434L504M164M436M723N451
53281F73139O696Q076R146R873J0593J1443J2164J2483J2433J2109J1455J0545
53269H00155R844R773J0119J0180R507Q283P005N973N081L950K311L82j299k518
53255H78746l667n156o809q193r352j0688j2200j3335j3746j3719j3740j3977
$$ y = [1407514, 1382925, 1357815, 1332113, 1306212, 1280812, 1256079, 1231489, 1206658, 1181877, 1157691, 1134407, 1112241, 1091499, 1072122, 1053332, 1034174, 1014351, 994184, 973888, 953328, 932474, 911756, 891821, 873188, 856190, 840989, 827542, 815709, 805517, 797114, 790352, 784577, 778964, 772931, 766157, 758436, 749782, 740567, 731229, 721854, 712299, 702718, 693662, 685497, 677992, 670744, 663794, 657570, 652352, 648159, 645162, 643735, 643889, 644936, 646034, 647014, 648427, 650861, 654365, 658529, 662965, 667688, 673139, 679835, 687911, 697057, 706930, 717523, 728966, 741130, 753613, 766046, 778155, 789610, 800155, 809999, 819772, 829891, 840071, 849578, 857861, 864866, 870839, 875920, 879870, 882181, 882563, 881264, 878746, 875079, 869923, 863114, 854921, 845569, 834881, 822681, 809346, 795600, 781881, 768141, 754164]
53243G54164j4446j5198j6055j6475j6060j5028j3909j2951j2119j1465j1167
53232E99291j1228j1491j1856j2225j2302j1905j1436j1586j2383j2871j2109
53221D67899j0289q556p737p551p165o269n323m792m410l569k383j886k822m482
53207C90665n367n051m778n858p944r551r927r713r736r902r669q963q174p517
53193B78515o944o447o082n789n571n654o037o120n380m320l988m521m897m438
53179B02327l801l972m831n413n233m677m153l605k908k259j958k044k287k341
53165A52845k002j450j192j459j806j633j004n63o70r91r89m88K98R49J027M29
53149A41301l97q75r39r65j070r81o56n37r25j466j607j249o97k11M5j29p93j642
$$ y = [754164, 739718, 724520, 708465, 691990, 675930, 660902, 646993, 634042, 621923, 610458, 599291, 588063, 576572, 564716, 552491, 540189, 528284, 516848, 505262, 492879, 480008, 467899, 457610, 449054, 441317, 433766, 426601, 420332, 415009, 410217, 405807, 402238, 399855, 397969, 395147, 390665, 385298, 380247, 375469, 369611, 361667, 352116, 342189, 332476, 322740, 312838, 303169, 294206, 286032, 278515, 271571, 265124, 259042, 253253, 247682, 242028, 235991, 229871, 224491, 220171, 216183, 211662, 206765, 202327, 198526, 194554, 189723, 184310, 179077, 174400, 170247, 166642, 163734, 161475, 159517, 157473, 155186, 152845, 150843, 149393, 148201, 146742, 144936, 143303, 142299, 141736, 141066, 140075, 139086, 138598, 138896, 139845, 140872, 141301, 140904, 140029, 139090, 138125, 137055, 136074, 135418, 134881, 133956, 132490, 130883, 129634, 128937, 128726, 128771, 128642, 127849, 126207]
53131A26207k191k206j811j256p66m48k82k32l65p04r78q38l96j51l11n64o99
53114A12009j000j633k106j853j079m91l53l97m90p78j111r84k47N38Q02O80O91
53097A02198R14Q92L12m59p39l54N1k38j049j457r87l10l70j082j491j091l91
53080I4349p1j56k89l47l79k84K2K98K28j41n20q10j030r31j66J035J837J717
53062I4362J075P03Q09R85R85J054J386J673J523J075Q18R49J239J499J788K052
53046A13975J990J544J156J209J397J055P5r53j498j612j551j302p22M7O13P71
53030A16194O21L30n5n28j003j292j231p97j93K35K73M5j38r9N9J34L1j90l74
53011A12022l17R7P49J282J448J400J513J861J994J400J50j094j682j557j132
$$ y = [126207, 124016, 121810, 119999, 118743, 117977, 117529, 117247, 117015, 116650, 115946, 114968, 114130, 113734, 113583, 113272, 112708, 112009, 111009, 109376, 107270, 105417, 104338, 103847, 103494, 103097, 102607, 101829, 100718, 99734, 99487, 100025, 100827, 101507, 102198, 103112, 104004, 104316, 103857, 103118, 102764, 102815, 102577, 101528, 100071, 99084, 98774, 98404, 97322, 95831, 94740, 94349, 94278, 94122, 93833, 93486, 93107, 92823, 92845, 93143, 93371, 93230, 92710, 91900, 90870, 89939, 89773, 90808, 92645, 94362, 95437, 96140, 96949, 97934, 98919, 99973, 101359, 103032, 104555, 105630, 106448, 107397, 108636, 110135, 111923, 113975, 115965, 117509, 118665, 119874, 121271, 122326, 122401, 121448, 119950, 118338, 116787, 115485, 114763, 114810, 115423, 116194, 116815, 117145, 117090, 116562, 115559, 114267, 113036, 112239, 112046, 112281, 112554, 112599, 112461, 112362, 112421, 112555, 112586, 112396, 112022, 111705, 111802, 112551, 113833, 115281, 116681, 118194, 120055, 122049, 123449, 123599, 122505, 120823, 119266, 118134]
52996A18134p29k72M26J208J559J195M90J56M75J040J280R79K76n12q23j04J422
52979A26200K491J940J47j201r22N72K062K819K811K234J364O54M01M20L47J54
52963A42493Q6K76O62J076J197O75k71p89l65L70M08k64p54n64m8M27R37J380
52945A46932J188K09q15j114q17n10l12m3J20j55o22o85l23j67m71o84l21L11
52927A41721O03N54O14R33J203J258J263J211O58o21k017k548j893o85K91P94
52911A43339R82R30O36K78R3Q3M8n9j16r5o7O0N37J375K132K271J643O17j83l63
52891A54141j20n9n30j233j709j968k259k389j893r03k10k02l47p2L19J56n23
52874A40199r96q06j52N48J068J307J233R95P19K17p83k115l119l306k782k005
$$ y = [118134, 117405, 117133, 117559, 118767, 120326, 121521, 122011, 122167, 122642, 123682, 124962, 125941, 126217, 125705, 124882, 124778, 126200, 128691, 130631, 130778, 129577, 128655, 129227, 131289, 134108, 136919, 139153, 140517, 141171, 141572, 141992, 142339, 142493, 142579, 142855, 143517, 144593, 145790, 146465, 146194, 145405, 145040, 145410, 145818, 145554, 144800, 144236, 144188, 144615, 145552, 146932, 148120, 148329, 147514, 146400, 145583, 145073, 144761, 144718, 144838, 144683, 144061, 143376, 143053, 142886, 142415, 141731, 141410, 141721, 142324, 142878, 143492, 144425, 145628, 146886, 148149, 149360, 150018, 149397, 147380, 144832, 142939, 142254, 142545, 143339, 144321, 145251, 145887, 146165, 146258, 146341, 146389, 146330, 146214, 146119, 146052, 146112, 146649, 148024, 150156, 152427, 154070, 154687, 154504, 154141, 154021, 153962, 153432, 152199, 150490, 148522, 146263, 143874, 141981, 141078, 140868, 140666, 140319, 140247, 140566, 140722, 140199, 139203, 138397, 138245, 138793, 139861, 141168, 142401, 143396, 144115, 144332, 143549, 141434, 138315, 135009, 132227, 130222]
52858A30222j346r78r38j130j388j637j876k002j844j437j059r43j035j121j054
52843A10434q28o12p02j271k014k288j764q64l58n56j092j407j282q79m35r5Q0
52826I4067R9J5j25l73p78j181j236p56K9O85R56Q38M22j33m95l75J17N58P20
52807I3054P44P52N97K19r6k6L41P06R12R62Q39O24N47O34N03o3n85m35K53P62
52787A01244Q20Q10R90J129J127J277J583J468O45j99k23M71J131J492J891K322
52771A17978K181J163j69j030j320j504j870k213k190j764j214q13o16n02m23
52756A05694m33n10n53o24q83j150q82Q0J041J245R57J094J867K489K355J743
52740A13530J098L41n76j118q58k97k38n67n20O2N66O67P23R37R77P48P59J271
$$ y = [130222, 128876, 127898, 126960, 125830, 124442, 122805, 120929, 118927, 117083, 115646, 114587, 113644, 112609, 111488, 110434, 109606, 108994, 108292, 107021, 105007, 102719, 100955, 100091, 99733, 99177, 98085, 96678, 95396, 94517, 94082, 93987, 94067, 94166, 94181, 94056, 93683, 92905, 91724, 90488, 89732, 89761, 90446, 91402, 92240, 92662, 92529, 92034, 91659, 91776, 92334, 93054, 93798, 94550, 95147, 95366, 95270, 95244, 95585, 96291, 97203, 98165, 99004, 99628, 100175, 100809, 101312, 101249, 100664, 100229, 100482, 101244, 102064, 102874, 103864, 104993, 106120, 107397, 108980, 110448, 111093, 110894, 110671, 111142, 112273, 113765, 115656, 117978, 120159, 121322, 121153, 120123, 118803, 117299, 115429, 113216, 111026, 109262, 108048, 107235, 106619, 106117, 105694, 105261, 104751, 104198, 103574, 102691, 101541, 100659, 100739, 101780, 103025, 103982, 105076, 106943, 109432, 111787, 113530, 114628, 114969, 114393, 113275, 112417, 112120, 111882, 111315, 110795, 110857, 111423, 112090, 112813, 113750, 114727, 115475, 116234, 117505]
52722A17505J696J406N97j39o42r69q16P2J118J358P17R9J54N46O50M33K90M07
52704A24482N70N07K04l5J69P93J270J139P12P06J262J747J621J031M44J34J75
52687A36931M67O45L45k17m46l27n55j400k079j824j046p16j045j524j969k555
52671A22685k942k378r70P6n0o91p31j32K39l1m27l78N1M77P60R57J057J009Q76
52652A19457P90Q11J024J545K250K663K473K065K092K436K177R08m41p36k47l36
52636A38931j547k852l088k345j472q08j13O49J166J303J200R05M19N2J83O65
52620A33248R61Q63O54L93l42j757l236l808l108j631k08N53M45l27j205j514
52604A19981r55N2P39Q17P67J021J160N12n39p46L13J538J782J212N61j53j162
$$ y = [117505, 119201, 120607, 121204, 121065, 120423, 119454, 118638, 118710, 119828, 121186, 121903, 122002, 122156, 122702, 123352, 123785, 124075, 124482, 125052, 125559, 125763, 125728, 125897, 126690, 127960, 129099, 129811, 130517, 131779, 133526, 135147, 136178, 136622, 136756, 136931, 137398, 138043, 138388, 138171, 137725, 137398, 136843, 135443, 133364, 131540, 130494, 129778, 128733, 127209, 125240, 122685, 119743, 117365, 116395, 116471, 116421, 115730, 114999, 114867, 115106, 115075, 114648, 114270, 114321, 114798, 115558, 116515, 117572, 118581, 119457, 120247, 121058, 122082, 123627, 125877, 128540, 131013, 133078, 135170, 137606, 139783, 140691, 140250, 139514, 139267, 138931, 137384, 134532, 131444, 129099, 127627, 126819, 126706, 127355, 128521, 129824, 131024, 131929, 132348, 132400, 132583, 133248, 134209, 135072, 135726, 136119, 135777, 134020, 130784, 126976, 123868, 122237, 122029, 122582, 123027, 122700, 121495, 119981, 119026, 119078, 119817, 120634, 121401, 122422, 123582, 124094, 123555, 122809, 123122, 124660, 126442, 127654, 128215, 128062, 126900]
52587A26900j845j425m10q6n84p51j41K52l17j144j319j073j077j208r34m41m02
52570A13995r52j575j746j189Q1J452J882J062m2m04j96j73l00Q7J042J835J931
52553A16790J340J88j277k329k313j583j107j115r39k42M11M70O4m77j132j824
52537A04925k165j903j236m86J09J39o91j843k115j019N25J212P36k46j015j218
52521I3709q13m1O15Q23O37K39k57o70p56n16k07Q4M23N63J03p41j173r37o96
52502I0389r13j103p71l30l41m32L2P38Q49M55M61J112J603J315N40k15q44j300
52484I1245j351j015o33k41M64J269J341M10n82o00K03R65J336J508J374N20q65
52467I5348j838j701p10L63R98J087O91k5p39j106j000o02l05m60j060j675j795
$$ y = [126900, 125055, 123630, 123220, 123134, 122550, 121799, 121658, 121910, 121593, 120449, 119130, 118057, 116980, 115772, 114838, 114397, 113995, 113043, 111468, 109722, 108533, 108614, 110066, 111948, 113010, 112968, 112564, 112368, 112195, 111895, 111982, 113024, 114859, 116790, 118130, 118318, 117041, 114712, 112399, 110816, 109709, 108594, 107655, 107413, 107824, 108294, 108358, 107881, 106749, 104925, 102760, 100857, 99621, 99135, 99244, 99383, 98692, 96849, 94734, 93715, 94240, 95452, 96188, 95942, 94927, 93709, 92896, 92855, 93470, 94293, 94930, 95169, 94912, 94242, 93486, 92970, 92763, 92847, 93270, 93833, 93936, 93195, 92022, 91085, 90389, 89476, 88373, 87602, 87272, 86931, 86499, 86531, 87269, 88118, 88573, 89034, 90146, 91749, 93064, 93604, 93389, 92545, 91245, 89894, 88879, 88246, 88005, 88469, 89738, 91079, 91489, 90907, 90307, 90510, 91475, 92811, 94319, 95693, 96213, 95348, 93510, 91809, 91099, 91462, 92460, 93547, 94238, 94213, 93474, 92368, 91368, 90766, 90461, 90001, 88941, 87266, 85471]
52450H5471j304o02j80j37n3N52J596K329K039Q99j45l94o5K25L19M98Q20Q91
52432I2759M12l98j029j176r00m44j9K81M29M29L42L48O49J154J448J237O96K18
52414I6436j50o47j199j229l32J100K162K249J484L89n70j133j156o56Q5N89N46
52397I7968J50o5K47R08J417J419R14J45o30j246j626j679j208j11J302K383K726
52380A03014K497K109J736J384J156J110J015O38J75m6j39m13o40j98Q67J691
52364A15956J756J593J837K185K009J486J286J415J209N13j0L5J34k99r63j036
52348A29106k03J082K169K761K958L025L080K984K635K332K528L162L611L491
52334A64721L143L156L713M687N962P294Q145Q190P885Q054Q883R762J0097R948
$$ y = [85471, 84167, 83565, 83385, 83248, 83195, 83747, 85343, 87672, 89711, 90610, 90465, 90071, 90006, 90231, 90550, 91048, 91868, 92759, 93171, 92773, 91744, 90568, 89668, 89224, 89205, 89486, 89915, 90344, 90686, 91034, 91683, 92837, 94285, 95522, 96218, 96436, 96286, 95639, 94440, 93211, 92879, 93979, 96141, 98390, 99874, 100263, 99693, 98560, 97404, 96748, 96833, 97422, 97968, 98118, 98053, 98300, 99208, 100625, 102044, 102958, 103103, 102473, 101227, 99601, 97922, 96714, 96603, 97905, 100288, 103014, 105511, 107620, 109356, 110740, 111896, 113006, 114021, 114659, 114834, 114788, 114649, 114236, 113596, 113398, 114265, 115956, 117712, 119305, 121142, 123327, 125336, 126822, 128108, 129523, 130732, 131245, 131235, 131270, 131404, 131105, 130142, 129106, 128903, 129985, 132154, 134915, 137873, 140898, 143978, 146962, 149597, 151929, 154457, 157619, 161230, 164721, 167864, 171020, 174733, 179420, 185382, 192676, 200821, 209011, 216896, 224950, 233833, 243595, 253692, 263640]
52320B63640R816J0133J1082J2499J3890J4759J5087J5260J5450J5426J5104J4867
52308D27013J5022J5222J4849J3828J2654J1684J0821R897Q964Q078P153O198
52296E61383N431M886M158K889J296q0j072j965k915l713m169m383m451m295m029
52281E48971m146m936n893o069n018l102j013P20J844K476L135M318N864P088
52267E44239P659Q054Q890J0141J1271J1942J2195J2083J1590J0931J0572J0715
52255F70282J0959J0658R536P866O153M749L713K807J662J41j424k498l026l637
52241G17941m934o730q259r113r570r934j0087r910r752r977j0386j0490j0182
52228E98617r722r220q620p969p244o120m524l217l037l662l924l387k621j897
$$ y = [263640, 273456, 283589, 294671, 307170, 321060, 335819, 350906, 366166, 381616, 397042, 412146, 427013, 442035, 457257, 472106, 485934, 498588, 510272, 521093, 530990, 539954, 548032, 555185, 561383, 566814, 571700, 575858, 578747, 580043, 579963, 578891, 576926, 574011, 570298, 566129, 561746, 557295, 553000, 548971, 544825, 539889, 533996, 527927, 522909, 519807, 518794, 519514, 521358, 523834, 526969, 531287, 537151, 544239, 551898, 559952, 568842, 578983, 590254, 602196, 614391, 626474, 638064, 648995, 659567, 670282, 681241, 691899, 701435, 709301, 715454, 720203, 723916, 726723, 728385, 728526, 727102, 724604, 721578, 717941, 713007, 706277, 698018, 688905, 679335, 669401, 659314, 649404, 639652, 629675, 619289, 608799, 598617, 588895, 579675, 571055, 563086, 555842, 549722, 545198, 541981, 538944, 535282, 531358, 527971, 525350, 523453]
52214E23453o88J103K523K903K803K831K558J654J214K430M456N187M121K890
52200E59438K793L221L070K371J766J320P38J23l42r02j770k562k852k845k889
52185E60678k743k090j404j486k299l051l352l496l586l228k420j973k506l521
52171E23523l936l348k268j348p99n42m54l76k35k70p76j521j799j395j059j556
52155E01841k450k595j722p99n92o97m52j5Q7n0r6l13j012j483p25P94J400N40
52137D91661m04j28R16J641K085L003M343N343N816O316P144Q047Q872R718J0549
52122E64922J1341J2454J4069J5354J5150J3687J2600J2960J4069J4738J4919
52111G16263J5311J5883J5700J4275J2355J1104J0721J0266Q791O489M518L638
$$ y = [523453, 522765, 523868, 526391, 529294, 532097, 534928, 537486, 539140, 540354, 542784, 547240, 552427, 556548, 559438, 562231, 565452, 568522, 570893, 572659, 573979, 574717, 574840, 574498, 573596, 571826, 569264, 566412, 563567, 560678, 557935, 555845, 554441, 552955, 550656, 547605, 544253, 540757, 537171, 533943, 531523, 529550, 527044, 523523, 519587, 516239, 513971, 512623, 511824, 511282, 510828, 510452, 510217, 509947, 509171, 507650, 505851, 504456, 503397, 501841, 499391, 496796, 495074, 494275, 493683, 492986, 492534, 492519, 492606, 492556, 492460, 492147, 491135, 489652, 488927, 489721, 491121, 491661, 491257, 491129, 492045, 493686, 495771, 498774, 503117, 508460, 514276, 520592, 527736, 535783, 544655, 554373, 564922, 576263, 588717, 602786, 618140, 633290, 646977, 659577, 672537, 686606, 701344, 716263, 731574, 747457, 763157, 777432, 789787, 800891, 811612, 821878, 830669, 837158, 841676, 845314]
52099H45314L337K578J118l64j392k369l928n997p785q613q528q195q176q250
52085G88750p708o500n722o344p711q075o702m623l079k091j004L46J756L363
52071G34656N357P294Q429Q683Q600Q545Q609R066J0131J1205J1311J0449R756
52058H52091R888R980Q803O456M230L026K530J861N07j456l627n537o919p899
52044H73934q832r909j0939j1587j1793j1989j2858j4649j6707j7896j7711j6724
52032G12340j5822j5322j5043j4965j5182j5444j5215j4348j3170j1915j0486
52021E55428r045q226q437r290j0050j0337j0051r085p597o370o214p053q046
52008D45627q654r044r471r785r841r873j0168j0606j0906j1039j1160j1219j0968
$$ y = [845314, 848651, 851229, 852347, 851983, 850591, 848222, 844294, 838297, 830512, 821899, 813371, 805176, 797000, 788750, 781042, 774542, 768820, 762476, 754765, 746690, 739988, 735365, 732286, 730195, 729191, 729537, 731293, 734656, 740013, 747307, 755736, 764419, 773019, 781564, 790173, 799239, 809370, 820575, 831886, 842335, 852091, 861979, 871959, 880762, 887218, 891448, 894474, 897004, 898865, 899372, 897916, 894289, 888752, 881833, 873934, 865102, 855193, 844254, 832667, 820874, 808885, 796027, 781378, 764671, 746775, 729064, 712340, 696518, 681196, 666153, 651188, 636006, 620562, 605347, 590999, 577829, 565914, 555428, 546383, 538157, 529720, 520430, 510380, 500043, 489992, 480907, 473310, 466940, 460726, 453673, 445627, 436973, 427929, 418458, 408673, 398832, 388959, 378791, 368185, 357279, 346240, 335080, 323861, 312893]
51995C12893j0270r301q440p996p983q105q068p872p592p048o008m791m132m237
51981B11050m430m068l463l474m406n750o806p157o644n442m176l492l377l197
$$ y = [312893, 302623, 293322, 284882, 276886, 268903, 260798, 252730, 244858, 237266, 230218, 224210, 219419, 215287, 211050, 206620, 202552, 199089, 195615, 191209, 185459, 178653, 171496, 164852, 159410, 155234, 151742, 148365, 145168]
$$ [...]
##END NTUPLES=NMR SPECTRUM
##END=
