##TITLE=NES1036_878015041_9242627_nzJsoLbIYV
##JCAMPDX= 6.0         $$ Bruker NMR JCAMP-DX V2.0
##DATA TYPE= NMR SPECTRUM
##DATA CLASS= NTUPLES
##ORIGIN= BRUKER
##OWNER= Administrator
$$ 1.72 TOPSPIN		Version 2.1
$$ 2015-06-23 18:35:36.608 -0700  Administrator@X
$$ Compression mode = diff/dup
##.OBSERVE FREQUENCY= 400.02188249412
##.OBSERVE NUCLEUS= ^1H
##.ACQUISITION MODE= SIMULTANEOUS (DQD)
##.ACQUISITION SCHEME= undefined
##.AVERAGES= 8
##.DIGITISER RES= 22
##SPECTROMETER/DATA SYSTEM= spect
##.PULSE SEQUENCE= zg30
##.SOLVENT NAME= COFFEE_meoh
##.SHIFT REFERENCE= INTERNAL, COFFEE_meoh, 1, 14.98509
##AUDIT TRAIL= $$ (NUMBER, WHEN, WHO, WHERE, PROCESS, VERSION, WHAT)
$$ ##TITLE= Audit trail, TOPSPIN		Version 2.1
$$ ##JCAMPDX= 5.01
$$ ##ORIGIN= Bruker BioSpin GmbH
$$ ##OWNER= Administrator
$$ $$ E:\/data/COFFEE/nmr/NES1036_878015041_9242627_nzJsoLbIYV/10/pdata/1/auditp.txt
$$ ##AUDIT TRAIL=  $$ (NUMBER, WHEN, WHO, WHERE, PROCESS, VERSION, WHAT)
(   1,<2015-06-23 18:35:29.514 -0700>,<Administrator>,<X>,<go>,<TOPSPIN 2.1>,
      <created by zg
	started at 2015-06-23 18:34:23.717 -0700,
	POWCHK enabled, PULCHK disabled,
       configuration hash MD5:
       21 0F 79 D6 B3 7B B4 F6 88 20 88 DB 03 48 BD 9F
       data hash MD5: 64K
       1A 23 07 B5 6F 1E 44 4B 6F 60 6F 20 82 C6 9B A6>)
(   2,<2015-06-23 18:35:32.623 -0700>,<Administrator>,<X>,<proc1d>,<TOPSPIN 2.1>,
      <Start of raw data processing
       efp LB = 0 FT_mod = 6 PKNL = 1 PHC0 = 0 PHC1 = 0 SI = 32K 
       data hash MD5: 32K
       3F F1 36 0E C7 B2 F3 7D 08 EE 3B D5 1B 8A 68 AE>)
(   3,<2015-06-23 18:35:32.904 -0700>,<Administrator>,<X>,<proc1d>,<TOPSPIN 2.1>,
      <pk PHC0 = 88.93433 PHC1 = 0 
       data hash MD5: 32K
       D8 73 39 A9 AE 7C A7 70 7B AB 49 17 CD A2 D0 1D>)
(   4,<2015-06-23 18:35:33.014 -0700>,<Administrator>,<X>,<proc1d>,<TOPSPIN 2.1>,
      <abs ABSG = 1 
       data hash MD5: 32K
       79 2E 1A 96 E9 41 A6 41 AD D8 98 99 08 FD 59 8C>)
(   5,<2015-06-23 18:35:33.076 -0700>,<Administrator>,<X>,<proc1d>,<TOPSPIN 2.1>,
      <abs ABSG = 2 
       data hash MD5: 32K
       2A EF 1E 64 FE 89 05 13 BE 61 DB B9 84 04 D3 83>)
(   6,<2015-06-23 18:35:33.139 -0700>,<Administrator>,<X>,<proc1d>,<TOPSPIN 2.1>,
      <abs ABSG = 3 
       data hash MD5: 32K
       C6 40 FD 69 A1 E8 D7 8F DD 86 86 FD E1 0C 1E AD>)
(   7,<2015-06-23 18:35:33.186 -0700>,<Administrator>,<X>,<proc1d>,<TOPSPIN 2.1>,
      <abs ABSG = 4 
       data hash MD5: 32K
       73 14 12 8E C8 D9 C3 03 24 E5 AF 90 8F A5 D6 95>)
(   8,<2015-06-23 18:35:33.248 -0700>,<Administrator>,<X>,<proc1d>,<TOPSPIN 2.1>,
      <abs ABSG = 5 
       data hash MD5: 32K
       74 CF 53 83 ED 7C 50 4A 05 DB E2 19 0F 90 0B 6D>)
$$ ##END=
$$ 
$$ $$ hash MD5
$$ $$ E6 29 28 A0 CF FF 24 EA E3 78 CA CD 83 14 05 61
##$RELAX= 
##$RELAX= 
##$RELAX= 
##$RELAX= 
##$RELAX= 
##$RELAX= 
##$RELAX= 
$$ Bruker specific parameters
$$ --------------------------
##$DU= <E:\>
##$EXPNO= 10
##$NAME= <NES1036_878015041_9242627_nzJsoLbIYV>
$$ [...]
##$TP= (0..7)
150 150 150 150 150 150 150 150
##$TP07= 0
##$TPNAME0= <>
##$TPNAME1= <>
##$TPNAME2= <>
##$TPNAME3= <>
##$TPNAME4= <>
##$TPNAME5= <>
##$TPNAME6= <>
##$TPNAME7= <>
##$TPOAL= (0..7)
0.5 0.5 0.5 0.5 0.5 0.5 0.5 0.5
##$TPOFFS= (0..7)
0 0 0 0 0 0 0 0
##$TUNHIN= 0
##$TUNHOUT= 0
##$TUNXOUT= 0
##$USERA1= <user>
##$USERA2= <user>
##$USERA3= <user>
##$USERA4= <user>
##$USERA5= <user>
##$V9= 5
##$VALIST= <valist>
##$VCLIST= <CCCCCCCCCCCCCCC>
##$VD= 0
##$VDLIST= <DDDDDDDDDDDDDDD>
##$VPLIST= <PPPPPPPPPPPPPPP>
##$VTLIST= <TTTTTTTTTTTTTTT>
##$WBST= 2048
##$WBSW= 25
##$XGAIN= (0..3)
0 0 0 0
##$XL= 0
##$YL= 0
##$YMAX_a= 625022
##$YMIN_a= -524008
##$ZGOPTNS= <>
##$ZL1= 120
##$ZL2= 120
##$ZL3= 120
##$ZL4= 120
##$ABSF1= 14.98509
##$ABSF2= -5.573092
##$ABSG= 5
##$ABSL= 3
##$ALPHA= 0
##$AQORDER= 0
##$ASSFAC= 0
##$ASSFACI= 0
##$ASSFACX= 0
##$ASSWID= 0
##$AUNMP= <proc_prof1d_extract_pilot.lims>
##$AXLEFT= 0
##$AXNAME= <>
##$AXNUC= <1H>
##$AXRIGHT= 0
##$AXTYPE= 0
##$AXUNIT= <>
##$AZFE= 0.1
##$AZFW= 0.1
##$BCFW= 0
##$BC_mod= 0
##$BYTORDP= 0
##$COROFFS= 0
##$CY= 15
##$DATMOD= 1
##$DC= 0
##$DFILT= <>
##$DTYPP= 0
##$F1P= 0
##$F2P= 0
##$FCOR= 0.5
##$FTSIZE= 32768
##$FT_mod= 6
##$GAMMA= 0
##$GB= 0
##$INTBC= 1
##$INTSCL= 1
##$ISEN= 128
##$LB= 0
##$LEV0= 0
##$LPBIN= 0
##$MAXI= 10000
##$MC2= 0
##$MEAN= 0
##$ME_mod= 0
##$MI= 0
##$NCOEF= 0
##$NC_proc= -8
##$NLEV= 6
##$NOISF1= 0
##$NOISF2= 0
##$NSP= 0
##$NTH_PI= 0
##$NZP= 0
##$OFFSET= 14.98509
##$PC= 1
##$PHC0= 88.93433
##$PHC1= 0
##$PH_mod= 1
##$PKNL= yes
##$PPARMOD= 0
##$PPDIAG= 0
##$PPIPTYP= 0
##$PPMPNUM= 2147483647
##$PPRESOL= 1
##$PSCAL= 4
##$PSIGN= 0
##$PYNMP= <proc.py>
##$REVERSE= no
##$SF= 400.02
##$SI= 32768
##$SIGF1= 0
##$SIGF2= 0
##$SINO= 400
##$SIOLD= 32768
##$SPECTYP= <>
##$SREGLST= <1H.CDCl3>
##$SSB= 0
##$STSI= 32768
##$STSR= 0
##$SW_p= 8223.68421052631
##$SYMM= 0
##$S_DEV= 0
##$TDeff= 65536
##$TDoff= 0
##$TI= <>
##$TILT= no
##$TM1= 0
##$TM2= 0
##$TOPLEV= 0
##$USERP1= <user>
##$USERP2= <user>
##$USERP3= <user>
##$USERP4= <user>
##$USERP5= <user>
##$WDW= 1
##$XDIM= 32768
##$YMAX_p= 435576435
##$YMIN_p= -730187
##$CURPLOT= <Network HP LaserJet P1505>
##$CURPRIN= <$Network HP LaserJet P1505>
##$DFORMAT= <normdp>
##$LAYOUT= <+/1D_H.xwp>
##$LFORMAT= <normlp>
##$PFORMAT= <normpl>
##$SURQMSG= 1
$$ End of Bruker specific parameters
$$ ---------------------------------
##NTUPLES= NMR SPECTRUM
##VAR_NAME=  FREQUENCY,     SPECTRUM/REAL,   SPECTRUM/IMAG
##SYMBOL=    X,             R,               I
##VAR_TYPE=  INDEPENDENT,   DEPENDENT,       DEPENDENT
##VAR_FORM=  AFFN,          ASDF,            ASDF
##VAR_DIM=   32768,         32768,           32768
##UNITS=     HZ,            ARBITRARY UNITS, ARBITRARY UNITS
##FACTOR=    0.250966925370066, 1,           1
##FIRST=     8223.43324360094, 57434,        -23014
##LAST=      0,             -225289,         83652
##MIN=       0,             -730187,         0
##MAX=       8223.43324360094, 435576435,    0
$$ Real data points
##PAGE= N=1
##DATA TABLE= (X++(R..R)), XYDATA
$$ [...]
23753 -8282 133361 -8522 92502 48378 -320618 -4760 29061 -316472 263731 70804 129920
23742 129920 172177 -14636 178308 17171 -110000 100438 -161918 169815 -15354 186706
23731 112685 44867 -108098 22517 -10248 -350473 47554 -59163 -211213 101941 12516 7147
23720 7147 -105152 -250468 -269720 39691 -173551 -310655 409951 192990 293238 15689
23709 52689 177816 5758 212512 -12428 -50316 -515175 163951 54986 3935 -285005 7266
23697 -32713 -106191 242204 74631 111567 -133897 104854 -150703 -26558 73957 -29879 -485519
23686 -485519 -65003 9770 -126570 -298687 157035 150218 -70242 32637 56669 -207167 -384517
23675 -384517 -167517 95265 -282059 119583 -139889 126590 34335 63300 124953 125292 -235130
23663 48816 -56496 -56360 -78011 174204 -86180 -166643 200515 -190251 -55334 -125882 -18911
23651 154841 -253334 10428 145405 161887 88566 -150830 58739 174475 64490 77849 194137
23640 194137 261631 173896 85281 90945 -39677 -194435 133740 32561 9583 244052 130433
23629 130433 -125871 -127436 -28881 264053 -68539 -342924 -276815 -61869 -120703 -241580 93188
23617 -65048 -289918 -69218 109003 -64455 137994 -191430 -33919 30624 -41766 -230030 -956
23605 277551 225582 260171 -177763 173060 191287 -5947 75188 -340560 -45756 -47671 -164679
23594 -164679 65713 147509 -46063 153682 37530 -280521 100513 -25311 -13566 100549 365919
23583 365919 358602 66095 -165394 -127142 -11626 14535 -127600 -179136 -1058 489522 -260975
23571 -42371 -146677 89583 14038 294417 266487 276630 92044 -161503 -261924 -206284 32309
23559 48565 196395 1954 25348 48869 -64046 -80129 -124640 -261671 -8957 108339 40166
23547 -216633 176606 135739 -34825 -1105 -209671 -168096 144911 -175006 -171996 -121229 56773
23535 186837 361985 -57921 -88370 -237684 98194 -372102 -221528 -21865 405096 -202818
23524 -23521 157537 104829 -98576 -36731 75445 -103655 -221362 -78962 -279926 -183004 -243373
23513 -243373 -91908 -39727 229868 116120 -147740 -192806 -111771 -137737 238561 81428 -188073
23501 14784 62359 -232047 52083 -79219 277625 -74024 -212799 -296844 69810 -153999 -111611
23490 -111611 358863 -18324 -176586 165586 -177036 -92561 2643 -256066 -238825 170279
23479 37722 137597 -173641 -48396 106316 -149308 246463 -143444 -36548 -56394 26596 260946
23468 260946 -22513 -332033 -35388 151293 147417 -145649 -413300 184254 -121735 14720
23457 387968 -88043 -219649 -390201 60986 -55459 -167563 132630 -113946 104174 167357
23447 167357 192217 -41486 55619 -73788 347481 169341 -51182 82755 -22201 304522 206196
23436 206196 -59547 -205441 -99178 166115 -35992 -79807 132412 273380 -125594 227621
23425 111442 29636 -184769 128693 21384 -301531 76917 233962 -35083 -115907 81924 -54126
23413 453807 -163458 -12991 -128526 198150 -218251 -59980 -10866 -216098 126452 -108165
23402 210933 -192378 -190900 -126039 -105937 240902 -84556 81419 15428 51740 -133240 -17036
23390 -44707 -204105 239682 -8768 -145781 -42731 22157 163968 -122339 106903 -355997
23379 -112443 -234707 -4985 137861 -121029 -277173 976 -183369 -102242 -228962 53478 25879
23367 187599 -219832 -141768 16669 53441 170533 -45646 223837 -167399 74688 -337805
23356 156899 -205439 72063 19385 -83197 -84790 172330 389232 116157 37754 34766 50851
23345 50851 144988 -19730 -98892 -152787 -117425 -289612 -160122 -82890 18348 244803 -9819
23333 -185256 -30179 171136 -124255 165545 -37122 -88306 259907 -59120 -234175 24694
23322 -176980 -107003 -289328 -61237 -358731 96842 -467539 -162844 -22863 15789 -299581
23311 -87808 -162245 -239290 123442 323666 -90500 -188059 -281985 -80362 -73282 82207 -49851
23299 72161 -224542 -59706 108222 113481 106506 -110055 -420771 -393265 -105619 32406 -11904
23287 193314 -208159 105808 -487007 91686 351473 209931 -97006 -176653 60031 -124406
23276 -201801 95430 -96419 -110030 -240045 -57113 134120 206172 -199027 -331217 59505 -76305
23264 225170 26529 130393 -81839 -291957 -2595 -17669 -37158 132016 444997 -88451 -294918
23253 -294918 39693 -55719 -93918 -10272 -53964 45213 60043 -120327 -22110 -317816 211636
23241 -21213 58157 -15844 147925 52748 7915 -39319 -325357 -52505 20485 -303202 -14672
23229 -111769 -309531 -50124 139872 -192856 -46556 56246 -260863 107054 -420940 56481
23218 -245891 -38469 20632 -72243 83590 -161717 -276820 -196963 -36558 37700 -244037 -61304
23206 -293000 351765 14775 57402 405452 -91195 -22642 -121066 -77536 114871 -109927 -129494
23195 -129494 -266781 -75003 -143966 157834 61259 -37408 112292 35487 -179327 43082 187636
23184 187636 38491 41362 26997 194136 -139800 -67337 96824 -120102 29659 -251533 14667
23172 -4218 -32815 35228 209058 123347 -120334 212668 -242234 162924 -103253 253105
23161 -314513 265020 69672 -5090 -260023 -2171 82158 6182 15927 -91128 111737 58579 -20020
23148 -26061 248052 -60131 116532 -224955 163117 148203 97507 112495 63169 146844 -128992
23136 -125430 132132 -190533 248941 177961 187707 -29780 370594 23458 92597 62053 293646
23125 293646 -159297 210996 295077 28006 13358 288268 -278449 128255 93623 28271
23114 -193798 84294 83426 -472137 -7014 -181255 -160923 -69293 208252 120710 87566 56175
23103 56175 227233 430983 -236220 334602 -41847 299497 -76781 160372 53644 -181847
23092 -229200 140036 123865 -68966 -259457 237579 49746 -62946 -76625 9777 97240 -319591
23080 -76554 99726 -218310 -129720 99307 -119033 -26754 -230688 -125180 -233943 38068 216092
23069 216092 -187077 -159115 -105509 -32438 -215604 21223 124816 10500 -80118 -242934 -193903
23058 -193903 -290374 211516 243923 121342 407647 50311 44038 -75645 17372 -67347 -178861
23047 -178861 278489 172760 53502 108390 206626 -142322 -126768 124891 -179186 -96658
23037 -96658 -80826 105 34590 -255447 331857 -117125 -169252 165413 -119486 219521 19648
23025 35752 -38068 53252 -48877 169851 66991 46793 60001 -299533 9570 93859 -155193
23013 -18913 44507 -112680 -198058 -87707 119904 51254 -76669 10628 97539 15931 -123392
23001 37222 -211989 9967 41064 -86137 24435 270402 -93431 -101740 -153494 -11062 -76752 31370
22988 -77772 -26682 30803 470957 -186578 -22301 -51966 43418 131473 117815 51763 240958
22977 240958 -18262 57015 -179160 -70224 23395 388870 -29973 -144451 -146646 -268664 -40660
22965 10714 -39810 147559 -370693 -28074 -135489 -441310 53869 -116872 -144623 -63555 -107428
22954 -107428 245688 -27143 76541 2549 190077 -62955 -191846 -68339 -23685 -246425 42145
22942 137239 102281 -50982 -188523 -94205 9526 -219252 355511 -197218 -123764 -108279 -138362
22931 -138362 -196850 -72857 -280987 143667 -243506 10961 228316 -55210 65678 -75634 316676
22919 -117563 -104759 -211802 -22187 -286607 -1792 -264816 57609 64221 -19134 -123358 -283451
22908 -283451 -126564 247218 -17262 -356495 79790 67472 111333 -121458 -75191 203896
22897 44894 -334292 239095 -39331 -6546 146657 -37221 83680 10507 -90056 -53393 -209189
22886 -209189 -67693 -117535 81410 -413930 -17912 -112105 -239317 97146 -82211 254342 -249171
22874 30021 172859 -545 -199788 98781 -174130 112013 7575 -209655 -373376 -105482 28439
22862 -46731 38937 -85522 -24013 99422 45763 -6847 -48097 96733 -131504 94730 -34942 -165100
22850 -165100 -50875 163631 -56118 -456657 239938 30141 -64534 206104 -92728 -172675 -60362
22838 175500 -139846 56341 -70546 -83042 -11608 89031 -312104 -46338 143796 -124361 27149
22826 34397 32272 89524 -57812 18814 -222836 -48846 -85193 135377 142576 105495 56780 -148088
22813 -83299 136286 87591 277922 -10595 -127204 -388008 63416 -207739 -348991 -239236
22803 -239236 56907 -75723 -268614 -48714 -206308 64071 -136081 122444 233918 -97956
22792 21529 -16227 -222172 189863 -92929 -260882 84465 -142653 -46065 -346536 13341 -11261
22780 -216292 -120142 361659 -339347 65218 -133572 12069 94481 -106798 -13246 -91827 -79923
22769 -79923 -31431 128331 212967 -72285 224085 -153317 -30608 203074 17962 182565 56016
22757 147989 158045 -148193 270211 -162264 -103268 -256974 15357 -65397 73238 -167654
22746 -102607 -131803 130122 9515 -316815 -124619 47058 -228075 -90774 -32038 1870 -75859
22734 58637 -77860 245794 -116823 26 -163389 45902 184786 7681 173867 -184691 91984
22722 82648 28958 155805 100891 61865 233630 -113712 -167195 341626 42725 179245 34591
22710 -237834 -151640 -181228 -56617 -208454 104253 164924 292707 -70156 107367 -84341 -282589
22699 -282589 282150 -69770 122456 67720 55035 53517 -400357 18420 -71372 -1136 -13739
22688 -13739 -221354 -98873 39725 -357064 -180793 -204135 -15568 -181224 -262044 -66475 127401
22676 205898 -187293 -81405 11787 -346963 51744 158437 117613 69427 79079 -149319 17747
22664 216868 -144135 -123333 -196632 -195752 -271544 -14268 -219269 158206 246903 -69767 -37700
22653 -37700 102808 39084 38872 -127738 -342449 -216273 -225650 -106948 86054 -212813 42957
22641 162661 56924 134462 78 -348377 -98852 -196689 34954 10915 -192562 161694 229149
22630 229149 -120294 15966 -242237 -8593 40427 -9798 241281 156950 202886 -88376 237829
22618 58358 -409369 -62132 -176565 864 -93622 24923 -304612 -154592 -23284 124844 -165009
22606 -137772 -21670 -88748 -81977 -270132 -438669 -87253 -195331 -21717 71387 -5470 167646
22594 -188635 -183409 -328876 -70316 -166079 242184 -90074 -64737 81682 -94633 67085 -154527
22582 59985 -353140 492775 144015 106150 135498 -183511 -193930 78664 380690 -280919
22571 -343944 -249547 34014 -137023 -146320 -198701 109533 80571 180147 -111536 -79796 -287051
22560 -287051 382595 -161363 -3123 -1193 -10885 248642 -356519 -385583 -639164 257867 121144
22548 -73656 -136804 -64300 -39228 -137782 30877 -53879 -144102 -353633 71632 -162617 -157195
22537 -157195 65531 -162719 -154248 -31681 -191112 -116826 181423 61364 -375330 269818 -118063
22525 -132213 250229 143868 30288 -238248 -126372 349728 70476 300754 -196572 -257673
22515 -257673 126672 230693 -100212 60291 -144359 -208347 268037 -46169 -451054 70431
22504 123240 -1982 345781 13220 43027 -364948 -55165 -76918 505165 72620 -95926 57362
22492 -13554 -77656 189926 -53105 -65374 319538 -39445 -147133 30445 -231150 30714 -49779
22480 -26978 -42328 -71732 -84142 -116603 129752 41879 -367982 327567 -42961 197553 -182324
22468 -39240 19854 -294856 105788 48167 -42994 -137002 -89519 238086 -251396 -160112 -38166
22456 -278786 246157 149978 -70966 -112193 -71978 -419192 -33966 -420052 108386 -98988 -242585
22445 -242585 -71740 -92513 263768 33136 126563 -278032 -31557 31790 -332992 -164482 -152240
22434 -152240 -67781 -103917 -46449 37731 -206081 -48391 116290 316361 139587 121707 -257277
22422 -230255 246286 101739 202021 -166599 199362 -385760 18027 -80898 -342860 120651
22411 -148972 -102135 -243377 17465 252530 58260 -127958 51730 -228596 -117671 -175536
22401 -175536 -382852 -91251 -96751 21587 26741 50109 -34720 46929 -27801 -250101 -191712
22390 -191712 -184001 -239553 -325990 59889 262171 28660 -264713 -94024 334257 -5595 -79635
22379 -79635 -189777 -136772 125964 -88552 -142953 -133674 -96925 99550 -237865 98659 -171486
22367 174369 106891 96312 -351612 151546 69570 -195319 -50763 -72518 16358 -280992 21745
22355 -102112 246658 28920 -36162 65515 -242061 21733 -57656 -40360 280112 36812 160034
22344 160034 -54008 173447 -217845 -108836 -207419 -151578 -183587 -265540 -228306 -35331 123802
22332 -51468 -122499 -2379 -104878 15628 273685 189586 -2560 -278290 -77639 213167 73860
22320 -42536 44978 -7246 -97173 -165600 -188830 -223962 -220880 -90539 126096 -113451 215339
22308 -303255 129817 108734 164085 -18218 273819 -193850 71346 -99260 -16135 50880 54649
22297 54649 257155 -290135 -128837 -286318 6877 -58554 16586 82485 -212303 259510 -2157
22285 -103250 333277 183806 162949 -106979 3339 262200 -25108 -110424 -386677 -147185
22274 207789 -242201 -59767 -164217 -31013 -77947 55883 -233967 108627 -136354 104528
22263 -34915 -156804 -432942 -116780 134381 -471 -78952 11175 -166380 144582 69333 149124
22252 149124 -21118 80848 110394 -133931 -227699 55490 -181849 -175156 -108548 144996 -302030
22240 116172 -78182 -31415 -291126 22523 -237615 78634 86812 103924 444017 -719784 -132774
22228 -46058 171914 -370065 47580 -298237 -21688 -98812 -243425 -228609 38868 126525 86681
22217 86681 134729 -235177 204790 20035 99298 -51503 -81549 -61517 -116327 -241643 -71071
22205 -219030 -41086 308421 -11483 207289 5199 -35655 -17620 147441 180616 -51739 68364
22193 243516 -3164 -45504 71108 -67521 -24462 -253866 -154272 188169 -145486 -96273 -139936
22182 -139936 139342 -64668 -2976 9759 135588 -226293 113032 -97112 -56901 98941 2934
22170 48589 41437 -333905 -410498 95705 -127086 -9290 25794 341317 -61803 -292541 -2566
22158 -127469 1794 -358436 -166707 81994 134811 -321316 -34885 1033 -183355 231475 85468
22146 -77004 233233 75175 115601 -29236 2860 85569 -21929 -18864 -93187 -17868 68721 -52853
22133 -52958 -34414 -351657 -336378 386812 -303202 -132895 -37495 -286285 14347 138362
22123 138362 -7213 31097 54742 -219361 -139275 -58171 -15460 140408 -258955 -151187 29119
22111 -111843 -196949 110549 -37983 -319256 90425 131474 74209 177290 -162505 -113724 -178858
22100 -178858 16936 243286 14669 6491 -161668 -34236 -315393 -218194 -89002 -69774 237771
22088 96060 240108 86342 -257551 176395 30 -373326 -139014 214921 -151203 -49457 387916
22076 -45120 -334030 -45371 -189944 -55706 146615 147659 29621 -82959 -153742 -116400 -57263
22064 7639 -220378 -168769 -168983 -289134 -162200 -93047 -162403 -284541 -2248 -252352 -303328
22053 -303328 -117261 -284901 -49615 15518 -125203 -187971 67081 141915 131369 -58532 50782
22041 -102477 -32363 -146336 158919 -208809 -68777 -87224 -29312 -115755 95896 176077 -22265
22029 175023 166689 -170435 -232224 -20627 94265 -245510 -153596 -133136 -80941 -35537 67171
22017 -43111 -123889 113915 238826 202848 103891 -30985 96790 60212 231208 -421849 176287
22005 -290999 -173272 -202146 -135083 135636 99083 -332455 -90509 104852 -134800 104784
21994 13806 -36419 56355 -393307 -207366 -84771 146757 73352 -225323 217074 389306
21984 389306 -38928 -200078 354129 -40400 122721 2842 7795 -193850 107118 -17118 -39135
21973 -39135 -253490 17911 103857 416412 -228925 -64323 -88519 227222 85780 104863 -83004
21961 -256276 -154097 -386370 -219776 -9353 158158 -82232 -115975 -428945 -32482 -247165
21951 -247165 -36684 165298 180380 276259 -169900 63769 -440513 -56362 -197547 -279838 -165260
21940 -165260 -305545 42515 61766 -249907 -90686 103758 -22595 -303869 -63133 208140
21929 9635 -115728 41051 -24206 398700 104119 -74635 62961 -52966 253039 -26315 -441596
21918 -441596 -82250 26546 169053 110865 -119585 -482855 -79957 -104223 -163108 -12161 67190
21906 90641 19200 -565693 -28239 1101 -118179 39717 177320 -183177 42660 -200437 -332536
21895 -332536 100107 169261 22504 358309 -158245 253430 195859 -65971 -92026 -182121 95999
21883 -153168 140962 108231 -53699 131998 -69852 -180494 -32832 -222517 119154 -412 173298
21871 -30594 -54995 8618 65597 -183099 424786 -169326 -83531 -290285 -321313 -203842 81522
21859 146386 -122120 -99686 -151601 110508 225360 81760 19541 -116754 -68859 76435 140042
21848 140042 62817 -105412 -115326 -234783 172923 92447 254116 65878 -243289 -79490 -397285
21837 -397285 -166620 320888 -250475 78711 113722 -89890 54455 -96357 -253868 -30619 -77271
21826 -77271 -157577 -36730 13254 -108285 38267 -87361 -26326 -258696 -36965 -200094 -53002
21814 -116146 -180899 -197369 -397696 -112949 -241174 85336 182946 56846 -28362 88393 -33552
21802 -25279 247538 -169759 -136574 272444 -162391 -218644 -382308 -43864 111965 -116336
21791 42546 -16439 -130375 87536 -84880 -251862 -166291 240447 -222557 25323 20790 73190
21780 73190 -236510 110037 124800 169826 -125158 11205 69996 -191546 -140451 63083 -149536
21768 -80441 162454 15131 29027 -74600 -88294 66437 269458 120125 -13539 47136 162321
21757 162321 -48032 59399 161755 98807 -118992 149882 -20443 106564 159510 -76829 141714
21745 -347071 -170903 -114902 -113868 -904 -263 -181094 -12606 -61235 -332906 88156 -52451 -14987
21732 -188502 -121063 -222969 -156556 13465 -93283 131530 -78413 -100612 -135546 -56916 75246
21720 -143739 286565 105656 -422510 204560 -12529 199269 276305 -59660 3322 -329540
21709 -40727 1199 -91437 -413370 -10406 53708 -118297 48440 99925 -111159 86747 73408
21698 73408 -231210 340553 -182396 -173115 -9285 -201660 -32633 -31612 6726 290978 -182275
21686 57956 218401 110835 -3656 -98123 -182397 -210098 -214226 52302 79830 174749 -31816 -277461
21674 -277461 -190584 -262420 -179643 -68457 45410 -181281 236051 138766 271135 33991 -163520
21662 73630 -255304 310064 -103547 -308708 -92128 108467 -195480 -26690 -82182 -104516
21652 -104516 -42641 40755 -172992 -317970 32577 253 -241944 -194505 229818 -198679 27213
21640 43019 99277 -168758 188017 319622 -38926 -29820 235039 -40968 293759 -283275 64343
21628 -256184 -244248 -368374 -382772 -30622 -95919 -298371 160556 -59057 -33004 97696 -238634
21616 39189 -101113 141925 113666 -37543 -312291 -83085 64524 -49393 -211336 -295832 -7667
21604 -52197 24632 46178 28784 83072 110104 -289587 -194618 197071 -85438 61783 185152
21593 185152 34771 -868 -173970 8821 -163232 57622 -92868 -93792 -76273 126883 128041 -183771
21580 -122310 -57082 96796 -42467 -63068 -88112 111773 -66490 -125636 -144178 -265419 -102414
21568 -26753 95815 -133032 -185323 110406 -235657 -176245 -131096 -20548 132804 -108483 303849
21556 132226 -160569 -190006 -72818 -165552 -8840 171320 7779 290046 -178261 -46902 180035
21544 -151809 -170151 -168132 106921 -148749 145843 -108647 245310 -186980 -135410 158117
21533 -11784 399272 -20911 110931 14979 -109242 13706 -352064 -130333 86859 226434
21523 226434 -293200 -238358 82612 -8031 -288748 -147634 -276232 -408171 165757 65744
21512 -330136 38962 -172342 -262172 -15157 -163178 241966 -50460 -196873 -163000 -5316 170181
21500 5836 -205875 16068 -146393 296608 418506 -451850 319681 251587 97055 -29154 -21050
21489 -21050 49110 -206149 71159 -87648 -209934 31802 -95387 -300869 269751 -143854 -5409
21477 7962 -147712 101076 110132 -168141 -275495 -27859 -182071 124501 -123 -399334 47414
21465 -260823 -59678 -105836 51577 224475 -220239 41908 -28078 -91465 73803 -2799 -369941
21454 -369941 -127830 120588 69342 -142084 -101885 160261 -3762 -52447 -136003 -173029 -218406
21443 -218406 215978 -324354 96110 -121084 8665 -306227 -28189 -50631 82698 -46875 56246
21431 -6824 23536 -35602 86976 -208996 -27581 -166516 360234 223830 -216397 -98885 -113757
21420 -113757 83229 94459 14169 -66850 -182853 -218196 27523 -16929 -137561 264773 -107989
21408 -48097 32854 147547 42296 -50753 57016 -122851 63760 -184447 -192943 -190821 -110248
21397 -110248 -210869 52439 11051 -220217 97861 93374 3588 -137022 -139743 -192297 -174705
21386 -174705 -96726 -401897 -97068 -142615 251925 -76232 -128212 -119909 -255690 -31237 219166
21374 130232 -332571 -188053 -222225 -136372 -182575 -80262 -48380 69746 -31821 -397652 -146541
21362 -515539 -157819 32184 -191860 -61629 154426 -52716 -176926 94157 -252267 79436
21351 -554277 11590 -240104 -79024 -31157 -134700 -202847 240806 -155972 120146 217411
21341 217411 84413 -112393 -4950 194775 -395370 -75395 28823 -182111 263015 224532 -62046
21329 223748 142473 69215 -206485 49820 -112379 -100531 -126487 174395 299466 -128905
21318 20615 -174221 -259692 -153651 -11001 -395265 128434 -90733 -443977 138961 -29917
21307 -139683 -201570 65487 144429 -22196 -107912 346545 -58820 291854 -263698 -103995 167192
21295 -29189 -245382 -217818 54634 -15917 -268144 -175326 -252399 -135775 7266 33355 136490
21284 136490 136775 -188801 -108418 -246893 -203106 206684 -227138 107325 -48493 201284 128909
21273 128909 -86480 -269825 -314425 144751 -149425 -25478 67112 -40200 -145468 58845 -58884
21261 -180630 194627 -97203 -379556 6311 -4013 19660 -90291 23949 -228812 -186219 -113995
21250 -113995 272149 -513617 134702 38996 -135245 -276211 -102720 -166717 -232455 72300
21239 95085 32589 -290212 -18505 -170515 16047 -22171 -447 81322 -104111 -282039 90917
21227 -42150 -34847 -30877 -227117 270055 -352639 20954 -208740 -36831 151668 -75076 -128313
21216 -128313 -380985 -113540 -80262 477957 -131275 -235983 22900 -233880 -161164 -247195
21206 -247195 218174 -62727 -315555 -191537 102799 -72612 -36192 -93411 -234114 -140684
21196 -140684 -183800 93515 -1046 -182919 -193095 119964 -95119 55527 -289283 -276334 -69684
21184 239430 67966 60915 -177901 -11666 192386 35012 348397 -286499 -172880 -62261 -57223
21173 -57223 353604 -169359 -195479 -318602 -220479 141337 -172194 -220414 -92844 97914 -195330
21161 326419 -385584 -221016 27723 -30910 -49156 -204319 120442 -241885 137227 -330269
21150 -86402 -140544 -134164 -174089 9229 -129208 -310172 187902 -49708 261944 157358 -70253
21138 30304 92795 -33093 -309337 137086 84142 -330184 25199 49105 -69882 267532 170965
21127 170965 -31693 7076 -88292 -196913 2064 -15158 294368 -318384 16745 83164 -228306
21115 -241919 -384017 -74516 13040 -216294 281470 23016 259538 -489835 -59828 -145760
21105 -145760 81395 178858 -171645 345253 24453 156058 -215978 18300 -29355 297497
21094 -171930 18969 -3158 260204 -75235 -218981 111951 14502 269898 14937 -137815 -9442
21082 -147770 173745 -245908 -2386 -6925 4060 -302245 205814 28114 -171787 227765 -261626
21070 -101585 -160687 10171 -432933 119349 -8600 -375797 -134884 -96215 -396389 -221186
21060 -221186 -159955 75415 -219587 -181834 -158029 116740 -70019 -77068 -305949 349049 114498
21048 75570 107555 16510 64119 -138794 142527 170918 152595 100617 -91511 141392 -121758
21036 268715 188437 -219095 211322 -165771 170244 -19793 141899 165637 -42385 133714
21025 -242083 9526 -136725 123573 -16389 -442880 -244645 -4092 -102282 -60366 -78525 -263741
21014 -263741 -198935 210103 -103310 -2708 273977 90740 -73333 -50342 96958 -254956 30345
21002 -134272 36959 56561 -116228 137791 38127 -224617 -368632 -49051 -58595 -105358 212272
20990 -175957 -162131 542 -144142 129830 -210090 -262365 -90598 -63352 62490 75146 -205416
20978 120960 -256252 -59687 -154673 -144799 -144476 -5470 104540 -18405 237999 394151 -206296
20966 21638 101696 -84802 -222757 25902 -75189 57138 11026 -215359 -42804 -167704 -223819
20955 -223819 170357 -174618 168085 -264035 182566 -280504 19124 -213293 231956 115723
20944 211158 -191847 -101519 -290321 10990 167633 117868 -24596 -281477 5952 -36098 -258686
20933 -258686 61111 -245034 -84666 -149004 -15466 -30440 118626 143937 166354 -89086 -264027
20922 -264027 -44077 87601 65972 -14628 -104051 -209649 -153589 61847 -263209 -71676 -266161
20911 -266161 -286210 196862 280646 -51536 -21886 203582 76323 -298481 -425839 -3508 -76109
20900 -76109 -60308 -211620 -393245 -102516 156665 -132815 -228800 -225670 40722 153596 -353227
20888 431634 -107978 116620 481 -164372 -122548 -82051 129139 47020 -282072 -254102 243852
20876 -5892 -322297 -308267 131772 500022 23972 -178091 -99117 24742 -332304 -63249 -137408
20865 -137408 -368393 259533 15720 -4398 115996 37940 -77071 141385 173598 81522 28871
20853 -181160 -243322 -53937 -13387 -220003 -36395 -20867 60265 -65693 -298622 -424597 -293964
20842 -293964 -70319 -152462 133605 122539 67046 213475 -324303 236084 -184177 -5822 -176035
20831 -176035 -113379 145649 -23551 -829 -35230 45799 -455175 -45975 -303 79001 -279664 -91982
20818 55290 337184 266303 33017 -96578 -172758 335863 -204183 -433542 -191460 -88052 -212459
20807 -212459 -78633 13054 -127399 -205948 -61121 -158066 -121310 -407403 -520477 6709 -109522
20795 -109637 90880 -177651 -220989 -195672 200533 59357 77673 270282 -132348 -101272 178482
20783 -59011 -71463 -273975 -223255 -54492 127318 94307 -290571 -44365 33896 28004 -222719
20771 80978 30464 171143 -70201 -174068 41205 -328801 -204139 -271995 11760 -98891 42050
20759 -141526 205398 -208636 117275 62107 192764 17370 -161620 88075 -142764 49824
20748 -259858 -381870 -106990 -72681 -98062 66177 -62900 84307 241264 -296950 -148226
20737 -150079 -215796 62309 -29756 47375 208984 -172974 -207144 243691 213294 -54861 -14432
20725 -210335 -114954 296047 -57127 52646 -280732 233844 -84272 -115130 -45522 -411907 -226138
20714 -226138 -7936 -187664 143789 -51383 -170586 111564 -142965 275402 -106159 43983
20703 -166522 -34345 -252468 -339163 -112011 -117795 82130 -325649 91279 -46335 -257439 -181201
20692 -181201 -143282 323439 -175299 -117240 -91317 88204 122616 -148484 -19189 -10057 267034
20680 128348 18367 -194808 173730 -268682 -257414 -113540 126225 207888 -173771 -48266
20669 -104751 -28100 212452 161083 128001 88100 -103479 -205786 -114380 -60427 -240801 -26887
20657 67474 -263993 -148815 158187 45105 -94436 -227615 -97874 -40970 -80238 -25123 63903
20645 86089 -200715 187295 -167842 -13785 30393 -201730 -255610 173141 139547 85089 -375351
20633 194306 238011 76034 108043 -479652 -271178 -311730 29526 94230 5688 -60300 -26152
20621 172026 -233731 205102 96480 146690 -61675 -38763 -91672 91520 -3513 39240 181644
20610 181644 7090 266189 -46319 -82287 -109904 -433407 -339819 14034 96469 -85631 -176427
20599 -176427 -114495 -77610 -83403 -93247 -151757 -55629 95159 57214 147509 113151 168536 -270839
20586 -146881 -251692 -204701 97787 -291200 -20785 165935 115337 151001 -30127 13607 362417
20575 362417 158400 -35311 127624 -96969 -61799 -334285 62175 87457 -226173 -212122 -134641
20564 -134641 -19708 52306 71254 -102938 177963 -56582 -257671 243681 -67393 -215909
20554 -215909 -68955 -108733 75259 -253745 -180757 -201287 -282781 161398 166282 -270677 142931
20542 65790 139986 -257451 -35798 212872 -47129 -7936 7452 -89437 100747 -44809 -164490
20531 -164490 -101241 99504 -203259 -44279 -219092 179979 -372100 -63507 -2023 -282120 -69665
20519 57819 -147496 -56768 -58685 108766 213748 -319509 192765 -14904 -201887 17361 55638
20508 55638 -126938 -98506 -227108 4940 -154400 41521 -13997 31976 135747 47952 46132
20497 46132 -249910 -48920 -216881 -118028 -129489 -222052 -12899 34734 -84298 -181452 -127295
20486 -127295 41033 245073 -204701 -343328 -56197 82570 58596 -123480 -122961 87650 -246478
20474 -246856 48402 187405 6669 19906 -98168 -275844 -301325 153077 11501 -195450 -359265
20463 -359265 -328712 -178086 263404 -136231 121403 76888 168194 19500 -143668 -113417
20453 -113417 -10228 195558 -64593 -116799 -57070 -123920 51415 -266090 180773 -34565 44493
20441 -159521 -135081 -112186 291651 -296633 -61087 25760 198257 -171865 -117764 47752 187394
20430 187394 -85681 -164012 469027 146674 -215173 -127199 -112087 -175263 44290 -183246 -81709
20418 -394653 -52464 -8909 -279579 -14263 -154689 100853 32682 -119501 245734 66223 -54571
20406 -224660 -190682 -12036 -273017 18983 -593153 -32302 6924 -230194 -82749 -40220 -62547
20395 -62547 -89910 -42473 212341 -81326 -264893 -136071 -260020 217222 434884 94438
20384 -308652 -277738 -119009 371059 663 -327427 85397 -25423 -123696 105721 -57579 -36935
20373 -36935 -217993 -189519 377809 -28883 87272 -182496 311617 -58669 -140874 -148205 158309
20361 308845 222471 125968 267214 -251064 -91076 -167543 158644 186379 -239205 -13416 -91710
20350 -91710 -174701 -2902 -84975 -141219 -24283 139553 -95458 -58836 325187 172828 -239624
20338 40441 290874 -48003 -12517 -34302 -1994 -87012 -381936 55023 -108654 207469 -218583
20326 -115266 328414 -183649 124711 8943 -20113 49971 -46820 -475424 -66704 -106080 -279412
20315 -279412 -196143 -35633 -74298 -74690 162791 -20278 -14129 -38763 -72899 -114044 195139 -87369
20302 -73547 -197867 16719 544 78817 -103513 271693 -160271 40216 -17272 -234537 -278348
20291 -278348 347397 52127 -196750 -117447 -32247 251012 379150 38459 -33879 -151272
20281 -151272 -34142 -236035 -128349 -137658 -466584 -53212 18725 5285 -232393 -140879 -150115
20270 -150115 -259051 -23362 -204703 99736 -374204 273390 -125355 -166279 -50385 -237996
20260 -237996 -275206 -201279 -32007 -102739 -16757 -172296 126355 -8410 26391 -21710 -74741
20249 -74741 -82534 -230494 -283719 -16388 -68124 -86305 -30392 -168631 -224676 134574 -119385
20237 84753 -82652 -185305 -107177 151690 -134776 105638 -12433 -177769 -94504 -94715 -396856
20226 -396856 -118086 -49520 189235 180035 91791 -274848 -26206 201223 -24935 -43333 -40052
20215 -40052 -306920 169959 -67376 -249383 211791 283659 -10290 301206 152439 410283
20205 410283 -20892 251717 -203608 -48739 -212218 157765 -208795 -259440 -431502 133664
20194 -130697 -277036 -41279 265808 -158906 -158216 175226 108286 -311515 -428799 302270
20183 62029 96128 144922 -63007 214665 -139597 -31210 11479 279992 66442 -138977 -269102
20172 -269102 -180485 -205395 66796 104229 39369 61212 58447 -80173 -44117 141513 -177440
20160 119972 119723 -134782 235911 -234180 128892 -218315 -1185 383580 150988 -143866
20149 141843 64545 41784 126073 436141 -147534 112729 139214 -186519 -286900 179222
20138 -60180 -248031 186931 -248216 226203 160549 -16853 92739 -99670 -112846 -286100 -62303
20126 -262104 32773 172815 -30614 -264733 -55872 100018 202622 -103296 -238997 -25857
20115 -113457 5643 -265284 -145410 -413750 -50476 100455 143858 -58470 -82256 198369 -357657
20103 -351414 -320764 -121482 160010 -89961 37208 -109891 -17360 445308 136339 101342
20093 101342 -94436 -287628 -34198 121884 27396 10680 -7095 -189920 -65780 106099 212258
20082 212258 56868 -225706 -79807 -43782 2604 -139321 28802 87809 -133634 61268 -54660
20070 84448 32189 -419439 -106456 -63100 -349430 -37648 1220 -177691 -76315 22819 60050
20059 60050 -157588 30544 -78701 -198084 -250479 104881 51432 29142 117483 97034 206660
20048 206660 -115035 174520 77865 -79353 -333969 -312162 33634 -80674 49462 56490 197900
20037 197900 138352 -51910 33197 -78080 -50167 187420 -247830 -438618 -335180 -203452
20027 -203452 -81453 -161217 -212016 -65006 -193025 130707 -284905 41402 -440137 -134045
20016 -306115 -377252 -8315 186531 186201 4361 -116918 -52707 105959 -3079 -50917 -115848 25876
20003 -129043 147275 -134422 -266656 340458 -222659 102257 -22562 181067 180791 4347 -189884
19991 -187852 -35550 -6371 -74997 71667 143572 -340358 158725 -87080 409931 -222988 -255685
19980 -255685 325472 76596 117545 111521 375655 256811 -4297 -197740 93233 -648878 248665
19968 -413357 45094 -46072 165788 -227494 69279 129360 -81755 -182512 79545 68962 -211363
19956 -17289 240301 39600 -186275 20331 181074 148589 -11264 -176440 -129016 38021 -30658
19944 123832 -124414 -260987 2030 -104440 167045 229002 22664 -217683 14916 -36859 -86134
19933 -86134 -32911 -75280 -54185 14393 87709 167061 -35014 -104477 -173786 -371963 -290260
19922 -290260 -168560 72839 -441791 -217830 -54840 -154141 109092 -165639 -134682 -103914
19912 -103914 13420 272965 -160643 -135605 -206335 65020 -34533 335023 -118499 131387
19901 -80439 -62746 -201571 -111754 -5286 -181401 -185974 -17294 -267838 -34825 58615 183326
19890 183326 -244574 50586 2974 58276 -127399 183076 -189196 162341 -80397 141522
19879 126280 281211 -252801 -136745 135201 36671 -164438 -58638 -11069 251147 -133939
19868 -52444 -35706 82389 -149182 481790 75428 268662 -43642 89308 -139445 -67110 -289842
19857 -289842 -155041 -69226 100046 -223100 9552 -215234 -44506 78337 -9398 -32491 -212830
19846 -212830 -715139 -70667 -110318 -401859 -388049 -217070 -185730 -14623 140172 179771 -209776
19834 -215937 332776 -369006 -444116 -366968 -32959 -268053 -88834 -87196 235561 -25855 -142629
19823 -142629 -123022 -47393 149010 -211132 -105234 -64036 -118272 296534 53068 109878 -123747
19811 66482 4376 -67843 12927 -231871 151479 -158462 48079 -262899 -123276 -128978 -122923
19800 -122923 -253038 -77474 -346778 159138 96583 -251685 -165832 -116217 -73603 -13691 -102155
19789 -102155 56749 58256 133390 23621 -219355 -162765 -125134 104200 -320622 -8320 126337
19777 -135612 -72987 -412662 -146621 127685 9353 56173 -334 -14023 -355094 -212220 22049
19765 23198 79729 -251551 -33693 -111914 123317 -113611 -112325 53487 -18988 -354454 -180887
19754 -180887 17075 -280390 -12954 287531 163485 -6418 -164549 -58481 47719 114097 -24053
19742 94652 -230909 -437925 -40051 -110688 -228769 261271 -194764 193578 193987 231900 103637
19730 232776 199728 55262 -218045 77999 -148474 -146760 11671 175383 -299416 -228058 164593
19718 -195561 -38899 -6557 -248277 117115 71477 159773 -14462 21867 80793 81230 -37084 -155752
19706 -155752 168894 164892 8580 364475 210729 159395 182266 -164 19511 147221 126928
19695 126928 120505 -102092 35728 -545038 -307147 -104535 -82810 -47089 52634 -75394 -143111
19684 -143111 -147035 76353 105959 -5053 140015 72912 -230732 -47364 -314921 -270918 -139310
19673 -139310 43957 -325598 325839 72817 -29019 -36627 -160002 -67892 -37120 -298773 291631
19661 -257985 228077 211884 -102790 18238 -229703 -82976 227875 -72281 -168642 544837
19650 263907 198171 -105437 -213942 29995 -14114 97915 90964 -150675 117117 -315163 -206780
19639 -206780 44920 62257 -117391 -280918 -195845 -96687 -252068 -121778 135423 -278791
19628 8248 -281724 43154 145791 77142 -94658 -45045 -118630 -236100 235435 189302 -150224
19616 -472627 81044 -57125 237371 -5784 -64133 148577 -193083 35899 441193 117673 185358
19605 185358 328435 -175371 -17977 -86904 -153649 186142 -122743 41902 18992 -78165 171348
19593 -455772 -51016 -110940 114849 -7426 6037 -222378 263 -117258 -24767 190711 -50074
19581 -103059 -30508 -276055 -138212 61693 -77627 -107973 -388573 -17124 -402731 -71922 -221510
19570 -221510 -252870 -307093 122360 -15301 -99307 83038 -155891 -226478 -38048 -73255 -58513
19559 -58513 64653 -16510 -229712 -135717 -145192 80427 76910 -91213 -273861 -7481 -308729 -224167
19547 -224167 -47215 264112 152296 18991 11961 -309454 59067 -27386 -38162 -71228 -553752
19536 -553752 -48540 -21704 104414 37624 -361601 -176876 55205 29388 -18396 -51902 -285229
19525 -285229 -274374 213463 13645 -316763 -54863 -251810 28447 -239452 -10528 -147050
19515 -147050 551146 -17329 201857 -150224 -250170 185131 -180370 61145 107586 24836
19504 -137802 -168826 93672 -106534 5803 -94123 136996 -42965 165539 10653 -447963 168004
19492 36583 -109951 -146221 140693 -202235 -15973 -229813 -80579 -194990 125118 210382
19482 210382 43265 -88659 -116408 -277425 -107159 -423701 -36907 204618 165264 -127170
19471 -126395 -361222 38100 -44993 7751 -25646 -268482 76083 -83622 -389820 -501523 -100527
19459 157252 114844 119965 -30119 -306011 -137318 -337173 114213 391270 44140 -130709
19448 64127 -174757 -13783 -169934 -164363 274338 129276 -92106 -117109 -67661 -247269 -279265
19437 -279265 64442 -143890 91081 -333 -311615 -166988 196392 -27894 -22871 -78402 67354
19425 -67034 113658 -128301 -596 -61812 -129389 -91337 -222941 181704 -36272 132105 -158168
19413 -64948 -224380 155066 260188 42585 48827 -193973 -173262 -122996 141709 227099 112238
19401 -469439 -199039 -96634 159534 111198 -127248 99222 -87701 -28562 -54665 -115480 -9398
19389 26333 166377 306163 -151759 104899 229329 -88681 1430 -20059 268750 23789 -79961
19377 201280 -302974 -163810 -313529 197516 -272844 -207770 -228417 -228096 131327 -37068 -359324
19366 -359324 -254201 -164513 -256961 47422 -140432 -230012 -35593 -238970 -383661 -41738 58621
19354 -126163 -128783 -31790 68732 -40523 -122963 18155 238809 -269922 328690 -219923 -91700
19342 -186196 -34862 285931 43950 101015 -355016 -168922 221719 161021 -343663 21116
19331 154823 109366 64690 -56945 60350 198971 32477 18083 25730 60218 -272647 -160035
19320 -160035 -92339 -70491 -16486 63398 -124574 -268336 -147500 55813 -65331 -68021 -158266
19309 -158266 45961 -126369 435663 11268 61533 25337 -175276 -188251 -28972 -8514 54204
19297 119221 -138002 -384738 -186789 -141458 34782 -93580 199582 30304 164423 18228
19286 -78383 -285390 -32800 -68595 -372172 41086 -38535 31237 -356629 -73346 -118348 -12880
19274 -175017 -132863 36258 -51878 -12029 49655 -139037 -59214 -266950 -284605 -186775 -177605
19263 -177605 -17050 -417325 -230482 -254103 -4697 -42883 -170846 136375 -112724 -194067 206417
19251 -40643 -309894 90468 88915 -191097 71597 47224 -108128 -12019 158558 -10261 -114127
19240 -114127 -245126 163214 110483 -449197 -139790 -69774 -51922 -216140 -450893 -55991
19229 50742 -2480 32736 -87759 -153802 119365 -106329 78570 -272013 230317 -274288 183500
19217 -114086 -329832 -27784 -54168 69515 257296 229248 133180 -438613 -290799 117447
19206 -111825 -193248 17628 54237 -243022 -317006 54792 162512 -245864 -306315 -7875 180993
19194 -293354 -306931 139031 -334 -104594 -115067 130969 61106 -164778 -125473 -95814 17941
19182 248142 -112412 -128591 44204 -105341 -200064 139102 238809 -135302 165574 -32165
19171 -389155 -183275 55725 -99846 101860 226390 247164 200154 -8878 90251 -297390 -307107
19160 -307107 -186334 72919 -378432 189704 -527880 7517 55594 -435205 18872 -60550 -73905
19149 -73905 -422239 223696 -59840 -68485 55804 22602 -65774 178204 3532 14999 90143
19138 90143 -94534 -133326 74590 50066 -708 -25147 471131 77531 -202650 -14966 18498 -24593
19125 -70093 72123 -60248 -52790 350893 -363013 -104631 -386841 21286 -130945 -195180 171778
19113 179023 -47130 -106043 177474 254723 158602 51191 76897 -113328 -30404 -237785 205166
19101 7326 15482 -109625 -273727 473 -10796 96948 -65485 75682 -94471 -181882 -95105 -50899
19089 -50899 -321382 -231101 2710 -299477 155724 199307 85289 149959 -29802 138351 -74046
19077 -11262 115733 226957 419 -188744 -122637 277181 -7207 -122619 67537 89253 -94487
19065 -122254 -139754 -245256 158171 357718 -95574 -219494 12021 -353313 -211257 -89216
19054 -222786 -163524 -17474 -117609 44605 31067 88936 -96399 -75606 -425560 -219872 -152029
19043 -152029 53751 -59803 -23097 80665 100333 41639 110287 189879 -134789 -147666 207136
19031 24019 236317 -126956 86511 -64901 -134795 281705 99821 106522 -219653 -118423 -120904
19020 -120904 322865 -25697 -74463 179332 -127232 281019 146877 -213489 186666 38604
19009 -103411 40077 92928 217335 3801 -566 43379 55030 -181509 -54739 -270002 33173
18997 50922 415096 -441072 -84161 -37317 -23595 -194607 -48182 -54728 1229 -228318 -15942
18985 -111013 -13917 158192 45350 -246187 -70352 -262486 -104841 -49391 124746 207278
18975 207278 182720 293965 -53802 302266 432546 -64895 56240 -282472 -214138 -225638 -318812
18964 -318812 -97963 188053 -234063 -221722 -155913 -10322 -158333 28220 -63587 201741 141196
18953 141196 182417 -24140 -117502 184831 -239626 -45062 -195139 -84227 -106701 -225867 -177455
18942 -177455 16757 -61310 -37158 -2460 -260171 85298 -218585 -401316 -242129 63254 153931
18931 153931 350828 -354406 -15652 -148075 -370192 25421 -52686 61803 -269324 -299241
18921 -299241 224707 -276254 -250174 335094 -292392 -50088 87924 -26670 235785 151881
18911 151881 352913 -80180 20663 -153833 206955 -22617 -51315 58592 12185 -46039 116161
18899 -99903 29744 -15767 -279434 -83746 -233452 -53189 -193877 -239922 107388 -181613 -150727
18888 -150727 222684 -262239 -90154 -119107 105455 -526747 67342 -106655 -23100 256291
18877 35093 -451277 -211806 -1113 121183 22548 229308 165838 -112266 -140116 110689 333687
18866 333687 -384475 171764 15820 -162306 -369166 -101125 139263 55338 -284195 -107445
18855 177983 -48545 138704 -40523 -162825 -168002 26372 217524 -277844 84722 4411 148134
18844 148134 69133 -119754 124916 1278 -48246 -9361 -108893 8929 -161715 185007 -99325
18832 -133161 -86453 -107359 -9105 146592 41533 -142021 -95410 -151094 -133795 -170417 13441
18820 115465 239043 300289 -145771 62007 -46109 -13615 -77845 221928 124779 105040 1380
18808 29406 98722 176788 -2804 54661 55445 -289686 145484 212086 -212365 283508 229529
18797 229529 -85221 -69250 -374117 -256984 -381970 -255155 281687 -169098 -251706 288398
18786 46337 -115876 4978 -68960 -200586 -52660 178704 152631 25868 118829 -331946 -202695
18775 -202695 -126113 46001 69192 -118463 -62013 -334518 -315619 60103 135510 -24813 35506
18763 90832 25139 -218676 25011 35040 7593 382230 -171177 -376724 -208769 -206749 -159362
18752 -159362 -13993 -93079 34835 -114550 170849 94096 -111110 -176023 -168006 116533 92910
18741 92910 122010 -64079 -473403 -211316 -93505 -376862 -208515 -427988 -131058 -269519
18731 -269519 -55201 -235109 -92595 -263998 -89859 -51954 -62943 -89816 -154021 -221695 54611
18719 324594 -344253 78118 -200696 -165266 11408 -114595 -138446 -190390 -418617 61594 194344
18708 194344 -305 -98361 -34262 21942 -38811 -182534 -122751 191945 -143181 -54223 -103582
18697 -103582 121324 93043 -271475 -213488 -119839 153593 -98760 154949 -95558 -36051 43513
18685 315782 -87625 73423 -130861 -535982 201621 105889 196728 4142 71010 -422377 18284
18673 135668 -260406 -50893 49409 98909 41793 -129586 -125334 40657 -211921 -3472 336361
18661 -311831 -88930 -109019 -347801 314719 -13974 -112251 225547 -254037 67712 8395 -115278
18649 -400634 -92425 -87527 -135372 150607 -68633 -253800 234531 19142 -124671 92374 -378654
18637 -2875 -123152 104059 12006 -80206 -83594 -201 -220099 -126238 -215256 -62332 -82321 -149361
18625 -149361 -201979 373054 86266 338100 -199757 -272001 -14426 211182 152160 -87504 -198368
18614 -198368 -114802 58654 -70109 -96761 70959 -355853 159760 118232 165869 -58379 220529
18602 -136899 -12932 87197 -13815 -190310 98181 -271041 -174366 -232705 -137504 -43282 -359543
18591 -359543 46488 -188625 36446 -75915 -330362 -53481 -121313 114616 -53137 -184856 18233
18579 -340760 -167900 -32780 -334075 -348893 -81570 -141206 132631 -31355 147362 78550 -90247
18567 -177091 -79420 39095 -462759 -13692 194656 12295 -101816 57663 62307 -461310 -2835
18555 -123210 -11270 185480 274695 453391 6571 -24432 -239940 93091 -367411 -38088 -346596
18544 -346596 353834 -245761 132340 79278 50916 4850 264727 235707 152831 -165433 32536
18532 -37947 21691 303582 -174160 212428 -67558 -268775 -4430 -228260 79690 19016 14839
18521 14839 -168514 176052 -35635 70218 -79076 -478015 -54452 -82161 29417 90573 -67019
18509 -279536 9254 86638 72521 -44758 -118611 3760 -47455 -128868 -124206 74110 40589 -53918
18496 -4972 18436 58535 -155556 56941 262774 48761 32289 -341142 -205496 -89881 -44305
18484 -157434 -87667 34557 -59622 51738 -36779 213869 -199465 1835 267695 13413 -246493
18472 18080 443981 38365 -111989 -315214 107070 70273 -105764 -76285 156513 -95912
18461 -193764 -62019 280474 -138514 199624 106430 28527 -128649 54222 169087 -168968
18450 86634 -327980 -224046 185712 -173218 -84530 51625 -238795 239731 -95914 372363
18439 29568 -167335 115318 -131 86241 -367945 -230287 -220297 60053 -148379 -263697 55381
18427 -202963 -220804 150497 -84940 -17150 -29842 243763 -235109 150001 -116710 -185315
18417 -185315 87907 -169911 -52980 158555 -165629 -94230 6072 139248 173221 68839 216629
18406 216629 -1763 -86203 -23116 31856 -442339 263435 -294386 11966 -15116 -131516 182286
18394 -273379 -165107 47055 -164859 -81664 -87350 -97025 187618 -62732 146681 -19245 -353552
18383 -353552 -175322 157668 277363 137600 419762 -234442 158860 125893 -62403 123834
18372 8786 -96026 -54214 16072 76689 314243 212129 38914 230327 -157627 50614 234521
18361 234521 145101 228256 -169643 -298811 93512 131941 -57458 -176974 190886 -2137 -231814
18350 -231814 -80373 -89722 -64796 -57320 20849 156265 -1027 -44950 -261834 -105638 -326581
18339 -326581 8393 109013 -95670 -85662 161859 -172414 34696 -40034 279257 35055 -6330
18327 199803 141234 -87729 -38201 -146853 -257588 138429 247581 -125414 -112400 143318
18316 -162841 70719 -52007 -8037 32937 6130 86074 -9714 -66546 -322999 -207162 -228262 242867
18303 -116345 -212376 195892 71183 167721 -16197 -39922 -404786 233823 -323587 -1266 -31806
18292 -31806 24900 -167397 68695 -182822 -121956 -328859 26097 -185182 70062 190242 101969
18281 101969 -311084 -22042 57566 51325 109695 -91581 -126082 169605 149894 107448 138278
18270 138278 -76575 -2182 203237 -332235 -273778 321675 -52538 55959 -26786 171226 78209
18258 -222015 -37980 123981 -252754 75401 -391914 241379 89719 83914 -49467 131991 -270114
18246 -153927 435887 45879 -427324 325103 63502 141624 -174975 -95010 198662 -114391
18235 -201556 -191381 274283 31005 302215 -149056 44930 14089 2576 130853 49462 35205
18224 35205 41992 390979 254366 346118 -47381 70838 91902 -367251 164782 41019 -234848
18212 72559 -174933 -180419 -174756 -53832 -214363 -211181 -244328 -6662 -211734 55042 -88485 -273200
18200 -273200 -21285 82190 166388 -231488 -449282 -9349 -61866 -125175 68403 149942 36619
18188 -340011 -81854 95557 138601 349824 141305 213765 127096 91748 67859 -212154 -57695
18176 393891 -232637 -102265 -284714 9499 75333 28888 130568 178171 -34722 -37730 -246951
18165 -246951 51726 3515 282981 -141508 79507 112526 -148795 62357 326646 291017 -165550
18153 -175269 -55 -114434 169110 -65343 93960 163845 -254824 36169 -229948 274535 -231494
18141 -307422 -282968 86262 -501561 -41835 74445 181721 -130904 60042 -120906 -259931
18131 -259931 257722 258316 69066 -215249 -93576 -221781 122114 -44205 -150482 119595 195769
18120 195769 93316 89102 -216049 -109694 185324 115044 -7459 -16084 -106059 -177413 43573
18108 -22551 111800 110146 289404 172758 -155530 -27035 -407560 314822 10524 87471 30718
18096 -101108 -277732 32942 -52556 -91694 149041 -146000 188935 325255 -65585 -314479
18086 -314479 -167674 58049 -89965 -188828 120691 -127516 -224044 381770 43531 1303 -190160
18074 -189850 73359 -148342 10362 -226618 41633 49280 437041 -154110 -114434 273548 -98471
18062 31133 -312062 -172815 -59892 -175829 -195972 290442 -27965 -55569 -19288 55906 327611
18051 327611 172210 242638 103683 -383361 -102637 57020 58809 -121635 80627 -23742 -106212
18040 -106212 -260504 -14215 62039 98877 -282461 -336997 -115771 392232 212629 244570
18030 244570 -50368 47566 -167146 -67596 109808 72979 131311 101194 -83856 36615 -277588
18018 -119056 245141 -141798 -110853 -6927 94469 -56940 102473 -122306 -159089 -222810 152213
18006 93621 -77348 -39833 360085 -197640 116362 108765 8741 45580 -10763 -172216 -38504
17994 -4240 170711 112740 55203 -418993 423952 -28171 68715 -200056 -227588 -381252 27494
17982 63310 4213 171888 -215688 44040 171710 71881 128478 -45438 52458 44850 -295676
17970 -196633 -25945 14821 -113293 142216 52845 19376 9035 325313 -701 272096 -66474
17958 67688 -39551 -119246 163006 70072 259631 134772 185387 -178374 -4419 -242247 175343
17946 141188 331757 148762 -173710 151716 106538 72359 12352 -11361 102269 -56885
17935 6245 263028 -58179 -66857 36434 -154045 156082 -125853 44477 -174555 -257080 207952
17923 -63677 -139305 -284668 -48180 -192498 -194284 -8235 -144557 -48793 252670 33843 -47308
17911 107645 -67001 9879 -198653 119225 110584 124686 3620 34560 126422 73395 -56937 80253
17898 41957 -126034 55894 -87828 -70886 -14826 -169214 222141 270552 3644 -200881 -140593
17887 -140593 -37031 182793 -57861 169739 102779 63913 118535 100856 -120080 14977 18414
17876 18414 27008 178177 -98204 117485 -63613 39764 269202 -304698 -252938 84312 163683
17865 163683 114579 -19905 -133766 -440524 385254 -41504 -140806 203668 29366 130549
17855 130549 -25292 33704 275474 277923 -87034 216526 62049 -199239 346393 -37568 30944
17843 -153765 14150 276295 -76703 62290 -12358 -23379 274270 155482 135456 158379 62107
17831 -85656 11122 -122882 -338847 226840 240713 -40168 -195420 156104 363957 -161189
17820 -103852 -60877 -85155 117828 400582 -108346 -276622 197003 -163838 224900 182128
17810 182128 -202559 -102410 -6270 -111388 157478 13159 83565 -81620 622 -85423 -25246
17798 -194830 158850 34538 -36523 -139371 178839 -46658 -14812 58798 43160 -22185 12342
17786 126923 283186 51165 78783 -53543 87278 30322 -3583 19686 68212 200172 -216051
17774 -106123 -87190 -12228 296300 271720 74839 -147359 375899 104701 83339 306369
17764 306369 -58788 -27485 304494 362197 66451 -71738 181921 -234774 269729 192692 -1065
17752 -210672 -110975 357425 159451 177358 392256 112593 246720 116122 -110143 353534
17741 208429 150006 5250 116717 3687 98531 356454 -215327 16404 -1539 101331 202747
17730 202747 215859 116086 237524 76458 436821 -135914 150460 -35121 115030 -63578
17719 34886 -111238 -179417 205848 153407 -110110 -274890 407796 55711 387473 249683
17709 249683 140229 76889 30947 322521 -179974 -108297 -29330 101771 34501 -20902 69747
17697 425776 8931 440733 163848 -263515 335205 -148207 292906 -177832 171600 -166736
17686 -31889 228228 -72680 245585 298982 187899 -192334 -79131 131652 122060 15265 212901
17675 212901 137058 270127 169647 77315 245447 -136342 22235 52713 378583 -148264
17664 -101538 282941 140434 278387 123657 103868 166637 34805 -20693 34017 203229
17654 203229 253402 189416 229879 110317 146715 68957 153491 -144454 159536 -79238 -10872
17642 269108 165693 155976 -165080 54762 221570 278088 -343768 255730 229802 -7772 3181
17630 297487 82843 -142891 -178374 -12229 239462 69950 79151 110386 212556 261011 -93712
17618 195264 -197528 -194073 162740 86709 199274 -269916 -183904 283029 -155428 144199
17607 -77079 103856 446088 127837 282967 341038 154587 578735 61377 -148517 262697
17596 409020 6562 387332 366886 148265 95249 -42692 440641 106322 50006 -127153 250215
17584 105882 237168 -177406 184186 96403 -41118 191261 223350 118574 235378 -107323
17573 -137021 137661 61170 241242 -140174 260610 318851 -90895 -112790 -256996 71564
17562 64670 33306 156186 129312 79542 69560 385249 135006 120242 132229 182049 67628
17550 293300 -239542 335193 127108 -43506 450221 193863 -165706 116648 30926 149013
17540 149013 -17854 279164 201089 -19583 464000 309912 202185 46679 108633 -130394
17529 5372 172776 154424 95187 -39184 394394 422643 268749 576682 674702 649078 493153
17518 493153 579292 500450 156775 251810 52082 608701 432732 -86060 86720 253703 290029
17507 290029 571734 598843 924035 306247 253851 254126 371469 241869 131278 -32596 146441
17495 248643 177608 27592 -33043 -40946 339447 299837 312397 224358 57090 182737 200194
17484 200194 371599 262095 201568 180064 344774 201051 334908 338978 89646 719988
17474 719988 -189077 285614 244572 216965 352285 249888 354777 13443 338380 -30912
17463 98041 350286 343986 218055 63116 -164299 138361 9828 267908 339389 213359 271003
17452 271003 -76714 591772 273603 415262 59460 424842 19325 201293 521769 246615
17441 73291 135024 554009 268557 230227 98654 306844 205401 77728 211808 235434 138831
17430 138831 590295 244942 194624 196021 283306 378974 324688 316534 106320 344975 351710
17419 351710 298112 361016 289549 202389 199999 489589 444 403964 43556 553554 172239
17407 424325 426517 202970 230284 46173 170671 232506 91592 492723 168278 105111 -86795
17395 -48546 236437 105344 319506 381627 242043 245558 68968 277034 290043 46207 -45361
17383 -15197 248764 61648 33668 65818 48483 163030 -238413 632222 88238 49853 209729
17372 209729 95195 41326 175728 84960 146946 94410 305087 399056 73693 15637 168728
17361 168728 -62905 175374 -53939 3049 374476 233377 163942 173596 173847 337228 106876
17349 409057 358167 358546 -49951 371137 356368 86536 -85698 302504 474521 409099 644772
17338 644772 262485 -18278 262278 34311 130060 298174 73949 409310 183363 154690
17328 154690 131259 39465 441117 93320 204438 323235 283210 208899 129999 255704 -214406
17316 171593 122078 46370 2502 505554 359803 210378 -48141 44489 215510 230394 -176103
17304 149224 260453 192114 188974 -48960 214867 346952 502931 133706 -20528 180887
17293 -25779 519680 243220 173557 84833 364183 66408 529954 237145 163038 467608
17283 467608 254977 241121 14034 226427 516591 139387 409527 286585 640606 163158
17272 386532 270283 164906 505881 442550 261696 520328 38093 202101 142455 380147
17262 380147 306366 137094 286097 152742 296386 224974 267197 360093 -3944 416012 457505
17251 457505 -47457 496859 374407 437042 164022 296097 125247 447434 114656 233408
17241 233408 381212 606268 280860 225661 264976 153942 -76451 143316 163954 197967
17231 197967 296301 426057 420228 528670 409619 340168 306572 273678 155448 299034 402802
17220 402802 42401 603103 365422 280200 362342 288690 -8384 322737 257770 446203 30632
17208 464262 495820 352497 189040 320217 382325 533284 401093 342476 238669 499120
17198 499120 223904 599442 300974 209181 422030 504326 223305 447808 425769 315117
17188 315117 332411 280564 245731 554023 387522 224918 412584 271541 785377 680684
17178 680684 268843 344902 220284 216917 556115 197606 357317 550042 375560 486014
17168 486014 221101 332831 432987 302061 394885 721562 764611 309719 612371 573634
17158 573634 432162 365983 88693 136150 362906 428012 314147 407272 383993 218913 366799
17147 366799 651802 522143 263840 700458 579222 509378 835314 451860 352166 672250
17137 672250 815641 798378 683860 306470 507539 337322 536228 486136 648641 712615
17127 712615 550936 547302 363108 624598 620726 393014 61303 797485 456743 303394
17117 303394 462284 543764 927549 530138 1001572 495922 474697 727524 437297 543669
17107 543669 524437 450794 503580 471122 756284 440506 704204 707041 731192 435596 836487
17096 836487 353749 574692 292957 451184 787033 475485 813040 618890 664754 910143
17086 910143 715689 790820 410852 600361 688410 730645 710582 940066 847062 538302
17076 538302 396768 1089785 553911 993639 836049 927329 867697 793428 863286 882559
17066 882559 458396 854922 804389 890087 500792 883323 844160 671777 1064180 786368
17056 786368 814408 769218 469088 911122 685610 784719 820651 898802 876662 760554 860579
17045 860579 795681 1049811 684136 1086081 797231 825057 834797 1059304 600875 876283
17035 876283 687718 926507 1003641 918663 900734 911452 1046398 914323 688012 861588
17025 861588 747884 972990 1382650 907773 1026238 887499 1046051 1027215 1043737 872600
17015 872600 1093452 1029782 1019972 923505 1086218 1297132 1534647 894310 1258315 1013761
17005 1013761 1151063 1173723 1421833 867683 1353961 1129635 1310273 1006616 1207339 1184513
16995 1184513 1240970 1390541 1199562 1285490 859648 1185573 1096196 1319558 985478 1286862
16985 1286862 1488548 1047907 995557 1366907 1551221 1206870 1613347 1362060 1563840 1251574
16975 1251574 1443914 1631251 1102155 1716479 1437122 1538542 1409743 1745972 1578073
16966 1578073 1496155 1540601 1580148 1762773 1498605 1695123 1856342 1776844 1802027 1732522
16956 1732522 1768136 1772894 1655539 1788795 1840045 1815936 1975295 1808987 1684102 1746973
16946 1746973 1950481 2370968 1699802 1937964 2008787 1961372 2057087 1976458 2225162 2323305
16936 2323305 1926107 2059026 2479420 2336299 2161920 2450820 2198083 2486592 2371729
16927 2371729 2388048 2544007 2376406 2381156 2470533 2338234 2516644 2361457 2629988 2446145
16917 2446145 2539936 2530442 3005547 2859268 2649784 2759938 3249867 2929991 2869616 3383334
16907 3383334 3165173 3056626 3144474 3491037 3053986 3310469 3232582 3321549 3382805 3446864
16897 3446864 3800691 3400413 3318829 3811441 3740102 3703841 3775241 3648430 3697880 4022688
16887 4022688 4184065 4177819 4054793 4018390 4599631 4159029 4139360 4439575 4696869 4462771
16877 4462771 4539674 4757036 4799345 4992431 4767579 4992168 5054336 5458043 5601914 5448812
16867 5448812 5459344 5450586 5768711 5635282 5983810 5441211 6127711 6074459 6622585 6506778
16857 6506778 6634115 6638118 6564436 6886462 6890739 7106856 7202319 7510005 7513085 7359857 7820830
16846 7820830 7979195 8139446 8276665 8206824 8692446 8633027 9086488 8976167 9237965 9284469
16836 9284469 9690482 9944993 10482444 10400030 10436931 10523964 10941907 10942053 11504503 11792823
16826 11792823 11561376 12202920 12228538 12799774 13073833 13104293 13687155 13862365 14418458 14624864
16816 14624864 14832989 15486192 15625951 16036880 16450167 17345154 17534923 17856131 18683692
16807 18683692 18641556 19120050 19701820 20082042 21099914 21742914 22067816 22602495 23254272
16798 23254272 24015379 24859620 25764277 26414048 27446618 27716070 28645724 29206705 30194365
16789 30194365 31233796 32295997 33017165 34443615 35373127 36466933 37581765 38598225
16781 38598225 39957578 41372328 42469553 44200167 45627641 46675172 48356037 50037985
16773 50037985 51696917 53679798 55247654 57095989 58858967 60821040 62719758 64661226
16765 64661226 66459421 68582328 70897002 72978779 75007957 76913335 79271632 81375679
16757 81375679 83429064 85556409 88151360 89607488 91472153 93704628 95477253 96883867
16749 96883867 98317320 99821329 101158111 102002641 102938784 103731115 104218490 104686267 104644361
16740 104644361 104442180 104309085 103799308 103235388 102197349 101294326 100113101 98725346 96843843
16731 96843843 95742351 93923140 92055194 90217983 88292648 86532256 84327208 82040035
16723 82040035 80147679 77911801 75787755 73603033 71724459 69684255 67726295 65581897
16715 65581897 63771459 61803897 59870367 58214749 56622526 54919446 53295991 51976862
16707 51976862 50194956 48394326 47129612 45889703 44661226 42994171 41671445 40716652
16699 40716652 39515549 38445227 37348917 36211613 35359524 34507820 33226274 32383169
16691 32383169 31562593 31040497 29929135 29124257 28543291 27633531 26721685 26480367 25546752
16682 25546752 25009522 24459024 23348104 23097023 22203551 22100541 21483665 20854308 20468649
16673 20468649 20229992 19344483 19356127 18673836 18467476 17996545 17514497 17210835 16849757
16664 16849757 16364480 16189434 15754933 15615567 15261599 14652679 14878225 14236523 14147973
16655 14147973 13580484 13553761 13242676 13178627 12415411 12740220 11924592 11797367 12249282 11635352
16645 11635352 11496429 11252976 10788118 10858702 10638572 10379247 10226509 10453246 10035703
16636 10035703 9866566 9587298 9427865 9735953 9202128 8890744 8807600 8904098 8711692 8676392
16626 8676392 8286939 8150594 8114416 8188911 7913717 7979035 7695439 7833090 7459204 7252355
16616 7252355 7358684 7036855 7103660 6954032 6610828 6470899 6674607 6724325 6461880 6487880
16606 6487880 6318974 6222349 6165329 6081413 5987243 6152026 5732271 6205237 5824134 5680665
16596 5680665 5751463 5778552 5474911 5258695 5546815 5088968 5170536 4976945 5234116 5239521
16586 5239521 4898806 5101774 5084069 4912387 5063312 4931370 4742032 4792888 4918831 4629291
16576 4629291 4595177 4860726 4646965 4587873 4345124 4359709 4234075 3912005 4349871 4209618
16566 4209618 4520773 4060720 4370705 4003896 4132121 3868122 4173242 3773023 3867251 3862641
16556 3862641 3899964 3931590 3751565 3972622 3559949 3764823 3942716 3391279 3725334 3850451
16546 3850451 3407337 3750555 3495087 3423906 3570589 3547681 3545725 3497878 3182795 3171277
16536 3171277 3187138 3251651 3487364 3112071 3163044 3375572 3201769 3139664 3167307 3151056
16526 3151056 3221756 2977102 3141322 3103541 2978587 3190599 2834540 3055092 3094524 2869082
16516 2869082 2946283 3062560 2677071 3064153 2817301 2979887 2878700 2637349 3082642 2907072
16506 2907072 2893083 2839818 2860577 2460210 2589022 2577539 2535868 2750145 2738597 2787309 2791200
16495 2791200 2584661 2476728 3011103 2524346 2661842 2483470 2778386 2206153 2484900
16486 2484900 2916637 2478751 2367285 2693174 2372438 2476646 2329488 2508919 2476527 2263060
16476 2263060 2599354 2143118 2374578 2408673 2285749 2093190 2643983 2434549 2312485 2306737
16466 2306737 2594225 2185606 2219444 2511011 2214931 2227051 2559767 2222346 2312011 2457962
16456 2457962 2289852 2429827 2369597 2054260 2058005 1991935 2460243 2245248 2230681 2297043
16446 2297043 2444876 2052434 2131161 2316104 2289452 2067073 2258247 2165761 2122985 2288446
16436 2288446 2280055 2398747 2177976 2141258 2027963 1914717 2016419 2274860 1919190 2098135
16426 2098135 2023129 2214530 2355310 2500235 2159283 1767285 2070324 2307562 1868455 1977915
16416 1977915 2159296 2128646 2347347 2169289 2177878 2273517 1981101 2339411 2107173 1808472
16406 1808472 2177366 2050193 2022704 1996534 1951402 1870098 2102165 2148178 1905719 1831417
16396 1831417 2596501 1977420 1905088 2124871 2089646 2247492 2016444 1822880 1731497 2317569
16386 2317569 1863270 2207812 2177984 1994963 1722341 2089626 2082208 1874187 1915133 1993764
16376 1993764 2101967 2080827 2091010 1865722 1911900 1924109 1776402 1633779 2069451 1679360
16366 1679360 1732462 1789177 1929733 1765459 2020463 1948243 1884416 2076160 2096377 2194979
16356 2194979 1778399 1869812 1874484 1838115 2072380 1695857 1789616 1739934 1992586 1946502 1957620
16345 1957620 1566727 2054434 1800731 1508438 1671627 2157300 2147102 1415067 2082564 1989731
16335 1989731 1831287 1687011 1797179 1666434 1694545 1698295 1496194 1826617 1427908 1948822
16325 1948822 1566061 1672454 1597684 1629634 1796745 1725406 1788378 1753090 1442346 1446939 1843454
16314 1843454 1461158 1971733 1641897 1659497 1894599 1814781 1630874 1641587 1901990 1862894
16304 1862894 1996060 1375718 1659282 1906734 1673052 1694877 1639225 2080640 1755538 1504148
16294 1504148 1424758 1203079 1615224 1656374 1562274 1237690 1833598 1425231 1564132 1524779
16284 1524779 1710918 1475624 1612405 1948359 1463886 1609745 1544577 1580057 1645145 1566289
16274 1566289 1426462 1518099 1805210 1504872 1667035 1568641 1519402 1539539 1118672 1600315
16264 1600315 1518044 1773331 1477962 1491606 1431066 1531791 1716541 1725087 1542111 1607673
16254 1607673 1420203 1400145 1227334 1566574 1480171 1283173 1610257 1512805 1806086 1327350
16244 1327350 1608838 1231332 1453673 1311738 1265955 1259910 1334890 1412113 1011189 1254851
16234 1254851 1357973 1584368 1113382 1335751 1267751 1336334 1351020 965756 1295075 998726
16224 998726 1217475 1106646 1417648 1196955 995030 1260045 1324275 1044110 1217788 1237006
16214 1237006 1379857 1178621 1128172 1075674 1084979 670487 1500724 1330564 1220968 961944
16204 961944 1342531 776852 1103994 1012655 867997 852721 1115139 795808 1268106 825351
16194 825351 1268462 1009852 810159 996575 1138332 799188 862856 927742 1119005 744142
16184 744142 836079 1121891 894444 1174722 1017544 1201103 912139 989680 1340036 839509
16174 839509 1028809 983930 945825 1009358 701980 1000116 549993 597836 822264 654740
16164 654740 753904 744553 944415 690318 554006 558266 895123 903484 843650 1122687 928495
16153 928495 599484 677238 593090 555564 888578 705091 635976 416595 642872 524074
16143 524074 607048 647197 728114 727811 671080 512769 379145 775157 618695 615096 668880
16132 668880 645529 322781 471230 466755 845383 356069 916260 719128 752999 533781
16122 533781 789075 658192 785661 468782 599465 636869 499997 481951 491163 722489
16112 722489 557550 335074 113327 622764 330708 617703 884826 570007 602073 518260
16102 518260 495316 521181 371124 513073 438039 577364 417625 374692 171613 411860
16092 411860 662106 438948 228020 569820 462905 354873 383832 220906 602939 496709
16082 496709 206068 51982 550088 592127 625869 380071 617936 432088 362860 333479
16072 333479 632647 366405 89169 314054 419801 203937 -104525 472589 778602 264003
16061 265205 200698 217021 470562 362169 472798 531402 324465 57990 247003 298958
16051 298958 416334 223615 513875 62497 585652 166146 -46040 273520 293624 340406
16041 340406 186748 228062 82284 81391 246195 136710 265158 59637 112732 95932 99774
16030 99774 394618 341130 25968 96588 314677 190865 109303 -4895 -28015 212276 131173
16019 131173 327067 109564 415788 547160 230977 181681 197013 -64014 330546 134776
16008 -185545 215381 10085 349214 237169 -260273 570786 89484 160837 715524 221517
15997 143183 214372 302551 133725 50495 72890 271624 210581 516703 114223 564968
15987 564968 826263 987078 939378 590950 612943 373456 217199 605371 -5276 -128150
15977 -128150 178733 146162 -88795 200321 -116771 210821 -67113 139827 177304 248256
15967 248256 -22194 -205565 -57307 -37463 -98633 41158 -83392 -80948 64527 95522 44800
15955 246681 207686 -94792 -24932 497307 154195 84533 359009 125996 -160686 186752
15944 112769 179882 -468845 336635 -105328 12691 233120 78373 24936 83431 -30298 100100
15932 -97077 140404 -206340 -141366 86185 342573 237839 270205 242234 -49054 67675 126914
15921 126914 16104 645590 181110 -138110 -16337 177788 23706 -114906 125969 56596
15910 244682 83883 195566 -255643 321517 -31438 -239140 92895 -205808 189569 203922
15900 203922 -55529 -106001 6566 92713 464147 -77006 -46905 372290 65441 113236 119304
15889 119304 128618 24108 165989 173205 260585 -8117 203554 159124 25489 58257 145280 -89604
15876 -185664 -32769 125749 -223174 -213618 -186746 12852 -178895 -377963 226712 -56471 220642
15864 -169953 -332300 -143908 -201853 -62344 381628 63202 -139189 -417043 -126137 86274
15853 281845 -157439 255952 -153668 274662 51267 202624 -44325 95585 -352100 38425
15842 -232806 40082 -137657 117359 -83752 -95796 45342 -144321 164606 -96926 2097 43744
15831 43744 8490 148636 80959 -47959 -214458 290723 8866 -90526 -83454 4861 -285466 17881
15818 -33005 69049 -186132 -138382 5769 -17244 -215156 -50495 47239 -77689 -525168 -119313
15806 38091 268694 -30121 107600 -31272 -181547 168982 457895 -90676 -234987 -188079
15796 -188079 -224886 167065 -81329 224060 61030 17375 414575 -61481 205100 -17263 81493
15784 -84491 -83565 -48051 119167 -156331 180932 -288730 142071 -103372 33191 -157210 12879
15772 -68453 21758 -400014 91631 -143277 -1418 68849 196365 134226 -147016 -184979 -45920
15760 -194968 84534 145125 271154 -15855 4322 2436 -304259 -131938 -255450 228750 -139027
15748 353210 247001 44253 -16572 253057 -71555 -194126 -43813 -129307 -2362 -366415 167901
15736 -140058 -46051 -99344 -166904 -304463 -23455 153607 186231 -323471 -170825 -182147 -122640
15725 -122640 51005 -338742 166246 1335 176727 -11010 161991 -1663 -1341 208543 -368016
15713 19543 -99466 -113392 -81790 252962 219348 366174 -43860 43527 28786 102294 -4284
15701 44853 -38225 135862 19715 -176635 -198831 39359 -190827 260093 3603 224670 -70369
15689 -126066 -135447 -244698 -267151 102391 -147357 -148895 -57638 -274886 154803 223809 -64089
15677 -119364 308796 -36444 -177703 17449 315172 47532 49686 192812 65984 47952 162311
15666 162311 -172032 -250052 -141730 21276 141123 -104820 13664 90330 -324892 -38748
15655 239290 81726 -124086 106489 197435 -81872 180689 -64640 -84113 94780 70274 -236048
15643 -38272 -276431 -158410 -263212 78466 179595 -187406 51254 -125132 -107491 -13036
15632 -36686 76711 231552 -205663 163152 346 136924 170753 -56258 -113891 49317 -146804
15620 -63010 -275518 -143937 -39573 214675 63218 -344539 -26365 71809 -62426 -93234 -198964
15609 -198964 -340338 121438 -69888 274879 -213053 -45195 26610 104437 194475 -224508
15598 29737 -173943 18359 12313 -79874 -218537 54231 43260 -124423 -55441 110068 -80305
15586 73774 7176 105084 -352220 64245 -405167 -299713 317884 244236 -259711 -79382 -39368
15574 46697 -163951 -412371 -71254 -253502 -179371 130281 -105160 218504 29414 62215
15564 62215 124144 -289137 207953 -77481 99531 -185807 -234349 44264 -7834 274784 371997
15553 371997 -179741 -213297 75131 -58390 24873 83055 305465 23217 -150145 -40478 107213
15541 -26206 -305854 -56080 114369 213763 -145548 113408 -133972 244336 133337 256398
15531 256398 -227435 266548 -153035 52129 -86936 -83696 137980 236003 -137887 37355 250675
15520 250675 15276 -127527 38434 -43548 -137856 395256 -5569 170010 63074 -390157 -62819
15508 -189167 -262468 77814 99391 -32103 -7719 94121 -105491 121665 -14794 305910 -160889
15496 -131469 -84505 -50429 -193245 174730 -459695 -53354 116908 -146663 -44036 -11631
15485 -275017 -14443 -44561 -165889 -13101 62414 43905 102776 554574 119323 62362 458038
15474 458038 426194 677457 277150 253154 -92717 -182153 43536 -62467 224269 -243823 160643
15462 105735 -210430 -290487 86887 -60090 52275 129792 -217914 191610 42224 79093 -431937
15450 221427 -247037 94358 158606 -30415 393947 204936 474988 619706 612758 226914
15439 168213 -17222 104784 142195 48841 100832 34653 10561 191862 -122407 -68517 -203083
15428 -203083 -416764 175045 -106756 174998 -27761 171691 42685 -2890 7999 -87633 -185193
15417 -185193 -94306 307804 46729 -10555 -19979 104656 143338 294488 -374348 -123571 -161277
15406 -161277 193437 299302 77188 -13445 77474 92232 -36749 15802 50491 -129159 27408
15394 -79336 -49744 -53185 129140 111521 67722 -294872 -17436 -73603 -378854 16695 34818
15383 34818 43662 209529 454245 -142735 -237295 251121 127694 96872 -26600 -170211 92131
15371 609559 29317 132813 355635 137732 246623 233619 238211 -282812 2465 250231 -50869
15359 30290 251479 -184701 39016 -74538 -92962 404534 103664 129666 -71415 121632 -77655
15347 455474 229946 -107433 152992 46811 161972 108106 251170 151781 213117 246080
15337 246080 220218 419334 175480 217839 -162815 -10962 150796 43294 178912 121037
15327 121037 64640 -102154 163544 -36712 136823 66151 76975 239964 37550 135491 -40137
15315 -45683 -99597 391944 278389 -7017 -46128 171733 -12678 55091 416347 -136346 -431438
15304 -431438 -60640 -96159 449535 -82417 -200520 10233 98843 116394 -131718 153351 89762
15293 89762 151015 -85548 -97050 -73964 -10934 118486 61047 137355 -9349 72892 93886 52706
15281 52706 64874 276656 60569 323713 197122 -66838 8258 -347648 -126856 19626 38500
15270 38500 -9482 17031 -174604 334586 -30137 -22942 277456 -270458 -101121 -49859 108462
15258 -89748 -48031 1713 235319 157814 -176137 -78273 76178 -224347 288873 497145 -35357
15246 54525 -175439 -227156 242377 134475 -12425 -26227 198806 -70442 149994 40032 35970
15235 35970 61742 179100 171083 -138306 128949 -320490 85703 -189534 -104077 -18665 50286
15223 133139 101178 -26384 -27580 119107 134151 304254 -90370 248555 39841 -372652 -164557
15211 368306 98652 -47815 12983 -28381 -30010 334381 6106 292190 155738 26160 108820
15200 108820 114084 62862 -51633 -21397 -75331 7398 416377 91800 59038 224803 -45498
15188 -72546 158900 47976 32118 -168924 201018 -189550 110244 154551 -162957 -2640 111639
15176 -7040 52191 -207644 240161 -231581 86218 -175513 -1573 11325 182562 -90670 -83833
15165 -83833 10946 -194600 -72254 126315 71121 184469 215949 -259936 -40026 212526 157811
15154 157811 285441 205064 104608 90316 276279 284604 -253121 80066 324027 64826 114717
15143 114717 211850 225209 218735 -353144 -35018 -2235 471087 227072 -95077 -69778 76012
15131 63881 -152725 188546 94850 243646 454061 89676 272810 102233 97669 154138 503293
15120 503293 151867 2991 413162 325401 172250 -33895 226602 79337 -15617 -337161 93577
15108 302245 85150 24990 220927 120761 342869 280813 152133 42947 55432 29057 91141
15097 91141 -95786 361470 187546 76832 59059 137935 449863 302555 352913 311413 261054
15086 261054 325895 60914 200939 232252 161373 143303 65384 89456 -102645 325304 200389
15075 200389 285271 123205 253636 -8179 -71008 3698 388761 223860 102903 172368 279051
15064 279051 -1718 -3202 5960 75218 277499 249262 233879 457485 283699 197833 156331
15053 156331 289183 347216 -581 172840 274841 200864 245947 396941 427883 183751 264480
15042 264480 270389 216893 417819 387727 -287678 569727 338458 70006 431993 348024 99893
15030 419010 187396 198777 279275 546088 488900 440284 345532 269897 283993 443792 111447
15018 395879 559697 342560 293709 629210 16207 591557 305725 112777 161215 297241
15008 297241 -61492 338974 141154 440382 510408 361559 136098 188383 75075 272634
14998 272634 136851 168169 -122411 392881 416732 169771 106106 485610 304753 91733
14987 -88266 362419 294776 191125 214163 453720 263510 62992 266102 376439 502101
14977 502101 373022 252992 972663 517335 -114588 292237 399187 473454 472797 511791
14967 511791 575888 542485 -12676 376051 -55771 502721 384100 460861 382750 366953 113647
14955 -19414 396026 246672 357856 168574 269111 159410 457029 491976 196617 274364
14945 274364 535938 730828 473567 601372 318715 382780 167983 334658 524246 103907
14934 334082 727190 409419 334512 395265 1087056 1022004 816640 720451 415826 909188
14924 909188 872231 1020346 791056 1184093 822218 1198812 1388856 1273526 934816 824121
14914 824121 1144905 861275 929353 554836 201189 244603 448070 410681 382222 473940
14904 473940 291989 235707 569016 217408 476655 281968 209699 232905 625088 203027
14893 228808 354565 403135 229590 335927 178443 494079 603017 868207 260918 801597
14883 801597 617507 699718 460845 220992 508903 577237 353135 387246 783128 512035
14873 512035 492834 648859 473978 313401 525925 494900 495653 615109 327771 251879 518113
14862 518113 667235 578390 708161 208696 365018 549181 282398 319045 450531 311097
14852 311097 503033 344318 254741 221031 856214 306638 775686 780468 398605 463421
14842 463421 512161 658938 790714 736440 982644 809196 996048 546515 685526 343793
14832 343793 702553 218529 423334 388135 232675 688729 481155 256466 586866 741865
14822 741865 389060 447720 513181 665581 392535 587650 469063 640456 287491 423524
14812 423524 566874 375811 577751 443410 697847 723023 648145 570058 639920 806468
14802 806468 682917 1069079 753698 739300 664899 557887 811765 500231 582670 691947
14792 691947 529857 583968 374463 352865 275541 725003 280585 814131 701607 631387
14782 631387 768554 457389 300621 761149 739199 635087 790853 692578 570502 687331
14772 687331 886455 753814 633955 343587 508222 780590 830163 1028368 768632 979960
14762 979960 531959 545358 542223 723514 393436 454501 491132 692148 528110 702331
14752 702331 866931 601605 20270 570940 977162 617747 468116 781708 749035 713975
14742 713975 637547 517265 846923 593894 387874 498856 684625 705095 712740 560228
14732 560228 541496 601299 823573 1009646 884840 866931 415922 964426 849460 1350070
14722 1350070 1075713 1205834 1050098 1317566 1333145 1013147 1229436 937413 1028152 878298
14712 878298 853303 1130917 930396 496640 819942 664054 817529 759327 903423 1227735
14702 1227735 1166692 772915 1017182 1600602 1139135 1307824 995367 1390407 1283130 1178348
14692 1178348 741743 1186777 1211822 891796 1019437 981222 1094236 972210 900075 1037949
14682 1037949 970465 806162 1193288 1017095 738649 1246942 830079 1237793 854393 1046870
14672 1046870 882976 1060477 1040731 1040874 922806 662099 884232 1021188 943430 1320395
14662 1320395 1234758 788440 949067 1254344 1019091 1307927 789782 1125327 941824 1090098
14652 1090098 962319 1190702 1183819 1181441 993539 1314085 1331244 1245651 1248303 1281823 1146432
14641 1146432 1397921 1155494 1494558 1095011 1453788 1195426 1492386 1190054 933688
14632 933688 1097340 1406985 1432839 1399073 1067461 1265525 1096301 1032436 1239986 1579760
14622 1579760 1559333 1120173 1337178 1446452 1362085 1409967 1340314 1534288 1423422 1638767
14612 1638767 1702779 1627147 1581591 1749856 1399527 1469264 1654563 1643902 1601435 1665122 1471112
14601 1471112 1686096 1424799 1722741 1725552 1838473 1814685 1799847 1724216 1619970 1898065
14591 1898065 1646629 1753394 1769703 1545545 1711514 1824238 1884363 1855341 1724809 1648495
14581 1648495 1851773 2244109 2208651 2194573 2139839 2062557 2111672 2137447 1996113 2437804
14571 2437804 2418632 2244521 2402014 2286818 2495262 2439501 2298624 2457236 2572493 2763415
14561 2763415 2926110 2579209 2864130 2815913 3219238 3495825 3664298 3722702 4406723 4875786
14551 4875786 5778749 7355556 9912564 13564659 20182982 27929106 29476405 19732925
14543 19732925 10036290 5726165 3861887 2966486 2516085 2426450 2044203 2207700 2115264
14534 2115264 2342970 2228254 2367862 2171627 2342644 2172820 2258109 2259213 2390212 2349073
14524 2349073 2544738 2426549 2529594 2408945 2327876 2595464 2609958 2404981 2590640 2644635
14514 2644635 2575934 2827131 2681593 2815796 2806489 2728737 2950854 2720034 3275570 3238583
14504 3238583 3067532 3036018 3190537 3083778 3285429 3519580 3221531 3213623 3432600 3297655
14494 3297655 3488502 3450161 3386695 3713403 3542833 3316547 3699694 3739566 3691030 3813304
14484 3813304 3506360 3759244 3671375 3836696 3899150 3948197 4119196 4047805 4248454 4199034
14474 4199034 4341734 4195191 4415685 4378600 4298626 4421609 4674558 4551442 4587772 4268362
14464 4268362 4668899 4655035 4794772 4543591 5181492 4862165 4896743 5110069 5099669 4901282
14454 4901282 5003998 5266932 5194789 5499697 5279390 5705694 5460319 5343290 5760221 5732198
14444 5732198 6007964 6028979 6239265 6208999 6092635 6161092 6079457 6552181 6540419 6451907
14434 6451907 6605605 6911993 6743115 6786268 7257745 7130005 7338281 7282716 7236814 7745867
14424 7745867 7935438 7777816 7813284 8239726 8058563 8215800 8836973 8379721 8905430 8990819
14414 8990819 9170112 8909782 9200505 9293635 9561357 9274324 9695271 9793683 9874913 10377956
14404 10377956 10281535 10472557 10882693 11010490 11197682 11143215 11348523 11668122 11565687 12022056
14394 12022056 11909095 12082718 12904110 12639251 12695169 13197180 13463107 13568377 14189479
14385 14189479 14261992 14369830 14683919 14702721 15265178 15480891 15860805 16176373 16438343 16784844
14375 16784844 17042379 17424739 17880449 18059849 18552971 18539106 19113527 19284904 19961980
14366 19961980 20190275 20458646 21288988 21800522 21937289 22482968 23038358 23461078 24273653
14357 24273653 24393340 24754121 25546205 26499861 26840300 27438640 28019633 28699020 29461059
14348 29461059 30355111 31008543 31883272 32794324 33563839 34447547 35253660 36355200 36887661
14339 36887661 38119248 39433041 40334304 41551552 42601287 44008777 45451870 46804013
14331 46804013 48172832 49708126 51326204 52515105 54368155 56119258 58062244 60252476
14323 60252476 61868649 64103715 65942974 68290588 70984019 73530945 76107485 79111534
14315 79111534 82032943 85136221 88608893 92241901 95590999 99390618 103675007 108037945
14307 108037945 112296406 117465539 122388802 127919378 133291006 139544270 145395841 152029986
14299 152029986 159186883 166038164 173729517 181572229 190081539 198996288 208505164 218393730
14291 218393730 229042034 239570158 250993430 262908221 274843277 287521955 300123303
14284 300123303 313539090 326943175 340399026 353743459 367248912 379574392 391992342
14277 391992342 403538095 414118574 422977972 429856045 433632906 434921649 435290495 435476687
14269 435476687 435576435 434063933 430583597 424583525 416062292 405028148 392559572 378947530
14261 378947530 364725502 349931151 335261638 320668387 306041605 291530175 277737574
14254 277737574 264381122 251644446 239542272 227474655 216734321 205901209 195482384
14247 195482384 186612626 177597171 169033541 161363754 153833219 146372829 140136302 133583232
14239 133583232 127594053 122440954 117306945 112132675 107517777 102782061 98610931 94770993
14231 94770993 91319975 87753455 84458320 80883073 78204024 74962036 72639841 70280641
14223 70280641 67569458 65235022 62735934 60706271 58950771 56652396 54998909 53139590
14215 53139590 51472517 50444670 48810127 47142620 45647431 44350768 43157471 42024677
14207 42024677 40773791 39738979 38652094 37448089 36256515 35431324 34505588 33710999
14199 33710999 33024932 32327831 31101847 29975725 29587614 29005825 28149043 27457513 26921473
14190 26921473 26176548 25542052 24771334 24156136 24011526 23047349 22521851 22158456 21558788
14181 21558788 20982712 20876098 20334103 19806221 19393268 19095879 18564392 18455911 17937934
14172 17937934 17668062 17444254 16937896 16869046 16021515 16112482 15673594 15676564 15003679 14683056
14162 14683056 14829262 14511002 14229263 13678259 13442080 13273976 13265056 13012425 12564702 12644048
14152 12644048 12414407 11945297 11897638 11928451 11583807 11352644 11517100 10918100 10747463 10969825
14142 10969825 10799754 10240079 10152080 10160481 9956645 9978581 9866147 9350216 9203878 9189396
14132 9189396 9168285 9137941 8761793 8688787 8416672 8513537 8309060 8172827 8194682 8156462
14122 8156462 8002837 7726841 7872638 7799031 7382416 6851023 7502889 7432901 7013663 7384378
14112 7384378 7082813 6969016 6963541 6499700 6750557 6254128 6759829 6328048 6207135 6068230
14102 6068230 6030306 6221118 5899909 6011963 5999897 5746222 5566627 5853397 5591388 5555734
14092 5555734 5436268 5291760 5369477 5296244 5572929 5183115 5168255 4773320 4774560 5208858
14082 5208858 4888346 5285750 4586198 4745740 4804367 4647908 4596253 4495724 4558836 4254728
14072 4254728 4504745 4332276 4234551 4087516 4446384 3926890 4001835 4114320 3909566 4094835
14062 4094835 4428956 3817142 3964978 3905013 3542768 3913434 3849845 3381736 3456803 3588643
14052 3588643 3675796 3810534 3764099 3372255 3286957 3490583 3307142 3316146 2970716 3373295
14042 3373295 3286624 3151878 3292115 2887674 3171636 3031205 2856312 3133333 3205944 2989647
14032 2989647 3100815 2879830 3187613 2836122 2965973 2913138 2803980 3157997 2521457 2870982
14022 2870982 2755782 2790335 2565869 2703214 2780770 2371908 2649481 2654970 2510114 2204274
14012 2204274 2597220 2502692 2399833 2556267 2582866 2749696 2443857 2511626 2363773 2289013
14002 2289013 2675304 2546066 2803168 2313266 2285089 2657786 2352974 2589832 2140699 2687883
13992 2687883 3086270 3565916 4109592 5984483 8722269 14577718 23455572 30148990 25286081
13983 25286081 15868634 9619729 6575654 5203609 4184283 3683132 3479420 3240489
13975 3240489 3039580 3016809 2736211 2595189 2498530 2649083 2494446 2396624 2271363 2157084
13965 2157084 2183594 1953388 2324021 2262336 2203509 2102661 2256436 2143253 1990663 2080795
13955 2080795 2150352 1957489 2035280 1777011 1995943 1965137 1728949 1999346 2048471 1711193
13945 1711193 1681273 1441230 1572646 1464310 1574910 1909259 1759011 1589409 1548362 1735077
13935 1735077 1996442 1531255 1792549 1548133 1750300 1584696 1430629 1536984 1711751
13926 1711751 1710320 1690513 1557795 1398182 1913182 1536443 1680699 1316890 1544085 1644265
13916 1644265 1518926 1180332 1477238 1563529 1300455 1766891 1328492 1354416 1611866 1273806
13906 1273806 1416394 1514470 1294580 1648975 1304022 1101831 1188763 1576701 1162270 1461372
13896 1461372 1172549 1416036 1309553 996508 1294940 1096891 1298094 1284100 1194792 1194862
13886 1194862 1390596 1061956 1281843 1179335 1178051 1172757 1232553 1121116 1155513 1235969 1162024
13875 1162024 1056169 1203280 1179456 979527 1132220 1247286 1010505 1191871 738693 1054086
13865 1054086 990391 941309 1069155 1020390 955503 1152542 1278747 1030777 1111459 958641
13855 958641 1175065 999604 1142115 867856 864090 821798 1070163 942259 1131261 1126674
13845 1126674 1100930 1112279 768126 856457 1114412 729131 1051116 1209572 828426 1055738
13835 1055738 800145 939894 1072959 977143 1136514 915540 949131 937239 982216 1076436
13825 1076436 1136145 792045 996107 1028883 953529 779964 1134680 897425 864688 1034817
13815 1034817 838062 828999 710825 740267 873564 844307 940175 643860 942054 635570
13805 635570 926871 936240 759349 687392 854657 553040 879531 663031 727006 940481
13795 940481 881175 680595 557366 783480 661366 601438 649813 820243 754938 772733
13785 772733 741666 955399 592182 759046 621584 840190 814957 834956 883627 651823
13775 651823 673865 274047 604021 576261 803648 914191 883526 604711 967535 690419
13765 690419 491445 812257 658700 670848 566947 548949 655142 541529 940497 477226
13755 477226 521006 691252 445151 884926 649066 400529 328929 547053 640044 970926
13745 970926 634654 947697 508453 607921 925407 593139 606376 511571 694246 813993
13735 813993 410912 747675 644547 590518 543272 592895 896681 639442 510319 879948
13725 879948 569769 361941 680744 533828 542377 764179 424829 635822 486887 436853
13715 436853 339329 537327 648918 446632 363074 598973 595309 745630 500818 653323
13705 653323 171412 726827 635016 294603 110466 679806 532790 690671 732243 383365
13695 383365 637895 643570 863960 382633 258381 530066 459945 741852 386184 436568
13685 436568 237417 324160 651433 516396 131178 272299 708419 275680 462936 693215
13675 693215 203197 194221 461438 203055 615075 411687 706810 226161 498279 673142
13665 673142 440925 353325 309228 117775 558194 332179 416697 367440 304223 237386 345966
13654 345966 232648 455538 392314 664728 227195 499320 428083 159427 739241 142798
13643 303415 543364 387355 357354 788107 381062 483426 391602 871729 -3219 267042
13632 480785 405842 373923 288311 435297 224016 573827 426157 262325 557493 245755
13621 535011 365300 326795 -3573 291993 176288 671832 489562 497377 376618 154862
13610 398073 483359 497125 427162 144206 426412 201230 328610 525842 569178 507049
13600 507049 382105 475837 315917 399698 595643 205328 106843 210025 149811 323663
13590 323663 457613 289419 403115 -7221 280880 270686 395576 102211 747582 358917
13579 420315 274566 252282 538773 270175 141296 577379 164146 529325 559041 581964
13569 581964 391240 247553 374636 127191 489349 546431 115773 416610 361271 446634
13559 446634 356532 306510 323126 248414 408506 185047 138875 673029 133964 618366
13549 618366 418367 170816 310583 497536 641780 64940 545813 363579 140472 349955
13539 349955 259072 238286 317172 370648 120181 227273 272892 310251 580235 -58948 197059
13527 480321 405613 352589 399804 495535 253269 161682 246767 174871 351609 466467 155501
13515 363180 -3235 318080 165908 308476 514814 89333 216534 44793 201468 273042
13505 273042 192327 623338 -95015 585710 217913 308470 354648 396958 67767 361549 65965
13493 126217 323827 80414 131008 -170367 503405 -6941 414894 372157 159763 120083 457765
13482 457765 -34649 320430 77820 101316 -91784 183128 121871 228668 604130 197999
13471 59218 40849 56694 523183 65913 -18859 252960 11319 456519 229306 158463 207552
13460 207552 127625 348139 271420 -71918 137883 92317 117010 -199900 352978 -49984 321385
13448 65070 570695 493428 343807 -31766 118514 247032 281278 265088 417001 301405
13438 301405 394352 -195407 197393 126249 376267 264819 390773 32176 434587 243181
13428 243181 133161 204452 309566 379995 291858 210374 102541 -153965 355575 236166
13418 236166 69041 -128752 90786 198291 259734 -37953 203181 356433 181653 23490
13407 86176 11137 22280 244457 41368 246956 436925 355928 214501 272382 68646 482666
13396 482666 188269 200153 65741 22671 68458 136226 223928 460483 241374 138590 18376
13384 -18959 389931 69952 329732 406850 359119 277330 380385 356026 153917 264875 428113
13373 428113 43642 -81817 -34678 545871 86796 119660 482800 246647 281678 218819 136877
13362 136877 205985 206191 -51364 206325 228427 155697 121630 277507 248380 282904 16497
13350 132608 83400 183757 -569 217515 200807 -71994 404178 328643 367714 -151625 318584
13338 -66120 108480 264151 168673 13539 259252 -247409 558870 -21601 41128 356043
13328 356043 155012 261531 -211357 394711 288919 336019 206827 156320 4350 -97604
13317 592656 242477 215645 209576 239720 131742 19100 209773 301227 48180 -18552 240483
13305 84518 206115 -19210 110308 237409 216953 34733 87700 79016 220227 32545 328241
13294 328241 -12805 84629 159948 344100 244432 -48533 339723 159244 263216 9190 -106217
13282 110205 391883 233009 167320 299499 27732 -278800 148846 9251 191976 328610
13272 328610 24742 88028 106917 52334 440248 11962 77168 409738 145430 124807 142225
13261 142225 271117 166534 -50449 -65671 533717 262515 490954 30274 46203 257039
13251 257039 201876 44584 100511 33694 -56549 109887 -12707 316810 -17304 303477 217695
13240 217695 114948 295576 218491 262988 -79687 187016 62073 59889 -4854 31673 45593
13229 45593 319788 -128054 39633 -72072 206038 -70797 356969 164395 301713 132445
13218 -83069 443220 -160097 244234 130278 11615 372921 -156824 -260782 12100 263565
13208 263565 102566 47105 44234 244576 308797 117500 -17454 -37711 270780 -68266 -21206
13196 170154 -158110 184234 113355 112134 164006 323940 329653 49645 -119530 -65904 229005
13184 128300 -127340 231115 -21454 241537 78625 63519 -124164 -228094 -65656 -101031
13174 -101031 -228014 248983 382363 197630 87459 -71635 -255295 19400 295040 34068
13163 -290621 -59532 -28699 -254624 169995 323521 -144245 150181 -280877 195637 80766
13152 94633 67334 -227921 142074 102981 41848 473006 -56126 -238309 64177 256298 265619
13141 265619 -181613 -125108 -25764 178457 160353 435124 165976 19167 -7014 411381 -64369
13129 -39330 253484 163767 -231548 100942 339826 -48927 135795 304791 115454 -57564
13118 78704 -296285 35278 -294538 -147479 246079 -50749 77512 149037 104918 86828 -281663
13106 260113 157512 -246703 -19406 129174 54880 544910 28760 160281 4314 509585
13096 509585 -2396 -122661 -11555 124825 216539 352761 -46784 -63612 -491 145928 102428
13085 102428 -129244 -181176 -50798 270775 7633 -256667 329728 108065 -196022 -24760
13074 -124146 92397 172945 72466 407639 231772 52372 -179319 -67697 -220532 146637
13063 -106581 -266017 134028 -133568 -81372 74976 395849 27160 -133558 -317574 145669
13052 156868 390075 175672 628933 138507 52691 67615 362952 -53787 62807 -38001
13041 99639 259579 204190 44033 356529 6970 140020 38089 -67493 -3316 -347304 49260
13029 44016 68369 -19919 280342 48096 146878 -186722 140003 -248126 219773 -261297
13018 101745 105409 -206310 80034 11372 224054 -351086 -19310 -28272 340850 78938 -12599
13006 64135 98251 -225295 -663 168725 -62003 -152616 -98599 347286 307815 22933 372481
12995 372481 -39622 -30604 -148884 -122677 -99996 8020 -129233 84232 344291 94867 251414
12984 251414 -158354 71339 -19816 -21846 -149516 308015 172704 319551 220535 -78301 258494
12972 10356 50982 82673 233501 161986 115115 -233334 24007 -130391 -116647 -137109 12923
12960 42043 68495 56435 34771 65122 -176517 418858 -188640 -27879 -47389 58769 -14098
12948 -334579 216595 11141 -98773 -9166 82448 15726 227878 -58759 252650 -50350 -383311
12937 -383311 215819 -22667 -126268 256457 -192624 209975 118503 138095 344135 20424
12926 449731 -91953 110543 232905 263626 339141 157701 14681 42017 272393 62460 46755
12915 46755 140797 -175717 213733 -101805 -32312 102745 1375 34441 -92683 225897 202186
12904 202186 -130379 194604 15568 -153062 -222271 -18251 -272808 105324 109529 48298 199724
12893 199724 -34241 109881 17759 99396 62511 185614 4752 77564 11864 432105 -211092
12881 -39265 107117 -228181 24800 -215344 56615 -69344 151992 252550 -28816 123713
12870 175441 -238891 -91358 185138 245843 97729 309250 61734 47976 -122191 353590
12859 155104 139772 179279 16040 116769 135027 -139274 -161544 -11611 -94337 -108919 -238840
12848 -238840 -180107 -11041 -30015 241569 97624 -130531 276559 -242897 15941 -224637
12837 -233425 3574 -48761 -324198 -204152 42769 -26287 300104 -47244 -268567 203412 141552
12826 141552 82891 -32245 81189 139636 2175 12333 134109 191883 -300179 -239777 -154197
12815 -154197 -111083 527395 -23257 10201 48952 -286110 34747 -18977 -245398 173018 174943
12804 174943 -21786 -42931 375780 -82632 -226460 121020 26924 36580 -261373 -59324 65651
12792 56106 -48622 -135966 18676 7264 100386 -131238 -235416 23021 219337 -221831 -329520
12781 -329520 -212847 -304346 -235050 -236460 -284614 7856 16596 -31147 -198787 -12417 257217
12769 -92311 129103 402926 -251206 -293879 63901 -157353 29638 -150654 -92421 311274
12758 262191 -74477 -89285 -208589 -56436 123826 131950 -43605 -24676 -222515 290728 118702
12746 269649 -295953 229917 316480 117768 20629 111827 106632 -41202 197461 -51479 -98279
12735 -98279 16527 161371 348264 -90380 88972 4572 -52742 173250 146560 216492 -100416
12723 -66819 180324 171096 40374 -65123 14806 -9740 66097 -137949 108909 114517 150931 309488
12711 309488 66131 90650 190901 188439 -94616 21185 112790 -23302 -190530 -260933 14845
12699 150982 -93126 223875 242575 -91314 -49720 25158 26442 248934 219166 -231123 -44050
12687 71215 -156438 -161902 264831 334225 263672 417745 180176 14982 288473 472485 323328
12676 323328 6825 -290996 114820 -15441 -58448 -19494 461709 -265698 32627 181314 275219
12665 275219 -144942 -30575 278541 -6968 188289 116237 19329 609380 -67429 123165 141918
12654 141918 -30856 52104 -271950 24402 -110974 107145 -164748 124327 -264335 227258
12643 159610 -196775 17187 11533 -80253 83441 2977 98491 -54934 -81783 743 89969 23029
12630 267141 -3853 139587 149501 -23642 136561 -18932 -286766 93821 133766 -40613 356959
12618 293554 135905 -162137 231287 129790 -58879 3450 -150495 -60675 -120683 -34009 135410
12606 296917 -123107 -3693 188531 -130384 196283 -135224 308102 -167603 286286 -9234
12595 -7588 70921 222725 -816 -91947 158853 -45295 -91957 133599 127649 91159 202838 -326706
12582 -119539 144943 84974 19988 265835 410729 -5092 161061 -357916 -202608 62323
12571 23450 -208834 -200573 -262660 76844 -180841 -124910 -192264 183052 180861 -227544 -118194
12560 -118194 175547 -325840 124460 18326 -141908 19916 268190 243672 -315199 234215
12549 403774 -210083 200688 -83179 95028 -74178 -45916 269881 -401841 104566 -263577
12538 49683 -113613 -28611 284369 -36981 -165601 38151 4835 26301 -37000 55198 -250723
12526 -6967 28399 17119 51674 29946 8706 13398 201543 24405 -87711 -78106 -125984 151570
12513 -140710 80929 265646 -271553 63273 55824 195868 153530 -184040 61135 8211 140016
12502 140016 75613 -126724 156454 112953 121419 -730187 270741 -105139 -65954 -156239 -162874
12491 -162874 219101 -253724 127114 -87506 58455 222616 190055 -138632 -38078 -412198
12481 -412198 128425 -195135 -199136 73735 241609 33526 -239693 7970 68757 -7310 82535
12469 -62094 -238043 -232082 162767 124573 -131418 263810 -116993 180962 76647 270409
12459 270409 -74212 5550 -7330 -115360 -448 -219019 180989 203841 -322837 188598 115051
12448 115051 -326856 -25574 -223550 376928 -591628 189309 -8953 239878 135183 86231
12438 86231 -169858 64497 179438 -133896 -91830 -171665 -211156 -533273 -134819 80512 16969
12426 -3371 -161954 -45350 99236 13447 -295552 -302753 -206686 -325570 -52032 -232958 52272
12414 -28869 -49905 117155 -297871 -52153 -219012 89021 321426 -29216 -152085 14 19426
12403 19426 -147675 31408 188492 1571 139405 97646 -51782 339035 183165 -162310 -197879
12392 -197879 -101723 126857 -356121 122235 17749 -294869 290329 -222341 290957 180509
12382 180509 -16347 -61927 -353018 165432 396507 -143257 256858 -310080 89946 -110785
12371 -112565 -62134 -59004 -148807 139978 -193472 27948 -191320 -122247 111050 -23818 37208
12359 87107 -50656 278264 38949 -213262 3077 246813 27629 15655 -211171 152722 -2300
12347 133883 -93020 304814 64624 -106131 55651 283578 68293 -195405 223433 -132541
12336 189321 -81365 -230594 -190078 388931 -25641 -205116 95306 6832 -155943 296947 192093
12325 192093 600259 -124515 180942 -30545 286503 -147688 141812 425514 111874 -341330
12314 -85027 145074 31753 -237051 -105010 88090 -80453 362671 349545 90260 -8649 -159692
12303 -159692 -18572 -15155 159826 187208 -248044 358303 8656 36242 154331 -91867 -111004
12292 -111004 247747 -178513 228273 247726 90209 323055 -172352 97760 15998 -35353
12281 -27171 153940 -27763 -32956 -49870 -148509 256473 17077 64004 124971 -32001 442983
12269 47559 39357 32137 -301162 159899 102847 -34943 -175658 107880 -190498 -9454 -112559
12258 -112559 -54378 46491 -126544 221175 -302231 101204 -273206 41395 274317 -105443
12247 -109287 40603 -138798 81079 89116 -6939 281493 -87282 -93977 -24460 81778 96841 61301
12235 61301 46901 -19827 305850 315975 -115328 -104024 149822 -144932 2538 122554 238141
12224 238141 62416 53081 32859 175577 513988 371880 49880 51552 -41366 375077 203024
12213 203024 -103803 96140 15255 -2991 260493 -77565 129256 -222208 72227 171725 19936
12201 313816 -137314 198639 135101 324681 327885 239598 218211 232960 151016 158293 383926
12190 383926 126733 -132784 -296343 374473 99180 82621 22803 -115680 -31646 43496
12179 52264 190359 158379 46231 54549 80108 71970 86073 -15235 -5468 68198 -46791 7400
12166 146280 238887 319243 20077 152462 -59862 15393 74469 52821 -57888 137530 44891
12154 -16525 -48622 -100948 19835 22492 -43452 152288 -11052 152321 -154283 198524 -219392
12142 114830 73822 -25327 -166997 98335 169782 -26333 153115 23100 155256 -45358 -6288
12130 132868 250224 175478 245676 223462 4151 130849 -319163 132643 -65235 148068 58118
12118 -70861 -1917 262890 -140906 282870 -994 -58268 132454 74632 274191 -50605 226269
12106 116859 -213045 -313804 -336216 -179172 66227 -110170 -108770 -48008 62201 -101965 70046
12094 -120079 149746 123339 -47476 -62290 239350 -11087 130013 -39751 -21774 185305 72346
12082 -323976 -168557 152513 7666 111191 284882 -266864 -40597 510015 206519 -198646
12071 -76516 -73848 -213634 35411 -3169 266478 10907 25474 12692 -295970 -43517 358913
12059 202708 32192 -177063 -382709 -212254 174358 -172204 87799 -30298 -307728 -101878
12048 -73904 -21850 135854 -108153 56212 -321027 -255677 147250 24743 -270251 37053 -257712
12036 54907 -159179 187331 -180577 -223028 26535 95542 84803 -139633 -23486 76214 165348
12025 165348 18947 216543 -144745 67066 324175 62239 -122210 -143723 -142455 91546 -37167
12013 26239 -121421 159359 -179482 -227807 -18889 -52523 31621 189884 191973 12767 335952
12002 335952 -297926 -254314 -161354 94975 216644 248200 -2927 142657 260089 -284747 13398
11990 -131350 126126 -205579 -175954 -126644 -17798 237446 -110492 -85503 -103098 184558
11979 192291 57987 -5355 -264999 -50588 -208406 -23714 -336352 -27066 116878 -132487 39601
11967 73247 -288524 -252518 77164 -261573 -152681 -60922 -329275 87135 92215 -108552 -156336
11956 -156336 28153 -205028 -427120 -24752 -1063 -148614 -55808 -20549 -91466 -35269 -298369
11945 -298369 -113859 16792 223280 -411683 132105 18490 258335 -168486 -242437 -178087
11935 -178087 129594 -158012 -62665 44772 -253699 -134378 -59888 113713 -17538 -84830
11925 -84830 96244 -288131 129194 142505 -4510 -97075 -210770 -30539 59532 84366 -158227
11913 -187905 -368634 -239250 -100295 -454920 -125929 -37992 -90293 138820 -37458 -246845
11903 -246845 136219 -45570 -125854 204767 96314 17324 -408 -224603 -87205 59188 -28685
11891 -90032 162172 26472 145160 -153291 -85352 70539 -34782 -97279 -39524 -125080 -387510
11880 -387510 -94286 -152778 -255894 50675 -77099 -264712 -43691 48574 -211179 -95122 -25772
11868 88961 51514 210301 87291 39597 205494 -44607 20706 -161244 -181730 160782 -351281
11856 131644 -221838 10825 124413 85798 -119419 -41147 179611 157042 -199705 15442
11845 -301343 7685 -21196 351880 218772 52721 5463 -305860 98162 -275687 -40166 -223216
11834 -223216 204557 -179788 220264 59923 -39388 -35918 194578 -151002 -118522 128418
11823 -37974 23461 292793 -181101 10406 -154034 -268389 -51787 -300651 -359227 121452
11812 -35605 -106527 -37678 -95157 229723 -420218 107874 -89591 189866 -77062 17463 -173630
11800 -364858 -51144 -96526 -138020 -113649 -322774 -235961 7828 -22545 59711 -269468 147287
11788 -134801 -182952 -88468 -138866 -97763 -143347 133092 -8459 -110925 -175576 151583 -199404
11776 -204439 -9875 -121365 -221784 251678 -156725 90657 -58653 44366 197450 -32332 -248956
11765 -248956 92836 -3954 -73932 416365 153263 109277 -207606 169634 -166311 -80806 121450
11753 -29368 -245019 -254584 -314938 -357991 -2261 -86297 -31738 -35864 79941 14662 -32866 -9814
11740 11216 -17586 -94505 222904 26134 -135883 -49701 -122578 -23985 337768 -138464 288029
11728 247635 -347330 -232491 -58298 -140170 -374790 48681 -221462 -54737 41434 107646 19071
11716 184853 -90631 5881 152441 146726 -8652 183717 103547 51351 -62260 493185 -53597
11704 -119602 28326 181875 112334 -287779 33255 166064 92075 205731 54014 -217583
11693 -64184 88245 218577 55738 317357 -123543 -138806 71680 65105 16016 89523 100259
11682 100259 128355 -218368 -29704 -50126 144085 -143509 214307 363633 -104604 63691
11671 -255972 -121753 218506 91069 45573 -172003 -19508 -243903 264479 -165489 406604
11660 109976 -65024 -123366 -132388 46184 -51293 -142713 115438 151909 -77752 -66787 -280312
11649 -280312 -6826 21159 -157590 138957 127715 213885 35643 -97999 -179448 -133178 24047
11637 394642 21842 170224 -222300 -75675 -125603 77677 -125490 -69516 96758 -41201 108729
11625 80246 84495 4426 -238813 -329635 -131426 -16488 155694 -213826 71780 22617 14475
11614 14475 -2674 -388095 168613 83062 -162991 127181 213891 -181253 262006 28031 -115836
11602 -87888 -23080 -59081 -6216 121740 458155 -22777 166510 139060 -86607 -315165 -251296
11591 -251296 21462 268988 118610 -71364 -144116 204615 58224 -106304 173743 -103278
11580 18731 -202906 264797 114993 410122 -181741 248391 -246385 187236 -16709 61447
11569 -191650 -108268 -81012 -160196 204204 205919 -152791 -285281 172305 -57831 -12277 80680
11557 103457 96909 140755 229150 78676 87787 -81052 -109195 8337 -12660 -7177 -100044 -77674
11545 -77674 -157075 223485 225380 -50249 -237632 -39226 112190 158276 92723 -101600 118174
11533 -89406 -321441 310890 -86455 235910 142101 -323004 -203624 -289644 150070 180300
11523 180300 -42030 -157020 108851 140353 -194620 207329 -180375 348571 -97495 218021
11512 113439 -93962 -185885 257574 2237 121448 205323 -127246 258137 120473 -19565 -22384
11501 -22384 -91367 181461 -106020 -139983 85906 -108330 -157794 198745 -50761 5900 -37658
11489 -10278 30260 -79372 10625 42224 181316 -25264 224263 15862 -32549 149755 75054
11478 75054 75767 86052 -42823 51945 -79209 -139623 70161 299794 186101 203592 -2282 -44603
11466 -44603 -307344 185155 122353 319616 -27536 -63263 8396 -95792 38305 291629 -84122
11454 -110463 -152991 392481 88369 37945 396610 -223709 20631 38435 36242 275972 1708
11442 16063 19745 -11793 36653 381537 -37344 -87592 63390 119603 -21039 -8270 -179226 115756
11429 -138668 -121642 41994 143753 94414 -15077 -151557 -94289 148757 311697 323776 -33103
11417 -97861 -59101 -27867 77630 -248462 83313 60529 -174709 -141544 82979 4229 35567
11406 35567 137222 -13001 -102619 -97800 250797 285560 368714 19794 -249691 -162214 294321
11394 -115758 117585 364347 90452 102551 178798 -753 -66982 -33505 16326 -33715 -247775
11383 -247775 -226288 257732 -86479 -153493 22032 -107961 -226235 -26305 -56726 -21067 81756
11371 -78754 80446 -221704 -185409 -212695 -393420 -57883 107946 202384 -68929 -185004 154471
11359 -152299 -224096 266228 55704 -221425 -35535 138979 85919 34309 96572 -227656 -355099
11348 -355099 12427 -161697 -53887 43676 129248 166515 124885 293304 -335312 -78730 105165
11336 -43537 8385 81269 -28648 155100 -201052 73629 -24911 -150994 -249724 43710 2463
11324 161689 56608 -32800 142729 28080 54597 109757 -190125 111475 -82653 -144487 -21564
11312 -36048 405516 -114766 279644 58014 62944 -148862 87001 128861 -152478 -237254 178326
11300 -45178 -235611 -18408 -8241 -142914 -234619 40926 246193 -345698 149104 199285 -7331
11288 -15140 54854 307465 423393 -215564 -37487 -54837 148716 230879 -182252 -29039 -211383
11277 -211383 56768 -107136 -168590 354344 46178 -65346 -69470 -24242 -248729 -447351 -237043
11266 -237043 35313 -338125 -235946 94917 -258698 -443122 73032 206265 -331037 -126748
11255 -86517 112427 -120732 306921 -44041 -177515 -291726 84493 9051 66562 -28818 -68966
11244 -68966 184699 -118880 34359 123227 118133 132054 -68613 -270218 -131157 -124550 -126029
11233 -126029 37592 -19319 -103985 -142301 98317 -110279 -319198 45766 278237 -291504 -216968
11222 -216968 -281838 86947 -55825 -250266 -162921 253319 -232513 -256621 -437420 -130566
11211 -243530 -433353 -181514 -206582 -11657 146455 -100704 8826 -91957 -385297 27192 -129041
11199 -94497 -206704 10742 52112 1850 107056 -404146 -6676 -59161 10936 74494 -44046
11187 -110580 158381 62129 -295043 60856 -154181 -14753 90850 -394414 -28562 -98770 42993
11175 -130406 7166 -177957 31557 -311181 222341 20944 248995 -251249 -158672 -106590 172145
11163 -97464 -144635 63370 -108909 -49683 -98057 -294731 -446260 -346824 -343238 -87102 -270648
11152 -270648 -56116 21117 -49377 79901 -215674 139466 207494 -122735 218671 -204403
11141 -166604 -110863 -150119 196243 -10581 240055 -129058 137416 -192490 -117064 426957
11130 99078 -112067 -35157 54918 246144 -246883 -292108 -374735 -63682 17462 -7019 -167676
11119 -167676 327857 18814 257038 -67317 226773 -238535 -54554 -162988 8952 -10532 38422
11107 42738 -156374 -176073 163515 -101916 -50876 -91398 110078 149813 455468 -68055 -68111
11096 -68111 415576 107165 295806 -106529 -80996 120501 199844 76444 -93802 42058 222319
11085 222319 96267 85198 208483 -926 -213 -43736 -5357 132038 77960 113248 -75427 160126
11072 339825 161655 483192 161947 142039 63299 480499 73093 236310 288871 402712
11062 402712 293495 212340 54688 122522 194420 199544 321824 119360 854298 557479 322567
11051 322567 301444 322584 548241 658452 384438 268636 657443 833204 563084 269864
11040 411309 593346 506992 423206 610768 499098 470956 382127 413777 329911 347627 545657
11029 545657 529115 397842 793482 187684 417467 54132 294385 298995 434224 633183
11019 633183 564360 584121 319913 482678 680027 469588 453984 724071 200772 609428
11009 609428 232401 515840 660026 437537 605151 516567 780445 325950 312490 461981
10999 461981 157786 279118 572850 270879 658900 214153 190394 201240 -1583 698108
10988 205342 364842 637105 447779 563921 270910 449716 771631 550117 495211 790331
10978 790331 817941 494395 812416 571240 982730 840559 1192905 1233067 1022645 1751238
10968 1751238 1468152 1647581 1767352 1612084 1554838 1347280 1229342 1159484 933110 1248107
10958 1248107 1190200 1018375 1403427 846019 1417842 1151836 1240119 901086 1290032 1058386
10948 1058386 631419 749911 779039 101964 155163 100970 118849 157965 334889 38166
10937 118886 52458 193379 -170142 -193842 -554629 251723 82930 -22702 -21340 -166375 226465
10925 305258 27225 22907 -27221 -208234 69877 53303 -99285 -103436 37480 23050 229928
10914 229928 208620 -111354 47355 -141855 436898 -193195 12883 164234 139280 -46397
10903 34555 52087 -58830 -19337 -20644 4127 6225 352827 -172253 82655 121134 -56006 43121
10890 -50105 -357623 -96114 -192379 110619 187517 137904 -116959 -279731 236262 -203666
10879 248574 -219800 -3481 250773 -37058 27813 245 -6741 -3612 -29469 -205426 68677 -153554
10866 342221 104051 114072 -339871 237455 -8720 -200924 203486 -112900 245787 78059
10855 -204959 305941 -64161 25910 -262990 172106 41935 118344 -23146 -102319 -250535 -154277
10844 -154277 233992 209615 -47299 229711 -106990 -20949 193402 -433309 -469184 -99825
10833 -29755 -357973 8537 354533 78773 258893 341491 -75325 -8017 -138762 -159950 -104783
10822 -104783 -313367 134293 -58125 -7096 -104924 -19314 -294968 155919 127941 -72500 -92908
10811 -92908 89502 -70786 57497 -176126 17438 80557 172519 -73000 -97349 63961 423922
10800 423922 -193487 -192353 -9266 99759 -473977 -107766 -143331 -10291 -271042 163137 -240443
10788 -263815 -118651 119231 -2900 145790 -147652 293899 309372 -36944 6945 77542 -152412
10776 -27430 279483 -29162 252518 -27513 157713 -50961 -362693 -17996 -106119 -167221 25833
10764 -122403 -255407 -137900 7047 -111435 -365691 -86973 11819 -123105 -157689 29189 -42149
10752 -147657 -71490 216194 -98933 123955 -151829 -51369 -45847 134977 190644 318180 -190614
10740 -22233 -13539 69172 -148833 48007 -78931 161055 -242411 -19904 -205391 -69282 -175680
10729 -175680 -30295 -73728 196588 194607 -152631 -299334 -155488 98373 -237441 166653
10718 -80295 -50255 -353784 -93481 316717 198639 83570 335445 162690 152766 -56094 45329
10706 100726 -71903 -106644 -141254 -125356 -126234 83606 269762 71045 -136149 55166 -209470
10694 -252140 163964 -237382 30623 -171621 96390 930 -52615 -300617 -42974 12133 -210344
10682 -7850 49871 -19387 187906 -80369 -98153 -33894 -100348 -60786 66209 8764 156525 98941
10670 98941 28521 -179837 121968 209629 -55125 117270 -185488 115021 -383059 -123512
10659 67907 -134286 -291497 -203119 -17610 -73252 -298286 -48410 -161125 -37247 -148618 -12745
10647 -27143 399 14127 -47890 -16240 394179 -149443 403596 59173 225927 6694 221845
10636 221845 60258 72475 239215 -22847 -287978 -225750 -45437 -171115 10011 -24731 -100947
10625 -100947 -544457 81851 -154327 -131309 15953 -42630 220343 -69050 -173636 295420
10614 19876 -28286 -287527 -300622 119559 -149571 82917 -130993 -56890 -236173 -233454 -6544
10602 -108997 -60756 -116108 -24460 -242705 80700 -38436 112594 23523 -75470 -61447 -264965
10591 -264965 70131 -190405 -214717 717 -306048 -25035 -57581 -89059 -163299 -120600 -1656 -1147
10579 -1147 -277718 -97771 173436 12838 52043 143828 43779 207588 -308659 -17302 24815
10567 101915 -211307 -98353 -14328 -33401 -153010 77817 187756 -90602 -142253 -47545 -17022
10555 -132351 254991 82635 -10136 -240866 -73664 -59942 -169693 148800 -412426 -77824
10544 56940 86355 -76279 199197 -54912 -116902 -29812 -24691 -282845 -39003 -73075 22379
10532 -127111 90827 49317 -86202 161734 55424 -28780 24390 -175351 -150040 -323737 -257074
10521 -257074 27138 -164224 6431 -59762 -23895 -51040 -119488 75758 147946 30560 -109409
10509 -61545 50346 110922 3663 786 17088 11867 -201638 91220 -353540 -128898 117897 -10663
10496 -144414 61462 99189 56928 -287552 -229412 56246 -78973 -240966 -104723 -153858 -159818
10485 -159818 -172085 -322984 -60367 137091 186297 154890 64486 399779 77710 -13547 264800
10473 -89554 -39351 180419 233373 -206981 363130 -110791 -70109 33952 -61574 -279668 387774
10461 -18285 43884 16071 -62603 -50448 165083 -37211 233003 42589 161901 264370 -125735
10449 -22851 139034 133892 145521 -45006 -276593 -557715 -232187 -247604 -315780 -330373 -65913
10437 -93543 -55200 222640 -47655 -12794 27268 -4336 -210247 -5606 -190968 -43012 -102889
10426 -102889 33422 -84481 -185552 -92189 108096 -280683 -295583 -322586 21751 -133838 -14255
10414 -163214 20037 133552 -210028 -188920 201519 -209640 -61287 139409 -33647 -136047
10404 -136047 61243 -182546 178887 21167 -73084 45249 -244413 150877 -108524 -124211
10394 -124211 5117 110002 268351 272798 325275 8666 -86768 28882 -305983 27479 104765
10383 104765 -86793 -362083 107178 77566 301947 -35591 156235 -2406 407664 -156938
10372 195353 122413 87205 -58550 85241 210525 180575 295165 -76266 133618 370402 289813
10361 289813 307277 113577 189377 127620 154402 -143452 117459 171793 478164 124003
10350 -28507 162659 85600 600641 151319 273571 319216 370608 85287 241856 -163433
10339 414759 434407 218342 46522 178338 130749 205519 175413 -100567 37166 303987 23632
10327 -178872 -97516 -87118 64561 -17990 212053 -171344 67302 58752 135947 39121 99844
10316 99844 -186299 -42861 247164 335468 233474 245864 -103065 130170 368890 4958 -81551
10304 -229111 -44346 -93979 75248 27890 13244 -154312 9597 -181924 -33440 71759 120434
10293 120434 2918 -178892 32376 -42191 137899 -75661 -143050 -103395 -90230 -33614 243687
10281 -248448 137192 -34161 -95736 -160570 86964 139519 -20160 -41496 -93697 38179 -68442
10269 -3415 198730 -75152 -144831 -103926 -88819 23612 -177202 231306 29575 1334 -272394
10257 361222 425311 130344 486917 93267 36404 154533 87128 52362 172548 85016 103259
10246 103259 -244333 -168197 369649 -182254 349352 -257014 -14904 84532 183526 178935 -91886
10234 -3335 267484 -134900 -68587 -134771 -83937 34671 -28490 -90417 -235265 272278 -9905
10222 52496 5114 69333 -164784 -65515 -8350 164870 203230 75567 -186341 75529 26449
10210 -37371 -45224 44901 315379 -63865 -137246 77935 -224771 -155733 236782 218426 -89034
10198 -13212 -207389 187446 -417895 -199959 -160939 -248274 -191188 -119140 -103395 -306542 -267751
10187 -267751 -317767 -124027 -195566 279458 -750 -137833 -59105 175666 173570 155458 -113728
10175 -51784 76343 -37378 24263 -81553 -163104 -239381 -21480 -161093 48029 101379 -92216
10163 115426 -54935 -47634 -115981 -343515 -117650 -135877 152017 -101301 -83463 174612 11727
10151 -197491 55574 52040 -55092 -69337 85171 -100851 -311867 62773 43122 -75984 -57995
10140 -57995 -91848 -251656 -4621 -233225 -199776 -166796 63006 -91638 31316 51675 104721
10129 104721 140140 -232138 -177190 -114227 19782 -103888 171323 241706 -55589 -97056 -224780
10118 -224780 -95142 -79663 -54531 -186231 -252300 18434 -395225 -273564 -17244 38688 19676
10107 19676 72863 -117094 444059 -47170 -20677 59731 -118030 -24030 18952 176024 317007
10096 317007 -3207 -342657 -61871 23475 -138023 -293442 -188455 -34846 268394 293523 8259
10084 -116108 -53782 -178493 -279966 100306 85674 -301720 -365392 -12787 -34779 129664
10073 -122473 -189256 -16908 54683 176224 -108254 -1948 -30362 25327 14986 -144096 283405
10061 -102625 -7272 106766 95969 81151 110918 -205497 -433783 272040 -362880 -285427 -180911
10050 -180911 -27208 -48658 -73740 -25592 285112 112662 -57530 250045 -122947 -528006
10040 -528006 -152021 -54485 12322 272515 -237603 42893 31812 138693 -143486 109833
10029 123036 -64870 -223827 -240983 -247357 317818 -44219 1225 -153931 -111808 -292370 -158309
10018 -158309 -321554 -71512 -59529 -306363 -147631 264188 -273979 -26071 -89732 149257
10007 -175740 -27557 -214727 -86379 -227536 137914 26245 -63007 -143297 -114938 -120813 158745
9995 183622 -390702 -127968 19813 -200566 67046 172063 -96884 -1530 -493062 -144691 85452
9983 -61448 -84243 -120406 -175268 308732 -502731 -256322 -61453 -54647 -2028 41901 -308024
9971 -221835 -154080 -113055 -153947 57110 -115941 -139840 97633 111568 148512 -174739 -105163
9960 -105163 128070 -189487 44925 -115098 -162842 -98427 169791 3507 26458 86922 -443248
9948 289410 -153557 103955 -101796 -66927 -228380 -103992 -115163 -423716 -111046 -336660
9938 -336660 -187430 -4274 21613 348273 -126652 281727 150634 162849 -7647 -16693 -182429
9927 -182429 92232 -137013 -76734 -169979 113516 39323 67974 -306762 -188350 -86976 -285980
9916 -285980 1809 63398 -4916 -219743 -202903 322043 -245238 169012 26928 -3147 112516
9904 -193688 -99260 120349 63 -81812 141163 195759 -77340 48515 -176741 42258 -127596
9892 160522 -90680 -111640 -133461 -270128 -153750 -8997 7080 -256586 -128402 -67032 -142401
9881 -142401 -212909 -562021 124854 -20923 -254088 189988 -14793 121859 -86216 154425
9870 21333 -418138 -87614 14103 -148941 -130201 -95668 -193675 -200099 -155969 74980 -69332 26780
9857 44584 -259141 -19695 23646 -338909 -234627 43166 -342449 -40349 86991 -276904 -67567
9845 187380 145815 17671 -76834 77570 -28735 148337 -50465 143115 130969 -233905 63543
9833 252516 225426 209320 34791 285663 -263692 77311 90680 193463 94044 -104481 -287718
9822 -287718 -279362 -217614 -269101 -298190 -218958 204680 -48468 212204 -109661 -359474 -157640
9810 148847 -546626 178564 -231219 -91041 -62568 -292366 -188416 241994 -228340 19255
9799 54675 265311 -233782 120853 153449 -322145 106134 46361 -134790 -53746 16411 93522
9788 93522 -71911 36463 -145227 -123111 -144569 -255766 117838 22281 130722 -270704 89830
9776 -329840 132280 29590 -80373 49435 107011 135999 156314 -9912 218890 -99390 -53884
9765 -53884 73672 152868 48535 -42770 -121219 -30175 93008 -175223 -19985 -242007 -479674
9754 -479674 -271057 -40506 -80176 262784 -27840 -23693 -31104 -186103 283959 -510712 121655
9742 -457434 -220908 -235560 -17659 8234 -45614 429422 62123 -76713 42008 281266 -88517
9730 -25198 -2357 67174 -17174 -279166 -59827 208468 83392 -142839 -63091 -48942 -116437
9719 -116437 35574 -230808 135138 -278536 -161442 12526 -309761 165088 247566 -213065
9708 -391620 103339 -125214 288982 -286128 131125 -194182 -158536 -81562 -67463 -57249
9698 -57249 -210792 209230 -206265 -384750 -8465 -222689 -77421 -316599 81559 65640 398333
9687 398333 202146 -308200 68630 124079 105107 -182559 130411 -56091 20948 41777 -134456
9675 24862 -53837 -146224 -85453 -142677 135284 -51824 54617 -223539 -251422 -179196 34565
9663 -189532 -42856 -84362 -130268 -134686 139188 -70153 -137640 -138900 -73388 341247 90643 -186847
9650 -57181 56673 -149374 77352 -184089 150585 -81348 -84894 -177373 -143852 -453906 82911
9638 -292900 -197957 -144723 -136386 -69120 -227715 -449258 341962 61311 34552 -128141 -25494
9626 -187465 41325 -157384 -79623 149688 170631 -284146 -83790 -117854 175282 -49535 -358304
9615 -358304 32157 124261 -207737 71755 -21703 -211327 -139564 -237154 138742 47332 76645
9604 76645 126747 430687 37328 -324472 86100 37640 230572 59870 -140309 -90316 -174324
9593 -174324 -68662 -138829 -112723 -182555 194460 152573 -236193 63120 -132768 -105255 -4361
9581 -97061 149753 -55431 262464 80704 9677 275461 -293089 -60951 320168 -65239 140935
9569 3128 -109809 94196 65596 194299 -304661 33851 12536 178259 162087 200803 30986
9557 -153682 267369 -167992 147538 -303932 -39735 223929 189667 58449 -58892 -140014 -31962
9545 20243 -261128 -43014 -223656 170143 -83915 103692 9717 66310 -295142 -440374 124694
9533 -44705 -243649 -222023 -283518 -232744 157734 22615 162210 -112924 -64488 -293088 -287074
9522 -287074 -18909 -117449 37437 25001 -12501 -57308 -227917 173583 94594 64653 142333
9511 142333 -129264 -414921 77589 -63519 -204122 61128 111702 -133342 -4392 116841 18935
9499 11771 -398423 -125436 -86588 -216302 -84397 57554 12041 201650 -420075 -424216 -137994
9487 -385618 -350107 -224497 -101906 -163017 -203691 -144836 -130527 -134502 -114434 -14003 -290133
9476 -290133 -146721 186110 -66995 212925 -26896 23055 -36837 204895 -157356 -138559 27457
9464 243998 271817 284832 19884 128352 -64378 118644 -24830 -224706 -161387 -194182 -188311
9453 -188311 -172450 -262596 155598 133542 -15071 191342 6849 74000 21934 -1137 237876
9441 -43791 -75923 -209271 -272993 42236 94204 -158122 117508 -236809 -53675 -247288 161563
9429 51143 -97767 -59591 157556 -59191 -307158 -116822 -172380 9993 370919 -9600 -517737
9418 -517737 -137262 77434 210552 -117060 98301 283562 25086 38230 -304962 125918
9407 -617310 118881 -216079 -403303 -22612 -193763 39028 -195671 302954 97199 129256
9397 129256 115646 -261748 187028 160099 -112899 1655 6013 -201447 -243009 -87868 -92634
9386 -92634 -443125 -56270 -34663 -287730 56164 153808 -143818 -153976 -91856 -160199 -92824
9375 -92824 -2764 -72250 -73676 78854 -314945 -173525 174471 -163508 -394481 -164033 186443
9363 -105068 -28013 -203210 -198632 -46845 -73510 -85280 205675 -228487 -84505 -133500 -145153
9352 -145153 28801 -293048 -278074 -141970 -252820 233969 -259503 -164520 -278290 378028
9341 377198 -133883 -76553 -60410 92439 -161870 -177874 -183440 -212207 -206824 220189 44409
9329 355103 -291755 -57013 -399835 -12495 -176640 -152728 138342 253951 197075 -43786 -107599
9318 -107599 136624 95884 -137615 42051 -168829 -94634 -347811 -131166 19709 31363 9787
9306 -25560 -348682 51616 100964 82261 -28058 146956 -329179 -252495 -32257 -83132 -304627
9295 -304627 -136227 -50056 28808 -37082 -123073 221007 22673 -315044 11395 88604 -79912
9283 -46441 -62704 -74901 282432 -251129 -255883 102938 -12060 -112326 -176272 -84240 49441
9271 123130 202584 75799 20569 194843 -230157 -191135 55669 -71925 341788 -215004 -148339
9260 -148339 -263847 -173375 -10889 -163380 -73742 -77079 -61350 -295516 104760 -412346 57713
9248 65205 -370489 -127312 -392955 -388995 36839 -83337 122424 -7525 68447 -18092 -38674
9237 -38674 267059 -165013 98417 107821 -272935 86281 -183170 -65840 118570 -251155 87955
9225 80588 -42392 -125526 -278906 -141769 -14699 122633 66079 -207598 -87282 228124 46086
9213 -123807 34276 71391 -64183 -146944 38632 -313025 -32671 -212440 -26030 60391 -43957
9201 140916 84573 301314 70396 -250506 -113587 -368490 -484061 -33712 -57907 49925 37133
9190 37133 -64683 113200 298124 -54583 -205728 109650 -163744 51587 -156276 -180170 -282580
9179 -282580 -89395 58726 -238663 550 122689 -146617 -54173 -329435 11061 -254528 -51417
9167 -132390 195399 -89899 68129 -119861 -11038 173160 64266 163532 -319221 -220490 78959
9155 -121415 186608 34629 -69175 -23919 104996 -166086 -218076 167729 -277256 155805
9144 85132 306984 -83017 -141956 -92788 -19610 -127191 -331420 48127 -206893 -33446 -44214
9133 -44214 -320574 -130597 50958 -216562 46655 -155844 -377388 110502 254084 -451695
9122 15438 -8569 81081 -10141 165144 -175506 -197273 38189 36376 -21606 87407 102773 -216684
9109 -283530 -335599 -442064 -60238 -170218 31067 -245520 -63234 -210427 -44956 -118284 42729
9097 195702 34189 -397007 -59980 -15065 36365 -29117 -204168 -518476 -165716 119949 -46050
9085 -111829 -106591 -367372 42205 -70087 -6006 -71573 -40982 48939 180505 -327433 150156
9073 20823 103435 -166521 -221613 -62192 -347449 226944 -48360 -263478 -261966 -136771 -144154
9062 -144154 -213252 95422 -12179 -221513 -309862 -120992 -127985 -354018 63479 -141925 91953
9050 -235890 -182036 -185715 -276745 -46079 21614 -7606 -252484 -34231 -491877 -54672 -288223
9039 -288223 11449 -376 12826 -236360 123430 384034 247478 -290908 -183829 123080 38036
9027 -491741 -13769 -176699 72865 -115715 -28707 -156447 132325 72525 137264 272327 41865
9015 -260815 -252552 -31955 141777 136327 -128479 46133 -228276 -206948 -74487 238805 -484814
9003 242982 -195489 100885 -31706 -58353 -151205 122764 -124856 19298 -146183 59099 -26997
8991 41166 -258514 -106984 360076 -179186 417964 279991 285103 -96755 31480 229373 274337
8980 274337 -171006 73162 -65097 -332916 -158931 -280332 -151486 416012 300403 301664
8970 301664 102839 -55306 -392404 -86335 78267 -173758 -48033 -75140 -62392 -423436 -363124
8959 -363124 -137023 -56934 -111189 -36623 -314804 188718 275788 -194435 60061 114197 -171148
8947 -112063 -164691 -35605 124920 -421818 -149035 202740 51696 90330 245041 -117031
8936 -8713 64560 3962 -326489 -73669 15173 13473 105755 105535 -252210 -129552 178820 121824
8924 121824 44294 322539 -24004 404736 179635 1051137 541793 20623 262391 -36196
8913 80976 -428308 -50739 7571 61594 -73669 24707 79417 158127 39826 2648 -299815 37571
8900 -136174 98407 -278863 -228371 -73354 155074 89010 216806 61805 -347924 -241513 -56453
8888 -34950 -286083 -296842 -235997 20585 106372 -154020 -168707 -147965 -106866 151181 -2420
8876 -236536 -41682 127332 -61831 -57402 109186 155286 238052 -178898 -179717 -86681 108242
8864 -204245 126090 185648 -88365 -140450 303491 -99851 215270 -148694 -121986 208001 -189067
8852 258148 -71492 8574 9028 -65349 154353 -269997 -187269 -256304 -213720 -327253 70857 -249765
8839 -194436 -38313 -5927 -205472 8143 -135975 -216912 -178806 114998 -247488 -110546 -2285
8827 65804 106021 -124631 32305 54256 173005 11261 -20415 3879 -2959 28352 95026 362751
8815 362751 8661 137390 -238474 -106743 -26772 35064 -54438 46738 -60853 30645 -106849
8803 -298569 -78667 -164854 -222545 -205765 -186543 -113541 -78887 285738 -152605 212530 -61246
8791 -106869 -233894 31461 -50766 135765 -279917 -111917 67792 -60595 22293 116192 -26397
8779 244686 -264851 -119752 -288782 209076 -79119 -259430 -388250 -7996 -37228 -70766 121510
8767 -70865 111043 70831 163057 -237143 -71917 81710 -329177 83875 288732 -350201 19654
8755 -50207 -192583 -223443 10919 -39204 74560 136011 70350 -149676 -259111 -236217 -39714
8743 -55937 116209 48275 -290066 -48176 -90511 -226548 170499 -81120 -156724 123586 -176312
8731 97481 -269756 -211923 -87751 11208 -94137 6594 -44742 -177432 -360289 225325 -428778
8719 -72419 -134122 -261610 -62224 -215916 -98490 -105888 -163943 295548 100778 -70865 -232110
8708 -232110 -227869 139945 42967 -102239 -38577 -257712 -62889 -25411 -446372 -219996 -47010
8696 -264937 -45337 39178 -49922 30257 -67622 -7248 -167557 138032 -382344 -348204 12564
8684 -192347 114106 -41700 -77858 233005 118205 214644 159556 -20037 238487 -76061 -19676
8672 98813 149821 14181 -157307 25926 -180434 -124221 -64283 -46304 -76780 107001 -341650
8660 99827 187737 -169253 164434 -79127 138321 -200696 -101843 -91561 188190 50830 125490
8649 125490 49954 -76053 -250260 -60818 32836 -395607 25012 55182 -382492 377788 -163007
8637 -49364 -51991 -74277 -130051 -32422 54119 209313 -45311 51450 75455 -241702 -68213 -89126
8625 -89126 28545 -95506 -74826 33427 -6336 -236936 -201653 31407 289948 -592187 -12558
8613 -67463 -188620 -115556 36128 -84543 -275364 -234015 175864 -130295 82853 65558 104231
8602 104231 -333080 90302 92783 35853 43159 -21598 -303724 -16894 -489927 -91350 17673
8590 120250 259299 52011 406664 74887 3860 -233926 -210765 91670 -213563 352569 313642
8579 313642 150939 49086 -417154 -21452 -153307 -23822 121621 -101270 -206103 241506
8568 -96885 43033 -98908 79884 -84224 100567 -137253 117334 23612 143940 -108090 -228317
8557 -228317 27762 -85950 -369592 -193170 33881 -106439 -150395 -145573 47924 -238189 -225310
8546 -225310 -347276 185296 -277717 58096 80786 -35879 -19811 -114518 216556 33589 103290
8535 103290 36210 -161980 -139683 -106934 -71611 -108404 -125142 55588 -164786 199518 64959
8523 -85781 -237427 -6917 -27945 98697 64429 -171196 -105832 -131923 -153293 -8656 18207 219385
8511 219385 -4919 -23398 -114898 161644 -76661 -101526 -90685 154998 -4576 129501 245881
8500 245881 10179 382213 -34581 -132241 -260210 100377 -12273 26221 -188353 97455 30303
8488 -52398 77744 -148274 82112 -445786 205707 -168768 472428 202218 454102 291652
8478 291652 -120967 76024 -135613 10142 -174122 138101 -32866 62732 -281942 62854 -235243
8466 -27060 102055 -155085 -20186 -136207 -121217 238168 -272278 21535 247570 1707 -117405
8454 -142831 -87522 72486 139746 263821 -151675 74373 -23242 -121596 -516949 -137944 -24261
8442 218442 -167391 -81302 -109601 -172696 136298 -65995 -381333 -171693 -98083 -166156 23604
8430 88974 -240446 -197925 43896 -70910 108489 56890 509 -287023 -131203 279601 73619
8418 -26110 58233 66772 -28895 -315306 -82209 -73145 -185492 -86585 8806 194952 187610 235638
8406 235638 -349065 -183415 -8488 101873 -171831 279494 -245544 60581 101827 -407791
8395 -135895 -2619 71791 -350898 72425 86976 -212053 -195500 -9524 37146 -117130 -209591
8384 -209591 -464988 70058 393559 239266 337400 38289 -28024 79024 -106534 22623 -216445
8372 50669 165727 2049 -7675 -550854 -236277 -145133 22623 47402 409 -51969 -439764 -24330
8359 -194509 205390 203967 91632 -185225 -9542 -12924 187216 -105174 163594 103476 115273
8348 115273 238170 -109846 195666 121058 -207077 162431 -48022 109705 94565 287909
8338 287909 376782 165646 -200012 41060 -10943 -93123 -23529 311072 -224024 78573 -81730
8326 189369 146713 -210549 -184216 94858 -23650 11207 -68818 -99328 111673 99349 -139843
8314 -85518 -2863 -97181 -12806 -61280 -68367 61963 9240 -20861 20036 -126622 84443 -37864
8301 -47 260495 28019 -4690 -300561 -82681 65768 -195655 6595 -88614 -214870 121789 -144106
8288 -72141 154387 -6964 147006 -204380 87792 -217596 92213 -174163 145129 -84317 -78377
8277 -78377 263443 -182453 63807 -111920 13496 -72503 -206419 -41023 -319592 -37339 152358
8265 -108971 -277258 260832 64746 55481 56713 -71999 -25203 -40585 -42095 121877 17765 -40287
8252 -219130 -189105 284141 -101047 287650 -94688 -32835 -145372 -230137 120068 -26741 -47964
8241 -47964 66229 -136515 -207357 -67959 -103180 -67890 -44748 72047 6666 67081 -154715 -112116
8229 -112116 -929 -269878 139030 8680 239825 -80601 67276 53619 75444 -139240 -182916
8218 -182916 -312040 -247855 8155 -172941 -105365 240585 4819 59294 308841 -116019 -111969
8207 -111969 6756 -133415 -61323 120509 65529 135798 128851 -84636 -136014 -307622 148105
8195 -95132 -13585 100545 235087 98126 109718 -38569 33219 -54529 -335430 79823 -139819
8183 131422 -148406 173595 100622 327160 -249681 -94335 44865 -46883 -38477 -78764 -48491
8172 -48491 52006 -18834 -133041 -64580 -74393 -159291 61722 211563 -112499 -102980 -322726
8161 -322726 78192 -177541 156092 31040 273215 -202854 -213253 -10333 216999 -55744 -202423
8150 -202423 -38118 -69183 293756 -268907 109611 -120208 122263 -104672 104827 193849
8140 193849 110609 88284 155222 -118538 401830 -157681 120746 68004 -65025 8555 -22512
8128 -316525 53368 118601 -116138 83356 175855 -79380 166007 -481679 175034 296604 -214561
8116 153994 226711 -195327 6755 194759 -229621 -56061 214985 18316 -40433 96502 109177
8105 109177 -230330 -250262 -148458 -333704 -20162 -8856 21138 -72201 209977 -71715 -152572
8094 -152572 -476 163882 91363 -147331 -128343 -411826 -217503 -353925 313587 200819 46067
8082 -282207 -182957 -152397 97783 -17919 -28505 -237884 39185 -131965 -32314 132470 316011
8071 316011 -189797 92519 -299472 -399112 -250559 178394 -79567 -91345 80147 -94241 -203540
8060 -203540 38596 -60339 -11666 13318 -6543 106477 -243730 -93470 120780 5167 64712
8049 64712 66768 -247539 -39015 -152369 264763 -151680 -175131 -209629 163758 -87861 68943
8037 121731 -67885 -57210 45305 184881 71445 160505 -133700 -42895 125476 -20302 -42753
8026 -42753 -34691 -189451 214903 -88842 72529 -91297 -269007 74384 -157724 -69312 -116037
8015 -116037 -61148 100718 -19433 -336432 95754 1010 79076 81842 82457 47220 167264 -185239
8002 -101913 17171 -30546 156145 -55351 -34000 -155730 -264097 236296 135476 -71571 -46144
7991 -46144 -412301 68837 181406 87294 250601 139203 -40110 -200972 -97263 46999 -129775
7979 -2903 -99990 -268593 -194843 169849 -230595 57259 207691 148731 142132 82314 -69076
7967 34526 407116 -27812 -272131 -165124 -108746 234803 156802 -2878 -75791 -113375 -218915
7956 -218915 86441 -34129 364 111054 -358508 -16643 -292385 324453 155396 -183876 182108
7944 44585 -200203 176819 -137658 -159402 -220419 -201415 -35302 -102568 -91985 -334653 -70356
7932 -106021 -174636 169043 26466 201398 11018 22398 147626 250085 -63271 -185720 -31767
7920 -106691 75110 37114 -150445 -42856 -119397 3267 384296 -63630 -21196 -83642 159482
7908 49590 -8990 284042 -403318 105013 61200 -184764 73106 -269403 -38071 86625 -298888
7896 -49148 92227 -172175 166122 15070 -13452 -263495 37029 -211418 72617 229904 601728
7885 601728 127431 124860 -85204 -190595 6106 -366595 292264 -135107 -127336 59811 35728
7874 35728 266066 416334 -76047 -181999 -72743 -262641 728111 -44120 -219524 158159
7863 -25483 143825 174113 95316 -45617 -20460 141557 164331 -145421 57827 -240134 186969
7851 49034 65862 -272526 -302362 -81588 -44539 135572 240270 -40915 -138312 -187728 237051
7839 344757 -318396 -47275 70671 -211557 -299479 -172573 85908 -26308 226173 -197578 -229630
7828 -229630 22078 -25909 223243 -82063 98686 78053 -178994 42609 -200609 -77673 -6346
7816 -281689 -28941 110202 -13090 123228 362783 -115948 64806 176872 1297 74595 -47148
7804 -39801 -396364 -190774 63640 33434 87999 -90422 -109321 84187 45159 -106729 -203761
7793 -203761 -139647 27794 -140877 -23541 -252215 -245383 -82416 -61206 -547 157209 43696 25257
7781 25257 -138883 -99907 54059 79165 -166983 -160794 -12785 167918 100847 -148542 -50776
7769 -283718 149680 157119 -217293 -252905 -17258 -132218 52788 359496 73700 -48173 63949
7757 -109616 169545 -140847 -32123 -55199 -92503 103952 271631 78572 -107462 -19015 140140
7745 -253932 -132618 -28339 270621 215939 98837 -133586 -60006 -157515 -165059 -424949 -269467
7734 -269467 398998 -277486 -226883 351277 -70137 -147231 -234824 -82555 -155906 68667 136798
7723 136798 -111699 34697 -8183 35625 -5584 7488 47317 8106 12319 -116065 -192299 196356
7710 32315 71379 194013 145624 -142104 198288 -32810 -44881 136584 -258232 -123657 -139925
7699 -139925 19942 132079 186325 -197934 145269 -48351 107476 -416811 -321176 22513 74477
7688 74477 -204209 50901 -239756 -207657 250399 207275 242444 20859 -7161 -15502 -212267
7677 -212267 -227123 53070 -102962 -33918 18417 80150 -135729 64340 -79140 -207053 170717
7665 -23446 386451 -144601 135104 -208884 -428833 -171736 -70357 -203698 -228488 167548
7654 30875 -18744 11562 71662 -96067 288205 -68099 -145009 -103340 80741 131076 47864 51229
7642 51229 -242258 -69034 -39089 -263468 205669 -12068 17608 -243448 -322257 193117 -105566
7630 -272546 -249536 105470 -20106 33935 103435 -176092 -325130 220747 -55946 64152 87892
7619 87892 -313407 -187546 -76328 57042 -342749 -146949 -30379 -51315 2468 179094 115162
7608 115162 285196 -337570 20904 -198056 -75491 -215336 154589 -427897 -151213 -93676
7598 -93676 -115310 -39076 -82832 -192208 125913 -98758 289091 -116553 -278892 92015 -336766
7586 -168449 -255477 52874 -356294 -17990 -151637 157287 -129497 -35517 34095 -87587 62723
7574 -143360 47869 -209921 -51263 -21167 -72647 66156 -63624 208787 187911 88654 -400308
7562 6783 -78242 -37034 58652 1061 325754 -41368 2657 -132359 23544 78443 -41848 -282205
7550 -282205 180703 -247521 -230885 195031 122409 -231101 151954 -291647 -65226 -102237
7540 -102237 -24351 -127131 38427 -227409 -338660 186214 -147608 -204649 -47149 151245
7529 -46688 5299 390005 152836 -138221 73775 -16309 227383 -179349 232854 -308064 124639
7517 132883 134597 -513556 31785 -25059 -53051 28260 -87332 -80490 -400464 -42497 -142980
7506 -142980 -304900 181379 -4299 193767 -90884 -248063 30604 -64593 113659 -65838 -106148
7495 -106148 152620 -84450 -92610 183773 -60520 -146997 -45282 -222247 -131874 -38964 67755
7483 -144373 210945 -97492 11639 -7149 105886 -131489 -530163 2436 -250619 -9909 153878
7471 -193646 -39977 -146178 -40304 -69295 69851 73141 49456 -141688 101074 69400 -10450
7459 80610 -174436 27706 357297 -127377 -10077 13629 4520 -64621 161738 -248204 -47915
7447 146181 292436 -359663 -20911 36667 175468 -244051 221804 -111078 78522 135421
7437 135421 209214 -99861 300653 213161 73822 329291 40932 -273107 273559 98484 -253531
7425 171645 275713 -372281 -254668 320721 95627 137275 206356 120399 181497 28710 -271759
7413 176942 27601 -195290 -16152 58108 -131132 226017 14525 110055 353814 -182523 203607
7401 156496 -151597 298299 -191233 -276405 -63193 -111127 27594 -197671 183014 67833 86402
7390 86402 2899 -118451 -110241 9608 -237569 89268 -139355 -32741 178524 -162526 -21048
7378 -52646 -113750 -160238 -238552 -140304 158429 -134908 -38335 -12448 -33035 -18817 -240372
7367 -240372 -186904 -520159 163412 13531 -22025 -137518 62512 -219755 -52391 71544 106654
7356 106654 -175254 -185907 302772 148478 -83877 -253135 137725 155853 185650 -11760 47714
7344 -93593 -61708 -156108 -13077 -80479 184794 5767 -182209 -33604 47747 -6707 247436 -222650
7331 185816 -70050 260321 -98685 -56362 -123904 92837 -209405 141378 54006 63806 -191112
7319 -47312 -249979 -109653 -88747 -345077 -32561 -96767 -70592 -120693 215332 -113111 -147549
7308 -147549 74061 83858 225614 -44460 113906 -147813 47709 8614 262717 -289471 -31432
7296 -187704 -281016 -515155 232081 -149125 -118901 418426 99258 31464 -290695 -4611 -11596
7285 -11596 -45952 -113268 319330 339000 -125608 -234613 3843 252778 54956 62914 -64825
7273 169791 -256845 24330 -168956 92186 91612 -348214 246034 -73829 -168820 240099 81307
7261 175684 46897 347225 -242897 -1581 -272841 121559 95258 -88337 -333612 38720 -304928
7249 -323916 -208403 113474 213303 -338832 -364239 267384 29797 -325746 16757 213432
7239 213432 215351 129297 73246 -101674 108228 -30756 136956 -73796 44127 -196595 212182
7227 -186272 50980 -202216 115162 -3302 -51147 256612 41126 125016 652 371576 -129225
7215 420304 -41458 -32840 63402 -249696 264795 -228741 -312455 -53100 -109115 87261 82330
7204 82330 200843 -1111 -132134 11573 -198720 -167423 262148 -91896 180504 -22028 -198638
7193 -198638 42945 -210970 -38927 -439046 35690 -388765 8689 59894 -346311 -105649 -175537
7182 -175537 -11247 -185442 -28346 99083 -276884 -211656 86982 46867 69537 -499906 -180291
7170 -82278 -7900 354034 178784 -246561 119443 -305259 192436 -17444 -7001 -36525 -2916
7158 84675 181126 80475 -34594 -61837 223463 -168789 218856 -46596 -33744 -106124 156309
7146 -103495 362265 61166 189055 111049 -471508 231873 29464 68322 -190656 49183 -37009
7134 23162 -55276 -55928 310430 -90617 -325023 -237124 -195347 28178 -13837 89360 99378 18591
7121 -145010 49221 -48915 167327 -187380 -266021 21468 105967 -57390 27291 82737 -118230
7109 5131 -140515 12574 221785 -222866 -193576 13892 -59143 127477 -75578 320681 205889
7098 205889 175047 251225 -243701 -28717 56377 -132176 101427 -115426 -366901 321071
7087 273340 244908 -124424 126174 -19410 162544 -196930 -38170 76891 137429 -236081 225908
7075 -33499 -163234 -67995 -98560 -245659 34949 -27968 324624 -59837 -192702 377340 211190
7064 211190 136534 -183400 -3942 -52728 -98159 211745 30086 -18541 -193145 10985 148568
7053 148568 -58333 -73900 225081 114958 -247724 -238568 113231 -66558 34833 119882 97252
7042 97252 -89942 150749 -133506 112975 -401870 -148581 -75676 22615 -135971 158190
7031 -29200 -191133 -12159 -61286 -186502 23416 -183282 -25231 -116291 -42670 -64565 134889
7019 -33232 -301884 74835 151147 -357900 -7221 132231 29981 -373314 106337 -144370 122696
7007 -29951 -23891 39646 -182764 -230624 -94036 -99469 -124695 24264 29127 -86913 -64502 60394
6994 -408094 -154033 -10267 103845 -57783 181637 4588 -180105 -99771 -134000 41026 -37711
6982 -167879 -34025 430036 442 -118048 352 -345802 171158 -84605 -191076 589409 5581
6970 180516 -174900 160314 -34721 61802 -14393 325 -96902 74196 230294 -266926 -238070
6959 -238070 -271523 147683 -136473 153562 161215 -8243 -123330 96462 -477071 80695 -29480
6947 -17801 -292366 -23688 -37304 223698 -18861 -46061 -283271 274456 -45147 -98978 38978
6935 -271415 -83995 -104164 -203705 -51007 -221418 -172090 -326586 44994 257108 94763 -245947
6923 274835 -120881 -136386 -85160 -188035 -243084 -19346 72676 -304292 -92602 198926 -499634
6911 -378536 -10809 413243 -97159 -406984 -27729 53757 65059 -27342 345334 -207929 64321
6899 288713 -246363 214123 43510 -162726 57938 -105428 87326 -206445 150193 -32523
6888 -174776 34363 -23276 28521 -121975 32010 -108389 -84644 214749 -96327 -259657 -17060
6876 -8403 -290162 -403344 -90260 121891 -180701 -196371 -248961 -4474 123923 -417182 -69416
6864 74142 253750 139519 256682 82264 95642 -186896 273984 -311184 200570 24674
6853 -98006 -402289 260944 -347890 234443 107615 -76338 80789 -172413 -38541 -17876 112307
6841 88130 31253 260023 -218144 -49138 115171 -218278 -7172 -217779 -232349 -92432 -321296
6830 -321296 -99515 14973 246613 -83416 -16560 260890 -6076 -66482 81058 -20057 -115768
6819 -115768 175616 52599 -37363 -101281 131727 -154366 -152582 3676 177193 -9199 -171660
6808 -171660 -87340 -144529 18870 4868 254597 -3709 -270493 184863 76368 -220020 -75969
6796 181944 -363099 221505 -140669 53685 -111287 74806 -19304 -68066 61699 90543 -132300
6784 -102054 -313283 160419 47481 68366 88385 -130920 -184674 -49417 -33493 -240317 70789
6772 908 -50926 -9126 11001 -187410 -1195 -21970 -41728 165231 -169393 -1483 -129630 84253
6759 -336733 -36995 -88462 -119127 257291 87535 11637 179510 -76503 -84144 82396 158797
6748 158797 -135989 50432 16454 -169753 274468 -75032 -344346 -116165 -7027 -173268 -57360
6736 -29668 -71214 164264 123342 -101010 -27201 -135421 66901 218162 -44658 -326296 -106356
6724 -93992 184506 103480 -24871 -282140 -195094 -113015 269979 28701 -111288 -183682 27713
6712 35599 -85981 -95710 274331 -109311 234329 13818 -12224 256043 -41258 -67771 -28484
6700 -84323 -220708 24083 11813 -8867 -140077 32519 -154239 -331548 60911 3583 78957
6689 78957 -85249 -282715 139047 -99406 234432 -139462 -253340 160120 -40784 -134175 129490
6677 -94129 248189 18115 -222962 -197291 131250 -309914 -46143 -64418 27643 -199388 -79047
6665 -17764 -90231 311303 231052 -142943 -246162 -220408 103938 82711 50191 195073 -56491
6653 501780 -88426 -45627 -47159 -64349 -88874 135384 141056 -157448 55178 198502 260698
6642 260698 284836 -150398 -242404 80574 -184894 -89366 -83362 228145 -35520 234237 152409
6631 152409 -254161 -21006 272904 -42696 -199170 140555 95452 45034 -407231 82376 57615
6620 57615 158667 -73609 -299352 7160 222049 87922 -765 -161577 -99531 -186484 136394
6608 56737 -7708 -114484 -123668 -78170 -34124 -16116 -247002 61109 -373885 65967 -200742
6596 -95194 -36462 -96505 -130944 -228630 -37877 -161970 -14919 31551 91847 -91180 -75684 235565
6583 -67875 -218744 155967 20276 11841 -84143 -198328 -64672 -63024 135133 245786 -357378
6571 18671 506726 164790 38868 -134378 56662 1483 -271121 91037 -22046 161383 -127621
6559 -17483 -176092 172928 243939 -210481 -216843 318273 146109 -125831 -20585 76993 130305
6548 130305 -296305 -261300 183477 384543 179826 -72684 -112643 -11222 33626 34765 -58492
6536 309888 -260800 -101552 207200 -312037 -22211 -44018 19473 4473 -9196 96444 -59656
6524 36921 -87380 118257 -27340 11626 63166 -33488 237302 140640 217626 158552 67236
6512 126397 -50464 -3657 206980 -294697 190466 146527 -149359 -74589 -208286 343393 -35613
6500 -90352 271984 -74592 -294285 78615 -296644 -42233 -268530 -50564 -105303 119074 158323
6489 158323 -18626 -293608 327895 -19244 -188714 -70554 -173491 -55379 -166710 -77532 369430
6477 79556 -129651 10521 124306 -110141 13465 298973 60936 -97548 -207190 -273354 -42808
6465 -30264 9584 124205 114521 103485 45483 65421 64968 50351 -306678 -288839 -23909 17850
6452 -18137 14664 -79227 -138717 -110910 -102117 11758 65290 -48913 -175375 -264803 -112286 228326
6439 -27033 -222777 -98787 -30058 -110139 -26628 -101329 -40932 -130117 200413 143891 107719
6428 107719 -176946 -1402 81366 211545 6095 323967 113803 -76 -166431 150838 149569 253067
6416 253067 -151776 40625 -310743 -132078 -137535 117476 144101 340248 327014 -132501 -236453
6405 -236453 8497 -316745 -374852 -31277 152033 -310187 148145 -239667 273953 274003 -10963
6393 31821 -164490 92978 29114 181345 29879 -26515 87309 2689 40088 165703 -20253
6381 20852 289544 130148 -66621 -38447 -115198 -10872 -169275 254152 58400 6882 42991
6370 42991 -84110 -191512 9054 -31460 -438299 -29425 188752 212805 -141547 -147000 1263 143566
6358 143566 2023 149725 -209549 219423 -115924 100674 286124 142536 15196 143494
6348 143494 80282 181813 22296 -219115 -72370 86918 80341 41323 -62462 76283 283994
6337 283994 77893 184216 -177662 127582 -6180 -311082 88530 -68743 -329800 267451 -8639
6325 -3117 181388 -255633 169209 -73788 -29432 93546 23311 -87043 -13674 -250689 -115824
6313 228094 -51753 -193552 -208182 230234 -128433 144268 -38191 -280022 381457 73284
6302 17796 160902 -136453 102831 69262 -116525 87515 31141 -208348 199938 346947
6292 346947 -190310 -86359 88334 -85719 100115 -13882 159603 -30659 306916 -387240 -21608
6280 -85619 -65744 -358480 -153176 -52638 -136610 217564 2043 -154648 -534 -211497 -46599
6268 -330082 -76987 59630 369967 469 203698 -133317 167354 100387 110457 -129524 -69942
6257 -69942 -360588 198250 11358 203730 -43032 332399 -262598 148730 -116385 139894
6246 -161882 -48277 63892 268510 29516 -75707 -179425 -133261 -49756 -94095 -100937 -181730
6235 -181730 105141 -161220 -498936 67664 -121238 -134102 208090 182726 144724 -4928 263650
6223 -172937 -48214 -60060 109821 -172158 34025 -81060 18551 -33932 116959 125525 -89857
6211 -57000 -49677 -71419 -70883 -44283 -496754 -252889 -2734 -295046 24397 24635 13867 127362
6199 127362 58184 -123155 105772 57666 96204 170961 -116641 42065 -170933 -222077 -32764
6187 -222462 -69164 -303927 -102611 -113642 -260725 -3119 9966 56677 -331577 364696 -543653
6175 248313 -98212 220099 -13019 88521 188745 75356 81602 -106323 282415 -334023 -176085
6164 -176085 -247 -230511 228716 127777 55159 15791 139885 239484 -208085 51183 325013
6153 325013 -56663 -24968 -115150 -140403 -162959 36501 153820 139675 185849 -458712 -353979
6142 -353979 74029 -170180 -100907 -112558 120484 -85949 45178 -33235 42841 100555 18337
6130 -40853 -64960 -109051 35989 95891 69823 -48322 4405 -51595 219760 -37570 -113973 -61772
6118 -61772 -98497 250573 -169061 -21847 -150166 279037 401829 -95098 7625 -214545 -155249
6107 -155249 74935 202483 87037 -33748 280700 -225467 -249666 165904 205364 -110452 -258357
6096 -258357 16409 -40122 -5205 -7797 -384059 -19157 -55298 91223 -179152 134010 -87507
6084 53348 283901 110847 24472 34397 -159740 -250119 -149107 -127038 67152 150725 192288
6073 192288 -187163 -165098 55007 48430 98004 -113170 61995 401149 -143723 52347 4207
6061 112490 -15986 236222 19015 -52397 59659 -50209 -140458 49934 -214690 90095 127762
6050 127762 -73919 -21974 -8330 -21335 120888 1536 42518 206562 158976 -24837 -20195 -34800
6038 -34800 153994 -239621 80991 -197468 70500 -313901 88948 -188678 228928 99624 38036
6026 -295131 -155183 170321 329313 -85462 -170632 -163069 96660 94222 -133299 74956 -70576
6014 24469 -112204 -1017 157356 -264388 320549 42101 -45171 115273 117824 -371344 171060
6002 -132390 18185 -106996 187494 99478 167652 118136 -211401 70099 -288545 70676 -32911
5990 65925 121557 -189951 83149 -135291 150068 -8827 60400 85827 -113900 -332040 236940
5978 -231158 -97754 196872 264045 -518689 49670 17520 -150654 -32403 -208074 -78472 109446
5966 148086 106545 -103793 -198398 -48694 156684 -263284 -243370 -81115 -151310 -67377 154051
5954 690 1880 -106308 158766 -171190 308112 27922 -130817 394617 -30321 -14556 85745
5942 -87768 121865 125353 241887 55079 -138602 -34158 139784 381283 -186372 26810 165164
5931 165164 235735 121930 118370 -69972 -438493 73066 -118168 -35285 -48993 568965 185415
5919 347048 -44263 50102 69386 -17388 149016 -156610 45186 -59932 171415 193606 44584
5907 -84652 321381 -197415 -38568 20997 -74344 -250575 162059 -100485 231480 125512
5897 125512 -11925 -367841 43483 41148 -129926 -332980 -66718 175532 -16808 57832 103376
5886 103376 88263 -59257 54744 -126271 -23890 358609 -37631 -17086 -494742 122964 -82830
5874 -51648 -21054 112732 145625 -258906 -147790 -163621 299303 60747 -325900 -13767 21636
5862 401732 254183 124256 62486 -154064 -26744 -195274 -29223 31315 240458 -221432
5851 113726 45765 -152584 -48410 -38264 5020 142864 76049 182990 37188 -36794 -63854
5840 -63854 -74445 -203288 147943 241675 -263752 251814 39569 97428 -178163 41229 422147
5829 422147 245814 -182929 -93922 249855 19320 -106732 296388 -81881 -22475 -187895
5819 -187895 140824 49155 -136179 152757 -108732 368048 51663 122899 -82451 121153
5808 -235056 -141973 199392 500404 259946 -165964 -5358 215792 22580 -219090 -204399 281889
5796 -198332 -291629 -168485 -283509 -230577 135879 109076 -122761 35860 112631 -32276 37310
5784 62381 -211632 292369 -113817 67217 309524 43758 -44234 -11196 -83919 381524 398603
5773 398603 38861 269992 -185103 42493 60161 27163 -118720 285820 -70269 -155441 119480
5761 180166 320832 -11747 -205368 -220568 129110 -413235 44594 -1305 117197 -148081 -164782
5750 -164782 145197 121915 -67555 -97513 170316 -123029 -188009 91850 242649 -141937 -24204
5738 120579 -27439 -98905 -56736 44550 100378 198141 -77912 -21482 -73953 -77043 -14724 -92737
5726 -92737 336114 -97764 -134572 -220515 286193 -59803 -13845 160864 -278265 -207035 120998
5714 -58354 -126287 -214828 -133075 -137243 10827 20381 -308559 -231842 -98967 -431449 -191139 192738
5701 139849 -159317 88762 205396 -245542 -106944 -7530 -185004 -174982 -318967 -93473 -25515
5689 271382 113237 -165142 109422 219007 -138612 104775 406823 81466 -5924 -45324
5679 -45324 222843 108048 -91175 -109991 194818 -240175 77205 65274 100424 4431 -98807
5667 41389 290201 16067 89757 207889 -192833 -33363 187240 278739 -110583 -130791 56817
5655 -152359 294854 -48120 495490 -184256 150762 306256 212751 -117711 13120 185548
5645 185548 -259006 225678 66440 185838 201995 -220302 65102 -39663 -8424 -78444 -142118
5634 -142118 73003 152376 526673 -84572 -272279 44093 51900 -59123 -143831 66658 -43289
5622 249377 -31127 -17762 45588 -75888 -177881 -341601 -2445 -265310 -145178 -198401 -477539
5611 -477539 -326291 -254072 -87854 2324 67519 5551 5391 11722 -23738 -9614 -93939 -17141 155019
5597 150936 -80833 91102 -84665 -99279 -80712 -164117 247065 -66048 5268 78906 189226
5586 189226 -95589 -267040 61796 323489 220774 201468 2019 225819 -24954 -282262 104178
5574 -55910 -31152 15037 -128008 236162 46758 87867 412692 -76666 -337876 -19520 -219508
5563 -219508 290427 83461 -545 231461 76605 189034 -132025 126017 -20847 130742 -95352
5551 248568 105057 347098 117624 -79731 41992 -253200 -17933 -209100 140616 83702
5541 83702 115314 -211751 115515 189741 -181816 100303 -163448 -27542 -110360 -150103 -212166
5530 -212166 -145642 -83257 -78509 -197619 -103318 72809 268338 191824 -41250 -168964 -186895
5519 -186895 9552 117861 27092 131596 169988 -36868 67608 18617 334533 83918 -324454
5507 120995 197764 -105182 -71417 -45779 -215133 -92564 144495 187294 333923 -539480 70628
5495 -261707 -202648 -29908 -139640 -86899 -4262 49171 9928 201956 -327772 -163215 -100698
5484 -100698 -121638 120154 127993 -364658 -405794 85493 -8229 204090 12184 -122686 114950
5472 -505159 140968 -40999 -324687 -135016 -174887 -42364 -275951 -87006 -21158 -252406 217632
5460 218283 -155632 -29903 -26671 704 -68715 249054 250285 -113191 -103258 -81562 -227632 128499
5447 -177216 -245258 -50269 74587 -63165 224474 218526 -145116 -127396 18418 99846 82139
5436 82139 -4755 168980 77512 -38231 233438 70105 171963 -186613 -180331 -22171 -127881
5425 -127881 91687 449482 -54444 305619 178608 168328 -5955 -332962 49427 102324 69922
5414 69922 -182278 77024 47906 -265730 116356 262685 -149170 -158606 -134595 -83854 -110911
5403 -110911 232756 -141082 271272 -171496 44276 288347 -57079 -172526 103117 -23829
5392 -91898 38804 -4726 -106655 -313929 111657 138180 -20581 19632 89100 -46469 -6784 219154
5379 32512 15028 -243288 12991 195937 -314481 -29384 -56421 103747 -2799 102146 58348
5368 58348 122864 -377405 -38293 338559 133377 -79925 -27064 -3330 -312676 -93939 173822
5356 291073 -27883 336808 202285 -284345 64998 -207045 -356539 -47595 -70449 300831
5345 -178806 289805 -71281 -91722 -120430 211796 -278386 -187182 126264 -75141 -116296 197682
5333 -216284 106402 173570 2486 95436 56516 232650 185203 38473 -79184 269858 -60764
5321 -99598 94281 -94441 -134436 -219493 -290219 113580 -196565 -61166 -28273 53232 -99486
5309 -50451 172772 247828 -39123 86151 -97785 261493 -101238 -42090 -143652 -109441 -64908
5298 -64908 89310 195201 -385752 -116994 -145247 127862 -424008 -252093 59829 -120287
5287 182618 120824 -23719 16115 317016 -233713 -24163 -65654 70448 44901 185450 86205
5275 20446 -131884 125519 240541 -14714 441447 -73574 -20144 -38612 8465 -149246 202464
5263 60393 93995 -197511 34610 -25763 -77722 11626 61028 263811 268402 386866 -307561
5251 93504 159942 -287555 316722 168696 -121468 -125087 50080 100449 14895 -56505 22402
5239 -64949 -12677 -362146 -51058 -80042 69953 344565 438520 -120983 -251610 -18381 -142986
5228 -142986 -77672 -313298 154672 97619 -101589 136799 -51154 116177 -87861 192557
5217 -129327 -36433 -218736 166355 247493 35218 -39265 342159 5535 231160 -20840 149491
5205 309338 142140 174740 99151 212481 -156513 -136408 55071 73064 -106046 136664 231578
5194 231578 111585 164356 -73136 -98253 70610 -83972 -164381 259407 111838 76322 47536
5183 47536 74370 -32410 53309 -105014 161100 231241 53901 163339 34929 -5512 -183446
5172 -183446 61379 -66630 -124802 232064 -1200 -130098 103788 159907 -102035 342488 -3063
5160 54414 -190283 91893 -30127 123423 128007 66867 29400 -67081 -75154 39818 92754 65457
5148 65457 354661 -65082 40344 20182 -170850 -11474 -184985 82201 8748 -148562 -218926
5137 -218926 -24512 96460 150183 -266042 -71107 44384 121389 -155978 158401 -90297 203472
5125 183898 -159379 -190632 -50568 -71530 -184561 -307753 -157175 -220473 -170678 176351 73904
5113 -123743 -460758 285959 -62573 120725 336938 -175781 67512 -220923 -72739 -163899
5103 -163899 -23223 -420385 99740 49882 -262238 -55581 9198 26753 205970 20538 267906
5092 267906 -274650 79368 -31285 156877 -664 -14986 12399 107744 -81909 -178119 -28310 26554
5079 360542 -255455 -14341 109641 82782 87372 -13401 -281053 40916 -103508 28556 278879
5068 278879 -134576 -88255 227582 -121522 45557 19122 -50536 -254240 132410 -29445 -32831
5057 -32831 150556 131698 -5903 -270241 -163358 -194004 -138968 53329 22251 -178949 -37254
5045 -43471 -12888 -232645 -274134 -92781 -37502 -175961 -186169 100136 217391 13345 -225336
5033 -350579 111895 129170 -6706 -162712 107680 -45186 -67530 62451 -66227 462213 -282236
5021 113923 184634 -49649 -71944 -159861 171121 308939 278139 177946 -34550 -224313 -85866
5009 31781 -25129 -30806 -146834 -470816 154671 59745 -35840 45102 126431 77225 95005
4998 95005 -21206 26700 -98405 -26510 42036 -213520 -105880 177288 120204 65970 -108229
4986 5848 341898 175869 -86145 36453 104198 86374 -299503 199455 85887 24725 34911
4975 34911 277676 -20262 -205956 111367 204496 -143651 203053 -77772 -67592 -82786 -300102
4964 -300102 -92399 -110728 76232 231415 -132005 -42031 151341 109268 -125351 318900 -76187
4952 -320640 137977 -190636 223913 148325 73564 -59 51054 -56912 342762 -56359 57247
4940 -108177 75131 -125457 298388 -267323 -85105 -117153 -30377 66219 -110919 -76051 -276568
4929 -276568 291940 -1142 8896 -109061 42513 177474 142120 627567 161525 47737 63973
4918 63973 -20958 -184819 -96794 54536 -101178 231618 -86639 137481 236117 -85077 179739
4906 193195 -106133 50434 -131482 -302450 62427 -94430 -230586 -116947 -48014 -229041
4896 -229041 253307 -208730 -24769 -114340 75567 175055 -119331 126603 181612 44031 -114971
4884 322330 -414383 60476 -57268 -108679 111916 106389 -129333 -77001 136285 36088 177053
4873 177053 270947 159637 62392 143160 334000 -135852 -32996 -142387 73180 155159 183628
4862 183628 -84348 -201787 -232541 75697 -253654 314607 129709 -94686 290153 -46617 -38552
4851 -38552 143260 -18978 10033 -84867 -4023 78179 1078 1080 72861 -262256 -278495 51778 8127
4837 27904 -156781 44303 -201913 61811 -57600 -4467 -54781 55924 -4388 152028 -52627 50963
4824 134632 101865 54032 -134865 45423 -87649 382896 155777 -163947 122013 474111
4814 474111 -44785 159894 359939 -37667 -429158 -39085 -39366 96055 48595 2210 97008 46964
4801 -84629 -387294 262287 -84048 -160516 -141415 153314 -135994 79232 -9610 52153 -241249
4789 174054 20590 183449 -68209 -61607 175162 -96934 -130660 -333946 53327 222352 35309
4777 -122016 -28246 415866 196367 -184072 -149181 1561 -20222 106453 136456 221406 -251992
4765 176338 -36263 -10793 -70787 -186831 -123011 156943 243089 -3703 -41768 77514 292969
4754 292969 -36132 -71872 -31044 291863 -259773 -76796 -69089 138767 -141857 63392 -160046
4742 -1474 95717 157013 51871 -47298 -78953 32112 -76201 -102487 34523 -199464 60716 212350
4730 212350 110597 233083 -8418 -97342 157788 -96747 -116501 45988 -95970 708816 -239386
4718 -51710 -72220 299258 68704 92056 -218704 -224306 -52782 -28854 5678 -20517 148153 136652
4706 136652 19105 279406 51311 -484144 60435 146080 -115812 253160 -16624 -230511 -262058
4695 -262058 206009 6737 -212070 -183417 210912 138704 -168147 30332 -84394 140915 94905
4684 94905 159551 132428 -120994 43153 -121328 75154 174279 -30392 271435 -137228 -51778
4672 22669 26360 164706 -352454 276370 167433 -124952 313968 84467 -18422 -81644 -133180
4661 -133180 75630 191860 55959 11700 -11277 198588 -68893 328399 29047 22836 88248
4650 88248 126529 -137449 37910 -218445 210946 138552 -72290 -50145 136791 149102 -134717
4638 -133812 -170767 -150793 34546 137074 88701 239433 -133724 -282291 188783 315800
4628 315800 -18210 239813 431557 -191772 300715 167816 193085 -121619 1489 -79873 -139056
4617 -139056 -98789 167006 -8092 261244 223720 45260 83802 -218185 -44985 14426 81784
4606 81784 -96050 -10716 -141861 -106137 -81860 -113059 413489 -2733 318633 16677 65146
4595 65146 -84937 -83050 312987 -400142 -160731 71226 207664 27550 -64440 -157265 -63632
4583 -123924 149628 215175 68981 -174461 375967 106508 -115622 76592 91321 -123772
4572 90825 -482 -48741 -204203 186274 -76499 -196382 -148818 -504043 15663 -282479 -7796
4560 217573 333509 -29972 273113 -80844 22744 -7361 -266412 162573 -43337 468443 -186889
4548 -130248 21589 -149420 -5675 204642 -149086 132478 -140058 -70103 50718 437895 69693
4536 35508 135593 -392421 78056 12187 -65115 -147935 -176512 -41592 177118 -25559 -154266
4525 -154266 103343 6265 -141403 81310 -66049 101634 15080 206005 -53413 -88653 149572
4513 51793 58670 -145199 -81806 9185 -36162 -104886 -159449 13013 149725 62092 -106747 39850
$$ [...]
##END NTUPLES=NMR SPECTRUM
##END=
