##TITLE=NES1036_878015041_9242627_nzJsoLbIYV
##JCAMPDX= 6.0         $$ Bruker NMR JCAMP-DX V2.0
##DATA TYPE= NMR SPECTRUM
##DATA CLASS= NTUPLES
##ORIGIN= BRUKER
##OWNER= Administrator
$$ 1.72 TOPSPIN		Version 2.1
$$ 2015-06-23 18:48:40.045 -0700  Administrator@X
$$ Compression mode = diff/dup
##.OBSERVE FREQUENCY= 400.02188249412
##.OBSERVE NUCLEUS= ^1H
##.ACQUISITION MODE= SIMULTANEOUS (DQD)
##.ACQUISITION SCHEME= undefined
##.AVERAGES= 64
##.DIGITISER RES= 22
##SPECTROMETER/DATA SYSTEM= spect
##.PULSE SEQUENCE= noesygpps1d.comp
##.SOLVENT NAME= COFFEE_meoh
##.SHIFT REFERENCE= INTERNAL, COFFEE_meoh, 1, 14.96262
##AUDIT TRAIL= $$ (NUMBER, WHEN, WHO, WHERE, PROCESS, VERSION, WHAT)
$$ ##TITLE= Audit trail, TOPSPIN		Version 2.1
$$ ##JCAMPDX= 5.01
$$ ##ORIGIN= Bruker BioSpin GmbH
$$ ##OWNER= Administrator
$$ $$ E:\/data/COFFEE/nmr/NES1036_878015041_9242627_nzJsoLbIYV/12/pdata/1/auditp.txt
$$ ##AUDIT TRAIL=  $$ (NUMBER, WHEN, WHO, WHERE, PROCESS, VERSION, WHAT)
(   1,<2015-06-23 18:48:34.904 -0700>,<Administrator>,<X>,<go>,<TOPSPIN 2.1>,
      <created by zg
	started at 2015-06-23 18:37:05.123 -0700,
	POWCHK enabled, PULCHK disabled,
       configuration hash MD5:
       21 0F 79 D6 B3 7B B4 F6 88 20 88 DB 03 48 BD 9F
       data hash MD5: 64K
       C7 FB 16 13 F2 CF 07 D9 82 B8 68 4E 5E AF 7D A1>)
(   2,<2015-06-23 18:48:38.045 -0700>,<Administrator>,<X>,<proc1d>,<TOPSPIN 2.1>,
      <Start of raw data processing
       efp LB = 0.3 FT_mod = 6 PKNL = 1 PHC0 = 0 PHC1 = 0 SI = 128K 
       data hash MD5: 128K
       53 0B B8 98 C2 71 33 67 8C 97 21 18 4E 05 76 19>)
(   3,<2015-06-23 18:48:38.904 -0700>,<Administrator>,<X>,<proc1d>,<TOPSPIN 2.1>,
      <pk PHC0 = -88.04993 PHC1 = 0 
       data hash MD5: 128K
       AD C8 18 DD 4F B7 46 D4 E5 72 AA 57 4F 21 1C 14>)
(   4,<2015-06-23 18:48:39.279 -0700>,<Administrator>,<X>,<proc1d>,<TOPSPIN 2.1>,
      <abs ABSG = 1 
       data hash MD5: 128K
       7D 2C 2C 41 4F 1C 14 D1 40 8C 47 9A DD FF A5 20>)
(   5,<2015-06-23 18:48:39.373 -0700>,<Administrator>,<X>,<proc1d>,<TOPSPIN 2.1>,
      <abs ABSG = 2 
       data hash MD5: 128K
       6B 86 62 35 E4 3C 1F 9E 34 EA FD E7 10 D7 40 34>)
(   6,<2015-06-23 18:48:39.451 -0700>,<Administrator>,<X>,<proc1d>,<TOPSPIN 2.1>,
      <abs ABSG = 3 
       data hash MD5: 128K
       98 7F 12 4F 24 77 8E 1A 0A 21 F7 0D 11 24 4B 14>)
(   7,<2015-06-23 18:48:39.545 -0700>,<Administrator>,<X>,<proc1d>,<TOPSPIN 2.1>,
      <abs ABSG = 4 
       data hash MD5: 128K
       78 51 16 E9 D8 87 6F 81 1E 90 48 01 09 B6 88 89>)
(   8,<2015-06-23 18:48:39.639 -0700>,<Administrator>,<X>,<proc1d>,<TOPSPIN 2.1>,
      <abs ABSG = 5 
       data hash MD5: 128K
       37 A6 3B 1F 65 C9 07 14 2A 62 AF FB 4D 4C 67 44>)
$$ ##END=
$$ 
$$ $$ hash MD5
$$ $$ 8F 03 47 51 B6 4C 11 9E C2 4B 65 DF 54 31 40 6B
##$RELAX= 
##$RELAX= 
##$RELAX= 
##$RELAX= 
##$RELAX= 
##$RELAX= 
##$RELAX= 
##$RELAX= 
$$ Bruker specific parameters
$$ --------------------------
##$DU= <E:\>
##$EXPNO= 12
$$ [...]
##$TP07= 0
##$TPNAME0= <>
##$TPNAME1= <>
##$TPNAME2= <>
##$TPNAME3= <>
##$TPNAME4= <>
##$TPNAME5= <>
##$TPNAME6= <>
##$TPNAME7= <>
##$TPOAL= (0..7)
0.5 0.5 0.5 0.5 0.5 0.5 0.5 0.5
##$TPOFFS= (0..7)
0 0 0 0 0 0 0 0
##$TUNHIN= 0
##$TUNHOUT= 0
##$TUNXOUT= 0
##$USERA1= <user>
##$USERA2= <user>
##$USERA3= <user>
##$USERA4= <user>
##$USERA5= <user>
##$V9= 5
##$VALIST= <valist>
##$VCLIST= <CCCCCCCCCCCCCCC>
##$VD= 0
##$VDLIST= <DDDDDDDDDDDDDDD>
##$VPLIST= <PPPPPPPPPPPPPPP>
##$VTLIST= <TTTTTTTTTTTTTTT>
##$WBST= 2048
##$WBSW= 25
##$XGAIN= (0..3)
0 0 0 0
##$XL= 0
##$YL= 0
##$YMAX_a= 6574985
##$YMIN_a= -12122788
##$ZGOPTNS= <>
##$ZL1= 120
##$ZL2= 120
##$ZL3= 120
##$ZL4= 120
##$ABSF1= 14.96262
##$ABSF2= -5.595562
##$ABSG= 5
##$ABSL= 3
##$ALPHA= 0
##$AQORDER= 0
##$ASSFAC= 0
##$ASSFACI= 0
##$ASSFACX= 0
##$ASSWID= 0
##$AUNMP= <proc_prof1d_extract.lims>
##$AXLEFT= 0
##$AXNAME= <>
##$AXNUC= <1H>
##$AXRIGHT= 0
##$AXTYPE= 0
##$AXUNIT= <>
##$AZFE= 0.1
##$AZFW= 0.1
##$BCFW= 0
##$BC_mod= 0
##$BYTORDP= 0
##$COROFFS= 0
##$CY= 15
##$DATMOD= 1
##$DC= 0
##$DFILT= <>
##$DTYPP= 0
##$F1P= 0
##$F2P= 0
##$FCOR= 0.5
##$FTSIZE= 131072
##$FT_mod= 6
##$GAMMA= 0
##$GB= 0
##$INTBC= 1
##$INTSCL= 1
##$ISEN= 128
##$LB= 0.3
##$LEV0= 0
##$LPBIN= 0
##$MAXI= 10000
##$MC2= 0
##$MEAN= 0
##$ME_mod= 0
##$MI= 0
##$NCOEF= 0
##$NC_proc= -2
##$NLEV= 6
##$NOISF1= 0
##$NOISF2= 0
##$NSP= 0
##$NTH_PI= 0
##$NZP= 0
##$OFFSET= 14.96262
##$PC= 1
##$PHC0= -88.04993
##$PHC1= 0
##$PH_mod= 1
##$PKNL= yes
##$PPARMOD= 0
##$PPDIAG= 0
##$PPIPTYP= 0
##$PPMPNUM= 2147483647
##$PPRESOL= 1
##$PSCAL= 4
##$PSIGN= 0
##$PYNMP= <proc.py>
##$REVERSE= no
##$SF= 400.020008988239
##$SI= 131072
##$SIGF1= 0
##$SIGF2= 0
##$SINO= 400
##$SIOLD= 131072
##$SPECTYP= <>
##$SREGLST= <1H.CDCl3>
##$SSB= 0
##$STSI= 131072
##$STSR= 0
##$SW_p= 8223.68421052631
##$SYMM= 0
##$S_DEV= 0
##$TDeff= 65536
##$TDoff= 0
##$TI= <>
##$TILT= no
##$TM1= 0
##$TM2= 0
##$TOPLEV= 0
##$USERP1= <user>
##$USERP2= <user>
##$USERP3= <user>
##$USERP4= <user>
##$USERP5= <user>
##$WDW= 1
##$XDIM= 131072
##$YMAX_p= 323748653
##$YMIN_p= -10648
##$CURPLOT= <Network HP LaserJet P1505>
##$CURPRIN= <$Network HP LaserJet P1505>
##$DFORMAT= <normdp>
##$LAYOUT= <+/1D_H.xwp>
##$LFORMAT= <normlp>
##$PFORMAT= <normpl>
##$SURQMSG= 1
$$ End of Bruker specific parameters
$$ ---------------------------------
##NTUPLES= NMR SPECTRUM
##VAR_NAME=  FREQUENCY,     SPECTRUM/REAL,   SPECTRUM/IMAG
##SYMBOL=    X,             R,               I
##VAR_TYPE=  INDEPENDENT,   DEPENDENT,       DEPENDENT
##VAR_FORM=  AFFN,          ASDF,            ASDF
##VAR_DIM=   131072,        131072,          131072
##UNITS=     HZ,            ARBITRARY UNITS, ARBITRARY UNITS
##FACTOR=    0.0627417313425164, 1,          1
##FIRST=     8223.62146879497, 3062,         -43118
##LAST=      0,             4564,            -42243
##MIN=       0,             -10648,          0
##MAX=       8223.62146879497, 323748653,    0
$$ Real data points
##PAGE= N=1
##DATA TABLE= (X++(R..R)), XYDATA
$$ [...]
63506A60265j80P7N97Q89O19R3L1P33J710K270K264K030J768J393R27O23N89O01
63488A77299N29O58J303K178K566K113J196M05p4l40l08J59P71Q88L97P5O76J807
63470A92298K260J567P95J361L299N109N394M287L107K852L355L810L806L594
63456B36894L613M066M943O168P551Q807R769J0526J1176J1640J1938J2567J4114
63443C53772J6361J8136J8358J7123J5379J3744J1935R413O241L086O18r03j610
63430D81653j865k066k384k672k701k512k424k703l352m218n189o293p661r383
63416D26230j1207j2486j2697j2119j1626j1645j1533j0392q283o212m940m244
63404C08846l531k688j998j510r30q5Q94J866K864L892M797N471N993O491O999
$$ plain form
63506 160265 160085 160162 160759 161648 162267 162360 162391 163124 164834 167104 169368 171398 173166 174559 175486 176109 176698 177299
63488 177299 177828 178486 179789 181967 184533 186646 187842 188247 188173 187833 187525 187684 188455 189343 189740 189815 190491 192298
63470 192298 194558 196125 196920 198281 201580 206689 212083 216370 219477 222329 225684 229494 233300 236894
63456 236894 240507 244573 249516 255684 263235 272042 281811 292337 303513 315153 327091 339658 353772
63443 353772 370133 388269 406627 423750 439129 452873 464808 474221 480462 483548 484166 483263 481653
63430 481653 479788 477722 475338 472666 469965 467453 465029 462326 458974 454756 449567 443274 435613 426230
63416 426230 415023 402537 389840 377721 366095 354450 342917 332525 324242 318030 313090 308846
63404 308846 305315 302627 300629 299119 298189 298104 298998 300864 303728 307620 312417 317888 323881 330372 337371
63389C37371P632Q650J0074J1400J2038J2146J2576J3738J4780J4395J2377R859
63377D77036P879O235M115J489q02k194l025l777m302m118l223k176j536j498
63363D70103j969k706l452m157n039o299p849r418j0758j1570j1531j0639r428
63350C75288q498p992p748p673p578o992n700m323l750l992m222m023l817l985
63336B94995m236m188l910l491k748j802j334j607j851j319m73l00q13j212j294
63321B64417j658k381k611j755l39P93J421J665J465Q80L83L03L03p5o57q95o56
63304B60603k50J26M63O77O41M43K63P5k34n78q38j075j301j292j032j007j536
63287B54148k042j692o37J54K47J57L06L71N0k95k73j62l32m42P2J019J639J721
$$ plain form
63389 337371 345003 353653 363727 375127 387165 399311 411887 425625 440405 454800 467177 477036
63377 477036 484915 491150 495265 496754 495952 493758 490733 486956 482654 478536 475313 473137 471601 470103
63363 470103 468134 465428 461976 457819 452780 446481 438632 429214 418456 406886 395355 384716 375288
63350 375288 366790 358798 351050 343377 335799 328807 323107 318784 315034 311042 306820 302797 298980 294995
63336 294995 290759 286571 282661 279170 276422 274620 273286 271679 269828 268509 268036 267736 266923 265711 264417
63321 264417 262759 260378 257767 256012 255673 256466 257887 259552 261017 261897 262280 262583 262886 262811 262154 261259 260603
63304 260603 260353 260479 260942 261619 262260 262703 262966 263041 262807 262229 261391 260316 259015 257723 256691 255684 254148
63287 254148 252106 250414 249777 249931 250178 250335 250641 251012 251062 250767 250494 250332 250000 249558 249630 250649 252288 254009
63269B54009J792K152K372J997J237O36L59K09R7K04O84J429K213K900L543M273
63253B80106N097N786O054N892N714O025O897P900Q599R051R699J0777J2012J3048
63239C92657J3929J4998J6341J7549J8111J7911J7292J6760J6575J6566J6377
63228E75066J6002J5919J6440J7119J7231J6795J6548J6796J6906J6254J5154
63217G56230J4283J3625J2502J0439P431L581j000n882j0531j4749j8493k1355
63205G46081k2835k3097k2835k2313k1159j9268j7154j5141j2899j0191p503n321
63193E46365l275p03K238M674O190P311Q792J0870J3217J5337J6904J7947J8767
63180F64634J9499J9875J9608J8851J8058J7539J7334J7298J6976J5727J3365
$$ plain form
63269 254009 255801 257953 260325 262322 263559 264195 264554 264763 264860 265064 265748 267177 269390 272290 275833 280106
63253 280106 285203 290989 297043 302935 308649 314674 321571 329471 338070 347121 356820 367597 379609 392657
63239 392657 406586 421584 437925 455474 473585 491496 508788 525548 542123 558689 575066
63228 575066 591068 606987 623427 640546 657777 674572 691120 707916 724822 741076 756230
63217 756230 770513 784138 796640 807079 814510 818091 817091 811209 800678 785929 767436 746081
63205 746081 723246 700149 677314 655001 633842 614574 597420 582279 569380 559189 551686 546365
63193 546365 543090 542387 544625 549299 555489 562800 571592 582462 595679 611016 627920 645867 664634
63180 664634 684133 704008 723616 742467 760525 778064 795398 812696 829672 845399 858764
63169H58764J0574Q224O397M414J700j823n907j0047j3564j6254j8855k2182k5742
63156G75699k8038k8352k7473k6395k5156k3417k1441j9699j8035j6019j3856
63145E27818j2178j1086j0089q927p814o840n802m836m538n111n769n486m110
63132D35232k456j400j195j564k088k383k142j332l42K77L28J93L91R36J345J318
63116D25118J142J313J880K392K504K388K520L009L360K985J995J289J594K619
63102D56108L436L596L422L242K895K235J611J444J632J816J928K098K219K138
63088D89820K072K375K960L428L732M214M970N613N794N626N484N686O417P583
63074E55774Q675R132Q959Q718Q840R274R847J0590J1544J2670J4080J5954J8071
$$ plain form
63169 858764 869338 877562 883959 888373 890073 888250 882343 872296 858732 842478 823623 801441 775699
63156 775699 747661 719309 691836 665441 640285 616868 595427 575728 557693 541674 527818
63145 527818 515640 504554 494465 485538 477724 470884 465082 460246 455708 450597 444828 439342 435232
63132 435232 432776 431376 430181 428617 426529 424146 422004 420672 420330 420607 420935 421128 421519 422455 423800 425118
63116 425118 426260 427573 429453 431845 434349 436737 439257 442266 445626 448611 450606 451895 453489 456108
63102 456108 459544 463140 466562 469804 472699 474934 476545 477989 479621 481437 483365 485463 487682 489820
63088 489820 491892 494267 497227 500655 504387 508601 513571 519184 524978 530604 536088 541774 548191 555774
63074 555774 564449 573581 582540 591258 600098 609372 619219 629809 641353 654023 668103 684057 702128
63061G02128J9886K1290K2825K4852K6933K8533K9890L1609L3657L5381L6447
63050A013431L7142L7753L8227L8511L8630L8318L7220L5784L5269L6255L7587
63039A424127L7551L5966L4299L3578L3038L1272K8058K4208J9965J4445O907
63028A723414k165j1590k0544k8656l5541m0919m5041m8355n0729n1537n0569
63017A337768m8386m5570m2071l7556l2095k6243k0631j5606j1056o470j369M093
63005A054808R191J3403J6886K0005K2732K4833K6463K8079K9803L1153L1559
62994A308915L1013L0173K9796K9969K9883K8565K5903K2704J9644J6456J2376
62983A585397P099Q74o107j3868k2165l0312l7690m4173m9884n4725n8362o0571
$$ plain form
63061 702128 722014 743304 766129 790981 817914 846447 876337 907946 941603 976984 1013431
63050 1013431 1050573 1088326 1126553 1165064 1203694 1242012 1279232 1315016 1350285 1386540 1424127
63039 1424127 1461678 1497644 1531943 1565521 1598559 1629831 1657889 1682097 1702062 1716507 1723414
63028 1723414 1721249 1709659 1689115 1660459 1624918 1583999 1538958 1490603 1439874 1388337 1337768
63017 1337768 1289382 1243812 1201741 1164185 1132090 1105847 1085216 1069610 1058554 1052084 1050715 1054808
63005 1054808 1063999 1077402 1094288 1114293 1137025 1161858 1188321 1216400 1246203 1277356 1308915
62994 1308915 1339928 1370101 1399897 1429866 1459749 1488314 1514217 1536921 1556565 1573021 1585397
62983 1585397 1592496 1593370 1587263 1573395 1551230 1520918 1483228 1439055 1389171 1334446 1276084 1215513
62971A215513o1392o0974n9390n6718n3288m9718m6550m3821m1096l8006l4565
62960F69995l1007k7507k4247k1480j9285j7418j5610j3974j2799j2028j1244
62949D63396j0152q922p930p380p251p450p827q058p716o612n101l814l038k498
62935C69647j957j692k017k581k753k619k862l571l928l472k841k740k862k594
62921C31158k212k460l295l930l945l547k877j954j257j333j820j742j025o93
62907B99068j301k034j890j012k76j63o04j340j908j741q63j07j34o67j070j277
62891B82681j565j828j745j415j232j302j437j530j486j070k63M13N19L13L03
62876B69356M62M45L26M24O27N19J33j29j23K6M77J368K163K056J158M17K45P0
$$ plain form
62971 1215513 1154121 1093147 1033757 977039 923751 874033 827483 783662 742566 704560 669995
62960 669995 638988 611481 587234 565754 546469 529051 513441 499467 486668 474640 463396
62949 463396 453244 444322 436392 429012 421761 414311 406484 398426 390710 384098 378997 375183 372145 369647
62935 369647 367690 365998 363981 361400 358647 356028 353166 349595 345667 342195 339354 336614 333752 331158
62921 331158 328946 326486 323191 319261 315316 311769 308892 306938 305681 304348 302528 300786 299761 299068
62907 299068 297767 295733 293843 292831 292555 292392 291788 290448 288540 286799 285936 285829 285695 285028 283958 282681
62891 282681 281116 279288 277543 276128 274896 273594 272157 270627 269141 268071 267808 268221 268740 269053 269356
62876 269356 269818 270263 270589 271013 271640 272159 272292 272163 272040 272066 272543 273911 276074 278130 279288 279705 279950 280020
62858B80020n33j072r74n07l19n74r96j353j494j274q25n79o79p65n94m16m01
62841B66665k25K88O38L75l5K28J106J732J613J125Q59J044J618K330K673K220
62825B84254J238N74P74J658K776L861M633M731M157L534L487L942M342M551N049
62810C33561O187P495Q123P918P746Q557J0247J1818J2584J2904J3548J4744J6244
62797D71676J7965K0094K2604K5170K7654L0311L3398L6877M0643M4690M8933
62786H20015N3061N6813O0127O2909O4894O5881O5890O4837O2288N7901N1898
62775A486514M4750L6490K6822J5883M480o645j7343k7669l7209m5283n1628n6490
62763A372672o0041o2145o2779o2349o1335n9859n7845n5391n2651m9529m5859
$$ plain form
62858 280020 279487 278415 277441 276934 276615 276041 275045 273692 272198 270924 270099 269520 268841 268076 267482 267066 266665
62841 266665 266440 266728 267366 267741 267706 267934 269040 270772 272385 273510 274369 275413 277031 279361 282034 284254
62825 284254 285492 286066 286840 288498 291274 295135 299768 304499 308656 312190 315677 319619 323961 328512 333561
62810 333561 339748 347243 355366 363284 371030 379587 389834 401652 414236 427140 440688 455432 471676
62797 471676 489641 509735 532339 557509 585163 615474 648872 685749 726392 771082 820015
62786 820015 873076 929889 990016 1052925 1117819 1183700 1249590 1314427 1376715 1434616 1486514
62775 1486514 1531264 1567754 1594576 1610459 1614939 1608294 1590951 1563282 1526073 1480790 1429162 1372672
62763 1372672 1312631 1250486 1187707 1125358 1064023 1004164 946319 890928 838277 788748 742889
62752G42889m1845l7960l4394l0980k7680k4783k2397k0183j7827j5536j3742
62741D55562j2549j1679j0768r455p552n455l997l437k859j305P35J800J442R10
62727C91393J474K905M114M735N326O395P921R771J1887J4062J5986J7615J9178
62714E12762K0860K2758K5090K8045L1408L4759L8049M1611M5536M9446N2980
62703I03304N6107N8803O0811O1856O1773O0282N7068N2266M6428L9621L1119
62692A489438K0487Q666k762j3224k3345l3450m2615m9711n4792n8802o2154o4143
62680A113593o3950o1809n8874n6094n3467n0414m6692m2751l9227l6264l3454
62669E70597l0349k6925k3591k0825j8790j7179j5500j3615j1913j0851j0396
$$ plain form
62752 742889 701044 663084 628690 597710 570030 545247 522850 502667 484840 469304 455562
62741 455562 443013 431334 420566 411111 403559 398104 394107 390670 387811 386506 387241 389041 390483 391393
62727 391393 392867 395772 399886 404621 409947 416342 424263 434034 445921 459983 475969 493584 512762
62714 512762 533622 556380 581470 609515 640923 675682 713731 755342 800878 850324 903304
62703 903304 959411 1018214 1079025 1140881 1202654 1262936 1320004 1372270 1418698 1458319 1489438
62692 1489438 1509925 1518591 1515829 1502605 1479260 1445810 1403195 1353484 1298692 1239890 1177736 1113593
62680 1113593 1049643 987834 928960 872866 819399 768985 722293 679542 640315 604051 570597
62669 570597 540248 513323 489732 468907 450117 432938 417438 403823 391910 381059 370663
62658C70663j0085r568q860q046p101o060n198m797m885n217n362m819l398j677
62644B85590p36j104k169k869k807k338j848j411j105j102j314j404j267j141
62630B62975j128r46m04K55P49J181J745K266K427K339K485L120M031M840N341
62615B91276N591N872O559P754R126J0360J1666J3465J5640J7534J8834K0068
62603D33745K1971K4658K7608L0260L2277L3427L3588L2944L1939L0836K9338
62592G62591K6705K2422J6771J0677M811r40o906j2737j7576k1101k3867k6406
62580G34444k8558k9959l0657l0739k9810k7639k5046k3331k2729k2113k0409
62569D43454j7731j4916j2502j0585r213q438q143q125q226q207p702o561n166
$$ plain form
62658 370663 360578 351010 342150 334104 327003 320943 315745 310948 306063 300846 295484 290665 287267 285590
62644 285590 284854 283750 281581 278712 275905 273567 271719 270308 269203 268101 266787 265383 264116 262975
62630 262975 261847 260901 260497 260752 261501 262682 264427 266693 269120 271459 273944 277064 281095 285935 291276
62615 291276 296867 302739 309298 317052 326178 336538 348204 361669 377309 394843 413677 433745
62603 433745 455716 480374 507982 538242 570519 603946 637534 670478 702417 733253 762591
62592 762591 789296 811718 828489 839166 843977 843037 836131 823394 805818 784717 760850 734444
62580 734444 705886 675927 645270 614531 584721 557082 532036 508705 485976 463863 443454
62569 443454 425723 410807 398305 387720 378507 370069 361926 353801 345575 337368 329666 323105 317939
62556C17939m163l928m359m997n284m975m433m177m057l313j680rP41O92O50Q43
62540B75490Q18N45P90K154M213O045P165P735Q137Q717R764J1407J3567J6078
62526C72625J8757K1288K3282K4551K5337K6133K7383K9189L1145L2526L2948
62515F65164L2688L2056L0591K7526K2991J8088J3443Q371K014n187j1831j7107
62503H18807k1354k5172k8553l0988l2065l1799l0630k9097k7426k5489k3299
62492E12935k1234j9534j7899j6014j4156j2736j1512r983q404p556p412o917
62480C59578n497m015l584m024m211l585k638k004j776j723j621j265n28L69J020
62465C24496J355J743K442L234L696L688L433L296L550M225N031N591N740N540
$$ plain form
62556 317939 313776 309848 305489 300492 295208 290233 285800 281623 277566 274253 272573 272564 273305 273997 274647 275490
62540 275490 276308 276853 277643 279797 284010 290055 297220 304955 313092 321809 331573 342980 356547 372625
62526 372625 391382 412670 435952 460503 485840 511973 539356 568545 599690 632216 665164
62515 665164 697852 729908 760499 788025 811016 829104 842547 850918 852932 847745 835914 818807
62503 818807 797453 772281 743728 712740 680675 648876 618246 589149 561723 536234 512935
62492 512935 491701 472167 454268 438254 424098 411362 399850 389867 381463 373907 366495 359578
62480 359578 354081 350066 346482 342458 338247 334662 332024 330020 328244 326521 324900 323635 323107 323476 324496
62465 324496 325851 327594 330036 333270 336966 340654 344087 347383 350933 355158 360189 365780 371520 377060
62451C77060M989L955K471R02l51j215j930k797l985n449o876p856q281q472q705
62436C33460q770q205o946n506m473l952l578k924j847o07L40O96N19J43l5L46
62420B88661J440K860L722L527K867K800L463L987L980M288N738P682Q721Q460
62406C52196P676O891N845M549L741L809M061L735L105K869K922K530J477K87
62392D05693n80j027r27o3J380K836L940M707N183N405N719O552P804R053J0414
62377D66089J2571J5692J8898K1244K2846K4517K6612K8625K9868L0101K9611
62366G26674K8775K7620K5778K2998J9592J6086J2488Q386L908o1k872m895o937
62353H77540r305j1810j4318j6726j8704k0001k0933k1998k3069k3405k2526k0721
$$ plain form
62451 377060 382049 386004 388475 389377 389026 387811 385881 383084 379099 373650 366774 358918 350637 342165 333460
62436 333460 324690 316485 309539 304033 299560 295608 292030 289106 287259 286652 286992 287688 288207 288350 288315 288661
62420 288661 290101 292961 296683 300210 303077 305877 309340 313327 317307 321595 327333 335015 343736 352196
62406 352196 359872 366763 372608 377157 380898 384707 388768 392503 395608 398477 401399 403929 405406 405693
62392 405693 405113 404086 403159 403096 404476 407312 411252 415959 421142 426547 432266 438818 446622 455675 466089
62377 466089 478660 494352 513250 534494 557340 581857 608469 637094 666962 697063 726674
62366 726674 755449 783069 808847 831845 851437 867523 880011 888397 892305 892244 889372 884477 877540
62353 877540 868235 856425 842107 825381 806677 786676 765743 743745 720676 697271 674745 654024
62341F54024j8681j6884j5417j4109j2865j1879j1470j1548j1571j1219j0786
62330E07595j0532j0043q817p259o314o136n799m622l097k093j615r43K49J378
62316D41952J706J247P35P49J070J025M82J14N46J427J750J025j87r80r91n72
62300D51098k96m54q39r56n21K08P61J033J359K051L042L947M370M201L852L990
62284D76846M822N800O379O810P739R242J0881J2578J4634J6836J8354J8991J9786
62271F29698K1834K4914K7849K9790L0650L0522K9409K7486K5063K2208J8773
62260I18196J4785J0577O505K791l82k966n304q007j1339j4868j7807j9713k0825
62247H51643k1683k2418k2535k1490j9378j6832j4289j1744r204p035n607m852
$$ plain form
62341 654024 635343 618459 603042 588933 576068 564189 552719 541171 529600 518381 507595
62330 507595 497063 487020 478203 470944 464630 458494 452695 448073 444976 442883 441268 440325 440574 441952
62316 441952 443658 444905 445640 446389 447459 448484 448966 449080 449626 451053 452803 453828 453641 452661 451670 451098
62300 451098 450802 450348 449509 448553 448032 448240 449001 450034 451393 453444 456486 460433 464803 469004 472856 476846
62284 476846 481668 487468 493847 500657 508396 517638 528519 541097 555731 572567 590921 609912 629698
62271 629698 651532 676446 704295 734085 764735 795257 824666 852152 877215 899423 918196
62260 918196 932981 943558 950063 952854 952472 949506 944202 936195 924856 909988 892181 872468 851643
62247 851643 829960 807542 785007 763517 744139 727307 713018 701274 692070 685035 679428 674576
62235F74576m351l636k408p65O62J247J225J601K881M357N019M766M232L830L597
62220F96833L695M308N104N454N265N085N263N574N778O046O570P115P329P287
62206G76706P415P915Q464Q541Q064P627P857Q596R099R219R771J1305J2995J3553
62192I07127J2930J2246J2165J2228J1982J1750J1984J2635J3645J5291J7478
62181A051461J9375K0397K1047K2094K3313K3861K3545K2829K1816K0093J7592
62170A287423J4814J1980Q871N651L174J915J243K22j290k899m525o304p796q178
62156A304301p363o252n645n358m768l776k739j739n85O28J476J812J943K045
62142A273980J904J425R46P23O00M94P60J479J923J468P41Q87J870K508K259J856
$$ plain form
62235 674576 670225 666589 664181 663416 664078 665325 666550 668151 671032 675389 680408 685174 689406 693236 696833
62220 696833 700528 704836 709940 715394 720659 725744 731007 736581 742359 748405 754975 762090 769419 776706
62206 776706 784121 792036 800500 809041 817105 824732 832589 841185 850284 859503 869274 880579 893574 907127
62192 907127 920057 932303 944468 956696 968678 980428 992412 1005047 1018692 1033983 1051461
62181 1051461 1070836 1091233 1112280 1134374 1157687 1181548 1205093 1227922 1249738 1269831 1287423
62170 1287423 1302237 1314217 1323088 1328739 1331913 1333828 1335071 1335293 1334003 1331104 1326579 1320275 1312479 1304301
62156 1304301 1296938 1290686 1285041 1279683 1274915 1271139 1268400 1266661 1266076 1266704 1268180 1269992 1271935 1273980
62142 1273980 1275884 1277309 1278255 1278978 1279578 1280072 1280832 1282311 1284234 1285702 1286443 1287330 1289200 1291708 1293967 1295823
62126A295823J796J460M58k19M81J932K611K216J708J503R82K4m54jM51l7r53
62109A309781j096k24Q94J634J871J534O88m5L1P41J274J360J528K091K610K641
62093A327313K394K287K311K294K409K976M008N261O462P258P290O742O427O820
62079A392252P317P081O401O300O807O560M598J699p32k569m865q022j1112j3190
62065A398525j4513j5917j7522j8730j9343j9991k1258k2871k4064k4503k4507
62054A175306k4401k4043k3141k1738k0181j8712j7365j6194j5334j4657j3707
62043I65833j2229j0646r728r676r797r242p935o646o157o506p104p402p364p265
62029H48136p226p105o796o405o070n740n306m881m779n184n917o565o770o443
$$ plain form
62126 1295823 1297619 1299079 1299537 1299318 1299799 1301731 1304342 1306558 1308266 1309769 1310751 1310775 1310321 1310320 1310771 1310734 1309781
62109 1309781 1308685 1308461 1309355 1310989 1312860 1314394 1315082 1315037 1315068 1315809 1317083 1318443 1319971 1322062 1324672 1327313
62093 1327313 1329707 1331994 1334305 1336599 1339008 1341984 1345992 1351253 1357715 1364973 1372263 1379005 1385432 1392252
62079 1392252 1399569 1406650 1413051 1419351 1426158 1432718 1437316 1439015 1438283 1435714 1430849 1422827 1411715 1398525
62065 1398525 1384012 1368095 1350573 1331843 1312500 1292509 1271251 1248380 1224316 1199813 1175306
62054 1175306 1150905 1126862 1103721 1081983 1061802 1043090 1025725 1009531 994197 979540 965833
62043 965833 953604 942958 933230 923554 913757 904515 896580 889934 883777 877271 870167 862765 855401 848136
62029 848136 840910 833805 827009 820604 814534 808794 803488 798607 793828 788644 782727 776162 769392 762949
62015G62949n784n136m728m474m020l068j760p53q03k031l606m356l908l025k699
62000G12798l089l592l827m060m622n278n509n184m688m478m608m753m558m024
61986F50528l522l353l318k928k066j158n28M8Q96J801K294K428K782L584M317
61971F51805M465M252M302M834N562O245O883P432P749P977Q549R674J1037J2283
61957G53049J3448J4697J5886J6790J7588J8639J9853K0804K1470K2423K4011
61946I58658K5818K7264K8422K9818L1686L3723L5594L7283L8972M0836M2994
61935A331068M5412M7923N0457N3230N6497O0251O4391O9101P4725Q1309Q8564
61924B022928R6257J04327J12726J21511J31084J41798J53219J64159J73780J82273
$$ plain form
62015 762949 757165 752029 747301 742827 738807 735739 733979 733226 732423 730392 726786 722430 718522 715497 712798
62000 712798 709709 706117 702290 698230 693608 688330 682821 677637 672949 668471 663863 659110 654552 650528
61986 650528 647006 643653 640335 637407 635341 634183 633655 633703 634599 636400 638694 641122 643904 647488 651805
61971 651805 656270 660522 664824 669658 675220 681465 688348 695780 703529 711506 720055 729729 740766 753049
61957 753049 766497 781194 797080 813870 831458 850097 869950 890754 912224 934647 958658
61946 958658 984476 1011740 1040162 1069980 1101666 1135389 1170983 1208266 1247238 1288074 1331068
61935 1331068 1376480 1424403 1474860 1528090 1584587 1644838 1709229 1778330 1853055 1934364 2022928
61924 2022928 2119185 2223512 2336238 2457749 2588833 2730631 2883850 3048009 3221789 3404062
61914C404062J90241J97596K03433K06719K06762K03040J94920J81717J62984
61905E151474J38844J09989P7279M1402L190l5753p3217j07461j37842j64131
61895E003774j85571k01107k10491k14684k15021k12303k06799j98840j89103
61886C169855j78314j66926j55194j43489j32352j22179j12959j04450r6441q8716
61876A868835q1011p3272o5904n9372n3614m8194m2966l8124l3649k9316k5337
61865A318076k2291k0111j7765j4494j0810p726n467l620k111j178n01O61K334
61852A214997L533L408K210Q39j03n03l88K45J269K372L145L383L361L748N012
61837A246528O867Q489R211Q907P946O983O634O946P318P207O803O697P121P918
$$ plain form
61914 3404062 3594303 3791899 3995332 4202051 4408813 4611853 4806773 4988490 5151474
61905 5151474 5290318 5400307 5477586 5518988 5522178 5486425 5413208 5305747 5167905 5003774
61895 5003774 4818203 4617096 4406605 4191921 3976900 3764597 3557798 3358958 3169855
61886 3169855 2991541 2824615 2669421 2525932 2393580 2271401 2158442 2053992 1957551 1868835
61876 1868835 1787824 1714552 1648648 1589276 1535662 1487468 1444502 1406378 1372729 1343413 1318076
61865 1318076 1295785 1275674 1257909 1243415 1232605 1224879 1219412 1215792 1213681 1212503 1212002 1212663 1214997
61852 1214997 1218530 1221938 1224148 1224987 1224884 1224381 1223993 1224238 1225507 1227879 1231024 1234407 1237768 1241516 1246528
61837 1246528 1253395 1261884 1271095 1280002 1287948 1294931 1301565 1308511 1315829 1323036 1329839 1336536 1343657 1351575
61823A351575R056J0620J2406J4169J6196J9026K2540K5942K8820L1609L4823
61812A576782L8327M1712M4934M8295N2118N6639O1889O7547P3190P8813Q4703
61801B224949R0828R6919J03278J10881J20406J31620J43886J56688J69504J82017
61791C530976J94893K09562K26576K44750K62580K79898K97250L14166L29172
61782E889823L41387L50976L57741L60079L55766L43315L22241K92417K53711
61773H867456K06277J50981Q9406K3489m4744j12834j77518k35324k83948l22806
61763H160435l52054l71655l81839l83911l79819l70985l58144l42086l23953
61754D895989l04697k84890k65064k45768k27229k09416j92494j76877j62769
$$ plain form
61823 1351575 1360631 1371251 1383657 1397826 1414022 1433048 1455588 1481530 1510350 1541959 1576782
61812 1576782 1615109 1656821 1701755 1750050 1802168 1858807 1920696 1988243 2061433 2140246 2224949
61801 2224949 2315777 2412696 2515974 2626855 2747261 2878881 3022767 3179455 3348959 3530976
61791 3530976 3725869 3935431 4162007 4406757 4669337 4949235 5246485 5560651 5889823
61782 5889823 6231210 6582186 6939927 7300006 7655772 7999087 8321328 8613745 8867456
61773 8867456 9073733 9224714 9314120 9337609 9292865 9180031 9002513 8767189 8483241 8160435
61763 8160435 7808381 7436726 7054887 6670976 6291157 5920172 5562028 5219942 4895989
61754 4895989 4591292 4306402 4041338 3795570 3568341 3358925 3166431 2989554 2826785
61745B826785j50105j38849j28966j20005j11276j02536r4164q6566p9764p3638
61735A740916o8100o2937n7916n3219m9342m6333m3540m0380l7117l4472l2653
61724A214907l1118k9299k7298k5637k4483k3361k1864k0317j9402j9104j8656
61713I54368j7658j6663j6261j6213j5997j5703j5649j5510j4707j3434j2445
61702G84128j1954j1534j1024j0608j0052q901p577p216q082r120r462r464r679
61689F59455r760r182q273p762p749p863p972q037p714o894o246o402o925o938
61675E51738o459o272o545o536n812m869m377m428m769n197n390m930l907l085
61661D79162l057l478l479k662j417l43K77M54K88q0m41p18j066j618k091j999
$$ plain form
61745 2826785 2676680 2537831 2408865 2288860 2177584 2075048 1980884 1894318 1814554 1740916
61735 1740916 1672816 1609879 1551963 1498744 1449402 1403069 1359529 1319149 1282032 1247560 1214907
61724 1214907 1183789 1154490 1127192 1101555 1077072 1053711 1031847 1011530 992128 973024 954368
61713 954368 936710 920047 903786 887573 871576 855873 840224 824714 810007 796573 784128
61702 784128 772174 760640 749616 739008 728956 720055 712478 705262 697180 688060 678598 669134 659455
61689 659455 649695 640513 632240 624478 616729 608866 600894 592857 585143 578249 572003 565601 558676 551738
61675 551738 545279 539007 532462 525926 520114 515245 510868 506440 501671 496474 491084 486154 482247 479162
61661 479162 476105 472627 469148 466486 465069 464726 465003 465457 465745 465665 465224 464506 463440 461822 459731 457732
61645D57732j377r81j374k061k070j274m98l16l94l44m10q74j306j084l44K04
61629D43229K01r7l78o12q68j192j617j987j949j405q59r52j744k727l359l383
61613D20301k836k101j652j475j019n9P17M95o01j729k367k536k313j786j356
61598C99683j407j681j533q29K2P94J627K438K838K772K640K687K728K653K688
61583D18120L044L670M467N284N807N859N835O275P092P808Q505R730J1375J2537
61569E15408J2809J2887J3442J4069J4017J3454J3319J4143J5465J6365J6283
61558F71661J5460J4697J4467J4291J3371J1871J0910J1166J2058J2729J3093
61547H15774J3430J3499J2817J1497J0152R079Q049O872N747M952M474L953K944
$$ plain form
61645 457732 456355 455374 454000 451939 449869 448595 448097 447781 447387 447043 446633 445759 444453 443369 443025 443229
61629 443229 443430 443333 442955 442343 441475 440283 438666 436679 434730 433325 432466 431514 429770 427043 423684 420301
61613 420301 417465 415364 413712 412237 411218 411159 411876 412371 411770 410041 407674 405138 402825 401039 399683
61598 399683 398276 396595 395062 394233 394255 395049 396676 399114 401952 404724 407364 410051 412779 415432 418120
61583 418120 421164 424834 429301 434585 440392 446251 452086 458361 465453 473261 481766 491496 502871 515408
61569 515408 528217 541104 554546 568615 582632 596086 609405 623548 639013 655378 671661
61558 671661 687121 701818 716285 730576 743947 755818 766728 777894 789952 802681 815774
61547 815774 829204 842703 855520 867017 877169 886248 894297 901169 906916 911868 916342 920295 923239
61534I23239J378k04j119j302j267j294j114n39J32O46J210K127L364M819O554
61519I36630Q469J0259J2011J4302J7335K0525K3436K6457K9982L3502L6327L8803
61507A208038M2030M6541N1932N7537O2802O7248P0841P4294P8401Q3119Q7824
61496A930607R2179R6041R8768R9412R7573R3476Q7271P8997O9015N7771M5161
61485B846271L0950J5741Q47j2882k5316l6250m5187n2116n7527o1553o3855o4554
61473B474569o4402o3631o1541n7704n2846m8050m3680l9533l5442l1235k6692
61462A949813k2058j8001j4559j0770o000j027K995O168R464J3090J6173J8131
61450A943419J9470K0987K2819K4513K5608K5946K5788K5789K6598K8221K9974
$$ plain form
61534 923239 924617 924413 923294 921992 920725 919431 918317 917778 917910 918556 919766 921893 925257 930076 936630
61519 936630 945099 955358 967369 981671 999006 1019531 1042967 1069424 1099406 1132908 1169235 1208038
61507 1208038 1250068 1296609 1348541 1406078 1468880 1536128 1606969 1681263 1759664 1842783 1930607
61496 1930607 2022786 2118827 2217595 2317007 2414580 2508056 2595327 2674324 2743339 2801110 2846271
61485 2846271 2877221 2892962 2893809 2880927 2855611 2819361 2774174 2722058 2664531 2602978 2539123 2474569
61473 2474569 2410167 2346536 2284995 2227291 2174445 2126395 2082715 2043182 2007740 1976505 1949813
61462 1949813 1927755 1909754 1895195 1884425 1878425 1877398 1880393 1886561 1896025 1909115 1925288 1943419
61450 1943419 1962889 1983876 2006695 2031208 2056816 2082762 2108550 2134339 2160937 2189158 2219132
61439B219132L1089L1263L0636K9424K7660K5201K2088J8918J6626J5594J5128
61428B482759J4125J2137R529O750L912J085j408l236m422n333o439q072j0175
61415B491212j2240j3739j4704j5717j7141j8562j9237j8977j8281j7550j6508
61404B308556j4699j2426j0684j0049r879r003p064m857l313k463j580n4K079
61391B224564M427O787R309J2186J5394J8881K2928K8008L4193M0967M7828N4844
61379B520316O2248O9811P6978Q3554Q9788R5765J01121J05372J08126J08907
61369C421986J07223J02965R6433Q7793P6855O3531M8153L1164J2878o217k5156
61358D017608m2793n8367p1691q2970r2496j00285j06032j09560j11325j12065
$$ plain form
61439 2219132 2250221 2281484 2312120 2341544 2369204 2394405 2416493 2435411 2452037 2467631 2482759
61428 2482759 2496884 2509021 2518550 2525300 2529212 2530297 2528889 2525653 2521231 2515898 2509459 2501387 2491212
61415 2491212 2478972 2465233 2450529 2434812 2417671 2399109 2379872 2360895 2342614 2325064 2308556
61404 2308556 2293857 2281431 2270747 2260698 2250819 2241816 2234752 2229895 2226582 2224119 2222539 2222485 2224564
61391 2224564 2228991 2235778 2245087 2257273 2272667 2291548 2314476 2342484 2376677 2417644 2465472 2520316
61379 2520316 2582564 2652375 2729353 2812907 2902695 2998460 3099581 3204953 3313079 3421986
61369 3421986 3529209 3632174 3728607 3816400 3893255 3956786 4004939 4036103 4048981 4042764 4017608
61358 4017608 3974815 3916448 3844757 3761787 3669291 3569006 3462974 3353414 3242089 3130024
61348C130024j12016j10813j08211j04434r9762r4280q8153q1747p5285o8802
61338B186521o2460n6375n0136m3187l5870k9294k3903j8900j3585q359l841K61
61326A840872M578Q992J2954J6437J9626K2080K3102K2769K1709K0103J7722J4777
61314B045721J1835Q996O048L378J799J359J259J056J064J438J734J714J668J632
61300B090701J080j24j293j936k559l840n564p106q466j0114j2041j3728j4940
61287B010070j6012j7266j8559j9524j9961j9956j9625j8808j7105j4484j1779
61276A816991j0133r918j0554j1435j2453j3521j4314j4921j6033j7864j9365
61265A666480j9301j7751j5810j3934j1489p991l949k07L050O146R253J2328J5533
$$ plain form
61348 3130024 3018008 2907195 2798984 2694550 2594788 2500508 2412355 2330608 2255323 2186521
61338 2186521 2124061 2067686 2017550 1974363 1938493 1909199 1885296 1866396 1852811 1844452 1840611 1840872
61326 1840872 1845450 1854442 1867396 1883833 1903459 1925539 1948641 1971410 1993119 2013222 2030944 2045721
61314 2045721 2057556 2066552 2072600 2075978 2077777 2079136 2080395 2081451 2082515 2083953 2085687 2087401 2089069 2090701
61300 2090701 2091781 2091657 2090364 2088428 2085869 2082029 2076465 2069359 2060893 2050779 2038738 2025010 2010070
61287 2010070 1994058 1976792 1958233 1938709 1918748 1898792 1879167 1860359 1843254 1828770 1816991
61276 1816991 1806858 1796940 1786386 1774951 1762498 1748977 1734663 1719742 1703709 1685845 1666480
61265 1666480 1647179 1629428 1613618 1599684 1588195 1580204 1576255 1576048 1579098 1585244 1594497 1606825 1622358
61252A622358J9212K3393K7582L1278L4600L8158M2252M6371M9747N2248N4297
61241B041496N5765N5510N2382M6553L9320L1762K3877J5133N363m964j5114k4503
61229B322580l2887m0306m6835n2387n6806o0089o2223o2874o1550n8307n4105
61218A734211n0193m7160m4718m2324l9782l7168l4512l1675k8553k5257k2176
61207A330693j9954j9141j9601k0368k0473j9895j9336j9078j8554j7316j5811
61196A121166j4733j4026j3149j2106j1528j1732j2323j2807j3032j2845j2021
61185I80864j0787r977j0133j0731j0718r748q585q243q870r489q899o889m451
61172H63344k599j286J20J620K578K867L178L828M155L456J914l7k630o236j0299
$$ plain form
61252 1622358 1641570 1664963 1692545 1723823 1758423 1796581 1838833 1885204 1934951 1987199 2041496
61241 2041496 2097261 2152771 2205153 2251706 2291026 2322788 2346665 2361798 2367161 2362197 2347083 2322580
61229 2322580 2289693 2249387 2202552 2150165 2093359 2033270 1971047 1908173 1846623 1788316 1734211
61218 1734211 1684018 1636858 1592140 1549816 1510034 1472866 1438354 1406679 1378126 1352869 1330693
61207 1330693 1310739 1291598 1271997 1251629 1231156 1211261 1191925 1172847 1154293 1136977 1121166
61196 1121166 1106433 1092407 1079258 1067152 1055624 1043892 1031569 1018762 1005730 992885 980864
61185 980864 970077 960100 949967 939236 928518 918770 910185 901942 893072 883583 874684 867795 863344
61172 863344 860745 859459 859579 861199 863777 866644 869822 873650 877805 881261 883175 883138 880508 874272 863973
61157H63973j3653j5773j7022j7750j7804j7039j5728j4275j2902j1743j0861
61146F99423j0116r360q808q860r499j0152j0310r932r204q167o885n735n216
61133E87179n396n699n408m424l377k808k433j552j13J175J877K378L061L575
61119E68035L444K930K479J683l24l420o330q049q735q995q957q534q062q062
61105E09103q537q963q956q656q413q313q113p651p149o944o878o322n024l637
61091D05547l001l138l349l190k866k686k579k329j858j240o52l29k34N4Q36J750
61075C80736K247K442K891L661M274M622N117N735N782M961M017L813M336M985
61061D39619N263M817L488J857J086J578K291K080J113K08n88j688k724k845k175
$$ plain form
61157 863973 850320 834547 817525 799775 781971 764932 749204 734929 722027 710284 699423
61146 699423 689307 679947 671139 662279 652780 642628 632318 622386 613182 605015 598130 592395 587179
61133 587179 581783 576084 570676 566252 562875 560067 557634 556082 555969 557144 559021 561399 564460 568035
61119 568035 571479 574409 576888 578571 578247 574827 568497 560448 551713 542718 533761 525227 517165 509103
61105 509103 500566 491603 482647 473991 465578 457265 449152 441501 434352 427408 420530 414208 409184 405547
61091 405547 402546 399408 396059 392869 390003 387317 384738 382409 380551 379311 378659 378330 378096 378150 378986 380736
61075 380736 382983 385425 388316 391977 396251 400873 405990 411725 417507 422468 426485 430298 434634 439619
61061 439619 444882 449699 453187 455044 456130 457708 459999 462079 463192 463400 462812 461124 458400 455555 453380
61046D53380j773k039k304k184k158k414k238j304n76r97j952k083j202l24J4
61031D29846M34J621L354M963O141P005P812Q888J0460J2399J4480J6972K0469
61018E44844K4918K9461L3679L8446M4922N3011O1569O9888P8016Q5326Q9516
61007A153596Q7534P7468N9666L6908J3927m020j3325j3554p225J302O805M497
60995A403579p808k8061n0941p0781q3855q8811q6285p8466o8154n7441m7307
60984G35669l8331l1076k5475k0626j5809j1429q361o735n885n223m590l927l252
60971E54950k943l469m712n966o650o744o479o030n583n421n735o519p631q717
60957D72351r238q865p930p163o930o996o982o761o377n893n363m757l877k649
$$ plain form
61046 453380 451607 449568 447264 445080 442922 440508 438270 436966 436390 435393 433441 431358 430156 429832 429846
61031 429846 430280 431901 435255 440218 446359 453364 461176 470064 480524 492923 507403 524375 544844
61018 544844 569762 599223 632902 671348 716270 769281 830850 900738 978754 1064080 1153596
61007 1153596 1241130 1318598 1378264 1415172 1429099 1425079 1411754 1398200 1390975 1392277 1399082 1403579
60995 1403579 1395771 1367710 1316769 1245988 1162133 1073322 987037 908571 840417 782976 735669
60984 735669 697338 666262 640787 620161 604352 592923 584562 577827 571942 566719 562129 558202 554950
60971 554950 552007 548538 543826 537860 531210 524466 517987 511957 506374 500953 495218 488699 481068 472351
60957 472351 463113 454248 446318 439155 432225 425229 418247 411486 405109 399216 393853 389096 385219 382570
60943C82570j413n69oP10J623K376K997L879M824M864L641K361K444L618M191
60928D18110L245J593L94l17j110j880j895j081m25p89j771k218j675q75p34j259
60912D07313j723j645j209p81m96l59l74l83j51J94J32n37j274j539j646k311
60896C93211l493m378m566m587m911n089m420l120k092j713j439o61N67J818K833
60881C57960L546L904M029M294M934N694O198O527P090P887Q319P856O648N255
60867D40141M007K953K247K198K843L720M275M318M030L629L142K404J226k90
60853D80843j566j947j467r41r92j259j049o06r90k559m259m870m493m159m325
60838D45361m468m083l324k537j796j201j144j758k431k355j483o01m53j050j809
$$ plain form
60943 382570 381157 380588 380582 381292 382915 385291 388288 392167 396991 401855 405496 407857 410301 413919 418110
60928 418110 421355 422948 423342 423025 421915 420035 418140 417059 416634 415845 414074 411856 410181 409306 408572 407313
60912 407313 405590 403945 402736 401955 401459 401100 400726 400343 400192 400386 400518 399981 398707 397168 395522 393211
60896 393211 389718 385340 380774 376187 371276 366187 361767 358647 356555 354842 353403 352742 353309 355127 357960
60881 357960 361506 365410 369439 373733 378667 384361 390559 397086 404176 412063 420382 428238 434886 440141
60867 440141 444148 447101 449348 451546 454389 458109 462384 466702 470732 474361 477503 479907 481133 480843
60853 480843 479277 477330 475863 474922 473930 472671 471622 471016 470026 467467 463208 458338 453845 449686 445361
60838 445361 440893 436810 433486 430949 429153 427952 426808 425050 422619 420264 418781 418180 417727 416677 414868
60823D14868k144j964j712j839k233k319j835j186q04m75K61J254J815J611J030
60808D04328O18O12J051J867K666K840K267J521J129R65O72L72M58Q83J180J162
60792D24591J162J395J587J431J134J113J326J261O91Q9P1N41P55K44n98j062
60776D35731r77p43n63j54P10J674K115J819J138N89M66P11J042J203J123Q50
60760D46734M01j63n81o34n38o75r92j073j018j514k663l392k807j686j665l107
60744D24627m724n344n094m580l860k835j916j545j476j137m94Q6N33J068J653
60729C94962K076K422K919L312L051K123J158N67R8n88j397k127k819l512l990
60714C98255m088l998l941l878l747l753m029m287m169l770l470l355l163k727
$$ plain form
60823 414868 412724 410760 409048 407209 404976 402657 400822 399636 398832 398357 398618 399872 401687 403298 404328
60808 404328 404946 405558 406609 408476 411142 413982 416249 417770 418899 419864 420536 420908 421366 422249 423429 424591
60792 424591 425753 427148 428735 430166 431300 432413 433739 435000 435691 435780 435851 436392 437147 437391 436793 435731
60776 435731 434754 434011 433448 433294 434004 435678 437793 439612 440750 441339 441805 442516 443558 444761 445884 446734
60760 446734 447135 446972 446391 445757 445219 444544 443552 442479 441461 439947 437284 433892 431085 429399 427734 424627
60744 424627 419903 414559 409465 404885 401025 398190 396274 394729 393253 392116 391622 391708 392241 393309 394962
60729 394962 397038 399460 402379 405691 408742 410865 412023 412590 412688 412100 410703 408576 405757 402245 398255
60714 398255 394167 390169 386228 382350 378603 374850 370821 366534 362365 358595 355125 351770 348607 345880
60700C45880k087j365p95p88j453k159k075j224m87m79q74j055r54q54p20k23
60684C28288P09J708K415K775K966L132L243L104K599J961J692K053K795L456
60670C62896L808L900L874L930M302N019N754O134O190O288O732P488Q175Q237
60656D42727P390O067N173N103N302N039M281L401K354R09n27j145r57j031k121
60641D81965l647m491m353l843l502l308l034k677k385k221k083j823j483j375
60627D41740j734k279k397j892j181o48j86L89Q73R79P99N10l9r51j663j415l15
60610D30590N66M31m06j086j253j281j626k277k703k337j138J92P77M11k86o24
60594D17950n35l76k78nN59J068J041M20k99n69l42o7j76n49o42p2R10J604J529
$$ plain form
60700 345880 343793 342428 341633 340845 339392 337233 335158 333934 333447 332968 332094 331039 330085 329231 328511 328288
60684 328288 328997 330705 333120 335895 338861 341993 345236 348340 350939 352900 354592 356645 359440 362896
60670 362896 366704 370604 374478 378408 382710 387729 393483 399617 405807 412095 418827 426315 434490 442727
60656 442727 450117 456184 461357 466460 471762 476801 481082 484483 486837 487746 487219 486074 485117 484086 481965
60641 481965 478318 473827 469474 465631 462129 458821 455787 453110 450725 448504 446421 444598 443115 441740
60627 441740 440006 437727 435330 433438 432257 431609 431423 431812 432685 433664 434463 434973 434934 433983 432320 430905 430590
60610 430590 431156 431587 431181 430095 428842 427561 425935 423658 420955 418618 417480 417672 418449 418860 418574 417950
60594 417950 417415 417039 416761 416756 417315 418383 419424 419844 419545 418976 418634 418567 418391 417842 417200 417128 418038 419642 421171
60575D21171Q47O6n32r39r65j92J248K318K082R89N03J308K475K708J857Q26M19
60558D36189Q42J972L477M753N371N657O377P799R409J0653J1608J2818J4749
60545E31674J7445K0442K3026K4861K6360K8042K9505K9463K7043K2607J7090
60534G97558J0892L934l459j0279j5628j9452k2228k4101k4621k3400k0768j7592
60522F30856j4518j1665q980o522m287k080J56K180L903N798Q414J1690J5024
60509F29969J7982K0540K2805K4855K6745K8191K8319K6312K2339J7402J2164
60498H77623O546O27m640q086r300q525n955j689L794R684J5559K1750K8893L7173
60484I63454M6126N5072O3689P2079Q0360Q8364R5943J03184J09780J14213J14187
$$ plain form
60575 421171 422018 422084 421552 420613 419648 419456 420704 423022 425104 426093 426596 427904 430379 433087 434944 435770 436189
60558 436189 437031 439003 442480 447233 452604 458261 464638 472437 481846 492499 504107 516925 531674
60545 531674 549119 569561 592587 617448 643808 671850 701355 730818 757861 780468 797558
60534 797558 808450 812384 808925 798646 783018 763566 741338 717237 692616 669216 648448 630856
60522 630856 616338 604673 595693 589171 584884 582804 582960 585140 589043 594841 603255 614945 629969
60509 629969 647951 668491 691296 716151 742896 771087 799406 825718 848057 865459 877623
60498 877623 884169 884796 880156 872070 862770 854245 848290 846601 850395 860079 875638 897388 926281 963454
60484 963454 1009580 1064652 1128341 1200420 1280780 1369144 1465087 1568271 1678051 1792264 1906451
60473A906451J08085R5651P7179N2785K3088r828m2873p3301r9203j19010j31419
60462A787605j36181j34427j27937j18288j06826r4909q3647p3447o4183n5773
60452G91987m8370m2053l6598l1701k7225k3240j9911j7424j5786j4582j3158
60441E01939j1288r504q462q071p616o725n767n169m741m039l042k187j843j987
60427D21498k279k287j876j472j585j911j418J87J766K069J369R04J062J149Q47
60412D18023P73J361K195K813L374M053M541M641M755N192N599N586N422N501
60398D73829N658N582N447N468N280M461L397K851K860K767K252J619J103N86
60384E23160Q1j06J90P51J262J527J431J017O59P59J279J818J999J696J046N26
$$ plain form
60473 1906451 2014536 2110187 2187366 2240151 2263239 2253411 2210538 2137237 2038034 1919024 1787605
60462 1787605 1651424 1516997 1389060 1270772 1163946 1069037 985390 911943 847760 791987
60452 791987 743617 701564 664966 633265 606040 582800 562889 545465 529679 515097 501939
60441 501939 490651 481147 472685 464614 456998 450273 444506 439337 434596 430557 427515 425328 423485 421498
60427 421498 419219 416932 415056 413584 411999 410088 408670 408857 410623 412692 414061 414965 416027 417176 418023
60412 418023 418796 420157 422352 425165 428539 432592 437133 441774 446529 451721 457320 462906 468328 473829
60398 473829 479487 485069 490516 495984 501264 505725 509122 511973 514833 517600 519852 521471 522574 523160
60384 523160 523241 523135 523325 524076 525338 526865 528296 529313 529972 530731 532010 533828 535827 537523 538569 539095
60368E39095O93J437J885J482Q10P35J064Q57r1r46j044o09j62J00J23j83o58
60351E44588r66j058j131j004k33J011J877J921J635J538J449J084P63Q05P80
60336E53059M0j212k121k332k342k722l463m198m656m756m525m039l395k688k084
60321E08566j757j682j592j316r17m59J30P61J062Q46M81M12M75J03q53j918k643
60304D99699l070l444l771l891l780l575l362l153k964k837k685k299j566o73
60290D58629K1L49M87O67Q65R24R04J087J600K255K831L341L850M168L972L228
60274D89178K357J943K239K956L474L371K773K210K116K525L246M130N071N830
60260E33419O166O136O063O127O145N985O014O692P756Q289P945P649Q493J0224
$$ plain form
60368 539095 539788 541225 543110 544592 545402 546137 547201 548058 547967 547021 545977 545368 545206 545306 545429 545246 544588
60351 544588 543622 542564 541433 540429 540196 541207 543084 545005 546640 548178 549627 550711 551474 552279 553059
60336 553059 553099 551887 549766 547434 545092 542370 538907 534709 530053 525297 520772 516733 513338 510650 508566
60321 508566 506809 505127 503535 502219 501302 500843 500973 501734 502796 503642 504123 504535 505010 505113 504260 502342 499699
60304 499699 496629 493185 489414 485523 481743 478168 474806 471653 468689 465852 463167 460868 459302 458629
60290 458629 458650 458999 459486 460153 461018 461942 462846 463933 465533 467788 470619 473960 477810 481978 485950 489178
60274 489178 491535 493478 495717 498673 502147 505518 508291 510501 512617 515142 518388 522518 527589 533419
60260 533419 539585 545721 551784 557911 564056 570041 576055 582747 590503 598792 606737 614386 622879 633103
60246F33103J1490J1610J1391J1969J3538J5563J7657J9744K1773K3838K6259
60235H17935K9127L2022L4640L7371M0755M4677M8640N2508N6415O0205O3690
60224A317985O7127P0669P3527P4597P3853P2260P0231O7044O2065N5634M8455
60213B053447M0805L2748K4486J6181P931J02o877j3184j9254k4632k8033k8959
60201B054761k8279k6747k3943j9443j4036q743l283L368J1269J9481K7479L5560
60189B027444M3927N2242O0134O7361P3397P7624Q0037Q1115Q0887P8638P3653
60178B796459O5756N5204M2667K9327J6298L754q873k1728l4062m5025n4285o1761
60166B783731o7247p0609p1853p0827o7215o1103n3130m3934l3814k3081j2251
$$ plain form
60246 633103 644593 656203 667594 679563 693101 708664 726321 746065 767838 791676 817935
60235 817935 847062 879084 913724 951095 991850 1036527 1085167 1137675 1194090 1254295 1317985
60224 1317985 1385112 1455781 1529308 1603905 1677758 1750018 1820249 1887293 1949358 2004992 2053447
60213 2053447 2094252 2127000 2151486 2167667 2175598 2175700 2168823 2155639 2136385 2111753 2083720 2054761
60201 2054761 2026482 1999735 1975792 1956349 1942313 1933570 1930287 1933655 1944924 1964405 1991884 2027444
60189 2027444 2071371 2123613 2183747 2251108 2324505 2402129 2482166 2563281 2644168 2722806 2796459
60178 2796459 2862215 2917419 2960086 2989413 3005711 3009465 3000592 2978864 2944802 2899777 2845492 2783731
60166 2783731 2716484 2645875 2574022 2503195 2435980 2374877 2321747 2277813 2243999 2220918 2208667
60155B208667j559R238K0132L0266L8543M4716M9356N2780N4478N3728N0481M5367
60143B656193L9029L1753K3788J5668P875L64p111j4168j9778k3266k4818k4631
60131B660898k2146j6806r240q10Q003J7945K9579M2300N5163O8018Q1310R5143
60119C009357J09106J22752J35848J48237J59906J71043J81578J90704J97267
60110D425798K00669K01014J98297J91889J81133J66280J48348J28100J05529
60101E947057Q0465N3411K5391k833l0908n8270q3816j06512j26082j42704j56249
60090E398950j66057j71482j72458j69504j63404j54855j44265j31861j17979
60081D007085j03145q7884p2582n7550m2979k8848j5174k493Q403J7336K4962
$$ plain form
60155 2208667 2207108 2216346 2236478 2266744 2305287 2350003 2399359 2452139 2506617 2560345 2610826 2656193
60143 2656193 2695222 2726975 2750763 2766431 2774306 2774670 2767559 2753391 2733613 2710347 2685529 2660898
60131 2660898 2638752 2621946 2612706 2611896 2619899 2637844 2667423 2709723 2764886 2832904 2914214 3009357
60119 3009357 3118463 3241215 3377063 3525300 3685206 3856249 4037827 4228531 4425798
60110 4425798 4626467 4827481 5025778 5217667 5398800 5565080 5713428 5841528 5947057
60101 5947057 6027522 6080933 6106324 6103491 6072583 6014313 5930497 5823985 5697903 5555199 5398950
60090 5398950 5232893 5061411 4888953 4719449 4556045 4401190 4256925 4125064 4007085
60081 4007085 3903940 3816056 3743474 3685924 3642945 3614097 3598923 3596430 3604833 3622169 3647131
60070C647131L1751L7164M0219M0520L8331L4023K7998K0877J3155M793m422j4357
60058C917183k4757l5547m6288n5781o3131o8912p4316p9273q2516q3533q3275
60047C219854q2522q0669p6770p0977o4152n6670m8238l8567k7645j5717l405
60036B654522Q478J9711L0900M2469N3849O4080P2815Q0139Q5714Q8817Q9125
60025C290619Q6877Q2283P5165O5291N2825L8409K2930P061r018k5277m1164n5690
60013C590311o8345p9367q8803r5799r9312r9229r6273r1152q4254p5869o6196
60002B645712n5312m3608l2020k1256j0931p4J1662K3739L5633M7338N8997P0570
59990B730450Q1939R2858J02712J10723J16468J19791J20237J17077J10005R9506
$$ plain form
60070 3647131 3678882 3716046 3756265 3796785 3835116 3869139 3897137 3918014 3931169 3935962 3931540 3917183
60058 3917183 3892426 3856879 3810591 3754810 3691679 3622767 3548451 3469178 3386662 3303129 3219854
60047 3219854 3137332 3056663 2979893 2908916 2844764 2788094 2739856 2701289 2673644 2657927 2654522
60036 2654522 2663000 2682711 2713611 2756080 2809929 2874009 2946824 3026963 3112677 3201494 3290619
60025 3290619 3377496 3459779 3534944 3600235 3653060 3691469 3714399 3721460 3712442 3687165 3646001 3590311
60013 3590311 3521966 3442599 3353796 3257997 3158685 3059456 2963183 2872031 2787777 2711908 2645712
60002 2645712 2590400 2546792 2514772 2493516 2482585 2482511 2494173 2517912 2553545 2600883 2659880 2730450
59990 2730450 2812389 2905247 3007959 3118682 3235150 3354941 3475178 3592255 3702260 3801766
59980C801766Q6311P0904N3703L5376J6710j691j9486l6498n2669o7855q1550
59969C805021r2838j00665j04259j03508r9057r1899q2711p1753n9429m6527l3605
59958B918770k0558p272N631J7320K7813L7840M7747N7095O5313P1962P6433P8177
59946C376271P7548P5692P3134O9104O2742N4496M5762L7430K9414K1460J3871
59935C936924P356K536k66r47N26M287J0508J9150K9802M1884N5030O9234Q4598
59922D260622J00886J17193J32292J45460J56832J66656J74269J78252J77610
59913E610072J72393J63062J49599J31483J08341Q0506M9158J6037j7277m9764
59903F413610q0493j07907j30267j46935j58540j65642j67946j65264j58580j49309
$$ plain form
59980 3801766 3888077 3958981 4012684 4048060 4064770 4063079 4043593 4007095 3954426 3886571 3805021
59969 3805021 3712183 3611518 3507259 3403751 3304694 3212795 3130084 3058331 2998902 2952375 2918770
59958 2918770 2898212 2890940 2896571 2913891 2941704 2979544 3027291 3084386 3149699 3221661 3298094 3376271
59946 3376271 3453819 3529511 3602645 3671749 3734491 3788987 3834749 3872179 3901593 3923053 3936924
59935 3936924 3944280 3946816 3946550 3945603 3946129 3950416 3960924 3980074 4009876 4051760 4106790 4176024 4260622
59922 4260622 4361508 4478701 4610993 4756453 4913285 5079941 5254210 5432462 5610072
59913 5610072 5782465 5945527 6095126 6226609 6334950 6415456 6464614 6480651 6463374 6413610
59903 6413610 6333117 6225210 6094943 5948008 5789468 5623826 5455880 5290616 5132036 4982727
59893D982727j37928j24220j08611r2300p6002n9414m2288k5318r440N210J9112
59882D331528L2411M4647N5408O4709P2604P8650Q1935Q1603P7394O9760N9408
59871E050057M6662L1386J3612n790k5386m4193o2142p9316r4975j07851j17483
59860D604581j24740j30670j35167j37230j36354j33029j27922j21269j13378
59851C444822j05084r7156q9558q1864p4174o7113o1013n5697n1123m7702m5601
59840B668737m4141m2272l9585l6654l4281l2645l1191k9438k7628k6414k5873
59829B298615k5111k3138j9967j6570j3856j1902j0114p727m228L39N240R560
59817B181141J2977J5939J8991K2075K4631K6177K6715K6665K6440K6012K4942
$$ plain form
59893 4982727 4844799 4720579 4611968 4519668 4443666 4384252 4341964 4316646 4307206 4312416 4331528
59882 4331528 4363939 4408586 4463994 4528703 4601307 4679957 4761892 4843495 4920889 4990649 5050057
59871 5050057 5096719 5128105 5141717 5135927 5110541 5066348 5004206 4924890 4829915 4722064 4604581
59860 4604581 4479841 4349171 4214004 4076774 3940420 3807391 3679469 3558200 3444822
59851 3444822 3339738 3242582 3153024 3071160 2996986 2929873 2868860 2813163 2762040 2714338 2668737
59840 2668737 2624596 2582324 2542739 2506085 2471804 2439159 2407968 2378530 2350902 2324488 2298615
59829 2298615 2273504 2250366 2230399 2213829 2199973 2188071 2177957 2170230 2166002 2166341 2171581 2181141
59817 2181141 2194118 2210057 2229048 2251123 2275754 2301931 2328646 2355311 2381751 2407763 2432705
59806B432705K2992K0505J7934J5175J1902Q496O077N407O235Q017J0802J5109
59794B581356K1275K9327L9064M9894O1024P2275Q4445R8312J13612J29538J45945
59783C426067J63155J80582J96283K07948K13659K11523J99274J74789J37039
59774E110319Q6922K7987l3547r0565j37656j72174j93262k01086j97423j85692
59764D013823j69198j49665j28129j06443q6661o9264n3253l8057k4224j2126
59754C176803j084R625J9803K8943L7169M5000N2714O0472O8695P7722Q7327R7138
59742C760327J07233J17960J29379J41438J54441J68733J84079J99910K16287
59733E179787K33936K53131K72994K92262L10427L27712L44022L58286L68876
$$ plain form
59806 2432705 2455697 2476202 2494136 2509311 2521213 2529709 2535786 2541193 2547428 2555445 2566247 2581356
59794 2581356 2602631 2631958 2671022 2720916 2781940 2854215 2938660 3036972 3150584 3280122 3426067
59783 3426067 3589222 3769804 3966087 4174035 4387694 4599217 4798491 4973280 5110319
59774 5110319 5197241 5225228 5191681 5101116 4963460 4791286 4598024 4396938 4199515 4013823
59764 4013823 3844625 3694960 3566831 3460388 3373727 3304463 3251210 3213153 3188929 3176803
59754 3176803 3175719 3185344 3205147 3234090 3271259 3316259 3368973 3429445 3498140 3575862 3663189 3760327
59742 3760327 3867560 3985520 4114899 4256337 4410778 4579511 4763590 4963500 5179787
59733 5179787 5413723 5666854 5939848 6232110 6542537 6870249 7214271 7572557 7941433
59724G941433L74392L73956L67123L53958L35254L12324K86328K58121K29117
59715A0832006K01942J79467J63007J51831J44616J40766J40008J41321J43010
59706A2237974J43715J42792J39739J33913J25043J13657J00720Q7038P3110N9389
59696A3357090M6466L5103K6185K0568J8845K1290K8030L9184N4760P4434R7563
59685A3819518J23392J51353J81001K11642K42086K71016K97505L20868L39912
59676A5958293L52718L57511L53477L40372L17420K83130K36390J77669J09093
59667A8486073L3561m5974j26470k04373k75787l37455l87524m25213m50054m62096
59657A5804688m63015m56296m45962m35494m28205m27738m36995m56276m82743
$$ plain form
59724 7941433 8315825 8689781 9056904 9410862 9746116 10058440 10344768 10602889 10832006
59715 10832006 11033948 11213415 11376422 11528253 11672869 11813635 11953643 12094964 12237974
59706 12237974 12381689 12524481 12664220 12798133 12923176 13036833 13137553 13224591 13297701 13357090
59696 13357090 13403556 13438659 13464844 13485412 13504257 13525547 13553577 13592761 13647521 13721955 13819518
59685 13819518 13942910 14094263 14275264 14486906 14728992 15000008 15297513 15618381 15958293
59676 15958293 16311011 16668522 17021999 17362371 17679791 17962921 18199311 18376980 18486073
59667 18486073 18519634 18473660 18347190 18142817 17867030 17529575 17142051 16716838 16266784 15804688
59657 15804688 15341673 14885377 14439415 14003921 13575716 13147978 12710983 12254707 11771964
59648A1771964n11417n36518n52740n56796n48421n29619n02892m70530m35119
59639G127912l99397l65132l32769l02498k74975k50585k28667k08182j88743
59630D576964j70523j53635j38233j24802j13558j03658r3766q3552p3946o5831
59620C455460n8949n2470m6228m0918l7215l5047l3843l3174l2980l3291l4094
59609C017251l5500l7666m0238m2244m2967m2825m2790m3022m2741m1454l9585
59598B566219l7541l5070l2014k9044k6788k4693k1645j7555j3500j0311p787
59587B310271n358k739K09L548O864R462J1340J3420J6401J9811K2652K4624K6170
59574B456675K7681K9222L0950L3159L5893L8942M2323M6344N1047N6002O0834
$$ plain form
59648 11771964 11260547 10724029 10171289 9614493 9066072 8536453 8033561 7563031 7127912
59639 7127912 6728515 6363383 6030614 5728116 5453141 5202556 4973889 4765707 4576964
59630 4576964 4406441 4252806 4114573 3989771 3876213 3772555 3678789 3595237 3521291 3455460
59620 3455460 3396511 3344041 3297813 3256895 3219680 3184633 3150790 3117616 3084636 3051345 3017251
59609 3017251 2981751 2944085 2903847 2861603 2818636 2775811 2733021 2689999 2647258 2605804 2566219
59598 2566219 2528678 2493608 2461594 2432550 2405762 2381069 2359424 2341869 2328369 2318058 2310271
59587 2310271 2304913 2302174 2302383 2305931 2312795 2322257 2333597 2347017 2363418 2383229 2405881 2430505 2456675
59574 2456675 2484356 2513578 2544528 2577687 2613580 2652522 2694845 2741189 2792236 2848238 2909072
59563B909072O5653P0718P5949Q1101Q6234R1584R7080J02286J06992J11341J15237
59552C913247J17950J18799J17955J15979J12499J05965R5155Q0648O4430M8343
59542D890970L3334J9872Q249j850j1445k1376l1484m0991m9447n6870o3101o7635
59530D608226p0176p0938p0089o7379o2577n6020m8140l8652k6827j2660K740
59519D087508J8242L3806N0145O7594Q5682J03599J20535J35699J48497J58735
59509E010042J66105J69414J66907J57726J42608J22780R8558O9616L6437Q93
59499F141086l4649o8346r8955j25442j46924j62859j73110j77775j77085j71430
59489D804511j61493j48344j33165j16720r9191q0760o2205m4596k8350j3053
$$ plain form
59563 2909072 2974725 3045443 3121392 3202493 3288727 3380311 3477391 3579677 3686669 3798010 3913247
59552 3913247 4031197 4149996 4267951 4383930 4496429 4602394 4697549 4778197 4842627 4890970
59542 4890970 4924304 4944176 4952425 4950575 4939130 4917754 4886270 4845279 4795832 4738962 4675861 4608226
59530 4608226 4538050 4467112 4397023 4329644 4267067 4211047 4162907 4124255 4097428 4084768 4087508
59519 4087508 4105750 4139556 4189701 4257295 4342977 4446576 4567111 4702810 4851307 5010042
59509 5010042 5176147 5345561 5512468 5670194 5812802 5935582 6034140 6103756 6140193 6141086
59499 6141086 6106437 6038091 5939136 5813694 5666770 5503911 5330801 5153026 4975941 4804511
59489 4804511 4643018 4494674 4361509 4244789 4145598 4064838 4002633 3958037 3929687 3916634
59479C916634J625J5122K6372L4899M1187M5980M9353N0582M8822M3862L6200
59468D310638K6471J4976J806j2680k7768m2792n7409p1430q4578r6490j06825
59457C853919j15220j21249j24636j25548j24586j22460j19639j16162j11789
59448B772630j06385j00264r4019q8021q2177p6269p0285o4309n8316n2314m6551
59437A933720m1225l6138l0953k5828k1364j7746j4368j0542o254j908K387O732
59425A736513J0839J3957J5502J5271J3094Q878L292k054n586o767n956l662l19
59412A793002L547P424J0979J3717J4655J3031R340N242K301J233K247N404J0323
59399A892445J6131K2100K8062L3817L8712M2348M5445M9362N4713O0857O6783
$$ plain form
59479 3916634 3918259 3933381 3959753 3994652 4035839 4081819 4131172 4181754 4230576 4274438 4310638
59468 4310638 4337109 4352085 4353891 4341211 4313443 4270651 4213242 4141812 4057234 3960744 3853919
59457 3853919 3738699 3617450 3492814 3367266 3242680 3120220 3000581 2884419 2772630
59448 2772630 2666245 2565981 2471962 2383941 2301764 2225495 2155210 2090901 2032585 1980271 1933720
59437 1933720 1892495 1856357 1825404 1799576 1778212 1760466 1746098 1735556 1729302 1727394 1729781 1736513
59425 1736513 1747352 1761309 1776811 1792082 1805176 1814054 1817346 1815292 1809706 1802939 1796983 1793321 1793002
59412 1793002 1796549 1803973 1814952 1828669 1843324 1856355 1865695 1870937 1873238 1874471 1876718 1882122 1892445
59399 1892445 1908576 1930676 1958738 1992555 2031267 2073615 2119060 2168422 2223135 2283992 2350775
59388B350775P2187P7613Q3808R0941R8434J05645J12845J21147J31218J42511
59378C387124J54205J66557J80601J96672K14079K32338K51859K72934K94654
59369E351023L15509L34605L51710L66286L77207L83469L84531L79874L68807
59360H613021L51232L28211L01212K70918K37270K00785J63125J25795Q8608N0115
59350A0730292R594l2058p3617j15074j57228k00025k41995k81317l16779l47531
59340H974262l72466l90429m00893m04117m00666l91043l75863l56232l33742
59331E548811l09964k85886k61926k38521k16413j96157j77648j60440j44417
59322C557439j29733j16252j03629r2030q2023p3643o6122n8975n2686m7779m3705
$$ plain form
59388 2350775 2422962 2500575 2584383 2675324 2773758 2879403 2992248 3113395 3244613 3387124
59378 3387124 3541329 3707886 3888487 4085159 4299238 4531576 4783435 5056369 5351023
59369 5351023 5666532 6001137 6352847 6719133 7096340 7479809 7864340 8244214 8613021
59360 8613021 8964253 9292464 9593676 9864594 10101864 10302649 10465774 10591569 10680177 10730292
59350 10730292 10739886 10707828 10634211 10519137 10361909 10161884 9919889 9638572 9321793 8974262
59340 8974262 8601796 8211367 7810474 7406357 7005691 6614648 6238785 5882553 5548811
59331 5548811 5238847 4952961 4691035 4452514 4236101 4039944 3862296 3701856 3557439
59322 3557439 3427706 3311454 3207825 3115795 3033772 2960129 2894007 2835032 2782346 2734567 2690862
59311B690862l9500l5151l1454k8590k5814k2743j9973j7986j6226j3950j1389
59300B428086r250p463n313k654r0K170M725P911J1112J3701J6143J9381K3450
59287B501909K7313L0052L1642L2616L3445L4296L4859L4355L2112K8292K3660
59276B844551J8579J2641N417k895j1780k0798k9408l6844m2693m7271n1078n4095
59264B584326n6103n7307n8093n8338n7567n5803n3656n1574m9442m7076m4584
59253A994783m2012l9028l5282l0917k6502k2550j9107j5713j1773p198k677R70
59241A742994L698O283R458J3320J7519K1661K5439K8863L2488L7026M2501M8153
59229B029403N3453N8885O5344P3034Q1380Q9914R8867J08885J20361J33072J46311
$$ plain form
59311 2690862 2651362 2616211 2584757 2556167 2530353 2507610 2487637 2469651 2453425 2439475 2428086
59300 2428086 2418836 2411373 2406060 2403406 2403316 2405486 2410211 2418122 2429234 2442935 2459078 2478459 2501909
59287 2501909 2529222 2559274 2590916 2623532 2656977 2691273 2726132 2760487 2792599 2820891 2844551
59276 2844551 2863130 2875771 2881188 2878293 2866513 2845715 2816307 2779463 2736770 2689499 2638421 2584326
59264 2584326 2528223 2470916 2412823 2354485 2296918 2241115 2187459 2135885 2086443 2039367 1994783
59253 1994783 1952771 1913743 1878461 1847544 1821042 1798492 1779385 1763672 1751899 1744701 1742024 1742994
59241 1742994 1746692 1752975 1762433 1775753 1793272 1814933 1840372 1869235 1901723 1938749 1981250 2029403
59229 2029403 2082856 2141741 2207085 2280119 2361499 2451413 2550280 2659165 2779526 2912598 3058909
59218C058909J59355J72019J84652J97533K10282K21922K31334K37575K39760
59209D913341K36866K27761K11552J88078J58079J22697Q2841L9302o545n2520
59199F121452r6359j36459j71773k01301k24058k39519k47881k49891k46528k38737
59189D068946k27357k13367j98047j82580j67362j52099j36775j22248j09517
59180B559594r8708q9072p9915p1142o3017n5746m9337m3662l8627l4383l1200
59169A904785k8917k6722k3901k0719j8237j7117j6905j6601j5747j4788j4466
59158A690665j4988j5774j6008j5426j4454j3620j3031j2497j1924j1403j1059
59147A540481j1033j1436j2141j2751j2968j2893j2768j2624j2399j2206j2203
$$ plain form
59218 3058909 3218264 3390283 3574935 3772468 3982750 4204672 4436006 4673581 4913341
59209 4913341 5150207 5377968 5589520 5777598 5935677 6058374 6141215 6180517 6173972 6121452
59199 6121452 6025093 5888634 5716861 5515560 5291502 5051983 4804102 4554211 4307683 4068946
59189 4068946 3841589 3628222 3430175 3247595 3080233 2928134 2791359 2669111 2559594
59180 2559594 2460886 2371814 2291899 2220757 2157740 2101994 2052657 2008995 1970368 1935985 1904785
59169 1904785 1875868 1849146 1825245 1804526 1786289 1769172 1752267 1735666 1719919 1705131 1690665
59158 1690665 1675677 1659903 1643895 1628469 1614015 1600395 1587364 1574867 1562943 1551540 1540481
59147 1540481 1529448 1518012 1505871 1493120 1480152 1467259 1454491 1441867 1429468 1417262 1405059
59136A405059j2296j2230j1859j1115r964q705p984q032q055o928m543j879K28
59123A301697J872L453M882N756O086O460P587R716J2339J4480J5559J5938J6271
59110A422096J6483J5972J4885J4303J4720J5168J4550J3349J3068J4257J6021
59099A584872J7504J8875K0551K2402K4227K6367K9087L1843L3954L5722L7905
59088A883309M0168M1091M0134L8556L7655L6818L4361K9919K4826K0012J4776
59077B241625Q130M13p263j4541k1815k9040l5534m0977m5761n0096n3426n5127
59065A896588n5382n5018n4719n4516n3863n2065m8982m5416m2477m0451l8553
59054A355146l6012l2977l0158k7934k6144k4496k2830k1099j9413j7944j6586
$$ plain form
59136 1405059 1392763 1380533 1368674 1357559 1347595 1338890 1330906 1322874 1314819 1307891 1303348 1301469 1301697
59123 1301697 1303569 1307022 1311904 1317660 1323746 1330206 1337793 1347509 1359848 1374328 1389887 1405825 1422096
59110 1422096 1438579 1454551 1469436 1483739 1498459 1513627 1528177 1541526 1554594 1568851 1584872
59099 1584872 1602376 1621251 1641802 1664204 1688431 1714798 1743885 1775728 1809682 1845404 1883309
59088 1883309 1923477 1964568 2004702 2043258 2080913 2117731 2152092 2182011 2206837 2226849 2241625
59077 2241625 2249755 2250168 2242905 2228364 2206549 2177509 2141975 2100998 2055237 2005141 1951715 1896588
59065 1896588 1841206 1786188 1731469 1676953 1623090 1571025 1522043 1476627 1434150 1393699 1355146
59054 1355146 1319134 1286157 1255999 1228065 1201921 1177425 1154595 1133496 1114083 1096139 1079553
59043A079553j4942j2996j1463j1024j1342j1404j0812j0206j0199j0495j0391
59032I54279r783r179q871q613q070p207o148n062m270m099m261l868k464q95
59018H71489n04j459k483k420j511p28m10j04N22J311K109K991L888M490M775
59003H81956N183O070P244Q261Q939R425R932J0589J1320J1810J1828J1621J1702
58990A005880J2095J2221J1721J1054J0834J0880J0359Q894P058N702N027M542
58978A116267L820L062K801L120L433L208K649K339K391K474K669L641N643P944
58964A165461R669J0839J1975J3025J3414J3123J3001J3699J4795J5291J4779
58953A309071J3779J3010J2692J2655J2903J3681J4958J6180J6878J7390J8426
$$ plain form
59043 1079553 1064611 1051615 1040152 1029128 1017786 1006382 995570 985364 975165 964670 954279
59032 954279 944496 935317 926446 917833 909763 902556 896408 891346 887076 882977 878716 874848 872384 871489
59018 871489 870985 869526 867043 864623 863112 862384 861974 861870 862392 863703 865812 868803 872691 877181 881956
59003 881956 887139 893209 900453 908714 917653 927078 937010 947599 958919 970729 982557 994178 1005880
58990 1005880 1017975 1030196 1041917 1052971 1063805 1074685 1085044 1093938 1100996 1106698 1111725 1116267
58978 1116267 1120087 1123149 1125950 1129070 1132503 1135711 1138360 1140699 1143090 1145564 1148233 1151874 1157517 1165461
58964 1165461 1175130 1185969 1197944 1210969 1224383 1237506 1250507 1264206 1279001 1294292 1309071
58953 1309071 1322850 1335860 1348552 1361207 1374110 1387791 1402749 1418929 1435807 1453197 1471623
58942A471623J9988K1277K1921K2616K4112K6049K7554K8666L0353L3093L6200
58931A763452L8797M0837M2867M5200M7761N0362N2796N4766N6168N7439N9402
58920B309847O2653O7116P2181P7256Q2294Q7762R3998J00685J07158J13164J19059
58909C293173J25247J31714J38307J45191J52668J60675J68715J76416J83938
58900D676044J91644J99445K06686K12731K17443K20885K22795K22773K20886
58891F591332K17558K12651K05253J94712J81414J65898J47698J25867J00598
58882H142981P3493M5988J8227j0233l9189o7786r5286j21258j45125j66078j83515
58871G452219j97366k07945k15629k20713k23439k24104k23021k20387k16187
$$ plain form
58942 1471623 1491611 1512888 1534809 1557425 1581537 1607586 1635140 1663806 1694159 1727252 1763452
58931 1763452 1802249 1843086 1885953 1931153 1978914 2029276 2082072 2136838 2193006 2250445 2309847
58920 2309847 2372500 2439616 2511797 2589053 2671347 2759109 2853107 2953792 3060950 3174114 3293173
58909 3293173 3418420 3550134 3688441 3833632 3986300 4146975 4315690 4492106 4676044
58900 4676044 4867688 5067133 5273819 5486550 5703993 5924878 6147673 6370446 6591332
58891 6591332 6808890 7021541 7226794 7421506 7602920 7768818 7916516 8042383 8142981
58882 8142981 8216474 8262462 8280689 8270456 8231267 8163481 8068195 7946937 7801812 7635734 7452219
58871 7452219 7254853 7046908 6831279 6610566 6387127 6163023 5940002 5719615 5503428
58862E503428k10364k03037j94515j85228j75759j66693j58066j49209j39510
58853C921047j29317j19621j10994j03187r5776q8567q1335p3851o6388n9589
58843B992422n3528m7534m1210l5081k9729k4928k0217j5770j2002q583m735l16
58831B698789M082Q150J2193J6421K0509K4198K7842L2030L6895M1972M6708N1012
58819C020801N5450O0731O6899P3223P9140Q5047R1764R9461J07629J15925J24423
58808C980493J33117J41843J50740J60164J69980J79481J88270J96651K04895
58799E505634K12586K19011K23753K26533K26945K24739K19962K12394K01152
58790G472709J85411J65297J41629J14976Q5518N3794K0873j2317m5422p8106
$$ plain form
58862 5503428 5293064 5090027 4895512 4710284 4534525 4367832 4209766 4060557 3921047
58853 3921047 3791730 3672109 3561115 3457928 3362152 3273585 3192250 3118399 3052011 2992422
58843 2992422 2938894 2891360 2850150 2815069 2785340 2760412 2740195 2724425 2712423 2703840 2699105 2698789
58831 2698789 2702871 2711021 2723214 2739635 2760144 2784342 2812184 2844214 2881109 2923081 2969789 3020801
58819 3020801 3076251 3136982 3203881 3277104 3356244 3441291 3533055 3632516 3740145 3856070 3980493
58808 3980493 4113610 4255453 4406193 4566357 4736337 4915818 5104088 5300739 5505634
58799 5505634 5718220 5937231 6160984 6387517 6614462 6839201 7059163 7271557 7472709
58790 7472709 7658120 7823417 7965046 8080022 8165540 8219334 8240207 8227890 8182468 8104362
58780H104362j09451j38301j64008j86600k06203k22647k35699k45409k51961
58771F344083k55269k55109k51686k45781k38177k29215k19118k08402j97530
58762D243796j86385j74721j63000j52167j42501j33362j24274j15570j07653
58753B944163j00250r2979q6084p9966p4370o8740o3162n8214n4006n0131m6565
58742B169696m3805m1899m0067l7704l5199l3317l2164l1219l0152k9100k8286
58731A786784k7736k7380k7128k6903k6780k7027k7759k8691k9443k9949l0301
58720A477687l0281k9604k8654k8491k9689l1484l2386l1610k9636k7499k5876
58709A152477k4848k4056k2968k1222j9014j6935j5326j3941j2424j0934j0026
$$ plain form
58780 8104362 7994911 7856610 7692602 7506002 7299799 7077152 6841453 6596044 6344083
58771 6344083 6088814 5833705 5582019 5336238 5098061 4868846 4649728 4441326 4243796
58762 4243796 4057411 3882690 3719690 3567523 3425022 3291660 3167386 3051816 2944163
58753 2944163 2843913 2750934 2664850 2584884 2510514 2441774 2378612 2320398 2266392 2216261 2169696
58742 2169696 2125891 2083992 2043925 2006221 1971022 1937705 1905541 1874322 1844170 1815070 1786784
58731 1786784 1759048 1731668 1704540 1677637 1650857 1623830 1596071 1567380 1537937 1507988 1477687
58720 1477687 1447406 1417802 1389148 1360657 1330968 1299484 1267098 1235488 1205852 1178353 1152477
58709 1152477 1127629 1103573 1080605 1059383 1040369 1023434 1008108 994167 981743 970809 960783
58698I60783j0041j0846j2008j3040j3623j3836j4045j4285j4023j2868j1350
58687H20818j0345r871r106p717o384n615m853l266j066P58J742K341L090L961
58673G74487M697N296N996O988Q188R160R349Q659P673P017O532N447L336O01
58659H63426k073m418o637q983j1394j3410j4471j4357j3356j1948j0406q867
58647G43106p444o078m421k333k99R95J473J678K065K702L576M756O096P245Q048
58632G61165Q687R350J0005J0607J1213J1893J2746J3945J5437J6739J7526J8261
58620I17574J9692K1691K3344K4333K5505K7653L0361L2625L4204L5773L7930
58609A230685M0598M3308M5750M8086N0834N4296N7969O0862O2587O3767O5064
$$ plain form
58698 960783 950742 939896 927888 914848 901225 887389 873344 859059 845036 832168 820818
58687 820818 810473 800602 791496 783779 777395 771780 766927 763661 762595 763353 765095 767436 770526 774487
58673 774487 779184 784480 790476 797464 805652 814812 824161 832820 840493 847510 854042 859489 862825 863426
58659 863426 861353 856935 850298 841315 829921 816511 802040 787683 774327 762379 751973 743106
58647 743106 735662 729584 725163 722830 722531 723526 724999 726677 728742 731444 735020 739776 745872 753117 761165
58632 761165 769852 779202 789207 799814 811027 822920 835666 849611 865048 881787 899313 917574
58620 917574 937266 958957 982301 1006634 1032139 1059792 1090153 1122778 1156982 1192755 1230685
58609 1230685 1271283 1314591 1360341 1408427 1459261 1513557 1571526 1632388 1694975 1758742 1823806
58598A823806O6200O6304O4862O1884N7393N1381M4141L6136K7535J8200Q166
58587B326008k213j2508k2355l1327l9044m5390n0414n3997n5854n5941n4692
58576A902273n2774n0672m8433m5801m2702l9644l7274l5572l3798l1484k9044
58565A455075k7119k5731k4513k3436k2751k2366k1889k1210k0652k0420k0326
58554A204662k0077j9531j8693j7756j7110j6977j6988j6465j5232j3909j3376
58543A018548j4066j5733j7696j9286k0242k0646k0516j9651j8052j6241j4865
58532H21554j4126j3772j3414j2694j1452j0019r003q484p851o808o012o106o518
58519F95295o134m909l885l602l423k662j617j013r67r27l50Q33K226L245L625
$$ plain form
58598 1823806 1890006 1956310 2021172 2083056 2140449 2191830 2235971 2272107 2299642 2317842 2326008
58587 2326008 2323795 2311287 2288932 2257605 2218561 2173171 2122757 2068760 2012906 1956965 1902273
58576 1902273 1849499 1798827 1750394 1704593 1661891 1622247 1584973 1549401 1515603 1484119 1455075
58565 1455075 1427956 1402225 1377712 1354276 1331525 1309159 1287270 1266060 1245408 1224988 1204662
58554 1204662 1184585 1165054 1146361 1128605 1111495 1094518 1077530 1061065 1045833 1031924 1018548
58543 1018548 1004482 988749 971053 951767 931525 910879 890363 870712 852660 836419 821554
58532 821554 807428 793656 780242 767548 756096 746077 737074 728590 720739 713931 707919 701813 695295
58519 695295 689161 684252 680367 676765 673342 670680 669063 668050 667083 666156 665806 666639 668865 672110 675735
58504F75735L640L627L444K838K167K157K920L731L919L463K665J766R80M73K17
58489G13742K06P10J769K549K038M33r64j434j601k243l175l749l781l430k837
58474F98233k345k491l234l770l611l341l695m431m724m232l212j998j019q36
58460F55294j471k002j589o08j19m41r38r79m19P02K182L425L853L638L465L632
58444F67625L869L982M112M375M756N336O083O557O330N696N342N383N232M467
58430G39145L285K013Q10q3l36K0N07P85R04Q84N50j02o53o45N1J277K692L781
58412G54885M149L927L626L507L395L146K931K990L314L679L781L469L018K989
58398H02806L509L928L639K999K897L580M554N506O535P475P801P511P353P934
$$ plain form
58504 675735 679375 683002 686446 689284 691451 693608 696528 700259 704178 707641 710306 712072 713052 713525 713742
58489 713742 713948 714658 716427 718976 721014 721447 720483 719049 717448 715205 712030 708281 704500 701070 698233
58474 698233 695888 693397 690163 686393 682782 679441 675746 671315 666591 662359 659147 657149 656130 655294
58460 655294 653823 651821 650232 649624 649505 649064 648126 647147 646728 647430 649612 653037 656890 660528 663993 667625
58444 667625 671494 675476 679588 683963 688719 694055 700138 706695 713025 718721 724063 729446 734678 739145
58430 739145 742430 744443 745253 745170 744834 744854 745361 746146 747050 747934 748484 748382 747729 747084 747135 748412 751104 754885
58412 754885 759034 762961 766587 770094 773489 776635 779566 782556 785870 789549 793330 796799 799817 802806
58398 802806 806315 810243 813882 816881 819778 823358 827912 833418 839953 847428 855229 862740 870093 878027
58384H78027R115J0490J1770J2602J2720J2601J3083J3990J4028J2588J0767R814
58372A021595R467Q833Q159Q372R206R282Q164P053P046P783Q352Q695R330J0257
58358A141594J0856J0709J0030R383R243R651J0091R974R418R185R611J0158J0291
58345A270194J0301J0638J0994J0847J0579J1086J2330J3287J3509J3745J4565
58334A402075J5294J5127J4573J4803J5978J7190J7890J8443J9164J9736J9902
58323A590175J9977K0289K0645K0808K0974K1393K1923K2359K2839K3435K3745
58312A828562K3408K2846K2881K3722K4779K5528K5989K6327K6469K6450K6747
58301B103708K7910K9820L1614L2504L2600L2759L3597L4864L6007L7030L8349
$$ plain form
58384 878027 887142 897632 909402 922004 934724 947325 960408 974398 988426 1001014 1011781 1021595
58372 1021595 1031062 1039895 1048054 1056426 1065632 1074914 1083078 1090131 1097177 1104960 1113312 1122007 1131337 1141594
58358 1141594 1152450 1163159 1173189 1182572 1191815 1201466 1211557 1221531 1230949 1240134 1249745 1259903 1270194
58345 1270194 1280495 1291133 1302127 1312974 1323553 1334639 1346969 1360256 1373765 1387510 1402075
58334 1402075 1417369 1432496 1447069 1461872 1477850 1495040 1512930 1531373 1550537 1570273 1590175
58323 1590175 1610152 1630441 1651086 1671894 1692868 1714261 1736184 1758543 1781382 1804817 1828562
58312 1828562 1851970 1874816 1897697 1921419 1946198 1971726 1997715 2024042 2050511 2076961 2103708
58301 2103708 2131618 2161438 2193052 2225556 2258156 2290915 2324512 2359376 2395383 2432413 2470762
58290B470762L9906M1089M1718M2548M4333M6773M8789M9698M9781M9847N0575
58279B975819N2184N4425N6942N9580O2266O4653O6319O7375O8392O9692P1141
58268C668788P2791P4964P7521P9813Q1791Q4277Q7610R0855R3298R5839R9821
58257D607368J04962J09799J13855J18129J23377J29203J35065J41153J47777
58248E730688J54738J61729J68840J76283J84081J92268K01041K10583K20963
58239G401214K32189K44073K56273K68939K83010K99331L17671L37255L57883
58230I997838L79913M03432M28408M55359M85028N17504N52555N90659O32820
58221A4443516O79589P31196P88400Q52290R23536J002945J092404J194025J308826
$$ plain form
58290 2470762 2510668 2551757 2593475 2636023 2680356 2727129 2775918 2825616 2875397 2925244 2975819
58279 2975819 3028003 3082428 3139370 3198950 3261216 3325869 3392188 3459563 3527955 3597647 3668788
58268 3668788 3741579 3816543 3894064 3973877 4055668 4139945 4227555 4318410 4411708 4507547 4607368
58257 4607368 4712330 4822129 4935984 5054113 5177490 5306693 5441758 5582911 5730688
58248 5730688 5885426 6047155 6215995 6392278 6576359 6768627 6969668 7180251 7401214
58239 7401214 7633403 7877476 8133749 8402688 8685698 8985029 9302700 9639955 9997838
58230 9997838 10377751 10781183 11209591 11664950 12149978 12667482 13220037 13810696 14443516
58221 14443516 15123105 15854301 16642701 17494991 18418527 19421472 20513876 21707901 23016727
58212B3016727J437787J583947J751764J944705K165553K419228K713130L054344
58204D0087185L448779L903803M429165N033531N721682O496974P366261Q341923
58196H4829303R439849J0675064J2056603J3583256J5239103J6982649J8727154
58189A81532981K0323880K1562362K2181802K1877962K0319224J7216904J2463437
58182C17478552O270101q00859p952830j4363979j9390348k2692404k4260342
58175B34287891k4346467k3341107k1648160j9605318j7456946j5359907j3402717
58168I9127269j1628153j0052203q674625p483596o460681n586358m842305m210735
58160D0188613l674562l218727k830311k497798k211761j965784j754953j573569
$$ plain form
58212 23016727 24454514 26038461 27790225 29734930 31900483 34319711 37032841 40087185
58204 40087185 43535964 47439767 51868932 56902463 62624145 69121119 76487380 84829303
58196 84829303 94269152 104944216 117000819 130584075 145823178 162805827 181532981
58189 181532981 201856861 223419223 245601025 267478987 287798211 305015115 317478552
58182 317478552 323748653 322947794 314994964 300630985 281240637 258548233 234287891
58175 234287891 209941424 186600317 164952157 145346839 127889893 112529986 99127269
58168 99127269 87499116 77446913 68772288 61288692 54828011 49241653 44399348 40188613
58160 40188613 36514051 33295324 30465013 27967215 25755454 23789670 22034717 20461148
58152B0461148j415664j277227j156113j049871r55425q70902p96015p30145o71413
58143A1538373o18095n69678n26096m86899m51601m19889l91144l64528l39835
58134G370608l17421k97180k78499k61323k46198k32965k20443k07876j95704
58125E112999j84473j73939j63877j54785j47025j39958j32782j25650j19203
58116C771307j13471j08012j02797r8137r3963q9898q5897q2133p8375p4255p0020
58105B774349o6442o3833o1789n9935n8271n6671n4692n2237m9928m8421m7623
58094B154507m6937m5980m4759m3433m2218m1366m0881m0411l9682l8810l7911
58083A692119l6709l4986l3163l1843l0911k9796k8491k7596k7165k6403k4844
$$ plain form
58152 20461148 19045484 17768257 16612144 15562273 14606848 13735946 12939931 12209786 11538373
58143 11538373 10920278 10350600 9824504 9337605 8886004 8466115 8074971 7710443 7370608
58134 7370608 7053187 6756007 6477508 6216185 5969987 5737022 5516579 5308703 5112999
58125 5112999 4928526 4754587 4590710 4435925 4288900 4148942 4016160 3890510 3771307
58116 3771307 3657836 3549824 3447027 3348890 3254927 3165029 3079132 2996999 2918624 2844369 2774349
58105 2774349 2707907 2644074 2582285 2522350 2464079 2407408 2352716 2300479 2250551 2202130 2154507
58094 2154507 2107570 2061590 2016831 1973398 1931180 1889814 1848933 1808522 1768840 1730030 1692119
58083 1692119 1655410 1620424 1587261 1555418 1524507 1494711 1466220 1438624 1411459 1385056 1360212
58072A360212k3158k2179k1796k1354k0693k0043j9311j8232j6960j5788j4512
58061A146186j2880j1468j1187j1841j2157j1454j0494j0351j1101j1978j2283
58050A018992j1772j0692r723r474r749r785r366r136r529r997r792q900p842
58037H93235o925o225n818n589n159m483m112m422n000n249n240n433n907o381
58023H17292o698o720o109m815l510k881k708k331j793j719k160k421k112j655
58009G69660j522j591j564j482j526j647j747j914k148k108j441l21N73P21L85
57994G52328M21J364K759L660L845M052M847N778O063N681N159M698M194L903
57980H08752M179M587M185K874J695J404J454Q46n66k185l662n127o598p758q370
$$ plain form
58072 1360212 1337054 1314875 1293079 1271725 1251032 1230989 1211678 1193446 1176486 1160698 1146186
58061 1146186 1133306 1121838 1110651 1098810 1086653 1075199 1064705 1054354 1043253 1031275 1018992
58050 1018992 1007220 996528 986805 977331 967582 957797 948431 939295 929766 919769 909977 901077 893235
58037 893235 886310 880085 874267 868678 863519 859036 854924 850502 845502 840253 835013 829580 823673 817292
58023 817292 810594 803874 797765 792950 789440 786559 783851 781520 779727 778008 775848 773427 771315 769660
58009 769660 768138 766547 764983 763501 761975 760328 758581 756667 754519 752411 750970 750649 751222 751943 752328
57994 752328 752749 754113 756872 760532 764377 768429 773276 779054 785117 790798 795957 800655 804849 808752
57980 808752 812931 817518 821703 824577 826272 827676 829130 829976 829410 827225 823563 818436 811838 804080 795710
57965G95710q479q223p698p087o616o243n587m322k615j003J38R06J643K522L490
57950G46536M422N114N257M759M099L867L800K765J81l007n300o352p073q189
57936G50879r381j0008r946r498q850q055p197o322n288m008k716j848j694k141
57922F63927k673k677k098j711k330l703m610m286l274k607k502k371j835j070
57908F26180k26R26K445L815M503M644M737M861M670M152L741L486K772J292k61
57893F71737j114j638k714m087m451l360k025j672k031k091j614j024m28L20R66
57878F44774J192J375K141L294M100M507N144O115O774O837O764O792O486N582
57864G11877M430L188J432r36l079m191m505m787n335n995o672p107o640m951
$$ plain form
57965 795710 787231 779008 771310 764223 757607 751364 745777 741455 738840 737837 737975 738881 740524 743046 746536
57950 746536 750958 756072 761329 766088 770187 774054 777854 780619 780800 777793 772493 766141 759068 750879
57936 750879 741498 731490 721544 712046 703196 695141 687944 681622 676334 672326 669610 667762 666068 663927
57922 663927 661254 658577 656479 654768 652438 648735 644125 639839 636565 633958 631456 629085 627250 626180
57908 626180 625954 626880 629325 633140 637643 642287 647024 651885 656555 660707 664448 667934 670706 671998 671737
57893 671737 670623 668985 666271 662184 657733 654373 652348 650676 648645 646554 644940 643916 643488 643808 644774
57878 644774 645966 647341 649482 652776 656876 661383 666527 672642 679416 686253 693017 699809 706295 711877
57864 711877 716307 719495 720927 719991 716912 712721 708216 703429 698094 692099 685427 678320 671680 666729
57850F66729k879j702j628j597o26J172K957M142M831N509O403P211P496P357
57836G05375P326P535P439O642N470M339K954P67k082m914p414r769j1896j3201
57822F98571j3246j2204j0533q669p094o210n844n235l848j954k09J164K463L904
57808F31056N221N992O297O810Q122R973J1408J1808J1560J1549J2109J2808J3122
57795G57835J2963J2506J1803J0779R392P726N929M139K357M40j686l833n678
57782H24672p068q045q721r226r739j0262j0440r904q833p855p326o975o406n591
57768G08281m639l362j538N30K107K786K848K747K532K078J569J466J981K932
57754G22318M049N184O084O379O024N565N656O363P162P564P557P475P565P749
$$ plain form
57850 666729 663850 662148 660520 658923 658297 659469 662426 666568 671399 676908 683311 690522 698018 705375
57836 705375 712701 720236 727675 734317 739787 744126 747080 747847 745765 740851 733437 723668 711772 698571
57822 698571 685325 673121 662588 653919 646825 640615 634771 629536 625688 623734 623525 624689 627152 631056
57808 631056 636277 642269 648566 655376 663498 673471 684879 696687 708247 719796 731905 744713 757835
57795 757835 770798 783304 795107 805886 815278 823004 828933 833072 835429 835869 834183 830350 824672
57782 824672 817604 809559 800838 791612 781873 771611 761171 751267 742434 734579 727253 720278 713872 708281
57768 708281 703642 700280 698742 699272 701379 704165 707013 709760 712292 714370 715939 717405 719386 722318
57754 722318 726367 731551 737635 744014 750038 755603 761259 767622 774784 782348 789905 797380 804945 812694
57740H12694P706P232O590O351O756P405P722P548P069O432N798N558O067P193
57726I08121Q503R761J0740J0853R664P889P081P943R586J0746J1234J1616J2102
57713A035839J2384J2346J2308J2601J3284J4249J5281J6190J7070J8224J9578
57702A199354K0571K0992K1549K3064K5387K7792L0121L2829L5920L8726M0901
57691A517206M3009M5817M9489N3782N8517O3513O8393P2866P7056Q1290Q5734
57680B216672R0425R5406J00506J05191J08840J11321J13061J14623J16192J17312
57670C289549J17110J14669J09006R8467Q0424N2347J3764l2551q1109j25183
57660C636493j58475j76950j80428j72503j58309j41851j25170j09201r4574q1533
$$ plain form
57740 812694 820400 827632 834222 840573 847329 854734 862456 870004 877073 883505 889303 894861 900928 908121
57726 908121 916624 926385 937125 947978 957642 965531 972612 980555 990141 1000887 1012121 1023737 1035839
57713 1035839 1048223 1060569 1072877 1085478 1098762 1113011 1128292 1144482 1161552 1179776 1199354
57702 1199354 1219925 1240917 1262466 1285530 1310917 1338709 1368830 1401659 1437579 1476305 1517206
57691 1517206 1560215 1606032 1655521 1709303 1767820 1831333 1899726 1972592 2049648 2130938 2216672
57680 2216672 2307097 2402503 2503009 2608200 2717040 2828361 2941422 3056045 3172237 3289549
57670 3289549 3406659 3521328 3630334 3728801 3809225 3861572 3875336 3842785 3761676 3636493
57660 3636493 3478018 3301068 3120640 2948137 2789828 2647977 2522807 2413606 2319032 2237499
57650B237499o9808n9060m9308m0803l3599k7496k2205j7383j2658p812k916J764
57638A896215N950R433J2165J4456J6877J9697K2588K5159K7696L0920L4966L9046
57626B155168M2401M5090M7629N0154N2483N4712N7103N9389O0721O0503N8863
57615B744216N6111N2187M6838M0061L2052K2979J2983K351q561j9351k9491l8378
57603B913997m5685n1475n5873n8816o0238o0319n9453n8041n6364n4400n1821
57592B301512m8505m5003m1984l9314l6219l2586k9272k6831k4663k1955j8855
57581A936325j6031j3703j1822j0687j0325r756p913n248l292k632k343j523l51
57568A840699O93J662K655L381L774M392N606O930P733Q161Q812R872J1070J2173
$$ plain form
57650 2237499 2167691 2108631 2059323 2018520 1984921 1957425 1935220 1917837 1905179 1897367 1894451 1896215
57638 1896215 1902165 1911598 1923763 1938219 1955096 1974793 1997381 2022540 2050236 2081156 2116122 2155168
57626 2155168 2197569 2242659 2290288 2340442 2392925 2447637 2504740 2564129 2624850 2685353 2744216
57615 2744216 2800327 2852514 2899352 2939413 2971465 2994444 3007427 3009778 3001217 2981866 2952375 2913997
57603 2913997 2868312 2816837 2760964 2702148 2641910 2581591 2522138 2464097 2407733 2353333 2301512
57592 2301512 2253007 2208004 2166020 2126706 2090487 2057901 2028629 2001798 1977135 1955180 1936325
57581 1936325 1920294 1906591 1894769 1884082 1873757 1864001 1856088 1850840 1847548 1844916 1842573 1841050 1840699
57568 1840699 1841392 1843054 1845709 1849090 1852864 1857256 1862862 1869792 1877525 1885686 1894498 1904370 1915440 1927613
57554A927613J3082J3740J4316J5161J6248J7103J7630J8431J9869K1401K2496
57543B117090K3601K5358K7339K8651K9475L0939L3402L5992L8027L9895M2094
57532B471863M4337M6191M7955N0134N2519N4451N5675N6402N6691N6326N5198
57521C047742N3355N0733M7195M2726L7296L0714K3012J4804O755j167r368j7590
57509C326207k4801l0214l3922l6262l7224l6907l6025l5281l4487l2823k9960
57498B958301k6389k2685j9021j5537j2578j0230p998n350k416K54K451M470O615
57485B849887Q881J1162J3386J5421J7103J8566K0371K3052K6549L0192L3259
57474C067829L5538L7428L9512M2025M4694M7105M9197N1323N3761N6236N8023
$$ plain form
57554 1927613 1940695 1954435 1968751 1983912 2000160 2017263 2034893 2053324 2073193 2094594 2117090
57543 2117090 2140691 2166049 2193388 2222039 2251514 2282453 2315855 2351847 2389874 2429769 2471863
57532 2471863 2516200 2562391 2610346 2660480 2712999 2767450 2823125 2879527 2936218 2992544 3047742
57521 3047742 3101097 3151830 3199025 3241751 3279047 3309761 3332773 3347577 3354332 3353165 3343797 3326207
57509 3326207 3301406 3271192 3237270 3201008 3163784 3126877 3090852 3055571 3021084 2988261 2958301
57498 2958301 2931912 2909227 2890206 2874669 2862091 2851861 2843863 2838513 2836097 2836351 2838802 2843272 2849887
57485 2849887 2858768 2869930 2883316 2898737 2915840 2934406 2954777 2977829 3004378 3034570 3067829
57474 3067829 3103367 3140795 3180307 3222332 3267026 3314131 3363328 3414651 3468412 3524648 3582671
57463C582671N8575N7920N6378N3974N0384M5527L9877L3946K7545J9980J1034
57452D037811J556p123j4184j9785k4674k9395l3734l6920l8458l8615l7892l6330
57440C722257l3835l0950k8520k6530k4112k1027j8204j6292j4452j1553p937
57429C488845m974l184j838k98J302K768M161N266N643N559N963P177Q398R036
57415C533824R675J1013J2585J3402J3450J3658J4516J5549J6109J6092J5791
57404C685664J5480J5307J5240J5137J5029J5274J6142J7368J8346J8719J8586
57393C866292J8342J8464J9236K0394K1228K1330K1037K0860K0786K0535K0226
57382D088730K0224K0529K0852K1199K1799K2424K2449K1755K1049K0995K1422
$$ plain form
57463 3582671 3641246 3699166 3755544 3809518 3859902 3905429 3945306 3979252 4006797 4026777 4037811
57452 4037811 4039367 4032244 4018060 3998275 3973601 3944206 3910472 3873552 3835094 3796479 3758587 3722257
57440 3722257 3688422 3657472 3628952 3602422 3578310 3557283 3539079 3522787 3508335 3496782 3488845
57429 3488845 3483871 3480687 3478849 3478551 3479853 3482621 3486782 3492048 3497691 3503250 3509213 3516390 3524788 3533824
57415 3533824 3543499 3554512 3567097 3580499 3593949 3607607 3622123 3637672 3653781 3669873 3685664
57404 3685664 3701144 3716451 3731691 3746828 3761857 3777131 3793273 3810641 3828987 3847706 3866292
57393 3866292 3884634 3903098 3922334 3942728 3963956 3985286 4006323 4027183 4047969 4068504 4088730
57382 4088730 4108954 4129483 4150335 4171534 4193333 4215757 4238206 4259961 4281010 4302005 4323427
57371D323427K1725K1679K1530K1437K1291K1024K0825K0926K1351K1960K2664
57360D559839K3426K4019K3996K3119K1895K1257K1588K2249K2393K2024K1851
57349D807656K2273K2968K3483K3755K3869K3714K3208K2634K2414K2692K3353
57338E062019K4324K5431K6116K5762K4541K3564K3731K4627K4999K4361K3554
57327E333029K3556K4209K4675K4764K5038K5717K6210K6013K5462K5159K5155
57316E608987K5110K5033K5293K5993K6807K7421K7831K8121K8258K8185K8041
57305E905080K8091K8488K9017K9195K8716K7786K6804K5818K4633K3347K2273
57294F199248K1235J9589J7216J4900J3285J1963J0216Q185O616N698M885L761
$$ plain form
57371 4323427 4345152 4366831 4388361 4409798 4431089 4452113 4472938 4493864 4515215 4537175 4559839
57360 4559839 4583265 4607284 4631280 4654399 4676294 4697551 4719139 4741388 4763781 4785805 4807656
57349 4807656 4829929 4852897 4876380 4900135 4924004 4947718 4970926 4993560 5015974 5038666 5062019
57338 5062019 5086343 5111774 5137890 5163652 5188193 5211757 5235488 5260115 5285114 5309475 5333029
57327 5333029 5356585 5380794 5405469 5430233 5455271 5480988 5507198 5533211 5558673 5583832 5608987
57316 5608987 5634097 5659130 5684423 5710416 5737223 5764644 5792475 5820596 5848854 5877039 5905080
57305 5905080 5933171 5961659 5990676 6019871 6048587 6076373 6103177 6128995 6153628 6176975 6199248
57294 6199248 6220483 6240072 6257288 6272188 6285473 6297436 6307652 6315837 6322453 6328151 6333036 6336797
57282F336797K540J616J218J454K224L097L671M069M686N553O357O976P548Q071
57268F395877Q472Q929R571R959R540Q568P941P977Q078P688O977O370O022N995
57254F507964O397P061P543P653P585P360O786O085N904O384O807O598O101N952
57240F602180O232O666P156P623P784P610P679Q411R291R372Q420P106O268O294
57226F708092P021P813P959P319O433N735N023L989K812J751N75r99k541l266
57212F757716k974k237j661j446j523j786k224l058m566o565q397r735j0968j2447
57198F688129j3900j5034j6107j7253j7851j7423j6684j6743j7568j8245j8434
57187F502887j8514j8470j7866j6931j6468j6524j6329j5722j5454j5747j5768
$$ plain form
57282 6336797 6339337 6340953 6342171 6343625 6345849 6348946 6352617 6356686 6361372 6366925 6373282 6380258 6387806 6395877
57268 6395877 6404349 6413278 6422849 6432808 6442348 6450916 6458857 6466834 6474912 6482600 6489577 6495947 6501969 6507964
57254 6507964 6514361 6521422 6528965 6536618 6544203 6551563 6558349 6564434 6570338 6576722 6583529 6590127 6596228 6602180
57240 6602180 6608412 6615078 6622234 6629857 6637641 6645251 6652930 6661341 6670632 6680004 6688424 6695530 6701798 6708092
57226 6708092 6715113 6722926 6730885 6738204 6744637 6750372 6755395 6759384 6762196 6763947 6764522 6763523 6760982 6757716
57212 6757716 6754742 6752505 6750844 6749398 6747875 6746089 6743865 6740807 6736241 6729676 6721279 6711544 6700576 6688129
57198 6688129 6674229 6659195 6643088 6625835 6607984 6590561 6573877 6557134 6539566 6521321 6502887
57187 6502887 6484373 6465903 6448037 6431106 6414638 6398114 6381785 6366063 6350609 6334862 6319094
57176F319094j5113j4631j5033j5769j6062j6086j6160j5743j4347j2822j2449
57165F154879j3203j4040j4587j5340j6362j7042j7261j7760j9037k0790k2675
57154E966782k4845k7317k9532l0988l1836l2554l3440l4712l6456l8157l8741
57143E608204l7668l5742l4315l3811l3439l2370l0817k9775k9922l1041l2450
57132E246854l3825l5326l7024l8584l9673m0468m1403m2615m3844m4743m4893
57121D804456m3751m1083l7471l3970l1126k8650k6006k2966j9481j5385j0419
57110D494148m315L144J1902K1563L1912M3590N7792P5226R5793J19401J46633
57099E096789J78340K15026K56872L03961L56074M12460M72095N33968N96877
$$ plain form
57176 6319094 6303981 6289350 6274317 6258548 6242486 6226400 6210240 6194497 6180150 6167328 6154879
57165 6154879 6141676 6127636 6113049 6097709 6081347 6064305 6047044 6029284 6010247 5989457 5966782
57154 5966782 5941937 5914620 5885088 5854100 5822264 5789710 5756270 5721558 5685102 5646945 5608204
57143 5608204 5570536 5534794 5500479 5466668 5433229 5400859 5370042 5340267 5310345 5279304 5246854
57132 5246854 5213029 5177703 5140679 5102095 5062422 5021954 4980551 4937936 4894092 4849349 4804456
57121 4804456 4760705 4719622 4682151 4648181 4617055 4588405 4562399 4539433 4519952 4504567 4494148
57110 4494148 4489833 4492977 4504879 4526442 4558354 4601944 4659736 4734962 4830755 4950156 5096789
57099 5096789 5275129 5490155 5747027 6050988 6407062 6819522 7291617 7825585 8422462
57090H422462O59176P19012P74482Q23357Q62935Q90500R03680R00105Q77193
57081A5832902Q32975P66940O79667N71681M43503K97079J36688l1655k01482
57072A9328298l66476n20560o58265p75413q69557r39774r86258j010007j012772
57063A2189216r96855r64720r18878q62373p99133p33151o67091o02109n39211
57054E105695m80166m26544l78446l34995k95865k61574k32270k07100j85002
57045B303733j65532j48563j33751j20647j09057r8914r0052q2367p5929p0680
57035A208241o6159o1817n7420n3015m8643m4329m0303l6987l4709l3328l2127
57024F99404l0223k7393k4407k2274k1211k0565j9705j8504j7076j5570j4350
$$ plain form
57090 8422462 9081638 9800650 10575132 11398489 12261424 13151924 14055604 14955709 15832902
57081 15832902 16665877 17432817 18112484 18684165 19127668 19424747 19561435 19529780 19328298
57072 19328298 18961822 18441262 17782997 17007584 16138027 15198253 14211995 13201988 12189216
57063 12189216 11192361 10227641 9308763 8446390 7647257 6914106 6247015 5644906 5105695
57054 5105695 4625529 4198985 3820539 3485544 3189679 2928105 2695835 2488735 2303733
57045 2303733 2138201 1989638 1855887 1735240 1626183 1527269 1437217 1354850 1278921 1208241
57035 1208241 1142082 1080265 1022845 969830 921187 876858 836555 799568 764859 731531 699404
57024 699404 669181 641788 617381 595107 573896 553331 533626 515122 498046 482476 468126
57013D68126j3795j3717j3461j2775j2124j1864j1661j1118j0444j0069r943r735
57001C27420r392r013q526p918p450p141o476n201m011l618l490k415k79J746
56987B54236K895L791N292P208Q696R359R347Q712P274N066K526K42j416k481
56973C20747l321m123m488l912k691j836j820j938j266J67J595K583L291L918
56959C06906M461M939N368N461M783L295J421n10k466m319n672o336o678p110
56945C03543p452p142o033m612l360k227r34N11J843K999M144N373O595P718Q601
56930C09567Q831Q010O346M507K638O6l635p713j0948j2921j3943j4096j3150
56917B63559j1455r920q917p946o665n586n194n065m452l394k660k719l292l697
$$ plain form
57013 468126 454331 440614 427153 414378 402254 390390 378729 367611 357167 347098 337155 327420
57001 327420 318028 309015 300489 292571 285121 277980 271504 266303 262292 258674 255184 252769 252490 254236
56987 254236 257131 260922 266214 273422 282118 291477 300824 309536 316810 321876 324402 324644 323228 320747
56973 320747 317426 313303 308815 304903 302212 300376 298556 296618 295352 295519 297114 299697 302988 306906
56959 306906 311367 316306 321674 327135 331918 335213 336634 336124 333658 329339 323667 317331 310653 303543
56945 303543 296091 288949 282916 278304 274944 272717 271783 272294 274137 277136 281280 286653 293248 300966 309567
56930 309567 318398 326408 332754 337261 339899 339965 336330 328617 317669 304748 290805 276709 263559
56917 263559 252104 242184 233267 225321 218656 213070 207876 202811 198359 194965 192305 189586 186294 182597
56903A82597l412k420j296p16n41J83J978M000M946M636M083M161M761N364N813
56888B14137O286O890P557Q118Q340P989O914N144K924P42r58k160l152l808l475
56873B61488j928J8J410K401L890O070Q130R449J0382J1615J3306J5091J6495
56860C57817J7101J6758J5860J4878J3445J0436N390n83n743r244j1299j2256
56848D12560j2117j0921q953o455l454m0L443O615R422J2261J5656J9682K3651
56835D61350K6622K8182K8462K7345K4201J8744J1674M026l785j1659j8846k4095
56823E72221k6808k7498k6851k4940k1645j7371j2916q827n206j949J158M438
56811D03806Q071J1832J5255J7951J9651K0070J8979J6245J1631M860l642j2202
$$ plain form
56903 182597 179185 176765 175469 174753 174212 174395 176373 180373 185319 189955 194038 198199 202960 208324 214137
56888 214137 220423 227313 234870 242988 251328 259317 266231 271375 274299 275041 274083 271923 268771 264963 261488
56873 261488 259560 259578 260988 263389 267279 273349 281479 290928 301310 312925 326231 341322 357817
56860 357817 374918 391676 407536 422414 435859 446295 451685 451102 445359 436115 424816 412560
56848 412560 400443 389522 380569 374114 370660 370620 374063 380678 390100 402361 418017 437699 461350
56835 461350 487972 516154 544616 571961 596162 614906 626580 630606 626821 615162 596316 572221
56823 572221 545413 517915 491064 466124 444479 427108 414192 405365 400159 398210 399368 403806
56811 403806 411877 423709 438964 456915 476566 496636 515615 531860 543491 548351 544709 532507
56799E32507j8832k2846k5076k6306k6154k4054k0675j7419j4686j1601p706l954
56787C13198j453J11J974M543O967Q382Q868Q871Q339O858M331J108k442o160
56773C63495r904j3330j5945j7331j7452j6721j5685j4537j3093j1321r648q568
56761A99960q048p560o740n778n094m675m018k800j496j014j593k393k420j674
56747A44657r64p35o29k67J06J37K8K20O05O19J2q29j346j281p19k1L30J06l47
56728A39682m76k14mj01k93l77n00p79r51p26k67Q7L22N94P57M99q2n27o54o74
56708A35316n82M6J339K581K848K037R39L32L42O78J103J532J863J887J465P67
56692A54493K75L62Q19J082R85R41J195J300Q38K47K88Q21R27L42p6L48J093J229
$$ plain form
56799 532507 513675 490829 465753 439447 413293 389239 368564 351145 336459 324858 317152 313198
56787 313198 311745 311856 313830 318373 325340 333722 342590 351461 359800 366658 370989 372097 369655 363495
56773 363495 353591 340261 324316 306985 289533 272812 257127 242590 229497 218176 208528 199960
56761 199960 191912 184352 177612 171834 166740 162065 158047 155247 153751 152737 151144 148751 146331 144657
56747 144657 143693 142958 142329 142062 142168 142305 142333 142553 143158 143777 143789 142960 141614 140333 139614 139593 139923 140029 139682
56728 139682 139206 138992 138988 138887 138594 138217 137717 136938 135987 135261 134994 135081 135403 135997 136754 137253 137171 136644 135990 135316
56708 135316 134734 134780 136119 138700 141548 143585 144524 144856 145198 145876 146979 148511 150374 152261 153726 154493
56692 154493 154768 155130 155949 157031 158016 158957 160152 161452 162290 162537 162825 163646 164573 164915 164839 165187 166280 167509
56674A67509O98J65k0n7j39k64n16r01j006m24M81P77O8j005j544j308p22l45
56656A61447m53q98j270j292j099r17p00m08m00j015j856k126j723j336j301j109
56640A43544m01K31Q3n12o06K2O31O21K77J98M35M75Ko02o29J34J021J191N17
56621A46632l51q17q21n54j17L44O00O31O32N04j36j184j755j144K36J363J730
56604A45793J516R81L79K19Q66J828K137J528P31M38N17N03M05N84J121J615J609
56587A62770J034L36J53P07J506J775J282N17O1K1J72L81P31J248J686J727J385
56570A77492J177J623K547L167L069K788L114M013M640M395L571K961L081L721
56556B21359M104L573K355J447J433J736J455O63K20L89L54o68k425l931m405
$$ plain form
56674 167509 168207 168372 168352 168295 168156 167892 167376 166475 165469 165045 165526 166303 166371 165366 163822 162514 161792 161447
56656 161447 160994 160096 158826 157534 156435 155518 154818 154410 154010 152995 151139 149013 147290 145954 144653 143544
56640 143544 143143 143374 143457 142945 142339 142361 142992 143613 143890 144088 144523 144998 145000 144398 143769 143903 144924 146115 146632
56621 146632 146281 145464 144643 144089 143972 144316 144916 145547 146179 146683 146547 145363 143608 142464 142700 144063 145793
56604 145793 147309 148290 148669 148888 149754 151582 153719 155247 155978 156416 156933 157436 157841 158425 159546 161161 162770
56587 162770 163804 164140 164293 165000 166506 168281 169563 170080 170141 170162 170334 170715 171446 172694 174380 176107 177492
56570 177492 178669 180292 182839 186006 189075 191863 194977 198990 203630 208025 211596 214557 217638 221359
56556 221359 225463 229036 231391 232838 234271 236007 237462 238125 238345 238734 239088 238420 235995 232064 227659
56541B27659l767k627j948k295l284m026m103l742l211k650k511l232m275m290
56527A81698k764q48J3k69o97o29k13K13M92M90K13l7L2K89M13K97k7n48r83p81
56507A76354M9N66K7j000j388j017p12q22q70o42o19r91j192p78o1N75J221J861
56489A70561J949J260N66O96J348J577J203R08J023J117Q87P48J146J801K087
56474A88877J925J871K392L248L708L328K492K034K243K474J977R25K39M25J017
56459B19175J290J065O01Q4m34q18r98j136j311j135k38R14J197J46j418k314
56443B14670k298j984j748j348o00R9J79m04j208j781j958j799j491j241j129
56428A95959j078j051j128j313j364j023l56L36Q63J275J584J581J053J36n91
$$ plain form
56541 227659 223892 221265 219317 217022 213738 209712 205609 201867 198656 196006 193495 190263 185988 181698
56527 181698 178934 178086 178099 177830 177133 176504 176291 176504 176996 177486 177699 177662 177694 177983 178396 178693 178666 178118 177135 176354
56507 176354 176403 176969 176996 175996 174608 173591 172879 172057 171187 170545 169926 168935 167743 166965 166904 167479 168700 170561
56489 170561 172510 173770 174336 175032 176380 177957 179160 180068 181091 182208 183095 183843 184989 186790 188877
56474 188877 190802 192673 195065 198313 202021 205349 207841 209875 212118 214592 216569 217494 217733 218158 219175
56459 219175 220465 221530 222131 222215 221781 220963 219965 218829 217518 216383 216145 217059 218256 218402 216984 214670
56443 214670 212372 210388 208640 207292 206692 206791 206970 206566 205358 203577 201619 199820 198329 197088 195959
56428 195959 194881 193830 192702 191389 190025 189002 188646 188982 189845 191120 192704 194285 195338 195474 194883
56413A94883n12M13J472J762J058J2n39l30L30J050J692K288K877L381L564L196
56397B16597K444J880J876K075J813J005K84J72M77O86O48N88N67K79m89j417
56381B29485j826j333k51P04J083R73O36K00j93j62N77J685K372K215J605J190
56365B38960J169J229J088Q46Q67J387K210K751K531J711R71P65Q72Q41O66P13
56349B59577J080J459J664J860K088K008J530J314K094L512M369M103L442L207
56335B93307L242L099L177M160N541N946N107M432M977N838N522M221L551M165
56321C56285M892M520L468L070L773M696M847M206L582L603M057M155L475K417
56307D11046J670J419J383J427J689K100K292K080J672J260R22R72J903L584N054
$$ plain form
56413 194883 194371 194784 196256 198018 199076 199088 198549 198219 198549 199599 201291 203579 206456 209837 213401 216597
56397 216597 219041 220921 222797 224872 226685 227690 227974 228146 228623 229309 229957 230545 231112 231391 230902 229485
56381 229485 227659 226326 226075 226779 227862 228835 229471 229671 229478 229316 229893 231578 233950 236165 237770 238960
56365 238960 240129 241358 242446 243292 244159 245546 247756 250507 253038 254749 255720 256485 257357 258198 258864 259577
56349 259577 260657 262116 263780 265640 267728 269736 271266 272580 274674 278186 282555 286658 290100 293307
56335 293307 296549 299648 302825 306985 312526 318472 323579 328011 332988 338826 344348 348569 352120 356285
56321 356285 361177 365697 369165 372235 376008 380704 385551 389757 393339 396942 400999 405154 408629 411046
56307 411046 412716 414135 415518 416945 418634 420734 423026 425106 426778 428038 428960 429932 431835 435419 440473
56292D40473N594N652O169P248Q120Q356Q448R018J0033J1112J2247J3695J5340
56279E61505J6636J7298J7775J8823K0741K3226K5870K8514L1154L3736L6303
56268H31581L9172M2771M7292N2580N8310O4158O9990P5961Q2339Q8999R5267
56257A548420J00444J04374J07252J08978J08992J06781J02280R5794Q7615P7753
56247B548683O5965N2218L7198K2048P442o684k0276l2571m2922n1729n9790o7079
56235B452503p2985p7465q1032q3736q5256q5927q6511q6797q5723q3188q0503
56224A543380p8391p5855p1845o6966o2384n8067n3296m8204m3494l9150l4749
56213I10979l0656k7645k5520k3374k1026j8993j7106j4544j1422r007p988p630
$$ plain form
56292 440473 446067 451719 457888 465136 473256 481612 490060 499078 509111 520223 532470 546165 561505
56279 561505 578141 595439 613214 632037 652778 676004 701874 730388 761542 795278 831581
56268 831581 870753 913524 960816 1013396 1071706 1135864 1205854 1281815 1364154 1453153 1548420
56257 1548420 1648864 1753238 1860490 1969468 2078460 2185241 2287521 2383315 2470930 2548683
56247 2548683 2614648 2666866 2704064 2726112 2733554 2726870 2706594 2674023 2631101 2579372 2519582 2452503
56235 2452503 2379518 2302053 2221021 2137285 2052029 1966102 1879591 1792794 1707071 1623883 1543380
56224 1543380 1464989 1389134 1317289 1250323 1187939 1129872 1076576 1028372 984878 945728 910979
56213 910979 880323 852678 827158 803784 782758 763765 746659 732115 720693 711686 703698 696068
56201F96068p073o381n824n043l719k328j597j610j910k011j509k44J272K160
56187F60251K306K607L709N074N835O047O464P416Q495R190R414R526J0059J1194
56173G57587J2447J3193J3534J4144J5144J5821J5844J5904J6678J7752J8308
56162I26356J8416J8890K0109K1680K3193K4817K7135L0751L5886M2150M8992
56151A238375N6610O6001P7757R1336J05829J20876J36097J50101J60871J66885
56141B370738J67223J61114J48499J31152J12257R4540P9206O6522N6409M7999
56131C435659L9297K8199J3952k338j8465l2334m2940n0691n7128o4314p4267
56120C174630q8196j05618j24147j40471j51732j56271j53772j45230j32482j17235
$$ plain form
56201 696068 688995 682614 676790 671747 668028 665700 664103 662493 660583 658572 657063 656819 658091 660251
56187 660251 662557 665164 668873 673947 679782 685829 692293 699709 708204 717394 726808 736334 746393 757587
56173 757587 770034 783227 796761 810905 826049 841870 857714 873618 890296 908048 926356
56162 926356 944772 963662 983771 1005451 1028644 1053461 1080596 1111347 1147233 1189383 1238375
56151 1238375 1294985 1360986 1438743 1530079 1635908 1756784 1892881 2042982 2203853 2370738
56141 2370738 2537961 2699075 2847574 2978726 3090983 3185523 3264729 3331251 3387660 3435659
56131 3435659 3474956 3503155 3517107 3514769 3496304 3463970 3421030 3370339 3313211 3248897 3174630
56120 3174630 3086434 2980816 2856669 2716198 2564466 2408195 2254423 2109193 1976711 1859476
56110A859476j00562q3513o7637n4225m3293l4031k6015j9336j3710q450l437
56099A405267O76L483N401O908P842P913P378O776O273N692N048M665M807N322
56085A483451N733N659N318N442O486Q052R429J0520J1732J3081J4088J4608J5182
56072A608781J6238J7480J8392J8955J9594K0652K2150K3749K4885K5288K5481
56061A841645K6316K7832K9046K9193K8662K8388K8798K9745L1066L2604L3977
56050B167272L4896L5640L6725L8136L9386M0275M1114M2130M3126M3885M4536
56039B607121M5213M5740M6033M6647M8395N1312N4445N6986N9286O2300O6214
56028C189692P0225P3649P6629P9536Q2290Q4800Q7523R0862R4395R7427J00174
$$ plain form
56110 1859476 1758914 1675401 1607764 1553539 1510246 1476215 1450200 1430864 1417154 1408704 1405267
56099 1405267 1405943 1409426 1414827 1421735 1429577 1437490 1444868 1451644 1457917 1463609 1468657 1473322 1478129 1483451
56085 1483451 1489184 1494843 1500161 1505603 1512089 1520141 1529570 1540090 1551822 1564903 1578991 1593599 1608781
56072 1608781 1625019 1642499 1660891 1679846 1699440 1720092 1742242 1765991 1790876 1816164 1841645
56061 1841645 1867961 1895793 1924839 1954032 1982694 2011082 2039880 2069625 2100691 2133295 2167272
56050 2167272 2202168 2237808 2274533 2312669 2352055 2392330 2433444 2475574 2518700 2562585 2607121
56039 2607121 2652334 2698074 2744107 2790754 2839149 2890461 2944906 3001892 3061178 3123478 3189692
56028 3189692 3259917 3333566 3410195 3489731 3572021 3656821 3744344 3835206 3929601 4027028 4127202
56017D127202J03570J07893J12368J16263J19721J23191J26861J31016J36266
56008E204351J42769J49600J55593J60694J66026J72679J80821J89927J99466
55999F721926K09206K19249K29986K41956K55465K70279K85777L01594L18085
55990I053523L35994L55795L77559M01412M27586M55994M86305N18740N54251
55981A2967159N93585O36730O83767P35709P93857Q58907R31455J012929J105153
55972B0319251J209431J327049J460421J612936J787981J989167K221219K489709
55964C4417164K800352L159827L577035M062321M625667N276746O025936O883151
55956G0828199P855472Q947147J0161301J1499337J2957494J4521403J6154622
$$ plain form
56017 4127202 4230772 4338665 4451033 4567296 4687017 4810208 4937069 5068085 5204351
56008 5204351 5347120 5496720 5652313 5813007 5979033 6151712 6332533 6522460 6721926
55999 6721926 6931132 7150381 7380367 7622323 7877788 8148067 8433844 8735438 9053523
55990 9053523 9389517 9745312 10122871 10524283 10951869 11407863 11894168 12412908 12967159
55981 12967159 13560744 14197474 14881241 15616950 16410807 17269714 18201169 19214098 20319251
55972 20319251 21528682 22855731 24316152 25929088 27717069 29706236 31927455 34417164
55964 34417164 37217516 40377343 43954378 48016699 52642366 57919112 63945048 70828199
55956 70828199 78683671 87630818 97792119 109291456 122248950 136770353 152924975
55949A52924975J7779059J9257935K0394567K0941650K0607207J9072001J6061791
55942B87039185J1484261N560292j153347p887164j3866079j8500475k1495879
55935B41180794k2865760k2861829k1856783k0229393j8292387j6269990j4305258
55928A04499394j2477771j0823959r355676q071753o962281o010982n199015m508030
55920D1089927l920901l421762k996718k634119k323982k057759j828652j631278
55912B0274756j460715j312433j183082j070368r71873q84709q06655p36864o75036
55903A1173021o20285n71213n26795m86653m50547m17963l88316l61370l37085
55894G012794l15044k94344k74473k56023k39953k26222k13711k01615j90135
$$ plain form
55949 152924975 170704034 189961969 210356536 231298186 251905393 270977394 287039185
55942 287039185 298523446 304083738 302930391 295043227 281177148 262676673 241180794
55935 241180794 218315034 195453205 173596422 153367029 135074642 118804652 104499394
55928 104499394 92021623 81197664 71841988 63770235 56807954 50796972 45597957 41089927
55920 41089927 37169026 33747264 30750546 28116427 25792445 23734686 21906034 20274756
55912 20274756 18814041 17501608 16318526 15248158 14276285 13391576 12584921 11848057 11173021
55903 11173021 10552736 9981523 9454728 8968075 8517528 8099565 7711249 7349879 7012794
55894 7012794 6697750 6403406 6128933 5872910 5632957 5406735 5193024 4991409 4801274
55885D801274j79573j69611j59991j51314j44314j38707j33435j27834j22018
55876C474477j16221j10361j04331r8355r2895q8284q4359q0525p6466p2701o9931
55865B480048o7871o5509o2611o0041n8203n6220n3365n0409m8547m7622m6521
55854A863129m4874m3206m1753m0242l8805l7968l7646l7088l6018l4886l3780
55843A436863l2087k9572k7024k5258k4066k2693k0889j9039j7497j6265j5198
55832A187275j4293j3811j4106j5148j6274j6833j6994j7518j8608j9542j9691
55821A004457j9394j9385j9732j9798j9194j8234j7438j6910j6470j6034j5614
55810H06254j4928j3499j1416r560q640q169p079n245l633k768j970o25O59R64
$$ plain form
55885 4801274 4621701 4452090 4292099 4140785 3996471 3857764 3724329 3596495 3474477
55876 3474477 3358256 3247895 3143564 3045209 2952314 2864030 2779671 2699146 2622680 2549979 2480048
55865 2480048 2412177 2346668 2284057 2224016 2165813 2109593 2056228 2005819 1957272 1909650 1863129
55854 1863129 1818255 1775049 1733296 1693054 1654249 1616281 1578635 1541547 1505529 1470643 1436863
55843 1436863 1404776 1375204 1348180 1322922 1298856 1276163 1255274 1236235 1218738 1202473 1187275
55832 1187275 1172982 1159171 1145065 1129917 1113643 1096810 1079816 1062298 1043690 1024148 1004457
55821 1004457 985063 965678 945946 926148 906954 888720 871282 854372 837902 821868 806254
55810 806254 791326 777827 766411 756851 748211 740042 732963 727718 724085 721317 719347 718722 719381 720345
55796G20345N02N4o09k570o030r817j2890j5348j7522j8881j8614j6912j4921
55783E86787j3523j2622j1698j0632r750r171q523p500o482o126o363o433o020
55770D71944n789o298p063p300p121p239p790q259q401q445q474q314q051q000
55756C65400q109q027p651p036n980m413l092k930l647l997l436k620k170j959
55742C00333j876k251l011l398l060k616k603k637k287j997k316k835k775k231
55728B64440k035k589l509m239m458m106l490l218l541l970l838l106k289j807
55714B18245j718j827j804j443r68p86q62p59l17K45R03J768K388K052J085P21
55698B16923J221J265j7j586j968j254m25L41J368K221K233J846J937K156J432
$$ plain form
55796 720345 720847 720901 720292 717722 711692 701875 688985 673637 656115 637234 618620 601708 586787
55783 586787 573264 560642 548944 538312 528562 519391 510868 503368 496886 490760 484397 477964 471944
55770 471944 466155 459857 452794 445494 438373 431134 423344 415085 406684 398239 389765 381451 373400 365400
55756 365400 357291 349264 341613 334577 328597 324184 321092 318162 314515 310518 307082 304462 302292 300333
55742 300333 298457 296206 293195 289797 286737 284121 281518 278881 276594 274597 272281 269446 266671 264440
55728 264440 262405 259816 256307 252068 247610 243504 240014 236796 233255 229285 225447 222341 220052 218245
55714 218245 216527 214700 212896 211453 210485 209699 208837 208078 207761 208006 208909 210677 213065 215117 216202 216923
55698 216923 218144 219409 219392 217806 215838 214584 214159 214500 215868 218089 220322 222168 224105 226261 227693
55683B27693j0p39k54M10M25O5m09j311k498l079k788k525k907l327l175k917
55667B02654l148l450l057k074j167n60p0L25N90R30J422J776J933K342L160L746
55651B05352L588L143L057L113K651J638N41m50j359j942k080k287k967l552l258
55636B05188k475k321k984l502l323k974k966l038k930l020l617m300m586m733
55622A58419n228n839n881n240m504m089l786l373l205l790m845n233m139k121
55608I7146o54n12j052j305j230j410j849j886j280o72p01j253j852k324k636
55593G6530k526j716m69N16O87O0q85j558j636j229o11J43J045J759J759J045
55577G2914L18J11J69Nl06l58j81j98n20p95q45r39j271j549j355o94J0L67K97
$$ plain form
55683 227693 227683 226944 226690 227100 227525 227590 227181 225870 223372 220293 217505 214980 212073 208746 205571 202654
55667 202654 199506 196056 192999 190925 189758 189198 189128 189453 190043 190973 192395 194171 196104 198446 201606 205352
55651 205352 208940 212083 215140 218253 220904 222542 223083 222633 221274 219332 217252 214965 211998 208446 205188
55636 205188 202713 200392 197408 193906 190583 187609 184643 181605 178675 175655 172038 167738 163152 158419
55622 158419 153191 147352 141471 136231 131727 127638 123852 120479 117274 113484 108639 103406 99267 97146
55608 97146 96492 95980 94928 93623 92393 90983 89134 87248 85968 85296 84595 83342 81490 79166 76530
55593 76530 74004 72288 71819 72335 73022 73082 72197 70639 69003 67774 67163 67306 68351 70110 71869 72914
55577 72914 73232 73343 73512 73517 73211 72853 72672 72474 71954 71159 70314 69375 68104 66555 65200 64506 64516 64883 65180
55558F5180k6l79o42q01q09n53o2M19P01R07J133J096M37n74j185j087q15r55
55540F1985j339j422j105p36n25m12m74q77j338j228m58J84L0m37j87Q92J756
55523E4309J635J068J078J741K226K122K005K446L088L164K594K021J843J815
55509H3155J604J269R55N24k06j068j714k015k075j942j613j297j398k136l295
55494F8748m379m934m795m162l434k842k308j690j105q06q57j112j495k032k519
55479C0278k492j696n61P6k02r02j111n30J39L9p24j190q23k15j77o01p50m56
55461A8102k93n89r25q80o38n25l92Q7P75J204J178Q65M55N5k11k65k25k24k11
55442A7343j22j7J20M76R59R85J58j024j661j518j061n67J12Q83J201P99L3p56
$$ plain form
55558 65180 65154 64775 64133 63332 62523 61970 61908 62327 63028 63935 65068 66164 66601 66027 64842 63755 62940 61985
55540 61985 60646 59224 58119 57383 56858 56446 55972 55095 53757 52529 52071 52255 52285 51848 51661 52553 54309
55523 54309 55944 57012 58090 59831 62057 64179 66184 68630 71718 74882 77476 79497 81340 83155
55509 83155 84759 86028 86983 87507 87301 86233 84519 82504 80429 78487 76874 75577 74179 72043 68748
55494 68748 64369 59435 54640 50478 47044 44202 41894 40204 39099 38293 37436 36324 34829 32797 30278
55479 30278 27786 26090 25529 25605 25403 24501 23390 22860 22999 23038 22314 21124 20301 20086 19909 19308 18558 18102
55461 18102 17809 17220 16295 15415 14777 14252 13860 13947 14722 15926 17104 17969 18424 18479 18268 18003 17778 17554 17343
55442 17343 17221 17204 17324 17800 18759 19744 19902 18878 17217 15699 14638 14071 14183 15066 16267 17066 17099 16343
55424A6343j638k476k520j299M54J438J256O40L45L80L99K90J52Q5K34O69J038
55407A5790O83n43j783j913p74O09J085M68m94j021r75p32o15n97m67j78P4R1
55389H708q1j66K0L36M33J88p7J5L93N35O1q15j512j586j032k25L14K63j82m66
55369E124l02JM8k3K33P58R33M14l94r21j134j246j095l00J002K105K419J894
55351I516P83m91j201p14N84J292M87j101j979j641p87j9P13J318J250M98M2N66
55333I116J307J037j31r18o84j53j48n19p06o14m13mP10J298J168L02p55j507
55315H386j758j484q48k22J43L66N24K82n61j362j122K45J671K117J523M91m42
55298G949r57q20r1P19J068Q08Q2q92j708j812j062p9L57J63j10j09o3l00p43
$$ plain form
55424 16343 14705 12229 9709 8410 8864 10302 11558 12198 12543 12923 13322 13612 13764 13849 14083 14752 15790
55407 15790 16473 15930 14147 12234 11460 12069 13154 13622 13128 12107 11132 10400 9785 9188 8721 8543 8617 8708
55389 8708 8627 8461 8481 8817 9250 9438 9361 9376 9769 10304 10365 9550 8038 6452 5420 5195 5509 5772 5590 5124
55369 5124 4822 4823 4871 4848 5081 5839 6772 7186 6792 5871 4737 3491 2396 2096 3098 5203 7622 9516
55351 9516 10299 9808 8607 7893 8477 9769 10256 9155 7176 5535 4748 4729 5442 6760 8010 8508 8550 9116
55333 9116 10423 11460 11329 10411 9727 9574 9426 8907 8201 7587 7174 7170 7880 9178 10346 10648 9893 8386
55315 8386 6628 5144 4296 4074 4217 4583 5107 5389 4828 3466 2344 2589 4260 6377 7900 8391 7949
55298 7949 6992 6172 6081 6800 7868 8676 8758 7866 6158 4346 3284 3205 3562 3725 3615 3506 3443 3143 2400
55279B400r65n55M82J598J984J295Pj092j639j674F58j62R12J333J011O03N78
55262D933N75O9p82j348j289q14k70R6J64K1n2L1k7m02B19a02D45J184J141P22
55242C492M43M43N76P22Q43Q63P58O52P33J048J375J288N46m57q74l58L70L49
55224A2812m32j112j144q37o11m44k69k83m44k51M70J052Q62L14K94P85Q94K48
55206A1904m41m13J53N03K76k96q30j048p83j13N36P11L82j5q6Q5M5m47j042j132
55186G949o14j04j99o75p56j46N62O44J29l36k91Q5L34K84J72K83N92P99P16M66
55166I894K59J02j20l38l69k66l19o14p83m60J55M63J63l96o46m07P8N17P28N38
55146H179j65j091j577j197k87M28N91M14J91J1m3J60M76M68m1o69r12o43m2O97
$$ plain form
55279 2400 1435 880 1362 2960 4944 6239 6246 5154 3515 1841 658 496 1408 2741 3752 4355 4933
55262 4933 5508 5577 4795 3447 2158 1344 1074 1170 1334 1355 1303 1334 1307 905 219 -102 445 1629 2770 3492
55242 3492 3935 4378 4954 5676 6519 7382 8140 8792 9525 10573 11948 13236 13782 13325 12451 12093 12463 12812
55224 12812 12380 11268 10124 9287 8676 8232 7963 7680 7236 6985 7455 8507 9369 9683 9977 10762 11656 11904
55206 11904 11463 11050 11203 11706 11982 11686 10856 9808 9025 8912 9448 10159 10541 10526 10440 10525 10570 10123 9081 7949
55186 7949 7335 7231 7032 6357 5601 5455 6017 6661 6790 6454 6163 6248 6582 6866 7038 7321 7913 8712 9428 9894
55166 9894 10153 10255 10135 9797 9428 9162 8843 8229 7446 6986 7141 7604 7767 7371 6725 6318 6396 6913 7641 8179
55146 8179 8014 6923 5346 4149 3862 4290 4881 5295 5486 5497 5454 5614 6090 6558 6517 5848 4936 4293 4251 4948
55126D948J306J516J412J443J677J522O16l26k47Q10J739J818J495J515J943K299
55110B5486K252J826J241Q19P76R09P12k5r18j482j686j820k021k106j785r72
55094B1206K2N97M02k54p12o55l00R2M70P88Q91O87K37l58q87r50l74L55N65K75
55074B2097O3J04k8m33n84j90K66L08J49J06L5j66o3N86J163J008N01M79Q65Q17
55054B7083J39m20l38m5j71o97j101r36r7J051J805J750J337J335J692J531M66
55037C4384o92r28k32N28O81L18jJ83R10J809K439K649K541K174J592J058Q86
55020E0299J027J115J003Q81P93M42k63r33j180j079q64n03M7M29J94n37j147
55003D9724j288j210j306j682k218k735k906k339j093N9L18j76m13K66J337J767
$$ plain form
55126 4948 6254 7770 9182 10625 12302 13824 14440 14114 13867 14677 16416 18234 19729 21244 23187 25486
55110 25486 27738 29564 30805 31624 32400 33309 34021 33996 33078 31596 29910 28090 26069 23963 22178 21206
55094 21206 21228 21825 22227 21973 21261 20606 20306 20398 20868 21656 22547 23234 23471 23113 22226 21276 20902 21257 21822 22097
55074 22097 22160 22264 22236 21803 21219 21029 21295 21603 21752 21858 21893 21727 21664 22250 23413 24421 24922 25401 26266 27083
55054 27083 27222 26802 26464 26419 26248 25551 24450 23514 23417 24468 26273 28023 29360 30695 32387 33918 34384
55037 34384 33692 32764 32532 33060 33741 34059 34058 34241 35151 36960 39399 42048 44589 46763 48355 49413 50299
55020 50299 51326 52441 53444 54325 55118 55560 55297 54364 53184 52105 51241 50738 50785 51214 51408 50871 49724
55003 49724 48436 47226 45920 44238 42020 39285 36379 34040 32947 33006 33324 33148 32735 33001 34338 36105
54987C6105J231K89m52q30p96k57N89J148J079P04N13N57N63M03J15k28l62J15
54969D0486J182K194K645K805L198L781M207M502M896N297N652O452Q073R799
54955A05169J0502J0193R904J0026R913R226Q432P535N548K014j941m960p067
54942A74494q978j0581j1199j0916j0437r875q843p528o664o289n597m272l018
54929G0297k443k198j721j137q58p38k61O98J764K615L211L643M069M749N808
54914H7498O953P684P887Q034Q621R500R902R242P740O114M607K593o41m820q624
54899A62290j0812j1243j0808j0440j0354j0159r549q656p729o691n360l960l010
54886E3519k616k295j686j057p93p21l99R6K04l05r79j213q62k01M49R10J139
$$ plain form
54987 36105 37336 37625 37173 36343 35547 35290 35879 37027 38106 38810 39323 39880 40443 40846 40961 40733 40371 40486
54969 40486 41668 43862 46507 49312 52510 56291 60498 65000 69896 75193 80845 87297 95370 105169
54955 105169 115671 125864 135768 145794 155707 164933 173365 180900 186448 188462 186521 181561 174494
54942 174494 165516 154935 143736 132820 122383 112508 103665 96137 89473 83184 77587 73315 70297
54929 70297 67854 65656 63935 62798 61940 61202 60941 61639 63403 66018 69229 72872 76941 81690 87498
54914 87498 94451 102135 110022 118056 126677 136177 146079 155321 163061 169175 173782 176375 175734 170914 162290
54899 162290 151478 140235 129427 118987 108633 98474 88925 80269 72540 65849 60489 56529 53519
54886 53519 50903 48608 46922 45865 45072 44351 43952 44048 44252 43947 42968 41755 40893 40692 41141 42051 43190
54869D3190J133Q55K99l42p13o86n62o62q84r30q86j156j781k237k029j264m97
54852C0848k03m20q06r05n81j86k07p24j323j544j290q00m00k70l23k89lM15P55
54833B1744R27R27P66O62R90J777K395K245J530R52P38N65L89O24J327J819J568
54816D1945R39O51Q40J123J308J547J925K333K733L256L984M868N819O769P734
54801H7774Q827J0039J0939J0944J0170R436R103Q333O138K847k49k572m685o943
54787A60101q684r180q656p787o714n337m100l712m132m573m496m031l349k387
54773H2963j372r18j174j353o40P72K010K618K830K931K959L078L660M764N896
54758A09024O599P086P984R494J1015J1597J0715Q613O012L550J504j50j604l104
$$ plain form
54869 43190 44323 45178 45477 45135 44422 43736 43174 42512 41628 40698 39812 38656 36875 34638 32609 31345 30848
54852 30848 30645 30225 29419 28514 27933 27747 27540 26816 25493 23949 22659 21859 21459 21189 20866 20577 20574 20989 21744
54833 21744 22671 23598 24364 25026 26016 27793 30188 32433 33963 34915 35653 36218 36607 37231 38558 40377 41945
54816 41945 42884 43535 44375 45498 46806 48353 50278 52611 55344 58600 62584 67452 73271 80040 87774
54801 87774 96601 106640 117579 128523 138693 148129 157232 165565 171703 174550 174301 171729 167044 160101
54787 160101 151417 142237 133581 125794 119080 113743 109643 105931 101799 97226 92730 88699 85350 82963
54773 82963 81591 80673 79499 78146 77506 78278 80288 82906 85736 88667 91626 94704 98364 103128 109024
54758 109024 115623 122709 130693 140187 151202 162799 173514 182127 188139 191689 193193 193043 191439 188335
54744A88335m685n938o374o127n959o256o549o320n892n862o097o043n804n930
54730A04499o261o027n237m830n062m946l907k899k935l436l218k398k008k138
54716D9197j929j267r93j286j180k01P75Q95N96P00J074J053O26L24K44J9m34
54699D8213q40j109j366j408q19L59J441J808J490J013Q91J305K014K427K010
54684E7429P83n54j095n07N97J183Q89M39P80J903K923L172K736J875O72n71j183
54667G1471r18m43n29j046j270q99k63K66N48M75M3l61k61K93Q09J053J267J610
54649G1845J846J727J440J505K315L829N488O524O575O092N837O019O224O200
54635A33466O354P219Q700J0044J0443R604P850N772L745J650q80l871o767q763
$$ plain form
54744 188335 183650 177712 171338 165211 159252 152996 146447 140127 134235 128373 122276 116233 110429 104499
54730 104499 98238 92211 86974 82144 77082 72136 68229 65330 62395 58959 55741 53343 51335 49197
54716 49197 47268 46001 45008 43722 42542 42341 43116 44011 44607 45307 46381 47434 48060 48384 48628 48647 48213
54699 48213 47373 46264 44898 43490 42671 43030 44471 46279 47769 48782 49673 50978 52992 55419 57429
54684 57429 58212 57658 56563 56056 56653 57836 58725 59164 59944 61847 64770 67942 70678 72553 73225 72654 71471
54667 71471 70553 70110 69581 68535 67265 66366 66103 66369 66917 67392 67435 67074 66813 67106 67915 68968 70235 71845
54649 71845 73691 75418 76858 78363 80678 84507 89995 96519 103094 109186 115023 121042 127266 133466
54635 133466 139820 147039 155739 165783 176226 185830 193680 199452 203197 204847 203967 200096 193329 184566
54621A84566r413r010q403q322q731q954q499p585o725o052n355m599m016l698
54607H5204l554l550l668l629l081k186j555j449j447j111o25m09m47m04k10j26
54591E7753k33k62m3J97J07k85n53l49J63M40J11o44j311j530j336r62o42n61
54573E0060p72j093j203r83n75j70J92M82N13J08o51j410j772j510o56N14J557
54556D2631K086J951J322N80M5k66n38p94p85l62J89M55M37M44M77J47o96j523
54538D5800j635q35N40K060L386M185M212L551K636J953J790K166K870L588M131
54523H0398M499M716M659M219L518K822K193J376R8j538l006l740l617l024k456
54508I1117k109j974k079k412k684k527k011j611j541j465j080o62o79j079j338
$$ plain form
54621 184566 175153 166143 157740 149418 140687 131733 123234 115649 108924 102872 97517 92918 88902 85204
54607 85204 81650 78100 74432 70803 67722 65536 63981 62532 61085 59974 59349 58940 58493 58089 57879 57753
54591 57753 57520 57258 57215 57412 57519 57234 56681 56332 56495 56935 57046 56402 55091 53561 52225 51263 50621 50060
54573 50060 49288 48195 46992 46009 45434 45264 45456 45938 46451 46559 45908 44498 42726 41216 40560 41074 42631
54556 42631 44717 46668 47990 48570 48615 48349 47811 47017 46232 45870 46059 46514 46951 47395 47872 48019 47323 45800
54538 45800 44165 43330 43870 45930 49316 53501 57713 61264 63900 65853 67643 69809 72679 76267 80398
54523 80398 84897 89613 94272 98491 102009 104831 107024 108400 108498 106960 103954 100214 96597 93573 91117
54508 91117 89008 87034 84955 82543 79859 77332 75321 73710 72169 70704 69624 68962 68283 67204 65866
54493F5866j151p49n28o28q96j034q10l65k27p05j319j205k43O53N79k35p33l64
54475E5906K45J53o75j260p80M01J179J031N83O61J194J411R57K85j08l12o80
54458F0191j247j765k049k022j588p99l1L12J93j51n72r51r33j72J073J969J888
54441E3346J021R7l22j68J97L05O6o1L92J093J150L46l54m2Q37J035J94p49q69
54422E7514l00K84O50J032J513J848J797J369Q25N56Q59J576K197K396K309K152
54406G8577J858J357Q90P45Q54R69J035J058Q52K89l65p65r89j309j607j537j237
54389H0675j318k001k747k925k476j814j354j259j325j106m02L68O69O06P10R51
54373F5252P38j0n84n96o01j051j366q23K14P18M51O1n9j03n1N80J851K936K937
$$ plain form
54493 65866 64715 63966 63438 62810 61914 60880 60070 59705 59478 58773 57454 56249 56006 56659 57238 57003 56270 55906
54475 55906 56151 56304 55629 54369 53589 53990 55169 56200 56783 57444 58638 60049 61006 61291 61183 60871 60191
54458 60191 58944 57179 55130 53108 51520 50721 50690 51002 51195 51044 50472 49521 48588 48416 49489 51458 53346
54441 53346 54367 54464 54142 53974 54171 54476 54542 54481 54873 55966 57116 57462 57108 57066 57903 58938 59132 58383 57514
54422 57514 57214 57498 58148 59180 60693 62541 64338 65707 66532 67088 67947 69523 71720 74116 76425 78577
54406 78577 80435 81792 82682 83427 84281 85250 86285 87343 88195 88484 88119 87354 86365 85056 83449 81912 80675
54389 80675 79357 77356 74609 71684 69208 67394 66040 64781 63456 62350 61948 62316 62985 63591 64301 65252
54373 65252 65990 65980 65396 64800 64199 63148 61782 60959 61173 61891 62342 62403 62344 62241 62190 62770 64621 67557 70494
54354G0494J882O55J90Q03J987K730K368J228J75l60n66n54j77L26K25p75j918
54337G8713k217j648j046j044j465j790j811j799k110k671k884k261j157n59r47
54322E3304j723j994j610j052o06j75K21L31P0l68q93j555k084j862p23M80O61
54305D0422k37j128j049k24L96L91K41M55P90O48j2n49n03j11J42K16M26Q33J053
54286D2200P63J20m12n87n13l47l4M96J001J057N88O0o1J61L53M24N69P59O36
54267D7233O1n90q07n68k42j91m16o03m07J61O07N01R4L7M60P75N56J32kJ49M30
54246D7370J070K176L027K659J180k09o48l93j45j78m72j004j485j347n74q5o82
54229E0260j825k185j325j59L09J7n50j124j571j583j043l98j37j11N4J25m08
$$ plain form
54354 70494 72376 73031 73221 74024 76011 78741 81109 82337 82512 82152 81586 81032 80855 81181 81406 80631 78713
54337 78713 76496 74848 73802 72758 71293 69503 67692 65893 63783 61112 58228 55967 54810 54251 53304
54322 53304 51581 49587 47977 46925 46319 46144 46365 46696 46766 46398 45505 43950 41866 40004 39281 39761 40422
54305 40422 40185 39057 38008 37784 38180 38571 38812 39267 40057 40705 40693 40144 39641 39530 39672 39888 40314 41147 42200
54286 42200 42963 43083 42671 42084 41571 41224 41190 41686 42687 43744 44332 44392 44331 44492 44845 45269 45838 46597 47233
54267 47233 47294 46704 45897 45329 45087 44896 44480 43877 43470 43631 44238 44739 44833 44870 45330 46105 46661 46793 46791 46940 47370
54246 47370 48440 50616 53643 56302 57482 57273 56625 56232 56087 55909 55437 54433 52948 51601 51027 50942 50260
54229 50260 48435 46250 44925 44766 45075 45092 44542 43418 41847 40264 39221 38823 38686 38575 38629 38754 38346
54212C8346j221j285l28O08N73k4k17M2Q6j72j50K65M83K47L8J35J36k11m04R
54192C6956O46Q31M68j01o54r94q11k54j29q37j545j206j09M81K9p58j064p54
54174C0195l3Q71J532J604J380J401J454P69o68j871k185k016j837j394m79L08
54158B9031L51J1K0L20K92j27l18N5O43R46Q23M56J81K69O03O80K49k48k68N2
54138C4021Q2m21j039j221p85K6P08Q23M74K18L45M76J51m75r09r04m34M71J380
54119C2987J428L66p61p06L81J305J497J399J278Q30J05k14Q6K63k06p33n23K32
54101C9014P33P18N69O11Q59J226J460J174L67l09k66K19M72L93M20O75Q03P13
54083D9851Q32J382J840J517M39o30j004o85j83J02K31M09N82N33L43M23R37J411
$$ plain form
54212 38346 37125 35840 35512 36120 36693 36669 36452 36494 36580 36408 36258 36523 37006 37253 37291 37426 37562 37351 36947 36956
54192 36956 37602 38433 38901 38800 38146 37152 36341 36087 35958 35121 33576 32370 32261 32742 32771 32013 30949 30195
54174 30195 30162 31033 32565 34169 35549 36950 38404 39173 38505 36634 34449 32433 30596 29202 28723 29031
54158 29031 29382 29393 29413 29733 30025 29898 29580 29635 30278 31224 32047 32503 32684 32953 33556 34236 34485 34237 33969 34021
54138 34021 34103 33682 32643 31422 30637 30663 31371 32194 32668 32886 33231 33707 33858 33383 32474 31570 31136 31607 32987
54119 32987 34415 34781 34020 33314 33695 35000 36497 37896 39174 40004 40109 39895 39981 40244 40038 39305 38782 39014
54101 39014 39747 40465 41034 41645 42504 43730 45190 46364 46731 46422 46156 46375 46847 47240 47660 48335 49138 49851
54083 49851 50683 52065 53905 55422 55861 55231 54227 53542 53359 53461 53692 54101 54683 55216 55559 55982 56919 58330
54065E8330J222K95p49j202q54o0O71J180J643K084K108J542J063J539K750L510
54049G5072L313L089L801M956N389M991M700M896M837L873K418J347J040J351
54035A25073J971K365J889N00q53j067o1J160J495N52j283l086l837l175j848
54020A19795j124j575k664l597m132m376m211l544k897l043l870m217l249j599
54006G5697n48m24m64j59R2j49n70p48r11j432j938j702q08k06m40r96j146q71
53988F2277n99m35j43L46Q22J143J275J071M14m04p98n77j98j36k82k57j01j78
53970F3240m71n13j58J12o6k70Q1P65J034P81O97J197J792J852J429R85P29O93
53952G3909J078J949K804L014K626K297K436K810L075L262L649M434N564O713
$$ plain form
54065 58330 59552 59847 59098 57896 57042 56982 57653 58833 60476 62560 64668 66210 67273 68812 71562 75072
54049 75072 78385 81474 85275 90231 95620 100611 105311 110207 115044 118917 121335 122682 123722 125073
54035 125073 127044 129409 131298 131798 130945 129878 129817 130977 132472 133024 131741 128655 124818 121643 119795
54020 119795 118671 117096 114432 110835 106703 102327 98116 94572 91675 88632 84762 80545 77296 75697
54006 75697 75149 74725 74261 74102 74194 74045 73475 72727 71816 70384 68446 66744 65936 65730 65290 64294 63148 62277
53988 62277 61678 61243 61100 61446 62268 63411 64686 65757 66171 65767 64969 64392 64194 64058 63776 63519 63418 63240
53970 63240 62769 62256 62098 62210 62144 61874 61955 62720 63754 64535 65232 66429 68221 70073 71502 72487 73216 73909
53952 73909 74987 76936 79740 82754 85380 87677 90113 92923 95998 99260 102909 107343 112907 119620
53938A19620P359P223O668O476P085Q208R150R367Q783P822P077O719O257N136
53924B22950L490K033J183O94J74l60o83q50j160j787k567l213l563l654l576
53909B09111l321k918k628k813l473m171m534m696m907n115n123n017m985m956
53895A50454m821m800n108n390n100m355l808l680l550l167k747k344j715j092
53881I8777j229k201k889k329j059l95p38j352j573j438j217r90q28q97j228j711
53865G6703k219k497k136j082J8M71M75P08J112Q77k34j221j029J70J378K035
53849G3529K297K290J800P98k51q54r89r23q23p58q78j200j312p32L31J013Q50
53832G4188M41N74J088J149N74L9m4q1k99j8J343L064L733K986J893J585K126
$$ plain form
53938 119620 126979 134202 140870 147346 154431 162639 171789 181156 189939 197761 204838 211557 217814 222950
53924 222950 226440 228473 229656 230350 230524 230164 229481 228631 227471 225684 223117 219904 216341 212687 209111
53909 209111 205790 202872 200244 197431 193958 189787 185253 180557 175650 170535 165412 160395 155410 150454
53895 150454 145633 140833 135725 130335 125235 120880 117072 113392 109842 106675 103928 101584 99869 98777
53881 98777 97548 95347 92458 90129 89070 88675 87937 86585 85012 83574 82357 81367 80539 79642 78414 76703
53865 76703 74484 71987 69851 68769 68787 69258 69733 70441 71553 72430 72196 70975 69946 70116 71494 73529
53849 73529 75826 78116 79916 80714 80463 79609 78620 77697 76874 76116 75238 74038 72726 71994 72325 73338 74188
53832 74188 74629 75203 76291 77440 78014 78053 78009 77928 77629 77611 78954 82018 85751 88737 90630 92215 94341
53815I4341K820L097K915K654K792L375L867L747L248L023L174L158K686K078
53801A36975J554Q41r5n68K7J195J832J500P48K22m1l69r47j680k321k644k705
53784A33524k923l645m588n009m477l313k191j504j262j411j960k797l547l773
53770I1124l374k740k386k432k494k188j614j196j181j452j762j953j897j454
53756F3001o59J79O70N81m3r14j525j461p95j04J42J14K83O85P68J37r05j721
53738E8433k049k083j926j391l64Q42J661J713J052J15m81l48L24R06J000Q50
53722E8254R58J345J543J277Q55O87O57K80n53j250j170m18K14J61k36j40P94
53705F3258J996K612K376J731J183Q23N32M10O92J327J871J953J713J599J808
$$ plain form
53815 94341 97161 100258 103173 105827 108619 111994 115861 119608 122856 125879 129053 132211 134897 136975
53801 136975 138529 139370 139275 138707 138734 139929 141761 143261 144009 144231 144190 143821 142874 141194 138873 136229 133524
53784 133524 130601 126956 122368 117359 112882 109569 107378 105874 104612 103201 101241 98444 94897 91124
53770 91124 87750 85010 82624 80192 77698 75510 73896 72700 71519 70067 68305 66352 64455 63001
53756 63001 62342 62521 63191 63772 63729 62815 61290 59829 59034 58930 59072 59186 59469 60154 60922 61059 60154 58433
53738 58433 56384 54301 52375 50984 50620 51462 53123 54836 55888 56003 55522 55174 55498 56404 57404 58254
53722 58254 59212 60557 62100 63377 64232 64919 65576 65856 65303 64053 62883 62465 62679 62840 62604 62464 63258
53705 63258 65254 67866 70242 71973 73156 73979 74511 74921 75613 76940 78811 80764 82477 84076 85884
53690H5884K081K061J664J095O15L78L76M50M20K68J43J34J87K64M07N60N69N14
53672I8070P64J391J832J521O99N4k91q08j492j582o66M99Q95N27K19L57N45M32
53654A02966K76M07O27M72j36p32p90k50M06O34L89J98N32J248J726J509O75l48
53636A09809j076j195p74k79j83m81o76k77P10J738K070J362J02o61k94P45J404
53619A12044J178N45K06K96M32K88o2k98j24N75J704K907L616L324K105Q26N25
53602A30087J399K577L046K601J730R00L04J50N64J225J511J266J079J538K376
53587A52353K683J989Q58K67M95Q42N75j72o56n41j60K12P45J466J832J327K01
53570A64316q74j553j866j777j239n11O4M64P81Q46N77L75N72P12J14r81j601
$$ plain form
53690 85884 87965 90026 91690 92785 93400 93778 94154 94604 95024 95292 95435 95569 95756 96020 96427 96987 97556 98070
53672 98070 98834 100225 102057 103578 104277 104331 104040 103232 101740 100158 99492 99991 100886 101413 101632 101989 102534 102966
53654 102966 103242 103649 104276 104748 104612 103880 103090 102840 103246 103880 104269 104467 104999 106247 107973 109482 110157 109809
53636 109809 108733 107538 106764 106485 106302 105821 105145 104868 105578 107316 109386 110748 110850 110189 109895 110640 112044
53619 112044 113222 113767 113973 114269 114701 114989 114927 114629 114505 115080 116784 119691 123307 126631 128736 129562 130087
53602 130087 131486 134063 137109 139710 141440 142340 142644 142794 143358 144583 146094 147360 148439 149977 152353
53587 152353 155036 157025 157883 158150 158645 159487 160062 159890 159234 158693 158533 158745 159490 160956 162788 164115 164316
53570 164316 163442 161889 160023 158246 157007 156496 156560 157024 157805 158651 159228 159603 160175 160887 161001 160020 158419
53553A58419j300m83M89J523K179J862R21N13R82J301P46O8K24Q58J042Q53J031
53536A71228J429J139R8n53k2J124J819J785J532J591K099K904L706M236M443
53521A98558M502M590M764M949N041M971M868M960N256N518N686O026O695P445
53507B73829Q002Q447Q908R210R226R291R810J0679J1518J2232J2906J3397J3544
53494D10999J3586J3828J4070J4004J3918J4295J4843J4743J3897J3164J3124
53483E64471J3453J3709J4017J4500J4748J4407J3828J3559J3573J3556J3580
53472G17401J3858J4049J3480J2120J0766J0115J0030R916R468Q837Q269P842
53460H46151P536P270O814N828M135J926m05k540m245n256n540n610o130p004
$$ plain form
53553 158419 157119 156636 157125 158648 160827 162689 163610 164123 165105 166406 167152 167220 167444 168302 169344 170197 171228
53536 171228 172657 173796 173894 173341 173319 174443 176262 178047 179579 181170 183269 186173 189879 194115 198558
53521 198558 203060 207650 212414 217363 222404 227375 232243 237203 242459 247977 253663 259689 266384 273829
53507 273829 281831 290278 299186 308396 317622 326913 336723 347402 358920 371152 384058 397455 410999
53494 410999 424585 438413 452483 466487 480405 494700 509543 524286 538183 551347 564471
53483 564471 577924 591633 605650 620150 634898 649305 663133 676692 690265 703821 717401
53472 717401 731259 745308 758788 770908 781674 791789 801819 811735 821203 830040 838309 846151
53460 846151 853687 860957 867771 873599 877734 879660 879255 876715 872470 867214 861674 856064 849934 842930
53446H42930p370o815o104o186o933p593q163r301j0945j2021j1895j1208j0775
53433G27621j0421r652q806q703r309r669r116p958o790n729m550l236k073j367
53419F30242j252j605k004j823o17J451L578M877N153N062N367O141O929P544
53405F69043Q276R213R918J0129J0435J1633J3578J5171J5701J5672J6143J7390
53393H22302J8596J8899J8492J8521J9888K2340K4844K6664K7808K8571K9061
53382A075986K9324K9589L0092L0787L1478L2106L2715L3146L3015L1984L0100
53371A420322K7894K6133K5307K5224K5111K4219K2305J9706J7104J5109J3744
53360A662178J2323J0197P561N173L263J263j311m252p266j0576j4456j8514k2033
$$ plain form
53446 842930 835560 828745 822641 816455 809522 801929 793766 784465 773520 761499 749604 738396 727621
53433 727621 717200 707548 698742 690039 680730 671061 661945 653987 647197 641468 636918 633682 631609 630242
53419 630242 628990 627385 625381 623558 622941 624392 627970 632847 638000 643062 648429 654570 661499 669043
53405 669043 677319 686532 696450 706579 717014 728647 742225 757396 773097 788769 804912 822302
53393 822302 840898 859797 878289 896810 916698 939038 963882 990546 1018354 1046925 1075986
53382 1075986 1105310 1134899 1164991 1195778 1227256 1259362 1292077 1325223 1358238 1390222 1420322
53371 1420322 1448216 1474349 1499656 1524880 1549991 1574210 1596515 1616221 1633325 1648434 1662178
53360 1662178 1674501 1684698 1692259 1697432 1700695 1701958 1700647 1696395 1689129 1678553 1664097 1645583 1623550
53347A623550k4757k6880k8465k9448l0031l0481l0614k9983k8595k6958k5468
53336A311870k4202k3318k3065k3350k3746k4084k4567k5161k5467k5327k5044
53325A044539k4661k3658k1804j9808j8516j7762j6678j4979j3257j1987j0958
53314H50471r880q990q646q716q805q891r282j0023j0747j1117j1097j0670r700
53301G23907q280o918n989n251m217k967k032j488o80Q55K586L525L389K867K809
53286G02116L539M918O608Q196R356J0128J0855J1772J2750J3512J3884J3785
53274H21419J3227J2473J2003J1991J1963J1260R817Q270P195O517N794M912M156
53261I40997L557K581P46j562l315l942l973m440n893q137j0621j2782j4197j4820
$$ plain form
53347 1623550 1598793 1571913 1543448 1514000 1483969 1453488 1422874 1392891 1364296 1337338 1311870
53336 1311870 1287668 1264350 1241285 1217935 1194189 1170105 1145538 1120377 1094910 1069583 1044539
53325 1044539 1019878 996220 974416 954608 936092 918330 901652 886673 873416 861429 850471
53314 850471 840591 831601 822955 814239 805434 796543 787261 777238 766491 755374 744277 733607 723907
53301 723907 715627 708709 702720 697469 693252 690285 688253 686765 686085 686940 689526 693051 696440 699307 702116
53286 702116 705655 710573 717181 725377 734733 744861 755716 767488 780238 793750 807634 821419
53274 821419 834646 847119 859122 871113 883076 894336 904153 912423 919618 926135 931929 936841 940997
53261 940997 944554 947135 947881 946319 943004 939062 935089 930649 924756 916619 905998 893216 879019 864199
53247H64199j5064j5379j5790j6112j6437j6998j7527j7305j6073j4489j3374
53236F89651j2874j2614j2392j2306j2342j2317j2236j2387j2988j3942j4920
53225E48333j5505j5301j4204j2675j1454j0834j0378r494q160o883o093n782
53213D21570n716n703n587n210m649m393m995o438q019q999r305r472r928j0481
53199C22675j0565r915q913q235q145q232p877p012o211o026o365o676o595o175
53185B15733n634n126m800m769m953n111n082m825m300l563k971k937l316l447
53171A54899k955k193j633j211o28k3J29k89r21j404j550j202m02L21L63j24l70
53154A40807q8J93R9N0M64R06P51K54J78N18N39P0j42L22P61L58n98j144r87p26
$$ plain form
53247 864199 849135 833756 817966 801854 785417 768419 750892 733587 717514 703025 689651
53236 689651 676777 664163 651771 639465 627123 614806 602570 590183 577195 563253 548333
53225 548333 532828 517527 503323 490648 479194 468360 457982 448488 440328 433445 427352 421570
53213 421570 415854 410151 404564 399354 394705 390312 385317 378879 370860 361861 352556 343084 333156 322675
53199 322675 312110 302195 293282 285047 276902 268670 260793 253781 247570 241544 235179 228503 221908 215733
53185 215733 210099 204973 200173 195404 190451 185340 180258 175433 171133 167570 164599 161662 158346 154899
53171 154899 151944 149751 148118 146907 146279 146256 146385 146096 145175 143771 142221 141019 140617 140938 141301 141177 140807
53154 140807 140719 140912 141011 141061 141525 142431 143182 143436 143614 144132 144671 144741 144599 144921 145682 146040 145442 144298 143311 142585
53134A42585q53j163j259j117r62q82q31p85p03m60l3K68j3r44j947k240j592
53117A27069n19K86N89N19J52m90j100j288j185j347j855k039j474p42o36r91
53101A14949j042o91n62q80j095q81o95r46j236r65l12L0j98o16q22q24q58j004
53083A01352j064p10O7O49L51o11j197q39k09j84o50r07q77r99j147o84L01P86
53065I3428K66m02j63P63J338J183Q92R29R44M17m92j024n91O75K016K630K321
53048A05130J643J357J694K205K320J863J021L6q89j499j617j368j106j020r78
53033A08792q28o64o81r13j327j970k736l134k774k025j705k002k190j727j022
53018H3094p66q73p28k04K29L22L57N41O46M32N3j68p2K97P07P87M02m8m4K44
$$ plain form
53134 142585 141732 140569 139310 138193 137231 136349 135518 134733 134030 133570 133537 133805 133792 132848 130901 128661 127069
53117 127069 126550 126836 127425 127944 128096 127606 126506 125218 124033 122686 120831 118792 117318 116576 115940 114949
53101 114949 113907 113216 112654 111774 110679 109798 109103 108157 106921 105956 105644 105674 105476 104860 104038 103214 102356 101352
53083 101352 100288 99578 99645 100294 100645 100034 98837 97998 97789 97605 96955 96048 95171 94172 93025 92341 92642 93428
53065 93428 93694 93292 93129 93892 95230 96413 97305 98234 99178 99595 99103 98079 97488 98163 100179 102809 105130
53048 105130 106773 108130 109824 112029 114349 116212 117233 117269 116380 114881 113264 111896 110790 109770 108792
53033 108792 107964 107300 106619 105706 104379 102409 99673 96539 93765 91740 90035 88033 85843 84116 83094
53018 83094 82328 81455 80727 80523 80752 81074 81431 81972 82618 83050 83103 82935 82863 83160 83867 84654 85056 85008 84964 85208
52998H5208J61l76o55k13M47O41M55L61L35P6k03J7N85P43L33J53P55J506J469
52979I1798P78L54M15J72q38j799j635m62N90Q32O20N30O48Q64J199J495J327
52962I6888P55N69J221J944J706P23J49L80O59M05k8k18l49n93n62J5O73Q68P34
52943A05939O50N48K71J41M83R68J098J016J086J079N70q1j22L34L97j91o67m83
52925A13036m9J18J60L23L66Q0j04L72J346K182K545K514K103J238J63n88o39
52908A25166o4P90J544J989K239K579L011L148K669J788J022O76O91Q56R87R76
52892A50067Q08M60j76j101j899k035j526j008r19j095j306j724k379k689k162
52877A31316j312j086j524j727j218n29k29r4L17P91P94L69J26M28J006J388J372
$$ plain form
52998 85208 85369 84993 84338 84125 84572 85213 85668 86029 86364 86440 86237 86254 86839 87582 87915 88068 88823 90329 91798
52979 91798 92576 92930 93345 93517 92679 90880 89245 88783 89373 90205 90825 91355 92003 92867 94066 95561 96888
52962 96888 97643 98212 99433 101377 103083 103806 103955 104335 104994 105399 105371 105153 104804 104211 103649 103664 104337 105205 105939
52943 105939 106589 107137 107408 107549 108032 109000 110098 111114 112200 113279 113849 113768 113646 113980 114377 114186 113519 113036
52925 113036 112987 113105 113265 113588 113954 114034 113930 114302 115648 117830 120375 122889 124992 126230 126393 125805 125166
52908 125166 125102 125892 127436 129425 131664 134243 137254 140402 143071 144859 145881 146557 147248 148104 149091 150067
52892 150067 150875 151335 151159 150058 148159 146124 144598 143590 142671 141576 140270 138546 136167 133478 131316
52877 131316 130004 128918 127394 125667 124449 123920 123691 123597 123914 124705 125499 125868 125994 126422 127428 128816 130188
52860A30188R87K90o16j527k202k489k413k139j819j456r90n41m15p86j414j820
52844A10838j699j160o44o13j155j801j939j537j234j457j703j212k08K05l96
52829I4285r67l27J103J682O91p53j215p35m90j018j620j489p56p9K73M54M76
52812H9515J44m38p91o16j85Mk10n32n62j41M88Q14M97k38p51o51j61K74N51Q11
52792H7822R97Q77N47M48P04Q54N29P2K8K19j8o65p62L01J818K573K271J621J208
52773A01444R58O69M20J90l13j139j747j636j024n50n37q54j323j795k011j749
52757H9003j178o79m00k81l79p74j175j065l53M93J049J261J141O25r3n21n07
52740H6167m85q32j313j563j757k240k791k813k233j611j335j152o80PN23O32
$$ plain form
52860 130188 131175 131465 130849 129322 127120 124631 122218 120079 118260 116804 115814 115273 114858 114072 112658 110838
52844 110838 109139 107979 107335 106722 105567 103766 101827 100290 99056 97599 95896 94684 94476 94681 94285
52829 94285 93318 92991 94094 95776 96467 95714 94499 93764 93274 92256 90636 89147 88391 88312 88585 89039 89515
52812 89515 89659 89221 88430 87814 87629 87633 87423 86891 86329 86188 86676 87490 87987 87749 86998 86347 86186 86460 87011 87822
52792 87822 88819 89696 90243 90691 91395 92249 92778 92850 92878 93097 93079 92414 91652 91953 93771 96344 98615 100236 101444
52773 101444 102402 103071 103491 103681 103368 102229 100482 98846 97822 97272 96735 95881 94558 92763 90752 89003
52757 89003 87825 87146 86746 86465 86086 85312 84137 83072 82719 83212 84261 85522 86663 87288 87195 86674 86167
52740 86167 85682 84850 83537 81974 80217 77977 75186 72373 70140 68529 67194 66042 65362 65369 65892 66524
52724F6524M12J25N3K77N69O61O06O35P27O17K77N0J53K94P5m78r35r13m01K86
52704F9614P16O73L85K48L80N60O15N59L60l1l03O2R68J537J182M65L12O52N87
52685G9541j66p37k63R88K009K180J633P62j14o91p20k70J93K37p8k88r5K89M83
52666H4893M40M40N95P06O19M47K33j55o12n64L29J468J817J050j94j184j715
52649H8613j775j143K86J957K864K394R43l56o50j60J53j78n58k31O45J267J379
52632I5450J485J914K338K325J933J512J319J473J903K188J882J115M70J78j04
52617A17381n63q55p07l38o3P7O3k13n18l94lj61j072j753j407o52n82j123j321
52598A05796q77l80j79J2L14M14J51k32n94j010j343j295r10n05j49K55M99L47
$$ plain form
52724 66524 66936 67061 67114 67391 67960 68621 69227 69862 70589 71206 71483 71533 71686 71980 72055 71577 70642 69729 69328 69614
52704 69614 70330 71003 71388 71636 72016 72576 73191 73750 74110 74079 73776 73838 74806 76343 77525 77990 78302 78954 79541
52685 79541 79375 78638 78375 79363 81372 83552 85185 85947 85833 85142 84422 84152 84345 84582 84504 84216 84121 84410 84893
52666 84893 85333 85773 86368 87074 87693 88140 88373 88218 87606 87042 87371 88839 90656 91706 91512 90328 88613
52649 88613 86838 85695 85981 87938 90802 93196 94139 93783 93133 92973 93126 92948 92390 92159 92804 94071 95450
52632 95450 96935 98849 101187 103512 105445 106957 108276 109749 111652 113840 115722 116837 117307 117485 117381
52617 117381 116818 115963 115256 114918 114855 114932 114995 114782 114264 113870 113867 113706 112634 110881 109474 108822 108240 107117 105796
52598 105796 104919 104539 104360 104372 104686 105100 105251 105019 104425 103415 102072 100777 99867 99362 99213 99468 99967 100314
52580A00314J78N28J103J076M00q2R0M76O77P98P86L04l97m59K01N28j05r16j016
52561A04484p29p21o98m6Q51J137Q47O40N50Q5o06q46o61p20j016p30L17J173
52543A03311J115N61J40k73r06j242o45N36J320J377J191J058N86m67j489j624
52527A04549q74j41l8k16r9N2m93j630k250j674n66L2kj37k67o81j182j158m96
52508I2729K81P80R46N63n53j731j817q01j25q15j996k083q50M68Q77N43J60J60
52490H6736N35Q92N93n72j853k154j313l21k9k11j23M07Q70Q53M61L7j26J25O80
52471H5487J002M55q76j953j753m50P17Q18J26m63n00k20M1K04L22M87Q41J359
52453H5644J675J451R08N86N89N40L50N00J233J987K031J438R58J008J246J128
$$ plain form
52580 100314 100492 101020 102123 103199 103599 103517 103607 104083 104760 105558 106344 106648 106251 105792 105993 106521 106416 105500 104484
52561 104484 103755 103034 102336 102290 103141 104278 105125 105765 106315 106400 105794 104948 104287 103567 102551 101821 102138 103311
52543 103311 104426 104987 105127 104854 103948 102706 102061 102597 103917 105294 106485 107543 108129 107662 106173 104549
52527 104549 103675 103534 103496 103280 103181 103233 102740 101110 98860 97186 96620 96652 96650 96513 96246 95565 94383 93225 92729
52508 92729 93010 93790 94736 95299 94746 93015 91198 90397 90272 89457 87461 85378 84528 84996 85873 86416 86576 86736
52490 86736 87271 88163 88756 88184 86331 84177 82864 82543 82514 82303 82180 82587 83457 84310 84771 84808 84682 84807 85487
52471 85487 86489 86944 86068 84115 82362 81912 82629 83447 83573 83110 82610 82390 82431 82635 82957 83444 84285 85644
52453 85644 87319 88770 89678 90264 90853 91393 91743 92243 93476 95463 97494 98932 99890 100898 102144 103272
52437A03272N47j75o83p69l09P16K037L001K964J927O13k55n96p06o18k19J93
52420A10940J31k67k72L81J097J355J389J474J217K55q19j034m27L0k52q51j061
52403A13286o15L68J481K018J550O56M63J184J782J392M29j89l46n56r62j220
52387A20721j213j116q40j30P34J038O85M48Q84J561J851J971K469L045K774J579
52371A36461O55R74J980K362J732Q95O46R63J439J884K213K240J870J345J039
52356A58698J139J601K140K227J508M57J63J076K340K823K475K104K048J886J471
52341A84156J350J867K449K406J972K006K787L743M386M917N712O591P025O976
52327B38343P075P789Q753R239R241R576J0739J2071J2526J2087J1896J2820J4419
$$ plain form
52437 103272 103819 103644 102961 102192 101883 102599 104636 107637 110601 112528 113141 112886 112290 111584 110966 110747 110940
52420 110940 111071 110804 110532 110913 112010 113365 114754 116228 117445 117700 116881 115847 115420 115450 115198 114347 113286
52403 113286 112671 113039 114520 116538 118088 118744 119207 120391 122173 123565 123994 123805 123459 122903 121941 120721
52387 120721 119508 118392 117552 117422 118156 119194 119879 120327 121211 122772 124623 126594 129063 132108 134882 136461
52371 136461 137116 138090 140070 142432 144164 145059 145705 146668 148107 149991 152204 154444 156314 157659 158698
52356 158698 159837 161438 163578 165805 167313 167770 167933 169009 171349 174172 176647 178751 180799 182685 184156
52341 184156 185506 187373 189822 192228 194200 196206 198993 202736 207122 212039 217751 224342 231367 238343
52327 238343 245418 253207 261960 271199 280440 290016 300755 312826 325352 337439 349335 362155 376574
52314C76574J5567J5741J5323J4854J4497J4231J4159J4361J4697J4951J5045
52303E40000J4905J4230J2703J0563Q631P546P110O644N857N023M300L382K011
52290F42905M88p11j608k621l934n276o208o395n705m439l348l013l214l210k615
52275E91096j622m41Q75K042K609K738L344M995P067Q510R100R521J0313J1340
52261F61487J2189J2615J2549J2094J1566J1257J1037J0535R716Q932Q290P360
52249G89627N874M282L258K677J683j55k151l320l637m018n020o115o527o507
52235G69951p149q955j1036j1960j1254r785q792q700q894q511p312n762m400
52222F57441l351k543k045j848j581r09j14J88L6K36J300K659L310K973K291K063
$$ plain form
52314 376574 392141 407882 423205 438059 452556 466787 480946 495307 510004 524955 540000
52303 540000 554905 569135 581838 592401 601032 608578 615688 622332 628189 633212 637512 640894 642905
52290 642905 643393 642682 641074 638453 634519 629243 623035 616640 610935 606496 603148 600135 596921 593711 591096
52275 591096 589474 589033 589908 591950 594559 597297 600641 605636 612703 621213 630313 639834 650147 661487
52261 661487 673676 686291 698840 710934 722500 733757 744794 755329 765045 773977 782267 789627
52249 789627 795501 799783 803041 805718 807401 807246 805095 801775 798138 794120 789100 782985 776458 769951
52235 769951 762802 753847 742811 730851 719597 709812 701020 692320 683426 674915 667603 661841 657441
52222 657441 654090 651547 649502 647654 646073 645164 645050 645238 645274 645510 646810 649469 652779 655752 658043 660106
52206F60106K509L137L240K650K057K196K785K791J963J310J630K255J990Q31
52192F91450j94o10r46j578k084k034j682j514j609j839k151k420k358j967j696
52177F66768j844k139k195k091k161k456k714k774k720k723k913l239l342k780
52163F30677j606m87q9m75j234j918k193j888j288j127j811k801l188k850k565
52148F05157k870l244k752j300J34N69k7r65j714k190k292j704m41Q49J542J792
52132E90544K192K853L394L778M484N713P059Q188R307J0583J1607J1946J1885
52119F83533J2133J3031J4378J5821J6997J7541J7385J6945J6598J6147J5204
52108H55713J3932J2930J2466J2236J1855J1115R859Q061O093M476L324K329J305
$$ plain form
52206 660106 662615 665752 668992 671642 673699 675895 678680 681471 683434 684744 686374 688629 690619 691450
52192 691450 691256 690646 689700 688122 686038 684004 682322 680808 679199 677360 675209 672789 670431 668464 666768
52177 666768 664924 662785 660590 658499 656338 653882 651168 648394 645674 642951 640038 636799 633457 630677
52163 630677 629071 628584 628495 628020 626786 624868 622675 620787 619499 618372 616561 613760 610572 607722 605157
52148 605157 602287 599043 596291 594991 595125 595694 595667 594702 592988 590798 588506 586802 586361 587210 588752 590544
52132 590544 592736 595589 598983 602761 607245 612958 620017 628205 637512 648095 659702 671648 683533
52119 683533 695666 708697 723075 738896 755893 773434 790819 807764 824362 840509 855713
52108 855713 869645 882575 895041 907277 919132 930247 940106 948167 954260 958736 962060 964389 965694
52095I65694L53n96j927l810n834p334p972p894p543p363p493p671p583p236o806
52080H78985o254n361m144k878j809j073p75p04q2J782M542P012Q504R350J0031
52065H97126J0413J0308J0118J0313J0635J0422R531Q480P762P373O952O010M268
52052A009711K075K83p29j567k952m568n556n970o832q647j0668j2090j3142j4417
52038I24931j5688j6229j6047j5934j6247j6413j5914j5179j5044j5638j6245
52027G50353j6176j5416j4448j3736j3380j3127j2651j1909j1172j0649j0232
52016F07457r783r490r603r978j0240j0399j0857j1612j2041j1749j1231j1202
52004D79272j1637j1984j2171j2703j3716j4578j4653j4034j3295j2838j2743
$$ plain form
52095 965694 966047 965451 963524 959714 953880 946546 938574 930680 923137 915774 908281 900610 893027 885791 878985
52080 878985 872731 867370 863226 860348 858539 857466 856691 855987 855905 857687 862229 869241 877745 887095 897126
52065 897126 907539 917847 927965 938278 948913 959335 968866 977346 985108 992481 999433 1005443 1009711
52052 1009711 1011786 1012069 1011340 1009773 1006821 1002253 996697 990727 983895 975248 964580 952490 939348 924931
52038 924931 909243 893014 876967 861033 844786 828373 812459 797280 782236 766598 750353
52027 750353 734177 718761 704313 690577 677197 664070 651419 639510 628338 617689 607457
52016 607457 597674 588184 578581 568603 558363 547964 537107 525495 513454 501705 490474 479272
52004 479272 467635 455651 443480 430777 417061 402483 387830 373796 360501 347663 334920
51993C34920j2920j3043j2617j1495j0186r283q695p814o490n417n295n893o302
51980B19470o099n785n911o127n642m515l818m190m882m798m058l751m222m558
$$ plain form
51993 334920 322000 308957 296340 284845 274659 265376 256681 248867 242377 236960 231665 225772 219470
51980 219470 213371 207586 201675 195548 189906 185391 181573 177383 172501 167703 163645 159894 155672 151114
$$ [...]
##END NTUPLES=NMR SPECTRUM
##END=
