##TITLE=NES1036_878015041_9242627_nzJsoLbIYV
##JCAMPDX= 6.0         $$ Bruker NMR JCAMP-DX V2.0
##DATA TYPE= NMR SPECTRUM
##DATA CLASS= NTUPLES
##ORIGIN= BRUKER
##OWNER= Administrator
$$ 1.72 TOPSPIN		Version 2.1
$$ 2015-07-01 23:18:14.258 -0700  Administrator@X
$$ Compression mode = diff/dup
##.OBSERVE FREQUENCY= 400.02188249412
##.OBSERVE NUCLEUS= ^1H
##.ACQUISITION MODE= SIMULTANEOUS (DQD)
##.ACQUISITION SCHEME= undefined
##.AVERAGES= 8
##.DIGITISER RES= 22
##SPECTROMETER/DATA SYSTEM= spect
##.PULSE SEQUENCE= zg30
##.SOLVENT NAME= COFFEE_meoh
##.SHIFT REFERENCE= INTERNAL, COFFEE_meoh, 1, 14.98509
##AUDIT TRAIL= $$ (NUMBER, WHEN, WHO, WHERE, PROCESS, VERSION, WHAT)
$$ ##TITLE= Audit trail, TOPSPIN		Version 2.1
$$ ##JCAMPDX= 5.01
$$ ##ORIGIN= Bruker BioSpin GmbH
$$ ##OWNER= Administrator
$$ $$ E:\/data/COFFEE/nmr/NES1036_878015041_9242627_nzJsoLbIYV/20/pdata/1/auditp.txt
$$ ##AUDIT TRAIL=  $$ (NUMBER, WHEN, WHO, WHERE, PROCESS, VERSION, WHAT)
(   1,<2015-07-01 23:18:07.024 -0700>,<Administrator>,<X>,<go>,<TOPSPIN 2.1>,
      <created by zg
	started at 2015-07-01 23:17:01.086 -0700,
	POWCHK enabled, PULCHK disabled,
       configuration hash MD5:
       21 0F 79 D6 B3 7B B4 F6 88 20 88 DB 03 48 BD 9F
       data hash MD5: 64K
       16 A3 86 30 1B 4A B0 FD B3 AD FD 3D EF CD 96 BC>)
(   2,<2015-07-01 23:18:10.195 -0700>,<Administrator>,<X>,<proc1d>,<TOPSPIN 2.1>,
      <Start of raw data processing
       efp LB = 0 FT_mod = 6 PKNL = 1 PHC0 = 0 PHC1 = 0 SI = 32K 
       data hash MD5: 32K
       93 B3 4F 00 33 15 10 75 B6 3D 6C F4 57 82 BA 51>)
(   3,<2015-07-01 23:18:10.477 -0700>,<Administrator>,<X>,<proc1d>,<TOPSPIN 2.1>,
      <pk PHC0 = 94.30115 PHC1 = 0 
       data hash MD5: 32K
       F5 0F 24 EE 71 7A 90 E2 2E 94 A0 EA 64 79 B8 50>)
(   4,<2015-07-01 23:18:10.586 -0700>,<Administrator>,<X>,<proc1d>,<TOPSPIN 2.1>,
      <abs ABSG = 1 
       data hash MD5: 32K
       EA 28 E5 4E AF BA 4A B2 DA 98 35 36 35 50 49 89>)
(   5,<2015-07-01 23:18:10.649 -0700>,<Administrator>,<X>,<proc1d>,<TOPSPIN 2.1>,
      <abs ABSG = 2 
       data hash MD5: 32K
       51 75 80 B2 B1 15 43 04 D3 11 40 80 1D 1D AD E2>)
(   6,<2015-07-01 23:18:10.711 -0700>,<Administrator>,<X>,<proc1d>,<TOPSPIN 2.1>,
      <abs ABSG = 3 
       data hash MD5: 32K
       EE DA 40 62 AD 65 D9 D8 68 24 12 78 25 E2 C7 82>)
(   7,<2015-07-01 23:18:10.774 -0700>,<Administrator>,<X>,<proc1d>,<TOPSPIN 2.1>,
      <abs ABSG = 4 
       data hash MD5: 32K
       0D E5 9A EB 2C 6D B1 25 C2 D1 9D 69 E1 2B 3D 3E>)
(   8,<2015-07-01 23:18:10.836 -0700>,<Administrator>,<X>,<proc1d>,<TOPSPIN 2.1>,
      <abs ABSG = 5 
       data hash MD5: 32K
       32 96 84 C3 99 B3 06 E8 55 07 2D 3B A2 7E FF 96>)
$$ ##END=
$$ 
$$ $$ hash MD5
$$ $$ 6F FF 86 99 12 FC 4C F9 3A C1 33 9F 55 A2 D4 E7
##$RELAX= 
##$RELAX= 
##$RELAX= 
##$RELAX= 
##$RELAX= 
##$RELAX= 
##$RELAX= 
$$ Bruker specific parameters
$$ --------------------------
##$DU= <E:\>
##$EXPNO= 20
##$NAME= <NES1036_878015041_9242627_nzJsoLbIYV>
$$ [...]
150 150 150 150 150 150 150 150
##$TP07= 0
##$TPNAME0= <>
##$TPNAME1= <>
##$TPNAME2= <>
##$TPNAME3= <>
##$TPNAME4= <>
##$TPNAME5= <>
##$TPNAME6= <>
##$TPNAME7= <>
##$TPOAL= (0..7)
0.5 0.5 0.5 0.5 0.5 0.5 0.5 0.5
##$TPOFFS= (0..7)
0 0 0 0 0 0 0 0
##$TUNHIN= 0
##$TUNHOUT= 0
##$TUNXOUT= 0
##$USERA1= <user>
##$USERA2= <user>
##$USERA3= <user>
##$USERA4= <user>
##$USERA5= <user>
##$V9= 5
##$VALIST= <valist>
##$VCLIST= <CCCCCCCCCCCCCCC>
##$VD= 0
##$VDLIST= <DDDDDDDDDDDDDDD>
##$VPLIST= <PPPPPPPPPPPPPPP>
##$VTLIST= <TTTTTTTTTTTTTTT>
##$WBST= 2048
##$WBSW= 25
##$XGAIN= (0..3)
0 0 0 0
##$XL= 0
##$YL= 0
##$YMAX_a= 631610
##$YMIN_a= -528565
##$ZGOPTNS= <>
##$ZL1= 120
##$ZL2= 120
##$ZL3= 120
##$ZL4= 120
##$ABSF1= 14.98509
##$ABSF2= -5.573092
##$ABSG= 5
##$ABSL= 3
##$ALPHA= 0
##$AQORDER= 0
##$ASSFAC= 0
##$ASSFACI= 0
##$ASSFACX= 0
##$ASSWID= 0
##$AUNMP= <proc_prof1d_extract_pilot.lims>
##$AXLEFT= 0
##$AXNAME= <>
##$AXNUC= <1H>
##$AXRIGHT= 0
##$AXTYPE= 0
##$AXUNIT= <>
##$AZFE= 0.1
##$AZFW= 0.1
##$BCFW= 0
##$BC_mod= 0
##$BYTORDP= 0
##$COROFFS= 0
##$CY= 15
##$DATMOD= 1
##$DC= 0
##$DFILT= <>
##$DTYPP= 0
##$F1P= 0
##$F2P= 0
##$FCOR= 0.5
##$FTSIZE= 32768
##$FT_mod= 6
##$GAMMA= 0
##$GB= 0
##$INTBC= 1
##$INTSCL= 1
##$ISEN= 128
##$LB= 0
##$LEV0= 0
##$LPBIN= 0
##$MAXI= 10000
##$MC2= 0
##$MEAN= 0
##$ME_mod= 0
##$MI= 0
##$NCOEF= 0
##$NC_proc= -8
##$NLEV= 6
##$NOISF1= 0
##$NOISF2= 0
##$NSP= 0
##$NTH_PI= 0
##$NZP= 0
##$OFFSET= 14.98509
##$PC= 1
##$PHC0= 94.30115
##$PHC1= 0
##$PH_mod= 1
##$PKNL= yes
##$PPARMOD= 0
##$PPDIAG= 0
##$PPIPTYP= 0
##$PPMPNUM= 2147483647
##$PPRESOL= 1
##$PSCAL= 4
##$PSIGN= 0
##$PYNMP= <proc.py>
##$REVERSE= no
##$SF= 400.02
##$SI= 32768
##$SIGF1= 0
##$SIGF2= 0
##$SINO= 400
##$SIOLD= 32768
##$SPECTYP= <>
##$SREGLST= <1H.CDCl3>
##$SSB= 0
##$STSI= 32768
##$STSR= 0
##$SW_p= 8223.68421052631
##$SYMM= 0
##$S_DEV= 0
##$TDeff= 65536
##$TDoff= 0
##$TI= <>
##$TILT= no
##$TM1= 0
##$TM2= 0
##$TOPLEV= 0
##$USERP1= <user>
##$USERP2= <user>
##$USERP3= <user>
##$USERP4= <user>
##$USERP5= <user>
##$WDW= 1
##$XDIM= 32768
##$YMAX_p= 445384953
##$YMIN_p= -764140
##$CURPLOT= <Network HP LaserJet P1505>
##$CURPRIN= <$Network HP LaserJet P1505>
##$DFORMAT= <normdp>
##$LAYOUT= <+/1D_H.xwp>
##$LFORMAT= <normlp>
##$PFORMAT= <normpl>
##$SURQMSG= 1
$$ End of Bruker specific parameters
$$ ---------------------------------
##NTUPLES= NMR SPECTRUM
##VAR_NAME=  FREQUENCY,     SPECTRUM/REAL,   SPECTRUM/IMAG
##SYMBOL=    X,             R,               I
##VAR_TYPE=  INDEPENDENT,   DEPENDENT,       DEPENDENT
##VAR_FORM=  AFFN,          ASDF,            ASDF
##VAR_DIM=   32768,         32768,           32768
##UNITS=     HZ,            ARBITRARY UNITS, ARBITRARY UNITS
##FACTOR=    0.250966925370066, 1,           1
##FIRST=     8223.43324360094, 61163,        -31306
##LAST=      0,             -172975,         -56552
##MIN=       0,             -764140,         0
##MAX=       8223.43324360094, 445384953,    0
$$ Real data points
##PAGE= N=1
##DATA TABLE= (X++(R..R)), XYDATA
$$ [...]
$$ plain form
19483 -96630 -101713 -303153 -91703 -257280 52359 46257 -69074 143013 178811 -179900 -12636
19471 -39719 -59572 -4010 -10033 -49295 156228 182076 -142037 -14371 27425 -992 -96625 -101778
19459 -101778 18362 -35816 -139365 -270222 -177627 111065 93917 -172925 -137200 -202107 -258872
19448 -258872 -118229 -260345 -3994 79460 -219240 -22929 -64663 269909 62762 -76826 294420
19436 -109972 -159771 -38293 -119647 202154 -124144 -74199 -74921 -234616 -186319 -212722 -213280 -7468
19423 -42264 -146612 -373188 -267888 -31889 -303546 -95038 8895 -176000 -130268 -96088 -340561
19412 -340561 70706 -41793 -147640 -109605 -160526 -294454 32076 -235439 -24353 -63238 -366549
19401 -366549 -70947 23074 -28952 -53482 33110 -305697 174695 123852 -284085 201848 -199607
$$ packed form
19483i6630n083k01440i1703j65577E2359o102f9074A43013L5798a79900a2636
19471c9719j9853d010o023l9262A56228K5848a42037a4371B7425i92r5633n153
19459a01778A8362c5816j03549j30857R2595A11065j7148a72925L5725o4907n6765
19448b58872a18229j42116c994G9460b19240b2929m1734B69909F2762g6826B94420
19436a09972m9799c8293q1354B02154a24144M9945p22j59695M8297k6403n58g468
19423d2264j04348k26576J05300c1889k71657i5038H895a76000M5732L4180k44473
19412c40561G0706d1793j05847L8035n0921j33928C2076b35439b4353l8885l03311
19401c66549g0947B3074b8952k4530C3110c05697A74695n0843b84085B01848a99607
$$ plain form
19389 -41059 -7424 -117070 -216433 -81829 -59877 -337747 151381 -90886 -77190 -278712 137451
19377 31222 -35300 122758 44939 -205772 -360250 -23433 17974 -177665 -192867 58879 -287092
19365 87723 326590 131483 386798 -101262 -37527 -189602 -241987 -148171 102428 -4536 -1050
19353 -170723 106043 119604 -199028 131026 -335574 85824 -137351 -63553 24703 -149751
19342 -216414 39902 -221207 -56443 183109 247324 -282515 37301 -179484 43992 -163745
19331 23760 -212273 65920 -303238 -121425 -367068 -171364 185790 55334 -79208 -98213
19321 -98213 -54212 -308035 -4487 -12001 -140274 -127204 148524 383766 -119836 -2188 -139425
19310 -139425 -306816 -9849 -447774 -262247 173229 -134594 -109168 -154191 279378 -128514
$$ packed form
19389d1059g424j09646r9363h1829K1952k77870A51381i0886J3696k01522A37451
19377C1222c5300A22758D4939b05772j54478b3433A7974a77665j5202E8879b87092
19365H7723K38867A31483K55315a01262c7527j52075n2385R3816A02428d536a050
19353a70723A06043J3561a99028A31026c35574H5824a37351f3553B4703a49751
19342b16414C9902b21207e6443A83109O4215b82515C7301a79484D3992a63745
19331B3760b12273F5920c03238a21425k45643a71364A85790E5334g9208j9005
19321i8213M4001k53823d487p514j28273J3070A48524K35242a19836b188j37237
19310a39425j67391i849m37925J85527A73229a34594K5426m5023B79378a28514
$$ plain form
19299 -19674 37316 -103971 -252934 -323411 -177936 -173878 20749 -259139 -218064 23158 7101
19287 169496 -43886 304311 -96711 -89443 -109348 161270 96076 -151758 -98827 -148003 -208202
19276 -208202 231231 -10443 139919 56519 -51566 -108710 -3684 -144331 23389 239023 -397002
19264 266240 -255 206327 -15387 -129479 -207079 56673 -215857 -12944 -177023 251735 523533
19253 523533 80437 -163704 106053 -109952 -196265 -88111 158723 -96053 6470 -136141 86349
19241 43000 25540 -162562 -233975 -215245 -396990 106977 103367 109445 -196840 116579 124813
19230 124813 -238502 -110170 -111636 132815 -268399 47186 -208370 -468633 -69926 -95601
19220 -95601 -250564 -144766 -49357 430071 -107739 -236894 93296 73981 -30512 -124740 -98545
$$ packed form
19299a9674C7316a03971j48963p0477J45475M058B0749b59139M1075B3158G101
19287A69496d3886C04311i6711P268j9905A61270o5194a51758N2931m9176o0199
19276b08202B31231a0443A39919E6519e1566n7144c684j40647B3389K15634c97002
19264B66240b55B06327a5387j14092p7600E6673b15857a2944j64079B51735K71798
19253E23533H0437a63704A06053a09952q6313h8111A58723i6053F470a36141H6349
19241D3000j7460a62562p1413J8730j81745A06977l610O078a96840A16579Q234
19230A24813b38502a10170j466A32815b68399D7186b08370k60263f9926k5675
19220i5601j54963J05798d9357D30071a07739j29155I3296j9315c0512r4228K6195
$$ plain form
19209 -98545 -446798 211050 -218945 -74196 -59629 -150409 -32623 -1556 29993 -407673 -85192
19197 -63712 62216 112266 345651 24547 153029 114106 95540 105323 22358 88340 -94081
19185 -28339 -122444 -185461 -94888 -277018 -325280 -51841 313887 -16956 -121139 78246 -15217
19173 35009 -50412 -38535 -109134 -27805 -5771 -91315 -54902 -63720 -70887 324158 -43436 -347592
19161 -347592 226467 -12754 11091 15727 -130502 -286702 -177911 43719 202949 -145381
19150 75016 -231085 -196498 -608613 -292552 327145 -32429 -29368 32995 -389197 -29901 -252374
19139 -252374 139463 -14444 187771 -171153 4966 167245 -230017 -166772 186593 -255976
19128 -39517 75088 -128489 -19077 -45047 97328 -36370 122708 -328447 -104443 -102823 82383
$$ packed form
19209i8545l48253B11050b18945g4196J4567r0780c2623a556B9993d07673h5192
19197f3712F2216N0050K33385B4547J28482l8923j8566R783B2358O5982i4081
19185b8339r4105o3017R0573j82130m8262e1841C13887a6956j04183G8246a5217
19173C5009e0412J1877p0599b7805e771q5544L6413q818p167C24158d3436l04156
19161c47592B26467a2754A1091M636a30502j56200J08791D3719J59230a45381
19150G5016b31085L4587m12115b92552C27145c2429L061C2995c89197b9901k22473
19139b52374A39463a4444A87771a71153D966J62279b30017O3245A86593b55976
19128c9517G5088a28489a9077k5970I7328c6370A22708c28447a04443J620H2383
$$ plain form
19116 -117474 23374 -199621 -70759 -174842 -298163 -111561 277849 -192513 -261387 -97135
19105 36261 -142072 36950 -214259 108149 91483 -162751 -149101 -207139 272465 -116212
19094 -326 -138249 -128043 -100888 39920 115584 94099 -166153 28481 -93522 7461 -165905 -32885
19081 28363 71061 -222959 49865 -84948 -235467 225554 -226963 -102478 72013 -290522
19070 -29279 -36003 -42274 10753 33484 11948 151937 -111902 -298577 -162657 -90493 378386
19058 247932 -200390 2344 95982 -157327 -195031 -90102 -528292 -424607 -246143 44791 49310
19047 49310 313908 12438 -52624 -6406 -69823 -149008 209691 48193 -86633 -72611 -153056
19036 -153056 -54283 60129 157729 62574 257562 166766 -174240 190912 239224 119623 -106519
$$ packed form
19116a17474B3374a99621g0759j04083j23321a11561B77849a92513o8874i7135
19105C6261a42072C6950b14259A08149j6666a62751J3650n8038B72465a16212
19094c26j37923J0206K7155C9920P5664k1485a66153B8481i3522G461a65905c2885
19081B8363M2698b22959D9865h4948j50519B25554b26963a02478G2013b90522
19070b9279o724o271A0753K2731A1948J39989a11902j86675J35920P2164C78386
19058B47932b00390B344R3638a57327l7704i0102m38190J03685J78464D4791M519
19047D9310K64598A2438e2624f406o3417p9185B09691D8193h6633J4022q0445
19036a53056e4283F0129R7600F2574J94988r0796a74240A90912M8312j19601a06519
$$ plain form
19024 68749 -133443 68631 -307418 -225544 245597 -100950 313252 -262216 -117701 -232458
19014 -232458 27152 306193 -97774 -79453 -270089 117448 -56265 -195022 -203209 -76505 -40421
19003 -40421 -104301 -249638 -175315 -70883 119856 -68076 -136207 49890 -35289 -452207 -285369
18992 -285369 38243 -239420 -98897 294362 -217623 -290523 91321 -131554 108260 81323
18982 81323 147863 183909 -103672 -67637 -49719 344643 -87925 -170329 193310 278764 -62053
18970 -444068 -141216 31765 -106799 -125431 229127 -53214 -179107 -280204 -305959 25834
18959 18251 -160832 -330250 64132 -25122 31617 -72680 82318 218814 361319 143764 30337
18947 101921 -363975 190531 28727 -205942 262597 190533 27451 189330 139017 -159926
$$ packed form
19024F8749a33443F8631c07418Q1874B45597a00950C13252b62216a17701j14757
19014b32458B7152K79041i7774J8321j90636A17448e6265j38757q187g6505L6084
19003d0421o3880j45337P4323g0883A19856f8076o8131D9890c5289m16918J66838
18992b85369C8243b39420i8897B94362b17623p2900I1321a31554A08260k6937
18982H1323O6540L6046a03672L6035J7918C44643h7925q2404A93310Q5454f2053
18970d44068a41216C1765a06799j8632B29127e3214j25893j01097k5755B5834
18959A8251a60832j69418F4132b5122C1617g2680H2318J36496J42505A43764C0337
18947A01921c63975A90531B8727b05942B62597p2064B7451J61879n0313a59926
$$ plain form
18936 33193 -131360 -22068 -56828 75963 46512 136890 -151249 19076 -350525 -263590 -131044
18924 -68938 -133203 73908 -141617 114816 -26740 56419 2362 4871 -52603 -18033 299520
18912 25454 -62997 324887 249295 -168735 -273449 165563 -198801 -43431 -127490 303035
18901 -229909 -19228 -213283 -146527 -173085 -474788 -312560 -130872 63258 2535 -68256 221147
18889 83474 -97243 -88487 -127593 -217544 61673 -267568 -17103 30643 -6664 -423518 63899 -437223
18876 43386 12921 32083 186167 -291969 -213653 -51995 55180 156820 63257 -231187 -245014
18865 -245014 255421 217442 -254928 -371034 43700 217573 -169644 -30760 -259109 44352
18854 -212556 261128 -209528 175664 29436 186736 15681 150618 79739 127833 -17011
$$ packed form
18936C3193a31360b2068l4760G5963k9451R0378a51249A9076c50525Q6935a31044
18924f8938o4265G3908a41617A14816b6740E6419B362K509e2603a8033B99520
18912B5454f2997C24887p5592a68735j04714A65563a98801d3431q4059C03035
18901b29909a9228j94055O6756k6558l01703J62228a30872F3258B535f8256B21147
18889H3474i7243Q756l9106q9951F1673b67568a7103C0643f664m16854F3899d37223
18876D3386A2921J9162J54084b91969P8316e1995E5180J01640F3257b31187j3827
18865b45014B55421l7979b54928j16106D3700J73873a69644c0760k28349D4352
18854b12556B61128b09528A75664B9436J57300A5681J34937p0879M8094a7011
$$ plain form
18843 -85323 2361 -245587 122541 -142693 50174 14034 -368115 -36497 -210368 288953 -205566
18831 -259166 -75381 -139437 -136427 -267912 159692 104736 -556489 79690 6618 -8716 48587
18819 -31521 -15731 298847 -11591 15009 235436 431368 276541 -32798 -96587 142469 297524
18808 297524 187106 12636 -128368 53168 -1280 106165 4342 83540 154260 -26392 -50307
18797 -50307 -75151 -76584 -520855 -233244 -263763 -79447 205661 -128069 103908 -218477 -68716
18785 18398 -76291 -178017 -75462 -53630 -91966 -56457 72346 221091 -102274 -216091 -68608
18773 68933 -155319 57749 -106952 12410 -63286 106454 11715 -126486 -231927 -135397 -203210
18762 -203210 -124540 -95255 53249 192087 -203956 -70053 -70519 -264988 -166696 -125679 -342535
$$ packed form
18843h5323B361b45587A22541a42693E0174A4034c68115c6497j73871B88953b05566
18831b59166g5381o4056L010j31485A59692n4956e56489G9690F618h716D8587
18819c1521a5731B98847a1591A5009K20427J95932j54827c2798o3789A42469J55055
18808B97524j10418A2636a28368E3168a280A06165D342P9198P0720b6392k3915
18797e0307k4844j433m44271b33244l0519g9447B05661a28069A03908b18477f8716
18785A8398g6291j01726g5462K1832l8336L5509G2346J48745a02274j13817f8608
18773F8933a55319E7749a06952A2410f3286A06454A1715a26486j05441R6530o7813
18762b03210P8670K9285E3249J38838b03956g0053m66j94469R8292M1017k16856
$$ plain form
18751 -342535 77486 -127387 -128828 -135021 265559 13207 -26427 -258308 248276 -293650 -92842
18739 20224 77677 120637 -103735 -179749 -3079 -7719 104478 -100343 -114781 -80227 -5841 78310
18726 251493 -186849 137543 -199363 76547 -52530 42235 -89826 -199254 168096 -45608
18715 -171151 -243684 99092 130726 -165761 -186986 10003 141123 -70687 -353974 -245718 143446
18703 175876 151540 -49589 -8974 61908 120102 -160334 35285 35364 -19312 83739 -232048 -158630
18691 -158630 66329 -143755 -227127 -171885 -293935 91683 19859 -68541 112513 46788 115306
18680 115306 -301065 64980 -53080 -258612 -185079 -259850 297947 -219733 12296 -125138
18669 -121911 -200825 -12346 -233708 -177730 -326228 -233015 78357 -142961 -117137 -204782 11771
$$ packed form
18751c42535G7486a27387j441o193B65559A3207b6427k31881B48276b93650i2842
18739B0224N7453M2960a03735p6014c079m640A04478a00343j4438L4554e841G8310
18726B51493a86849A37543a99363G6547e2530D2235h9826j09428A68096d5608
18715a71151p2533I9092L1634a65761k1225A0003J31120g0687k83287J08256A43446
18703A75876k4336d9589h974F1908N8194a60334C5285P9a9312H3739b32048P3418
18691a58630F6329a43755q3372N5242j22050I1683A9859f8541A12513D6788O8518
18680A15306c01065F4980e3080k05532P3533p4771B97947b19733A2296a25138
18669a21911p8914a2346k21362N5978j48498R3213G8357a42961K5824q7645A1771
$$ plain form
18657 1861 -112380 209168 -444884 -17228 259771 -14281 -190349 -309521 -234681 22715 192879
18646 192879 -197769 250524 -46676 -217221 -241321 -58162 -235704 -333891 29648 -39330 -32293
18635 -32293 -192560 181665 62121 -116956 -67260 -276363 39538 -59391 -118583 129155 -128407
18623 36901 46150 -146929 187907 187537 26739 -32369 -92933 -95698 -139166 99603 126032 -330458
18610 58904 -310779 100468 485290 -450813 15207 -148348 -128442 -56413 -77715 58857 -311160
18598 50591 -37188 -184907 262015 -378409 -187494 161924 -298384 -62478 -219886 -35618
18587 -107183 -270145 -18387 340676 -126348 -180845 -226546 41015 157816 170488 219403 -90693
18575 -259351 -144566 -473790 -141462 259314 120052 302847 75743 100477 25127 99649
$$ packed form
18657A861a12380B09168d44884a7228B59771a4281j76068j19172P4840B2715J70164
18646A92879a97769B50524d6676j70545k4100e8162j77542r8187B9648c9330P037
18635c2293j60267A81665F2121a16956M9696k09103C9538e9391n9192A29155a28407
18623C6901R249a46929A87907l70B6739c2369o0564k765m3468I9603K6429c30458
18610E8904c10779A00468L84822d50813A5207a48348J9906e6413k1302E8857c11160
18598E0591c7188j47719B62015c78409a87494A61924b98384f2478j57408c5618
18587a07183j62962a8387C40676a26348n4497m5701D1015J16801J2672M8915i0693
18575b59351J14785l29224a41462B59314A20052J82795G5743K4734B5127P4522
$$ plain form
18565 99649 -298976 259760 -496710 -311794 -40606 -32106 53474 57851 72161 -12562 -183063
18554 -183063 -79855 -134788 57451 52377 -276255 -368277 -171288 -104512 -254487 -212434 39918
18542 -12143 -75436 23062 -234253 -70596 -97773 -10516 112249 87735 223223 -1895 155680
18530 -74395 -95871 135514 211958 -238642 -40473 -80790 -337128 -13254 77377 -126524 -223670
18519 -223670 41102 -205161 -260575 58400 93566 41516 -310182 230581 -145294 -143499 146744
18507 -166845 104111 14215 -321558 397609 -33551 37900 6430 57685 -243195 473275 15668
18495 275739 131232 371679 57171 -50298 -271735 -252012 -160025 292428 13397 1881 327169
18484 327169 -87062 -313676 -114183 -67400 -72387 -127692 -50179 -15429 293867 -171877 46123
$$ packed form
18565I9649b98976B59760d96710J84916d0606Q500E3474M377J4310a2562j70501
18554a83063g9855n4933E7451n074b76255r2022a71288O6776j49975M2053C9918
18542a2143o3293B3062b34253g0596k7177a0516A12249k4514J35488a895A55680
18530g4395k1476A35514P6444b38642d0473m0317k56338a3254G7377a26524r7146
18519b23670D1102b05161n5414E8400L5166D1516c10182B30581a45294J795A46744
18507a66845A04111A4215c21558C97609c3551C7900F430N1255b43195D73275A5668
18495B75739A31232K40447E7171e0298k21437J9723R1987B92428A3397A881L25288
18484C27169h7062k26614a14183M6783m987n5305e0179a5429B93867a71877D6123
$$ plain form
18472 312731 19059 45380 102239 275641 -20727 62688 -114204 116027 -109790 24174 -297561
18460 -79020 -143597 10270 -182649 54653 -218236 -28732 -213036 -367120 36883 236884 28388
18448 125376 27466 408326 -163922 45251 -60342 -65754 -71880 125159 193834 -156247 -45647
18436 -63232 -100458 -91273 38996 115929 -122280 114619 2893 184475 -196827 -158564 -308228
18425 -308228 112463 40276 38223 -13079 -99207 -193731 61284 208529 104380 71850 -257229
18413 -230030 92038 -57373 -217158 30077 400579 300953 -148321 -38332 -63117 54040 -174146
18401 34955 67398 -78459 -77960 141029 19162 -113086 -29443 -152533 -224101 -298083 313169
18389 -225776 -57127 24002 198831 -169572 -27280 -93485 255766 -3468 40758 -103560 -165751
$$ packed form
18472C12731A9059K6321N6859J73402b0727F2688a14204A16027a09790B4174b97561
18460g9020o4577A0270a82649E4653b18236b8732j84304j54084C6883K00001B8388
18448A25376B7466L80860a63922D5251f0342n412o126A25159O8675a56247d5647
18436f3232l7226R185C8996P6933a22280A14619B893J81582a96827L8263j49664
18425c08228A12463D0276k053a3079q6128r4524F1284J47245j04149l2530b57229
18413b30030I2038e7373j59785C0077L70502r9626a48321c8332k4785E4040a74146
18401C4955L2443g8459M99A41029A9162a13086b9443j23090p1568p3982C13169
18389b25776e7127B4002J74829a69572b7280o6205B55766c468D0758a03560o2191
$$ plain form
18378 -165751 113752 -179988 -85553 55691 -201064 79864 158478 -128582 -160072 -303416
18368 -303416 -278501 203303 -9061 -47707 -213918 201220 74154 63059 -123006 17687 -135654
18356 290104 251305 -113083 -267043 71828 -126483 -65367 55232 98252 388151 211655
18346 211655 -170533 -284247 -413 -167238 -113183 160382 93375 42249 -32343 -89570 -246595
18335 -246595 -33639 -92553 -121259 -2879 -209174 -169269 58932 73548 32253 -378772 10932
18323 195133 -408479 -1696 -55904 73905 63032 -104893 -73950 -145798 -1599 82552 58839
18312 58839 -83359 -202957 112814 -322068 364388 121107 -166926 -12238 208889 173879
18302 173879 -51416 -239725 -97162 -114368 73943 22196 -50588 -125932 -61462 36502 -295174
$$ packed form
18378a65751A13752a79988h5553E5691b01064G9864P8614a28582l1490j43344
18368c03416K4915B03303i061l8646j66211B01220G4154j1095a23006A7687a35654
18356B90104l8799a13083j53960G1828a26483O1116E5232M3020K89899j76496
18346B11655a70533j13714d13j66825N4055A60382o7007D2249c2343n7227j57025
18335b46595c3639n8914k8706b879k06295L9905E8932J4616C2253c78772A0932
18323A95133d08479a696n4208G3905j0873a04893L0943p1848a599H2552k3713
18312E8839h3359j19598A12814c22068C64388A21107a66926a2238B08889l5010
18302A73879e1416j88309i7162j7206G3943B2196e0588p5344f1462C6502b95174
$$ plain form
18290 78557 7320 -131833 94799 -244650 -173160 -203878 77486 -146829 -17338 52219 -267637
18278 -138259 -58195 273316 30091 153786 54688 -422052 120338 117465 -134527 -72739 161384
18266 -50130 62014 -74274 -192243 164256 -383027 -211387 -24937 -3094 206427 -171935 -180728
18255 -180728 30525 172770 -50576 -224055 -144965 166749 -145574 -109756 144406 -4265 68413
18243 -57742 38378 -244967 -86461 20148 17301 222741 130587 -28971 -215213 91356 121494
18232 121494 -97112 24476 90181 -23102 -26263 113586 812 150155 160915 -97079 71364 -148804
18219 -129072 -140793 -297669 -109018 -112973 -58532 -312033 -151872 54398 -19313 -192232 21521
18207 -79878 193196 -141136 209568 -46383 -37096 -136154 5564 179012 57950 -298954 -192686
$$ packed form
18290G8557G320a31833I4799b44650P1490l0718G7486a46829a7338E2219b67637
18278a38259e8195B73316C0091J23695E4688d22052A20338k873a34527O1788A61384
18266e0130F2014g4274j17969A64256c83027J71640b4937c094B06427a71935q793
18255a80728C0525J42245e0576j73479P9090A66749a45574L5818A44406d265F8413
18243e7742C8378b44967h6461B0148k847K05440r2154b8971j86242I1356L0138
18232A21494i7112B4476O5705b3102l161A13586H12J49343J0760i7079G1364a48804
18219a29072j1721j56876a09018l955N4441k53501a51872E4398a9313j72919B1521
18207g9878A93196a41136B09568d6383R287r9058E564J73448E7950b98954J06268
$$ plain form
18196 -192686 -183406 138565 110265 -224589 111302 -122316 233021 131997 39402 49817
18186 49817 68515 118112 -85484 264592 486830 -18831 -417978 19339 -150524 67444 121651
18175 121651 29394 20131 -347053 158064 -92418 50484 64302 105695 35563 -45650 -15244
18163 120375 375854 37156 -73341 18235 -225718 -101347 -74523 -48376 372401 21165 130072
18152 130072 121458 -213512 -58778 -289655 71461 -61515 -231283 -194021 139565 -95217 137919
18140 -134027 -4865 -79525 363579 -55403 -35611 151448 246078 -102488 141409 288621 -103817
18128 -26628 -284503 41262 189506 99440 64100 -231942 -111080 81309 -103144 183649
18117 -78335 -125022 -255032 123199 25087 216334 -70185 -300562 21301 92723 -3022 117040
$$ packed form
18196a92686R280A38565k8300b24589A11302a22316B33021j01024C9402J0415
18186D9817J8698M9597h5484B64592K22238a8831l99147A9339a50524F7444N4207
18175A21651B9394r263c47053A58064i2418E0484J3818M1393C5563d5650a5244
18163A20375K55479C7156g3341A8235b25718a01347K6824K6147C72401B1165J08907
18152A30072q614b13512e8778k30877G1461f1515j69768L7262A39565i5217A37919
18140a34027d865p4660C63579e5403J9792A51448R4630a02488A41409J47212a03817
18128b6628k57875D1262J48244r0066l5340b31942a11080H1309a03144A83649
18117g8335m6687j30010A23199B5087J91247g0185k30377B1301P1422c022A17040
$$ plain form
18105 142572 -9187 34471 -47579 235489 -356664 -352017 170172 -50788 202046 92808 -85481
18093 156372 85992 -201970 -235556 -233286 80378 -328041 9507 -27422 -1577 19223 149097
18082 149097 -16087 271720 -154167 -167424 228761 -195274 -147315 63258 273149 -12648
18071 263686 -224707 -28156 -1945 -158267 319763 -254818 50230 -262179 -165422 -94214 -22646
18059 118268 -149862 293902 141443 -203373 237098 -229705 -309052 120092 -165870 404022
18048 76945 -131172 100967 213006 49707 170983 -159138 153426 274328 -118092 -198534
18038 -198534 26947 141716 -490761 61887 -62193 452195 -19874 -133114 -279216 -172168
18028 -172168 151166 -13430 -378619 50915 -39579 99210 139392 -56524 59427 49617 12340
$$ packed form
18105A42572i187C4471d7579B35489c56664M647A70172e0788B02046I2808h5481
18093A56372p0380b01970l3586K270H0378c28041I507b7422a577A9223J29874
18082A49097a6087B71720a54167j3257B28761a95274M7959F3258K09891a2648
18071B63686b24707b8156a945j56322C19763b54818E0230b62179R6757P1208b2646
18059A18268a49862B93902A41443b03373B37098b29705p9347A20092a65870D04022
18048G6945a31172A00967J12039D9707J21276a59138A53426J20902a18092q0442
18038a98534B6947J14769d90761F1887f2193D52195a9874j13240j46102J07048
18028a72168A51166a3430l65189E0915c9579I9210M0182e6524E9427r810A2340
$$ plain form
18016 209537 218481 -168891 518006 121312 -49855 -145834 -173290 -120881 93955 -277929 300930
18004 -38095 -186311 191012 239520 135265 166 -118647 175978 99680 207396 -152998 -47608
17992 132715 -236449 -140019 77166 -109153 166331 -97940 -241605 213218 -274479 22694
17981 90908 34884 299227 -39916 189204 -160150 -46916 -115913 -132449 12812 99855 235030
17970 235030 -108057 89725 -13582 -12833 -228335 35973 -172884 64315 59808 -43857 -64838
17959 -64838 176217 172136 219033 178107 -320596 -147501 -56179 35077 -136036 -247926 135998
17947 107479 448888 -141610 331039 120608 -45872 169787 20271 227449 21778 -88724
17936 -52959 22749 17966 -156669 -254165 -218965 33121 -308491 -163397 113286 -133879 6692
$$ packed form
18016B09537Q944a68891E18006A21312d9855r5979k7456N2409I3955b77929C00930
18004c8095j48216A91012M8508j04255A66a18647A75978p6298J07716a52998d7608
17992A32715b36449R6430G7166a09153A66331i7940j43665B13218b74479B2694
17981I0908C4884K64343c9916A89204a60150d6916o8997j6536A2812Q7043J35175
17970B35030a08057H9725a3582P49k15502C5973a72884F4315m507d3857k0981
17959f4838A76217m081M6897m0926c20596a47501e6179C5077a36036j11890A35998
17947A07479L41409a41610C31039A20608d5872A69787B0271K07178B1778h8724
17936e2959B2749m783a56669r7496L5200C3121c08491J45094A13286a33879F692
$$ plain form
17924 -458 11222 283848 98094 -131495 302391 246536 61385 -110640 -23018 -10780 217078
17912 125633 -39605 185998 149178 142222 -35011 -114343 217443 311677 -134947 132552 -149484
17900 160069 -126483 48832 179260 119949 -98482 -73279 -70282 -15890 -75001 92039 209486
17889 209486 -239228 158512 -78009 202348 -26893 -202751 -314384 -187192 -93463 8372
17878 208028 -15397 -25621 54137 -351338 253475 -40503 -101116 13741 306324 508409 -153311
17866 93522 -27328 -42687 -20986 172732 38677 186470 66036 -138969 -148836 -255817 -66395
17854 -134797 315057 -66032 177558 -23907 175175 -30873 -245209 12177 179242 35083
17843 -43440 62197 221868 387069 48819 161101 225104 88223 235237 56689 -40741 5605
$$ packed form
17924d58A1222K72626I8094a31495C02391n5855F1385a10640b3018a0780B17078
17912A25633c9605A85998l6820o956c5011p9332B17443R4234a34947A32552a49484
17900A60069a26483D8832J30428n9311i8482K5203K997a5890n9111I2039J17447
17889B09486b39228A58512g8009B02348b6893j75858j11633J27192i3463H372
17878B08028a5397j0224E4137c51338B53475d0503o0613A3741K92583K02085a53311
17866I3522b7328j5359b0986A72732C8677J47793F6036a38969r867j06981f6395
17854a34797C15057f6032A77558b3907A75175c0873k14336A2177J67065C5083
17843d3440F2197J59671J65201D8819J12282O4003H8223J47014E6689d0741E605
$$ plain form
17831 45041 -110572 66071 166463 -57690 71553 -259152 -83095 -53166 -99361 260267 -12648
17819 243133 -17900 -153585 307028 -219705 -19339 -242565 -126299 -60074 272210 -109359
17808 151229 316478 179250 362980 28103 291816 -91232 163684 229974 125246 -6491
17797 63909 27654 90017 -86166 -130843 319808 137457 -142999 138452 -333882 -33647 96536
17785 21673 -75838 -264163 316149 281865 -141539 -189958 113775 67271 121346 -9336 359358
17773 73097 119896 -203534 145239 -50903 185487 121163 29048 321061 -163604 -129089 -261322
17762 -261322 -61860 -51610 -10972 16911 412426 46744 161070 163042 67093 66545 95721 489320
17750 489320 4517 318572 40092 173285 358364 -118297 80679 -76516 -162749 228641 88553
$$ packed form
17831D5041a10572F6071J00392e7690G1553b59152h3095K9929m6195B60267a2648
17819B43133a7900j35685C07028b19705a9339k23226J16266f0074B72210a09359
17808A51229J65249j37228J83730B8103K63713i1232A63684O6290j04728f491
17797F3909B7654O2363h6166m4677C19808A37457a42999A38452c33882c3647I6536
17785B1673g5838j88325C16149l4284a41539m8419A13775m6504N4075i336C59358
17773G3097M6799b03534A45239e0903A85487o4324B9048K92013a63604L4515j32233
17762b61322f1860J0250a0972A6911L95515D6744J14326J972F7093n48K9176L93599
17750D89320D517L14055D0092J33193J85079a18297H0679g6516q6233B28641H8553
$$ plain form
17738 -108451 190973 69292 159316 -175296 112527 68743 126556 56057 -196364 -140035 -21166
17726 280613 142935 8955 323890 -78783 163900 5078 358564 29524 139383 283293 -98660
17714 -44111 -72939 -21833 147176 115721 138405 69506 167395 139268 -142516 -236438 -258278
17703 -258278 45498 41953 75782 177815 -109304 154295 98524 418940 44332 150731 -23545
17691 150476 -94702 474758 -97146 -36987 -132558 123785 -984 -142033 23769 257998 76718
17679 149086 280894 128694 30710 -5160 381562 -80340 25400 -137417 -123822 -118639 115753
17667 357177 -287134 159335 -2523 -341130 129228 255736 256555 270447 -153393 331820 -73925
17655 -328464 284902 82016 -349387 94736 145972 300763 188061 430827 -14161 -34028
$$ packed form
17738a08451A90973F9292R0024a75296A12527m3784N7813E6057a96364N6329b1166
17726B80613j37678H955L14935g8783A63900E078L53486B9524J09859J43910i8660
17714d4111k8828b1833A47176l1455K2684o8899R7889k8127a42516r3922k1840
17703b58278D5498l545L3829J02033a09304A54295n5771L20416D4332J06399b3545
17691A50476i4702D74758i7146c6987r5571A23785i84j41049B3769K34229G6718
17679A49086J31808A28694C0710e160C81562h0340B5400a37417J3595N183A15753
17667C57177b87134A59335b523l38607A29228J26508Q19J3892a53393C31820g3925
17655c28464B84902H2016c49387I4736N1236J54791j12702K42766a4161j9867
$$ plain form
17645 -34028 109449 99329 16974 -109987 -109779 144719 -42491 -66777 18811 100502 330805
17634 330805 90109 -176986 330499 236417 -111470 142136 134375 152605 156877 219825 -68322
17622 425560 28881 282664 98528 474574 18624 54198 315060 -178907 525856 143868
17611 -98628 -46226 156215 20735 327092 -259258 -13296 -11036 -68836 199127 163795 238251
17600 238251 286167 -19223 441697 17736 -81231 -83536 165167 245844 129148 185981 6454
17588 185300 -29945 295151 3151 141478 106044 159907 486073 -147042 530198 521308 -121999
17576 -203468 163242 65139 134699 -100092 474785 110026 324889 147864 171569 146633
17566 146633 253736 29456 88988 197363 406943 -7823 149281 156025 116492 -84933 296883
$$ packed form
17645c4028A09449j0120A6974a09987K08A44719d2491k4286A8811Q1691K30303
17634C30805I0109a76986C30499r4082a11470A42136p761J8230M272O2948f8322
17622D25560B8881K53783I8528L76046A8624L5574K60862a78907E25856A43868
17611i8628d6226A56215B0735L06357b59258a3296K260n7800A99127l5332P4456
17600B38251M7916a9223D41697A7736h1231k305A65167Q0677j16696N6833F454
17588A85300b9945B95151C151J38327l5434N3863L26166a47042E30198q890a21999
17576b03468A63242F5139O9560a00092D74785A10026K14863A47864K3705k4936
17566A46633J07103B9456N9532J08375K09580g823A49281O744l9533h4933B96883
$$ plain form
17554 398440 197815 143483 530355 -43510 54688 183493 488573 115066 174037 186830
17544 186830 53419 72495 350124 36909 122214 -110128 528424 272037 242743 90425 67305
17533 67305 -151090 248756 407461 359734 222421 80304 273601 24855 368124 443282
17523 443282 560011 486128 782505 719057 714203 532348 265735 269467 165479 186891 531436
17512 531436 261198 337714 241344 224825 790841 544530 342966 689267 671848 101104
17501 -96040 519544 30915 104799 191995 151290 33260 163205 124892 249952 141453 622629
17490 622629 140264 180750 400774 136266 250867 299238 194092 444238 -50659 235948
17479 213932 190414 236343 57601 110601 69276 142448 167701 -88657 1636 239572 231596 222123
$$ packed form
17554C98440A97815n4332L86872d3510E4688J28805L05080A15066N8971J2793
17544A86830E3419J9076K77629C6909Q5305a10128E28424k56387k9294I0425k3120
17533F7305a51090B48756J58705m7727j37313H0304J93297B4855L43269P5158
17523D43282J16729p3883K96377o3448m854j81855B65735L732j03988K1412L44545
17512E31436B61198P6516r6370j6519N66016k46311k01564L46301j7419A01104
17501i6040E19544C0915P3884Q7196m0705C3260J29945l8313J25060j08499M81176
17490F22629A40264M0486K20024A36266J14601M8371j05146K50146e0659B35948
17479B13932k3518M5929E7601N3000m1325P3172K5253h8657A636K37936p976r473
$$ plain form
17467 222123 230939 90574 53051 -62821 -227557 140432 -165078 98171 255197 152284 568950
17456 568950 238799 98647 229731 -48096 142933 -64529 564539 -41243 403653 510678
17446 510678 400512 786687 382001 287346 442156 241187 325957 -14744 347533 335768
17436 335768 326356 241304 244675 384827 251355 113494 462758 258901 188735 217399 -266696
17424 -78837 36656 385116 166892 110485 224309 -118421 167175 483886 302516 30406
17413 77230 -47621 416362 -78388 23753 215324 542267 -10241 412877 153202 346583
17403 346583 107941 83278 466262 -224958 -12905 215676 371191 55908 392303 137282
17392 213398 234104 313547 219523 423944 68626 111555 194506 24692 -196193 101882 94380
$$ packed form
17467B22123Q816I0574l7523f2821j64736A40432a65078I8171J57026j02913M16666
17456E68950B38799I8647J31084d8096A42933f4529E64539d1243D03653J07025
17446E10678j10166L86175C82001r4655J54810k00969Q4770a4744C47533j1765
17436C35768r412q5052L371J40152j33472A13494L49264k03857p0166K8664b66696
17424g8837C6656L48460A66892n6407J13824a18421A67175L16711j81370C0406
17413G7230d7621D16362g8388B3753J91571L26943a0241D12877A53202J93381
17403C46583A07941k4663L82984b24958a2905B15676J55515E5908L36395A37282
17392B13398K0706P9443r4024K04421F8626M2929Q2951B4692a96193A01882p502
$$ plain form
17381 94380 372837 20904 377768 258518 -53600 72184 171853 79050 253490 610205 -59263
17369 397073 48699 -33268 613 267316 85000 79927 697313 354144 398572 109526 281005
17358 281005 319713 309383 44066 279224 -14262 363063 252879 439527 201335 265675
17348 265675 496031 286121 456262 373780 -852 -10450 -23372 188651 110382 147379 -38340
17336 150697 97121 512243 184716 390473 314322 377855 267943 397081 190683 322172
17326 322172 576239 366271 416244 285147 148517 137284 172180 65496 -34671 277001
17315 186373 370632 378175 329625 497889 145270 474992 -88940 370017 846153 389772
17304 230178 235905 490545 195542 134992 394135 223706 157020 422690 333400 284303 301150
$$ packed form
17381I4380K78457B0904L56864j19250e3600G2184R9669G9050J74440L56715e9263
17369C97073D8699c3268F13K66703H5000n073O17386l43169M4428A09526J71479
17358B81005L8708j0330D4066K35158a4262C63063j10184J86648B01335O4340
17348B65675K30356k09910J70141q2482h52r598j2922A88651p8269L6997c8340
17336A50697n3576M15122A84716K05757p6151O3533j09912J29138A90683J31489
17326C22172K54067k09968M9973j31097j36630j1233L4896F5496c4671B77001
17315A86373J84259P543m8550J68264A45270L29722h8940C70017M76136C89772
17304B30178N727K54640A95542o0550K59143j70429o6686K65670q9290m9097J6847
$$ plain form
17293 301150 235471 68561 379272 257526 136821 143098 236842 379344 250743 276682 148146
17282 148146 316792 271860 469637 290375 108354 -42737 321973 206172 101183 312078
17272 312078 425856 227973 318552 277821 163425 -34682 294713 512702 85791 -279593
17261 69927 -109124 98001 458598 96093 156327 217045 266494 306265 105065 300676 -84563
17249 391047 346989 124519 261433 529754 187262 123420 -32854 291148 461827 435072
17239 435072 330372 219386 524922 372959 456392 305857 235101 597442 455254 404121
17229 404121 386673 467164 354755 282002 299788 551926 96306 241304 300564 274299 -16404
17217 388690 -39078 402516 418572 -26335 486855 94906 300562 556222 225503 31849
$$ packed form
17293C01150o5679F8561L10711j21746j20705O277R3744J42502j28601K5939j28536
17282A48146J68646m4932J97777j79262A08354d2737C21973j15801A01183K10895
17272C12078J13778j97883R0579m0731j14396c4682B94713K17989H5791b79593
17261F9927a09124I8001L60597I6093O0234O0718M9449L9771A05065J95611h4563
17249C91047m4058A24519J36914K68321A87262o3842c2854B91148J70679k6755
17239D35072j04700j10986L05536j51963Q3433j50535p0756L62341j42188n1133
17229D04121j7448Q0491j12409p2753J7786K52138I6306J44998N9260k6265a6404
17217C88690c9078D02516J6056b6335D86855I4906K05656K55660B25503C1849
$$ plain form
17206 127892 333193 -104910 490883 372297 286523 26118 331266 464833 698138 431699
17196 431699 230700 342833 421158 31574 213703 380802 311314 290678 290506 195843 77909
17184 142818 210033 447978 518549 396602 662249 318903 365338 435698 79580 338342
17174 338342 48471 186579 422526 774007 330558 312380 -47338 629220 608841 300014
17163 273946 637041 222031 51267 574662 559596 456614 499005 384082 565285 -7906
17152 314572 700476 592544 420487 413862 447433 655103 676678 571407 453669 543105
17142 543105 495719 555982 371187 737042 610519 676090 521225 687075 4764 619230
17132 619230 586541 660468 929624 238136 536786 764566 433173 525314 428661 607298
$$ packed form
17206A27892K05301a04910D90883j18586q5774B6118L05148J33567K33305k66439
17196D31699k00999J12133P8325C1574J82129J67099o9488k0636j72r4663G7909
17184A42818O7215K37945P0571j21947K65647C18903M6435P0360G9580K58762
17174C38342D8471J38108K35947L51481C30558j8178d7338F29220k0379C00014
17163B73946L63095B22031E1267N23395j5066j02982M2391j14923J81203g906
17152C14572L85904j07932j72057o625L3571K07670K1575j05271j17738Q9436
17142E43105m7386O0263j84795L65855j26523O5571j54865J65850D764O14466
17132F19230l2689P3927K69156B38136K98650K27780l31393R2141r6653J78637
$$ plain form
17122 607298 950786 451600 466850 487728 459092 411052 483426 732705 288378 381089 424808
17111 424808 513228 513553 501122 461057 388537 701067 466891 692378 418743 703926 522300
17100 522300 543586 590441 530152 440401 443327 540429 404327 614822 412589 465830 569677
17089 569677 773135 585388 568376 722315 848986 840000 616993 688126 458660 559317
17079 559317 601482 818565 802981 699879 847751 577267 956969 423530 572668 872367
17069 872367 688547 757288 717801 860005 618501 810854 419920 618869 635151 598632
17059 598632 822055 594466 492552 968587 660714 633265 969816 405330 701443 281365
17048 604060 1017515 584906 737574 1048845 405677 921418 694565 949212 1143519 670503
$$ packed form
17122F07298L43488D51600J5250K0878k8636m8040P2374K49279B88378R2711M3719
17111D24808Q8420L25j2431m0065p2520L12530k34176K25487k73635K85183j81626
17100E22300K1286M6855o0289q9751K926R7102j36102K10495k02233N3241J03847
17089E69677K03458j87747j7012J53939J26671q986k23007P1133k29466J00657
17079E59317M2165K17083j5584j03102J47872k70484L79702D23530J49138K99699
17069H72367j83820O8741l9487J42204k41504J92353l90934J98949J6282l6519
17059E98632K23423k27589j01914M76035l07873k7449L36551D05330K96113B81365
17048F04060M13455m32609J52668L11271D05677N15741k26853K54647J94307m73016
$$ plain form
17038 670503 891145 769150 1007888 786775 610275 969379 1172016 969313 1183941 512692
17027 825825 691179 806780 996634 1112001 652246 1171195 554291 999161 1126065 941593
17017 941593 1361965 1155415 1090199 950671 936317 963888 1053037 742455 1353715 1145101
17007 1145101 774123 1138214 1182615 828264 1018044 976979 973156 1322069 1053475 1106651
16997 1106651 814721 1235324 1096253 1273352 1081393 857810 1022756 1070398 1521023 1179365
16987 1179365 1180478 1232819 1449942 1181096 1047652 1651411 1117334 1058062 1283312 1192119
16977 1192119 1109123 1674229 1446685 1476266 1387390 1607422 1651217 1334073 1112910 1545141
16967 1545141 1347263 1414396 1275942 1516892 1379934 1727983 1679712 1498916 1444453 1571824
$$ packed form
17038F70503K20642j21995K38738k21113j76500L59104K02637k02703K14628E12692
17027H25825j34646J15601J89854J15367m59755N18949E54291M44870J26904j84472
17017I41593M20372k06550o5216j39528j4354K7571Q9149l10582O11260k08614
17007A145101l70978L64091M4401l54351J89780m1065l823L48913k68594N3176
16997A106651k91930M20603j39071J77099j91959k23583J64946M7642M50625l41658
16987A179365J113N2341K17123k68846j33444O03759n34077n9272K25250r1193
16977A192119q2996N65106k27544K9581q8876K20032M3795l17144k21163M32231
16967A545141j97878O7133j38454K40950j36958L48049m8271j80796n4463J27371
$$ plain form
16957 1571824 1469401 1723226 1649501 1835279 1653239 1477014 1553176 1552885 1660390 1862430
16947 1862430 1929168 1859667 1949467 1870350 2127208 1693556 1898600 2215702 1979171 1789573
16937 1789573 2187940 1861306 1737325 1723372 2156449 1911250 2428512 1864765 2313999 2291787
16927 2291787 2414684 2114688 2211359 2853945 2544841 2292687 2459872 2486554 2475794 2662057
16917 2662057 2314144 2538251 2603581 2754297 2701865 3054265 2646164 2342779 2944982 2901439
16907 2901439 2830568 2683379 2805960 2958281 3264026 2956782 3088174 3086035 2946871 3037624
16897 3037624 3269769 2907907 3154582 3409456 3512723 3477736 3519518 3825436 3500372 3523944
16887 3523944 3525236 3526555 3853347 3671574 4039003 3854545 3822860 3958925 4281126 4252411
$$ packed form
16957A571824j02423K53825p3725J85778j82040j76225P6162k91J07505K02040
16947A862430O6738o9501Q9800p9117K56858m33652K05044L17102k36531j89598
16937A789573L98367l26634j23981j3953M33077k45199N17262n63747M49234k2212
16927B291787J22897k99996R6671O42586l09104k52154J67185K6682j0760J86263
16917B662057l47913K24107O5330J50716n2432L52400m08101l03385O02203m3543
16907B901439p0871j47189J22581J52321L05745l07244J31392k139j39164R0753
16897C037624K32145l61862K46675K54874J03267l4987M1782L05918l25064K3572
16887C523944J292J319L26792j81773L67429j84458l1685J36065L22201k8715
$$ plain form
16877 4252411 4105186 4664154 4598660 4346422 4736234 4381087 4699544 4916039 5001176 4875297
16867 4875297 5147013 4854417 5005935 5221741 5345584 5717563 5529652 5853582 5690070
16858 5690070 5700687 5879250 6038821 5895666 6032100 6187070 6436762 6417052 6799611 6673263
16848 6673263 7003592 6949731 7378605 7336586 7464454 7320273 7805048 7988320 8033235 8150421
16838 8150421 8136091 8832333 8520323 8775197 9129821 9384872 9536378 9420575 9979928 10116394
16828 10116394 10269246 10417886 10976095 10730966 11002349 11339455 11708609 11980720 11891758
16819 11891758 12487464 12699970 13296421 13391783 13790833 14100114 14485697 14718472 15028388
16810 15028388 15249774 16223326 16183490 16390669 16840259 17644959 17736111 18552363 19122908 19636099
$$ packed form
16877D252411j47225N58968o5494k52238L89812l55147L18457K16495Q5137j25879
16867D875297K71716k92596J51518K15806J23843L71979j87911L23930j63512
16858E690070J0617J78563J59571j43155J36434J54970K49692j9710L82559j26348
16848F673263L30329n3861M28874m2019J27868j44181M84775J83272M4915J17186
16838H150421j4330O96242l12010K54874L54624K55051J51506j15803N59353J36466
16828A0116394J52852J48640N58209k45129K71383L37106L69154K72111q8962
16819A1891758N95706K12506N96451R5362L99050L09281L85583K32775L09916
16810A5028388K21386R73552l9836K07179M49590Q04700R1152Q16252N70545N13191
$$ plain form
16800 19636099 19856176 20534796 20847738 21713007 22239543 22521964 23673215 24214223 25024367
16791 25024367 25916433 26311970 27411941 28045523 29020540 29780601 30571382 31755596 32839741
16782 32839741 33541178 34656464 35502542 36854522 38006790 39342332 40505501 41946998
16774 41946998 43347267 44683433 46099252 47471612 49255362 50830739 52569012 54113607
16766 54113607 56107659 57733199 59391698 61640582 63354680 65348983 67648210 69439767
16758 69439767 71701535 73698030 75616464 77766675 79879687 82282175 84113972 86208377
16750 86208377 87965176 89705380 91559280 93257649 94885182 96492000 97748146 99113886
16742 99113886 99937298 100870286 101855317 101760575 102305592 102642854 102724864 102421136 101796986 101125764
$$ packed form
16800A9636099K20077O78620L12942Q65269N26536K82421J151251N41008Q10144
16791B5024367Q92066L95537J099971O33582R75017P60061P90781J184214J084145
16782C2839741P01437J115286Q46078J351980J152268J335542J163169J441497
16774D1946998J400269J336166J415819J372360J783750J575377J738273J544595
16766E4113607J994052J625540J658499K248884J714098J994303K299227J791557
16758F9439767K261768J996495J918434K150211K113012K402488J831797K094405
16750H6208377J756799J740204J853900J698369J627533J606818J256146J365740
16742I9113886Q23412R32988R85031r4742N45017L37262Q2010l03728o24150o71222
$$ plain form
16732 101125764 100571524 99392815 98324331 96949884 95972598 93957037 92381967 90718518
16724 90718518 88865413 87041832 85189614 83072206 81199280 78797163 76975058 75087783
16716 75087783 72786616 71227421 69098718 67175456 65179924 63281549 61573790 59840435
16708 59840435 57923687 56109952 54566617 53111062 51136958 50242184 48487738 47088594
16700 47088594 45446985 44322961 43242704 41881647 40583579 39545868 38439134 37273481
16692 37273481 36236606 35240009 34177307 33593247 32639616 31916342 30765376 29526494 29100539
16683 29100539 28270846 27575082 27024394 25984340 26095536 24818236 24245809 23612978 23657224
16674 23657224 22753534 22095515 21691879 21112680 20576884 20103256 19463422 18933664 19001585
$$ packed form
16732A01125764n54240j178709j068484j374447r77286k015561j575070j663449
16724I0718518j853105j823581j852218k117408j872926k402117j822105j887275
16716G5087783k301167j559195k128703j923262j995532j898375j707759j733355
16708E9840435j916748j813735j543335j455555j974104q94774j754446j399144
16700D7088594j641609j124024j080257j361057j298068j037711j106734j165653
16692C7273481j036875r96597j062702n84060r53631p23274j150966j238882m25955
16683B9100539q29693o95764n50688j040054J11196j277300n72427o32831M4246
16674B3657224r03690o58019m03636n79199n35796m73628o39834n29758O7921
$$ plain form
16665 19001585 18101937 18152969 17454098 17061740 16654790 16621746 16246440 15865021 15414838 15353452
16655 15353452 15087200 14848979 14611497 14133748 14155345 13583240 13463704 12914821 12735194
16646 12735194 12622491 12345387 12140783 11754707 11547107 11732105 11500422 11133471 11163752
16637 11163752 10970047 10374703 10346441 10136018 10132420 10367495 10010508 9852006 9369300 9496062
16627 9496062 8896783 8935121 8977673 8639873 8353860 8491473 8279793 8068847 8233705 8190573
16617 8190573 7741120 7929218 7769593 7239218 7589161 7261929 7184134 7293048 7187382 7285679
16607 7285679 7002196 7187518 6995555 6559419 6557204 6209618 6123910 6231381 6339950 6284211
16597 6284211 6056624 6061886 5959690 5674802 5889396 5776174 6083900 5602499 5826955 5486958
$$ packed form
16665A9001585q99648N1032o98871l92358m06950l3044l75306l81419m50183o1386
16655A5353452k66252k38221k37482m77749K1597n72105j19536n48883j79627
16646A2735194j12703k77104k04604l86076k07600J84998k31683l66951L0281
16637A1163752j93705n95344k8262k10423l598K35075l56987j58502m82706J26762
16627I496062n99279L8338M2552l37800k86013J37613k11680k10946J64858m3132
16617H190573m49453J88098j59625n30375L49943l27232p7795J08914j05666R8297
16607G285679k83483J85322j91963m36136k215l47586q5708J07471J08569n5739
16597F284211k27587N262j02196k84888K14594j13222L07726m81401K24456l39997
$$ plain form
16587 5486958 5817871 5329610 5214001 5233155 5489731 4890617 5228124 4921583 5048983 5097583
16577 5097583 5012867 4858637 4672683 5096701 4532060 4744278 4837676 4689198 4736498 4629393
16567 4629393 4513117 4195712 4276366 4008043 4355682 4137348 4042173 4168860 4247484 3752518
16557 3752518 4047337 4191459 3982591 4205556 4148912 3613419 3763320 3864662 3548119 3817619
16547 3817619 3794571 3926441 3906482 3706092 3927543 3944915 3279983 3196272 3591269 3613748
16537 3613748 3425330 3407212 3814232 3567210 3635499 3269237 3589158 3211363 3706229 3106055
16527 3106055 3087974 3461031 3382452 3005879 3107022 2933276 3137177 2870104 3270504 3207863
16517 3207863 2990531 3156765 2902201 3143100 2531226 2853471 2776627 3310333 2937080 2649723
$$ packed form
16587E486958L30913m88261j15609J9154K56576n99114L37507l06541J27400M8600
16577E097583q4716j54230j85954M24018n64641K12218R3398j48478M7300j07105
16567D629393j16276l17405Q0654k68323L47639k18334r5175J26687P8624m94966
16557C752518K94819J44122k08868K22965n6644n35493J49901J01342l16543K69500
16547C817619k3048J31870j9959k00390K21451J7372o64932q3711L94997K2479
16537C613748j88418j8118M07020k47022O8289l66262L19921l77795M94866o00174
16527C106055j8081L73057p8579l76573J01143j73746K03901k67073M00400o2641
16517C207863k17332J66234k54564K40899o11874L22245p6844N33706l73253k87357
$$ plain form
16507 2649723 2932751 2619456 3059777 2687697 2794951 2821673 2835749 2718025 2519244 2742175
16497 2742175 2821046 2574622 2721316 2490630 2535300 2679145 2752720 2586409 3028844 2409875
16487 2409875 2680688 2655095 2598053 2536688 2569987 2584306 2575423 2722782 2458067 2622489 2676410
16476 2676410 2374136 2344862 2533747 2424309 2860236 2420203 2246099 2483263 2390743 2189184
16466 2189184 2407413 2540084 2564981 2118028 2289603 2570315 2571552 2157438 2285032 2568668
16456 2568668 2574762 2525077 2438310 2359417 2284926 2414903 2379297 2074809 2365221 2316276 2518069
16445 2518069 1858241 2428125 2469613 2207138 1830623 2340242 2020396 2237499 2178996 1874340
16435 1874340 1954463 2159820 2254290 2126702 2521045 2147238 2210949 2468031 2296886 2319915
$$ packed form
16507B649723K83028l13295M40321l72080J07254K6722J4076j17724j98781K22931
16497B742175P8871k46424J46694k30686M4670J43845P3575j66311M42435o18969
16487B409875K70813k5593n7042o1365L3299J4319q883J47359k64715J64422N3921
16476B676410l02274k9274J88885j09438M35927m40033j74104K37164r2520k01559
16466B189184K18229J32671K4897m46953J71575K80712J237m14114J27594K83636
16456B568668O094m9685q6767p8893p4491J29977l5606l04488K90412m8945K01793
16445B518069o59828N69884M1488k62475l76515N09619l19846K17103n8503l04656
16435A874340Q0123K05357R4470j27588L94343l73807O3711K57082j71145K3029
$$ plain form
16425 2319915 2170137 2293203 2642945 1958548 2348245 2000866 2023587 2395965 2063741 2212377
16415 2212377 2105218 2159953 2046468 1967818 2133754 2217787 1900304 1915265 2071322 1650846
16405 1650846 2007423 2383700 2194904 2089122 2089330 1802765 2153177 2025842 2227164 2123168
16395 2123168 1912089 2136302 2144981 2257388 2125078 1998288 1748544 1809733 1836286 1967394
16385 1967394 1902267 1923222 1866224 1894112 1986287 1791605 1851291 2314312 1869062 1920025 2027602
16374 2027602 1810403 1638011 1756370 2153468 1937097 2231102 1948629 1693028 1783462 1832688
16364 1832688 1912313 1750266 2068048 2002160 2015669 2005163 1773715 1521947 1653236 2000129
16354 2000129 1761259 2147571 1958354 2116872 1849158 2013272 1731098 1892892 1791998
$$ packed form
16425B319915j49778J23066L49742o84397L89697l47379K2721L72378l32224J48636
16415B212377j07159N4735j13485p8650J65936Q4033l17483J4961J56057m20476
16405A650846L56577L76277j88796j05782K08k86565L50412j27335K01322j03996
16395B123168k11079K24213Q679J12407j32310j26790k49744O1189K6553J31108
16385A967394o5127K0955n6998K7888R2175j94682N9686M63021m45250N0963J07577
16374B027602k17199j72392J18359L97098k16371K94005k82473k55601R0434M9226
16364A832688P9625j62047L17782o5888J3509j0506k31448k51768J31289L46893
16354B000129k38870L86312j89217J58518k67714J64114k82174J61794j00894
$$ plain form
16345 1791998 1791268 1939771 1924554 1749954 1831208 1974728 1929893 1767241 1924581 1921561 1844694
16334 1844694 1786830 1787800 2005690 1911235 2100939 1910563 2014679 2116030 1727471 1812918
16324 1812918 1834053 1742985 1643295 1940236 1452117 1517063 2273063 1500603 1672751 1733855
16314 1733855 1693000 1943376 1688337 1751030 1873323 1822277 1836327 1600727 1891567 1684841
16304 1684841 1354014 1377671 1689712 1682140 1730968 1793644 1940009 1733394 1767621 1584558
16294 1584558 1718350 1758897 1723932 1740231 1539021 1399079 1632807 1853211 1481354 1870216
16284 1870216 1826127 1585102 1659754 1277109 1499285 1663397 1716838 1540329 1344258 1455410
16274 1455410 1810273 1445256 1595000 1634344 1491920 1766636 1562266 1656364 1292405 1619637
$$ packed form
16345A791998p30J48503j5217j74600Q1254J43520m4835j62652J57340l020p6867
16334A844694n7864R70K17890r4455J89704j90376J04116J01351l88559Q5447
16324A812918K1135r1068r9690K96941m88119O4946P56000p72460J72148O1104
16314A733855m0855K50376k55039O2693J22293n1046J4050k35600K90840k06726
16304A684841l30827K3657L12041p572M8828O2676J46365k06615L4227j83063
16294A584558J33792M0547l4965J6299k01210j39942K33728K20404l71857L88862
16284A870216m4089k41025P4652l82645K22176J64112N3441j76509j96071J11152
16274A455410L54863l65017J49744L9344j42424K74716k04370R4098l63959L27232
$$ plain form
16264 1619637 1477524 1535626 1413200 1463255 1954708 1511214 1188086 1298857 1197185 1500112
16254 1500112 1392203 1495467 1871637 1273383 1438047 1658310 1269622 1357808 1484167 1324512
16244 1324512 1379522 1188560 1159128 1308897 1634729 1324158 1077244 1698886 980144 1431736
16234 1431736 1559468 960421 1446595 1440141 1089606 1522568 979855 1112134 1335992 1099364
16224 1099364 1362406 1024808 1353391 1344084 1044518 1218231 879497 826737 1414122 1166894
16214 1166894 1279310 933283 1060608 1221936 1057920 1491914 1221736 1196475 1246607 847811
16204 847811 689207 1048337 862956 1011183 1086336 1377372 1160543 1076632 1145895 1555122
16194 1555122 885810 877923 1454739 1087545 1222122 1238902 986263 1113865 1357974 1280802
$$ packed form
16264A619637j42113N8102j22426N0055M91453m43494l23128J10771j01672L02927
16254A500112j07909J03264L76170n98254J64664K20263l88688Q8186J26359j59655
16244A324512N5010j90962k9432J49769L25832l10571k46914O21642p18742M51592
16234A431736J27732n99047M86174o454l50535M32962n42713J32279K23858k36628
16224A099364K63042l37598L28583r307k99566J73713l38734n2760N87385k47228
16214A166894J12416l46027J27325J61328j64016M33994k70178k5261N0132l98796
16204H47811j58604L59130j85381J48227P5153K91036k16829q3911O9263M09227
16194A555122o69312p887N76816l67194J34577J6780k52639J27602K44109p7172
$$ plain form
16184 1280802 870275 860607 1160428 1006304 772489 1013773 764101 845939 896323 796684
16174 796684 969335 936074 1126709 878548 1002869 931726 707418 651375 1073636 1036204
16164 1036204 948288 506048 971114 759605 928180 1036507 713454 630677 1077938 853703
16154 853703 588177 799876 938166 737828 669135 962466 805113 923309 898874 735949
16144 735949 659016 793559 845999 374555 718680 756030 753366 661861 638397 626831 675860
16133 675860 919222 557050 716774 1120369 694105 979435 430543 659225 715676 486095
16123 486095 576146 584597 699713 591447 278614 636465 480499 683703 848192 635033
16113 635033 83981 867797 632112 675058 540587 500502 489063 841656 665079 579779
$$ packed form
16184A280802m10527r668K99821j54124k33815K41284k49672Q1838N0384r9639
16174G96684J72651l3261J90635k48161J24321p1143k24308n6043M22261l7432
16164A036204q7916m42240M65066k11509J68575J08327l23053q2777M47261k24235
16154H53703k65526K11699J38290k00338o8693K93331j57353J18196k4435j62925
16144G35949p6933J34543N2440C74555L44125L7350k664r1505k3464j1566M9029
16133F75860K43362l62172J59724M03595m26264K85330D30543K28682N6451k29581
16123D86095R0051Q451J15116j08266B78614L57851j55966K03204J64489k13159
16113F35033H3981P83816k35685M2946j34471m0085j1439L52593j76577q5300
$$ plain form
16103 579779 195245 323504 574472 470700 710300 535088 658311 484501 510156 909615
16093 909615 452533 215211 73328 270131 679922 284551 711750 632557 890221 518886
16083 518886 188067 255458 324685 222695 437325 415722 383525 27751 487632 215265
16072 238059 173862 283409 498652 236616 173271 529066 284888 342366 52769 302427
16062 302427 287522 173656 111079 473221 170349 235146 156655 470192 172162 439252
16052 439252 240875 -150931 383176 709583 440509 486710 119668 186093 336302 87121
16041 318955 11676 709104 46463 404446 240611 523373 336693 144157 156845 -230337
16030 320871 109292 467606 185548 680055 177937 -25389 316255 140589 176888 6236
$$ packed form
16103E79779A95245J28259K50968j03772K39600j75212J23223j73810K5655L99459
16093I09615D52533B15211G3328J96803M09791B84551M27199p9193K57664l71335
16083E18886A88067O7391O9227j01990K14630k1603l2197B7751M59881B15265
16072B38059o4197J09547K15243B36616o3345L55795k44178N7478E2769K49658
16062C02427j4905j13866o2577L62142A70349O4797p8491L13537A72162K67090
16052D39252j98377a50931C83176L26407k69074M6201A19668O6425J50209H7121
16041C18955A1676O97428D6463L57983j63835K82762j86680A44157J2688b30337
16030C20871A09292L58314A85548M94507A77937b5389C16255A40589L6299F236
$$ plain form
16019 -7745 407385 525067 187513 92163 223523 279797 58447 246251 -18143 -233714 178903
16007 373731 4977 306261 9059 275274 6484 599146 279147 193597 167641 523487 254178
15995 573 2180 196955 167802 204079 245165 382836 347763 381788 1037180 1341126 950720
15984 950720 934832 814987 336388 128386 -18849 186653 88532 186380 93370 214852
15974 214852 49770 54459 -11457 -14640 256990 41117 305414 352867 175959 343432 225339
15963 225339 132017 26756 -126090 48785 340937 -11232 183895 172658 419103 264993
15953 264993 113012 -29987 237745 176777 -163408 427992 233683 -259144 100326 -276617
15942 -133858 224845 -118827 196190 146988 -280141 144203 313284 184109 354585 188716
$$ packed form
16019g745D07385J17682A87513I2163J31360N6274E8447J87804a8143k15571A78903
16007C73731D977L01284I059K66215F484N92662B79147q5550k5956L55846B54178
15995E73J607J94775k9153L6277M1086J37671l5073L4025O55392L03946l90406
15984I50720j5888j19845C36388A28386a8849A86653H8532R7848r3010J21482
15974B14852D9770M689a1457l183B56990D1117K64297M7453A75959J67473j18093
15963B25339r3322B6756a26090D8785K92152a1232A83895j1237K46445j54110
15953B64993A13012b9987B37745o0968a63408D27992j94309b59144A00326b76617
15942a33858B24845a18827A96190m9202b80141A44203J69081j29175J70476j65869
$$ plain form
15932 188716 -17753 -173909 205701 -292834 -14897 138260 161836 170286 38324 109953 140922
15921 140922 -44096 -93163 31788 129140 192377 36808 -54723 106385 44624 383572 86112
15909 -97261 549124 191769 281135 31563 -132046 11777 45837 122671 -197838 43393 143553
15898 143553 74443 50710 11822 -202884 -112508 186833 422963 -17387 45753 96512 93682
15887 93682 244174 174123 26166 153825 -122752 43840 -323666 -36312 121165 -67238 -4927
15875 -252290 -74724 -130931 45178 -224117 83601 166090 -7418 160712 -39765 395720 4872
15863 -141857 -227780 92617 -99537 150447 -96724 393790 167573 30931 -179208 -135891 -30383
15851 64880 -38536 -589 134589 -88461 47303 233279 11719 89603 -223977 -208578 -224387
$$ packed form
15932A88716a7753j56156B05701b92834a4897A38260K3576Q450C8324P1629L0969
15921A40922d4096m9067C1788R7352O3237C6808e4723A06385D4624L38948H6112
15909i7261E49124A91769Q9366C1563a32046A1777L4060P6834a97838D3393J00160
15898A43553o9110k3733A1822b02884R0376A86833K36130a7387D5753N0759k830
15887I3682J50492p0051B6166J27659a22752D3840c23666c6312A21165f7238d927
15875b52290g4724n6207D5178b24117H3601Q2489g418A60712c9765C95720D872
15863a41857q5923I2617i9537A50447i6724C93790A67573C0931a79208M3317c0383
15851F4880c8536e89A34589h8461D7303J85976A1719P7884b23977J5399j5809
$$ plain form
15840 -224387 146975 -58312 178658 -14005 -71427 -88000 -51481 -20798 177677 -162170 -225820
15829 -225820 -414882 278950 -68982 -192263 -114125 -18350 -51263 -85193 -204199 28371 293288
15818 293288 -73374 141880 -14822 86629 -131873 -9062 269246 72993 -332912 -317047 -63898
15806 -236542 229901 68956 -75127 -67797 156261 -157117 -56968 104104 -380941 -28326 193154
15794 -106261 90514 112339 247568 -52711 98456 -344955 -254822 108066 215945 235967 -255638
15782 66312 -37840 -365914 60195 -324306 -119695 -317203 -238416 -103278 133735 89719
15772 89719 432276 70571 12458 -258129 -7790 -163068 -130219 203880 70318 -182496 19909
15760 71196 -85760 60351 114171 -98358 -133584 13003 -1265 155606 -200677 -55814 -70998
$$ packed form
15840b24387A46975e8312A78658a4005n7422j6573L6519b0798A77677a62170o3650
15829b25820j89062B78950f8982j23281P8138a8350l2913l3930j19006B8371K64917
15818B93288g3374A41880a4822H6629a31873i062B69246G2993c32912J5865f3898
15806b36542B29901F8956g5127P330A56261a57117e6968A04104c80941b8326A93154
15794a06261I0514K1825J35229e2711I8456c44955R0133A08066J07879K0022b55638
15782F6312c7840l28074F0195c24306a19695j97508P8787a03278A33735m4016
15772H9719L42557G0571A2458b58129g790j55278L2849B03880G0318a82496A9909
15760G1196h5760F0351N3820i8358l5226A3003a265A55606b00677e5814j5184
$$ plain form
15749 -70998 -105029 -80484 89197 75866 -124130 -70433 157710 111919 -111660 190201 -51913
15737 -41713 38163 -49107 -59204 -146632 98704 120218 -140212 -24219 230980 137450 427 -145306
15724 95811 -6197 -100381 93415 9936 66401 4405 125030 -28702 -116096 27200 -277968 221610
15711 -24872 -105666 -206829 -59646 4639 232671 -220750 -203756 208873 -13058 177469 177197
15700 177197 147741 -99536 261847 -131954 50766 -138548 73058 40525 -64028 285451 166445
15689 166445 303954 -89111 -106207 31060 292627 47033 -80415 -322298 -142617 173163
15678 108637 -167692 97665 -1428 -195753 227285 181760 -193495 227049 202223 33779 -194602
15666 253235 -22514 85888 83855 -216144 203375 -30980 -80974 -80756 278125 66908 69271 -37725
$$ packed form
15749g0998l4031K4545H9197j3331a24130N3697A57710m5791a11660A90201e1913
15737d1713C8163d9107j0097q7428I8704K1514a40212b4219B30980r3530D27a45306
15724I5811f197r4184I3415I936N6465D405J20625b8702q7394B7200b77968B21610
15711b4872q0794j01163e9646D639K28032b20750J6994B08873a3058A77469k72
15700A77197k9456i9536B61847a31954E0766a38548G3058l2533f4028B85451j19006
15689A66445J37509h9111j7096C1060K61567D7033h0415k41883a42617A73163
15678A08637a67692I7665a428j94325B27285m5525a93495B27049k4826C3779a94602
15666B53235b2514H5888k033b16144B03375c0980m9994K18B78125F6908K363c7725
$$ plain form
15653 243080 57095 -175406 587467 79756 -7907 91278 66135 -102006 52230 77789 -176332
15641 -101062 80111 132710 -270003 109361 -179062 -96353 -344001 53799 131964 -260358
15630 -11884 -2917 -14559 -76205 -121933 307344 57976 -294218 210533 -47534 -101422 -275808
15619 -275808 -359640 -341556 88724 -42109 194306 -186854 185648 169411 149534 -61212 -213415
15608 -213415 -114829 -206215 70280 -1916 -153790 -43006 39470 -151626 -75255 58673 -179646
15596 264293 94356 -39404 -76005 -52306 -232884 180590 163647 -65550 205986 76770 374403
15585 374403 -69142 -22785 32743 -2692 -32240 257737 76527 -46160 -93286 -35022 -127604
15574 -127604 44517 223385 -367278 -158208 -172973 -286024 -338249 65213 82897 -67214 79482
$$ packed form
15653B43080E7095a75406E87467G9756g907I1278k5143a02006E2230K5559a76332
15641a01062H0111N2599b70003A09361a79062Q2709k47648E3799P8165b60358
15630a1884b917j1642o1646m5728C07344E7976b94218B10533d7534n3888j74386
15619b75808q3832J8084H8724d2109A94306a86854A85648j6237j9877f1212j52203
15608b13415R8586r1386G0280a916j51874d3006C9470a51626g5255E8673a79646
15596B64293I4356c9404l6601K3699j80578A80590j6943f5550B05986G6770K97633
15585C74403f9142b2785C2743b692k9548B57737G6527d6160m7126c5022r2582
15574a27604D4517J78868c67278a58208j4765j13051n2225F5213J7684f7214G9482
$$ plain form
15562 7529 -50180 -92728 -393198 34103 -99022 181642 -35505 -199025 -30003 -206018 22580
15550 -30457 -13427 -125107 -41761 -50125 220340 -768 91451 49613 -83955 96346 96106 30119
15537 39566 149944 158082 127583 -146877 216411 -26181 -63560 -88255 156428 -31843 176063
15525 279835 44870 303749 108164 170846 -168299 42629 -129380 91930 -23575 232262
15514 75430 -132296 131901 294033 39286 -547019 147384 -13687 -258147 -155744 54415
15503 -95584 414317 -156078 37026 65446 -150120 -269441 -96091 -72855 60105 -322094 -132462
15491 -264447 9157 -25377 -421672 329409 155237 -61292 -30255 178771 -150138 330748
15480 269325 128498 163403 235987 88031 257246 154659 185350 59867 -90572 268274 350839
$$ packed form
15562G529e0180m2548l00470C4103i9022A81642c5505j63520c0003j76015B2580
15550c0457a3427j11680d1761q364B20340g68I1451m1838h3955I6346k40C0119
15537C9566J10378Q138l0499a46877B16411b6181l7379k4695A56428c1843A76063
15525B79835D4870K58879A08164O2682a68299D2629a29380I1930b3575B32262
15514G5430a32296A31901J62132C9286e47019A47384a3687k44460J02403E4415
15503i5584D14317a56078C7026K8420a50120j19321i6091K3236F0105c22094a32462
15491b64447I157b5377l96295C29409A55237f1292c0255A78771a50138C30748
15480B69325A28498L4905P2584H8031J69215j02587L0691E9867i0572B68274Q2565
$$ plain form
15469 350839 69526 91177 -338230 -42094 107802 -198646 22363 254833 -375128 -66070
15458 -117342 168632 86976 219419 209338 -62139 -103993 99080 120029 -245137 -35283 -35862
15447 -35862 -44794 181020 -2943 517036 546030 545748 433077 285002 279336 137687 54031 9857
15434 217365 56666 -59050 -374381 186174 43527 -109325 -87386 138595 81559 -78252 -151169
15423 -151169 241432 -12713 245176 237123 -193610 -348032 -19389 -121331 46834 222563
15413 222563 -31576 -208737 -94730 155534 -278698 91254 -224353 14214 177092 -387601
15402 -185186 216639 -95972 -124263 -249417 -100182 -23655 236171 3585 -197111 44337 146226
15391 146226 48808 -217556 -245704 454075 -237994 340410 260741 -5196 637 -112259 -4879
$$ packed form
15469C50839F9526K1651c38230d2094A07802a98646B2363K32470c75128f6070
15458a17342A68632q1656J32443j0081f2139m1854I9080K0949b45137c5283n79
15447c5862q932A81020b943E17036K8994k82j12671j48075n666A37687E4031I857
15434B17365E6666e9050l15331A86174D3527a09325K1939A38595n7036g8252p2917
15423a51169B41432a2713B45176q053a93610j54422a9389j01942D6834J75729
15413B22563c1576j77161i4730A55534b78698I1254b24353A4214J62878c87601
15402a85186B16639i5972k8291j25154a00182b3655B36171C585a97111D4337J01889
15391A46226D8808b17556k8148D54075b37994C40410p9669e196F37a12259d879
$$ plain form
15379 -261351 156399 197691 -58144 -14121 13539 157141 -67329 241888 342795 254883 253850
15368 253850 -60813 110836 215195 323578 362823 -191829 232249 172214 295640 -285542
15357 143356 -325557 65640 124842 290583 -104281 213054 57047 166600 136521 -23315
15346 88981 -199931 -50024 27496 162514 261620 31643 391232 317237 119830 220059 343652
15335 343652 259625 74357 99635 346572 232965 82665 52097 268051 159972 3088 24999
15324 24999 109363 -11998 134086 105562 480082 -371536 -25618 -25641 -69255 -46406 49431 397562
15312 397562 -93844 269143 288453 176731 -62199 -142033 317482 -155668 31437 169996
15302 169996 185620 92403 -154951 -142859 142234 101650 92067 -125947 -176776 -294307 -101159
$$ packed form
15379b61351A56399M1292e8144a4121A3539J43602f7329B41888J00907q7912j033
15368B53850f0813A10836J04359J08383L9245a91829B32249o0035J23426b85542
15357A43356c25557F5640N9202J65741a04281B13054E7047J09553l0079b3315
15346H8981a99931e0024B7496J35018R9106C1643L59589p3995A19830J00229J23593
15335C43652q4027G4357K5278K46937j13607H2665l0568K15954j08079C088K1911
15324B4999Q4364a1998A34086k8524L74520c71536b5618k3m3614K2849D9431L48131
15312C97562i3844B69143J9310j11722f2199p9834C17482a55668C1437J38559
15302A69996J5624I2403a54951J2092A42234m0584r583a25947n0829j17531a01159
$$ plain form
15290 -29596 -34919 -29627 136185 -26930 -441118 -57622 506241 301013 -36374 -118443 -66472
15279 -66472 531602 -201429 -196703 -250129 7502 324350 159152 113118 35675 79281 221801
15268 221801 26191 74723 -26916 30922 -179470 235608 -315080 -350895 -154398 -60090 157917
15256 79563 8645 -39542 191756 288081 -66133 285842 313769 191957 206172 -88880 115032
15244 -31399 -246646 129120 91323 145916 -53066 -63576 -121436 14251 -22996 133017 -170807
15232 251067 -64331 -109118 99455 420474 223639 12552 199693 63922 177045 197878 378191
15221 378191 -28646 327248 67955 -281064 58520 238752 47110 290955 83004 -111243
15210 -4282 -449743 122982 -70395 12259 -141826 252537 105485 -287146 318256 -106488
$$ packed form
15290b9596n323N292A36185b6930m14188e7622E06241k05228c6374q2069N1971
15279f6472E31602b01429M726n3426G502L16848A59152m6034C5675M3606J42520
15268B21801B6191M8532b6916C0922a79470B35608c15080l5815a54398f0090A57917
15256G9563H645c9542A91756R6325f6133B85842K7927j21812J4215h8880A15032
15244c1399k15247A29120l7797N4593e3066j0510n7860A4251b2996A33017a70807
15232B51067f4331m4787I9455L21019j96835A2552J87141F3922J13123K0833J80313
15221C78191b8646C27248F7955b81064E8520J80232D7110K43845H3004a11243
15210d282m45461A22982g0395A2259a41826B52537A05485b87146C18256a06488
$$ plain form
15199 171294 242224 288599 360559 215458 46278 320710 109155 165957 81382 -139011 220054
15187 55817 8431 -129684 -25427 157664 -195157 -421079 -293394 41925 50678 460215 29306
15175 457017 -203054 273745 38513 109678 253488 114440 13095 -7196 -133555 -211261 509
15163 269371 301434 67494 184867 47970 33940 143177 40901 -117691 608664 171608
15152 491835 -205779 -289992 -124283 -19929 196095 -35687 -153933 -87029 94259 -157643
15141 -178783 -58916 -70492 168175 -108544 230221 122424 214784 274219 60486 70037 171193
15130 171193 168726 13412 257896 -32468 187416 -117629 189738 334902 -139072 509702
15119 167347 167921 269999 9165 286730 436725 -122351 -92199 43765 18883 81872 7495
$$ packed form
15199A71294P0930M6375P1960j45101D6278K74432A09155N6802H1382a39011B20054
15187E5817H431a29684b5427A57664a95157k25922J27685D1925Q753M09537B9306
15175D57017b03054B73745C8513P1165J43810A14440A3095g196j26359p7706E09
15163B69371L2063F7494J17373D7970j4030J09237D0901a17691F08664A71608
15152D91835b05779q4213a24283a9929A96095c5687j18246O6904I4259a57643
15141a78783e8916j1576A68175a08544B30221j07797R2360N9435F0486R551J01156
15130A71193k467A3412K44484c2468A87416a17629A89738J45164a39072E09702
15119A67347N74J02078I165K77565J49995a22351L0152D3765A8883O2989G495
$$ plain form
15107 -137826 -105422 235203 253440 509773 -116575 -153362 120116 42186 349065 68825
15096 -196402 32775 11407 294997 -312012 299777 219921 -109159 389064 155230 -105417
15085 351173 236285 -2003 141380 474529 136667 -42541 -61879 204846 144466 74495 181765
15074 181765 151848 -130 393701 -22793 262054 49917 -22272 -28304 7052 525643 243161
15062 211579 98418 275790 219231 268889 -28284 107447 315117 -112616 395698 346681
15052 346681 142785 328686 579009 288204 185583 66508 417375 271377 239547 128248
15042 128248 115138 197548 104589 9685 140027 260130 173445 113773 538898 230090 362311
15031 362311 -4853 362975 275217 539484 156171 79089 629965 297591 463392 297709
$$ packed form
15107a37826L2404B35203J8237K56333a16575l6787A20116D2186L06879F8825
15096a96402C2775A1407K83590c12012B99777p9856a09159C89064A55230a05417
15085C51173j14888b003A41380L33149A36667d2541j9338B04846o0380o9971J07270
15074A81765k9917a30C93701b2793B62054D9917b2272o032G052N18591B43161
15062B11579I8418J77372n6559M9658b8284A07447K07670a12616C95698m9017
15052C46681A42785J85901K50323B88204j02621F6508L50867j45998l1830j11299
15042A28248j3110Q2410r2959I685J30342J20103q6685n9672M25125B30090J32221
15031C62311d853C62975q7758K64267A56171p7082N50876B97591J65801j65683
$$ plain form
15021 297709 283287 207023 276880 -3119 402911 500820 359808 573033 312112 260800 67664
15009 154180 290255 487488 316963 410014 437311 241905 605246 503344 294122 206342
14999 206342 174103 359374 380778 161790 539115 177217 255662 599775 502686 313910
14989 313910 391581 314874 142362 500691 562031 310915 236602 692618 380491 681904
14979 681904 330522 424905 687560 526081 378109 365812 287411 701888 272888 697935
14969 697935 501345 389159 290871 210297 249168 298075 206808 129331 202544 164869 168179
14958 168179 163360 458791 231549 284285 191719 344747 127931 558318 667355 368145
14948 368145 736578 198146 343657 251892 515330 411059 505508 236553 308628 263514
$$ packed form
15021B97709j4422p6264O9857c119D02911R7909j41012K13225k60921n1312F7664
15009A54180J36075J97233j70525R3051K7297j95406L63341j01902k09222q7780
14999B06342l2239J85271K1404A61790L77325A77217P8445L44113r7089j88776
14989C13910P7671p6707A42362L58329O1340k51116p4313M56016l12127L01413
14979F81904C30522R4383K62655j61479j47972j2297p8401M14477B72888M25047
14969F97935j96590j12186r8288q0574L8871M8907r1267p7477P3213l7675L310
14958A68179m819K95431k27242N2736r2566J53028A27931M30387J09037k99210
14948C68145L68433A98146J45511r1765K63438j04271R4449B36553P2075m5114
$$ plain form
14938 263514 314007 538904 167701 452295 563647 740124 96324 802656 926208 516174
14928 516174 786249 642414 717946 1111913 827447 837303 1018486 745176 982191 1278023
14918 1278023 1164767 1377223 1233191 970384 748209 652415 820742 357452 486619 255370
14908 255370 394496 755891 275892 352607 284860 73340 361945 76456 499906 713052
14898 713052 498688 289753 300530 432994 314307 141681 587509 457256 158230 692548
14888 692548 367996 674529 340823 623477 195119 410547 345923 440243 545443 594241
14878 594241 488242 358644 405162 744651 638016 722612 1135583 371400 628832 658185
14868 658185 224271 333720 688432 625032 451135 181951 333018 78592 254802 223719
$$ packed form
14938B63514N0493K24897A67701K84594J11352J76477I6324P06332J23552m10034
14928E16174K70075j43835P5532L93967k84466R856J81183k73310K37015K95832
14918A278023j13256K12456j44032k62807k22175r5794J68327C57452J29167k31249
14908B55370J39126L61395B75892P6715o7747G3340K88605G6456M23450K13146
14898G13052k14364k08935J0777J32464j18687A41681M45828j30253A58230N34318
14888F92548l24552L06533l33706K82654A95119K15428o4624R4320J05200M8798
14878E94241j05999j29598M6518L39489j06635Q4596M12971C71400K57432K9353
14868F58185B24271J09449L54712o3400j73897A81951J51067G8592J76210l1083
$$ plain form
14858 223719 203432 359951 75673 502043 225044 366842 685514 338422 318040 506523
14848 506523 771282 528229 594415 689460 650184 512170 422724 581183 579726 1121643 1097441
14837 1097441 769002 1152506 491360 921155 603376 807105 619083 580487 527502 708186
14827 708186 712149 559112 367535 651583 167300 525878 630041 670469 562680 459790
14817 459790 143583 587716 569238 550901 355566 649023 558622 555820 607342 572671 775064
14806 775064 330026 647181 696380 643173 1039628 625935 622060 595634 552491 468685 892476
14795 892476 492237 505502 850636 484150 274208 716969 782931 526561 643028 448183
14785 448183 536133 592601 677238 506584 870219 919392 382260 527815 683781 857404
$$ packed form
14858B23719k0287J56519G5673M26370B25044J41798L18672C38422k0382J88483
14848E06523K64759k43053O6186R5045l9276j38014q9446J58459j457N41917k4202
14837A097441l28439L83504D91360M29795l17779K03729j88022l8596n2985J80684
14827G08186L963j53037j91577K84048A67300L58578J04163M0428j07789j02890
14817D59790A43583M44133j8478j8337j95335K93457r0401k802N1522l4671K02393
14806G75064C30026L17155M9199n3207L96455m13693l875k6426m3143q3806M23791
14795H92476m00239J3265L45134l66486k09942M42761O5962k56370J16467j94845
14785D48183Q7950N6468Q4637j70654L63635M9173C82260J45555J55966J73623
$$ plain form
14775 857404 628645 501054 725610 438159 89023 652527 526356 758078 433452 252931
14765 252931 681633 437336 611776 331827 705255 456127 801127 800501 508639 653957
14755 653957 894616 361672 767972 666713 874380 613324 957286 610301 544083 971925
14745 971925 684934 564477 451035 598752 916745 791193 562126 720243 985860 571878
14735 571878 388145 557089 819458 901148 961059 797510 747955 643072 845032 1024713
14725 1024713 760665 1005933 1327376 1034365 1210268 1282458 1119672 1193248 910843 850674
14715 850674 1110801 1029936 876965 701462 912496 559075 917808 832406 696576 995576
14705 995576 709043 1122949 909462 981179 950541 1275406 1032955 1181707 1084745 1140510
$$ packed form
14775H57404k28759j27591K24556k87451H9023N63504j26171K31722l24626j80521
14765B52931M28702k44297J74440k79949L73428k49128L45000o26k91862J45318
14755F53957K40659C61672M06300j01259K07667k61056L43962l46985o6218M27842
14745I71925k86991j20457j13442J47717L17993j25552k29067J58117K65617m13982
14735E71878j83733J68944K62369Q1690N9911j63549m9555j04883K01960J79681
14725A024713k64048K45268L21443k93011J75903P2190j62786P3576k82405o0169
14715H50674K60127q0865j52971j75503K11034l53421L58733q5402j35830K99000
14705I95576k86533M13906k13487P1717l0638L24865k42451J48752r6962N5765
$$ plain form
14695 1140510 1475833 1436464 923129 870974 854185 1083229 770352 657513 725123 1121204
14685 1121204 813578 923236 912601 835804 1082403 865030 584141 1207201 945080 813934
14675 813934 882629 899419 847388 830113 1316571 1027922 931674 906294 963483 867920 1160116
14664 1160116 975664 463463 1248442 958596 1113869 1082975 663186 976421 1235298 795935
14654 795935 1429319 1214472 962225 1153948 1192386 1206996 1497018 1394723 1060790 1335068
14644 1335068 1234807 1132322 1300602 1033512 1171271 1128118 1068625 1348099 1309451 1374305
14634 1374305 1291726 1067338 1102334 1479299 1196114 1331120 1274521 863418 1444462 1341544
14624 1341544 1229889 1148629 1519111 1445576 1142545 1353229 1355722 1719217 1190531 1210166
$$ packed form
14695A140510L35323l9369n13335n2155j6789K29044l12877j12839O7610L96081
14685A121204l07626J09658j0635p6797K46599k17373k80889O23060k62121j31146
14675H13934O8695J6790n2031j7275M86458k88649r6248k5380N7189r5563K92196
14664A160116j84452D63463P84979k89846J55273l0894m19789L13235K58877m39363
14654G95935O33384k14847k52247J91723L8438J4610K90022j02295l33933K74278
14644A335068j00261j02485J68280k67090J37759m3153n9493K79474l8648O4854
14634A374305q2579k24388L4996L76965k83185J35006n6599m11103N81044j02918
14624A341544j11655q1260L70482p3535l03031K10684K493L63495n28686J9635
$$ plain form
14614 1210166 1565690 1276810 1275035 1415116 1853405 1656184 1679460 1522506 1041431 1342064
14604 1342064 1388230 1471766 1670462 1793000 1424846 1685116 1718396 1367278 1537447 1430395
14594 1430395 1535583 1625137 1571352 2130668 1695408 1553846 1743468 1814481 2027626 1690251
14584 1690251 1721735 1862888 1580677 2066450 1730339 1886812 1859866 2073493 2177261 2008167
14574 2008167 1947285 2071598 1703974 2031993 1932829 2376142 2430052 2148294 2312194 2609321
14564 2609321 2417212 2198520 2453424 2299689 2495346 2938475 2741656 2900036 3286920
14555 3286920 3058439 3644344 4061943 4490871 5556821 6076135 8245860 11756204 17969045
14546 17969045 28218177 33803621 20249126 9803196 5926746 3777679 2968145 2728479
$$ packed form
14614A210166L55524k88880j775J40081M38289j97221K3276j56954m81075L00633
14604A342064M6166Q3536J98696J22538l68154K60270L3280l51118J70169j07052
14594A430395J05188Q9554n3785N59316m35260j41562J89622P1013K13145l37375
14584A690251L1484J41153k82211M85773l36111J56473k6946K13627J03768j69094
14574B008167o0882J24313l67624L28019r9164M43313N3910k81758J63900K97127
14564B609321j92109k18692K54904j53735J95657M43129j96819J58380L86884
14555C286920k28481N85905M17599M28928J065950N19314K169725L510344O212841
14546A7969045J0249132N585444j3554495I803196l876450k149067q09534k39666
$$ plain form
14538 2728479 2476045 2253134 2278305 2347800 1825618 2348498 1908528 1989934 1735852 2318897
14528 2318897 2100250 2227904 2265549 2221632 2487432 2655691 2576079 2334599 2554231 2316193
14518 2316193 2269022 2490995 2512894 2482079 2947117 2425958 2424800 2612666 2661646 2758250 2980728
14507 2980728 2715307 2772268 2997283 3041050 2571714 3097097 2782196 2955547 2981564 3012567
14497 3012567 2616893 3368588 3051660 3124018 3475965 2930628 3128276 3373798 3523147 3374793
14487 3374793 3267168 3325830 3578302 3482958 3543706 3875774 3579693 3625159 3680836 3753548
14477 3753548 3829050 4167741 3870532 3838495 4134127 3844694 4084436 4127408 3973292 4037022
14467 4037022 4580171 4381938 4489652 4548925 4217460 4524051 4669399 4599296 4369215 4688833
$$ packed form
14538B728479k52434k22911K5171O9495n22182N22880m39970Q1406k54082N83045
14528B318897k18647J27654L7645m3917K65800J68259p9612k41480K19632k38038
14518B316193m7171K21973K1899l0815M65038n21159j158J87866M8980R6604K22478
14507B980728k65421N6961K25015M3767m69336N25383l14901J73351K6017L1003
14497C012567l95674P51695l16928P2358L51947n45337J97648K45522J49349j48354
14487C374793j07625N8662K52472r5344O0748L32068k96081M5466N5677P2712
14477C753548P5502L38691k97209l2037K95632k89433K39742M2972j54116O3730
14467D037022N43149j98233J07714N9273l31465L06591J45348p0103k30081L19618
$$ plain form
14457 4688833 4835438 4825969 5111840 4930081 5066545 5056348 4953737 4970830 5124797 5196859
14447 5196859 5074766 5657175 5506860 5303842 5812126 5691086 5773442 5606747 5956127 5911361
14437 5911361 6106984 6213082 6315947 5954047 6381110 6495029 6623858 6348459 6947540
14428 6947540 6702996 6992188 6989054 7278621 6843149 7021006 7526336 7698806 7711579 7815229
14418 7815229 7988776 8451239 8098354 8532221 8303208 8395919 8547389 8765739 8407062 8943478
14408 8943478 9231385 9086104 9514984 9316435 9762765 10033414 10069045 10169201 10149661 10586079
14398 10586079 10443626 10596093 10495743 10893748 11172250 11466384 11573958 11760064 12008524
14389 12008524 11968625 12262135 12767424 12776167 12929855 13482456 13510814 13768098 14148588 14536720
$$ packed form
14457D688833J46605r469K85871j81759J36464j0197j02611J7093J53967P2062
14447E196859j22093N82409j50315k03018N08284j21040Q2356j66695L49380m4766
14437E911361J95623J06098J02865l61900M27063J13919J28829k75399N99081
14428F947540k44544K89192l134K89567m35472J77857N05330J72470J2773J03650
14418G815229J73547M62463l52885M33867k29013R2711J51470K18350l58677N36416
14408H943478K87907j45281M28880j98549M46330K70649L5631J00156j9540M36418
14398A0586079j42453J52467j00350L98005K78502K94134J07574J86106K48460
14389A2008524l9899K93510N05289Q743J53688N52601K8358K57284L80490L88132
$$ plain form
14379 14536720 14451749 14989532 14982213 15097625 15343015 16186972 16113210 16328145 17000353 17032138
14369 17032138 17316854 17979289 18067804 18708298 18816891 19445841 19857113 20276858 20761806
14360 20761806 21222818 21494851 22032279 22602152 22792580 23625386 24294359 24647656 25083480
14351 25083480 25770133 26668250 27197441 27893783 28668418 29247266 30199973 30792640 31570286
14342 31570286 32491357 33350000 33969795 35021868 36114582 37037001 37953512 39285033 40520558
14333 40520558 41979429 43013539 44415987 45885727 47049093 48670980 50368493 51989300
14325 51989300 54053658 55006885 57204123 59271247 61222643 63625518 65891030 68269064
14317 68269064 70514432 73634375 75779131 78988946 82408893 85511457 89236292 92779301
$$ packed form
14379A4536720q4971N37783p319J15412K45390Q43957p3762K14935O72208L1785
14369A7032138K84716O62435Q8515O40494J08593O28950M11272M19745M84948
14360B0761806M61012K72033N37428N69873J90428Q32806O68973L53297M35824
14351B5083480O86653Q98117N29191O96342P74635N78848R52707N92667P77646
14342C1570286R21071Q58643O19795J052073J092714R22419R16511J331521J235525
14333D0520558J458871J034110J402448J469740J163366J621887J697513J620807
14325E1989300K064358R53227K197238K067124J951396K402875K265512K378034
14317F8269064K245368L119943K144756L209815L419947L102564L724835L543009
$$ plain form
14309 92779301 96407923 100981583 104942857 109370613 114204154 119479047 124621868 130418961
14301 130418961 136307278 142490834 149132840 155955171 163060714 170832044 178651498 187811423
14293 187811423 196160681 205991398 216116494 226656626 237562741 249269768 261010465
14286 261010465 273593047 286751836 300158663 314026452 327774317 341734202 355618264
14279 355618264 369271409 382451651 395868170 407920689 418901666 428343364 435374635
14272 435374635 439647866 442216678 444346016 445384953 443566196 440346612 434738457 426905984
14264 426905984 417754308 406576932 393854434 380159022 365756849 350896963 335951074
14257 335951074 320927474 306249241 291384941 277244664 263620131 250945817 238128711
$$ packed form
14309I2779301L628622M573660L961274M427756M833541N274893N142821N797093
14301A30418961N888317O183556O642006O822331P105543P771330P819454R159925
14293A87811423Q349258R830717J0125096J0540132J0906115J1707027J1740697
14286B61010465J2582582J3158789J3406827J3867789J3747865J3959885J3884062
14279C55618264J3653145J3180242J3416519J2052519J0980977R441698P031271
14272D35374635M273231K568812K129338J038937j818757l219584n608155p832473
14264D26905984r151676j1177376j2722498j3695412j4402173j4859886j4945889
14257C35951074j5023600j4678233j4864300j4140277j3624533j2674314j2817106
$$ plain form
14250 238128711 226461332 215258095 204504634 194228741 184637466 176191434 167551040
14243 167551040 159371980 152218972 144912820 137986139 132086078 125976439 120476354 115320382
14235 115320382 110472741 105583780 101171918 96840381 93753733 89561545 86146876 82619066
14227 82619066 79554141 76869278 73838549 71141342 68422738 66031081 63620541 61762602
14219 61762602 59372807 57566430 55908375 54031573 52237318 50868544 49318696 47564473
14211 47564473 45986077 44774500 43665797 42223825 41358528 40360476 38845887 37706631
14203 37706631 36855037 35715220 34772694 34310463 33173815 32396751 31315766 30580632 29699798
14194 29699798 28593323 28595037 27273212 26915580 26287797 25591345 25236919 24543727 23607329
$$ packed form
14250B38128711j1667379j1203237j0753461j0275893r591275q446032q640394
14243A67551040q179060p153008p306152o926681n900061o109639n500085n155972
14235A15320382m847641m888961m411862m331537l086648m192188l414669l527810
14227H2619066l064925k684863l030729k697207k718604k391657k410540j857939
14219F1762602k389795j806377j658055j876802j794255j368774j549848j754223
14211D7564473j578396j211577j108703j441972q65297r98052j514589j139256
14203C7706631q51594j139817r42526m62231j136648p77064j080985p35134q80834
14194B9699798j106475J714j321825l57632o27783o96452l54426o93192r36398
$$ plain form
14185 23607329 23372029 22984074 22497069 22020324 21220568 20657403 20574045 20112372 19494511
14176 19494511 19141865 18766167 18618161 17964007 17620075 17303262 17127109 16938474 16372099
14167 16372099 15861329 15730077 15597660 15032748 14693511 14663772 14232152 14431636 13962007
14158 13962007 13435932 13133913 13175858 12533437 12690630 12496285 12234525 11968693 11947188 11549591
14148 11549591 11227688 11621024 11190099 10702366 10674512 10411603 10772147 10511403 9956775
14139 9956775 9866542 9983151 9507667 9369092 9198499 9475369 8876283 8750266 8186782 8744074
14129 8744074 8731452 8457153 8298845 8112380 8115800 8221625 7791455 7747067 7571550 7766670
14119 7766670 7254568 7667000 7138945 7375054 6921949 6894898 6694688 6622442 6600198 6425418
$$ packed form
14185B3607329k35300l87955m87005m76745p99756n63165q3358m61673o17861
14176A9494511l52646l75698j48006o54154l43932l16813j76153j88635n66375
14167A6372099n10770j31252j32417n64912l39237k9739m31620J99484m69629
14158A3962007n26075l02019M1945o42421J57193j94345k61760k65832k1505l97597
14148A1549591l21903L93336m30925m87733k7854k62909L60544k60744n54628
14139I956775r0233J16609m75484j38575j70593K76870n99086j26017n63484N57292
14129H744074j2622k74299j58308j86465L420J05825m30170m4388j75517J95120
14119G766670n12102M12432n28055K36109m53105k7051k00210p2246k2244j74780
$$ plain form
14109 6425418 6199998 6259447 6346399 6071792 6112289 6326498 5879221 5731367 5983437 6021667
14099 6021667 5989042 5888335 5546340 5497663 5458367 5596005 5537913 5269391 5209268 5284184
14089 5284184 5546758 5200198 4913647 4987115 5325563 4712541 4693300 4773286 4853253 4864743
14079 4864743 4448953 5002322 4395690 4717849 4417514 4456902 4315180 4458545 4378857 4156202
14069 4156202 3978623 3866804 3726057 4237931 4164480 4043708 4092372 4286194 4287943 4130434
14059 4130434 4227570 3770353 3852433 3802106 3564245 3593046 3618876 3650573 3352285 3341524 3701007
14048 3701007 3584930 3178263 3528270 3388246 3327459 2845182 3007126 3380507 3057787 3101893
14038 3101893 3117278 3099512 3013253 3151863 3322180 2938025 3188750 2893994 2837830 2902377
$$ packed form
14109F425418k25420N9449Q6952k74607M0497K14209m47277j47854K52070L8230
14099F021667l2625j00707l41995m8677l9296J37638n8092k68522o0123P4916
14089E284184K62574l46560k86551P3468L38448o13022j9241P9986P9967J1490
14079D864743m15790N53369o06632L22159l00335L9388j41722J43365p9688k22655
14069D156202j77579j11819j40747N11874p3451j20772M8664J93822J749j57509
14059D130434R7136m57217Q2080n0327k37861K8801K5830L1697k98288j0761L59483
14048C701007j16077m06667L50007j40024o0787m82277J61944L73381l22720M4106
14038C101893J5385j7766q6259J38610J70317l84155K50725k94756n6164O4547
$$ plain form
14028 2902377 2667236 2594865 2835885 2720185 2514107 2620146 2414336 2565347 2379180 2565881
14018 2565881 2541964 2822165 2573702 2566003 2741641 2520388 2694824 2623399 2125895 2252762
14008 2252762 2159363 2469036 2155718 2653324 2554971 2319188 2404504 2218561 2414994 1884984
13998 1884984 2242236 2429065 2017562 2560592 2504226 2703473 2510605 3210678 3518882 4820103
13988 4820103 7309219 12022596 21758989 33812250 27130798 15978688 9786480 6915976
13980 6915976 5245951 4522457 3982122 3449920 3224262 3252850 3045311 2776009 2704303 2253818
13970 2253818 2628349 2581749 2381135 2316850 2390874 2179916 2426996 2337516 1967433 1996123
13960 1996123 2118286 1863800 2155919 2091179 1637945 2052805 1766497 1693179 1888048 1833228
$$ packed form
14028B902377k35141p2371K41020j15700k06078J06039k05810J51011j86167J86701
14018B565881k3917K80201k48463p699J75638k21253J74436p1425m97504J26867
14008B252762r3399L09673l13318M97606r8353k35783Q5316j85943J96433n30010
13998A884984L57252J86829m11503N43030n6366J99247j92868P00073L08204J301221
13988D820103K489116M713377R736393J2053261o681452j1152110o192208k870504
13980F915976j670025p23494n40335n32202k25658K8588k07539k69302p1706m50485
13970B253818L74531m6600k00614o4285P4024k10958K47080q9480l70083K8690
13960A996123J22163k54486K92119o4740m53234M14860k86308p3318J94869n4820
$$ plain form
13950 1833228 1630658 2262136 1765926 1828854 1666531 1784479 1675434 1953003 1731586 2012903
13940 2012903 1604751 1619266 1335475 1436132 1631602 1586200 1605160 1738124 1397050 1619108
13930 1619108 1648615 1339204 1506262 1561333 1857501 1750447 1647413 1646561 1545381 1302872
13920 1302872 1579847 1376137 1969221 1375751 1256527 1431475 1257122 1372779 1405464 1333110
13910 1333110 1521347 1517902 1061978 1580245 1302859 1550467 1052230 1507521 1413642 1104098
13900 1104098 1424440 1412164 1242920 1195016 1190693 950020 1623301 1271783 1570619 1400077
13890 1400077 1477078 1287370 1168069 1274561 1457538 1140710 1356520 1187831 1119464 1126226
13880 1126226 1122737 1407156 857468 990186 866818 926405 1013119 1122848 974597 1185094
$$ packed form
13950A833228k02570O31478m96210O2928j62323J17948j09045K77569k21417K81317
13940B012903m08152J4515k83791J00657J95470m5402J8960J32964l41074K22058
13930A619108K9507l09411J67058N5071K96168j07054j03034q52j01180k42509
13920A302872K76975k03710N93084n93470j19224J74948j74353J15657L2685p2354
13910A333110J88237l445m55924N18267k77386K47608m98237M55291r3879l09544
13900A104098L20342j2276j69244m7904m323k40673O73281l51518K98836j70542
13890A400077P7001j89708j19301J06492J82977l16828K15810j68689o8367O762
13880A126226l489K84419n49688J32718j23368N9587Q6714J09729j48251K10497
$$ plain form
13870 1185094 1184094 1371829 1111434 1248347 1175264 1193600 1036634 1169141 924385 946439
13860 946439 958189 1226180 653337 1083018 984691 1201232 1168509 1058945 1171038 904223
13850 904223 968316 653332 978231 1116751 910384 985088 916120 913513 647276 740693 701459
13839 701459 1049869 617162 1004805 1042423 857182 685137 846809 785494 1169551 779976
13829 779976 835237 837195 958347 676121 872682 922506 825736 1124192 827410 737918 688302
13818 688302 1109496 747286 1118843 904428 664152 693173 583776 794636 371080 934365
13808 934365 719701 572357 873451 808020 675577 1212573 958279 647125 699524 869232
13798 869232 1135988 838277 760257 974983 837351 411559 1044490 553393 589939 869212
$$ packed form
13870A185094j000J87735k60395J36913p3083J8336j56966J32507k44756K2054
13860I46439J1750K67991n72843M29681r8327K16541l2723j09564J12093k66815
13850I04223O4093l14984L24899J38520k06367P4704o8968k607k66237R3417l9234
13839G01459L48410m32707L87643L7618j85241j72045J61672o1315L84057l89575
13829G79976N5261J958J21152k82226J96561M9824r6770K98456k96782q9492m9616
13818F88302M21194l62210L71557k14415k40276K9021j09397K10860C71080N63285
13808I34365k14664j47344L01094o5431j32443N36996k54294l11154N2399J69708
13798H69232K66756k97711p8020K14726j37632D11559O32931m91097L6546K79273
$$ plain form
13788 869212 540737 677311 720461 820391 642565 858585 526975 888475 525634 583526
13778 583526 274067 675355 575811 1037231 607032 817730 557998 855258 738215 1023866
13768 1023866 492300 530374 530537 454916 464304 760286 867094 764968 415331 630204 321154
13757 321154 584431 591612 880774 694177 556829 407690 963632 489556 434523 412998
13747 412998 668508 617958 446594 493025 475603 494715 687091 493928 746798 651304
13737 651304 415095 686937 496772 592603 552876 328330 707215 558252 612274 843121
13727 843121 521944 514346 591496 307171 828958 801777 310689 382498 591582 442621
13717 442621 631719 512084 605528 481233 639093 586214 380256 534993 432970 467967
$$ packed form
13788H69212l28475J36574M3150R9930j77826K16020l31610L61500l62841N7892
13778E83526B74067M01288r9544M61420m30199K10698k59732K97260j17043K85651
13768A023866D92300L8074J63p5621R388K95982J06808j02126l49637K14873l09050
13757C21154K63277P181K89162j86597j37348j49139N55942m74076n5033k1525
13747D12998K55510n0550j71364M6431j7422J9112J92376j93163K52870r5494
13737F51304k36209K71842j90165R5831l9727k24546L78885j48963N4022K30847
13727H43121l21177p598P7150k84325N21787k7181C10689P1809K09084j48961
13717D42621J89098j19635R3444j24295J57860n2879k05958J54737j02023L4997
$$ plain form
13707 467967 377714 439094 800743 449386 408543 622002 523570 469283 627507 677261 542089
13696 542089 540181 231275 636686 277873 233406 442781 449771 231920 559661 453572
13686 453572 477855 420761 223985 644630 558875 423213 504176 517996 592118 308221 156194
13675 156194 689081 38365 591532 283716 509889 651178 403277 445112 469613 617057
13665 617057 479615 220194 446036 510978 442028 698848 500521 239270 283018 660309
13655 660309 698377 603082 242332 629235 313482 337743 294497 338426 467689 829183
13645 829183 592604 353445 247657 225703 263694 458717 317118 291448 236103 479450
13635 479450 491490 505434 -27308 264523 482001 367877 380896 325414 283514 355650 430116
$$ packed form
13707D67967r0253O1380L61649l51357m0843K13459r8432n4287J58224M9754j35172
13696E42089j908B31275M05411B77873m4467K09375O990k17851L27741j06089
13686D53572K4283n7094j96776M20645q5755j35662Q0963J3820P4122k83897j52027
13675A56194N32887C8365N53167B83716K26173J41289k47901M1835K4501J47444
13665F17057j37442B20194K25842O4942o8950K56820j98327B39270M3748L77291
13655F60309L8068r5295B42332L86903C13482K4261m3246M3929J29263L61494
13645H29183k36579k39159j05788k1954L7991J95023j41599k5670n5345K43347
13635D79450J2040J3944b7308B64523K17478j14124J3019n5482m1900P2136P4466
$$ plain form
13624 430116 501542 436723 399064 448143 506290 197102 448667 260115 641306 212989
13613 404983 489472 615106 375148 557937 428772 156500 252097 620577 94206 483992
13603 483992 481235 302010 126858 106000 196375 -49577 431636 193752 206489 19356 -9346
13591 301379 263903 239706 291836 405882 356356 686331 196481 758244 240974 279538
13581 279538 153768 159414 402013 217959 121691 569706 349153 624069 182289 301081
13571 301081 390661 339766 147160 297011 294415 56362 -75318 231182 114123 160800 498369
13560 498369 169392 186947 385887 242379 358641 243285 417289 164764 466149 7821
13549 155798 241596 199926 480156 126155 304302 194348 341250 420032 -38089 256335
$$ packed form
13624D30116P1426o4819l7659M9079N8147A97102K51565j88552L81191B12989
13613D04983Q4489J25634k39958J82789j29165A56500R5597L68480I4206L89786
13603D83992k757j79225A26858k0858R0375d9577D31636A93752J2737A9356i346
13591C01379l7476k4197N2130J14046m9526L29975A96481N61763B40974L8564
13581B79538j25770N646K42599j84054r6268M48015k20553K74916A82289J18792
13571C01081Q9580n0895A47160J49851k596E6362g5318B31182A14123M6677L37569
13560D98369A69392J7555J98940j43508J16262j15356J74004A64764L01385G821
13549A55798Q5798m1670K80230A26155J78147j09954J46902P8782c8089B56335
$$ plain form
13538 251198 156287 40997 339372 137482 31681 22695 267999 750489 277860 315241 588621
13527 588621 391578 431172 247140 282086 88500 430306 624527 476006 412518 272574
13517 272574 161360 364399 265991 344179 397944 510098 -48958 337019 116999 -43554
13506 238195 520014 76975 219545 160568 272987 128312 -19444 298240 -56929 -73783
13496 -73783 269392 412877 263693 628830 -141999 395190 379836 367319 18413 201906
13486 201906 300417 389160 117218 280150 531865 134185 248218 -76413 -3899 607186
13475 92408 -27644 245617 47351 309327 77235 87410 467831 373791 461877 97708 241319
13464 241319 34813 439884 66365 235332 199128 31767 186161 29773 141401 52095 227805
$$ packed form
13538B51198r4911D0997K98375A37482C1681q986K45304M82490B77860L7381K73380
13527E88621j97043L9594j84032L4946H8500L41806J94221j48521o3488j39944
13517B72574j11214K03039r8408P8188N3765J12154d8958C37019A16999d3554
13506B38195K81819G6975J42570n8977J12419A28312a9444B98240e6929j6854
13496g3783B69392J43485j49184L65137a41999C95190j5354j2517A8413J83493
13486B01906R8511Q8743A17218J62932K51715A34185J14033g6413c899F07186
13475I2408b7644B45617D7351K61976G7235J0175L80421r4040Q8086I7708J43611
13464B41319C4813M05071F6365J68967l6204C1767J54394B9773J11628E2095J75710
$$ plain form
13453 227805 559437 457493 255970 6657 32153 221594 193883 138683 -134492 168266
13442 48812 -70947 -117230 -152259 86290 408482 99006 520723 397485 428628 166111 62710
13430 332232 -43582 615341 132325 402396 300567 206600 194813 401652 3846 81339 162881
13419 162881 -169155 207063 382623 334426 367223 237636 -209958 138826 222041 592755
13409 592755 229205 65756 422967 15929 51907 -111951 107316 183515 106978 57225 7454
13397 344417 334914 344618 80405 377160 187754 139538 208585 -143282 270117 286143 19258
13385 297610 215847 -110559 192529 81649 138729 371931 254387 -211316 285969 341007
13375 341007 143979 368302 165065 -55566 571238 340505 512581 186266 159379 103199
$$ packed form
13453B27805L31632j01944k01523F657K5496J89441k7711n5200a34492A68266
13442D8812g0947m6283l5029H6290L22192I9006M21717j23238L1143A66111F2710
13430C32232d3582F15341A32325K70071j01829r3967j1787K06839C846P7493Q1542
13419A62881a69155B07063J75560m8197L2797j29587b09958A38826Q3215L70714
13409E92755B29205F5756L57211A5929L5978a11951A07316P6199p6537m9753G454
13397C44417r503R704H0405K96755A87754m8216O9047a43282B70117J6026A9258
13385B97610q1763a10559A92529H1649N7080K33202j17544b11316B85969N5038
13375C41007A43979K24323A65065e5566E71238k30733J72076A86266k6887n6180
$$ plain form
13365 103199 554475 147077 72569 315824 -96552 295294 211388 96405 -26858 350859
13354 182569 170820 309811 121933 238832 226239 92594 159006 16003 167688 201335 282385
13343 282385 414699 -147051 79507 201043 361003 449245 395083 472678 473355 -8960 301132
13331 -54800 221482 448486 482524 -127763 24218 177537 251566 421334 484571 13966 214754
13320 214754 12147 187566 232049 377049 141369 121877 136682 240604 39116 355724
13310 355724 91985 -50131 244198 173469 126787 131861 -113644 118901 43861 -52187 146772
13298 -118945 -6121 88010 37295 113727 105164 -107342 -82406 53406 69306 256431 353198
13287 353198 160270 229727 -39924 284652 171828 -99700 432975 92187 112569 -26698 236220
$$ packed form
13365A03199M51276A47077G2569K43255i6552B95294q3906I6405b6858C50859
13354A82569j1749J38991A21933J16899j2593I2594O6412A6003J51685L3647Q1050
13343B82385J32314a47051G9507J21536J59960Q8242n4162P7595O77h960C01132
13331e4800B21482K27004L4038a27763B4218J53319P4029J69768O3237A3966K00788
13320B14754A2147J75419M4483J45000A41369j9492J4805J03922C9116L16608
13310C55724I1985e0131B44198p0729m6682N074a13644A18901D3861e2187A46772
13298a18945f121H8010C7295P6432q563a07342K4936E3406J5900J87125R6767
13287C53198A60270O9457c9924B84652j12824i9700D32975I2187K0382b6698B36220
$$ plain form
13275 255636 67473 -17249 99137 -110934 173291 416013 -3527 -40072 172901 310190 350210
13264 350210 -26534 227059 197693 234765 154488 274403 88457 18866 165781 319295 20307
13252 357732 -213237 496678 8346 23000 67902 -134551 53549 111126 52489 -145743 45338
13240 -161534 295571 164472 13252 285498 -201382 134270 199505 -92800 366214 390992
13230 390992 115196 6159 41513 -55278 124167 19673 152201 221731 71539 146726 49373
13218 -160844 59508 285521 -44654 443671 209935 251643 25325 209907 33277 -187277
13207 132111 161760 428232 -186285 301188 156380 318561 116296 248977 544643 210405
13196 -224325 -45906 200947 -21114 -323611 73101 135867 68035 87396 107367 213881 -28106
$$ packed form
13275B55636F7473a7249I9137a10934A73291K42722c527l6545A72901J37289M0020
13264C50210b6534B27059k9366L7072q0277J19915H8457A8866J46915J53514B0307
13252C57732b13237D96678H346J4654M4902a34551E3549N7577E2489a45743D5338
13240a61534B95571j31099A3252K72246b01382A34270O5235i2800C66214K4778
13230C90992A15196F159L5354e5278A24167A9673J32528O9530G1539P5187D9373
13218a60844E9508K26013d4654D43671B09935M1708B5325J84582C3277a87277
13207A32111K9649K66472a86285C01188j44808J62181A16296J32681K95666B10405
13196b24325d5906B00947b1114l02497G3101O2766o7832J9361J9971J06514b8106
$$ plain form
13184 108298 -24950 -35671 195472 -38222 231588 -268643 398587 229022 149280 191092
13174 191092 213700 119296 173881 -199021 138863 239920 258214 28689 218538 -141780
13163 93599 280191 37410 -189071 350485 52725 -141617 186187 53227 -36707 -61445 -58747
13152 -58747 187448 52079 -100298 170248 120311 -130130 -11666 293639 -36072 353377
13141 113453 -50775 -30001 -11990 -172967 -76056 442087 1502 96576 -21822 176514 -247771
13129 88461 324227 -162563 19439 25032 113652 60914 111629 -204625 -211539 -189854 34825
13117 89848 -131350 55198 188984 33740 230804 77772 -216424 194012 38886 -293982
13106 321990 -55407 248610 95433 -30584 150013 49301 -1291 -233918 -77017 355188 374085
$$ packed form
13184A08298b4950j0721A95472c8222B31588b68643C98587j69565p9742M1812
13174A91092K2608r4404N4585a99021A38863J01057J8294B8689J89849a41780
13163I3599J86592C7410a89071C50485E2725a41617A86187E3227c6707k4738K698
13152e8747A87448E2079a00298A70248m9937a30130a1666B93639c6072C53377
13141A13453e0775K0774a1990j60977g6056D42087A502R5074b1822A76514b47771
13129H8461K35766a62563A9439N593Q8620n2738N0715b04625o914K1685C4825
13117H9848a31350E5198J33786C3740J97064G7772b16424A94012C8886b93982
13106C21990e5407B48610I5433c0584A50013D9301a291k32627g7017C55188J8897
$$ plain form
13095 374085 221439 107107 -239245 -280308 -37657 150162 181333 189670 96503 141372 19426
13083 112982 -111622 391717 133443 -71898 -35322 352123 -83207 240872 -135463 -197609
13073 -197609 211292 29871 -153355 122970 27447 31821 466363 267673 -8329 185329 16947
13061 250938 96088 -92166 125489 -174685 17030 332548 247328 -245240 -114300 209644
13050 133098 210139 -12758 220980 288555 259238 235758 9539 -247338 -39085 143878 199544
13039 199544 280946 126265 76401 20473 107055 -125092 -4201 -96011 -97929 -228846 86361
13027 19729 -18299 267447 -79977 158931 342156 270233 83433 33345 205770 147508 191241
13016 191241 291770 96768 404022 10005 151665 123867 384430 442553 214455 -14424
$$ packed form
13095C74085j52646A07107b39245m1063c7657A50162L1171Q337r3167M4869A9426
13083A12982a11622C91717A33443g1898c5322C52123h3207B40872a35463o2146
13073a97609B11292B9871a53355A22970B7447M374M34542j98690h329A85329A6947
13061B50938I6088i2166A25489a74685A7030L15518q5220b45240a14300B09644
13050A33098P7041a2758B20980O7575k9317k3480I539b47338c9085A43878N5666
13039A99544Q1402A26265m9864B0473Q6582a25092d201r1810j918j30917H6361
13027A9729a8299B67447g9977A58931J83225p1923H3433C3345J72425n8262M3733
13016A91241J00529I6768L07254A0005J41660k7798K60563N8123B14455a4424
$$ plain form
13005 167696 76305 57738 312642 -7819 279396 31790 -332295 130461 246334 -36885 114695
12993 83600 33599 55394 192791 -41033 -94964 -156515 345297 -4888 155843 72420 93431
12982 93431 215441 105449 269493 -21622 243459 -1472 346818 210935 266874 236187 232416
12971 232416 53529 -32072 344690 -36749 181212 71062 257943 281232 218410 -27302 -133381
12960 -133381 350587 -34473 28164 110138 -150176 -177978 -45238 -132550 -38943 -238760 378906
12948 9252 -167696 70853 6094 -141071 65037 -184918 195730 169183 131422 -11961 14856
12936 -320896 -119755 984 -55155 85756 4688 138935 9418 34208 35550 -8348 -69919 -285849
12924 -285849 -307527 24534 -8553 38926 150078 147385 -38561 -69991 -261076 152928 -195868
$$ packed form
13005A67696G6305j8567K54904g819B79396C1790c32295A30461J15873c6885A14695
12993H3600C3599K1795J37397d1033n3931o1551C45297d888A55843G2420K1011
12982I3431J22010A05449J64044b1622B43459a472C46818j35883N5939l0687l771
12971B32416E3529c2072C44690c6749A81212G1062J86881K3289o2822b7302j06079
12960a33381C50587c4473B8164Q1974a50176k7802d5238q7312c8943j99817C78906
12948I252a67696G0853F094a41071F5037a84918A95730k6547l7761a1961A4856
12936c20896a19755I84e5155H5756D688J34247I418K4790J342h348o1571k15930
12924b85849k1678B4534h553C8926J11152k693c8561l1430j91085A52928a95868
$$ plain form
12912 -169103 -82717 -106447 -170495 -14172 -71129 155268 263869 181330 -161262 -24406 -39990
12901 -39990 303015 327007 129833 98043 38455 -120631 163363 -167281 18635 79081 -102874
12889 -269234 -52006 219967 75377 -195752 -95128 400848 -337017 182545 2830 222263
12879 222263 -28025 7036 -181805 121932 15261 -94680 -193359 -68670 -61983 25089 -7568 228224
12866 113105 -262240 -119989 309426 -41221 -63581 -124940 43629 245527 -149610 9250 -269063
12854 337465 -29169 42437 -19172 -19332 -197534 2897 -252411 -59196 -212036 -33006 -32267 306430
12841 -75303 288231 -198939 58976 47157 204590 18378 16971 6909 142898 46111 -49175
12829 148499 61689 114032 8984 -316961 -86733 428503 181987 12511 -28483 -106573 209337
$$ packed form
12912a69103h2717k3730o4048a4172n6957A55268J08601q2539a61262b4406j5584
12901c9990C03015K3992A29833l1790C8455a20631A63363a67281A8635O0446a02874
12889b69234e2006B19967G5377a95752i5128D00848c37017A82545B830K19433
12879B22263b8025G036a81805A21932A5261i4680r8679f8670O687B5089g568B28224
12866A13105b62240a19989C09426d1221k2360o1359D3629K01898a49610I250b69063
12854C37465b9169D2437a9172j60j78202B897b52411e9196j52840c3006P39C06430
12841g5303B88231a98939E8976j1819J57433A8378j407F909J35989D6111d9175
12829A48499F1689N2343H984c16961h6733D28503A81987A2511b8483p8090B09337
$$ plain form
12817 -145031 -116766 117787 -302891 71824 10718 14508 58985 -55041 -30985 -231026 -349648
12806 -349648 46347 -8211 -186946 117453 38107 -249544 81081 128491 11921 596109 -297462
12794 -89426 -109585 246391 -254261 358866 -163477 -20731 15256 -128085 -32590 50630 -117400
12782 35893 -135505 -29970 -226001 1563 -80996 166227 -28827 -76239 -3306 -82034 410136
12770 199158 -23765 189329 26004 166212 230003 22512 399234 -25506 18786 -447022 -120582
12758 190015 181689 -111041 127051 225923 -211944 -338181 -66619 153569 169877 295394
12748 295394 123412 99526 -103105 -262281 253932 -168911 49423 -104834 83053 18997
12737 60366 -6523 324170 281261 85303 110404 176017 -104239 33869 95651 157042 116514
$$ packed form
12817a45031K8265A17787c02891G1824A0718L790M4477e5041K4056k00041j18622
12806c49648D6347h211j78735A17453C8107b49544H1081M7410A1921N84188b97462
12794h9426k0159B46391b54261C58866a63477b0731A5256a28085c2590E0630a17400
12782C5893a35505b9970j96031A563h0996A66227b8827m7412c306p8728D10136
12770A99158b3765A89329B6004J40208O3791B2512L76722b5506A8786d47022a20582
12758A90015q326a11041A27051R8872b11944j26237f6619A53569J6308J25517
12748B95394A23412k3886a03105j59176B53932a68911D9423a04834H3053A8997
12737F0366f523C24170m2909H5303K5101O5613a04239C3869O1782O1391m0528
$$ plain form
12726 116514 1735 -301573 117365 -72227 46762 -346 138202 145826 22330 112905 -323600
12714 45382 190451 213475 -78585 202571 198097 -290679 -90107 110446 -17846 -309923 -86735
12702 226625 185611 110622 -57061 -207656 -91195 -143918 152531 -299318 81511 -28517 -114768
12691 -114768 22172 202863 144485 102936 -49202 -10338 -134435 -69291 321425 197692 -118207
12679 75772 -441682 153761 302297 -162706 -54873 -257160 61213 15735 -6948 -90604 -151858
12668 -151858 -214713 131918 234835 -85366 -77769 61036 19828 -39733 109356 18150 -64876
12656 -331786 174687 58586 139901 160550 35617 -1984 -31509 23571 -88303 238118 263268
12645 263268 -164030 -108570 52353 -298579 191478 105230 -52981 -263248 -100783 -75277
$$ packed form
12726A16514A735c01573A17365g2227D6762c46A38202P624B2330R0575c23600
12714D5382J45069K3024g8585B02571m474b90679i0107A10446a7846k92077h6735
12702B26625m1014p4989e7061j50595i1195n2723A52531b99318H1511b8517q6251
12691a14768B2172J80691n8378m1549d9202a0338j24097O5144C21425j23733a18207
12679G5772d41682A53761J48536a62706e4873k02287F1213A5735f948q3656o1254
12668a51858o2855A31918J02917h5366P597F1036A9828c9733A09356A8150f4876
12656c31786A74687E8586Q1315K0649C5617a984k9525B3571h8303B38118K5150
12645B63268a64030N5460E2353b98579A91478q6248e2981k10267a00783K5506
$$ plain form
12635 -75277 -35241 204704 83806 63973 305040 -12 -20299 302390 184831 181207 -287161
12623 -125546 168505 25454 -100011 -121936 65260 312762 -284993 142293 8990 139279
12613 139279 261413 50379 182897 -215606 116069 -117308 295197 9235 492521 209725
12602 -85751 -57774 -248529 445511 -34331 117220 -130510 -77457 -102440 246627 130418
12592 130418 46747 -90662 217824 -134102 101172 -140568 83435 178318 -97256 -272165
12582 -272165 35382 111109 -99021 -291841 121584 215327 293069 22701 59589 37908 -91478
12570 -58575 159423 109106 -122441 11832 38478 6352 -102614 186272 -116735 138064 271528
12559 271528 38796 38504 -192412 202645 -437885 7370 -96333 215662 176858 -37468 -151556
$$ packed form
12635g5277c5241B04704H3806j9833K41067a2k0287C02390j17559l624b87161
12623a25546A68505B5454a00011k1925F5260K47502b84993A42293H990J30289
12613A39279J22134E0379J32518b15606A16069a17308B95197I235M83286B09725
12602h5751K7977j90755D45511c4331A17220a30510N3053k4983B46627j16209
12592A30418D6747i0662B17824a34102A01172a40568H3435R4883i7256j74909
12582b72165C5382P5727i9021j92820A21584R3743P7742B2701L6888k1681i1478
12570e8575A59423n0317a22441A1832K6646F352a02614A86272a16735A38064J33464
12559B71528C8796k92a92412B02645d37885G370i6333B15662l8804c7468j14088
$$ plain form
12548 -151556 18261 289156 -271526 166626 -148939 101607 123892 -165921 -223667 130346
12537 -100861 99087 -5784 232581 -75252 -13480 -60165 310534 -84636 30932 -102574 -172019
12526 -172019 -159503 96186 286499 93431 -334664 -246015 -97959 -275042 24121 78771 -312543
12514 -102616 -86511 121406 85996 89232 -207140 -253820 28633 155161 285440 61825 65565
12503 65565 17580 -130188 -237747 86015 136583 -167057 -37088 1223 60887 -130686 -1642
12491 -186008 268033 3811 27466 302366 17184 370225 41408 154611 -35962 -86406 -303483
12480 -303483 -15515 108774 -344745 277988 20241 16711 -107027 -324553 273901 121039
12469 -22220 133454 10383 31418 251876 -268052 199790 -149413 -144817 -49694 -121852 302212
$$ packed form
12548a51556A8261K70895b71526A66626a48939A01607K2285a65921n7746A30346
12537a00861I9087e784B32581g5252a3480m6685C10534h4636C0932a02574o9445
12526a72019J2516I6186J90313I3431c34664Q8649i7959j77083B4121N4650c12543
12514a02616J6105A21406l5410L236b07140m6680B8633J26528J30279F1825L740
12503F5565A7580a30188j07559H6015N0568a67057c7088A223N9664a30686a642
12491a86008B68033C811K3655K74900A7184L53041D1408J13203c5962n0444k17077
12480c03483a5515A08774c44745B77988B0241l530a07027k17526B73901A21039
12469b2220A33454A0383K1035K20458b68052A99790a49413M596d9694p2158C02212
$$ plain form
12457 213144 -154463 234008 -86472 -225534 -236891 32474 53728 148297 6503 -10200 -119618
12446 -119618 -11857 139629 -199165 21239 140247 -78630 77719 38970 -263442 428172
12435 -139746 -165960 -196607 392310 -274846 -28391 -256834 306276 8365 107878 131135 38835
12423 -111913 176574 -320345 238132 -340047 67909 242957 205710 -63939 -203186 31463
12412 -22076 -327050 181418 279596 137671 -118987 173141 -146986 -308938 -343693 196972
12401 53584 171336 20578 149372 278410 -112902 -201877 266555 -35177 285356 -216286
12390 97284 171363 -46405 -110711 187214 172255 179794 15884 -239358 130939 218461 -43136
12378 -337012 -43254 -31602 167975 -238441 91603 -83193 -160207 -121135 291841 -5689 -357831
$$ packed form
12457B13144a54463B34008h6472j39062j1357C2474K1254R4569F503a0200j09418
12446a19618a1857A39629a99165B1239J19008g8630G7719l8749b63442D28172
12435a39746k6214l0647C92310b74846b8391k28443C06276H365R9513K3257C8835
12423a11913A76574c20345B38132c40047F7909J75048l7247f3939j39247C1463
12412b2076l04974A81418R8178A37671a18987A73141a46986j61952l4755A96972
12401E3584J17752B0578J28794J29038a12902q8975B66555c5177B85356b16286
12390I7284P4079d6405o4306A87214j4959P539A5884b39358A30939Q7522d3136
12378c37012d3254J1652A67975b38441I1603h3193p7014L9072B91841e689l52142
$$ plain form
12367 -357831 -237603 -274592 67921 -117886 -15577 5395 -18452 -35835 176591 212136 -34112
12355 149307 71286 -23142 -83992 62122 -24070 78468 47716 256096 -53894 234486 186156
12344 186156 30909 -345323 -205123 -287742 2399 -343727 -189587 139253 164484 -97268 209050
12332 72918 -132237 -213232 -701 164944 310717 71031 208147 67321 105557 -129248 -238140
12321 -238140 122261 -30059 -144015 417459 108038 -10962 25041 296840 94981 377295
12311 377295 -14475 -24465 179763 -15112 -5502 -181597 40112 -193702 82980 -114498 246340
12299 -26945 -35268 -48929 23163 -77877 229042 -91750 73857 71464 -5241 245739 -18309 203473
12286 5204 135825 -73112 22465 195842 141655 49333 128340 233819 177447 -57011 198164
$$ packed form
12367c57831J20228l6989F7921a17886a5577E395a8452j7383A76591L5545c4112
12355A49307G1286b3142o0850F2122b4070G8468l0752K08380e3894B34486m8330
12344A86156C0909c45323J40200q2619B399c43727J54140A39253K5231i7268B09050
12332G2918a32237q0995g01A64944J45773G1031J37116F7321L8236a29248j08892
12321b38140A22261c0059j13956D17459A08038a0962B5041K71799I4981K82314
12311C77295a4475r990A79763a5112e502j76095D0112a93702H2980a14498B46340
12299b6945q323j3661B3163g7877B29042i1750G3857k393e241B45739a8309B03473
12286E204J30621g3112B2465J73377n4187D9333P9007J05479n6372e7011A98164
$$ plain form
12274 143923 -87695 87095 341037 204076 126578 290000 139837 173569 263872 143462
12264 143462 30088 -73195 -108365 148996 98044 75037 -60130 91368 -345718 90533 35138
12252 67735 -142887 252927 30989 75667 142496 -206568 -32793 123223 -7139 181182 41762
12240 -82465 42336 -57780 -23585 -82257 92768 18480 242883 66404 190002 64813 39820
12229 39820 190169 132143 -205675 276699 98351 303158 125211 102300 260659 -47307
12218 53072 -60451 124712 -179819 28908 145456 86676 -152456 -20260 -1106 107413 218464
12207 218464 59823 -210131 -83458 343589 -41181 43429 -110360 218488 17483 -78743 350624
12195 89320 -101179 206207 334020 155069 -5897 159565 294587 392058 154534 70210
$$ packed form
12274A43923h7695H7095K53942j36961p7498J63422A39837L3732R0303j20410
12264A43462C0088g3195l5170A48996n0952k3007f0130I1368c45718I0533C5138
12252F7735a42887B52927C0989M4678O6829b06568c2793A23223g139A81182D1762
12240h2465D2336e7780b3585n8672I2768A8480K24403F6404J23598F4813k4993
12229C9820J50349n8026b05675B76699I8351K04807A25211k2911J58359d7307
12218E3072f0451A24712a79819B8908J16548n8780a52456b0260a106A07413J11051
12207B18464E9823b10131h3458C43589d1181D3429a10360B18488A7483g8743C50624
12195H9320a01179B06207J27813A55069e897A59565J35022R7471A54534G0210
$$ plain form
12184 126543 221585 32611 77829 423742 79084 41227 299005 100071 -421037 70088 170977
12173 170977 9400 -42970 31988 79340 72741 171076 73261 -150388 -50318 17173 27643 358698
12161 358698 183637 120832 243398 181848 104360 -68869 127517 92991 277062 69528 -158946
12149 -37062 182465 428027 190440 11826 -1320 32871 240749 63200 352901 28559 -84652
12137 136167 -135175 154378 106887 232340 165952 -32803 70296 450664 181162 243667
12127 243667 157221 243635 -71862 136042 -64632 5977 -67521 3820 98451 78708 -349314
12115 48809 162699 -2904 -275725 -27392 -110744 35468 -49159 195541 65599 -194731 -108471
12104 -108471 -118166 -44192 67043 144610 233448 78411 -1758 7721 -402811 -267052 -274410 -8758
$$ packed form
12184A26543R5042C2611M5218L45913G9084l7857K57778A00071d21037G0088J00889
12173A70977I400d2970C1988M7352o599R8335G3261a50388e0318A7173J0470L31055
12161C58698j75061o2805J22566o1550p7488f8869A27517l4526J84071F9528a58946
12149c7062A82465K45562A90440A1826a320C2871K07878F3200K89701B8559h4652
12137A36167a35175A54378m7491J25453o6388c2803G0296L80368A81162O2505
12127B43667q6446Q6414g1862A36042f4632E977f7521C820R4631j9743c49314
12115D8809J13890b904k72821b7392q3352C5468d9159A95541F5599a94731Q6260
12104a08471r695d4192F7043P7567Q8838G8411a758G721d02811J35759p358h758
$$ plain form
12091 -53629 -75592 -48249 -105245 -26041 -144589 124787 24076 61679 4685 -343355 -261476
12080 -261476 -41641 126638 -6923 -153414 -303258 59189 246214 78491 182347 59064 195855
12069 195855 163622 256659 339159 -408172 124057 -206660 345999 -40396 181126 55065
12058 236309 -240388 54517 86579 -230863 -259396 229757 -166100 163171 139372 46827
12047 -29079 -917 -91631 -192390 -19617 -49987 23030 189443 -172713 -72012 183853 -38114
12035 -38155 270763 -42065 -243993 233118 175686 -94238 192517 -120291 -112688 -263940 -208831
12024 -208831 -71521 22597 -87766 55669 54935 135577 2443 32359 47237 51883 94949 -50359
12011 235289 109777 -115279 -200139 78312 -41805 -333526 -34049 158469 -20649 -123088
$$ packed form
12091e3629k1963K7343n6996b6041j18548A24787B4076L7603D685c43355Q1879
12080b61476d1641A26638f923j46491j49844E9189J87025G8491J03856E9064J36791
12069A95855l2233R3037Q2500d08172A24057b06660C45999d0396A81126E5065
12058B36309b40388E4517L2062b30863k8533B29757a66100A63171k3799D6827
12047b9079i17r0714j00759a9617l0370B3030J66413a72713g2012A83853c8114
12035c8155B70763d2065k01928B33118n7432i4238A92517a20291P603j51252N5109
12024b08831g1521B2597h7766E5669p34Q0642B443K9916J4878M646M3066e0359
12011B35289A09777a15279q4860G8312d1805k91721c4049A58469b0649j02439
$$ plain form
12001 -123088 -254458 -95234 -331219 12386 -82829 -106852 -45884 -154194 -104083 168493 -20665
11989 58842 25276 -150343 232781 297759 -103179 33039 98449 -153627 -28818 -213078 -32159
11977 -31005 -3108 -93503 -244194 278578 284786 -175675 -183953 265940 -8907 -126547 59565
11965 84614 78385 -80437 -62709 -28280 -129561 -187023 -16396 234466 -71967 400486 36361
11953 163347 31629 -52923 180982 15803 -44820 107279 188388 -57148 -168908 138661 192146
11942 192146 125770 -196775 226305 153003 87656 24425 79824 -117136 219845 -138076
11931 60262 -188717 -17156 -190655 -83846 230578 -55276 -22732 -167295 -181853 5888 21560
11920 21560 256 164354 -175937 174079 48510 -173830 123012 -176910 120326 -274149
$$ packed form
12001a23088j31370i5234k35985A2386h2829k4023d5884j08310N0111A68493b0665
11989E8842B5276a50343B32781O4978a03179C3039O5410a53627b8818j84260c2159
11977c1005c108r0395j50691B78578O208a75675q278B65940h907j17640E9565
11965H4614o229h0437J7728b8280j01281n7462a6396B34466g1967D00486C6361
11953A63347C1629e2923A80982A5803d4820A07279Q1109e7148j11760A38661N3485
11942A92146o6376a96775B26305p3302o5347B4425N5399a17136B19845a38076
11931F0262a88717a7156j73499h3846B30578e5276b2732j44563j4558E888J5672
11920B1560B56J64098a75937A74079D8510a73830A23012a76910A20326b74149
$$ plain form
11909 -296580 -255968 98347 236031 325775 -31426 -50736 226852 -31337 -94103 29411 -99118
11897 -65981 59378 77657 129980 -137814 -136093 -394813 -110748 184889 -288553 82401 -13425
11885 -350182 -212275 -93396 -8394 -187409 -58899 -327289 38241 -237735 -214509 -190345 -5808
11873 72554 -33820 147429 339398 -48738 9466 -186543 15489 -21807 -37413 -7672 -27859
11862 -27859 -94863 -291363 63724 -176129 -139513 -170691 -108838 -483038 10236 64449 161821
11851 161821 -47083 28855 26139 -64790 49826 -405399 -236574 -86566 -254248 303667 36593
11839 47958 84113 70117 -25173 98864 158464 47505 -35562 -29783 64509 23199 -150054 -197712
11827 -197712 -71923 -189727 219982 -120448 -425571 -94155 -48588 -148540 240227 114892
$$ packed form
11909b96580M0612I8347J37684Q9744c1426j9310B26852c1337o2766B9411i9118
11897f5981E9378J8279N2323a37814J721k58720a10748A84889b88553H2401a3425
11885c50182J37907i3396h394j79015e8899k68390C8241b37735K3226K4164e808
11873G2554c3820A47429J91969d8738I466a86543A5489b1807j5606g672k0187
11862b7859o7004j96500F3724a76129L6616l1178O1853l74200A0236N4213R7372
11851A61821d7083B8855k716f4790D9826d05399J68825h6566j67682C03667C6593
11839D7958L6155j3996b5173I8864N9600D7505c5562N779F4509B3199a50054m7658
11827a97712g1923j17804B19982a20448l05123i4155M5567r9952B40227A14892
$$ plain form
11816 54825 -308964 18359 -45386 31949 576538 -351554 41381 -218315 -290969 -95205 -112590
11805 -112590 231543 264179 -102081 57868 39734 449737 -114940 146082 -127863 97133
11794 -421193 -229507 -150981 -157665 -270520 178516 50903 -282585 -161660 -190699 -79072 -182729
11783 -182729 -165668 5509 77916 195112 -446564 10794 -238126 275270 32805 112748 -96403
11771 -193952 141472 59318 48276 -375583 -189214 -126877 -67750 -92650 127871 41327 24274
11760 24274 7323 16652 100516 65610 -58772 -264446 240228 -192542 10423 554926 167146
11748 67965 -59896 13874 -45248 54049 -276339 29420 319416 -45300 -335209 -60597 81872
11736 -282453 2435 -268336 4496 -176730 -283222 -122369 -78513 -123979 117372 227636 100269
$$ packed form
11816E4825c08964A8359d5386C1949N44589c51554D1381b18315p2654i5205j7385
11805a12590B31543L2636a02081E7868j8134M10003a14940A46082a27863I7133
11794d21193J91686P8526o684j12855A78516E0903b82585J20925k9039g9072j03657
11783a82729J7061E509P2407J17196d46564A0794b38126B75270C2805P9943i6403
11771a93952A41472E9318j1042c75583J86369O2337N9127k4900A27871D1327j7053
11760B4274G323R329Q3864l4906e8772k05674B40228a92542A0423N44503A67146
11748F7965e9896A3874d5248E4049b76339B9420K89996d5300k89909f0597H1872
11736b82453B435b68336D496a76730j06492a22369M3856m5466A17372J10264A00269
$$ plain form
11724 344083 -101729 36264 -100384 -94262 134803 20236 -274322 -71672 112771 134130 -133434
11712 83941 28781 -8355 -132783 64571 -167988 -36085 -91712 -32242 -35818 -82332 99096 -84120
11699 -174876 158050 -2469 245313 -223987 52504 -119836 214641 -427775 171492 160966
11689 160966 -200846 -44365 186613 132605 -127987 -32013 -71774 28132 -172842 -32380 92686
11677 -73731 46912 198186 -37476 -7657 -135230 255834 -33176 32103 -355489 -80696 -61159
11666 -61159 -282508 -86012 85699 -121631 -17686 -32261 -120038 59201 213923 -91697 -58907
11655 -58907 -163409 -124850 73744 -343925 260454 297607 15363 -278320 60134 172475 292665
11644 292665 244408 -101677 145186 -263717 -10733 240780 69840 -244892 -2597 91257 119733
$$ packed form
11724C44083a01729C6264a00384O122A34803B0236b74322g1672A12771K1359a33434
11712H3941B8781h355j24428F4571a67988c6085n5627c2242l576m6514I9096h4120
11699a74876A58050b469B45313b23987E2504a19836B14641d27775A71492j0526
11689A60966b00846d4365A86613n4008a27987c2013l9761B8132a72842c2380I2686
11677g3731D6912J51274c7476g657j27573B55834c3176C2103c55489h0696J9537
11666f1159k21349h6012H5699a21631a7686j4575q7777E9201J54722i1697L2790
11655e8907j04502L8559G3744c43925B60454L7153A5363b78320F0134J12341J20190
11644B92665m8257a01677A45186b63717a0733B40780F9840b44892b597I1257K8476
$$ plain form
11633 119733 -42823 241216 162141 -41120 -154704 -404007 -101345 -119692 181660 571547
11623 571547 -72819 -230686 224996 99104 26820 -141316 -94094 90024 100704 -147585 192401
11611 108348 -250267 104421 -262560 -1250 -192925 216876 170576 -102807 200785 -78569
11600 70306 306057 133566 -141618 -101569 -47089 259094 66360 -105499 -21533 50137 67331
11589 67331 -111883 -74489 144454 197131 66294 22361 251484 -16163 48157 163640 -287773
11577 5164 26444 336263 -69163 88601 57157 -32004 221694 -123236 -267126 -235500 328673
11565 274090 284260 -156209 1656 71900 -52644 123436 342923 5716 114268 -62843 14618
11553 68666 116321 155082 -213322 -79012 -84150 65219 -233169 -93856 -61890 227969 43849
$$ packed form
11633A19733d2823B41216p9075d1120j13584k49303a01345j8347A81660L89887
11623E71547g2819j57867B24996I9104B6820a41316M7222I0024J0680a47585A92401
11611A08348b50267A04421b62560a250j91675B16876m6300a02807B00785g8569
11600G0306K35751A33566a41618M0049d7089B59094F6360a05499b1533E0137J7194
11589F7331a11883L7394A44454N2677F6294B2361K29123a6163D8157J15483b87773
11577E164K1280L09819f9163H8601l1444c2004B21694a23236j43890L1626C28673
11565B74090J0170a56209A656P0244e2644A23436K19487E716J08552f2843A4618
11553F8666M7655L8761b13322g9012n138F5219b33169i3856L1966B27969D3849
$$ plain form
11541 -14134 110464 -106394 -228014 284359 163374 -97883 235882 -79391 5412 -101435
11530 520963 205807 238057 55700 168294 366909 305114 283356 -253314 337331 -6099 -67963
11519 -67963 -45844 92075 70943 -99811 52800 185748 55682 -105674 250817 78344 95330
11508 95330 -112962 -145609 47174 88355 43473 -207987 238232 -7431 52824 -163521 -190588
11497 -190588 236037 -1659 127280 -29271 50180 95414 118721 -12172 163176 196963 213566
11486 213566 330605 402628 -37385 115758 -34140 27114 -810 108189 427476 3898 100210
11475 100210 97471 332451 172923 -68540 427631 85104 171698 201447 222592 -135877 -183160
11464 -183160 -189263 51343 -47484 72625 133443 15968 -192539 32654 3967 -54316 -221347
$$ packed form
11541a4134A10464a06394j21620B84359j20985i7883B35882g9391E412a01435
11530E20963B05807L2250E5700J12594J98615o1795k1758b53314C37331f099o1864
11519f7963K2119I2075k1132i9811E2800J32948E5682a05674B50817G8344J6986
11508I5330a12962l2647D7174M1181D3473b07987B38232g431E2824a63521k7067
11497a90588B36037a659A27280b9271E0180M5234K3307a2172A63176L3787J6603
11486B13566J17039P2023c7385A15758c4140B7114h10A08189L19287C898R6312
11475A00210k739K34980j59528f8540D27631H5104Q6594K9749K1145a35877m7283
11464a83160o103E1343d7484G2625O0818A5968a92539C2654C967e4316j67031
$$ plain form
11453 -221347 168823 -38794 117891 -190353 260245 2040 55482 -142787 -58214 -246614
11443 -246614 284335 97859 39707 -90050 -82381 252443 -65590 24230 68886 -132516 -43714
11431 168527 -229659 -145693 232276 380151 -275316 50677 271189 -172033 -146706 305574
11420 230196 -327327 257115 118011 -5091 -11590 -762 -62265 -151067 128170 -319328 -95251
11408 -67260 38613 206676 46368 -120133 29068 -81511 -186710 -207535 -79569 -113055 47785
11396 175323 435067 -368 194208 43599 140122 193776 -363695 113528 -294600 -224033 158698
11384 -175911 35673 -40979 168534 225675 82106 -317779 -152009 64353 -63784 -121118 -131723
11373 -131723 -32151 439902 199253 97372 -176869 34147 -102192 -118644 -221563 237369
$$ packed form
11453b21347A68823c8794A17891a90353B60245B040N3442a42787e8214j88400
11443b46614B84335I7859C9707i0050P669B52443f5590B4230M4656a32516d3714
11431A68527b29659Q3966B32276J47875b75316E0677K20512a72033K5327C05574
11420B30196c27327B57115A18011e091o499g62o1503q8802A28170c19328i5251
11408f7260C8613J68063D6368a20133B9068h1511j05199k0825g9569l3486D7785
11396A75323K59744c68A94208D3599R6523N3654c63695A13528b94600P0567A58698
11384a75911C5673d0979A68534N7141H2106c17779a52009F4353f3784n7334j0605
11373a31723c2151D39902A99253I7372a76869C4147a02192j6452j02919B37369
$$ plain form
11362 19396 -146839 214459 -53004 -52564 50718 160206 -90645 -14063 -325028 -40573 64642
11350 -27356 7465 10177 31227 139016 140008 -141952 -1007 72454 -43743 70578 239185 -183441
11337 2802 111647 -87333 359409 -63327 539913 -149686 -468196 -354075 -181167 -144669
11327 -144669 -35538 -75002 -243375 756 -4159 166818 -288573 -156934 40408 -78279 123982
11315 -63448 -178969 -330669 -89077 5464 218805 163506 256281 161856 -101877 67424 -112574
11303 -329213 129741 101151 -399556 -82945 146850 -12951 -160498 -10306 -217886 4642 89255
11292 89255 -57907 27723 221140 127028 52415 -231355 -51422 39467 -92582 170672 53137
11280 143814 -387422 -175103 -34116 89088 -25772 267172 -141761 153361 -45412 -70380
$$ packed form
11362A9396a46839B14459e3004M40E0718J09488i0645a4063l10965d0573F4642
11350b7356G465K712K1050J07789R92a41952a007G2454d3743G0578J68607a83441
11337B802J08845h7333C59409f3327E39913a49686l18510J14121J72908L6498
11327a44669c5538l9464j68373G56d159A66818b88573J31639D0408g8279A23982
11315f3448j15521j51700h9077E464K13341n5299R2775r4425a01877F7424a12574
11303c29213A29741k8590c99556h2945A46850a2951j47547a0306k07580D642Q4613
11292H9255e7907B7723J93417r4112E2415b31355e1422C9467i2582A70672E3137
11280A43814c87422a75103c4116H9088b5772B67172a41761A53361d5412k4968
$$ plain form
11270 -70380 69624 -15866 12299 -128013 -134043 -81951 -80037 -118388 -279828 -137099 -187348
11259 -187348 76266 -164576 -160499 102621 4980 311611 -64617 -196306 75559 -432218 38247
11247 65252 -6736 -181427 5633 -68521 -278546 -126419 104592 126119 -25423 265269 88100
11235 190501 -195171 21402 -321379 -108450 -176920 -193381 -14156 -79589 11320 135789 -148986
11223 51645 -138162 -212435 -161182 -21244 -225120 161120 324363 -29188 -335323 -65672 -259123
11212 -259123 -144613 163189 97034 153842 -281861 -87458 -128774 -247462 291878 76009
11201 55542 -124823 -22107 3040 -100777 112421 50593 -57778 -215623 188662 -243993 -211771
11190 -211771 -129118 -323178 136432 -33926 -33682 62342 -209250 295563 43401 -83761 113064
$$ packed form
11270g0380F9624a5866A2299a28013o030N2092J914l8351j61440a37099n0249
11259a87348G6266a64576M077A02621D980L06631f4617j31689G5559d32218C8247
11247F5252f736j74691E633f8521k10025a26419A04592K1527b5423B65269H8100
11235A90501a95171B1402c21379a08450o8470j6461a4156o5433A1320J24469a48986
11223E1645a38162p4273N1253b1244k03876A61120J63243b9188l06135f5672j93451
11212b59123J14510A63189o6155N6808b81861h7458m1316j18688B91878G6009
11201E5542a24823b2107C040a00777A12421E0593e7778j57845A88662b43993L2222
11190b11771Q2653j94060A36432c3926K44F2342b09250B95563D3401h3761A13064
$$ plain form
11178 -133017 -83419 -150523 118791 -276408 -123734 221715 -70510 -19903 -556345 -93140
11167 -59443 -38409 -95015 -189921 -245919 -52321 143652 -165036 344613 29880 -549333 -126826
11155 -108930 -105527 44641 50640 -152809 -254416 -121270 45386 -44412 -55850 352803 72629
11143 -127033 270950 111333 -104899 -92089 -300146 111941 -44427 52321 6687 126662
11133 126662 28656 123169 -236994 129065 481941 33422 -49154 -306825 148989 83629
11123 83629 -356305 130138 127670 17337 -9922 336446 57389 107972 -267267 -58373 200664
11111 169983 -265630 26779 141868 38484 64682 -35927 -100832 -121242 429921 131493 95381
11100 95381 176039 134879 215272 105954 117383 212039 -155116 81714 326748 -157590 29634
$$ packed form
11178a33017M9598o7104A18791b76408a23734B21715g0510a9903n36442i3140
11167e9443K1034n6606r4906n5998e2321A43652a65036C44613B9880e49333a26826
11155a08930L403D4641N999a52809j01607a21270D5386d4412j1438C52803G2629
11143a27033B70950A11333a04899J2810k08057A11941d4427E2321F687J19975
11133A26662B8656R4513b36994A29065L52876C3422d9154k57671A48989o5360
11123H3629c56305A30138k468A7337i922C36446E7389N0583b67267e8373B00664
11111A69983b65630B6779J15089C8484K6198c5927o4905k0410D29921A31493l6112
11100I5381Q0658m1160Q0393A05954J1429R4656a55116H1714K45034a57590B9634
$$ plain form
11088 33204 210967 -45569 -45279 -66193 50096 -9811 -274601 188442 -346200 -3672 -17407 -13470
11076 -13470 -71395 124341 -328300 15194 292020 169253 190601 110258 -162853 120463
11065 138749 415314 213903 160800 354278 -207914 474497 193979 556458 -43561 279407
11054 312305 440788 127583 317004 358414 296464 256994 548996 224209 490663 374443
11044 374443 631053 585860 427469 509742 290584 475893 394956 269786 515635 325435
11034 325435 366494 373652 747767 261934 546481 495326 58101 421578 518958 326949 341430
11023 341430 427330 428839 364094 733057 354115 683626 708215 516582 230975 208920 324393
11012 324393 333779 413831 380034 280466 -26032 451862 580076 376787 440874 83699 376252
$$ packed form
11088C3204J77763d5569K90k0914E0096i811k64790A88442c46200c672j3735L937
11076a3470n7925A24341c28300A5194K76826j22767K1348q0343a62853A20463
11065A38749K76565k01411n3103J93478b07914D74497A93979L62479d3561B79407
11054C12305J28483A27583J89421M1410o1950l9470K92002B24209K66454j16220
11044C74443K56610m5193j58391Q2273k19158J85309q0937j25170K45849j90200
11034C25435M1059P158L74115B61934K84547n1155E8101L63477R7380j92009J4481
11023C41430Q5900J509o4745L68963C54115L29511K4589j91633B30975k2055J15473
11012C24393R386Q0052l3797r9568b6032D51862J28214k03289O4087H3699K92553
$$ plain form
11001 376252 245302 429027 253419 480729 364234 211845 582349 386206 298940 359080
10991 359080 647234 30235 302238 327278 459852 325251 634827 532427 521225 489227
10981 489227 569570 680121 728954 610510 955291 876574 632169 859850 774374 1142752
10971 1142752 1678303 1223299 1212670 1640972 1632519 1753458 1744738 1370046 1517449 1430269
10961 1430269 1403025 1313115 988288 975977 800699 1297180 1351935 986798 932404 1064494
10951 1064494 1067043 1120046 866935 536074 684752 377913 484831 691392 196746 407981
10941 407981 405250 97719 85806 371619 76869 -165884 328989 -158359 -91338 61729 -52261
10929 279845 -3817 43536 170423 -160245 164331 -181998 -291928 -53354 136720 -3376 181317
$$ packed form
11001C76252j30950J83725j75608K27310j16495j52389L70504j96143q7266O0140
10991C59080K88154C0235K72003K5040J32574j34601L09576j02400j1202l1998
10981D89227Q0343J10551M8833j18444L44781p8717k44405K27681q5476L68378
10971A142752N35551m55004j0629M28302q453J20939q720l74692J47403q7180
10961A430269k7244q9910l24827j2311j75278M96481N4755l65137n4394J32090
10951A064494K549N3003k53111l30861J48678l06839J06918K06561A96746K11235
10941D07981k731I7719j1913K85813G6869a65884C28989a58359O7021F1729e2261
10929B79845c817D3536J26887a60245A64331a81998j09930e3354A36720c376A81317
$$ plain form
10917 386830 -220296 -2079 -491161 173596 -16057 -135726 92149 -86795 -141824 87559 -119857
10905 -387134 35784 -40329 -210468 168863 -130804 207821 92287 156055 232661 402220
10895 402220 -230479 63805 -224875 -5986 -125665 -204914 30959 -65211 -356285 159172 7968
10883 99784 -214449 170407 84806 233563 39123 98358 -425558 194710 156883 22033 -60556
10871 -22907 -31499 -202005 -169881 -175510 199128 -17499 184663 -68460 162073 130811 -298921
10859 -130730 -58812 162064 112196 -13511 244391 55256 110635 -82399 7113 -323060 -189698
10848 -189698 -147884 -222280 -66528 -155498 -275683 193176 -253943 30083 86482 68366 -171834
10836 172252 26651 141052 212594 -84276 -90975 -62405 -71785 288222 -172834 88716 63422
$$ packed form
10917C86830b20296b079m89082A73596a6057j19669I2149h6795n5029H7559a19857
10905c87134C5784d0329j70139A68863a30804B07821I2287O3768P6606J69559
10895D02220b30479F3805b24875e986j19679p9249C0959f5211k91074A59172G968
10883I9784b14449A70407H4806J48757C9123N9235d25558A94710l7827B2033f0556
10871b2907q592j70506L2124n629A99128a7499A84663f8460A62073l1262b98921
10859a30730e8812A62064m9868a3511B44391E5256N5379h2399G113c23060J33362
10848a89698M1814p4396f6528q8970j20185A93176b53943C0083N6399j8116a71834
10836A72252B6651J14401P1542h4276o699K8570r380B88222a72834H8716k5294
$$ plain form
10825 63422 29678 -279853 333478 36872 -98942 -79205 -157651 -35649 -87294 -78610 -205012
10814 -205012 296595 -96601 -187321 394735 -299903 114399 -17894 -342592 -318799 -22060
10803 -200627 53506 -138292 -27582 -99776 -189525 152187 -306118 -138531 -312905 221016
10792 416734 -194659 -215600 -111997 130334 -90781 -83255 -139279 -35421 271300 78953 195836
10781 195836 15197 -253740 144915 -103087 326864 14944 -80966 125502 -190730 57207
10770 129834 194158 163969 220379 -253858 -216522 746 -144091 -85956 -373171 12691 -373894
10758 -231443 -112990 -88783 -217449 34313 83037 -49515 -68306 68409 -106892 141885 -183834
10746 -306506 -70886 -191463 -183855 425951 -77741 -236448 -32768 -250814 -102485 100494
$$ packed form
10825F3422B9678b79853C33478C6872i8942J9737p8446c5649n1645Q684j26402
10814b05012B96595i6601r0720C94735b99903A14399a7894l24698K3793b2060
10803b00627E3506a38292b7582p2194q9749A52187c06118a38531j74374B21016
10792D16734a94659k0941J03603A30334i0781P526n6024c5421B71300G8953J16883
10781A95836A5197b53740A44915a03087C26864A4944h0966A25502a90730E7207
10770A29834O4324l0189N6410b53858L7336G46a44091N8135k87215A2691c73894
10758b31443a12990K4207j28666C4313M8724d9515j8791F8409a06892A41885a83834
10746c06506g0886j20577P608D25951g7741j58707c2768k18046a02485A00494
$$ plain form
10735 -111281 -88315 -255911 -87335 36423 -13699 216511 187590 -39624 16462 -87345 -2986
10723 146250 -191464 -96962 -441226 -368564 -191849 210363 -49951 -159811 -135845 77296
10712 30710 -41552 138019 -147626 -105420 -206902 31602 -292421 -280875 76085 -114896 -221276
10701 -221276 62171 -291022 29449 39903 61023 -105484 -255470 -76271 141341 -38326 -417042
10690 -417042 217364 -161905 22602 -140540 158826 66612 -223053 -30764 532864 12894
10679 -8009 -122437 88432 -147323 -90092 -58683 -18425 92532 -258053 -127550 -27624 104779
10667 239663 -34898 82373 -228171 -83014 8751 -35994 3542 358980 -132265 -359546 96440
10655 51904 56487 19084 -49907 -81652 -170234 12410 -156510 -162165 -30751 -46211 201591 -111096
$$ packed form
10735a11281K2966j67596h7335C6423a3699B16511k8921c9624A6462h7345b986
10723A46250a91464R4502l44264P2662J76715B10363d9951j09860K3966G7296
10712C0710d1552A38019a47626M2206j01482C1602b92421J1546G6085a14896j06380
10701b21276F2171b91022B9449J0454K1120a05484j49986g6271A41341c8326l78716
10690d17042B17364a61905B2602a40540A58826F6612b23053c0764E32864A2894
10679h009j14428H8432a47323N7231L1409a8425I2532b58053a27550b7624A04779
10667B39663c4898H2373b28171h3014H751c5994C542L55438a32265k27281I6440
10655E1904M583A9084d9907l1745q8582A2410a56510n655c0751j5460B01591a11096
$$ plain form
10642 -316011 116300 46152 -57931 -255582 -491580 -373001 12380 -136800 -42658 230998
10631 -395871 -58962 -146546 -181196 -179231 95814 215188 -265145 -243542 67982 -74912 -83164
10620 -83164 -315913 106714 41907 -12267 -213858 100066 6807 23698 -338934 -76892 -87747
10609 -87747 -264265 -359368 220424 20630 25443 -79178 -212795 -974 -131070 159434 36699
10597 -264632 38316 -204918 -43926 -315935 -27540 60290 -251155 -54229 -123223 -38230 -361686
10586 -361686 -50228 -117052 37603 224890 34797 191592 252965 204672 -102410 -434730 80831
10574 -132172 -189716 -182652 -53410 -139654 195417 -54685 -225198 -7728 14475 -352769 17674
10562 -331452 51949 -334043 39717 6695 -89479 114824 -3778 -285503 88914 -202601 -265485
$$ packed form
10642c16011A16300D6152e7931j97651k35998J18579A2380a36800d2658B30998
10631c95871e8962q7584l4650J965I5814J19374b65145K1603F7982g4912q252
10620h3164k32749A06714D1907a2267k01591A00066F807J6891c38934g6892j0855
10609h7747j76518r5103B20424B0630M813g9178j33617i74j30096A59434C6699
10597b64632C8316b04918d3926k72009b7540F0290b51155e4229o8994c8230l23456
10586c61686e0228o6824C7603J87287C4797J56795O1373m8293a02410l32320H0831
10574a32172n7544P064e3410q6244A95417e4685j70513g728A4475c52769A7674
10562c31452E1949c34043C9717F695h9479A14824c778k81725H8914b02601o2884
$$ plain form
10551 -265485 -24764 63552 -92431 -116631 -7700 -153606 -130444 -171480 139456 -105700 -18737
10539 285292 9868 -237534 161761 -18256 110088 -121260 -157592 32789 11575 197455 23583
10527 136494 -42511 204435 -220506 115147 101188 -66454 -32014 -138374 201782 29529
10516 -56666 -124806 24040 -116631 205877 222862 147796 -52758 39942 -174568 -178694 -102244
10505 -102244 -247693 -102433 -162802 -9953 112978 -11282 -96529 -180170 -557790 127059 -296777
10493 -92298 -230024 101933 -341473 -28589 56450 -71270 -263135 107468 -20380 -369377
10483 -369377 121896 44692 126317 210474 263820 369884 116269 204344 236382 212717 161108
10472 161108 191192 118120 -91646 -183962 -190130 -198808 -2487 -371143 -113638 289133 55328
$$ packed form
10551b65485b4764F3552i2431k4200g700j45906K3162m1036A39456a05700a8737
10539B85292I868b37534A61761a8256A10088a21260l6332C2789A1575J85880B3583
10527A36494d2511B04435b20506A15147j3959f6454c2014j06360B01782B9529
10516e6666o8140B4040a16631B05877J6985p5066e2758C9942a74568m126P6450
10505a02244j45449a02433o0369i953A12978a1282q5247q3641l77620A27059b96777
10493i2298j37726A01933c41473b8589E6450g1270j91865A07468b0380l48997
10483c69377A21896D4692Q1625Q4157N3346J06064A16269Q8075L2038k3665n1609
10472A61108L0084p3072i1646r2316o168q678b487l68656a13638B89133E5328
$$ plain form
10460 266347 58037 -203819 -343967 -369827 -36184 -173027 -14547 -86056 -94930 -131490 -95943
10449 -95943 -429316 -230181 -113717 171763 165054 185688 -32595 -37780 135483 -22417 164973
10437 -24148 -222205 32181 136965 -100014 -157095 -75524 -123512 -117644 261838 186094 102733
10426 102733 -43999 20785 -319871 -67566 -102016 298209 -180918 -293941 -44722 -94362 -202025
10415 -202025 84534 24169 139685 33372 -12947 -73586 -156707 -48042 -270716 140722 -335028
10403 -82964 261057 45353 125977 360336 60444 347679 -68478 351777 94415 -193244 91021
10391 -76539 91301 285727 190065 -123382 194865 -2472 -186366 119884 -211674 -3869 167282
10379 -195434 -111305 273243 -241862 179983 -116153 185672 -266075 348926 8974 -100256
$$ packed form
10460B66347E8037b03819j40148k5860c6184j36843a4547p1509q874l6560L5547
10449i5943l33373J99135a13717A71763o709K0634c2595n185A35483b2417A64973
10437b4148j98057C2181J04784a00014n7081g5524m7988N868B61838p5744q3361
10426A02733d3999B0785c19871f7566l4450B98209a80918j13023d4722m9640j07663
10415b02025H4534B4169J15516C3372a2947o0639q3121d8042k22674A40722c35028
10403h2964B61057D5353Q0624K34359F0444K87235f8478C51777I4415a93244I1021
10391g6539I1301J94426r5662a23382A94865b472j83894A19884b11674c869A67282
10379a95434Q4129B73243b41862A79983a16153A85672b66075C48926H974a00256
$$ plain form
10368 255773 -20179 412551 148321 258074 365309 319774 32014 186037 -62075 -232089
10358 -232089 196195 248767 449996 -23014 207444 -288337 121413 442876 85835 46649
10348 46649 123083 257282 578915 65250 130950 111929 410031 -57213 269587 259372 78329
10336 295021 86606 79727 74189 208773 -38533 208384 -39788 -136802 57634 -13733 134065
10324 26137 404446 222696 171996 314048 40599 209547 61984 193386 41013 -213906
10313 -321371 -68379 122053 15300 -128381 -402915 50771 11669 -137772 -88909 -106837 -171307
10302 -171307 143512 296667 -242776 -177629 -29785 29759 -123761 -87048 25113 -32810 -69553
10291 -69553 186836 228400 -304773 121133 312649 -48704 -343487 -144859 176024 94069
$$ packed form
10368B55773b0179D12551A48321J09753J07235m5535C2014J54023f2075j70014
10358b32089A96195N2572K01229b3014B07444b88337A21413L21463H5835l9186
10348D6649P6434J34199L21633F5250O5700j9021K98102e7213B69587j0215G8329
10336B95021H6606o879n538J34584c8533B08384c9788r7014E7634a3733A34065
10324B6137L78309j81750n0700J42052D0599J68948F1984J31402D1013b13906
10313c21371f8379A22053A5300a28381k74534E0771A1669a37772M8863j7928o4470
10302a71307A43512J53155b42776O5147b9785B9759a23761L6713B5113c2810l6743
10291f9553A86836M1564c04773A21133J91516d8704k94783a44859A76024q1955
$$ plain form
10281 94069 -97969 -227662 241141 136690 -273788 -5545 -91311 94960 -122646 268291 -190205
10269 -123166 158045 245993 -7089 -167241 274821 -205755 -358312 -226853 -207708 -56642
10258 419460 125937 337049 44674 413996 338521 561238 -216433 -149146 -259403 -70848
10247 -165277 -153347 215314 -157082 -129479 -25949 -260482 3566 -130670 2900 -70999 -220039
10236 -220039 -139563 -114154 -26647 29316 -113871 77061 -301541 39642 -138001 22986 -12370
10224 118332 14209 -6716 -189472 140728 -2799 -262346 -160653 82819 90263 -78183 46278
10212 -76382 -280404 19813 97290 -47627 155030 -69045 -90919 -273774 -224940 334714 208584
10201 208584 80752 6111 -98672 25512 40875 -270946 -43077 -91473 -9627 65799 176612
$$ packed form
10281I4069i7969j29693B41141j04451b73788e545q5766I4960a22646B68291a90205
10269a23166A58045Q7948g089j60152B74821b05755j52557J31459J9145e6642
10258D19460A25937K11112D4674L69322p5475K22717b16433O7287j10257g0848
10247a65277J1930B15314a57082K7603b5949k34533C566a30670B900g0999j49040
10236b20039Q0476K5409b6647B9316a13871G7061c01541C9642a38001B2986a2370
10224A18332A4209f716j82756A40728b799k59547J01693H2819P444g8183D6278
10212g6382k04022A9813P7477d7627A55030f9045k1874j82855M8834C34714j26130
10201B08584H0752F111i8672B5512J5363b70946d3077m8396i627F5799J10813
$$ plain form
10190 176612 127547 -552 -162044 -268834 -256276 -114965 -150576 -216624 37486 -31633 -346455
10179 -346455 -224742 53608 36094 -193115 -191994 -105672 -106266 -116568 171578 -200864 -91471
10167 -97303 -140891 103515 -224074 -87728 -305813 -32230 -80867 143866 -49822 -78355 -213566
10156 -213566 -70552 -78228 -40470 -105726 -155978 191301 158687 -217224 -75713 -319115 148513
10144 273107 -358567 107569 124165 -169810 324073 -5028 71258 58994 201314 112484 325724
10133 325724 -196177 703 -38421 38551 -225785 47639 -256474 -140746 243898 -18943 161916
10121 -178682 107324 -150455 114127 126712 239772 387993 -196341 6344 -158236 29280
10110 -171667 -28953 -54164 106171 -59414 -229052 -24826 278629 -83394 -126612 -46960 -370858
$$ packed form
10190A76612m9065e52j61492j06790J2558a14965l5611o6048C7486c1633l14822
10179c46455J21713E3608j7514a93115J121Q6322n94j0302A71578b00864i1471
10167i7303m3588A03515b24074h7728k18085c2230m8637A43866d9822k8533j35211
10156b13566g0552p676L7758o5256n0252A91301l2614b17224g5713k43402A48513
10144B73107c58567A07569J6596a69810C24073e028G1258j2264J42320q8830K13240
10133C25724a96177G03c8421C8551b25785D7639b56474J15728B43898a8943A61916
10121a78682A07324a50455A14127J2585J13060J48221a96341F344a58236B9280
10110a71667b8953k5211A06171e9414j69638b4826B78629h3394m3218d6960l23898
$$ plain form
10099 -370858 -68820 2434 25298 2166 -136898 115400 43572 -334711 -130962 90041 -82856
10087 56002 170363 -65808 -302472 21171 -21492 -123136 57431 -403481 -123759 33809 50371
10076 50371 156026 295166 -79273 -88582 -121095 124189 -92020 -20586 70053 -177376 -399621
10065 -399621 -46781 322086 -272467 -240250 -19553 -183906 247689 -65963 257414 170066
10055 170066 -42742 -175836 -270160 -85253 60724 88928 -254109 -152049 -251157 -231038 -282274
10044 -282274 18840 -21389 243569 -24260 -228848 134949 -86038 6721 -129779 -98804 543
10032 295314 187482 -274505 -159469 -50359 67539 39055 -58632 123942 53991 -109901
10021 -173568 26996 -277033 -303797 -126652 -91785 42067 77440 -216955 -280217 106363 -30813
$$ packed form
10099c70858f8820B434K2864B166a36898A15400D3572c34711a30962I0041h2856
10087E6002J14361f5808k36664B1171b1492j01644E7431d03481a23759C3809J6562
10076E0371J05655J39140g9273r309l2513A24189i2020b0586G0053a77376k22245
10065c99621d6781C22086b72467L2217a9553j64353B47689f5963B57414q7348
10055A70066d2742j33094r4324h5253F0724K8204b54109J02060r9108K0119n1236
10044b82274A8840b1389B43569b4260k04588A34949h6038F721a29779L0975E43
10032B95314j07832b74505J15036e0359F7539k8484e8632A23942E3991a09901
10021a73568B6996b77033k6764a26652L4867D2067L5373b16955o3262A06363c0813
$$ plain form
10009 -68789 -267028 -8398 101710 23035 153665 -88746 -104669 -321968 -190727 -71822 57161
9997 77124 -73272 -258565 -107337 -101766 145636 386792 -45724 -56832 -190243 -104295 15021
9985 67361 100614 -153901 44691 -109966 6890 55504 144398 115100 42695 186473 -59767
9973 -133449 -128111 8268 238221 -111416 289392 -276407 -295360 120970 -93417 92597 110343
9962 110343 217631 47552 36785 125732 17392 -152807 -182883 -308066 61599 74403 5110
9950 231957 -51245 -101842 119317 -109307 42652 -27576 -302414 -26759 -35723 -58203 -106174
9939 -106174 -346161 -119306 -482256 171623 -53196 206161 139193 69085 -205105 -131549
9929 -131549 -158815 -40659 30149 -52968 115631 -35097 -290961 80922 91184 -289613 -253194
$$ packed form
10009f8789j98239h398A01710B3035J30630h8746j5923k17299J31241g1822E7161
9997G7124g3272j85293a07337N571A45636K41156d5724j1108j33411Q5948A5021
9985F7361L3253a53901D4691a09966F890M8614Q8894k9298D2695J43778e9767
9973a33449N338H268K29953a11416B89392b76407j8953A20970i3417I2597J7746
9962A10343J07288D7552j0767Q8947A7392a52807l0076j25183F1599J2804E110
9950B31957e1245n0597A19317a09307D2652b7576k74838b6759q964k2480m7971
9939a06174k39987a19306l62950A71623e3196B06161o6968F9085b05105P3556
9929a31549k7266d0659C0149e2968A15631c5097k55864H0922J0262b89613L6419
$$ plain form
9918 -253194 74264 -58024 -40736 56929 -359906 -148860 -72057 108387 -119538 -120632 -95971
9907 -95971 175415 -213516 -40035 -312340 -257774 99273 61808 -11995 -232545 147326 -134510
9895 -46667 -263145 -52768 -202350 14102 -178273 120411 151710 -236179 -8646 -78056 116567
9883 -27120 -75368 206908 -97743 -26859 -226693 -334059 -15417 -101803 93167 103573 97137
9872 97137 -60643 263218 -413040 -54679 215023 110065 -96377 -31140 229807 -226732 -572111
9861 -572111 -357237 -120241 233906 -130805 -125676 175238 206962 -238651 78087 -65654 -56126
9850 -56126 1697 104471 -51097 -43464 -145668 -235802 -107983 -202116 -62959 -236245 -354205
9839 -354205 3108 -948 -392685 53504 -32860 38130 -115146 71939 -96521 125235 -185723
$$ packed form
9918b53194G4264e8024J7288E6929c59906a48860g2057A08387a19538j094K4661
9907i5971A75415b13516d0035k72305N4566I9273l7465a1995k20550A47326a34510
9895d6667k16478e2768j49582A4102a78273A20411L1299b36179h646o9410A16567
9883b7120m8248B06908i7743b6859j99834j07366a5417q6386I3167J0406o436
9872I7137f0643B63218d13040e4679B15023j04958i6377c1140B29807b26732l45379
9861e72111K14874a20241B33906a30805N129A75238L1724b38651G8087f5654R528
9850e6126A697J02774e1097P633j02204r0134a07983r4133f2959j73286j17960
9839c54205C108i48l91737E3504c2860C8130a15146G1939i6521A25235a85723
$$ plain form
9827 34456 100313 -293058 -128851 83191 149511 -79248 155098 118250 -137774 90290 -133012
9815 -174919 122462 -147762 106606 117310 -69164 -218983 -216597 31721 -73890 -163194 -145913
9804 -145913 -380390 210553 -249402 78265 -303497 15579 254904 -108358 38505 29661 -409723
9792 24835 -421945 -64880 149862 216547 188253 38752 -82406 -186678 98099 97303 -403687
9780 98201 -158900 -87072 -12307 -101273 -40507 154852 -259694 -18761 96851 154918 -68688
9768 -32275 214630 -104123 -67482 -334117 -184833 49024 -92456 214418 -219992 -42029 264783
9756 102586 -94908 -8305 -417523 29336 68867 -388762 115056 -74096 142132 -92066 -63513
9745 -63513 -109434 186218 250523 108233 -138202 229045 -452333 -366248 -231522 -53833 -204968
$$ packed form
9827C4456O5857b93058a28851H3191O6320g9248A55098l6848a37774I0290a33012
9815a74919A22462a47762A06606J0704f9164j49819K386C1721g3890q9304J7281
9804a45913k34477B10553b49402G8265c03497A5579K39325a08358C8505q844d09723
9792B4835d21945f4880A49862O6685k8294C8752h2406j04272I8099p96d03687
9780I8201a58900P1828a2307q8966d0507A54852b59694a8761I6851N8067f8688
9768c2275B14630a04123L6641k66635J49284D9024i2456B14418b19992d2029B64783
9756A02586i4908h305m09218B9336L9531c88762A15056g4096A42132i2066K8553
9745f3513m5921A86218O4305A08233a38202B29045d52333Q6085J34726e3833j51135
$$ plain form
9734 -204968 -47557 171878 147195 -40014 112687 -71064 -133858 -87866 132023 -294418 151157
9722 -324878 -199144 66508 25679 129259 73268 112480 -178967 74598 -294403 -191416 -19438
9710 -6082 69563 5265 156483 -36962 293237 131958 -23693 -173722 98146 76988 19519
9698 -90923 92809 -442951 398618 30824 -5440 -12574 -283845 -499773 -19890 101170 -293571
9686 -183237 -50855 -215943 -96931 127746 134823 137720 -92268 24104 -213782 11711 -144426
9674 -546307 -300689 -92551 -368110 -82038 -193752 100944 -154217 -122392 -13882 -87405 142105
9662 -143887 -390513 -351359 -138764 -97657 -101295 -205640 67080 53563 -63959 405316 -198561
9650 -141651 -196553 220817 -239310 -247158 -266009 102556 -301727 24831 278100 182136 141146
$$ packed form
9734b04968d7557A71878k4683d0014A12687g1064o2794M5992A32023b94418A51157
9722c24878J25734F6508B5679J03580n5991L9212a78967G4598b94403J02987a9438
9710f082F9563E265J51218c6962B93237A31958b3693j50029I8146k1158A9519
9698i0923I2809d42951C98618C0824e440p134k71271k15928a9890A01170b93571
9686a83237e0855j65088i6931A27746P077K897i2268B4104b13782A1711a44426
9674e46307K45618i2551k75559h2038j11714A00944a54217L1825a3882p3523A42105
9662a43887k46626L9154a38764M1107l638j04345F7080j3517f3959D05316a98561
9650a41651n4902B20817b39310p848j8851A02556c01727B4831K53269r5964m0990
$$ plain form
9639 141146 229270 -40892 -131459 -276452 -27664 128888 -90783 176810 -16608 55809 -219608
9627 118843 91224 -293327 50742 -86347 210231 -104958 30192 -32823 -159738 14984 -182422
9615 -335340 -13286 -308448 -314445 -69763 -14201 -165567 -56658 -32729 -182219 -73675 -241220
9604 -241220 2183 -41689 -289156 2564 -11705 -371782 131201 -100252 -80720 -106355 247024
9592 20705 -150955 84339 -83157 40608 7631 137894 -163951 -365344 -4856 -22630 -104458
9581 -104458 -160140 -255472 120126 -145931 129534 44975 24435 -59439 -321172 -69313 13760
9569 -352794 -130694 -40567 213185 7426 -116081 -79773 -122545 89821 69579 -113472 -254032
9558 -254032 -297642 20478 -20223 373401 -62746 26594 174457 308916 -435373 226249 -99530
$$ packed form
9639A41146Q8124d0892r0567j44993b7664A28888i0783A76810a6608E5809b19608
9627A18843k7619b93327E0742h6347B10231a04958C0192c2823j26915A4984a82422
9615c35340a3286k95162n997f9763a4201j51366e6658K3929j49490g3675j67545
9604b41220B183d1689k47467B564a1705l60077A31201a00252J9532k5635B47024
9592B0705a50955H4339h3157D0608G631J30263a63951k01393d856j7774q1828
9581a04458n5682r5332A20126a45931A29534D4975k0540e9439k61733f9313A3760
9569c52794a30694d0567B13185G426a16081L6308m2772H9821k0242a13472j40560
9558b54032m3610B0478b0223C73401f2746B6594J47863J34459d35373B26249i9530
$$ plain form
9546 -130468 205864 -59630 -17695 -39716 6974 -77588 74256 -75447 -238848 6729 -15705 283271
9533 -109803 306702 -148879 -100758 130714 -12478 -60057 -267305 -248473 -37324 204466 -47212
9521 167043 64233 -161912 -4800 -210641 318528 214720 -188984 -38077 -31110 -334069 -143073
9509 128459 -156006 -71378 55332 -96968 -179919 117986 153385 -73646 309612 -35523 54672
9497 -252656 73892 156596 -47331 -120009 -114598 75470 37075 445822 -386186 -78439 -28914
9485 -99585 187476 73918 -289426 -100166 -47684 193558 -87486 -124614 -36297 135727 -96063
9473 -78825 -79341 -204442 214595 -184663 -251100 -360367 36842 -87297 211258 129171 -319575
9461 10159 166658 4863 -401246 27743 -146135 -104849 -205929 74242 -124610 -52338 91169
$$ packed form
9546a30468B05864e9630a7695k2021F974g7588G4256g5447j63401F729a5705B83271
9533a09803C06702a48879M8121A30714a2478m7579k07248J8832c7324B04466d7212
9521A67043F4233a61912d800k05841C18528j03808a88984c8077O967l02959a43073
9509A28459a56006g1378E5332i6968q2951A17986L5399g3646C09612c5523E4672
9497b52656G3892Q2704d7331p2678N411G5470C7075M08747c86186g8439b8914
9485i9585A87476G3918b89426a00166d7684A93558h7486l7128c6297A35727i6063
9473g8825n16j25101B14595a84663o6437j09267C6842h7297B11258q2087c19575
9461A0159J56499D863d01246B7743a46135M1286j01080G4242a24610e2338I1169
$$ plain form
9449 70181 -228818 -51884 2731 54327 167842 16116 -322900 -263466 -351739 -101097 -162091
9438 -162091 -89655 -283958 104422 -90437 -114569 -75025 -118501 -170819 -68720 -364263 -67940
9426 -91131 -31264 78090 -219555 -312076 -19204 16137 -320354 -316979 94247 -396329 160562
9414 -186960 7563 -208941 38274 236204 31311 -21883 -261773 -135475 -31892 -193661 -36707
9402 -66501 -144569 -19090 -297523 161441 23162 29221 36109 34859 119470 -160103 -9311 -152273
9390 -152273 219480 -150742 -276744 58837 -98056 29956 -56896 -30970 -56824 -314315 -132809
9378 -197046 -48874 -234228 -44854 -231636 43215 -98420 -262797 -315196 49285 -23305 -80415
9367 -80415 329062 -67552 -68501 168245 78906 -172236 133530 321014 153369 47421 -157704
$$ packed form
9449G0181b28818e1884B731N1596J13515A6116c22900N9434q8273a01097o0994
9438a62091P2436j94303A04422i0437k4132L9544m3476n2318f8720k95543f7940
9426i1131c1264G8090b19555r2521a9204A6137c20354L375I4247c96329A60562
9414a86960G563b08941C8274J97930C1311b1883k39890J26298c1892j61769c6707
9402f6501p8068a9090k78433A61441B3162O059O888j250Q4611a60103i311j42962
9390a52273B19480a50742j26002E8837i8056B9956e6896K5926k5854k57491a32809
9378a97046d8874j85354d4854j86782D3215i8420j64377n2399D9285b3305n7110
9367h0415C29062f7552r49A68245G8906a72236A33530J87484A53369D7421a57704
$$ plain form
9355 -207478 -89423 -61073 -159364 142095 -88816 -214137 -292819 -163348 199315 260403 12072
9343 -155954 -161149 -234271 -209644 -53781 6730 -158077 190023 168456 20678 -331462 80554
9331 -230511 -81264 -1950 224684 48312 -84175 -172123 124978 -52481 -21027 395201 -59776
9319 -135265 -27397 -144118 -66295 122958 43843 30767 -280420 -207644 78145 -171633 -168249
9308 -168249 95951 86912 -6152 -196964 -206084 -37955 -88152 27867 -195394 52895 -124678 17633
9295 52399 -98666 -186326 -353157 34529 -83214 -43577 28920 89525 104268 -2937 -137031 -161565
9283 -161565 38882 112277 84407 132547 11432 -3344 -159255 -68176 -168886 -60414 146846
9271 184101 24923 -235611 -138429 -164068 -34196 37370 294393 10870 -156278 -165904 134969
$$ packed form
9355b07478h9423K8350r8291A42095h8816j25321p8682J29471A99315O1088A2072
9343a55954n195p3122K4627e3781F730a58077A90023k1567B0678c31462H0554
9331b30511h1264a950B24684D8312h4175q7948A24978e2481b1027C95201e9776
9319a35265b7397j16721f6295A22958D3843j3076b80420P2776G8145a71633L384
9308a68249I5951r039f152j90812r120c7955n0197B7867a95394E2895a24678A7633
9295E2399i8666q7660j66831C4529h3214L9637B8920O0605J4743b937j34094k4534
9283a61565C8882P3395k7870M8140A1432c344j55911f8176j00710f0414A46846
9271A84101B4923b35611R7182k5639c4196C7370K57023A0870a56278r626A34969
$$ plain form
9259 134148 -129041 -300680 -108601 262 -115403 187324 -74298 271800 -119228 155097
9248 -81489 10550 161023 160215 112697 -121103 -406869 197048 -152466 -225230 -61193 -25908
9236 93827 -204942 -90796 -340703 -32064 -134 -3755 -214346 4880 126635 123951 84345 -245847
9223 -50053 -119714 25419 45777 -99318 70925 23025 -191274 11038 -162163 -351242 163317
9211 147102 -118203 186202 -28671 -309617 -78864 -365344 -219896 -267563 -179674 85453 83225
9200 83225 -168296 -248448 -426720 -383176 -320078 -92896 11494 66549 -122435 -141295 190388
9188 120614 3813 -9588 -74903 31473 -167370 122372 129970 104258 -55660 -18613 -447164 27817
9175 36236 -358534 -57554 119531 193801 -187725 -63242 -184692 -163547 80066 5186 -819 160810
$$ packed form
9259A34148a29041j71639a08601B62a15403A87324g4298B71800a19228A55097
9248h1489A0550J50473q08m7518a21103k85766A97048a52466p2764f1193b5908
9236I3827b04942i0796k49907c2064a34l621k10591D880J21755k684l9606b45847
9223e0053o9661B5419K0358i9318G0925B3025a91274A1038a62163j89079A63317
9211A47102a18203A86202b8671k80946g8864k86480J45448m7667Q7889H5453k228
9200H3225a68296q0152j78272M3544O3098i2896A1494N5055a22435j8860A90388
9188A20614C813i588o5315C1473a67370A22372P598k5712e5660a8613m28551B7817
9175C6236c58534e7554A19531P4270a87725f3242j21450K1145H0066E186h19A60810
$$ plain form
9162 192965 32337 101181 -319236 -52358 -359704 63676 -232060 146178 -30814 -37128 -47585
9151 -47585 91724 108797 4677 79587 -74599 157672 -353801 -301011 -236992 31431 182870
9140 182870 -237112 -155170 -183864 314609 -351645 181217 -57756 77472 98972 -297870 -281951
9129 -281951 -188302 190535 -253641 -80069 180968 -358689 -238539 108460 -162619 45923
9118 113488 -55086 95873 -231744 -268502 -505938 -195275 -63990 -305327 -317595 -132237 -150671
9107 -150671 71072 -6208 23855 176899 -122947 93292 -220207 24045 170055 130257 19396
9095 291447 40597 -321531 -87261 -172782 -129823 -291012 82362 -138772 -15954 73904 -83473
9083 -3270 -172608 33992 112446 -41367 -17149 -178668 -200858 -33844 132142 -184361 173569
$$ packed form
9162A92965C2337O8844c19236e2358l07346F3676b32060A46178c0814o314j0457
9151d7585I1724J7073D677P4910g4599A57672c53801N2790O4019C1431J51439
9140A82870b37112Q1942k8694C14609c51645A81217e7756G7472K1500b97870J5919
9129b81951R3649A90535b53641h0069A80968c58689J20150A08460a62619D5923
9118A13488e5086I5873b31744l6758k37436a95275f3990k41337j2268a32237j8434
9107a50671G1072f208B3855J53044a22947I3292b20207B4045J46010l9798A9396
9095B91447D0597c21531h7261q5521M2959j61189H2362a38772a5954G3904h3473
9083c270j69338C3992P8454d1367a7149j61519k2190c3844A32142a84361A73569
$$ plain form
9071 123459 208466 75746 15924 268194 117463 -95485 16161 112332 -200107 -217457 9862
9059 -48120 -62262 -123814 -200397 -294331 22918 361754 11960 15419 -377509 -315291 -88967 -128511
9047 -128511 -58315 209650 -210289 117584 237657 89287 -111856 76466 -211739 -200269
9037 -200269 -281569 -168855 -120930 -35134 195978 30473 135948 -272418 -31356 79456 -57707
9025 -405816 -30504 -20316 112855 98519 102621 -183611 -54071 53428 -288665 120120 -100189
9013 23797 171133 -137334 -126519 57266 -234659 22746 -214908 -11132 194417 -185737 98335
9001 -110693 -16351 35940 92442 -163915 -53664 35737 -72627 92308 103395 228626 -87016
8989 149601 289103 -279583 -181541 -12979 173687 326701 -328011 130005 -409774 -305374
$$ packed form
9071A23459Q5007G5746A5924K52270A17463i5485A6161R6171b00107j7350I862
9059d8120j4142o1552p6583r3934B2918L38836A1960L459c77509O2218h8967l9544
9047a28511e8315B09650b10289A17584J20073H9287a11856G6466b11739J1470
9037b00269q1300J12714M7925c5134A95978C0473J05475b72418c1356G9456e7707
9025d05816c0504J0188A12855j4336M102a83611e4071E3428b88665A20120a00189
9013B3797J47336a37334J0815E7266b34659B2746b14908a1132A94417a85737I8335
9001a10693a6351C5940N6502a63915e3664C5737g2627I2308J1087J25231h7016
8989A49601J39502b79583R8042a2979A73687J53014c28011A30005d09774J04400
$$ plain form
8979 -305374 48258 -3077 -394084 -316713 124003 -188328 178371 108692 10388 4122 -382978
8967 -3499 -164082 -179193 66185 78840 -194154 -57826 -304436 -223948 -248867 -73016 66727
8955 -104809 -139669 -57685 -140798 -109182 -22851 59398 -56223 50875 -28636 -2406 66711 -218026
8942 156289 124599 -240211 98074 -297817 -56742 1307 -125971 -306420 90947 -184338 110478
8930 -427850 120488 313357 -85537 139551 -184740 47629 168835 215958 249103 -41557 146746
8918 410390 1070931 278544 382242 -165455 -110134 -229653 81850 -155527 -20438 85905
8907 -192378 -25303 33091 267442 6456 -57943 74604 -21741 -195021 -388362 -122839 -70944
8896 -70944 38157 -158624 -66220 -66713 12356 -36519 212530 30422 16325 -159831 -226321 175498
$$ packed form
8979c05374D8258c077l91007P7371A24003a88328A78371o9679A0388D122c82978
8967c499j60583j5111F6185J2655a94154e7826k46610Q0488k4919g3016F6727
8955a04809l4860e7685q3113L1616b2851E9398e6223E0875b8636b406F6711b18026
8942A56289l1690b40211I8074b97817e6742A307a25971j80449I0947a84338A10478
8930d27850A20488J92869h5537A39551a84740D7629J21206M7123L3145d1557A46746
8918D10390O60541B78544J03698a65455N5321j19519H1850a55527b0438H5905
8907a92378b5303C3091K34351F456e7943G4604b1741j73280j93341a22839N1895
8896g0944C8157a58624f6220m93A2356c6519B12530C0422j4097a59831o6490A75498
$$ plain form
8883 -136697 117390 -339571 -212675 -221513 -33450 13417 28021 -223839 -235706 30185 -205423
8871 -287165 -66865 -45865 -283519 -90367 -398213 -96929 -155004 61110 -91500 61023 -217608
8859 -254097 107739 8678 -324692 77187 36691 -475357 70504 50022 2870 -138799 199470
$$ packed form
8883a36697A17390c39571J26896q838c3450A3417J4604b23839j1867C0185b05423
8871b87165f6865K1000k37654i0367l07846i6929n8075F1110i1500F1023b17608
8859b54097A07739H678c24692G7187C6691d75357G0504k0482B870a38799A99470
$$ [...]
##END NTUPLES=NMR SPECTRUM
##END=
