##TITLE=NES1036_878015041_9242627_nzJsoLbIYV
##JCAMPDX= 6.0         $$ Bruker NMR JCAMP-DX V2.0
##DATA TYPE= NMR SPECTRUM
##DATA CLASS= NTUPLES
##ORIGIN= BRUKER
##OWNER= Administrator
$$ 1.72 TOPSPIN		Version 2.1
$$ 2015-07-01 23:31:17.742 -0700  Administrator@X
$$ Compression mode = diff/dup
##.OBSERVE FREQUENCY= 400.02188249412
##.OBSERVE NUCLEUS= ^1H
##.ACQUISITION MODE= SIMULTANEOUS (DQD)
##.ACQUISITION SCHEME= undefined
##.AVERAGES= 64
##.DIGITISER RES= 22
##SPECTROMETER/DATA SYSTEM= spect
##.PULSE SEQUENCE= noesygpps1d.comp
##.SOLVENT NAME= COFFEE_meoh
##.SHIFT REFERENCE= INTERNAL, COFFEE_meoh, 1, 14.96286
##AUDIT TRAIL= $$ (NUMBER, WHEN, WHO, WHERE, PROCESS, VERSION, WHAT)
$$ ##TITLE= Audit trail, TOPSPIN		Version 2.1
$$ ##JCAMPDX= 5.01
$$ ##ORIGIN= Bruker BioSpin GmbH
$$ ##OWNER= Administrator
$$ $$ E:\/data/COFFEE/nmr/NES1036_878015041_9242627_nzJsoLbIYV/22/pdata/1/auditp.txt
$$ ##AUDIT TRAIL=  $$ (NUMBER, WHEN, WHO, WHERE, PROCESS, VERSION, WHAT)
(   1,<2015-07-01 23:31:12.227 -0700>,<Administrator>,<X>,<go>,<TOPSPIN 2.1>,
      <created by zg
	started at 2015-07-01 23:19:42.695 -0700,
	POWCHK enabled, PULCHK disabled,
       configuration hash MD5:
       21 0F 79 D6 B3 7B B4 F6 88 20 88 DB 03 48 BD 9F
       data hash MD5: 64K
       F1 97 A1 41 A4 2A 4F 21 40 F8 43 56 EC CC 1B 09>)
(   2,<2015-07-01 23:31:15.664 -0700>,<Administrator>,<X>,<proc1d>,<TOPSPIN 2.1>,
      <Start of raw data processing
       efp LB = 0.3 FT_mod = 6 PKNL = 1 PHC0 = 0 PHC1 = 0 SI = 128K 
       data hash MD5: 128K
       5C A5 E7 A3 E3 03 75 23 18 91 83 16 AF 56 47 7A>)
(   3,<2015-07-01 23:31:16.539 -0700>,<Administrator>,<X>,<proc1d>,<TOPSPIN 2.1>,
      <pk PHC0 = -83.39172 PHC1 = 0 
       data hash MD5: 128K
       C5 E8 82 71 39 42 93 94 B1 F3 CC 50 19 E4 DE F1>)
(   4,<2015-07-01 23:31:16.914 -0700>,<Administrator>,<X>,<proc1d>,<TOPSPIN 2.1>,
      <abs ABSG = 1 
       data hash MD5: 128K
       1A 05 11 5B 02 BD 47 B4 A1 AE 19 55 25 CE 96 ED>)
(   5,<2015-07-01 23:31:17.024 -0700>,<Administrator>,<X>,<proc1d>,<TOPSPIN 2.1>,
      <abs ABSG = 2 
       data hash MD5: 128K
       C7 96 EC 57 B5 97 C8 0D C2 DE 4D 51 09 24 83 7A>)
(   6,<2015-07-01 23:31:17.117 -0700>,<Administrator>,<X>,<proc1d>,<TOPSPIN 2.1>,
      <abs ABSG = 3 
       data hash MD5: 128K
       F3 21 B2 C1 54 25 C6 6D 4E 6D 01 70 7B 04 7F B8>)
(   7,<2015-07-01 23:31:17.195 -0700>,<Administrator>,<X>,<proc1d>,<TOPSPIN 2.1>,
      <abs ABSG = 4 
       data hash MD5: 128K
       69 F1 4B 25 B9 7C DE D2 A3 3C 68 4E 68 36 92 D2>)
(   8,<2015-07-01 23:31:17.320 -0700>,<Administrator>,<X>,<proc1d>,<TOPSPIN 2.1>,
      <abs ABSG = 5 
       data hash MD5: 128K
       87 FA F6 E2 C3 42 AC 43 0E F0 38 BD F1 93 D7 58>)
$$ ##END=
$$ 
$$ $$ hash MD5
$$ $$ CB AE A7 48 D5 B7 88 5D A3 35 8B 77 31 46 33 4E
##$RELAX= 
##$RELAX= 
##$RELAX= 
##$RELAX= 
##$RELAX= 
##$RELAX= 
##$RELAX= 
##$RELAX= 
$$ Bruker specific parameters
$$ --------------------------
##$DU= <E:\>
##$EXPNO= 22
$$ [...]
##$TP07= 0
##$TPNAME0= <>
##$TPNAME1= <>
##$TPNAME2= <>
##$TPNAME3= <>
##$TPNAME4= <>
##$TPNAME5= <>
##$TPNAME6= <>
##$TPNAME7= <>
##$TPOAL= (0..7)
0.5 0.5 0.5 0.5 0.5 0.5 0.5 0.5
##$TPOFFS= (0..7)
0 0 0 0 0 0 0 0
##$TUNHIN= 0
##$TUNHOUT= 0
##$TUNXOUT= 0
##$USERA1= <user>
##$USERA2= <user>
##$USERA3= <user>
##$USERA4= <user>
##$USERA5= <user>
##$V9= 5
##$VALIST= <valist>
##$VCLIST= <CCCCCCCCCCCCCCC>
##$VD= 0
##$VDLIST= <DDDDDDDDDDDDDDD>
##$VPLIST= <PPPPPPPPPPPPPPP>
##$VTLIST= <TTTTTTTTTTTTTTT>
##$WBST= 2048
##$WBSW= 25
##$XGAIN= (0..3)
0 0 0 0
##$XL= 0
##$YL= 0
##$YMAX_a= 6284268
##$YMIN_a= -12213386
##$ZGOPTNS= <>
##$ZL1= 120
##$ZL2= 120
##$ZL3= 120
##$ZL4= 120
##$ABSF1= 14.96286
##$ABSF2= -5.595322
##$ABSG= 5
##$ABSL= 3
##$ALPHA= 0
##$AQORDER= 0
##$ASSFAC= 0
##$ASSFACI= 0
##$ASSFACX= 0
##$ASSWID= 0
##$AUNMP= <proc_prof1d_extract.lims>
##$AXLEFT= 0
##$AXNAME= <>
##$AXNUC= <1H>
##$AXRIGHT= 0
##$AXTYPE= 0
##$AXUNIT= <>
##$AZFE= 0.1
##$AZFW= 0.1
##$BCFW= 0
##$BC_mod= 0
##$BYTORDP= 0
##$COROFFS= 0
##$CY= 15
##$DATMOD= 1
##$DC= 0
##$DFILT= <>
##$DTYPP= 0
##$F1P= 0
##$F2P= 0
##$FCOR= 0.5
##$FTSIZE= 131072
##$FT_mod= 6
##$GAMMA= 0
##$GB= 0
##$INTBC= 1
##$INTSCL= 1
##$ISEN= 128
##$LB= 0.3
##$LEV0= 0
##$LPBIN= 0
##$MAXI= 10000
##$MC2= 0
##$MEAN= 0
##$ME_mod= 0
##$MI= 0
##$NCOEF= 0
##$NC_proc= -2
##$NLEV= 6
##$NOISF1= 0
##$NOISF2= 0
##$NSP= 0
##$NTH_PI= 0
##$NZP= 0
##$OFFSET= 14.96286
##$PC= 1
##$PHC0= -83.39172
##$PHC1= 0
##$PH_mod= 1
##$PKNL= yes
##$PPARMOD= 0
##$PPDIAG= 0
##$PPIPTYP= 0
##$PPMPNUM= 2147483647
##$PPRESOL= 1
##$PSCAL= 4
##$PSIGN= 0
##$PYNMP= <proc.py>
##$REVERSE= no
##$SF= 400.020008893146
##$SI= 131072
##$SIGF1= 0
##$SIGF2= 0
##$SINO= 400
##$SIOLD= 131072
##$SPECTYP= <>
##$SREGLST= <1H.CDCl3>
##$SSB= 0
##$STSI= 131072
##$STSR= 0
##$SW_p= 8223.68421052631
##$SYMM= 0
##$S_DEV= 0
##$TDeff= 65536
##$TDoff= 0
##$TI= <>
##$TILT= no
##$TM1= 0
##$TM2= 0
##$TOPLEV= 0
##$USERP1= <user>
##$USERP2= <user>
##$USERP3= <user>
##$USERP4= <user>
##$USERP5= <user>
##$WDW= 1
##$XDIM= 131072
##$YMAX_p= 349926880
##$YMIN_p= -11956
##$CURPLOT= <Network HP LaserJet P1505>
##$CURPRIN= <$Network HP LaserJet P1505>
##$DFORMAT= <normdp>
##$LAYOUT= <+/1D_H.xwp>
##$LFORMAT= <normlp>
##$PFORMAT= <normpl>
##$SURQMSG= 1
$$ End of Bruker specific parameters
$$ ---------------------------------
##NTUPLES= NMR SPECTRUM
##VAR_NAME=  FREQUENCY,     SPECTRUM/REAL,   SPECTRUM/IMAG
##SYMBOL=    X,             R,               I
##VAR_TYPE=  INDEPENDENT,   DEPENDENT,       DEPENDENT
##VAR_FORM=  AFFN,          ASDF,            ASDF
##VAR_DIM=   131072,        131072,          131072
##UNITS=     HZ,            ARBITRARY UNITS, ARBITRARY UNITS
##FACTOR=    0.0627417313425164, 1,          1
##FIRST=     8223.62146879497, 1265,         -41332
##LAST=      0,             3308,            -41686
##MIN=       0,             -11956,          0
##MAX=       8223.62146879497, 349926880,    0
$$ Real data points
##PAGE= N=1
##DATA TABLE= (X++(R..R)), XYDATA
$$ [...]
63496A54239J147P05N41Q56J312J587J779K104K506K776K886K872K561J771P56
63481A80398N9j82l76p24p63PJ255K080K044J551J138R44R24J183J710K124K098
63464A95470J842J801K004K117K119K418L261M369N363O205O960P504P690P667
63450B56790P778Q227R009J0009J1049J2081J3463J5700J8591K0918K1408J9959
63438D24982J7503J4819J1937Q680N317K378J50j486k794l825m281l772k389r23
63424D66296k66o44j635k805m056n454p078q967j0908j2345j2883j2790j2582
63411C73883j2222j1272r843q653p986p241n884m294l213k770k548k252j821j141
63397B92743j05J137K374L612M859N874O481O912P474Q044Q374Q687R473J0822
$$ y = [154239, 155386, 156091, 156632, 157488, 158800, 160387, 162166, 164270, 166776, 169552, 172438, 175310, 177871, 179642, 180398, 180457, 180275, 179899, 179175, 178412, 178419, 179674, 181754, 183798, 185349, 186487, 187431, 188355, 189538, 191248, 193372, 195470, 197312, 199113, 201117, 203234, 205353, 207771, 211032, 215401, 220764, 226969, 233929, 241433, 249123, 256790, 264568, 272795, 281804, 291813, 302862, 314943, 328406, 344106, 362697, 383615, 405023, 424982, 442485, 457304, 469241, 477921, 483238, 485616, 485766, 484280, 481486, 477661, 473380, 469608, 467219, 466296, 466030, 465386, 463751, 460946, 456890, 451436, 444358, 435391, 424483, 412138, 399255, 386465, 373883, 361661, 350389, 340546, 331893, 323907, 316666, 310782, 306488, 303275, 300505, 297957, 295705, 293884, 292743, 292638, 293775, 296149, 299761, 304620, 310494, 316975, 323887, 331361, 339405, 347779, 356466, 365939, 376761]
63383C76761J2420J4094J5806J7130J7300J5964J3481J0332O754L102O9j877l048
63370D98288m078n054n463m975l985l115k468j659o93m09j651m109o494p981r016
63355D37138j0326j1659j2150j1682j1069j0797j0373r261p878p057o793o235
63343C21858m929l571l245m108n132n176m097k790k195k383k637k307j436o68
63329B77184o13j344k356k939k665j692o09J1M3j62j72P8K67J03l28p04p88n55
63311B62759j00L73O09O04O77R95J136N68n79j622k158k314k139j455n25j17n17
63294B56195j034j046r56j415k066j944r39J4K08l5j03O3R3k31p98j275j287p60
63276B42684j40rl79o66l71M20J242J668J545J122Q71J027J318J377J283J365
$$ y = [376761, 389181, 403275, 419081, 436211, 453511, 469475, 482956, 493288, 500042, 503144, 503213, 501336, 498288, 494210, 489156, 483693, 478718, 474733, 471618, 469150, 467491, 466798, 466389, 464738, 460629, 454135, 446154, 437138, 426812, 415153, 403003, 391321, 380252, 369455, 359082, 349821, 341943, 334886, 328093, 321858, 316929, 313358, 310113, 306005, 300873, 295697, 291600, 288810, 286615, 284232, 281595, 279288, 277852, 277184, 276571, 275227, 272871, 269932, 267267, 265575, 264966, 264977, 265020, 264858, 264686, 264764, 265031, 265134, 264806, 264102, 263314, 262759, 262659, 263032, 263641, 264245, 264922, 265917, 267053, 267621, 267042, 265420, 263262, 260948, 258809, 257354, 256829, 256712, 256195, 255161, 254115, 253159, 251744, 249678, 247734, 246795, 246809, 247017, 246982, 246879, 246942, 247035, 246804, 246006, 244731, 243444, 242684, 242544, 242535, 242156, 241490, 241119, 241539, 242781, 244449, 245994, 247116, 247987, 249014, 250332, 251709, 252992, 254357]
63260B54357J682K098K623L259L621L371K911K992L713M451M842N132N456N573
63246C06081N606O250P826R589J0560J0644J0556J0946J2037J3784J5925J7974
63234D37778J9442K0068J9817J8903J7822J7018J6439J5721J4844J4192J3938
63223F25982J3937J4265J5261J6759J7862J7834J6746J5032J2962J0757Q602O140
63211G92139K594k146p102j1341j4942j8297k1121k2830k3474k3550k3181k2115
63199F04634k0214j7485j4020j0399p623n984m491k128Q10L477N908Q620J1231
63186E52336J2816J3471J4259J5522J6420J6466J6317J6644J7250J7767J8292
63175G27560J8729J8345J6768J4863J3848J3939J4296J3982J2480R665N865J739
$$ y = [254357, 256039, 258137, 260760, 264019, 267640, 271011, 273922, 276914, 280627, 285078, 289920, 295052, 300508, 306081, 311687, 317937, 325763, 335352, 345912, 356556, 367112, 378058, 390095, 403879, 419804, 437778, 457220, 477288, 497105, 516008, 533830, 550848, 567287, 583008, 597852, 612044, 625982, 639919, 654184, 669445, 686204, 704066, 721900, 738646, 753678, 766640, 777397, 785999, 792139, 794733, 792587, 785485, 774144, 759202, 740905, 719784, 696954, 673480, 649930, 626749, 604634, 584420, 566935, 552915, 542516, 534893, 528909, 524418, 522290, 523100, 526577, 532485, 541105, 552336, 565152, 578623, 592882, 608404, 624824, 641290, 657607, 674251, 691501, 709268, 727560, 746289, 764634, 781402, 796265, 810113, 824052, 838348, 852330, 864810, 874475, 880340, 882079]
63163H82079k304o365j0524j4430j7761k0726k3624k6196k7860k8411k8086k7143
63151F48649k5735k4007k1975j9500j6669j4065j2232j1079j0109r074q030o961
63139D69213n816m797m124l591k790j873j554k197l241l774l454k609j753j204
63125D26436r92q64m44L27R28P33k31j171j280l57J193K695L482L275K616K524
63109D38870L344M212M160L442L115L411L465K709J698J112P95L47M9L62J018
63094D72109J354J315J384J722K072K327K577K718K658K698L125L597L689L789
63080E07134M620N944O746O726O688P223P910Q128P917P697P749Q252R203J0124
63066F12061J0564J1009J2419J4632J6221J6448J6361J7331J9372K1718K4200
$$ y = [882079, 879775, 873410, 862886, 848456, 830695, 809969, 786345, 760149, 732289, 703878, 675792, 648649, 622914, 598907, 576932, 557432, 540763, 526698, 514466, 503387, 493278, 484204, 476174, 469213, 463397, 458600, 454476, 450885, 448095, 446222, 444668, 442471, 439230, 435456, 432002, 429393, 427640, 426436, 425444, 424580, 424136, 424463, 425391, 426124, 425893, 424722, 423442, 423085, 424278, 426973, 430455, 433730, 436346, 438870, 442214, 446426, 450586, 454028, 457143, 460554, 464019, 466728, 468426, 469538, 470333, 470680, 470729, 471091, 472109, 473463, 474778, 476162, 477884, 479956, 482283, 484860, 487578, 490236, 492934, 496059, 499656, 503345, 507134, 511754, 517698, 524444, 531170, 537858, 545081, 552991, 561119, 569036, 576733, 584482, 592734, 601937, 612061, 622625, 633634, 646053, 660685, 676906, 693354, 709715, 727046, 746418, 768136, 792336]
63055G92336K7036K9918L2321L4348L6314L7803L8202L7882L7875L8297L8144
63044A180476L6831L5130L4172L4197L4667L5196L5839L6582L6921L6188L4254
63033A570453L1714K9038K5694K0528J3108M142n400j4980k4049l1832l8142m3647
63021A536627m8678n2376n3801n3352n2062n0007m6503m1598l6179l0623k4554
63010A046894j8106j2263p516l130J688O667J1111J5016J8839K2531K5442K7182
62998A134355K8062K8695K9329K9695K9486K8936K8700K8960K9056K8365K7223
62987A450862K6289K5255K2957J8766J3097O497q92q770j6488k3885l1566l9747
62975A442375m7438n3359n7214n9536o0721o0839o0045n8471n5955n2486m8701
$$ y = [792336, 819372, 849290, 881611, 915959, 952273, 990076, 1028278, 1066160, 1104035, 1142332, 1180476, 1217307, 1252437, 1286609, 1320806, 1355473, 1390669, 1426508, 1463090, 1500011, 1536199, 1570453, 1602167, 1631205, 1656899, 1677427, 1690535, 1694677, 1689277, 1674297, 1650248, 1618416, 1580274, 1536627, 1487949, 1435573, 1381772, 1328420, 1276358, 1226351, 1179848, 1138250, 1102071, 1071448, 1046894, 1028788, 1016525, 1009009, 1005879, 1007567, 1014234, 1025345, 1040361, 1059200, 1081731, 1107173, 1134355, 1162417, 1191112, 1220441, 1250136, 1279622, 1308558, 1337258, 1366218, 1395274, 1423639, 1450862, 1477151, 1502406, 1525363, 1544129, 1557226, 1563723, 1562831, 1554061, 1537573, 1513688, 1482122, 1442375, 1394937, 1341578, 1284364, 1224828, 1164107, 1103268, 1043223, 984752, 928797, 876311, 827610]
62964H27610m5288m2060l8393l4427l1033k8450k5839k2612j9448j7347j6165
62953E06548j4880j3046j1186r773q637p694p401p983q725q745q144p652p368
62940C85314o724n667m899m700m387l464k478k137k238k251k268k593k809k292
62926C36407j381j052j540k210k732l377m083m244l697l026k613k201j670j402
62912C01179j434j169m43o0n70j314j406j084j154j540j409n67K05K86r2m90r01
62895B88037j437j831j712j244j138j853k879l058j855j03Q36N42k56q99j393
62880B69757j688j241N2J182J118K40k07J49N01L23J92P35J499J505O14k40k16
62863B74275M38P47K29m93m30N95J733K079J544O75j4l09j34L76P57M91m48j440
$$ y = [827610, 782322, 740262, 701869, 667442, 636409, 607959, 582120, 559508, 540060, 522713, 506548, 491668, 478622, 467436, 457663, 449026, 441332, 433931, 425948, 417223, 408478, 400334, 392682, 385314, 378590, 372923, 368024, 363324, 358937, 355473, 352995, 350858, 348620, 346369, 344101, 341508, 338699, 336407, 335026, 333974, 332434, 330224, 327492, 324115, 320032, 315788, 312091, 309065, 306452, 304251, 302581, 301179, 299745, 298576, 298133, 298073, 297503, 296189, 294783, 293699, 292545, 291005, 289596, 289029, 289234, 289520, 289428, 288938, 288037, 286600, 284769, 283057, 281813, 280675, 278822, 275943, 272885, 271030, 270927, 271763, 272305, 272049, 271150, 269757, 268069, 266828, 266880, 268062, 269180, 269420, 269213, 269362, 269863, 270186, 270378, 271113, 272612, 274117, 274731, 274491, 274275, 274713, 275460, 275689, 275196, 274766, 275361, 277094, 279173, 280717, 281392, 281378, 281069, 280935, 281311, 282068, 282559, 282111, 280671]
62845B80671j715r74L26J288J319O45K4r3P6J08m3n3M26J470K671L192K476J022
62827B92836O1K56J074J670J859J999K264K576K870L088L111L049L265L780M136
62812C27894M149M296M835N151M681M080M513O090P809R003R918J0919J1985J3097
62798D28420J4377J5650J6657J7804J9945K3226K6783K9991L3156L6656M0181
62787G02846M3389M6730N0880N5707O0367O4171O6862O8283O8335O7047O4306
62776A358923N9640N2717M3920L4064K3606J2527Q98j0825k2026l2199m0986m8221
62764A432038n3918n8085o0705o2060o2782o3155o2590o0294n6454n2272m8703
62753G91020m5647m2461l8896l5189l1640k8467k5889k3932k2148j9959j7365
$$ y = [280671, 278956, 277982, 278308, 279596, 280915, 281560, 281584, 281491, 281567, 281675, 281632, 281579, 282005, 283475, 286146, 289338, 291814, 292836, 292897, 293153, 294227, 295897, 297756, 299755, 302019, 304595, 307465, 310553, 313664, 316713, 319978, 323758, 327894, 332043, 336339, 341174, 346325, 351006, 355086, 359599, 365689, 373498, 382501, 392419, 403338, 415323, 428420, 442797, 458447, 475104, 492908, 512853, 536079, 562862, 592853, 626009, 662665, 702846, 746235, 792965, 843845, 899552, 959919, 1024090, 1090952, 1159235, 1227570, 1294617, 1358923, 1418563, 1471280, 1515200, 1549264, 1572870, 1585397, 1586295, 1575470, 1553444, 1521245, 1480259, 1432038, 1378120, 1320035, 1259330, 1197270, 1134488, 1071333, 1008743, 948449, 891995, 839723, 791020, 745373, 702912, 664016, 628827, 597187, 568720, 542831, 518899, 496751, 476792, 459427]
62742D59427j4995j3320j2071j0651q920p274o036n122m295l443k494j356j13
62729C69337Q89J411J619J871K337L035M048N418O932Q348R797J1624J3791J5779
62715D56236J7219J8373J9810K1865K4540K7772L1411L5114L8549M1873M5685
62704G78447N0312N5175N9120O1406O2262O2341O1824O0236N7034N2077M5484
62693A405718L7347K7772J6986N313o875j8998l0258l9956m7790n3745n7899o0464
62681A177151o1823o2245o1670n9958n7226n3812m9986m5906m1782l7894l4467
62670F10382l1589k9134k6765k4219k1681j9579j7963j6381j4578j2875j1640
62659C83978j0770j0066r581r214q426o987n622n153n287n056m264l620l473l351
$$ y = [459427, 444432, 431112, 419041, 408390, 399470, 392196, 386160, 381038, 376743, 373300, 370806, 369450, 369337, 370226, 371637, 373256, 375127, 377464, 380499, 384547, 389965, 396897, 405245, 415042, 426666, 440457, 456236, 473455, 491828, 511638, 533503, 558043, 585815, 617226, 652340, 690889, 732762, 778447, 828759, 883934, 943054, 1004460, 1066722, 1129063, 1190887, 1251123, 1308157, 1360234, 1405718, 1443065, 1470837, 1487823, 1493136, 1486261, 1467263, 1437005, 1397049, 1349259, 1295514, 1237615, 1177151, 1115328, 1053083, 991413, 931455, 874229, 820417, 770431, 724525, 682743, 644849, 610382, 578793, 549659, 522894, 498675, 476994, 457415, 439452, 423071, 408493, 395618, 383978, 373208, 363142, 353561, 344347, 335921, 328934, 323312, 318159, 312872, 307816, 303552, 299932, 296459, 293108]
62645B93108k922k521k442k368j955j380r67q26j123k097l411m037l353j928p86
62630B60992k42N2L64P54J415K449L365L425K563J578J281J738K471L146L876
62615B89227M870O007O915P470Q069R150J0674J2296J3868J5419J6840J8041J9372
62602D38218K1313K3783K6307K8824L1574L4127L5432L5114L3945L2532L0340
62591G71509K6621K1574J5840R441K157n375j1900j6845k0665k3950k6834k9182
62579G12391l0753l1158l0314k8885k7743k6963k5837k3891k1399j8819j6416
62568D30213j4426j3085j2209j1219r803q273p136o623o683p089p447p384o819
62555C12017n930m868l864l414l845m673m900m087k847k081k097k451k404j411
$$ y = [293108, 290186, 287665, 285223, 282855, 280900, 279520, 278553, 277727, 276604, 274507, 271096, 267059, 263706, 261778, 260992, 260750, 260802, 261166, 261920, 263335, 265784, 269149, 272574, 275137, 276715, 277996, 279734, 282205, 285351, 289227, 294097, 300104, 307019, 314489, 322558, 331708, 342382, 354678, 368546, 383965, 400805, 418846, 438218, 459531, 483314, 509621, 538445, 570019, 604146, 639578, 674692, 708637, 741169, 771509, 798130, 819704, 835544, 844985, 847142, 841767, 829867, 813022, 792357, 768407, 741573, 712391, 681638, 650480, 620166, 591281, 563538, 536575, 510738, 486847, 465448, 446629, 430213, 415787, 402702, 390493, 379274, 369471, 361198, 354062, 347439, 340756, 333667, 326220, 318836, 312017, 306087, 301219, 297355, 293941, 290096, 285423, 280523, 276436, 273589, 271508, 269411, 266960, 264556, 263145]
62541B63145L57J947K471K171K229L347M955O054O427O662P289Q342R636J1093
62527C36125J2778J4776J7081J9485K1713K3651K5459K7372K9539L1950L4303
62516E94232L5917L6119L4809L2471K9552K6042K1670J6297J0095L585k514p837
62504H30438j2735j7717k2544k6396k9036l1090l2811l3262l1499k8164k5061
62493E40123k3159k1796j9967j7661j5530j3808j2241j0838r981r675r216q018
62481C68233o457n420n133m916m262l583l498l772l576k681j744j310j128p70
62467C19983l44j05K16J092K368L333L686L930M579N469O060O148N945N615N110
62452C73085M431L737L085K240R01r74l113n126o651p453p574p388p317p396p238
$$ y = [263145, 263502, 265449, 267920, 270091, 272320, 275667, 280622, 286676, 293103, 299765, 307054, 315396, 325032, 336125, 348903, 363679, 380760, 400245, 421958, 445609, 471068, 498440, 527979, 559929, 594232, 630149, 666268, 701077, 733548, 763100, 789142, 810812, 827109, 837204, 840789, 838275, 830438, 817703, 799986, 777442, 751046, 722010, 690920, 658109, 624847, 593348, 565184, 540123, 516964, 495168, 475201, 457540, 442010, 428202, 415961, 405123, 395142, 385467, 376251, 368233, 361776, 356356, 351223, 346307, 342045, 338462, 334964, 331192, 327616, 324935, 323191, 321881, 320753, 319983, 319639, 319534, 319750, 320842, 323210, 326543, 330229, 334159, 338738, 344207, 350267, 356415, 362360, 367975, 373085, 377516, 381253, 384338, 386578, 387479, 386505, 383392, 378266, 371615, 364162, 356588, 349200, 341883, 334487, 327249]
62437C27249o517n414m468m059m088m121l768k985k092j459j109p40j92L16N25
62422B87078O49J217K430L883M935N257M960M390L898L707L905M492N374O255
62408C42430O706O533O061N860O166O638O733O187N144L914K784J942J496J419
62394D10013J406R60r6j226j598j073l96j76m3P44K174L570M656N916P740R894
62378D42465J2000J4093J6303J8491K0561K2815K5510K8336L0771L2644L3920
62367F97909L4163L2882L0347K7390K4284K0479J5820J1309Q057N822L336k9l655
62354I08114o832r763j3001j6370j9118k0973k2434k3947k5266k5810k5273k3734
62342F75593k1407j8659j6097j4310j3456j3134j2769j2161j1674j1758j2233
$$ y = [327249, 320732, 315318, 310850, 306791, 302703, 298582, 294814, 291829, 289737, 288278, 287169, 286429, 286237, 286553, 287078, 287727, 288944, 291374, 295257, 300192, 305449, 310409, 314799, 318697, 322404, 326309, 330801, 336175, 342430, 349136, 355669, 361730, 367590, 373756, 380394, 387127, 393314, 398458, 402372, 405156, 407098, 408594, 410013, 411419, 412379, 412283, 411057, 409459, 408386, 407990, 407814, 407771, 408515, 410689, 414259, 418915, 424831, 432571, 442465, 454465, 468558, 484861, 503352, 523913, 546728, 572238, 600574, 631345, 663989, 697909, 732072, 764954, 795301, 822691, 846975, 867454, 883274, 894583, 902640, 908462, 911798, 911769, 908114, 901282, 891519, 878518, 862148, 843030, 822057, 799623, 775676, 750410, 724600, 699327, 675593, 654186, 635527, 619430, 605120, 591664, 578530, 565761, 553600, 541926, 530168, 517935]
62331E17935j2259j1243r592q224p441o717n586m156k708j335k42J77m3k10J95
62316D48551Q48J150J128J216J426J390J036O72L82o8p12j212j313j082p18l87
62300D52307k27k22j12K54N96N99M67O89J345K084K673L175L617L910M046M090
62284D79291M091M362N461P432R313J0098J0012J0219J1492J3810J6975K0582
62272F03138K3602K5129K5762K7118K9645L1897L2359L1084K9012K6591K3665
62261I09002K0131J6023J1561P418M283J782j296n257q908j1380j3525j6550k0049
62248H93235k2510k3283k2890k1779k0022j8015j6381j4997j3078j0315p334m888
62236F97743l183j969q19N66J863K198J302K27K24J208K105K510K980L805M573
$$ y = [517935, 505676, 494433, 484841, 476617, 469176, 462459, 456873, 452717, 450009, 448674, 448432, 448609, 448566, 448356, 448551, 449399, 450549, 451677, 452893, 454319, 455709, 456745, 457417, 457799, 457731, 457019, 455807, 454494, 453412, 452694, 452307, 452080, 451858, 451746, 452000, 452596, 453195, 453662, 454351, 455696, 457780, 460453, 463628, 467245, 471155, 475201, 479291, 483382, 487744, 493205, 500637, 509950, 520048, 530060, 540279, 551771, 565581, 582556, 603138, 626740, 651869, 677631, 704749, 734394, 766291, 798650, 829734, 858746, 885337, 909002, 929133, 945156, 956717, 964135, 968418, 970200, 968904, 963647, 954739, 943359, 929834, 913284, 893235, 870725, 847442, 824552, 802773, 782751, 764736, 748355, 733358, 720280, 709965, 702631, 697743, 694560, 692591, 691772, 692338, 694201, 696399, 697701, 697928, 698152, 699360, 701465, 703975, 706955, 710760, 715333]
62221G15333N012N385N773N827N462N098N006N083N401O169O993P062O407O116
62207G96127O756P433P095O130N828O711Q111R295J0182J0974J1654J2081J2247
62194I10624J2305J2448J2742J3016J2978J2571J2140J2105J2576J3315J4004
62183A050824J4591J5466J7259K0156K3424K5863K6859K6786K6333K5673K4431
62172A297665K2245J9185J5716J2353R331O662M452K905J880Q06p11k407l908
62159A386174n374p157q962r966r745q591o939n068l323k098j352o51K33J056
62145A318237J552J673J411P89R6l06m69p32j105j225q98k63N50J344J614J028
62129A323296J34j64J20J18m34p70l66K40L72K01K33M86O53N71N3j080k337k636
$$ y = [715333, 720345, 725730, 731503, 737330, 742792, 747890, 752896, 757979, 763380, 769549, 776542, 783604, 790011, 796127, 802883, 810316, 817411, 823541, 829369, 836080, 844191, 853486, 863668, 874642, 886296, 898377, 910624, 922929, 935377, 948119, 961135, 974113, 986684, 998824, 1010929, 1023505, 1036820, 1050824, 1065415, 1080881, 1098140, 1118296, 1141720, 1167583, 1194442, 1221228, 1247561, 1273234, 1297665, 1319910, 1339095, 1354811, 1367164, 1376495, 1383157, 1387609, 1390514, 1392394, 1393200, 1392489, 1390082, 1386174, 1380800, 1373643, 1364681, 1354715, 1344970, 1336379, 1329440, 1324372, 1321049, 1318951, 1317599, 1316948, 1317181, 1318237, 1319789, 1321462, 1322873, 1323662, 1323758, 1323452, 1322983, 1322251, 1321146, 1319921, 1319023, 1318760, 1319310, 1320654, 1322268, 1323296, 1323430, 1323266, 1323386, 1323504, 1323070, 1322300, 1321934, 1322174, 1322546, 1322747, 1322980, 1323466, 1324119, 1324690, 1324743, 1323663, 1321326, 1318690]
62111A318690j609k67K32r9n45q08r56q08k49K53J72k90n56n13l56j3O29J244
62093A314151J516J676J943J910J333J012J875L449M314M047L622L872M552N175
62079A354447N758O401O891P140P338P324O337L823J35l784p134r557j1155j2416
62065A361548j3776j5201j6480j7796j9508k1423k2861k3574k4011k4589k5181
62054A137148k5415k5050k3997k2432k0912j9788j8592j6646j4272j2590j1992
62043I25462j1681j0980j0213r840r559q904q164p915q100q156p802p184o525
62030H10439o085o176o702o971o488n680n364n674n972n725n009m305m162m878
62016G31248o062o663n893m137k538j721j332q73n54j010k330l709m163l607k927
$$ y = [1318690, 1317081, 1316814, 1317046, 1316947, 1316402, 1315594, 1314638, 1313830, 1313581, 1313834, 1314006, 1313716, 1313160, 1312647, 1312291, 1312278, 1312907, 1314151, 1315667, 1317343, 1319286, 1321196, 1322529, 1323541, 1325416, 1328865, 1333179, 1337226, 1340848, 1344720, 1349272, 1354447, 1360205, 1366606, 1373497, 1380637, 1387975, 1395299, 1401636, 1405459, 1405594, 1401810, 1394676, 1385119, 1373964, 1361548, 1347772, 1332571, 1316091, 1298295, 1278787, 1257364, 1234503, 1210929, 1186918, 1162329, 1137148, 1111733, 1086683, 1062686, 1040254, 1019342, 999554, 980962, 964316, 950044, 937454, 925462, 913781, 902801, 892588, 882748, 873189, 864285, 856121, 848206, 840106, 831950, 824148, 816964, 810439, 804354, 798178, 791476, 784505, 778017, 772337, 766973, 761299, 755327, 749602, 744593, 740288, 736126, 731248, 725186, 718523, 712630, 708493, 705955, 704234, 702902, 702029, 701475, 700465, 698135, 694426, 690263, 686656, 683729]
62001F83729k922l366l504l266l441m528o014o959o941o144n077m394m506m936
61987F17731m626l267j794j092q15j96N72P48M93P51J714K440K360K140K584L420
61971F23163L825L721L821M571N657O570P237P945Q827R699J0332J0740J1070
61958G17178J1279J1222J1153J1808J3610J6024J8108J9616K1018K2534K3733
61947H97283K4363K4945K6119K7731K9190L0548L2600L5684L8888M0947M1741
61936A250039M2439M4033M6266M8322N0201N2729N6401O0845O5641P0951P7028
61925A864895Q3743R1055R9458J09346J20276J31461J42692J54111J65488J76552
61915C139077J87793J99895K12288K23160K31168K36178K38022K35367K26553
$$ y = [683729, 680807, 677441, 673937, 670671, 667230, 662702, 656688, 649729, 642788, 636644, 631567, 627173, 622667, 617731, 613105, 609838, 608044, 606952, 606137, 605941, 606513, 607261, 607754, 608505, 610219, 612659, 615019, 617159, 619743, 623163, 626988, 630709, 634530, 639101, 644758, 651328, 658565, 666510, 675337, 685036, 695368, 706108, 717178, 728457, 739679, 750832, 762640, 776250, 792274, 810382, 829998, 851016, 873550, 897283, 921646, 946591, 972710, 1000441, 1029631, 1060179, 1092779, 1128463, 1167351, 1208298, 1250039, 1292478, 1336511, 1382777, 1431099, 1481300, 1534029, 1590430, 1651275, 1716916, 1787867, 1864895, 1948638, 2039693, 2139151, 2248497, 2368773, 2500234, 2642926, 2797037, 2962525, 3139077, 3326870, 3526765, 3739053, 3962213, 4193381, 4429559, 4667581, 4902948, 5129501]
61906E129501K10911J88657J59969J24964Q4429L9977o425n2661r6493j35872
61896E646957j69390j96308k16370k29850k37440k39792k37355k30931k21927
61887C667594k11620k00417j88236j75359j62412j49751j37467j25775j14892
61878B201665j04655r4905q6133p8988p3142o7434o1323n5464n0485m5890m0774
61867A442472l5154k9914k5650k2186j9162j6527j4248j1999r448o747m418k732
61855A244287j373J25J659K536K308J385N75R7n52j714k846k975j748K24K046
61840A244034L404M636O041P305P843P618P320P537Q050Q182P659O790N989N508
61826A337916N559O302P612R208J0970J2846J4601J6104J7824K0428K3792K6970
$$ y = [5129501, 5340412, 5529069, 5689038, 5814002, 5898431, 5938408, 5931983, 5879322, 5782829, 5646957, 5477567, 5281259, 5064889, 4835039, 4597599, 4357807, 4120452, 3889521, 3667594, 3455974, 3255557, 3067321, 2891962, 2729550, 2579799, 2442332, 2316557, 2201665, 2097010, 2002105, 1915972, 1836984, 1763842, 1696408, 1635085, 1579621, 1529136, 1483246, 1442472, 1407318, 1377404, 1351754, 1329568, 1310406, 1293879, 1279631, 1267632, 1258184, 1251437, 1247019, 1244287, 1242914, 1243039, 1244698, 1247234, 1249542, 1250927, 1251502, 1251599, 1251047, 1249333, 1246487, 1243512, 1241764, 1241988, 1244034, 1247438, 1252074, 1258115, 1265420, 1273263, 1280881, 1288201, 1295738, 1303788, 1311970, 1319629, 1326419, 1332408, 1337916, 1343475, 1349777, 1357389, 1366597, 1377567, 1390413, 1405014, 1421118, 1438942, 1459370, 1483162, 1510132]
61814A510132K9376L1532L4320L7994M2200M6523N0653N4478N8393O3127O8827
61803B027555P4765Q0472Q6579R3864J01901J09621J17111J25796J36672J49265
61793C103601J62593J76451J91245K07195K24302K42692K62373K82804L03240
61784E156496L23496L43886L64365L83828M00291M11550M15755M11645L98366
61775H609678L75046L40522K93716K34442J64087Q5683L313p8792j56955k28257
61765I642483k90407l41685l81025m08128m23507m28507m25029m15005m00015
61756F129175l81447l60753l39232l17520k95627k73564k51866k31510k13356
61747C464300j97525j83216j69340j55631j42883j31847j22186j13021j04177
$$ y = [1510132, 1539508, 1571040, 1605360, 1643354, 1685554, 1732077, 1782730, 1837208, 1895601, 1958728, 2027555, 2102320, 2182792, 2269371, 2363235, 2465136, 2574757, 2691868, 2817664, 2954336, 3103601, 3266194, 3442645, 3633890, 3841085, 4065387, 4308079, 4570452, 4853256, 5156496, 5479992, 5823878, 6188243, 6572071, 6972362, 7383912, 7799667, 8211312, 8609678, 8984724, 9325246, 9618962, 9853404, 10017491, 10103174, 10106487, 10027695, 9870740, 9642483, 9352076, 9010391, 8629366, 8221238, 7797731, 7369224, 6944195, 6529190, 6129175, 5747728, 5386975, 5047743, 4730223, 4434596, 4161032, 3909166, 3677656, 3464300, 3266775, 3083559, 2914219, 2758588, 2615705, 2483858, 2361672, 2248651, 2144474]
61738B144474r6215q9276q2761p6344p0466o5468o0917n6331n1997m8425m5414
61727A400860m2337l9037l5876l3039l0486k8413k7105k6281k5211k3692k2364
61716A067019k1853k1922k1762k0918j9664j8605j8061j7838j7513j6871j6032
61705H55980j5251j4705j4482j4460j4167j3191j1846j1064j1248j1645j1230
61694G12691r948q614p833p597p753q225q775r041q944q676q351q017p894q162
61680E94861q549q622q404q183p860p109o200n843o131o325o001n622n597n485
61666D98930m669l331k191j633j588j915k393k651k576k536k773k910k512j858
61652D63394j549j623j631j439j339j412j398j204j061j102j228j410j705j940
$$ y = [2144474, 2048259, 1958983, 1876222, 1799878, 1729412, 1663944, 1603027, 1546696, 1494699, 1446274, 1400860, 1358523, 1319486, 1283610, 1250571, 1220085, 1191672, 1164567, 1138286, 1113075, 1089383, 1067019, 1045166, 1023244, 1001482, 980564, 960900, 942295, 924234, 906396, 888883, 872012, 855980, 840729, 826024, 811542, 797082, 782915, 769724, 757878, 746814, 735566, 723921, 712691, 702743, 694129, 686296, 678699, 670946, 662721, 653946, 644905, 635961, 627285, 618934, 610917, 603023, 594861, 586312, 577690, 569286, 561103, 553243, 546134, 539934, 534091, 527960, 521635, 515634, 510012, 504415, 498930, 494261, 490930, 488739, 487106, 485518, 483603, 481210, 478559, 475983, 473447, 470674, 467764, 465252, 463394, 461845, 460222, 458591, 457152, 455813, 454401, 453003, 451799, 450738, 449636, 448408, 446998, 445293, 443353]
61638D43353j776j226o71l70k86m21q49j326j356q59l51k43l07j72jl00j155k102
61620D29582k647k701k447k046j618j395j637k310k858k606j531m27q6m38p93
61605D04042p39m59k14j3R6q9n29p97o03k24j03k74m37m18k56R3P67J695K564
61586D04102L109L319L310L219L256L721M808O316P628Q106P694P122P330Q601
61572D81641J0349J1724J2363J2565J2976J4025J5426J6253J5895J4983J4863
61561F33063J5966J7152J7102J5895J4649J3983J3550J3041J2697J2688J2647
61550G92433J2298J2016J2275J2881J3213J2965J2204J0940R259P736P093P242
61538I22555P154N936L788J672K95l19n53q30j410k201k712k410j201M89K083
$$ y = [443353, 441577, 440351, 439680, 439310, 439024, 438603, 437754, 436428, 435072, 434213, 433862, 433619, 433312, 433140, 433139, 432839, 431684, 429582, 426935, 424234, 421787, 419741, 418123, 416728, 415091, 412781, 409923, 407317, 405786, 405359, 405273, 404835, 404042, 403303, 402844, 402630, 402617, 402713, 402624, 402095, 401298, 400695, 400471, 400368, 400094, 399657, 399239, 398983, 399076, 399843, 401538, 404102, 407211, 410530, 413840, 417059, 420315, 424036, 428844, 435160, 442788, 450894, 458588, 465710, 473040, 481641, 491990, 503714, 516077, 528642, 541618, 555643, 571069, 587322, 603217, 618200, 633063, 649029, 666181, 683283, 699178, 713827, 727810, 741360, 754401, 767098, 779786, 792433, 804731, 816747, 829022, 841903, 855116, 868081, 880285, 891225, 900484, 908220, 915313, 922555, 929709, 935645, 939433, 941105, 941400, 941081, 940528, 939698, 938288, 936087, 933375, 930965, 929764, 930253, 932336]
61523I32336L191L783M311N526P785J0490J2630J4071J5856J8915K2863K6582
61511A078339K9718L2886L6426L9804M2675M5875N0642N7039O3858P0058P5724
61500A623044Q1465Q7397R3144R8445J03359J07814J11286J12992J12302J08955
61490B640203J02933R4187Q2568O8136N1516L3755J5851j480j7618l2008m4399
61479B993644n4793o2965o8386p0984p1609p1319p0425o8619o5865o2530n8670
61468B267479n3943m8420m2899l8038l3593k8890k3762j8638j3936r712n757j765
61456A948126K449O694J0550J3843J6707J9013K0291K0621K1053K2472K4408K5728
61444B151955K6354K7317K9164L1157L2426L3108L3839L4644L4865L3958L1880
$$ y = [932336, 935527, 939310, 943621, 949147, 956932, 967422, 980052, 994123, 1009979, 1028894, 1051757, 1078339, 1108057, 1140943, 1177369, 1217173, 1259848, 1305723, 1356365, 1413404, 1477262, 1547320, 1623044, 1704509, 1791906, 1885050, 1983495, 2086854, 2194668, 2305954, 2418946, 2531248, 2640203, 2743136, 2837323, 2919891, 2988027, 3039543, 3073298, 3089149, 3087669, 3070051, 3038043, 2993644, 2938851, 2875886, 2807500, 2736516, 2664907, 2593588, 2523163, 2454544, 2388679, 2326149, 2267479, 2213536, 2165116, 2122217, 2084179, 2050586, 2021696, 1997934, 1979296, 1965360, 1955648, 1949891, 1948126, 1950575, 1957269, 1967819, 1981662, 1998369, 2017382, 2037673, 2058294, 2079347, 2101819, 2126227, 2151955, 2178309, 2205626, 2234790, 2265947, 2298373, 2331481, 2365320, 2399964, 2434829, 2468787, 2500667]
61433B500667K8938K5590K2286J9229J6348J3539J0741P771M490J211j494l603
61421B645713n730q161j0362j1779j2566j3073j3242j3174j3712j5502j7820j9256
61409B491336j9475j9322j9195j8402j6442j3987j1983j0486r019p600o660o211
61397B332554n748m943l954k999k003o65J305M033P326J0720J3969J7500K2201
61384B389296K8553L6075M3702N0735N7384O4368P2117Q0543Q9375R8309J06699
61373C117156J13610J18562J21844J23648J23285J19823J13156J03643R0979P4483
61363D220189N4660L3334J1907r518l0755n0407o7045q0743r2388j02138j09647
61352C777449j15378j20254j24060j25486j24079j21036j17643j13819j08754
$$ y = [2500667, 2529605, 2555195, 2577481, 2596710, 2613058, 2626597, 2637338, 2645109, 2649599, 2650810, 2649316, 2645713, 2639983, 2631822, 2621460, 2609681, 2597115, 2584042, 2570800, 2557626, 2543914, 2528412, 2510592, 2491336, 2471861, 2452539, 2433344, 2414942, 2398500, 2384513, 2372530, 2362044, 2353025, 2345425, 2338765, 2332554, 2326806, 2321863, 2317909, 2314910, 2312907, 2312242, 2313547, 2317580, 2324906, 2335626, 2349595, 2367095, 2389296, 2417849, 2453924, 2497626, 2548361, 2605745, 2670113, 2742230, 2822773, 2912148, 3010457, 3117156, 3230766, 3349328, 3471172, 3594820, 3718105, 3837928, 3951084, 4054727, 4145706, 4220189, 4274849, 4308183, 4320090, 4310572, 4279817, 4229410, 4162365, 4081622, 3989234, 3887096, 3777449, 3662071, 3541817, 3417757, 3292271, 3168192, 3047156, 2929513, 2815694, 2706940]
61343B706940j02269r4918q7240p9544p2138o5236n8744n2385m5945l9298l2538
61332A976685k6101k0377j5020r290l211K224O403J0004J4020J8402K2298K5141
61320B001178K6764K6826K5030K1800J8008J4012R672N309J820k21r32n07R89
61307B149748K903L973L585K538J985K017J938J484J024O48k00j937m182o175
61293B159349p629q947j0656j2795j4880j6427j7508j8618k0014k1417k2343k2570
61281A965545k2084k0902j9107j6872j4283j1365q597p071p630r990j3053j6009
61269A798582j8668k0812k1869k1481k0051j8326j6677j4883j2498r268n386j430
61257A617233K131N429Q966J2873J6714K0210K3697K7589L1691L5480L8925M2657
$$ y = [2706940, 2604671, 2509753, 2422513, 2342969, 2270831, 2205595, 2146851, 2094466, 2048521, 2009223, 1976685, 1950584, 1930207, 1915187, 1905897, 1902686, 1904910, 1911313, 1921317, 1935337, 1953739, 1976037, 2001178, 2027942, 2054768, 2079798, 2101598, 2119606, 2133618, 2143290, 2148599, 2150419, 2150198, 2149266, 2148759, 2149748, 2152651, 2156624, 2160209, 2162747, 2164732, 2166749, 2168687, 2170171, 2171195, 2171843, 2171643, 2169706, 2165524, 2159349, 2151720, 2142773, 2132117, 2119322, 2104442, 2088015, 2070507, 2051889, 2031875, 2010458, 1988115, 1965545, 1943461, 1922559, 1903452, 1886580, 1872297, 1860932, 1852335, 1845264, 1837634, 1827644, 1814591, 1798582, 1779914, 1759102, 1737233, 1715752, 1695701, 1677375, 1660698, 1645815, 1633317, 1624049, 1618663, 1617233, 1619364, 1624793, 1633759, 1646632, 1663346, 1683556, 1707253, 1734842, 1766533, 1802013, 1840938, 1883595]
61245A883595M7244N2628N8147O2816O5559O5618O2978N8189N1594M2873L1682
61234B482923J8607N221p056j7999k8288l8350m7766n5870o2446o7510p0719p1586
61222B039161p0233o7418o3747n9308n4280m9327m5064m1560l8618l6186l3956
61211A479464l1147k7387k3603k1233k0640k0977k1605k2647k3918k4315k3051
61200A218941k0889j9211j8225j6928j4848j2867j2009j2132j2327j2170j1938
61189A055397j1829j1632j1212j0893j1044j1638j2329j2749j2601j1746j0527
61178I27197r679r451r016p359m776k842k556l081k790j108J274L694O093Q199
61164H93799Q953P392L697r68n522r518j2880j5544j7449j8543j8729j7997j6636
$$ y = [1883595, 1930839, 1983467, 2041614, 2104430, 2169989, 2235607, 2298585, 2356774, 2408368, 2451241, 2482923, 2501530, 2506751, 2499695, 2481696, 2453408, 2415058, 2367292, 2311422, 2248976, 2181466, 2110747, 2039161, 1968928, 1901510, 1837763, 1778455, 1724175, 1674848, 1629784, 1588224, 1549606, 1513420, 1479464, 1448317, 1420930, 1397327, 1376094, 1355454, 1334477, 1312872, 1290225, 1266307, 1241992, 1218941, 1198052, 1178841, 1160616, 1143688, 1128840, 1115973, 1103964, 1091832, 1079505, 1067335, 1055397, 1043568, 1031936, 1020724, 1009831, 998787, 987149, 974820, 962071, 949470, 937724, 927197, 917518, 908067, 899051, 891692, 886916, 884074, 881518, 878437, 875647, 874539, 875813, 879507, 885600, 893799, 902752, 910144, 913841, 912873, 907351, 897833, 884953, 869409, 851960, 833417, 814688, 796691, 780055]
61151G80055j5181j4039j3267j2712j2271j1866j1344j0631r968r759j0063j0338
61139F38616r998r101q279p948p877p646p168o579n829m820l746k893k144j029
61125E53559N66K118L058L447L876M750N764O052M902K362q30l951o755r196j0953
61110E58769j1686j1565j1180j0838j0375r671q972q508q194p846p472p114o778
61097D38570o632o948p548p654o721n239m306m372m797m662l761k648j901j565
61083C69816j351j113q98n34L49J705K754K838K421K625L773M948N191M625M045
61068D01194L857L819L638L367L337L839M753N460N373M634L883L340K616J577
61054D54687P14K57l03j316k180k229j859j913k321k285j683j311j635k175k330
$$ y = [780055, 764874, 750835, 737568, 724856, 712585, 700719, 689375, 678744, 668776, 659017, 648954, 638616, 628618, 619517, 611238, 603290, 595413, 587767, 580599, 574020, 568191, 563371, 559625, 556732, 554588, 553559, 554125, 556243, 559301, 562748, 566624, 571374, 577138, 583190, 588092, 590454, 589624, 585673, 578918, 569722, 558769, 547083, 535518, 524338, 513500, 503125, 493454, 484482, 475974, 467780, 459934, 452462, 445348, 438570, 431938, 424990, 417442, 409788, 403067, 397828, 393522, 389150, 384353, 379691, 375930, 373282, 371381, 369816, 368465, 367352, 366454, 365920, 366269, 367974, 370728, 373566, 375987, 378612, 382385, 387333, 392524, 397149, 401194, 405051, 408870, 412508, 415875, 419212, 423051, 427804, 433264, 438637, 443271, 447154, 450494, 453110, 454687, 455401, 455658, 455355, 454039, 451859, 449630, 447771, 445858, 443537, 441252, 439569, 438258, 436623, 434448, 432118]
61039D32118k147j984k035k345k804k944k256q73N79J908L537N576P350Q279Q664
61024D50623R151R787J0185J0359J0952J2695J5827J9915K4258K8673L3884M0825
61012F77134M9700O0351P3326Q9165J05613J16366J14134R5742O4474K8335l345
61001A470995k2739k5846j4250N105K2710L0212K3022J293l0175o3250q9387j03166
60989A204524j04216r6151q3661p0213n7601m6562l7221k9341k2791j7761j4256
60978F24750j1602r106p089o451p041p386o525n398n609p260q860r228q602p875
60964E16718p489p411p547p756p779p501p121o872o686o396o079o018o305o626
60950D19132o439n469m024k810k293k319k422k318j917j019N66K510L989M492
$$ y = [432118, 429971, 427987, 425952, 423607, 420803, 417859, 415603, 414730, 415309, 417217, 420754, 426330, 433680, 441959, 450623, 459774, 469561, 479746, 490105, 501057, 513752, 529579, 549494, 573752, 602425, 636309, 677134, 726834, 787185, 860511, 949676, 1055289, 1171655, 1285789, 1381531, 1446005, 1474340, 1470995, 1448256, 1422410, 1408160, 1413265, 1435975, 1466187, 1489209, 1490502, 1460327, 1397077, 1307690, 1204524, 1100308, 1004157, 920496, 850283, 792682, 746120, 708899, 679558, 656767, 639006, 624750, 613148, 604042, 596953, 590502, 583461, 576075, 569550, 564152, 558543, 551283, 542423, 533195, 524593, 516718, 509229, 501818, 494271, 486515, 478736, 471235, 464114, 457242, 450556, 444160, 438081, 432063, 425758, 419132, 412693, 407224, 403200, 400390, 398097, 395778, 393356, 391038, 389121, 388102, 388668, 391178, 395167, 399659]
60936C99659M427M598N123N195M104K251Q26N23R07J186J142R47M66n17j526j730
60920D27581j218j133k045k974k784j927j745k411k725k008j031o28m39J87Q00
60905D05500L91r52j940j812j382j891l339m511m536l848l472l767m260m464m316
60890C61401l822k834j519n99o20j104r97J14J606K696L271L751M516N564O589
60875C78013P221P441P749Q569R568R931R345Q240O966N341L369J770J259J674
60861D66456K371L129M001M498L861K224P64L08L84L1q98j795k346k771l153l163
60845D73901k750k561l208m396n216n223m810m493m317m134m043m093l842k721
60831D18094q67P75J341Q31r9q57j328j687k003k037j484n17J06k19j116j511
$$ y = [399659, 404086, 408684, 413807, 419002, 423106, 425357, 426183, 426706, 427613, 428799, 429941, 430888, 431354, 430837, 429311, 427581, 426363, 425230, 423185, 420211, 417427, 415500, 413755, 411344, 408619, 406611, 405580, 404952, 404513, 404700, 405500, 405891, 404939, 402999, 401187, 399805, 397914, 394575, 390064, 385528, 381680, 378208, 374441, 370181, 365717, 361401, 357579, 354745, 353226, 352627, 352007, 350903, 349906, 350020, 351626, 354322, 357593, 361344, 365860, 371424, 378013, 385234, 392675, 400424, 408993, 418561, 428492, 437837, 446077, 453043, 458384, 461753, 463523, 464782, 466456, 468827, 471956, 475957, 480455, 484316, 486540, 487304, 487612, 487996, 488027, 487129, 485334, 482988, 480217, 477064, 473901, 471151, 468590, 465382, 460986, 455770, 450547, 445737, 441244, 436927, 432793, 428750, 424657, 420815, 418094, 417227, 418002, 419343, 420174, 420075, 419218, 417890, 416203, 414200, 412163, 410679, 410162, 410268, 410049, 408933, 407422]
60815D07422q53L14J082J145Q17M64L57P14J448J930J511L62n54m89L85J287J696
60798D19038J737J905K480L187L386K734J600O88L50L94M73M87N21O95J033J363
60782D42071J343Q05R4k20pK50N3n46j040j013m84J09K04l44j043j222p91k47
60764D37972J09N29J172J630J497J083R91J164R75K37m26m08J25N01K33p39k217
60747D44428l794m992n539n510n105m492l886l486l195k734k130j780j743j430
60733C94612l90R09J602J526J299J453J960K555K920K602J378j43r41q73r25j838
60717D07706l113l854m055m325m744m808m414m082m093m088l755l365l322l567
60703C52121l779l840l779l520l030k544k256j991j445p16k19p9L6M04Q71J182
$$ y = [407422, 406569, 406883, 407965, 409110, 409927, 410391, 410748, 411462, 412910, 414840, 416351, 416713, 416159, 415670, 416055, 417342, 419038, 420775, 422680, 425160, 428347, 431733, 434467, 436067, 436755, 437105, 437499, 437972, 438459, 438980, 439675, 440708, 442071, 443414, 444219, 444313, 444093, 444086, 444336, 444389, 443843, 442803, 441790, 441306, 441415, 441619, 441275, 440232, 439010, 438219, 437972, 438081, 438610, 439782, 441412, 442909, 443992, 444983, 446147, 447122, 447359, 446933, 446525, 446650, 447151, 447384, 446645, 444428, 440634, 435642, 430103, 424593, 419488, 414996, 411110, 407624, 404429, 401695, 399565, 397785, 396042, 394612, 394222, 395131, 396733, 398259, 399558, 401011, 402971, 405526, 408446, 411048, 412426, 412283, 411342, 410469, 409544, 407706, 404593, 400739, 396684, 392359, 387615, 382807, 378393, 374311, 370218, 366130, 362375, 359010, 355688, 352121, 348342, 344502, 340723, 337203, 334173, 331629, 329373, 327382, 325937, 325221, 325002, 324923, 324959, 325363, 326234, 327416]
60687C27416J408J805K309K569K471K308K356K476K415K238K177K152J888J535
60673C57523J736K773M022M574M204L505L145L362M003M762N388N884O529P471
60659D18881Q405Q873Q799Q427P861P031O085N405N092M744L839K176o1k327l836
60644D89394m086l488l096l507m253m507m065l410l014k912k834k555k132j870
60630D43665j969k254k414k469k618k698k308j585j223j430j454o37N65J175R83
60615D23329N92N32R21J747K705K949J840Kj218j409j379j701j861j387q75j091
60599D23696j665j572o23M09J026J440J743J453M05o00n82L73J144Q60k71j395
60583D25841j981k095j911j301j16J210J724R14n01j116l25R81J439P43j57l33
$$ y = [327416, 328824, 330629, 332938, 335507, 337978, 340286, 342642, 345118, 347533, 349771, 351948, 354100, 355988, 357523, 359259, 362032, 366054, 370628, 374832, 378337, 381482, 384844, 388847, 393609, 398997, 404881, 411410, 418881, 427286, 436159, 444958, 453385, 461246, 468277, 474362, 479767, 484859, 489603, 493442, 495618, 495557, 493230, 489394, 485308, 481820, 478724, 475217, 470964, 466457, 462392, 458982, 455968, 453056, 450222, 447667, 445535, 443665, 441696, 439442, 437028, 434559, 431941, 429243, 426935, 425350, 424127, 422697, 421243, 420606, 421171, 422346, 423329, 423921, 424453, 425374, 427121, 429826, 432775, 434615, 434617, 433399, 431990, 430611, 428910, 427049, 425662, 424787, 423696, 422031, 420459, 419836, 420245, 421271, 422711, 424454, 425907, 426312, 425712, 425130, 425503, 426647, 427507, 427236, 425841, 423860, 421765, 419854, 418553, 418437, 419647, 421371, 422285, 421784, 420668, 420343, 421324, 422763, 423506, 423349, 423016]
60567D23016O8K47q7l96j13O43J243J306R95P47Q87J458K284L181M130N216O386
60550D51211P426Q309R378J1028J3223J5639J8113K0805K3809K6963L0029L2778
60538F68711L4686L4872L2610K7908K1336J3457M678m388j2717j9270k3490k5353
60526G53040k5205k3634k1420j9238j7338j5578j3741j1732r542p189m795k523
60514E81105l87J816M291P110J0257J3629J6880J9657K2208K5377K9449L3189
60502G64581L4608L2711K8005K1411J3433M709l471r814j3861j5674j5168j2349
60490H29121p889k667L135R808J7117K4353L1405L8993M7498N6349O4932P3626
60478A185781Q3369R4553J06667J18648J29012J35775J36656J29483J12664Q5895
$$ y = [423016, 423084, 423331, 423244, 422848, 422735, 423378, 424621, 425927, 426922, 427669, 428556, 430014, 432298, 435479, 439609, 444825, 451211, 458637, 466946, 476324, 487352, 500575, 516214, 534327, 555132, 578941, 605904, 635933, 668711, 703397, 738269, 770879, 798787, 820123, 833580, 838258, 833870, 821153, 801883, 778393, 753040, 727835, 704201, 682781, 663543, 646205, 630627, 616886, 605154, 595612, 588423, 583628, 581105, 580718, 582534, 586825, 593935, 604192, 617821, 634701, 654358, 676566, 701943, 731392, 764581, 799189, 831900, 859905, 881316, 894749, 899458, 895987, 886173, 872312, 856638, 841470, 829121, 821232, 818565, 821700, 831508, 848625, 872978, 904383, 943376, 990874, 1047223, 1112155, 1185781, 1269150, 1363703, 1470370, 1589018, 1718030, 1853805, 1990461, 2119944, 2232608, 2318503]
60468B318503N0885J1054k9851o8670j02423j28042j43598j49603j48278j41557
60458A468420j30558j16794j02601q9757p8414o8061n8896n1447m5245l9081l2647
60447F54919k7101k3573k1716k0191j8179j5836j3591j1606r991q891q207p613
60435D68424p010o604o337n685m473l391l180l488l272k272j428j535k198k458
60421D15093k065j532j225r51m03L92J097J332R42K86J52J028K479L570L897L885
60405D27977M067M470M910N469O322P301P993Q197P959P234N850L981K336J584
60391E05650J649J797J471Q29M05M26O76R15J146J402J551J477J340J436J763
60376E23933J967J785J394J197J313J485J507J534J777K089K113J809J457J075
$$ y = [2318503, 2369388, 2380442, 2350591, 2281921, 2179498, 2051456, 1907858, 1758255, 1609977, 1468420, 1337862, 1221068, 1118467, 1028710, 950296, 882235, 823339, 771892, 726647, 687566, 654919, 627818, 604245, 582529, 562338, 544159, 528323, 514732, 503126, 493135, 484244, 476037, 468424, 461414, 454810, 448473, 442788, 438315, 434924, 431744, 428256, 424984, 422712, 421284, 419749, 417551, 415093, 413028, 411496, 410271, 409320, 408917, 409309, 410406, 411738, 412680, 412966, 413118, 414146, 416625, 420195, 424092, 427977, 432044, 436514, 441424, 446893, 453215, 460516, 468509, 476706, 484665, 491899, 497749, 501730, 504066, 505650, 507299, 509096, 510567, 511396, 511801, 512227, 512903, 513818, 514964, 516366, 517917, 519394, 520734, 522170, 523933, 525900, 527685, 529079, 530276, 531589, 533074, 534581, 536115, 537892, 539981, 542094, 543903, 545360, 546435]
60362E46435L37p04j263o90N55J375J337R25N36Mp38j256j276j194j401j524r73
60345E40485R2Q65R22O04M32N53Q40J210J693K233K475J823Q5j915k858k402j641
60328E45496j769k727l663m212m555m622m146l410l004k763j952n76L25R6o40
60313E07878r19o19k29j9n1m78j279j985k219k282k722l570m350m612m115k838
60297D75591j273m32r17k099k693k148j147p26j216j978k013q84P75J868K032
60282D62740J886K009K271K490L052M111M861M467L422K910L030K765J817J269
60268E03100K018L498M564M887M847M675M465M612N432O533P145P040O644O362
60254E75822O257O277O405O532O654P154Q507J0576J2501J3474J3514J3446J4139
$$ y = [546435, 546772, 546068, 544805, 544115, 544670, 546045, 547382, 548307, 548843, 548847, 548109, 546853, 545577, 544383, 542982, 541458, 540485, 540577, 541442, 542364, 542968, 543400, 543953, 544793, 546003, 547696, 549929, 552404, 554227, 554312, 552397, 549539, 547137, 545496, 543727, 541000, 537337, 533125, 528570, 523948, 519802, 516392, 513388, 510625, 508673, 508097, 508422, 508518, 507878, 506959, 506340, 506111, 506092, 506041, 505563, 504284, 502299, 500080, 497798, 495076, 491506, 487156, 482544, 478429, 475591, 474318, 473886, 472969, 470870, 468177, 466029, 464882, 464156, 462940, 460962, 458949, 458065, 458840, 460708, 462740, 464626, 466635, 468906, 471396, 474448, 478559, 483420, 487887, 491309, 494219, 497249, 500014, 501831, 503100, 505118, 508616, 513180, 518067, 522914, 527589, 532054, 536666, 542098, 548631, 555776, 562816, 569460, 575822, 582079, 588356, 594761, 601293, 607947, 615101, 623608, 634184, 646685, 660159, 673673, 687119, 701258]
60241G01258J5847J8090K0243K2176K4278K6861K9814L2865L5897L8907M1995
60230A008231M5599N0313N6060O1788O6475P0220P3843P7552Q0572Q2106Q1993
60219A754752Q0419P7474P3195O7544O0205N0999M0688L0766K2027J3778M996
60208B276843m207j2780k0061k6157l1087l4370l5615l4998l2880k9323k4277
60197A991088j7966j0855l404M115J1747J9890K8942L8742M8668N8294O7641P6664
60185B313566Q4760R1077R4936R5813R3348Q7803Q0096P0872N9784M6342L1278
60174C149675J6210J852j2584k7831m2976n6148o6344p3971p9663q3166q3598
60163B641456q0448p4150o5836n6580m6746l6001k4025j1143J858J4425K6485
$$ y = [701258, 717105, 735195, 755438, 777614, 801892, 828753, 858567, 891432, 927329, 966236, 1008231, 1053830, 1104143, 1160203, 1221991, 1288466, 1358686, 1432529, 1510081, 1590653, 1672759, 1754752, 1835171, 1912645, 1985840, 2053384, 2113589, 2164588, 2205276, 2236042, 2258069, 2271847, 2276843, 2272636, 2259856, 2239795, 2213638, 2182551, 2148181, 2112566, 2077568, 2044688, 2015365, 1991088, 1973122, 1962267, 1958863, 1962978, 1974725, 1994615, 2023557, 2062299, 2110967, 2169261, 2236902, 2313566, 2398326, 2489403, 2584339, 2680152, 2773500, 2861303, 2941399, 3012271, 3072055, 3118397, 3149675, 3165885, 3167737, 3155153, 3127322, 3084346, 3028198, 2961854, 2887883, 2808220, 2725054, 2641456, 2561008, 2486858, 2421022, 2364442, 2317696, 2281695, 2257670, 2246527, 2248385, 2262810, 2289295]
60152B289295L8025M8613N7376O3320O5776O4766O0994N5274M7972L9165K9302
60141B859878J9309R833P24q395j7070k3985k8137k9787k9998k9267k6903k1808
60129B674394j3672l288Q159J9885L1751M4047N7116P0989Q5301R9725J14317
60118C188724J29267J44296J58792J72645J86320J99748K11572K20059K24461
60109D835884K24987K21700K14167K02155J85942J65839J41989J14947Q5818N5526
60099F448954K4441p036l7972o7453r5127j20729j43358j61793j75376j84146
60089E480405j88312j88151j84289j77528j68295j56644j42838j27429j10770
60080D036149r2917p4211n5620l8142k2183p672N385J6815K6541L4670M1250M6124
$$ y = [2289295, 2327320, 2375933, 2433309, 2496629, 2562405, 2627171, 2688165, 2743439, 2791411, 2830576, 2859878, 2879187, 2889020, 2889744, 2881349, 2864279, 2840294, 2812157, 2782370, 2752372, 2723105, 2696202, 2674394, 2660722, 2657434, 2665593, 2685478, 2717229, 2761276, 2818392, 2889381, 2974682, 3074407, 3188724, 3317991, 3462287, 3621079, 3793724, 3980044, 4179792, 4391364, 4611423, 4835884, 5060871, 5282571, 5496738, 5698893, 5884835, 6050674, 6192663, 6307610, 6393428, 6448954, 6473395, 6466359, 6428387, 6360934, 6265807, 6145078, 6001720, 5839927, 5664551, 5480405, 5292093, 5103942, 4919653, 4742125, 4573830, 4417186, 4274348, 4146919, 4036149, 3943232, 3869021, 3813401, 3775259, 3753076, 3745404, 3750789, 3767604, 3794145, 3828815, 3870065, 3916189]
60068C916189M9040M9812M8289M4304L7766K8882J8232O539n591j7655k9196m0053
60056D106558n0614o1362p1939q1111q7917r2563r5805r7794r8077r6468r3187
60045C179721q8204q1144p2097o1880n1265m0328k8805j6637l875R459K3086L6396
60033B804427M9024O1171P2930Q3637R2322R8549J02323J03371J01061R4979Q5179
60022C748973P2002N6115L8642K0750K892j5166l3532n1696o8821q4068r6667
60011C589424j06042j12010j14569j13495j08672j00807r1240q0784o9332n6837
60001B635636m4111l2117k0846r541K248J4369K6656L9176N1865O4506P7165R0166
59989B895172J03431J16168J27333J35944J40796J40503J34364J23128J08485
$$ y = [3916189, 3965229, 4015041, 4063330, 4107634, 4145400, 4174282, 4192514, 4199053, 4193462, 4175807, 4146611, 4106558, 4055944, 3994582, 3922643, 3841532, 3753615, 3661052, 3565247, 3467453, 3369376, 3272908, 3179721, 3091517, 3010373, 2938276, 2876396, 2825131, 2784803, 2755998, 2739361, 2735486, 2744945, 2768031, 2804427, 2853451, 2914622, 2987552, 3071189, 3163511, 3262060, 3364383, 3467754, 3568815, 3663794, 3748973, 3820975, 3877090, 3915732, 3936482, 3939374, 3924208, 3890676, 3838980, 3770159, 3686091, 3589424, 3483382, 3371372, 3256803, 3143308, 3034636, 2933829, 2842589, 2761805, 2692473, 2635636, 2591525, 2559408, 2538562, 2529021, 2531269, 2545638, 2572294, 2611470, 2663335, 2727841, 2805006, 2895172, 2998603, 3114771, 3242104, 3378048, 3518844, 3659347, 3793711, 3916839, 4025324]
59980D025324R1854P3903N4996L5531J5706m665k5703m6853o6930q4738r9524
59969C968901j10811j18009j20527j18315j12175j03196r1934p8391o2937m6896
59959C005710l1798j8065m903Q429K1569L3637M4484N4824O5063P4504Q1921Q6614
59947C421989Q8556Q7883Q4716P9423P2564O4445N5087M4754L4238K4302J5210
59936D073167O956k16n828r499j0908r590n174K188J2001K3987L8175N4314P1654
59923D241227Q9470J07512J25707J43665J60783J76534J90330K01231K08152K10311
59913E854922K07240J98396J83193J61450J33587J00321O2564K1821j9629n9290
59903F844575r5258j26353j51728j70750j83338j90056j91605j88276j80194j67971
$$ y = [4025324, 4117178, 4191081, 4246077, 4281608, 4297314, 4292649, 4266946, 4220093, 4153163, 4068425, 3968901, 3858090, 3740081, 3619554, 3501239, 3389064, 3285868, 3193934, 3115543, 3052606, 3005710, 2973912, 2955847, 2950944, 2959373, 2980942, 3014579, 3059063, 3113887, 3178950, 3253454, 3335375, 3421989, 3510545, 3598428, 3683144, 3762567, 3835131, 3899576, 3954663, 3999417, 4033655, 4057957, 4073167, 4080123, 4079907, 4074079, 4064580, 4053672, 4044082, 4038908, 4041096, 4053097, 4077084, 4115259, 4169573, 4241227, 4330697, 4438209, 4563916, 4707581, 4868364, 5044898, 5235228, 5436459, 5644611, 5854922, 6062162, 6260558, 6443751, 6605201, 6738788, 6839109, 6901673, 6923494, 6903865, 6844575, 6749317, 6622964, 6471236, 6300486, 6117148, 5927092, 5735487, 5547211, 5367017, 5199046]
59893E199046j52892j36322j19071j01429q3552o5586m7644k9928j2843L421J9335
59882D472535L5518N1546O5802P7004Q5529R2591R8157J00409R7458Q9057P6396
59871E342002O0634M2230K1447j016k4081m6636o7851q7309j04882j20327j33072
59860D881139j42582j48939j52688j54063j52695j48308j41451j33220j24383
59851C582810j15034j05110r4912q5035p6060o8458o2545n8262n5077n2301m9591
59840B760425m6924m4223m1218l7927l4933l2951l2042l1499l0596k9279k8002
59829B370831k6976k5821k3998k1385j8259j4795j0924o709k498J493N548R969
59817B236476J4421J8176K1056K3643K6386K8972L0784L1633L1499L0041K6914
$$ y = [5199046, 5046154, 4909832, 4790761, 4689332, 4605780, 4540194, 4492550, 4462622, 4449779, 4453200, 4472535, 4508053, 4559599, 4625401, 4702405, 4787934, 4880525, 4978682, 5079091, 5176549, 5265606, 5342002, 5402636, 5444866, 5466313, 5465297, 5441216, 5394580, 5326729, 5239420, 5134538, 5014211, 4881139, 4738557, 4589618, 4436930, 4282867, 4130172, 3981864, 3840413, 3707193, 3582810, 3467776, 3362666, 3267754, 3182719, 3106659, 3038201, 2975656, 2917394, 2862317, 2810016, 2760425, 2713501, 2669278, 2628060, 2590133, 2555200, 2522249, 2490207, 2458708, 2428112, 2398833, 2370831, 2343855, 2318034, 2294036, 2272651, 2254392, 2239597, 2228673, 2221964, 2219466, 2220959, 2226507, 2236476, 2250897, 2269073, 2290129, 2313772, 2340158, 2369130, 2399914, 2431547, 2463046, 2493087, 2520001]
59806B520001K2526J7878J3627R754O250L556K085J794K571M678Q435J3674J9983
59793B646812K7371L6281M6946N9106P2487Q7278J03931J22625J43130J65157
59783C511124J88633K13215K37321K57479K68714K65763K44379K02468J41243
59774E530339O5928j4894r1486j55534k01793k28587k37440k32101k17064j96349
59764D021019j73016j49187j26066j04120q3620o5065m8858l4714k1743r263K630
59753C207997J3436K2955L1489L9402M6808N3952O1581P0503Q0462R0115R8715
59742C817415J07479J18418J31815J45927J59515J73551J89669K07849K26877
59733E278515K46526K67801K90960L14664L37396L58647L78096L94475M05925
$$ y = [2520001, 2542527, 2560405, 2574032, 2583786, 2590036, 2593592, 2595677, 2597471, 2600042, 2604720, 2613155, 2626829, 2646812, 2674183, 2710464, 2757410, 2816516, 2889003, 2976281, 3080212, 3202837, 3345967, 3511124, 3699757, 3912972, 4150293, 4407772, 4676486, 4942249, 5186628, 5389096, 5530339, 5596267, 5581373, 5489887, 5334353, 5132560, 4903973, 4666533, 4434432, 4217368, 4021019, 3848003, 3698816, 3572750, 3468630, 3385010, 3319945, 3271087, 3236373, 3214630, 3205367, 3207997, 3221433, 3244388, 3275877, 3315279, 3362087, 3416039, 3477620, 3548123, 3628585, 3718700, 3817415, 3924894, 4043312, 4175127, 4321054, 4480569, 4654120, 4843789, 5051638, 5278515, 5525041, 5792842, 6083802, 6398466, 6735862, 7094509, 7472605, 7867080, 8273005]
59724H273005M10900M08150L96589L76002L47774L14335K78235K42092K08929
59715A1256011J81580J61680J49514J44570J45596J50496J57005J63695J69845
59706A2679992J74386J75720J72723J65424J54447J40351J23758J05644Q6961
59697A3979406O8182M9742L2781J9112J0301O975R001J6132K8338M5633O7766
59686A4333369R4194J24362J57751J93621K30832K68108L04455L39042L70719
59677A6416453L97741M17956M29159M29315M16751L90272L49077K92758K21678
59668A9761160J37575M3799n4986j53407k46160l28859l98341m52217m88462n06150
59658A7313952n06741m94306m74383m52942m36355m31157m42266m70500n11554
$$ y = [8273005, 8683905, 9092055, 9488644, 9864646, 10212420, 10526755, 10804990, 11047082, 11256011, 11437591, 11599271, 11748785, 11893355, 12038951, 12189447, 12346452, 12510147, 12679992, 12854378, 13030098, 13202821, 13368245, 13522692, 13663043, 13786801, 13892445, 13979406, 14047588, 14097330, 14130111, 14149223, 14159524, 14166499, 14175500, 14191632, 14219970, 14265603, 14333369, 14427563, 14551925, 14709676, 14903297, 15134129, 15402237, 15706692, 16045734, 16416453, 16814194, 17232150, 17661309, 18090624, 18507375, 18897647, 19246724, 19539482, 19761160, 19898735, 19942534, 19887548, 19734141, 19487981, 19159122, 18760781, 18308564, 17820102, 17313952, 16807211, 16312905, 15838522, 15385580, 14949225, 14518068, 14075802, 13605302, 13093748]
59649A3093748n57174n97706o24867o34109o25578o02928n70813n33044m92441
59640G855088m51398m11913l75149l41416l10629k82591k57061k33853k12983
59631D978095j94424j77701j62053j47134j33195j20426j08440r6805q5787p6080
59621C676050o7852o0532n3599m7210m1916l8111l5924l5195l5357l5646l5742
59610C188966l6068l7204l9236m1844m4686m7412m9504n0491n0306m9176m7334
59599B695705m5012m2474l9723l6458l2649k8877k5635k2613j9224j5625j2445
59588B374970r656o516k831P10L641O426R489J2345J4365J5919J7933K0610K3295
59575B480700K5461K7177K8667L0092L1847L4443L7924M1790M5737N0078N5181
$$ y = [13093748, 12536574, 11938868, 11314001, 10679892, 10054314, 9451386, 8880573, 8347529, 7855088, 7403690, 6991777, 6616628, 6275212, 5964583, 5681992, 5424931, 5191078, 4978095, 4783671, 4605970, 4443917, 4296783, 4163588, 4043162, 3934722, 3837917, 3752130, 3676050, 3608198, 3547666, 3494067, 3446857, 3404941, 3366830, 3330906, 3295711, 3260354, 3224708, 3188966, 3152898, 3115694, 3076458, 3034614, 2989928, 2942516, 2893012, 2842521, 2792215, 2743039, 2695705, 2650693, 2608219, 2568496, 2532038, 2499389, 2470512, 2444877, 2422264, 2403040, 2387415, 2374970, 2365314, 2358798, 2355967, 2356677, 2360318, 2366744, 2376233, 2388578, 2402943, 2418862, 2436795, 2457405, 2480700, 2506161, 2533338, 2562005, 2592097, 2623944, 2658387, 2696311, 2738101, 2783838, 2833916, 2889097]
59564B889097O0896O6753P2575P8545Q4823R1346R7988J04673J11254J17394J22728
59553C898072J27139J30799J33791J35725J35724J32664J25401J13118R6068P6221
59543E104722N6677L9900K6350J4758L496q399k0950l3448m4943n4902o3458p0805
59531D948998p6582q0081q0985p9555p6210p1156o4337n5410m3970l0140j4850
59520D275722J020J7710L6264N6984P8757J00039J20141J39179J57166J73426
59510E156408J86667J95248J97507J92238J79042J58199J30351R6380N7548J5616
59500F565204k7220o8668j06784j40149j67631j88242k01461k07524k07054k00629
59490E049842j89042j73716j56231j37446j17664r7513p7897n9013m0376k2088
$$ y = [2889097, 2949993, 3016746, 3089321, 3167866, 3252689, 3344035, 3442023, 3546696, 3657950, 3775344, 3898072, 4025211, 4156010, 4289801, 4425526, 4561250, 4693914, 4819315, 4932433, 5028501, 5104722, 5161399, 5201299, 5227649, 5242407, 5245903, 5237504, 5216554, 5183106, 5138163, 5083261, 5019803, 4948998, 4872416, 4792335, 4711350, 4631795, 4555585, 4484429, 4420092, 4364682, 4320712, 4290572, 4275722, 4276742, 4294452, 4330716, 4387700, 4466457, 4566496, 4686637, 4825816, 4982982, 5156408, 5343075, 5538323, 5735830, 5928068, 6107110, 6265309, 6395660, 6492040, 6549588, 6565204, 6537984, 6469316, 6362532, 6222383, 6054752, 5866510, 5665049, 5457525, 5250471, 5049842, 4860800, 4687084, 4530853, 4393407, 4275743, 4178230, 4100333, 4041320, 4000944, 3978856]
59480C978856n216R612K3085L5946M7569N6708O3061O7070O8566O6723O1275N2793
59468D526048M1710K8066J2312m574k2012m0030n8271p5624r1250j05152j17252
59457D093971j26723j32888j36187j37474j36924j34432j30639j26564j22303
59448B909837j17007j10253j02753r5456q8558q1736p4892o8264o2043n6252n0843
59437B001780m5680m0506l5184k9993k5436k1655j8111j4046r327m603n08L171
59425A759902P150J1566J5455J7380J6278J1910N137k000p082q814p640m698n62
59412A813982M633J0316J5412J8924K0068J8169J3321P184K309L52J294M376R060
59399A939400J4881K1091K7057L2710L8258M3766M9221N4702O0169O5418P0513
$$ y = [3978856, 3973640, 3983252, 4006337, 4042283, 4089852, 4146560, 4209621, 4276691, 4345257, 4411980, 4473255, 4526048, 4567758, 4595824, 4608136, 4603562, 4581550, 4541520, 4483249, 4407625, 4316375, 4211223, 4093971, 3967248, 3834360, 3698173, 3560699, 3423775, 3289343, 3158704, 3032140, 2909837, 2792830, 2682577, 2579824, 2484368, 2395810, 2314074, 2239182, 2170918, 2108875, 2052623, 2001780, 1956100, 1915594, 1880410, 1850417, 1824981, 1803326, 1785215, 1771169, 1761842, 1757239, 1756731, 1759902, 1767052, 1778618, 1794073, 1811453, 1827731, 1839641, 1844778, 1842778, 1835696, 1826882, 1819242, 1814544, 1813982, 1818615, 1828931, 1844343, 1863267, 1883335, 1901504, 1914825, 1922009, 1924318, 1924670, 1925964, 1930340, 1939400, 1954281, 1975372, 2002429, 2035139, 2073397, 2117163, 2166384, 2221086, 2281255, 2346673, 2417186]
59388B417186P5939Q2010Q8506R5248J02636J11126J20441J29934J39622J50298
59378C512946J62642J76697J92351K09789K29217K50484K73205K97080L21775
59369E626186L46558L70200L91238M08287M20102M25508M23482M13502L95944
59360I221007L71994L43171L10826K75967K39329K01508J63112J24643Q5997M6190
59350A1383744M091m0531q6984j34688j83598k33266k82045l27676l68233m02036
59340I328778m27165m42066m46692m42465m31096m13892l92166l67588l41752
59331E623896l15651k89686k63969k38754k14842j93425j75065j58923j43598
59322C629983j28768j15358j04027r4211q4921p5926o7690o0694n5150n0967m7565
$$ y = [2417186, 2493125, 2575135, 2663641, 2758889, 2861525, 2972651, 3093092, 3223026, 3362648, 3512946, 3675588, 3852285, 4044636, 4254425, 4483642, 4734126, 5007331, 5304411, 5626186, 5972744, 6342944, 6734182, 7142469, 7562571, 7988079, 8411561, 8825063, 9221007, 9593001, 9936172, 10246998, 10522965, 10762294, 10963802, 11126914, 11251557, 11337554, 11383744, 11387835, 11347304, 11260320, 11125632, 10942034, 10708768, 10426723, 10099047, 9730814, 9328778, 8901613, 8459547, 8012855, 7570390, 7139294, 6725402, 6333236, 5965648, 5623896, 5308245, 5018559, 4754590, 4515836, 4300994, 4107569, 3932504, 3773581, 3629983, 3501215, 3385857, 3281830, 3187619, 3102698, 3026772, 2959082, 2898388, 2843238, 2792271, 2744706]
59311B744706m4083m0198l6508l3685l1551k9358k6715k3827k0984j8277j5714
59300B423806j3252j0718p992n171k303Q64M562Q600J2545J6263J9948K3732K7527
59287B498411L1140L4398L7224L9776M2317M4646M5920M5344M2861L8856L3480
59276B934373K6684J8682R871M39r466j9236k8073l5770m2735m9132n4543n8566
59264B692528o1264o2855o3431o3173o2375o1025n8804n5799n2715n0031m7354
59253B053702m4095m0398l6820l3280k9066k3956j8697j4162j0408o874l178O17
59241A793385M354Q015J1606J5135J8769K2775K7185L1681L5964M0122M4506M9377
59229B102874N4910O1339O8778P6938Q5467R4608J05116J17325J30737J44804
$$ y = [2744706, 2700623, 2660425, 2623917, 2590232, 2558681, 2529323, 2502608, 2478781, 2457797, 2439520, 2423806, 2410554, 2399836, 2391844, 2386673, 2384370, 2385234, 2389796, 2398396, 2410941, 2427204, 2447152, 2470884, 2498411, 2529551, 2563949, 2601173, 2640949, 2683266, 2727912, 2773832, 2819176, 2862037, 2900893, 2934373, 2961057, 2979739, 2989610, 2990049, 2980583, 2961347, 2933274, 2897504, 2854769, 2805637, 2751094, 2692528, 2631264, 2568409, 2504978, 2441805, 2379430, 2318405, 2259601, 2203802, 2151087, 2101056, 2053702, 2009607, 1969209, 1932389, 1899109, 1870043, 1846087, 1827390, 1813228, 1802820, 1795946, 1792768, 1793385, 1797739, 1805754, 1817360, 1832495, 1851264, 1874039, 1901224, 1932905, 1968869, 2008991, 2053497, 2102874, 2157784, 2219123, 2287901, 2364839, 2450306, 2544914, 2650030, 2767355, 2898092, 3042896]
59219C042896J59618J75430J91890K08333K24521K40289K54606K65689K72145
59210E035417K73246K67922K54437K31682K00300J61864J17416O7479J3438m1912
59200F581289r5365j44463j87594k23474k50957k69344k78764k80234k75294k65454
59190D310346k51927k35850k18457k00700j82903j65129j47936j32449j19352
59181B655643j08071r7289q6274p5521o6038n8229n1661m5728m0230l5305l1128
59170A960169k7838k5445k3580k1609j9366j7578j7103j7785j8549j8642j8229
59159A734445j7667j6868j5802j5066j5319j6378j7441j8042j8223j7975j7193
59148A548471j6252j5913j6342j6790j6591j6081j5934j6021j5562j4367j3193
$$ y = [3042896, 3202514, 3377944, 3569834, 3778167, 4002688, 4242977, 4497583, 4763272, 5035417, 5308663, 5576585, 5831022, 6062704, 6263004, 6424868, 6542284, 6609763, 6623201, 6581289, 6485924, 6341461, 6153867, 5930393, 5679436, 5410092, 5131328, 4851094, 4575800, 4310346, 4058419, 3822569, 3604112, 3403412, 3220509, 3055380, 2907444, 2774995, 2655643, 2547572, 2450283, 2364009, 2288488, 2222450, 2164221, 2112560, 2066832, 2026602, 1991297, 1960169, 1932331, 1906886, 1883306, 1861697, 1842331, 1824753, 1807650, 1789865, 1771316, 1752674, 1734445, 1716778, 1699910, 1684108, 1669042, 1653723, 1637345, 1619904, 1601862, 1583639, 1565664, 1548471, 1532219, 1516306, 1499964, 1483174, 1466583, 1450502, 1434568, 1418547, 1402985, 1388618, 1375425]
59137A375425j2648j2361j1606j0370r206q289p268o069n169m765m229k875r29
59124A279641Q07K104L501N469P869J0319J2575J4375J5482J6100J6842J7976
59112A403060J9045J9524J9428J9040J8469J7840J7562J7854J8350J8667J9024
59101A607863J9769K0653K1292K2138K4094K7196L0547L3632L6743L9887M2358
59090A926172M3943M5526M7547M8731M7552M4491M1478L9142L5918L0298K2690
59079B373488J4461O058k847j2043k0805k8994l7069m4833n1111n5170n7696n9804
59067B023635o1597o2336o1720o0221n8248n5727n2673m9614m7018m4739m2346
59056A427396l9751l7155l4608l2031k9569k7414k5356k2914k0081j7525j5781
$$ y = [1375425, 1362777, 1350416, 1338810, 1328440, 1319234, 1310945, 1303677, 1297608, 1292439, 1287674, 1283445, 1280570, 1279641, 1280448, 1282552, 1286053, 1291522, 1299391, 1309710, 1322285, 1336660, 1352142, 1368242, 1385084, 1403060, 1422105, 1441629, 1461057, 1480097, 1498566, 1516406, 1533968, 1551822, 1570172, 1588839, 1607863, 1627632, 1648285, 1669577, 1691715, 1715809, 1743005, 1773552, 1807184, 1843927, 1883814, 1926172, 1970115, 2015641, 2063188, 2111919, 2159471, 2203962, 2245440, 2284582, 2320500, 2350798, 2373488, 2387949, 2394007, 2391160, 2379117, 2358312, 2329318, 2292249, 2247416, 2196305, 2141135, 2083439, 2023635, 1962038, 1899702, 1837982, 1777761, 1719513, 1663786, 1611113, 1561499, 1514481, 1469742, 1427396, 1387645, 1350490, 1315882, 1283851, 1254282, 1226868, 1201512, 1178598, 1158517, 1140992, 1125211]
59045A125211j4606j3436j2196j1288j0871j0688j0616j0955j1884j2964j3508
59034I92199j3291j2561j1565j0355r090q055p296o572n759n019m391l599k591
59021H92055j888j932k267j980r23O0K36k10o46p78n91N4J232K580L588M264N025
59004H97879N947O534O456O175O533P842R579J0967J1682J1995J2369J3051J3918
58991A020927J4595J4685J4077J3061J2079J1270J0428R454Q618Q130P720O983
58979A152027O029N336N039M798M387L892L295K443J680J881L355N228O455P101
58965A212946Q019R535J1147J2384J3291J4033J4589J4971J5280J5414J5152J4609
58953A371370J4211J4117J4122J4243J4882J6136J7375J7877J7733J7746J8535
$$ y = [1125211, 1110605, 1097169, 1084973, 1073685, 1062814, 1052126, 1041510, 1030555, 1018671, 1005707, 992199, 978908, 966347, 954782, 944427, 935337, 927282, 919986, 913414, 907655, 902636, 898245, 894646, 892055, 890167, 888235, 885968, 883988, 883065, 883125, 883361, 883151, 882505, 881727, 881136, 881190, 882422, 885002, 888590, 892854, 897879, 903826, 910360, 916816, 922991, 929524, 937366, 946945, 957912, 969594, 981589, 993958, 1007009, 1020927, 1035522, 1050207, 1064284, 1077345, 1089424, 1100694, 1111122, 1120576, 1129194, 1137324, 1145044, 1152027, 1158056, 1163392, 1168431, 1173229, 1177616, 1181508, 1184803, 1187246, 1188926, 1190807, 1194162, 1199390, 1205845, 1212946, 1220965, 1230500, 1241647, 1254031, 1267322, 1281355, 1295944, 1310915, 1326195, 1341609, 1356761, 1371370, 1385581, 1399698, 1413820, 1428063, 1442945, 1459081, 1476456, 1494333, 1512066, 1529812, 1548347]
58942A548347J9922K1221K2010K2638K3912K6190K8978L1664L4380L7713M1642
58931A858617M5385M8358N0689N2581N3840N4425N4948N6137N8164O0933O4637
58920B458714O9468P5044Q0782Q6700R3149R9931J06350J12285J18509J25614
58910C426546J33256J40778J48150J55686J63274J70576J77968J86475J96523
58901D899232K07186K17117K25841K33633K40380K45328K48076K49115K48877
58892G014785K46752K41597K32930K20910K05355J85677J62001J35517J07245
58883H752769P7075M4615J0556k3540n6559q8285j18532j46585j71606j93086
58873H086822k10728k24384k34321k41232k45640k47563k47011k44429k40327
$$ y = [1548347, 1568269, 1589490, 1611500, 1634138, 1658050, 1684240, 1713218, 1744882, 1779262, 1816975, 1858617, 1904002, 1952360, 2003049, 2055630, 2109470, 2163895, 2218843, 2274980, 2333144, 2394077, 2458714, 2528182, 2603226, 2684008, 2770708, 2863857, 2963788, 3070138, 3182423, 3300932, 3426546, 3559802, 3700580, 3848730, 4004416, 4167690, 4338266, 4516234, 4702709, 4899232, 5106418, 5323535, 5549376, 5783009, 6023389, 6268717, 6516793, 6765908, 7014785, 7261537, 7503134, 7736064, 7956974, 8162329, 8348006, 8510007, 8645524, 8752769, 8829844, 8874459, 8885015, 8861475, 8804916, 8716631, 8598099, 8451514, 8279908, 8086822, 7876094, 7651710, 7417389, 7176157, 6930517, 6682954, 6435943, 6191514, 5951187]
58864E951187k34658k27053k17650k07288j96808j86465j76152j65924j55989
58855D183200j46383j36923j27558j18442j09626j00930r2331q4157p6668o9556
58845C120626o2278n4872m8030m2192l7004l1923k7014k2680j8802j4719j0107
58834B751005n354r12L319P622J1898J5938K0024K4672K9782L4638L8973M3437
58822B975042M8652N4210N9284O3916O8979P4884Q1116Q7312R4025J01847J10445
58811C819712J19142J28080J37871J48347J58572J68244J78187J89094K00575
58802E247824K11825K22641K33069K42588K50249K55442K58012K57718K54117
58793G433485K46742K35053K18439J96710J70516J40700J07426P0590L1050r206
$$ y = [5951187, 5716529, 5489476, 5271826, 5064538, 4867730, 4681265, 4505113, 4339189, 4183200, 4036817, 3899894, 3772336, 3653894, 3544268, 3443338, 3351007, 3266850, 3190182, 3120626, 3058348, 3003476, 2955446, 2913254, 2876250, 2844327, 2817313, 2794633, 2775831, 2761112, 2751005, 2745651, 2744739, 2748058, 2755680, 2767578, 2783516, 2803540, 2828212, 2857994, 2892632, 2931605, 2975042, 3023694, 3077904, 3137188, 3201104, 3270083, 3344967, 3426083, 3513395, 3607420, 3709267, 3819712, 3938854, 4066934, 4204805, 4353152, 4511724, 4679968, 4858155, 5047249, 5247824, 5459649, 5682290, 5915359, 6157947, 6408196, 6663638, 6921650, 7179368, 7433485, 7680227, 7915280, 8133719, 8330429, 8500945, 8641645, 8749071, 8819661, 8850711, 8841505]
58783H841505m8286q5322j20034j51968j80500k05232k26058k43041k56543k67115
58773G057406k74950k79532k80165k76828k70328k61693k51588k40283k27923
58764D694116k14817k01529j88703j76705j65432j54562j43960j33862j24666
58755C189880j16524j09058j01553r3585q5491p8121p2050o7124o2724n8317n3775
58744B291558m9416m5788m3178m1224l9226l6968l4949l3624l2713l1566l0036
58733A872870k8617k7774k7537k7750k8321k9060k9583k9700k9640k9707k9849
58722A555332k9863k9878l0270l1058l1743l1894l1668l1565l1783l2022l1795
58711A211793l0790k9054k7001k5126k3535k1768j9345j6445j3813j2030j1043
$$ y = [8841505, 8793219, 8707897, 8587863, 8435895, 8255395, 8050163, 7824105, 7581064, 7324521, 7057406, 6782456, 6502924, 6222759, 5945931, 5675603, 5413910, 5162322, 4922039, 4694116, 4479299, 4277770, 4089067, 3912362, 3746930, 3592368, 3448408, 3314546, 3189880, 3073356, 2964298, 2862745, 2769160, 2683669, 2605548, 2533498, 2466374, 2403650, 2345333, 2291558, 2242142, 2196354, 2153176, 2111952, 2072726, 2035758, 2000809, 1967185, 1934472, 1902906, 1872870, 1844253, 1816479, 1788942, 1761192, 1732871, 1703811, 1674228, 1644528, 1614888, 1585181, 1555332, 1525469, 1495591, 1465321, 1434263, 1402520, 1370626, 1338958, 1307393, 1275610, 1243588, 1211793, 1181003, 1151949, 1124948, 1099822, 1076287, 1054519, 1035174, 1018729, 1004916, 992886, 981843]
58700I81843j0454r979r642r747j0721j2639j4816j6196j6370j5921j5552j5154
58688H24652j4144j2467j0747r435q254o718m827k997j412K05K079L860M944N257
58674G69996N500O277P320P932Q128Q763J0376J2434J3990J4594J4126J2213Q458
58661I00107L192k582p918j2307j5483j7431j8490j8906j8358j6470j3786j1522
58649G50046j0161q973p280n447m123l069j564L53J831K467K858L662M717N478
58635G30795O002O886Q361R878J0762J0988J1101J1580J2546J3886J5334J6456
58623H64575J7069J7709J9197K1557K3741K4909K5500K6565K8377L0436L2661
58612A132296L5656L9550M3420M6309M8437N0821N4042N7828O1650O5309O8859
$$ y = [981843, 971389, 961410, 951768, 942021, 931300, 918661, 903845, 887649, 871279, 855358, 839806, 824652, 810508, 798041, 787294, 777859, 769605, 762887, 758060, 755063, 753651, 753856, 755935, 759795, 764739, 769996, 775496, 781773, 789093, 797025, 805153, 813916, 824292, 836726, 850716, 865310, 879436, 891649, 900107, 903299, 900717, 892799, 880492, 865009, 847578, 829088, 810182, 791824, 775354, 761568, 750046, 739885, 730912, 723632, 718185, 714062, 710993, 709429, 709782, 711613, 714080, 716938, 720600, 725317, 730795, 736797, 743683, 752044, 761922, 772684, 783672, 794773, 806353, 818899, 832785, 848119, 864575, 881644, 899353, 918550, 940107, 963848, 988757, 1014257, 1040822, 1069199, 1099635, 1132296, 1167952, 1207502, 1250922, 1297231, 1345668, 1396489, 1450531, 1508359, 1570009, 1635318, 1704177]
58601A704177P2250P5070P6623P6420P4590P1640O7701O2338N5115M6095L5650
58590B417669K4150J2048j14j2060k3835l5193m5243n3073n8451o1678o3058o2944
58578B038218o1942o0487n8370n5238n1504m8138m5507m3001l9972l6634l3693
58567A503732l1434k9516k7496k5356k3480k2240k1644k1396k1303k1434k1729
58556A236704k1724k0989j9735j8561j7715j6920j5954j5007j4468j4677j5973
58545A044981j8386k1179k3162k3829k3824k3962k4084k3373k1594j9414j7558
58534H04616j6098j4749j3473j2449j1660j0847r860q866q100p602p254p052p096
58521F69510p339p417o937n913m791m034l636l139k087n63P79J321J201J235J982
$$ y = [1704177, 1776427, 1851497, 1928120, 2004540, 2079130, 2150770, 2218471, 2280809, 2335924, 2382019, 2417669, 2441819, 2453867, 2453753, 2441693, 2417858, 2382665, 2337422, 2284349, 2225898, 2164220, 2101162, 2038218, 1976276, 1915789, 1857419, 1802181, 1750677, 1702539, 1657032, 1614031, 1574059, 1537425, 1503732, 1472298, 1442782, 1415286, 1389930, 1366450, 1344210, 1322566, 1301170, 1279867, 1258433, 1236704, 1214980, 1193991, 1174256, 1155695, 1137980, 1121060, 1105106, 1090099, 1075631, 1060954, 1044981, 1026595, 1005416, 982254, 958425, 934601, 910639, 886555, 863182, 841588, 822174, 804616, 788518, 773769, 760296, 747847, 736187, 725340, 715480, 706614, 698514, 690912, 683658, 676606, 669510, 662171, 654754, 647817, 641904, 637113, 633079, 629443, 626304, 624217, 623654, 624433, 625754, 626955, 628190, 630172]
58506F30172L066L704L736L689L847L847L421K977K963L028K495J546J124J556
58492F71171J994J647Q85O00Q46R08N39K21J57j47r07j460j313j184k219m284
58476F67454n979o323n755n186m810m322l793l693m195m906n315n240m889m640
58462E98408m709m844m486l453k252j507j183p32J04R71J432J498J563J982K829
58447E85621L827M487M495M104L941M360N110N704O018O295O640O759O308N367
58433F59036M372L559K703J588M82j51l76p84j623k377k434j930j436j099n63
58418F58967L06J087J377J299J316J730K520L442M128M290M049L848L924M027
58404F96310L823L463L434L914M466M466L760K816K327K579L206L523L229K766
$$ y = [630172, 633238, 636942, 640678, 644367, 648214, 652061, 655482, 658459, 661422, 664450, 666945, 668491, 669615, 671171, 673165, 674812, 675697, 676297, 677143, 678051, 678590, 678811, 678968, 678821, 677914, 676454, 675141, 673957, 671738, 667454, 661475, 655152, 649397, 644211, 639401, 635079, 631286, 627593, 623398, 618492, 613177, 607937, 603048, 598408, 593699, 588855, 584369, 580916, 578664, 577157, 575974, 575242, 575346, 576317, 577749, 579247, 580810, 582792, 585621, 589448, 593935, 598430, 602534, 606475, 610835, 615945, 621649, 627667, 633962, 640602, 647361, 653669, 659036, 663408, 666967, 669670, 671258, 671740, 671589, 671213, 670429, 668806, 666429, 663995, 662065, 660629, 659530, 658967, 659273, 660360, 661737, 663036, 664352, 666082, 668602, 672044, 676172, 680462, 684511, 688359, 692283, 696310, 700133, 703596, 707030, 710944, 715410, 719876, 723636, 726452, 728779, 731358, 734564, 738087, 741316, 744082]
58390G44082K903L941N316O151O147N916O344P677R275J0245J0161R238P967O760
58376H42123N809N095M501M052L986M457N182N619N585N555O131P306Q455R078
58362I22934R333R691J0229J0515J0232R596R057Q844Q889R069R178Q938Q365
58349A044870P994Q261Q768Q711Q099P955Q996J0634J1718J1904J1735J1733J1938
58336A173316J2251J2664J3054J3245J3297J3415J3599J3743J4034J4762J5765
58325A323145J6518J6921J7433J8303J9139J9523J9626J9814K0039K0074K0080
58314A530615K0409K0943K1170K0864K0305J9773J9304J9042J9373K0420K1735
58303A753953K2836K3848K5273K7177K9002L0169L0613L0653L0688L1143L2450
$$ y = [744082, 746985, 750926, 756242, 762393, 768540, 774456, 780800, 788477, 797752, 807997, 818158, 827396, 835363, 842123, 847932, 853027, 857528, 861580, 865566, 870023, 875205, 880824, 886409, 891964, 898095, 905401, 913856, 922934, 932267, 941958, 952187, 962702, 972934, 982530, 991587, 1000431, 1009320, 1018389, 1027567, 1036505, 1044870, 1052864, 1061125, 1069893, 1078604, 1086703, 1094658, 1103654, 1114288, 1126006, 1137910, 1149645, 1161378, 1173316, 1185567, 1198231, 1211285, 1224530, 1237827, 1251242, 1264841, 1278584, 1292618, 1307380, 1323145, 1339663, 1356584, 1374017, 1392320, 1411459, 1430982, 1450608, 1470422, 1490461, 1510535, 1530615, 1551024, 1571967, 1593137, 1614001, 1634306, 1654079, 1673383, 1692425, 1711798, 1732218, 1753953, 1776789, 1800637, 1825910, 1853087, 1882089, 1912258, 1942871, 1973524, 2004212, 2035355, 2067805]
58292B067805L4672L7244L9272M0209M0218L9999M0337M1646M3666M5648M7024
58281B517740M7908M8830N0172N1934N3966N6085N8099N9912O1564O2967O3814
58270C132991O4090O4422O5395O6694O7514O7803O8423O9991P2251P4844P7942
58259C892360Q1654Q5464Q8904R2413R6893J02592J08878J14982J20568J25742
58249D910450J30940J36692J43203J50241J57535J65041J72738J80576J88905
58240F336321J98358K09013K20155K31353K43218K56572K71318K86807L03052
58231H556167L20844L40749L62604L85848M10096M35528M63041M93705N27760
58222A2296342N64666O04398O48106O97027P51507Q11707Q78553R53286J036864
$$ y = [2067805, 2102477, 2139721, 2178993, 2219202, 2259420, 2299419, 2339756, 2381402, 2425068, 2470716, 2517740, 2565648, 2614478, 2664650, 2716584, 2770550, 2826635, 2884734, 2944646, 3006210, 3069177, 3132991, 3197081, 3261503, 3326898, 3393592, 3461106, 3528909, 3597332, 3667323, 3739574, 3814418, 3892360, 3974014, 4059478, 4148382, 4240795, 4337688, 4440280, 4549158, 4664140, 4784708, 4910450, 5041390, 5178082, 5321285, 5471526, 5629061, 5794102, 5966840, 6147416, 6336321, 6534679, 6743692, 6963847, 7195200, 7438418, 7694990, 7966308, 8253115, 8556167, 8877011, 9217760, 9580364, 9966212, 10376308, 10811836, 11274877, 11768582, 12296342, 12861008, 13465406, 14113512, 14810539, 15562046, 16373753, 17252306, 18205592, 19242456]
58213A9242456J130577J236532J356728J492645J646850J824090K029611K267534
58205C2227023K542784K863974L242270L687177M204345M796787N467176O221459
58197F5252995P074750Q055327R200972J0550012J2135281J3982927J6109127
58190A42361391J8507208K1118582K3780203K6155140K7689561K7664668K5382369
58183C12659122K0442926J2996249L828583n797232j4510935k1251889k5532381
58176B82834443k7440313k7438696k6117231k4018167k1561795j9036760j6619823
58169A20601658j4406075j2437039j0719950r240687p974993o896653n980144
58162E2946117n200879m536845l970276l486671l073001k717880k412453k149586
$$ y = [19242456, 20373033, 21609565, 22966293, 24458938, 26105788, 27929878, 29959489, 32227023, 34769807, 37633781, 40876051, 44563228, 48767573, 53564360, 59031536, 65252995, 72327745, 80383072, 89584044, 100134056, 112269337, 126252264, 142361391, 160868599, 181987181, 205767384, 231922524, 259612085, 287276753, 312659122, 333102048, 346098297, 349926880, 344129648, 329618713, 308366824, 282834443, 255394130, 227955434, 201838203, 177820036, 156258241, 137221481, 120601658, 106195583, 93758544, 83038594, 73797907, 65822914, 58926261, 52946117, 47745238, 43208393, 39238117, 35751446, 32678445, 29960565, 27548112, 25398526]
58154B5398526j922534j725122j552478j400693j266410j147302j042107r49425
58146A4392455q67100p93378p27667o69439o17250n69642n26304m87461m52692
58137H681522m20995l91532l63876l38135l15118k95518k78524k62267k46034
58128E769523k30936k17844k05975j94347j83372j73855j65383j56931j48335
58119D092545j40163j32741j26199j20719j15849j10401j04038r8156r4083r1216
58109B958980q8035q4178q0288p6531p2684o9060o5979o2811n8937n5235n3059
58098B192183n2051n0529m7907m5243m3382m2106m1247m1109m1387m0945l9265
58087A707012l7105l5391l4276l3569l3140l2701l1950l1171l0834l0584k9639
$$ y = [25398526, 23475992, 21750870, 20198392, 18797699, 17531289, 16383987, 15341880, 14392455, 13525355, 12731977, 12004310, 11334871, 10717621, 10147979, 9621675, 9134214, 8681522, 8260527, 7868995, 7505119, 7166984, 6851866, 6556348, 6277824, 6015557, 5769523, 5538587, 5320743, 5114768, 4920421, 4737049, 4563194, 4397811, 4240880, 4092545, 3952382, 3819641, 3693442, 3572723, 3456874, 3346473, 3242435, 3144279, 3050196, 2958980, 2870945, 2786767, 2706479, 2629948, 2557264, 2488204, 2422225, 2359414, 2300477, 2245242, 2192183, 2140132, 2089603, 2041696, 1996453, 1953071, 1910965, 1869718, 1828609, 1787222, 1746277, 1707012, 1669907, 1634516, 1600240, 1566671, 1533531, 1500830, 1468880, 1437709, 1406875, 1376291, 1346652]
58076A346652k8228k7419k7377k6958k5490k3733k2475k1395k0031j8883j8616
58065A086047j8850j8627j7583j6009j4234j2603j1559j1176j1001j0774j0860
58054I32771j1486j2137j2275j2142j2192j2209j1656j0559r416q507p894p735
58042H04563q031q304q087p597p370p493p627p556p211o405n130l944l520l866
58028G12422m507n205o007o635o548n710m808m484m613m572l989l108k502k478
58014F47256k737k800k681k829l290l398k681j687j358j790k140j729p38J52M00
57999F17950j08j001j558j279m04L53N78M54L60M77Q15J273J670K006K621L817
57983F28024N247O079N883N016M080L281K471J541N33n13j648l017m785o904q954
$$ y = [1346652, 1318424, 1291005, 1263628, 1236670, 1211180, 1187447, 1164972, 1143577, 1123546, 1104663, 1086047, 1067197, 1048570, 1030987, 1014978, 1000744, 988141, 976582, 965406, 954405, 943631, 932771, 921285, 909148, 896873, 884731, 872539, 860330, 848674, 838115, 828699, 820192, 812298, 804563, 796532, 788228, 780141, 772544, 765174, 757681, 750054, 742498, 735287, 728882, 723752, 719808, 716288, 712422, 707915, 702710, 696703, 690068, 683520, 677810, 673002, 668518, 663905, 659333, 655344, 652236, 649734, 647256, 644519, 641719, 639038, 636209, 632919, 629521, 626840, 625153, 623795, 622005, 619865, 618136, 617398, 617550, 617950, 617842, 616841, 615283, 614004, 613600, 613953, 614531, 614985, 615345, 615822, 616637, 617910, 619580, 621586, 624207, 628024, 633271, 639350, 645233, 650249, 654329, 657610, 660081, 661622, 662155, 661642, 659994, 656977, 652192, 645288, 636334]
57968F36334j0403j1077j1246j1204j0992j0484r542q047o075m073k547j486m50
57955E38708P07J610K079K638L834N381O478O849O851O604N648L726J452l14j509
57940E90742k947n291q216j0667j1801j1655j0894j0042r072p857o677n974n656
57927D83993n155m276l544l439l700l816l818m106m722n371n985o643o972o385
57913D16061m952l436k300j358n32o1L61J685M056O049O329N463N043N358N243
57898D43009M040K470J219p7j896l755m856n134n079m970m851m883n083n028m387
57883D00739l509k981k820k583k032j186N4J719L405M637N532O527P509P869P440
57868D30320O743O167N472M442L380K583J757M20j323k952m305n706p233q346
$$ y = [636334, 625931, 614854, 603608, 592404, 581412, 570928, 561386, 553339, 547264, 543191, 540644, 539158, 538708, 539415, 541025, 543104, 545742, 549576, 554957, 561435, 568284, 575135, 581739, 587387, 591113, 592565, 592251, 590742, 587795, 582504, 574288, 563621, 551820, 540165, 529271, 519229, 510157, 502300, 495623, 489649, 483993, 478838, 474562, 471018, 467579, 463879, 460063, 456245, 452139, 447417, 442046, 436061, 429418, 422446, 416061, 411109, 407673, 405373, 404015, 403483, 403422, 403783, 405468, 409524, 415573, 421902, 427365, 432408, 437766, 443009, 447049, 449519, 450738, 450661, 448765, 445010, 440154, 435020, 429941, 424971, 420120, 415237, 410154, 405126, 400739, 397230, 394249, 391429, 388846, 386814, 385628, 385682, 387401, 390806, 395443, 400975, 407502, 415011, 422880, 430320, 437063, 443230, 448702, 453144, 456524, 459107, 460864, 461284, 459961, 457009, 452704, 446998, 439765, 431419]
57854D31419q446p659o721o169n790n018l685k239j165m81J65J028K135L413M667
57839C95454N522N690N338M920M660M474M382M481M454L580J499j359m460p736
57825D30899j1034j3518j4358j3926j3432j3335j2893j1491r577p814o083m065
57813B99373k227j325j074l18J422L356M620N334O055O816P288P620Q442J0048
57799C55430J1910J3123J3152J2135J0635R160P879O748N691M584L210J499k91
57786D54865j925l540n321p004q210r136j0220j1214j1394j0867j0676j1252j1650
57773C42456j0927r411p942o633n276m254l896l507k302r30p37j618j970r75M22
57758B82500J089J124J119J194J362J973L029L800L846L820M555N818O659O619
$$ y = [431419, 422973, 415314, 408593, 402424, 396634, 391616, 387931, 385692, 384527, 384046, 384211, 385239, 387374, 390787, 395454, 400976, 406666, 412004, 416924, 421584, 426058, 430440, 434921, 439375, 442955, 444454, 443095, 438635, 430899, 419865, 406347, 391989, 378063, 364631, 351296, 338403, 326912, 317335, 309521, 303438, 299373, 297146, 295821, 294747, 294429, 295851, 299207, 303827, 309161, 315216, 322032, 329320, 336940, 345382, 355430, 367340, 380463, 393615, 405750, 416385, 425545, 433424, 440172, 445863, 450447, 453657, 455156, 454865, 452940, 449400, 444079, 437075, 428865, 419729, 409509, 398295, 386901, 376034, 365358, 354106, 342456, 331529, 322118, 314176, 307543, 302267, 298013, 294117, 290610, 288308, 287378, 286641, 285023, 283053, 282078, 282500, 283589, 284713, 285832, 287026, 288388, 290361, 293390, 297190, 301036, 304856, 309411, 315229, 321888, 328507]
57744C28507O002N341N107N549O263O308N304M114L884M695N647N972N591M869
57730D03153M399M771N997P293P901P945Q057Q377Q493Q185P733P459P372P383
57716E04518P583Q199R327J0644J1562J1993J2728J4501J6737J8036J8058J7957
57704F61843J8655J9638K0072K0114K0332K0776K1561K3485K6923L0772L3818
57693I17989L6570M0407M5337N0131N4425N9061O4263O9136P3356P7795Q2902
57682A571372Q7764R1561R4779R8164J01306J03181J03418J02291J00139R7621
57672B551596R6102R7039J00973J07172J13224J14160J02912P3442K4775l7286
57662C344109j01929j57178j94160k10084k08223j94908j75982j55253j34891
$$ y = [328507, 334509, 339850, 344957, 350506, 356769, 363077, 368381, 372495, 376379, 381074, 386721, 392693, 398284, 403153, 407552, 412323, 418320, 425613, 433514, 441459, 449516, 457893, 466386, 474571, 482304, 489763, 497135, 504518, 512101, 520300, 529627, 540271, 551833, 563826, 576554, 591055, 607792, 625828, 643886, 661843, 680498, 700136, 720208, 740322, 760654, 781430, 802991, 826476, 853399, 884171, 917989, 954559, 994966, 1040303, 1090434, 1144859, 1203920, 1268183, 1337319, 1410675, 1488470, 1571372, 1659136, 1750697, 1845476, 1943640, 2044946, 2148127, 2251545, 2353836, 2453975, 2551596, 2647698, 2744737, 2845710, 2952882, 3066106, 3180266, 3283178, 3356620, 3381395, 3344109, 3242180, 3085002, 2890842, 2680758, 2472535, 2277627, 2101645, 1946392, 1811501]
57653A811501j16120r9495q5065p2577o1615n1787m3012l5418k8917k3162j8029
57642A176304j3691j0022o369k185K419O923J0989J4563J7774K0875K4098K7434
57630A269112L0881L4753L9257M3849M7674N0687N3620N6826N9896O2522O4741
57619A813818O6105O5667O3205N9419N4449M7316L7551K6272J4728K809r959k2901
57607B218479l4844m5486n4856o2210o6926o9869p2292p3853p3398p1334o9331
57596A524080o7688o4961o0637n6233n2987n0116m6378m2023l8025l4490l1119
57585I79423k8312k6580k5364k3674k1518j9666j8267j6774j5060j3587j2452
57574G58169j1161r521q005o977o177n227m156l190k353j518o14L82J415K239
$$ y = [1811501, 1695381, 1595886, 1510821, 1438244, 1376629, 1324842, 1281830, 1246412, 1217495, 1194333, 1176304, 1162613, 1152591, 1146222, 1144037, 1146456, 1153379, 1164368, 1178931, 1196705, 1217580, 1241678, 1269112, 1299993, 1334746, 1374003, 1417852, 1465526, 1516213, 1569833, 1626659, 1686555, 1749077, 1813818, 1879923, 1945590, 2008795, 2068214, 2122663, 2169979, 2207530, 2233802, 2248530, 2251339, 2241380, 2218479, 2183635, 2138149, 2083293, 2021083, 1954157, 1884288, 1811996, 1738143, 1664745, 1593411, 1524080, 1456392, 1391431, 1330794, 1274561, 1221574, 1171458, 1125080, 1083057, 1045032, 1010542, 979423, 951111, 924531, 899167, 875493, 853975, 834309, 816042, 799268, 784208, 770621, 758169, 747008, 737487, 729482, 722505, 716328, 711101, 706945, 703755, 701402, 699884, 699270, 699652, 701067, 703306]
57560G03306K601K660K991L946N193O047O274O374P066Q513J0193J1517J2531
57547G89212J3795J5573J7372J8485J8897J9430K0908K3314K5932K8235L0447
57536A021600L3108L6298L9502M2246M4490M6362M7859M9049N0277N1832N3582
57525A516205N5129N6106N6051N4288N0386M4646L7661K9653K0567J0703O42r312
57513A922725j9043k7983l5324m0923m5333m8784n0833n1327n0963n0392m9345
57502A452475m7221m4101m0555l6776l2586k8152k4072k0735j8032j5681j3464
57491A131100j1175q705o259m164k422o73J408L830O428Q994J1397J3684J6075
57478A159518J8665K1274K3794K6545K9954L3844L7387L9906M1607M3353M5716
$$ y = [703306, 705907, 708567, 711558, 715504, 720697, 726744, 733018, 739392, 746458, 754971, 765164, 776681, 789212, 803007, 818580, 835952, 854437, 873334, 892764, 913672, 936986, 962918, 991153, 1021600, 1054708, 1091006, 1130508, 1172754, 1217244, 1263606, 1311465, 1360514, 1410791, 1462623, 1516205, 1571334, 1627440, 1683491, 1737779, 1788165, 1832811, 1870472, 1900125, 1920692, 1931395, 1932037, 1922725, 1903682, 1875699, 1840375, 1799452, 1754119, 1705335, 1654502, 1603175, 1552212, 1501820, 1452475, 1405254, 1361153, 1320598, 1283822, 1251236, 1223084, 1199012, 1178277, 1160245, 1144564, 1131100, 1119925, 1111220, 1104961, 1100797, 1098375, 1097702, 1099110, 1102940, 1109368, 1118362, 1129759, 1143443, 1159518, 1178183, 1199457, 1223251, 1249796, 1279750, 1313594, 1350981, 1390887, 1432494, 1475847, 1521563]
57467A521563M8345N0336N1229N1439N1515N1144M9280M5203L9080L1444K2664
57456B013242J3186L728n249j4042k3125l2194m0255m6520n0852n3414n4400n4196
57444A655909n3360n2272n0881m8886m5991m2208l8107l4667l2390l0679k8510
57433A197958k5746k3221k1419j9727j7397j4741j2745j1669j0747r267p394n702
57421A018183m334l074j937j208r24p05k74K28N82Q78J308J805K153K372K628
57406A017681K892K996L016L277L917M768N660O526P215P530P563P633P760P641
57392A096075P266P093P341P566P315O854O757P101P547P971Q482Q955R097Q954
57378A204374Q892R060R349R762J0342J0686J0220R122Q388Q608R196R227Q718
$$ y = [1521563, 1569908, 1620244, 1671473, 1722912, 1774427, 1825571, 1874851, 1920054, 1959134, 1990578, 2013242, 2026428, 2030156, 2024907, 2010865, 1987740, 1955546, 1915291, 1868771, 1817919, 1764505, 1710105, 1655909, 1602549, 1550277, 1499396, 1450510, 1404519, 1362311, 1324204, 1289537, 1257147, 1226468, 1197958, 1172212, 1148991, 1127572, 1107845, 1090448, 1075707, 1062962, 1051293, 1040546, 1031279, 1023885, 1018183, 1013849, 1010775, 1008838, 1007630, 1006706, 1006001, 1005727, 1005955, 1006537, 1007415, 1008723, 1010528, 1012681, 1015053, 1017681, 1020573, 1023569, 1026585, 1029862, 1033779, 1038547, 1044207, 1050733, 1057948, 1065478, 1073041, 1080674, 1088434, 1096075, 1103341, 1110434, 1117775, 1125341, 1132656, 1139510, 1146267, 1153368, 1160915, 1168886, 1177368, 1186323, 1195420, 1204374, 1213266, 1222326, 1231675, 1241437, 1251779, 1262465, 1272685, 1281807, 1290195, 1298803, 1307999, 1317226, 1325944]
57365A325944Q470Q886R494R755R796J0157J1054J2190J3128J3620J3672J3510
57353A459676J3483J3823J4348J4653J4618J4620J5015J5615J5961J5952J5914
57342A623678J6029J6120J6047J5919J5808J5610J5417J5591J6174J6608J6454
57331A799455J6090J6202J6825J7436J7834J8323J8993J9430J9417J9386J9871
57320A999262K0777K1548K1922K2241K3002K4216K5341K5866K5949K6243K7035
57309B263402K7820K8029K7908K8214K9185L0261L0865L0951L0654K9891K8672
57298B585852K7458K6749K6442K5877K4601K2801K0929J9077J6904J4210J1359
57287B822259Q942P127N653M445L776L671L646L415L444M227N365O077O408P171
$$ y = [1325944, 1334414, 1343300, 1352794, 1362549, 1372345, 1382502, 1393556, 1405746, 1418874, 1432494, 1446166, 1459676, 1473159, 1486982, 1501330, 1515983, 1530601, 1545221, 1560236, 1575851, 1591812, 1607764, 1623678, 1639707, 1655827, 1671874, 1687793, 1703601, 1719211, 1734628, 1750219, 1766393, 1783001, 1799455, 1815545, 1831747, 1848572, 1866008, 1883842, 1902165, 1921158, 1940588, 1960005, 1979391, 1999262, 2020039, 2041587, 2063509, 2085750, 2108752, 2132968, 2158309, 2184175, 2210124, 2236367, 2263402, 2291222, 2319251, 2347159, 2375373, 2404558, 2434819, 2465684, 2496635, 2527289, 2557180, 2585852, 2613310, 2640059, 2666501, 2692378, 2716979, 2739780, 2760709, 2779786, 2796690, 2810900, 2822259, 2831201, 2838328, 2843981, 2848426, 2852202, 2855873, 2859519, 2862934, 2866378, 2870605, 2875970, 2882047, 2888455, 2895626]
57273B895626Q610R985J0705J1162J1995J3119J3963J4330J4479J4629J4861J5274
57261C048738J5879J6440J6758J6966J7284J7594J7629J7473J7511J7918J8392
57250C238582J8469J7964J7155J6617J6775J7504J8259J8676J8890J9182J9536
57239C437609J9709J9541J9056J8474J8228J8669J9503J9849J9173J8037J7505
57228C645353J7917J8617J8895J8854J9154K0074K1036K1178K0337J9264J8740
57217C859419J8706J8576J8282J8409J9335K0823K2768K5601K9485L3700L7602
57206D122706M1827M7654N5179O2791O8551P1447P1312O8396O3494N7882N2467
57195D783706M7170M1622L6120L1439K7802K4636K1462J8507J6124J4102J1962
$$ y = [2895626, 2904236, 2914221, 2924926, 2936088, 2948083, 2961202, 2975165, 2989495, 3003974, 3018603, 3033464, 3048738, 3064617, 3081057, 3097815, 3114781, 3132065, 3149659, 3167288, 3184761, 3202272, 3220190, 3238582, 3257051, 3275015, 3292170, 3308787, 3325562, 3343066, 3361325, 3380001, 3398891, 3418073, 3437609, 3457318, 3476859, 3495915, 3514389, 3532617, 3551286, 3570789, 3590638, 3609811, 3627848, 3645353, 3663270, 3681887, 3700782, 3719636, 3738790, 3758864, 3779900, 3801078, 3821415, 3840679, 3859419, 3878125, 3896701, 3914983, 3933392, 3952727, 3973550, 3996318, 4021919, 4051404, 4085104, 4122706, 4164533, 4212187, 4267366, 4330157, 4398708, 4470155, 4541467, 4609863, 4673357, 4731239, 4783706, 4830876, 4872498, 4908618, 4940057, 4967859, 4992495, 5013957, 5032464, 5048588, 5062690, 5074652]
57184E074652R751P947O505M675K047p17k726m080n569p321q608r119r611j0852
57170E046974j2530j3815j4576j5366j6488j7674j8637j9319j9675j9736j9866
57159D859292k0471k1304k1602k1035k0194j9821j9874j9621j8525j6818j5212
57148D644815j4147j3439j2670j1896j1637j2193j3294j4656j6471j8889k1325
57137D484198k2850k3289k3396k3927k4952k6042k6648k6160k4159k0856j6948
57126D224971j2799q042k216M500J1420J7960K3793K8524L1454L1823K9347K4766
57114D405501J9868J6651J6219J8507K3020K9569L8259M9115O1974P6733R3571
57103D848987J13064J36124J63664J96312K34571K79141L30826L90112M57024
$$ y = [5074652, 5084403, 5092350, 5098855, 5103530, 5105577, 5104860, 5102134, 5098054, 5092485, 5085164, 5076556, 5067437, 5057826, 5046974, 5034444, 5020629, 5006053, 4990687, 4974199, 4956525, 4937888, 4918569, 4898894, 4879158, 4859292, 4838821, 4817517, 4795915, 4774880, 4754686, 4734865, 4714991, 4695370, 4676845, 4660027, 4644815, 4630668, 4617229, 4604559, 4592663, 4581026, 4568833, 4555539, 4540883, 4524412, 4505523, 4484198, 4461348, 4438059, 4414663, 4390736, 4365784, 4339742, 4313094, 4286934, 4262775, 4241919, 4224971, 4212172, 4204130, 4201914, 4206414, 4217834, 4235794, 4259587, 4288111, 4319565, 4351388, 4380735, 4405501, 4425369, 4442020, 4458239, 4476746, 4499766, 4529335, 4567594, 4616709, 4678683, 4755416, 4848987, 4962051, 5098175, 5261839, 5458151, 5692722, 5971863, 6302689, 6692801, 7149825]
57094G149825N31381O12852P00754P93979Q91023R89582J086047J175706J253519
57085A5184668J314158J351415J358407J329275J260837J152705J006475Q25294
57077B4783234O13827L78017J24940j36745l96498o42786q64954j054676j206512
57068B1597847j317948j389159j422367j421078j389741j333618j258399j169681
57060A0895856j072811r72996q74929p81973o95785o16891n45532m81898m25820
57051D427221l76599l33427k95852k63643k36157k12120j90299j70334j52646
57042B196144j37603j24985j14156j04537r5811q7984q1221p5424p0023o4543
57032A239857n9262n4875n1466m8354m5053m1805l8940l6357l3989l2187l1075
$$ y = [7149825, 7681206, 8294058, 8994812, 9788791, 10679814, 11669396, 12755443, 13931149, 15184668, 16498826, 17850241, 19208648, 20537923, 21798760, 22951465, 23957940, 24783234, 25397061, 25775078, 25900018, 25763273, 25366775, 24723989, 23859035, 22804359, 21597847, 20279899, 18890740, 17468373, 16047295, 14657554, 13323936, 12065537, 10895856, 9823045, 8850049, 7975120, 7193147, 6497362, 5880471, 5334939, 4853041, 4427221, 4050622, 3717195, 3421343, 3157700, 2921543, 2709423, 2519124, 2348790, 2196144, 2058541, 1933556, 1819400, 1714863, 1619052, 1531068, 1449847, 1374423, 1304400, 1239857, 1180595, 1125720, 1074254, 1025900, 980847, 939042, 900102, 863745, 829756, 797569, 766494]
57021G66494l0029k8457k6650k5227k4049k2515k0752j9640j9533j9726j9411
57010E10505j8563j7658j7012j6688j6612j6432j5659j4211j2609j1421j0742
56999C42898j0348j0126j0000r743r136q203p064n692m013k121j85J739L642N373
56985B77021O743P787Q719R552R923R383P838N635L241R68j053k731m031m936
56971C34059n316m928l795k452j501q98j11R90J864K134K191K668L689N057O687
56956C40338Q291Q982P875N051J446k101n211p667r332j0377j0941j0704r374
56943C06276p479n920m716l073q38J044J931K529L985O467R221J1520J3021J3538
56929C47506J3058J1689R282N505O24m202p989j0826j3211j5006j5786j5800j5704
$$ y = [766494, 736465, 708008, 681358, 656131, 632082, 609567, 588815, 569175, 549642, 529916, 510505, 491942, 474284, 457272, 440584, 423972, 407540, 391881, 377670, 365061, 353640, 342898, 332550, 322424, 312424, 302681, 293545, 285342, 278278, 272586, 268573, 266452, 266267, 268006, 271648, 277021, 283764, 291551, 300270, 309822, 319745, 329128, 336966, 342601, 345842, 346810, 345757, 343026, 338995, 334059, 328743, 323815, 320020, 317568, 316067, 315169, 315058, 316048, 317912, 320046, 322237, 324905, 328594, 333651, 340338, 348629, 357611, 365486, 370537, 371983, 369882, 364671, 357004, 347672, 337295, 326354, 315650, 306276, 298797, 292877, 288161, 285088, 284250, 285294, 287225, 289754, 293739, 300206, 309427, 320947, 333968, 347506, 360564, 372253, 381535, 387040, 387664, 383462, 375473, 364647, 351436, 336430, 320644, 304844, 289140]
56916B89140j5405j4143j1787r304p680o898o273n342m167l079k365k047j868
56903A98782j672j662k027k422k183j100L94J759K697L111L129L212L777M675
56889B10470N518O389P658R070R788R542Q944Q317O946M196P62j980l526m360
56875B77734m773m444l334k091j276o57L46J909L863O158Q806J1474J3573J4914
56861C22202J6006J7483J9262K0408J9886J7404J3429Q503K894l040q446j2394
56849D33597j4568j5248j4594j2438q942n088k047k0J916M795Q759J3196J7591
56836D06909K1926K6248L0120L2762L3601L2378K8743K2138J2525J115r999j9086
56824F19380k5527k9422l0911l0121k7556k4039k0280j6630j3156r652n707j132
$$ y = [289140, 273735, 259592, 247805, 238501, 230821, 223923, 217650, 212308, 208141, 205062, 202697, 200650, 198782, 197110, 195448, 193421, 190999, 188816, 187716, 188110, 189869, 192566, 195677, 198806, 202018, 205795, 210470, 215988, 222377, 230035, 239105, 248893, 258435, 267379, 275696, 282642, 286838, 287600, 285620, 282094, 277734, 272961, 268517, 265183, 263092, 261816, 261159, 261505, 263414, 267277, 273435, 282241, 293715, 307288, 322202, 338208, 355691, 374953, 395361, 415247, 432651, 446080, 454583, 457477, 454437, 445991, 433597, 419029, 403781, 389187, 376749, 367807, 362719, 360672, 360652, 362568, 367363, 376122, 389318, 406909, 428835, 455083, 485203, 517965, 551566, 583944, 612687, 634825, 647350, 648465, 638466, 619380, 593853, 564431, 533520, 503399, 475843, 451804, 431524, 414894, 401738, 392086, 386379, 385247]
56812C85247L600P686J0895J3768J6813J9847K2263K3453K2534J8368J0686J086
56800E56246p942j5042k0439k4455k6577k6450k4890k3126k1421j9210j6239j2880
56788C17575r451n921k338J061M135O832Q905J0152J0801J1104J0576Q388M552
56775C76371L9m427q882j3183j6438j7938j8032j7483j6485j5010j3485j2307
56763B22740j0989q796o095m199l762m145m426m332l914l158k361k202k828l334
56749A58199k761j332j46J76j9j54q3J09M33Q77J163R79L02n80j315j633j394
56732A52821o95M5L59J63j47j76n5k65r23j491j400p30q4J42M7j12k10k20j78
56713A46891k54n59q22o11JL64L8o06q88o19r1N44J323J991K060J531J122J370
$$ y = [385247, 388847, 396533, 407428, 421196, 438009, 457856, 480119, 503572, 526106, 544474, 555160, 556246, 548304, 533262, 512823, 488368, 461791, 435341, 410451, 387325, 365904, 346694, 330455, 317575, 308124, 302203, 299865, 300926, 305061, 311893, 320798, 330950, 341751, 352855, 363431, 371819, 376371, 376410, 371983, 363101, 349918, 333480, 315542, 297510, 280027, 263542, 248532, 235047, 222740, 211751, 202955, 196860, 192661, 188899, 184754, 180328, 175996, 172082, 168924, 166563, 164361, 161533, 158199, 155438, 154106, 153960, 154136, 154117, 153963, 153880, 153989, 154422, 155299, 156462, 157441, 157743, 157163, 155848, 154215, 152821, 152126, 152171, 152530, 152693, 152546, 152370, 152315, 152050, 151127, 149636, 148236, 147506, 147422, 147564, 147611, 147499, 147289, 147069, 146891, 146637, 146078, 145256, 144645, 144646, 145010, 145048, 144442, 143554, 142935, 142844, 143388, 144711, 146702, 148762, 150293, 151415, 152785]
56695A52785J768J343O4q69m62P13J195N20k61j42M25L31m73r97p54l33j79K06
56677A54880J278K389K493J532L42m72q58p30K9R64J269P63O4l85p70j168j131
56660A60489m77R1k02j160j903j934j440p43%N89P92N58K7o26j096j004m20o1
56642A51480m43r98o60O38J746J657O16m23q57o81j58K83J93m25r47q89o06p86
56624A48740j413j759j385o78k36j79k25j44J14M60O74N43J23k67l73j26N75J774
56606A46218L009L456K835J860J296R52J76r25j477j070k82K39N08P22O65J33
56590A58315m84n72j9P93J523J962J899J363Q37P56R53R78Q39Q52R21O59K19L25
56572A72119J263K363K755K251J323O68R31K337M230N439N436M855M584M714M734
$$ y = [152785, 154553, 155896, 155960, 155091, 154629, 155342, 156537, 157057, 156796, 156654, 157079, 157410, 156937, 155940, 155186, 154853, 154674, 154880, 156158, 158547, 161040, 162572, 162914, 162442, 161584, 160854, 160883, 161847, 163116, 163879, 163943, 163558, 162788, 161620, 160489, 160012, 160103, 159901, 158741, 156838, 154904, 153464, 152721, 152721, 153310, 154102, 154660, 154687, 154061, 152965, 151961, 151541, 151480, 151037, 150039, 149379, 150017, 151763, 153420, 154036, 153613, 152756, 152075, 151917, 152200, 152393, 151968, 151021, 150132, 149526, 148740, 147327, 145568, 144183, 143505, 143269, 143090, 142865, 142721, 142835, 143295, 143969, 144512, 144635, 144368, 143995, 143869, 144444, 146218, 149227, 152683, 155518, 157378, 158674, 159626, 159802, 158877, 157400, 156330, 156048, 156287, 156795, 157517, 158182, 158315, 157831, 157259, 157240, 158033, 159556, 161518, 163417, 164780, 165617, 166373, 167326, 168304, 169143, 169995, 170916, 171575, 171794, 172119, 173382, 175745, 178500, 180751, 182074, 182742, 183673, 186010, 190240, 195679, 201115, 205970, 210554, 215268, 220002]
56557B20002M401L964L718L698L717L432K599J427N20J79N4k95q15j274j763k459
56541B41105l200l708m039m325m359l929l344l140l412l858m318m676m545l699
56527A86553k679k219k150j625m86M53O26L92J82k05r50j537j429r38q07j104
56511A72077j245q81k98J16K57J54k10p27j038q20k01K44R2l81n01j80j25p59
56493A65574j365j001O5P01N70M38P11P65K21k04J47P04O44L16O36J498J948J724
56475A74092J515J699J887J923K292L183L900L732K831J882J366J476K231L179
56461B07188L521K957K105J633J325M80r88k354k944k736k154j649j477j564j458
56446B01885p42M26J385J626J222N42k00r39j532j785j736j631j619j628j603
$$ y = [220002, 224403, 228367, 232085, 235783, 239500, 242932, 245531, 246958, 247478, 247657, 247711, 247416, 246601, 245327, 243564, 241105, 237905, 234197, 230158, 225833, 221474, 217545, 214201, 211061, 207649, 203791, 199473, 194797, 190252, 186553, 183874, 181655, 179505, 177880, 177394, 177847, 178473, 178865, 179047, 178842, 177892, 176355, 174926, 173988, 173181, 172077, 170832, 169951, 169653, 169769, 170026, 170180, 169970, 169243, 168205, 167385, 167184, 167428, 167520, 167139, 166638, 166458, 166333, 165574, 164209, 163208, 163273, 163974, 164544, 164982, 165693, 166458, 166679, 166475, 166622, 167326, 167970, 168286, 168922, 170420, 172368, 174092, 175607, 177306, 179193, 181116, 183408, 186591, 190491, 194223, 197054, 198936, 200302, 201778, 204009, 207188, 210709, 213666, 215771, 217404, 218729, 219209, 218221, 215867, 212923, 210187, 208033, 206384, 204907, 203343, 201885, 201143, 201569, 202954, 204580, 205802, 206344, 206144, 205205, 203673, 201888, 200152, 198521, 196902, 195274, 193671]
56431A93671j657j817j793j246l02M55N28o3q52j295j125n98l20n48p04o0J079
56414A83353J494O33m54l26J087K511K924K496J972J776J829J868J659J235J026
56399B05083J443K249K670K246J378Q20Q63J130J044L25p63j625j793j328o88
56384B13054k66m9K17O68J104J157P51L14L23N99M80j51n43j07O94J025R07R94
56366B21171J416J673J687K041K942L656L417K416J481J114J185J299J187Q95
56352B47580P42R43J306J544J754K137K431K225J768J745K151K187J550R54R86
56337B72003J303J481J882K919M138M843N104N303N175M265L099K771L402L993
56323C21681L906L655L919M537M902M831M648M651M759M594L841K672J735J420
$$ y = [193671, 192014, 190197, 188404, 187158, 186856, 187311, 187839, 187776, 186924, 185629, 184504, 183906, 183586, 183038, 182334, 182274, 183353, 184847, 185480, 185026, 184700, 185787, 188298, 191222, 193718, 195690, 197466, 199295, 201163, 202822, 204057, 205083, 206526, 208775, 211445, 213691, 215069, 215889, 216752, 217882, 218926, 219251, 218488, 216863, 215070, 213742, 213054, 212788, 212739, 212956, 213624, 214728, 215885, 216636, 216950, 217273, 217872, 218352, 218201, 217658, 217551, 218245, 219270, 220177, 221171, 222587, 224260, 225947, 227988, 230930, 234586, 238003, 240419, 241900, 243014, 244199, 245498, 246685, 247580, 248322, 249265, 250571, 252115, 253869, 256006, 258437, 260662, 262430, 264175, 266326, 268513, 270063, 271017, 272003, 273306, 274787, 276669, 279588, 283726, 288569, 293673, 298976, 304151, 308416, 311515, 314286, 317688, 321681, 325587, 329242, 333161, 337698, 342600, 347431, 352079, 356730, 361489, 366083, 369924, 372596, 374331, 375751]
56309C75751J397J157P91P22R42J072J087J242J383J101O06O57J445K255K540
56294C94148K608K915L328L590L992M948O358P771Q955R861J0435J0828J1441
56281D81178J2393J3262J3776J4269J5092J6040J6967J8425K0887K3740K6074
56270F72103K8224L1405L5753L9920M3072M6289N1193N7893O5099P1821P8147
56259A220919Q4456R0727R6740J02347J07284J11019J12977J12792J10376J05917
56249B255554R9706R1635Q1001O7275N1165L4464J8634L901j0084k3166l4679
56238B635406m4330n2554n9993o6878p2978p7932q1632q4421q6807q8877r0095
56227A828909q9899q8389q6158q3502q0209p6068p1341o6505o1808n7153n2312
$$ y = [375751, 377148, 378305, 379096, 379818, 380760, 381832, 382919, 384161, 385544, 386645, 387251, 387908, 389353, 391608, 394148, 396756, 399671, 402999, 406589, 410581, 415529, 421887, 429658, 438613, 448474, 458909, 469737, 481178, 493571, 506833, 520609, 534878, 549970, 566010, 582977, 601402, 622289, 646029, 672103, 700327, 731732, 767485, 807405, 850477, 896766, 947959, 1005852, 1070951, 1142772, 1220919, 1305375, 1396102, 1492842, 1595189, 1702473, 1813492, 1926469, 2039261, 2149637, 2255554, 2355260, 2446895, 2527896, 2595171, 2646336, 2680800, 2699434, 2703335, 2693251, 2670085, 2635406, 2591076, 2538522, 2478529, 2411651, 2338673, 2260741, 2179109, 2094688, 2007881, 1919004, 1828909, 1739010, 1650621, 1564463, 1480961, 1400752, 1324684, 1253343, 1186838, 1125030, 1067877, 1015565]
56216A015565m7229m2263l8060l4914l2282k9254k5576k1928j9088j7162j5699
56205F92110j4183j2350j0316q624p780p590p337o666n875n114l998k423j128
56192E98726p72q77m59N49J355J611J841K520L510M543N563O365O574O372O646
56177F44067P947R685J0822J1057J0971J1159J1633J2019J2130J2331J3263J5023
56165G82107J6722J7287J6667J5808J5455J5575J6082J7298J9336K1720K4289
56154I78346K7812L2980L9282M5832N3024O2377P4757Q9725J06795J26137J47336
56143A784403J68088J84790J94115J93779J82691J61860J35280J09026Q8433P5703
56133C278168O9618O6729O2664N3422L7036J4908q640k8672m2153m9009n1664
$$ y = [1015565, 968336, 926073, 888013, 853099, 820817, 791563, 765987, 744059, 724971, 707809, 692110, 677927, 665577, 655261, 646637, 638857, 631267, 623930, 617264, 611389, 606275, 602277, 599854, 598726, 597954, 597077, 596618, 597167, 598522, 600133, 601974, 604494, 608004, 612547, 618110, 624475, 631049, 637421, 644067, 652014, 661699, 672521, 683578, 694549, 705708, 717341, 729360, 741490, 753821, 767084, 782107, 798829, 816116, 832783, 848591, 864046, 879621, 895703, 913001, 932337, 954057, 978346, 1006158, 1039138, 1078420, 1124252, 1177276, 1239653, 1314410, 1404135, 1510930, 1637067, 1784403, 1952491, 2137281, 2331396, 2525175, 2707866, 2869726, 3005006, 3114032, 3202465, 3278168, 3347786, 3414515, 3477179, 3530601, 3567637, 3582545, 3573905, 3545233, 3503080, 3454071, 3402407]
56122C402407n4017o0298p3617r4475j20240j46175j67296j79931j82446j75344
56112B148568j60859j42068j21874j02297q4393o8500n4619m2672l2584k4207
56102A314495j7307j1667p192l810j351M36J783K826L547L737L183K046Q61L3
56088A291620n36j047j193l69J424L344M562N131N644O394P216Q109R406J1191
56074A350896J2933J4031J4507J4874J5492J6326J7257J8203J8975J9347J9451
56063A532292J9814K0776K2087K3228K3986K4499K4921K5336K5960K7116K8814
56052A798829L0554L1661L1904L1736L1939L2958L4481L5785L6521L7043L7918
56041B171329L9284M0889M2591M4436M6276M7693M8533M9245N0456N2309N4446
$$ y = [3402407, 3348390, 3288092, 3214475, 3120000, 2999760, 2853585, 2686289, 2506358, 2323912, 2148568, 1987709, 1845641, 1723767, 1621470, 1537077, 1468577, 1413958, 1371286, 1338702, 1314495, 1297188, 1285521, 1278329, 1274519, 1273168, 1273604, 1275387, 1278213, 1281760, 1285497, 1288680, 1290726, 1291587, 1291620, 1291084, 1290037, 1288844, 1288475, 1289899, 1293243, 1297805, 1302936, 1308580, 1314974, 1322190, 1330299, 1339705, 1350896, 1363829, 1377860, 1392367, 1407241, 1422733, 1439059, 1456316, 1474519, 1493494, 1512841, 1532292, 1552106, 1572882, 1594969, 1618197, 1642183, 1666682, 1691603, 1716939, 1742899, 1770015, 1798829, 1829383, 1861044, 1892948, 1924684, 1956623, 1989581, 2024062, 2059847, 2096368, 2133411, 2171329, 2210613, 2251502, 2294093, 2338529, 2384805, 2432498, 2481031, 2530276, 2580732, 2633041, 2687487]
56030B687487N6547N8645O0904O3314O5754O8213P0766P3448P6220P9102Q2076
56019C442476Q4904Q7274Q9249R1341R3984R7130J00583J04487J09062J14059
56009D414549J18971J23762J28907J34613J40560J46560J52916J59896J67367
56000E688101J75290J84033J93814K04271K15105K26713K39561K53358K67572
55991G647818K82518K99183L18004L38491L60107L82953M07448M33821M62116
55982A0932459M92393N24961N60641O00604O45622O95679P50661Q11225Q78537
55973A6892782R53570J037345J131646J238888J361364J501296J661524J845647
55965B7624062K057853K303375K589032K922887L313859L772401M311015M943193
$$ y = [2687487, 2744034, 2802679, 2863583, 2926897, 2992651, 3060864, 3131630, 3205078, 3281298, 3360400, 3442476, 3527380, 3614654, 3703903, 3795244, 3889228, 3986358, 4086941, 4191428, 4300490, 4414549, 4533520, 4657282, 4786189, 4920802, 5061362, 5207922, 5360838, 5520734, 5688101, 5863391, 6047424, 6241238, 6445509, 6660614, 6887327, 7126888, 7380246, 7647818, 7930336, 8229519, 8547523, 8886014, 9246121, 9629074, 10036522, 10470343, 10932459, 11424852, 11949813, 12510454, 13111058, 13756680, 14452359, 15203020, 16014245, 16892782, 17846352, 18883697, 20015343, 21254231, 22615595, 24116891, 25778415, 27624062, 29681915, 31985290, 34574322, 37497209, 40811068, 44583469, 48894484, 53837677]
55957E3837677N682224O541840P537236Q684771J0002519J1513360J3245534J5223673
55949A32268834J7449440J9871778K2339661K4538689K5949559K5896348K3724927
55942B92039236J9069135J2085071L521459n441265j3536992j9793684k3768342
55935B64174618k5545715k5553862k4336628k2394530k0116911j7772522j5526176
55928A12928274j3466042j1630746j0028076q646239p463237o454763n597500
55921D9641671m869161m249190l720215l267898k879939k546338k259642k013354
55913B3835934j800487j614751j452214j310251j185528j074648r76029q89318
55905A3532708q13130p45066o83699o28845n79817n35159m94270m57679m25286
$$ y = [53837677, 59519901, 66061741, 73598977, 82283748, 92286267, 103799627, 117045161, 132268834, 149718274, 169590052, 191929713, 216468402, 242417961, 268314309, 292039236, 311108371, 323193442, 326714901, 321273636, 307736644, 287942960, 264174618, 238628903, 213075041, 188738413, 166343883, 146226972, 128454450, 112928274, 99462232, 87831486, 77803410, 69157171, 61693934, 55239171, 49641671, 44772510, 40523320, 36803105, 33535207, 30655268, 28108930, 25849288, 23835934, 22035447, 20420696, 18968482, 17658231, 16472703, 15398055, 14422026, 13532708, 12719578, 11974512, 11290813, 10661968, 10082151, 9546992, 9052722, 8595043, 8169757]
55896H169757l95745l68093l42603l19514k98181k78171k60025k44004k29092
55887E434329k14214j99903j87656j78009j70022j62501j55047j47898j41251
55878C877828j34919j28505j21929j15622j09929j04491r8749r2970q8189q4865
55868B797660q2285p9571p6699p4031p1457o8561o5348o2273n9616n7294n5081
55857B045444n2686m9781m6369m3055m0547l8879l7453l5888l4471l3635l3250
55846A599430l2676l1549l0211k9227k8549k7480k5584k3299k1427k0246j9419
55835A309763j8601j7679j6639j5693j5479j6476j8138j9210j9178j8831j9051
55824A114788j9635j9864j9706j9714j9915j9708j8932j8309j8507j9131j9175
$$ y = [8169757, 7774012, 7405919, 7063316, 6743802, 6445621, 6167450, 5907425, 5663421, 5434329, 5220115, 5020212, 4832556, 4654547, 4484525, 4322024, 4166977, 4019079, 3877828, 3742909, 3614404, 3492475, 3376853, 3266924, 3162433, 3063684, 2970714, 2882525, 2797660, 2715375, 2635804, 2559105, 2485074, 2413617, 2345056, 2279708, 2217435, 2157819, 2100525, 2045444, 1992758, 1942977, 1896608, 1853553, 1813006, 1774127, 1736674, 1700786, 1666315, 1632680, 1599430, 1566754, 1535205, 1504994, 1475767, 1447218, 1419738, 1394154, 1370855, 1349428, 1329182, 1309763, 1291162, 1273483, 1256844, 1241151, 1225672, 1209196, 1191058, 1171848, 1152670, 1133839, 1114788, 1095153, 1075289, 1055583, 1035869, 1015954, 996246, 977314, 959005, 940498, 921367, 902192]
55813I02192j8178j6562j4933j3488j2131j0842r615q307o799n266m034l135k258
55800G76644j238l15K29N03P90J004O02j027m172q663j3752j8267k1156k2052
55786F89130k1210j9079j6202j3378j1350j0192r304q155o840n805n314n340n679
55773E51282o001o038n933o208p196q525r417r444q860q287q096q185q237q257
55759D42598q627r457j0105r759q515p442p336p812p906p293o507o099o012n797
55745C33931n188m374l786l691l912m035l866l622l595l795l986l891l382k652
55731B80156k165k228k473k228j457r19j158j842k474l216m324n202m931l698
55717B41841k757k741k840k117r56m43p56j017o36p0P5J03P95K127K938K219N00
$$ y = [902192, 884014, 867452, 852519, 839031, 826900, 816058, 806443, 798136, 791337, 786071, 782037, 778902, 776644, 775406, 775091, 775320, 775823, 776613, 777617, 778219, 777192, 773020, 764357, 750605, 732338, 711182, 689130, 667920, 648841, 632639, 619261, 607911, 597719, 588415, 580260, 573420, 567615, 562301, 556961, 551282, 545281, 539243, 533310, 527102, 519906, 511381, 501964, 492520, 483660, 475373, 467277, 459092, 450855, 442598, 433971, 424514, 414409, 404650, 396135, 388693, 381357, 373545, 365639, 358346, 351839, 345740, 339728, 333931, 328743, 324369, 320583, 316892, 312980, 308945, 305079, 301457, 297862, 294067, 290081, 286190, 282808, 280156, 277991, 275763, 273290, 271062, 269605, 268686, 267528, 265686, 263212, 259996, 255672, 250470, 245539, 241841, 239084, 236343, 233503, 231386, 230430, 229987, 229231, 228214, 227578, 227508, 227583, 227686, 228481, 230608, 233546, 235765, 236265]
55700B36265n61k2J190J415K59j038j252n96j14k12l08J86J129J980K421K501
55684B43243K393K166J710Q38l71j435j892j824j724j892k264k768l425l996l980
55669B24779l269k442k087k113k027j594r37k00M95R45J112J326J816K322K475
55654B20601K481K801L300L338K720J877J075J13r76j652j691j624j888k113j844
55639B26518j436j566k181k645k734k696k532j960j202j011j731k869l820m532
55625A93603n221n873o318o478o362o059n788n642n270m301l145k753l322l858
55611A23213l491k654k309k451k229j371o28o00q92q55n95o56j085j354j236j154
55595I9653j485j909j837j276q77j069j466j351n28N39J357J879K288K539K423
$$ y = [236265, 235704, 235682, 236872, 238287, 238546, 237508, 236256, 235660, 235546, 235334, 235026, 235212, 236341, 238321, 240742, 243243, 245636, 247802, 249512, 250350, 249979, 248544, 246652, 244828, 243104, 241212, 238948, 236180, 232755, 228759, 224779, 221510, 219068, 216981, 214868, 212841, 211247, 210310, 210110, 210605, 211550, 212662, 213988, 215804, 218126, 220601, 223082, 225883, 229183, 232521, 235241, 237118, 238193, 238306, 237330, 235678, 233987, 232363, 230475, 228362, 226518, 225082, 223516, 221335, 218690, 215956, 213260, 210728, 208768, 207566, 206555, 204824, 201955, 198135, 193603, 188382, 182509, 176191, 169713, 163351, 157292, 151504, 145862, 140592, 136291, 133146, 130393, 127071, 123213, 119722, 117068, 114759, 112308, 110079, 108708, 108080, 107480, 106588, 105733, 105138, 104482, 103397, 102043, 100807, 99653, 98168, 96259, 94422, 93146, 92269, 91200, 89734, 88383, 87855, 88394, 89751, 91630, 93918, 96457, 98880]
55580I8880K080K174L275N068O442O570N742M817M067K993J302n38k010l324m904
55565A32634o472p230o880n904m826l752k720j971j619j482j441j655k148k472
55551H2062k124j161j93J54l09j203j821j690j061o86r93j635j995j858j456j087
55535F2944r17r72j026o51L43J506K081J815J300J306J849K150J627P30M28R79
55519G5492J667J883J859J993K082J904J999K955M150M283L194K049J619J376
55505A08505O45m42j658l266n128o182n758m707m240m267l999l495l410l502k843
55490E6253j467n22n86j053j404j910k588k648j683n56k97p79j185j239j152q81
55474C6303k74K42M6o75j033o68k43n02j286j806j620j010n07k94j41J80N52O93
$$ y = [98880, 100960, 103134, 106409, 111477, 117919, 124489, 130231, 135048, 139115, 142108, 143410, 142872, 140862, 137538, 132634, 126162, 118932, 112052, 106148, 101322, 97570, 94850, 92879, 91260, 89778, 88337, 86682, 84534, 82062, 79938, 78777, 78584, 78738, 78429, 77226, 75405, 73715, 72654, 71968, 70975, 69340, 67345, 65487, 64031, 62944, 62027, 61055, 60029, 59378, 59721, 61227, 63308, 65123, 66423, 67729, 69578, 71728, 73355, 74085, 74513, 75492, 77159, 79042, 80901, 82894, 84976, 86880, 88879, 91834, 95984, 100267, 103461, 105510, 107129, 108505, 109150, 108708, 107050, 103784, 98656, 92474, 86716, 82009, 77769, 73502, 69503, 66008, 62598, 59096, 56253, 54786, 54264, 53678, 52625, 51221, 49311, 46723, 44075, 42392, 41836, 41539, 40760, 39575, 38336, 37184, 36303, 36029, 36271, 36317, 35642, 34609, 33941, 33698, 33196, 31910, 30104, 28484, 27474, 26967, 26673, 26532, 26712, 27264, 27957]
55456B7957N22K65J77L08N06N11P4p49j498j648j180n22m6J75J66k6j71o1O9l02
55436B4527j196j985k151j825j310n69M68J437J864J707J263P64L54J87K00O2
55420B3797k68k68L56J020R42K81j58j51j80l72k12M44Q60M20m74j010j022r20
55402B3085r42r95r57o85M8J114J805J591Q92N17N02J80n78j068q48l98k73k55
55384B2735P2M30K11n22j078j083q17o05m55l24k78k20Q0N25O44K53k37l49p6
55365A8906L13P06J042J075N89k42r80j338j305j052r00j145j656j806j087K40
55349A1360J325J538R16M0l90k9O56O90l28j573j802q05L87P69M52K56N18P08
55331A4688K15p53j320j048m87l25k50N59J874K258R62p75j196k10P06N38l60
$$ y = [27957, 28479, 28744, 28921, 29229, 29735, 30246, 30320, 29571, 28073, 26425, 25245, 24723, 24677, 24852, 25018, 24992, 24821, 24760, 24829, 24527, 23331, 21346, 19195, 17370, 16060, 15491, 15959, 17396, 19260, 20967, 22230, 22994, 23348, 23535, 23735, 23797, 23529, 23261, 23617, 24637, 25579, 25860, 25702, 25551, 25371, 24999, 24787, 25231, 26091, 26511, 26037, 25027, 24005, 23085, 22143, 21148, 20191, 19506, 19554, 20668, 22473, 24064, 24956, 25473, 25975, 26155, 25577, 24509, 23661, 23263, 22990, 22735, 22807, 23237, 23448, 22926, 21848, 20765, 19948, 19343, 18888, 18564, 18286, 18066, 18146, 18671, 19315, 19568, 19331, 18982, 18906, 19219, 19925, 20967, 22042, 22631, 22389, 21409, 20071, 18766, 17714, 16814, 15669, 14013, 12207, 11120, 11360, 12685, 14223, 15139, 15179, 14789, 14760, 15416, 16106, 15778, 14205, 12403, 11598, 11985, 12754, 13206, 13462, 13980, 14688, 14903, 14150, 12830, 11782, 11295, 10970, 10720, 11279, 13153, 15411, 16373, 15598, 14402, 14192, 14898, 15436, 15076]
55314A5076j225j731j705r33L11J255J437J065M51k36n37J13J317J670M21j397
55298A5352k165j543m61L51R93J665K044J626M39p89j189n80J88J15p63j397j095
55281A2791k59M36Q94J219J114L83l88l51N20J425J636J017n9q38o18M08J084
55264B0414O26l70q75q77j026j221p43K98Q18L60k31j28L70N36K76r7n14r90j255
55245A5371j105q22p19n82p1N42N94n9q67j236j112p67l93k4L15N31N74N49O11
55226A1330P08N84J71k15k45o5p0l30m76k40J86L34j54j138j898j599k82R71J179
55207H751N69M8p0j39k14L8M93N52J87J01O06J139J200R44M83m53j575j737l97
55188A0526J307J874J246M40m7n00r24q99m12Q2M14P42Q74M12l92p03k04N65J046
$$ y = [15076, 13851, 12120, 10415, 9482, 9793, 11048, 12485, 13550, 14001, 13765, 13228, 13341, 14658, 16328, 16749, 15352, 13187, 11644, 11183, 11534, 12527, 14192, 16236, 17862, 18301, 17512, 16323, 15743, 15931, 16046, 15283, 13886, 12791, 12532, 12968, 13862, 15081, 16195, 16578, 16190, 15839, 16359, 17784, 19420, 20437, 20378, 19540, 18922, 19330, 20414, 21040, 20670, 19795, 18918, 17892, 16671, 15928, 16226, 17044, 17404, 17173, 17045, 17415, 17951, 18227, 18130, 17616, 16626, 15371, 14266, 13444, 12725, 12143, 12072, 12614, 13208, 13149, 12282, 11046, 9934, 9167, 8774, 8750, 9065, 9596, 10170, 10719, 11330, 12038, 12622, 12793, 12578, 12333, 12268, 12198, 11868, 11392, 11152, 11338, 11672, 11518, 10380, 8482, 6883, 6601, 7572, 8751, 9320, 9368, 9298, 9159, 8945, 8983, 9476, 10028, 10215, 10316, 10922, 12061, 13261, 14205, 14688, 14235, 12660, 10923, 10526, 11833, 13707, 14953, 15393, 15346, 14846, 13922, 13023, 12611, 12693, 13107, 13849, 14723, 15135, 14743, 14040, 13836, 14401, 15447]
55169A5447J174R65M03j31m0N47O95q1j125j499j082l96J26L03O6m09p13p23p72
55150A2755r94r36j99Q35J393J178M97k01n77m34N6L33L1n40q08o16j51M57J098
55131A3177J455J403J371J757K080J446o9j270j270m53L48J045K029L096L380
55116B9525K442R73J14K89R53J357J399J515J868J978J406M88q3l26r42k053k679
55099C8224k061r76r01j982k787k268j134p54j259j537q36L54J140J269J124J035
55083B6651J006R02O61L30M1j04j65k80m31m01j32J05K9k42l18j2M49O39L16l72
55063B8672r21q44j29O45Q51M21j66m46l47q1J25J75R6K7J01K98N25P53J024J297
55043C2076J456J431J234Q50K83k73m54p0O38J220J422J401J500J925K561L069
$$ y = [15447, 16621, 17586, 17989, 17858, 17818, 18365, 19060, 18979, 17854, 16355, 15273, 14877, 15003, 15306, 15372, 14963, 14250, 13527, 12755, 11761, 10825, 10626, 11461, 12854, 14032, 14529, 14328, 13751, 13317, 13373, 13706, 13737, 13197, 12389, 11773, 11622, 12079, 13177, 14632, 16035, 17406, 19163, 21243, 22689, 22620, 21350, 20080, 19627, 19975, 21020, 23049, 26145, 29525, 31967, 32940, 33054, 33343, 34296, 35653, 37052, 38567, 40435, 42413, 43819, 44307, 44224, 43898, 42956, 40903, 38224, 36163, 35187, 34286, 32304, 29517, 27249, 26115, 25361, 24102, 22565, 21729, 22083, 23223, 24492, 25616, 26651, 27657, 28559, 29220, 29550, 29591, 29487, 29322, 29042, 28611, 28210, 28078, 28183, 28212, 27970, 27652, 27640, 28089, 28728, 29044, 28672, 27751, 26907, 26778, 27423, 28274, 28695, 28529, 28083, 27736, 27655, 27780, 27955, 28051, 28078, 28179, 28477, 29002, 29755, 30779, 32076, 33532, 34963, 36197, 37047, 37330, 37057, 36603, 36533, 37171, 38391, 39813, 41214, 42714, 44639, 47200, 50269]
55027E0269L175K837K200J479Q66M60J86j10m28n66m41k38j19K4K96M71K32l97
55009F0196j132j825k353k376j666p54n59j182j708j501j095j297j910j986j115
54994C7737J91J236J707J531Q31M9l06k16l0J60O03J281J717J601J129O24K02
54977E0047J2K76Q18J004N75J57M77J386K218K763L276L672L495K790K353K785
54961G8104L807M865N985P582R634J1618J3177J4347J5054J4814J3252J0671P724
54948B10634M605R80l184p125r876j1217j1635j1638j1424j1210j1194j1066j0135
54935A06515q311o514n595n300m820m021l359k756j541L22J805K062J499J106
54921G1092J278J796K528L501M540N429O377P715R246J0409J1047J1541J2027
$$ y = [50269, 53444, 56281, 58481, 59960, 60826, 61286, 61472, 61362, 60934, 60368, 59927, 59689, 59570, 59594, 59890, 60361, 60593, 60196, 59064, 57239, 54886, 52510, 50844, 50090, 49531, 48349, 46641, 45140, 44045, 42748, 40838, 38852, 37737, 37928, 39164, 40871, 42402, 43233, 43282, 42976, 42760, 42730, 42890, 43493, 44774, 46491, 48092, 49221, 49845, 50047, 50059, 50335, 51153, 52157, 52732, 52889, 53366, 54752, 56970, 59733, 63009, 66681, 70176, 72966, 75319, 78104, 81911, 86776, 92761, 100343, 109977, 121595, 134772, 149119, 164173, 178987, 192239, 202910, 210634, 215239, 216219, 213035, 205910, 196034, 184817, 173182, 161544, 150120, 138910, 127716, 116650, 106515, 98204, 91690, 86095, 80795, 75975, 71954, 68595, 65839, 64298, 64620, 66425, 68487, 69986, 71092, 72370, 74166, 76694, 80195, 84735, 90164, 96541, 104256, 113502, 123911, 134958, 146499, 158526]
54908A58526J1953J0605P853M202L61l212o496r627j2314j3798j3703j2671j1696
54895A09983j0939r823q216o775n948n376m606l801l228k622j637n34J48L57L77
54880D7360K15k13m70O8J167J758J242K29l26k60p1l8K0K51M60L78mm66q52j234
54860D9214j795k497k956k731j830q10l41o38j277j496q42L23J046P00l44j172
54844C2554j413j428j466j110K7J412J987J423N54L81R56J489J282L50p43j327
54828C4928j013j9Q63R23L34KM19J034J081P54R68J961K869K847K144J620J657
54811E3372K013K465L010L577M009M439N259O604Q160R561J0736J1830J2912J3763
54797A51710J3861J2691J0302P276L978K08l987p608r571j0056j0116j0071r361
$$ y = [158526, 170479, 181084, 188937, 193139, 193500, 190288, 183792, 174165, 161851, 148053, 134350, 121679, 109983, 99044, 89221, 81005, 74230, 68282, 62906, 58300, 54499, 51271, 48649, 47012, 46478, 46626, 46983, 47360, 47575, 47362, 46892, 46960, 48127, 49885, 51127, 51356, 51030, 50770, 50699, 50661, 50681, 50932, 51392, 51770, 51766, 51300, 50448, 49214, 47419, 44922, 41966, 39235, 37405, 36595, 36254, 35616, 34339, 32843, 32001, 32324, 33370, 34070, 33726, 32554, 31141, 29713, 28247, 27137, 27164, 28576, 30563, 31986, 32540, 32921, 33877, 35366, 36648, 36998, 36255, 34928, 33915, 33896, 34759, 35682, 36016, 36018, 36437, 37471, 38552, 39306, 40274, 42235, 45104, 47951, 50095, 51715, 53372, 55385, 57850, 60860, 64437, 68446, 72885, 78144, 84748, 92908, 102469, 113205, 125035, 137947, 151710, 165571, 178262, 188564, 195840, 199818, 200026, 196039, 188431, 178860, 168804, 158688, 148617, 139256]
54784A39256q061p345p718q021p005n199m017l668l197k303j720j707j460n38
54770G7297L03L43J68Q64K425L903M773N366O035O701P396Q551J0319J1987J2585
54755A59016J1917J0730R802R164Q176O239L303j01l194n393o665p466q174q643
54741A78711q477p776p191p169p420p431p222p218p550p881p864p388o444n164
54727G6516m028l507l430l115k302j499j177j126r96j024j618k426k514j528k11
54712D6015M66L45j6j34n4o2k53m49m68l29j63nK22N23P76R27J045J121R76N48
54692E1031J66K00N34O68M23K41O09J327J687J297N34R4K41P13J203J676K133
54675F4777K381K259J947J759J673J388P79O1n41r26r33m86Mr9p06q65n2R03Q52
$$ y = [139256, 131195, 123850, 116132, 108111, 101106, 95907, 91890, 88222, 85025, 82722, 81002, 79295, 77835, 77297, 77600, 77943, 78111, 78975, 81400, 85303, 90076, 95442, 101477, 108178, 115574, 124125, 134444, 146431, 159016, 170933, 181663, 191465, 200629, 208805, 215044, 218347, 218246, 215052, 209659, 202994, 195528, 187354, 178711, 170234, 162458, 155267, 148098, 140678, 133247, 126025, 118807, 111257, 103376, 95512, 88124, 81680, 76516, 72488, 68981, 65551, 62436, 60134, 58635, 57458, 56332, 55336, 54312, 52694, 50268, 47754, 46226, 46015, 46481, 46826, 46810, 46676, 46622, 46560, 46307, 45858, 45390, 45061, 44898, 44893, 45115, 45638, 46414, 47341, 48386, 49507, 50483, 51031, 51197, 51397, 51931, 52599, 53022, 53263, 53872, 55199, 56886, 58183, 58717, 58811, 59052, 59765, 60968, 62644, 64777, 67158, 69417, 71364, 73123, 74796, 76184, 76963, 77024, 76483, 75557, 74624, 74138, 74142, 74043, 73337, 72472, 72420, 73323, 74175]
54656G4175o8o80m53j3J66N99J783L135L646L247K817L031L774M607N265N650
54640A10681N780N889O323P190Q284R348J0220J0771J0938J0693R791P702M206
54627B17816J1l703o380q394j0119j1238j1282j0423r335q430p677p050o683o524
54613A10589o184n368m260l341k880k739k648k552k622k940l257l228k795k252
54599F3523j867j553j054l20L51N84L08r3j23K28L14m01j511j988j458o88n34
54582E3718q27p87k17L35M97M56L57m2q02j393j312p55l32k49k55k06k48m29n00
54563D7009k50K00N13M92K76J60K98N31N97M80L85L79K79N5j0K51N10L82M1JM07
54542E2986Q95J165J247J151P39J14k30P6Q61J665K212K516K714L036L678M505
$$ y = [74175, 74107, 73427, 72974, 72961, 73127, 73726, 75509, 78644, 82290, 85537, 88354, 91385, 95159, 99766, 105031, 110681, 116461, 122350, 128673, 135863, 144147, 153495, 163715, 174486, 185424, 196117, 205908, 213610, 217816, 217827, 214124, 207744, 199350, 189231, 177993, 166711, 156288, 146953, 138523, 130846, 123796, 117113, 110589, 104405, 99037, 94777, 91436, 88556, 85817, 83169, 80617, 77995, 75055, 71798, 68570, 65775, 63523, 61656, 60103, 59049, 58729, 59080, 59664, 59972, 59879, 59756, 59984, 60298, 59897, 58386, 56398, 54940, 54252, 53718, 52891, 52104, 51887, 52222, 52719, 53175, 53532, 53490, 52688, 51295, 49983, 49228, 48896, 48647, 48392, 48186, 47938, 47509, 47009, 46759, 46959, 47472, 47964, 48240, 48400, 48698, 49229, 49826, 50306, 50691, 51070, 51349, 51404, 51394, 51645, 52155, 52537, 52578, 52579, 52986, 53881, 55046, 56293, 57444, 58183, 58297, 58067, 58143, 59004, 60669, 62881, 65397, 68111, 71147, 74825, 79330]
54526G9330N060N120M988N004N025M745M269L915L529K468M44k037m146n439n907
54511A06368n710n090m376l787l283k749k276k051k058k045j823j486j313j422
54497F6899j582j402p30J60Q57J203J286J107N68j66o42o30m68o10r62j006n71
54480F3311j03o1l25m00p2L34L35k09r49j294r36j91K08j57q85j148o07K28O47
54461E7726N02K19J66K79L11K27K19L96O02N55J33m49q04o94k31K73N95O75M86
54442F1186L1n62j020j153r84o49k16K53O05O44L26j99o56q01n41NN59Q54P53
54423E8435K95k46m19%O52R09O22L50O00J186J598J789K130K723L175L120K683
54406G9602K298K333K806L319L242K341J133L50N2l22j086j932k441k506k151
$$ y = [79330, 84390, 89510, 94498, 99502, 104527, 109272, 113541, 117456, 120985, 123453, 123897, 121860, 117714, 112275, 106368, 100658, 95568, 91192, 87405, 84122, 81373, 79097, 77046, 74988, 72943, 71120, 69634, 68321, 66899, 65317, 63915, 63185, 63345, 64202, 65405, 66691, 67798, 68366, 68200, 67558, 66928, 66460, 65850, 64888, 63882, 63311, 63208, 63147, 62822, 62422, 62350, 62684, 63019, 62810, 61861, 60567, 59631, 59440, 59648, 59491, 58606, 57458, 56851, 57079, 57726, 58228, 58447, 58613, 58892, 59203, 59430, 59649, 60045, 60647, 61202, 61335, 60886, 60082, 59388, 59157, 59430, 60025, 60700, 61186, 61217, 60655, 59635, 58482, 57498, 56849, 56633, 56886, 57491, 58135, 58461, 58262, 57606, 56805, 56264, 56269, 56828, 57682, 58435, 58730, 58484, 58065, 58065, 58717, 59626, 60248, 60598, 61198, 62384, 63982, 65771, 67901, 70624, 73799, 76919, 79602, 81900, 84233, 87039, 90358, 93600, 95941, 97074, 97424, 97476, 97154, 96068, 94136, 91695, 89189, 87038]
54391H7038j520j129j496k269k390j538o85p07j133j022m81l08n24m02M2j21j239
54374G0116k346k444j734j031p05o71q71j082p56K70J231J326Q69Q81J602K195
54358F6850J966J241Q05R03J170J236J105R91J037J239J559J981K405K494J858
54343H8840N30r15j850k123k041j965k034k120j921j290o42p14j639k555k497
54328F5064j559p23o83j219j729j872j654j237q90p98q43p55n74o21r67j223j039
54311D6678n94l48m75p13o93k65L75Q55R09O09K55Q2P0ol80r98j351q68K99J165
54291D4606R72J47k28J76O41N14Nk68o2M38R35J159J020P85P64P61K58o61j191
54272E0771q90k91RK66Q69J295P28n09j148o60J68N26O00Q28R43M52l75p35m03
$$ y = [87038, 85518, 84389, 82893, 80624, 78234, 76696, 76011, 75304, 74171, 73149, 72668, 72360, 71836, 71434, 71476, 71355, 70116, 67770, 65326, 63592, 62561, 61856, 61185, 60314, 59232, 58476, 58746, 59977, 61303, 62172, 63053, 64655, 66850, 68816, 70057, 70862, 71765, 72935, 74171, 75276, 76267, 77304, 78543, 80102, 82083, 84488, 86982, 88840, 89370, 88455, 86605, 84482, 82441, 80476, 78442, 76322, 74401, 73111, 72469, 71755, 70116, 67561, 65064, 63505, 62782, 62099, 60880, 59151, 57279, 55625, 54388, 53498, 52700, 51857, 51102, 50528, 49907, 48940, 47717, 46678, 46084, 45736, 45261, 44548, 43855, 43590, 43965, 44820, 45729, 46338, 46593, 46675, 46745, 46739, 46359, 45361, 44010, 43142, 43441, 44606, 45578, 45725, 45497, 45673, 46314, 46828, 46833, 46565, 46503, 46941, 47876, 49035, 50055, 50840, 51604, 52365, 52623, 51962, 50771, 49881, 49590, 49599, 49865, 50734, 52029, 52757, 52248, 51100, 50440, 50608, 51134, 51734, 52562, 53505, 53957, 53582, 52847, 52444]
54253E2444N7K10L10O90J074Q70J7q77j217j039p73o47n21k62QJ60L04N99Q60
54234E2267P06J40k71n4M09J79j011k174k120j010k60p41j677j749r02k32l84
54217D1116r02j219j414j634j506p59J38N32M63M00M19K26j92n18n96m36P7R49
54199C5144J653J585R14L59R4l75j164j481o46Q54J812J588N91l60q57j072j268
54182C7371j298p43L68J269J229M30k93m57k50MJ50On27j112j241r24n76k59K89
54163C3436P71M34o49j264o00O31J250J154J030J098J039Q44P81O42p9j181j744
54146C7593j314m78RJ30L01O05O88L14k53m17J23Q93J010J76q50j101n18J66L72
54127C7449J11l87q30p51J05J183J471O50n31j175j066m98K38Q47R82O34K66K89
$$ y = [52444, 52501, 52711, 53021, 53711, 54785, 55655, 55672, 54795, 53578, 52539, 51766, 51119, 50598, 50336, 50344, 50504, 50808, 51407, 52267, 52973, 53113, 52842, 52788, 53197, 53376, 52365, 50191, 48071, 47061, 46801, 46060, 44383, 42634, 41732, 41500, 41116, 40214, 38995, 37581, 35947, 34441, 33682, 33820, 34352, 34815, 35215, 35634, 35860, 35668, 35150, 34554, 34118, 34195, 35144, 36797, 38382, 39296, 39655, 39749, 39374, 38210, 36729, 36083, 36937, 38749, 40337, 40928, 40568, 39711, 38639, 37371, 36073, 35330, 35698, 36967, 38196, 38626, 38333, 37876, 37626, 37630, 37780, 37786, 37259, 36147, 34906, 33982, 33406, 33147, 33436, 34207, 34641, 33992, 32728, 32128, 32759, 34009, 35163, 36193, 37291, 38330, 39174, 39955, 40597, 40518, 39337, 37593, 36279, 35801, 35810, 35940, 36241, 36846, 37534, 37848, 37595, 37178, 37301, 38194, 39204, 39380, 38530, 37429, 36911, 37077, 37449, 37560, 37173, 36343, 35592, 35697, 36880, 38351, 39001, 38470, 37295, 36229, 35731, 35969, 36816, 37798, 38432, 38698, 38987]
54109C8987O11R22J095J050N48m02j168j009%R52J096N84J23J03L28M30L43K41
54091D4834K39L20N31R08J187R34J57m99m60R5O29J047J608K215K377J966J366
54074E9454R24N91L48L29M02J66l72o68m78k22j88L3P71J450J326P04N80J223
54056F6373J876J862J373R80R99J447K184K894L312L603M075M536M439L760L204
54041A06917L232L438L254K819K676K908L120L060K741K102J064k9n72m13l8J10
54025A36389R0L6l43j398k849l913m202m107m193m445m426l995l556l500l671
54010I1917l585l036k288j726j487j482j510j305o91P2K69n59j902k560j882m46
53994F7799O05P56L77Kk53n10p63q66p13k49M48J029J052N85L52Q56J541J326
$$ y = [38987, 39598, 40520, 41615, 42665, 43213, 42811, 41643, 40634, 40634, 41586, 42682, 43266, 43389, 43492, 43820, 44250, 44593, 44834, 45073, 45393, 45924, 46832, 48019, 48953, 49110, 48611, 48151, 48246, 48875, 49922, 51530, 53745, 56122, 58088, 59454, 60378, 60969, 61317, 61646, 62048, 62214, 61842, 61174, 60696, 60474, 60286, 60319, 61090, 62540, 63866, 64570, 65150, 66373, 68249, 70111, 71484, 72464, 73463, 74910, 77094, 79988, 83300, 86903, 90978, 95514, 99953, 103713, 106917, 110149, 113587, 116841, 119660, 122336, 125244, 128364, 131424, 134165, 136267, 137331, 137302, 136730, 136317, 136279, 136389, 136479, 136515, 136172, 134774, 131925, 128012, 123810, 119703, 115510, 111065, 106639, 102644, 99088, 95588, 91917, 88332, 85296, 83008, 81282, 79795, 78313, 76803, 75498, 74807, 74879, 75148, 74589, 72687, 70127, 68245, 67799, 68404, 69160, 69537, 69539, 69286, 68776, 68013, 67147, 66434, 66185, 66633, 67662, 68714, 69299, 69651, 70507, 72048, 73374]
53976G3374jj412j854j353o86l06j09J5o9l71o19n81l27pL31O14O72N64P15J432
53956G0022K334K630K025J110O76Q90J323J665K072K754L440L550K876J941J618
53941A00926K322L637M799N480O050P011Q333R498J0046R947R432Q735Q045P520
53927B01781P151O756O129N167L895K517J459J021R26N14m32j430k053k521l163
53912B27717l690l614l178l141l672m122m073l996m465n299n848n858n596n313
53898A65852m992m589m240m133m310m576m631m345l941l678l536l375l340l595
53884A08571l695k902j340k54o30j946k851k748k145j708j599j774k286l029l566
53869G6098l462k713j729r48m54O5Q67J708J985J422L52p23j501j732j197j49
$$ y = [73374, 73373, 71961, 70107, 68754, 68068, 67762, 67653, 67668, 67599, 67228, 66609, 66028, 65701, 65694, 66025, 66639, 67311, 67875, 68590, 70022, 72356, 74986, 77011, 78121, 78797, 79687, 81010, 82675, 84747, 87501, 90941, 94491, 97367, 99308, 100926, 103248, 106885, 111684, 117164, 123214, 130225, 138558, 148056, 158102, 168049, 177481, 186216, 194261, 201781, 208932, 215688, 221817, 226984, 230879, 233396, 234855, 235876, 236802, 237316, 236884, 235454, 233401, 230880, 227717, 224027, 220413, 217235, 214094, 210422, 206300, 202227, 198231, 193766, 188467, 182619, 176761, 171165, 165852, 160860, 156271, 152031, 147898, 143588, 139012, 134381, 130036, 126095, 122417, 118881, 115506, 112166, 108571, 104876, 101974, 100634, 100380, 99750, 97804, 94953, 92205, 90060, 88352, 86753, 84979, 82693, 79664, 76098, 72636, 69923, 68194, 67246, 66792, 66857, 67724, 69432, 71417, 72839, 73191, 72468, 70967, 69235, 68038, 67889]
53853F7889P15J103J479K106K313J434L7o83n47m69r00j224q79k36J18K20L88
53836G2864N75N91O22R52J430J540R97M8o78o05K92J294J589J141O59P13J305
53819H5329K175L000L249K567J467R87J427K100K569L248M347N050M588L440K624
53804A28167K304J987J672J746J958J607P81M28J011J845K079J599P95K9m09m24
53788A47175m90j284k723l887m214m136m204m250l917l552l682m049l889l198
53774I9700k843l268l774l468k480j730j692j890j655j012n51o43j028j210j036
53759G1420p95q35j187j491j355q10l75n11r91j114n50K33N47K25l78q38r25o13
53741E9657j97j35m98p48m29Q9N0o54j314j281n66M39J330J748J531R31L40k06
$$ y = [67889, 68604, 69707, 71186, 73292, 75605, 77039, 77076, 76393, 75846, 75377, 74477, 73253, 72374, 72138, 72256, 72476, 72864, 73439, 74030, 74652, 75604, 77034, 78574, 79571, 79619, 78941, 78336, 78628, 79922, 81511, 82652, 83311, 84024, 85329, 87504, 90504, 93753, 96320, 97787, 98774, 100201, 102301, 104870, 108118, 112465, 117515, 122103, 125543, 128167, 130471, 132458, 134130, 135876, 137834, 139441, 140222, 140650, 141661, 143506, 145585, 147184, 147979, 148008, 147599, 147175, 146685, 145401, 142678, 138791, 134577, 130441, 126237, 121987, 118070, 114518, 110836, 106787, 102898, 99700, 96857, 93589, 89815, 86347, 83867, 82137, 80445, 78555, 76900, 75888, 75337, 74694, 73666, 72456, 71420, 70625, 69790, 68603, 67112, 65757, 64947, 64572, 64061, 63070, 61956, 61406, 61639, 62186, 62411, 62033, 61195, 60270, 59657, 59460, 59325, 58827, 58079, 57650, 57739, 57789, 57135, 55821, 54540, 53974, 54413, 55743, 57491, 59022, 59953, 60293, 60087]
53723F0087q55j334j088j14R26J625K209K749K646J487j17j127j256r76o97n03
53707F3662m51n25l89J91Q02P99K86P8O30J587K438L029L271K973K282J812J905
53690H4380K120J897J423J396J994K573K415J464L27k90j15M73Q10O35L51M32
53674A02285P11O31J62o0L79J004J061M87j12l10k35r6J33M17M74K02k5J47M83
53655A07738N14K98L27P13R99Q58M98J97p8l34k93P7K10l46j110j239p38m39p21
53636A07131r97p28k42q5j13J43N15L91k21n77k94J38K18K46P10J331J430J050
53618A10046R56J430J793J398N31j15l70m21j64O00J514J926J801J705J822J748
53602A26200J385J269J604J699R95Q6rP47J497J788K020K589L292L687L547K843
$$ y = [60087, 59232, 57898, 56810, 56696, 57622, 59247, 61456, 64205, 66851, 68338, 68221, 67094, 65838, 64862, 64165, 63662, 63211, 62686, 62297, 62488, 63290, 64089, 64375, 64453, 65083, 66670, 69108, 72137, 75408, 78381, 80663, 82475, 84380, 86500, 88397, 89820, 91216, 93210, 95783, 98198, 99662, 99989, 99699, 99584, 100057, 100867, 101502, 101853, 102285, 102996, 103627, 103789, 103729, 104108, 105112, 106173, 106660, 106548, 106238, 106003, 105907, 106040, 106457, 106931, 107133, 107108, 107255, 107738, 108252, 108550, 108877, 109590, 110589, 111447, 111945, 112142, 112064, 111730, 111437, 111514, 111724, 111378, 110268, 109029, 108291, 107852, 107131, 106134, 105406, 105164, 105079, 104966, 105109, 105624, 106015, 105794, 105217, 104923, 105061, 105279, 105525, 106235, 107566, 108996, 110046, 111002, 112432, 114225, 115623, 116154, 116039, 115669, 115248, 115084, 115684, 117198, 119124, 120925, 122630, 124452, 126200, 127585, 128854, 130458, 132157, 133152, 133238, 133229, 133976, 135473, 137261, 139281, 141870, 145162, 148849, 152396, 155239]
53586A55239J773R27Q19J174J161N15j05j20J22o2o98j176j116p15m16m93q71
53569A55958j110p15L11J292J516R08m0p98j112r72o21m26n51q08r73r82p67j77
53551A49933O50J179J117R09J102J449J215K81o02p09n7Q72J681K152K133J657
53535A64962R83M26K31N07J113J602J590J253J170J667K535L361L856L877L522
53520A92655L280L632M345M596M005L199L091L868M976N827O221O307O416O818
53506B59236P424P858P999Q217Q861R749J0435J0810J1088J1414J1760J2138J2584
53493C89573J3032J3417J3797J4147J4191J3785J3292J3228J3603J3960J4053
53482E40078J4027J4023J3924J3671J3518J3784J4444J5033J4894J3704J1928
$$ y = [155239, 157012, 157939, 158758, 159932, 161093, 161608, 161503, 161383, 161505, 161443, 160745, 159569, 158453, 157738, 157322, 156829, 155958, 154848, 154133, 154444, 155736, 157252, 158160, 158120, 157322, 156210, 155238, 154617, 154191, 153640, 152832, 151859, 150877, 150110, 149933, 150583, 151762, 152879, 153788, 154890, 156339, 157554, 157835, 157233, 156524, 156467, 157339, 159020, 161172, 163305, 164962, 165945, 166371, 166602, 167109, 168222, 169824, 171414, 172667, 173837, 175504, 178039, 181400, 185256, 189133, 192655, 195935, 199567, 203912, 208508, 212513, 215712, 218803, 222671, 227647, 233474, 239695, 246002, 252418, 259236, 266660, 274518, 282517, 290734, 299595, 309344, 319779, 330589, 341677, 353091, 364851, 376989, 389573, 402605, 416022, 429819, 443966, 458157, 471942, 485234, 498462, 512065, 526025, 540078, 554105, 568128, 582052, 595723, 609241, 623025, 637469, 652502, 667396, 681100, 693028]
53471F93028J0590J0322J0743J1051J0998J0892J0894J0894J0971J1293J1513
53460H13189J0902R335P572O241N130L791K344J168K14q49k042l153m214n420
53446H44208o659p580q062q283q381q353q250q251q517r167j0145j0955j0916
53433G30689r981r061r018r692j0318j0644j0908j0933j0119q443o708n474m384
53420F15006k935j366l18Qr5k84k57L29J545K891L691L736L363L099L439M702
53404F36554O710Q693R940J0486J0912J1547J2226J2738J3165J3724J4530J5591
53392G76816J6804J7935J8849J9699K0748K2020K3374K4834K6465K8011K8977
53381A024532K9255K9292K9475K9682K9677K9648K9997L0749L1479L1790L1545
$$ y = [693028, 703618, 713940, 724683, 735734, 746732, 757624, 768518, 779412, 790383, 801676, 813189, 824091, 833426, 840998, 847239, 852369, 856160, 858504, 859672, 859886, 859037, 856995, 853842, 849628, 844208, 837549, 829969, 821907, 813624, 805243, 796890, 788640, 780389, 771872, 762705, 752560, 741605, 730689, 720708, 711647, 702629, 692937, 682619, 671975, 661067, 650134, 640015, 631572, 624864, 619390, 615006, 612071, 610705, 610387, 610395, 610300, 610016, 609759, 610088, 611633, 614524, 618215, 621951, 625314, 628413, 631852, 636554, 643264, 651957, 661897, 672383, 683295, 694842, 707068, 719806, 732971, 746695, 761225, 776816, 793620, 811555, 830404, 850103, 870851, 892871, 916245, 941079, 967544, 995555, 1024532, 1053787, 1083079, 1112554, 1142236, 1171913, 1201561, 1231558, 1262307, 1293786, 1325576, 1357121]
53370A357121L0677K9169K7358K5889K5054K4343K3002K1000J9110J7874J6907
53359A617504J5461J3383J1089Q723N992K905L1k338m825q211j2336j6328j9764
53346A611286k2926k5899k8109k9085k9117k8878k8710k8603k8529k8415k8028
53335A304987k7193k6014k4654k3198k1924k1459k2104k3269k4071k4325k4502
53324A042274k4734k4493k3368k1649j9943j8611j7698j7004j5996j4108j1538
53313H33132r341q321q110p773p093o808p585r201j0774j1461j0978r774q740
53300G17173q448q595q423p589o330m900l281j576j92N76Q61J014J385K320L925
53285F77920N616O433O228O097P113Q997J0663J1708J2562J3295J3318J2546J1929
$$ y = [1357121, 1387798, 1416967, 1444325, 1470214, 1495268, 1519611, 1542613, 1563613, 1582723, 1600597, 1617504, 1632965, 1646348, 1657437, 1666160, 1672152, 1675057, 1675088, 1672750, 1667925, 1659714, 1647378, 1631050, 1611286, 1588360, 1562461, 1534352, 1505267, 1476150, 1447272, 1418562, 1389959, 1361430, 1333015, 1304987, 1277794, 1251780, 1227126, 1203928, 1182004, 1160545, 1138441, 1115172, 1091101, 1066776, 1042274, 1017540, 993047, 969679, 948030, 928087, 909476, 891778, 874774, 858778, 844670, 833132, 823791, 815470, 807360, 799587, 792494, 785686, 778101, 768900, 758126, 746665, 735687, 725913, 717173, 708725, 700130, 691707, 684118, 677788, 672888, 669607, 668031, 667839, 668415, 669276, 670290, 671675, 673995, 677920, 683536, 689969, 696197, 702294, 709407, 718404, 729067, 740775, 753337, 766632, 779950, 792496, 804425]
53272H04425J2242J2935J2935J2223J1731J1821J1597J0166P852N798M632M027
53260I22384L455K831K282J668P17n50j871l200m774o614q315r631j0952j2765
53246H74665j4777j6132j6559j6709j7179j7657j7517j6805j6126j5763j5491
53235F93950j5158j4810j4287j3325j2261j1972j2725j3576j3472j2620j2159
53224E47585j2608j3267j3248j2498j1556j0797j0290j0064j0008r637q513o925
53212D18174n725n292n075m525l994m239n174n923o215o871q455j0057j0356r548
53198C26725r212j0066j0905j0280q502p101o794o938o865o718o715o483n704
53185B24442m880m747n264n712n736n650n708n658n152m284l462l010k985l199
$$ y = [804425, 816667, 829602, 842537, 854760, 866491, 878312, 889909, 900075, 907927, 913725, 918357, 922384, 925839, 928670, 930952, 932620, 933337, 932787, 930916, 927716, 922942, 916328, 908013, 898382, 887430, 874665, 859888, 843756, 827197, 810488, 793309, 775652, 758135, 741330, 725204, 709441, 693950, 678792, 663982, 649695, 636370, 624109, 612137, 599412, 585836, 572364, 559744, 547585, 534977, 521710, 508462, 495964, 484408, 473611, 463321, 453257, 443249, 433612, 425099, 418174, 412449, 407157, 402082, 397557, 393563, 389324, 384150, 378227, 372012, 365141, 356686, 346629, 336273, 326725, 317513, 307447, 296542, 286262, 277760, 270659, 263865, 256927, 250062, 243344, 236629, 230146, 224442, 219562, 214815, 209551, 203839, 198103, 192453, 186745, 181087, 175935, 171651, 168189, 165179, 162194, 158995]
53171A58995l256k842k077j431j179j173j247j484j849j881j153lO51K97o61j364
53155A38343j255l84P11J337J147M65k0jK65N01P90J191J290O55m36j148j092
53138A42359p29o40p91p62m77k34j49k0J86J45k73n98l32K11K10m93j057p70q1
53119A35705K8n62r81o72j86l27j006j394j088n92o32j294j967j970j201k21K50
53102A21890L9l86n64n30n57o54p50j069j832k589k570j792j161j157j109l50
53086A04859N03L79m89p46O3P30J59j067j688j606j745k350k559j770n32K45L00
53069I2686o1m84n92n9Q46J247P11l4n1N01P42N14O10J444K321K406J847J418
53051A06012J448J595J508J265J151J284J500J498J108M01n00j620k862l653l346
$$ y = [158995, 155739, 152897, 150820, 149389, 148210, 147037, 145790, 144306, 142457, 140576, 139423, 139420, 140071, 140368, 139707, 138343, 137088, 136704, 137415, 138752, 139899, 140364, 140344, 140343, 140608, 141109, 141899, 143090, 144380, 145035, 144599, 143451, 142359, 141630, 140990, 140199, 139437, 138960, 138726, 138577, 138557, 138743, 138888, 138615, 138017, 137685, 137896, 138106, 137613, 136556, 135786, 135705, 135733, 135171, 134190, 133518, 133332, 133005, 131999, 130605, 129517, 128925, 128293, 126999, 125032, 123062, 121861, 121640, 121890, 121929, 121543, 120979, 120449, 119892, 119238, 118488, 117419, 115587, 112998, 110428, 108636, 107475, 106318, 105209, 104859, 105362, 105741, 105252, 104506, 104569, 105299, 105458, 104391, 102703, 101097, 99352, 97002, 94443, 92673, 92141, 92386, 92686, 92625, 92141, 91549, 91490, 92336, 93583, 94294, 94260, 94209, 94710, 95452, 95966, 96576, 98020, 100341, 102747, 104594, 106012, 107460, 109055, 110563, 111828, 112979, 114263, 115763, 117261, 118369, 118770, 118270, 116650, 113788, 110135, 106789]
53036A06789k086q63m72p62j114j288j372j338j096q19p24o69m07j25k49q33j541
53019I1031k163k658k740k068r54k57l27n24j14P69J485J834K068K163J691O06
53003H9842m19p32n15m91q60j039n58J45K73k16n28j67M44O64N27N20P94J127
52985H8811J390J569J420O68l94j072j137j041j146j183p21J93J141J818K126
52970I2442K028J535Q19J96l9K14O54P13J46n73p18j90N02R77J274J376J113O15
52952A03084L58M27L26j98o37m24K56Q43J109J149R11L59k02l96k23J38O86J399
52934A08965J900J768J062J90n00p33l19M53Q45O03M08Q33J308R02k23j021j019
52917A15422n96k1Q29J620J623Q99M83R37J635J919K105K596K849K163J042P98
$$ y = [106789, 104703, 103840, 103368, 102606, 101492, 100204, 98832, 97494, 96398, 95579, 94855, 94186, 93779, 93654, 93405, 92572, 91031, 88868, 86210, 83470, 81402, 80448, 80191, 79864, 79340, 79226, 79995, 81480, 83314, 85382, 87545, 89236, 89842, 89423, 88691, 88176, 87685, 86825, 85786, 85228, 85373, 85646, 85430, 84902, 84735, 85179, 85843, 86370, 86890, 87684, 88811, 90201, 91770, 93190, 93858, 93464, 92392, 91255, 90214, 89068, 87885, 87164, 87357, 88498, 90316, 92442, 94470, 96005, 96824, 97020, 96981, 97195, 97849, 98562, 98708, 98135, 97417, 97227, 97729, 98706, 99980, 101356, 102469, 103084, 103442, 103869, 104195, 103997, 103360, 102936, 103192, 104035, 105144, 106293, 107204, 107563, 107361, 106965, 106742, 106880, 107566, 108965, 110865, 112633, 113695, 113885, 113385, 112652, 112333, 112786, 113631, 114234, 114642, 115475, 116783, 117685, 117462, 116441, 115422, 114826, 114805, 115634, 117254, 118877, 119776, 120259, 121196, 122831, 124750, 126855, 129451, 132300, 134463, 135505, 136303]
52901A36303J865L320M075L912L268K512J681O41o12j772k381k310j956j788j862
52886A44896j925j817j546j204j015j249j806k131j830j172o89n05m51n69r74
52871A26013j333j015O9J224J776J762J704J883K065J859J132P7r75j744k057
52856A32440j872j400j074j146j445j707k084k811l493l283k053p69k53k17k7
52841A08806R3n38j721k429k233j799j782j933j743j297r87p74l56J10N1p00j566
52824H9202j825j369o29M2O34J100J021M9j328j985j397l08K21J36K32Q16J225
52807H5837Q30r6p78q63n38o7M44R14J190J141P73L18J60M17O66L87k71n72j96
52788H9696L08L58J74L59R40J378J406J337J476J671J656J505J514J721J752J197
$$ y = [136303, 138168, 141488, 145563, 149475, 152743, 155255, 156936, 157577, 156965, 155193, 152812, 150502, 148546, 146758, 144896, 142971, 141154, 139608, 138404, 137389, 136140, 134334, 132203, 130373, 129201, 128512, 128007, 127556, 126987, 126013, 124680, 123665, 123734, 124958, 126734, 128496, 130200, 132083, 134148, 136007, 137139, 137216, 136241, 134497, 132440, 130568, 129168, 128094, 126948, 125503, 123796, 121712, 118901, 115408, 112125, 110072, 109303, 109050, 108833, 108806, 108899, 108361, 106640, 104211, 101978, 100179, 98397, 96464, 94721, 93424, 92437, 91663, 91307, 91417, 91468, 90768, 89202, 87377, 86008, 85379, 85421, 86055, 87155, 88176, 88225, 86897, 84912, 83515, 83207, 83428, 83564, 83796, 84612, 85837, 86667, 86571, 85793, 84930, 84392, 84325, 84769, 85683, 86873, 88014, 88787, 89105, 89265, 89682, 90348, 90735, 90464, 89892, 89696, 90004, 90362, 90536, 90895, 91835, 93213, 94619, 95956, 97432, 99103, 100759, 102264, 103778, 105499, 107251, 108448]
52772A08448R2j059j785k088k275k383k186j722j431j494j425p74P5L38m1l39
52756H9951j47N6k76r35j316j284j171j126r51n66k00o8j40l49p11j089j177r41
52738G7560q60j291j803j568m66O60R68M96j71p36j285j757j857j454o98K13J056
52721F7007J396Q70j71q04n72m8L0k45k16K21M00j19q75j051m51L84Q70R77J010
52702F8613J111J134J002R02J011J169J122R51R65J126R86L77k08k10K66O13M72
52685H1402L0k88k10K00N22L35k07m10M8N40L01m72q41l89L68P70O63K36k27l22
52665H2049J62Q10R61O77O80J142J329Q01J85J46K41l09j222j493r25l65l71n35
52647H3963l47J07N81J125J676J766J138L05pL19R03J512K118K515K392J845J438
$$ y = [108448, 108540, 107481, 105696, 103608, 101333, 98950, 96764, 95042, 93611, 92117, 90692, 89918, 89993, 90331, 90290, 89951, 89804, 89860, 89584, 88649, 87333, 86049, 84878, 83752, 82801, 82235, 82035, 81967, 81827, 81478, 80767, 79678, 78501, 77560, 76700, 75409, 73606, 72038, 71572, 72232, 73200, 73696, 73525, 72789, 71504, 69747, 67890, 66436, 65738, 65951, 67007, 68403, 69273, 69102, 68298, 67726, 67678, 67708, 67463, 67247, 67468, 67868, 67749, 66874, 65823, 65372, 65756, 66626, 67603, 68613, 69724, 70858, 71860, 72762, 73773, 74942, 76064, 77015, 77980, 79106, 80092, 80469, 80261, 80051, 80317, 80930, 81402, 81432, 81144, 80934, 81134, 81656, 81991, 81784, 81374, 81422, 81962, 82263, 81791, 80950, 80561, 80929, 81699, 82362, 82598, 82371, 82049, 82211, 83021, 83982, 84659, 85339, 86481, 87810, 88611, 88796, 88942, 89183, 88874, 87652, 86159, 85234, 84869, 84498, 83963, 83616, 83723, 84304, 85429, 87105, 88871, 90009, 90314, 90307, 90626, 91529, 93041, 95159, 97674, 100066, 101911, 103349]
52630A03349J610K194K652K566J949J167O00L51K35jn16j327k193k562k013r04
52614A07157k37n31j141j084l29K72K60J17L89Q30Q33L55q7k38m87j263k327k795
52596I9694j948j8J815K394J625M99n0QJ48K28N05R20R04K32m48l23M94J039O68
52577A08386k53q79q28m17r9LN2J28J44Q5J88O62J260J369P16k43q08p73m22l3
52557A08238K25K9q59j941k135j019M68J054O17J09J76N09O61P57J089J411J218
52540A10607N44m9k58l98q16j241j065j91O98Q53K76m17q70j276j764j907j284
52523A01442k87K01j33p42j118j398j812k055j666q03j35k7k84n64p58q74q90
52506H8097p88n73k84o3j87p22j297j423j038m30K06Q60J382J533J368J172R69
$$ y = [103349, 104959, 107153, 109805, 112371, 114320, 115487, 116087, 116438, 116673, 116672, 116156, 114829, 112636, 110074, 108061, 107157, 106920, 106389, 105248, 104164, 103835, 104107, 104367, 104484, 104873, 105703, 106536, 106891, 106804, 106566, 106079, 104816, 102489, 99694, 97746, 97728, 99543, 101937, 103562, 104061, 104011, 104019, 104167, 104395, 104900, 105820, 106724, 106956, 106508, 106185, 106679, 107718, 108386, 108133, 107254, 106426, 106009, 105910, 105913, 105965, 106093, 106237, 106322, 106510, 107172, 108432, 109801, 110517, 110274, 109466, 108693, 108271, 108238, 108463, 108492, 107633, 105692, 103557, 102538, 103006, 104060, 104677, 104786, 104962, 105471, 106132, 106889, 107978, 109389, 110607, 111151, 111102, 110844, 110446, 109630, 108389, 107324, 107133, 107831, 108684, 108960, 108543, 107673, 106397, 104633, 102726, 101442, 101155, 101356, 101223, 100481, 99363, 97965, 96153, 94098, 92432, 91629, 91494, 91467, 91183, 90619, 89861, 88987, 88097, 87309, 86736, 86452, 86389, 86202, 85480, 84183, 82760, 81722, 81292, 81498, 82358, 83740, 85273, 86641, 87813, 88782]
52489H8782N14j39n21m74m38p56j048p22J50R43J272J251J041O15l2p71j471j979
52471H6217k091j784j357j064o78J15J035J431J254J193J652K127J951J215N28
52456I1744K01M5j68m37o19m77J84J167J809J634R36M05K65K50K40M33P81P96
52438I9189J79o77j069o84J84R53J153P34J44p6J69N21P50J018J522K116K498
52421A08624K495K054J183J39o57j037j233j397j331r35n35l46K1R51J881J756
52405A11633M38q91j003N5J208J577J211P49O60Q77J092J242J485J669J281J87
52389A23470r09j238r30o41n06j42M02N83M08O20J477K097J631M95k07p1M16P29
52371A27684Q01P80Q80J292J886K195J995J700J731J864J665J244J039J127J290
$$ y = [88782, 89296, 89157, 88636, 88162, 87724, 86968, 85920, 85198, 85348, 86291, 87563, 88814, 89855, 90470, 90438, 89667, 88196, 86217, 84126, 82342, 80985, 79921, 79243, 79358, 80393, 81824, 83078, 84271, 85923, 88050, 90001, 91216, 91744, 91945, 91990, 91822, 91385, 90766, 90289, 90473, 91640, 93449, 95083, 96019, 96424, 96689, 96939, 97179, 97612, 98393, 99189, 99368, 98691, 97622, 96938, 97122, 98075, 99228, 99962, 100106, 100030, 100199, 100720, 101470, 102488, 104010, 106126, 108624, 111119, 113173, 114356, 114495, 113838, 112801, 111568, 110171, 108840, 107905, 107370, 107024, 107045, 107996, 109877, 111633, 112071, 111180, 110177, 110232, 111440, 113017, 114228, 114977, 115637, 116514, 117606, 118848, 120333, 122002, 123283, 123470, 122561, 121323, 120393, 119752, 119246, 119104, 119506, 120089, 120497, 121117, 122594, 124691, 126322, 126817, 126610, 126539, 126955, 127684, 128485, 129265, 130145, 131437, 133323, 135518, 137513, 139213, 140944, 142808, 144473, 145717, 146756, 147883, 149173]
52356A49173J529J937K281K310K240K248J897Q51j26L8J046J471Q14J55M28J157
52340A69449J567J840K504L240L291K667K106K121K672L571M620N531O166O703
52326B18048P200P372P155P106P723Q761R714J0553J1446J2128J2273J2161J2272
52313C43912J2464J2352J2258J2898J4206J5276J5628J5678J5831J5843J5433
52302E01779J4771J4032J2967J1375R678Q538Q141Q017P521O363M824L472K518
52289F13996J554J75j336k402l004l586m232m596m656m788n030m976m551m147
52275E68421l746k777j216J9L79O55J844L704N203O013O623P334Q051Q913J0153
52260F19573J1375J1823J1568J1580J2265J2737J2037J0536R464R336R440Q807
$$ y = [149173, 150702, 152639, 154920, 157230, 159470, 161718, 163615, 164466, 164340, 164378, 165424, 166895, 167709, 167864, 168292, 169449, 171016, 172856, 175360, 178600, 181891, 184558, 186664, 188785, 191457, 195028, 199648, 205179, 211345, 218048, 225248, 232620, 239775, 246881, 254604, 263365, 273079, 283632, 295078, 307206, 319479, 331640, 343912, 356376, 368728, 380986, 393884, 408090, 423366, 438994, 454672, 470503, 486346, 501779, 516550, 530582, 543549, 554924, 564602, 573140, 581281, 589298, 596819, 603182, 608006, 611478, 613996, 615550, 615725, 614389, 611987, 608983, 605397, 601165, 596569, 591913, 587125, 582095, 577119, 572568, 568421, 564675, 561898, 560682, 560701, 561080, 561735, 563579, 567283, 572486, 578499, 585122, 592456, 600507, 609420, 619573, 630948, 642771, 654339, 665919, 678184, 690921, 702958, 713494, 722958, 732294, 741734, 750541]
52248G50541P279N499M118L228K468J571O02l35j437k983m839o497p628q370r004
52233G34213r569r916r918r490q634p624o970o951p218p104o343n348m721m606
52219F29801m549l999k845j513n06P7N25J022J358J258R09R28J705K934L946M351
52203F35402M233L805L172K456J892J615J528J489J496J522J374R37M08J06N1
52188F61486J2j36l69p10j174j573j657j436j202j175j490k343l761n171n737
52173F33564n269m382l613k795j641m91p0o16j610k276k246j789j534j773k136
52158F01323k139k010k373l113l296k507j565j399j872k306k571k791k539j366
52144E69476N4M41l51j110j024o34o86q60m39M11P77K47o10q60L7J970M231N898
$$ y = [750541, 757820, 763319, 767437, 770665, 773133, 774704, 775306, 774971, 773534, 770551, 765712, 759215, 751587, 743217, 734213, 724644, 714728, 704810, 695320, 686686, 679062, 672092, 665141, 657923, 650819, 644476, 639128, 634407, 629801, 625252, 621253, 618408, 616895, 616389, 616466, 616991, 618013, 619371, 620629, 621538, 622466, 624171, 627105, 631051, 635402, 639635, 643440, 646612, 649068, 650960, 652575, 654103, 655592, 657088, 658610, 659984, 660921, 661329, 661435, 661486, 661498, 661362, 660993, 660283, 659109, 657536, 655879, 654443, 653241, 652066, 650576, 648233, 644472, 639301, 633564, 628295, 623913, 620300, 617505, 615864, 615373, 615303, 614687, 613077, 610801, 608555, 606766, 605232, 603459, 601323, 599184, 597174, 594801, 591688, 588392, 585885, 584320, 582921, 581049, 578743, 576172, 573381, 570842, 569476, 569530, 569971, 569620, 568510, 567486, 566852, 566166, 565306, 564867, 565278, 566055, 566302, 565692, 564832, 564869, 566839, 571070, 576968]
52126E76968O537O544O695P384Q478R654J0640J1280J1627J1947J2434J2980J3431
52113G06599J3888J4532J5188J5431J5143J4681J4365J4082J3612J3095J2842
52102H63458J2667J1885J0158Q095O544N535M275K326J84j408k321k928l548m380
52088I10542n606p084q114q167p609p241p178o826n942n070m729m701m485l945
52074H23845l237k383j256K04J942L781N332O255O723P363Q486R650J0178R931
52060H86814R373R113R427R999J0053R037P328N887N096M368L027J182n62j854
52046I68288k749l493m473o049q005r505j0078j0405j1508j3412j5140j6005j6266
52033H41200j6477j6700j6644j6171j5411j4552j3789j3348j3316j3461j3341
$$ y = [576968, 583505, 590049, 596744, 604128, 612606, 622260, 632900, 644180, 655807, 667754, 680188, 693168, 706599, 720487, 735019, 750207, 765638, 780781, 795462, 809827, 823909, 837521, 850616, 863458, 876125, 888010, 898168, 906263, 912807, 918342, 922617, 924943, 925127, 923719, 921398, 918470, 914922, 910542, 904936, 897852, 889738, 881571, 873962, 866721, 859543, 852717, 846775, 841705, 836976, 832275, 827790, 823845, 820608, 818225, 816969, 817173, 819115, 822896, 828228, 834483, 841206, 848569, 857055, 866705, 876883, 886814, 896187, 905300, 914727, 924726, 934779, 943816, 951144, 957031, 962127, 966495, 969522, 970704, 970142, 968288, 965539, 962046, 957573, 951524, 943519, 934014, 923936, 913531, 902023, 888611, 873471, 857466, 841200, 824723, 808023, 791379, 775208, 759797, 745245, 731456, 718108, 704792, 691331, 677990]
52022F77990j2709j1796j1141j1010j1090j0893j0393r977r842r779r655r667
52010E50038r962j0373j0752j1216j1802j2191j2142j1877j1707j1637j1657j2085
$$ y = [677990, 665281, 653485, 642344, 631334, 620244, 609351, 598958, 588981, 579139, 569360, 559705, 550038, 540076, 529703, 518951, 507735, 495933, 483742, 471600, 459723, 448016, 436379, 424722, 412637]
$$ [...]
##END NTUPLES=NMR SPECTRUM
##END=
