##TITLE=NES1037_878015026_9242866_9XMLrb76ax
##JCAMPDX= 6.0         $$ Bruker NMR JCAMP-DX V2.0
##DATA TYPE= NMR SPECTRUM
##DATA CLASS= NTUPLES
##ORIGIN= BRUKER
##OWNER= Administrator
$$ 1.72 TOPSPIN		Version 2.1
$$ 2015-07-01 12:12:55.768 -0700  Administrator@X
$$ Compression mode = diff/dup
##.OBSERVE FREQUENCY= 400.02188249412
##.OBSERVE NUCLEUS= ^1H
##.ACQUISITION MODE= SIMULTANEOUS (DQD)
##.ACQUISITION SCHEME= undefined
##.AVERAGES= 8
##.DIGITISER RES= 22
##SPECTROMETER/DATA SYSTEM= spect
##.PULSE SEQUENCE= zg30
##.SOLVENT NAME= COFFEE_meoh
##.SHIFT REFERENCE= INTERNAL, COFFEE_meoh, 1, 14.98509
##AUDIT TRAIL= $$ (NUMBER, WHEN, WHO, WHERE, PROCESS, VERSION, WHAT)
$$ ##TITLE= Audit trail, TOPSPIN		Version 2.1
$$ ##JCAMPDX= 5.01
$$ ##ORIGIN= Bruker BioSpin GmbH
$$ ##OWNER= Administrator
$$ $$ E:\/data/COFFEE/nmr/NES1037_878015026_9242866_9XMLrb76ax/20/pdata/1/auditp.txt
$$ ##AUDIT TRAIL=  $$ (NUMBER, WHEN, WHO, WHERE, PROCESS, VERSION, WHAT)
(   1,<2015-07-01 12:12:48.471 -0700>,<Administrator>,<X>,<go>,<TOPSPIN 2.1>,
      <created by zg
	started at 2015-07-01 12:11:42.081 -0700,
	POWCHK enabled, PULCHK disabled,
       configuration hash MD5:
       21 0F 79 D6 B3 7B B4 F6 88 20 88 DB 03 48 BD 9F
       data hash MD5: 64K
       71 9D 51 25 A0 03 38 60 E2 5F 90 DC F6 8C 1D 3A>)
(   2,<2015-07-01 12:12:51.643 -0700>,<Administrator>,<X>,<proc1d>,<TOPSPIN 2.1>,
      <Start of raw data processing
       efp LB = 0 FT_mod = 6 PKNL = 1 PHC0 = 0 PHC1 = 0 SI = 32K 
       data hash MD5: 32K
       17 82 E8 37 69 AF BB BA 60 AB AB 2C 9E 91 34 BA>)
(   3,<2015-07-01 12:12:51.940 -0700>,<Administrator>,<X>,<proc1d>,<TOPSPIN 2.1>,
      <pk PHC0 = 94.83948 PHC1 = 0 
       data hash MD5: 32K
       FD D7 EF 9B 6B 77 76 3C A1 B7 9C 24 CB 73 84 AF>)
(   4,<2015-07-01 12:12:52.049 -0700>,<Administrator>,<X>,<proc1d>,<TOPSPIN 2.1>,
      <abs ABSG = 1 
       data hash MD5: 32K
       D7 FA AA 9F B4 32 5A 88 9C 44 0A 78 D1 93 46 2D>)
(   5,<2015-07-01 12:12:52.096 -0700>,<Administrator>,<X>,<proc1d>,<TOPSPIN 2.1>,
      <abs ABSG = 2 
       data hash MD5: 32K
       B8 B2 FA 82 01 B8 42 E9 67 EE AE 4E 7E F6 6A B3>)
(   6,<2015-07-01 12:12:52.190 -0700>,<Administrator>,<X>,<proc1d>,<TOPSPIN 2.1>,
      <abs ABSG = 3 
       data hash MD5: 32K
       C6 59 5A E3 10 DB 4C CA 08 12 63 20 CC B1 E3 7D>)
(   7,<2015-07-01 12:12:52.268 -0700>,<Administrator>,<X>,<proc1d>,<TOPSPIN 2.1>,
      <abs ABSG = 4 
       data hash MD5: 32K
       C0 A0 99 CE F9 1A AF 3E C7 F6 C8 E0 92 EE F4 A9>)
(   8,<2015-07-01 12:12:52.424 -0700>,<Administrator>,<X>,<proc1d>,<TOPSPIN 2.1>,
      <abs ABSG = 5 
       data hash MD5: 32K
       8F 3A B1 22 FB A8 05 82 05 49 72 52 64 00 03 53>)
$$ ##END=
$$ 
$$ $$ hash MD5
$$ $$ 04 D4 AB 20 72 04 95 BF AF 0A 4A AF 5D 61 19 E3
##$RELAX= 
##$RELAX= 
##$RELAX= 
##$RELAX= 
##$RELAX= 
##$RELAX= 
##$RELAX= 
$$ Bruker specific parameters
$$ --------------------------
##$DU= <E:\>
##$EXPNO= 20
##$NAME= <NES1037_878015026_9242866_9XMLrb76ax>
$$ [...]
150 150 150 150 150 150 150 150
##$TP07= 0
##$TPNAME0= <>
##$TPNAME1= <>
##$TPNAME2= <>
##$TPNAME3= <>
##$TPNAME4= <>
##$TPNAME5= <>
##$TPNAME6= <>
##$TPNAME7= <>
##$TPOAL= (0..7)
0.5 0.5 0.5 0.5 0.5 0.5 0.5 0.5
##$TPOFFS= (0..7)
0 0 0 0 0 0 0 0
##$TUNHIN= 0
##$TUNHOUT= 0
##$TUNXOUT= 0
##$USERA1= <user>
##$USERA2= <user>
##$USERA3= <user>
##$USERA4= <user>
##$USERA5= <user>
##$V9= 5
##$VALIST= <valist>
##$VCLIST= <CCCCCCCCCCCCCCC>
##$VD= 0
##$VDLIST= <DDDDDDDDDDDDDDD>
##$VPLIST= <PPPPPPPPPPPPPPP>
##$VTLIST= <TTTTTTTTTTTTTTT>
##$WBST= 1024
##$WBSW= 4
##$XGAIN= (0..3)
0 0 0 0
##$XL= 0
##$YL= 0
##$YMAX_a= 629336
##$YMIN_a= -527022
##$ZGOPTNS= <>
##$ZL1= 120
##$ZL2= 120
##$ZL3= 120
##$ZL4= 120
##$ABSF1= 14.98509
##$ABSF2= -5.573092
##$ABSG= 5
##$ABSL= 3
##$ALPHA= 0
##$AQORDER= 0
##$ASSFAC= 0
##$ASSFACI= 0
##$ASSFACX= 0
##$ASSWID= 0
##$AUNMP= <proc_prof1d_extract_pilot.lims>
##$AXLEFT= 0
##$AXNAME= <>
##$AXNUC= <1H>
##$AXRIGHT= 0
##$AXTYPE= 0
##$AXUNIT= <>
##$AZFE= 0.1
##$AZFW= 0.1
##$BCFW= 0
##$BC_mod= 0
##$BYTORDP= 0
##$COROFFS= 0
##$CY= 15
##$DATMOD= 1
##$DC= 0
##$DFILT= <>
##$DTYPP= 0
##$F1P= 0
##$F2P= 0
##$FCOR= 0.5
##$FTSIZE= 32768
##$FT_mod= 6
##$GAMMA= 0
##$GB= 0
##$INTBC= 1
##$INTSCL= 1
##$ISEN= 128
##$LB= 0
##$LEV0= 0
##$LPBIN= 0
##$MAXI= 10000
##$MC2= 0
##$MEAN= 0
##$ME_mod= 0
##$MI= 0
##$NCOEF= 0
##$NC_proc= -8
##$NLEV= 6
##$NOISF1= 0
##$NOISF2= 0
##$NSP= 0
##$NTH_PI= 0
##$NZP= 0
##$OFFSET= 14.98509
##$PC= 1
##$PHC0= 94.83948
##$PHC1= 0
##$PH_mod= 1
##$PKNL= yes
##$PPARMOD= 0
##$PPDIAG= 0
##$PPIPTYP= 0
##$PPMPNUM= 2147483647
##$PPRESOL= 1
##$PSCAL= 4
##$PSIGN= 0
##$PYNMP= <proc.py>
##$REVERSE= no
##$SF= 400.02
##$SI= 32768
##$SIGF1= 0
##$SIGF2= 0
##$SINO= 400
##$SIOLD= 32768
##$SPECTYP= <>
##$SREGLST= <1H.CDCl3>
##$SSB= 0
##$STSI= 32768
##$STSR= 0
##$SW_p= 8223.68421052631
##$SYMM= 0
##$S_DEV= 0
##$TDeff= 65536
##$TDoff= 0
##$TI= <>
##$TILT= no
##$TM1= 0
##$TM2= 0
##$TOPLEV= 0
##$USERP1= <user>
##$USERP2= <user>
##$USERP3= <user>
##$USERP4= <user>
##$USERP5= <user>
##$WDW= 1
##$XDIM= 32768
##$YMAX_p= 443340423
##$YMIN_p= -705068
##$CURPLOT= <Network HP LaserJet P1505>
##$CURPRIN= <$Network HP LaserJet P1505>
##$DFORMAT= <normdp>
##$LAYOUT= <+/1D_H.xwp>
##$LFORMAT= <normlp>
##$PFORMAT= <normpl>
##$SURQMSG= 1
$$ End of Bruker specific parameters
$$ ---------------------------------
##NTUPLES= NMR SPECTRUM
##VAR_NAME=  FREQUENCY,     SPECTRUM/REAL,   SPECTRUM/IMAG
##SYMBOL=    X,             R,               I
##VAR_TYPE=  INDEPENDENT,   DEPENDENT,       DEPENDENT
##VAR_FORM=  AFFN,          ASDF,            ASDF
##VAR_DIM=   32768,         32768,           32768
##UNITS=     HZ,            ARBITRARY UNITS, ARBITRARY UNITS
##FACTOR=    0.250966925370066, 1,           1
##FIRST=     8223.43324360094, -166397,      187557
##LAST=      0,             -18290,          -339126
##MIN=       0,             -705068,         0
##MAX=       8223.43324360094, 443340423,    0
$$ Real data points
##PAGE= N=1
##DATA TABLE= (X++(R..R)), XYDATA
$$ [...]
19485a39149A29661Q88b61847a08928j43513M8151p4965C52646a41429N0599A21561
19473b29221E54777b19107Q2544A28893g2918l58219a75025P1423M0425k55459
19463c18636A43433J6711D9477a53154f3008D9261a88951L4806C26139b19895
19452a46675O5181B07636a45385B21206E4802h3287j17655F5461i0477A10941
19441a855j13468k28885C1351i3591r1626m05B52728a7483m36416B8394a41866
19429a56384e0299I3518A1349d6146m15435B73755b57822B51642A07601h7152
19418b75706j6282A7136b92712h6515A80255a17723j17319a3225B7964a88025
19407a83461A88144F6585J80421b40809L1876H9970i7532A4789a57862P6183k751
$$ y = [-139149, 129661, 130549, -261847, -108928, -252441, -204290, -279255, 352646, -141429, -90830, 121561, -229221, 554777, -219107, -136563, 128893, -72918, -431137, -175025, -103602, -63177, -318636, 143433, 160144, 49477, -153154, -63008, 49261, -188951, -154145, 326139, -219895, -146675, -81494, 207636, -145385, 221206, 54802, -83287, -200942, 65461, -90477, 110941, -1855, -115323, -344208, 31351, -93591, -185217, -185622, 252728, -17483, -453899, 28394, -141866, -156384, -50299, 93518, 11349, -46146, -461581, 273755, -257822, 251642, 107601, -87152, -275706, -291988, 17136, -292712, -86515, 180255, -117723, -235042, -13225, 27964, -188025, -183461, 188144, 66585, 247006, -240809, -208933, 89970, -97532, 14789, -157862, -81679, -84430]
19396h4430L1960m5288J1573n8854D920N7570d3950A27292c66801B9705e26D6385
19383A81891i939j53485A62223J5583c99895f2654K6924A70095g4139I5462b14384
19371a73996f7606k32465J35676A63913a35540c2342I8552j0461N0964P992i9176
19359b05022K587N7790A36272D7767a46236B08727i9636A4763a36580k5800A14025
19347B34121D5007i1594E3525L7300K3742c00350g8527A13366b01408A86286B0036
19335a47641A8241g4596A13687l5643J0500C6290c0708J3092A79992b53857i5602
19323B8405b09629R9685r5988A40503c35902H1796Q2446b14639B8893a32184c5573
19311I6619c682G1165i9536j37707i1366B42282a54030n2156g5872F6204b05818
$$ y = [-84430, -52470, -97758, -86185, -145039, 4920, 62490, -43950, 127292, -366801, 29705, -526, 46385, 181891, -9939, -163424, 162223, 177806, -399895, -62654, -35730, 170095, -74139, 95462, -214384, -173996, -67606, -300071, -164395, 163913, -135540, -32342, 98552, 88091, 139055, 147047, -99176, -205022, -202435, -144645, 136272, 47767, -146236, 208727, -99636, 14763, -136580, -162380, 114025, 234121, 45007, -91594, 53525, 90825, 114567, -300350, -78527, 113366, -201408, 186286, 20036, -147641, 18241, -74596, 113687, 78044, 88544, 36290, -30708, -17616, 179992, -253857, -95602, 28405, -209629, -109944, -205932, 140503, -335902, 81796, 164242, -214639, 28893, -132184, -35573, 96619, -3682, 71165, -99536, -237243, -91366, 242282, -154030, -206186, -75872, 66204, -205818]
19299c93399a42187A6451b83801O7732j42994B42973F3698b21621F7099K16312
19289B83411C1114a22981A08142l4528e6786D6891b02277J4942d2848k8784J6853
19278e4779j04066A74992l2901C5777c76463a77978e4612j67866A14082a80676
19267b99477G7460I056a26975C4830J968d39006i3322K9490I4413h3273K5790
19256e7483p8923c4305q3395I4491k544b31305F7031O2288j0962g3115c392B0534
19243A92946D8699J93021e4879j20518n26203a55497A78165a19988C6777b50590
19232g7896B105f8707A00703Q7380j2437B5522g5665E883a37377D07317A16024
19220B37639b8587B5209J6572a78525A84970a83206l8684L3636l88581g1482m1207
$$ y = [-393399, -142187, 16451, -283801, -216069, -359063, 242973, 63698, -221621, 67099, 283411, 31114, -122981, 108142, 73614, -56786, 46891, -202277, -187335, -42848, -71632, -54779, -158845, 174992, 142091, 35777, -376463, -177978, -54612, -222478, 114082, -180676, -299477, 77460, 9056, -126975, 34830, 36798, -439006, -93322, -63832, 94413, -83273, -57483, -136406, -34305, -117700, 94491, 91947, -231305, 67031, 129319, 118357, -73115, -3392, 20534, 192946, 48699, 241720, -54879, -175397, -701600, -155497, 178165, -119988, 36777, -250590, -77896, 2105, -68707, 100703, 188083, 175646, 25522, -75665, 5883, -137377, 407317, 116024, 237639, -28587, 25209, 41781, -178525, 184970, -183206, -221890, -188254, -576835, -71482, -112689]
19209a12689q8007g9172B540J08896g6420n1368j21193G3756A3045K55263a01900
19197C04643a73280a4180k28627A44240e10874A01688f2570m5910K8589A00884
19186b00490A08118a16894A20918L81600A65089c85338a17294K8495H6951K92753
19176C79704a76539j40271c7329l24515R7176D9505d1430j16319A52515a80340
19165c11289G2641B9019b34007A12611A562a49319q8018D0281f5110A94470b46614
19153H8542b87769b2332C18399a88295L6424J1044K1655B43082f7067A99856i8015
19141a03457j17773p7370a27455a8126k02577R074B8213a74139o9933e5962l17544
19130c73506h1037F1879a22277L5033E047a77559e8007E2837R1749g8545B07665
$$ y = [-112689, -200696, -79172, 2540, 111436, -76420, -127788, -248981, 73756, 13045, 268308, -101900, 304643, -173280, -14180, -242807, 144240, -510874, 101688, -62570, -108480, -79891, 100884, -200490, 108118, -116894, 120918, 502518, 165089, -385338, -117294, -88799, 86951, 379704, -176539, -316810, -37329, -361844, -264668, 49505, -41430, -157749, 152515, -180340, -311289, 72641, 29019, -234007, 112611, 1562, -149319, -237337, 40281, -65110, 194470, -246614, 88542, -287769, -22332, 318399, -188295, -151871, -140827, -119172, 243082, -67067, 199856, -98015, -103457, -221230, -298600, -127455, -18126, -220703, -211629, 28213, -174139, -244072, -55962, -373506, -81037, 61879, -122277, -87244, 5047, -177559, -58007, 52837, 144586, -78545, 207665]
19118b14902B24305a46997L0412o6166n8045A26253M8863b16528a3440G6037k6939
19107D9098b38346L5274A83455e1106F8851O5741e2399J4924o5906l8987N9600
19096h2768j08742k7566j59191a89057l761L4038C2396L6755K03590L5753F7458
19084G3055a85749B53944N2788A23719f1079a2610B42902J03538a06741k30802
19074c37543J30510C5441b50582A383b31790N8755L7500d1326j57343Q6082j31476
19063b44063J14792A38939B7492J23665e37842K27288a5659A37462b18025g4432
19052A62218a57548B23850a09386l6186m8331k724g661j46893A20451e78429K39375
19041c39054A05218b80344N188Q0632f5758j6077B42786o179h5693k5104E959
$$ y = [-214902, 224305, -146997, -116585, -182751, -240796, 126253, 175116, -216528, -13440, 76037, 49098, -238346, -203072, 183455, -51106, 68851, 134592, -52399, -37475, -103381, -142368, -82768, -191510, -219076, -378267, -189057, -192818, -158780, 32396, 69151, 272741, 308494, 67458, 73055, -185749, 253944, 306732, 123719, -61079, -12610, 242902, 346440, -106741, -337543, -207033, 35441, -250582, 1383, -231790, -173035, -135535, -41326, -198669, -112587, -244063, -129271, 138939, 27492, 151157, -537842, -310554, -15659, 137462, -218025, -74432, 162218, -157548, 223850, -109386, -145572, -193903, -196627, -7661, -154554, 120451, -578429, -339054, 105218, -280344, -275156, -194524, -65758, -81835, 242786, 236607, -85693, -110797, 5959]
19029C1283a45330H6730K09293a84181A92642a56969C2133d0981H057J80030b57164
19017E3224f9300B69707b25613b2090j96520j1283c071k8596C9095Q9805D1095
19005B0108O1479b4282j00384C72429b95601A00944a62955B68392b89533A3625
18994B7474j0947N5941C4265h4411K2800K5443I1736j5090g2032j32377h7086
18982a79164k58421B5081R8961b89687N5210A13370J04068A2887J16902e8361
18971h9822o3501a1558F6214J480a35701c9007C5374b66977i1960H8589a75683
18959b68106C77492j81890C742c5530k11284I7244j4031b31972d7080B0896J39321
18948A60217J68545G6560i5392A60685b35874q8683b1633j52181l7189h1081K5947
$$ y = [31283, -145330, 86730, 296023, -184181, 192642, -156969, 32133, -40981, 8057, 188087, -257164, 53224, -69300, 269707, -225613, -22090, -218610, -229893, -3071, -31667, 39095, 128900, 41095, 20108, 81587, -24282, -124666, 372429, -295601, 100944, -162955, 268392, -289533, 13625, 27474, 16527, 72468, 34265, -84411, -61611, -36168, 91736, 76646, -72032, -204409, -87086, -179164, -437585, 25081, 124042, -289687, -234477, 113370, 217438, 12887, 129789, -58361, -89822, -153323, -11558, 66214, 67694, -135701, -39007, 35374, -266977, -91960, 88589, -175683, -268106, 377492, 195602, 3742, -35530, -246814, 97244, 83213, -231972, -47080, 20896, 160217, 328762, 76560, -95392, 160685, -235874, -324557, -21633, -173814, -211003, -81081, -55134]
18937e5134l14709H4401a82361A04489d1211A68778K2294G9855J75762g8702A14802
18925B62908a2580B12634a87726M2965d2924a8437q4914B17249A3759a54848j5479
18914a70327A53204F3030a8923j52524L0524B03097G645b42071A74773d1840a9760
18902g5198b8053j8411j1384k6707q6614l1402j5714I4689a35100e9534K5297
18891c4237A93713b46774h313G920a40427f6934m00175a48264j2282j4374I5739
18879c00498A8430a26904o332b5965k79666e8596j46120q6131A00539k8324J00665
18868A72880K7588k9693G2981B6339a74429c45j21798A65294J02837c43854D6060
18856A92467q3984m430b78452A32215f9997A22444K27202c8985A93698b63525
$$ y = [-55134, -369843, 84401, -182361, 104489, -41211, 168778, 191072, 79855, 255617, -78702, 114802, 262908, -12580, 212634, -187726, -144761, -42924, -18437, -103351, 217249, 13759, -154848, -170327, 153204, 63030, -18923, -171447, -140923, 203097, 7645, -242071, 174773, -41840, -19760, -75198, -28053, -46464, -57848, -84555, -171169, -202571, -218285, 94689, -135100, -59534, -34237, 193713, -246774, -8313, 7920, -140427, -66934, -467109, -148264, -160546, -174920, 95739, -300498, 18430, -126904, -133236, -25965, -305631, -58596, -204716, -290847, 100539, 72215, 172880, 200468, 170775, 72981, 26339, -174429, -345, -122143, 165294, 268131, -343854, 46060, 192467, 108483, 104053, -278452, 132215, -69997, 122444, 349646, -38985, 193698, -263525]
18845b59939M783B45419a30788a7647I256a17082e5692k46808O9459g5655E799
18833a37876h318k0347A25580K1895b13765A77377a39275k528k2623H42163d27077
18821b34111G8869K75923a42875f9743K8213A37383h0230A79911E073K62391I8928
18809D76089H1224i0023j58506O9043O7077q3756f0129I3142c5148k2714n5802
18798a13664B6514b97018A8334i9325J1875A7971R0505J0675a913l8657D6182
18786A45589o1631a39512J818f6140k83184a47558h180C6207M9999b15894n5622
18775b71516g0666B03629h4892C4759J5866j9587c80351N9801C81490c4356G6835
18763E1137a53974A0016J2905O9433h150A9372q845K52534n4616c01641f2737
$$ y = [-259939, -255156, 245419, -130788, -17647, 9256, -117082, -55692, -302500, -233041, -75655, 5799, -137876, -8318, -28665, 125580, 147475, -213765, 177377, -139275, -141803, -164426, 842163, -427077, -234111, 78869, 354792, -142875, -69743, -41530, 137383, -80230, 179911, 5073, 267464, 98928, 476089, 81224, -90023, -248529, -179486, -112409, -196165, -60129, 93142, -35148, -57862, -113664, 26514, -297018, 18334, -99325, -87450, 17971, 108476, 119151, -1913, -40570, 46182, 145589, 83958, -139512, -137694, -66140, -349324, -147558, -8180, 36207, 86206, -215894, -271516, -70666, 203629, -84892, 34759, 50625, 31038, -380351, -320550, 381490, -34356, 76835, 51137, -153974, 10016, 22921, 92354, -8150, 19372, 10527, 263061, 208445, -301641, -62737]
18751b1820l78032J73045B09375F7084K50244a48566O1924B2894a66890A49302
18740e5630k51742M1396B7284K2906a29441C8156a07531l44556a75585a0871j42552
18729a53423j09100h2088c0618l55633J42971n2424e813j48914g4735f252j62076
18718a68328j67900A92346d69135I9141N8610Q1540b89061a18875j05435c9747
18707b42605j36842M3068a34694A59886c55912d9126B0010K32443D7114p2b58415
18695a56785j40815E1846a24448D9135H305K09499a79988A524J5469J0726J31768
18684A59487M6613b5482C11133g4254A13997a13572B48113h3346j00073G2927
18673c56760G0995a11665C4354a0182m4522J7464A16124N8151b39264k6856c0334
$$ y = [-21820, -399852, -226807, 209375, 67084, 317328, -148566, -86642, 22894, -166890, 149302, -55630, -307372, -265976, 27284, 50190, -129441, 38156, -107531, -452087, -175585, -10871, -153423, -262523, -82088, -30618, -386251, -243280, -295704, -5813, -154727, -74735, -6252, -168328, -336228, 192346, -469135, 99141, 157751, 239291, -289061, -118875, -224310, -39747, -242605, -379447, -336379, -134694, 159886, -355912, -49126, 20010, 252453, 47114, 47042, -258415, -156785, -297600, 51846, -124448, 49135, 8305, 217804, -179988, 1524, 16993, 27719, 159487, 206100, -25482, 311133, -74254, 113997, -113572, 248113, -83346, -183419, 72927, -356760, 70995, -111665, 34354, -10182, -54704, -37240, 116124, 174275, -239264, -266120, -30334]
18661e8608m4019G3746c22966a01218L2911j41754C8555K0861M348i368n9535
18650f8903B8488L96375a58819A97485o9376h2785B15384k1835e4455l16343H9737
18638i8297K992K4569c0449p250k21284a17754A30859b38718F2129L83a35334
18626a41190E1328d5105j49785r3426c2146n7803C09573A08275l0777b78903C54281
18614A3754K13556b21931K5392C5951b3096G5049b04148B92259c37303B33126
18603c23869f5601A63841G5506K26640B6462a59345p5223e319A80579Q9758E946
18591b5563A0960O3431a94256a0066E8884d3434a8767l29438J08558o2193q031
18580c09871A68328a50406A93275a30462a6784n912D102a40608B89851b55158
$$ y = [-58608, -102627, 73746, -322966, -101218, -68307, -210061, 38555, 59416, 63764, -9368, -68903, 28488, 424863, -158819, 197485, 128109, -82785, 215384, 193549, -54455, -370798, 89737, -98297, -95305, -70736, -30449, -37699, -258983, -117754, 130859, -238718, 62129, 62512, -135334, -141190, 51328, -45105, -194890, -288316, -32146, -89949, 309573, 108275, 77498, -278903, 354281, 13754, 227310, -221931, -196539, 35951, -23096, 75049, -204148, 292259, -337303, 233126, -323869, -65601, 163841, 75506, 302146, 26462, -159345, -234568, -5319, 180579, 270337, 5946, -25563, 10960, 74391, -194256, -10066, 58884, -43434, -18767, -348205, -239647, -301840, -309871, 168328, -150406, 193275, -130462, -16784, -22696, 4102, -140608, 289851, -255158]
18569B0323O2090C1457J1357c29349E8299d8352B4387f1446q4768c2607B27457
18557A27933c8377H6948c3097A2164P8255a25781N8377m5230j16589M8635b9377
18545a15729B25086k7350n4046a28732k0747A57833i943k49874c4713j24291B52782
18533A09749h2030a1855d249G7516J27524j2296a67492D0099c79762J65251A51108
18521b00588h6330k88051B4768b12813A9735d0234A4022a56224d9608q9348b4482
18509A07146b36A53984b91592e1821M095k75440C04314A27464b2113j98936A68551
18497B07016p8160a59839j51883A45955a80541D00902j91910b24537F2211e0241
18486A22282J31945b60735c3073A7023a09035b4834A7318a69893M4061n6186E9588
$$ y = [20323, 82413, 31457, 42814, -329349, 58299, -48352, 24387, -61446, -146214, -32607, 227457, 127933, -38377, 86948, -33097, 12164, 90419, -125781, -67404, -112634, -229223, -180588, -29377, -115729, 225086, 197736, 143690, -128732, -149479, 157833, -9943, -259817, -34713, -159004, 252782, 109749, -82030, -11855, -4249, 77516, 205040, 192744, -167492, 40099, -379762, -214511, 151108, -200588, -86330, -374381, 24768, -212813, 19735, -40234, 14022, -156224, -49608, -138956, -24482, 107146, -236, 153984, -291592, -51821, -47726, -323166, 304314, 127464, -22113, -221049, 168551, 207016, 128856, -159839, -311722, 145955, -180541, 400902, 208992, -224537, 62211, -50241, 122282, 254227, -260735, -33073, 17023, -109035, -24834, 17318, -169893, -125832, -182018, 59588]
18474E9750a10536j28165I3967A9798a65688m5768A31078b12833g0166l53496
18464d23662A56092d1127j69981g314A48072k605M1137c38131l5744O9682A864
18452b93379i7698k9217j59360h0131B62842b18158H8885b01381B17496k1389
18442A96107A1198e17457a11985K8855l8821K5187A35040C2588c49182A29589
18431B7338h6821j18624j84876f5288l5272l67150K06785A71863B3691a67365
18420B72626G3040J95259h3490k1452A63261B6811J88322J71297A10931J56026
18410B66957a76919A72854D8375L4235a69348B24658n4282h8998C9158g7628c0263
18398A3932b37107B19133a22992b9287d235H6066P1253g9778m7487l8969O701
$$ y = [59750, -110536, -238701, 93967, 19798, -165688, -211456, 131078, -212833, -70166, -423662, 156092, -41127, -211108, -7314, 148072, 145467, 186604, -338131, -373875, -304193, 1864, -293379, -97698, -126915, -286275, -80131, 262842, -218158, 88885, -201381, 217496, 196107, 11198, -517457, -111985, -83130, -121951, -96764, 135040, 32588, -349182, 129589, 27338, -86821, -205445, -390321, -65288, -100560, -467710, -260925, 171863, 23691, -167365, 272626, 73040, 268299, -83490, -104942, 163261, 26811, 215133, 386430, 110931, 266957, -176919, 172854, 48375, 82610, -169348, 224658, 170376, -88998, 39158, -77628, -30263, 13932, -237107, 219133, -122992, -29287, -4235, 86066, 157319, -79778, -127265, -166234, -159533]
18387a59533C27060E4630e6276F5564a19423q7132D1041c7308Q137j3619m8254
18376i1044B50798A14395i0009B00188l0789M9268N253b93551F58c5846J6099
18365a9747C87862f1310a0948B2489b77040q0468b7320K401k81061I4576C2360
18353d1090k67839Q5441D6311J68002b36313D7267i2530A48857a28173j65268
18343b93441d8473L936H3176a88221I4733d1014k42593j500b5045k83848C32286
18331B90222a8741j90126g4308o033k50235J63744B40648D6293D501b0657k7243
18320d7900j80929j24986A13252p599a76386G942A6i6657k46438B4568G072g5802
18307B61841A03774b51916A31647k5102a49233e9113j7755j47561r8685I9101
$$ y = [-159533, 327060, 54630, -56276, 65564, -119423, -206555, 41041, -37308, -29171, -42790, -91044, 250798, 114395, -90009, 200188, 169399, 218667, 223920, -293551, 658, -35846, -19747, 387862, -61310, -10948, 22489, -277040, -357508, -27320, -24919, -305980, 94576, 32360, -41090, -308929, -223488, 46311, 214313, -236313, 47267, -92530, 148857, -128173, -293441, -48473, -44537, 83176, -188221, 94733, -41014, -283607, -285107, -25045, -308893, 332286, 290222, -18741, -208867, -74308, -80341, -330576, -166832, 240648, 46293, 4501, -20657, -47900, -228829, -353815, 113252, 105653, -176386, 7942, 16, -96657, -343095, 24568, 7072, -75802, 261841, 103774, -251916, 131647, 106545, -149233, -59113, -76868, -224429, -323114, 99101]
18296a09242b5721q2312B34566m1923c5928B2631K14431B6781J22449b1230H886
18284a30117L3408B16350f4162C66051A43273a04245B24426p0499a13441o1260
18274a74701q1074O2892O274c074j44692B56560o2775a03676k32904a22940l323
18263a26263c4954l5415j222k26775D3177a1928k75427j48368A36818B0814c07898
18251C34754b16518G2554A5262K74408a85760n5587A74331a60760d1136j1851
18241e2987k34614D28294a00618J391k08692C18261c8403p3143j35795c5162G9854
18229a08999A33893a97219A9844a67817C4816a09476D8154a39749j10130B6235
18218a92777K3363a7436o3294l0308D5114L01428a49251j71585A46861N0110b8989
$$ y = [-109242, -25721, -108033, 234566, 192643, -35928, 22631, 237062, 26781, 149230, -21230, 8886, -130117, -96709, 216350, -64162, 366051, 143273, -104245, 224426, 153927, -113441, -174701, -255775, -192883, -186609, -3074, -147766, 256560, 193785, -103676, -336580, -122940, -126263, -34954, -70369, -71591, -298366, 43177, -11928, -287355, -435723, 136818, 20814, -307898, 334754, -216518, 72554, 15262, 289670, -185760, -241347, 174331, -160760, -41136, -52987, -287601, 428294, -100618, -99227, -307919, 318261, -38403, -111546, -247341, -35162, 79854, -108999, 133893, -197219, 19844, -167817, 34816, -109476, 48154, -139749, -249879, 26235, -192777, -169414, -17436, -80730, -111038, 45114, 346542, -149251, -320836, 146861, 196971, -28989]
18206a18619B36975J8807a79841h4835j47846O119B3825o864a23110N7109A69455
18194A78707a79225c8516B88701a97886c0049P421C42657a08998p3715b0019q2305
18183a02324a7790A0752a58247k05396a03930A29997a4539j4876C47135a47746
18172A32957a70241A3789a46483J5117B06655b58364j02077B1031k168P8559j5904
18161H1518d236j82469f5767q2100j4204K2478j60651f0375A00332a15679E4408
18149A79009b26657a8305A34114d3024B05752o4917a53495I8023a9796A90848
18138b76403M2068H0067b32121A47742E6265a4920A20682a06409I3275a74685
18127b14708r7075B44276r4672g2163n9685B89400g3059F9978b63351g0128A51651
$$ y = [-118619, 236975, 255782, -179841, -84835, -232681, -226562, 23825, 16961, -123110, -66001, 169455, 178707, -179225, -38516, 288701, -197886, -30049, -22628, 342657, -108998, -182713, -20019, -102324, -17790, 10752, -158247, -363643, -103930, 129997, -14539, -29415, 347135, -147746, 132957, -170241, 13789, -146483, -131366, 206655, -258364, -360441, 21031, 18863, 97422, 81518, -4236, -186705, -65767, -147867, -162071, -139593, -300244, -60375, 100332, -115679, 54408, 179009, -226657, -18305, 134114, -43024, 205752, 140835, -153495, 98023, -19796, 190848, -276403, -234335, 80067, -232121, 147742, 56265, -14920, 120682, -106409, 93275, -174685, -214708, -311783, 244276, 149604, -72163, -131848, 289400, -73059, 69978, -263351, -70128, 151651]
18115a48790A18705h7954A48381p2536c60361d820j35329A90696a9538C52543
18104c10696a01424A18784q629L4235A7262K91508i0779r3213m1491p5650B67996
18092B12588a15109l5996J618J0577J9835E0192e3027J828k68921b3536D29984
18080B03a91109d8700k54771J35871b061k87856A38571a82716B07200h7020j9086
18069a06106I0357m4262a90037E2974A9505L59166I5236B9647a4634j03758A02087
18057b65377J18589A02643l5549k1897a15333c7001p8169C06062b63988A23957
18046e978j52809A20394i8100m6696Q651B9332K6220b25617l33B86796c471n4054
18034e7525A41652J19185D349P9292A5005A27g9832b6857B50910a29225j74408
$$ y = [-148790, 118705, -87954, 148381, 75845, -360361, -4820, -140149, 190696, -19538, 352543, -310696, -101424, 118784, 110155, 144390, 17262, 308770, -90779, -183992, -225483, -301133, 267996, 212588, -115109, -151105, -149487, -138910, -119075, 50192, -53027, -51199, -320120, -23536, 429984, 203, -191109, -48700, -303471, -167600, -2061, -289917, 138571, -182716, 207200, -87020, -106106, 90357, 46095, -190037, 52974, 19505, 378671, 95236, 29647, -14634, -118392, 102087, -265377, -146788, 102643, 67094, 45197, -115333, -37001, -115170, 306062, -263988, 123957, -5978, -158787, 120394, -98100, -144796, -136145, 29332, 55552, -225617, -225950, 286796, -3471, -57525, 141652, 260837, 4349, 83641, 15005, 127, -79832, -26857, 250910, -129225, -303633]
18023c03633a1836C0934b40599E1091a3233n6417B19385n0924b60753j9138C2516
18011E979d9655G0884A7857a12127N4031A6419L2691P6573B4844a46900e9448
17999b00477d5211j21885c4566j2133C47702B6667N8018L8736Q3649a41829O4059
17988g7770m6198l27935J65785a24524e9045A94502h2547E1590b26033J08926
17978a17107B92640A15605Q3321J21063a05901A69761d6017k8587B55595B2366
17967A71259a17015B26437a20689A15982E5264a06602j2683l8318f8867r9107
17957a67974C56540j40819G2218J72019N445b73599d3537B7458d2836j19465O1137
17946a01164C9002i6474L4128B06175q3704a38923B07037I4426M6705c03079B35210
$$ y = [-303633, -11836, 30934, -240599, 51091, -13233, -69650, 219385, 168461, -260753, -279891, 32516, 5979, -49655, 70884, 17857, -112127, -58096, 16419, 49110, 125683, 24844, -146900, -59448, -200477, -45211, -167096, -34566, -46699, 347702, 26667, 84685, 123421, 207070, -141829, -77770, -123968, -451903, -286118, -124524, -59045, 194502, -82547, 51590, -226033, -117107, 292640, 115605, 198926, 319989, -105901, 169761, -46017, -74604, 255595, 22366, 171259, -117015, 226437, -120689, 115982, 55264, -106602, -119285, -157603, -68867, -167974, 356540, 215721, 72218, 244237, 249682, -273599, -43537, 27458, -42836, -162301, -101164, 39002, -96474, -62346, 206175, 122471, -138923, 207037, 94426, 141131, -303079, 235210]
17934b14123F8703h155B8286g3871A46604o5947a77970H3074d1606A01881a57976
17922I4133b21655F2546m693h6821n4601l7208O2627k32124a32976B06107h9222
17910a50951B54941c8162i572C12421h6291o0936A2679c6114B38970A14034b29725
17898F2236J7958h4994A96976E0848K8942Q0506J45398a42401f5953b5391D02603
17886b72241D2541b2767C57211j11092I9475O4732q2067J54536C6105K90523H3559
17874G908a01443A23561L548C5770K53241h6837M0643B80586a10091M0033j29493
17863a99551E8377b14827E8427f3093K9354o3162B51188C4427a24016A28890n111
17852A23779m3833f0160E5085B5281h4400A45253P3432g8549A09079E0209a06854
$$ y = [-214123, 68703, -8155, 28286, -73871, 146604, 80657, -177970, 83074, -41606, 101881, -157976, 94133, -221655, 62546, 57853, -86821, -141422, -178630, -116003, -348127, -132976, 206107, -89222, -150951, 254941, -38162, -9572, 312421, -86291, -147227, 12679, -36114, 238970, 114034, -229725, 62236, 80194, -84994, 196976, 50848, 79790, 160296, 305694, -142401, -65953, -25391, 402603, -272241, 42541, -22767, 357211, 246119, 99475, 164207, 82140, 236676, 36105, 326628, 83559, 7908, -101443, 123561, 127109, 35770, 289011, -86837, -46194, 280586, -110091, -70058, -199551, 58377, -214827, 58427, -63093, -33739, -96901, 251188, 34427, -124016, 128890, 123779, 79946, -60160, 55085, 25281, -84400, 145253, 218685, -78549, 109079, 50209, -106854]
17840A81127J17083g7454j93377A30122a23475A08131K2492l103b08784A40460
17829b7138k15758a8806r6375A07348f6378K3272c607r1313F2556e2472A59572
17817a47095J6988N2128M642D1427a86165k9756G946K97235A42273J14039b02195
17805A21860b6495B4678L5062R0447b51784g5481E0970J56222d0293p6313l17371
17794d33977D14255F0868h1689B22477r1487F2839J49183J60500H0589e3722H6914
17782d2304I6784N9233G0706b43859d1255B21370a78484n3381G08793C115P806
17771A0921K40258a14195B1132f0255A79302b37094D1398e9168n0986m6727c3845
17759a1942B56215R2279D0887c6848A8408O7415a60053F0975K71129F1632a62707
$$ y = [181127, 298210, -77454, -270831, 130122, -123475, 108131, 130623, 127520, -208784, 140460, -27138, -242896, -18806, -115181, 107348, -66378, -43106, -3607, -94920, 62556, -52472, 159572, -147095, -130107, -77979, -73337, 41427, -186165, -215921, 7946, 305181, 142273, 256312, -202195, 121860, -26495, 24678, 59740, 150187, -251784, -75481, 50970, 207192, -40293, -116606, -433977, 414255, 60868, -81689, 222477, 130990, 62839, 212022, 372522, 80589, -53722, 86914, -42304, 96784, 156017, 70706, -243859, -41255, 221370, -178484, -231865, 708793, 3115, 10921, 251179, -114195, 21132, -60255, 179302, -237094, 41398, -59168, -110154, -156881, -33845, -11942, 256215, 348494, 40887, -36848, 18408, 85823, -160053, 60975, 332104, 61632, -162707]
17747c0106m4434C13091b72357A25380n9267h8213A0129b46769D5182c4664m0576
17736g5240j81374A53164A3559L10022c482k87779a1672I8820I951K49133G8647
17724b74194C43061c54265A59632d9344q3587p8245O6396A08886n257L18926A20807
17712B1961A713a33191e8199A23833E8316A369L14082p3735A3468d0383A45338
17700A31599Q6867a15430A65950J23996H8740a95469O0742D6677B1152J4800J73972
17689B09924n9234C0094K1243a70616g8376A274J6893K99311N433B9404K49148
17678B78552I1604a52175A03558f893k2127O920D6993e93259a9634k30322A24625
17666e6541m1711B46632a14586b5354o1039G9733J12881J92355B9108L30698p5277
$$ y = [-30106, -74540, 313091, -272357, 125380, 66113, -88213, 10129, -246769, 45182, -34664, -75240, -256614, 153164, 13559, 323581, -3482, -291261, -11672, 98820, 9951, 259084, 78647, -274194, 343061, -354265, 159632, -49344, -132931, -211176, -144780, 108886, 103629, 422555, 120807, 21961, 1713, -133191, -58199, 123833, 58316, 1369, 315451, 241716, 13468, -40383, 145338, 131599, 218466, -115430, 165950, 289946, 88740, -195469, -134727, 46677, 21152, 35952, 209924, 150690, 30094, 51337, -170616, -78376, 1274, 18167, 317478, 322911, 29404, 278552, 91604, -152175, 103558, -6893, -29020, -22100, 46993, -593259, -19634, -249956, 124625, -56541, -98252, 246632, -114586, -25354, -86393, 79733, 192614, 384969, 29108, 359806, 284529]
17655B84529a53661B31676D4903J2813J98661R0165A33043K21927g9109C28087
17644D9361Q9052e535A72003J91954j62630q304l1465b87814E933c7784A02007
17632I8566a17510B79017J47648A01892d6272D20947a01052E0184K0072L77189
17622D47445A64695J09818k6833P6826n0393a85975i211A19562J43517A22250
17611a01970F2033C907M08877j61144R1733o4900l5212a77587r368E4573a24857
17599A37033N1106K58148F266O9196M12544j47680a8855C54400a7301j14892A75648
17587A13871a65034F40825A86101r788M0552k8531H5770J31726C3863d8959C90042
17575A2208J09605d7099p9273J5214J6388B18046c9303A46684J22930i9477C28561
$$ y = [284529, -153661, 231676, 44903, 57716, 256377, 346542, 133043, 354970, -79109, 328087, 49361, 138413, -5535, 172003, 363957, 201327, 193023, 161558, -287814, 5933, -37784, 102007, 98566, -117510, 279017, 426665, 101892, -46272, 420947, -101052, 50184, 70256, 447445, 164695, 274513, 247680, 324506, 274113, -185975, -9211, 119562, 263079, 122250, -101970, 62033, 3907, 412784, 251640, 343373, 278473, 243261, -177587, -186955, 54573, -124857, 137033, 188139, 446287, 6266, 75462, 488006, 340326, -18855, 354400, -17301, -132193, 175648, 113871, -165034, 640825, 186101, 176313, 216865, 188334, 85770, 217496, 33863, -48959, 390042, 12208, 121813, -47099, -126372, -111158, -94770, 218046, -39303, 146684, 269614, -99477, 328561]
17563B68759J61304G5462d4451A32315J41207k7482Q9353E4607J16502G2141R5288
17552A67429K66748I89K86139A29181E9946J05445a03905l4644c1222j10059B38245
17540f4677G3216j0979h7516A98525J80029q2790k7274C9315M3579J65392L0563
17529B78849h8245B65860H0371a48677D69063A05815r066K98606O864K62699B13494
17517G71696A21031P4034J23627B0341J15613K78905j49790J69883A97813J07840
17507C05653K12419j70562K99112O0541A00223K06167H9636J13980P4194m8411
17497B29399L3536R7626I9076L06532a5714B75006j37311a24014B31399J56152
17487C87551A17890G938M23155j48231e1935H748K26048G9692O6819K83476a22211
$$ y = [268759, 430063, 75462, -44451, 132315, 273522, 246040, 335393, 54607, 171109, 72141, 167429, 434177, 989, 287128, 129181, 59946, 165391, -103905, -138549, -31222, -141281, 238245, -64677, 73216, 62237, -87516, 198525, 378554, 295764, 268490, 39315, 82894, 248286, 278849, -88245, 265860, 80371, -148677, 469063, 105815, 96749, 395355, 402219, 664918, 213494, 771696, 121031, 195065, 318692, 20341, 135954, 414859, 265069, 434952, 197813, 305653, 518072, 347510, 646622, 707163, 100223, 306390, 89636, 203616, 277810, 229399, 262935, 360561, 99076, 405608, -15714, 275006, 137695, -124014, 231399, 387551, 117890, 7938, 431093, 282862, -51935, 8748, 234796, 79692, 146511, 429987, -122211]
17475B10999j3076J19763r4600r1702i4990C59448D1521h897m5162a982n6968
17464e8950A22885J79224m5286Q8436j57035K51181A32362O0175O4435A11692
17453a20067A64039r101L8329k3967K23711L9081B4531J32459J23869n8886F0979
17441A74016K6556J89248H4834J29549H8514P9092M34047B13025J47374A76447
17430B89360K812j30950J61628K91211B77997J62755r9215q3575q5373R9028j06774
17419A64843K0457k6630a50956C67280A36175L56991C9156J03033K43203A63041
17408C15524c1431B66598p3927q1394A721a09824D53261r3476l6481g3747j8485
17397i2232B29090D2468L63806A11132D8608h217k2519C97878A00126K59571I6659
$$ y = [210999, 197923, 317686, 223086, 131384, -94990, 359448, 41521, -8897, -54059, -1982, -58950, 122885, 302109, 256823, 345259, 188224, 439405, 132362, 192537, 256972, 111692, -120067, 164039, 154938, 193267, 169300, 393011, 432092, 24531, 156990, 280859, 221973, 60979, 174016, 200572, 389820, 84834, 214383, 88514, 167606, 601653, 213025, 360399, 176447, 289360, 292172, 161222, 322850, 614061, 277997, 440752, 341537, 257962, 172589, 271617, 164843, 185300, 158670, -150956, 367280, 136175, 493166, 39156, 142189, 385392, 163041, 315524, -31431, 266598, 192671, 111277, 1721, -109824, 453261, 359785, 323304, -73747, -92232, 229090, 42468, 406274, 111132, 48608, -8217, -30736, 397878, 100126, 359697, 96659]
17385B00903r4963c2363B71348g9960A91556Q0443L9364j01777I4195K49484o6857
17374B76822g0427C28340a13108B72506a5264A52179L300p5008P6280l2020M2597
17363A67328K39886A45333N6299a28804A14899d2262E8591B5501j989g4625B99193
17351B53936j17167a20938d5868D16974c060D20940p5842j00476j08267J69818
17341C06173a42810D25384g6677C01887O0956a43751F4250J16722J04541C3649
17330E1387J74243r2114A7882J09585M98721A54746J519a3911D75916h0216B58861
17318A25719K568K14703J54368B14984M079n4519Q756J36270p3386N0728g9294
17306H0495M0618L95032k21036L829A37311A7400L30389j06738f4987E34462a55150
$$ y = [200903, 105940, -32363, 271348, -79960, 191556, 271999, 311363, 209586, 94195, 343679, 276822, -70427, 328340, -113108, 272506, -15264, 152179, 155479, 80471, 156751, 124731, 167328, 407214, 145333, 201632, -128804, 114899, -42262, 58591, 25501, 23512, -74625, 299193, 253936, 136769, -120938, -45868, 416974, -3060, 420940, 345098, 244622, 136355, 306173, -142810, 425384, -76677, 301887, 362843, -143751, 64250, 180972, 285513, 33649, 51387, 225630, 133516, 17882, 127467, 626188, 154746, 156265, -13911, 475916, -80216, 258861, 125719, 128287, 342990, 497358, 214984, 219063, 164544, 173300, 309570, 236184, 286912, -79294, 80495, 121113, 516145, 295109, 298938, 137311, 17400, 347789, 241051, -64987, 534462, -155150]
17294B68161D1296J59938J6181K31073J16166k39928j07185H6499M69512B18403
17283A64338O260B7426K90049G6026J91067O7525O6003k5510j30191E4361L03926
17272C58287R2407D7938K56115j34178j0769m5275K78486A48588J25426p5317
17262A98697b1222F56778h3172D74075A78823L13211m6478a23276B58801N6589
17252C15390q1993A04596K43885p6187j6476C8021J29200J62306J31578A07088
17241B50501n5237k4419Q913J13599J11626A40658J47516m5O5951A36684R5881
17230B32565L04704j59786m5002R3967j62861O8973A24592D7406K65728m7700
17220B65434J76416B03401E9501M28501B17575R1379p4609K42230b1664B11445
$$ y = [268161, 41296, 201234, 217415, 448488, 564654, 324726, 217541, 86499, 556011, 218403, 164338, 170598, 27426, 317475, 76026, 267093, 334618, 400621, 375111, 244920, 54361, 358287, 450694, 47938, 304053, 169875, 159106, 113831, 392317, 148588, 274014, 198697, -21222, 656778, -83172, 474075, 178823, 492034, 445556, -123276, 258801, 315390, 233397, 104596, 348481, 272294, 255818, 38021, 167221, 329527, 461105, 107088, 250501, 195264, 170845, 179758, 293357, 404983, 140658, 288174, 288129, 354080, 136684, 232565, 537269, 377483, 332481, 426448, 263587, 332560, 124592, 47406, 313134, 265434, 441850, 203401, 59501, 488002, 217575, 308954, 234345, 476575, -21664, 211445]
17209H8751K45688O0838N5038G6452J79810K4903P7886m6163o8465M22225j75425
17198D91223j85722A22532O4828N8031c8714F76454l30316r4857n5263J12018
17188C08036G6751K0829K86196R8600K6477P3816k62120A40149l8775N52487B68698
17176E52054j03412I9167L09697K01386a6528E01318N1133N50e700C96152m190
17165C91962L90264C03478J39193m8697L8259j02205e9709F13503A34808K44540
17155C79348r0129n4224M1840j02209K48216Q0864H8317J17935J28508L17218
17145F51978k89124L95875j73113j31225q4371r5844L15664q4149k8924L000J95286
17134F75053j45113k13786K16154l4933k15054L81202j88545j28J98318A62380
$$ y = [88751, 334439, 395277, 450315, 76452, 256262, 281165, 359051, 312888, 244423, 666648, 491223, 305501, 122532, 187360, 245391, -38714, 676454, 346138, 251281, 196018, 308036, 76751, 97580, 383776, 482376, 508853, 582669, 320549, 140149, 101374, 653861, 268698, 552054, 448642, 99167, 408864, 610250, -16528, 501318, 552451, 553001, -5700, 396152, 391962, 782226, 303478, 442671, 393974, 432233, 330028, -59709, 613503, 134808, 379348, 289219, 234995, 276835, 174626, 422842, 503706, 88317, 206252, 334760, 651978, 362854, 758729, 585616, 454391, 370020, 274176, 589840, 505691, 476767, 479767, 675053, 529940, 316154, 532308, 497375, 282321, 663523, 474978, 474850, 673168, 162380]
17123C81549K40638j95399J69071k0929O1452j80673q3985J57974j17213j15085
17113B97400K0463K77925B86026M45053r263B15897J42381J12445j42q7854R6875
17102D79602K5755O6916j56732K31985j03124J91255k28028L89057C94129M44401
17092H38530l09638J03524K17260n5694l16166B24478K40452K7253l8708n2885
17082D00590K53847J58960l11941R8648j66241J13800K03407l17639J51744r4852
17072D90323M9867j47999K54581R8423o0616n4312L6662J2160l5296K64198l15143
17061E92848j6254L9254n6041L95048C12775N58361k28042J68121J8340j65322
17051F64233j25206P22285E29016L1241Q4938K23097j41426K7473L22853j72247
$$ y = [381549, 622187, 426788, 595859, 574930, 636382, 455709, 371724, 529698, 412485, 297400, 317863, 595788, 286026, 731079, 721816, 215897, 358278, 470723, 470581, 382727, 479602, 505357, 572273, 415541, 647526, 544402, 735657, 507629, 896686, 394129, 838530, 528892, 632416, 849676, 793982, 477816, 224478, 464930, 492183, 453475, 400590, 654437, 813397, 501456, 600104, 433863, 547663, 751070, 433431, 585175, 490323, 540190, 392191, 646772, 745195, 684579, 630267, 666929, 679089, 643793, 907991, 592848, 576594, 615848, 559807, 954855, 312775, 871136, 643094, 811215, 829555, 664233, 539027, 1261312, 529016, 560257, 645195, 868292, 726866, 754339, 1077192, 904945]
17041I04945L6884k55889K4717M77679E72053K04873r8138r4617N59950E60793
17030A041806k91842J05182O9390j52309Q8043P2988K9404j37087m05391J70534
17020E90718K09413K62253k15180J2692M9137p8827N4756j02853L22154k74071
17010H30192k2630Q1341k8553J50703K5662l92401K43439K1388l80126L81908
17000I10923P5258J64042k71658K02581O9203m61648N68875j3730k30082J79508
16990A193272k79776L63707N0208J16372k83471j2227j82971L6523O6225M68250
16980A536112o78079M55454J81940m16720L63492l519k64970J78553j60600J76133
16970A367796J30040Q5550l08531J25070q0481K38369j69893J76856J0204l41097
$$ y = [904945, 941829, 685940, 710657, 1188336, 572053, 776926, 678788, 584171, 1144121, 560793, 1041806, 749964, 855146, 924536, 772227, 860270, 933258, 962662, 825575, 420184, 590718, 800131, 1062384, 847204, 859896, 909033, 830206, 884962, 782109, 1104263, 830192, 807562, 888903, 860350, 1011053, 1036715, 644314, 887753, 909141, 529015, 910923, 986181, 1150223, 878565, 1081146, 1150349, 688701, 1257576, 1243846, 1013764, 1193272, 913496, 1277203, 1327411, 1443783, 1160312, 1148085, 965114, 1001637, 1067862, 1536112, 858033, 1313487, 1495427, 1078707, 1442199, 1438680, 1173710, 1352263, 1191663, 1367796, 1497836, 1583386, 1274855, 1399925, 1319444, 1557813, 1387920, 1564776, 1574980, 1233883]
16960A233883K72527J49448J12211l08722N85239o11492K4107J95411k13278p812
16950A431522K13220k45498M41678j88520J14684n5555K31804j15386p030J7455
16940A838374P4377M5890m37445L98007K358R1892J42317j52499j49227N9005
16930A913049K85316k96598L28444k31721K4058J03935r6992K92977j08414J42834
16920B356888j40074R110L4955L28908k13325R3874K97213k51375L3319q2440
16910B467053m0710M58633l64210J76630J23106j62900K14859P5983K17347r8818
16900C066973o0418P9242J31135l68180L18076r187L9679m7908J02273O6552K47521
16889C565758M951P1821p794q2130K24950k88803q7524L23243M24999j64509j09757
$$ y = [1233883, 1506410, 1655858, 1768069, 1459347, 2044586, 1433094, 1457201, 1652612, 1439334, 1431522, 1644742, 1399244, 1840922, 1652402, 1767086, 1711531, 1943335, 1827949, 1820919, 1838374, 1912751, 1958641, 1521196, 1919203, 1921561, 2013453, 2155770, 2003271, 1854044, 1913049, 2198365, 1901767, 2230211, 1998490, 2022548, 2126483, 2029491, 2322468, 2214054, 2356888, 2216814, 2225924, 2260879, 2589787, 2376462, 2470336, 2767549, 2516174, 2549493, 2467053, 2426343, 2884976, 2520766, 2697396, 2820502, 2657602, 2872461, 2948444, 3165791, 3066973, 3006555, 3085797, 3216932, 2848752, 3166828, 3157641, 3197320, 3149412, 3251685, 3318237, 3565758, 3570709, 3642530, 3634736, 3552606, 3777556, 3488753, 3401229, 3724472, 4149471, 3984962, 3875205]
16878C875205J53544L63209k26635P5760k99670N00546k55237L95696J60801J82000
16868D925219j32021J47044Q8374K2795J70788q2704j4620Q6120K31505j10387
16858E332113L42176l5088L36967l24362J29895N29776j49505J52246J71561p1605
16848F414174J55937K40953j25437M34010K97302j52393O39313l02076J56033
16839G757816L93186r3683J09499K49218K43768L38640m1367K40872J97955L50383
16829I746287J48824M17385N0483L14401j58036L15270J26177M97675R7736M93913
16819A2050115J30324L85013M76272K0068K13749O86026j7498O00689J86299M96454
16809A5227511N78935L53093M60722L19222M22155N77982M46046N49172L78062
$$ y = [3875205, 4028749, 4391958, 4165323, 4241083, 3941413, 4441959, 4186722, 4582418, 4743219, 4925219, 4793198, 4940242, 5028616, 5051411, 5222199, 5139495, 5124875, 5210995, 5442500, 5332113, 5674289, 5639201, 5976168, 5651806, 5781701, 6311477, 6161972, 6314218, 6485779, 6414174, 6570111, 6811064, 6685627, 7119637, 7416939, 7264546, 7903859, 7601783, 7757816, 8151002, 8057319, 8166818, 8416036, 8659804, 8998444, 8957077, 9197949, 9395904, 9746287, 9895111, 10312496, 10362979, 10677380, 10519344, 10834614, 10960791, 11458466, 11556202, 12050115, 12180439, 12565452, 13041724, 13061792, 13275541, 13961567, 13944069, 14544758, 14731057, 15227511, 15806446, 16159539, 16620261, 16939483, 17361638, 17939620, 18385666, 18934838, 19312900]
16800A9312900N26065L73960J100450L98638N78516Q32310N81341O38417Q14987
16791B5157584Q37458O00361R54364R51822O50388J073759P41307Q75579J310730
16782C3153352Q44681J148750J418576J054215J497304R97129J259438J485475
16774D2858920J510962J634406J729129J661308J385628J539308K147851J389739
16766E5857251J834667K336499J786956K275788J821131K028102K438833K358265
16758G2737492J942236K298979K425720K342216J834626K487757J781002K176343
16750I0026371K175481J857237K051979J734672J621515J319536J308350J115981
16742A03211122R99289P10115N73950O7142L26619j42956l94841q53241l46591
$$ y = [19312900, 19838965, 20212925, 21313375, 21712013, 22290529, 23122839, 23704180, 24342597, 25157584, 25995042, 26595403, 27549767, 28501589, 29151977, 30225736, 30967043, 31842622, 33153352, 33998033, 35146783, 36565359, 37619574, 39116878, 40114007, 41373445, 42858920, 44369882, 46004288, 47733417, 49394725, 50780353, 52319661, 54467512, 55857251, 57691918, 60028417, 61815373, 64091161, 65912292, 67940394, 70379227, 72737492, 74679728, 76978707, 79404427, 81746643, 83581269, 86069026, 87850028, 90026371, 92201852, 94059089, 96111068, 97845740, 99467255, 100786791, 102095141, 103211122, 104210411, 104920526, 105494476, 105561618, 105888237, 105745281, 105350440, 104497199, 104150608]
16733A04150608j149176j307450j097867j556087j556205j802683j563116k348302
16725I1769722j593443k235129j892329k181570k090510k695071j608019k427681
16717G5045970k382615j621834k294399k064504k053452j749646k129919j844823
16709E8904778j938451j887155j501160j457249j821240j284146j555636j194689
16701D6265052j949928r08922j313107p98755j774702j119679j172876j000301
16693C6226782r76055r44301j225824o55813j046710q10889j004977q27794k04175
16684B8530244r56406q16169o25340p01171p78482n27030o36376p31823k83832
16675B2473615p24505l61413k39270j186020K56714n81634n30422n74639m93235
$$ y = [104150608, 103001432, 101693982, 100596115, 99040028, 97483823, 95681140, 94118024, 91769722, 90176279, 87941150, 86048821, 83867251, 81776741, 79081670, 77473651, 75045970, 72663355, 71041521, 68747122, 66682618, 64629166, 62879520, 60749601, 58904778, 56966327, 55079172, 53578012, 52120763, 50299523, 49015377, 47459741, 46265052, 44315124, 43406202, 42093095, 41294340, 39519638, 38399959, 37227083, 36226782, 35250727, 34306426, 33080602, 32424789, 31378079, 30567190, 29562213, 28734419, 28530244, 27573838, 26757669, 26132329, 25431158, 24652676, 24125646, 23489270, 22757447, 22473615, 21749110, 21387697, 21148427, 19962407, 20219121, 19637487, 19107065, 18532426, 18039191]
16666A8039191l52790m52608p2805n29329l45469l46060l52858m3235o88426l07396
16656A4548215k48635j01609k60535l39460m03112j60038k94432j81292o18296
16647A1940806k7728R6093m91587J55880m81685j09516k70552l35232j27927l33099
16637A0015453J66364j54453j82033j09463k12508j70077j51443l20667L24879
16628I206052n23601N9413n10068Q8220j38909o6917n206k57215j57057p4189
16618G620523J52469l25326j40983J25235m13568K60287l52917K45518k08289
16609F962949l81630M8422j04989P3445k52061m037j68770k0656j38960K3934
16599F037647m11646M9857r5739Q9496K7776k41729R7944K64603k16095l78575
$$ y = [18039191, 17686401, 17233793, 17160988, 16631659, 16286190, 15940130, 15587272, 15544037, 14855611, 14548215, 14299580, 14197971, 13937436, 13597976, 13194864, 13034826, 12740394, 12559102, 11940806, 11913078, 12009171, 11517584, 11673464, 11191779, 11082263, 10811711, 10476479, 10348552, 10015453, 10181817, 10027364, 9845331, 9735868, 9523360, 9353283, 9201840, 8881173, 9206052, 8682451, 8741864, 8231796, 8320016, 8181107, 8114190, 8108984, 7851769, 7694712, 7620523, 7772992, 7447666, 7306683, 7431918, 7018350, 7278637, 6925720, 7171238, 6962949, 6581319, 6629741, 6524752, 6598197, 6346136, 6342099, 6173329, 6152673, 6013713, 6037647, 5626001, 5675858, 5580119, 5669615, 5697391, 5455662, 5553606, 5818209, 5602114, 5223539]
16589E223539j6620j8663r8753J38434n17089p6530M09754L1796m12655R4461
16579D757674J61135l58395M36441k24783j83189o3820r903j35639j8114J36014
16569D497421m03457L14944o3550m9446n12514O24552n64590L21168o7034J14469
16559D211963l06207J44802k48581K09587j74946o2534K1396k03336j25478L020
16549C469686K86002k17543j9436N6325k59487K15762R3095J11962j24146k41191
16539C371029J8033k31496j5470J05606J32672j84538k88872J47420N6981O5102
16529C176467k04714J35158k2778n2821q7883n486J60796j41730l89313K54902
16519B822598R7573l75024N9880K65648K28211k97857Q6966L97103l57410j79091
$$ y = [5223539, 5206919, 5188256, 5089503, 5227937, 4710848, 4634318, 5044072, 5075868, 4663213, 4757674, 4918809, 4560414, 4996855, 4772072, 4588883, 4525063, 4515160, 4379521, 4361407, 4497421, 4093964, 4408908, 4345358, 4295912, 3783398, 4407950, 3843360, 4164528, 4097494, 4211963, 3905756, 4050558, 3801977, 4011564, 3836618, 3774084, 3795480, 3592144, 3466666, 3469686, 3755688, 3538145, 3518709, 3575034, 3315547, 3531309, 3624404, 3736366, 3612220, 3371029, 3389062, 3157566, 3142096, 3247702, 3380374, 3195836, 2906964, 3054384, 3111365, 3176467, 2971753, 3106911, 3084133, 3031312, 2943429, 2937943, 3098739, 2957009, 2567696, 2822598, 2920171, 2545147, 2605027, 2870675, 3098886, 2801029, 2887995, 3285098, 2927688, 2748597]
16509B748597j27744l1886L90152k08682J40242m32430K79469k6240L83977m32456
16499B682999J60972l06644J77181K40103k97259q895j20858j99905P1747J56012
16489B555453k45194J54248k6176K69526l08097j41917M06536m16712P5270L52579
16479B675516k06750p4741Q847J38215j70146j11498J15603K52356m93287R7535
16469B231650L35836r5235m2633j79649K68320j34187l21723L34483m34300M46607
16459B409169j32020M72690k72445k76953L47711o09208J24650l180N64123j09568
16449B514969m61849O3304J92362r5955K36596J3999k97713K9865j95537R60R3801
16438B094802J14221l37148L89944k10129j5408J38100j1974L4231M3648k3252
$$ y = [2748597, 2620853, 2588967, 2979119, 2770437, 2910679, 2478249, 2757718, 2731478, 3115455, 2682999, 2843971, 2537327, 2714508, 2954611, 2657352, 2648457, 2527599, 2327694, 2399441, 2555453, 2310259, 2464507, 2438331, 2707857, 2399760, 2257843, 2664379, 2247667, 2322937, 2675516, 2468766, 2394025, 2402872, 2541087, 2370941, 2259443, 2375046, 2627402, 2134115, 2231650, 2567486, 2472251, 2429618, 2249969, 2518289, 2384102, 2062379, 2396862, 1962562, 2409169, 2277149, 2749839, 2477394, 2200441, 2548152, 1938944, 2063594, 2060414, 2624537, 2514969, 2053120, 2116424, 2308786, 2212831, 2449427, 2463426, 2165713, 2195578, 2000041, 2001001, 2094802, 2209023, 1871875, 2261819, 2051690, 2036282, 2174382, 2162408, 2196639, 2240287, 2217035]
16428B217035k52924L38964k31978Q2668j29878k1582J60559k86407L18673j34203
16418B060927l9962K58032k09399k69828J44704J32335K0277j71521m5793J72348
16408B052120l26353M76363k38287o6900k81989M93580k94817K82208O2795j19677
16398B039043k2340K0671Q7568k01294n4756M50496l54123J87857k08501n4878
16388A889743n3993K85259R421l41867k8275K32806J34363j82765k32077K86433
16378A999048k97161M09671k1426j28416K23011k18332K57956l74003l3344K98718
16368B115722j17880m5284j45162j31195L61102k85615m9526M11525j1488l24466
16358A777733J65130J93479l42971R6151k29394K27131J23371l09244J04416M10817
$$ y = [2217035, 1964111, 2303075, 2071097, 2153765, 2023887, 2002305, 2162864, 1876457, 2195130, 2060927, 2020965, 2278997, 2069598, 1799770, 1944474, 2076809, 2097086, 1925565, 1879772, 2052120, 1725767, 2202130, 1963843, 1896943, 1614954, 2108534, 1813717, 2095925, 2158720, 2039043, 2016703, 2037374, 2124942, 1923648, 1868892, 2319388, 1965265, 2153122, 1944621, 1889743, 1835750, 2121009, 2130430, 1788563, 1760288, 1993094, 2127457, 1944692, 1712615, 1999048, 1701887, 2111558, 2090132, 1961716, 2184727, 1966395, 2224351, 1850348, 1817004, 2115722, 1997842, 1952558, 1807396, 1676201, 2037303, 1751688, 1702162, 2113687, 2102199, 1777733, 1942863, 2136342, 1793371, 1889522, 1660128, 1887259, 2010630, 1701386, 1805802, 2216619]
16348B216619k18945M4789Q8020m08194L1251k1517l4940L1033L84004k91495
16338A820625K50508j98775j20510J97044k23177J89719k26324k76141J80335
16329A593304J05170J85877k17339K16796p0061j21514L28714l65054J30594j24315
16319A662172K49769l93357K79616Q894j63004J23818J38911r4995l1352J46598
16309A927070k79956K9402j12227K11564k73490L49610k90461K10699o7328k776
16299A702107J00414L7810l05406K08267M5473L84444o17760J47358K4869J07345
16289A834921k55992r9426J46968J39591l5173k01767J35384l38461M61462l8868
16279A748639O3501n7782j78424N9768N5952j33347J83185K21986m84019L2846
$$ y = [2216619, 1997674, 2042463, 2130483, 1722289, 1753540, 1732023, 1697083, 1728116, 2112120, 1820625, 2071133, 1872358, 1751848, 1948892, 1725715, 1915434, 1689110, 1412969, 1593304, 1698474, 1884351, 1667012, 1883808, 1813747, 1692233, 2020947, 1655893, 1786487, 1662172, 1911941, 1518584, 1798200, 1807094, 1644090, 1767908, 1906819, 1811824, 1780472, 1927070, 1647114, 1676516, 1564289, 1775853, 1502363, 1851973, 1561512, 1772211, 1704883, 1702107, 1802521, 1840331, 1534925, 1743192, 1788665, 2173109, 1555349, 1702707, 1727576, 1834921, 1578929, 1479503, 1626471, 1766062, 1730889, 1529122, 1664506, 1326045, 1787507, 1748639, 1812140, 1754358, 1575934, 1635702, 1691654, 1558307, 1741492, 1963478, 1479459, 1512305]
16269A512305K04715j45022k49016K39605K40663m02459K79829J27774l81318
16260A427076j33957J16481J83803j94811M24885j04603l41649j51467M24529
16251A650287n1305J064j31640m41737M60630o9663J514J18683p1653j30634k30635
16240A104911Q9654K74678O8192j30276K8670j3993J25186l23313K04325j45058
16230A282976Q2914J13716N1492l02927K20867j86233k57678L34965L8392m7512
16220A330972j84058r6123J09676L62486j52425Q4061j14173j95228J28031j05846
16210A167373j25597n0097K90437j45795J40599K29812m00379q7698K3724L0055
16200A072434J53315J7240r3795j84778J77682l09016M75942k13216k40075K63522
$$ y = [1512305, 1717020, 1571998, 1322982, 1562587, 1803250, 1400791, 1680620, 1808394, 1427076, 1293119, 1409600, 1593403, 1398592, 1823477, 1718874, 1377225, 1225758, 1650287, 1598982, 1600046, 1468406, 1026669, 1487299, 1417636, 1419150, 1537833, 1466180, 1335546, 1104911, 1194565, 1469243, 1537435, 1407159, 1435829, 1421836, 1547022, 1223709, 1428034, 1282976, 1365890, 1479606, 1531098, 1228171, 1449038, 1262805, 1005127, 1340092, 1378484, 1330972, 1146914, 1050791, 1160467, 1522953, 1370528, 1454589, 1340416, 1145188, 1273219, 1167373, 1041776, 991679, 1282116, 1136321, 1276920, 1506732, 1106353, 1018655, 1042379, 1072434, 1225749, 1242989, 1149194, 964416, 1142098, 833082, 1309024, 1095808, 855733, 1119255]
16190A119255L14601k89289r2715P5774n2681k01880L47839n2315k28458k16634
16180G23497j40556K72949O8055n7736k13225l529L07646K09050l54408k8605
16170G83138K88353J76115n18263O8432K88925l57924J4091j90006M19318l57712
16160F14467K70136J75154j87129P5600k07919k03497O01705k99913M5974p4323
16150H10255j86260N86164m34357R0873K25790k30564J08080D84812O4265J07177
16140F56254R6889m7383R773q6561J01336J05534l20356K40044B95933L65097
16130F61030j68710L4469J99657k15171J91997l4578l28846N95678B61826J46643
16120D08469K33182k88390P6892R1498j06358J53731J23326B86932L7740J72266
$$ y = [1119255, 1433856, 1144567, 1051852, 1127626, 1074945, 873065, 1220904, 1168589, 940131, 723497, 582941, 855890, 923945, 866209, 652984, 649455, 957101, 1166151, 811743, 783138, 1071491, 1247606, 729343, 797775, 1086700, 728776, 742867, 552861, 972179, 614467, 884603, 1059757, 872628, 948228, 740309, 536812, 1138517, 838604, 884578, 810255, 623995, 1210159, 775802, 866675, 1092465, 861901, 969981, 484812, 549077, 656254, 753143, 705760, 715533, 628972, 730308, 835842, 515486, 755530, 295933, 661030, 492320, 526789, 726446, 511275, 703272, 668694, 339848, 935526, 261826, 408469, 641651, 353261, 430153, 521651, 415293, 569024, 692350, 286932, 324672, 496938]
16110D96938P9543r7432j02504A80924O00025C29935p4932j03113N09357k5270
16100F35977o1115A59577N61303j89961J11891j80372m8525k03330J96859r641
16090C97801j54341O2475A12457J20278L81329k91025J60563A70592L49987B26345
16079D10951J21218j06025A86853L41426k01634K56376k41088K18366j20242r8324
16069C41733M0472R8725C0947J57007j5173J70614J51577j22722J80357j29977
16059D22630q9398K41480k01369J10524B37872N6975A26927K74651O8329j57100
16049C12807r3112O4364m182j37209A9931K58149O4517j19054q0420J12562I0585
16037E21713A8148h220D86342D8370K46945J53631j67828K45117A52685a76750
$$ y = [496938, 576481, 479049, 376545, 180924, 780949, 329935, 255003, 151890, 661247, 635977, 574862, 159577, 720880, 530919, 642810, 462438, 413913, 210583, 407442, 397801, 243460, 305935, 112457, 232735, 614064, 323039, 483602, 170592, 520579, 226345, 410951, 532169, 426144, 186853, 528279, 326645, 583021, 341933, 560299, 440057, 341733, 382205, 480930, 30947, 187954, 172781, 343395, 494972, 372250, 552607, 422630, 333232, 574712, 373343, 483867, 237872, 294847, 126927, 401578, 469907, 312807, 219695, 284059, 279877, 142668, 19931, 278080, 342597, 223543, 143123, 255685, 90585, 521713, 18148, -8220, 486342, 48370, 295315, 448946, 281118, 526235, 152685, -176750]
16026D15393j94191J50824j1496f3029C72607n8062D4599M73314A94349n945D1649
16014a93605A36220L2493L12050C6353K59269A08269L97200j84717q00O3519A68096
16002C52786A05092J59448j02277e8732A31940K63032p4760A6376K89916j4708
15992B91584j37362R8542J29278n4147M67575l5413N7998L49701m54778P0794
15982G83772l27818G8403M12354e4118B79795a80656A38985J01678r8348L8715
15972A81030J27426O6637A82977J53010A46782a57826h722B18118k5516M537P5468
15961B72607m8984g6313E9514D385J43032C1951a08746A88774g181B89570e4309
15949A07641K7361b14134i694A79994o8477g5515B58184O2355j13488a83084e3691
$$ y = [415393, 221202, 372026, 360530, -63029, 372607, 314545, 44599, 517913, 194349, 188404, 41649, -193605, 136220, 168713, 480763, 36353, 295622, 108269, 505469, 320752, 319952, 383471, 168096, 352786, 105092, 264540, 162263, -58732, 131940, 394972, 320212, 16376, 306292, 291584, 154222, 252764, 382042, 327895, 795470, 760057, 818055, 1167756, 712978, 783772, 455954, 78403, 490757, -54118, 279795, -180656, 138985, 240663, 142315, 181030, 308456, 375093, 182977, 335987, 146782, -157826, -8722, 218118, 192602, 197139, 272607, 223623, -76313, 59514, 4385, 147417, 31951, -108746, 188774, -7181, 289570, -54309, 107641, 135002, -214134, -9694, 179994, 111517, -75515, 258184, 320539, 207051, -183084, -53691]
15937b66770R2643c4591o9053B96582R6973C4612M6992J19995e9555A91940q473
15926A83467K49737G1220J86389B9060J82466a03016n0697g055l8173A22653N0380
15915A73033o3409b01310L6664H7490F525K95152a5436A59995A3615a08210q3072
15904a91282C54932A1297K55985G6254a37106A34412p089L1979K22420F8782b44443
15892d1861m6722j29542A99517a96485A12619c1808k4056G6968a05890H4326A1736
15880a67523B85930b4955j77737G9315k4372J56346d4131j59129D7496a40472
15869h5854j08376K8863c1123j29980M1527B32115C7861J77068g399D28879d56593
15857B35177e2920A681O9357L2960C9388J78055b30360f8390H8637b37317E2031
$$ y = [-266770, -174127, -34591, -103644, 296582, 393555, 34612, 81604, 201599, -59555, 191940, 183467, 433204, 71220, 257609, 29060, 211526, -103016, -153713, -7055, -45228, 122653, 173033, 109624, -201310, -164646, 87490, 6525, 301677, -15436, 159995, 13615, -108210, -191282, 354932, 11297, 267282, 76254, -137106, 134412, 127323, 159302, 381722, 68782, -244443, -41861, -88583, -218125, 199517, -196485, 112619, -31808, -55864, 76968, -105890, 84326, 11736, -167523, 285930, -24955, -202692, 79315, 54943, 211289, -44131, -203260, 47496, -140472, -85854, -194230, -165367, -31123, -161103, -119576, 232115, 37861, 214929, -7399, 428879, -456593, 235177, -52920, 1681, 71038, 103998, 39388, 217443, -230360, -68390, 88637, -237317, 52031]
15845f5067j608m4235G43e2704l9148A76599e3470B31100K2052J26237c71249
15833C4918a1882j86061O1923j96984C3680i785D6161b08788a0941j355k49498
15822b61794A77054p4397a96126H0480M8660J23393f5560G1508k8576K23683d37329
15810A81982a44963A57174d6491B78048n5421n9054G2139a23383C47506A25019
15799A17449K35895A14346c9575A24297d8855l5153A23563i3330K8985j33386
15789a97731G8495a61933A86439a8670A43394e9152j65416H5943b92768f8309
15778A10606c08093K9997k5339a4909j6404m8545B2775R782a5466M889j4452C7671
15765i1394c8331J5161A01404c8484A49364b05772B23029M7025A33008e7032H1662
$$ y = [-65067, -66675, -110910, 743, -52704, -91852, 176599, -53470, 231100, 253152, 379389, -371249, 34918, -11882, -197943, -136020, -333004, 33680, -9785, 46161, -208788, -10941, -12296, -261794, 177054, 102657, -196126, 80480, 129140, 252533, -65560, 71508, 42932, 266615, -437329, 181982, -144963, 157174, -46491, 278048, 222627, 163573, 72139, -123383, 347506, 125019, 117449, 353344, 114346, -39575, 124297, -48855, -84008, 123563, -93330, -64345, -197731, 78495, -161933, 186439, -18670, 143394, -59152, -224568, 85943, -292768, -68309, 110606, -308093, -278096, -303435, -14909, -31313, -79858, 22775, 32557, -15466, -10577, -25029, 37671, -91394, -38331, -23170, 101404, -38484, 149364, -205772, 223029, 270054, 133008, -57032, 81662]
15753A28716K97636n0131f8033j15363h0026C06653j12313b80802A899b08425
15742a10819F3657P6169b20013B54482c25392f0613j06920l2659J5212f2856m01565
15731d64421b2925J0343q1714k48520a52510B67013b56069d3877l08099C6901
15720F0822e3292j27663G527i381H0911a41709e1638D4867j1438a81986M4598
15709a37388j861k8762C00257b22709J10447M3579C73808b97968a0414k45302
15699b55716e0224A81706D4760R2292E0342f7878a0366j74861a10A3694N4323
15688F8017J86924a18328A14065l8295B0020J02655a48904k04231D51333B04993
15677i8588E5379J1976j1928A4669J44632j3187b0195C9711A3590L5296K60626
$$ y = [128716, 426352, 376221, -68033, -183396, -80026, 306653, 194340, -280802, 1899, -208425, -110819, 63657, 139826, -220013, 254482, -325392, -60613, -167533, -200192, -184980, -62856, -464421, -22925, -12582, -94296, -342816, -152510, 267013, -256069, -43877, -351976, 36901, 60822, -53292, -180955, 7527, -9381, 80911, -141709, -51638, 44867, 33429, -181986, -137388, -139249, -168011, 300257, -222709, -112262, -68683, 373808, -297968, -10414, -255716, -50224, 181706, 44760, 137052, 50342, -67878, -10366, -185227, -110, 13694, 68017, 254941, -118328, 114065, 75770, 20020, 122675, -148904, -353135, 451333, 204993, -98588, 55379, 67355, 55427, 14669, 159301, 146114, -20195, 39711, 13590, 48886, 309512]
15666C09512G470h0713k65527g4652A03502A4941b38207a13791l04634a20964
15655a68971A9479J69336a28489A52822C6159J2215a11705B94016b4403j91952
15645b16355O6082b1005p9757A24815g39H999K8044J43300a0821G4930J2255b60697
15632e3687m4539B85242a44302E188b29425F9303P8426a3778k68262h7123c053
15620d66378a80308c7784k09612j24289K7614Q7424A29857j1929h8896j05148
15610a94044A48379i7807H6761a44821E6103R2327E2696c8967H8375L8406a58805
15598i897A82110B5011a6472A38698a88650c0248A08954m8515b64712P9965I9628
15586E3421a44621j56806L737a39373C74884i5513J0823D7517b04533R5651A92353
$$ y = [309512, 7470, -80713, -346240, -74652, 103502, 14941, -238207, -113791, -418425, -120964, -168971, 19479, 188815, -128489, 152822, 36159, 48374, -111705, 294016, -24403, -216355, -150273, -21005, -100762, 124815, -739, 8999, 37043, 180343, -10821, 74930, 87185, -260697, -53687, -98226, 285242, -144302, 5188, -229425, 69303, 147729, -13778, -282040, -87123, -3053, -466378, -180308, -37784, -247396, -371685, -344071, -256647, 129857, 117928, -88896, -194044, 148379, -97807, 86761, -144821, 56103, 148430, 52696, -38967, 88375, 126781, -158805, -9897, 182110, 25011, -16472, 138698, -188650, -30248, 108954, 60439, -264712, -184747, 99628, 53421, -144621, -301427, -297690, -139373, 374884, -95513, -84690, 47517, -204533, -108882, 192353]
15574b11450A9920p342b03918B5068a49143G7055b9225k6646l3483I6049i6150
15562e2753j9731j15546e8786j8477B9757N9385J42440j15741m3034b53156j26863
15551c80019J10220j21114h0949c6352j89454g573B09732c6977l7869j36638G1527
15539A01117l8741a21474A93095h02A21757h4152E0275j537R8387F3669K76377
15528C40046A2608d2317A00549d3035A26299i9011F9956K45390k769J82513A55598
15516D4738c9376C4707q65J90379A7605a11075D7571a25848C1914J1051b31882
15504a23200Q153c6029A3351l100a24675d3654A49922M030G6399L06907A29927
15492I9678D3105a91929Q6726b0407G9107c2576k73492e005j77004E2113k0731
$$ y = [-211450, 19920, 12578, -203918, 25068, -149143, 77055, -29225, -55871, -89354, 96049, -96150, -52753, -72484, -188030, -58786, -77263, 29757, 89142, 231582, 115841, 72807, -253156, -380019, -269799, -390913, -80949, -36352, -225806, -7573, 209732, -36977, -74846, -211484, 71527, 101117, 62376, -121474, 193095, -802, 121757, -84152, 50275, 48738, 147125, 63669, 340046, 12608, -42317, 100549, -43035, 126299, -99011, 69956, 315346, 312577, 495090, 155598, 44738, -39376, 34707, 33842, 224221, 17605, -111075, 47571, -125848, 31914, 42965, -231882, -123200, -115047, -36029, 13351, 10251, -124675, -43654, 149922, 153952, 76399, 383306, 129927, 99678, 43105, -191929, -105203, -20407, 79107, -32576, -306068, -5005, -182009, 52113, 31382]
15481C1382b55051c924D9469K86828c73925e9542D4720e1284A78502J41198J26078
15470D45778A86102J33442a89182N5211C6076b52878E170a47498A33681e1569
15459A967J03528i0702I1199a18881B86251A39074a51526N899B32840d02025i9567
15447g412A62849J67998i5645B32876J07473J67552R8420J7737A70362q3463f6326
15435b05372F6046j159h048m7103E4873L62731d01919i9241A39502b17510f7965
15423A4637a98576a3102j08659c5930C82319b70858B33725d2442k7250j35975
15413b05667J419O6153d0777j02099A25345a48724p1833e3477a7474F3457b00439
15401I3140P33R2705q4561b64679f5692m6160H3913d7960j32391d5278A4825a11019
$$ y = [31382, -255051, -3924, 49469, 336297, -373925, -59542, 44720, -51284, 178502, 319700, 445778, 186102, 319544, -189182, -133971, 36076, -252878, 5170, -147498, 133681, -51569, 1967, 105495, -90702, 91199, -118881, 286251, 139074, -151526, -145627, 232840, -402025, -99567, -7412, 162849, 330847, -95645, 232876, 340349, 507901, 606321, 624058, 170362, 86899, -66326, -205372, 66046, 64887, -8048, -55151, 54873, 417604, -401919, -99241, 139502, -217510, -67965, 14637, -198576, -13102, -121761, -35930, 382319, -270858, 233725, -42442, -69692, -205667, -204248, -138095, -40777, -142876, 125345, -148724, -220557, -53477, -17474, 63457, -200439, 93140, 93873, 186578, 102017, -264679, -65692, -111852, 83913, -47960, -180351, -45278, 14825, -111019]
15388B5535J18502J15396L9034G5231L4226b97305e1103A86087l2195k1112E9598
15376F0871Q1322J82618f4157G8486K12743a07438O85B49592e1647H9315b64960
15364a41355B43495e9811H765K74409D1836b48283B34526a51604B03006D045N1750
15353E5795b2125E7804J02465N4999a27400A84890J46080g5077Q115f04B10561
15341B18821k9805i4224A96121H3469K83762b88491h4021C31286L894j66496c52691
15329B38535A06320D9291O7126B3821L4512a04118A09895l8776Q9984F0867O4720
15318A25587c3844H0172L6601j1070L91188a24663A30620a94256B32380a51448
15307A39801a24323D2445c0349k23294A68216n6594l4460j3014o750J70721A01332
$$ y = [25535, 144037, 259433, 298467, 75231, 109457, -297305, -51103, 186087, 153892, 132780, 59598, 60871, 142193, 324811, -64157, 78486, 291229, -107438, -106753, 249592, -51647, 89315, -264960, -141355, 243495, -59811, 8765, 283174, 41836, -248283, 234526, -151604, 203006, 4045, 55795, -22125, 57804, 160269, 215268, -127400, 184890, 330970, -75077, -66962, -604, 210561, 218821, 189016, -94224, 196121, 83469, 367231, -288491, -84021, 331286, 335180, 168684, -352691, 238535, 106320, 49291, 116417, 23821, 58333, -104118, 109895, 71119, 161103, 60867, 125587, -33844, 80172, 116773, 105703, 496891, -124663, 130620, -194256, 232380, -151448, 139801, -124323, 42445, -30349, -253643, 168216, 111622, 77162, 64148, 57398, 228119, 101332]
15295B55814j07856m7197a34955A0317a91840R3449D64477F0514b48142A66555
15284a72945A79787a70059F0107a89961P8910l2404C35310A31223f8961r3987
15274a62948a0944n6466J0728B67390I4420f9157F870J04684a0445B35581A6287
15262A73614b95798A16958a7700A62170J38900k0967J86228A28702g8539G4771
15251i4367B95056J31701c6983B96728I8469a18929A22992c11604i2250A76432
15240a34533B51276N430E264J73217C7093L2775J04873b61479P7759B50043F0002
15228C75839c4031B9921J2324P9175J41017H2060b34476B44546b36953M4424D2368
15216A3063b1370A67824a01226F2556K08524j33456c3201C81359a25030A11299
$$ y = [255814, 147958, 100761, -134955, 10317, -191840, -98391, 464477, 60514, -248142, 166555, -172945, 179787, -170059, 60107, -189961, -111051, -143455, 335310, 131223, -68961, -162948, -10944, -67410, -56682, 267390, 94420, -69157, 6870, 111554, -10445, 235581, 16287, 173614, -295798, 116958, -17700, 162170, 301070, 280103, 466331, 128702, -78539, 74771, -94367, 295056, 426757, -36983, 296728, 98469, -118929, 122992, -311604, -92250, 176432, -134533, 251276, 256706, 5264, 178481, 37093, 69868, 174741, -261479, -183720, 250043, 60002, 375839, -34031, 29921, 42245, 121420, 262437, 82060, -234476, 244546, -236953, -192529, 42368, 13063, -21370, 167824, -101226, 62556, 271080, 137624, -33201, 381359, -125030, 111299]
15205a37105A92056D6151a88309H8059J05599i2604A15227L9609J79218A0821
15194B91861O5748A42744J23263a38220m8399c2539B71550d750E7014J76639H8595
15182A92142a63156A8676O904N5298Q454f0085J4708C6594a96170A01014h2347
15170b84394c5672k5696G2913L8206C3160b96081F3320a51372B67343a28545G3730
15158E4268J87200I7910J19438D8802n998a80105D529Q5145a08712B93757b2907
15146a76413A11809d9810I4658P8494l5077a87908L3464M2423c358j41599A58873
15134B31790N4955O1208b40885G6670i3724n5463K309A30360i3842A96822E2416
15122B87910j03143d85253a74B27083p9313J77359A53362g1506A41511K99281
$$ y = [-137105, 192056, 46151, -188309, 88059, 193658, -92604, 115227, 154836, 334054, 10821, 291861, 357609, 142744, 266007, -138220, -186619, -32539, 271550, -4750, 57014, 233653, 88595, 192142, -163156, 18676, 25580, 80878, 89332, -60085, -45377, 36594, -196170, 101014, -82347, -284394, -35672, -61368, 72913, 111119, 33160, -296081, 63320, -151372, 267343, -128545, 73730, 54268, 241468, 97910, 217348, 48802, 42804, -180105, 4529, 89674, -108712, 293757, -22907, -176413, 111809, -49810, 94658, 173152, 138075, -187908, -154444, -112021, -3358, -144957, 158873, 231790, 286745, 347953, -240885, 76670, -93724, -149187, -146878, 130360, -93842, 196822, 52416, 287910, 184767, -485253, -174, 227083, 147770, 325129, 153362, -71506, 141511, 440792]
15112D40792G5789b75839e4867A51880c0830j15889b7000p7726j25296A53191
15101d8015h975A0463e2917a6910n7395A66723m6286k877l3696J20450n7870a14728
15088B8662L07257j39471P9402A30788i4342B5678K54376A31973D9175A5038K89177
15077C04215r4689k9646p4471b35264B78879F7069K61323j19456k2739q2139a26
15065f7257D13497a51452C91600p3676c93916B46069A15448D2877M57015a34027
15054a19056A40919J44695J09798A44586J99486A46535L443j9186J62136J06873
15044C99801j88402J26582F0613R5927p6627L83349b97814C62562j20996J02951
15034C44517b19517b674G0778L94379Q4052e0562C0456M22999j93221K79247K3550
$$ y = [440792, 75789, -275839, -54867, 151880, -30830, -146719, -27000, -104726, -230022, 153191, -48015, -8975, 10463, -52917, -16910, -74305, 166723, 120437, 117560, 83864, 204314, 146444, -114728, 28662, 335919, 196448, 275850, 130788, -94342, 25678, 280054, 131973, 49175, 15038, 304215, 209526, 179880, 105409, -235264, 278879, 67069, 328392, 208936, 186197, 104058, -126, -67257, 413497, -151452, 391600, 317924, -393916, 246069, 115448, 42877, 499892, -134027, -119056, 140919, 285614, 395412, 144586, 344072, 146535, 149978, 130792, 292928, 399801, 211399, 337981, 60613, 156540, 79913, 463262, -297814, 362562, 241566, 344517, -219517, -2674, 70778, 465157, 549209, -50562, 30456, 453455, 260234, 539481, 563031]
15023E63031k8209A67458L3822p1811M2463J35807j48168J48035J00154p0817
15013C36943j62451B3511J76849J4883P5636A03579R3426r0068L76298j36097
15003C47138K86144j24275B39992q5422K05492j36363K281n0110J03752G2509
14992D79091k01803J44713P4787B04173B1805K31273J60332k01632J74558J8025
14982D04361p1781K81269A39440L64309q8649j54890K97560p8023q7524j76228
14972B15995m0598K95812j40249K29698k4812k00347J43418k20705N8062R1420
14962D07694p6968L6880J05767j75382p5445F8841K75106I6430J22996L68638
14952E88064k64646O6163G3715L29017l3697j9397n8885P8696N8675J68239q0733
$$ y = [563031, 534822, 167458, 201280, 129469, 171932, 307739, 159571, 307606, 407760, 336943, 174492, 23511, 200360, 215243, 290879, 103579, 197005, 106937, 483235, 347138, 633282, 509007, 239992, 154570, 360062, 223699, 225980, 175870, 279622, 72509, 479091, 277288, 422001, 496788, 204173, 21805, 253078, 413410, 211778, 386336, 404361, 332580, 613849, 139440, 503749, 415100, 260210, 557770, 479747, 392223, 215995, 175397, 471209, 330960, 560658, 535846, 335499, 478917, 258212, 316274, 407694, 330726, 367606, 473373, 297991, 222546, 68841, 343947, 96430, 219426, 588064, 323418, 389581, 73715, 402732, 369035, 349638, 290753, 369449, 428124, 596363, 515630]
14941E15630O4874L7829A00745J87045J55063j75082L48475j02492A60079J64555
14931C24634J20197P2757K66612p8145L5232K32986k79778L39500k55338J43370
14921I22027K20952J87109k83127M9722k6737L84428n57096L29464E98014L63597
14911I61611k80870P8187j71162P2100B96126O8460p147k5259J18276p4626j06556
14900B69274k5275H0252J18660J53092J67337k18808K11466k26896M7667p5367
14890B57403k1541r740R9743O21258C31589j51020K78223K12803j94780k1434
14880D55381j06172K41017j24579N2583k6617K87530k89639k23131J62238J68060
14870E96671A59189L72962Q1102J09199O0963k21885Q5310j52841A15334L98408
$$ y = [515630, 580504, 618333, 100745, 287790, 442853, 267771, 616246, 513754, 160079, 324634, 444831, 517588, 784200, 706055, 741287, 974273, 694495, 1033995, 778657, 922027, 1142979, 1330088, 1046961, 1096683, 1069946, 1454374, 897278, 1226742, 598014, 961611, 680741, 758928, 587766, 659866, 296126, 364586, 357439, 332180, 450456, 375830, 269274, 243999, 80252, 198912, 352004, 519341, 300533, 511999, 285103, 332770, 257403, 235862, 226122, 325865, 947123, 331589, 180569, 458792, 671595, 476815, 455381, 349209, 590226, 465647, 518230, 491613, 779143, 489504, 266373, 428611, 596671, 159189, 532151, 613253, 722452, 783415, 561530, 646840, 493999, 115334, 513742]
14860E13742j47388A62323J62168M22054k17313m9817o3876j1914Q3121j4361
14850D72385N1192B09034R7114E5737N17605k41885J76695J19201J2549K3415
14840F63317P8036M55168E95937M11219j04202L47379E90241r7607J45097k56811
14830C80920K3821N7831A49233M61237K31802m08242J25017j37963L233J28455
14820E52772J27624B78430K14561J27282A01699D8945L31420o4602A54259M32655
14810E86914r4134j19005J02277K62748k46920M1451j60780J45643o1044L13395
14800G70545J54477j96266M6264j50996m3986k62196J50589J59666Q192J18842
14790G55131j23215k62409K03390p4717J62846J78890k52225B43620J80574l1114
$$ y = [513742, 366354, 162323, 324491, 746545, 529232, 479415, 415539, 403625, 486746, 472385, 523577, 209034, 306148, 55737, 573342, 331457, 508152, 627353, 639902, 663317, 741353, 1196521, 595937, 1007156, 902954, 1250333, 590241, 492634, 637731, 380920, 404741, 462572, 149233, 610470, 842272, 434030, 559047, 421084, 424317, 552772, 680396, 278430, 492991, 620273, 101699, 48945, 380365, 315763, 154259, 586914, 492780, 373775, 476052, 738800, 491880, 533331, 372551, 518194, 457150, 770545, 925022, 728756, 775020, 624024, 580038, 317842, 468431, 628097, 636289, 755131, 631916, 369507, 572897, 498180, 661026, 839916, 587691, 243620, 424194, 393080]
14780C93080J33523q372j34715J11013o9391M23752k88963M2823r1132L65334
14770H76952l22505L5022K02549B42448O18941D08973K16604j13012j6690J4400
14760E10275J19178k05693N788B14257K99100K81618k79584N9490o5825n5921
14750D53135M06095j19566K6707m6302j52341l8857j83289K36121Q2278J7818
14740F81799B25818O40296j41151k5739L02685o6166m9734k01287K88857D59937
14729E29820K13097o6572M8375J42988j29303O7676J24691J2145O3958J72112
14719A178987l69024J4256M08742m33892J01359J16279k57619n1274L4602N5386
14709G97802C74409N70807n3655j04182Q9724j98484J88126o0341J50550j05268
$$ y = [393080, 526603, 518231, 383516, 494529, 425138, 848890, 559927, 602750, 511618, 876952, 554447, 589469, 792018, 242448, 861389, 408973, 625577, 512565, 495875, 510275, 629453, 423760, 429548, 214257, 513357, 794975, 515391, 574881, 509056, 453135, 859230, 739664, 766371, 720069, 567728, 528871, 345582, 581703, 663981, 681799, 225818, 866114, 724963, 699224, 1001909, 935743, 886009, 684722, 973579, 459937, 529820, 742917, 676345, 724720, 867708, 738405, 806081, 930772, 942917, 1006875, 1178987, 809963, 824219, 1232961, 799069, 900428, 1016707, 759088, 707814, 742416, 797802, 374409, 945216, 891561, 787379, 877103, 678619, 866745, 806404, 956954, 851686]
14699H51686L06003K06345j2020P1269j34754n3618r9352r0171O9323n240l49623
14688G59848q9786p3989j21358M48342o076o0871K13424j31874J26894j67267
14678H97287k62917r9635K57691k28330J69807L00771r3385j07658K70728k75880
14668H28479n5101K23116K50336l53590j40177L31853m29801L26660m6533J15388
14658A050630Q6510m56342N66185o1972J33873P8173n39342P8798L66168L3985
14648A336666j66931p4871l0062K26042o29398P01196r6854q1223J54707n15688
14638H23584M2435K92747o6839L81947k65585J73879o48578L50704J79642j73503
14628A090433N2070K6798K68804j36449j40668j23877J95418j71351J61242l2388
$$ y = [851686, 1157689, 1364034, 1352014, 1423283, 1288529, 1234911, 1135559, 1045388, 1114711, 1109471, 759848, 670062, 596073, 474715, 923057, 916981, 856110, 1069534, 937660, 1064554, 897287, 634370, 534735, 792426, 564096, 733903, 1034674, 941289, 833631, 1104359, 828479, 773378, 996494, 1246830, 893240, 753063, 1084916, 655115, 981775, 935242, 1050630, 1137140, 680798, 1246983, 1185011, 1318884, 1397057, 857715, 936513, 1302681, 1336666, 1169735, 1094864, 1064802, 1290844, 661446, 1362642, 1265788, 1184565, 1339272, 823584, 866019, 1158766, 1091927, 1473874, 1208289, 1382168, 733590, 1084294, 1263936, 1090433, 1142503, 1169301, 1438105, 1301656, 1160988, 1037111, 1232529, 1061178, 1222420, 1190032]
14618A190032N8459k0982K1054j69546L17448j32681k4716K58921j53772K27705
14608A571922j38985r6328r3332L04007j78520j13379K22302J24416l47681K89145
14598A543567j69365O9496k06917L21728P7231l60126J76249l7763j35593N53214
14588A831721o6904k71258L51853J09248l71554k73857M92116J35864k85983J11936
14578A763182L37470l40231l3838j70531K87087J97623n994J83041K63318k16178
14568B264949k33173Q8739k63821N41876Q7970o252J46339R9923m5568j64943
14558B516039O3119J88051J55484M42196J41821L65530N82767M15849J325580
14549F196436J688284L989019P717149J1552183M98421j2961490r089645m104533
$$ y = [1190032, 1248491, 1227509, 1248563, 1079017, 1396465, 1263784, 1239068, 1497989, 1344217, 1571922, 1432937, 1336609, 1243277, 1547284, 1368764, 1255385, 1477687, 1602103, 1254422, 1543567, 1374202, 1443698, 1236781, 1558509, 1635740, 1275614, 1451863, 1414100, 1278507, 1831721, 1764817, 1493559, 1845412, 1954660, 1583106, 1309249, 1801365, 1937229, 1651246, 1763182, 2100652, 1760421, 1726583, 1556052, 1843139, 2040762, 2034768, 2217809, 2481127, 2264949, 2031776, 2120515, 1856694, 2398570, 2486540, 2480288, 2626627, 2726550, 2680982, 2516039, 2579158, 2767209, 2922693, 3364889, 3506710, 3872240, 4455007, 4870856, 6196436, 7884720, 11873739, 19590888, 31143071, 31641492, 18680002, 9590357, 5485824]
14541E485824j804580n05741o86784j39992k57899m4509J0519q6199L94307j09329
14531B255617l42180J27923L21747l58201J65605Q2927p5350J1507L7856Q3668
14521B311119K32548l73986M8850J17436k61797K35481j0311M70287j26320p7527
14511B565780M17067o35277N77182m89403j43660M15441L55201k51314p1168l1980
14501B707869L23699j25919L8724N4693m5961k0148J63735M7122K6475M2395J1562
14490C224246K8169p958j41945K19079L6940L6377j45482L97350j89920J54514
14480C611370j34687M94300j28865m0766K9072K31927j71457l8137J23125Q294
14470C984176R9854N0958R6749N0598J06468m08660M05666J3812k56941K3330
$$ y = [5485824, 3681244, 3175503, 2488719, 2348727, 2090828, 2046319, 2056838, 1970639, 2364946, 2255617, 1913437, 2041360, 2363107, 2004906, 2170511, 2253438, 2178088, 2189595, 2227451, 2311119, 2543667, 2169681, 2218531, 2335967, 2074170, 2309651, 2299340, 2769627, 2643307, 2565780, 2982847, 2347570, 2924752, 2435349, 2291689, 2707130, 3062331, 2811017, 2739849, 2707869, 3031568, 2905649, 2944373, 2999066, 2953105, 2932957, 3096692, 3143814, 3170289, 3212684, 3224246, 3252415, 3244457, 3102512, 3321591, 3358531, 3394908, 3249426, 3646776, 3456856, 3611370, 3476683, 3970983, 3842118, 3801352, 3830424, 4062351, 3890894, 3852757, 3975882, 3984176, 4084030, 4134988, 4231737, 4282335, 4388803, 3980143, 4385809, 4399621, 4142680, 4166010]
14460D166010N13009q814Q311K68135l18248K32366j33635k32345N35758j2063
14450E018484k79582L72410J1968r2429l2028J15718L17231m28144O93332k33202
14440E463758J49307K86593p3659J03113m569k8735K69342J12401K22828M7171
14430F547550k21872J63593N52738k28989J02293p6572L94449J50189k30142J84242
14420G337479M65695k95672O95694j75199J87253p5242J76599l74405M85712k23023
14410H204891K82986K55919K53165J69898L2750m2957K71629L04346m367L94713
14400A0122973q8486j39771L95356O1933L26016j01708L52318J22086J74884J26169
14390A1351770Q49649m17069L82166O8143N44516K43216J30089J36620L70369
$$ y = [4166010, 4679019, 4670205, 4678516, 4946651, 4628403, 4860769, 4727134, 4494789, 5030547, 5018484, 4738902, 5111312, 5123280, 5030851, 4998823, 5114541, 5431772, 5003628, 5696960, 5463758, 5613065, 5899658, 5825999, 5929112, 5924543, 5895808, 6165150, 6277551, 6500379, 6547550, 6325678, 6489271, 7042009, 6813020, 6915313, 6838741, 7233190, 7383379, 7153237, 7337479, 7803174, 7507502, 8203196, 8027997, 8215250, 8140008, 8316607, 7942202, 8427914, 8204891, 8487877, 8743796, 8996961, 9166859, 9199609, 9156652, 9428281, 9732627, 9728260, 10122973, 10034487, 9894716, 10290072, 10352005, 10678021, 10576313, 10928631, 11050717, 11225601, 11351770, 12201419, 11784350, 12166516, 12234659, 12779175, 13022391, 13152480, 13289100, 13659469]
14381A3659469K63942K40679J33499J71921L17288N52340q1665K07514N67811
14372A6032798P7791M11171L52893L22057K57740N33781K06293N59262N75640
14363A9329426r7344O01571M65780P01186J89028M57251P24813L08319M42394
14354B3122424O62136Q06352N62896L07881K11444J066723Q60609N85486M90426
14345B8676377Q32111Q96535O11441J108058Q97491J132487O20022O05296J303148
14336C6682966J095513J233214J339453J036995J182485J374808J040626J588532
14328D6574592J575841J883802J654848J684127K070170J707536J539842K262754
14320F0953512K380929J927512K294568K508558K956108K442546L129079K978724
$$ y = [13659469, 13923411, 14164090, 14297589, 14469510, 14786798, 15339138, 15257473, 15464987, 16032798, 16110589, 16521760, 16874653, 17196710, 17454450, 17988231, 18194524, 18753786, 19329426, 19232082, 19833653, 20299433, 21000619, 21189647, 21646898, 22371711, 22680030, 23122424, 23784560, 24590912, 25153808, 25461689, 25673133, 26739856, 27600465, 28185951, 28676377, 29508488, 30405023, 31016464, 32124522, 33022013, 34154500, 34774522, 35379818, 36682966, 37778479, 39011693, 40351146, 41388141, 42570626, 43945434, 44986060, 46574592, 48150433, 50034235, 51689083, 53373210, 55443380, 57150916, 58690758, 60953512, 63334441, 65261953, 67556521, 70065079, 73021187, 75463733, 78592812, 81571536]
14312H1571536L150407L265073L784910L572899M358087L955783M680361M629881
14304A12968937N014991N377278N974866N841802O229868O795715O839326P751060
14296A62793843P711523Q308195Q758156R219988R564613J0680250J0183461J1523535
14288B38743564J1556251J2011215J2880089J2971014J3522659J3569629J4249109
14281C29503530J3885458J4081617J3791806J3327734J2708008J1797239J0796955
14274D19892347R453914P362275M915147J716740k87335q67533j802095l814624
14266D36568836n463916p083838r601606j1281166j2855325j3847220j4320359
14259C62115406j4795079j4833440j4795331j4999137j4304800j3690446j3709008
$$ y = [81571536, 84721943, 87987016, 91771926, 95344825, 99702912, 103658695, 108339056, 112968937, 117983928, 123361206, 129336072, 135177874, 141407742, 148203457, 155042783, 162793843, 170505366, 178813561, 187571717, 196791705, 206356318, 217036568, 227220029, 238743564, 250299815, 262311030, 275191119, 288162133, 301684792, 315254421, 329503530, 343388988, 357470605, 371262411, 384590145, 397298153, 409095392, 419892347, 429346261, 436708536, 441623683, 443340423, 443053088, 442185555, 440383460, 436568836, 431104920, 424021082, 414419476, 403138310, 390282985, 376435765, 362115406, 347320327, 332486887, 317691556, 302692419, 288387619, 274697173, 260988165]
14252B60988165j2757581j2043844j1902875j1110951j0297748j0190795r391576
14245A83292795q548070q373008p896834p462085p074959o783939o007335n573467
14237A25573098n359316n347206m913999m473197m596277l946340l501685l784191
14229H9650887l878843l148578l299120k720315k937151k908484k454699k657148
14221F5646549j824585k375749k166865j761015j875011j727143j946999j818911
14213E0150271j011483j799609j314702j377504j667267r44513p12601j114073
14205D0208519j485519p97983j338148l28169j421860m10914j267484r86923p15040
14196C1456479j360463l48906n35605r33446o08309n39152p57607m94657o75665
$$ y = [260988165, 248230584, 236186740, 224283865, 213172914, 202875166, 192684371, 183292795, 174744725, 166371717, 158474883, 151012798, 143937839, 137153900, 131146565, 125573098, 120213782, 114866576, 109952577, 105479380, 100883103, 96936763, 93435078, 89650887, 85772044, 82623466, 79324346, 76604031, 73666880, 70758396, 68303697, 65646549, 63821964, 61446215, 59279350, 57518335, 55643324, 53916181, 51969182, 50150271, 49138788, 47339179, 46024477, 44646973, 42979706, 42035193, 41322592, 40208519, 38723000, 37925017, 36586869, 36258700, 34836840, 34425926, 33158442, 32171519, 31456479, 30096016, 29747110, 29211505, 28278059, 27669750, 27130598, 26372991, 25878334, 25202669]
14187B5202669q51546k74326p62258m38266m3892r02346m94226l88917k89521
14178B0757371n74385o90151k24380m17394m27784R7054q35039m78123m80225
14169A6726944j01018k36866r6716o80292k72786j29301l68292l97783j04048
14160A4339842j23330k09788m28038m6834m37528o88883N85665q80168J29615
14151A2240553m9481o28098j27070j39237L02363k48495P3498r52005o6165k71644
14141A0134219M9379k15094J90732k95538l29401j55839J40313j19553k18322
14132I180896m14492r8724M67086o14078J61595j80916k65367l5216P082k68648
14122G939218P7145o74849J49510j54978J54665j44572q5886k49843k06592L79091
$$ y = [25202669, 24351123, 24076797, 23314539, 22876273, 22832381, 21930035, 21435809, 21046892, 20757371, 20182986, 19492835, 19268455, 18851061, 18423277, 18520331, 17685292, 17207169, 16726944, 16625926, 16389060, 16292344, 15612052, 15339266, 15209965, 14841673, 14443890, 14339842, 14216512, 14006724, 13578686, 13531852, 13094324, 12405441, 12991106, 12110938, 12240553, 12191072, 11562974, 11435904, 11296667, 11599030, 11350535, 11424033, 10472028, 10405863, 10134219, 10183598, 9968504, 10159236, 9863698, 9534297, 9378458, 9518771, 9399218, 9180896, 8766404, 8667680, 9134766, 8520688, 8682283, 8501367, 8236000, 8200784, 8207866, 7939218, 8016363, 7341514, 7491024, 7336046, 7490711, 7346139, 7260253, 7010410, 6803818, 7182909]
14112G182909k12374m92395J47527l14114K46800k00927j82658k5295k15267J18349
14102F052555n9411j75559L36661m05457j72774J72124k52117L3077j26441R4679
14092E497337n8791j14489k21457J21083j85729K16899l99567J09741K48235m30968
14082D782294q713o3608Q7871l14217N06836k05196k7974m39329J64062k33925
14072D248101J84775o5546k7478k20607L4250o1118L73948m10014R3111M150n33217
14061C620355L31898j48608J23234j81752M32829n90601J07724J02518q5058l67377
14051C345162L49695k87662J97930q8281k12908N281j09158L67042j27076j89884
14041C250141O3145J10072j83371o71818L46683L15562l84948K48518k00949L55545
$$ y = [7182909, 6970535, 6478140, 6625667, 6311553, 6558353, 6357426, 6174768, 6149473, 5934206, 6052555, 5993144, 5817585, 6154246, 5748789, 5576015, 5748139, 5496022, 5529099, 5402658, 5497337, 5438546, 5324057, 5102600, 5223683, 5037954, 5254853, 4855286, 4965027, 5213262, 4782294, 4773581, 4709973, 4797844, 4483627, 4990463, 4785267, 4757293, 4317964, 4482026, 4248101, 4432876, 4367330, 4339852, 4119245, 4153495, 4092377, 4466325, 4056311, 4149422, 4153572, 3620355, 3952253, 3803645, 3926879, 3745127, 4177956, 3587355, 3695079, 3797597, 3712539, 3345162, 3694857, 3407195, 3605125, 3516844, 3303936, 3309217, 3200059, 3567101, 3440025, 3250141, 3313286, 3423358, 3239987, 2568169, 2914852, 3230414, 2845466, 3093984, 2893035, 3248580]
14031C248580q0889k89960N1368j92353M4170O3025R6961l06097L93990l84685
14021B644110N1707n14130K70290L90078J02502o09966M21775l31235j74879N07047
14011B757299k37264k28615k7131L70172n97477L45808r8005q5147O6627K22856
14001B489123j88042m9531K28626l58647L53387K43364k89153j89288J70485j5267
13991B395057K24735Q95890R43233K771483O067743J1941536Q262523q190371
13983B5311829r914472n769672k557978j639339r04967m43750m68348j50510k44051
13974C218742j76937m92685R7808n0238l185l49456J83953k19229j28167K52644
13964B333250j90628j90119J57267K7918N4565k89942M21517l20675L6610j90978
$$ y = [3248580, 3167691, 2877731, 2929099, 2736746, 2780916, 2843941, 2940902, 2634805, 3028795, 2644110, 2695817, 2181687, 2451977, 2842055, 2944557, 2334591, 2756366, 2425131, 2250252, 2757299, 2520035, 2291420, 2264289, 2634461, 2036984, 2382792, 2284787, 2199640, 2266267, 2489123, 2301081, 2251550, 2480176, 2121529, 2474916, 2718280, 2429127, 2239839, 2410324, 2395057, 2619792, 3515682, 4458915, 7230398, 13298141, 25239677, 33502200, 25311829, 15397357, 9627685, 7069707, 5430368, 4525401, 4081651, 3613303, 3462793, 3218742, 3041805, 2549120, 2646928, 2596690, 2593505, 2244049, 2428002, 2208773, 2080606, 2333250, 2142622, 1952503, 2109770, 2137688, 2192253, 1902311, 2323828, 2003153, 2039763, 1848785]
13954A848785M13382j71305l50277L19155k35758k28282J99398J3801n6424L60080
13944B112555j52726M452l88532J42888L27666r3604k56557L6948O63K3382k55784
13933A501351K99504P3014j65117n8089o6091J46636o1966K03860o22253K19475
13923A470324j26805L27209o935j65879Q1382l23229j18172N27162m779m08770
13913A251508L19113J985l54039k44280L07543K54239K7324j3044j73807j05353
13903A271189k8782q7071L78488j40549m0115j61579M7671K57620k57117Q5820
13893A325575K10950m09711L21436L3506m22494k98004N12465q7232k41524M37554
13883A382521m49928J80625R8644p9168J42748n9985J0917K62202l95214m823
$$ y = [1848785, 2262167, 2090862, 1740585, 2059740, 1823982, 1595700, 1795098, 1808899, 1752475, 2112555, 1959829, 1964281, 1575749, 1718637, 2046303, 1952699, 1696142, 1733090, 1733753, 1757135, 1501351, 1800855, 1873869, 1708752, 1650663, 1584572, 1731208, 1669242, 1873102, 1250849, 1470324, 1343519, 1670728, 1663793, 1497914, 1579296, 1256067, 1137895, 1665057, 1660278, 1251508, 1570621, 1572606, 1218567, 974287, 1281830, 1536069, 1563393, 1550349, 1376542, 1271189, 1242407, 1155336, 1533824, 1393275, 1353160, 1191581, 1239252, 1496872, 1239755, 1325575, 1536525, 1126814, 1448250, 1481756, 1059262, 761258, 1273723, 1186491, 944967, 1382521, 932593, 1113218, 1211862, 1132694, 1275442, 1215457, 1226374, 1488576, 1093362, 1088539]
13873A088539l159j66419K44389p3403K87586m27420K6992J88522n03986N17820
13863A179461j80404L11833J90745m95782j31523O7760J48471l10409O0336K59499
13853A099987O3728j99023p3570R7213q287J26669p9123J75951k81863k3520J22871
13842A021033K2105j73271K16406l8873j32836k14038L7735J79450J22128M3329
13832A083168j92807m8433j99862K38170k4829j07735K83748N0334k75958Q9655
13822H95451l85583L77691p5952L49782k38181q4931O5958j01832K22137j62546
13812H61994J89306j49139J76738k17566j00714K60039m58121M62729R812L4562
13802A069640j47782q6174M9777j72427p7203j1149M46763m26296J42224q8094
$$ y = [1088539, 1085380, 918961, 1163350, 1089947, 1377533, 950113, 977105, 1165627, 661641, 1179461, 999057, 1310890, 1501635, 1005853, 874330, 942090, 1090561, 780152, 840488, 1099987, 1163715, 964692, 891122, 988335, 980048, 1106717, 1027594, 1203545, 921682, 898162, 1021033, 1043138, 869867, 1086273, 1047400, 914564, 700526, 738261, 917711, 1039839, 1083168, 890361, 841928, 642066, 880236, 855407, 747672, 1031420, 1081754, 805796, 895451, 509868, 887559, 811607, 1161389, 923208, 838277, 904235, 802403, 1024540, 861994, 1051300, 902161, 1078899, 861333, 760619, 1020658, 562537, 1025266, 1035078, 1069640, 921858, 835684, 885461, 713034, 635831, 624682, 1071445, 645149, 787373, 699279]
13792F99279l0387K11315p1140j72696j5943J48560j90177r5288N23488l04347
13782G02664K8070J44643j79522J04820l16191K08719J14376k73531K79674q6850
13772G26872O3282m6333J47123j47802p4113C30488K14151L27416P5511m17992
13762E29574m3973K06953q5715A89871L83729J06352J67209l28789N07022l97294
13752F28100J97766l40012J31783j5419J073J44875J57050m09266K00216q773
13742F87393K62058m19574M664J55476A83352L98830r5020K42892O2721B04741
13731D30348J30648q1874j15488M3885L04478l08168J31409B40866J42664J63709
13721E47239L4418k35789N17883k28247M477j73365K59403j13055J24290L5470
$$ y = [699279, 668892, 880207, 809067, 636371, 620428, 768988, 578811, 483523, 1007011, 702664, 730734, 875377, 695855, 800675, 484484, 693203, 807579, 534048, 813722, 726872, 790154, 743821, 890944, 743142, 669029, 330488, 544639, 872055, 947566, 529574, 485601, 692554, 606839, 189871, 573600, 679952, 847161, 518372, 1025394, 628100, 825866, 485854, 617637, 602218, 603291, 748166, 905216, 495950, 696166, 687393, 949451, 529877, 534541, 690017, 183352, 582182, 487162, 730054, 792775, 204741, 430348, 560996, 479122, 363634, 407519, 711997, 403829, 535238, 240866, 383530, 547239, 581657, 345868, 863751, 635504, 639981, 466616, 726019, 612964, 737254, 772724]
13711G72724C68670L89964B99243L89715N8180j15508k50516J75030R0256k65441
13701C80959A72014O52461C84045N4949L18303l60657L88658k85276L1322M4025
13691E75369j61235L84191B65213K56818J61063j41816K15590B70899j08843N50836
13681G12892J124A27228Q59444D85202m5226Q8331H4204L70349o0290j19206K92398
13670E67455j51216o2759R8860J22838j54213j2550A81014M66897B78025K77042
13660E55067K37924C30122M95136k42056k81128J26011J32771A52257L49194o3155
13650D38296K40055l4650B04071L77915j41980J40396q4737k16327M8779j11578
13640B16539L45370J16495J44187k00043N5478j36182N2872B30499K89214j60165
$$ y = [772724, 368670, 758634, 299243, 688958, 747138, 631630, 381114, 556144, 646400, 380959, 172014, 824475, 384045, 438994, 757297, 396640, 785298, 500022, 531344, 575369, 414134, 798325, 265213, 522031, 683094, 541278, 756868, 270899, 162056, 712892, 714016, 127228, 986672, 485202, 439976, 528307, 84204, 454553, 394263, 275057, 567455, 416239, 353480, 452340, 575178, 420965, 408415, 181014, 647911, 278025, 555067, 792991, 330122, 825258, 583202, 302074, 428085, 560856, 152257, 501451, 438296, 678351, 643701, 204071, 581986, 440006, 580402, 495665, 279338, 328117, 216539, 561909, 678404, 822591, 622548, 678026, 541844, 594716, 230499, 519713, 359548]
13630C59548j36788F9017L97627j22448J35150Q1074j09206L9051q0140K50893
13620F61018l09044M9143J51236k4414B47798J04490j1819j43207K48121j21034
13610C24349J97397J44951A33448M62531A64868L70478A76260G6069L98690l7467
13600D37292J63076e9313A27431R1742R6129k703K99885c5470o5620C12436L1089
13589C43525K00058r3424B06469J3890K08333j02478D3316M23244p2283j90658
13579B03619m0459J56062R8157J75733A27588K59397L097q2606C1517K88341r1611
13568B28247K69516A65994K60544j12643J1705j52214K07951K2135A08714L9898
13558A48612J14011L0985J86356k09606j23120K08686J06421K8141H2267J37102
$$ y = [359548, 222760, 69017, 466644, 344196, 479346, 560420, 451214, 490265, 410125, 661018, 351974, 401117, 552353, 527939, 247798, 352288, 340469, 197262, 445383, 324349, 521746, 666697, 133448, 595979, 164868, 535346, 176260, 76069, 474759, 437292, 600368, -59313, 127431, 219173, 315302, 312599, 612484, -35470, -101090, 312436, 343525, 543583, 450159, 206469, 220359, 428692, 326214, 43316, 466560, 394277, 203619, 163160, 319222, 417379, 593112, 127588, 386985, 390082, 307476, 31517, 319858, 228247, 497763, 165994, 426538, 313895, 325600, 173386, 381337, 403472, 108714, 148612, 262623, 293608, 479964, 270358, 147238, 355924, 462345, 490486, 82267, 219369]
13548B19369J18117d8136B68435J4699B1396J87356K99789r6729L41323l65871
13538C87264F5240Q9997F4313J90243r6978L13732M9487j20848j91719R506A06462
13526B28670J09684j27109J56538J31026k8119K33016H3710N97841d0250C56646
13515E39538j01486G4934L7814K56903j14121D9469K46205A46065a00065C96893
13504C99225j42323h6948F05254B56109J53839F0381A9757K19641j08254k906
13494A28238K47114j58455m7265A8247J22653K54930A18454R2231L70092B35326
13483a91377C14202j27794N2535J71569A70494K86706n0752r7050j14661K4164
13473B18901p1370e6106C23408o1117J93680A12549M49029B40589k8714K20674
$$ y = [219369, 337486, -48136, 268435, 283134, 21396, 208752, 508541, 411812, 753135, 387264, 65240, 155237, 64313, 254556, 157578, 471310, 520797, 399949, 208230, 217736, 106462, 228670, 338354, 211245, 367783, 498809, 470690, 703706, 83710, 681551, -40250, 356646, 539538, 438052, 74934, 112748, 369651, 255530, 49469, 295674, 146065, -100065, 396893, 399225, 256902, -86948, 605254, 256109, 409948, 60381, 19757, 239398, 131144, 128238, 375352, 216897, 169632, 18247, 140900, 395830, 118454, 210685, 580777, 235326, -191377, 314202, 186408, 238943, 410512, 170494, 457200, 406448, 309398, 194737, 218901, 147531, -56106, 323408, 262291, 455971, 112549, 561578, 240589, 211875, 432549]
13463D32549c1768R656E11427B2970P2506J99221A24742h0072A95580r5482K03285
13452C03383N9368b63607A30846M8150N0596m5513H1089l5122M39046k0748k16773
13441B47492k4848J53193r7163F7128F097J54327O1920G7397L5120K86657j51222
13430B47952C3675J16854J23319j03844J05346N7972J74125A98150o615m254J34232
13419C21513J36656j38703K70863a6831A72810k6713F9671K43057I9807J43843
13409B43650r1644j1515J1056n1510N9501m1354J25403k5376o0631A6952M6908
13398F3860J52395M3804K53796E8051M58490B26504r9449K20933M9610j9341I3014
13386A73227c0630D52488e3623B01031k7949J05647L7025Q3439A00140m6322J88436
$$ y = [432549, -31768, -22112, 511427, 22970, 95476, 294697, 124742, -80072, 195580, 100098, 303383, 362751, -263607, 130846, 178996, 229592, 184079, 81089, 45967, 485013, 464265, 247492, 222644, 375837, 278674, 67128, 6097, 160424, 222344, 77397, 112517, 399174, 247952, 33675, 150529, 273848, 170004, 275350, 333322, 507447, 198150, 191535, 187281, 321513, 458169, 319466, 590329, -16831, 172810, 146097, 69671, 312728, 99807, 243650, 152006, 140491, 151547, 100037, 159538, 118184, 243587, 218211, 157580, 16952, 63860, 216255, 260059, 513855, 58051, 516541, 226504, 127055, 347988, 397598, 378257, 93014, 173227, -30630, 452488, -53623, 201031, 173082, 278729, 315754, 399193, 100140, 53818, 242254]
13375B42254e7614I4835k0312J91413j24734M5476J9576J9880A8135e430H1066
13363C32952A12432C1046B014J34898K02409J09477B09125O491M6025a2467G3115
13351E3906j388J66917G4672M3843A9506J64587o1274K1744K55525o7949A11676
13339B44368m9637K80941j11327A82066K7919n0139K21784n2961j53503a12512
13328A73000n9067i2652F08700A78275M56008k02164R687A64995J59816J13593
13318D38404e9662E1727j6434h206J128B54569N8143o2801D9381K00969K76268
13307E26618j60509a2719j16200B09457J10747m3805j02669A3922K0281K80854
13297C15057a39502E3169K69199A55019D2451J04989Q0934b9075B05653a80604
$$ y = [242254, -57614, 94835, 74523, 265936, 141202, 186678, 206254, 226134, 18135, -5430, 81066, 332952, 112432, 31046, 2014, 136912, 339321, 448798, 209125, 215616, 261641, -12467, 73115, 53906, 52518, 219435, 74672, 118515, 19506, 184093, 122819, 144563, 400088, 332139, 111676, 244368, 194731, 475672, 364345, 182066, 209985, 159846, 381630, 328669, 175166, -112512, 173000, 113933, -92652, 608700, 178275, 634283, 432119, 441806, 164995, 324811, 438404, -59662, 51727, 35293, -8206, -7078, 254569, 312712, 249911, 49381, 250350, 526618, 366109, -12719, -128919, 209457, 320204, 276399, 173730, 13922, 34203, 315057, -139502, 53169, 322368, 155019, 42451, 147440, 228374, -29075, 205653, -180604]
13286A62859J34182A43911M5328a42863c560C4144J09310n0972J28866B8281K77529
13275C05810D2499b12645e195A38062k0682J54941F8407J44236b23422F7445K57281
13264C24726A34220Q0184a9717A00772f4204A65178a09853j52572C21592d726
13253C80783A48123c6855B73629G3002j8494L6634h2372C036P8174K31332c58917
13241B54400f1778B62071Q4377A04849O7831J23167j09919J73236A255K10397
13231B11652j04305R285e3943p2986C6675Q2210l8348a01969A90090n7219f5215
13219d2749B45543b2635e97H9308J79773b31991A09792J37022C2862a41806C73597
13207E5378c60j23874B41272J6958K2029J22301p5468A07855a43415A38713J86529
$$ y = [162859, 297041, 143911, 189239, -142863, -3560, 34144, 143454, 92482, 221348, 28281, 305810, 42499, -212645, -5195, 138062, 117380, 272321, 68407, 212643, -223422, 67445, 324726, 134220, 214404, -19717, 100772, -64204, 165178, -109853, -262425, 321592, -4726, 380783, 148123, -36855, 273629, 73002, 54508, 91142, -82372, 3036, 81210, 312542, -358917, 254400, -61778, 262071, 346448, 104849, 172680, 295847, 185928, 359164, 1255, 211652, 107347, 116632, -53943, -126929, 36675, 118885, 80537, -101969, 190090, 132871, -65215, -42749, 245543, -22635, -597, 89308, 269081, -231991, 109792, 246814, 32862, -141806, 373597, 55378, -360, -124234, 241272, 258230, 280259, 402560, 327092, 107855, -143415, 138713, 325242]
13196C25242I8912L9889A8317K56794N3822q1494m8066p5837N5649D9398L54175
13185D03573p1441i0494E10064b36525A1580P8558b48730D14175i0657A20593
13174e347j39373k99869I0824A555a9575C16470b3871o6072B13752K7444a30351
13162I8916m6326O9512b55986B15091j386j04003R7428m5778g978B37575p4244
13151A63331J92768D5466J09028E2714N8552j1469K7114J75073b30526B15769
13140A16368J9889J6528Q4912N079a53398C8297J09623J98459E7158a60598j32439
13129b93037C53700n5436A34522m9861J39798b44870A69033a37989f532B43408
13118B09023L53989d7254A09291c6549B7063K40947a01487A74612p8847a11884
$$ y = [325242, 98912, 138801, 18317, 275111, 328933, 247439, 199373, 123536, 179185, 49398, 403573, 332132, -90494, 510064, -236525, 11580, 90138, -248730, 414175, -90657, 120593, -5347, -144720, -444589, 90824, 1555, -19575, 316470, -23871, -89943, 213752, 241196, -130351, 98916, 52590, 122102, -255986, 215091, 213705, 109702, 207130, 161352, -7978, 237575, 163331, 356099, 45466, 154494, 52714, 111266, 99797, 126911, 301984, -230526, 215769, 116368, 136257, 152785, 237697, 242776, -153398, 38297, 147920, 346379, 57158, -160598, -293037, 353700, 298264, 134522, 84661, 224459, -244870, 169033, -137989, -6532, 243408, 209023, 563012, -47254, 109291, -36549, 27063, 268010, -101487, 174612, 95765, -111884]
13107A35413J19068j25012M3733k8473b15316g8873F7763K12245I9995k7864c8337
13095a126p1164B59261J37450A25922N691B9845K15079n8451a28728A64553n7977
13084A06576L3049a54094B65385p1626C9330L08068j61189J0982L627a58162C2895
13072F3892J51848K87763G3602J77188j16153E4588K30566a75200G5671a4082
13061A71307a13764A78637a00213A91565c7450A68019D496a30895j04831A26229
13050A14813a7539H7124J52186Q3608j51886p2684b76491J32107A20483R9709
13040B20192A3732b21244B92377j27612l9220J19435E7605B6349b3850k8055B27597
13028E1510K77404q7883H8745J42162c6951D2700J37507K33608E1349K89054h2106
$$ y = [135413, 254481, 129469, 173202, 144729, -215316, -78873, 67763, 280008, 99995, 72131, -38337, -1126, -72290, 259261, 396711, 125922, 131613, 29845, 244924, 186473, -128728, 164553, 106576, 139625, -154094, 265385, 193759, 39330, 347398, 186209, 197191, 200818, -158162, 32895, 63892, 215740, 503503, 73602, 250790, 134637, 54588, 285154, -175200, 75671, -14082, 171307, -113764, 178637, -100213, 191565, -37450, 168019, 4496, -130895, -235726, 126229, 114813, -17539, 87124, 239310, 322918, 171032, 98348, -276491, -144384, 120483, 220192, 13732, -221244, 292377, 164765, 125545, 244980, 57605, 26349, -23850, -51905, 227597, 51510, 328914, 241031, 88745, 230907, -36951, 42700, 180207, 413815, 51349, 340403, -82106]
13016E0959J97632r5798J46452B2330R8588i6051D46443d7468B77110n1643h2181
13004B43432I1077c04337p129A06452J01310K52599G5907h3651A74520d32837
12993B56725B609e0939K2660C9868J1360K55825A05854b05743e3066A10859B6557
12981a87591A05449a81019d4221J4618E0124K27790b3575n7448A79072L3165N1662
12970B63899A09788D7478d66931a09532C54750b21051C64474C6127g9461D6427
12959b7143B63448q0857Q012G5728K21453b08489p1673A63635h9152c1829C13010
12947C8914c36344C11344A08894a99878C82791c3178n8630A9565K50586C1590
12936D324J16925K16784a00994H2458J57262C2340c86931A0046m609L0951K53836
$$ y = [50959, 248591, 152793, 299245, 22330, 120918, -96051, 446443, -47468, 277110, 225467, -82181, 243432, 91077, -304337, -311466, 106452, 207762, 460361, 75907, -83651, 174520, -432837, 256725, 2609, -50939, -28279, 39868, 51228, 307053, 105854, -205743, -53066, 110859, 26557, -187591, 105449, -181019, -44221, -29603, 50124, 277914, -23575, -81023, 179072, 212237, 263899, 109788, 47478, -466931, -109532, 354750, -221051, 364474, 36127, -79461, 46427, -27143, 263448, 182591, 190603, 75728, 297181, -208489, -280162, 163635, -89152, -31829, 313010, 38914, -336344, 311344, 108894, -199878, 382791, -33178, -91808, 19565, 270151, 31590, 4324, 121249, 338033, -100994, 82458, 239720, 32340, -386931, 10046, 5437, 36388, 290224]
12925B90224k4895c6869A90181D5532J98035J62481a97371C11252a96256c0209
12914B11720H8599b63485j71628A03190J61684c87705E16785e3937G7621a85400
12903a83288B288K28619m3553a64788I594Q8008a05025B4798K21959D1422h4017
12891G4256c4874A10870n0222a03620L337A42794b18581A05342J11679o8952J18406
12880B66475a82862C88422j28161a09311D314J26101J04113i4528a2596H9017
12869C3357J38692J37219A05222a45170Q764C4446i8026A13500P2962i6139D075
12857a46970A26342a80693G0024J14746a04465A37044O9248b66506J14108c769
12846f1686b5647H8715Q533c60261A7002h894B7034K0786a7119E0848b76246a07740
$$ y = [290224, 265329, -36869, 190181, 45532, 243567, 406048, -197371, 311252, -196256, -30209, 211720, 88599, -263485, -435113, 103190, 264874, -387705, 516785, -53937, 77621, -185400, -183288, 2288, 230907, 187354, -164788, 9594, 97602, -105025, 24798, 246757, 41422, -84017, 74256, -34874, 110870, 60648, -103620, -100283, 142794, -218581, 105342, 217021, 148069, 266475, -182862, 388422, 260261, -109311, 4314, 130415, 234528, -94528, -12596, 89017, 33357, 172049, 309268, 105222, -145170, -136406, 34446, -98026, 113500, 186462, -96139, 4075, -146970, 126342, -180693, 70024, 184770, -104465, 137044, 206292, -266506, -152398, -3769, -61686, -25647, 88715, 97248, -360261, 17002, -8894, 27034, 47820, -17119, 50848, -276246, -107740]
12833F3572O7407a80268n0020F4748L9426C0495a62402d2612m6821D7166J42481
12822A89647q6023c0756j66709F2044d5337A64914K5664b1231p5784l24740K04149
12811b17606G975J23015D1338b30051E656b7348A48465l9483b54025j14228A92861
12799a2564A02555q015a60787B86126B5101L7415c6536B62553b51623b7797M182
12788b3615j5291G1121K04618p5364G4316J00151m8944K22m3658K59056a98343
12776c8095o5371N1203F2784j9829O9304d1240B0551a13834m5186M5970K8729
12765h4321A98473H8126C9397K8574J8510J13978C2643J23615J4889c8722r7482
12754a36204q0866D6253N2403i6917B07167j7423b70835A2288a70244A35723e9509
$$ y = [63572, 130979, -180268, -230288, 64748, 104174, 30495, -162402, -42612, -89433, 47166, 189647, 103624, -30756, -197465, 62044, -45337, 164914, 190578, -21231, -97015, -421755, -217606, 7975, 130990, 41338, -230051, 5656, -27348, 148465, 108982, -254025, -368253, 192861, -12564, 102555, 94540, -160787, 286126, 25101, 62516, -36536, 262553, -251623, -27797, -23615, -38906, 71121, 275739, 200375, 74316, 174467, 125523, 125745, 82087, 341143, -198343, -38095, -103466, -52263, 62784, 42955, 112259, -41240, 20551, -113834, -159020, -113050, -84321, 198473, 88126, 39397, 67971, 86481, 200459, 32643, 156258, 171147, -38722, -136204, -217070, 46253, 98656, -96917, 207167, 189744, -270835, 12288, -170244, 135723, -59509]
12742F71552f5433j1643G8780l3011b0992C02368b30555J0290C7678J42117J64599
12731C44394C0020f9249m5910A37210b255k10333A19890d26817H8719b12420Q8330
12720a24090B39595n0318H549J53668c5596I0015l2041k804J88480J08860C2272
12708A22058c1C25509j56088n2082m4191A954J66281p3416K0721B5869A2778L45013
12696C57791i4925E04139A88139J88339j71559c86803a84082O9247C18439c31987
12685E2077c07914B05313K22511A20979k3050a05141A8361J15484q227k328n6258
12674F7032B6280J69075a46342r1532B1507b0827B00140C2181J20617i4470a6056
12662C92295H5646a07717n2225A29531m7761C0937J52042a24934D71856A34381
$$ y = [671552, -65433, -77076, 78780, 45769, -20992, 302368, -230555, -220265, 37678, 179795, 344394, 30020, -69249, -115159, 137210, -2255, -212588, 119890, -426817, 88719, -212420, -124090, 239595, 189277, 8549, 162217, -35596, 90015, 57974, 55170, 243650, 352510, 32272, 122058, -31, 325509, 169421, 117339, 73148, 1954, 168235, 94819, 115540, 25869, 12778, 357791, -94925, 504139, 188139, 376478, 204919, -386803, -184082, -114835, 318439, -331987, 52077, -307914, 205313, 427824, 120979, 97929, -105141, 18361, 133845, 125618, 123290, 67032, 26280, 195355, -146342, -237874, 21507, -20827, 200140, 32181, 152798, -94470, -16056, 392295, 85646, -107717, -159942, 129531, 81770, 30937, 182979, -124934, 471856, 134381]
12651F206J90393n4571F5185P7837a65184A49099k1949E7083O6397c31187A95218
12639H3565j6969J14049D9456L81836a8314F3283m177J37217D4346Q1609k5827
12628A00128O6069c45366A37924a6256k49260a26813r3769b801I043J3671c7640
12616A2308K11702b19097A81938F7066J57244d7635G6758B0475Q1573K84319j45916
12605B40451k890b87416A60370i1815B13394G3132b42368D8483J357J84793e7037
12593A86572a88450g7904A58004J66485a55552D9691h5766j55488A18381b12243
12582b17111O4577g1137k53687J18677A04063a18375d7015A0271a38469L5481
12572a02988C10197C5412K274O4839k4455J02965N3908a4307B24596a24396Q764
$$ y = [6206, 196599, 142028, 65185, 143022, -165184, 149099, 127150, 57083, 123480, -331187, 195218, 83565, 66596, 180645, 49456, 431292, -18314, 63283, 59106, 196323, 44346, 125955, 100128, 166197, -345366, 137924, -16256, -265516, -126813, -220582, -2801, 9043, 22714, -37640, 12308, 224010, -219097, 181938, 67066, 224310, -47635, 76758, 20475, 102048, 386367, 240451, 237561, -287416, 160370, -91815, 213394, 73132, -242368, 48483, 49840, 234633, -57037, 186572, -188450, -77904, 158004, 324489, -155552, 49691, -85766, -241254, 118381, -212243, -217111, -152534, -71137, -324824, -206147, 104063, -118375, -47015, 10271, -138469, -102988, 310197, 35412, 37686, 102525, 78070, 181035, 234943, -14307, 224596, -124396, -115632]
12561a15632B03355a69617E207c67006e7446F6062b07495C3915a90889G7133b9570
12549A7413P3449g9848A8426d9500o8119D48583b08959L3961A6379J25587b21624
12537I76L4533a7879B03812A3734c16053A37990c35806a64311a966A08295l2090
12526G6205a27040e8720A06233l8318h1393B45850A08820a84411B96816b9251
12515A07291L7427c8771K221A7101J9731a10872j50358d0340A20295A0292c7687
12503B00973I1605h0997k47132a00969A54109b5473E4356B355K42756K0336d488
12491a19295H2003k0048a32751C5131R5496D9825a30580G871b59015f4348A59362
12479D9443a32287A27539d1653o994a1915r4017K9651p5433j29053i6950k13569
$$ y = [-115632, 203355, -169617, 5207, -367006, -57446, 66062, -207495, 33915, -190889, 77133, -29570, 17413, 90862, -79848, 18426, -49500, -117619, 448583, -208959, -174998, 16379, 141966, -221624, 976, 35509, -17879, 203812, 13734, -316053, 137990, -335806, -164311, -1966, 108295, 76205, -127040, -58720, 106233, 67915, -81393, 245850, 108820, -184411, 296816, -29251, 107291, 144718, -38771, -36550, 17101, 36832, -110872, -261230, -40340, 120295, 10292, -37687, 200973, 91605, -80997, -328129, -100969, 154109, -25473, 54356, 2355, 245111, 265447, -4488, -119295, 82003, 61955, -132751, 35131, 130627, 49825, -130580, 7871, -259015, -64348, 159362, 49443, -132287, 127539, -41653, -48647, -11915, -105932, -76281, -151714, -280767, -96950, -310519]
12468c10519E8054d55282E235a09594m8385f8904B06369a52316j06429C76885
12457D72376a23796D0371b80658g0301j78015a3203A95777H2862K1466b85765
12446E7504i8234B54225H1218a16889j71279d9606j75680b9488C2036C790K02220
12435B06010a63319C68949g970k05718K5250F7332K7331a68945B24342A082e3013
12423g1125n9477E5094L5051C2983f2036B35503c8298C77826D7325J4064a75152
12411H2464L6432B7387K15276A02937a16102A71601a7831j20383O5208F9633J08529
12400A78162a03816A95100b40462N3459D1320K17947a83657B75268m0604a16746
12389B76109b1072Q459j61991q1330A30231b27401a10046K8684N691j79877a26058
$$ y = [-310519, 58054, -455282, 5235, -109594, -157979, -68904, 206369, -152316, -258745, 376885, 472376, -123796, 40371, -280658, -70301, -248316, -13203, 195777, 82862, 104328, -285765, 57504, -98234, 254225, 81218, -116889, -288168, -49606, -225286, -29488, 32036, 3790, 206010, -163319, 368949, -7970, -213688, -188438, 67332, 94663, -168945, 224342, 1082, -53013, -71125, -130602, 55094, 90145, 32983, -62036, 235503, -38298, 377826, 47325, 61389, -175152, 82464, 118896, 27387, 242663, 102937, -116102, 171601, -17831, -138214, -73006, 69633, 178162, -103816, 195100, -240462, -187003, 41320, 259267, -183657, 275268, 234664, -116746, 276109, -21072, -12613, -174604, -255934, 130231, -227401, -110046, -81362, -75671, -255548, -126058]
12377G0927Q1253Q2427a02452l5281M992O3156A2095Q4159C0579b50166A08755
12365a058B29118a18496j36854b96r2345F7870L2017b94515N047J25446R856I2794
12352F3588O0418a75512k7440C8991J52332r3549k408A2920m894c8878e595j56070
12340a61665C89577A11092a28360F1470b16172q1105i0040k65127A50714a75918
12329I4043a09238J9609D36166A61857Q001a33124n4136J7308l0381c7410B34782
12317B5061K58940a09012A0131Q3512l6788g8058j8978B09758c1374G4232l5728
12306C8504c2553E6994r253R4547E1602e6740k20418D9085d4354A06429k1942
12295H4487R2030o3611A2473a72246A37817m4848J30689d5321A72613c584B1387
$$ y = [70927, 152180, 234607, -102452, -137733, -132741, -69585, 12095, 96254, 30579, -250166, 108755, -1058, 229118, -118496, -255350, -296, -92641, 67870, 99887, -294515, -289468, -164022, -154166, 92794, 63588, 124006, -175512, -202952, 38991, 191323, 97774, 95366, 12920, 8026, -38878, -5595, -161665, 389577, 111092, -128360, 61470, -216172, -297277, -90040, -355167, 150714, -175918, 94043, -109238, -89629, 436166, 161857, 169858, -133124, -187260, -169952, -200333, -37410, 234782, 25061, 284001, -109012, 10131, 93643, 56855, -78058, -97036, 209758, -31374, 74232, 38504, -32553, 56994, 47741, 142288, 51602, -56740, -277158, 49085, -44354, 106429, 84487, 176517, 112906, 12473, -172246, 137817, 92969, 223658, -45321, 172613, -3584, 21387]
12283C77230b71599J03909K8657E8360A2781b59612B3547L6353G078Q9768b8731
12271c2577A3589K16313g3582B89196G9368B6065J34269C3571c6569A91921g1797
12259g856j1399A50228J42582n2639b46914H3357J59773H2783a9887D1010J98018
12248B39028O2661a02454J3684J9099H0466Q0540B9250J18140b55626i9117B145
12236B68898j30345J92004q7035j10448B9207g1585k647B68331D2685J15110n2942
12225A04853j387j6690B393N14694B21254j04665l8676R9659l2764m3240A540
12213B81099B9961O4801K25059a21931B27925q0313J26760e1458A36315L9242
12203A75557O5570a59712A37986g6327j3183C58949j73502J80046A6002K77813
$$ y = [377230, -271599, -167690, -139033, 58360, 12781, -259612, 23547, 59900, 7078, 96846, -28731, -32577, 13589, 229902, -73582, 289196, 79368, 26065, 160334, 33571, -36569, 191921, -71797, -7856, -19255, 150228, 292810, 240171, -246914, 83357, 243130, 82783, -19887, 41010, 239028, 301689, -102454, -88770, -69671, 80466, 161006, 29250, 147390, -255626, -99117, 2145, 268898, 138553, 330557, 243522, 133074, 29207, -71585, -74232, 268331, 42685, 157795, 104853, 103466, 86776, 2393, 517087, 221254, 116589, 77913, 177572, 144808, 101568, 1540, 281099, 29961, 94762, 319821, -121931, 227925, 147612, 274372, -51458, 136315, 175557, 241127, -159712, 137986, -76327, -89510, 358949, 185447, 365493, 16002, 293815]
12193B93815j28355J10219j24679c786k01449B32781b46275f2990o3094C38965
12182a79370c6043C75103b3881j4552C89697j35907j3470C4044P2128a01016H1731
12170F3632K0124e5655G2024a03694F8432c1768B4849J09556o0596R3283H099
12158b4998C30833b17392C12483f805B38427J2982I2320a31808A80001d2755D0267
12146a6332k2980k92j0481B59327a89326B8211O8734i7550k91786J82186e0021
12134A69600n8336c39327A35517R3427a02606A34691B1003L66840J00795E8857
12123c60953J68290j38864E8134J21629A9405c988A70726J116b88785a17367e1207
12111a07704o5685C04999j06008J00790F8462l1595N9979N8238d7671D95628G6606
$$ y = [293815, 165460, 275679, 151000, -3786, -205235, 232781, -246275, -62990, -126084, 338965, -179370, -36043, 375103, -23881, -38433, 389697, 253790, 240320, 34044, 106172, -101016, 81731, 63632, 83756, -55655, 72024, -103694, 68432, -31768, 24849, 134405, 73809, 167092, 8099, -24998, 330833, -217392, 312483, -6805, 238427, 251409, 92320, -131808, 180001, -42755, 40267, -16332, -39312, -39604, -50085, 259327, -189326, 28211, 96945, -97550, -389336, -207150, -50021, 169600, 111264, -339327, 135517, 228944, -102606, 134691, 21003, 387843, 488638, 58857, -360953, -192663, -331527, 58134, 179763, 19405, -3988, 170726, 171842, -288785, -117367, -51207, -107704, -173389, 304999, 198991, 299781, 68462, 36867, 96846, 155084, -47671, 495628, 76606]
12099A93557L5971d8527A36609e7210k37416D6044b48592J20064D2756J69630
12089B12386m2757Q9469b24286A81593I43e0134I0448a53595d8003C6533J46619
12078A83152H0496a03089A41437K19731c689k01281B4880J61103D9411O1446J25910
12067B36767M1888j23403Q831a02839A6213a91366R5447A31161J61378b27305
12056b07457e9710A54502J79967A38114J04453i8000B55902A15743h8181A56426
12045E0416d54934A45038j3886b47706b0645C23021i0903j21606K0768p7416C06251
12033B40894j11849j0547Q1112A1427J97880a79745f3613p155g31j01638B18056
12021D6667J34086J03046I0135a0618C60854c15034A48585m5787a44173n4065
$$ y = [193557, 229528, -48527, 136609, -57210, -294626, 46044, -248592, -128528, 42756, 212386, 169629, 259098, -224286, 181593, 943, -50134, 90448, -153595, -48003, 36533, 183152, 80496, -103089, 141437, 361168, -3689, -204970, 24880, 185983, 49411, 110857, 236767, 278655, 155252, 164083, -102839, 16213, -191366, -95919, 131161, 292539, -227305, -207457, -59710, 154502, 334469, 138114, 242567, -98000, 255902, 115743, -88181, 156426, 50416, -454934, 145038, 131152, -247706, -20645, 323021, -90903, -212509, -191741, -269157, 306251, 240894, 129045, 118498, 199610, 11427, 209307, -179745, -63613, -70768, -731, -102369, 218056, 46667, 180753, 283799, 90135, -10618, 360854, -315034, 148585, 102798, -144173, -198238]
12011a98238B87783d7440C12671e5393K4272m1424A2731K0836L06612a40374O1615
12000g8759b4542p2607l9147A13540b94083e3641j00671A48966M0941p7057C0114
11988a15136A99073f3738j61952o4675B89426c16818C10390i3298i254I0925e5494
11976i5678A58454a27763q1881B0514c2965A40279j8715a20247j06737C6125f937
11964b30891D6882J55092D4985O3919C7033h8174n0879j26826A93503r3143a71298
11952c32273D17610H777b2353p3373A54432f6930j97181E5579J83287f26j22111
11941a22737A09978K7091C0209d2680j1393k9024B5297n947J3499J91051a71426
11929a12102I3406k4689H696a58869A95058c71720J41387A03070b39722C1976
$$ y = [-198238, 287783, -47440, 312671, -55393, -31121, -72545, 12731, 33567, 340179, -140374, -78759, -24542, -97149, -136296, 113540, -294083, -53641, -154312, 148966, 189907, 112850, 30114, -115136, 199073, -63738, -225690, -290365, 289426, -316818, 310390, -93298, -9254, 90925, -55494, -95678, 158454, -127763, -209644, 20514, -32965, 140279, 121564, -120247, -226984, 36125, -6937, -230891, 46882, 201974, 44985, 108904, 37033, -88174, -139053, -265879, 193503, 100360, -171298, -332273, 417610, 8777, -22353, -95726, 154432, -66930, -264111, 55579, 238866, -626, -122737, 109978, 137069, 30209, -42680, -54073, -83097, 25297, 19350, 32849, 223900, -171426, -112102, 93406, 68717, 8696, -158869, 195058, -371720, -230333, 103070, -239722, 31976]
11918a83573A38678c0847j45377d0925j31949j27913J096I8113J16045I5973b68541
11906a68071A70007d2976j39236P1250k89399A1410P8570J08474I3875a91855
11895B49015e5987k1975K8744A44759c3552j00224a8605A45111a10250b2310j57108
11884a79418m2432M8508e616l77359A37307a81921C57372a44211b8116L975p9998
11873a04139F8687g6745k52008D417b22006c7490J3313n2742E1293g7144G5363
11861e4716A77512g8747k37946B51179a26992r4660d9834r9849h491F9122b7585
11849a41701J1916p1631h9156n6364C22310A31565d59147B29196c93698A48138
11838a4266l90289C1678P0108m5524a37321H9227j4800b32313j22191J63992j94406
$$ y = [-183573, 138678, -30847, -176224, -40925, -172874, -300787, -299691, 98113, 214158, 95973, -268541, -168071, 170007, -42976, -182212, -110962, -400361, 11410, 89980, 198454, 93875, -191855, 249015, -55987, -77962, -49218, 144759, -33552, -133776, -18605, 145111, -110250, -22310, -179418, -221850, -173342, -5616, -382975, 137307, -181921, 357372, -144211, -28116, -24141, -104139, 68687, -76745, -328753, 4417, -222006, -37490, -24177, -76919, 51293, -77144, 75363, -54716, 177512, -78747, -316693, 251179, -126992, -221652, -49834, -149683, -8491, 69122, -27585, -141701, -129785, -201416, -89156, -145520, 322310, 131565, -459147, 229196, -393698, 148138, -14266, -404555, 31678, 101786, 56262, -137321, 89227, 74427, -232313, -354504, -190512, -384918]
11827c84918G2502b03654R4569a7423C5810a53312K9074k37798R7019E2333c39608
11815C22846A2085J49582K6531d0965k0867b9525j182A06564K3128c01636a8920
11803A79344i3177M3174D0537J74534i5833M2616k15275e2224j81346j59920A61881
11791a83176N8737B54490a28770L1937p3722A21403a08308H6503e0132B99511
11780c4190D6828M5392E088d5745j3330p1005o1735e9747m04295F5546a7757m4576
11768f2333D8221J49829n1434A0996c20023F0137h8765j54798I4633g8823E0570
11756E7748i5624q1714C39267a18286k75715b9505M076B98409j15129D5459f3680
11744A17044e4838A73163M1860H3265J15196m5332a0663A35546n9652b94282f5289
$$ y = [-384918, 72502, -203654, -109085, -17423, 35810, -153312, -124238, -362036, -265017, 52333, -339608, 322846, 12085, 161667, 188198, -40965, -61832, -29525, -30707, 106564, 129692, -301636, -18920, 179344, -93177, -50003, 40537, 215071, -95833, -53217, -268492, -52224, -233570, -393490, 161881, -183176, -124439, 254490, -128770, -96833, -170555, 121403, -108308, 86503, -50132, 299511, -34190, 46828, 92220, 5088, -45745, -59075, -130080, -191815, -59747, -464042, 65546, -17757, -62333, 48221, 198050, 146616, 10996, -320023, 60137, -88765, -243563, 94633, -78823, 50570, 57748, -95624, -177338, 339267, -118286, -394001, -29505, -25429, 298409, 183280, 45459, -63680, 117044, -54838, 173163, 215023, 83265, 198461, 153129, -10663, 135546, 75894, -294282, -65289]
11732e0883a4775k65406b951A14308a06303C05674A42906b83729G4438a37230
11721B05069D365J4627a51000o5195B9654f3006A28422i8723c5285D06459C7765
11709b1103A23368J07840c391A64020i9719H9268J4746a1416I5675h2664A66328
11697G0302i6936q33d7242I3477a4825A77468a11878A71778J80708j19032b03930
11685A56832o4518a7427n0909L3682a1616n115I3984C4633a04241A33238g8908
11673a28867P999e4935k68149k1619G1585J36417b6263F997i9255C7183K6618
11662F3801b22904c0960A6536o544d1121k05353a5440E5682b62449B37627C9241
11650c1351j78222p1450B28364D9544J33823a46724C35523b33853R7926A7606
$$ y = [-50883, -14775, -280181, -2951, 114308, -106303, 305674, 142906, -283729, 74438, -137230, 205069, 4365, 18992, -151000, -216195, 29654, -63006, 128422, -98723, -35285, 406459, 37765, -21103, 123368, 231208, -3391, 164020, -99719, 89268, 104014, -11416, 95675, -82664, 166328, 70302, -96936, -97769, -47242, 93477, -14825, 177468, -111878, 171778, 352486, 233454, -203930, 156832, 92314, -17427, -68336, -34654, -11616, -16731, 93984, 34633, -104241, 133238, -78908, -128867, -120868, -54935, -323084, -344703, 71585, 208002, -26263, 6997, -99255, 37183, 63801, -222904, -30960, 16536, 9992, -41121, -246474, -15440, 55682, -262449, 237627, 39241, -31351, -209573, -281023, 228364, 49544, 183367, -146724, 335523, -233853, -135927, 17606]
11639b48157B11573g4606B57254C8919a32596A51087a65412E1101Q1971g1130
11628f4455A22743k3610b20791H2603M6374e7829B76216j19978a70693G9660i640
11616C90872i536k2785j68255a5113p6683a827l0980B97134D3657K35543D8962
11604B59478A24780b38584J11087b8407C1043Q0919m5943h2294B53039a12797
11593a92340C2572L4495k6371b9996A32370N0919h8523G5364K8288J49810q6368
11582A67094K000a19120A82570E3942h7976F4493a42052F7908q609b5908k35336
11571b61244c8873D5829J1197J18281h5064K8241A36655b05945B61503A2504M6946
11560E9450K512Q736a99077c8389k34649g1403L2948k36446P9777A90074N7289
$$ y = [-248157, 211573, -74606, 257254, 38919, -132596, 151087, -165412, 51101, 133072, -71130, -64455, 122743, 99133, -220791, 82603, 128977, -57829, 276216, 156238, -170693, 79660, -9640, 390872, -9536, -32321, -200576, -15113, -91796, -1827, -32807, 297134, 43657, 279200, 48962, 259478, 124780, -238584, -127497, -28407, 31043, 111962, 66019, -82294, 253039, -112797, -192340, 32572, 67067, 40696, -29996, 132370, 183289, -88523, 75364, 103652, 253462, 167094, 169094, -119120, 182570, 53942, -87976, 64493, -142052, 67908, 59299, -25908, -261244, -38873, 45829, 57026, 175307, -85064, -56823, 136655, -205945, 261503, 12504, 59450, 61962, 70698, -199077, -38389, -273038, -71403, -38455, -274901, -195124, 190074, 247363]
11549B47363J1725r0340h0142D8435J67925g4293H9501K16453A1579c0399A05712
11537d61855A98845G6012K3593l3908a06205e932H114a03298B20655M7766G313
11525a78315e7004A4758J28819E7421a76040r6055E20111a1580C41098e1871m1886
11514i3757j18877a8341o8614A25665J23931d36951H3074c2802A2068J17120F0526
11502A41600J6892j7864K10040H0619d8440p1454A7358M7487K3700i5792B38561
11490a34041B45458H4970d9283A38673R8078p847G8375L02968A83049e1329B43323
11478C85817a00684A53398K52259a96125D99901B09750E3264l126K9972f3707
11467a09661B41434E4208a66806B96630A2130K2087Q4246a27960B1788f3563b5238
$$ y = [247363, 259088, 168748, -80142, 48435, 216360, -74293, 89501, 305954, 11579, -30399, 105712, -461855, 198845, 76012, 99605, 65697, -106205, -5932, 8114, -103298, 220655, 268421, 7313, -178315, -57004, 14758, 143577, 57421, -176040, -272095, 520111, -11580, 341098, -51871, -93757, -212634, -18341, -86955, 125665, 249596, -436951, 83074, -32802, 12068, 129188, 60526, 141600, 158492, 140628, 350668, 80619, -48440, -119894, 17358, 64845, 88545, -95792, 238561, -134041, 245458, 84970, -49283, 138673, 236751, 228904, 78375, 381343, 183049, -51329, 243323, 385817, -100684, 153398, 405657, -196125, 499901, 209750, 53264, 50138, 80110, -63707, -109661, 241434, 54208, -166806, 296630, 12130, 34217, 118463, -127960, 21788, -63563, -25238]
11455f5998C46460A25156d8688B3298P6135a32777H1930c9229k67958a17515b2023
11443b5084O56l6035A85601b41707B7011a22023G3252P9787L3403p2476a74377
11431b8549j14154N7840A60200c08649A8928J8521Q7531a81515A47411K4924a59485
11419D136J09505i3156d4839A61297G3414h9929j64402K2305A8321D519P6344
11408H0863J55448b2041q4788n1779F9234J97405a3049A5813J21967g1297C34457
11396b2911l3284b2748j54256G8076A0741b33348a8996F309J3111d6897Q503p3151
11384a11545B59995H3357R2648m2712i2678I8719N7709D6610L9534d1673A60058
11372a58957b8679C0021J3259a34817N0308A1520e2216A44685e5910m10539c5469
$$ y = [-65998, 346460, 125156, -48688, 23298, 99433, -132777, 81930, -39229, -307187, -117515, -22023, -25084, -24428, -60463, 185601, -241707, 27011, -122023, 73252, 153039, 186442, 113966, -174377, -28549, -142703, -84863, 160200, -308649, 18928, 37449, 124980, -181515, 147411, 172335, -159485, 4136, 113641, -93156, -44839, 161297, 73414, -89929, -254331, -232026, 18321, 4519, 80863, 236311, -22041, -106829, -158608, 69234, 266639, -13049, 15813, 137780, -71297, 334457, -22911, -56195, -22748, -177004, 78076, 10741, -233348, -18996, 6309, 19420, -46897, -38394, -111545, 259995, 83357, 176005, 133293, -92678, 98719, 156428, 46610, 86144, -41673, 160058, -158957, -28679, 30021, 43280, -134817, -84509, 11520, -52216, 144685, -55910, -466449, -35469]
11360B1090a1860k2901F3667K6188a73169M2058M3850a8639r6046A66222F8255
11348A6472h1801B456d1072n1977A44572h3782a1248k18782A26716A5017N7685
11337G2702J25783P7727a21136o1067B02216a10273E3565b38453g0777B90042
11326C23769I9920a0392F6498J21239E6692a66231B56706g2103N871j51211j60796
11315c78239g6061k72924J36162A3307J864b7674A55889J12200b53977B23722
11304b63657H9075a68457k67337J58124R5631a6026n8081n3788l4640n5909C82081
11292a21010I3609J8112b04966A29372E5900b72380J24567j8714p0446j27790
11282c64763I6092J8379J40O6033E5762K09780A3768R9576c6151E2382a7238j51122
$$ y = [21090, -11860, -34761, 63667, 89855, -173169, -131111, -87261, -18639, -114685, 166222, 68255, 16472, -81801, 2456, -41072, -93049, 144572, -83782, -11248, -230030, 126716, 15017, 72702, 198485, 276212, -121136, -182203, 202216, -110273, 53565, -238453, -70777, 290042, 323769, 99920, -10392, 66498, 187737, 56692, -166231, 256706, -72103, -66232, -217443, -378239, -76061, -348985, -212823, 13307, 15171, -27674, 155889, 268089, -253977, 223722, -263657, 89075, -168457, -435794, -277670, -182039, -16026, -74107, -127895, -162535, -218444, 382081, -121010, 93609, 111721, -204966, 129372, 55900, -272380, -147813, -166527, -236973, -364763, 96092, 114471, 114611, 180644, 55762, 265542, 13768, 113344, -36151, 52382, -17238, -168360]
11270a68360H5584k8683e4900j90836j6031p424r977k64258A26482a17209c6444
11258F3908k5754c5358k20131b4830k45757b5997m3176m118j77344N6899A24738
11246g0480b2386A385L04473h8097B85829a64283b0601j3900a340j38674f0614
11234A41162d20234B00821c9192D699J0148J12565F3472l1408a13074C9316j3142
11223B6174L0710b82473a5816F0425K89862h9453l51960K14758k103b9526l0954
11212f0480l08437J77134E2844b30503A6232Q6386b65632A01524D4648a93920
11201g010D7323a68912P4969l8659A36944b26792J9958a01491j5173A68808L5962
11190B04770d32312B27692A08054L352d7496j25379E2231g0234A38974P7826a5113
$$ y = [-168360, 85584, 56901, -54900, -245736, -261767, -269191, -279168, -543426, 126482, -117209, -36444, 63908, 38154, -35358, -255489, -24830, -270587, -25997, -69173, -73291, -250635, -193736, 124738, -70480, -22386, 1385, 305858, -88097, 285829, -164283, -20601, -34501, -1340, -140014, -60614, 141162, -420234, 200821, -39192, 4699, 14847, 127412, 63472, 32064, -113074, 39316, 26174, 56884, -282473, -15816, 60425, 350287, -89453, -441413, -226655, -228758, -29526, -60480, -368917, -191783, 52844, -230503, 16232, 102618, -265632, 101524, 44648, -193920, -7010, 47323, -168912, -93943, -132602, 136944, -226792, -206834, -101491, -116664, 168808, 204770, -432312, 227692, 108054, 111406, -47496, -172875, 52231, -70234, 138974, 216800, -15113]
11178F8951B5534i0891B36828b69764b9278A68205c64201g3343J8427j25127A91473
11166a05624j55880C9696c07061B7834J4841o640b9299e041A9588a64309n2343
11155b16652l7016M6661k23867b8049l5366A55948C3820R7243e1749l7037o4729
11144a53515A03978b13384E481O8959L1637J1173l9443L2231a13176A4553b02006
11132A75358e992A0838b78389B64079k1723c534n5312j77419a08162J6596B2090
11120A00374b76251d8554K2282k18554A24675a70385d690j02365k19820a49507
11109a67031A67490o8257K64743b15347B72570a30293E0285a27520c2311C7360
11098c7742H0164K48308f7563B55064e4117B32320J43097b9283A19305c2168j67373
$$ y = [68951, 25534, -90891, 236828, -269764, -29278, 168205, -364201, -73343, -54916, -180043, 191473, -105624, -261504, 39696, -307061, 27834, 42675, 36035, -29299, -5041, 19588, -164309, -216652, -253668, -207007, -430874, -28049, -63415, 155948, 33820, 131063, -51749, -88786, -153515, 103978, -213384, 5481, 74440, 106077, 117250, 77807, 110038, -113176, 14553, -202006, 175358, -5992, 10838, -278389, 264079, 242356, -3534, -58846, -236265, -108162, -91566, 22090, 100374, -276251, -48554, -26272, -244826, 124675, -170385, -4690, -107055, -326875, -149507, -167031, 167490, 99233, 363976, -215347, 272570, -130293, 50285, -127520, -32311, 37360, -37742, 80164, 328472, -67563, 255064, -54117, 232320, 375417, -29283, 119305, -32168, -199541]
11087a99541a2191I8652J04912F553c69A749h2190C04835A44552J38019D3388
11075B58702i2895A83583K8105a9818B99185a2444A76524A3738K09265P4520I4641
11063i7086C98833A32435J70292J41551j5146o5460q6681j22114O0049P3633l3667
11052B54892L04720k21738l1704A47927M83783j79034N357R8065k13532L56281
11042F98847k20737p5128q0268L0499O3272j18838l0061K17478p0729M6175q4082
11031C76428J14273j40685J41665r6482K58944k87815Q1210P6064j89325J61766
11021D96043N6695q483L735j89366p5202Q665j12375E1477J98534L33814j19150
11010D64675J42856C02398J4165j11799J24124L1011j73462P3474q4037J64561
$$ y = [-199541, -12191, 98652, 203564, 6553, -369, 1749, -82190, 304835, 144552, 282571, 43388, 258702, -92895, 183583, 211688, -19818, 299185, -12444, 176524, 13738, 223003, 297523, 94641, -97086, 398833, 132435, 302727, 444278, 429132, 363672, 276991, 154877, 214926, 288559, 254892, 559612, 337874, 306170, 147927, 631710, 452676, 458033, 556098, 342566, 698847, 478110, 402982, 322714, 353213, 416485, 297647, 267586, 485064, 414335, 460510, 376428, 490701, 350016, 491681, 395199, 654143, 366328, 447538, 523602, 334277, 496043, 552738, 544255, 547990, 358624, 283422, 292087, 179712, 51477, 250011, 583825, 464675, 607531, 302398, 316563, 204764, 328888, 359899, 186437, 259911, 175874, 340435]
11000C40435A47241R4094J60379J8091A52739M09325M8948k29066O00595m53683
10990E28858j52758P9498j69042J56461B04147N26884C41575L37608j50384R3765
10980F22564j2427m7230K21865j71621J28184j9799L24737j10744j5422M81079
10970A401186Q516J24265K48796j16876j95891o2789l78084L87707k24171j26708
10960A065951j48207M27863J52976n16265J19352L74527l93688L33299k49952
10951A165856j908L1601K4986o0667m54047L25549l43406B71682R9171K40282
10941F11135B88649B1733L92352A22942a95977f8350m4285G3692a48785C99383
10930C54840A981L0785K52579q4765J01035e295B71709i7351j53491A8063d1056
$$ y = [340435, 147241, 241335, 401714, 419805, 152739, 562064, 611012, 381946, 982541, 528858, 376100, 455598, 286556, 443017, 204147, 731031, 341575, 679183, 528799, 622564, 610137, 562907, 784772, 613151, 741335, 721536, 1046273, 935529, 920107, 1401186, 1409702, 1533967, 1782763, 1665887, 1469996, 1407207, 1029123, 1416830, 1192659, 1065951, 917744, 1345607, 1498583, 982318, 1101670, 1476197, 1082509, 1415808, 1165856, 1163948, 1195549, 1220535, 1159868, 705821, 1031370, 687964, 271682, 370853, 611135, 288649, 21733, 414085, 122942, -195977, -68350, -112635, 73692, -148785, 399383, 354840, 1981, 32766, 285345, 200580, 301615, -5295, 271709, -97351, -250842, 18063, -41056]
10918B60069f4182D3309b68002a23080K7830l01685d4706B54005a30864I5833
10907C3072a62177O6804D3311d01520d4126r2629B03672a7202r2307B80184b0629
10895b80048A3626K96852I2989M8416a58858C4698d96876A72400l9651K16830
10885C49579c30007a49818K8813m8061k15543A8194R6359j7109c2562j6565j70738
10874b19865F0667a11825b2980j58996c0596D6685J61934b30889L8959f982l9112
10863d6094E3715b4807C5033K29348A20260a77183h1145B46580D1948o244A4476
10851c25202P5645G5824J85291b23196I2055a07509B89820c85009D0322M357P2647
10840A17326c9158A2963K6379K33702p0058a82981A73050g87o674F9531J53921
$$ y = [260069, -64182, 43309, -268002, -123080, -95250, -396935, -44706, 254005, -130864, 95833, 33072, -162177, -95373, 43311, -401520, -44126, -136755, 203672, -17202, -109509, 280184, -20629, -280048, 13626, 310478, 92989, 141405, -158858, 34698, -496876, 172400, 132749, 349579, -330007, -149818, -121005, -169066, -384609, 18194, 114553, 97444, -32562, -49127, -219865, 60667, -111825, -22980, -181976, -30596, 46685, 208619, -230889, -191930, -6982, -46094, 53715, -24807, 35033, 264381, 120260, -177183, -81145, 246580, 41948, 35704, 14476, -325202, -249557, 75824, 261115, -223196, 92055, -107509, 289820, -385009, 40322, 44679, 117326, -39158, 12963, 39342, 273044, 202986, -182981, 173050, -787, -7461, 69531, 223452]
10829B23452a78820A38579N3429a43I8185E560a93917b2292B05474a07181k55970
10818c63151A29524a43595o7762j45n3433A71110b39027c3901A01209Q6843m2348
10807A45704j9461Q6607l5968E5834J26569H3476d9593j99891L609A14754Q9680
10796B04434d25145B8108K11134J02860a04589j14735J02758e3355j96379p2901
10786c22635B01631b84431B9383b14733m9068a01145L2171A30712b04977E1294
10775a51455B70564A19687b4813j54883E5020J13782J39520q9486o2757J68790
10765C24869m4022G2600e4348j3651E6225b56087f5594d434n3401j30580N2501
10754a35914C03779h9071a2015G3339h5505i675I4631a04946A71640i1203A02055
$$ y = [223452, -178820, 138579, 192008, -143, 98185, 5560, -193917, -22292, 205474, -107181, -363151, 129524, -143595, -211357, -211502, -264935, 171110, -239027, -33901, 101209, 188052, 145704, 126243, 212850, 176882, 55834, 182403, 83476, -49593, -249484, -245875, 114754, 204434, -425145, 28108, 239242, 342102, -104589, -219324, -116566, -53355, -249734, -322635, 201631, -284431, 29383, -214733, -263801, -101145, -68974, 130712, -204977, 51294, -151455, 270564, 119687, -24813, -179696, 55020, 168802, 308322, 218836, 156079, 324869, 280847, 72600, -54348, -67999, 56225, -256087, -65594, -4434, -57835, -188415, -135914, 303779, -89071, -12015, 73339, -85505, -9675, 94631, -104946, 171640, -91203, 102055]
10742A38178C3522c0837r6764k1588L4124r8850A56074G7429J97244E3996a6418
10730b24380j92308J21644P6299i4828j29043m5732B62378i2766r0817a4418j51804
10719a66222D7785b98420C02157b01809B35218a93324j61523B15793A2013a96447
10708d0835C0331J16850b38616J04888b5108G7233G038b52468k0857a9319j47459
10697a66778m5763L4853O6121A48497c50478K7990i3277l12305H8691a95259j57954
10686c53213A362P1111a88898j9844C49730a28696B69978C9077b30419d7468A85646
10674B27386c4188A55090d8203j36772A82729f6895b9112I793g468l819A54096
10662a90790A94761E8255h9499B08595A1862Q2628f917A04382J44023b66020j26378
$$ y = [138178, 33522, -30837, -127601, -149189, -115065, -213915, 156074, 77429, 274673, 53996, -16418, -224380, -416688, -295044, -218745, -94828, -223871, -269603, 262378, -92766, -183583, -14418, -166222, 47785, -298420, 302157, -201809, 235218, -193324, -354847, 215793, 12013, -196447, -40835, 30331, 147181, -238616, -133728, -25108, 77233, 7038, -252468, -273325, -19319, -166778, -212541, -177688, -111567, 148497, -350478, -322488, -93277, -405582, 88691, -195259, -353213, 1362, 72473, -188898, -208742, 349730, -128696, 269978, 39077, -230419, -47468, 185646, 227386, -34188, 155090, -48203, -184975, 182729, -66895, -29112, 9793, -7468, -11287, 154096, -190790, 194761, 58255, -89499, 208595, 11862, 94490, -6917, 104382, 248405, -266020, -392398]
10651c92398B86205H7945c9404F8061a76075A47819a15238a2633m0727B58345
10640i2550M3207k75236D0772f8667k1235k23746D4376J28664h8189I6487c13778
10628b5215k93527H4845b412j82431b8556p9912H5812h5586j06151A19718b16179
10616e77723K72620o3101g2393L5136h016E9376K8491K80387A62202a8319j62288
10605a80607n9118L7232d3926j7565H8405c13559A1698a04067k1488d6258J3267
10594c2991m6437j50014h7497o2080A37376h5418a1765A40432a35085A16186a34642
10582b08361A910M635N7516R1055K5734d8920G0270d2262j60574E7176B7230K32221
10570B59451A04801j8785J12816p2927a66624g5013a6554k62222A616J49648B6105
$$ y = [-392398, 286205, 87945, -39404, 68061, -176075, 147819, -115238, -12633, -53360, 258345, -92550, -49343, -324579, 40772, -68667, -89902, -313648, 44376, 173040, -88189, 96487, -313778, -25215, -318742, 84845, -2412, -184843, -28556, -108468, 85812, -85586, -191737, 119718, -216179, -577723, -305103, -368204, -72393, -37257, -8016, 59376, 87867, 368254, 162202, -18319, -180607, -239725, -202493, -43926, -61491, 88405, -313559, 11698, -104067, -125555, -46258, -32991, -79428, -229442, -87497, -149577, 137376, -85418, -11765, 140432, -135085, 116186, -134642, -208361, 1910, 6545, 64061, 155116, 180850, -48920, 70270, -42262, -202836, 57176, 27230, 259451, 104801, 86016, 198832, 125905, -166624, -75013, -16554, -278776, 1616, 151264, 26105]
10558c23965b8018C1560a37924r5563B19720g4262j30875M0826A09272R0396b10396
10546A07645b17477a5960A19672g855A11024a40518L7168F1742J01455c9208k45419
10535b84627a02674G3263A8289a62373E8844a91446A19485C2891h7116j08686
10525a95802M2677j07741e4460j68810F7699c4213A4354b36129m3856c2060C5457
10513b11576d7173F938K54749j7019D6734a10096L0655m8820A40064a02806d085
10501B4936O0304A6950a38670a8412l0011F4983q156a75574j48119C24594A53192
10489b59006G148a43733A53262a16239B1521f1236B82208A491a41628B82652J05022
10478C87674O5597m606I0501R0342K3630m3914N0535a04590c925l40161h4619
$$ y = [-323965, -28018, 31560, -137924, -233487, 219720, -74262, -205137, -164311, 109272, 199668, -210396, 107645, -217477, -15960, 119672, -7855, 111024, -140518, -103350, 61742, 163197, -39208, -284627, -102674, 73263, 18289, -162373, 58844, -191446, 119485, 32891, -87116, -195802, -153125, -260866, -54460, -223270, 67699, -34213, 14354, -236129, -279985, -32060, 35457, -211576, -47173, 6938, 261687, 244668, 46734, -110096, -79441, -128261, 140064, -102806, -4085, 24936, 85240, 16950, -138670, -18412, -48423, 64983, 56827, -175574, -323693, 324594, 153192, -259006, 7148, -143733, 153262, -116239, 21521, -61236, 282208, 1491, -141628, 282652, 387674, 453271, 448665, 90501, 180843, 204473, 160559, 211094, -104590, -3925, -344086, -84619]
10466B00201h3056m834J1124j60223B49612a17257B27428a9248j41773E8484g7043
10454c4732j12171q8859R4542j13121A08219b9922l0298j311j16553C6417f5762
10442a11519E8175b11580r0022F7299L393f4002G4365b81419B42143b61023K6211
10431b34812j66a13024a2289m0197A90962F8111g5646j11142B151b05679L6682
10420a68997P4899n1121A5242K55719b04796A3163b0677m97236a09803n7054A36313
10408C10338a03622q1286A07567a83601N0536I4655j1048b32569H568d8667A72173
10396a90604I4522a56877c5572J1832j46683A61434C0322L9745J83770a20972
10385A10558N615O5984g5308K0763N893A09898K02631i7881K6007H8015k2187
$$ y = [200201, -83056, -87890, -76766, -236989, 249612, -117257, 227428, -19248, -161021, 58484, -77043, -34732, -146903, -235762, -141220, -254341, 108219, -29922, -60220, -61531, -178084, 36417, -65762, -111519, 58175, -211580, -301602, 67299, 70692, -64002, 74365, -281419, 242143, -261023, -234812, -234978, -113024, -12289, -52486, 190962, 68111, -75646, -186788, 2151, -205679, -168997, -94098, -145219, 15242, 270961, -204796, 13163, -20677, -517913, -109803, -166857, 136313, 310338, -103622, -184908, 107567, -183601, -133065, 94655, 83607, -232569, 8568, -48667, 172173, -190604, 94522, -156877, -35572, -23740, -170423, 161434, 30322, 70067, 253837, -120972, 110558, 116173, 182157, -75308, -54545, -48652, 109898, 312529, -97881, -71874, 88015, 65828]
10374F5828a16443A24681P9752m9607d45808B40848Q6374n9962F1409M4771L72763
10363D78943j31008A18137K89459b64513A51958j0651K4543m3620a8072B632P2438
10352G5070c46546b1864B53650J30558K13788a98118C79290b2373A76841L72110
10342E48951h2869C76837A54946J14022A12900B1528d30288a79293n2131C46865
10331b00266g9241D0855J97855a45020C26294A09222b11463A26938B3481a3308
10320A09766l9036L016f1301A96013n0741n4069J86508C5489J33654n9096k6491
10309H3556A3406J78540R9574b78845C40172A4863g0463A526N5312J32271a96166
10297C19822C0680J1222a72666A35937J66248j44985i4319n5004m2723e6617r4989
$$ y = [65828, -116443, 124681, 204433, 154826, -445808, 240848, 327222, 267260, 61409, 106180, 478943, 347935, 118137, 407596, -264513, 151958, 141307, 165850, 122230, -18072, 2632, 75070, -346546, -21864, 253650, 384208, 597996, -198118, 379290, -22373, 176841, 548951, -82869, 376837, 154946, 268968, 112900, 21528, -430288, -179293, -231424, 346865, -200266, -79241, 40855, 238710, -145020, 326294, 109222, -211463, 126938, 23481, -13308, 109766, 70730, 73746, -61301, 196013, 145272, 91203, 277711, 35489, 169143, 110047, 83556, 13406, 191946, 291520, -278845, 340172, 14863, -70463, 1526, 56838, 189109, -196166, 319822, 30680, 41902, -172666, 135937, 302185, 157200, -94319, -149323, -192046, -56617, -151606]
10286a51606B57933f8473A60282d6351h310A96969b15694a04241q7086C6592d78117
10274F2351g5751A16304e74536A46274a12341B57666G7880c2523B90339A10272
10263f9715j29625B70861A21646K53774A41858k4216O6581J38182O277g7948A38166
10251b03564D6866b720k10955R4485j10929I9413R891B7639a64283d8283j7987
10240f6270A5582b46274A56786C562a94674Q2333B76089q3437B2798J47238n2555
10229A17481m203N7313d12742e7689P474j3953I2805R9618J31611c0797C12647
10217H6761M79796f0721A32106d95247J99247f2191a4898j59179g5307A83881
10206A31150b216A44389b72018N4253B27462F0505b19793E4570c33133A82362
$$ y = [-151606, 257933, -68473, 160282, -46351, -8310, 196969, -215694, -104241, -191327, 36592, -478117, 62351, -75751, 116304, -574536, 146274, -112341, 257666, 77880, -32523, 290339, 110272, -69715, -199340, 270861, 121646, 375420, 141858, 117642, 184223, 322405, 328682, -77948, 138166, -203564, 46866, -2720, -213675, -119190, -230119, 99413, 109304, 27639, -164283, -48283, -66270, 15582, -246274, 156786, 3562, -194674, -112341, 276089, 192652, 22798, 170036, 117481, 113278, 170591, -412742, -57689, -50215, -64168, 92805, 192423, 324034, -30797, 312647, 86761, 566557, -60721, 132106, -495247, -296000, -62191, -14898, -174077, -75307, 183881, 131150, -2216, 144389, -272018, -217765, 227462, 60505, -219793, 54570, -333133, 182362]
10195d48515a38863I5153h4772A37266o810K75948f9019D2121a20298a8496p9821
10184i8317A3929M0797g781k9259a3436m9010a7993q9031A20166g0104E7213j3718
10172D3495f1946k45771B72377a58148n3890m0210H8946J04696b18633h2197l19970
10161d02167B23512p3578a5693r1089c2980j89869b4915A82361i6204o0293O0731
10150i5766j05407A53545c48348C16164b38022G8667c95667a93540j31408J02552
10140b22396a07434p5275D8030c4411k44330J06288j72141J9280A32165B3865
10129a11168A96533A7875K96091D0495e5765l4858A82856k4356o6099b17673C406
10117E2721B1983a7205j65953g2597A36879o1234b60605a02312A02057b97336
$$ y = [-448515, -138863, 95153, -84772, 137266, 130456, 406404, -69019, 42121, -120298, -18496, -98317, 13929, 54726, -7781, -37040, -13436, -62446, -17993, -107024, 120166, -70104, 57213, 43495, -61946, -307717, 272377, -158148, -212038, -252248, 88946, 193642, -218633, -82197, -402167, 223512, 149934, -15693, -106782, -32980, -222849, -24915, 182361, -96204, -156497, -95766, -201173, 153545, -348348, 316164, -238022, 78667, -395667, -193540, -324948, -222396, -107434, -182709, 48030, -34411, -278741, -172453, -344594, -325314, 132165, 23865, -111168, 196533, 17875, 313966, 40495, -55765, -90623, 182856, 158500, 92401, -217673, 3406, 52721, 21983, -17205, -183158, -72597, 136879, 75645, -260605, -102312, 102057, -297336]
10106b25103K2639R4875a0931B69740e124r2270D68960b17745C38131b01280R6956
10095a04324l3779b9360p1542r4646B3348h9451k65606A50869c1548j07485j21306
10084b60339G4677l5037a43917f5974p0474A11105M7406c05969J01336P4186G682
10072I2612b20516J00142j3716F5658g3010H9166a31352A22328A7275J18947h5722
10060c5579j7453r8872B1805a30508b6562j15747A42827e845p4126j72255A23480
10048C8229a27671o9216O8149E1440J34908C5274a03807j96832E768a54254l13405
10037d67659i6634B26691a21745a8935D2889M9295h9249m7286p0728A09821g4465
10025B07740b56645e4587G0998a46516B8878a30714j7117N9721j31594k27186
$$ y = [-225103, -202464, -107589, -10931, 269740, -5124, -97394, 468960, -217745, 338131, -201280, -104324, -138103, -29360, -100902, -195548, 23348, -89451, -355057, 150869, -31548, -139033, -260339, 74677, 39640, -143917, -65974, -136448, 111105, 158511, -305969, -204633, -130447, 7682, 92612, -220516, -120374, -134090, 65658, -73010, 89166, -131352, 122328, 17275, 136222, -85722, -35579, -53032, -151904, 21805, -130508, -26562, -142309, 142827, -5845, -79971, -252226, 123480, 38229, -127671, -196887, -128738, 51440, 186348, 35274, -103807, -300639, 5768, -154254, -467659, -96634, 226691, -121745, -18935, 42889, 92184, -89249, -136535, -207263, 109821, -74465, 207740, -256645, -54587, 70998, -146516, 28878, -130714, -147831, -88110, -219704, -446890]
10015d46890B90165e7586A15439b11939l3580C10176G2616a05490c457B06541
10004b84320e1663C3757J36897A831f0072B20711a67050P3166a1504l7955k642
9993e2101k644p1271H0165k140b01713J00437j80099J06070M3728E9434c32631
9981B22287c75408e3760o7446j72244d565A55613b27719i1854B9454D769N0080
9970E4849b27326a113k31320H123J62388q3200b04449A25245l23g5370L0329n8245
9958a03286J0157E9106c46764i3281D1054d16115a90535G2065a24980D7269l212
9947D4057K68216q4304c31008A18220b43069D1779J29634H235J20234d37940c0238
9935c53356B0597b24049J105B43033i8825H9802j2779e4261l74322e8169j89377
$$ y = [-446890, 290165, -57586, 115439, -211939, -245519, 310176, 72616, -105490, -3457, 206541, -284320, -51663, 33757, 170654, 1831, -60072, 220711, -167050, -93884, -11504, -49459, -52101, -54745, -126016, 80165, 78025, -201713, -101276, -281375, -175305, -131577, 59434, -332631, 222287, -375408, -53760, -121206, -293450, -4565, 155613, -227719, -91854, 29454, 4769, 54849, -227326, -1113, -232433, 8123, 170511, 87311, -204449, 125245, 124922, -75370, -45041, -103286, -93129, 59106, -346764, -93281, 41054, -416115, -190535, 72065, -124980, 47269, 44057, 312273, 227969, -331008, 118220, -243069, 41779, 171413, 8235, 128469, -437940, -30238, -353356, 20597, -224049, -222944, 243033, -98825, 89802, 77023, -54261, -428583, -58169, -247546]
9924b47546B43488a22121q1360p304B4212a4082j90481A23e8323L271a9820k63532
9912b83352A16029e56288A9015J03095D9815a50788j9686A37166G804J35213a13932
9900b13888h5155D02348i136p6735B8023b12359d5515j30339L7345K5300D4318
9888G3812J47679a73930e1371E1892a68349m2332e7559j71295B51457e0440C23967
9876a11156B21119d48071a28391D8533a30564A2268a2653l8114b1231A79775g601
9864a74858e179H6259d49871B22103h7387C36702C5941J81283i4077M4206k3810
9853g3681j15481B7916g381j22240A91829f2086k94815H5881c9892D4199b51339
9841a85382e9767A34930b94477P318i6988c3529l58296B10835j3273P5887i8924
$$ y = [-247546, 243488, -122121, -203481, -210785, 24212, -14082, -204563, 123, -58323, -55052, -19820, -283352, 116029, -556288, 19015, 122110, 49815, -150788, -170474, 137166, 7804, 143017, -113932, -213888, -85155, 402348, -9136, -85871, 28023, -212359, -45515, -175854, -138509, -113209, 44318, 73812, 221491, -173930, -51371, 51892, -168349, -210681, -57559, -228854, 251457, -50440, 323967, -111156, 221119, -448071, -128391, 48533, -130564, 12268, -12653, -50767, -21231, 179775, -7601, -174858, -5179, 86259, -449871, 222103, -87387, 336702, 35941, 217224, -94077, -49871, -73681, -189162, 27916, -7381, -129621, 191829, -62086, -356901, 85881, -39892, 44199, -251339, -185382, -59767, 134930, -294477, -287159, -96988, -33529, -391825, 210835, 197562, 273449, -98924]
9829b05271D1956i7796j05461D0892C53O0589a26007j78757K7999A09900c23814
9817a10764G9174a41471j67108i0950n0507i225C56891b34096K9004d401n3210
9806e7611j44240A64727b28153i5917H7556c15178A72520l2539n8583J96093b00953
9794b40560l1138i58A77631c09391d9792E8338Q1277a33808K3016n675B127h6064
9781a00755K3460A99019q2373b6316K142l251l0680A57799d57169H4762h4162
9769C17329I3679K45923B6289O8479c26171a60394d6818A74437e4691a4726o8361
9758h3087F8727a13213A43306h1600L0606j41137k11146K7167d8196k31816F8210
9746C9314b07164e5933I4029c4601j28990O9278A25698b1582l7792H7788a67409
$$ y = [-205271, 41956, -97796, -203257, 40892, 353, 60942, -126007, -304764, -276765, 109900, -323814, -110764, 79174, -141471, -308579, -90950, -141457, -9225, 356891, -234096, -205092, -4401, -57611, -201851, 164727, -228153, -95917, 87556, -315178, 172520, 139981, 81398, 277491, -200953, -240560, -271698, -958, 177631, -309391, -49792, 58338, 139615, -133808, -110792, -116467, 2127, -86064, -100755, -77295, 199019, 116646, -26316, -24174, -27425, -58105, 157799, -457169, 84762, -84162, 317329, 93679, 339602, 26289, 94768, -326171, -160394, -46818, 174437, -54691, -14726, -83087, 68727, -113213, 143306, -81600, -50994, -192131, -403277, -376110, -48196, -280012, 68210, 39314, -207164, -55933, 94029, -34601, -163591, -94313, 125698, -21582, -59374, 87788, -167409]
9734a65596C2545b96792a26769A74566k4620a16783L9338l08030B83732b06696
9723f350A50674f0640j51583b353A91461a21512k4894j11443M678B20388b42002
9711a11913A62511J22188E4138b41920A76814a00051j14701C9236a15117j1636
9701a26753B08138b18611c5290H9229C6738a01607j86084H8008d30283A26321
9690c05181l013A87481n3162a05535F4494d8367j81017a3207A9322g9975j58265
9679b38240L5039j1192Q3040K0772A96501a70755c8020C5309N8561O6965e7928
9667a9373A0152b06490f3768j83198A43568e2979A42485a84399B6380J9607a19427
9655a86738B74430A09286a19586m2584B8985c41304J11677a01927j90985A94831
$$ y = [-165596, 32545, -296792, -126769, 174566, 149946, -116783, -77445, -385475, 283732, -206696, -6350, 150674, -60640, -212223, -2353, 191461, -121512, -146406, -257849, -253171, 220388, -242002, -111913, 162511, 284699, 54138, -241920, 176814, -100051, -214752, 39236, -115117, -126753, 208138, -218611, -35290, 89229, 36738, -101607, -287691, 88008, -430283, 126321, -305181, -308194, 187481, 134319, -105535, 64494, -48367, -229384, -13207, 19322, -79975, -238240, -203201, -214393, -131353, -110581, 196501, -170755, -38020, 35309, 93870, 160835, -57928, -19373, 10152, -206490, -63768, -246966, 143568, -52979, 142485, -184399, 26380, 45987, -119427, -186738, 274430, 109286, -119586, -162170, 28985, -341304, -229627, -101927, -292912, 194831]
9644i4719j55011n8376I104a37321A96468i5522j17156B1217Q0088A8342c179
9632h7105j62716E1674P7051a24675C21776b1717k01399a5367k9111A6206a46028
9620a92000A19681C3710a82163j5032J8397k8539D30041f0177A5163g9529j1983
9609i1512A69095a63903l9520K6886H7872a81714A0021K6416a82208B2901L2875
9598E5776a02610o6587K1568E2136d0415n779l5905J8276j61741A09245J56737
9587B65982a70585B15630b74270e4463B17629b12591C0881c0573C0342i9382I1854
9575b9696q7321D395a35654A26210c12194C99118g8588B7099b23539p0474J01270
9564a92743C20144b72777R3094C0492R6195g1686n5914B08904b3167I0898B5661
$$ y = [-94719, -249730, -308106, 9104, -137321, 196468, -95522, -212678, 21217, 101305, 18342, -3179, -87105, -249821, 51674, 128725, -124675, 321776, -21717, -223116, -15367, -44478, 16206, -146028, -192000, 119681, 33710, -182163, -197195, -178798, -207337, 430041, -60177, 15163, -79529, -91512, 169095, -163903, -203423, -176537, 87872, -181714, 10021, 36437, -182208, 22901, 55776, -102610, -169197, -147629, 52136, -40415, -46194, -82099, -63823, -225564, 109245, 265982, -170585, 215630, -274270, -54463, 217629, -212591, 30881, -30573, 30342, -99382, 91854, -29696, -117017, 4395, -135654, 126210, -312194, 399118, -78588, 27099, -223539, -294013, -192743, 320144, -272777, -179683, 30492, 126687, -71686, -127600, 208904, -23167, 90898, 25661]
9552g2271A58344b44049N8214A88804c18302f5418j29459F3333a87800I411f3404
9540b7554k48407I8997C2013k522K07171M5540a26528j97691A7959a99452B48048
9528H6126a83580k4372j75418E3784K32720b41046Q9313l4074A48035i613A46810
9516d4566B3891L2504a81066h8809k13453J12335H74a43972D6264b75960A5884
9504B32708b42039B19616d0006n5619C0043Q7296A379P6801D556b6704j30416
9493a57120g7362l14812a34660J9880l48933B06707G2151b204l6804A46885a00157
9481e0783r5896M6619G1663d7555B6046f687A6695K59640a84807g1045j93510
9470b64555A89091g6346m3842J3675N2963J8300k1105l89252D1551b75433c9446
$$ y = [-72271, 158344, -244049, -185835, 188804, -318302, -65418, -194877, 63333, -187800, 9411, -63404, -27554, -275961, 98997, 32013, 29491, 236662, 282202, -126528, -324219, 17959, -199452, 248048, 86126, -183580, -207952, -383370, 53784, 286504, -241046, -151733, -185807, 148035, -9613, 146810, -44566, 23891, 56395, -181066, -88809, -302262, -189927, 874, -143972, 46264, -275960, 15884, 232708, -242039, 219616, -40006, -95625, 30043, 117339, 1379, 78180, 4556, -26704, -157120, -77362, -392174, -134660, -114780, -463713, 206707, 72151, -2204, -39008, 146885, -100157, -50783, -146679, -100060, 71663, -47555, 26046, -6687, 16695, 276335, -184807, -71045, -264555, 189091, -76346, -120188, -106513, -53550, -35250, -56355, -445607, 41551, -275433, -39446]
9458b73275H4040a90619i0570c2909B25609a85266e4808A73529c2079B30923b6893
9446a13842k2040A19027B0777J14134l129b78233K5514b4418k40456d9773k54927
9435c04700E351b16973B57175j25967b8295E2950Q3731f995l00045c4206G8774
9423c11698D6653M1985J3459c32369J07783f0087B6185b21022a4600j53162A3564
9411A89896k0581a52240M058g3509k61852o5180A71834c14221J13947I5741c44691
9399e3006k26992F05459g6106j09873I2977L1507A2754M0218a58309d0587I6557
9387c19565I810i54H311N0423j4875a6127k57852h3920m28269a14017c0642l75987
9375d06629D9604a23633B8600a46314N9827a2205E4833P403J41911F8386c4059
$$ y = [-273275, 84040, -190619, -90570, -32909, 225609, -185266, -54808, 173529, -32079, 230923, -26893, -113842, -135882, 119027, 20777, 134911, 131782, -278233, -252719, -24418, -264874, -49773, -304700, 5351, -216973, 257175, 131208, -28295, 52950, 136681, -6995, -307040, -34206, 78774, -311698, 46653, 88638, 102097, -332369, -224586, -60087, 26185, -221022, -14600, -167762, 13564, 189896, 169315, -152240, -148182, -73509, -335361, -400541, 171834, -314221, -200274, 95741, -344691, -53006, -279998, 605459, -76106, -185979, 92977, 124484, 12754, 52972, -158309, -40587, 96557, -319565, 9810, -954, 8311, 58734, 43859, -16127, -273979, -83920, -512189, -114017, -30642, -406629, 49604, -123633, 28600, -146314, -86487, -12205, 54833, 62236, 204147, 68386, -34059]
9363c36452R2667L3445j13607B8630a17038c4389B26885a0789k24336a246j72633
9352a73879p8433E8660c3157G6540a47589A15953o138C071i9309j08513j77846
9341c85668M684a74207B37317d5053D885b04555F1502a52100M6834G5173a89215
9329b53698l3343Q8502c5550E1518b7350I0902a23719q8470M8954D5224P3169
9318A18393J20788a52826E162a69536A0526a70960a3439K389l70846A68517p3903
9307I4614g2746A20639d89160C04890a26378M1132B21513I1910a72800J890B5050
9295B08193e1002B32527h6066o5735D8530a7539l27068J68574M9877e3488j98850
9284b52338a08371A2793J5598e9690A50467j6516M2353d3069A21393c10287A60003
$$ y = [-336452, -243785, -210340, -323947, 28630, -117038, -34389, 226885, -10789, -235125, -1246, -173879, -252312, 58660, -33157, 76540, -147589, 115953, 109815, 3071, -99309, -207822, -385668, -380984, -174207, 237317, -45053, 4885, -204555, 61502, -152100, -105266, 75173, -189215, -253698, -287041, -198539, -35550, 51518, -27350, 90902, -123719, -212189, -163235, 45224, 118393, 239181, -152826, 5162, -169536, 10526, -170960, -13439, -11050, -381896, 168517, 94614, -72746, 120639, -489160, 304890, -126378, -85246, 221513, 91910, -172800, -170910, 25050, 208193, -51002, 232527, -86066, -151801, 48530, -17539, -344607, -176033, -126156, -53488, -252338, -108371, 12793, 28391, -59690, 150467, 133951, 176304, -43069, 121393, -310287, 160003]
9272C5524a19064C1b8858j80506m0952a14841J1501k14763f9187k48387e2276
9260C25316j18840n0486f3500k77791J67040A19066c0815j37551b6383p5281d2503
9248c95547G9147K08236b86294A66646f0207H2160b41845C7716N2555d37945a62887
9236I8102a96275h8971k37182C1586J55781h6199A04031a16278i15k24493A68565
9224b85233H9123M6113N7612h8615o5384M9099d4783j32656N5988o0598p7679
9213b59728A23676E8686A5521g197j18164c7006m0184m4773a5811o6201A70070
9201a24120n6544L1626A7196N6805c02852A69857b11376K9205B13979I6250e5466
9189A31955K9570e3115j31151K5121k04642i0857k2416d0099k91417A73209p9239
$$ y = [35524, -119064, 31, -28858, -209364, -250316, -114841, -103340, -318103, -69187, -317574, -52276, 325316, 206476, 155990, -63500, -341291, -174251, 119066, -30815, -168366, -26383, -101664, -42503, -395547, 79147, 287383, -286294, 166646, -60207, 82160, -241845, 37716, 90271, -437945, -162887, 98102, -196275, -88971, -326153, 31586, 187367, -86199, 104031, -116278, -915, -225408, 168565, -285233, 89123, 135236, 192848, -88615, -153999, -104900, -44783, -177439, -121451, -182049, -259728, 123676, 58686, 15521, -7197, -125361, -37006, -77190, -121963, -15811, -82012, 170070, -124120, -180664, -149038, 17196, 74001, -302852, 169857, -211376, -182171, 213979, 96250, -55466, 131955, 161525, -53115, -184266, -159145, -363787, -90857, -113273, -40099, -331516, 173209, 93970]
9178I3970a35677F141a04212n3172f0445O212j65438K5875O5984b4845r3340o8245
9166a86430J0902g0346A10436L77918H2402b74321O3552A50928A7865c44812a43696
9154B07563D5667l368b91677F1445h073C1130b18928b9476k6609A6953e1116k19452
9142b70568A41312c70689J61221f2536F0111B216O7683b41718B60723i1987j2458
9131a04445j39357d7593p5147A1728L2484d5268A96604e4877I6697b6772p9239
9120a06011K6403D5076a23792A58091c94342c2940E6706O500b69013a18199k37501
9109c55700a28624k10736J05532a16517K0172A04217J01528e4995E7521a38105
9098i7021j33203d7967k6437n1916d4458m5888l7822H8624a36546k8054j75221
$$ y = [93970, -135677, 6141, -104212, -157384, -60445, -54233, -219671, -193796, -127812, -24845, -118185, -186430, -175528, -70346, 110436, 488354, 82402, -274321, -210769, 150928, 17865, -344812, -143696, 207563, 45667, 42299, -291677, 61445, -8073, 31130, -218928, -29476, -56085, 16953, -51116, -270568, 141312, -370689, -209468, -62536, 60111, 2216, 69899, -241718, 260723, -91987, -104445, -243802, -47593, -122740, 11728, 44212, -45268, 196604, -54877, 96697, -26772, -106011, -79608, 45076, -123792, 158091, -394342, -32940, 56706, 63206, -269013, -118199, -355700, -128624, -339360, -233828, -116517, -96345, 104217, 205745, -54995, 57521, -138105, -97021, -230224, -47967, -74404, -126320, -44458, -90346, -128168, 88624, -136546, -164600, -339821]
9087c39821G689R7178f4220A14930E0452b4835j54386f0330A76250a31523A50364
9075A49001i2247A09069b58797b0772A0527B86b90816J4549B35162L2249f4211
9063a80568H3674b14957m2610h8954A13841c50660a22341e1100l6961A72220b17705
9051i0474g629H9047Q9747K0570d03548C73514i0564A56111a49623j58259B19825
9039a00065j30240A021J91309a90799j31360A06921J79233h2787F5806h0970A8668
9027A29283C1247a47656E9339b13596P4756B5965b0590d018l2356C31590a30973
9015b16622F644N0268i8550L856k34284B0617a66456k45215e226j60207N1451
9004a13982m30042a39356B44993j8147h0025m04455E6057d64309A04411d42513
$$ y = [-339821, 7689, 104867, -64220, 114930, 50452, -24835, -179221, -60330, 176250, -131523, 150364, 149001, -92247, 109069, -258797, -20772, 10527, 286, -290816, -276267, 235162, 267411, -64211, -180568, 83674, -214957, -257567, -88954, 113841, -350660, -122341, -51100, -88061, 172220, -217705, -90474, -7629, 89047, 178794, 199364, -403548, 373514, -90564, 156111, -149623, -307882, 219825, -100065, -230305, 1021, 192330, -190799, -322159, 106921, 286154, -82787, 65806, -80970, 18668, 129283, 31247, -147656, 59339, -213596, -138840, 25965, -20590, -4018, -36374, 331590, -130973, -216622, 6644, 56912, -98550, -94694, -328978, 20617, -166456, -411671, -5226, -165433, -113982, -544024, -139356, 244993, 226846, -80025, -484480, 56057, -464309, 104411, -442513]
8993b15470k02457B1136K08375G353b43709k8004G2788d3519l4015a5406A09771
8981a31246n1906A81858C4013i3522D2364f3992D2683K00129o4462a05261D137
8969I9252b34297B72971A1826d69989A04493a16913n2113C3926J44990E4605a03138
8957c9395n92727b8055m21435C2734N5758b5522j73184l9544A36303J44188a04257
8945a01355A35927b3789D6753a68176j85991A94305e1644j5073j86538a19450
8934C13188b11587A62181n8247a37548j04002b6671j61950M5140j45306g4287
8923F5890e0915B48611b62338C9055P52679r5029a52748C14132A17415a40984
8912E0566c84200a21133A97040E2467C675d60233D6174N4538A3760J23800b17940
$$ y = [-215470, -417927, 21136, 229511, 7353, -243709, -271713, 72788, -43519, -77534, -15406, 109771, -131246, -183152, 181858, 34013, -93522, 42364, -63992, 42683, 242812, 178350, -105261, 4137, 99252, -234297, 272971, 11826, -469989, 104493, -116913, -169026, 33926, 178916, 54605, -103138, -39395, -632122, -28055, -449490, 32734, 88492, -25522, -198706, -238250, 136303, 280491, -104257, -101355, 135927, -23789, 46753, -168176, -354167, 194305, -51644, -66717, -253255, -119450, 313188, -211587, 162181, 103934, -137548, -241550, -26671, -188621, -143481, -288787, -74287, 65890, -50915, 248611, -262338, 39055, 791734, 696705, -152748, 314132, 117415, -140984, 50566, -384200, -121133, 197040, 52467, 3675, -460233, 46174, 100712, 13760, 137560, -217940]
8900A73822a58184B37971c94910A36795L863D1751b0013B1632a50408k2446A0373
8888c9128n7125j29131J11840C1380L2146a23723K3982A0220J77364b71308A23839
8876a76840h2813j85572B9962d74258h1200G7842r942J30019F9425a66696A66656
8864a82379O1552R302A58367P7280k3487a47266A36872b4089j58078c7641B32092
8852a06092q1321a3561c462j96891e9145B40021E4499J16800a4653j73244g2802
$$ y = [173822, -158184, 237971, -394910, 136795, 140658, 41751, -20013, 21632, -150408, -172854, 10373, -39128, -96253, -225384, -113544, 31380, 63526, -123723, -99741, 10220, 187584, -271308, 123839, -176840, -82813, -268385, 29962, -474258, -81200, 77842, 67900, 197919, 69425, -166696, 166656, -182379, -120827, -111525, 158367, 235647, 212160, -147266, 136872, -24089, -182167, -37641, 232092, -106092, -187413, -13561, -3462, -200353, -59145, 240021, 54499, 171299, -14653, -187897, -72802]
$$ [...]
##END NTUPLES=NMR SPECTRUM
##END=
