##TITLE=NES1037_878015026_9242866_9XMLrb76ax
##JCAMPDX= 6.0         $$ Bruker NMR JCAMP-DX V2.0
##DATA TYPE= NMR SPECTRUM
##DATA CLASS= NTUPLES
##ORIGIN= BRUKER
##OWNER= Administrator
$$ 1.72 TOPSPIN		Version 2.1
$$ 2015-07-01 12:26:00.628 -0700  Administrator@X
$$ Compression mode = diff/dup
##.OBSERVE FREQUENCY= 400.02188249412
##.OBSERVE NUCLEUS= ^1H
##.ACQUISITION MODE= SIMULTANEOUS (DQD)
##.ACQUISITION SCHEME= undefined
##.AVERAGES= 64
##.DIGITISER RES= 22
##SPECTROMETER/DATA SYSTEM= spect
##.PULSE SEQUENCE= noesygpps1d.comp
##.SOLVENT NAME= COFFEE_meoh
##.SHIFT REFERENCE= INTERNAL, COFFEE_meoh, 1, 14.96267
##AUDIT TRAIL= $$ (NUMBER, WHEN, WHO, WHERE, PROCESS, VERSION, WHAT)
$$ ##TITLE= Audit trail, TOPSPIN		Version 2.1
$$ ##JCAMPDX= 5.01
$$ ##ORIGIN= Bruker BioSpin GmbH
$$ ##OWNER= Administrator
$$ $$ E:\/data/COFFEE/nmr/NES1037_878015026_9242866_9XMLrb76ax/22/pdata/1/auditp.txt
$$ ##AUDIT TRAIL=  $$ (NUMBER, WHEN, WHO, WHERE, PROCESS, VERSION, WHAT)
(   1,<2015-07-01 12:25:53.503 -0700>,<Administrator>,<X>,<go>,<TOPSPIN 2.1>,
      <created by zg
	started at 2015-07-01 12:14:23.893 -0700,
	POWCHK enabled, PULCHK disabled,
       configuration hash MD5:
       21 0F 79 D6 B3 7B B4 F6 88 20 88 DB 03 48 BD 9F
       data hash MD5: 64K
       87 9F 79 F9 45 AD 0B F6 CA 38 C8 8C E5 B5 4C ED>)
(   2,<2015-07-01 12:25:57.096 -0700>,<Administrator>,<X>,<proc1d>,<TOPSPIN 2.1>,
      <Start of raw data processing
       efp LB = 0.3 FT_mod = 6 PKNL = 1 PHC0 = 0 PHC1 = 0 SI = 128K 
       data hash MD5: 128K
       4B 20 4D 30 88 94 A7 17 21 16 EF 9B D3 A1 7B C5>)
(   3,<2015-07-01 12:25:58.096 -0700>,<Administrator>,<X>,<proc1d>,<TOPSPIN 2.1>,
      <pk PHC0 = -84.95178 PHC1 = 0 
       data hash MD5: 128K
       3E EE B5 1E 29 11 6D 6D 7F 48 A0 6E 8D 35 B0 A6>)
(   4,<2015-07-01 12:25:59.081 -0700>,<Administrator>,<X>,<proc1d>,<TOPSPIN 2.1>,
      <abs ABSG = 1 
       data hash MD5: 128K
       E0 F0 1E 4C 79 74 E5 2E 55 63 69 23 37 8E C0 21>)
(   5,<2015-07-01 12:25:59.299 -0700>,<Administrator>,<X>,<proc1d>,<TOPSPIN 2.1>,
      <abs ABSG = 2 
       data hash MD5: 128K
       D8 A7 6D E7 3C A8 CE EA 0A 72 87 27 B1 01 85 53>)
(   6,<2015-07-01 12:25:59.424 -0700>,<Administrator>,<X>,<proc1d>,<TOPSPIN 2.1>,
      <abs ABSG = 3 
       data hash MD5: 128K
       0D 22 19 67 F4 3F 3F 7E E4 D8 54 B3 EA 98 F3 54>)
(   7,<2015-07-01 12:25:59.846 -0700>,<Administrator>,<X>,<proc1d>,<TOPSPIN 2.1>,
      <abs ABSG = 4 
       data hash MD5: 128K
       64 FF EC E9 F9 B5 81 55 23 48 BA C2 31 C1 42 A3>)
(   8,<2015-07-01 12:25:59.940 -0700>,<Administrator>,<X>,<proc1d>,<TOPSPIN 2.1>,
      <abs ABSG = 5 
       data hash MD5: 128K
       7F 87 0E DD 5C 3F F3 E1 12 8A DE 0D 0E 6C 8E FD>)
$$ ##END=
$$ 
$$ $$ hash MD5
$$ $$ 37 3F 0A 78 56 CF F8 AF 06 D9 ED 6E 4C B6 CB 0D
##$RELAX= 
##$RELAX= 
##$RELAX= 
##$RELAX= 
##$RELAX= 
##$RELAX= 
##$RELAX= 
##$RELAX= 
$$ Bruker specific parameters
$$ --------------------------
##$DU= <E:\>
##$EXPNO= 22
$$ [...]
##$TP07= 0
##$TPNAME0= <>
##$TPNAME1= <>
##$TPNAME2= <>
##$TPNAME3= <>
##$TPNAME4= <>
##$TPNAME5= <>
##$TPNAME6= <>
##$TPNAME7= <>
##$TPOAL= (0..7)
0.5 0.5 0.5 0.5 0.5 0.5 0.5 0.5
##$TPOFFS= (0..7)
0 0 0 0 0 0 0 0
##$TUNHIN= 0
##$TUNHOUT= 0
##$TUNXOUT= 0
##$USERA1= <user>
##$USERA2= <user>
##$USERA3= <user>
##$USERA4= <user>
##$USERA5= <user>
##$V9= 5
##$VALIST= <valist>
##$VCLIST= <CCCCCCCCCCCCCCC>
##$VD= 0
##$VDLIST= <DDDDDDDDDDDDDDD>
##$VPLIST= <PPPPPPPPPPPPPPP>
##$VTLIST= <TTTTTTTTTTTTTTT>
##$WBST= 1024
##$WBSW= 4
##$XGAIN= (0..3)
0 0 0 0
##$XL= 0
##$YL= 0
##$YMAX_a= 6407795
##$YMIN_a= -12294982
##$ZGOPTNS= <>
##$ZL1= 120
##$ZL2= 120
##$ZL3= 120
##$ZL4= 120
##$ABSF1= 14.96267
##$ABSF2= -5.595511
##$ABSG= 5
##$ABSL= 3
##$ALPHA= 0
##$AQORDER= 0
##$ASSFAC= 0
##$ASSFACI= 0
##$ASSFACX= 0
##$ASSWID= 0
##$AUNMP= <proc_prof1d_extract.lims>
##$AXLEFT= 0
##$AXNAME= <>
##$AXNUC= <1H>
##$AXRIGHT= 0
##$AXTYPE= 0
##$AXUNIT= <>
##$AZFE= 0.1
##$AZFW= 0.1
##$BCFW= 0
##$BC_mod= 0
##$BYTORDP= 0
##$COROFFS= 0
##$CY= 15
##$DATMOD= 1
##$DC= 0
##$DFILT= <>
##$DTYPP= 0
##$F1P= 0
##$F2P= 0
##$FCOR= 0.5
##$FTSIZE= 131072
##$FT_mod= 6
##$GAMMA= 0
##$GB= 0
##$INTBC= 1
##$INTSCL= 1
##$ISEN= 128
##$LB= 0.3
##$LEV0= 0
##$LPBIN= 0
##$MAXI= 10000
##$MC2= 0
##$MEAN= 0
##$ME_mod= 0
##$MI= 0
##$NCOEF= 0
##$NC_proc= -2
##$NLEV= 6
##$NOISF1= 0
##$NOISF2= 0
##$NSP= 0
##$NTH_PI= 0
##$NZP= 0
##$OFFSET= 14.96267
##$PC= 1
##$PHC0= -84.95178
##$PHC1= 0
##$PH_mod= 1
##$PKNL= yes
##$PPARMOD= 0
##$PPDIAG= 0
##$PPIPTYP= 0
##$PPMPNUM= 2147483647
##$PPRESOL= 1
##$PSCAL= 4
##$PSIGN= 0
##$PYNMP= <proc.py>
##$REVERSE= no
##$SF= 400.020008968633
##$SI= 131072
##$SIGF1= 0
##$SIGF2= 0
##$SINO= 400
##$SIOLD= 131072
##$SPECTYP= <>
##$SREGLST= <1H.CDCl3>
##$SSB= 0
##$STSI= 131072
##$STSR= 0
##$SW_p= 8223.68421052631
##$SYMM= 0
##$S_DEV= 0
##$TDeff= 65536
##$TDoff= 0
##$TI= <>
##$TILT= no
##$TM1= 0
##$TM2= 0
##$TOPLEV= 0
##$USERP1= <user>
##$USERP2= <user>
##$USERP3= <user>
##$USERP4= <user>
##$USERP5= <user>
##$WDW= 1
##$XDIM= 131072
##$YMAX_p= 343187383
##$YMIN_p= -10967
##$CURPLOT= <Network HP LaserJet P1505>
##$CURPRIN= <$Network HP LaserJet P1505>
##$DFORMAT= <normdp>
##$LAYOUT= <+/1D_H.xwp>
##$LFORMAT= <normlp>
##$PFORMAT= <normpl>
##$SURQMSG= 1
$$ End of Bruker specific parameters
$$ ---------------------------------
##NTUPLES= NMR SPECTRUM
##VAR_NAME=  FREQUENCY,     SPECTRUM/REAL,   SPECTRUM/IMAG
##SYMBOL=    X,             R,               I
##VAR_TYPE=  INDEPENDENT,   DEPENDENT,       DEPENDENT
##VAR_FORM=  AFFN,          ASDF,            ASDF
##VAR_DIM=   131072,        131072,          131072
##UNITS=     HZ,            ARBITRARY UNITS, ARBITRARY UNITS
##FACTOR=    0.0627417313425164, 1,          1
##FIRST=     8223.62146879497, 1711,         -46164
##LAST=      0,             4149,            -46302
##MIN=       0,             -10967,          0
##MAX=       8223.62146879497, 343187383,    0
$$ Real data points
##PAGE= N=1
##DATA TABLE= (X++(R..R)), XYDATA
$$ [...]
63523A80092m158m313m446l976k738j440q48q85r88j037j290j632j554r43l27
$$ 180092 175934 171621 167175 163199 160461 159021 158173 157288 156300 155263 153973 152341 150787 149844 149517
63508A49517k40o49j108j129m80N44J223J118N85K61K32K25L34Q76J545J629J198
$$ 149517 149277 148628 147520 146391 145911 146455 147678 148796 149381 149642 149874 150099 150433 151309 152854 154483 155681
63491A55681J193K023K883K988K675K665K845K618J970J356Q18J02m35J0J481
$$ 155681 156874 158897 161780 164768 167443 170108 172953 175571 177541 178897 179715 179817 179382 179392 180873
63476A80873K906L223K372J066O6j20P04K226L709M537M684M552M450M246L521
$$ 180873 183779 187002 189374 190440 190506 190386 191090 193316 197025 201562 206246 210798 215248 219494 223015
63461B23015K187R39P84J917L338M019M060M241M705M914M786N040O140P677R117
$$ 223015 225202 226141 226925 228842 232180 236199 240259 244500 249205 254119 258905 263945 270085 277762 286879
63446B86879J0593J2418J4313J5660J6306J6677J7194J7858J8227J7596J5504
$$ 286879 297472 309890 324203 339863 356169 372846 390040 407898 426125 443721 459225
63435D59225J2296Q919N905K951j57k726l869l730l299l067k658j799r80q86j736
$$ 459225 471521 480440 486345 489296 489139 486413 482544 478814 475515 472448 469790 467991 467011 466125 464389
63420D64389l461n920q570j0433j1087j1336j2239j3569j3977j2780j0871r528
$$ 464389 460928 455008 446438 436005 424918 413582 401343 387774 373797 361017 350146 340618
63408C40618q933q429p765p278o972o254m893l567k943k622j655J12J774K530
$$ 340618 331685 323256 315491 308213 301241 294987 290094 286527 283584 280962 279307 279419 281193 283723
63394B83723K620K858L629M648N527O306P330Q739J0172J1141J1657J2259J3246
$$ 283723 286343 289201 292830 297478 303005 309311 316641 325380 335552 346693 358350 370609 383855
63381C83855J4183J4522J4401J4285J3975J2645J0008O815L872J244j197l015
$$ 383855 398038 412560 426961 441246 455221 467866 477874 484689 488561 489805 488608 485593
63369D85593l693l493l170l011k697k083j465j096j003j372k495m215n836o927
$$ 485593 481900 478407 475237 472226 469529 467446 465981 464885 463882 462510 460015 455800 449964 443037
63355D43037p828r079j0616j1827j2174j1582j0384r055p893o821n617m423l708
$$ 443037 435209 426130 415514 403687 391513 379931 369547 360492 352599 345778 340161 335738 332030
63342C32030l680l995m262m524m994n569n969o165o301o271n809m943m064l438
$$ 332030 328350 324355 320093 315569 310575 305006 299037 292872 286571 280300 274491 269548 265484 262046
63328B62046k963k467j995j695j621j755k037k268k222j918j588j276p23J44Q14
$$ 262046 259083 256616 254621 252926 251305 249550 247513 245245 243023 241105 239517 238241 237518 237662 238476
63313B38476P68K83K80J212K381K642J620Q6q52p51o4M51M80K79J46o1o36j354
$$ 238476 239244 239527 239807 241019 243400 246042 247662 247748 246896 246145 246081 246532 247012 247291 247437 247376 246740 245386
63295B45386j496p61J55K89m40j222j479j453j577j725j426n78L99R95R65M21
$$ 245386 243890 243129 243284 243573 243133 241911 240432 238979 237402 235677 234251 233673 234072 235067 236032 236453
63279B36453j89l26J14O45Q28Q63J207J749J899J451R33Q38J027J068Q95P59Q13
$$ 236453 236264 235938 236052 236697 237525 238388 239595 241344 243243 244694 245627 246465 247492 248560 249455 250214 251027
63262B51027J095J680K472K976K689J794J178J604K976M510N456N649N398N068
$$ 251027 252122 253802 256274 259250 261939 263733 264911 266515 269491 274001 279457 285106 290504 295572
63248B95572M815M718M999N846P059Q154Q902R587J0534J1692J2855J4087J5548
$$ 295572 300387 305105 310104 315950 323009 331163 340065 349652 360186 371878 384733 398820 414368
63235D14368J7033J8027J8332J8291J8396J8785J9152J9003J8083J6734J5731
$$ 414368 431401 449428 467760 486051 504447 523232 542384 561387 579470 596204 611935
63224F11935J5478J5570J5468J5467J6383J8217J9739J9762J8317J6258J4012
$$ 611935 627413 642983 658451 673918 690301 708518 728257 748019 766336 782594 796606
63213G96606J1258P598L061k026p204j1908j5643j8224j9783k0650k1329k2263
$$ 796606 807864 815462 818523 816497 809293 797385 781742 763518 743735 723085 701756 679493
63201F79493k3210k3164k1417j8563j5858j3671j1265q163m938k271J14K897O001
$$ 679493 656283 633119 611702 593139 577281 563610 552345 544182 539244 536973 537087 539984 545985
63188E45985Q681J0647J2430J4569J6874J8662J9417J9196J8585J8297J8604J9123
$$ 545985 554666 565313 577743 592312 609186 627848 647265 666461 685046 703343 721947 741070
63176G41070J9335J9193J9000J8848J8565J8168J7882J7602J6699J4593J1337
$$ 741070 760405 779598 798598 817446 836011 854179 872061 889663 906362 920955 932292
63165I32292P449L361p67m980r415j4137j8854k2898k5654k7064k7696k8279k9059
$$ 932292 939741 943102 942335 937355 927940 913803 894949 872051 846397 819333 791637 763358 734299
63152G34299k9524k8865k6883k4323k2047k0115j8089j6035j4527j3615j2542
$$ 734299 704775 675910 649027 624704 602657 582542 564453 548418 533891 520276 507734
63141E07734j0837r023p736o714n364l863k969k811k718k222j598j337j543j970
$$ 507734 496897 487874 480138 473424 468060 464197 461228 458417 455699 453477 451879 450542 448999 447029
63127D47029k247k077j610j480j968k300j569k54J41q35j837j542l17O76J226
$$ 447029 444782 442705 441095 439615 437647 435347 433778 433524 433665 432830 430993 429451 429134 429810 431036
63112D31036J947K873L330L105K800K852K963K787K523K520K678K592K089J419
$$ 431036 432983 435856 439186 442291 445091 447943 450906 453693 456216 458736 461414 464006 466095 467514
63098D67514J027J200J797K349K552K583K717K897K949L030L359L703L671L440
$$ 467514 468541 469741 471538 473887 476439 479022 481739 484636 487585 490615 493974 497677 501348 504788
63084E04788L602M248M898N369N996O858P481P611P661P956Q215Q198Q272Q726
$$ 504788 508390 512638 517536 522905 528901 535759 543240 550851 558512 566468 574683 582881 591153 599879
63070E99879R095Q864Q468Q781R907J1200J2279J3311J4435J5650J7233J9473
$$ 599879 608974 617838 626306 635087 644994 656194 668473 681784 696219 711869 729102 748575
63058G48575K2004K4118K5886K8118L1001L3585L5059L5857L6928L8390L9561
$$ 748575 770579 794697 820583 848701 879702 913287 948346 984203 1021131 1059521 1099082
63047A099082L9989L9851L9445L8849L8101L7367L6798L6432L6261L6381L6981
$$ 1099082 1139071 1178922 1218367 1257216 1295317 1332684 1369482 1405914 1442175 1478556 1515537
63036A515537L8108L9257L9350L7527L3946K9341K3837J6857Q387n03q951j7360
$$ 1515537 1553645 1592902 1632252 1669779 1703725 1733066 1756903 1773760 1782147 1781644 1772693 1755333
63024A755333k6375l5237m2247m6704m9437n1349n2291n1680m9414m5825m1284
$$ 1755333 1728958 1693721 1651474 1604770 1555333 1503984 1451693 1400013 1350599 1304774 1263490
63013A263490l6320l1552k7048k2213j6775j1366o551j733M069J0592J6304K0255
$$ 1263490 1227170 1195618 1168570 1146357 1129582 1118216 1111665 1109932 1114001 1124593 1140897 1161152
63001A161152K3036K5649K8116K9820L0753L1592L2696L3714L4311L4691L5106
$$ 1161152 1184188 1209837 1237953 1267773 1298526 1330118 1362814 1396528 1430839 1465530 1500636
62990A500636L5273L4722L3475L1995L0436K8300K4859J9749J3110N363l073j1943
$$ 1500636 1535909 1570631 1604106 1636101 1666537 1694837 1719696 1739445 1752555 1757918 1754845 1742902
62978A742902k1104l0234l8803m6441n3177n8996o3286o5305o5274o4396o3461
$$ 1742902 1721798 1691564 1652761 1606320 1553143 1494147 1430861 1365556 1300282 1235886 1172425
62967A172425o1923n8824n4360m9844m6242m3347m0468l7371l4296l1449k8827
$$ 1172425 1110502 1051678 997318 947474 901232 857885 817417 780046 745750 714301 685474
62956F85474k6412k4197k2062j9841j7502j5191j3103j1408j0215r566r433r697
$$ 685474 659062 634865 612803 592962 575460 560269 547166 535758 525543 515977 506544 496847
62944D96847j0129j0407j0232r473q214o756n565n034n124n276m858l732k368
$$ 496847 486718 476311 466079 456606 448392 441636 436071 431037 425913 420637 415779 412047 409679
62931D09679j454j392k012k690k910k770k795l259l941m614n319n941o032n433
$$ 409679 408225 406833 404821 402131 399221 396451 393656 390397 386456 381842 376523 370582 364550 359117
62917C59117m686m313m035l334k450k097k298k345j835j061l11L46N23k89j663
$$ 359117 354431 350118 346083 342749 340299 338202 335904 333559 331724 330663 330352 330698 331221 330932 329269
62902C29269k288j606o67p19j579k148j953j422r84p05o47r12j306j519j542j523
$$ 329269 326981 325375 324708 323989 322410 320262 318309 316887 315903 315198 314551 313639 312333 310814 309272 307749
62886C07749j432j279j413k020k580k394j562q30n52m25j89M4J93L45L71Nn55
$$ 307749 306317 305038 303625 301605 299025 296631 295069 294239 293687 293262 293073 293117 293310 293655 294026 294031 293476
62869B93476o68o4P18R53N00j62m15J6Q14J259R63L30j2q1l70r71j443j574j630
$$ 293476 292808 292744 293462 294415 294915 294753 294338 294354 295168 296427 297390 297720 297708 297627 297257 296286 294843 293269 291639
62850B91639j769j779j602j566j826k075k031j837j705j590j382j071n57K33R49
$$ 291639 289870 288091 286489 284923 283097 281022 278991 277154 275449 273859 272477 271406 270849 271082 272031
62835B72031J077P48P59J428K089K075J669J602K004K440K622K602K465K320K359
$$ 272031 273108 273856 274615 276043 278132 280207 281876 283478 285482 287922 290544 293146 295611 297931 300290
62820C00290K531K508K225K205K840L760M413M867N479O056O032N402M832M882
$$ 300290 302821 305329 307554 309759 312599 316359 320772 325639 331118 337174 343206 348608 353440 358322
62806C58322N617O828Q190R248R817J0261J0975J1761J2290J2997J4685J7295
$$ 358322 363939 370767 378957 388205 398022 408283 419258 431019 443309 456306 470991 488286
62794D88286J9935K2171K4536K7510L0857L4389L8547M3633M9030N3883N8154
$$ 488286 508221 530392 554928 582438 613295 647684 686231 729864 778894 832777 890931
62783H90931O2284O6146O9065P0777P1660P1886P0855O7723O2128N4304M4734
$$ 890931 953215 1019361 1088426 1159203 1230863 1302749 1373604 1441327 1503455 1557759 1602493
62772A602493L3937K2329J0229k017j3916k4993l5046m4012n1622n7411o1234
$$ 1602493 1636430 1658759 1668988 1666971 1653055 1628062 1593016 1549004 1497382 1439971 1378737
62761A378737o3453o4523o4596o3684o2053o0085n7838n5023n1512m7648m3917
$$ 1378737 1315284 1250761 1186165 1122481 1060428 1000343 942505 887482 835970 788322 744405
62750G44405m0491l7234l3993l0727k7456k4322k1619j9576j8010j6437j4566
$$ 744405 703914 666680 632687 601960 574504 550182 528563 508987 490977 474540 459974
62739D59974j2516j0561q865p512o502n659m717l696k921k537k147j243J54J524
$$ 459974 447458 436897 428032 420520 414018 408359 403642 399946 397025 394488 392341 391098 391252 392776
62725C92776K479L168M016N308P013Q932J0864J2593J3888J4744J5686J7546K0579
$$ 392776 395255 398423 402439 407747 414760 423692 434556 447149 461037 475781 491467 509013 529592
62712E29592K3983K6688K8611L0731L3942L8300M3379M8746N3877N8301O2164
$$ 529592 553575 580263 608874 639605 673547 711847 755226 803972 857849 916150 978314
62701I78314O6090P0039P2894P3618P2304O9501O5054N8413M9596L9056K6961
$$ 978314 1044404 1114443 1187337 1260955 1333259 1402760 1467814 1526227 1575823 1614879 1641840
62690A641840J3562J2j2307k3230l3660m3871n2919n9863o4614o7359o8132o7390
$$ 1641840 1655402 1655414 1643107 1619877 1586217 1542346 1489427 1429564 1364950 1297591 1229459 1162069
62678A162069o6081o4596o2335n8866n4850n1248m8201m5233m2015l8427l4337
$$ 1162069 1095988 1031392 969057 910191 855341 804093 755892 710659 668644 630217 595880
62667E95880k9989k6149k3289k1054j9030j7489j6721j6136j4889j3098j1636
$$ 595880 565891 539742 516453 495399 476369 458880 442159 426023 411134 398036 386400
62656C86400j0862j0325r662r000q472p934p294o640n987n283m625m057l337k388
$$ 386400 375538 365213 355551 346551 338079 330145 322851 316211 310224 304941 300316 296259 292922 290534
62642B90534j757k035k873l228k604j506o88m69p79j272j394q85k76l04q76j111
$$ 290534 288777 286742 283869 280641 278037 276531 275843 275374 274595 273323 271929 271044 270768 270464 269588 268477
62626B68477o02J30M89M87L91K82L12P90J609K154K153K211L054M599O189P416
$$ 268477 267875 268005 268494 268981 269372 269654 269966 270756 272365 274519 276672 278883 281937 286536 292725 300141
62610C00141Q358R302J0588J2392J4367J5786J6482J7327J9351K2548K5988K8927
$$ 300141 308499 317801 328389 340781 355148 370934 387416 404743 424094 446642 472630 501557
62598E01557L1355L3536L5419L6588L6581L5252L2886K9812K5862K0567J4004
$$ 501557 532912 566448 601867 638455 675036 710288 743174 772986 798848 819415 833419
62587H33419P144R42m545r833j5054j9791k3626k6371k7963k8574k8758k8991
$$ 833419 840563 841505 836960 827127 812073 792282 768656 742285 714322 685748 656990 627999
62575F27999k9094k8519k7139k5324k3309k1026j8600j6487j4873j3463j1973
$$ 627999 598905 570386 543247 517923 494614 473588 454988 438501 423628 410165 398192
62564C98192j0497r168p889o676n890n763n971o052n990o014o048n825n499n556
$$ 398192 387695 378527 370638 363962 358072 352309 346338 340286 334296 328282 322234 316409 310910 305354
62550C05354o011o147n359m000k989k727k749k440j722r00j20P01J563K364L162
$$ 305354 299343 293196 287837 283837 280848 278121 275372 272932 271210 270310 270190 270891 272454 274818 277980
62535B77980M179N423O551P384Q269R673J1487J3055J4025J4886J6432J8814K1373
$$ 277980 282159 287582 294133 301517 309786 319459 330946 344001 358026 372912 389344 408158 429531
62522D29531K3527K5437K7645L0249L2850L5252L7601L9630M0323L8936L6014
$$ 429531 453058 478495 506140 536389 569239 604491 642092 681722 722045 760981 796995
62511G96995L2690K9119K4368J7931J0553L224l863j0826j7196k2286k6106k9204
$$ 796995 829685 858804 883172 901103 911656 914880 911017 900191 882995 860709 834603 805399
62499H05399l1762l3457l4056l3652l2339l0284k8053k6296k5056k3813k2200
$$ 805399 773637 740180 706124 672472 640133 609849 581796 555500 530444 506631 484431
62488D84431k0214j7863j5199j2740j1146j0351r611q537p501o801o145n302m642
$$ 484431 464217 446354 431155 418415 407269 396918 387307 378770 371269 364468 358323 353021 348379
62475C48379m480m408l799k649j438m36L48Q67J185J682K586L470L773L711M107
$$ 348379 343899 339491 335692 333043 331605 331169 331517 332384 333569 335251 337837 341307 345080 348791 352898
62460C52898N323O816P828Q130Q031P975Q220Q662Q829Q299P094N569M001K420
$$ 352898 358221 365037 372865 380995 389026 397001 405221 413883 422712 431011 438105 443674 447675 450095
62446D50095Q13q77k844n265p957j0361j1844j2059j1208j0091r603r924j0391
$$ 450095 450908 450031 447187 441922 433965 423604 411760 399701 388493 378402 368799 358875 348484
62433C48484j0301r621q618p340n854m589l809l067j872o05l0m1J92R01J449J508
$$ 348484 338183 328562 319944 312604 306750 302161 298352 295285 293413 292808 292778 292737 292929 293830 295279 296787
62417B96787J640K347L386M369N267N949N992N521N494O488P785Q343Q090P553
$$ 296787 298427 300774 304160 308529 313796 319745 325737 331258 336752 343240 351025 359368 367458 375011
62403C75011O858N960N341N379N332M147K159Q61Q35J009L69o68j168j084j028
$$ 375011 381869 387829 393170 398549 403881 408028 410187 411048 411883 412892 413261 412593 411425 410341 409313
62388D09313j174j229j118r13l29J051L022M825O110P351R160J1561J4182J6818
$$ 409313 408139 406910 405792 404879 404550 405601 408623 413448 419558 426909 436069 447630 461812 478630
62374D78630J9553K2414K5190K7664K9836L1814L3493L4492L4485L3508L1808
$$ 478630 498183 520597 545787 573451 603287 635101 668594 703086 737571 771079 802887
62363H02887K9419K6100K1831J7269J3415J0714Q564N910K342j579n171q495j2060
$$ 802887 832306 858406 880237 897506 910921 921635 930199 936109 938451 936872 931701 923206 911146
62350I11146j5862j9230k1746k3673k5243k5992k5404k3806k2048k0445j8729
$$ 911146 895284 876054 854308 830635 805392 779400 753996 730190 708142 687697 668968
62339F68968j6941j5637j5017j4510j3624j2635j2093j2023j2079j2141j2267
$$ 668968 652027 636390 621373 606863 593239 580604 568511 556488 544409 532268 520001
62328E20001j2234j1599j0281q738p476o546n532m043k269j018q99j459j491m21
$$ 520001 507767 496168 485887 477149 469673 463127 457595 453552 451283 450265 449366 447907 446416 445995
62314D45995J007J690J446Q85L92j87r70j738k284k569k487k012j628k002k976
$$ 445995 447002 448692 450138 451023 451415 451228 450258 448520 446236 443667 441180 439168 437540 435538 432562
62299D32562l466k820j835j807k767l398k772j504q23r66j061m22O78J651K452
$$ 432562 429096 426276 424441 422634 419867 416469 413697 412193 411370 410404 409343 408921 409599 411250 413702
62284D13702L390M412N080N289N543O380P805R492J1248J3066J4897J6651J8411
$$ 413702 417092 421504 426584 431873 437416 443796 451601 461093 472341 485407 500304 516955 535366
62271E35366K0445K2974K5945K8899L1074L1882L1452L0544K9689K8597K6535
$$ 535366 555811 578785 604730 633629 664703 696585 728037 758581 788270 816867 843402
62260H43402K3135J8600J3396Q102L355n22l879p314j0919j4248j7081j9710k2356
$$ 843402 866537 885137 898533 906635 909990 909468 905589 898275 887356 873108 856027 836317 813961
62247H13961k4626k5921k6103k5518k4469k2928k0717j7848j4739j2089j0413
$$ 813961 789335 763414 737311 711793 687324 664396 643679 625831 611092 599003 588590
62236E88590r545q755p444n652l886k619j997j808j604j111n55l47l65N5J189
$$ 588590 579045 570290 562846 557194 553308 550689 548692 546884 545280 544169 543614 543267 542902 542957 544146
62221E44146K350K684K294K033K314K720K855K991L557M379M854M788M650N001
$$ 544146 546496 549180 551474 553507 555821 558541 561396 564387 567944 572323 577177 581965 586615 591616
62207E91616N915O996P818Q209Q213P918P411O929O924P792R430J1168J2229J2319
$$ 591616 597531 604527 612345 620554 628767 636685 644096 651025 657949 665741 675171 686339 698568 710887
62193G10887J1755J1119J0787J0760J0809J0792J0816J1061J1542J2116J2782
$$ 710887 722642 733761 744548 755308 766117 776909 787725 798786 810328 822444 835226
62182H35226J3809J5424J7439J9343K0781K1862K2895K3941K4624K4410K2975
$$ 835226 849035 864459 881898 901241 922022 943884 966779 990720 1015344 1039754 1062729
62171A062729K0444J7272J3943J0770P937N665M069K856J397o82k989m780n832
$$ 1062729 1083173 1100445 1114388 1125158 1133095 1138760 1142829 1145685 1147082 1146400 1143411 1138631 1132799
62158A132799o656p753q961r776r977r557q311o031l156o63Q91J825K592L095
$$ 1132799 1126143 1118390 1109429 1099653 1089676 1080119 1071808 1065777 1062621 1061958 1062849 1064674 1067266 1070361
62144A070361L073K785K698K667K110R57n9l02J03O23R66J133J231J511K298L543
$$ 1070361 1073434 1076219 1078917 1081584 1083694 1084651 1084592 1084290 1084393 1085016 1085982 1087115 1088346 1089857 1092155 1095698
62128A095698M673N229N424N807O497P093P157O519N349M231L937M660N629N918
$$ 1095698 1100371 1105600 1111024 1116831 1123328 1130421 1137578 1144097 1149446 1153677 1157614 1162274 1167903 1173821
62114A173821N503N034M754M314L630L153L102L098K913K952L577M416M819M621
$$ 1173821 1179324 1184358 1189112 1193426 1197056 1200209 1203311 1206409 1209322 1212274 1215851 1220267 1225086 1229707
62100A229707M113L553L160L199L668M195M566N004N570N825N594N525O146O878
$$ 1229707 1233820 1237373 1240533 1243732 1247400 1251595 1256161 1261165 1266735 1272560 1278154 1283679 1289825 1296703
62086A296703O843O294O294P167Q316R473J1005J2784J3952J4166J4164J4483
$$ 1296703 1303546 1309840 1316134 1323301 1331617 1341090 1352095 1364879 1378831 1392997 1407161 1421644
62074A421644J4511J3405J1200Q446N382K146p85l115n245p617r980j1921j3642
$$ 1421644 1436155 1449560 1460760 1469206 1474588 1476734 1475949 1472834 1467589 1459972 1449992 1438071 1424429
62061A424429j5502j7271j8663k0061k1826k3206k3170k2131k1677k2432k3272
$$ 1424429 1408927 1391656 1372993 1352932 1331106 1307900 1284730 1262599 1240922 1218490 1195218
62050A195218k2956k1603k0006j8448j6888j5690j5304j5442j5210j4067j2339
$$ 1195218 1172262 1150659 1130653 1112205 1095317 1079627 1064323 1048881 1033671 1019604 1007265
62039A007265j0859j0267j0534j0948j0699r671q530p972q058q310q204p516o489
$$ 1007265 996406 986139 975605 964657 953958 944287 935757 927785 919727 911417 903213 895697 889208
62026H89208n770n846o435o717o312n713n591o000o481o659o431n853n127m561
$$ 889208 883438 877592 871157 864440 858128 852415 846824 840824 834343 827684 821253 815400 810273 805712
62012H05712m274m071l755l389l093k803k415k050j883j905j991k163k553l198
$$ 805712 801438 797367 793612 790223 787130 784327 781912 779862 777979 776074 774083 771920 769367 766169
61998G66169l936m473m513m033l467l396l964m798n549o203o787p105p002o637
$$ 766169 762233 757760 753247 749214 745747 742351 738387 733589 728040 721837 715050 707945 700943 694306
61984F94306o157n440m373l224k390j924j668j608j810k035j853j165l43K29N19
$$ 694306 688149 682709 678336 675112 672722 670798 669130 667522 665712 663677 661824 660659 660316 660545 661064
61969F61064P55J132J724K498L349M084M516M587M486M596N184O115P005P672
$$ 661064 661819 662951 664675 667173 670522 674606 679122 683709 688195 692791 697975 704090 711095 718767
61955G18767Q286R055R948J0874J1917J3234J4763J6243J7503J8684K0075K1731
$$ 718767 727053 736108 746056 756930 768847 782081 796844 813087 830590 849274 869349 891080
61943H91080K3267K4231K4783K5722K7596L0001L2091L3594L4884L6231L7575
$$ 891080 914347 938578 963361 989083 1016679 1046680 1078771 1112365 1147249 1183480 1221055
61932A221055L9064M1099M3729M6594M9700N3663N8873O4925P1325P8187Q5883
$$ 1221055 1260119 1301218 1344947 1391541 1441241 1494904 1553777 1618702 1690027 1768214 1854097
61921A854097R4397J03523J13309J23839J34858J46044J57429J69099J80829J92251
$$ 1854097 1948494 2052017 2165326 2289165 2424023 2570067 2727496 2896595 3077424 3269675
61911C269675K02999K12310K18935K21968K21226K16251K05488J87468J62440
$$ 3269675 3472674 3684984 3903919 4125887 4347113 4563364 4768852 4956320 5118760
61902E118760J31996R7255N8500J6682k5792o6141j02533j34101j60399j81230
$$ 5118760 5250756 5348011 5406511 5423193 5397401 5331260 5228727 5094626 4934227 4752997
61892D752997j96638k06654k11389k11466k08047k02243j94718j85883j76105
$$ 4752997 4556359 4349705 4138316 3926850 3718803 3516560 3321842 3135959 2959854
61883B959854j65628j54679j43689j33081j22855j12848j03323r4799q7269q0190
$$ 2959854 2794226 2639547 2495858 2362777 2239922 2127074 2023751 1928952 1841683 1761493
61873A761493p3318o7002o1391n6033n0560m5280m0708l6851l3301k9777k6290
$$ 1761493 1688175 1621173 1559782 1503749 1453189 1407909 1367201 1330350 1297049 1267272 1240982
61862A240982k3032k0253j8050j6105j3888j1298q772o718n155l977l158k565
$$ 1240982 1217950 1197697 1179647 1163542 1149654 1138356 1129584 1122866 1117711 1113734 1110576 1108011
61850A108011k019j630j689k082k294k130j899j689j113q1Q73J449K220L759N586
$$ 1108011 1105992 1104362 1102673 1100591 1098297 1096167 1094268 1092579 1091466 1091385 1092258 1093707 1095927 1099686 1105272
61835A105272O659O628O068N677N784O411P263P750P594P271P405P904Q235Q519
$$ 1105272 1111931 1118559 1124627 1130304 1136088 1142499 1149762 1157512 1165106 1172377 1179782 1187686 1195921 1204440
61821A204440R572J1758J4298J6094J6871J7387J8660K1217K4817K8652L1958
$$ 1204440 1214012 1225770 1240068 1256162 1273033 1290420 1309080 1330297 1355114 1383766 1415724
61810A415724L4571L6970L9728M3009M6592N0254N4044N8135O2586O7324P2443
$$ 1415724 1450295 1487265 1526993 1570002 1616594 1666848 1720892 1779027 1841613 1908937 1981380
61799A981380P8268Q4990R2421J00388J09158J19078J29961J41280J53030J65839
$$ 1981380 2059648 2144638 2237059 2337447 2446605 2565683 2695644 2836924 2989954 3155793
61789C155793J80165J95856K12730K30998K50769K71571K92663L13517L33678
$$ 3155793 3335958 3531814 3744544 3975542 4226311 4497882 4790545 5104062 5437740
61780E437740L52534L69369L83087L91606L92171L82870L63401L33910K93760
$$ 5437740 5790274 6159643 6542730 6934336 7326507 7709377 8072778 8406688 8700448
61771H700448K42315J80635J11629L8726l4936j06273j72271k30637k79922l19101
$$ 8700448 8942763 9123398 9235027 9273753 9238817 9132544 8960273 8729636 8449714 8130613
61761H130613l47575l65770l75156l77430l73828l65187l52267l36030l17820
$$ 8130613 7783038 7417268 7042112 6664682 6290854 5925667 5573400 5237370 4919550
61752D919550k99110k80726k62531k44268k26403k09636j93999j79124j65186
$$ 4919550 4620440 4339714 4077183 3832915 3606512 3396876 3202877 3023753 2858567
61743B858567j52654j41299j30386j19878j10489j02367r4717q7071p9982p4003
$$ 2858567 2705913 2564614 2434228 2314350 2203861 2101494 2006777 1919706 1839724 1765721
61733A765721o8767o3707n8937n4765n0974m7318m4197m2001m0128l7528l4056
$$ 1765721 1696954 1633247 1574310 1519545 1468571 1421253 1377056 1335055 1294927 1257399 1223343
61722A223343l0543k7627k5233k3226k1813k1054k0531j9855j9164j8815j8716
$$ 1223343 1192800 1165173 1139940 1116714 1094901 1073847 1053316 1033461 1014297 995482 976766
61711I76766j8318j7241j5770j4646j4361j4673j4888j4534j3684j2669j1714
$$ 976766 958448 941207 925437 910791 896430 881757 866869 852335 838651 825982 814268
61700H14268j0910j0318r923r627r371r144q855q374p724p094o621o425o703p474
$$ 814268 803358 793040 783117 773490 764119 754975 746120 737746 730022 722928 716307 709882 703179 695705
61686F95705q206q216p555p015p118p575p941q252q623q779q496q083p899p725
$$ 695705 687499 679283 671728 664713 657595 650020 642079 633827 625204 616425 607929 599846 591947 584222
61672E84222p237o717o632o735o360n585n251n753o458o523n712m303k816k012
$$ 584222 576985 570268 563636 556901 550541 544956 539705 533952 527494 520971 515259 510956 508140 506128
61658E06128k420l491l868l020j991j920k347j910m56O05K52p99j213q10m60n64
$$ 506128 503708 500217 496349 493329 491338 489418 487071 485161 484705 485310 485562 484763 483550 482740 482280 481716
61642D81716n65j5O28P06L55J98L41K83j79n07k16L30L56l03r77r72k97M49P00
$$ 481716 481151 481136 481764 482470 482825 483023 483364 483647 483468 482961 482745 483075 483431 483128 482151 481179 480882 481331 482031
61623D82031K93n51j477k141k332k118j923k234k977l357k702j484j003j830l046
$$ 482031 482324 481773 480296 478155 475823 473705 471782 469548 466571 463214 460512 459028 458025 456195 453149
61608D53149l369k710k035j964k122j932j429j090j216j715k259k471k239j865
$$ 453149 449780 447070 445035 443071 440949 439017 437588 436498 435282 433567 431308 428837 426598 424733
61594D24733j720j729j495r03k18M96J508K796L794M080L866L491K958K422K610
$$ 424733 423013 421284 419789 418886 418668 419164 420672 423468 427262 431342 435208 438699 441657 444079 446689
61579D46689M011N967P300P770Q129Q880R729J0347J0859J1401J1899J2491J3482
$$ 446689 450700 456667 463967 471737 479866 488746 498475 508822 519681 531082 542981 555472 568954
61566E68954J4662J5387J5699J6397J7588J8102J7168J5799J5366J5484J4694
$$ 568954 583616 599003 614702 631099 648687 666789 683957 699756 715122 730606 745300
61555G45300J2891J1509J1271J1298J0811J0350J0493J0612R934R028R041R938
$$ 745300 758191 769700 780971 792269 803080 813430 823923 834535 844469 853497 862538 872476
61543H72476J0514R997Q720P393O444N996N770N036L345J232l46j210j950k850
$$ 872476 882990 892987 901707 909100 915544 921540 927310 932346 935691 936923 936577 935367 933417 930567
61529I30567l499l506k929j877m42R03J454J192R88J688L423N917Q852J1719J3948
$$ 930567 927068 923562 920633 918756 918314 919217 920671 921863 922851 924539 927962 933879 942731 954450 968398
61514I68398J5650J7681K0591K3929K6996K9834L2994L6705M0817M5323N0386
$$ 968398 984048 1001729 1022320 1046249 1073245 1103079 1136073 1172778 1213595 1258918 1309304
61503A309304N5959O1753O7588P3446P9305Q5139R0968R6581J01422J04958J07052
$$ 1309304 1365263 1427016 1494604 1568050 1647355 1732494 1823462 1920043 2021465 2126423 2233475
61492B233475J07701J06537J02935R6551Q7560P6461O3790M9951L5168J9782M554
$$ 2233475 2341176 2447713 2550648 2647199 2734759 2811220 2875010 2924961 2960129 2979911 2984465
61481B984465r539k1909l2463m1072m7473n1790n4609n6228n6440n5494n4529
$$ 2984465 2974926 2953017 2920554 2879482 2832009 2780219 2725610 2669382 2612942 2557448 2502919
61470B502919n4366n4344n3212n0873m8417m6569m4950m2829l9818l5737l0622
$$ 2502919 2448553 2394209 2340997 2290124 2241707 2195138 2150188 2107359 2067541 2031804 2001182
61459B001182k5052j9874j5300j0780n885q46L823P723J0527J2206J3479J5350
$$ 2001182 1976130 1956256 1940956 1930176 1924291 1923445 1927268 1934991 1945518 1957724 1971203 1986553
61447A986553J7968K0493K2386K4208K6704K9779L2779L5363L7463L8853L9236
$$ 1986553 2004521 2025014 2047400 2071608 2098312 2128091 2160870 2196233 2233696 2272549 2311785
61436B311785L8507L6476L2737K7401K1637J6870J3495J0910Q619O744N447M498
$$ 2311785 2350292 2386768 2419505 2446906 2468543 2485413 2498908 2509818 2518437 2525181 2530628 2535126
61424B535126L551K472J270L6r66j433j307q57n92j255l620p768j2722j7218k0808
$$ 2535126 2538677 2541149 2542419 2542455 2541489 2540056 2538749 2537892 2537300 2536045 2532425 2524657 2511935 2494717 2473909
61409B473909k3764k6062k7190k7042k6240k5202k3525k0782j7524j4889j3428
$$ 2473909 2450145 2424083 2396893 2369851 2343611 2318409 2294884 2274102 2256578 2241689 2228261
61398B228261j2781j2328j1670j0628r238p805o555n208l315q98J655M470Q320
$$ 2228261 2215480 2203152 2191482 2180854 2171616 2163811 2157256 2152048 2148733 2147835 2149490 2153960 2162280
61385B162280J3664J9903K6027L1735L7525M3878N0767N7982O5527P3502Q1812
$$ 2162280 2175944 2195847 2221874 2253609 2291134 2335012 2385779 2443761 2509288 2582790 2664602
61374B664602R0075R7766J04362J09458J12790J14203J13567J10658J05024R5957
$$ 2664602 2754677 2852443 2956805 3066263 3179053 3293256 3406823 3517481 3622505 3718462
61364C718462Q3002O6661M8427K9788J1312p064k5069m1841n6588o9084p9558
$$ 3718462 3801464 3868125 3916552 3946340 3957652 3950588 3925519 3883678 3827090 3758006 3678448
61353C678448q8435r6159j02749j07573j10021j10584j10489j10070j08219j03960
$$ 3678448 3590013 3493854 3391105 3283532 3173511 3062927 2952438 2842368 2734149 2630189
61343B630189r7990r1939q6504q1104p5160o8842o2560n6417n0423m4678l9119
$$ 2630189 2532199 2440260 2353756 2272652 2197492 2128650 2066090 2009673 1959250 1914572 1875453
61332A875453l3470k7637k1848j6317j1051o008j096L942R176J4020J7634J9894
$$ 1875453 1841983 1814346 1792498 1776181 1765130 1759122 1758026 1761968 1771144 1785164 1802798 1822692
61320A822692K1400K2393K2290K0643J7956J5165J2746J0829R654R348R474R453
$$ 1822692 1844092 1866485 1888775 1909418 1927374 1942539 1955285 1966114 1975768 1985116 1994590 2004043
61308B004043R261R225R266Q958Q283P799P894Q254Q177P139N043K307k89k199
$$ 2004043 2013304 2022529 2031795 2040753 2049036 2056835 2064729 2072983 2081160 2088299 2093342 2095649 2095360 2093161
61294B093161l639n345p680j0358j2962j5395j7640j9478k0751k1703k2725k3805
$$ 2093161 2089522 2084177 2076497 2066139 2053177 2037782 2020142 2000664 1979913 1958210 1935485 1911680
61282A911680k4478k4268k3062k1099j8751j6377j4253j2648j1868j2156j3485
$$ 1911680 1887202 1862934 1839872 1818773 1800022 1783645 1769392 1756744 1744876 1732720 1719235
61271A719235j5477j7571j9233k0115k0171j9639j8779j7552j5719j3376j1102
$$ 1719235 1703758 1686187 1666954 1646839 1626668 1607029 1588250 1570698 1554979 1541603 1530501
61260A530501r336p650n106j426K580O001Q974J2318J6259K0153K3658K7470L2407
$$ 1530501 1521165 1513515 1508409 1506983 1509563 1515564 1524538 1536856 1553115 1573268 1596926 1624396 1656803
61247A656803L8265M4190M9894N5762O1761O7050P0767P2464P1541O7086N8941
$$ 1656803 1695068 1739258 1789152 1844914 1906675 1973725 2044492 2116956 2188497 2255583 2314524
61236B314524M8423L7228K5944J4245K309q813j8361k6679l4513m1837m7731n1239
$$ 2314524 2362947 2400175 2426119 2440364 2442673 2433860 2415499 2388820 2354307 2312470 2264739 2213500
61224B213500n2173n1204m9276m6891m3939m0317l6553l3600l2124l2226l3667
$$ 2213500 2161327 2110123 2060847 2013956 1970017 1929700 1893147 1859547 1827423 1795197 1761530
61213A761530l5917l7992l8824l8170l6887l6010l5680l5209l4008l2226l0441
$$ 1761530 1725613 1687621 1648797 1610627 1573740 1537730 1502050 1466841 1432833 1400607 1370166
61202A370166k8988k7676k6091k4050k1702j9309j7158j5582j4750j4321j3657
$$ 1370166 1341178 1313502 1287411 1263361 1241659 1222350 1205192 1189610 1174860 1160539 1146882
61191A146882j2714j2323j3149j4596j5405j5206j4828j4992j5362j5258j4680
$$ 1146882 1134168 1121845 1108696 1094100 1078695 1063489 1048661 1033669 1018307 1003049 988369
61180I88369j4189j4067j4087j3911j3357j2353j1004r589q315p156o026m868
$$ 988369 974180 960113 946026 932115 918758 906405 895401 885812 877497 870341 864315 859447
61168H59447l464j560M97J652J112p65l059n440q157j1057j3314j4350j4401j3939
$$ 859447 855983 854423 854920 856572 857684 856919 853860 848420 840263 829206 815892 801542 787141 773202
61154G73202j3069j1848j0703j0039r587q694p218n738m859m544m372m228m432
$$ 773202 760133 748285 737582 727543 717956 709262 702044 696306 691447 686903 682531 678303 673871
61141F73871n175o133o844p344q035q868r072q055o325m990m476m168l419k334
$$ 673871 668696 662563 655719 648375 640340 631472 622400 614345 608020 603030 598554 594386 590967 588633
61127E88633j330m15O85K035L455M831O000O531O057M784L300J837J66j795l649
$$ 588633 587303 586888 587573 589608 593063 597894 603894 610425 616482 621266 624566 626403 626569 624774 621125
61112F21125m985n844o492p040p446p725p888p883p805p963q489r023r120q866
$$ 621125 616140 610296 603804 596764 589318 581593 573705 565822 558017 550054 541565 532542 523422 514556
61098E14556q734q903r147r395r927j0765j1301j0882r546p873o309m991m122
$$ 514556 505822 496919 487772 478377 468450 457685 446384 435502 425956 418083 411774 406783 402661
61085D02661l970m392m700m297l323k461k142k092j723q29J72P64R62J200J635
$$ 402661 398691 394299 389599 385302 381979 379518 377376 375284 373561 372732 372904 373668 374630 375830 377465
61070C77465J870J644J414J787K489K654K151K050L227N108O305O282N720N403
$$ 377465 379335 380979 382393 384180 386669 389323 391474 393524 396751 401859 408164 414446 420166 425569
61056D25569N363N190M615L543K065P87N87J615K750K615J088o13j330j054o23
$$ 425569 430932 436122 440737 444280 446345 447132 447719 449334 452084 454699 455787 455174 453844 452790 452167
61041D52167p54j580k780l791m084l570k757k324k455k709k549j865r20L4R78
$$ 452167 451413 449833 447053 443262 439178 435608 432851 430527 428072 425363 422814 420949 420029 420063 421041
61026D21041J969K958L864M772N976P774J0206J3040J6092J9673K4626L1675M0687
$$ 421041 423010 425968 429832 434604 440580 448354 458560 471600 487692 507365 531991 563666 604353
61013F04353N0818O1560P3144Q4997R3665R3467Q0696N7590L1637J0566j772n195
$$ 604353 655171 716731 789875 874872 968537 1062004 1142700 1200290 1231927 1242493 1240721 1235526
61001A235526p50R645K1463K7625K2219M609k0297m5580o5894p8575q3113q0592
$$ 1235526 1234776 1244421 1265884 1293509 1315728 1320337 1300040 1254460 1188566 1109991 1026878 946286
60989I46286p3255o3614n3499m3852l5127k7546k1055j5483j0813p192m703l289
$$ 946286 873031 809417 755918 712066 676939 649393 628338 612855 602042 594850 590147 586858
60977E86858k815k964l120k803k243k177k894l763l974l463k880k896l760n288
$$ 586858 584043 581079 577959 575156 572913 570736 567842 564079 560105 556642 553762 550866 547106 541818
60963E41818o812p359o472m898l978m193m773m840m532m612n401o529p518q117
$$ 541818 535006 527647 521175 516277 512299 508106 503333 498493 493961 489349 483948 477419 469901 461784
60949D61784q149p601o868o536o657o605n857m614l393k265q50R94K862M220M830
$$ 461784 453635 446034 439166 432630 425973 419368 413511 408897 405504 403239 402389 403383 406245 410465 415295
60934D15295M699L887K622J397O85M83M11J92q9k67m34p77j208j348r75l51J8
$$ 415295 419994 423881 426503 427900 428585 429068 429479 429671 429582 429315 428881 428104 426896 425548 424573 424222 424240
60917D24240q7m12n76m97k83J69J182K763M312N170N331N228M986M267K958J514
$$ 424240 424153 423741 423165 422668 422385 422554 423736 426499 430811 435981 441312 446540 451526 455793 458751 460265
60901D60265L57n84j473k111k313k447l015l943m777n396n931o160n691m777m162
$$ 460265 460622 460038 458565 456454 454141 451694 448679 444736 439959 434563 428632 422472 416781 412004 407842
60886D07842m023l788l157k546k167j517l07Q31J340J763K919M537N637N969O085
$$ 407842 403819 400031 396874 394328 392161 390644 390337 391168 392508 394271 397190 401727 407364 413333 419418
60871D19418O123N535M151K585J393N65R7L56J397K623L475M012M444M560M053
$$ 419418 425541 431076 435227 437812 439205 439770 439867 440223 441620 444243 447718 451730 456174 460734 464787
60856D64787L075K054J235O71L96L78N04Q01J286J598J224L03l89m81m48o90q24
$$ 464787 467862 469916 471151 471822 472218 472596 473100 473901 475187 476785 478009 478312 477923 477442 476994 476304 475480
60839D75480m76j37m88j285j713j541j196q51l25J90M4r92k361l421l998m222
$$ 475480 475004 474867 474379 473094 471381 469840 468644 467793 467468 467658 467702 466710 464349 460928 456930 452708
60823D52708m285m503n172o066o500o025m867l606k713k391k554k844k903k709
$$ 452708 448423 443920 438748 432682 426182 420157 415290 411684 408971 406580 404026 401182 398279 395570
60809C95570k395j936j292p82p04p30k57O23J191J216J237J504J463Q04K64N83
$$ 395570 393175 391239 389947 389165 388461 387731 387474 388097 389288 390504 391741 393245 394708 395512 395776 396359
60793C96359J240J168M97N52J958L578L875K779J702J812K819L500L149K267J881
$$ 396359 397599 398767 399264 399816 401774 405352 409227 412006 413708 415520 418339 421839 424988 427255 429136
60778D29136K404L303L796L608L007K394K038K035K261K412K307K141K228K541
$$ 429136 431540 434843 438639 442247 445254 447648 449686 451721 453982 456394 458701 460842 463070 465611
60764D65611K734K614K362K172J939J499J015Q02Q24O60J01n84j182j992l349
$$ 465611 468345 470959 473321 475493 477432 478931 479946 480748 481572 482232 482333 481749 480567 478575 475226
60749D75226m873n735n755n637n956o452o596o392o106n649m858m100l893m017
$$ 475226 470353 464618 458863 453226 447270 440818 434222 427830 421724 416075 411217 407117 403224 399207
60735C99207l686k676j641j142r37n04J79P16Q81Q50R57J357J843K030J856J686
$$ 399207 395521 392845 391204 390062 389125 388621 388800 389516 390397 391247 392204 393561 395404 397434 399290 400976
60719D00976J710J538Q49J08k5K11N6m71o32m41q89k361l848m422m430m522m415
$$ 400976 402686 404224 405073 405181 405156 405367 405423 404952 404320 403879 402990 400629 396781 392359 387929 383407 378992
60702C78992l700l081l570m788n346m828m228m346m706m405l319k096j380j271
$$ 378992 375292 372211 368641 363853 358507 353679 349451 345105 340399 335994 332675 330579 329199 327928
60688C27928j280q11O4N53K35j66K68J238J600R65R9k41nO49J636K486K531J827
$$ 327928 326648 325837 325901 326454 326689 326523 326791 328029 329629 330594 330693 330452 330447 331096 332732 335218 337749 339576
60670C39576J239J305J723K145K696L359L675L622L971N144O366O718O486O593
$$ 339576 340815 342120 343843 345988 348684 352043 355718 359340 363311 368455 374821 381539 388025 394618
60656C94618P067P082O368N698N726O056N812M788L614K875K412J680P11K98R26
$$ 394618 401685 408767 415135 420833 426559 432615 438427 443215 446829 449704 452116 453796 454507 454805 455731
60641D55731J911K186J768J665K221K436J398m14j812k324k318k216k249k605
$$ 455731 457642 459828 461596 463261 465482 467918 469316 468902 467090 464766 462448 460232 457983 455378
60627D55378l146l256k599j784j553j682j369n26J80M17N03N74K95m49j232j699
$$ 455378 452232 448976 446377 444593 443040 441358 439989 439463 439643 440060 440563 441137 441432 440983 439751 438052
60611D38052j959k162k220k135k114k229k349k422k442k085j099k6K24k93m52
$$ 438052 436093 433931 431711 429576 427462 425233 422884 420462 418020 415935 414836 414810 415034 414741 414289
60596D14289M05J557K018J819J555J321Q14J80j39j22o6J32Q32J804K222J653
$$ 414289 414694 416251 418269 420088 421643 422964 423778 423958 423819 423697 423631 423763 424595 426399 428621 430274
60580D30274N54l76q56r20n74J17Q46J266J286J086R07R16J131J350J298R10M59
$$ 430274 430828 430452 429596 428676 428102 428219 429065 430331 431617 432703 433610 434526 435657 437007 438305 439215 439674
60563D39674L10N57Q96R20O46O45J461K887M121M731N179O188P933J0116J2552
$$ 439674 439984 440541 441437 442357 443003 443648 445109 447996 452117 456848 462027 468215 476148 486264 498816
60548D98816J5235J8053K0959K4302K8481L3149L7222L9728M0308L8820L5049
$$ 498816 514051 532104 553063 577365 605846 638995 676217 715945 756253 795073 830122
60537H30122K9029K1242J2198K166q284j7757k4609k8144k8964k8199k6624k4509
$$ 830122 859151 880393 892591 894757 886473 868716 844107 815963 786999 758800 732176 707667
60525G07667k1930j9033j6091j3415j1113q941o488l668r18J214K677M044N999
$$ 707667 685737 666704 650613 637198 626085 617144 610656 606988 606070 607284 609961 614005 620004
60512F20004Q809J2314J6303K0636K5060K9197L2829L5908L8113L8628L6664L2124
$$ 620004 628813 641127 657430 678066 703126 732323 765152 801060 839173 877801 914465 946589
60500I46589K5487J7287Q198n14p241j1092j2294j1441q727m120K217J0187K0014
$$ 946589 972076 989363 997561 997047 989806 978714 966420 954979 946252 942132 944349 954536 974550
60487I74550L1737M4627N7780P1163Q5500J00952J16426J30190J40591J45827
$$ 974550 1006287 1050914 1108694 1179857 1265357 1366309 1482735 1612925 1753516 1899343
60477A899343J43655J32068J10443P9888M2768K227l8087p4511j04215j25708
$$ 1899343 2042998 2175066 2285509 2365397 2408165 2410392 2372305 2297794 2193579 2067871
60467B067871j38666j43562j41486j34143j23642j12003j00576q9757p9323o9206
$$ 2067871 1929205 1785643 1644157 1510014 1386372 1274369 1173793 1084036 1004713 935507
60457I35507o0029n2635m7119m2543l7868l3006k8669k5314k2589j9956j7369
$$ 935507 875478 822843 775724 733181 695313 662307 633638 608324 585735 565779 548410
60446E48410j5110j3255j1704j0547r939r631r105q218p266o394n453m571m246
$$ 548410 533300 520045 508341 497794 487855 478224 469119 460901 453635 447241 441788 437217 432971
60433D32971m464m394l468k354k094k629k960k625k099j730j233m60J39L34N81
$$ 432971 428507 424113 420645 418291 416197 413568 410608 407983 405884 404154 402921 402461 402600 402934 403515
60418D03515J246J911K084K009K094K078J519Q16P74J422K040K452L259M667N920
$$ 403515 404761 406672 408756 410765 412859 414937 416456 417272 418046 419468 421508 423960 427219 431886 437806
60403D37806O332O227O362O887P408P672P708P475O926O233N568M744L457J914
$$ 437806 444138 450365 456727 463614 471022 478694 486402 493877 500803 507036 512604 517348 520805 522719
60389E22719Q07O08J086J607J675J186M16j94l40r4K29L79L68L46M32O21Q38J016
$$ 522719 523526 524134 525220 526827 528502 529688 530104 529910 529570 529476 529705 530084 530452 530798 531230 531851 532689 533705
60371E33705J132J211J210R90M31l71r95r07K1J116J318K29j343k228k188j953
$$ 533705 534837 536048 537258 538248 538679 538308 537313 536406 536427 537543 538861 539090 537747 535519 533331 531378
60355E31378k043k126j787j290j112j088o45K65J042J234J028Q18P41P37P59P39
$$ 531378 529335 527209 525422 524132 523020 521932 521287 521552 522594 523828 524856 525674 526415 527152 527911 528650
60339E28650N68K43j27m96q58j106j122j063j199j453j462j234j303k009k996
$$ 528650 529218 529461 529334 528838 527980 526874 525752 524689 523490 522037 520575 519341 518038 516029 513033
60324E13033l678l965m097m051l551k634j762j314j228j187r02k65N44J049Q42
$$ 513033 509355 505390 501293 497242 493691 491057 489295 487981 486753 485566 484664 484399 484943 485992 486834
60309D86834L5q07j233j189q55n08n77j410k775l877m108l604k918k399k129k123
$$ 486834 486869 486062 484829 483640 482785 482277 481700 480290 477515 473638 469530 465926 463008 460609 458480 456357
60293D56357k232k052j336m23J59M09P32J169J336J247J523K386L017K573J526
$$ 456357 454125 452073 450737 450314 450473 450882 451614 452783 454119 455366 456889 459275 462292 464865 466391
60278D66391J256K294L626L997L387K832L113M011M787N054N080N374O023O475
$$ 466391 467647 469941 473567 477564 480951 483783 486896 490907 495694 500748 505828 511202 517225 523700
60264E23700O142N183M494M778N822O877P532P943Q313Q489Q169P289O204N545
$$ 523700 529842 535025 539519 544297 550119 556996 564528 572471 580784 589273 597442 604731 610935 616480
60250F16480N855P092Q546R489R931J0434J1247J2024J2507J3044J4069J5455
$$ 616480 622335 629427 637973 647462 657393 667827 679074 691098 703605 716649 730718 746173
60238G46173J6897J8647K1260K4655K8022L0876L3703L7189M1283M5396M9317
$$ 746173 763070 781717 802977 827632 855654 886530 920233 957422 998705 1044101 1093418
60227A093418N3418N7951O2587O6738P0090P2724P4861P6544P7427P6896P4497
$$ 1093418 1146836 1204787 1267374 1334112 1404202 1476926 1551787 1628331 1705758 1782654 1857151
60216A857151P0331O4899N8603N1487M3464L4583K5207J6009P726N08o305j3352
$$ 1857151 1927482 1992381 2050984 2102471 2145935 2180518 2205725 2221734 2229460 2229968 2223663 2210311
60204B210311k0136k5241k7859k8559k8292k7100k4420k0282j5385j0121m194
$$ 2210311 2190175 2164934 2137075 2108516 2080224 2053124 2028704 2008422 1993037 1982916 1978722
60193A978722K594R852J7193K4863L3323M2421N1452N9839O7470P4326Q0030Q3829
$$ 1978722 1981316 1991168 2008361 2033224 2066547 2108968 2160420 2220259 2287729 2362055 2442085 2525914
60181B525914Q4955Q3094P8583P2068O3827N3635M1418K7861J4065P07j2244k4991
$$ 2525914 2610869 2693963 2772546 2844614 2908441 2962076 3003494 3031355 3045420 3046127 3033883 3008892
60169C008892l7443m9265n9971o8810p4809p7313p6481p3051o7756o1029n3138
$$ 3008892 2971449 2922184 2862213 2793403 2718594 2641281 2564800 2491749 2423993 2362964 2309826
60158B309826m4287l4522k3894j2800j932Q270J7946K7322L6109M3632M9387N3114
$$ 2309826 2265539 2231017 2207123 2194323 2192391 2200661 2218607 2245929 2282038 2325670 2375057 2428171
60146B428171N4440N3006M9101M3649L7319K9953K1230J1557J858p227j5507k2703
$$ 2428171 2482611 2535617 2584718 2628367 2665686 2695639 2716869 2728426 2730284 2723057 2707550 2684847
60134B684847k8296l1854l3079l1629k7373k0919j3332n133L939J4118K5051L6387
$$ 2684847 2656551 2624697 2591618 2559989 2532616 2511697 2498365 2493232 2497171 2511289 2536340 2572727
60122B572727M8344O1295P5079Q9219J03572J18340J33548J48819J63578J77120
$$ 2572727 2621071 2682366 2757445 2846664 2950236 3068576 3202124 3350943 3514521 3691641
60112C691641J88703J97893K04650K08843K09820K06883J99934J89275J74912
$$ 3691641 3880344 4078237 4282887 4491730 4701550 4908433 5108367 5297642 5472554
60103E472554J56613J34638J09888Q3234N5072K5702m190l3592o1420q6750j09039
$$ 5472554 5629167 5763805 5873693 5956927 6011999 6037701 6033511 5999919 5938499 5851749 5742710
60092E742710j28253j44466j57319j66189j70887j71809j69292j63323j54140
$$ 5742710 5614457 5469991 5312672 5146483 4975596 4803787 4634495 4471172 4317032
60083D317032j42677j30067j16886j03190q9017p4542n9921m5324l1041j7296
$$ 4317032 4174355 4044288 3927402 3824212 3735195 3660653 3600732 3555408 3524367 3507071
60073C507071m178P982J8391K6352L2039L6193L9022L9866L8130L4132K8691K2108
$$ 3507071 3502893 3510875 3529266 3555618 3587657 3623850 3662872 3702738 3740868 3775000 3803691 3825799
60061C825799J4060M400o264j6941k7007l6393m5264n3720o1734o9132p5507q0307
$$ 3825799 3839859 3844259 3837995 3821054 3794047 3757654 3712390 3658670 3596936 3527804 3452297 3371990
60049C371990q3197q4246q3724q1757p8309p3416o7283o0181n2306m3746l4456
$$ 3371990 3288793 3204547 3120823 3039066 2960757 2887341 2820058 2759877 2707571 2663825 2629369
60038B629369k4347j3475k118R443K1199L3295M5672N7877O9214P8889Q6228R0969
$$ 2629369 2605022 2591547 2589429 2598872 2620071 2653366 2699038 2756915 2826129 2905018 2991246 3082215
60026C082215R3318R3424R0819Q4710P4974O2511M8464L3381J7360P15j6001l2463
$$ 3082215 3175533 3268957 3359776 3444486 3519460 3581971 3630435 3663816 3681176 3681891 3665890 3633427
60014C633427m8566o3860p7285q7755r4871r8982j00636j00069r7247r2204q5280
$$ 3633427 3584861 3521001 3443716 3355961 3261090 3162108 3061472 2961403 2864156 2771952 2686672
60003B686672p6955o7610n7561m7223l6980k6742j5885l884R079K2269L5115M7605
$$ 2686672 2609717 2542107 2484546 2437323 2400343 2373601 2357716 2353832 2362911 2385180 2420295 2467900
59991B467900O0079P2845Q5939R8960J10972J20750J27313J30240J29489J25047
$$ 2467900 2527979 2600824 2686763 2785723 2896695 3017445 3144758 3274998 3404487 3529534
59981C529534J16848J05055R0271P3455N5569L7221J8557n68k0219m0046n9110
$$ 3529534 3646382 3751437 3841708 3915163 3970732 4007953 4026510 4025942 4005723 3965677 3906567
59970C906567p6119q9947j00037j06252j08471j06607j01046r2753q2691p1326
$$ 3906567 3830448 3740501 3640464 3534212 3425741 3319134 3218088 3125335 3042644 2971318
59960B971318n8923m6048l3344k0836q057M999J7445K8440L8238M7833N7553O6494
$$ 2971318 2912395 2866347 2833003 2812167 2804110 2809109 2826554 2854994 2893232 2941065 2998618 3065112
59948C065112P3425P7877Q0090Q0313P8548P4845O9405O2375N3978M4886L6042
$$ 3065112 3138537 3216414 3296504 3376817 3455365 3530210 3599615 3661990 3715968 3760854 3796896
59937C796896K7836J9869J1884M623o87l553m287k971R49P779J6890K7457L9492
$$ 3796896 3824732 3844601 3856485 3861108 3860421 3856868 3852581 3849610 3850559 3858338 3875228 3902685 3942177
59924C942177N3583O9727Q6961J04198J20929J37011J52132J65664J76782J84542
$$ 3942177 3995760 4065487 4152448 4256646 4377575 4514586 4666718 4832382 5009164 5193706
59914E193706J88057J86795J80543J68956J51434J27741R8698O6007L1459l453
$$ 5193706 5381763 5568558 5749101 5918057 6069491 6197232 6295930 6361937 6393396 6389943
59904F389943l7319o8694r6442j19943j38760j52311j60209j62856j61311j56501
$$ 6389943 6352624 6283930 6187488 6067545 5928785 5776474 5616265 5453409 5292098 5135597
59894E135597j48776j38325j25664j11500r6311q0324o3820m7171l0614j4235
$$ 5135597 4986821 4848496 4722832 4611332 4515021 4434697 4370877 4323706 4293092 4278857
59884D278857J869J7608L3000M7951O1990P4489Q5078R3487R8889J00035R6283
$$ 4278857 4280726 4298334 4331334 4379285 4441275 4515764 4600842 4694329 4793218 4893253 4989536
59873D989536Q8186P6624O1790M3483K2260k91k2536m3589o3101q0685r5896j08527
$$ 4989536 5077722 5154346 5216136 5259619 5281879 5281588 5259052 5215463 5152362 5071677 4975781 4867254
59861D867254j18632j26337j31781j35174j36713j36437j34227j30005j23904
$$ 4867254 4748622 4622285 4490504 4355330 4218617 4082180 3947953 3817948 3694044
59852C694044j16292j07637r8363q8844p9477p0686o2809n5962n0045m4767l9731
$$ 3694044 3577752 3470115 3371752 3282908 3203431 3132745 3069936 3013974 2963929 2919162 2879431
59841B879431l4697k9849k5663k2383j9756j7469j5589j4415j3995j4205j5119
$$ 2879431 2844734 2814885 2789222 2766839 2747083 2729614 2714025 2699610 2685615 2671410 2656291
59830B656291j6929j9370k1645k3078k3558k3208k1964j9809j7182j4736j2660
$$ 2656291 2639362 2619992 2598347 2575269 2551711 2528503 2506539 2486730 2469548 2454812 2442152
59819B442152j0571q074n206k178R98M364P603J0090J1439J1845J1744J1290J0369
$$ 2442152 2431581 2423507 2418301 2416123 2417121 2421485 2429088 2439178 2450617 2462462 2474206 2485496 2495865
59806B495865Q943P137M917K094j198m262o368p354p398o416m060l24M277R298
$$ 2495865 2504808 2511945 2516862 2518956 2517758 2513496 2507128 2499774 2492376 2485960 2481900 2481576 2485853 2495151
59792B495151J4885K1593K9910M0084N2202O6261Q2243J00241J20314J42174J65161
$$ 2495151 2510036 2531629 2561539 2601623 2653825 2720086 2802329 2902570 3022884 3165058 3330219
59781C330219J88481K11078K30880K44338K46997K34705K04853J57540R6525K8891
$$ 3330219 3518700 3729778 3960658 4204996 4451993 4686698 4891551 5049091 5145616 5174507
59771E174507l7154r5022j40869j72951j90869j95781j90537j78725j63196j45547
$$ 5174507 5137353 5042331 4901462 4728511 4537642 4341861 4151324 3972599 3809403 3663856
59761C663856j26723j07722q9603p3019n7950m3963l0789j8666q011J220R648
$$ 3663856 3537133 3429411 3339808 3266789 3208839 3164876 3134087 3115421 3107410 3108630 3118278
59750C118278J7886K6044L3982M1790M9667N7463O4827P1919P9549Q8434R8587
$$ 3118278 3136164 3162208 3196190 3237980 3287647 3345110 3409937 3481856 3561405 3649839 3748426
59739C748426J09639J21489J34250J47823J62063J77324J94384K13604K34462
$$ 3748426 3858065 3979554 4113804 4261627 4423690 4601014 4795398 5009002 5243464
59730E243464K56098K78020L00078L21844L42319L60074L73463L80810L80795
$$ 5243464 5499562 5777582 6077660 6399504 6741823 7101897 7475360 7856170 8236965
59721H236965L72915L57578L35827L09154K79591K49689K21946J98071J78778
$$ 8236965 8609880 8967458 9303285 9612439 9892030 10141719 10363665 10561736 10740514
59712A0740514J64259J54700J50071J49562J51547J54338J56743J57740J56011
$$ 10740514 10904773 11059473 11209544 11359106 11510653 11664991 11821734 11979474 12135485
59703A2135485J50478J41224J29292J15480R9825Q2529O4752M8018L3197K0561
$$ 12135485 12285963 12427187 12556479 12671959 12771784 12854313 12919065 12967083 13000280 13020841
59693A3020841J0552L889J135K655Q888K0143L6130N6257Q0298J08209J39297
$$ 13020841 13031393 13035282 13036417 13039072 13047960 13068103 13104233 13160490 13240788 13348997 13488294
59682A3488294J72256K06198K40984K76119L09862L39916L64598L82888L93546
$$ 13488294 13660550 13866748 14107732 14383851 14693713 15033629 15398227 15781115 16174661
59673A6174661L94673L84168L60396L22638K71231K07350J32668M9583l8208j25845
$$ 16174661 16569334 16953502 17313898 17636536 17907767 18115117 18247785 18297368 18259160 18133315
59663A8133315k08558k82625l45079l93248m25422m41904m44836m37160m22332
$$ 18133315 17924757 17642132 17297053 16903805 16478383 16036479 15591643 15154483 14732151
59654A4732151m04949l90703l85013l91493m11056m41424m77207n11371n37753
$$ 14732151 14327202 13936499 13551486 13159993 12748937 12307513 11830306 11318935 10781182
59645A0781182n52739n55103n45223n24972m97591m66566m34211m01509l69120
$$ 10781182 10228443 9673340 9128117 8603145 8105554 7638988 7204777 6803268 6434148
59636F434148l38014l09045k82392k57685k34615k13264j93915j76619j60987
$$ 6434148 6096134 5787089 5504697 5247012 5012397 4799133 4605218 4428599 4267612
59627D267612j46451j32784j20154j08618r7784q7301p7484o9026o2040n5827
$$ 4267612 4121161 3988377 3868223 3759605 3661821 3574520 3497036 3428010 3365970 3310143
59617C310143m9740m3996l9333l6203l4500l3948l4261l5035l5894l6912l8540
$$ 3310143 3260403 3216407 3177074 3140871 3106371 3072423 3038162 3003127 2967233 2930321 2891781
59606B891781m0871m3160m4421m4448m3902m3367m2679m1367l9489l7513l5540
$$ 2891781 2850910 2807750 2763329 2718881 2674979 2631612 2588933 2547566 2508077 2470564 2435024
59595B435024l3070k9834k6407k3635k1581j9545j7010j4134j1162p947m397r75
$$ 2435024 2401954 2372120 2345713 2322078 2300497 2280952 2263942 2249808 2238646 2230699 2226302 2225327
59583B225327J791M104O634R505J2136J4192J6119J8437K0978K3272K5343K7659
$$ 2225327 2227118 2231222 2237856 2247361 2259497 2273689 2289808 2308245 2329223 2352495 2377838 2405497
59571B405497L0398L3251L5913L8405M0919M3710M7197N1706N7027O2437O7443
$$ 2405497 2435895 2469146 2505059 2543464 2584383 2628093 2675290 2726996 2784023 2846460 2913903
59560B913903P2236P7307Q2771Q8351R3868R9509J05497J11641J17315J21923
$$ 2913903 2986139 3063446 3146217 3234568 3328436 3427945 3533442 3645083 3762398 3884321
59550C884321J25256J27100J26451J21622J11686R7765Q2370O7375N3054L9098
$$ 3884321 4009577 4136677 4263128 4384750 4496436 4594201 4676571 4743946 4797000 4836098
59540D836098K5801J3722K636q339j9598l0559m0488m9279n7224o4281o9967p3866
$$ 4836098 4861899 4875621 4878257 4869918 4850320 4819761 4779273 4729994 4672770 4608489 4538522 4464656
59528D464656p5936p6261p4618p0561o3983n5464m5858l5444k3670r775O428K4423
$$ 4464656 4388720 4312459 4237841 4167280 4103297 4047833 4001975 3966531 3942861 3933086 3939514 3963937
59516C963937M3416O2711Q1877J00800J19474J37494J53794J67018J76056J80008
$$ 3963937 4007353 4070064 4151941 4252741 4372215 4509709 4663503 4830521 5006577 5186585
59506E186585J77818J68428J51495J27728R8444O5058K9073p753m3652p7223j07385
$$ 5186585 5364403 5532831 5684326 5812054 5910498 5975556 6004629 5996876 5953224 5876001 5768616
59495E768616j33117j53489j68001j76631j79520j76895j69442j58450j45246
$$ 5768616 5635499 5482010 5314009 5137378 4957858 4780963 4611521 4453071 4307825
59486D307825j30484j14284r6988p9442o2390m5909k9724j3936Q95J4204K5747
$$ 4307825 4177341 4063057 3966069 3886627 3824237 3778328 3748604 3734668 3735563 3749767 3775514
59475C775514L5524M3635N0114N4613N6402N4955N0551M3918L5360K4646J1715
$$ 3775514 3811038 3854673 3904787 3959400 4015802 4070757 4121308 4165226 4200586 4225232 4236947
59464D236947l008j8991l5665n2033o6907p9922r1668j02379j11092j16800j19896
$$ 4236947 4233939 4214948 4179283 4127250 4060343 3980421 3888753 3786374 3675282 3558482 3438586
59453C438586j21639j22445j21640j18843j14730j10233j05622j00690r5338q9636
$$ 3438586 3316947 3194502 3072862 2954019 2839289 2729056 2623434 2522744 2427406 2337770
59443B337770q3668p7578p1545o5624n9755n4023m8636m3683l9132l4992l1121
$$ 2337770 2254102 2176524 2104979 2039355 1979600 1925577 1876941 1833258 1794126 1759134 1728013
59432A728013k6993k2139j6797j1673p042k538K209P177J2134J6428J8603J7153
$$ 1728013 1701020 1678881 1662084 1650411 1643369 1640831 1643040 1650217 1662351 1678779 1697382 1714535
59420A714535J2202N901Q16j703j443J463O668J3692K2478L3115M4108N1573N1475
$$ 1714535 1726737 1732638 1733454 1731751 1730308 1731771 1738439 1752131 1774609 1807724 1851832 1903405 1954880
59407A954880M2885K8444J1899l935j7101k5937k9532k8278k3422j6304q095K27
$$ 1954880 1997765 2026209 2038108 2034173 2017072 1991135 1961603 1933325 1909903 1893599 1885504 1885731
59395A885731Q173J5791K3223L0347L6959M3078M8870N4565O0481O6839P3389
$$ 1885731 1893904 1909695 1932918 1963265 2000224 2043302 2092172 2146737 2207218 2274057 2347446
59384B347446P9619Q5454R1471R8204J05625J13598J22500J32921J44958J58262
$$ 2347446 2427065 2512519 2603990 2702194 2807819 2921417 3043917 3176838 3321796 3480058
59374C480058J72774J89058K07782K29037K52172K76088K99668L22101L42816
$$ 3480058 3652832 3841890 4049672 4278709 4530881 4806969 5106637 5428738 5771554
59365E771554L61024L75391L84333L86756L82486L72048L56137L35347L10299
$$ 5771554 6132578 6507969 6892302 7279058 7661544 8033592 8389729 8725076 9035375
59356I035375K81889K51306K19639J87349J54166J19534Q3093M4720M273l8382
$$ 9035375 9317264 9568570 9788209 9975558 10129724 10249258 10332351 10377071 10381344 10342962
59346A0342962q3010j28814j74691k19541k62139l00889l34018l60174l78736
$$ 10342962 10259952 10131138 9956447 9736906 9474767 9173878 8839860 8479686 8100950
59337H100950l89465l92228l87357l76130l60512l42208l22265l01450k80638
$$ 8100950 7711485 7319257 6931900 6555770 6195258 5853050 5530785 5229335 4948697
59328D948697k60430k40813k21499k02583j84549j67807j52430j38350j25443
$$ 4948697 4688267 4447454 4225955 4023372 3838823 3671016 3518586 3380236 3254793
59319C254793j13490j02315r1995q2722p4423o6776n9578n2877m6740m1183l6216
$$ 3254793 3141303 3038988 2946993 2864271 2789848 2723072 2663494 2610617 2563877 2522694 2486478
59308B486478l1772k7505k3030j8444j4317j0980q145n297k307N53K988M955O738
$$ 2486478 2454706 2427201 2404171 2385727 2371410 2360430 2352285 2346988 2344681 2345234 2348222 2353177 2359915
59295B359915Q842J1537J4484J6978J8830K0625K3017K5974K8965L1559L3607
$$ 2359915 2368757 2380294 2394778 2411756 2430586 2451211 2474228 2500202 2529167 2560726 2594333
59284B594333L5103L6221L7185L7792L7319L5324L2269K8767K4467J8415J0512
$$ 2594333 2629436 2665657 2702842 2740634 2777953 2813277 2845546 2874313 2898780 2917195 2927707
59273B927707J874o470j4482k2383k9793l6257m2067m7794n3177n7266n9651o0825
$$ 2927707 2929581 2923111 2908629 2886246 2856453 2820196 2778129 2730335 2677158 2619892 2560241 2499416
59261B499416o1297o1100o0386n9729n9366n8641n6807n4028n1036m8087m4917
$$ 2499416 2438119 2377019 2316633 2256904 2197538 2138897 2082090 2028062 1977026 1928939 1884022
59250A884022m1558l8367l5234l1529k7119k2753j9032j5591j1786p733m027p85
$$ 1884022 1842464 1804097 1768863 1737334 1710215 1687462 1668430 1652839 1641053 1633320 1629293 1628508
59238A628508K338N410Q286J1292J5040J9376K3350K6543K9780L4062L9336M4935
$$ 1628508 1630846 1636256 1644542 1655834 1670874 1690250 1713600 1740143 1769923 1803985 1843321 1888256
59226A888256N0836N7701O5901P5081Q4810R5056J05998J17837J30956J45757
$$ 1888256 1939092 1996793 2062694 2137775 2222585 2317641 2423639 2541476 2672432 2818189
59216B818189J62042J78901J95451K11367K26335K39226K48298K52213K50426
$$ 2818189 2980231 3159132 3354583 3565950 3792285 4031511 4279809 4532022 4782448
59207D782448K42477K27353K03994J72490J34469R2222M7560J668m4127q7797
$$ 4782448 5024925 5252278 5456272 5628762 5763231 5855453 5903013 5904681 5860554 5772757
59197E772757j27042j60176j86517k05951k18447k24164k23903k19113k11226
$$ 5772757 5645715 5485539 5299022 5093071 4874624 4650460 4426557 4207444 3996218
59188C996218k01100j89187j76096j62705j49676j37214j25350j14266j04095
$$ 3996218 3795118 3605931 3429835 3267130 3117454 2980240 2854890 2740624 2636529
59179B636529r4665q5723p7281o9441o2049n4875m8164m2566l8424l5430l3075
$$ 2636529 2541864 2456141 2378860 2309419 2247370 2192495 2144331 2101765 2063341 2027911 1994836
59168A994836l1150k9643k8481k7570k6890k6412k6029k5699k5438k5072k4261
$$ 1994836 1963686 1934043 1905562 1877992 1851102 1824690 1798661 1772962 1747524 1722452 1698191
59157A698191k2911k1268j9482j7414j5066j2874j1216r913q470o696m767k910
$$ 1698191 1675280 1654012 1634530 1617116 1602050 1589176 1577960 1568047 1559577 1552881 1548114 1545204
59145A545204j316j52O12J209J695J898J918K218K766K708J525kq24j247k415
$$ 1545204 1543888 1543736 1544348 1545557 1547252 1549150 1551068 1553286 1556052 1558760 1560285 1560283 1559459 1558212 1555797
59130A555797m307n479n077m005l567l850m087l836l101j920m97O27J283K136
$$ 1555797 1551490 1546011 1540934 1536929 1533362 1529512 1525425 1521589 1518488 1516568 1516071 1516698 1517981 1520117
59116A520117L822N980P784R035J0002J0546J0356R860R933J0557J0722R892Q821
$$ 1520117 1523939 1529919 1537703 1546738 1556740 1567286 1577642 1587502 1597435 1607992 1618714 1628606 1637427
59103A637427Q492Q939R580J0164J0866J1814J3143J5268J8507K2426K6045K8825
$$ 1637427 1645919 1654858 1664438 1674602 1685468 1697282 1710425 1725693 1744200 1766626 1792671 1821496
59091A821496L1133L3555L6084L8198L9572M0318M0486L9666L7407L3838K9553
$$ 1821496 1852629 1886184 1922268 1960466 2000038 2040356 2080842 2120508 2157915 2191753 2221306
59080B221306K4857J9466J3083N879j769r665j7628k5274l2311l8790m4649m9275
$$ 2221306 2246163 2265629 2278712 2284591 2282822 2273157 2255529 2230255 2197944 2159154 2114505 2065230
59068B065230n2100n3436n4190n4757n4755n3941n2630n1092m9102m6501m3715
$$ 2065230 2013130 1959694 1905504 1850747 1795992 1742051 1689421 1638329 1589227 1542726 1499011
59057A499011m1312l9354l7543l5718l3760l1375k8348k4968k1771j8977j6449
$$ 1499011 1457699 1418345 1380802 1345084 1311324 1279949 1251601 1226633 1204862 1185885 1169436
59046A169436j4121j2119j0495r185q215p725p766q302r354j0904j2617j3907
$$ 1169436 1155315 1143196 1132701 1123516 1115301 1107576 1099810 1091508 1082154 1071250 1058633 1044726
59034A044726j4385j4124j3493j2774j2038j1266j0503r818r113q093o635n104
$$ 1044726 1030341 1016217 1002724 989950 977912 966646 956143 946325 937212 929119 922484 917380
59022I17380m087l738l643l381k932k397j653n94N48J444K143K906L697M221M498
$$ 917380 913293 909555 905912 902531 899599 897202 895549 894955 895503 896947 899090 901996 905693 909914 914412
59007I14412N043O287P988R437J0208J0660J1599J3479J5945J8267K0078K1411
$$ 914412 919455 925742 933730 943167 953375 964035 975634 989113 1005058 1023325 1043403 1064814
58995A064814K2183K2125K1356K0540K0073J9565J8503J7025J5558J3965J1820
$$ 1064814 1086997 1109122 1130478 1151018 1171091 1190656 1209159 1226184 1241742 1255707 1267527
58984A267527R313P183N731M588L529K793K338J547N7j675l053m048m767m816
$$ 1267527 1276840 1284023 1289754 1294342 1297871 1300664 1303002 1304549 1304606 1302931 1299878 1295830 1291063 1286247
58970A286247l776k033l79J037K772N102P593R704J1263J2244J2571J2442J2328
$$ 1286247 1282471 1280438 1280059 1281096 1283868 1288970 1296563 1306267 1317530 1329774 1342345 1354787 1367115
58957A367115J2425J2391J1966J1554J1803J2780J3893J4577J4749J4633J4484
$$ 1367115 1379540 1391931 1403897 1415451 1427254 1440034 1453927 1468504 1483253 1497886 1512370
58946A512370J4520J4816J5135J5112J4814J4892J5996J8085K0547K2997K5620
$$ 1512370 1526890 1541706 1556841 1571953 1586767 1601659 1617655 1635740 1656287 1679284 1704904
58935A704904K8680L1963L4992L7696M0550M3892M7279M9842N1130N1409N1099
$$ 1704904 1733584 1765547 1800539 1838235 1878785 1922677 1969956 2019798 2070928 2122337 2173436
58924B173436N0297M9169M8469M9171N1476N4735N8441O2959O8831P5775Q2911
$$ 2173436 2223733 2272902 2321371 2370542 2422018 2476753 2535194 2598153 2666984 2742759 2825670
58913B825670Q9792R6640J03625J10623J17772J25527J33895J42216J50162J58386
$$ 2825670 2915462 3012102 3115727 3226350 3344122 3469649 3603544 3745760 3895922 4054308
58903D054308J67618J77627J87737J97898K08261K17952K25338K29795K32234
$$ 4054308 4221926 4399553 4587290 4785188 4993449 5211401 5436739 5666534 5898768
58894E898768K33488K32944K29423K22881K14404K04710J93267J78961J61256
$$ 5898768 6132256 6365200 6594623 6817504 7031908 7236618 7429885 7608846 7770102
58885G770102J40611J17995R4003O8426M0765J1280j8739m7862p5424j01310j25230
$$ 7770102 7910713 8028708 8122711 8191137 8231902 8243182 8224443 8176581 8101157 7999847 7874617
58874G874617j46622j65188j80982j93948k03784k10454k14545k16860k17748
$$ 7874617 7727995 7562807 7381825 7187877 6984093 6773639 6559094 6342234 6124486
58865F124486k17018k14483k10397k05297j99489j92949j85675j77921j69876
$$ 6124486 5907468 5692985 5482588 5277291 5077802 4884853 4699178 4521257 4351381
58856D351381j61378j52273j42862j33607j24479j15148j05823r7253q9673q2395
$$ 4351381 4190003 4037730 3894868 3761261 3636782 3521634 3415811 3318558 3228885 3146490
58846C146490p4865o7518o1055n5271m9332m3002l6862l1361k6318k1410j6610
$$ 3146490 3071625 3004107 2943052 2887781 2838449 2795447 2758585 2727224 2700906 2679496 2662886
58835B662886j1990p604l717o62J744M334P841J2283J7139K1849K6013K9509L2705
$$ 2662886 2650896 2643292 2639575 2638913 2640657 2644991 2652832 2665115 2682254 2704103 2730116 2759625 2792330
58822B792330L6320M0751M5698N0546N5012N9273O3627O8304P3493P9366Q6041
$$ 2792330 2828650 2869401 2915099 2965645 3020657 3079930 3143557 3211861 3285354 3364720 3450761
58811C450761R3502J01569J10001J18793J28297J38808J50008J61130J71724J81999
$$ 3450761 3544263 3645832 3755833 3874626 4002923 4141731 4291739 4452869 4624593 4806592
58801D806592J92320K02643K12596K21786K29706K35568K38582K38381K34933
$$ 4806592 4998912 5201555 5414151 5635937 5865643 6101211 6339793 6578174 6813107
58792F813107K28068K17300K02192J82696J59114J31848J01384O8458L4135m86
$$ 6813107 7041175 7258475 7460667 7643363 7802477 7934325 8035709 8104167 8138302 8137816
58782H137816l4623o7833r9642j29340j56285j80138k00621k17227k29628k38245
$$ 8137816 8103193 8035360 7935718 7806378 7650093 7469955 7269334 7052107 6822479 6584234
58772F584234k44017k47430k48195k45968k41049k34132k25732k16214k06157
$$ 6584234 6340217 6092787 5844592 5598624 5357575 5123443 4897711 4681497 4475340
58763D475340j96228j86629j76929j66582j55571j44485j34031j24447j15431
$$ 4475340 4279112 4092483 3915554 3748972 3593401 3448916 3314885 3190438 3075007
58754C075007j06653r8274r0696q3915p7356p0471o3303n6448n0608m6117m2629
$$ 3075007 2968354 2870080 2779384 2695469 2618113 2547642 2484339 2427891 2377283 2331166 2288537
58743B288537l9273l5573l2159l0148k9626k9362k8297k6772k5728k5218k4534
$$ 2288537 2249264 2213691 2181532 2151384 2121758 2092396 2064099 2037327 2011599 1986381 1961847
58732A961847k3642k3531k4869k7015k8834l0124l1670l4024l6667l8558l9214
$$ 1961847 1938205 1914674 1889805 1862790 1833956 1803832 1772162 1738138 1701471 1662913 1623699
58721A623699l8986l8417l7657l6673l5654l4852l4183l3360l2417l1561l0484
$$ 1623699 1584713 1546296 1508639 1471966 1436312 1401460 1367277 1333917 1301500 1269939 1239455
58710A239455k8504k5679k3091k1444j9952j7389j3900j0854r010p796o563n731
$$ 1239455 1210951 1185272 1162181 1140737 1120785 1103396 1089496 1078642 1069632 1061836 1055273 1049542
58698A049542o169q007j0618j3391j6066j8468k0336k1403k1480k0590j9140j7755
$$ 1049542 1043373 1035366 1024748 1011357 995291 976823 956487 935084 913604 893014 873874 856119
58686H56119j6746j5910j4893j3487j1461q630n397k815j553r99J15K223M566
$$ 856119 839373 823463 808570 795083 783622 774992 769595 766780 765227 764228 764343 766566 771132
58673G71132O285P359Q298R286R952R900R211Q414P925P578O833N551M290L493
$$ 771132 777417 784776 793074 802360 812312 822212 831423 839837 847762 855340 862173 867724 872014 875507
58659H75507K641P36k358n691q456j0879j3407j5605j6560j6157j5170j4073j2541
$$ 875507 878148 878884 876526 870835 862379 851500 838093 822488 805928 789771 774601 760528 747987
58646G47987j0375q190o639n442l851j836j81N71P24Q73J283J995L085M507N918
$$ 747987 737612 729422 722783 717341 713490 711654 711473 712044 712768 713641 714924 716919 720004 724511 730429
58631G30429O957P550P805P853P997Q701J0158J2007J3760J5364J7013J8622J9877
$$ 730429 737386 744936 752741 760594 768591 777292 787450 799457 813217 828581 845594 864216 884093
58618H84093K0810K1965K3906K6732L0092L3402L6073L7827L9017M0434M2598
$$ 884093 904903 926868 950774 977506 1007598 1041000 1077073 1114900 1153917 1194351 1236949
58607A236949M5331M8055N0470N2816N5559N8880O2445O5668O8110O9581O9967
$$ 1236949 1282280 1330335 1380805 1433621 1489180 1548060 1610505 1676173 1744283 1813864 1883831
58596A883831O9169O7239O4215N9765N3255M4467L4029K2837J1375j19j1095k0938
$$ 1883831 1953000 2020239 2084454 2144219 2197474 2241941 2275970 2298807 2310182 2310063 2298968 2278030
58584B278030k9589l7397m4265m9532n2804n4430n4960n4545n3089n0685m7659
$$ 2278030 2248441 2211044 2166779 2117247 2064443 2010013 1955053 1900508 1847419 1796734 1749075
58573A749075m4372m1060l7622l3639k9044k4678k1611j9819j8215j6275j4838
$$ 1749075 1704703 1663643 1626021 1592382 1563338 1538660 1517049 1497230 1479015 1462740 1447902
58562A447902j4883j6216j7984j9868k1906k3625k4318k4105k3803k3760k3559
$$ 1447902 1433019 1416803 1398819 1378951 1357045 1333420 1309102 1284997 1261194 1237434 1213875
58551A213875k2952k2224k1495k0348j8517j6347j4358j2836j2170j2904j5017
$$ 1213875 1190923 1168699 1147204 1126856 1108339 1091992 1077634 1064798 1052628 1039724 1024707
58540A024707j7587j9698k1318k2842k4106k4436k3564k2022k0620j9863j9716
$$ 1024707 1007120 987422 966104 943262 919156 894720 871156 849134 828514 808651 788935
58529G88935j9570j8558j6370j3742j1797j0844j0250r433q538p945p599p182
$$ 788935 769365 750807 734437 720695 708898 698054 687804 678371 669833 661888 654289 647107
58517F47107o655o209n739m816l269j537k48L75O19R35J662K916M523N939O628
$$ 647107 640452 634243 628504 623688 620419 618882 618634 619009 619628 620563 622225 625141 629664 635603 642231
58502F42231O643O660P191P955Q310Q182Q073Q169Q074P648P549Q356R494R704
$$ 642231 648874 655534 662725 670680 678990 687172 695245 703414 711488 719136 726685 735041 744535 754239
58488G54239Q519O644M863L208J409m38k080l586n152o704q063r308j0506j1327
$$ 754239 762758 769402 774265 777473 778882 778444 776364 772778 767626 760922 752859 743551 733045 721718
58474G21718j1434j1114j0984j1134j1083j0644j0203r984r638q896q085p552
$$ 721718 710284 699170 688186 677052 665969 655325 645122 635138 625500 616604 608519 600967
58462F00967p050o216n335m977n095n099m722m187l558k634j602j057j085r30
$$ 600967 593917 587701 582366 577389 572294 567195 562473 558286 554728 552094 550492 549435 548350 547420
58448E47420l0J107J568J243P95O48O61P72J374K735M444N681O001N696N462N698
$$ 547420 547390 548497 550065 551308 552103 552751 553412 554184 555558 558293 562737 568418 574419 580115 585577 591275
58432E91275O182O440O408O439O558O131M675K774J586J451J538J061K90m2J14
$$ 591275 597457 603897 610305 616744 623302 629433 634108 636882 638468 639919 641457 642518 642808 642766 642880
58417F42880R4m31r81r94o23n11r35j453j442p92M6O23R08J196J707K417L185
$$ 642880 642974 642543 641562 640568 639945 639434 638499 637046 635604 634812 634858 635481 636389 637585 639292 641709 644894
58400F44894L835M163L991L403K838K802L409M267M823M841M533M294M420N033
$$ 644894 648729 652892 656883 660286 663124 665926 669335 673602 678425 683266 687799 692093 696513 701546
58386G01546O091P352Q449R247J0033J1103J2178J2547J1940J0902J0062R316
$$ 701546 707637 714989 723438 732685 742718 753821 765999 778546 790486 801388 811450 820766
58374H20766Q098O375M859M202M263M369M064L455K964K928L415M250N173N924
$$ 820766 828864 835239 840098 844300 848563 852932 856996 860451 863415 866343 869758 874008 879181 885105
58360H85105O276O143N744N514N708O148O540O883P399Q124Q808R184R063Q290
$$ 885105 891381 897524 903268 908782 914490 920638 927178 934061 941460 949584 958392 967576 976639 984929
58346I84929P020O083O542Q513J0734J1696J1156J0171R715R694R493R145R372
$$ 984929 991949 998032 1004574 1013087 1023821 1035517 1046673 1056844 1066559 1076253 1085746 1094891 1104263
58333A104263J0516J1798J2067J1216J0481J1148J3188J5380J6648J6979J7059
$$ 1104263 1114779 1126577 1138644 1149860 1160341 1171489 1184677 1200057 1216705 1233684 1250743
58322A250743J7382J7865J8213J8343J8458J8743J9128J9347J9175J8554J7596
$$ 1250743 1268125 1285990 1304203 1322546 1341004 1359747 1378875 1398222 1417397 1435951 1453547
58311A453547J6694J6481J7259J8404J8824J8298J7940J8853K0678K2086K2561
$$ 1453547 1470241 1486722 1503981 1522385 1541209 1559507 1577447 1596300 1616978 1639064 1661625
58300A661625K2922K4057K5772K7228K8050K8624K9529L0930L2478L3712L4602
$$ 1661625 1684547 1708604 1734376 1761604 1789654 1818278 1847807 1878737 1911215 1944927 1979529
58289A979529L5635L7123L8648L9572M0002M0722M2153M3907M5499M7006M8860
$$ 1979529 2015164 2052287 2090935 2130507 2170509 2211231 2253384 2297291 2342790 2389796 2438656
58278B438656N1415N4831N8956O3158O6721O9502P1735P3188P3207P1764O9644
$$ 2438656 2490071 2544902 2603858 2667016 2733737 2803239 2874974 2948162 3021369 3093133 3162777
58267C162777O7290O4358O0919N8228N7463N8336N9786O1556O4145O7600P1386
$$ 3162777 3230067 3294425 3355344 3413572 3471035 3529371 3589157 3650713 3714858 3782458 3853844
58256C853844P5380Q0033Q5436R0959R6056J00906J06117J12118J18873J25933
$$ 3853844 3929224 4009257 4094693 4185652 4281708 4382614 4488731 4600849 4719722 4845655
58246D845655J32820J39582J46678J54253J61981J69914J78805J88922J99306
$$ 4845655 4978475 5118057 5264735 5418988 5580969 5750883 5929688 6118610 6317916
58237F317916K09115K19177K31110K45249K60452K75922K92073L09670L29098
$$ 6317916 6527031 6746208 6977318 7222567 7483019 7758941 8051014 8360684 8689782
58228H689782L50557L74115L99462M26414M55591M87867N23309N61486O02709
$$ 8689782 9040339 9414454 9813916 10240330 10695921 11183788 11707097 12268583 12871292
58219A2871292O48034O98303P54165Q16772Q87350R66378J054513J153991J267700
$$ 12871292 13519326 14217629 14971794 15788566 16675916 17642294 18696807 19850798 21118498
58210B1118498J397338J544438J713035J909227K138216K404353K714251L076611
$$ 21118498 22515836 24060274 25773309 27682536 29820752 32225105 34939356 38015967
58202C8015967L497567L979774M530080N168768N931043O860730Q002477R396228
$$ 38015967 41513534 45493308 50023388 55192156 61123199 67983929 75986406 85382634
58194H5382634J1073766J3054538J5334841J7866862K0533737K3127727K5326408
$$ 85382634 96456400 109510938 124845779 142712641 163246378 186374105 211700513
58187B11700513K6668284K6573779K4482100K0100967J3633703N807390k344851
$$ 211700513 238368797 264942576 289424676 309525643 323159346 328966736 326621885
58180C26621885r813593j5867794k0147954k2631508k3539061k3224016k2069907
$$ 326621885 316808292 300940498 280792544 258161036 234621975 211397959 189328052
58173A89328052k0417661j8532698j6601284j4740499j3014348j1452003j0061776
$$ 189328052 168910391 150377693 133776409 119035910 106021562 94569559 84507783
58166H4507783q838256p767154o831259o014728n303089m682109m138723l662504
$$ 84507783 75669527 67902373 61071114 55056386 49753297 45071188 40932465 37269961
58158C7269961l245324k880167k560792k281584k037134j822495j633997j468866
$$ 37269961 34024637 31144470 28583678 26302094 24264960 22442465 20808468 19339602
58150A9339602j323958j195933j082799r83831q97513q20883p51550o89034o33333
$$ 19339602 18015644 16819711 15736912 14753081 13855568 13034685 12283135 11594101 10960768
58141A0960768n83373n37889m96753m60293m27950l98596l71643l46893l23892
$$ 10960768 10377395 9839506 9342753 8882460 8454510 8055914 7684271 7337378 7013486
58132G013486l02305k82542k65128k49708k35452k22095k09870j98637j87888
$$ 7013486 6711181 6428639 6163511 5913803 5678351 5456256 5246386 5047749 4859861
58123D859861j77433j67557j58485j50152j42389j35063j28129j21755j16082
$$ 4859861 4682428 4514871 4356386 4206234 4063845 3928782 3800653 3678898 3562816
58114C562816j10815j05543j00518r6414r3057q9409q5194q1553p9240p7137p3699
$$ 3562816 3452001 3346458 3245940 3149526 3056469 2967060 2881866 2800313 2721073 2643936 2570237
58103B570237o9114o4812o1325n7995n4467n1076m7763m4011m0140l7453l6627
$$ 2570237 2501123 2436311 2374986 2316991 2262524 2211448 2163685 2119674 2079534 2042081 2005454
58092B005454l6905l7280l7612l8141l8730l9103l9206l8911l7971l6710l5981
$$ 2005454 1968549 1931269 1893657 1855516 1816786 1777683 1738477 1699566 1661595 1624885 1588904
58081A588904l5976l5685l4132l1630k9266k7596k6456k5593k4849k3934k2672
$$ 1588904 1552928 1517243 1483111 1451481 1422215 1394619 1368163 1342570 1317721 1293787 1271115
58070A271115k1248j9833j8281j6664j5669j5759j6328j6398j5951j5624j5311
$$ 1271115 1249867 1230034 1211753 1195089 1179420 1163661 1147333 1130935 1114984 1099360 1084049
58059A084049j4147j2096j0515j0521j1558j2213j1971j1423j1099j0921j0722
$$ 1084049 1069902 1057806 1047291 1036770 1025212 1012999 1001028 989605 978506 967585 956863
58048I56863j0598j0584j0470j0174r936r897r831r512r102q868q662q081p092
$$ 956863 946265 935681 925211 915037 905101 895204 885373 875861 866759 857891 849229 841148 834056
58035H34056o134n549n173m713m230l999m047m216m638n628o951p643p010n581
$$ 834056 827922 822373 817200 812487 808257 804258 800211 795995 791357 785729 778778 771135 764125 758544
58021G58544m604m647n133n289m971m355l379j994o94j15j97k34J19M71M70M18
$$ 758544 753940 749293 744160 738871 733900 729545 726166 724172 723478 723363 723166 722932 723051 723522 723992 724410
58005G24410P67J391J875K318L186M422N213M885L704K542K032K249K955L876
$$ 724410 725177 726568 728443 730761 733947 738369 743582 748467 752171 754713 756745 758994 761949 765825
57991G65825M784N569O295P108Q088R185J0239J1026J1392J1457J1527J1734J1825
$$ 765825 770609 776178 782473 789581 797669 806854 817093 828119 839511 850968 862495 874229 886054
57978H86054J1433J0531R456Q489P444N724K816j177n538r568j3162j6601j9830
$$ 886054 897487 908018 917474 925963 933407 939131 941947 940770 935232 925664 912502 895901 876071
57965H76071k2257k3382k3311k2520k1309j9737j7914j6062j4324j2718j1218
$$ 876071 853814 830432 807121 784601 763292 743555 725641 709579 695255 682537 671319
57954F71319r738q159o510n001l727k490j124J35R10J155J082O63l35j844l340
$$ 671319 661581 653422 646912 641911 638184 635694 634570 634705 635615 636770 637852 638515 638180 636336 632996
57939F32996m350m894n288n746o162o166n371l760j833j43J222K435L330L472
$$ 632996 628646 623752 618464 612718 606556 600390 595019 591259 589426 589283 590505 592940 596270 599742
57925E99742K860K101J652J259M18r69k658m452o223p775q998r951j0597j0584
$$ 599742 602602 604703 606355 607614 608032 607063 604405 599953 593730 585955 576957 567006 556409 545825
57911E45825r677q251o998o232n684m929l762k270q21Q6K11k37r27j736k578l213
$$ 545825 536148 527897 520899 514667 508983 504054 500292 498022 497201 497287 497498 497261 496334 494598 492020 488807
57895D88807l633m329n637o941p212o295n075m286l816l319k870k570k147j466
$$ 488807 485174 480845 475208 468267 461055 454760 449685 445399 441583 438264 435394 432824 430677 429211
57881D29211r60r65j000l93O45J303J415J626K249K701K459J952K007K731L405
$$ 429211 428251 427286 426286 425893 426538 427841 429256 430882 433131 435832 438291 440243 442250 444981 448386
57866D48386L366K535J247q1j058j442j357j317j843l007m378n392n861o019o073
$$ 448386 451752 454287 455534 455453 454395 452953 451596 450279 448436 445429 441051 435659 429798 423779 417706
57851D17706n828m986l644k287j243m84R5N63J136K063L125L731L693L571L873
$$ 417706 411878 406892 403248 400961 399718 399234 399329 399892 401028 403091 406216 409947 413640 417211 421084
57836D21084M374M639M797N103N136M193K355L39j707m370p709j0721j2465j3033
$$ 421084 425458 430097 434894 439997 445133 449326 451681 452020 450313 445943 438234 427513 415048 402015
57822D02015j2942j2230j0820r155p750o425m741k895j438l57P32J652J875J757
$$ 402015 389073 376843 366023 356868 349118 342693 337952 335057 333619 333262 333994 335646 337521 339278
57808C39278K540M703P132Q530R044R856J1549J3601J5311J6519J7331J7661J7233
$$ 339278 341818 346521 353653 362183 371227 381083 392632 406233 421544 438063 455394 473055 490288
57795D90288J5837J3487J0530P531M831K209p80m108p154r360j0802j1909j2811
$$ 490288 506125 519612 530142 537673 542504 544713 543933 539825 532671 523311 512509 500600 487789
57782D87789j3227j3076j2870j3220j4000j4334j3604j2158j0795r795q864p821
$$ 487789 474562 461486 448616 435396 421396 407062 393458 381300 370505 360710 351846 344025
57770C44025o845n949m834l490k465k184k304k138j436m54N06J170J189N40j28
$$ 344025 337180 331231 326397 322907 320442 318258 315954 313816 312380 311926 312432 313602 314791 315331 315203
57755C15203m3P34J420J644J905K706L735M327M450M681N319N904N791M986M253
$$ 315203 315160 315894 317314 318958 320863 323569 327304 331631 336081 340762 346081 351985 357776 362762 367015
57740C67015M313M997N322M653L565L250M005M802M638L807L395L768M230M173
$$ 367015 371328 376325 381647 386300 389865 393115 397120 401922 406560 410367 413762 417530 421760 425933
57726D25933L864L875M180M314M126L968M192M850N785O742P361P405P116P050
$$ 425933 429797 433672 437852 442166 446292 450260 454452 459302 465087 471829 479190 486595 493711 500761
57712E00761P413P855Q046Q289R215J0940J2796J3960J4218J4054J4104J4580
$$ 500761 508174 516029 524075 532364 541579 552519 565315 579275 593493 607547 621651 636231
57700F36231J5238J5831J6515J7708J9621K2151K5151K8488L1764L4449L6617
$$ 636231 651469 667300 683815 701523 721144 743295 768446 796934 828698 863147 899764
57689H99764L9202M3034M7821N2543N6796O1151O6179P1687P7181Q2594Q8152
$$ 899764 938966 982000 1029821 1082364 1139160 1200311 1266490 1338177 1415358 1497952 1586104
57678A586104R3915R9707J05438J11207J17295J24176J32330J41811J51945J61072
$$ 1586104 1680019 1779726 1885164 1996371 2113666 2237842 2370172 2511983 2663928 2825000
57668B825000J65814J60552J38962R7831M0131k5541q8646j40428j75844j93972
$$ 2825000 2990814 3151366 3290328 3388159 3428290 3402749 3314103 3173675 2997831 2803859
57658B803859j97356j90383j77339j61358j44407j27600j11553r6877q4332p4144
$$ 2803859 2606503 2416120 2238781 2077423 1933016 1805416 1693863 1596986 1512654 1438510
57648A438510o5457n7111m9007m1971l6295l1155k5764k0354j5509j1197p059
$$ 1438510 1373053 1315942 1266935 1224964 1188669 1157514 1131750 1111396 1095887 1084690 1077631
57637A077631l242k04K127M394P126J0415J4227J8484K2846K6806L0107L2872
$$ 1077631 1074389 1074185 1076312 1080706 1087832 1098247 1112474 1130958 1153804 1180610 1210717 1243589
57625A243589L5382L7962M0986M4564M8291N1599N4284N6387N7607N7360N5479
$$ 1243589 1278971 1316933 1357919 1402483 1450774 1502373 1556657 1613044 1670651 1728011 1783490
57614A783490N2357M8184M2453L4653K5102J4736M160o631j7567k7964l6944m4215
$$ 1783490 1835847 1884031 1926484 1961137 1986239 2000975 2005135 1998504 1980937 1952973 1916029 1871814
57602A871814n0130n5019n8724o0967o1914o2048o1536o0133n7794n5093n2657
$$ 1871814 1821684 1766665 1707941 1646974 1585060 1523012 1461476 1401343 1343549 1288456 1235799
57591A235799n0376m7570m3959m0147l7032l4860l3009l0663k7688k4842k2976
$$ 1235799 1185423 1137853 1093894 1053747 1016715 981855 948846 918183 890495 865653 842677
57580H42677k2034k1001j9059j6545j4510j3404j2723j1834j0664r410q087o738
$$ 842677 820643 799642 780583 764038 749528 736124 723401 711567 700903 691493 683406 676668
57568F76668n732n398n471n320m668l753k772j601j99J044J660J722J856K559
$$ 676668 670936 665538 660067 654747 650079 646326 643554 641953 641754 642798 644458 646180 648036 650595
57554F50595L663M592N131N732O873Q326R360R754J0191J1348J2926J4055J4514
$$ 650595 654258 658850 663981 669713 676586 684912 694272 704026 714217 725565 738491 752546 767060
57541G67060J5030J6255J7994J9703K1319K3121K5101K7001K8956L1476L4647
$$ 767060 782090 798345 816339 836042 857361 880482 905583 932584 961540 993016 1027663
57530A027663L7716L9862M1106M2221M3874M6077M8348N0070N0705M9933M7747
$$ 1027663 1065379 1105241 1146347 1188568 1232442 1278519 1326867 1376937 1427642 1477575 1525322
57519A525322M4297L9650L3835K7065J9747J2148M265l935j2220k0181k7373l3387
$$ 1525322 1569619 1609269 1643104 1670169 1689916 1702064 1706329 1702394 1690174 1669993 1642620 1609233
57507A609233l7919m0991m2929m3963m4005m3063m1624m0224l8735l6566l3600
$$ 1609233 1571314 1530323 1487394 1443431 1399426 1356363 1314739 1274515 1235780 1199214 1165614
57496A165614l0527k7975k5780k3390k0610j7584j4385j1119q278o356n042l450
$$ 1165614 1135087 1107112 1081332 1057942 1037332 1019748 1005363 994244 985966 979610 974568 971118
57484I71118j216J044K680L929N536P793J0293J2533J4333J5885J7656K0093K3176
$$ 971118 969902 970946 973626 977555 983091 990884 1001177 1013710 1028043 1043928 1061584 1081677 1104853
57471A104853K6371K9332L2377L5829L9209M1694M3293M4778M6367M7224M6617
$$ 1104853 1131224 1160556 1192933 1228762 1267971 1309665 1352958 1397736 1444103 1491327 1537944
57460A537944M4847M2481L9265L4529K8334K1453J4231O275k580j1607j9761k6560
$$ 1537944 1582791 1625272 1664537 1699066 1727400 1748853 1763084 1769359 1766779 1755172 1735411 1708851
57448A708851l2167l6885m0848m3969m5996m6756m6521m5857m5017m3693m1593
$$ 1708851 1676684 1639799 1598951 1554982 1508986 1462230 1415709 1369852 1324835 1281142 1239549
57437A239549l9038l6644l4547l2273k9419k6186k3105k0477j8286j6597j5650
$$ 1239549 1200511 1163867 1129320 1097047 1067628 1041442 1018337 997860 979574 962977 947327
57426I47327j5354j4894j3326j0686q164o880o730o743o301n508m543l337k026
$$ 947327 931973 917079 903753 893067 884903 878023 871293 864550 858249 852741 848198 844861 842835
57413H42835j067o44l90k4J66j24n58n35R7J103K313L509M128L763K949K703L274
$$ 842835 841768 841124 840734 840710 840876 840752 840194 839659 839756 840859 843172 846681 850809 854572 857521 860224 863498
57396H63498L931M145M359N184O409P237P230O618N862N297N111N330N850O524
$$ 863498 867429 871574 875933 881117 887526 894763 901993 908611 914473 919770 924881 930211 936061 942585
57382I42585P189P531P328O910O981P663Q113P568O453N906O311O943P040O665
$$ 942585 949774 957305 964633 971543 978524 986187 994300 1001868 1008321 1014227 1020538 1027481 1034521 1041186
57368A041186O345O371O703P161P478P449P181O985O894O726O630P101Q126Q822
$$ 1041186 1047531 1053902 1060605 1067766 1075244 1082693 1089874 1096859 1103753 1110479 1117109 1124210 1132336 1141158
57354A141158Q415P299O642P118Q391R666J0371J0444J0337J0637J1317J1637
$$ 1141158 1149573 1156872 1163514 1170632 1179023 1188689 1199060 1209504 1219841 1230478 1241795 1253432
57342A253432J1154J0524J0723J1646J2293J2232J2047J2246J2581J2796J3172
$$ 1253432 1264586 1275110 1285833 1297479 1309772 1322004 1334051 1346297 1358878 1371674 1384846
57331A384846J3858J4323J4198J4002J4407J5172J5630J5814J6258J6901J7079
$$ 1384846 1398704 1413027 1427225 1441227 1455634 1470806 1486436 1502250 1518508 1535409 1552488
57320A552488J6648J6233J6305J6672J7099J7718J8493J8961J8907J8832J9316
$$ 1552488 1569136 1585369 1601674 1618346 1635445 1653163 1671656 1690617 1709524 1728356 1747672
57309A747672K0237K0974K1118K0775K0427K0703K1899K3508K4586K4856K5024
$$ 1747672 1767909 1788883 1810001 1830776 1851203 1871906 1893805 1917313 1941899 1966755 1991779
57298A991779K5657K6237K5833K4336K2415K0561J8822J7327J6229J5091J3108
$$ 1991779 2017436 2043673 2069506 2093842 2116257 2136818 2155640 2172967 2189196 2204287 2217395
57287B217395J0283P731O383N851N081L811K722K307K262K150K149K733L891N104
$$ 2217395 2227678 2235409 2241792 2247643 2252724 2256535 2259257 2261564 2263826 2265976 2268125 2270858 2274749 2279853
57273B279853O006O707P459Q329R312J0449J1588J2332J2498J2476J2769J3296
$$ 2279853 2285859 2292566 2300025 2308354 2317666 2328115 2339703 2352035 2364533 2377009 2389778 2403074
57261B403074J3539J3342J3110J3117J3140J2933J2650J2483J2266J1904J1861
$$ 2403074 2416613 2429955 2443065 2456182 2469322 2482255 2494905 2507388 2519654 2531558 2543419
57250B543419J2707J4192J5298J5356J4765J4452J4852J5585J6015J5894J5504
$$ 2543419 2556126 2570318 2585616 2600972 2615737 2630189 2645041 2660626 2676641 2692535 2708039
57239B708039J5244J5177J5004J4464J3644J2879J2448J2402J2535J2532J2270
$$ 2708039 2723283 2738460 2753464 2767928 2781572 2794451 2806899 2819301 2831836 2844368 2856638
57228B856638J2081J2434J3332J4248J4821J5306J6054J6872J7259J7100J6718
$$ 2856638 2868719 2881153 2894485 2908733 2923554 2938860 2954914 2971786 2989045 3006145 3022863
57217C022863J6339J5999J5892J6325J7255J8252J9013J9559J9809J9454J8503
$$ 3022863 3039202 3055201 3071093 3087418 3104673 3122925 3141938 3161497 3181306 3200760 3219263
57206C219263J7574J7301J7639J8071J8334J8563J8846J9010J8949J8843J8872
$$ 3219263 3236837 3254138 3271777 3289848 3308182 3326745 3345591 3364601 3383550 3402393 3421265
57195C421265J8922J8731J8264J7708J7155J6408J5231J3681J2171J1289J1470
$$ 3421265 3440187 3458918 3477182 3494890 3512045 3528453 3543684 3557365 3569536 3580825 3592295
57184C592295J2679J4258J5372J5782J6027J6562J6985J6615J5625J4884J4644
$$ 3592295 3604974 3619232 3634604 3650386 3666413 3682975 3699960 3716575 3732200 3747084 3761728
57173C761728J4107J2717J1102J0126R553Q461O738N286M792M993N309N505N486
$$ 3761728 3775835 3788552 3799654 3809780 3819333 3827794 3834532 3839818 3844610 3849603 3854912 3860417 3865903
57160C865903N109M601M694N808P307P970P293O024N403N912O888P324O976O498
$$ 3865903 3871012 3875613 3880307 3886115 3893422 3901392 3908685 3914709 3920112 3926024 3932912 3940236 3947212 3953710
57146C953710O433O527O244N642N227N117M913M383L797L510L624M103M866N676
$$ 3953710 3960143 3966670 3972914 3978556 3983783 3988900 3993813 3998196 4001993 4005503 4009127 4013230 4018096 4023772
57132D023772O362P128Q271R613J0702J1626J3049J5307J8038K0887K4046K7741
$$ 4023772 4030134 4037262 4045533 4055146 4065848 4077474 4090523 4105830 4123868 4144755 4168801 4196542
57120D196542L1782L5968M0562M5892N1842N8174O5100P3166Q2663R3459J05329
$$ 4196542 4228324 4264292 4304854 4350746 4402588 4460762 4525862 4599028 4681691 4775150 4880479
57109D880479J18361J33273J51350J73802K01102K33394K71470L16720L70018
$$ 4880479 4998840 5132113 5283463 5457265 5658367 5891761 6163231 6479951 6849969
57100F849969M31505N01951N83607O79145P90160R17263J060875J220918J395715
$$ 6849969 7281474 7783425 8367032 9046177 9836337 10753600 11814475 13035393 14431108
57091A4431108J581652J773490J964408K145992K308894K443620K540588K590284
$$ 14431108 16012760 17786250 19750658 21896650 24205544 26649164 29189752 31780036
57083C1780036K584182K515143K376312K160811J865019J493782J062675N95274
$$ 31780036 34364218 36879361 39255673 41416484 43281503 44775285 45837960 46433234
57075D6433234J17908l45164p75153j160047j493156j770344j988818k148066
$$ 46433234 46551142 46205978 45430825 44270778 42777622 41007278 39018460 36870394
57067C6870394k250586k301053k305202k269630k201534k107857j994965j869260
$$ 36870394 34619808 32318755 30013553 27743923 25542389 23434532 21439567 19570307
57059A9570307j737103j603527j471535j343184j220667j105755r98851q99626
$$ 19570307 17833204 16229677 14758142 13414958 12194291 11088536 10089685 9190059
57051I190059q08277p25417o50926n83797n23118m68601m20148l77468l40134
$$ 9190059 8381782 7656365 7005439 6421642 5898524 5429923 5009775 4632307 4292173
57042D292173l07528k78731k52884k29732k09397j91655j75842j61429j48265
$$ 4292173 3984645 3705914 3453030 3223298 3013901 2822246 2646404 2484975 2336710
57033B336710j36243j25221j15291j06650r9101r2043q5183p8818p3222o8144
$$ 2336710 2200467 2075246 1959955 1853305 1754204 1662161 1576978 1498160 1424938 1356794
57023A356794o3267n8790n5133n2165m9218m5905m2584l9838l7670l5527l3044
$$ 1356794 1293527 1234737 1179604 1127439 1078221 1032316 989732 949894 912224 876697 843653
57012H43653l0518k8530k7248k6335k5408k4324k3043k1500j9830j8459j7747
$$ 843653 813135 784605 757357 731022 705614 681290 658247 636747 616917 598458 580711
57001E80711j7585j7579j7587j7825j8433j9140j9458j9173j8537j7943j7442
$$ 580711 563126 545547 527960 510135 491702 472562 453104 433931 415394 397451 380009
56990C80009j6637j5172j3140j0888q489n839l197j201r5N43J026Q84m38k479
$$ 380009 363372 348200 335060 324172 315683 309844 306647 305446 305351 305894 306920 307804 307366 304887
56976C04887m067m666m824n099n188m491l098j721q01j68N14J352K305L414M789
$$ 304887 300820 296154 291330 286231 281043 276552 273454 271733 270932 270764 271278 272630 274935 278349 283138
56961B83138O469Q364J0214J1617J2259J2109J1319R886P566M224K07l701o742
$$ 283138 289607 297971 308185 319802 332061 344170 355489 365375 372941 377165 377372 373671 366929
56948C66929q605r469r677r421q720p671o565n594m514k872o12J743L746N588
$$ 366929 358324 348855 339178 329757 321037 313366 306801 301207 296693 293821 293209 294952 298698 304286
56934C04286P790J0402J2907J4759J5652J5195J2968R108M469k00m854r556j3663
$$ 304286 312076 322478 335385 350144 365796 380991 393959 403067 407536 407336 402482 392926 379263
56921C79263j6300j7450j7879j7968j7377j5920j4122j2472j0817q973p382o497
$$ 379263 362963 345513 327634 309666 292289 276369 262247 249775 238958 229985 222603 216106
56909B16106n922m911l589k913l281l895l758k841j892j362r77k34R53K203L084
$$ 216106 210184 205273 201684 198771 195490 191595 187837 184996 183104 181742 180765 180531 181484 183687 186771
56894A86771L568M017M711N444N839O086O968Q952J1413J3087J3202J1949R894
$$ 186771 190339 194356 199067 204511 210350 216436 223404 232356 243769 256856 270058 282007 291901
56881B91901P355M473J577r01k753l958m416m001k898j592l99P92K175L717N343
$$ 291901 299256 303729 305306 304405 301652 297694 293278 289277 286379 284787 284388 285180 287355 291072 296415
56866B96415P193R425J1956J4647J7530K0470K2748K3450K2328J9808J6213J1453
$$ 296415 303608 313033 324989 339636 357166 377636 400384 423834 446162 465970 482183 493636
56854D93636N623n47o163j0701j3893j5497j5547j4487j2709j0185o886l250K01
$$ 493636 499259 498712 492549 481848 467955 452458 436911 422424 409715 399530 392644 389394 389595
56841C89595L512P180J1510J6458K1849K7274L1997L5400L7358L7597L4956K8242
$$ 389595 393107 400287 411797 428255 450104 477378 509375 544775 582133 619730 654686 682928
56829F82928J7953O414m188j3250k0959k6894l0243l0960k9857k7584k4215j9968
$$ 682928 700881 707295 703107 689857 668898 642004 611761 580801 550944 523360 499145 479177
56817D79177j5591j1776q428m905o95M234R568J4835J9481K2975K4879K4863K2723
$$ 479177 463586 451810 443382 438477 437782 442016 451584 466419 485900 508875 533754 558617 581340
56804E81340J8456J2265M519m153j2722k0003k5244k8417k9801k9465k7496k4517
$$ 581340 599796 612061 616580 612427 599705 579702 554458 526041 496240 466775 439279 414762
56792D14762k1518j8900j6166j2797r109n763k745N34M120P280R547J1278J2641
$$ 414762 393244 374344 358178 345381 336272 330509 327764 328298 332418 339698 349245 360523 373164
56779C73164J2679J0273N765Q00l499p432j1547j5387j7919j8738j8266j7073
$$ 373164 385843 396116 401881 402681 399182 391750 380203 364816 346897 328159 309893 292820
56767B92820j5598j4301j3465j2741j1477r620p917o984o618o266n826n525n299
$$ 292820 277222 262921 249456 236715 225238 215618 207701 200717 194099 187833 182007 176482 171183
56754A71183m775l842k804j916j190p57r14j550j926j406k92M64K75o54j697k314
$$ 171183 166408 162566 159762 157846 156656 155899 154985 153435 151509 150103 149811 150275 150550 149896 148199 145885
56738A45885k218j542q82p81j110j227q32k33K45O78J124J289R37L26j42m29o99
$$ 145885 143667 142125 141243 140462 139352 138125 137293 137060 137305 137983 139107 140396 141333 141659 141517 141088 140389
56721A40389q54n92J11R15J380J219M66l66o20k51M8k58q06q90m35P0L36M92O49
$$ 140389 139535 138943 139054 139969 141349 142568 143034 142668 142048 141797 141845 141587 140781 139891 139456 139526 139862 140354 141003
56702A41003Q53J284J967K476K391J972J744J670J380J054J099J147L96q66j300
$$ 141003 141856 143140 145107 147583 149974 151946 153690 155360 156740 157794 158893 160040 160436 159570 158270
56687A58270m76L67K05k47J52J004J024J16n50l36J88M63P19J184J529J558J651
$$ 158270 157794 158161 158366 158119 158271 159275 160299 160415 159865 159529 159717 160180 160899 162083 163612 165170 166821
56670A66821J954J789O30p75j054O0J349J617J002M78M22J90q08k140k838k630
$$ 166821 168775 170564 171194 170419 169365 169425 170774 172391 173393 173871 174293 174483 173675 171535 168697 166067
56654A66067k178k067k038j535o17Q1J73j39m32m67k89k24o87j673k483k335j245
$$ 166067 163889 161822 159784 158249 157632 157713 157886 157747 157315 156848 156559 156335 155648 153975 151492 149157 147912
56637A47912JP33Q96P08K82k26m89k99J55N72Q10Q45O36K80L8J0r5o13j438k066
$$ 147912 147913 148646 149542 150250 150532 150306 149817 149518 149673 150245 151055 151900 152536 152816 152854 152864 152769 152156 150718 148652
56617A48652k105j548p09K7L39J94r2j26J61M73N59N65Q38J479K192K635K776
$$ 148652 146547 144999 144290 144317 144656 144850 144758 144632 144793 145266 145825 146390 147228 148707 150899 153534 156310
56600A56310K761K549J968J128N09M71Q44J179J275J255J246J231J146R67O89
$$ 156310 159071 161620 163588 164716 165225 165696 166540 167719 168994 170249 171495 172726 173872 174839 175528
56585A75528L80J05j96o26r16m60Q28K001J954Q02j73l6Q57J620J940K088K294
$$ 175528 175908 176013 175817 175191 174275 173815 174643 176644 178598 179400 179227 179191 180048 181668 183608 185696 187990
56568A87990K620L167L966M692M941M767M681N078N861O591O844O492N815N312
$$ 187990 190610 193777 197743 202435 207376 212143 216824 221902 227763 234354 241198 247690 253505 258817
56554B58817N263N460N466N001M053K827J760J262J163P12n13j948k792l182l941
$$ 258817 264080 269540 275006 280007 284060 286887 288647 289909 291072 291784 291271 289323 286531 283349 279408
56539B79408n188o034n920n553n914o845p316o840n899n019m186l357k901l066
$$ 279408 274220 268186 262266 256713 250799 243954 236638 229798 223899 218880 214694 211337 208436 205370
56525B05370l446l457l073k650k154j242p7M81o8j046j322p06j61n46j588k306
$$ 205370 201924 198467 195394 192744 190590 189348 189271 189752 189684 188638 187316 186610 186449 185903 184315 182009
56509A82009k113j239l11J06l21j494k735l229k840k248k079k184k026j477q06
$$ 182009 179896 178657 178346 178452 178131 176637 173902 170673 167833 165585 163506 161322 159296 157819 157013
56494A57013j53M87P51J58r99j604j037j3L96K16L34J044J685J755J635J827K111
$$ 157013 156860 157347 158098 158256 157257 155653 154616 154603 154999 155215 155549 156593 158278 160033 161668 163495 165606
56477A65606J979J492J202J423K043K815L444L532K954K240K131K648L070K907
$$ 165606 167585 169077 170279 171702 173745 176560 180004 183536 186490 188730 190861 193509 196579 199486
56463A99486K533K611L210L717L484K360Q00m28q27o27n36r73j653k124k355k516
$$ 199486 202019 204630 207840 211557 215041 217401 218201 217773 216946 216319 215783 214810 213157 211033 208678 206162
56447B06162k403j639m34L18Q4n44n32K55P98J49j434k738k838j915r48p28j139
$$ 206162 203759 202120 201686 202004 202088 201544 201012 201267 202065 202214 200780 198042 195204 193289 192341 191613 190474
56430A90474j385r49k67k38r99j628j269j94O57R05Q71P30K97k76l33M01J299
$$ 190474 189089 188140 187873 187635 186636 185008 183739 183545 184202 185107 185978 186708 187005 186729 186396 186797 188096
56413A88096J607J327R24O03L79M22Q21J245J356J348J585J965K227K621L578
$$ 188096 189703 191030 191954 192557 192936 193358 194179 195424 196780 198128 199713 201678 203905 206526 210104
56398B10104M793N349M807L603K344J355Q66R37R97K99r78j769j647j448j924
$$ 210104 214897 220246 225053 228656 231000 232355 233221 234158 235155 235454 234476 232707 231060 229612 227688
56383B27688k502k225j210l38J45O63J164J002J75l42R5Q32R29N70P15J531K034
$$ 227688 225186 222961 221751 221413 221558 222221 223385 224387 224562 224220 224315 225147 226076 226646 227361 228892 230926
56366B30926J522O66N94J318J792J511J273J924K999L327K641J788J387J146O96
$$ 230926 232448 233114 233708 235026 236818 238329 239602 241526 244525 247852 250493 252281 253668 254814 255510
56351B55510L73O58J405K084K403K302J773J118R87J620K345K399J969J888K473
$$ 255510 255883 256541 257946 260030 262433 264735 266508 267626 268613 270233 272578 274977 276946 278834 281307
56336B81307L258L793M098M307M485M771N256N629N484M985M747M950N079M701
$$ 281307 284565 288358 292456 296763 301248 306019 311275 316904 322388 327373 332120 337070 342149 346850
56322C46850M052L611L532L679L945M244M502M744M999N043M588L787L156K876
$$ 346850 350902 354513 358045 361724 365669 369913 374415 379159 384158 389201 393789 397576 400732 403608
56308D03608K631K257K095K342K642K645K609K902L309L365L158L155L364L338
$$ 403608 406239 408496 410591 412933 415575 418220 420829 423731 427040 430405 433563 436718 440082 443420
56294D43420L052L085L753M598N182N922P540R862J1781J2517J2508J2734J3515
$$ 443420 446472 449557 453310 457908 463090 469012 476552 486414 498195 510712 523220 535954 549469
56281E49469J4389J5087J6080J7893K0259K2372K3886K5286K7241K9952L3273
$$ 549469 563858 578945 595025 612918 633177 655549 679435 704721 731962 761914 795187
56270G95187L7105M1448M6189N1200N6627O2879P0324P9028Q8722R8913J09152
$$ 795187 832292 873740 919929 971129 1027756 1090635 1160959 1239987 1328709 1427622 1536774
56259A536774J19326J29675J40304J50699J59796J66596J70678J72072J70720
$$ 1536774 1656100 1785775 1926079 2076778 2236574 2403170 2573848 2745920 2916640
56250B916640J66070J57271J43915J26493J06109Q3707N9777L4853J0041j3248
$$ 2916640 3082710 3239981 3383896 3510389 3616498 3700205 3759982 3794835 3804876 3791628
56240C791628l4110n2509o8829q3211r5486j05693j14303j21760j27807j31685
$$ 3791628 3757518 3705009 3636180 3552969 3457483 3351790 3237487 3115727 2987920 2856235
56230B856235j33117j32794j31597j29577j26213j21553j16496j11693j06694
$$ 2856235 2723118 2590324 2458727 2329150 2202937 2081384 1964888 1853195 1746501
56221A746501j00692r3761q6828q0540p4665o8694o2551n6564n1017m5983m1443
$$ 1746501 1645809 1552048 1465220 1384680 1310015 1241321 1178770 1122206 1071189 1025206 983763
56210I83763l7373l3797l0814k8444k6373k4099k1476j8960j7100j5871j4746
$$ 983763 946390 912593 881779 853335 826962 802863 781387 762427 745327 729456 714710
56199G14710j3339j1712j0107q680p562o855o380n682m534l234k219j512q96m26
$$ 714710 701371 689659 679552 670872 663310 656455 650075 644393 639859 636625 634406 632894 631998 631572
56185F31572l44m96k92O22J980L320M408N128N459N788O773Q442R827J0121R829
$$ 631572 631228 630732 630440 631062 633042 636362 640770 645898 651357 657145 663918 672360 682187 692308 702137
56170G02137J0152J1352J2518J2939J2966J3223J3630J3754J3650J3923J4962
$$ 702137 712289 723641 736159 749098 762064 775287 788917 802671 816321 830244 845206
56159H45206J6458J7657J8103J8247J9282K2107K6519L1841L8214M6548N7174
$$ 845206 861664 879321 897424 915671 934953 957060 983579 1015420 1053634 1100182 1157356
56148A157356O9354Q2528R7079J13092J28781J41004J47206J46350J38627J25376
$$ 1157356 1226710 1309238 1406317 1519409 1648190 1789194 1936400 2082750 2221377 2346753
56138B346753J09290R3654Q0758P1238O4556N9295N3079M3513L0071J4772N86
$$ 2346753 2456043 2549697 2630455 2701693 2766249 2825544 2878623 2922136 2952207 2966979 2967565
56127B967565j0525j8039k2497k5638l0372l9497n3959p2436r2306j10582j24429
$$ 2967565 2957040 2939001 2916504 2890866 2860494 2820997 2767038 2694602 2602296 2491714 2367285
56116B367285j31952j33019j28871j20767j09308r5290q0464o6803n5120m4903
$$ 2367285 2235333 2102314 1973443 1852676 1743368 1648078 1567614 1500811 1445691 1400788
56106A400788l5507k7082k0186j4897j0636o759k997O13L932O712Q546R121Q598
$$ 1400788 1365281 1338199 1318013 1303116 1292480 1285721 1282724 1283337 1287269 1293981 1302527 1311648 1320246
56093A320246P623O865O501O158N368M092K792J969J676J606J547J644K188L292
$$ 1320246 1327869 1334734 1341235 1347393 1352761 1356853 1359645 1361614 1363290 1364896 1366443 1368087 1370275 1373567
56079A373567M883O754Q554R863J0543J0950J1569J2529J3590J4556J5408J6124
$$ 1373567 1378450 1385204 1393758 1403621 1414164 1425114 1436683 1449212 1462802 1477358 1492766 1508890
56067A508890J6672J7254J8200J9509K0732K1528K2083K2812K3773K4696K5478
$$ 1508890 1525562 1542816 1561016 1580525 1601257 1622785 1644868 1667680 1691453 1716149 1741627
56056A741627K6336K7434K8564K9381K9806L0187L0937L2110L3352L4347L5212
$$ 1741627 1767963 1795397 1823961 1853342 1883148 1913335 1944272 1976382 2009734 2044081 2079293
56045B079293L6356L7945L9741M1390M2681M3464M3699M3808M4604M6543M9180
$$ 2079293 2115649 2153594 2193335 2234725 2277406 2320870 2364569 2408377 2452981 2499524 2548704
56034B548704N1780N4226N6908N9810O2316O4025O5259O6474O7666O8706O9881
$$ 2548704 2600484 2654710 2711618 2771428 2833744 2897769 2963028 3029502 3097168 3165874 3235755
56023C235755P1683P4119P6680P8988Q1193Q3768Q7070R1089R5453R9763J03940
$$ 3235755 3307438 3381557 3458237 3537225 3618418 3702186 3789256 3880345 3975798 4075561 4179501
56012D179501J08133J12318J16310J20362J25165J30901J36806J42208J47608
$$ 4179501 4287634 4399952 4516262 4636624 4761789 4892690 5029496 5171704 5319312
56003E319312J53953J61255J68810J76643J85615J95970K06896K17860K29394
$$ 5319312 5473265 5634520 5803330 5979973 6165588 6361558 6568454 6786314 7015708
55994G015708K41992K55309K69200K84643L02615L22655L43604L65377L88966
$$ 7015708 7257700 7513009 7782209 8066852 8369467 8692122 9035726 9401103 9790069
55985I790069M14973M43152M73302N05751N40943N79360O21871O69441P22548
$$ 9790069 10205042 10648194 11121496 11627247 12168190 12747550 13369421 14038862 14761410
55976A4761410P81366Q46332R18028R96949J084335J182778J295169J423413J569307
$$ 14761410 15542776 16389108 17307136 18304085 19388420 20571198 21866367 23289780 24859087
55967B4859087J736312J929319K153115K412788K715757L072200L493779L993859
$$ 24859087 26595399 28524718 30677833 33090621 35806378 38878578 42372357 46366216
55959D6366216M589481N302437O159047P190617Q433339R924868J1698700J3777920
$$ 46366216 50955697 56258134 62417181 69607798 78041137 87966005 99664705 113442625
55951A13442625J6162957J8808257K1594773K4306369K6603370K7994738K7861322
$$ 113442625 129605582 148413839 170008612 194314981 220918351 248913089 276774411
55944B76774411K5607329K0931922J4068720N805001k760253j0568024j6862194
$$ 276774411 302381740 323313662 337382382 343187383 340427130 329859106 312996912
55937C12996912k1279545k3808715k4690670k4302626k3049676k1288587j9294874
$$ 312996912 291717367 267908652 243217982 218915356 195865680 174577093 155282219
55930A55282219j7261001j5307764j3500723j1868610j0418145r142600q027494
$$ 155282219 138021218 122713454 109212731 97344121 86925976 77783376 69755882
55923F9755882p055833o210705n474988m832191m269239l776941l346978k970298
$$ 69755882 62700049 56489344 51014356 46182165 41912926 38135985 34789007 31818709
55915C1818709k639285k349248k096265j875113j680703j509934j360546j229392
$$ 31818709 29179424 26830176 24733911 22858798 21178095 19668161 18307615 17078223
55907A7078223j113338j010771r20564q40468p68129p02960o45424n94899n49655
$$ 17078223 15964885 14954114 14033550 13193082 12424953 11721993 11076569 10481670 9932015
55898I932015n08549m71320m37559m06666l78650l53622l30771l09001k88447
$$ 9932015 9423466 8952146 8514587 8107921 7729271 7375649 7044878 6735877 6447430
55889F447430k70043k53656k38027k22661k08474j96288j85921j77064j69812
$$ 6447430 6177387 5923731 5685704 5463043 5254569 5058281 4872360 4695296 4525484
55880D525484j63720j57426j50051j42206j34934j28340j21983j15960j10726
$$ 4525484 4361764 4204338 4054287 3912081 3777147 3648807 3526824 3410864 3300138
55871C300138j06117j01488r6683r2216q8517q5486q2875q0597p8538p6359p3652
$$ 3300138 3194021 3092533 2995850 2903634 2815117 2729631 2646756 2566159 2487621 2411262 2337610
55860B337610p0164o5881o1028n5949n0917m6122m1868l8608l6581l5545l5062
$$ 2337610 2267446 2201565 2140537 2084588 2033671 1987549 1945681 1907073 1870492 1834947 1799885
55849A799885l5012l5574l6743l8043l8783l8553l7436l5802l3874l1562k8721
$$ 1799885 1764873 1729299 1692556 1654513 1615730 1577177 1539741 1503939 1470065 1438503 1409782
55838A409782k5580k2712k0562j9106j7968j6822j5570j4382j3567j3329j3539
$$ 1409782 1384202 1361490 1340928 1321822 1303854 1287032 1271462 1257080 1243513 1230184 1216645
55827A216645j3870j4259j4995j6240j7618j8555j8917j9076j9339j9590j9564
$$ 1216645 1202775 1188516 1173521 1157281 1139663 1121108 1102191 1083115 1063776 1044186 1024622
55816A024622j9233j8778j8273j7577j6587j5459j4502j3833j3203j2255j0952
$$ 1024622 1005389 986611 968338 950761 934174 918715 904213 890380 877177 864922 853970
55805H53970r576q241o622m381j883j02L92J18J64Q99J512P65j883n945j0436
$$ 853970 844394 836153 829531 825150 823267 823165 823557 823675 823839 824738 826250 827015 825132 819187 808751
55790H08751j4529j7798k0040k1056k0635j8840j6215j3538j1318r619q411p775
$$ 808751 794222 776424 756384 735328 714693 695853 679638 666100 654782 645163 636752 628977
55778F28977p656p677p522p291p186o991o392n732n891p180q839r921j0277j0357
$$ 628977 621321 613644 606122 598831 591645 584654 578262 572530 566639 559459 550620 540699 530422 520065
55764E20065j0438j0545j0861j1603j2538j3100j3102j2873j2639j2153j1186
$$ 520065 509627 499082 488221 476618 464080 450980 437878 425005 412366 400213 389027
55753C89027j0031r270r112r171q821p746o196m755l775l113k522k087j971j906
$$ 389027 378996 369726 360614 351443 342622 334876 328680 323925 320150 317037 314515 312428 310457 308551
55739C08551j403n11Q4j03q05j467j888k160k331k392k401k322k057j821k152
$$ 308551 307148 306637 306721 306618 305813 304346 302458 300298 297967 295575 293174 290852 288795 286974 284822
55724B84822l117l933l845l197k977l481m013l996l655l402l181k809k476k432
$$ 284822 281705 277772 273927 270730 267753 264272 260259 256263 252608 249206 246025 243216 240740 238308
55710B38308k449k103j440r15p26n51o7O07J067J089P35J71m29q11o91n7O38Q95
$$ 238308 235859 233756 232316 231401 230675 230124 230057 230664 231731 232820 233555 233726 233297 232486 231795 231738 232376 233271
55692B33271Q20J063J869K544K303J404Q05P58N30l06j081j099p66r01j355j290
$$ 233271 234091 235154 237023 239567 241870 243274 244079 244837 245367 245061 243980 242881 242115 241214 239859 238569
55676B38569o48m51j370k805l740l920l746l479l078k568k117j790j487j111n42
$$ 238569 237921 237470 236100 233295 229555 225635 221889 218410 215332 212764 210647 208857 207370 206259 205717
55661B05717L12J293J993K219K303K700L419M100M496M599M387L865L300L067
$$ 205717 206029 207322 209315 211534 213837 216537 219956 224056 228552 233151 237538 241403 244703 247770
55647B47770L114K875J899M10q92j570j777j966k352k729k746k322j721j259j081
$$ 247770 250884 253759 255658 256068 255176 253606 251829 249863 247511 244782 242036 239714 237993 236734 235653
55632B35653j167j470j933k469l018l569m105m608n163n870o601p034p026o795
$$ 235653 234486 233016 231083 228614 225596 222027 217922 213314 208151 202281 195680 188646 181620 174825
55618A74825o616o476o209n806n366m884m302l688l196k927k961l308l655l499
$$ 174825 168209 161733 155524 149718 144352 139468 135166 131478 128282 125355 122394 119086 115431 111932
55604A11932k832k363k673l352l490k876k134j729j538j434j603j975j993j396
$$ 111932 109100 106737 104064 100712 97222 94346 92212 90483 88945 87511 85908 83933 81940 80544
55590H0544p54p30j115j158o19pJ49j77o59r45p77j53N82R84R40P39P71J187J734
$$ 80544 79790 79060 77945 76787 76168 76161 76310 76133 75474 74529 73752 73599 74181 75165 76105 76844 77615 78802 80536
55571H0536J861J169n1r62j076p75p19j028j335j439j355r93l12K26j7r12j479
$$ 80536 82397 83566 83515 82553 81477 80702 79983 78955 77620 76181 74826 73833 73521 73747 73730 72818 71339
55554G1339j010P3Q03P75M10K43L54M38K39j52m36n10o97j288k021k293j959j518
$$ 71339 70329 70402 71205 71980 72390 72633 72987 73425 73664 73512 73076 72566 71869 70581 68560 66267 64308 62790
55536F2790j403j422j185p19l23j8M39J013J316J116O62M04N31R12J354J782K220
$$ 62790 61387 59965 58780 58061 57738 57720 58159 59172 60488 61604 62266 62670 63201 64113 65467 67249 69469
55519F9469K558K524J997J361J241J717K181K178K122K769M065N096N161M432
$$ 69469 72027 74551 76548 77909 79150 80867 83048 85226 87348 90117 94182 99278 104439 108871
55505A08871L441K367J123j97j329k176k862l524m220m919n444n481m888l952
$$ 108871 112312 114679 115802 115605 114276 112100 109238 105714 101494 96575 91131 85650 80762 76810
55491G6810l213l007l192l319l041k523k379k969l774l843k975k065j926k245
$$ 76810 73597 70590 67398 64079 61038 58515 56136 53167 49393 45550 42575 40510 38584 36339
55477C6339k186j631j122p86j72P22J085L63q66j604j584j227q41m01M6L27M40
$$ 36339 34153 32522 31400 30614 30442 31164 32249 32612 31746 30142 28558 27331 26490 26089 26135 26462 26902
55460B6902M88L28k70j079j439j000j71L32K07k70o09n66k51Q8L26M68M33J02
$$ 26902 27390 27718 27448 26369 24930 23930 23759 24091 24298 24028 23419 22853 22602 22690 23016 23484 23917 24019
55442B4019l72n44j69N11J070J283J061L97l38m83J80J043J486J638J815J714
$$ 24019 23647 23103 22934 23445 24515 25798 26859 27256 26918 26435 26615 27658 29144 30782 32597 34311
55426C4311R39k9m35o02j466k798l135j893l11L25K69L16L09k41r11r44n84n66
$$ 34311 35250 35221 34786 34184 32718 29920 26785 24892 24581 24906 25175 25491 25800 25559 24648 23704 23120 22554
55408B2554o66j41O53M90p20j566j161l11j07m12m69j71J27M07P53Q15L38j15
$$ 22554 21888 21747 22400 22890 22170 20604 19443 19132 19025 18613 18144 17973 18100 18507 19260 20075 20413 20298
55390B0298K12J045J304N18o59j397j548j357r40l67Q8J74J1l0J91L68J01o05
$$ 20298 20510 21555 22859 23377 22718 21321 19773 18416 17476 17109 17197 17371 17382 17352 17543 17911 18012 17407
55372A7407j230j246p06j58j5k14n41r86j493j700j330p07m52o69q78p85o76q66
$$ 17407 16177 14931 14225 14067 14052 13838 13297 12311 10818 9118 7788 7081 6629 5960 5082 4297 3621 2755
55354B755j151D41e17q48q27o01j61J67L24P01c49A454J196n8q50n97K05P76R12
$$ 2755 1604 441 -517 -1365 -2192 -2793 -2954 -2787 -2463 -1762 -349 1454 2650 2592 1742 1145 1350 2126 3038
55335C038Q17N95K79P3R0J21qk8M01J078J450J348J043O66O4p42j375j529j195
$$ 3038 3855 4450 4729 4802 4892 5013 5005 4977 5378 6456 7906 9254 10297 10963 11027 10285 8910 7381 6186
55316F186m77M80J247J296O14j76m84k84Q4K97J91r4q3M79J043Q09n0m43O7N57
$$ 6186 5709 6189 7436 8732 9346 9170 8686 8402 8486 8783 8974 8880 8797 9276 10319 11128 11078 10635 10702 11259
55296A1259J16p59q88q5P46R38O62L08k1l12n44q19j174j276q04n0M27O42J059
$$ 11259 11375 10616 9728 9643 10389 11327 11989 12297 12276 11964 11420 10601 9427 8151 7347 7297 7724 8366 9425
55277I425J562J375K31j047j552j375j194j177q96r0Q66J359J092L39k57k15K63
$$ 9425 10987 12362 12593 11546 9994 8619 7425 6248 5352 5262 6128 7487 8579 8918 8661 8446 8709
55260H709N32K97J9K28P05O67k32j416j946j442l70N09Q28P40M24j88j106j894
$$ 8709 9241 9538 9557 9785 10490 11157 10925 9509 7563 6121 5751 6260 7088 7828 8252 8064 6958 5064
55242E064j980j301l56L61P05P20N07L56N23P20K93q03j632j332k17O16O32K97
$$ 5064 3084 1783 1427 1788 2493 3213 3720 4076 4599 5319 5612 4809 3177 1845 1628 2244 2876 3173
55224C173K38M96P02O08K64n7j2M73R12O05m72j397j203N7J365J870J660J417
$$ 3173 3411 3907 4609 5217 5481 5424 5412 5885 6797 7402 6930 5533 4330 4387 5752 7622 9282 10699
55206A0699J496J548J015j32j201j394o14L79P25L16k47m60m03l83m17l44k28
$$ 10699 12195 13743 14758 14626 13425 12031 11417 11796 12521 12837 12590 12130 11727 11344 10927 10583 10355
55189A0355k59l43j72K31M68L23K7k11m88p75o76p7L95J73l13j75N35Q48L60j15
$$ 10355 10096 9753 9581 9812 10280 10603 10630 10419 9931 9156 8480 8403 8798 8971 8658 8483 9018 9866 10226 10111
55169A0111J90Q22Q16P4o37p81m66R9Q44J438J308L40p41j103o70n0J83n4m74
$$ 10111 10301 11123 11939 12013 11376 10595 10129 10228 11072 12510 13818 14158 13417 12314 11644 11594 11777 11723 11249
55150A1249p10n36n2L35L09L2m3K00L11j30q89j276r44k13M34Q41J040R14L82
$$ 11249 10539 10003 9951 10286 10595 10627 10584 10784 11095 10965 10076 8800 7856 7643 8077 8918 9958 10872 11254
55131A1254k11k70L59J146J429J075M83N9j77m85r31j186q10K22J444K329K570
$$ 11254 11043 10773 11132 12278 13707 14782 15265 15324 15147 14662 13731 12545 11735 11957 13401 15730 18300
55114A8300K027P78n42r71k25Q51J287J189J322J796J908J265K94n25j088j194
$$ 18300 20327 21105 20563 19592 19367 20218 21505 22694 24016 25812 27720 28985 29279 28754 27666 26472
55098B6472n09O12J090M82k88k22L76N66K32J1P7k6l85m99j03M49P75Q38O81L59
$$ 26472 25963 26575 27665 28147 27859 27637 28013 28579 28811 28822 28899 28873 28488 27989 27886 28335 29110 29948 30629 30988
55078C0988J79M45Q67P78K5q77j499j799j642p93M17J110Q52J15n19j042j566
$$ 30988 31167 31612 32479 33257 33282 32405 30906 29107 27465 26672 27089 28199 29051 29166 28647 27605 26039
55061B6039j875j854j782j790j461n58L77O87M83L28L21J61j33j95N9L43M19K60
$$ 26039 24164 22310 20528 18738 17277 16719 17096 17783 18266 18594 18915 19076 18943 18748 18807 19150 19569 19829
55043A9829p8l67k50J55P8q68j808j555k07J015J511J871K544K973K545J649J160
$$ 19829 19751 19384 19134 19289 19367 18499 16691 15136 14929 15944 17455 19326 21870 24843 27388 29037 30197
55026C0197J337J725J842J521R16N25Q03J462J571P37k64n25j45L10Q39J692K317
$$ 30197 31534 33259 35101 36622 37538 38063 38866 40328 41899 42636 42372 41847 41702 42012 42851 44543 46860
55009D6860J781K78p81n77K5k81j547k672k825k167j412j102j263j401r23J22
$$ 46860 48641 48919 48138 47561 47586 47305 45758 43086 40261 38094 36682 35580 34317 32916 31993 32115
54993C2115R18Q10J52j73Q9M06L95L12L90K88l15r27o10Q13K347K817K051Q71
$$ 32115 33033 33843 33995 33822 33911 34317 34712 35024 35414 35702 35387 34460 33850 34663 37010 39827 41878 42749
54975D2749J62J55N72J126J691K167K387K280J972J725J794K316L215M164M799
$$ 42749 42911 43066 43638 44764 46455 48622 51009 53289 55261 56986 58780 61096 64311 68475 73274
54960G3274N087N442O368Q033J0131J2164J3814J5096J6132J6674J6034J3696
$$ 73274 78361 83803 90171 98204 108335 120499 134313 149409 165541 182215 198249 211945
54948B11945J0061O164K519j327n768j0036j2765j3599j3533j3526j3373j2391
$$ 211945 222006 228170 230689 229362 223594 213558 200793 187194 173661 160135 146762 134371
54936A34371j0720r274q548q039p034n516m096l223k792k440k041j757j641j359
$$ 134371 123651 114377 105829 97790 90756 85240 81144 77921 75129 72689 70648 68891 67250 65891
54922F5891n71N47J379J630J789K571M082N805P287Q583R955J1513J3227J4928
$$ 65891 65320 65867 67246 68876 70665 73236 77318 83123 90410 98993 108948 120461 133688 148616
54908A48616J6182J6322J4942J2277Q863M945M69m299q506j1368j2972j4078j5031
$$ 148616 164798 181120 196062 208339 217202 222147 222616 218317 209811 198443 185471 171393 156362
54895A56362j5226j4005j1810r951r133q719p741o190m836m052l472k781k176
$$ 156362 141136 127131 115321 105370 96237 87518 79777 73587 68751 64699 61227 58446 56270
54882E6270j890j667j161m50R6L55M28L55J50K4J60L20O0n73r37n85J08L92j4
$$ 56270 54380 52713 51552 51102 51198 51553 51981 52336 52486 52510 52670 52990 53050 52477 51540 50955 51063 51455 51441
54863E1441p37j295j550j598j528j322r29l35K69M51q6j038j641j520j114j058
$$ 51441 50704 49409 47859 46261 44733 43411 42482 42147 42416 42867 42781 41743 40102 38582 37468 36410
54847C6410j326j464j434j722k462l012k700j645m95K97O36N92M44O46J299J799
$$ 36410 35084 33620 32186 30464 28002 24990 22290 20645 20150 20447 21083 21675 22119 22765 24064 25863
54831B5863J579R61P30R47R05L88J09O39J469J701J250P93Q30J203J437J208N14
$$ 25863 27442 28403 29133 30080 30985 31373 31482 32121 33590 35291 36541 37334 38164 39367 40804 42012 42526
54814D2526j94k58N48J730K599K999L265L698M384N384O735Q311R941J1562J3110
$$ 42526 42332 42074 42622 44352 46951 49950 53215 56913 61297 66681 73416 81727 91668 103230 116340
54799A16340J4437J5523J6519J7206J6727J4364J0422N922J549k589o318r163
$$ 116340 130777 146300 162819 180025 196752 211116 221538 227460 229009 226420 220102 210939
54787B10939j0853j1569j1521j0756r532q439p812p386o714n766m878m341m110
$$ 210939 200086 188517 176996 166240 156708 148269 140457 133071 126357 120591 115713 111372 107262
54774A07262l835l155k172j516j602j944j632m56R54K082L022L927M597M972N428
$$ 107262 103427 100272 98100 96584 94982 93038 91406 90950 91904 93986 97008 100935 105532 110504 115932
54759A15932O312P585R258J1568J4321J6561J7424J6910J5338J2600Q630M257
$$ 115932 122244 129829 139087 150655 164976 181537 198961 215871 231209 243809 252439 256696
54747B56696O69j818l781n528o631o671n785m307k490q39j41q72k741n046p242
$$ 256696 257365 255547 251766 246238 239607 232936 227151 222844 220354 219515 219374 218502 215761 210715 203473
54732B03473r030j0257j0942j1250j1281j1020j0499r842r107q243p251o267n379
$$ 203473 194443 184186 173244 161994 150713 139693 129194 119352 110245 102002 94751 88484 83105
54719H3105m531l656k897k632l113l892l877k466o37j01j137k087j562l31no41
$$ 83105 78574 74918 72021 69389 66276 62384 58507 56041 55404 55303 54166 52079 50517 50186 50181 49540
54703D9540q90k74K31L1j33L68Q56M21o46j340j306r19m92o1K57L82M88O96P97
$$ 49540 48650 48376 48607 48638 48505 48873 49729 50150 49504 48164 46858 45939 45447 45386 45643 46025 46513 47209 48006
54684D8006O88O46Q09P64K57j40L10J463K472K850K713K265J602R85P06P06P26
$$ 48006 48694 49340 50149 50913 51170 51030 51340 52803 55275 58125 60838 63103 64705 65690 66396 67102 67828
54667F7828P20P43O50K93j58n41r93j497j505o79L44O78M27L99P56R24Q18J157
$$ 67828 68548 69291 69941 70234 70076 69535 68542 67045 65540 64861 65205 65883 66310 66709 67465 68389 69207 70364
54649G0364K267L431L841L589L335L524M218N219O102O551O909P869R425J0747
$$ 70364 72631 76062 79903 83492 86827 90351 94569 99788 105890 112441 119350 127219 136644 147391
54635A47391J1354J1899J3366J5938J8921K1408K2630K2058J9639J5797J0995
$$ 147391 158745 170644 184010 199948 218869 240277 262907 284965 304604 320401 331396
54624C31396N516k79n907j1036j5390j8337j9258j8530j7469j6918j6478j5463
$$ 331396 336912 336633 330726 319690 304300 285963 266705 248175 230706 213788 197310 181847
54612A81847j3960j2433j0934r364q044p346p062o702o157n548m796l885l150
$$ 181847 167887 155454 144520 135156 127112 119766 112704 106002 99845 94297 89501 85616 82466
54599H2466k842k728k635k830l301l257k228j052p88j081q28p3R6n38r85q16q03
$$ 82466 79624 76896 74261 71431 68130 64873 62645 61593 60805 59724 58896 58823 58919 58381 57396 56580 55777
54582E5777j336j539p96N8K4n00n05o5m5o10j114j257j270j077l65M59M28n47
$$ 55777 54441 52902 52106 52164 52188 51688 51183 51118 51073 50463 49349 48092 46822 45745 45380 45839 46267 45720
54564D5720j304r44l3K72k38q02q53n10p0L45O14N65L19K55M32M19l9m49r8R68
$$ 45720 44416 43472 43439 43711 43473 42671 41818 41308 41238 41583 42197 42762 43081 43336 43768 44187 44148 43699 43601 44569
54544D4569J929K117J672J150Q95R18J092J173R29N00M40J040J885K411K732L409
$$ 44569 46498 48615 50287 51437 52332 53250 54342 55515 56444 56944 57384 58424 60309 62720 65452 68861
54528F8861M506N438N809N970O488P492Q686R761J0499J0682J0176Q962P082M698
$$ 68861 73367 78805 84614 90584 97072 104564 113250 123011 133510 144192 154368 163330 170412 175110
54514A75110K196k6j998m131o592q981j0654j1164j0375q636o875o082o254o336
$$ 175110 177306 177280 175282 171151 164559 155578 144924 133760 123385 114749 107874 101792 95538 89202
54500H9202n521m207l374l349l692l907l668k725j254r9J28k1M30J260J232O4
$$ 89202 83681 79474 76100 72751 69059 65152 61484 58759 57505 57406 57534 57513 57943 59203 60435 60499
54484F0499r05o46K3j97r42o85Q60K185K024Q16l35j155j937k487k332j664j173
$$ 60499 59594 58948 58971 58774 57832 57147 58007 60192 62216 63032 62697 61542 59605 57118 54786 53122 51949
54467E1949r80n54K04N62k2j017j415r28j20L99N00L57J26j05k78l80m26m25m06
$$ 51949 50969 50415 50619 51181 51159 50142 48727 47799 47679 48078 48578 48935 49061 48956 48678 48298 47872 47447 47041
54448D7041l73k44M2L20K74j18m67m52k20j11j50p7K46O71R38P99J87n37p59l49
$$ 47041 46668 46424 46466 46786 47060 46942 46475 46023 45803 45692 45542 45465 45711 46382 47320 48119 48306 47769 47010 46661
54428D6661k6m90j352j477m59Q19J279Q74M30O01J292J939K052J627J136J049
$$ 46661 46635 46145 44793 43316 42857 43676 44955 45829 46259 46860 48152 50091 52143 53770 54906 55955
54412E5955J303J353R22M61O97J762K967L412K839J855J281J272J244P46Q6k21
$$ 55955 57258 58611 59533 59994 60691 62453 65420 68832 71671 73526 74807 76079 77323 78069 78155 77934
54396G7934l22p95j639k102j700r34o85j202j930k135j514m22M00M93J74J29M69
$$ 77934 77612 76817 75178 73076 71376 70442 69757 68555 66625 64490 62976 62554 62954 63447 63621 63750 64219
54379F4219N79j8j018j772k004j877j627j399j227r96o12k97l74p58r29n50K51
$$ 64219 64798 64780 63762 61990 59986 58109 56482 55083 53856 52860 52248 51951 51577 50819 49890 49340 49591
54362D9591J214K075K361J733P40N00J257K012J992J746K050K579K545K077J911
$$ 49591 50805 52880 55241 56974 57714 58214 59471 61483 63475 65221 67271 69850 72395 74472 76383
54347G6383K026J720R14K89Q9j55n36m37L17Q31K00j314k696l290l144k606j995
$$ 76383 78409 80129 81043 81332 81421 81266 80730 80293 80610 81441 81641 80327 77631 74341 71197 68591 66596
54330F6596j539j316j398j930k830l492l306k478j822j656j497r98m86k88j54
$$ 66596 65057 63741 62343 60413 57583 54091 50785 48307 46485 44829 43332 42334 41848 41560 41406
54315D1406K25O12O46M88M72M45Kp82j339j317r11n27l82m53n80o03n04l38m7
$$ 41406 41631 42243 42889 43377 43849 44294 44296 43514 42175 40858 39947 39420 39038 38585 38005 37402 36898 36560 36513
54296C6513M62R93J143Q85P27J038J512J610J295R15N79R3m87p33m28J3m4p03
$$ 36513 36975 37968 39111 39996 40723 41761 43273 44883 46178 47093 47672 47765 47278 46545 46117 46130 46086 45383
54278D5383j369j385p02J55P15R28Q86N35r4o34p51o25o03n63j65L63M35J23J60
$$ 45383 44014 42629 41927 42082 42797 43725 44611 45146 45052 44418 43667 43042 42439 41876 41711 42074 42509 42632 42792
54259D2792O49O24m86j740j796o51N84J286J743K142K088J388N18K8l5J26M25
$$ 42792 43441 44065 43579 41839 40043 39392 39976 41262 43005 45147 47235 48623 49141 49169 49134 49260 49685
54242D9685P34P74M66O8k43o18j122j366r22Q4J028J350Q59k75j582k487k713
$$ 49685 50419 51193 51659 51727 51484 50866 49744 48378 47456 47540 48568 49918 50777 50502 48920 46433 43720
54225D3720k496k177j707q57J55O45K79l89m95R6P17P54K99j71l55k47L7K76K02
$$ 43720 41224 39047 37340 36483 36638 37283 37562 37173 36678 36774 37491 38245 38544 38373 38018 37771 37808 38084 38286
54206C8286j40l47k34j83n12p83m33J69J11n93q45j42N67K79n95r64o86m99o77
$$ 38286 38146 37799 37565 37382 36870 36087 35654 35823 35934 35341 34496 34354 34921 35200 34605 33641 32955 32456 31779
54187C1779p79o15n10n52m04n2Rl80p27o33k26L83J387K587L066K206O51l48l05
$$ 31779 31000 30385 29875 29323 28919 28867 28876 28496 27769 27136 26910 27293 28680 31267 34333 36539 37190 36842 36537
54168C6537K24N09K83k83p49o55J0O24O02J04l10n23q05j078q83k38J54j51o67
$$ 36537 36761 37270 37553 37270 36521 35866 35876 36500 37102 37206 36896 36373 35568 34490 33607 33369 33523 33372 32705
54149C2705o76k38j8l00o08l62M37J227J395P99r3n77l50K69P70R55Q92O30K40
$$ 32705 32029 31791 31773 31473 30865 30503 30940 32167 33562 34361 34268 33691 33341 33610 34380 35335 36227 36857 37097
54130C7097J7K42P61J096J042Q39P17O61O51P55Q67P25L77J73J68j1l99m32J04
$$ 37097 37114 37356 38117 39213 40255 41094 41811 42472 43123 43878 44745 45470 45847 46020 46188 46177 45778 45346 45450
54111D5450L95l11j418j635p33K86P04P80Q15O13K09K04P43J036O10K82R79K097
$$ 45450 45845 45534 44116 42481 41748 42034 42738 43518 44333 44946 45155 45359 46102 47138 47748 48030 49009 51106
54093E1106K195J009k47o89o94q35p63Q9J306J819J281N06L45O42O69K35p4J04
$$ 51106 53301 54310 54063 53374 52680 51845 51082 51171 52477 54296 55577 56083 56428 57070 57739 57974 57900 58004
54075E8004K98l0n21m46K8no37p31M22J843K078J095J01j16K48Q57J590K039J697
$$ 58004 58302 58272 57751 57305 57333 57328 56691 55960 56382 58225 60303 61398 61499 61383 61631 62488 64078 66117 67814
54056F7814Q61N18J084J974K643L279M074M604M484M046L760L500L061K848L364
$$ 67814 68675 69193 70277 72251 74894 78173 82247 86851 91335 95381 99141 102641 105702 108550 111914
54041A11914M204M453L981L600L803M063L700K881K262J990J601Q85K93K92O42
$$ 111914 116118 120571 124552 128152 131955 136018 139718 142599 144861 146851 148452 149337 149630 149922 150564
54026A50564O58L4r36j868k664l289l607l685l887m366m709m472l794l171k808
$$ 150564 151222 151256 150320 148452 145788 142499 138892 135207 131320 126954 122245 117773 113979 110808 108000
54011A08000k610k598k796k857k389j608j149j200j404j575j888k237k153j559
$$ 108000 105390 102792 99996 97139 94750 93142 91993 90793 89389 87814 85926 83689 81536 79977
53997G9977j083j203j616j789j714j658j594j290p92m03k89l34k67J05O05P16
$$ 79977 78894 77691 76075 74286 72572 70914 69320 68030 67238 66835 66546 66212 65945 66050 66655 67371
53981F7371K10l43k67J49L8n97p37NO62M11j62j39K56K87J76P32J810K280J586
$$ 67371 67581 67238 66971 67120 67158 66561 65824 65829 66491 66902 66740 66601 66857 67144 67320 68052 69862 72142 73728
53962G3728L71m80o92l75J97N45L60K1J23O12R18R50J142J592K007K414L106L740
$$ 73728 74099 73619 72927 72552 72749 73294 73654 73675 73798 74410 75328 76278 77420 79012 81019 83433 86539 90279
53944I0279L568K791K671L772N089N500N357N743O870P998Q635Q977R326R744
$$ 90279 93847 96638 99309 103081 108170 113670 119027 124770 131640 139638 148273 157250 166576 176320
53930A76320J0167J0369R966Q849P480O377N493M519L482K626J931J206N13J4
$$ 176320 186487 196856 206822 215671 223151 229528 235021 239540 243022 245648 247579 248785 249298 249312
53916B49312m39j065j719k141k490l052l605l687l406l374l752l996l756l407
$$ 249312 248873 247808 246089 243948 241458 238406 234801 231114 227708 224334 220582 216586 212830 209423
53902B09423l471l959m602n277n935o391o557o581o522o149n324m398l889l914
$$ 209423 205952 201993 197391 192114 186179 179788 173231 166650 160128 153979 148655 144257 140368 136454
53888A36454m128m121l747l187k853k986l264l120k608k434k924l369l006k176
$$ 136454 132326 128205 124458 121271 118418 115432 112168 109048 106440 104006 101082 97713 94707 92531
53874I2531j803j952j767r64m01q15j619j664p48K50N33J24m99r87j248j339j340
$$ 92531 90728 88776 87009 86045 85644 84829 83210 81546 80798 81048 81581 81705 81206 80219 78971 77632 76292
53857G6292j250j017p67p64r49q54l04J55P8M0R79K631L518K745J131J69M54J537
$$ 76292 75042 74025 73258 72494 71545 70691 70387 70542 70620 70660 71639 74270 77788 80533 81664 81833 82287 83824
53839H3824K653L079K335P63m57n31p9k57j152j780j583j002n04K3O09P34J45
$$ 83824 86477 89556 91891 92654 92197 91666 91587 91330 90178 88398 86815 85813 85309 85332 85941 86675 86820
53822H6820m31o5J158K248K561K393K379K693L010L056K999L237L800M143L792
$$ 86820 86389 86324 87482 89730 92291 94684 97063 99756 102766 105822 108821 112058 115858 120001 123793
53807A23793L122K993L534L790K987J636Q71Q73P98K47n0N88J525J481K58r82
$$ 123793 126915 129908 133442 137232 140219 141855 142726 143599 144397 144644 144594 145182 146707 148188 148446 147464
53791A47464j258r41r96j609k196k479k767l142l122k528k047k339k966k940k165
$$ 147464 146206 145265 144269 142660 140464 137985 135218 132076 128954 126426 124379 122040 119074 116134 113969
53776A13969j567j761k225k082j224l21j3m18j213j928k254k236k091j936j832
$$ 113969 112402 110641 108416 106334 105110 104789 104776 104358 103145 101217 98963 96727 94636 92700 90868
53761I0868j956k361k562j956p39N8k82j355k230k466k199j667j095p72q37j098
$$ 90868 88912 86551 83989 82033 81294 81352 81070 79715 77485 75019 72820 71153 70058 69286 68449 67351
53745F7351j345j615j877j788j199n65l94n01l96j31k13o95j039q80m60k01k59
$$ 67351 66006 64391 62514 60726 59527 58962 58568 58067 57671 57540 57327 56632 55593 54713 54253 54052 53793
53728E3793n61q04m47P68K199K673J807M82j79L6N70R88J313J671J942J840J171
$$ 53793 53232 52428 51981 52749 54948 57621 59428 59910 59731 59767 60337 61325 62638 64309 66251 68091 69262
53711F9262Q6r42j452j360q96l41J1j31o95r78k49J300K672L198L113K931K786
$$ 69262 69348 68406 66954 65594 64698 64357 64368 64237 63542 62564 62315 63615 66287 69485 72598 75529 78315
53694G8315K613K472K344J990J313N57l7m80p14n82k97l68o89l52J070K604L046
$$ 78315 80928 83400 85744 87734 89047 89604 89567 89087 88373 87791 87494 87126 86437 86085 87155 89759 92805
53677I2805K526K103K079J722O42m83q27l38M71J106J247Q88N28O89J095Q92j38
$$ 92805 95331 97434 99513 101235 101877 101394 100567 100229 100700 101806 103053 103941 104469 105158 106253 107145 107007
53660A07007j163j424j152r31p30j65O30J105J127J117J328J457J085K56n14p41
$$ 107007 105844 104420 103268 102337 101607 101442 102072 103177 104304 105421 106749 108206 109291 109547 109033 108292
53644A08292m65k47n36j031r90k76L81L83L3p5k1k53o13m56K14N37m9q95q94J78
$$ 108292 107827 107580 107044 106013 105023 104747 105128 105511 105544 105469 105448 105195 104582 104126 104340 104877 104828 103933 103039 103217
53624A03217J411J792J185K78k21j83J29N71J188J755J754J082N06R02K122L054
$$ 103217 104628 106420 107605 107883 107662 107479 107608 108179 109367 111122 112876 113958 114464 115366 117488 120542
53608A20542K839J677M77J8M80J389J989J896J497J410J691J905J942K131K502
$$ 120542 123381 125058 125535 125553 126033 127422 129411 131307 132804 134214 135905 137810 139752 141883 144385
53593A44385K535J938J128O29M23L26M97J069J590J469P34o2n31n95j42P66J509
$$ 144385 146920 148858 149986 150615 151038 151364 151861 152930 154520 155989 156723 156661 156130 155535 155393 156159 157668
53576A57668J347M02m35o41o09q51j210j234q53l44J24N05O93O73O92R20J066
$$ 157668 159015 159417 158982 158341 157732 156881 155671 154437 153584 153240 153364 153869 154562 155235 155927 156847 157913
53559A57913O61k81j254j788j777j285m09O11J437J895K015J753J014P7l76K1
$$ 157913 158574 158293 157039 155251 153474 152189 151780 152391 153828 155723 157738 159491 160505 160582 160206 160227
53543A60227P68J050P29L98M34N74N39O51J304K150K374J830J333J607K339K599
$$ 160227 160995 162045 162774 163172 163606 164180 164719 165370 166674 168824 171198 173028 174361 175968 178307 180906
53527A80906K058J353J291J951K658K750K260J870K207L210M256M837M979N016
$$ 180906 182964 184317 185608 187559 190217 192967 195227 197097 199304 202514 206770 211607 216586 221602
53513B21602N186N584O235P012P581P689P505P489P898Q569R186R641J0091J0689
$$ 221602 226788 232372 238607 245619 253200 260889 268394 275883 283781 292350 301536 311177 321268 331957
53499C31957J1338J1780J1998J2383J3269J4286J4591J3814J2590J1896J2119
$$ 331957 343295 355075 367073 379456 392725 407011 421602 435416 448006 459902 472021
53488D72021J2935J3819J4344J4223J3522J2725J2285J2170J2102J2135J2573
$$ 472021 484956 498775 513119 527342 540864 553589 565874 578044 590146 602281 614854
53477F14854J3320J3802J3668J3191J2897J2990J3263J3370J3057J2374J1705
$$ 614854 628174 641976 655644 668835 681732 694722 707985 721355 734412 746786 758491
53466G58491J1377J1230J0815J0026R236Q782Q593Q379P895O959N506L784K202
$$ 758491 769868 781098 791913 801939 811175 819957 828550 836929 844824 851783 857289 861073 863275
53453H63275Q44n82k205l675m622n184n872o947q050q468p802o561n873o370p485
$$ 863275 864119 863537 861332 857657 853035 847851 841979 835032 826982 818514 810712 804151 798278 791908 784423
53438G84423q206q401q762r548j0146j0133r942j0065j0204r874r328r129r117
$$ 784423 776217 767816 759054 749506 739360 729227 719285 709220 699016 689142 679814 670685 661568
53425F61568q525p022n071l268j947j276j215j269q90j91J98R5R9P95K041L305
$$ 661568 653043 646021 640950 637682 635735 634459 633244 631975 631085 630894 631092 631187 631286 632081 634122 637427
53409F37427M356N328O290P088P562P733P820Q103Q754R678J0649J1579J2500
$$ 637427 641783 647111 653401 660489 668051 675784 683604 691707 700461 710139 720788 732367 744867
53396G44867J3346J3964J4441J5238J6799J8993K1076K2357K2910K3469K4525
$$ 744867 758213 772177 786618 801856 818655 837648 858724 881081 903991 927460 951985
53385I51985K5704K6301K6332K6573K7515K8788K9808L0505L1088L1478L1498
$$ 951985 977689 1003990 1030322 1056895 1084410 1113198 1143006 1173511 1204599 1236077 1267575
53374A267575L1323L1270L1319L1256L1025L0528K9323K7127K4498K2374K1025
$$ 1267575 1298898 1330168 1361487 1392743 1423768 1454296 1483619 1510746 1535244 1557618 1578643
53363A578643J9955J8750J7406J5825J3742J1229Q666O079L146p6l121o033r486
$$ 1578643 1598598 1617348 1634754 1650579 1664321 1675550 1684216 1690295 1693441 1693365 1690244 1684211 1674725
53350A674725j3653j7664k0720k3061k5258k7116k8029k8045k7751k7329k6533
$$ 1674725 1661072 1643408 1622688 1599627 1574369 1547253 1519224 1491179 1463428 1436099 1409566
53339A409566k5488k4716k4279k3614k2486k1482k1192k1351k1336k1199k1652
$$ 1409566 1384078 1359362 1335083 1311469 1288983 1267501 1246309 1224958 1203622 1182423 1160771
53328A160771k2942k4285k4707k4157k3332k2538k1366j9651j8122j7487j7246
$$ 1160771 1137829 1113544 1088837 1064680 1041348 1018810 997444 977793 959671 942184 924938
53317I24938j6138j3790j1153r316q529q604r496j0968j2242j2653j2314j1750
$$ 924938 908800 895010 883857 874541 866012 857408 847912 836944 824702 812049 799735 787985
53305G87985j1152j0453r787r364r069q673q194p720p045n980m761l644k462j052
$$ 787985 776833 766380 756593 747229 738160 729487 721293 713573 706528 700548 695787 692143 689681 688629
53291F88629R0L92K51P40K199L892N124O039P044Q116R105J0135J1296J2224J2437
$$ 688629 688719 689111 689362 690102 692301 696193 701317 707356 714400 722516 731621 741756 753052 765276 777713
53276G77713J1938J1251J1005J1476J2356J2834J2329J1222J0523J0624J0821
$$ 777713 789651 800902 811907 823383 835739 848573 860902 872124 882647 893271 904092
53265I04092J0225Q737O871N038L485K502K197K077J346k96k437m483o258q013
$$ 904092 914317 923054 929925 934963 938448 940950 943147 945224 946570 946274 943837 939354 933096 925083
53251I25083r957j1862j3123j3417j3224j3437j4363j5388j5781j5514j5088j4804
$$ 925083 915126 903264 890141 876724 863500 850063 835700 820312 804531 789017 773929 759125
53239G59125j4588j4282j3872j3382j2889j2478j2107j1560j0809j0274j0537
$$ 759125 744537 730255 716383 703001 690112 677634 665527 653967 643158 632884 622347
53228F22347j1700j3200j4244j4445j4089j3777j3727j3544j2845j1859j1048
$$ 622347 610647 597447 583203 568758 554669 540892 527165 513621 500776 488917 477869
53217D77869j0246q888p096n793n436n359m875m333m492n314o227p123q313r688
$$ 477869 467623 458735 451639 445846 440410 435051 430176 425843 421351 416037 409810 402687 394374 384686
53203C84686j0734j1244j1315j0849r811q852q708r023q751p801p215p427p507
$$ 384686 373952 362708 351393 340544 330733 321881 313173 304150 295399 287598 280383 272956 265449
53190B65449o693n671n498o042o397o325o300o442o325n840n480n644o131o402
$$ 265449 258756 253085 247587 241545 235148 228823 222523 216081 209756 203916 198436 192792 186661 180259
53176A80259n989m739l060j801j496j801j980j815j618j575j490j169o52j35N2
$$ 180259 174270 169531 166471 164670 163174 161373 159393 157578 155960 154385 152895 151726 151074 150939 150991
53161A50991l57j113j461j058n00l92l72K03R41Q21j64q55n64J53N93Q00R49P45
$$ 150991 150634 149521 148060 147002 146502 146110 145738 145941 146882 147703 147539 146684 146120 146273 146866 147666 148615 149360
53143A49360J26l15k25j50n18o90K5J005J005J3p07m30J98L45J69L05P57R06L53
$$ 149360 149486 149171 148946 148796 148278 147588 147613 148618 149623 149636 148929 148499 148697 149042 149211 149516 150273 151179 151532
53124A51532n84j197j009k11M91N17p2p88j286j472j309q91n88o97r85r61n99
$$ 151532 150948 149751 148742 148531 149022 149539 149467 148679 147393 145921 144612 143721 143133 142436 141451 140490 139891
53107A39891l26l39m32n09p65j167j344j250j374j912k240j715o58N3J52J02J29
$$ 139891 139565 139226 138794 138285 137520 136353 135009 133759 132385 130473 128233 126518 125860 125913 126065 126167 126296
53090A26296j73j136k340l020k822j976r63k35q5m67r79j213j137j019j009j044
$$ 126296 126123 124987 122647 119627 116805 114829 113866 113631 113546 113079 112100 110887 109750 108731 107722 106678
53074A06678j098j303j618j666j110j93L78J73m65p56k94N34R40N11l61q85p18
$$ 106678 105580 104277 102659 100993 99883 99690 100068 100241 99776 99020 98726 99260 100200 100711 100350 99465 98747
53057I8747k58l4JK96R85J717K238K638K933K875K431K061K113K253J903J063
$$ 98747 98489 98455 98456 98752 99737 101454 103692 106330 109263 112138 114569 116630 118743 120996 122899 123962
53041A23962K46k00l73m79p29j388k472l433l612l023k292j800j394r91q82j229
$$ 123962 124208 124008 123635 123156 122427 121039 118567 115134 111522 108499 106207 104407 103013 102022 101140 99911
53025I9911j688j855j720j489j216r25p72q61j037j090j024r10p40m79j53L00
$$ 99911 98223 96368 94648 93159 91943 91018 90246 89385 88348 87258 86234 85324 84584 84105 83952 84252
53009H4252R10J361J117J50p79r24l35L57P27P50M26j79o78n21L21J150J223N68
$$ 84252 85162 86523 87640 87790 87011 86087 85752 86109 86836 87586 88012 87833 87155 86634 86955 88105 89328 89896
52991H9896p0l4N49R57P31J53j75n7K26L68L24J75J24M43J112J565J282N79K34
$$ 89896 89826 89792 90341 91298 92029 92182 92007 91950 92176 92544 92868 93043 93167 93610 94722 96287 97569 98148 98382
52972I8382L52L02o6m9O68J219P61j19j30R09J836J681O85k72o18l27K68P15P84
$$ 98382 98734 99036 98970 98921 99589 100808 101569 101450 101320 102229 104065 105746 106431 106159 105541 105214 105482 106197 106981
52953A06981O36M77K24j35j48N64J536J809J086j6q19j199j202p33J53J029J465
$$ 106981 107617 108094 108318 108183 108035 108599 110135 111944 113030 113014 112195 110996 109794 109061 109214 110243 111708
52936A11708J375R22L43p1j46n8j11k53j62J75M12L74K57K73M66R27J625K071
$$ 111708 113083 114005 114348 114277 114131 114073 113962 113709 113547 113722 114134 114508 114765 115038 115504 116431 118056 120127
52918A20127J687P16J13L16O74M75oJ3O81J364J510J192Q91R90J437J765J604
$$ 120127 121814 122530 122643 122959 123633 124108 124102 124115 124796 126160 127670 128862 129753 130743 132180 133945 135549
52901A35549J182J053J297J488J451J536J889K095J929J802J945J743O50p45j421
$$ 135549 136731 137784 139081 140569 142020 143556 145445 147540 149469 151271 153216 154959 155609 154864 153443
52886A53443j342j347j722j905j654j519j866k231k122j796j687j617j170n18
$$ 153443 152101 150754 149032 147127 145473 143954 142088 139857 137735 135939 134252 132635 131465 130947
52872A30947k50n22q46p33j00P98J547J780J567J509J980K389J749M3j599k337
$$ 130947 130697 130175 129329 128596 128496 129294 130841 132621 134188 135697 137677 140066 141815 141858 140259 137922
52856A37922k601l188l897l810k734j523r26p97p12o44o82n99k62j6j76m80o17
$$ 137922 135321 132133 128236 124426 121692 120169 119243 118446 117734 117090 116408 115809 115547 115531 115355 114875 114258
52839A14258r31j841k820k857j885r10n33l15J07K48k70p89n46N3J8o71j102r14
$$ 114258 113327 111486 108666 105809 103924 103014 102481 102166 102273 102521 102251 101462 100916 100969 100987 100316 99214 98300
52821I8300p17q76q57k08N46O63K44o3j65n40j297j887j825j230m44L60R12P55
$$ 98300 97583 96707 95850 95642 96188 96851 97095 97032 96867 96327 95030 93143 91318 90088 89644 90004 90916 91671
52803I1671j65j053j088n06k78p28j116q37k56k7j24j68j94l60k59N80J666J903
$$ 91671 91506 90453 89365 88859 88581 87853 86737 85900 85644 85617 85493 85325 85131 84771 84512 85092 86758 88661
52785H8661J106K92K54O58Q91J029J460K116K693L111L296K914J919R11M05J03
$$ 88661 89767 90059 90313 90971 91862 92891 94351 96467 99160 102271 105567 108481 110400 111311 111716 111819
52769A11819n23j286j663j750k071k588k695k230j759j714j869j874j764j727
$$ 111819 111296 110010 108347 106597 104526 101938 99243 97013 95254 93540 91671 89797 88033 86306
52755H6306j781j866j871j619j058n01j73L39J496K740K806J399j86o26j31J02
$$ 86306 84525 82659 80788 79169 78111 77610 77437 77776 79272 82012 84818 86217 86031 85405 85274 85376
52739H5376m40j131j237p99l51k88n71r26j142j228j254j148q15n03o66j352j990
$$ 85376 84936 83805 82568 81769 81418 81130 80559 79633 78491 77263 76009 74861 74046 73543 72877 71525 69535
52722F9535j979j285k94O00J100R90L88j80k62%K02K85M94Q09Q69N16K3k93m36
$$ 69535 67556 66271 65977 66577 67677 68667 69055 68875 68613 68613 68815 69100 69594 70403 71272 71788 71811 71518 71082
52703G1082m64j87N58J441J831J485Q49N48P78J296J788J979J596O21m53j009
$$ 71082 70618 70431 70989 72430 74261 75746 76595 77143 77921 79217 81005 82984 84580 85201 84748 83739
52687H3739j046j125j445j472p85J77P19Q06P37L63o23j659j638m48O99Q00J87
$$ 83739 82693 81568 80123 78651 77866 78043 78762 79568 80305 80668 80045 78386 76748 76300 76999 77799 77986
52670G7986k93m76n51k13Q89K149K428J559O35N38R33R69N16J56K31M14K42k57
$$ 77986 77693 77217 76666 76453 77342 79491 81919 83478 84113 84651 85584 86553 87069 87225 87456 87870 88112 87855
52652H7855n62k40N60J231J301R27O39O41N21j74j192j701j257m19n9k24j16O92
$$ 87855 87293 87053 87613 88844 90145 91072 91711 92352 92873 92699 91507 89806 88549 88130 88071 87847 87731 88423
52634H8423J581J841J779K228L145L621L254K736K712K805K300J220J11p81j465
$$ 88423 90004 91845 93624 95852 98997 102618 105872 108608 111320 114125 116425 117645 117756 116975 115510
52619A15510j701j316p71p26j080j236j143j332j798j734p38M40Q84O67N16P10
$$ 115510 113809 112493 111722 110996 109916 108680 107537 106205 104407 102673 101935 102375 103259 103926 104442 105152
52603A05152R26R50R43R97R03M42k67q57r99o85k74j71l25k65K67R08J156J023
$$ 105152 106078 107028 107971 108968 109871 110313 110046 109189 108190 107505 107231 107060 106735 106470 106737 107645 108801 109824
52585A09824Q82Q70Q02O47O36Q52J023Q52L50k49o56o46k01L82P37Q39R30J025
$$ 109824 110706 111576 112378 113025 113661 114513 115536 116388 116738 116489 115833 115187 114986 115368 116105 116944 117874 118899
52567A18899Q33L05j80l71n31r59j423j446r93m67j36M4J46K14M60J021J547J431
$$ 118899 119732 120037 119857 119486 118955 117996 116573 115127 114134 113667 113531 113575 113721 113935 114395 115416 116963 118394
52549A18394O11l34r26j188j208q53k30J53P6O5N83J245J370J022P68O85L53j66
$$ 118394 119005 118671 117745 116557 115349 114496 114266 114419 114495 114560 115143 116388 117758 118780 119548 120233 120586 120420
52531A20420l27j37l54j206j733j070K04P63K43n26q77j009j238j250o38K72O72
$$ 120420 120093 119956 119602 118396 116663 115593 115797 116560 116803 116277 115400 114391 113153 111903 111265 111537 112209
52514A12209K92k71l59n8l9o61j537k007j799j176n43j68j24l05m78m83m04l73
$$ 112209 112501 112230 111871 111813 111774 111113 109576 107569 105770 104594 104051 103883 103759 103454 102976 102493 102089 101716
52496A01716l25j33O9l3m90j008j346j483j365p81K45J220J579J213M68k37o84
$$ 101716 101391 101258 101327 101294 100804 99796 98450 96967 95602 94821 95066 96286 97865 99078 99546 99309 98625
52479I8625q63r04r07q13n45k33j07j50j28%N0kj8q6m43q22n11N80J493J329M24
$$ 98625 97762 96858 95951 95138 94593 94360 94253 94103 93975 93975 94025 94023 94005 93919 93476 92654 92143 92723 94216 95545 95969
52458I5969k31l08l08n86r45j124j069o63K05J180J607J300P67M70L69K85L45
$$ 95969 95738 95430 95122 94536 93591 92467 91398 90735 90940 92120 93727 95027 95794 96264 96633 96918 97263
52441I7263O76R87Q45K50l16m30j63Q4J51L14Q29J349J246N41K8K27O74P44O27
$$ 97263 97939 98926 99771 100021 99705 99275 99112 99196 99347 99661 100490 101839 103085 103626 103654 103881 104555 105299 105926
52422A05926Q89J395J536J295J249J469J347O90J03PP3m4j03R4J55k08n54l59
$$ 105926 106815 108210 109746 111041 112290 113759 115106 115796 115899 115906 115979 115935 115832 115926 116081 115873 115319 114960
52404A14960J96O51J014J396J422P73Rp3L42L68j47l87P0N82N11J40L8J01j37
$$ 114960 115156 115807 116821 118217 119639 120412 120421 120348 120690 121058 120911 120524 120594 121176 121687 121827 121865 121966 121829
52385A21829n84o61k13K25J92l6K15J160K222K644K298J792J708J951K039J845
$$ 121829 121245 120584 120371 120596 120788 120752 120967 122127 124349 126993 129291 131083 132791 134742 136781 138626
52369A38626J713J815J778J215L70n0L22J121J670J631J240J005J271J984K716
$$ 138626 140339 142154 143932 145147 145517 145467 145789 146910 148580 150211 151451 152456 153727 155711 158427
52354A58427K886K165Q13l51n34L66J656K478K482J962J494J466J875K405K775
$$ 158427 161313 163478 164291 163940 163406 163772 165428 167906 170388 172350 173844 175310 177185 179590 182365
52339A82365K992L161L185K962K833L396M660N770N957N480N208N548O262P099
$$ 182365 185357 188518 191703 194665 197498 200894 205554 211324 217281 222761 227969 233517 239779 246878
52325B46878Q009Q791R239R721J0878J2541J3599J3420J2825J3048J4180J5307
$$ 246878 254887 263678 272917 282638 293516 306057 319656 333076 345901 358949 373129 388436
52313C88436J5905J6238J6523J6583J6477J6702J7354J7743J7255J6188J5156
$$ 388436 404341 420579 437102 453685 470162 486864 504218 521961 539216 555404 570560
52302E70560J4166J2879J1476J0479R809Q764P121N555M682M262L712K923K078
$$ 570560 584726 597605 609081 619560 629369 638133 645254 650809 655491 659753 663465 666388 668466
52289F68466J020o09k674m541n730o280o480o578o712o754o250m881l045j591
$$ 668466 669486 668877 666203 661662 655932 649652 643172 636594 629882 623128 616878 611997 608952 607361
52275F07361r07n65N4J154K606M236N834P146Q104Q892R642J0327J1016J1900
$$ 607361 606454 605889 605943 607097 609703 613939 619773 626919 635023 643915 653557 663884 674900 686800
52261F86800J2851J3338J3077J2517J2257J2267J2086J1636J1271J1056J0506
$$ 686800 699651 712989 726066 738583 750840 763107 775193 786829 798100 809156 819662
52250H19662R229P507N916M567L064J169p51k096k739l181l991n195o377p233
$$ 819662 828891 836398 842314 846881 849945 851114 850363 848267 845528 842347 838356 833161 826784 819551
52236H19551p821q295q624q705q578q428q445q672q866q604p725o623n795n195
$$ 819551 811730 803435 794811 786106 777528 769100 760655 751983 743117 734513 726788 720165 714370 709175
52222G09175m434l601l266l458l296k058k47R91J165P15L17M15J215K509L631
$$ 709175 704741 701140 697874 694416 691120 689062 688815 689806 690971 691686 692003 692418 693633 696142 699773
52207F99773M092M123M178M149L678L007K800L100L298L116K870K625J975R65
$$ 699773 703865 707988 712166 716315 719993 723000 725800 728900 732198 735314 738184 740809 742784 743749
52193G43749L85O01P92Nj476k527k583k029j439j097j124j521k060k529k992l517
$$ 743749 744134 744735 745527 745532 744056 741529 738946 736917 735478 734381 733257 731736 729676 727147 724155 720638
52177G20638l822l672l418l598m090m242l786l102k482j763r04l97o71j456k131
$$ 720638 716816 713144 709726 706128 702038 697796 694010 690908 688426 686663 685759 685362 684691 683235 681104
52162F81104k477k676k780k597k152j814j850k111k325k437k468k248j646j007
$$ 681104 678627 675951 673171 670574 668422 666608 664758 662647 660322 657885 655417 653169 651523 650516
52148F50516r26j461j929j763j246j005j052q66l65j43n89j283j595j386p85K25
$$ 650516 649590 648129 646200 644437 643191 642186 641134 640268 639903 639760 639171 637888 636293 634907 634122 634347
52132F34347J581K801L410L594L934M649N509O406P484Q707R761J0527J1273J2310
$$ 634347 635928 638729 642139 645733 649667 654316 659825 666231 673715 682422 692183 702710 713983 726293
52118G26293J3633J4942J5786J5882J5532J5528J6204J6825J6495J5556J5241
$$ 726293 739926 754868 770654 786536 802068 817596 833800 850625 867120 882676 897917
52107H97917J5913J6464J5827J4300J2874J1843J0766R340P680N922M164K668
$$ 897917 913830 930294 946121 960421 973295 985138 995904 1005244 1012924 1018846 1023010 1025678
52095A025678J525K55j756m390o785q194q551q274p910p875q169q369q171p773
$$ 1025678 1027203 1027458 1025702 1021312 1014527 1006333 997782 989508 981598 973723 965554 957185 949014 941241
52081I41241p398o717n349l659k417j720r75M7R88J817L094M872O238O598O762
$$ 941241 933843 927126 921777 918118 915701 913981 913006 913053 914041 915858 918952 923824 930062 936660 943422
52066I43422P935R997J1610J1844J1026J0043R480R437R605R350Q257O694N514
$$ 943422 951357 961354 972964 984808 995834 1005877 1015357 1024794 1034399 1043749 1052006 1058700 1064214
52053A064214N047M689L599J568q81l005m385n209o078p458r265j1159j2960j4587
$$ 1064214 1069261 1073950 1077549 1079117 1078236 1075231 1070846 1065637 1059559 1052101 1042836 1031677 1018717 1004130
52039A004130j5839j6562j6905j7024j6742j5966j5240j5284j6060j6909j7473
$$ 1004130 988291 971729 954824 937800 921058 905092 889852 874568 858508 841599 824126
52028H24126j7809j7657j6481j4519j2836j2010j1473j0679j0072j0287j0994
$$ 824126 806317 788660 772179 757660 744824 732814 721341 710662 700590 690303 679309
$$ [...]
##END NTUPLES=NMR SPECTRUM
##END=
