##TITLE=NES1037_878015026_9242866_9XMLrb76ax
##JCAMPDX= 6.0         $$ Bruker NMR JCAMP-DX V2.0
##DATA TYPE= NMR SPECTRUM
##DATA CLASS= NTUPLES
##ORIGIN= BRUKER
##OWNER= Administrator
$$ 1.72 TOPSPIN		Version 2.1
$$ 2015-07-02 04:40:29.602 -0700  Administrator@X
$$ Compression mode = diff/dup
##.OBSERVE FREQUENCY= 400.02188249412
##.OBSERVE NUCLEUS= ^1H
##.ACQUISITION MODE= SIMULTANEOUS (DQD)
##.ACQUISITION SCHEME= undefined
##.AVERAGES= 8
##.DIGITISER RES= 22
##SPECTROMETER/DATA SYSTEM= spect
##.PULSE SEQUENCE= zg30
##.SOLVENT NAME= COFFEE_meoh
##.SHIFT REFERENCE= INTERNAL, COFFEE_meoh, 1, 14.98509
##AUDIT TRAIL= $$ (NUMBER, WHEN, WHO, WHERE, PROCESS, VERSION, WHAT)
$$ ##TITLE= Audit trail, TOPSPIN		Version 2.1
$$ ##JCAMPDX= 5.01
$$ ##ORIGIN= Bruker BioSpin GmbH
$$ ##OWNER= Administrator
$$ $$ E:\/data/COFFEE/nmr/NES1037_878015026_9242866_9XMLrb76ax/30/pdata/1/auditp.txt
$$ ##AUDIT TRAIL=  $$ (NUMBER, WHEN, WHO, WHERE, PROCESS, VERSION, WHAT)
(   1,<2015-07-02 04:40:22.039 -0700>,<Administrator>,<X>,<go>,<TOPSPIN 2.1>,
      <created by zg
	started at 2015-07-02 04:39:16.086 -0700,
	POWCHK enabled, PULCHK disabled,
       configuration hash MD5:
       21 0F 79 D6 B3 7B B4 F6 88 20 88 DB 03 48 BD 9F
       data hash MD5: 64K
       BE 7A 4C 2A CD 7E 04 2C 50 33 15 B0 8F B8 46 D3>)
(   2,<2015-07-02 04:40:25.555 -0700>,<Administrator>,<X>,<proc1d>,<TOPSPIN 2.1>,
      <Start of raw data processing
       efp LB = 0 FT_mod = 6 PKNL = 1 PHC0 = 0 PHC1 = 0 SI = 32K 
       data hash MD5: 32K
       23 72 A4 BF 39 29 0F 28 34 C5 0D D3 54 11 96 00>)
(   3,<2015-07-02 04:40:25.836 -0700>,<Administrator>,<X>,<proc1d>,<TOPSPIN 2.1>,
      <pk PHC0 = 90.401 PHC1 = 0 
       data hash MD5: 32K
       98 A4 7F 71 25 D3 36 ED 67 58 80 56 72 58 3D 37>)
(   4,<2015-07-02 04:40:25.961 -0700>,<Administrator>,<X>,<proc1d>,<TOPSPIN 2.1>,
      <abs ABSG = 1 
       data hash MD5: 32K
       7B 7E 60 22 7D 89 E5 9B 76 BF 9F 64 5E 13 7B 82>)
(   5,<2015-07-02 04:40:26.024 -0700>,<Administrator>,<X>,<proc1d>,<TOPSPIN 2.1>,
      <abs ABSG = 2 
       data hash MD5: 32K
       31 55 E3 C2 A8 03 DB 80 3D A4 60 32 33 97 4A 44>)
(   6,<2015-07-02 04:40:26.070 -0700>,<Administrator>,<X>,<proc1d>,<TOPSPIN 2.1>,
      <abs ABSG = 3 
       data hash MD5: 32K
       90 2E 9F DB 87 48 B8 C4 D6 26 C5 9B F2 2A DD 74>)
(   7,<2015-07-02 04:40:26.133 -0700>,<Administrator>,<X>,<proc1d>,<TOPSPIN 2.1>,
      <abs ABSG = 4 
       data hash MD5: 32K
       7E D3 69 1A FD 73 2E E3 B6 32 42 4F 5B 66 A6 09>)
(   8,<2015-07-02 04:40:26.195 -0700>,<Administrator>,<X>,<proc1d>,<TOPSPIN 2.1>,
      <abs ABSG = 5 
       data hash MD5: 32K
       E1 CC D1 40 B8 F8 E0 04 05 EA 7C 27 7F 5F F5 BD>)
$$ ##END=
$$ 
$$ $$ hash MD5
$$ $$ F9 EB D6 C8 10 70 20 47 A0 5C 07 A6 2F 5E 6A 87
##$RELAX= 
##$RELAX= 
##$RELAX= 
##$RELAX= 
##$RELAX= 
##$RELAX= 
##$RELAX= 
$$ Bruker specific parameters
$$ --------------------------
##$DU= <E:\>
##$EXPNO= 30
##$NAME= <NES1037_878015026_9242866_9XMLrb76ax>
$$ [...]
##$TP= (0..7)
150 150 150 150 150 150 150 150
##$TP07= 0
##$TPNAME0= <>
##$TPNAME1= <>
##$TPNAME2= <>
##$TPNAME3= <>
##$TPNAME4= <>
##$TPNAME5= <>
##$TPNAME6= <>
##$TPNAME7= <>
##$TPOAL= (0..7)
0.5 0.5 0.5 0.5 0.5 0.5 0.5 0.5
##$TPOFFS= (0..7)
0 0 0 0 0 0 0 0
##$TUNHIN= 0
##$TUNHOUT= 0
##$TUNXOUT= 0
##$USERA1= <user>
##$USERA2= <user>
##$USERA3= <user>
##$USERA4= <user>
##$USERA5= <user>
##$V9= 5
##$VALIST= <valist>
##$VCLIST= <CCCCCCCCCCCCCCC>
##$VD= 0
##$VDLIST= <DDDDDDDDDDDDDDD>
##$VPLIST= <PPPPPPPPPPPPPPP>
##$VTLIST= <TTTTTTTTTTTTTTT>
##$WBST= 2048
##$WBSW= 25
##$XGAIN= (0..3)
0 0 0 0
##$XL= 0
##$YL= 0
##$YMAX_a= 621029
##$YMIN_a= -516850
##$ZGOPTNS= <>
##$ZL1= 120
##$ZL2= 120
##$ZL3= 120
##$ZL4= 120
##$ABSF1= 14.98509
##$ABSF2= -5.573092
##$ABSG= 5
##$ABSL= 3
##$ALPHA= 0
##$AQORDER= 0
##$ASSFAC= 0
##$ASSFACI= 0
##$ASSFACX= 0
##$ASSWID= 0
##$AUNMP= <proc_prof1d_extract_pilot.lims>
##$AXLEFT= 0
##$AXNAME= <>
##$AXNUC= <1H>
##$AXRIGHT= 0
##$AXTYPE= 0
##$AXUNIT= <>
##$AZFE= 0.1
##$AZFW= 0.1
##$BCFW= 0
##$BC_mod= 0
##$BYTORDP= 0
##$COROFFS= 0
##$CY= 15
##$DATMOD= 1
##$DC= 0
##$DFILT= <>
##$DTYPP= 0
##$F1P= 0
##$F2P= 0
##$FCOR= 0.5
##$FTSIZE= 32768
##$FT_mod= 6
##$GAMMA= 0
##$GB= 0
##$INTBC= 1
##$INTSCL= 1
##$ISEN= 128
##$LB= 0
##$LEV0= 0
##$LPBIN= 0
##$MAXI= 10000
##$MC2= 0
##$MEAN= 0
##$ME_mod= 0
##$MI= 0
##$NCOEF= 0
##$NC_proc= -8
##$NLEV= 6
##$NOISF1= 0
##$NOISF2= 0
##$NSP= 0
##$NTH_PI= 0
##$NZP= 0
##$OFFSET= 14.98509
##$PC= 1
##$PHC0= 90.401
##$PHC1= 0
##$PH_mod= 1
##$PKNL= yes
##$PPARMOD= 0
##$PPDIAG= 0
##$PPIPTYP= 0
##$PPMPNUM= 2147483647
##$PPRESOL= 1
##$PSCAL= 4
##$PSIGN= 0
##$PYNMP= <proc.py>
##$REVERSE= no
##$SF= 400.02
##$SI= 32768
##$SIGF1= 0
##$SIGF2= 0
##$SINO= 400
##$SIOLD= 32768
##$SPECTYP= <>
##$SREGLST= <1H.CDCl3>
##$SSB= 0
##$STSI= 32768
##$STSR= 0
##$SW_p= 8223.68421052631
##$SYMM= 0
##$S_DEV= 0
##$TDeff= 65536
##$TDoff= 0
##$TI= <>
##$TILT= no
##$TM1= 0
##$TM2= 0
##$TOPLEV= 0
##$USERP1= <user>
##$USERP2= <user>
##$USERP3= <user>
##$USERP4= <user>
##$USERP5= <user>
##$WDW= 1
##$XDIM= 32768
##$YMAX_p= 443518138
##$YMIN_p= -746576
##$CURPLOT= <Network HP LaserJet P1505>
##$CURPRIN= <$Network HP LaserJet P1505>
##$DFORMAT= <normdp>
##$LAYOUT= <+/1D_H.xwp>
##$LFORMAT= <normlp>
##$PFORMAT= <normpl>
##$SURQMSG= 1
$$ End of Bruker specific parameters
$$ ---------------------------------
##NTUPLES= NMR SPECTRUM
##VAR_NAME=  FREQUENCY,     SPECTRUM/REAL,   SPECTRUM/IMAG
##SYMBOL=    X,             R,               I
##VAR_TYPE=  INDEPENDENT,   DEPENDENT,       DEPENDENT
##VAR_FORM=  AFFN,          ASDF,            ASDF
##VAR_DIM=   32768,         32768,           32768
##UNITS=     HZ,            ARBITRARY UNITS, ARBITRARY UNITS
##FACTOR=    0.250966925370066, 1,           1
##FIRST=     8223.43324360094, -242005,      61621
##LAST=      0,             24927,           -18079
##MIN=       0,             -746576,         0
##MAX=       8223.43324360094, 443518138,    0
$$ Real data points
##PAGE= N=1
##DATA TABLE= (X++(R..R)), XYDATA
$$ [...]
23759 -26456 -101576 17896 178006 -86557 85980 133165 -168306 -30680 -60891 -111753 -433837
23748 -433837 214210 -204208 174212 -257512 217145 21007 41407 25881 -374665 -155417
23737 -1210 -48641 -134593 201622 62197 7367 -12636 166740 -127429 -118128 77009 -107783
23725 -278809 13154 161687 -9253 169153 177821 83117 -127495 -310220 17520 -162311 68431
23713 150000 -76702 269972 -163193 121402 17912 313966 -44300 -75844 67157 -71458 -59586
23702 -59586 191813 -44926 48448 -247166 124125 111464 229703 -110362 -50071 -64298 23129
23690 -27146 70281 -184685 -86660 194665 -30767 -150397 -187350 53185 -69708 96629 166749
23679 166749 -59090 248796 -110534 -618514 -269261 121556 -306442 -13406 -27345 -86368
23669 -86368 3570 -194105 283095 42393 -137858 -41326 -341308 -1613 -131200 155048 136054
23658 136054 255394 175947 -118168 -8018 -138711 -77089 -5377 135394 -128079 -170966 -40130
23646 145625 -203469 -54100 -75294 -74103 129866 -14345 -43928 151174 -284349 113133 605043
23635 605043 -104287 -17642 138407 -148051 -272888 -166815 83459 143547 60450 99372
23625 99372 55935 59400 29468 123012 -103641 194943 113588 192114 255817 -174166 306752
23613 -132752 228421 -224622 75890 171559 -117990 -79531 173596 116215 -115998 -316802
23603 -316802 104790 -72283 -63296 -288386 126264 -82735 78628 -12115 -131484 -344998 -78793
23591 -82031 -71507 -14762 -261185 101435 138594 221468 -4262 200424 181407 2947 45020
23580 45020 21855 -25851 153253 98801 371049 309944 63182 -121492 240540 188786 -98329
23568 -122806 71012 -433923 -45621 -171582 -62972 -13947 -77669 4877 -43174 195983 150440
23557 150440 318322 -156021 180806 139995 -217013 61834 -233892 -283197 -113626 -235944
23547 -235944 -317846 173451 -18208 -339277 -12068 188802 111275 -6541 -15819 29929 52603
23536 52603 104128 338301 -146297 76403 -71121 317956 390832 310226 -8519 12839 -113454
23524 -342139 364866 65487 -249718 91139 78288 -332820 251362 6390 -49609 -163571 53004
23512 -520385 -123400 16668 -64117 103406 148241 30122 -1791 -74888 44982 -213178 79854
23500 46214 15847 133902 -120804 92760 -97709 89081 -42208 -300022 -143623 161396 214376
23489 214376 96611 -213000 264059 -269076 -193232 18558 48636 288166 -236950 -257545
23479 -257545 399087 59895 29071 90757 39690 -214352 130659 -346435 23841 -219808
23468 43698 -93768 -105584 -337737 22311 182938 -51052 -234061 71436 69423 -81341 279092
23456 -280326 172206 -106383 102142 -284911 -89791 -32557 -144492 -260423 -19854 208593
23445 136670 227523 378648 -5239 238449 -188339 -97106 22139 -262214 -110128 -316134
23435 -316134 -76277 -270590 -69359 228426 -239467 -32415 214221 100979 287662 14148
23424 151485 -7593 47053 196502 42506 -46074 85911 203718 -199157 -31173 439 -265817
23412 303454 -297226 -91953 -80029 -7385 -23595 148909 722 -153725 -150488 61273 -260399
23400 224963 94008 239091 64968 -203423 -297766 -50620 -135468 -218932 76806 89192 -179346
23388 -33661 -102378 -109556 157273 98865 -176465 78456 123237 -13812 -14998 -158324 -20072
23376 -160760 -20046 -218004 -284398 39924 224567 -59095 -125412 -164119 -80036 -122322 83153
23364 -68556 -218351 14248 -130663 -182806 30610 61861 115424 101509 -196362 -258807 -371312
23353 -371312 64381 2735 30776 -38597 -77694 -146001 -38798 70207 26986 22979 202476 -188160
23340 198447 -82861 52137 -3984 -533602 -103159 11897 204763 84768 -170852 -257675 259363
23328 -144210 -13229 5107 -87543 -27608 -82154 10460 125206 -95075 -4256 244328 199669
23317 199669 9942 112864 -204955 -106259 55343 160282 -279919 -152132 -135284 -207434 -162531
23306 -162531 203135 -18613 40824 -223284 -19425 109591 145819 238699 -219073 50442 -85613
23294 -58236 -180772 94974 28026 -149615 -53214 -138315 -215914 169340 182906 189693 30103
23282 -108531 -286903 -82734 22999 -56812 -351495 162594 987 -141287 -159109 190669 -132515
23270 95832 -184904 -121298 348413 298998 -113388 -139458 -64379 -287125 -106740 -265959
23260 -265959 -317091 -35636 -80909 -170369 200680 91065 -248216 -45017 130380 -210618 117939
23248 -157616 -452355 -85076 191871 128416 10112 24864 -202743 86522 -147457 -190179 202538
23236 -183826 102679 192021 50735 154048 142273 56806 240867 37967 50975 89190 -38816
23224 -127410 -204958 147435 21835 -234985 28043 -311551 -264310 -157113 14648 -30505 -189054
23213 -189054 144731 -231184 -275427 -86141 -111912 -112670 -187635 121931 -197292 -139795 145473
23201 -45311 -132288 161531 -36695 208963 37581 -88118 391241 -90924 -203379 -204678 -33829
23189 -157438 151432 113219 156566 14755 -193253 -107980 -83573 55425 21270 -491231 48370
23177 -99056 11194 -228642 -135980 -116301 -116098 -166148 -250328 -234680 123712 -83870 97790 377377
23165 377377 -37447 -73314 19801 92627 188687 167958 170851 -39160 -506291 161859 282159
23154 282159 -7845 -197076 145419 -31159 14504 44546 -181260 173528 -95774 41899 -98867
23142 -14722 -220761 -249791 248661 -21999 218440 49418 108265 141271 -62051 203946 -33574
23130 -7053 45441 47923 130247 -21839 34726 -75440 -171204 -35034 -59429 -177670 105880 108773
23118 108773 237435 -150527 60224 -85180 -420011 253632 -52662 -275598 255073 25076
23107 89562 186813 -2883 -23005 -240508 -264440 -267295 74719 -25015 156206 303239 -98258
23095 232530 -8171 -69406 32735 -303327 42251 -45005 25722 8797 -23918 -105866 179203
23083 -127318 -263774 207435 194387 -83853 -84213 68840 -27171 71824 -22510 408374 39350
23071 -221184 364834 -41157 243212 -80348 260735 159651 65324 -10505 -134591 343677
23060 246867 -157146 -27582 73467 -211971 153119 105028 -61101 -232712 -357287 -150513
23049 -313920 -14263 162104 108275 -118003 -146366 204127 131367 -54051 -50054 -6225 191023
23037 -361874 205366 16058 119218 -46922 -158133 -273950 -6634 85210 -63154 124320 -64987
23025 -20855 -56468 -127705 -38978 -10905 245423 280237 182230 -54973 -221553 36467 90891
23014 90891 201552 -189516 123293 -206561 53603 -179344 23892 -107623 45626 -7234 -204338
23003 -204338 -239646 10226 95879 262576 -442339 -75300 -338008 -116884 -92984 -79312 133525
22991 -185965 -123204 235678 -195157 -122209 -98775 -91911 169215 144360 -112406 -160779 -39582
22979 350137 -38701 -325702 106633 30046 71359 -98307 -16434 -83985 108194 103530 265887
22968 265887 92607 356177 174071 -176722 -351121 -30378 -113059 -54403 36431 114601 -296457
22956 -197149 -81680 74664 -48473 -54091 30570 -99544 -47424 -280792 -229762 -346560 118673
22944 89289 -226583 9183 -249604 -203790 -268659 146212 64642 -173353 -159196 -283374 -126881
22932 -221964 -51153 -60477 21314 141474 12417 -259455 -16941 -30506 -41398 -24655 69098
22920 88729 110800 150879 45090 210740 317604 -110443 -65978 135054 -167986 -127330 94949
22908 -21634 -182748 -478310 -289422 8676 -368212 -4574 124139 111864 279148 -66236 148815
22896 -203821 -139928 -86947 347965 74853 300432 54107 -288141 117134 -188834 25631
22885 -5513 30381 -244174 -48624 -29321 172794 -19651 -79331 60279 -229445 -192000 66252
22873 -74696 142957 -39724 -29972 -301002 -359903 -257623 -80674 240909 144964 148812 -221626
22861 -256781 -273870 -413090 -143874 167542 -32083 -161726 -34307 -52285 140120 58817
22850 83038 -115410 13639 75590 -194501 62410 -182008 190655 -8846 389548 -189722 94176
22838 259823 -321819 4626 -106245 -121394 12123 90532 167315 83812 -108021 -222340 -130343
22827 -130343 -54889 166024 162333 386868 -175323 109242 11425 181011 -13561 -243225
22817 -243225 69963 -161062 -59509 -35021 73586 -56897 128623 23931 448153 -185600 -61696
22805 -50145 -41540 -87422 -110867 -137561 31276 532089 174024 -210390 18235 152673 -31146
22793 -412860 94104 -78405 -138211 -9212 36019 82109 -432865 228981 -24563 -40640 -32988
22782 -32988 -114501 -391006 30614 152261 -81976 -20840 12797 74326 30484 -186855 -75786
22770 -220561 38359 238744 116410 100250 161014 -122164 -157896 -163638 419739 266073 59860
22758 64911 146846 -30825 -140566 -164666 71346 -109851 -251564 -52507 6247 -139282 -152648
22747 -152648 55144 -239405 192914 25107 -36931 -141576 -25249 -57589 -134645 179100 -123240
22735 -56564 58102 -26329 -169083 -211156 -267302 46054 -169880 -198049 268603 66723 15453
22723 31895 72212 -131413 -497287 394232 -41207 -12983 48813 194227 -314122 -87112 -162333
22712 -162333 197133 105063 -369250 135834 32594 140596 -248366 -21436 -429388 94184
22701 90522 73140 -354763 82885 -270900 57672 81393 64963 92156 -330198 -323198 -104202
22689 -52559 132793 30160 94399 -220751 224854 -317474 -260884 170750 5055 -134002 -187215
22678 -187215 -222797 -176806 -225103 47553 -78967 71196 -142824 -444536 82174 -108871 151768
22666 -31277 -236735 -167942 -4391 -59037 -56362 90771 134437 -299251 -117580 -443894 -62197
22654 -166355 112781 -134946 -129577 -187405 223312 -56600 163989 -41626 -88914 -247685 -47493
22642 -92908 35731 -32047 -165516 -143067 79533 -112783 104012 -103539 383340 -479586
22631 -115744 45792 150834 218400 2389 -33897 194566 -200576 49313 -746576 33985 -225111
22619 -81771 -8608 -158756 50977 49433 -18194 29917 -107143 -80576 -258089 93784 -440468
22607 79909 60856 -197344 326445 -138440 -16804 -63836 50431 -113530 43012 166224 -254337
22595 232639 -105445 -85945 38301 -50971 29589 46284 41105 -39329 582089 -265530 60499
22583 172202 -86364 323895 -145234 -19386 -34108 64099 61802 96293 -109412 -419183 81385
22571 121294 -426432 264693 -173104 -29537 -221850 -34237 82129 206987 107686 -196388
22560 102863 -86683 -210182 -216928 -378353 -137443 -28427 202638 -322932 92227 -37917 123484
22548 97277 -213813 -124513 78303 -352647 -319141 153125 -190274 329804 -98016 97766 36894
22536 -22406 -30195 20568 -216782 32414 239906 -18831 98294 -129835 -133143 -205178 28015
22524 280388 -30083 -78399 -159959 73889 -1236 130042 -24854 98599 -43405 152557 -202918
22512 312388 267195 -167664 14221 -34383 915 63204 98762 -266594 254033 19110 118121
22501 118121 -115455 102543 -68405 71337 -223936 164011 -258271 -38699 84581 -163831
22490 44433 45316 -68301 -302999 152217 -228931 75919 7990 64594 -68667 103057 -50300
22478 -20444 -11651 17253 -174424 62248 61323 -229592 -415703 -56738 -93471 -95827 -306791 -207181
22466 -207181 -23665 88232 -241220 109481 34480 38050 -16185 38471 141709 59123 271244
22455 271244 -13759 -64102 308317 33882 376110 -144847 -194910 -172381 245853 -23598 9521
22443 196091 -22449 137332 104773 -9978 -26627 -46099 37095 36077 -286244 84446 -183765
22431 -172576 -39476 208609 -20566 -278895 -66742 -103818 36735 4895 10910 207889 117858
22420 117858 -182285 311725 -56226 177002 -440528 164066 -60021 105927 -15009 55508
22409 -167740 274121 -154990 189521 322629 -23107 -58323 -155626 -266967 -24665 83985
22398 70945 16463 77678 -42478 -155324 -141596 4761 -157635 90262 -145512 378297 322473
22387 322473 -7368 -495357 -73849 -106090 231812 -148383 -342747 30766 -334500 -63313 18514
22375 -103696 239275 -113998 -263450 164121 95076 83622 75278 -232703 -208139 -23510 -274740
22364 -274740 -47281 143686 -155376 283375 197501 175178 -117130 -64617 -84335 -188555
22354 -188555 111156 -352699 -21524 -444599 128110 -114771 -285908 82766 -342942 -29735
22343 -151912 -65380 137374 -105909 -17227 -43772 146732 231616 -314495 234001 -162358
22332 -155180 62502 -172952 32598 -75211 -404218 -168988 -91860 11739 -237245 148732
22321 -82150 110233 -56221 23181 -146328 -164287 -80034 76786 72085 -26495 28218 -12091
22309 67554 -272112 281563 -289280 365875 -67492 -23362 -36300 28065 -410641 10006 -177335
22297 -31363 -298878 -205545 -95070 -79868 43763 104570 5118 161499 159383 -98454 41373 50308
22285 50308 199580 -43127 302094 248010 59553 -136448 1902 -57954 -223581 -77552 -10995
22273 -446755 60736 56470 18943 125736 -108633 -169086 12381 1438 59475 -145810 -217758
22262 -217758 -125186 -235862 -155582 -120085 90106 263394 -338490 -62431 -224288 -189636 -28764
22250 117447 18730 291648 -137960 104942 87863 -385916 -21094 116229 -259936 -400847
22240 -400847 -62504 -358701 -76324 113502 8385 141810 -370863 -116972 -171354 75655 -84598
22228 146397 -120417 248438 -114690 -151945 -8307 -185140 -82329 166971 -308708 -110631
22217 -67251 -466600 -82472 -214749 -58137 186531 -148323 189027 -5940 -334036 -172038
22207 -172038 -167881 -107072 111579 18531 57826 144281 -48306 427286 71229 -80507 -55128
22196 -55128 -100022 32937 85699 377451 62601 -176355 -19896 -116840 170137 -554822 -40347
22184 -326780 -10938 192785 -295872 147421 -35564 152075 37991 283201 -137 27727 -3802
22172 -56860 -453175 59483 -53374 -72322 74639 -95338 82478 -31046 138720 52704 -200612
22160 325185 116274 126179 3037 64348 -88578 -277608 265495 -121547 -242092 -16988 -77551
22149 -77551 246532 -132946 94329 -210756 -159016 -79087 142695 -277713 261711 179885
22139 179885 328579 -221246 -149343 -56898 -349614 -23993 -228140 -7919 -194872 158101
22128 73406 -169892 -27066 -154354 -131704 298948 -245752 211419 -177806 424430 -14317
22117 -112365 104400 -201967 185789 -311072 51827 114900 40440 7477 155025 -293449
22106 139299 25659 378636 -27496 -110966 -195322 -62022 -297461 69268 -71422 318091 -104670
22094 -105360 -77842 192617 -13359 -228474 185286 -198087 218007 -219761 286013 -117969
22083 144317 -79062 85965 133737 49071 -55677 68375 -22666 116493 171053 150430 141439
22072 141439 -65695 -135811 37617 46208 15488 118185 -239920 111844 34299 -21390 63714
22060 -142768 -358649 -117511 47455 330248 -226595 -14589 -105656 82792 -92890 -129978 -21800
22048 217302 45290 119583 -47608 -203968 192836 -156321 -22568 66939 16953 -91493 422820
22036 -8039 -224778 -76214 266947 -288930 64326 -51346 12917 -96436 50324 -44552 148891
22024 151287 -169130 -95828 5828 -121379 -260762 44940 -118456 -196914 187616 20340 -243746
22012 -289282 193506 -138492 21563 -260855 -301725 -422327 154196 -23204 30095 -31041
22001 -115847 -123680 -120570 -52526 -181951 -68469 26498 -16912 35392 -6972 -26380 144004 39606
21988 -243342 -91256 -1829 -8167 174457 160746 138021 -194064 -183795 356233 -162564 40638
21976 -291687 253520 19256 -237865 159945 -218353 26808 -61051 112471 -231907 -117575
21966 -117575 198723 243877 11355 -56377 -200981 -111038 -455703 -143129 -303320 -35053
21955 -436356 160490 -179355 -55653 -133121 -127305 374346 -263449 329804 -295793 -454233
21945 -454233 -122547 -60793 -134325 190826 10341 122803 -70590 -211 -112027 123579 -252848
21933 -17890 -154814 -260915 159466 -270341 -35921 -173862 290773 -162492 50489 -195066
21922 -124688 -312572 50022 -74792 -141102 116240 267798 -172625 7687 36507 66690 -124512
21910 -120888 -493411 -357900 -66678 13085 -117369 -388370 -216393 -58888 -369829 -53944
21899 -12534 -55193 -76654 199396 -259499 -130747 157307 -24780 -6511 224977 68562 -439269
21887 24043 -90152 -9359 166720 84333 105371 -210930 -85540 -178385 -426715 49355 14420
21875 72924 -459697 -191159 -93142 -131313 62250 77493 -153502 -329333 31703 210726 17171
21863 -229877 64879 3396 166496 113361 -419163 -146826 497403 67163 125893 351432 -160730
21851 16825 125398 -28907 -112737 44597 -158247 65035 451826 8387 -28678 51116 181089
21840 181089 176084 69016 -291035 -111724 -155111 15567 -101035 21471 -64842 -43614 52200
21828 -396276 -78771 -11475 -110718 -24267 -75989 -209388 -154186 -360869 386909 7641 104874
21817 104874 5326 -202929 -18193 166217 -167252 70729 130678 -17668 -306365 102967 -199467
21805 -85551 53540 63716 -1564 178303 -36445 -72247 -262488 -239607 -512962 -73129 85768
21793 -20208 144738 -25498 -417699 -186874 84032 274167 -373205 50465 -45022 470990
21782 -112911 -232419 -116367 -40378 52645 -57720 -101564 -158571 352871 200 45775 -187152
21770 -176260 -205383 180903 84051 83981 1917 132231 -42022 148710 118904 29334 79470 208156
21758 208156 77803 -144553 204202 -196502 -124906 263782 -268109 90593 -6656 -478646
21748 -478646 -258023 212582 -222045 261499 82465 -178831 -30931 -148604 -169438 -146153
21738 -146153 280796 -319603 -143674 -231443 222026 141425 46616 60415 334291 86036
21727 220125 -232878 -19571 447162 -120196 19393 -199430 -168232 -286857 121291 9972
21716 -295450 -64812 -186941 -135138 -30178 108793 -240168 -92095 -9435 -269802 -133610 -269257
21705 -269257 -50040 -137456 109952 -74558 650 167825 105529 -116030 -156296 5278 101666
21694 101666 53816 -339415 43424 -202764 125714 31688 76378 -22663 -17007 -264801 16304
21682 143885 -315350 2695 60802 131716 -147645 55005 -17811 -211253 143712 -80254 -71492
21671 -71492 87618 126706 -17689 334244 -92531 127057 214039 120307 -142247 -97886 -266354
21660 -266354 -33184 -182648 -197690 206291 70810 -84870 -130117 -108587 -15994 99133 -249901
21648 12097 197567 66850 -37780 36734 -264186 -82265 113031 53485 134522 -144504 -333521
21637 -333521 89769 -320990 53829 50440 -225707 -510740 -223495 -306725 89028 52303 -4199
21625 231903 8434 373637 3088 498769 84548 273969 -223209 -17646 15397 -112800 -42933
21613 -153171 28850 -94527 -142324 493519 -402153 171124 110121 -39362 166550 -319368
21602 112480 -9947 201066 -196336 -6098 126919 -33368 33983 -279819 38179 87663 151309
21591 151309 60974 -126756 59302 91471 35997 -118922 -217887 260350 193483 -248909 61403
21579 -74055 -138636 -99625 14534 -136779 -163684 194440 -304798 -205610 91473 74198 -20632
21567 27227 -262557 153842 -181303 -96115 56895 228609 -152435 -166925 -234409 -377094
21557 -377094 -95310 -254946 -396193 -64919 -139887 186487 223242 -382897 433214 -126797
21546 97161 -117883 25278 -246637 -241234 -41957 -23034 -100122 -431126 -68670 -23214 -107824
21535 -107824 -165257 -107048 -165709 34148 111366 -63781 50194 102402 -142091 14009 -30227
21523 98457 16561 39284 -138236 -103354 -159791 -40167 -247069 -192701 71746 -154769 -238427
21512 -238427 -41846 10585 -123005 -127404 47647 -153347 25945 -106460 -196883 -16669 45376
21500 237878 -176149 -66493 -54892 218158 25664 41671 119324 -243597 41249 -200364 -92375
21488 180577 -135061 78948 10410 -253761 -315594 224574 -39607 -54212 -140655 5786 140748
21477 140748 -11346 31924 -233031 -67629 -382685 -66669 -268136 17498 -43180 -48680 -66901
21466 -66901 43698 53013 -245445 -128735 363853 -173354 -282915 -240557 -136952 74687 -175152
21454 -74923 -192300 -239444 -97403 -22257 -427339 -350690 -28511 150160 45874 -182160 -64460
21442 -293912 -9103 235731 -452354 -219321 -83114 103835 -268424 211840 -154049 -213353
21432 -213353 46480 139383 279539 237247 128233 -169637 -48099 -25817 3766 -373053 -76645
21420 -57696 -64570 -148782 -238592 33632 52896 242893 129922 -137332 67100 108041 -16451
21408 30216 169348 -239905 -129819 -242820 -199059 131226 40881 -77637 56260 115481 -179402
21396 -4886 -279152 -282118 234887 -335442 244883 -86723 125423 -56874 -95100 -26839 -185164
21385 -185164 158461 32389 46340 -55500 167856 23961 -71782 -190659 4081 -367753 -478480
21374 -478480 -399169 148938 -74122 -346063 87398 -141045 91144 7997 -253223 -96336 145760
21362 -59889 150756 146467 214655 -95339 59102 -48552 -292397 124302 -278471 -165140 -73542
21350 -201039 -40232 8432 -204030 -59837 -261569 -83029 -172599 -79700 -27844 86300 89083
21339 89083 116733 -30157 51242 -112734 -337131 -29186 -64687 62470 74939 -232810 259649
21327 47309 -306239 -4902 -213660 7991 -16360 -300351 191915 192872 -263423 -153668 191138
21315 -16157 84645 9798 -75634 117026 -127270 -379866 -86433 159314 -57585 -84166 68177
21303 -71494 -10568 87285 -123739 197987 -57499 -279063 -59867 -209192 -35953 -54742 -193029
21292 -193029 175305 86984 349694 -59404 -158071 -305925 -166912 219959 42753 15435
21281 154793 36394 41145 -291853 87437 -83869 -183300 2642 118693 -34364 -150922 -34659
21269 33641 20449 37200 -232923 195643 148848 188568 -5902 151384 17332 73406 -59700
21257 111816 -165863 -89653 -81046 109429 -224653 -321902 -72839 -146638 -130948 159399 -124241
21245 -150945 -56948 11890 54065 245437 -132974 132361 -40896 43000 -173655 -16284 -74664
21234 -74664 50097 -165675 -23015 -123480 -276247 -124074 -43806 224585 -18098 183434
21223 244894 -162906 104129 -156987 -18783 -29582 -250787 -6017 -389023 -337010 -357914 -219399
21212 -219399 -480388 -242404 -231545 71435 -33712 -421578 -207693 74715 -354346 -57916
21201 -325921 -131325 -88691 -8976 -185926 -213060 -95222 -28745 -204488 -251742 135565 301550
21190 301550 -81521 -303110 350201 -33265 -321178 192978 -23267 71092 231157 -35032
21179 -102727 -164719 -62074 -70964 101599 76930 -67059 -58008 34944 -98988 180528 -191776
21167 -218479 -89197 -48474 -21884 -138525 -243533 -55325 76812 9757 -147167 -181052 223047
21155 -159545 -123921 124361 -185650 229846 -393281 -176409 80893 -336992 -32687 -3055
21144 -185914 -119345 -200465 -53496 158674 29952 75625 -168607 69950 -243651 14264 69164
21133 69164 55042 134779 169217 87521 327798 -63105 98694 -110123 -208369 -205970 -16113
21121 -85645 -173532 33040 -225511 67649 183243 132461 -216773 -231167 -175923 117348 77452
21110 77452 -175486 170930 -135599 -347227 166956 -132847 235619 -70244 40413 -28312
21099 100632 55652 97149 118273 74828 125019 -179193 -128367 92333 -22533 150226 116840
21088 116840 -144817 199430 -97713 431758 124280 27446 -108532 122386 523 -128514
21077 -166582 -123437 192379 -157987 -193321 -494629 -187292 -154215 174439 -151925 134849
21066 75648 185192 -56460 -197807 -172389 -132815 -109636 -174895 -284465 -303952 -229891 -159401
21055 -159401 141567 -174500 -373763 183987 45570 -20582 -123389 -43505 70787 216012
21045 216012 -333543 -146052 75337 61364 -186073 -176355 276790 -172150 248800 -2879 -46925
21034 -46925 87124 -217151 -136506 -142269 4583 -88735 -108336 -145081 372398 -314809 103520
21022 116416 263980 121311 -81764 262803 -133136 -17721 -334798 -85933 203380 520246
21012 520246 63860 349716 98171 -133824 -208765 -19555 -78356 267621 -232031 164558
21001 -101424 -279496 -120139 63094 -51796 146361 132909 -57410 18001 -147840 -106266 -89317
20990 -89317 -242749 -141700 247726 40403 -89559 576 -85686 -33019 -275146 -224809 142619
20978 -138589 67957 318481 -222458 180039 -9452 -149470 -527292 -109215 29589 -136192
20967 73817 -12342 31223 -73541 1638 -132333 -195101 28666 -106128 46523 -5269 -153494
20956 -153494 44885 53659 110721 201604 92677 -138567 130947 -14247 -54125 215061 -62735
20944 -27484 233836 136961 -2595 -216806 -61272 -42813 -204269 -185243 -61229 97301 -15071
20932 186971 -270527 191057 110946 99386 223221 -41089 11718 -448708 -313098 -160564
20922 -160564 269977 -116418 25444 -132244 -9744 -119317 -185299 27981 121252 -103115 50102
20910 -123792 -117029 -23535 183059 46015 275612 18911 -305585 -180506 -36866 -23229 26802
20898 -92910 -42787 -73930 -41319 -88165 -83098 42336 -89202 -222409 165801 -126099 85462
20886 -193591 -233105 57201 -122231 -361185 -152937 148982 -189012 -270043 -208513 -50708
20875 -11090 -32235 298111 -56668 -27908 14947 366724 -473029 82140 -343561 -176658 -198135
20864 -198135 -249907 78650 220481 -224247 155883 182048 68441 -317096 -261984 -20749 -16620
20853 -16620 -172254 -278162 -179825 -191010 -62940 -324509 -44118 309761 -28900 -43716 -175848
20842 -175848 -121007 -220367 58893 -209587 30819 -80097 -252288 -67579 -230471 141233 290404
20831 290404 -128759 327831 296374 -37579 -81191 -10440 401241 10100 -3755 -278463 -211757
20820 -211757 -231402 -104035 52027 116394 -90353 -274334 48097 -165273 -61390 -50058 262295
20808 -127574 177872 -142590 168489 127550 130691 -199224 -17825 -132584 -99727 -2122 20655
20796 192957 52184 -63987 -104506 80712 -43311 -365902 -151585 -120482 319492 173531 -40323
20784 -166675 337026 -29000 86200 -44789 -170624 -177314 95734 -161159 -154464 159239 -212924
20772 124582 -120258 362435 130647 -425230 186630 186495 -254063 21232 -231749 -9017 -79685
20761 -79685 1855 280625 -245021 -221526 152050 -334035 -347289 -320241 39709 -115372 -4705
20749 -256447 -66352 -182809 42433 -119807 -148616 -272434 -193786 -59073 204697 62893 147501
20738 147501 -273011 36651 -44416 -103473 -11720 -207883 -52062 17405 93660 -235687 -50315
20726 -169748 -32105 -124417 94444 -202576 -85600 -183702 -44865 -293319 39706 -166157 -73803
20714 -193603 -125037 -92220 -23838 -20186 -247574 -262102 -111874 73724 -105002 78274 144886
20703 144886 -164607 -135513 -91058 23145 -114612 -145578 25919 -153147 -12278 -227687 398666
20691 202722 -41086 97551 -249421 -172543 27514 -69808 40520 -41621 -131104 -87042 -171684
20680 -171684 -232554 -357807 145968 -54237 133541 -200165 -28907 1204 -188181 117811
20669 85099 71038 -86158 239049 -140916 -26275 35643 -52415 -184986 -192444 -76766 -67164
20658 -67164 116799 -200176 -134162 -89683 -145621 26734 -156355 -99565 -244836 -70139 -87612
20647 -87612 40166 -107869 -69127 -301110 -192233 -218113 -91437 77901 9031 180722 37165
20635 67330 -3561 -62151 -406224 383839 100082 163551 -138307 -49247 -311788 -145126 -100306
20624 -100306 8779 -136455 176600 13805 55702 -255686 -53381 -298537 127359 34446 21182
20613 21182 -72083 53723 169705 30422 69949 -369169 -100396 178735 -273112 94449 -271246
20601 -394098 -269596 -16103 -87710 149361 -222299 -56160 85238 -237410 -81553 -217526
20591 -217526 -19112 47218 -198156 -400466 -123020 -84024 -134465 29700 76123 -75059 -245251
20580 -245251 -153728 -191900 -101591 184121 -385932 -18174 19322 -107282 -42480 -53380 -204951
20569 -204951 -11158 -214532 58840 -73308 -52402 -268661 -71310 195645 -235572 -49197 -69929
20558 -69929 -215041 23138 -19239 -180771 7561 -25597 73388 155327 166360 161978 -30842 -212885
20546 -212885 194179 -134776 -56186 -2920 73997 4927 -88093 -206108 114756 54550 222276
20535 222276 -162851 -28260 37861 -101462 -36429 107443 80365 129104 -120835 169788
20524 -294559 -257025 -342312 -70137 -269257 -190206 43371 52615 -450954 -259677 128566 146870
20513 146870 21093 -81049 133501 -101760 226575 -82312 -410613 -4138 -181250 -34153 223216
20501 79361 -441437 198025 -294443 106160 -26149 -319917 -235129 -76856 53801 -1763 274380
20489 231856 139565 -223499 -302502 -151305 34573 -93809 11800 -123737 -10270 -246510 -15586
20477 -97255 29476 -127476 -10810 43794 -348365 -81193 -22899 -232929 41176 -118382 77107
20465 165052 38380 -23181 297728 13754 136060 182314 -227083 49191 27154 -302729 64331
20453 -14372 25775 -323451 24573 -156004 -80863 -18662 -181390 170474 -339017 -378665 -41146
20441 -312224 90531 -279501 30624 -69593 -104264 20160 63205 -131709 -101946 77853 -338902
20429 -241628 -270710 -75163 85241 -53116 -134377 -7899 -252437 67148 -153501 62694 -114387
20417 76751 356240 -198206 233849 -15607 -87257 67581 110032 -295908 -172782 -189498 -273436
20406 -273436 -85912 -171689 -74346 -299764 -152809 -101114 169181 -361 -18043 82427 86047
20395 86047 -57200 -124469 44154 -128068 124932 -68182 -26844 -93111 -168382 -202096 9906
20383 -72453 -58449 -7860 -151984 323710 -288936 -35475 -188456 167270 346216 194973
20373 194973 -69939 -255697 -227146 31146 -198835 20523 1869 295785 -197883 -73546 67859
20361 -67120 105373 -42886 217620 -262224 -115910 99624 -189430 -54888 189766 -169236
20350 -289137 -67374 173790 -173334 -69385 93148 -75514 310571 -216422 58855 40521 -281634
20338 -12126 -96743 -61358 -38772 -95728 -90221 104078 -80620 -48886 -207231 -376477 -203896
20327 -203896 78729 199523 -281102 -398038 -129708 -32396 -199262 35114 -215570 148059
20316 -88674 -201406 109186 -130090 94649 -134287 -45655 9812 -212747 132112 -243990
20305 90877 59501 -71755 21193 -153671 224525 -92348 -301800 -60493 -5119 -383981 -33708
20293 84372 269800 7112 -232304 152923 84865 -168639 -79452 -9487 1525 102319 19920
20281 -177709 -162809 -151970 115686 -285914 -223094 -3748 203195 -108876 -147894 -290016 -24989
20269 -166797 -309208 -166205 -266675 -125457 -229982 -640 -34327 -125066 -87199 -195616 57126
20257 -200167 45916 -10046 -165449 -257965 -54969 -321355 -6430 48400 33804 183965 211593
20246 211593 -11828 -131532 12032 -139221 -291302 232801 -228252 -129710 -277645 -58212
20235 -36745 -149166 129490 -363216 -27942 183638 -243675 102106 -211190 -9612 -261579
20225 -261579 -350371 -223814 131054 -107658 -36827 125441 -198102 -162412 -101698 135124
20214 39270 23382 120695 9551 79689 14434 6830 334539 -184705 -303355 64346 376743
20203 376743 193732 -268063 221747 -183974 -174906 -235342 -26293 -329041 266717 -309491
20192 -111528 -171985 82814 29963 -33649 -72397 256700 51578 40752 -29297 127735 -182282
20180 74580 -139994 -203363 43383 -31764 -55713 151127 -37012 -16128 -93425 236942 -302544
20168 146709 284003 -221053 32458 -377740 -191142 156161 -241368 55915 -53539 66152
20157 213261 -12395 131024 -114996 371276 -193505 13085 415990 72635 163634 65756
20146 159770 -2662 177435 128141 -152096 -8504 -131173 72498 364837 290369 54238 183494
20135 183494 240586 105454 175162 108438 -76655 54029 -384400 178854 88733 69670 -164586
20123 -406659 154015 -219410 -217539 -50160 183558 140454 71420 -217997 -235518 -38441 59148
20111 -326439 -144953 -84418 122146 -52477 -209864 -157448 21650 261849 -27332 -80576 -345049
20100 -345049 -217228 105559 -64264 -234865 -118130 -18920 -69023 -618409 238747 124284
20090 124284 172858 27662 -271016 -93384 204042 -302853 -49769 152225 -41525 -113436 209795
20078 159705 -306807 71124 -40103 -85592 -253842 126145 -176857 -54172 76865 -189261
20067 -306905 103200 36217 74787 88266 -102920 71596 -213916 23480 -328886 25781 -61329
20055 -163168 200001 -135522 190631 117754 -245254 -43236 -391684 110341 -12 179984 112044
20044 112044 -150237 -127332 169406 251237 -61184 8020 -81133 94889 49217 -85568 -64357
20033 -64357 100220 -52195 -60701 205023 175823 -173679 28207 132097 -401490 115276 15992
20021 579490 -188111 -359598 173814 11733 18372 -269785 -347687 -141993 -218811 856 -85800
20009 172169 -212962 126940 -81516 149343 -63662 -49178 338883 -14719 173941 93306
19999 93306 66668 217853 -59300 -9260 148176 104875 -204930 -191626 245954 224373 -40099
19987 -95658 -56524 -180118 -126116 67064 -59871 94443 -175334 20327 86296 108029 -51309
19975 -64820 -41109 -148906 -300835 -227237 141985 -84387 143593 227647 167387 50424 115273
19964 115273 -165688 -187486 -103808 -23078 -179273 96695 -73992 -94092 -298192 -156652 -189739
19953 -189739 80392 147348 -62233 -128273 -209992 107135 -22991 -104062 53112 217952 140806
19942 140806 111131 118123 114822 59932 17785 100675 124115 -92581 110801 226269 37129
19930 -64571 -187873 -113356 -134742 -119876 475026 246305 -240636 156512 57926 -215786
19919 -186322 -25605 77345 -332224 -230783 -203423 -119370 -60142 -52249 -15723 52898 6341
19907 149743 -220229 162339 133518 -21288 -85514 62393 -55034 -223930 111333 53152 -114387
19895 -72692 -7532 -30273 -21528 -28352 -86115 105890 147931 -278984 -141866 -170516 59715 -357525
19882 79609 -23090 56578 298659 22244 -150242 -193942 135 -154136 -12739 -45474 -314543
19871 -314543 -234708 -213012 137920 -39276 -446461 199273 -51594 -40922 82736 14852 6780
19859 -233479 123208 -212218 171610 119499 -438197 -38914 72495 -99316 -69395 -371742
19849 -371742 141415 75861 -150437 182441 31937 -197387 -158428 -313367 27688 54618
19839 54618 80394 264416 -17240 -19867 158170 -216693 -102718 98921 -479528 -131611 -135286
19828 -135286 -224511 -32730 63954 -129825 160536 -172513 -197026 -55272 49379 -89544 20454
19816 -155603 -176505 -83717 -16770 -79778 -155889 -182368 -165880 86789 117010 130001 -17173
19804 124739 -287149 -279508 -100998 -383579 -29343 -210277 -210715 38062 -60273 -10035 257708
19792 -47970 -88605 87758 -345839 281325 -96295 124086 87930 -38254 245577 -233850 -98206
19780 208415 119226 152200 31334 70186 -11455 -11624 -121544 -34242 74492 125144 244948
19769 244948 23011 71618 64806 -95705 98418 373256 -238677 -140069 -19644 -148454 9477
19757 254436 -93563 -89490 -160488 58042 75310 -123573 -327784 -336924 -125122 70589 -29087
19745 -79064 -184443 -108847 -501094 -178472 224515 -10709 233140 197325 -91138 -224545
19735 -224545 198238 51781 46534 6133 -66665 -52511 46801 -57958 -1652 113814 156929 -223632
19722 -69085 -180654 -311575 -2372 -30281 32014 -100692 28176 97744 83586 -338397 -32002
19710 -189002 -170230 -362928 -208604 -11985 112108 202416 424728 258649 -123574 210449
19699 7371 -72879 151115 -186134 -96863 -355480 244236 -140688 -208140 163358 -157332
19688 -178149 -287710 -149307 -92772 -78533 -215659 -95602 -186902 -44193 33246 110398 -43672
19676 133039 160201 -144285 -335264 146607 -49219 -126154 -178807 182808 -110260 -170570
19666 -170570 -54214 -64060 131348 -12791 -310437 -249140 27248 107299 53484 -64119 120876
19654 44069 98979 -104582 183772 -151594 -319223 -131673 219706 -41531 82272 -53028
19643 -240934 -79520 97662 -123641 -206752 249488 213496 -155849 13154 -272857 -279757 -14321
19631 -330531 -32929 -271440 10969 -48949 -181580 75365 129820 5550 94172 -344263 -238995
19620 -238995 -342258 96694 119492 -368240 -153826 -85852 -170916 279538 322488 18784 128784
19609 128784 -107627 -90648 -167739 -229529 -305118 -69347 -11791 392188 90419 -124006 260812
19597 46893 -40529 37498 179021 -241121 -291548 98256 315944 200634 -120911 -79307 196596
19585 -382999 -47689 -306983 -70850 -38084 107369 -249603 -102060 -23950 176417 19373
19574 -83255 -70786 -110809 138601 -319199 258160 -80219 146452 120665 -228213 -12775 -260786
19563 -260786 13723 -25365 70133 -191763 -120055 125329 -25877 -270909 -116730 162215
19552 -246926 -164627 -67551 6961 114732 44392 -68510 -109022 -64421 -239062 -242448 -185498
19541 -185498 303328 146966 -96167 -52225 176096 -57381 10020 -14201 134944 -114468
19530 290453 57516 -131948 -26658 -131893 -184218 303144 200605 -482529 39603 176028
19520 176028 -372451 -413577 81045 -140953 -233393 -112750 -43071 -55146 117917 -85450 -285066
19509 -285066 -35220 71098 -69420 -61080 -98521 257741 289765 -126675 -284299 -324161 -287090
19498 -287090 100559 -111639 -62018 38574 -70382 45202 -43122 -122178 -114715 11359 -27561
19486 -268784 -37658 -292748 5505 -68518 -148216 -190736 -57090 -118683 227651 246736 128163
19475 128163 -9775 70648 -173735 -101005 -83174 -47572 -175045 -350472 187992 -23041 -196799
19464 -196799 36494 -247420 -225597 -35609 -94947 20324 -230955 198684 -230546 10939 -78118
19452 -296675 -223306 -341239 -106688 -111900 -1459 -172634 123064 -69278 17182 -210599 290350
19440 109197 30641 -188433 -158399 56880 -2227 -12000 32953 92437 -270518 94851 72927
19429 72927 -210531 237858 -254715 -282658 -293649 -266309 -366143 15464 77622 -187204 9361
19417 242583 -92228 -23762 115124 -387831 -81735 22517 -128445 -20515 63657 -25180 130810
19405 135384 -191902 -118058 -51025 -94210 -30912 -125619 25581 -227298 -327055 -13940 -149851
19394 -149851 -103878 96786 -332019 24590 4507 -79864 -91341 -107360 -484236 92919 -14927
19382 -12859 -6612 -363322 2635 -298946 -58852 -207658 -152922 -35463 -225684 -49068 209402
19370 28156 -247425 -118523 -114194 -71334 10667 108246 -46198 -149595 -91495 -215787 -38033
19358 184883 -133972 -254615 -183363 -147966 -369638 -95903 -216730 -87629 63016 192627
19348 192627 64005 -71961 -147507 108826 306054 194366 -227345 124626 -161523 -167074
19338 -167074 -21320 -175269 -195812 328904 -176579 24521 -57639 -87737 -106414 -62780 -30991
19326 -70383 30864 68185 327788 166097 -47497 -217934 115122 -60486 -193092 82073 -163376
19314 71634 -155868 -69346 322127 243345 -25985 -324276 -68228 70966 -78058 -96607 -50664
19303 -50664 40453 -161833 -151216 -24180 -376794 75161 -39961 248270 35728 -74413 -84519
19292 -84519 232814 -151863 -508921 -50659 -259663 -348055 -277412 131302 -142429 178886
19281 -96486 54328 -103034 -132904 99083 -22139 -289344 387920 -77010 -391040 -9802 -11689
19270 -11689 -153358 -17596 -248864 -204794 41097 313933 40634 -130554 8673 49537 -276036
19258 167302 -75626 -136430 -15642 -75030 -262823 -4932 114688 246232 -160279 45095 -67966
19246 -243245 -174324 -53504 -186317 -185807 -34920 -236791 -252601 -13182 34046 -101436 -111649
19235 -111649 -92392 27767 -129552 -73735 -212258 -84993 -39563 35856 -55417 -39298 -249920
19224 -249920 36592 201010 -7061 134495 109881 -276862 240620 280019 270182 197098 -32363
19212 -148834 -17137 -143864 -87723 -7748 -164010 -513294 181438 -86772 -154308 -229918 141279
19200 -462948 187991 36292 -133228 125541 -19324 -443392 63217 69647 -119601 134939
19189 165789 -234059 -98790 178046 -406181 196087 -200421 42562 217271 -379467 -134426
19178 155606 169592 -323988 89299 -1178 -144860 -80006 134870 -174705 -78136 -71119 9052
19166 -158538 -114412 -45644 -237803 -38462 49599 147283 81705 -15837 90905 -239732 -25421
19154 -90721 77355 54236 -63737 -12937 -3333 180069 -207475 -355277 -174798 -377235 19313
19142 -10682 194052 -181480 -38430 -97905 59842 89796 70811 159923 57105 48575 252523
19131 252523 173005 -75423 -87074 -65547 -41124 -123388 -19183 -102372 65182 54008 150777
19120 150777 40063 -259558 107505 -102020 -261723 41655 -263859 -132851 66249 -92556
19109 -368666 -191044 -254219 -282169 -99528 16301 295 -72994 -123258 -8241 -25989 -122048 -110139
19097 -110139 -363064 52447 -204396 -219628 -39110 53884 -89248 237350 -174246 -174898 2884
19085 -30439 -339883 -69691 25285 6198 54205 -108450 -332609 -31783 -289178 32318 -253821
19073 -282931 -245955 -404850 -189410 -33941 118594 167623 -408314 92266 47753 -200709
19062 -78520 -267001 255520 35152 11950 63701 -18417 -106294 179535 -176004 -226630 219478
19050 -227619 58969 51911 74039 -162289 -181716 -97305 242019 -180970 14622 -107255 -266302
19039 -266302 133225 10876 288449 69624 1078 -448316 26475 405895 161315 -54632 -44021
19028 -44021 7601 -105532 -196179 120003 317292 -216920 -246012 209715 -139206 -234587 27018
19016 -170069 -44975 -68168 25042 -43219 169927 -165175 -375450 128284 -37368 -375450
19006 -375450 69851 -46935 -20828 61154 -299489 250258 129940 229725 32226 -92702 -216482
18995 -216482 97647 231083 -196619 103627 -76044 -238468 -224274 22860 -154820 -28049
18984 -203614 -136175 109510 29399 -28374 -89060 -68938 94313 93675 282999 214143 -183021
18972 -405814 170137 -130354 -201698 -179284 -178026 7405 -137284 68565 244236 -309628 -75751
18960 259879 -436716 -137093 -61482 -89709 42169 -176511 -84942 -96288 -192607 186180 80553
18948 19075 32744 -78413 187415 97568 222611 20905 -90877 -259488 162397 -227766 96904
18936 -99217 -141586 -265917 -384935 -358052 223706 -371227 -90424 96626 2502 19449 311243
18925 311243 -24285 -76719 160188 207274 -34930 -143515 -165373 -295914 64202 73094 73656
18914 73656 -72620 225503 -242072 141300 315994 9548 -75882 -218793 -99613 214569 11615
18902 -164010 -108524 -7695 -226528 -184478 -31383 -48364 150729 -252197 -153499 26707 -232876
18890 -23955 -443309 -141880 133499 43449 145790 86347 5971 -280256 74435 -95210 -131178
18879 -131178 -37500 85840 21358 101646 105544 243423 -505571 211650 -101668 142849 -214535
18867 -49350 102708 75808 -338157 2152 -343800 -37684 155543 -90054 222144 -212458 -159647
18856 -159647 86372 -221824 138484 -52548 -61172 68103 43094 -287255 -13397 164798 -229797
18844 -144701 280596 235339 121252 199040 248613 191703 -166139 -146079 -12063 87589 -365005
18832 86169 -91746 66061 116267 -273244 83554 17234 -73496 105744 -193151 182559 227551
18821 227551 -115276 -37182 308536 71220 307239 -105302 85973 -93399 319854 -165244
18810 -67347 74309 -157830 2830 11730 -289269 119947 -297124 -67533 248643 -128569 257921
18798 168172 83748 -219168 -150584 389784 53521 -65284 -145451 -139337 -315103 -106741 89251
18786 54665 -342304 -124849 89578 -96544 -109528 -223106 159167 118052 -109409 96301 -454281
18774 -265481 -194382 -189125 8620 14266 80612 -84596 113243 -70189 -59117 -68122 167318 -104725
18761 72356 259819 85369 239057 466680 -54380 65533 -300121 46746 -317380 -104175
18750 -194119 102244 -21147 269628 -334866 -156530 167605 -266722 136158 47114 45818
18740 45818 -129636 -191012 -200108 44815 -27011 -46052 -235567 -75369 -101317 -3292 -62127 158617
18727 -308434 -190158 2272 -273168 -11921 -142790 -428450 -38232 -453921 -173672 -235671
18717 -235671 -397879 234010 378201 -269614 -167701 -178353 -14878 -4777 -254093 76985
18706 153153 -337227 -26784 -95483 -194117 177991 -483708 -130379 13180 -272484 -333521
18696 -333521 103701 121496 138803 -52820 -61829 -57943 134142 -196103 246819 -107207 -91024
18685 -91024 220719 -195933 -214010 -78884 260349 328552 22292 -112888 -115165 184383 -37567
18673 -264520 -87603 -97356 -276419 -99540 -214608 -116652 472785 -41621 -151768 -170282 118424
18661 -533222 -31402 -8572 92193 -398221 98996 -463478 -6437 -253750 -299874 24227 101224
18650 101224 103253 -5683 -41886 -131210 -88803 -78322 -89299 245906 -5434 -314605 -164886
18639 -164886 -203008 103025 63107 -80463 -329809 -353449 67752 -41780 -355171 -281410 102508
18627 124923 117707 -28838 -112237 -40355 71849 -239842 9512 299600 1253 -265207 -195531
18616 -195531 184879 -185227 -40672 238002 185490 -19888 -20829 -204023 -143211 62491 -404650
18604 25948 -85161 3492 184114 439349 -360415 -110587 134559 -101410 -121310 -257081
18594 -257081 70254 -25246 -202358 -62430 259047 48868 33833 144463 35347 -62204 -22033
18582 22946 92771 -100847 311684 81337 -283317 81670 -215559 -104392 197808 -34129
18571 12170 -155903 93942 8212 -182235 186869 61284 -27704 152709 -176171 100936 100326
18560 100326 -29301 -185781 -300105 67608 -10470 -163602 -190589 106980 229453 -80220
18549 172375 -155664 -36340 -97866 71037 51716 59489 -198959 51454 -299694 49864 20197
18537 -10771 6803 -27367 166785 -18459 -109312 146104 -98238 -21773 -291833 200103 -85779
18525 -23372 32504 199016 -272273 -141505 160729 -184368 -464376 99128 300382 -85769
18514 -186783 -34526 197997 318853 -101966 -175667 -349044 -10566 -60926 125568 54887
18503 108005 75841 -443566 -446295 -212177 63574 72186 193874 -60133 144848 -71554 16152
18491 48209 -94824 -27013 25632 -251437 255794 -228477 -175101 -54360 89954 -118167 -112349
18480 -112349 302125 72821 -321853 313976 -16473 -170437 105632 312191 -20436 227659
18469 -259609 -146867 -89453 284744 -291152 216566 -182912 -139373 235553 20019 -234542
18458 -20898 -158682 249629 104971 170707 -241463 -49532 -58277 173036 -68137 -88721 -168276
18447 -168276 -59893 -56082 24881 -124876 179897 -126711 -318383 48428 160312 -49224 -1751
18435 205663 55388 148171 -391711 -13188 -35110 4665 -2208 41546 -47139 -416879 -126130
18423 11220 -29431 -258458 -295884 -27991 234033 73479 159347 -173593 146725 71778 -47507
18411 74916 -102841 -53301 165892 136112 -30245 -69374 382435 6538 118036 -154775 -157165
18400 -157165 -52249 -244693 2133 -122263 265582 -223417 156354 -239241 -108223 -76241
18390 -76241 -3292 -11757 180831 28843 -147925 -89034 206281 270713 -40249 -245337 -33447
18378 71622 339952 -305136 195485 278213 -312621 -166761 -256980 405162 -94310 -280610
18368 -280610 -208353 -124833 -92119 -67441 99460 -159743 -289577 -109454 21693 62254 123092
18357 123092 39029 113876 -431253 179632 -71609 -65771 -186736 -92851 -189542 85084 -114033
18345 -50576 -143960 260004 -5899 92821 204929 -140949 -36751 -73884 166958 140626 -217543
18333 194582 38928 -140025 -457010 -74952 136589 -366005 -314704 38086 56881 -117085
18322 -3008 -191619 118672 -123497 384299 240270 -247531 -274591 -2069 -11989 -128675 -225708
18311 -225708 80930 -15524 -31068 -5297 91767 -112420 -72592 289442 38665 -385969 -63957
18299 -115684 113375 -100873 35539 211174 -100350 -299133 178880 159642 -90711 22547
18288 -203706 455517 152785 -496798 94137 376993 55965 -156000 55710 -29223 40746
18277 19821 197950 181108 195168 169044 -73204 -23607 10339 96325 -15908 41130 32229 -28004
18264 60565 226121 -379701 352840 -5726 -99093 -260013 -259394 -23770 149610 -232914 -45982
18252 -60644 -40809 -108242 280468 -132297 -115809 -14949 89408 -179664 -47323 -281004 -107513
18240 -161203 16099 67835 -123279 -48131 -29396 -35120 36885 24941 -50890 -324054 -244261
18229 -244261 -200461 -118526 63983 -141105 5214 -205760 -55387 14804 -125401 -351726 20140
18217 -368441 -58031 29328 110886 200774 238883 -85389 116436 -111238 28189 85993 120976
18206 120976 9101 139807 -78229 -369475 -122418 151364 -93271 -113494 -26990 -119034 12129
18194 -42950 -104909 54245 106167 212192 222008 -88261 -94339 76027 131529 -211331 166316
18182 -154204 -67855 -59234 -7716 -16443 -137053 -112868 251279 -250323 -83351 26012 -209466
18170 -46932 -248549 -8846 111038 135727 -9616 -394711 60550 -156713 21429 -106325 -201027
18159 -201027 -425490 85310 308041 188626 48469 -44643 -107552 213266 47121 45359 -98909
18147 219311 -147910 6968 83134 -75873 195279 125112 -73315 -23737 302212 18955 -240404
18135 -73605 -103830 -228749 -210142 121069 -37814 -155587 -49752 185163 49812 127182 -34771
18123 -39307 85866 -166358 115809 213668 -175112 -47779 205333 146457 -19523 -165399 -122424
18112 -122424 -54496 -114846 152878 -6421 -128712 82602 264289 12927 -89107 61574 -228630
18100 -101020 -86005 -125410 122667 -49502 289307 -20186 -153713 -87790 171564 -509929
18089 -192760 252699 -104866 35794 231015 256606 -16247 24332 -117905 98691 -113869
18078 -49803 -45190 -61948 -70690 -102017 -77117 44515 -40350 -180743 118758 -138392 -98167
18067 -98167 163222 24337 -29025 195860 231594 5227 -135062 -82113 274190 -21069 -25948
18056 -25948 122392 51433 -322480 -396640 -120662 27115 50861 81754 -64586 -309012 -432104
18045 -432104 196435 160331 -368676 -227337 82055 311299 -324525 -162512 45295 -254345
18034 146651 198590 382130 -146694 69500 203855 27302 223558 206971 187229 18602 61614
18023 61614 -51219 -102846 -152969 -100586 -341018 -64000 151665 5580 -81395 -162109 263450
18011 127669 85989 85008 -44682 165622 29108 45143 -41267 -170654 -70048 40693 -665 53187
17998 26187 -147106 131443 -190644 116044 -5376 94156 235864 75784 267276 294672 -198936
17986 53213 -86008 -67813 -121164 -185225 28280 -229777 4593 13516 188332 40620 -23475 155621
17973 -97588 -41885 -191275 68570 -54486 94066 -93713 -56433 95848 -173067 147221 179344
17962 179344 75419 69222 60477 -38232 96812 124787 -4008 55552 -58462 295563 -69285 254294
17949 260430 -18534 -221595 84357 31169 396135 93236 -235724 -101197 -160488 74521 44125
17938 44125 -297583 169332 294267 189192 -3226 63898 52635 -181618 -167521 -204237 -61744
17926 142026 115560 38120 146940 209000 -77255 -204471 125506 -120413 93438 148921 9017
17914 -83088 -238090 271905 -88024 -60015 -26571 71229 250133 319378 144223 169468 -52245
17902 332637 -101762 -198436 -132453 -130982 -219031 85654 143991 -39697 105085 140813 -269855
17890 116842 219952 19288 146423 396907 -183575 57175 186050 -76910 -81377 182305
17879 91837 -141496 -21591 46977 27190 11217 -234869 94534 -153335 33976 178273 247280
17868 247280 268498 302457 -60176 51549 151540 -201237 -90120 157610 452449 -246811 -68434
17856 148517 47676 169467 -233350 -98416 16981 136209 16538 17734 5278 185275 -61316
17844 62539 63666 -66934 258421 183323 -147623 -188381 19499 258627 254840 -51114 13165
17832 234219 75358 301353 105303 -173298 144355 -67974 13865 -99429 -25927 173374
17821 125608 20452 189344 -86497 289383 -146296 -24750 58453 133256 221129 -25031 -195341
17810 -195341 166314 -44349 263941 36580 428612 -147664 -114409 64040 36149 150086
17800 150086 374159 144908 -20670 112864 233082 101045 179134 392289 -5386 213600
17789 -128254 352329 114930 -84224 202041 -73586 221531 -20982 265677 100607 17977
17778 334491 58612 -32053 358063 -369216 -152368 -155791 202197 -268297 245443 80912
17767 77508 -135038 -69303 -391629 117731 56253 -61297 -195376 -68670 153384 14990 213779
17756 213779 -47141 -71348 147099 -82469 28198 161468 -149589 163504 400917 -138938
17745 -90631 171344 22179 117254 140794 -31762 21831 93113 203531 -18577 391061 231232
17734 231232 -100140 -229731 -66417 72819 204419 -44280 -5915 239 69583 -108444 -163347
17723 -163347 63747 88014 -4847 245691 253411 461455 -109709 148072 -37168 -35901 195243
17711 301489 -13853 185954 204351 -59651 -114225 13773 -109137 37780 48337 193374 -66210
17699 -68587 192065 31410 -34804 -101254 184992 160238 -14648 -62602 -84977 262183 35790
17687 386002 65126 82060 241148 -288252 -9374 -32047 188029 168808 105273 13350 -49712
17675 128438 447386 197566 136181 -33174 276488 284192 -10600 571809 -32483 15978 36898
17664 36898 -62400 28660 206030 -17097 -178359 120787 458735 317912 231277 402387
17654 402387 281836 397 124875 27873 12201 37597 272783 51107 216616 50247 -502717
17642 -193706 337763 -91184 -52753 -59041 -96417 34115 128647 273310 -87604 -116065 219845
17630 177845 -48831 171402 472143 278235 107093 229798 14405 -283354 -90203 -11951
17619 296135 151081 -28493 55399 582753 20323 309008 227445 91564 370738 180475
17608 74319 542741 152995 84134 -182153 272716 48059 76736 45083 -308565 304579
17597 -26899 47337 100090 -87118 159668 91401 208185 340601 84452 -8761 -102639 32012
17585 167405 34715 -45518 -143687 102387 113275 96731 263917 156809 197621 116154 68245
17574 68245 -12011 -12589 254608 522310 -66011 182891 256031 190583 291759 112958 -205925
17562 59546 109470 61608 56758 110601 415437 236482 242667 -26463 156563 223594 48852
17550 295634 -154174 75797 508583 127845 140017 101689 283113 -25548 111291 125483
17540 125483 153388 118652 103014 603877 -194117 260151 130153 254916 -33197 -4026 98528
17528 426742 321531 247404 92785 200398 185797 275064 849223 614384 587550 415049
17518 415049 399110 511157 -3327 347972 44522 206486 301000 197784 527526 376979
17508 376979 488119 760973 382973 571474 281191 408404 320078 270200 128519 385445
17498 385445 308205 107 649840 208780 376580 103351 175319 371438 237192 113169
17487 103644 145479 218138 525756 350507 96149 488151 40984 313522 459186 220956
17476 240879 191677 217359 311551 238128 107083 363471 362056 295155 136946 250725 352053
17465 352053 214166 18641 -4369 300813 5296 195026 516841 23052 108448 224579 443999
17454 443999 519878 -192638 352656 116122 327607 355274 208231 43270 264742 171835
17444 171835 234498 291848 257012 347508 40819 230168 536144 13207 21842 -52878 208890
17432 93152 165017 244083 384768 271214 273325 -34532 326189 434372 295748 343562 247850
17421 247850 337219 472000 257345 164367 456630 226410 374223 389576 -44356 53082
17410 65515 513633 8722 335617 394752 58299 372673 -9478 -125 208768 371718 569553
17399 569553 119620 225061 7356 155592 243761 -128598 -31237 238696 327760 491369
17389 491369 348750 83626 310598 75887 456883 245194 145753 341756 516117 -81274
17378 373693 398938 67232 -49039 129935 238135 -48654 141190 131708 313748 288688 256217
17367 256217 375654 143637 147956 225713 177752 287459 115993 153280 -116449 219152
17356 52103 314002 4387 149580 123926 286397 484921 104082 175188 76083 167157 275310
17345 275310 545234 6063 211291 -12107 120512 217878 646050 107909 144013 -141729
17334 233462 404562 395768 434831 349817 386337 215330 614766 260617 380538 307449 277372
17323 277372 129307 400523 296209 182382 17636 -68176 167202 472772 399172 35013
17312 495297 -202450 122403 408043 266966 377927 21859 176731 442280 38019 298893
17302 298893 88899 69644 292749 320774 211209 353639 335699 487240 131900 341300
17292 341300 215073 236247 174122 189268 102183 -33882 41238 590120 168901 289692 76336
17280 -14790 19012 244201 -149364 316375 150136 295991 424960 293542 564562 578558
17270 578558 476076 137418 137314 89766 357974 110236 -95148 63756 108251 371370 505740
17259 505740 190853 211471 220119 205223 -22129 442591 106506 225065 346855 179905
17249 179905 397751 258813 64768 161246 351265 265871 139657 462562 160499 456943
17239 456943 340567 112584 466631 179574 64924 565169 418994 4696 -85239 587666
17228 212409 305660 418895 -42295 462978 153916 142774 91248 254878 500512 80657
17217 295208 263994 212742 124345 235892 427637 437028 232228 282947 185157 140930 334448
17206 334448 67595 -27430 532913 -280385 227427 417093 207232 448647 83955 154977
17196 154977 510121 677006 784198 456644 300592 399090 416480 4433 186560 168449
17186 168449 505018 152239 571066 502142 229914 324660 356516 116833 284915 488655
17176 488655 280922 697946 414309 376104 774202 450840 408759 123558 412350 635207
17166 635207 516853 119792 197373 511293 422264 410236 518390 250023 682624 398257
17156 398257 426219 516400 447049 672636 477967 387310 359008 371626 803155 399770 347259
17145 347259 216008 467165 138269 482378 752346 510233 332094 340907 286377 547807
17135 547807 703196 497702 443257 337032 605364 167173 676024 557247 418968 597050
17125 597050 617757 784040 468416 494564 370382 551573 397777 364388 555288 769075
17115 769075 400534 320343 591468 350350 707364 235104 665886 299687 642106 434654
17105 434654 234195 428904 305602 697497 589945 706476 898048 349102 526395 710004
17095 710004 736411 624072 754104 534717 175018 611711 559592 655457 626768 582725
17085 582725 546783 724699 413229 602183 828739 764183 348661 802732 738058 738083 808915
17074 808915 398338 619351 467872 450321 713755 577954 601273 796123 654541 680200
17064 680200 848499 917894 668180 923139 745350 599624 589831 826860 739413 582885
17054 582885 664306 1037892 798919 688325 560261 744317 837634 492695 864293 831502
17044 831502 594690 1132697 969387 890698 486001 757850 964975 996278 596039 813859
17034 813859 992492 1200911 795705 892134 866519 694175 805245 711112 1240858 1165775
17024 1165775 917759 1075310 1141549 904968 993238 1020437 794790 781829 851847 706025
17014 706025 798467 537703 765317 795251 993877 909070 817496 1234329 849308 1133014
17004 1133014 787088 1368444 1079087 1093396 997883 1402733 1063498 998886 1243797 1355656
16994 1355656 1328599 1178149 918012 1221211 1139218 1363213 1191187 1203668 1295185 1067064
16984 1067064 1531631 1182543 1197221 974576 1253135 1443939 1188904 1116266 1348978 1388762
16974 1388762 1496042 1324214 1505733 1632704 1383775 1395462 1914918 1798342 1465373 1797834
16964 1797834 1496437 1710533 1380459 1436235 1617438 1713501 1259385 1736005 1587778 1638521
16954 1638521 1888080 1589563 1367161 1722483 1618263 1848990 1901687 1893204 1820774 1908165
16944 1908165 1777381 1519879 1978241 1975806 2071971 1930966 1845119 1971242 1979414 2131837
16934 2131837 2077596 1874634 2190551 2266350 2026228 2215349 2094655 1963483 2362061 2251615
16924 2251615 2366328 2510196 2292624 2391741 2260272 2327891 2296412 2674356 2316502 2561554
16914 2561554 2461788 2495231 2882952 2692967 2837211 3087936 2768637 2967396 2931021 2823540
16904 2823540 2839779 2880795 2959212 3263865 2941773 2851594 3209594 3443399 3111176 3555423
16894 3555423 3274031 3384225 3201922 3728984 3543986 3820493 3751092 3805877 3805381 4026408
16884 4026408 3983289 3766754 4184369 4254388 4385181 4037438 4143089 4193879 4356960 4460350
16874 4460350 4537181 4759929 4738948 4678588 4834538 4992533 4878038 4740231 4989783 5627782
16864 5627782 5186536 4968579 5895784 5619990 5670227 5703828 5698116 5742961 6224982 6318690
16854 6318690 6010971 6372278 6579823 6454654 7007102 6717527 7061330 6898116 7531320
16845 7531320 7241267 7407908 7555573 8136497 8054168 8237224 8317148 8187240 8784994 8945801
16835 8945801 8911596 9131762 9382082 9933787 9943586 9957843 10205676 10393009 10776291 10952244
16825 10952244 11369900 11330114 11642020 12115656 12219034 12704554 12617759 13040881 13078908 13969369
16815 13969369 14121584 14470728 14629056 15316597 15808875 15905979 16381298 16820181 17151518
16806 17151518 17648917 17976874 18324588 19250749 19834002 20078303 20716478 21549407 21695578
16797 21695578 22138107 22865049 23716488 24452397 25163934 26085202 26562476 27425943 28129402
16788 28129402 29372946 29762242 31060093 31542185 32582133 33987148 34940191 36044053
16780 36044053 37794883 38323304 39897888 41086467 42224273 43513340 45091065 46670299
16772 46670299 48277531 49511946 51362628 53388142 54873429 56425513 58239499 60179900
16764 60179900 62093718 63907287 66076600 68169858 70398642 71807855 74205520 76497931
16756 76497931 78744232 80638867 82227444 84869343 86880466 88807207 90400483 91999885
16748 91999885 93913052 95467156 96981977 97835398 99201007 100125058 101022986 101958704 102288368
16739 102288368 102336401 102312977 102570844 101892062 101289214 100581521 99845384 98632511 97590952
16730 97590952 96583295 94640220 93093658 91278234 89510963 88012304 86009110 83995414
16722 83995414 82333323 80324284 77905439 76117626 74084080 71931659 70139686 67923961
16714 67923961 66133718 64007739 62605324 60419149 58589591 57042945 55275976 53762588
16706 53762588 52391133 50732046 48976768 47698557 46421735 44791272 43421789 42224366
16698 42224366 41374548 39815636 38638025 37854583 36742983 35561710 34694209 33768619 32674739
16689 32674739 31575859 31272951 30319557 29220334 28505512 27985833 27095277 26435397 25714255
16680 25714255 25426818 24691176 24127395 23547403 22738183 22380580 21847818 21243857 20469060
16671 20469060 20633561 19936837 19529923 19091408 18624107 18350571 18122420 17548538 16790101
16662 16790101 16675868 16084900 15670041 15690768 15239693 14955072 14320498 14584756 14259071
16653 14259071 13860578 13853968 13375271 13273045 12854960 12432965 12426697 12586045 12165354 11709435
16643 11709435 11543221 11062978 11110743 11017561 10450047 10397226 10563829 10256217 10065580 9845661
16633 9845661 9508392 9950167 9347749 9327226 9210820 8960465 8902197 8455946 8370338 8753874
16623 8753874 8462492 8424126 8369256 8072460 7898290 7882840 7647824 7712897 7452035 7570414
16613 7570414 7329361 7255857 6744040 7094391 6948196 6688579 6764896 6772357 6484399 6739690
16603 6739690 6527215 6261937 6223861 6248241 6064687 5918645 5914469 5840158 5833031 5897873 5435629
16592 5435629 5739010 5335395 5523009 5763292 5692821 5189330 5084362 4728163 5263055 5001406
16582 5001406 5314598 5019238 5252871 4811969 5011338 4725424 4540581 4574090 4675390 4492607
16572 4492607 4829944 4330553 4818557 4266657 4632181 4455322 4245033 4265303 4408822 4164408
16562 4164408 4116037 4281926 4160061 4048235 4039891 3900981 4017588 3977261 3620937 3771583
16552 3771583 3464726 3717494 3886781 4113815 3374621 3762433 3585978 3784686 3685637 3516052
16542 3516052 3475194 3205137 3749424 3210911 3655247 3517953 3434939 3330841 3315624 3489950
16532 3489950 3376468 3346002 3339766 3247083 3282403 3607507 3329557 3514319 3065029 3206828
16522 3206828 3147362 2956243 2808516 3240677 3341823 3134664 3020857 3137907 2993454 2938414
16512 2938414 2987904 3134718 2807680 3112531 2801406 2962565 2914123 3142292 2747409 2658174
16502 2658174 2946409 2855308 2601379 2874550 2551602 2651017 2775419 2875948 2668034 2704109
16492 2704109 3047099 2857186 2367671 2698938 2322859 2664259 2542569 2891645 2542628
16483 2542628 2566059 2324802 2357125 2829385 2579468 2836678 2423003 2596686 2549024 2451785
16473 2451785 2383039 2265403 2626457 2448238 2478570 2688085 2142975 2470797 2382385 2382070
16463 2382070 2511221 2328652 2482398 2404186 2395385 2569291 2390579 2266457 2532924 2331667
16453 2331667 2506999 2302682 2495591 2252889 2301044 2437393 2388002 2167056 2418904 2095814
16443 2095814 2317204 2441740 2234797 2456827 2423434 2136445 2342645 2282892 2174575 2147214
16433 2147214 2231307 2395486 2125738 2123738 2111135 2374370 2064961 2013906 2142506 2291127
16423 2291127 2523031 2422367 2181208 2091975 2314535 2087621 2163763 2292130 2501536 1955466
16413 1955466 2312990 2061632 2033071 1998982 2087973 1610064 2389101 2458210 2042509 1973275
16403 1973275 1910908 2243655 2581470 2112648 2242574 2592489 2124525 2562805 2086311 2031196
16393 2031196 2207851 2021991 2072530 1669725 2343149 2049967 1926659 2009287 2137689 2180042
16383 2180042 2058716 1976400 2046278 2045950 2221667 2056139 2041912 1962789 2153715 2236998 1932933
16372 1932933 1950982 2085951 2110809 2147509 2012073 1775009 2110704 1855859 2239552 2154527
16362 2154527 1854342 2201241 2123419 2456179 2027942 1622204 1959979 1974047 2167204 1998100
16352 1998100 2227572 1972393 2356711 1792650 1921265 2121909 1881540 2228137 2029707
16343 2029707 2464361 2023651 2062736 1973098 2168401 2055153 2091665 2025026 2066772 2180218
16333 2180218 2015750 1850036 2095782 1814880 1864401 2142209 1855943 2193979 1772518 2001084
16323 2001084 1464946 2144478 1762294 2169369 1577874 1812999 1637078 1858545 2110907
16314 2110907 2538035 1823662 1876161 1870493 1801382 1955881 1823109 2085247 1776794 1770102
16304 1770102 1697585 2142830 1927437 2252079 1587220 2047755 1903252 1748526 1856589 1898943
16294 1898943 1873011 2044568 2013257 1832674 1695851 1933454 1614808 1661183 1552294 1843021
16284 1843021 1769040 1468209 2065970 1726520 1776536 1580042 2028677 1827519 1935661 1859385
16274 1859385 1598934 1720986 1816060 1780123 1897434 1632452 1885371 1856977 1805399 1508907
16264 1508907 1499981 1837086 1861078 1635084 1640765 1865351 1869564 1780396 1908234 1749106 1733880
16253 1733880 1929274 1715418 1302444 1474916 1735823 1589192 1382719 1581509 1550535 1879590
16243 1879590 1718649 1637995 1638742 1691616 1736684 1159080 1467266 1386729 1199865 1467909 1373644
16232 1373644 1396214 1665798 1683173 1467251 1503493 1587657 1326926 1634677 1553164 1170452
16222 1170452 1669485 1562178 928854 1645468 1315846 1148109 1632814 1500758 1350655
16213 1350655 1104762 1351800 1510551 1522181 1365874 1353558 1297957 1316097 1474553 836215
16203 836215 1475863 1260279 1339036 1348470 1456128 1545072 1265863 981314 1252192 990961
16193 990961 1217736 1128061 1115506 1073726 1059212 1535835 1066696 1025063 1058906 915129 926023
16182 926023 1156196 928076 1019215 1028037 1175189 951807 1318991 1132348 874757 866635
16172 866635 1031975 534517 1172448 851331 902820 981204 963249 900098 754137 977450
16162 977450 878832 1003718 1039791 1104838 964819 619069 646059 869787 937277 581114
16152 581114 596957 790979 997499 757249 661935 769833 1181645 748510 823302 853793
16142 853793 666646 750332 751067 789368 860131 786557 411983 455440 646748 697344 619957
16131 619957 794041 775034 724766 485785 689777 916581 855071 651737 729758 944058
16121 944058 621658 434673 607379 822856 933277 411890 702710 583921 626254 385245
16111 385245 594984 548747 800139 641970 391947 593608 501027 315595 395441 434825
16101 434825 826212 330383 788862 573029 714100 744479 452506 599941 285966 491839
16091 491839 765884 694496 720981 401077 687486 261413 525203 307802 625164 604437
16081 604437 464117 390914 197753 368339 474563 351884 272086 260148 666274 244188
16070 371779 417104 618212 94505 289278 430994 531842 610081 220572 309440 375186
16060 375186 384088 182115 232183 278194 265462 364161 495920 304474 332940 369106 171838
16048 575692 204132 473724 398273 65882 266372 374693 263665 465195 307098 277120
16038 277120 164699 512504 397194 223788 104328 214111 138224 158333 450796 367241
16028 367241 140270 287309 37830 142673 361933 384782 154198 271502 315264 218585
16018 218585 394563 349483 369370 276612 392779 336450 179696 209682 12320 170988 213459
16007 213459 374161 256206 92777 348382 396429 224234 20475 426903 -251714 258183
15996 302638 282226 193806 168707 149381 419030 353065 202121 633290 605882 788474 929310
15985 929310 1317487 644938 614357 395455 -79144 560697 432263 191366 201914 136438
15975 136438 6119 -108554 406082 355648 355482 147203 263108 341279 231209 -26540 -169142
15964 -169142 126927 -278811 51245 37245 160001 -2688 122453 24035 -269733 -40715 130945
15952 -254031 107483 139692 -54500 98126 -21298 -51043 165544 134538 221310 -147456 107427
15940 -130551 408037 -16364 -210988 12197 19054 -8113 113829 53726 124991 147918 64582
15928 -85824 -232716 9953 69763 -113983 214617 48615 54159 76313 -36883 255217 -31480
15916 -90553 168317 29663 -54511 3167 -120545 143353 -147768 37211 14771 53309 -48954
15904 114329 -8917 358406 -80803 -37467 327446 -92760 -227625 -116102 -201970 35320 -148740
15892 -180975 -105150 89767 121799 93353 268878 -185817 122855 170413 -128129 -109041 59310
15880 46103 178809 234020 254191 -190895 -133893 468720 276063 -50175 57843 -228665 -219226
15869 -219226 -46778 -45350 -35472 174216 2192 -34300 -150775 54569 214164 23032 89550
15858 89550 41394 -45763 259981 -30413 160318 177330 103229 111180 -295904 -88835 -75947
15847 -75947 -9654 -340000 -206394 94456 -114642 2427 -191439 -44780 174270 -239591 82864
15835 107296 -31610 174985 146182 -76833 -114580 65952 180758 280962 27601 -258930 265455
15823 141598 17670 -128527 252044 -17949 332413 -27820 -130259 -181795 152765 -110984
15812 -96879 63616 71311 -175403 -360418 -155579 72774 244264 -150224 -7200 -66809 167097
15800 -332376 63671 -42296 -52305 180781 56922 -190818 37121 20916 253765 294474 -102027
15788 145736 188826 419 -113158 -124595 -82192 -104558 -237916 2590 -52833 -143594 297575
15776 45536 -105877 -178180 -68998 -32986 85249 25702 -105136 9908 -337845 -119223 -80590
15765 -80590 125028 50204 34158 73324 -107576 124841 90318 112887 110901 -45626 175003
15753 211811 236334 -129728 -90735 -81424 -165691 -438219 -46348 114009 72174 -72785 213467
15741 307291 52732 144785 70723 -65464 10273 -144487 31112 39543 111021 -6555 -47400 -225318
15729 -225318 198502 92544 -301707 198329 366749 -111659 3246 -44559 25536 -256992
15718 -159252 201691 99051 -144654 131690 -127504 -199317 -75789 158749 -64180 -344496
15708 -344496 83627 -170391 251816 -234557 35320 10727 124113 -19640 -72613 301014
15697 275635 23117 113096 322279 126644 167933 -233509 215526 243812 291096 134427
15686 -157801 -154970 -27862 -177775 3284 -183720 207590 -50073 -161968 -277747 153962 214509
15675 214509 244233 121175 9415 252892 92226 -84686 14650 241518 19465 -79138 105254
15663 -127372 -133712 -196151 -136990 -204338 133212 -54485 -124428 269475 -412681 -224651 -28829
15651 -28321 -352597 -175929 169270 104826 -55918 -173676 -94390 218199 108296 -1615 -349960
15640 -349960 -236858 102195 -44293 80235 370232 -245904 -357104 -370193 300715 -243192
15629 -84177 -430508 -58020 -119356 23284 28369 53078 -120636 -288732 217775 210765 244843
15618 244843 -29727 95114 -20143 -28808 -55305 -177941 -188403 67040 183679 -23449 -73705
15607 -73705 77806 94926 -54291 73466 64032 -174139 -174940 -273152 129205 -146988 51866 -35234
15594 5564 -101917 -30767 -240802 -216963 170743 16992 273420 -288259 -127024 95478 -253613
15582 -39382 -36708 -63661 245332 -232254 53183 11147 156467 80620 -41118 29588 -47145
15570 -92368 -35402 100401 164966 67716 36715 -147119 -32530 -156060 -115914 12411 -117603
15558 -41919 -94547 -37310 96625 -13068 110246 -99519 168575 284818 -54084 114073 72969
15547 72969 51786 -52685 104981 24734 -51002 1281 81565 104212 45171 -117046 485544
15535 31995 29575 -120506 -200168 70623 -179807 -207986 -47676 -315189 28262 -35998 -86776
15524 -86776 38549 -22104 65051 465904 87202 -244741 72997 327921 234714 45652 -73164
15512 73326 72352 331689 -10868 100612 -54511 -5093 -14351 -371303 -15160 -22115 1451 300292
15500 300292 -122862 -49618 -241488 122102 245558 140244 -134153 -361962 -277978 264861
15489 220977 6570 156451 61472 -36241 51098 -200920 213018 141697 144635 192762 38226
15477 149625 269972 54652 263828 97702 52578 105987 20406 -292776 236069 149313 -194836
15465 208390 9065 -12900 61746 -109753 -28181 165192 88654 -34302 118252 -82965 -274933
15454 -274933 134781 -85157 3554 -31629 -17618 -175664 270107 9087 -23736 376453 171963
15442 570878 412454 185460 146032 46641 304907 164382 79103 57117 407662 -182352
15431 269098 -233089 125292 -59580 327234 199320 -126897 140170 -158627 158165 -172293
15420 -58827 359050 94785 -90800 187620 292795 -440208 -327107 132669 72518 -175092
15409 5767 -226593 339623 -235325 111211 -156042 243078 -229122 -293763 -3423 -221076
15399 -221076 -20219 106492 112952 -36411 -168659 82496 174040 44468 -243049 -131383 -158691
15388 -158691 512586 -233029 -122196 -86948 -400005 -14807 -192228 -52035 124972 322342
15378 322342 -90777 -149132 -98385 -108484 131213 119069 192015 -119156 57268 171322 367912
15367 367912 452377 223743 273637 173470 -134863 284829 -28064 197269 -5236 96681 210572
15356 210572 1881 138632 6707 280839 226006 201398 -55147 617100 -83499 209609 121592
15345 121592 -244391 94863 250820 -27841 58321 70057 371399 326076 40669 292791 -254706
15333 151038 317776 -84692 45471 191251 -88877 143217 67656 450378 58097 396323
15323 396323 -19667 154957 398922 183688 137159 330736 103699 82939 104083 243101
15313 243101 -278845 163027 -11621 204751 -4053 130768 -23388 -55199 296287 181484
15303 181484 -264745 163705 130322 -106927 -41865 -20599 100238 75285 30209 73432 -172544
15291 -155325 203329 116581 181563 136168 4119 235284 -121179 156699 56378 44730 -118788
15279 -40843 176141 113009 -35228 -69148 -130675 166189 373904 153412 -171966 -39199 -40151
15268 -40151 -459973 338492 334047 140293 53979 -251320 30734 37524 183216 123960 -144580
15256 148292 134942 98209 -76338 77665 -65499 -90522 150117 82766 95186 55231 -2787
15244 84347 -349352 -172517 188963 72181 130301 120232 83887 98914 -204418 50865 166579
15233 166579 -204327 1834 256777 -28828 164576 -116671 -364706 34771 -153733 -29027
15222 143421 97408 79170 -268382 35905 51404 255613 406272 270725 -37694 262831
15211 136335 -14264 178826 238408 1895 -133079 -167872 -10750 -266787 158975 196670 176614
15200 176614 37356 -60825 -281704 281381 -35431 139 186750 44820 224219 400911 77652
15188 346290 -71073 30880 105166 108977 -25065 40011 286151 280467 375140 -168899 129655
15176 -90131 65779 15440 -389531 108364 240675 -46100 -70282 80137 155487 -78637 216524
15164 261732 -152126 157046 -216742 110244 152605 72037 351763 -248541 211526 197808
15154 197808 -130704 121310 43123 102017 206351 -269742 116405 -2634 277418 -156267
15143 408904 287569 -112024 -114016 36141 397889 -108649 42 292542 53281 366888 -181856
15131 50765 -40231 310686 134243 -86986 365015 223840 -37142 180978 185727 -91398 432
15119 -121129 474704 262572 41587 -115903 215352 209039 105722 117595 326437 -164422
15108 41783 -23061 -21218 -22727 256570 -93222 245280 569446 224269 -134860 213324 26265
15096 325665 243281 338122 178240 211970 157530 -1530 213657 -43057 302 144564 234571
15085 234571 327202 -171761 269230 166992 253458 29066 94794 487715 -115581 168841
15074 312059 61051 -144626 73354 168885 262639 3961 107328 -11511 503326 -20771 336604
15062 232056 446495 267220 142276 -2968 325900 418225 169108 257592 384303 291859
15052 291859 139947 396726 -72239 333904 422284 351272 445640 502101 389139 251803
15042 251803 208886 148582 224631 321328 250795 131362 99858 65965 -65087 -163167 476281
15030 465735 318949 488325 193714 355492 337405 522782 516675 276050 38669 307615
15020 307615 360106 331685 517606 283872 -5332 236159 627463 222744 105318 767176
15010 767176 482790 113396 407175 144723 355982 249317 102083 26915 274771 252845
15000 252845 492947 131591 505342 193727 263025 531328 473899 292144 246018 38417
14989 252884 72995 305302 331468 90080 316486 421118 601080 244762 532446 302007
14979 302007 761219 541369 625765 536458 543756 661635 500537 401139 238624 260774 555568
14968 555568 47370 280919 655874 511230 726104 39858 238488 453148 416170 558045
14958 558045 434191 62916 276694 618633 199274 441737 72397 240435 90200 312872
14948 312872 264990 464390 446849 489032 508997 596327 380295 533521 509537 360699 765703
14937 765703 533618 446141 509517 383342 587379 580246 705137 533051 970998 921010
14927 921010 729536 829273 1030767 919870 748364 884663 780206 1264954 1024018 1231528
14917 1231528 1222133 1285115 1199722 1367977 735399 575195 361738 327462 490252 308155
14907 308155 332064 280992 542516 701480 372260 261683 502171 51122 293877 388282
14897 388282 224398 559444 19550 389493 444855 406695 343568 577079 580321 582528 437918
14886 437918 738653 644244 522220 540430 524732 655802 -146425 220027 360356 387416
14876 387416 529315 521190 328961 541150 772079 275393 532632 703141 395553 299328
14866 299328 840764 747445 428864 591044 -35818 303618 117397 141213 690505 187937
14855 260888 499028 284078 109652 642620 411613 458320 708750 417909 831163 341723
14844 426529 482441 759109 684142 1130111 768261 842357 771912 799199 844453 854471 482557
14833 482557 869601 559961 677141 349432 332766 194322 502296 662284 340622 269915
14823 269915 485318 372938 128880 737172 622999 488939 517402 635234 719135 594077
14813 594077 577244 461645 420900 386466 556206 775172 541247 723165 377361 737028
14803 737028 713648 714828 762889 974425 719831 495828 809126 123712 665810 502853
14793 502853 745458 584038 638570 427199 625139 734497 241643 488883 631323 341598
14783 341598 428291 649633 545716 675927 645915 660573 668874 815710 670689 899603
14773 899603 780571 604708 442407 644726 857186 376676 316199 658111 392234 619404
14763 619404 672918 685303 492587 801797 346858 462610 325336 481143 420780 965348
14753 965348 560031 853304 593921 606099 862623 724929 647599 408347 582449 561297
14743 561297 655569 800524 689442 604432 718082 479579 1095690 539441 581286 764589
14733 764589 667847 1012581 863523 1126667 689452 676696 851939 755706 810896 1354715
14723 1354715 1185432 1089324 988580 1390594 1336885 1026316 822597 966520 976621 926125
14713 926125 641055 953289 852972 868763 784266 866540 790225 985531 998115 951768 871168
14702 871168 1289226 1071983 1208719 1460319 1369498 1408601 1346716 1410000 1202363 980040
14692 980040 841692 1235336 1109775 915959 891549 791642 790208 1119953 691899 743667
14682 743667 818391 1084326 1207834 1181569 816476 1311409 1096735 811046 1001897 994491
14672 994491 987735 982073 632187 833864 1192757 806539 1182247 1112007 1018837 1065718 1027598
14661 1027598 952395 948287 1180626 847550 1091678 1216917 1194442 1072123 1560385 1104463
14651 1104463 1120564 1560985 1039974 1178565 1113429 927997 968555 1015549 1092620 1249616
14641 1249616 1199856 1136462 1080755 1154597 1327267 982091 1178233 1166021 1075728 1108911 1214532
14630 1214532 1228915 1231282 1289231 1295098 1245883 1380604 1617921 1272824 1215385 1339125 1461611
14619 1461611 1595198 1219155 1560345 1158279 1179101 1660132 1700835 1079046 1575529 1558774
14609 1558774 1595536 1440051 1219356 1159476 1459300 1605172 1642085 1415558 1517137 1341008
14599 1341008 1671161 1536346 1992518 1459383 1607268 1675649 1411047 1423110 1724094 1724583
14589 1724583 1783617 1519596 1813154 1872651 2013590 1752265 1743796 1742933 1807068 1663743 1723517
14578 1723517 1847521 1747682 2053070 1886825 2063026 2050207 2292478 2064327 2228634 2096457
14568 2096457 2196754 2335028 2194859 2468078 2222612 2494798 2787185 2317104 2771050
14559 2771050 2485100 2955108 3149241 3332434 3257944 3315794 4087756 4327588 5407434 6163569
14549 6163569 8470511 12254868 19179691 30457808 32553220 18250456 9286910 5542532
14541 5542532 3846169 3100556 2680240 2469207 2074745 2208943 2191641 2419099 2039839
14532 2039839 1776174 1836496 2083243 2125812 1969016 2299497 2591105 2029998 1976660 1999223
14522 1999223 2289324 2683135 2384009 2346769 2641657 2539557 2585822 2496255 2486924 2847715
14512 2847715 2760680 2799995 2481600 2406134 2918563 2584187 2496375 2641679 2931035 2827302
14502 2827302 3064880 3015816 2984594 2854659 3144952 3496184 3389372 3130253 3122009 3158717
14492 3158717 3399638 3339979 3056410 3584069 3571967 3314652 3549628 3661780 3474232 3474350
14482 3474350 3753368 3332172 3776552 3739179 3761269 4110353 3908002 3770356 4071826 3931882
14472 3931882 3876473 4053487 3945237 4069803 4577479 4166394 4381850 4534621 4337192 4599408
14462 4599408 4620633 4480613 4694291 4527671 4868540 4900843 4637777 4842065 5055359 5135137
14452 5135137 5261161 4832001 5210758 5165644 5634145 5547608 5615156 5789352 5403801 5511652
14442 5511652 5694637 6139548 5886452 5960138 6109300 6397633 6308478 6389114 6361738 6391822
14432 6391822 6680574 6327077 6497222 6808263 7296704 7085000 7149300 7207270 7295758 7141479
14422 7141479 7604574 7925348 7789212 8074408 8225314 8175017 8456902 8464472 8314448 8534492
14412 8534492 8636852 9072018 8684602 9105701 8985478 9351304 9335165 9838799 9369207 10139826
14402 10139826 10137824 10253592 10226581 10530278 10665068 10630105 11034682 11114291 11316615 11629758
14392 11629758 11879140 12014354 12485764 12146043 13037921 12733821 12883238 13023910 13393179
14383 13393179 13567858 14238485 14442901 14682983 14971157 15227172 15572836 15714548 16050032
14374 16050032 16281271 16638097 16868546 16961107 17863630 18104539 18201677 18586279 18925704 19731481
14364 19731481 20004296 20456358 20868186 21008882 21837023 22150105 22628065 22840998 24059495
14355 24059495 24135899 24875456 25113863 26314664 26265105 27589043 27970732 29232210 29350655
14346 29350655 30398128 31197901 32159989 32747079 33314053 34753212 35567213 36593373 37890486
14337 37890486 38482727 39258317 40899708 42052538 42981057 44608315 46141155 47462125
14329 47462125 48866019 50401874 52125381 53556947 55676366 57428471 59024498 61491308
14321 61491308 63558807 65923729 68241403 70575475 73023100 75963576 78794507 81940678
14313 81940678 85284186 88433778 92114609 95941160 99566367 104026893 108644729 113300451
14305 113300451 118341961 123545307 128851348 134888466 141250262 147725742 154803959 161719774
14297 161719774 169404154 177322561 185849979 194921578 203934325 213726219 224152494 234943347
14289 234943347 246334267 257722475 270338911 282808825 296207364 309808831 323070392
14282 323070392 337145810 350810493 364614574 378125463 391211455 403153620 414762654
14275 414762654 424534801 433339691 438720300 441492670 442910629 443518138 442458668 439166430
14267 439166430 434680626 427967645 418949459 407684330 395033836 381048668 366436631
14260 366436631 351686103 336381637 321394996 306254760 291943111 277958114 264309238
14253 264309238 251218541 238278870 226872387 215437631 204718761 194445740 184961252
14246 184961252 175954219 167382958 159798079 152181289 144964109 138196788 132026565 125830003
14238 125830003 120197097 115270108 110279786 105623255 101571148 97043971 93219099 89963347
14230 89963347 86134745 82683770 79370277 76592674 73516871 70784842 68199164 65731468
14222 65731468 63255832 61260540 59068773 57495503 55357472 53527754 51655037 50104762
14214 50104762 48626127 47208178 45666605 43728672 42969184 41844221 40400606 39689500
14206 39689500 38866608 37285874 36231701 35387437 34244565 33361434 32691891 31839696 31017098
14197 31017098 30035169 29438348 28596723 27809442 27309991 26513976 26322035 25109621 24766322
14188 24766322 23829303 23293083 22811482 22494332 21867894 21470113 21021639 20501078 20230517
14179 20230517 19734131 19366218 18935084 18644686 17932640 17269734 17279841 16814751 16861431 16378768
14169 16378768 16070041 15415393 15594597 15133306 14975780 14593809 14093529 14006236 13829997
14160 13829997 13749939 13307146 13115744 13058668 12706987 12125264 12295828 12171093 11682471 11435154
14150 11435154 11204494 11036678 10706633 10906146 10725968 10425638 10550870 10433956 10162177
14141 10162177 9977006 9727891 9607582 9773319 9424801 9273810 9293807 8753180 8805821 8619908
14131 8619908 8497223 8557685 8277607 8354355 8189003 7884576 7886438 7862692 7796446 7565037
14121 7565037 7200449 7356968 7176975 7008398 7017073 6801797 6868411 6564285 6517617 6677487
14111 6677487 6629295 6197295 6205847 6082338 6544424 6223581 5557807 6201709 6111273 5683828
14101 5683828 5522140 5488292 5548605 5658581 5452156 5339725 5418661 5473267 5342157 4849091
14091 4849091 5343811 5109387 5079863 4778719 4871605 4983621 4793005 4678212 4742188 4330584
14081 4330584 4353545 4494740 4195356 4325428 4190671 3947324 4312800 4249890 4139088 4390808
14071 4390808 4037589 3873014 4244061 3910021 3991427 3978133 3948654 3840521 3857098 4093397
14061 4093397 3703992 4008986 4095160 3951032 3654982 3668039 3496292 3507835 3669248 3382623
14051 3382623 3351221 3344035 3189444 3260620 3432923 3159830 3025114 2922668 3204204 2776961
14041 2776961 2987779 3027383 3157528 2931057 2666080 2628405 3078446 3023084 3060728 2912857
14031 2912857 2874306 3064891 2716628 2498049 2583353 2616496 2612346 2412421 2766115 3005736
14021 3005736 2767000 2694795 2469411 2422640 2668316 2426870 2576708 2545358 2454937 2580553
14011 2580553 2297176 2304580 2759144 2483467 2363655 2461213 2421190 2008910 2162804 1641626
14001 1641626 1999147 2391391 2182247 2117732 2469386 2201455 2323932 2381204 2421885 2801385
13991 2801385 3255135 3625078 4691818 7421827 12547936 23424589 33904339 25004065
13983 25004065 14969208 9426275 6630450 5410936 4319812 3753389 3567780 3309209
13975 3309209 3151506 2566275 2646406 2561294 2516069 2419503 2434120 2307241 2380078 2047988
13965 2047988 2356000 1852025 1829545 2067666 1999622 1530275 1746164 1523805 1848297 2091747
13955 2091747 1841731 1866045 1722473 1870725 2181873 1808962 2000760 1925792 1365257 1858659
13945 1858659 1788780 1971711 1811921 1663063 1747879 1583734 1641230 1586246 1715598 1954182
13935 1954182 1785465 1655489 1700249 1455016 1592330 1475924 1491305 1355779 1225033 1569341
13925 1569341 1568688 1400131 1426696 1303965 1410161 1569738 1292321 1464211 1416258 1321348
13915 1321348 1333202 1169390 1669792 1401030 911752 1323837 1389040 1092527 1254870 1407118
13905 1407118 1434221 1318502 1276362 1388972 1386671 1285720 1008814 1156237 1409426 1012900
13895 1012900 1524217 950991 1378189 1120340 1479407 1178418 920621 1217694 1419215
13886 1419215 1331599 1303369 1222600 879506 1493339 1093923 1668914 1035169 926135 835459
13876 835459 1377231 907559 1182903 1031391 857907 1218583 861925 1196328 617371 982363
13866 982363 862573 1247417 838436 1088858 924475 687464 1116237 1227726 806088 1093788
13856 1093788 1354621 1004809 875485 898340 1006003 793159 766697 741919 1008758 1105600
13846 1105600 1015092 918385 927269 934786 693431 859826 982618 921652 1062049 802509 1200791
13835 1200791 1002597 910244 670822 837595 839562 908631 819986 836528 882848 774918 619059
13824 619059 919338 999324 850997 809098 1003515 465685 1240136 666132 907978 528264
13814 528264 810143 835421 933626 593388 692778 949632 590151 746322 610086 936253
13804 936253 706197 574369 600480 889860 746932 306926 945759 670415 538618 744725
13794 744725 622206 445400 783026 473343 981094 497601 726321 930073 510119 570684
13784 570684 861845 889994 660401 529606 702304 928398 768542 1062384 438752 596349
13774 596349 405374 880448 509482 1105774 623968 623295 452807 453490 733696 769622 745989
13763 745989 364159 542656 778924 574756 718075 622586 555097 540541 806313 377083
13752 631512 741199 414237 655172 419344 813466 462008 721458 431814 721615 961318
13742 961318 894993 629223 615244 453115 182912 899620 622109 489962 518943 695299
13732 695299 647187 617804 659783 324842 284691 652490 511807 460615 546449 627240 221274
13720 539076 276231 625062 318202 431891 541393 482796 504808 702673 483591 -2959
13709 603248 449035 476551 395511 300275 473162 373996 586371 378564 561691 542988
13699 542988 481635 473748 315300 494844 577429 603788 232287 133302 267751 540848 199244
13687 266287 306343 404885 160639 665835 442980 632134 433817 383802 588791 402900
13677 402900 482763 485196 546786 431289 264528 300807 539314 319483 513939 225278
13666 341921 521557 370649 127492 257099 771801 267614 -88671 379799 435949 320235
13656 320235 585863 655643 418316 386408 724729 152291 356694 370599 405776 532381
13646 532381 193698 462103 493626 258234 110280 313277 350128 418109 378003 522897
13636 522897 474558 452151 493719 517092 385272 313252 -52542 298118 191078 300998 561208
13625 561208 333295 319292 327893 742361 636610 374516 208669 147756 550856 131255
13614 264329 353936 527101 341976 346866 739097 429514 325290 85292 298429 310806
13604 310806 414748 633718 5888 245962 447865 368578 189967 -22689 474216 300751
13594 300751 171657 357328 361042 528624 247761 17899 190741 350697 441099 316479
13584 316479 -12665 439067 273414 191397 198989 622831 460423 568063 108017 147673
13574 147673 502423 414065 287722 727277 479978 259770 343244 373266 228397 317550
13564 317550 347590 789735 354972 324676 561884 247530 517791 210233 260952 326376
13554 326376 394298 155851 255309 313161 468460 231974 66255 228538 273156 307377 226214
13543 226214 213134 194622 252926 434621 255602 47273 301956 300469 198654 -88447 -120372
13532 -120372 25012 473822 194423 208231 389135 219387 314828 759936 231287 233119
13522 233119 315849 19655 174076 -22961 266829 124778 263246 280061 161901 408556
13512 408556 -65927 574434 282435 -188358 -31053 267615 42062 437098 -147506 277654
13501 25588 307925 -280522 286944 153969 41951 473528 398929 296587 82015 242573
13491 242573 300558 503565 282304 161790 169641 13318 208418 -193597 31520 561198
13481 561198 375633 155356 277918 292748 154055 278078 283037 -101952 508095 148391
13470 212134 58145 228313 472549 309046 396032 -136833 30823 123551 118651 327920 290310
13459 290310 297065 205513 276 443620 189461 361720 387979 77627 -167741 190485 507376
13448 507376 402720 249473 72054 -38667 167716 -66170 269933 24729 456997 -29126
13437 154634 -208037 516982 132416 344404 109368 138609 238226 266647 327312 162015
13426 69750 256679 181170 121362 -12262 349366 268139 154828 332723 320737 125027 -52730
13414 116818 187405 179433 -375444 -79467 207662 80659 220351 5362 68292 94614 -67020
13402 195096 462105 -28019 663425 434406 199976 -28533 -112515 590392 127703 -226582
13391 -88914 340563 187277 29027 -71313 156112 314741 429517 67104 298347 221100
13381 221100 257981 -302141 42817 149590 191171 -131229 96779 -68868 160868 83236 92956
13370 92956 -52499 317766 13220 423456 -194951 53377 296444 360541 342992 91576 295437
13359 295437 31023 379873 57265 114640 333418 150756 469722 75021 285651 186030
13349 186030 135754 80970 183968 -3976 492385 12880 266411 277038 189761 283971 148079
13338 148079 65863 49099 424691 171729 108004 256204 137659 86476 165480 412824
13328 412824 250188 293249 492077 56388 264203 88274 250600 -57283 306515 -17634
13317 261412 -67688 -245030 121298 -32336 46955 299607 239867 62031 176756 242744 321880
13306 321880 49755 -166825 -6811 -14758 -12324 59618 152452 35402 97341 -57153 -85284 145774
13293 193693 227472 199514 -206537 173090 243878 188416 -70502 212579 221061 -124191 -34910
13281 -129225 -2253 -3578 58447 37035 -213436 16938 171791 309144 -51864 -28995 110960
13269 126663 233390 -99531 114867 40446 403290 -153421 183712 109453 -69928 -9676 58587
13257 -73213 41620 -22520 49674 311533 -257973 8062 1274 -171967 277474 -59133 495313
13245 267562 -130190 139753 154247 386507 129369 79275 -153637 762 81034 75891 -40503
13233 39122 134266 343759 76580 299852 122060 88776 461759 154815 167143 -3848 -105636
13222 -105636 72216 259146 371477 475306 202813 -127621 443142 56704 149507 224131
13212 224131 -1148 106505 -101121 125870 225179 329766 312173 96515 -72700 23067 112526
13201 112526 74271 38190 72873 -246895 -207492 -259579 40677 -46461 28916 -151102 -3596
13189 105881 153869 -348569 255298 117837 153885 287212 372916 160361 354960 204253
13179 204253 -36950 -16395 77508 308584 135954 -95557 -133518 93202 314474 -61424 -123265
13168 -123265 232090 177739 322790 -269448 250886 -42134 82112 117670 30321 -111171
13157 185422 -237206 -123346 -27301 195763 245397 24062 -16390 429164 1648 -59209 -238514
13146 -238514 273178 331238 -146279 297597 -31496 -221227 75705 -86046 208899 187746
13136 187746 168493 327380 128114 59322 -227798 109354 -102779 -126954 -12139 -136798
13126 -136798 -62549 282157 47934 -65896 76270 -94584 -330304 -140876 279616 396546
13116 396546 53414 7130 465305 -119157 285618 178576 -100778 292932 430406 24859
13105 38597 317869 -216794 105267 133643 142277 60025 4705 32714 -144397 -101164 -129985
13094 -129985 130995 196142 125055 94062 227462 286997 -15066 -76034 -89833 54173 97987
13083 97987 -87274 11635 321610 181674 313108 -96151 -48720 -342450 -61222 -164104 527447
13071 55686 104878 355212 -157957 -60380 -63782 285112 99800 -242947 33956 119699 130243
13060 130243 -110532 80706 248330 -90330 -182592 307360 157653 -17510 87401 -15733 23844
13048 151618 218810 112670 -124183 212421 -233173 -58689 -94537 224841 187172 290590
13038 290590 134774 40572 95619 74233 54013 -30240 249857 -22286 234814 239783 124484
13027 124484 140764 27535 -79270 45833 120623 -97858 19057 64164 104559 91401 37120
13015 208027 -167716 -66756 -131365 213924 -386964 111643 178137 64083 -26092 -65478 -149700
13004 -149700 -44985 32120 56408 -126304 101978 -340982 -110031 12869 153969 48066
12993 -262911 -45311 314173 4023 81925 -66425 148740 -359398 -30696 -457720 261666 246674
12982 246674 -64655 -40126 69076 64877 -135627 -323701 -72549 -129998 59927 320881 -101091
12970 115345 113793 95866 169586 -71283 351018 -82852 -285288 -127096 -121866 -92670 -265111
12959 -265111 -61502 267267 -89836 188091 325340 -307028 -162463 204661 106731 1970
12948 -356266 98106 69075 65293 -121328 63115 178727 -9589 -233559 -244454 -62827 -114219
12937 -114219 -62403 -46903 -19842 243974 38415 -61075 117439 167182 -144328 -216878 -12049
12925 20972 35271 80870 -267694 -108796 170263 188427 160848 62352 -28208 47498 -56826
12913 53227 -327936 186713 296720 -80777 -118213 -89351 -176079 -64905 -240631 132981 243275
12902 243275 114050 97607 215562 -296861 -5904 -7358 301646 -55505 94102 -77539 66641
12890 -308954 44144 192940 -202226 156264 133892 157076 407697 93894 -150972 95558
12879 -423389 -216636 -73739 59677 213130 -74874 350350 16975 -347571 114482 186057
12869 186057 286265 -75156 240419 43414 412781 209274 -1647 -76501 349699 -18104 -70677
12858 -70677 30397 112462 -25461 -351621 -109302 -216816 -35812 22804 34939 258143 -16731
12846 -240657 -3122 -113328 -11856 138996 -316071 203366 120537 -9898 -129720 -144206 -203800
12835 -203800 -282899 55263 126517 164477 70108 34269 -97162 125697 -149489 -104549 -57476
12824 -57476 -41733 -248709 19496 -70593 81338 -37259 2135 -92539 -156025 -76498 66748 309155
12812 309155 65070 116154 45278 65840 -17470 -79875 -149326 67207 -52986 -319971 190748
12800 -57102 -15938 -303398 90216 -172331 -133406 -141300 79545 -288160 207065 209992 -109532
12788 -151453 -163321 -279127 -179623 140683 -127600 39872 -229483 -31492 135637 -47028
12777 -344075 -7307 160718 -10902 -375624 162367 166624 158343 257450 -28810 -215640 281409
12765 -169543 -248134 103320 81653 -267234 252253 -55117 37673 -176151 328260 127125
12754 -4456 134251 -76938 -115983 -62646 75170 3707 -5940 63762 -116367 -152305 169734 304384
12742 304384 -160841 -44668 320614 -32494 162126 116561 160728 -211156 -38795 -377709
12732 -377709 -45372 -20974 -143650 12014 -32885 -38173 315492 142109 109515 136223 -25485
12720 29573 -46295 -118442 -54874 -114349 223687 -92243 121669 -282825 567052 25505 175577
12709 175577 -175088 -38266 194532 124932 68983 -144840 112651 -50772 164806 91689
12699 91689 76453 -33898 -215694 75970 136733 621055 -45123 -85565 58189 -397970 203442
12687 -305699 111830 117153 278342 2840 -97919 270214 205188 105442 230063 242714 131959
12676 131959 86503 -131787 -160868 -197398 58365 279853 -47505 10220 -17337 -226750 124333
12664 321775 29305 64871 -210078 18723 182307 -54133 -145640 1573 -143800 -64502 71360
12652 84356 10292 40939 88292 14935 116539 -292703 27693 259781 76497 -70534 107651
12640 -20954 -411219 -39191 39967 147011 82895 529410 27303 -300702 130489 -97681 212862
12628 139005 -4749 -77146 235151 -216387 122017 -84619 -82694 58993 -1156 -39476 -242066
12617 -242066 37492 42947 -11153 120194 -30501 166473 94782 76636 -172769 -189590 112440
12605 -211381 97100 36550 14093 -66792 189547 85902 -214673 -135917 -13945 -6760 -112150
12594 -112150 -277797 103197 -8974 -16355 35812 -19541 232174 -124283 124857 -298788 -99067
12582 -320562 -38665 144872 -39811 -280241 -66706 314937 -97548 135425 -98066 -157882 46243
12570 -12206 -29017 -67242 -108071 -169201 155200 -330448 -44834 -175574 92354 -141836 58100
12558 219697 -97226 -277120 -225829 30986 -37503 -225931 78956 -33535 22614 103490 24595
12546 31969 -64430 15352 219427 -256152 73692 -203945 -186044 -39842 93426 127531 -175497
12534 69350 180946 -5614 -134618 19489 -103133 -47459 -19658 -30667 -74824 360324 -259073
12522 -68843 327667 352490 -287110 122300 -296875 -48461 71523 50157 166043 -93983 125631
12510 97888 -126577 118547 70429 106494 100047 -224836 -37220 -157863 89448 97666 83898
12499 83898 153340 -30104 168218 203317 -152438 4310 132516 -5526 123410 58326 285491
12488 285491 97948 -339150 36440 98188 -54012 -73704 -142228 -68549 -75730 -123647 72763
12476 -290509 -38896 -5072 -13692 41908 -164916 78081 -136285 225585 108409 14035 55714
12465 55714 131982 -202152 186671 -84121 -154578 -84340 -37564 -196137 154480 213899 36011
12453 -12722 91986 -121616 8701 -45722 -672 5019 -436950 41991 2912 60278 102283 -183004
12440 200890 359434 -68396 -122713 -151740 76648 151221 -240873 50124 -103968 -51603 -21493
12428 -101008 140915 -120334 189907 219362 -139582 -281102 -219246 216680 -150064 91881
12417 365001 -197339 307396 -80697 -165250 123746 -321507 -126504 -302140 116516 56721
12406 -62499 1116 -274868 -24932 194175 -40796 -59967 52446 101857 -11174 -331681 249089
12394 -308604 -259556 27761 -74310 -8003 30665 -32899 -215525 72543 192041 -74767 32055
12382 -227005 -1380 69384 292200 40115 -4053 -14531 -28562 -70120 79583 116250 247911
12371 247911 23053 -38167 295396 315015 70116 -95094 100963 -57315 -58582 -154674 -39830
12359 -105488 416821 314214 99722 282200 39052 108174 -205132 -66154 -114354 -141736 -124332
12348 -124332 -236889 -87734 -49937 305681 -117576 185911 130788 -51328 36464 99120 -13715
12336 -139145 255676 -146790 106271 127629 -123095 -31878 -149130 29951 -201809 -75245
12325 -225028 188644 -152939 293307 57391 64501 -175446 92266 -82203 159664 -35906 147221
12313 241384 -186399 208285 523837 143186 -218886 -170564 -23650 -86472 48135 31441
12303 31441 9463 -87516 213331 336727 169586 -200503 -307611 402700 -94830 -95103 185382
12291 262917 -80707 -10598 211645 319208 38782 51712 181689 -17647 50171 80420 -210220
12279 -73189 70524 -98907 -11790 -13640 -207226 -240344 -127984 244066 -127811 -67558 -81020
12268 -81020 16213 78227 15055 54902 -128654 345093 206769 256118 -80482 62138 68895
12257 68895 -248155 -31854 -337672 -210009 202040 151721 335441 220756 239083 -50747
12246 -46159 -256706 50807 32975 -16497 119070 185003 -97116 162889 188788 235903 -60512
12234 -29041 -182901 -2808 163662 104372 183255 118551 -363258 210814 56326 121869 119072
12223 119072 -117619 59301 -306650 128460 21709 20376 308248 143144 254146 -90411
12212 40485 11975 -81665 -70498 96451 201160 115565 70426 127529 228463 -26638 137304
12200 -15511 52329 240941 62484 32653 91297 199289 141800 153006 3953 96367 -169249
12188 138639 -7703 144350 151264 259186 -122366 335128 135238 80970 931 131722 57677
12176 -18268 273907 351311 -149615 119871 15561 246530 138534 30803 139688 26716
12165 97146 -179422 154052 95990 198051 340275 -296440 125012 338253 26792 209893
12155 209893 -18565 202667 -115426 -76684 -13182 107128 -246638 224540 -243440 -222391
12145 -222391 253707 -90515 -145020 -289146 -95320 5951 98704 -80369 52702 34553 123221
12134 123221 187510 -33567 -66106 -93448 310574 137071 -163117 -117726 -20390 -51327 -33900
12123 -33900 -225139 424900 -114251 88462 -158202 370578 -143812 -165921 336789 496978
12113 496978 182840 -255657 -65080 326 244398 -92387 -162713 -38352 90648 -163313 57794
12101 73564 97237 -48813 -163898 168358 164473 -52705 -269589 -14021 124043 -54733 175857
12089 172088 -141043 667 -20688 73072 228752 255009 -338962 -76512 -103337 -168808 -130380
12078 -130380 -66101 -4455 -336813 -21393 50092 -115472 -35345 6022 -33638 135915 40235
12066 -168246 230377 279748 258947 -285276 116539 108411 -9776 -313828 -26884 -98520 208717
12054 -195324 16500 -99037 -120323 -326860 69110 -143041 89221 -324935 76957 205911 66546
12042 105108 -162786 -42801 282010 189712 61839 -176612 -213224 193979 154616 359749
12032 359749 -206071 -177104 -5639 -39644 254308 36573 209906 -99754 9106 143603 180409
12021 180409 231235 29481 17330 76359 -4094 96026 -172306 47948 -62093 5516 -269306
12009 301554 4853 -66499 -77805 447956 221416 36392 218314 285712 -222198 159760 206620
11998 206620 -149945 -276012 46013 333586 92426 -273366 54554 -12572 71646 -125531
11987 58428 -26950 -450511 107610 -36448 -149628 128599 66408 150220 -424804 284870
11976 -233236 52521 -120057 -38938 101248 -950 -158849 -161903 343402 62731 -204555 -74302
11964 -156895 -126640 222672 -371508 -61732 -134134 6770 4372 -306211 5803 -143557 126836
11952 -87102 -168952 76889 -329822 -158349 101984 82451 127299 32719 50122 67070 93814
11941 93814 82916 -108639 -43895 -312285 -71442 -114368 40479 -107143 178485 -291620 249747
11929 42287 -146118 173297 43916 175269 -159270 164677 167713 52939 -217739 -207087 -454005
11918 -454005 -330832 -152283 84682 -20220 -121869 168094 136581 -189912 -218060 -180937
11908 -180937 -236196 -215567 90816 -17106 236534 61597 -18845 -189524 82406 110986 30581
11896 -110370 -172963 -73929 -159341 -21879 -23834 -136389 166361 204442 -206824 -59005 109873
11884 62244 -163566 37256 -93736 -227100 136547 -183404 10483 -136521 -224913 -27538 -72134
11873 -72134 -240083 150367 28700 69280 -228436 32115 85555 30563 42005 -96416 -171854
11862 -171854 -155356 -302333 140851 -151788 98659 -186427 -32997 -154346 214828 181601
11852 181601 48127 -251540 122698 192267 95868 93725 180509 229931 214972 205014 346653
11841 346653 -97376 -386481 -136760 174518 -141229 -176953 58407 -162323 -211325 -472822
11831 -472822 268292 104853 -252387 -160507 -109633 -89835 22900 33089 -114830 -117532 -232552
11820 -232552 48122 -168429 366908 172976 78357 115507 -79338 421460 121399 59022
11809 21360 89014 -322866 8042 -43156 -69271 -262522 265353 -196339 211521 -375590 37949
11797 265587 -380661 -28682 26192 5257 -253097 -213887 91935 94865 -221231 77998 63107
11786 63107 41198 99718 116462 -175402 -194506 177933 -146740 -379174 14778 -116776 -54646
11774 176306 -280441 -395165 -255125 181257 -188968 -227703 33989 297 -149594 -56240 -145598
11763 -145598 132081 56411 65633 -36079 -259705 -331767 55630 103443 74811 7005 144962
11752 144962 391615 214236 10093 39445 -86746 -261714 13283 -37720 -184976 169610
11741 184849 243011 233098 -79315 -76304 233541 33980 16955 143752 15568 141979 270688
11730 270688 -154644 241671 229712 52530 -127953 118888 -180603 404979 -76589 76018
11719 135766 181281 6232 80563 116183 467356 -80012 -80254 141203 129839 245791 -116927
11707 50066 -96875 -16552 206005 -37377 -45171 310033 107965 -47335 31351 116879 92867
11696 92867 170805 86727 -112613 96056 214006 -205640 82795 -280015 -102901 7397 -30577
11684 -53573 -2573 37856 395402 -84034 200410 104216 157352 75706 147214 -74237 -136714
11673 -136714 77090 254464 276546 -72851 -10630 -228339 17325 -170053 -474533 -154820
11662 -24073 213491 -122065 -60593 166870 -211014 46924 -330643 245848 34388 48309
11652 48309 -119751 110750 -144467 -312299 13169 21098 -11967 241739 -179962 39139 -21605
11640 -201426 -201744 15945 -259336 127289 -105777 30022 -235887 149808 293927 271113 121059
11628 360625 367542 190247 -329745 275 276895 54055 -2019 84998 263701 61922 -55612
11616 179678 -125828 -101104 -69348 -296659 -116997 59740 -182997 76506 37520 187075
11606 187075 34350 156996 -26138 35360 144466 41432 -257438 117011 -35726 -125382 127608
11594 -45745 -209105 -240290 -60450 -296384 -88664 26701 199637 -66881 -12786 135843 185264
11583 185264 190690 395889 40067 230010 -295944 282193 140416 -35231 58228 114794 185492
11572 185492 -2658 85252 -2380 -128841 151997 -90844 24968 386558 -162734 278113 -281509
11560 -104225 48506 73508 41486 -382951 34317 65005 -63580 345246 221745 238421 115716
11548 -28391 -23853 -256301 -337444 -197914 96199 -272252 43033 -235293 -87124 -51648 54966
11536 3583 -245849 -93679 206325 -149106 335651 28597 -275765 35886 175080 -141684
11525 127442 -780 -18029 53567 -9320 120659 62464 -212588 158838 171902 40135 96297
11514 96297 400277 -63394 111157 150139 38416 -115013 383190 333692 -10117 -158518 -192371
11503 -192371 -7446 -26139 -19218 79133 260185 95088 122456 108504 66747 37496 106284 80669
11491 80669 275892 -183964 132436 -72196 -9399 82036 129339 -128413 -175693 322067 126025
11479 -74100 -192308 115655 -13152 105765 224593 305376 108534 74821 -46717 125223
11468 289279 -2841 188231 163257 -112795 3409 210264 315284 -202791 30730 -27959 151421
11456 -52213 -258887 72220 185540 168811 25180 178245 78892 -74481 22754 65674 -34591
11444 -156081 8328 45252 99340 -62551 -10511 351858 -138028 39214 4801 58791 252306
11433 252306 136426 -8463 136035 160649 -171836 386629 245864 135881 319873 -98703
11422 150270 187055 58270 -84263 -174321 30558 -134879 74451 -109377 -109100 -477950 -366672
11411 -366672 28127 105977 -152441 -158418 192113 244887 -145758 139770 95349 -127115 -90554
11400 -90554 -104857 -60220 10411 -39078 144824 -34874 66554 -13884 246325 -136975 -310216
11389 -310216 134778 -163545 71095 -2829 -32969 50964 -292104 -133350 81341 79849 222747
11378 222747 -60181 165081 273849 -200275 373412 -127016 267687 -129888 -414883 -62207
11367 18358 -155862 412810 146925 -30206 258567 221199 -110747 74104 -504888 -195139
11356 -286912 5950 -127560 -47971 -88639 67998 -186762 226949 -418830 84373 111039 -124663
11344 -71772 -34569 268929 61727 114668 -50771 78654 -239322 -94607 208949 65459 94278
11333 94278 63227 -189128 63153 20907 -111572 -12607 -288589 -192147 -43997 -151088 -191370
11322 -191370 184610 -72257 -8589 -263913 -99564 -41442 -286056 68299 153028 -127852 72012
11310 -267372 -205415 -318555 -281997 -14489 -412454 13617 -158170 87135 -228472 -54975 -12130
11298 -56047 -120905 72715 -27471 10662 -310540 198369 -320336 -174912 -214060 -31723 -178082
11287 -178082 87561 104858 -139427 -55461 -201054 -100220 50738 27414 -148237 227778
11276 214495 24149 -122399 441728 86443 -420186 -78901 -46274 116200 95667 118108 -81572
11264 -2840 11171 -161155 -120158 -333226 8815 159536 -291369 -39323 176738 -279952 50057
11252 102413 -23092 -401846 -132767 -119302 -165806 -394144 -86515 102105 146369 -9612 113903
11240 -6729 73098 -240058 15314 133120 28630 -304400 242258 -239695 -271802 -47856 197887
11228 -588757 -17755 -509783 -101210 -43847 -148859 -95531 -118607 -109576 -38860 -185579 -95751
11217 -95751 -61870 -228983 292817 34586 7498 -220185 103276 -279547 -144131 -481003
11207 -481003 -344096 255122 -335001 115838 -44817 -127392 -142854 -140722 240351 -24279 -187035
11196 -187035 19372 104289 -66491 86976 144232 -88731 -181091 -61610 -156326 149471 -126877
11184 35127 221266 31457 -34125 161190 125747 -57237 -331131 90251 -220818 90656 215998
11173 215998 -293463 248481 82762 -332107 -45933 -125993 -20804 -37338 -63829 -7651 -105440
11162 -105440 -21151 -47539 -188717 -7550 -198502 -151468 149573 62158 131172 144280 -306693
11150 -278742 189385 72744 -155306 -82743 -63816 -93999 30957 229916 66190 -88290 222725
11138 -28529 -459892 -19170 234214 174963 -187986 79288 -118829 36116 -236226 -32362 98447
11126 -133705 -269762 -250699 62910 -398256 -183582 -12584 -235890 254613 -305636 15153
11115 -154391 160360 230127 143063 139323 82700 168072 -10393 -330364 -138208 -128955 -169092
11104 -169092 157237 -193808 -54218 365206 160684 180222 141192 -33358 277747 168979
11094 168979 131354 239301 183135 401028 -90283 -105631 286414 204499 57713 346463 269578
11083 269578 211015 183661 197132 156954 403710 183513 376617 11520 162998 -5057 86752
11071 117942 67554 168408 288315 155494 70056 53283 34707 288380 175520 120953
11061 120953 269889 322457 62005 288257 65426 342604 439580 393090 250592 254080 266767
11050 266767 -29380 372315 593293 730577 534586 540734 375853 236011 449625 296935
11040 296935 521176 411822 346180 164078 260280 323027 443194 220953 451143 156125
11029 448001 190130 592312 382968 469309 716568 420263 506275 53308 528167 472980
11019 472980 416370 202843 586409 -5987 433044 364913 778517 397736 477479 295262
11009 295262 399465 352757 322182 369353 160893 384640 165036 551905 441909 137072
10998 497732 242074 168880 458163 118466 422162 80797 373123 344569 714600 339440
10987 508774 409510 376070 45524 767013 682290 203005 732455 456802 817691 682631
10977 682631 1003086 621522 1058207 1016580 878694 808382 1276190 1120051 1694841 1373707
10967 1373707 1479202 1561157 1528070 1035649 1191889 994669 1125340 1308776 1311626 1163470
10957 1163470 1166386 1228314 1144359 1156598 1281186 1046569 1228555 1355530 1156416 585248
10947 585248 871974 759359 581094 397698 372585 483796 113475 154098 -88649 185072
10936 47793 61281 46562 -109344 110467 339472 165811 -21930 -203767 318457 -245931
10925 243981 282136 -178306 21302 -250627 -114522 -27035 101578 -151902 70472 66767 423727
10914 423727 46432 -69876 -56064 139525 7348 -354567 -224518 -270814 297635 196297 -149905
10902 270456 -464308 158521 168097 -44963 115 55294 253016 -45675 -332745 283189 275253
10891 275253 -143886 136386 -45625 -84013 -252710 -6322 13111 87446 124818 37393 -409636
10879 -301112 122338 -183983 169900 -79927 197002 -286397 -60973 115100 74282 10982
10868 -90702 -511648 -37061 -163006 -142173 60774 22541 -243858 -135406 -39350 361118 14656
10856 -114593 -7326 87750 -212419 101489 -224368 99293 -289370 -403617 -114620 -257617
10846 -257617 -91563 5296 78612 -216612 105874 -211527 35664 -222804 78286 63011 183889
10835 183889 43899 31283 173003 -340216 -16976 -192556 -122436 -130218 -247077 41733 -90969
10823 -375315 -53836 -74279 190815 -389006 -14476 29676 24945 -24787 -189485 -325146 -133610
10811 -267569 -152006 177629 -239986 -123423 -41279 -337847 -120369 246713 -23232 -226110
10801 -226110 691945 -197139 27349 -225515 150125 66687 -215922 201530 -451181 105505
10790 -89189 122539 -33283 -137999 -61605 59461 -124212 19461 -207403 2945 -1360 41543
10778 -54466 -360181 264633 66219 -157553 -135556 -165059 -307763 27436 86071 -109389 116408
10766 52525 233622 153694 164279 -75549 -110209 198014 -137660 -132823 -425250 109865 50953
10754 55421 -5609 57411 32688 -216958 12217 -17952 -42023 -91968 -239569 193976 -90526
10742 120301 -107084 -275962 -36820 -12798 228309 67657 68645 -222759 -111332 78698 -374346
10730 4222 -63451 -125805 22312 148793 88545 81039 -165372 82627 -130519 -246802 205568
10718 -117190 174447 79123 -243983 252556 -62298 -212829 -488084 -5606 -25746 72824 -271932
10706 229834 -28877 -151570 -81287 77907 166908 29055 102218 115582 64819 108550 -84296
10694 -432747 -231308 141696 124707 -48637 338277 6493 -45085 -247436 -126860 -10522 100518
10682 67387 -368241 152496 -43619 54802 87519 42523 296336 60302 -5606 -136216 71520
10670 -238196 -26940 52514 332808 -85508 29237 79731 -450752 -112446 154384 -206397
10659 38537 -56415 -362345 21376 -78505 51097 67455 -216572 -187559 -60995 -139538 66055
10647 217259 115321 494822 -289932 -143807 -196971 -241556 6557 162899 95697 -257750
10636 -424482 -2218 -26397 -286845 -60085 41185 -2959 118359 -104449 -74933 64384 -264418
10624 78794 297653 -32435 -232778 72802 -162764 -158445 -69328 345725 -85676 -8619 -252927
10613 -252927 -406966 -333900 -190517 168905 -193205 81461 -338547 -55701 18323 -158840
10602 -273460 -87050 -137468 -509153 -162005 -111842 -319411 -113023 40957 -65368 -124213 34088
10590 -158741 -378572 109005 -119808 194854 -178491 -127979 -304400 49219 -34955 -90358
10580 -90358 31888 150884 -186983 -157336 146358 210189 -92572 -57283 -126515 -69359 -85693
10569 -85693 -144775 -155537 55159 -204937 110627 36141 -5508 56294 139147 -115793 -52258
10557 -217156 255355 -43721 106991 -148495 -16243 -197174 -149592 234173 86881 -297376
10546 -36402 154112 36789 102872 -257176 333061 116935 213094 -266391 -261965 280418 -224457
10534 46947 188338 84802 164151 228147 -107726 -411938 -22524 -253878 -126001 88333 97602
10523 97602 -26388 -35293 -85441 -191974 146892 -81695 44121 -199927 126983 -81909 19733
10511 231376 104829 -86660 -81557 99306 151613 50869 -131411 -217141 -279442 150146 67256
10499 -500796 43162 294441 -33321 -2119 2715 -205159 16255 120473 28104 -45185 5276
10487 -13037 -178338 -65449 381728 111857 -100410 7820 349754 344998 248147 362640 204526
10476 204526 243798 -365954 -240721 117796 149788 179427 -200199 -129972 -295779 56296
10465 32691 210746 -100070 489811 -33679 -175364 -32095 74625 2442 257527 111124 -132580
10453 348990 -196818 61473 63175 -3531 -214569 -204849 57749 -127335 -425694 -132770 153106
10441 408667 92016 -274416 130122 75986 -119507 -230053 -91486 -102733 -14363 -88002 -173759
10430 -173759 232524 118801 -136199 -37811 -87602 -76505 -41644 -10481 238285 -187677
10419 -165997 -64361 156496 53266 -291028 -192751 -206264 -36865 -73111 -202524 15729 -136068
10407 58546 -134680 185007 -8147 197589 146506 143546 323738 -82767 163154 179069 -141819
10395 -125935 -120653 -200195 -136352 -86007 38149 -357478 -213933 -281353 -221439 -93959 169675
10383 -59139 207426 -624121 166414 269361 11064 -314239 31859 14319 -107359 315687
10372 353771 -58823 -28823 198953 380959 114200 147836 128160 404711 -107015 118860
10361 94171 260692 374291 197721 365743 96026 65268 -57583 204521 225318 -53308 108695
10349 27806 -232227 166516 727605 434022 -40549 331694 245542 304394 332724 383195 400585
10338 400585 167852 28518 -13529 207400 158398 169384 -52574 403330 267615 -262831
10327 -92085 -181042 -27347 109654 -161182 -49241 -81801 256792 -204358 17922 -22183 -325217
10316 -325217 150786 3197 71027 380364 160358 234998 15409 155349 -112973 1999 158044
10305 158044 -27449 222507 -229817 -131503 139084 183341 -69699 -69367 77034 -74117 285982
10293 281205 -230529 123645 59423 44333 -53028 -451899 73052 -55902 -483645 328054
10282 -182443 117162 -244814 44476 51297 -102367 -212238 -57327 -158836 189314 -55645
10271 -199057 48729 -16040 71945 -88566 170466 154278 52074 -119447 -12250 -70998 326661
10259 -82472 -157036 67577 296832 126883 -118638 414569 -164652 174357 -47378 -114709
10249 -114709 38688 -180668 -120997 -44499 113435 59345 215421 -157290 57254 -109546
10238 -20731 -21855 83836 -251 5307 108718 220678 -40220 -111118 -56577 -21577 37682 140795
10226 140795 -11153 -261512 193955 220266 -219322 304585 -105888 247616 62660 -229263
10215 -145256 -96586 402231 -53905 96816 290174 36675 33739 22356 -189227 -240913 -188721
10204 -188721 -30562 18766 72337 -129066 -236265 -6788 -75662 196377 -147552 -76868 -184198
10193 -184198 124949 130147 -45275 -170181 -124034 -51719 -63219 139893 -83921 -6456 -26016
10182 -26016 -258890 -98875 279910 52325 -176410 -210689 -174850 -181469 -47706 -35891 -153975
10171 -153975 -80588 52267 -235355 209842 -89855 -217092 -266811 -70992 215631 -156003
10160 -113312 -46239 -155069 -46319 -296960 -182844 -323420 -230577 -56670 148385 -181350
10149 -240855 32680 220946 -26356 -20456 -221456 100789 127819 -480067 53734 214329 -64987
10137 69925 -210297 -203531 -102048 -176440 123718 -297902 -284684 190583 109268 -76219 -143772
10126 -143772 -273076 468 -67897 -194463 -101308 -128600 204096 -246157 -114079 -4949 -72858
10115 -72858 18431 -272583 50911 -165773 17098 -237278 -354340 -357348 10359 28888 -25138
10103 -125658 134794 -84812 24568 -100682 -121599 43258 -324996 -119132 1597 184623 -102436
10091 -67192 182454 -122688 -95391 -131398 66203 18461 228016 -249185 -71109 -161365 227496
10079 -214348 -46915 -45905 -258889 25894 -336569 -9827 -41219 -288215 -44514 -128787 -126720
10068 -126720 -395671 -349083 -167117 -83585 -57764 -80617 -52807 2533 -156304 -110695 60074
10056 10982 46590 -13844 -196780 149795 43909 150776 -83561 -168888 39538 51529 41406
10045 41406 -240922 75510 78896 -107236 -127656 79688 7530 -278053 -32810 86932 -251424
10033 -453855 -117552 -270882 -329762 -351362 79645 297845 -368065 100789 -182379 -156469
10023 -156469 -102630 -58088 -284653 -383219 -136109 -215633 -303173 -343062 38337 -5866 -205740
10012 -205740 -152974 1822 -53781 148850 166884 59678 -4182 185862 18558 -228227 -339604
10001 -339604 -157533 34690 -44113 -253634 7558 -48334 -116025 -13351 -221696 -34800 -82749
9990 -82749 65527 309295 63450 -109494 -151266 -192217 -84939 -370740 94967 9793 -118213
9978 -46663 -71925 -31347 144199 20231 -435071 10507 136424 -444061 -136532 67110 207240
9967 207240 -25497 -52174 -46948 -92597 95201 -40595 -111621 160156 246667 -383754 -157302
9955 111017 -156278 -66734 6158 -36887 -302396 151730 -104197 53775 36890 -23198 68671
9943 -54067 10412 -301866 -223957 140846 -34199 -313460 126754 87857 -234633 -364427 -301953
9932 -301953 -60006 -268350 -75660 2140 -25683 -35348 170486 -176429 40374 -141925 -241918
9921 -241918 80015 -253110 248496 30507 273104 -81158 -14473 -83402 13967 -117326 94394
9909 -109187 180649 -92324 -165542 -327670 -221629 295058 150134 51760 -155755 -103965
9899 -103965 -363522 236276 -198695 10757 -125236 25206 168100 6816 -224249 -42952 53022
9887 -104555 -141499 -129000 164586 69414 -123909 -119496 -59942 -124219 104770 130448 133492
9876 133492 118928 -249933 -248977 -6202 -336608 296370 -123236 69497 -306051 180627 -255861
9864 166960 -167104 -99556 -281771 190815 -242251 -288830 233609 -547310 262935 93929
9853 -31448 -58865 -94007 115974 -298901 127117 -184028 -19735 -36385 -12996 273712 -102298
9841 105808 33466 177082 19355 -21211 22509 -44199 -69334 -51613 -42564 -101068 -107986 -107963
9829 -107963 228487 -246702 -58789 -30176 -203741 -290223 -187588 -202356 -258449 152227 147010
9818 147010 166717 7276 -60189 210336 -334546 5311 -139549 142292 -46939 -143495 -110958
9807 -110958 75948 -83096 44104 -130210 -112709 62703 -76151 1962 -27857 -360619 -158717
9795 -188926 20021 57825 -29761 -146104 258942 -72955 -176494 -205954 -49383 -49419 171115
9783 70531 130007 18821 14358 76065 -296307 -206978 65575 -197039 115670 -124146 -108232
9772 -108232 64038 -131428 -138642 -177079 -29109 250487 -46254 -306081 163300 -82223 155655
9760 -102065 -319610 17254 -137023 41935 -337749 -9422 -3435 -57653 89948 -195223 -119013
9749 -119013 -204744 -221842 -81765 -305430 -8097 -112996 213330 -152226 0 -352784 97706 15455
9736 -238857 -27005 -71395 -176859 41077 297460 19599 31269 -5378 5968 171280 62619
9724 -189084 10339 246312 80041 -261864 160147 33172 161466 -11033 -207783 -286846 138993
9712 -50912 -150365 138164 -360651 -112987 52872 25407 23851 8963 -193314 -55747 -83781
9701 -83781 74904 41642 57988 -313244 -33878 -132328 226932 -298538 43610 -248908 66631
9689 -296214 -482431 -24345 -40891 -79365 -9430 -112132 212891 149068 19038 -91528 36530
9677 88509 -178927 -166431 -425586 -21947 -104202 -270274 -133835 -133809 79488 -114692 -57318
9665 119915 78782 -230379 -183616 -120622 -120131 -122176 55216 -8577 -214067 188948 -196218 137556
9652 39415 5492 239256 -124249 267456 -68077 -203076 -318667 174946 43421 7495 -298158
9640 -336771 -239900 271505 -362313 238290 44808 -161757 135103 -172135 157162 -84459
9629 -114187 -155843 182736 -131807 -192047 -527659 22950 87341 -174398 115249 -307406
9618 -133095 88841 -170630 216939 -46187 -95719 -466116 107148 -64161 -109836 -242822 -19654
9606 -45115 -214746 -33917 -41218 -149347 -134165 -128382 -39065 112313 -62780 111027 -540996
9594 -83323 131007 -102872 -129277 -134020 -26501 183926 132600 -217264 -96064 -145980 -24320
9582 20919 108559 -156241 104741 -64418 -134645 82855 95472 122347 179008 -118953 -33850
9570 -428800 -9541 -221702 33814 -73164 -26966 261028 193822 99997 -22320 -155165 -200524
9559 -200524 -350631 -75291 -162280 -241137 -136145 163375 161368 120898 138698 -270772 196714
9547 312153 57180 -107499 -269934 -14216 35499 273404 -34304 -283615 -123618 81963 33080
9535 -137647 51663 20061 -51301 121574 -168997 21509 -125789 101541 -232676 -392294
9525 -392294 -189010 -41045 -101361 -191863 190859 -245573 -89840 5566 -177749 -260554 53401
9513 -175117 -310943 -147621 122143 -37067 -181821 423261 36218 276007 205084 -151544
9502 -113846 -189990 16011 11554 64108 117176 -90418 -172656 202561 -23420 48552 -148895
9490 -181174 -27336 95535 -150520 -186726 -352338 -516868 189629 -130353 -159576 -246126 -9635
9478 -176733 147873 26571 41285 -106392 190945 16045 94971 -25766 -67513 -221770 -51580
9466 36491 116655 122843 -221387 116490 124602 -79139 280436 -269028 -46004 -282275 -124803
9454 -165530 150314 207559 -49532 -268961 48196 -56861 -19762 -266870 54231 -44981 4107
9442 -130260 93423 -94982 -379021 -93504 151969 49525 -207803 -338936 86564 -135357 65220
9430 -64925 -161394 78017 -195758 274275 -37019 78988 -145166 -228543 20020 -308208 262663
9418 141587 -40298 60100 -49113 43001 -208610 -24329 118618 -272232 53918 42959 413615
9407 413615 -189772 -183823 -69532 -231274 -105485 57068 -118168 -145649 102078 -343633 223423
9395 -342524 -377482 408136 -171996 -4379 -373969 275350 -79815 -94986 -30202 174964 -189091
9383 145156 -281979 -49250 150586 6660 -283207 66297 -212419 -79885 204409 66952 143173
9372 143173 129911 174226 49288 106740 -127387 -12815 217191 -244717 141342 -98342 432335
9360 -33569 143926 275370 -216035 96227 36697 -276456 686 131658 -138528 109136 48019
9348 186486 -377753 20033 -74247 -232696 -80336 -505447 160540 -44877 77491 -128678 168403
9336 -392457 132291 132836 52088 -250200 67276 -58894 -70601 -175857 438639 -176986 -239834
9325 -239834 180994 -189395 -275294 -352765 192251 -37187 -114676 -57745 -85075 -129683 -156149
9314 -156149 138292 74137 -43252 -63484 206792 -330506 -98753 -110957 -155434 244539 274763
9303 274763 -10149 265109 93416 -459 76604 -177806 117215 251798 59151 -222205 109961
9291 15685 -179276 44300 -297991 -201448 -147902 -643 381169 20436 337808 146053 -18941
9279 -17142 -187579 111860 -54430 333007 83299 -271135 123320 134677 22323 -21088 -262611
9268 -262611 -29869 -169588 -468495 -155042 -130459 29700 -25497 -186276 -225402 -8574 205
9256 -370438 -317821 204453 18947 -317331 -14940 -137045 -162347 -110967 56019 -75169 -350121
9245 -350121 257181 -267179 -63933 -111268 -151473 -426809 -367611 -239180 -239366 -152489 -137299
9234 -137299 -254925 223790 71659 -21418 -175864 -31878 -164874 28845 -16239 52837 -148309
9222 -142351 90508 21395 78348 -97408 -282285 77630 -101656 248725 35285 -188161 173011
9210 -93386 -120456 -165489 -2181 -2581 -273583 56770 -201832 228335 60314 -100679 22389 35791
9198 35791 147057 -181751 29000 11601 170093 -106602 -138882 -25575 -148080 -94175 260434
9186 -99138 -340512 21036 -276771 -299370 173081 -66595 71560 1711 146957 39471 -37519
9174 154146 -39903 -159259 278800 36112 -38803 325119 14332 -298285 -213762 147791 -104131
9162 -81248 -22561 -116459 -310193 -113950 16076 4872 73759 -176191 73283 -81725 407890
9150 -143105 -112196 -70519 195970 20842 139875 -109234 -71381 -67041 -186802 -18913 -142935
9139 -142935 -43083 -29212 -233428 -208692 76347 133296 -125466 118840 296821 8195 -298788
9127 -35712 -119379 227131 285626 15169 -346274 -69727 -152562 122651 -236161 -1539 -365159
9116 -365159 91388 -172737 -121927 120496 -159263 225357 -64053 -161029 166926 38690 -15566
9104 246938 -30874 -31610 -350313 -235125 206317 -116677 -113304 -97744 55763 77203 22377
9092 -128386 -20985 -383323 144141 -297021 -140298 178547 16886 427164 85739 122012
9082 122012 121087 99751 245868 -214123 -12733 233518 45753 -170131 -46397 -226628 2761
9070 16984 -117207 -58553 -68403 -54720 -374723 -107917 -178621 -26808 133716 90884 -159801
9058 -114625 -286658 184899 62518 160011 -255877 125016 79056 130205 -230717 -299578 -147182
9046 -177479 -182332 28385 151510 -293547 57498 224296 52976 104351 -22361 126864 -26537
9034 -181792 -390224 -61059 -372758 -93793 -475712 -12887 -207101 46038 254903 389109
9024 389109 -104966 -94873 2489 -155651 -301330 -145036 -94434 -22577 -219184 27169 -124167
9012 232900 -103998 -182736 -82805 -129800 -229586 -255492 289241 46076 -116577 -174414 39123
9000 -122402 26985 152973 -39230 -570547 -64188 -164204 54490 -179194 212520 -203014
8989 405038 -90796 155882 -219869 -201345 -312624 -150136 109698 147640 -128191 17143
8978 241679 54400 -401599 -443386 222031 -185819 31805 119884 -200921 52163 277608 -140071
8966 -17357 -2745 -108006 71354 100358 304589 124539 -59122 7200 24993 93590 -153232
8954 208324 -141226 111072 -103752 -136659 399281 -267330 -16827 -54226 -88020 304137
8943 46509 273035 -54850 -249789 -96201 120431 -80359 -334252 26258 212067 321403 45493
8931 177146 -17711 -221325 -281994 189707 -11903 -298090 -74497 -268021 -84673 18124 -134697
8919 261988 1075895 619220 146667 14821 65640 102737 97303 -152606 106659 -333692 80911
8907 322835 -75691 68376 -109213 -198255 -176112 176444 -65241 -384667 -144625 -405720 -64772
8895 19191 -70628 -442463 -127783 -54302 -67880 -254261 -75047 -110096 167139 -151119 -132585
8884 -132585 99114 66550 -180267 -136338 -150420 -452005 31257 181523 24000 138724 -262087
8872 31056 -274964 -167753 222145 -151687 -153045 104012 5199 -263882 200016 23179 44560
8861 44560 34769 -232768 -54604 -102875 122691 -74157 -375009 -180860 -197888 -35975 -193180
8850 -193180 -145411 -169463 -286246 -106705 -54280 -239108 360063 32177 74374 -100946 -363171
8839 -363171 -390350 -505366 -100392 79407 -137432 -121799 286391 -256795 220877 -86075
8828 97630 -68970 181025 -201714 93408 -34170 111766 -83455 -87018 29251 78567 -225708
8816 -161418 -51462 -130068 528055 95577 -86320 -108712 -254353 27487 50280 140816 -90968
8804 -272959 -408186 -95810 92295 -156592 8684 142512 5859 174105 -74586 -40251 -32106
8793 -32106 -142365 126666 -281104 -445419 55195 -259946 20381 -136334 56 -272139 147157
8781 98816 -45856 -101133 -237235 -94037 -201765 -101015 -179969 -71320 -11905 -78927 -137866
8770 -137866 -165097 147111 -60509 73885 -126363 -220651 112697 -84715 232727 128931 -209834
8758 -325231 75002 71986 -309597 -56536 -198054 -336801 -332 -263290 -149354 -104438 210891
8746 11884 49039 -95183 129616 -219877 -109137 -19441 -126395 238433 -164877 -218643 124359
8734 -74478 -367932 82423 -12939 -46012 182049 70532 72076 -127302 118254 -320754 162752
8722 -77979 -86811 45673 80044 -12885 21580 115627 391365 -120381 -78745 -178657 240479
8710 -82573 -69308 163894 -154997 -487804 -57382 -111063 241426 110361 111093 -343839 -30560
8698 -87616 30934 8289 -14507 84114 218193 16471 99126 116651 -207342 -367082 -523133
8687 -523133 81449 138368 211338 94385 68531 119711 135177 -173925 -263254 -26742 245838
8675 -30322 -133227 97624 -381999 269181 -156020 76258 44348 -138628 191690 -255086
8664 198036 -181676 264339 59822 -50861 108707 -149561 -65053 -261041 -78443 -253436
8654 -253436 -152988 -242213 139433 -243879 153123 224402 -334657 -211277 -149341 -582 30571
8642 -138164 -150301 -269028 49858 155113 57695 186479 237180 61582 -181344 -175821 -222552
8631 -222552 -46658 -57905 -68232 -291946 202264 362911 145830 17202 254597 59201 -146017
8619 -27344 -15890 54588 -131157 88314 -62519 -11398 -49974 -88448 -10656 -11586 -64955 160766
8606 -115765 -137077 51580 -220387 -193566 -128984 -297093 157425 134275 -75212 82140 45636
8595 45636 202326 -35005 -37135 -185254 115519 -140743 122644 192834 54524 -219440 34175
8583 219100 -134032 60192 49580 45194 -370405 -151127 -89961 -346168 -178231 367368 147891
8571 -116486 -318566 37280 155325 20953 -236222 -166327 -245957 -15991 -306617 -82408 -246340
8560 -246340 -41713 -107107 -217310 -54476 145560 184480 -51032 93634 48777 -140572 146991
8548 -67341 -252362 -224899 61980 -172932 114718 -42666 -84101 -326917 -97273 -440819 326051
8536 362929 -4719 -245256 26822 -547345 -358591 139542 -92800 49960 72338 69365 112863
8525 112863 -32038 37057 53193 -201490 111463 -188680 -189033 316270 -106248 -87008 52535
8513 -134634 195610 -834 97127 -106130 -57918 -34527 -156384 123733 -72532 -68585 167388
8501 254609 78996 -296102 -267521 243774 -182193 -238204 -56509 -66290 8150 -169141 -120998
8490 -120998 -300662 -79147 -171678 -70766 -116582 -106463 -312191 106625 -311143 -117813 151196
8478 -47780 42895 -55748 202714 -77590 203892 -189809 50566 -107624 -127504 -263413 247184
8466 -162665 -104559 82576 -252329 1423 -86975 99241 -35076 -220521 222172 -93393 159584
8454 114230 -34758 -307697 205307 -11791 14939 -158836 -304718 556 134910 74273 -329547
8442 -176848 -40834 -33771 -80789 4648 -282737 74489 211645 -26775 161181 -191931 49770
8430 47064 -166232 77442 -68766 167437 -127409 173378 -283947 107193 -247483 -30780
8419 -37617 353210 165930 101591 -51759 116173 -187726 -280154 -50892 258129 -117167 -252781
8408 -252781 289453 48025 -59851 -25337 -8751 -11027 112871 9444 180037 70943 -358637
8396 94321 -44584 -141798 -124377 -194999 -381011 -124076 69474 414185 -132720 -21166 -189805
8385 -189805 -168209 -168217 -195504 -302680 -240066 -117790 47271 -76551 -70268 -252563 -182431 152750
8372 -112750 121648 -51152 -165974 -98357 363894 265925 157189 102479 174095 89491 -58823
8360 -79274 -85820 -61836 -179102 75699 35269 67797 -291826 -258319 100870 -160499 162353
8348 142035 63823 -224820 -66072 153817 -596853 143648 28047 160897 83784 115951 53486
8336 -136071 20444 26084 -223969 -425900 -32844 191301 594743 -266197 -84838 -274717 131826
8324 116234 -27199 211895 -110326 -21276 7735 -240364 152139 -235147 372434 -135007
8313 179385 -61810 128186 17229 -124743 -285323 68777 -7163 -157008 -22455 80535 -48893
8301 26111 186176 31932 -278258 -68959 -323615 -245065 -216719 -275520 469848 130173 -38937
8289 -202573 -89432 28992 -303701 143613 212726 -185393 12431 -75512 101021 87803 3998
8277 -54961 -323907 -264041 -226251 -24788 -265055 -183530 -30046 -5420 142274 -203130 86131
8265 -34718 110179 -178376 38118 -403030 112110 -62424 150660 -304076 -179245 33351
8254 -38780 254596 -348575 216010 -206928 10321 -5897 -209664 126221 280628 35077 -213656
8242 109580 -68548 139393 19034 12598 163534 147546 63297 -22263 -87450 -134862 103746
8230 116805 -151138 -163012 -65093 -236792 -152193 -102017 260714 -395826 -139538 124660
8219 -98305 -13539 -251283 -138470 4394 -187445 120803 117810 51738 -159597 215242 -110184
8207 -231117 -77534 173250 -332201 15299 -13557 3134 -198352 -60639 -109102 -33781 -30609
8196 -30609 -59939 -40415 -352190 -137670 189619 111823 -122852 -316036 -18819 -132068 -49873
8184 -183623 -418682 78907 -87103 -3969 -500075 -165586 47405 -26489 -127107 -164903 -160262
8173 -160262 -54289 -83664 -73643 105677 257048 -287368 155976 -57718 281678 -49223 -210992
8162 -210992 9616 110191 -2063 -14747 -270414 -124511 -130331 203682 70843 -15941 4728 -110529
8149 -74375 429413 75857 -330 -64522 -227607 -235416 45610 -186465 -302153 109001 -212217
8137 -57140 -211177 85116 101285 34786 122431 46022 -210783 127400 -117924 -650 -192129
8126 -192129 -138580 -79273 167880 -73615 27394 -59159 -195807 -244660 -38741 -169886 -172834
8115 -172834 5137 -119449 -295545 -396225 87709 -159733 -177086 -109802 -8107 -246290 36914
8103 -168172 -54871 130203 197468 -99194 296847 -238152 190511 186723 98263 127058 -70129
8091 -46611 67740 80795 18044 285224 22391 -185560 -137831 80024 53939 -98721 -186142
8080 -186142 98246 -262991 -44372 65776 99066 -242030 -7643 163185 -64948 -27073 105210
8068 11390 7298 53158 -345508 176764 85301 -162515 78480 24601 -67863 -138245 289950
8056 -16583 42202 -258009 100789 36214 54331 -125512 -73728 11876 -48913 -147628 144171
8044 128328 -209427 146745 -175465 58770 -451086 57537 -196436 -171689 -427151 4968 -421499
8032 -21779 51243 -167748 -275483 -306549 -245612 -190477 -266109 -30548 156389 -59855 -41085
8021 -41085 107855 -217754 121636 96367 26973 209797 454690 -145023 139695 -196400
8010 72140 -21228 -11406 -356052 -87444 -81612 -35576 61297 -185543 116490 -38493 -346396
7999 -346396 -37019 26709 -55192 -157827 218695 -233960 95664 127005 148032 243859 -360236
7987 136879 131643 128407 222891 -308083 -97045 -223991 202279 61367 299389 180851 -339188
7975 234230 -199620 94190 -137623 69681 18969 191995 75689 -61608 -263291 -541770 46358
7963 147124 55050 251490 -224114 -178530 -30139 -103725 -266288 103123 77482 83511 236299
7952 236299 108866 -78000 -200010 -86357 -27617 -130550 105015 -443065 148265 -26837
7941 -64647 -52871 -10906 -236087 302917 -121369 99534 117062 -74513 -182612 -315596 -91227
7929 104657 130007 -338054 -78314 -204068 16259 -198431 181360 140100 -3551 -227546 -149452
7918 -149452 98159 185630 -168350 -123085 82117 -31321 -51284 60303 -143410 -83942 299127
7906 -351111 74074 -126279 -365022 -185125 -426627 -68561 -278273 -51216 -120098 100179
7895 -160829 1221 79665 13329 -149705 -66731 -262378 -39636 334080 -123765 153818 -66234
7883 -378917 246129 -252 78650 -335 -43363 -169213 376560 -18661 -133176 -247733 -272294
7872 -272294 -168877 39681 -13690 -22288 236611 -60318 183567 -114318 -119775 -191927 -278863
7861 -278863 -114897 -68375 124333 284806 203034 18247 104317 175302 -158942 -177197 -75764
7849 78840 -395445 35692 -21800 249811 -253929 -118767 12047 129776 -148843 -49394 -175417
7838 -175417 65433 -348966 124387 -169469 -77641 -88664 159301 -476027 28286 25959 81391
7827 81391 152733 -169092 267697 14015 -17228 -326232 235741 -13543 -51378 -179588 28057
7815 -220511 311164 -225226 -179189 263340 26952 3799 -207954 -3169 -63494 -142539 56183
7803 -440542 32618 -98294 -73085 -275387 -8046 -49755 61292 -133174 -237440 -37296 234532
7791 -137365 90075 27519 -113754 -228978 424 -155603 -254164 -261567 -196003 -28950 207151
7779 -144091 63234 107032 -2955 -229754 14097 -113797 327015 -203929 279447 2439 -63633
7767 -109239 87767 263355 199258 244450 44478 -134 41853 149374 1108 -126512 20150 61975
7755 61975 -113335 -142570 129351 -7120 94180 -293785 91651 -136596 -164337 253397 -268241
7743 -250636 22557 -217795 -13463 -107208 183260 161822 -329910 138 185151 10222 108413
7732 108413 -92476 -217025 -184345 -39844 -244958 -28686 -188016 -219210 29774 -31156 24349
7720 -190024 77997 78 144769 -160195 -364271 -97194 -60182 -310536 -155331 -155453 -172038 -122879
7708 -122879 -61606 104253 -19472 -118843 172212 42541 -153336 90783 -35428 -223038 -202708
7697 -202708 -152956 10726 99233 83841 47600 -140067 294505 -252711 -124434 179325 82049
7685 -139867 -102263 -245358 -175961 415102 -263139 28988 297436 112058 5565 96591 -82047
7673 -5912 -164618 83363 -40878 98353 51263 166583 -193179 178048 288013 -136112 176321
7661 -361251 -25684 -111687 6974 48149 -167924 287961 78447 126130 -146502 249874 -75552
7649 31314 56440 -82814 -355585 -44079 -164780 -146584 -120003 -141094 -176241 -57558 -89641
7638 -89641 6596 349645 18621 42059 -225129 -102493 -27827 -254494 -39699 62275 -94251
7626 -257532 -233752 -345357 -135643 -92639 83045 104114 -298791 -287983 81770 123079 1709
7614 -26049 96056 -6420 134313 -209747 -93025 -178998 45844 -33670 -24536 -111831 -116266 -142169
7602 -142169 263067 -293081 -89982 113306 -12086 -112709 -195787 223750 160380 -30570 165196
7590 -235505 130161 226731 2312 219752 87561 273600 -55534 -35750 61916 -204043 -148558
7579 -148558 -27911 -2562 -155029 -77059 217872 109126 160299 58229 -137275 -66679 -117238
7568 -117238 40153 122724 102030 245934 -144785 -167055 95050 -157075 -17105 -268507 -46487
7556 -5805 -89070 -151719 -361725 -30797 28568 -23686 -198895 56556 181295 64865 -5615 89745
7543 -142907 57663 128985 -153990 150205 -139315 117689 184047 21671 245506 -114783
7532 -111476 58579 -355705 -175451 86185 -101944 92218 -136453 135439 36743 -105229
7521 -33971 -388318 102871 82977 224693 167399 -158198 -330337 81008 -16814 115070 27717
7509 304908 -293678 289908 -136603 83599 -211209 -274316 55576 -44338 -157461 69240 -244883
7497 328892 -332323 -97197 -128711 -360333 -624700 76465 257330 52336 -169769 -42682 261742
7485 -87583 109630 191501 -56611 -162898 -27688 -157334 80568 -100417 -435487 185455 -166087
7473 187668 132703 -103177 -31159 -197244 -274121 -42328 -34971 -233283 59304 -236914 -227103
7462 -227103 -259222 198614 -224103 -165512 -105847 6811 -301833 -9533 -44752 288548 -172940
7450 110064 -252147 -22562 67358 -33933 162589 -134178 -82386 -248577 -42700 17032 415331
7439 415331 177549 251448 -79170 -156358 127850 47088 -417263 -159909 -141047 18357 81879
7428 81879 144986 109746 -377457 -11431 426106 109513 -261526 -165050 -148254 53071 27332
7417 27332 -179271 82829 269359 105395 96678 -163209 -15211 273749 -175134 97736 65653
7406 65653 -124479 -325707 407154 -4482 -19832 -107334 192123 87576 -120556 -129385 211973
7394 -189605 -128980 -25322 -53225 -61331 -41474 200280 -34410 -24735 101202 16734 -500 -72150
7382 -72150 -209255 402909 466523 -59212 -230971 -31793 124102 27966 -56123 150999 -339853
7370 -142302 77425 -79600 100551 26925 -89849 -185192 -23089 258962 176984 -251272 47812
7358 -67765 257783 73499 -258055 -208708 83610 102268 -174427 393684 29298 26626 17817
7347 17817 23120 6068 187158 201462 155570 404026 119598 94139 -82253 -11164 -227380
7336 -227380 -143337 -159140 -91402 -179053 82991 96096 -391728 -63378 -69744 154732 135729
7325 135729 -142747 10410 95610 -3275 -19003 -85263 -289484 -8099 -274635 -159112 18464
7313 -50387 312306 48383 -282297 69250 94332 -115679 130318 14602 -178618 -275367 -188376
7302 -188376 -150918 -349371 97124 94234 -13007 53161 -41282 -216377 -54091 -19582 -12137 -71512
7290 -71512 23749 -73487 -177381 -388022 81728 148940 -102878 -125382 1028 299143 -12006
7278 -290481 -20899 -216042 208232 292315 188411 -77052 -294614 -141466 -229954 118082
7267 -19191 97958 190068 -52619 -36480 89960 -211334 -221169 -175475 -59440 -187361 148606
7255 295761 148860 -24941 71537 45387 86072 -105279 -248851 60234 43726 274823 -12124
7243 65497 -577546 -330395 -64815 -288433 -248675 233446 -67904 269744 193388 58357 175753
7232 175753 79590 512090 130393 -123596 -40214 -98122 49036 -201337 18880 -4585 -409135
7221 -409135 -155340 -165494 -265025 432 -105020 45284 -245878 -223625 -7037 119289 -251641
7209 -84554 -20824 184061 -13867 106254 -111873 81783 26791 6535 -155639 -197099 -112222
7198 -112222 -430080 -9355 143826 35851 5938 317041 -8257 411825 77845 190945 248430
7187 248430 162441 125186 246088 173549 -84942 30256 -304074 51896 150143 19320 -64279
7175 -144520 -27666 177896 -44467 40032 -83774 -98494 3167 73837 -143960 382155 5351
7163 -45769 -395287 -642306 104016 92881 124603 -152717 94750 -5661 68581 28848 -78676
7151 74408 -41198 132053 136977 -5367 -48647 42792 -285204 65076 -56490 -97913 -64807 -195555
7139 -195555 160774 138498 162931 -116898 11222 -72101 5285 -90461 12915 -31258 -44202
7128 -44202 32708 162393 -131972 2225 55854 -52323 -170186 -178619 -79776 81520 -75395 14106
7115 78450 150048 105326 148352 112760 204633 44046 133953 391009 -211268 -72370 82026
7103 -401976 -391572 -111508 33982 -353795 168057 -294936 -5775 -79678 59361 319961 273714
7092 273714 -34643 -44100 75044 184677 -186398 -18971 173537 -72803 -130618 -281385 -91629
7080 112132 -12685 -262483 -65845 -6296 124689 187721 191216 -251326 72726 103330 386978
7069 386978 -65813 -342715 208595 -18623 56845 256957 -22187 -185845 68132 -117178 290770
7057 118157 135406 72914 134212 62662 -222669 173166 93537 121266 113581 -155100 -293742
7046 -293742 -194023 -61740 -100767 52137 168821 -137310 169506 -10965 428807 -40100 -1139
7034 33481 -223635 246279 -153897 -101342 84161 -93064 -145673 -213870 -279140 21814 37883
7023 37883 36584 2149 -47271 -198155 199694 -53183 18828 -141618 -65632 238487 -241472
7011 -268527 -604440 -41208 -177171 -88010 -386778 191209 374948 -8349 55281 -124316 360131
6999 -68062 -110590 -145475 132960 -236908 40282 203098 102898 40857 -110754 -219186 -177129
6988 -177129 35520 79025 -284114 64173 -49558 -253342 40890 -197249 9776 34377 107611
6977 107611 63252 40346 361860 41565 202953 -127897 292510 -167562 15638 -44808 -174625
6966 -174625 -188288 64646 68214 -245556 100090 -144263 -136204 -39183 38499 -158426 -6632
6954 -468099 -228345 283919 221007 72687 9057 12646 -103984 -98677 -276834 -93287 -33847
6942 166382 -64408 -96909 -10037 88735 129371 126908 -146652 57810 66378 -75650 173782 90947
6930 90947 -21073 42127 115940 30387 -34720 280286 -174471 67859 40473 -42096 252895
6918 83265 -36650 -59785 115038 -91580 -110092 -195068 105303 274670 -45475 45527 -226360
6906 -123923 -79786 -93228 -24451 -61544 105711 269439 -150875 -143542 -98605 230360 152660
6895 152660 28276 -160466 96399 80278 -313725 -1120 6601 126676 -311708 -30835 146245
6883 -139881 158108 294952 191140 -16518 12181 -11191 -568339 292659 -637 9657 -114508
6871 190739 97790 326803 -235276 43118 6304 353436 146609 -101053 442342 159607
6860 192921 -186303 -76648 -688604 83711 -349675 22951 252926 -175286 -78184 27766 133958
6849 133958 31410 267213 182138 49420 110614 -42613 -203249 170620 223810 -138858 -229969
6838 -229969 117150 -321469 121332 152485 26493 45323 -73571 -96350 -55458 -164006 -76483
6826 19096 82733 -109632 123755 -18223 167810 -134110 -130142 24789 58114 75272 360749
6815 360749 149262 -355112 -23737 28460 -53607 152223 71763 247608 203418 180044 -49544
6803 2768 -71907 -203517 25965 64091 192459 -301897 -13325 -208875 -453653 174724 -142357
6791 -25619 -62737 -89237 -110863 100009 -87059 -36783 119456 -91285 96221 -230182 -76698
6779 -141825 -104279 241355 -24272 113671 110871 265238 -150003 -222858 209754 315073 -136624
6767 -107945 150137 -60387 105139 -87476 -101450 -247930 -147567 6623 37560 -295902 -21943
6755 81790 -140610 -415534 8705 -119833 -284413 76264 2982 317798 -71868 30680 -200701
6743 -325927 -32874 -4673 -58109 187635 157257 -231977 75722 -391210 120054 -198942 -206066
6732 -206066 251712 59001 84705 310790 134577 -7301 -191608 65551 407766 69214 -20067
6720 -118985 -229527 119563 -63336 -181520 -319035 17774 128858 15725 18105 126291 -41878
6708 -59290 238368 -235315 126262 55586 193942 -221354 -252634 69757 -151783 -94625 -14488
6696 -54719 -69421 -75219 174187 394922 -243915 47089 -16888 63716 -78861 -52296 -321295
6685 -321295 129158 -35924 -43302 177530 -63760 -34207 -55360 41963 -43191 -63619 108702
6673 -102668 125325 -308365 -89510 -86053 -174034 -323765 -33139 40760 -30603 -108829 86904
6661 128202 82130 -171404 -19684 -3001 356517 89957 19661 111258 -13596 358737 136899
6649 329348 -187447 20890 78440 -201613 357077 162563 5704 -267160 -85683 -74703 -73602
6638 -73602 -67703 -5364 165599 110681 54836 249892 -89954 -68657 -143480 -9052 94256 39357
6625 58218 49972 -246768 -148262 -42810 -152701 185731 -1714 163379 83342 -126547 -201451
6614 -201451 -64628 -146 198708 -309188 -190330 131708 -173868 -63546 214361 77220 247486
6603 247486 297943 3492 -111948 -178931 239026 -242290 69555 -38858 -146082 -264099 -157559
6592 -157559 -5544 -281700 407927 109044 -20088 48631 -49724 -69830 198746 108892 -273800
6580 -129621 -138431 344481 -260468 102159 -131692 -60821 88098 -72548 -35479 -97467 122247
6568 236394 -307718 88178 -205576 -265971 -140599 75637 76316 287541 -281860 50025 -236292
6556 -188617 -278076 -105108 -98676 -12062 110349 -187002 -13012 -42654 -80653 -20269 -201210
6545 -201210 -244799 145916 372975 -74498 -68690 -204974 150961 -86765 194490 -103399 -230805
6534 -230805 -101600 -184320 82138 21974 -209111 -86696 19432 -77543 -39465 422037 61728
6522 97191 287366 -21576 -39498 148241 -86008 91405 121235 -194951 -40311 54303 -151618
6510 369568 54894 -110897 80622 -117747 -76671 -114963 158481 -324404 -12789 33532 -84752
6498 -125682 144446 -55806 379249 103898 23987 67875 39565 -94320 36273 8666 193286
6487 193286 -71651 -47468 -16003 83988 158066 -27056 97896 2499 -250615 231979 193511
6476 193511 224332 86468 166881 -107609 126509 109047 65591 -299593 189501 -82266 -51302
6465 -51302 25139 94797 194289 120440 -216630 -114537 138876 86868 87163 81128 -110940 -35564
6452 -146368 -96933 152526 107435 -259742 -10884 -149890 -90734 -233152 -49826 -120476 -97251
6441 -97251 73833 15534 124608 91899 221998 -170455 -228204 -80388 164941 30107 -89474
6429 -223132 419414 -45033 -161371 -265385 -3914 -26646 157303 -71219 113230 -72792 155542
6417 268021 6929 108991 -237436 -6894 -359072 -9916 -3086 136965 18004 211697 -52538
6405 -112452 -241521 136707 -135603 -25167 73620 -218498 17753 -169250 6554 155332 -228472
6393 -86581 -87873 -159798 251780 -61268 59465 374351 240047 36560 159671 24579 -20207
6381 325194 299511 106482 34682 -68026 -24541 -68030 -32235 -159138 47890 209640 46586
6369 -48398 131261 11756 -110942 -59956 -259388 335159 52099 -38991 -73015 131032 4009
6357 -77272 69134 36091 9611 -143276 -19058 157358 -194985 -396591 -25210 -93206 -236400
6346 -236400 92698 -44632 -191608 -420 -85137 55835 318072 -325233 -330202 166350 -135017
6334 54948 -274613 157858 95440 -505050 2281 -29780 -56177 -458880 -107072 77348 46129
6323 46129 10643 -662 -188104 96259 -168897 108915 317803 -66220 194182 -224591 -83515
6311 -33008 -149730 -131690 20719 -132952 58775 -186171 -44764 -170345 -140994 25031 4899
6299 -207634 22224 249190 -107502 4559 -116796 -354308 -216514 29495 59187 -91080 -25393
6287 56995 -66516 -12374 341358 83309 32116 -124856 123971 132862 -88509 -28856 -16391
6276 -16391 49395 -120377 -53388 106864 -185426 -136506 155597 157382 49138 -99081 -24049
6264 -122847 390770 -150350 -160295 -80621 70302 73022 132540 159881 -277177 21892 -397873
6252 36947 -39640 -49545 31556 -140838 250120 -142759 183715 11806 167267 -71886 -5088
6240 354166 162278 355226 -116958 -182532 61361 137953 174756 317267 -384014 -136268
6229 -278059 -216800 -114157 33792 -96612 98828 64458 268944 -39738 -80487 211582 198499
6218 198499 10853 83801 224170 290104 -93423 51708 -284348 -20914 -83833 83639 -105802
6206 -35049 375546 -227485 53349 130189 -17182 -266993 52680 308501 134231 -31235 -25048
6195 -25048 -89338 52582 117490 -266792 136780 -67986 -215925 -136825 -325204 -29600 -59614
6184 -59614 -185206 -201643 146816 -10840 228278 -216852 50389 35173 -371663 42048 -205479
6172 125126 49276 20644 257917 -290278 296082 -72519 80019 -15965 -1880 -210933 90252
6160 12517 -94642 -50407 88689 427161 47017 121533 -275435 3982 -103730 112663 246188
6149 246188 -73560 -50946 32708 -280197 95107 -9948 127592 317312 60035 -146050 -239247
6138 -239247 -43465 -230686 168867 200878 -490303 -90909 99786 78268 -166082 265657 -115343
6126 -111026 35465 -112729 113526 -168505 9394 26422 99757 -9317 82527 -188750 -360690
6115 -360690 -82309 -245374 311087 -105210 -450029 78025 -392286 63488 59906 -201207 240306
6103 -315979 -196413 -443241 265643 56595 205661 -125128 241995 207688 -102990 -124654
6093 -124654 84179 49773 35651 -488817 89048 -151815 -517 140495 39654 52786 185141
6082 185141 203008 -273537 110407 72170 -345957 -20924 -146430 -100322 209650 227012 127068
6071 127068 307548 -47009 3018 167912 -1995 36862 -285407 -220601 -213129 128045 -141882
6059 32998 -183825 -165580 -437310 -66964 5654 176619 -212191 293994 -91146 391327 90486
6047 -366259 -11210 -103798 -164095 75349 243485 -97621 -67710 -22230 -24147 110816 -44521
6035 -72469 -298516 243558 -105820 -139490 110266 22366 -74922 -100366 -173824 88838 95237
6024 95237 1329 112914 139455 37327 -85059 -4115 99663 -40153 122763 -286054 119246
6012 -38926 -39014 70799 -125219 -172542 -155764 58326 149341 76962 -147855 -273506 9097 224653
6000 224653 354059 -22177 -32985 166221 -228656 392743 -21775 185320 -265299 55573
5989 76158 445790 216251 -205213 -159091 -156581 87507 -47805 -242732 -74280 -66088 6997 -55195
5976 67683 -270071 -59142 85623 178562 216090 219119 91165 50389 -124098 1322 -71105 -46236
5964 -46236 -38172 -366841 -85863 134985 197772 -72221 188 164208 -30869 -18174 -65817 -249489
5952 -249489 -360469 154660 218194 -141757 -177230 58875 -92706 -282782 216254 220479 68967
5940 321595 109620 -293252 -210769 101267 93823 128460 -61013 -96057 50893 -118665 -246789
5929 -246789 -18830 249516 111041 -133252 -184394 37450 161061 135409 -174944 -317909
5919 -317909 152400 221023 -44470 -86109 146693 25438 -108762 55804 96946 -45568 -122459
5908 -122459 175678 -159069 96391 89808 94280 -469011 98305 154127 43340 -251658 132503
5896 -29744 65551 -79165 144749 23728 -125585 145320 -23076 -42371 -108945 -115635 81927
5884 122636 4838 -388144 42449 85949 -432524 76786 -134270 -83827 -298869 34817 51929
5873 51929 90513 174921 -189968 -104060 -93046 -61456 -62840 243840 -293121 115024 -377086
5861 -198975 327200 273730 -143852 134994 93656 16504 -24440 -61144 49697 -333461 -70007
5849 21712 -194868 -165339 43736 255555 45171 -144483 59427 66747 50563 -61443 258805
5837 -80270 -119589 214634 -72293 -138564 124793 174206 162317 -278279 100089 159947 -157558
5825 215158 -256148 238800 291681 -254776 37025 43343 266240 91880 69911 109735 124440
5814 124440 -411463 208799 -192038 178511 -223147 -5245 56165 -266144 173418 -50722
5803 59070 -175984 95887 3424 -161984 -3629 111311 180491 -26980 -296989 59686 350852
5792 350852 120120 -20944 361872 -197381 461581 -312746 -127776 -228823 -105959 20646
5781 76648 11539 -417435 -69857 120662 10009 -299419 -38397 -35407 -12395 13627 89710
5770 89710 -139679 -23217 -18862 -42013 13408 35800 39685 -140805 -100210 -128132 149726 192499
5758 192499 -47514 91374 110838 -190215 -69847 -193693 111392 202578 -130593 6275 41991
5747 41991 21161 -155485 105624 -107229 -189646 -64244 -120087 -142342 -27508 348733 113906
5735 -160037 122422 229899 16163 -66732 180509 -168618 -60537 -101311 189335 266110 -241632
5723 -159907 112431 -49911 3002 -24257 -108774 -2447 -21498 41420 175615 160559 142632 -198969
5710 -95886 -283088 69450 -125066 28018 -184523 71129 -102769 -113243 -64738 31315 225654
5699 225654 38514 -67359 213531 -135067 -207660 -23226 -169538 -221104 30747 9412 -53858
5687 -189622 30235 198840 -47899 65224 34842 194217 -228933 195184 243838 104251 850
5675 74388 288811 115076 112620 -151349 185175 -151566 -11345 -47186 180090 -158177 125137
5663 -1304 196631 1835 -41547 -118407 270420 163674 -224323 -113283 131178 148596 235494
5652 235494 -221219 -191128 -74529 -169816 311518 228925 89164 -2428 63943 -300232 -28645
5640 231259 81055 -69553 -13308 8558 -314017 79751 60905 240584 -64819 189993 168457
5629 168457 -58914 -63910 193824 97876 5822 3127 2908 -283372 159940 228251 90461 -132704
5616 -13610 -18470 -103819 70386 -243162 -102726 -316237 -129524 221331 -160314 90344 169916
5605 169916 -66793 248903 -166303 -119311 405164 52076 -33252 -112027 -135002 -21197 -145113
5594 -145113 107916 -89080 391817 277430 39412 -163736 -76752 -26612 76670 122622 194214
5583 194214 97255 97313 84312 121870 -79754 -90303 585 287619 298031 -133229 -212390 92862
5570 21447 115682 -18388 240331 45529 201085 64250 146075 -223481 131325 285480 -27638
5558 -10506 -131349 51560 12188 210758 -383113 -80560 -164153 222877 199236 80643 109913
5547 109913 -140804 89185 -404743 36008 -210301 -164334 118820 -106355 64530 -186452
5536 29814 61261 -87038 38114 -238485 -295150 161552 146231 -131748 -24671 11346 142765
5525 142765 -60357 -65048 -277274 -101592 45691 -51731 -124059 -8187 28354 -86493 -113929 56277
5512 -184560 26305 317964 235043 -41695 55746 -54869 89396 21887 1367 19279 -6594 83349
5499 140209 78312 268397 -31056 -46720 -90504 -141079 -51429 52463 58809 -88882 49788 57840
5487 57840 -471505 98212 -343747 128484 274357 -125286 -302182 146878 -168623 -35079
5476 57559 99367 24727 -175907 299608 466349 64260 -25481 -160679 -130955 123338 124648
5465 124648 12898 -196810 15843 47993 193312 -276452 -157015 -185413 -8029 -184464 -9481
5453 -228506 265453 16233 20255 -176534 130376 -257832 98835 -230555 -109899 -28853 -142608
5442 -142608 -243517 46710 44978 -55108 -133824 73837 -96497 -115348 -38237 -217315 70543
5430 42266 215747 -36626 -36595 212916 83473 -604636 149095 -351987 3727 -16176 209502
5418 69639 38752 24681 4675 282059 -145173 12235 -8487 -473653 44395 -159203 -121338
5407 -121338 40487 -217313 -90245 107994 -112161 -169849 -67233 -43497 114281 95556 12259
5395 -182064 56051 96579 45702 -44642 -150486 -44033 -6348 7910 334042 77651 -95318 -272002
5383 -272002 92450 226173 84790 122667 165574 -66542 188011 41799 92520 -147900 -355035
5372 -355035 23778 261565 95821 -137599 -114024 -326524 -147539 -10879 -16676 -5071 100353
5360 97927 -312851 -139819 -157391 -215064 -203676 106316 265056 19368 -129393 224084 106678
5348 -161572 -268749 286478 249330 -10967 38619 420575 196356 346365 11943 88258 15307
5336 -297578 88996 154672 189721 -30262 201172 168344 -63457 -223813 -123713 216576 -32688
5324 257643 -281118 -61775 -130155 135457 110721 -242066 262979 111559 6611 184812 206580
5313 206580 -23847 -203621 -245816 292992 47256 136809 171900 6318 30950 161567 290090
5302 290090 150199 -162996 112084 -9579 105220 -68406 210997 290106 -140047 173604
5291 -266059 -196672 359027 126634 -196242 13543 192150 143648 -150327 -315924 -31207
5280 42567 32269 -227856 91641 96046 90962 -59242 63274 15850 -143691 36582 179925 -234871
5267 -75940 135446 91611 -13999 30475 213067 39145 -172843 266946 120538 107559 -114057
5255 -47845 146246 88284 50041 26666 98119 61620 149416 -83333 170571 236699 95452
5243 -118676 -204087 -18971 61221 -196263 -278700 90966 279273 258217 33256 -180605 -183992
5232 -183992 13848 -127698 -78619 56292 81116 154030 30312 76360 -120560 -13484 144272
5220 -5077 -45019 55066 -414434 245955 -177271 256846 298374 -90741 -238206 -142571 -171583
5209 -171583 -58255 -224519 208737 -181361 -150780 -184068 -130576 259439 -25982 -327955 -50690
5197 267852 145702 -97555 279790 -215725 73912 85749 -79698 -314378 -74862 -140155 -83189
5186 -83189 441269 -152256 -130155 -143775 143722 -168141 15372 95033 -304390 173591 -66341
5174 178909 358262 18501 339365 131587 -143978 313339 -132395 -113986 -187189 -223417
5164 -223417 -141193 246613 204775 61496 168709 222475 -301768 -222966 -184749 -232666 -151997
5153 -151997 237499 -117001 -9269 -162671 -60900 113090 -31473 -16658 -160416 -46034 -63622
5142 -63622 42411 14579 242785 -172576 182818 -68063 -222663 14321 -242434 206569 36592
5130 382787 233739 3681 -113279 -135976 -50363 82735 197529 -6946 -78475 -236379 157225
5118 115378 -53407 -123555 -7857 193364 -127047 -3409 29076 -195446 11762 -125172 48109
5106 118677 124916 -133162 -184661 -214295 97934 -56959 -117967 6254 24591 96931 193158 184904
5094 184904 -38595 179306 -81946 -163718 10615 35052 148526 -23826 720797 -10163 95284
5082 146622 182390 134619 -124023 318513 -90408 -136438 -224599 71423 360656 -210524 -198734
5071 -198734 103019 -21187 237397 -192843 252507 15886 -17425 364480 3382 -64217 116105
5059 -237335 148402 -155002 82623 93288 -371878 154804 -167608 353821 -55308 -65082 206924
5047 -164401 -180459 199894 63771 -82010 285472 172985 -210237 -291919 21473 -81125 161894
5035 139142 -229911 53116 273281 69304 -12220 -76686 107050 182859 95681 72300 151852
5024 151852 -220210 115249 90279 43056 -115575 -145893 -96784 -263016 305874 -125490
5013 117218 131721 78031 -216542 138497 -131885 93792 -62050 117075 346792 -49366 230288
5001 -135100 57839 123448 148908 -181058 -136798 -235110 -80094 -215005 15354 26519 156465
4990 156465 97816 67218 -119166 73714 -171929 -218587 154609 -79713 -92664 -160567 32024
4978 -19443 -76084 -61247 -177871 -95064 105995 165701 131038 -21781 -20852 -63603 70241 -298849
4965 -90149 13440 351263 -364553 -157497 -292457 104530 -149036 -52167 -29289 94756 -134508
4953 74287 -14011 -23737 -98524 60369 178181 100283 -203711 -117702 -53930 223713 94746
4941 29494 237010 87688 233614 -45385 -12933 6719 128267 -168448 -55578 -23446 86954
4929 218649 161468 -144044 -284324 309581 12452 -56886 167992 144968 -21239 5270 -378519
4917 36905 131848 366643 177606 -279483 -190094 -60003 -178670 -181497 -70620 60925 -257925
4905 135578 -107785 -33434 276667 95418 44560 -118939 -256846 -179480 -47869 222023 532287
4894 532287 -109399 182411 90964 79859 -108539 14594 114190 131110 55810 296639 138321
4882 -109852 -116418 -182647 -169313 252353 21132 225172 -37403 389023 243715 94088 -96342
4870 -114191 55141 -225614 167085 181463 -43398 39372 -104842 -186711 -208207 140753 -256536
4858 54136 128080 47367 151416 -63894 129955 -128380 -234975 107737 296834 -96238 238177
4846 -39434 -350413 49068 -70348 149260 -12831 44811 -187350 537431 -281334 -86138 32585
4834 -87518 1880 -329174 -93970 91762 287828 -104139 -197454 -2265 57741 -18288 59401 5950
4821 -47057 12636 257945 358132 -21088 37660 129534 206974 -10336 -132242 41782 27635
4810 27635 228113 3905 51684 44203 -230096 -50219 -185443 258108 -211149 24150 108527
4799 108527 137581 53988 131554 -74665 -185679 106997 83209 -92123 -8401 -43899 19973
4787 -88619 66352 -214461 -138420 347778 -194730 342712 -277178 -10510 -116067 -90871 -151428
4776 -151428 164257 52495 -124484 39271 411311 185905 -30663 152849 255886 -376217
4765 -162651 104760 -128085 -61984 -300214 -45683 18354 -291781 79046 -126808 -166869 65116
4753 136040 -124455 -118267 170140 -35277 88174 236213 -147742 -2807 151899 109299 263254
4742 263254 -9998 50891 191834 -148612 -63470 113408 26200 -25793 -21916 -304306 249671
4730 -75409 -22390 -412685 -37500 -186006 14768 -24141 -429754 -16934 4960 -403038 86562
4718 -219300 -29651 67827 -406839 -212981 128081 -275906 158410 79276 -59834 68535 -120312
4706 49692 238643 165965 6701 23796 72303 -32501 78265 54906 -44422 -140274 -180658 -67530
4693 145068 199453 190606 76961 68685 -34671 65297 -77961 -158388 68559 -3379 -115836 56887
4680 -14055 -70709 103500 217568 -36989 79884 214331 98157 -78559 345034 -405004 82467
4668 181155 107374 -268998 -24375 -168577 -47420 92604 308263 208444 -193945 10057 103819
4657 103819 -115478 -69075 -178606 -149845 -32118 47204 -44280 -256474 56052 11454 -402290
4645 41967 217679 187761 12383 -338878 229695 -152142 -409282 2027 -49288 35646 -79843
4633 -39011 192594 216593 2323 -3437 -128088 405013 80284 174189 -209914 183900 51766
4621 -69211 67556 -101602 35108 -90667 -254881 -45672 232989 232079 -61167 240781 -136476
4609 128508 -131167 -62872 -168271 261783 28551 222401 -273393 -118175 16748 201032
4599 201032 -57099 -166260 373868 -4267 122708 95965 169953 -82138 -24182 12706 190352
4588 190352 96012 -16418 -31118 289979 -43776 -108736 50146 -25869 -122569 179446 -4927
4576 190571 -100336 -334296 342688 -29106 -34842 78528 -265489 6067 -97535 276654 -44001
4564 64085 -29493 238941 17209 -34116 41877 257987 -49196 98654 68134 113004 -57959
4552 182167 75840 3192 167269 189859 124132 426091 -33404 -38746 161676 -137190 42951
4540 271083 161471 -25717 48239 321088 205321 -20147 155676 279339 -241333 -44263
4529 -170163 250080 205706 -13688 52824 271931 -424586 344428 33181 55660 38821 274903
4518 274903 44986 -166880 169732 -47524 240888 18469 -180481 208229 37561 78378 -334125
4506 -35040 -127198 80924 111090 375634 87580 -115338 48617 -65026 73818 -127018 -155211
4495 -155211 -133417 -192963 -53741 62246 6187 -425025 -41597 110089 152309 -156072 12154
4483 -62403 -238152 17378 -54530 -308421 96652 -51049 6545 32616 219962 -19961 -15457 202423
$$ [...]
##END NTUPLES=NMR SPECTRUM
##END=
