##TITLE=NES1037_878015026_9242866_9XMLrb76ax
##JCAMPDX= 6.0         $$ Bruker NMR JCAMP-DX V2.0
##DATA TYPE= NMR SPECTRUM
##DATA CLASS= NTUPLES
##ORIGIN= BRUKER
##OWNER= Administrator
$$ 1.72 TOPSPIN		Version 2.1
$$ 2015-07-02 04:53:33.102 -0700  Administrator@X
$$ Compression mode = diff/dup
##.OBSERVE FREQUENCY= 400.02188249412
##.OBSERVE NUCLEUS= ^1H
##.ACQUISITION MODE= SIMULTANEOUS (DQD)
##.ACQUISITION SCHEME= undefined
##.AVERAGES= 64
##.DIGITISER RES= 22
##SPECTROMETER/DATA SYSTEM= spect
##.PULSE SEQUENCE= noesygpps1d.comp
##.SOLVENT NAME= COFFEE_meoh
##.SHIFT REFERENCE= INTERNAL, COFFEE_meoh, 1, 14.96276
##AUDIT TRAIL= $$ (NUMBER, WHEN, WHO, WHERE, PROCESS, VERSION, WHAT)
$$ ##TITLE= Audit trail, TOPSPIN		Version 2.1
$$ ##JCAMPDX= 5.01
$$ ##ORIGIN= Bruker BioSpin GmbH
$$ ##OWNER= Administrator
$$ $$ E:\/data/COFFEE/nmr/NES1037_878015026_9242866_9XMLrb76ax/32/pdata/1/auditp.txt
$$ ##AUDIT TRAIL=  $$ (NUMBER, WHEN, WHO, WHERE, PROCESS, VERSION, WHAT)
(   1,<2015-07-02 04:53:27.789 -0700>,<Administrator>,<X>,<go>,<TOPSPIN 2.1>,
      <created by zg
	started at 2015-07-02 04:41:58.117 -0700,
	POWCHK enabled, PULCHK disabled,
       configuration hash MD5:
       21 0F 79 D6 B3 7B B4 F6 88 20 88 DB 03 48 BD 9F
       data hash MD5: 64K
       B1 69 D7 A4 F3 1B 80 FD F6 40 16 64 AF 8F DF FF>)
(   2,<2015-07-02 04:53:31.008 -0700>,<Administrator>,<X>,<proc1d>,<TOPSPIN 2.1>,
      <Start of raw data processing
       efp LB = 0.3 FT_mod = 6 PKNL = 1 PHC0 = 0 PHC1 = 0 SI = 128K 
       data hash MD5: 128K
       05 A9 8B C2 FB FF 03 FE 9C AA 64 92 50 B9 0C 97>)
(   3,<2015-07-02 04:53:31.867 -0700>,<Administrator>,<X>,<proc1d>,<TOPSPIN 2.1>,
      <pk PHC0 = -87.1106 PHC1 = 0 
       data hash MD5: 128K
       A9 C5 6C 65 BC 7E F1 0B 94 FD 85 B5 DC 34 F1 95>)
(   4,<2015-07-02 04:53:32.258 -0700>,<Administrator>,<X>,<proc1d>,<TOPSPIN 2.1>,
      <abs ABSG = 1 
       data hash MD5: 128K
       91 DA B8 5D D6 2D F1 A2 D1 5E 21 BF 08 E2 5F 57>)
(   5,<2015-07-02 04:53:32.352 -0700>,<Administrator>,<X>,<proc1d>,<TOPSPIN 2.1>,
      <abs ABSG = 2 
       data hash MD5: 128K
       11 72 F7 17 68 96 C5 7F 51 D2 EC 08 B7 F4 93 3B>)
(   6,<2015-07-02 04:53:32.445 -0700>,<Administrator>,<X>,<proc1d>,<TOPSPIN 2.1>,
      <abs ABSG = 3 
       data hash MD5: 128K
       BB 07 B7 A7 FD 09 B2 5A 22 10 96 3A 9C 75 23 9E>)
(   7,<2015-07-02 04:53:32.555 -0700>,<Administrator>,<X>,<proc1d>,<TOPSPIN 2.1>,
      <abs ABSG = 4 
       data hash MD5: 128K
       C4 47 6F 9A 9A 68 25 22 E5 CF C0 87 FF 30 FE 5D>)
(   8,<2015-07-02 04:53:32.664 -0700>,<Administrator>,<X>,<proc1d>,<TOPSPIN 2.1>,
      <abs ABSG = 5 
       data hash MD5: 128K
       9C 08 2F 55 D9 04 45 43 07 26 1C A8 0A 54 CA 2C>)
$$ ##END=
$$ 
$$ $$ hash MD5
$$ $$ 2C AA 18 47 14 4B 20 C0 33 40 6D E6 E1 6A DF C8
##$RELAX= 
##$RELAX= 
##$RELAX= 
##$RELAX= 
##$RELAX= 
##$RELAX= 
##$RELAX= 
##$RELAX= 
$$ Bruker specific parameters
$$ --------------------------
##$DU= <E:\>
##$EXPNO= 32
$$ [...]
150 150 150 150 150 150 150 150
##$TP07= 0
##$TPNAME0= <>
##$TPNAME1= <>
##$TPNAME2= <>
##$TPNAME3= <>
##$TPNAME4= <>
##$TPNAME5= <>
##$TPNAME6= <>
##$TPNAME7= <>
##$TPOAL= (0..7)
0.5 0.5 0.5 0.5 0.5 0.5 0.5 0.5
##$TPOFFS= (0..7)
0 0 0 0 0 0 0 0
##$TUNHIN= 0
##$TUNHOUT= 0
##$TUNXOUT= 0
##$USERA1= <user>
##$USERA2= <user>
##$USERA3= <user>
##$USERA4= <user>
##$USERA5= <user>
##$V9= 5
##$VALIST= <valist>
##$VCLIST= <CCCCCCCCCCCCCCC>
##$VD= 0
##$VDLIST= <DDDDDDDDDDDDDDD>
##$VPLIST= <PPPPPPPPPPPPPPP>
##$VTLIST= <TTTTTTTTTTTTTTT>
##$WBST= 2048
##$WBSW= 25
##$XGAIN= (0..3)
0 0 0 0
##$XL= 0
##$YL= 0
##$YMAX_a= 6415385
##$YMIN_a= -11958305
##$ZGOPTNS= <>
##$ZL1= 120
##$ZL2= 120
##$ZL3= 120
##$ZL4= 120
##$ABSF1= 14.96276
##$ABSF2= -5.595422
##$ABSG= 5
##$ABSL= 3
##$ALPHA= 0
##$AQORDER= 0
##$ASSFAC= 0
##$ASSFACI= 0
##$ASSFACX= 0
##$ASSWID= 0
##$AUNMP= <proc_prof1d_extract.lims>
##$AXLEFT= 0
##$AXNAME= <>
##$AXNUC= <1H>
##$AXRIGHT= 0
##$AXTYPE= 0
##$AXUNIT= <>
##$AZFE= 0.1
##$AZFW= 0.1
##$BCFW= 0
##$BC_mod= 0
##$BYTORDP= 0
##$COROFFS= 0
##$CY= 15
##$DATMOD= 1
##$DC= 0
##$DFILT= <>
##$DTYPP= 0
##$F1P= 0
##$F2P= 0
##$FCOR= 0.5
##$FTSIZE= 131072
##$FT_mod= 6
##$GAMMA= 0
##$GB= 0
##$INTBC= 1
##$INTSCL= 1
##$ISEN= 128
##$LB= 0.3
##$LEV0= 0
##$LPBIN= 0
##$MAXI= 10000
##$MC2= 0
##$MEAN= 0
##$ME_mod= 0
##$MI= 0
##$NCOEF= 0
##$NC_proc= -2
##$NLEV= 6
##$NOISF1= 0
##$NOISF2= 0
##$NSP= 0
##$NTH_PI= 0
##$NZP= 0
##$OFFSET= 14.96276
##$PC= 1
##$PHC0= -87.1106
##$PHC1= 0
##$PH_mod= 1
##$PKNL= yes
##$PPARMOD= 0
##$PPDIAG= 0
##$PPIPTYP= 0
##$PPMPNUM= 2147483647
##$PPRESOL= 1
##$PSCAL= 4
##$PSIGN= 0
##$PYNMP= <proc.py>
##$REVERSE= no
##$SF= 400.02000893187
##$SI= 131072
##$SIGF1= 0
##$SIGF2= 0
##$SINO= 400
##$SIOLD= 131072
##$SPECTYP= <>
##$SREGLST= <1H.CDCl3>
##$SSB= 0
##$STSI= 131072
##$STSR= 0
##$SW_p= 8223.68421052631
##$SYMM= 0
##$S_DEV= 0
##$TDeff= 65536
##$TDoff= 0
##$TI= <>
##$TILT= no
##$TM1= 0
##$TM2= 0
##$TOPLEV= 0
##$USERP1= <user>
##$USERP2= <user>
##$USERP3= <user>
##$USERP4= <user>
##$USERP5= <user>
##$WDW= 1
##$XDIM= 131072
##$YMAX_p= 330087861
##$YMIN_p= -11119
##$CURPLOT= <Network HP LaserJet P1505>
##$CURPRIN= <$Network HP LaserJet P1505>
##$DFORMAT= <normdp>
##$LAYOUT= <+/1D_H.xwp>
##$LFORMAT= <normlp>
##$PFORMAT= <normpl>
##$SURQMSG= 1
$$ End of Bruker specific parameters
$$ ---------------------------------
##NTUPLES= NMR SPECTRUM
##VAR_NAME=  FREQUENCY,     SPECTRUM/REAL,   SPECTRUM/IMAG
##SYMBOL=    X,             R,               I
##VAR_TYPE=  INDEPENDENT,   DEPENDENT,       DEPENDENT
##VAR_FORM=  AFFN,          ASDF,            ASDF
##VAR_DIM=   131072,        131072,          131072
##UNITS=     HZ,            ARBITRARY UNITS, ARBITRARY UNITS
##FACTOR=    0.0627417313425164, 1,          1
##FIRST=     8223.62146879497, -2483,        -44495
##LAST=      0,             -615,            -45573
##MIN=       0,             -11119,          0
##MAX=       8223.62146879497, 330087861,    0
$$ Real data points
##PAGE= N=1
##DATA TABLE= (X++(R..R)), XYDATA
$$ [...]
63518A51398k285j482j235j888k470j979o79L07M26J54J40M15O31O08M64L94N33
63501A43452R11J374J598J376Q62M35L27N22R44J550K203K647K790K876L109L229
63485A70205K748J701P98O74J177J635J650J451J564K247L181L622L178K438K439
63470B00708L321M016L630K618K026J971J745J152Q12J047J368J410J563K247
63456B29634L172L829M247M807N668O839Q361R928J0830J0828J0846J1984J4014
63443C34987J5524J5576J4560J3232J1540Q849N114J380r75j550j336j692k868
63430D12341l852l809l103k582k334j893j426j769l222n051o503p677q971j0218
63416C49931j0801j0419r307p927o721n970n532m958m094l431l461l938m120l663
$$ y = [151398, 149113, 147631, 146396, 144508, 142038, 140059, 139380, 139687, 140113, 140267, 140407, 140822, 141453, 142061, 142525, 142919, 143452, 144363, 145737, 147335, 148711, 149573, 150008, 150335, 150857, 151801, 153351, 155554, 158201, 160991, 163867, 166976, 170205, 172953, 174654, 175452, 176126, 177303, 178938, 180588, 182039, 183603, 185850, 189031, 192653, 195831, 198269, 200708, 204029, 208045, 211675, 214293, 216319, 218290, 220035, 221187, 221999, 223046, 224414, 225824, 227387, 229634, 232806, 236635, 240882, 245689, 251357, 258196, 266557, 276485, 287315, 298143, 308989, 320973, 334987, 350511, 366087, 380647, 393879, 405419, 414268, 419382, 420762, 419787, 418237, 416901, 415209, 412341, 408489, 404680, 401577, 398995, 396661, 394768, 393342, 391573, 388351, 383300, 376797, 369120, 360149, 349931, 339130, 328711, 319404, 311477, 304756, 298786, 293254, 288296, 284202, 280771, 277310, 273372, 269252, 265589]
63402B65589k872k091j273k54Q54J799K500L151M037N292O673P663P972P941Q246
63387C15227R190J0438J1566J2544J3522J4259J4050J2295R167N644K876J249
63375D32027J32j377l332m862n185m476l476k582j684p46l8K35J01n15j930m190
63359C98102o679q540r353r289q740q017p287o530n579m428l387k775k577k596
63345C12325k830l404m194m802m991m876m688m549m462m420m391m309m104l719
63331B52586l208k816k744k716k201j254o98j017j488j163l56j95q42j231p66
63316B29891j53o2M3Q87K067K606K355J902J496R63M59L31K97k44j139j540j218
63299B38941r28j239j696j569q15R7Q35J286J336J000N03O4k45l11rM19M91J38
$$ y = [265589, 262717, 260626, 259353, 259099, 259953, 261752, 264252, 267403, 271440, 276732, 283405, 291068, 299040, 306981, 315227, 324417, 334855, 346421, 358965, 372487, 386746, 400796, 413091, 422258, 427902, 430778, 432027, 432159, 430782, 427450, 422588, 417403, 412927, 409451, 406869, 405185, 404439, 404401, 404636, 404737, 404222, 402292, 398102, 391423, 382883, 373530, 364241, 355501, 347484, 340197, 333667, 328088, 323660, 320273, 317498, 314921, 312325, 309495, 306091, 301897, 297095, 292104, 287228, 282540, 277991, 273529, 269109, 264718, 260409, 256305, 252586, 249378, 246562, 243818, 241102, 238901, 237647, 236949, 235932, 234444, 233281, 232925, 232730, 231888, 230657, 229891, 229738, 229676, 229719, 230606, 232673, 235279, 237634, 239536, 241032, 241995, 242454, 242785, 243082, 242838, 241699, 240159, 238941, 238013, 236774, 235078, 233509, 232694, 232791, 233626, 234912, 236248, 237248, 237751, 237815, 237570, 237259, 237250, 237669, 238160, 238298]
63281B38298j78k10k93n97n42M35J811K372J657N56J76N89R44P36N05J077K284
63264B49620K947K319J112O77J396K467L076L185L107L034L116L532M150M598
63250B88336M859N305O028O667P141P914R121J0128J0440J0538J1212J2564J4182
63237D04435J5829J7282J7982J7740J7406J7939J8977J9202J8075J6350J4819
63226E96036J3545J2571J2462J3520J5066J6095J6370J6370J6407J6143J4987
63215G59572J2663R352N413J017l809q681j2785j5602j7549j9407k1215k2261
63203F66708k2154k1343k0424j9368j7706j5121j1719q037m845k629j120M26K457
63190E25125M909P592J0343J2842J4864J6664J8513J9914K0043J9086J8296J8415
$$ y = [238298, 238120, 237910, 237617, 237020, 236478, 236913, 238724, 241096, 242753, 243309, 243485, 244074, 245018, 245754, 246259, 247336, 249620, 252567, 254886, 255998, 256675, 258071, 260538, 263614, 266799, 269906, 272940, 276056, 279588, 283738, 288336, 293195, 298500, 304528, 311195, 318336, 326250, 335371, 345499, 355939, 366477, 377689, 390253, 404435, 420264, 437546, 455528, 473268, 490674, 508613, 527590, 546792, 564867, 581217, 596036, 609581, 622152, 634614, 648134, 663200, 679295, 695665, 712035, 728442, 744585, 759572, 772235, 781587, 787000, 788017, 784208, 775527, 762742, 747140, 729591, 710184, 688969, 666708, 644554, 623211, 602787, 583419, 565713, 550592, 538873, 530836, 525991, 523362, 522242, 522668, 525125, 530034, 537626, 547969, 560811, 575675, 592339, 610852, 630766, 650809, 669895, 688191, 706606]
63178G06606J8871J8962J8971J9379J9724J9120J7523J5693J4150J2786J1261
63167H93046R166O068J979k410o558j0760j5414j9955k3402k5705k7609k9257
63155G49189k9885k8986k7015k4751k2673k1057j9955j8858j7094j4792j2793
63144E11330j1405j0035q327o835o058n602m895m059l416k761j863j228j464k206
63130D41176k497k070j450r29k74N07R63R30Q14Q56P81M59L20P27J335J516J164
63113D44328O95M80O09J044J652K198K509K600K525K264J907J757K001K398K534
63098D71501K279J886J731K052K815L625L964L731L402L422L679L824L951M492
63084E16354N503O464O892O814O539O264O068O066O413P178Q248R166R296Q499
$$ y = [706606, 725477, 744439, 763410, 782789, 802513, 821633, 839156, 854849, 868999, 881785, 893046, 902212, 908280, 910259, 907849, 901291, 890531, 875117, 855162, 831760, 806055, 778446, 749189, 719304, 690318, 663303, 638552, 615879, 594822, 574867, 556009, 538915, 524123, 511330, 499925, 489890, 481563, 474728, 468670, 463068, 458173, 454114, 450698, 447937, 446074, 444846, 443382, 441176, 438679, 436609, 435159, 434230, 433956, 434463, 435426, 436356, 437170, 438026, 438807, 439266, 439586, 440313, 441648, 443164, 444328, 445023, 445503, 446112, 447156, 448808, 451006, 453515, 456115, 458640, 460904, 462811, 464568, 466569, 468967, 471501, 473780, 475666, 477397, 479449, 482264, 485889, 489853, 493584, 496986, 500408, 504087, 507911, 511862, 516354, 521857, 528321, 535213, 542027, 548566, 554830, 560898, 566964, 573377, 580555, 588803, 597969, 607265, 615764]
63070F15764P635P856R286J0862J1678J2003J2694J4082J5954J8134K0496K2639
63058G79083K4241K5643K7510K9962L2482L4606L6178L7041L7169L7047L7223
63047A138185L7411L6862L5652L4845L5018L5489L5481L5260L5375L5572L5265
63036A530415L4572L3878L2655K9752K4784J8425J1260L266n441j4201k2484l0406
63024A646475l8088m4926m9862n2219n2178n0641m8632m6473m3557l9228l3800
63013A146871k8200k2827j7413j2002p108k691K157P952J3918J8946K2879K6193
63001A148675K8892L0557L1221L1526L1928L2344L2524L2411L2065L1622L1268
62990A495033L0997L0449K9171K6947K3704J9313J3782P403L99p309j5675k4267
$$ y = [615764, 623399, 631255, 640541, 651403, 663081, 675084, 687778, 701860, 717814, 735948, 756444, 779083, 803324, 828967, 856477, 886439, 918921, 953527, 989705, 1026746, 1063915, 1100962, 1138185, 1175596, 1212458, 1248110, 1282955, 1317973, 1353462, 1388943, 1424203, 1459578, 1495150, 1530415, 1564987, 1598865, 1631520, 1661272, 1686056, 1704481, 1715741, 1719007, 1713566, 1699365, 1676881, 1646475, 1608387, 1563461, 1513599, 1461380, 1409202, 1358561, 1309929, 1263456, 1219899, 1180671, 1146871, 1118671, 1095844, 1078431, 1066429, 1059321, 1056630, 1058787, 1066739, 1080657, 1099603, 1122482, 1148675, 1177567, 1208124, 1239345, 1270871, 1302799, 1335143, 1367667, 1400078, 1432143, 1463765, 1495033, 1526030, 1556479, 1585650, 1612597, 1636301, 1655614, 1669396, 1676799, 1677198, 1669889, 1654214, 1629947]
62978A629947l2741m1184m9443n6486o1167o3449o4206o3970o2652o0392n7789
62967A016468n5080n1819m7750m3394l9409l5854l2482k9342k6654k4358k2193
62956F08133k0007j7794j5568j3433j1616j0315r657r769j0526j1259j1160j0177
62944D56852r019q126p166n807m464l722l461l158k731k467k295j788r75n36j033
62929D00104k250l490m203m271l944l667l752m070m213m040l891m138m673m963
62915C44539m603l704k718j984j494j079p18n34n54o30o39o20o86q60j072j161
62899C21483r46m66j16k65p66j172j423j940k820l416l116k203j564j597j865
62884B97808j780j299q56q38j186j499j484j325j365j479j109r9Q86J130P51L91
$$ y = [1629947, 1597206, 1556022, 1506579, 1450093, 1388926, 1325477, 1261271, 1197301, 1134649, 1074257, 1016468, 961388, 909569, 861819, 818425, 779016, 743162, 710680, 681338, 654684, 630326, 608133, 588126, 570332, 554764, 541331, 529715, 519400, 509743, 499974, 489448, 478189, 467029, 456852, 447833, 439707, 432541, 426734, 422270, 418548, 415087, 411929, 409198, 406731, 404436, 402648, 401673, 401137, 400104, 397854, 394364, 390161, 385890, 381946, 378279, 374527, 370457, 366244, 362204, 358313, 354175, 349502, 344539, 339936, 336232, 333514, 331530, 330036, 328957, 328239, 327705, 327151, 326521, 325882, 325262, 324576, 323716, 322644, 321483, 320537, 320071, 319955, 319690, 318924, 317752, 316329, 314389, 311569, 308153, 305037, 302834, 301270, 299673, 297808, 296028, 294729, 293873, 293035, 291849, 290350, 288866, 287541, 286176, 284697, 283588, 283489, 284375, 285505, 286256, 286647]
62868B86647L15L31L88O68J079J226J047R23J040J015M57m20j037j118r09q42
62852B90810j102j492j611j286p81m37k55l0K18L00K97M55O14K50o81j405j174
62835B82690j72Q40J472J880K120J952J373R62J323K342L313L767L903M107M347
62820C16219M312M040L943M149M259M001L712L800M091M193M289M894N990P014
62806C78906P785Q670R748J0472J0592J0720J1568J3053J4672J6360J8339K0527
62794E31412K2758K5454K9296L4213L9238M3559M7220N0681N4150N7595O0983
62783I96559O4115O6474O7569O7354O5963O3060N7859N0010M0236K9771J9202
62772A588172Q169l622j5470k6185l5347m3491n0987n7244o1393o3365o3889o3610
$$ y = [286647, 286962, 287293, 287681, 288349, 289428, 290654, 291701, 292624, 293664, 294679, 295136, 294716, 293679, 292561, 291652, 290810, 289708, 288216, 286605, 285319, 284538, 284101, 283846, 283816, 284034, 284334, 284631, 285086, 285700, 285950, 285269, 283864, 282690, 282518, 283358, 284830, 286710, 288830, 290782, 292155, 293117, 294440, 296782, 300095, 303862, 307765, 311872, 316219, 320531, 324571, 328514, 332663, 336922, 340923, 344635, 348435, 352526, 356719, 361008, 365902, 371892, 378906, 386691, 395361, 405109, 415581, 426173, 436893, 448461, 461514, 476186, 492546, 510885, 531412, 554170, 579624, 608920, 643133, 682371, 725930, 773150, 823831, 877981, 935576, 996559, 1060674, 1127148, 1194717, 1262071, 1328034, 1391094, 1448953, 1498963, 1539199, 1568970, 1588172, 1596341, 1592719, 1577249, 1551064, 1515717, 1472226, 1421239, 1363995, 1302602, 1239237, 1175348, 1111738]
62760A111738o2668o0982n8563n5446n1730m7764m4045m0852l8008l5116l1909
62749E84655k8476k5211k2451k0141j7988j5987j4432j3262j1842r749p508n975
62737C91633n212m500l413k266j443q42j37Q32K139L766N320O204O351O480P310
62722D12222Q804J0480J2074J3602J5038J6370J7794J9504K1483K3807K6917L1029
62710F29124L5499L9341M2456M5794N0075N4887N9376O3262O6682O9225O9896
62699A225617O8168O4567N9881N4067M6341L6246K4314J1639q93j2933k4461l5448
62687A517105m5566n4134o0543o4841o7616o9143o9005o6911o3601o0317n7438
62676H37990n4248n0149m5568m1337l7688l4290l0975k7906k5133k2468j9771
$$ y = [1111738, 1049070, 988088, 929525, 874079, 822349, 774585, 730540, 689688, 651680, 616564, 584655, 556179, 530968, 508517, 488376, 470388, 454401, 439969, 426707, 414865, 405116, 397608, 391633, 386421, 381921, 378508, 376242, 374799, 373957, 373820, 374652, 376791, 380557, 385877, 392081, 398432, 404912, 412222, 421026, 431506, 443580, 457182, 472220, 488590, 506384, 525888, 547371, 571178, 598095, 629124, 664623, 703964, 746420, 792214, 842289, 897176, 956552, 1019814, 1086496, 1155721, 1225617, 1293785, 1358352, 1418233, 1472300, 1518641, 1554887, 1579201, 1590840, 1589947, 1577014, 1552553, 1517105, 1471539, 1417405, 1356862, 1292021, 1224405, 1155262, 1086257, 1019346, 955745, 895428, 837990, 783742, 733593, 688025, 646688, 609000, 574710, 543735, 515829, 490696, 468228, 448457]
62665D48457j7117j4673j2673j1406j0906j0729j0287r466q605p950p390o797
62653C20458o214n653n008m350m009m134m402m318l697k647j380k47K53j08q92
62638B73652j365j247q86o69o31o82q44j079j095o96j56O5nJ78R56J932K446K415
62620B72289K435K981L756M085L894L977N107P083Q878R790J0155J0829J2242
62607C57501J4194J6367J8695K1137K3488K5621K7715L0015L2432L4483L5600
62596F37248L5402L3763L0854K7086K2885J8343J3258P478J233m933j0543j5492
62584G96582j9986k4143k7704l0221l1486l1649l0903k9354k7314k5397k3945
62573D94480k2564k0607j8076j5640j3721j2028j0237q645p762p482p146o420
$$ y = [448457, 431340, 416667, 403994, 392588, 381682, 370953, 360666, 351200, 342595, 334645, 327255, 320458, 314244, 308591, 303583, 299233, 295224, 291090, 286688, 282370, 278673, 276026, 274646, 274399, 274652, 274544, 273652, 272287, 271040, 270154, 269485, 268854, 268172, 267328, 266249, 265154, 264458, 264302, 264367, 264362, 264540, 265496, 267428, 269874, 272289, 274724, 277705, 281461, 285546, 289440, 293417, 298524, 305607, 314485, 324275, 334430, 345259, 357501, 371695, 388062, 406757, 427894, 451382, 477003, 504718, 534733, 567165, 601648, 637248, 672650, 706413, 737267, 764353, 787238, 805581, 818839, 826317, 827550, 822617, 812074, 796582, 776596, 752453, 724749, 694528, 663042, 631393, 600490, 571136, 543822, 518425, 494480, 471916, 451309, 433233, 417593, 403872, 391844, 381607, 372962, 365200, 357718, 350572, 344152]
62561C44152n677n403n503n453n055m733n050n927o560o189m903l567k930k988
62547B74214l147k787j639Q3J684K423K274K051K523L547M445N071N907P164Q394
62532C12207R217R944J1044J2484J4033J5865J8287K1015K3388K5287K7256K9634
62520E29661L2065L4106L5735L6936L7240L6197L3976L0994K7153K2084J5965
62509H72112R506L038l700j0674j7061k2099k5994k9420l2385l4180l4412l3498
62497F41233l2056l0314k8327k6307k4367k2194j9454j6459j4070j2759j2109
62486D02817j1365j0280r162q215p238o065m952m252l839l217k199j136m16K3
62472C30504M81J076J707K332K994L635M062M167M099M186M698N615O645P569
$$ y = [344152, 338475, 333072, 327569, 322116, 317061, 312328, 307278, 301351, 294791, 288602, 283699, 280132, 277202, 274214, 271067, 268280, 266641, 266724, 268408, 270831, 273105, 275156, 277679, 281226, 285671, 290742, 296649, 303813, 312207, 321424, 331368, 342412, 354896, 368929, 384794, 403081, 424096, 447484, 472771, 500027, 529661, 561726, 595832, 631567, 668503, 705743, 741940, 775916, 806910, 834063, 856147, 872112, 881618, 884656, 880956, 870282, 853221, 831122, 805128, 775708, 743323, 709143, 674731, 641233, 609177, 578863, 550536, 524229, 499862, 477668, 458214, 441755, 427685, 414926, 402817, 391452, 381172, 372010, 363795, 356557, 350492, 345540, 341288, 337449, 334232, 332033, 330897, 330481, 330504, 330985, 332061, 333768, 336100, 339094, 342729, 346791, 350958, 355057, 359243, 363941, 369556, 376201, 383770]
62458C83770Q522R651J0566J0494R220P468O016M769L148J090r67k944n274q045
62444D37484j0555j2090j2653j2652j2207j1224r946q981q668q637q154o917n409
62431C09391m382l956l491k496j314n63j33N68J534K052J928K008L078M777O079
62416C15080O500O299N880N548N579N997O369O344O164O176O125N522M629M244
62402C96456M500M586L904K826J970J315N40k72q52j434k537l970m700l930k058
62387C96344j65J281K779M824O969Q311Q765R365J1098J3845J6788J9492K2107
62374E21803K4654K6756K8150K9012K9534K9529K8722K7204K5309K3143K0460
62363H14276J7027J2989Q858N205K337K08j487l173n380q462j2194j5739j8350
$$ y = [383770, 392292, 401943, 412509, 423003, 432223, 439691, 445707, 450476, 453624, 454714, 453747, 450803, 445529, 437484, 426929, 414839, 402186, 389534, 377327, 366103, 356157, 347176, 338508, 329871, 321717, 314800, 309391, 305009, 301053, 297562, 295066, 293752, 293189, 293056, 293624, 295158, 297210, 299138, 301146, 304224, 309001, 315080, 321580, 327879, 333759, 339307, 344886, 350883, 357252, 363596, 369760, 375936, 382061, 387583, 392212, 396456, 400956, 405542, 409446, 412272, 414242, 415557, 416097, 415825, 414973, 413539, 411002, 407032, 402332, 398402, 396344, 396179, 397460, 400239, 405063, 412032, 420343, 429108, 438473, 449571, 463416, 480204, 499696, 521803, 546457, 573213, 601363, 630375, 659909, 689438, 718160, 745364, 770673, 793816, 814276, 831303, 844292, 853150, 858355, 860692, 860900, 859413, 856240, 850860, 842398, 830204, 814465, 796115]
62350G96115j9971k0991k1527k1348k0423j9117j7766j6381j4894j3433j2190
62339E98074j1264j0713j0599j0935j1668j2639j3385j3168j1697r690q220p438
62327D66658o550n120l725k992k693k252j629j080m60M39J217J257P20L53L29
62312D44472J1q94j713j743j255j004j154j253j181j417k220l093l365l083k855
62297D18253k900k716j898q76m57p47j056q09q0R33K415M442O461P724Q151Q245
62281D45085Q326Q375Q584R405J0909J2629J4319J6386J9219K2400K5088K6914
62269F27639K8061K8582K8196K6831K4913K2865K0599J7749J4171J0057N717J536
62257H56916k110n222q363j1979j5656j8510k0326k1737k3040k3542k2600k0759
$$ y = [796115, 776144, 755153, 733626, 712278, 691855, 672738, 654972, 638591, 623697, 610264, 598074, 586810, 576097, 565498, 554563, 542895, 530256, 516871, 503703, 492006, 482316, 474096, 466658, 460108, 454988, 451263, 448271, 445578, 443326, 441697, 440617, 440157, 440596, 441813, 443070, 443790, 444143, 444472, 444483, 443589, 441876, 440133, 438878, 437874, 436720, 435467, 434286, 432869, 430649, 427556, 424191, 421108, 418253, 415353, 412637, 410739, 409863, 409406, 408659, 407603, 406794, 406714, 407647, 410062, 414504, 420965, 428689, 436840, 445085, 453411, 461786, 470370, 479775, 490684, 503313, 517632, 534018, 553237, 575637, 600725, 627639, 655700, 684282, 712478, 739309, 764222, 787087, 807686, 825435, 839606, 849663, 855380, 856916, 854806, 849584, 841221, 829242, 813586, 795076, 774750, 753013, 729973, 706431, 683831, 663072]
62245F63072j9083j7724j5980j3616j1199r065o927m806l403l002k775j829m30
62232E53233N42Q40Q76R13R37J069J368J521J420J687K871M338M943M630M379
62217E85567M593M710M491M582N319O045O219O281O749P274P347P285P694Q480
62203F72636R177R827J0647J1245J1059J0388J0135J0603J1245J1575J1574J1294
62191H01405J0763J0296J0257J0472J0500J0462J1001J2368J4195J6142J8110
62180I35971J9830K0952K1597K2028K1783K0055J7066J4086J1737R369O623M455
62168A125552L675L437K331M17j097j852k694m100n429o025o012n673m871l533
62154A094126k062p87N16K100L642M557M668M254L675L173K746K056P57q36j800
$$ y = [663072, 643989, 626265, 610285, 596669, 585470, 576405, 569478, 564672, 561269, 558267, 555492, 553663, 553233, 553775, 554615, 555491, 556404, 557341, 558410, 559778, 561299, 562719, 564406, 567277, 571615, 576558, 581188, 585567, 590160, 594870, 599361, 603943, 609262, 615307, 621526, 627807, 634556, 641830, 649177, 656462, 664156, 672636, 681813, 691640, 702287, 713532, 724591, 734979, 745114, 755717, 766962, 778537, 790111, 801405, 812168, 822464, 832721, 843193, 853693, 864155, 875156, 887524, 901719, 917861, 935971, 955801, 976753, 998350, 1020378, 1042161, 1062216, 1079282, 1093368, 1105105, 1114474, 1121097, 1125552, 1129227, 1132664, 1134995, 1135412, 1134315, 1132463, 1129769, 1125669, 1120240, 1114215, 1108203, 1102530, 1097659, 1094126, 1092064, 1091277, 1091793, 1093893, 1097535, 1102092, 1106760, 1111014, 1114689, 1117862, 1120608, 1122664, 1123421, 1122585, 1120785]
62139A120785j623q15k12P7O19J762L195M296M622M169L454L190L615M245M500
62124A155879M390M314M374M305L954L433K823K202J870K126K734L048K823K484
62110A200759K379K207J591Q87Q73J660K434K477K077K086K737L364L371L074
62096A231976L204L774M000L470K827K925L677M293M495M828N709O762P414P691
62082A297045Q011Q454Q727Q725Q665Q583Q051O594M242J490j237l885o461q612
62068A348392r834j0212j0625j1862j3686j5228j6301j7658j9779k1979k3246
62057A177982k3473k3245k2668k1287j9200j7402j6611j6327j5640j4518j3747
62046I73864j3631j3477j2482j0737r108q299q277q468q340p803p160o757o672
$$ y = [1120785, 1119162, 1118347, 1118135, 1118212, 1118831, 1120593, 1123788, 1128084, 1132706, 1136875, 1140329, 1143519, 1147134, 1151379, 1155879, 1160269, 1164583, 1168957, 1173262, 1177216, 1180649, 1183472, 1185674, 1187544, 1189670, 1192404, 1195452, 1198275, 1200759, 1203138, 1205345, 1206936, 1207823, 1208696, 1210356, 1212790, 1215267, 1217344, 1219430, 1222167, 1225531, 1228902, 1231976, 1235180, 1238954, 1242954, 1246424, 1249251, 1252176, 1255853, 1260146, 1264641, 1269469, 1275178, 1281940, 1289354, 1297045, 1305056, 1313510, 1322237, 1330962, 1339627, 1348210, 1356261, 1362855, 1367097, 1368587, 1367350, 1363465, 1357004, 1348392, 1338558, 1328346, 1317721, 1305859, 1292173, 1276945, 1260644, 1242986, 1223207, 1201228, 1177982, 1154509, 1131264, 1108596, 1087309, 1068109, 1050707, 1034096, 1017769, 1002129, 987611, 973864, 960233, 946756, 934274, 923537, 914429, 906130, 897853, 889385, 881045, 873242, 866082, 859325, 852653]
62033H52653o722o747o698o527o165n720n544n865o421o678o420n949n582n237
62019G66378m683m017l602l576l741l912m074m062l515k435j544j598k320k570
62005G20729j702m40o3r39k239l009l155l235l659m328m915n238n348n380n324
61990F71755m945m023k849k245k805m115n023m793l668k297j037o3K88j05o17
61975F33458l41Q25K052K672K914L261L675L870M026M614N617O478O880P147P723
61960F94871Q595R456J0158J0817J1625J2650J3791J4797J5535J6244J7404J9170
61948H55113K1202K3117K4888K6584K7989K8879K9562L0692L2390L3974L4887
61937A169277L5628L7339M0451M4173M7442N0102N2852N6264O0305O4771O9802
$$ y = [852653, 845931, 839184, 832486, 825959, 819794, 814074, 808530, 802665, 796244, 789566, 783146, 777197, 771615, 766378, 761695, 757678, 754076, 750500, 746759, 742847, 738773, 734711, 731196, 728761, 727217, 725619, 723299, 720729, 719027, 718587, 718524, 717585, 715346, 712337, 709182, 705947, 702288, 697960, 693045, 687807, 682459, 677079, 671755, 666810, 662787, 659938, 657693, 654888, 650773, 645750, 640957, 637289, 634992, 633955, 633892, 634180, 634075, 633458, 633117, 633942, 635994, 638666, 641580, 644841, 648516, 652386, 656412, 661026, 666643, 673121, 680001, 687148, 694871, 703466, 712922, 723080, 733897, 745522, 758172, 771963, 786760, 802295, 818539, 835943, 855113, 876315, 899432, 924320, 950904, 978893, 1007772, 1037334, 1068026, 1100416, 1134390, 1169277, 1204905, 1242244, 1282695, 1326868, 1374310, 1424412, 1477264, 1533528, 1593833, 1658604, 1728406]
61926A728406P5706Q2574R0308R8860J08120J17718J27289J37017J47518J59028
61916B872544J70900J82117J92084K00661K07536K11934K12981K10032K02377
61907D663166J88906J68592J41465J08852P2452L3373p630m9097q8584j23648
61897E107847j53006j76561j94618k07298k14604k16729k14261k08271k00101
61888C322398j90827j80838j70071j58577j46731j34963j23585j12911j03195
61879B000700r4345q6019p8148p1141o5314o0333n5508n0534m5656m1145l6912
61868A315645l2740k8692k5076k2085j9568j7183j4715j2225r933p950o200m554
61856A114724l014j705p84l59l83n94o44m16j68j89l72k66M31J512K477L018L286
$$ y = [1728406, 1804112, 1886686, 1976994, 2075854, 2183974, 2301692, 2428981, 2565998, 2713516, 2872544, 3043444, 3225561, 3417645, 3618306, 3825842, 4037776, 4250757, 4460789, 4663166, 4852072, 5020664, 5162129, 5270981, 5343433, 5376806, 5369176, 5320079, 5231495, 5107847, 4954841, 4778280, 4583662, 4376364, 4161760, 3945031, 3730770, 3522499, 3322398, 3131571, 2950733, 2780662, 2622085, 2475354, 2340391, 2216806, 2103895, 2000700, 1906355, 1820336, 1742188, 1671047, 1605733, 1545400, 1489892, 1439358, 1393702, 1352557, 1315645, 1282905, 1254213, 1229137, 1207052, 1187484, 1170301, 1155586, 1143361, 1133428, 1125478, 1119278, 1114724, 1111710, 1110005, 1109221, 1108862, 1108479, 1107885, 1107241, 1106825, 1106657, 1106468, 1106096, 1105830, 1106261, 1107773, 1110250, 1113268, 1116554]
61839A116554L730M712O162P547Q272Q235P937P913Q144Q237Q183Q588R829J1302
61825A225345J2007J1946J2322J4041J6479J8307J9256K0365K2517K5419K8334
61814A426338L1183L4374L7938M1444M4625M7588N0511N3648N7562O2733O8817
61803A956761P4838Q0337Q5941R2513J00233J08854J18359J28825J39896J51124
61793C037681J62754J75566J89931K05535K22090K39646K57983K76378K94383
61784E061947L12286L30206L47009L60715L69691L72813L68678L55537L32249
61775H211131K98686K54999K01198J38001O7822n597p8439j47524k10190k64243
61765H465844l08242l41704l64871l78408l83269l80762l72542l60325l45324
$$ y = [1116554, 1120284, 1124996, 1131158, 1138705, 1146977, 1155212, 1163149, 1171062, 1179206, 1187443, 1195626, 1204214, 1214043, 1225345, 1237352, 1249298, 1261620, 1275661, 1292140, 1310447, 1329703, 1350068, 1372585, 1398004, 1426338, 1457521, 1491895, 1529833, 1571277, 1615902, 1663490, 1714001, 1767649, 1825211, 1887944, 1956761, 2031599, 2111936, 2197877, 2290390, 2390623, 2499477, 2617836, 2746661, 2886557, 3037681, 3200435, 3376001, 3565932, 3771467, 3993557, 4233203, 4491186, 4767564, 5061947, 5374233, 5704439, 6051448, 6412163, 6781854, 7154667, 7523345, 7878882, 8211131, 8509817, 8764816, 8966014, 9104015, 9171837, 9166240, 9087801, 8940277, 8730087, 8465844, 8157602, 7815898, 7451027, 7072619, 6689350, 6308588, 5936046, 5575721, 5230397]
61756E230397l27987l08566k87931k67408k47792k28973k10848j93977j78914
61747B978001j65303j52325j39828j28389j18339j09398j01181r3549q6333p9364
61737A803992p2906o7477o3037n8853n4413n0026m6234m3113m0464l8233l6313
61726A232923l4258l1675k8764k6074k3872k2123k0862k0195j9950j9635j8825
61715I66690j7428j5670j4027j3058j3001j3521j3912j3564j2355j0835r998j0459
61703H08862j1676j2342j1780j0665j0049j0049r909r069p797o818o670p269p898
61690F86871p871p376p269p764p965p225o356o590p738q503q405q246q537q718
61676E78308q303p692p273o705n913n847p174q792q838p033m943l960l925l906
$$ y = [5230397, 4902410, 4593844, 4305913, 4038505, 3790713, 3561740, 3350892, 3156915, 2978001, 2812698, 2660373, 2520545, 2392156, 2273817, 2164419, 2063238, 1969689, 1883356, 1803992, 1731086, 1663609, 1600572, 1541719, 1487306, 1437280, 1391046, 1347933, 1307469, 1269236, 1232923, 1198665, 1166990, 1138226, 1112152, 1088280, 1066157, 1045295, 1025100, 1005150, 985515, 966690, 949262, 933592, 919565, 906507, 893506, 879985, 866073, 852509, 840154, 829319, 819321, 808862, 797186, 784844, 773064, 762399, 752350, 742301, 732392, 723323, 715526, 708708, 702038, 694769, 686871, 679000, 671624, 664355, 656591, 648626, 641401, 635045, 628455, 620717, 612214, 603809, 595563, 587026, 578308, 570005, 562313, 555040, 548335, 542422, 536575, 529401, 520609, 511771, 504738, 499795, 495835, 491910, 488004]
61662D88004l447k708k016j696j870k189k093j556j077q30l90L45O66P6p01n67
61646D67951L61P97M0j159j687j367p08J9Q28J483J572J185R09J060J272J004
61630D73560J53r78j972k424k081j116j63J86k45j233k303k804k391j648j739
61615D52802k941l975l482j810o14p79j627k202k452k709k837k569k112j774j338
61600D19581n10K62J88o67j275r11L1P15Q98R84J314J852K401K878L282L611L871
61583D38505M156M615N260N848O125O230O630P519Q545R361J0173J1327J2561
61570E36855J3230J3338J3742J5065J6804J7891J7885J7264J6672J6281J5858
61559G10885J5147J4120J2990J2029J1328J0752J0225R857R675R478R187R140
$$ y = [488004, 484557, 481849, 479833, 478137, 476267, 474078, 471985, 470429, 469352, 468522, 468132, 468477, 469143, 469219, 468518, 467951, 468312, 469109, 469149, 467990, 466303, 464936, 464228, 464247, 465075, 466558, 468130, 469315, 470224, 471284, 472556, 473560, 473713, 472735, 470763, 468339, 466258, 465142, 464979, 465165, 464920, 463687, 461384, 458580, 456189, 454541, 452802, 449861, 445886, 442404, 440594, 439980, 439201, 437574, 435372, 432920, 430211, 427374, 424805, 422693, 420919, 419581, 419071, 419333, 419521, 418854, 417579, 416668, 416699, 417414, 418312, 419296, 420610, 422462, 424863, 427741, 431023, 434634, 438505, 442661, 447276, 452536, 458384, 464509, 470739, 477369, 484888, 493433, 502794, 512967, 524294, 536855, 550085, 563423, 577165, 592230, 609034, 626925, 644810, 662074, 678746, 695027, 710885, 726032, 740152, 753142, 765171, 776499, 787251, 797476, 807333, 817008, 826486, 835673, 844813]
61547H44813R666J0457J0800J0462R912R522Q965P762O044M423L219K249J313
61534I39607N22Ml76q91j625k334k566k001q12L58J034J479K381L995N988Q100
61518I52863J0482J3157J5700J7815J9880K2484K5636K8937L2280L5818L9414
61507A214466M2829M6411N0894N6363O2004O7232P2402P8068Q4042Q9705R4782
61496A959198R9221J02619J04436J04563J03092R9632R3557Q4836P4085O1794
61486B887033M8114L3492J8804M610r100k2152l3676m2850m9623n4307n6931n7633
61474B665781n7328n7194n7442n7203n5811n3709n1914n0835m9843m7812m4037
61463B082653l8753l2935k7456k2467j7649j2870q278l917K88M160P304R733J2004
$$ y = [844813, 854479, 864936, 875736, 886198, 896110, 905632, 914597, 922359, 928403, 932826, 936045, 938294, 939607, 940129, 940133, 939757, 938866, 937241, 934907, 932341, 930340, 929528, 929886, 930920, 932399, 934780, 938775, 944763, 952863, 963345, 976502, 992202, 1010017, 1029897, 1052381, 1078017, 1106954, 1139234, 1175052, 1214466, 1257295, 1303706, 1354600, 1410963, 1472967, 1540199, 1612601, 1690669, 1774711, 1864416, 1959198, 2058419, 2161038, 2265474, 2370037, 2473129, 2572761, 2666318, 2751154, 2825239, 2887033, 2935147, 2968639, 2987443, 2992053, 2982953, 2960801, 2927125, 2884275, 2834652, 2780345, 2723414, 2665781, 2608453, 2551259, 2493817, 2436614, 2380803, 2327094, 2275180, 2224345, 2174502, 2126690, 2082653, 2043900, 2010965, 1983509, 1961042, 1943393, 1930523, 1922245, 1918328, 1918616, 1922776, 1930080, 1939813, 1951817]
61450A951817J4459J6726J8335J9605K1342K3775K6226K8083K9617L1613L4307
61439B215905L7025L8791L8986L7406L4085K9408K4227J9462J5445J1941Q846
61428B511527O485M967L677J930o4j505k196k816l822m784n123n000n025n507
61414B492744o624q948j3018j8333k3355k6714k8105k7993k6908k5187k3016k0464
61402B244079j7603j4723j2196j0062q041o041m339l133k198j144J24J493K931
61389B169147M591O766R895J4364K0117K6568L3114L9574M6044N2598N9341O6494
61377B548613P4094Q1743Q8978R5720J01996J07315J10791J11889J10661J07097
61367C538897J00707R1014P8141O2580M4705K5050M938j3805l0173m4641n8173
$$ y = [1951817, 1966276, 1983002, 2001337, 2020942, 2042284, 2066059, 2092285, 2120368, 2149985, 2181598, 2215905, 2252930, 2291721, 2330707, 2368113, 2402198, 2431606, 2455833, 2475295, 2490740, 2502681, 2511527, 2518012, 2522979, 2526656, 2528586, 2528522, 2527017, 2524821, 2522005, 2518183, 2513399, 2508276, 2503276, 2498251, 2492744, 2486120, 2477172, 2464154, 2445821, 2422466, 2395752, 2367647, 2339654, 2312746, 2287559, 2264543, 2244079, 2226476, 2211753, 2199557, 2189495, 2181454, 2175413, 2171074, 2167941, 2165743, 2164599, 2164723, 2166216, 2169147, 2173738, 2180504, 2190399, 2204763, 2224880, 2251448, 2284562, 2324136, 2370180, 2422778, 2482119, 2548613, 2622707, 2704450, 2793428, 2889148, 2991144, 3098459, 3209250, 3321139, 3431800, 3538897, 3639604, 3730618, 3808759, 3871339, 3916044, 3941094, 3946032, 3932227, 3902054, 3857413, 3799240]
61356C799240p0806q1741r0638r8104j04604j09578j12167j12493j11493j09659
61346B797957j06651j02273r7109r1857q6523q0669p4130o7130n9932n2838m6226
61335A932619m0211l4354k8225k2132j6843j2520q364l558J756O769J1049J4911
61323A800897J8633K1611K2722K1561J9026J6456J4428J2646J0771Q871P133N737
61311A980492N102N642P081Q438R070R293R669J0093R986R062P494N588L697K141
61297B082848Q36p58k963n439p787j0106j2565j4860j6710j8482k0608k2727k4125
61284A926554k4731k4869k4379k2923k0934j9228j7719j5738j3665j3011j4372
61273A714985j6469j7809j8373j8924j9486j9394j8364j6676j4546j2026r307
$$ y = [3799240, 3728434, 3646693, 3556055, 3457951, 3353347, 3243769, 3131602, 3019109, 2907616, 2797957, 2691306, 2589033, 2491924, 2400067, 2313544, 2232875, 2158745, 2091615, 2031683, 1978845, 1932619, 1892408, 1858054, 1829829, 1807697, 1790854, 1778334, 1769970, 1766412, 1768168, 1774937, 1785986, 1800897, 1819530, 1841141, 1863863, 1885424, 1904450, 1920906, 1935334, 1947980, 1958751, 1967622, 1974755, 1980492, 1985594, 1991236, 1998317, 2006755, 2015825, 2025118, 2034787, 2044880, 2054866, 2063928, 2071422, 2077010, 2080707, 2082848, 2083684, 2082926, 2079963, 2074524, 2066737, 2056631, 2044066, 2029206, 2012496, 1994014, 1973406, 1950679, 1926554, 1901823, 1876954, 1852575, 1829652, 1808718, 1789490, 1771771, 1756033, 1742368, 1729357, 1714985, 1698516, 1680707, 1662334, 1643410, 1623924, 1604530, 1586166, 1569490, 1554944, 1542918, 1533611]
61262A533611o701m409k530r72Q69L749P606J1461J4687J7739K1266K5142K8979
61249A650497L3021L7731M3053M8658N4479O0204O4760O7215O7853O7414O5517
61238B260402O0776N2471M1255K8344J4922K217q954j8967k8794l8343m6208n1384
61226B267737n4431n6402n7297n6238n2785m7603m1985l7137l3674l1565l0509
61215A768111l0471l1608l3702l5994l7692l8372l7990l6908l5852l5334l4938
61204A379250l3711l1334k8408k5499k2610j9874j7976j7265j6997j6193j4937
61193A134446j4122j4078j4191j3867j3265j2826j2664j2644j2772j3181j3846
61182I86990j4516j4868j4672j3893j2715j1420j0134q796p416o218n422m853
$$ y = [1533611, 1526910, 1522501, 1519971, 1518999, 1519868, 1523617, 1531223, 1542684, 1557371, 1575110, 1596376, 1621518, 1650497, 1683518, 1721249, 1764302, 1812960, 1867439, 1927643, 1992403, 2059618, 2127471, 2194885, 2260402, 2321178, 2373649, 2414904, 2443248, 2458170, 2460387, 2451433, 2432466, 2403672, 2365329, 2319121, 2267737, 2213306, 2156904, 2099607, 2043369, 1990584, 1942981, 1900996, 1863859, 1830185, 1798620, 1768111, 1737640, 1706032, 1672330, 1636336, 1598644, 1560272, 1522282, 1485374, 1449522, 1414188, 1379250, 1345539, 1314205, 1285797, 1260298, 1237688, 1217814, 1199838, 1182573, 1165576, 1149383, 1134446, 1120324, 1106246, 1092055, 1078188, 1064923, 1052097, 1039433, 1026789, 1014017, 1000836, 986990, 972474, 957606, 942934, 929041, 916326, 904906, 894772, 885976, 878560, 872342, 866920, 862067]
61170H62067m034k678j030M18J358J588O56j924n919j0104j3102j4387j4416j3920
61156G84573j3356j2834j2212j1284j0079q942q110p380o475n590n222n467n836
61143F71786n909n830o045o759p735q553q925q829q315p314n813m233l186k694
61129E81646k049p66P31J877K911M387N934O447N600M324L480K720J158j301l768
61114F13331n333n896o147o867q157r304r567q994q204p533o900o442o583p362
61100E10042q179q540q558q556q615q797r278r908j0068r371q183p105o230n322
61086C93332m447l945l893l898l474k427r85L37J131J408J441J353J131R64J164
61071C79192J714K300K791L316L813M050M161M586N352N959O164O178N941M922
$$ y = [862067, 858033, 855355, 854325, 854743, 856101, 857689, 858345, 856421, 850502, 840398, 827296, 812909, 798493, 784573, 771217, 758383, 746171, 734887, 724808, 715866, 707756, 700376, 693901, 688311, 683089, 677622, 671786, 665877, 660047, 654002, 647243, 639508, 630955, 622030, 613201, 604886, 597572, 591759, 587526, 584340, 581646, 579597, 578831, 579562, 581439, 584350, 588737, 594671, 601118, 606718, 611042, 614522, 617242, 618400, 617099, 613331, 607998, 602102, 595955, 589088, 580931, 571627, 562060, 553066, 544862, 537329, 530429, 523987, 517404, 510042, 501863, 493323, 484765, 476209, 467594, 458797, 449519, 439611, 429543, 420172, 411989, 404884, 398654, 393332, 388885, 384940, 381047, 377149, 373675, 371248, 370263, 370600, 371731, 373139, 374580, 375933, 377064, 378028, 379192, 380906, 383206, 385997, 389313, 393126, 397176, 401337, 405923, 411275, 417234, 423398, 429576, 435517, 440439]
61057D40439L117J482Q29Q29O86K62n8j36j37j41k73p63j420j546r30m04p28j487
61039D39621j896k167k990m052m176l001j434k92N90J647K812L809M699N745P072
61024D45987Q674J0492J2388J4338J6632J9637K3465K8230L4388M2529N3055O6233
61012G76048Q1630R6352J04347R9211P8934M8086J5593r502k1420j9235o613J0152
61000A253583K4246K9285K0346l184l5188o5191q4807r2082q9860q1665p0089
60989H05394n7563m6354l7399l0101k3538j7442j2167q216n766m310k960j458
60977E58120n16p05j500k011k297l113m516n602n686n086m494m162l984l991m310
60962E06147m830n163n039m601m297m412m806n221n744o592p474p680p018o172
$$ y = [440439, 443556, 445038, 445867, 446696, 447382, 447644, 447586, 447450, 447313, 447172, 446899, 446136, 444716, 443170, 442240, 441836, 441108, 439621, 437725, 435558, 432568, 428516, 424340, 421339, 419905, 419613, 420203, 421850, 424662, 428471, 433170, 438915, 445987, 454661, 465153, 477541, 491879, 508511, 528148, 551613, 579843, 614231, 656760, 709815, 776048, 857678, 954030, 1058377, 1157588, 1236522, 1284608, 1300201, 1290699, 1269279, 1250044, 1243431, 1253583, 1277829, 1307114, 1327460, 1324276, 1289088, 1223897, 1139090, 1047008, 957148, 875483, 805394, 747831, 701477, 664078, 633977, 610439, 592997, 580830, 572614, 566848, 562538, 559578, 558120, 557604, 556899, 555399, 553388, 551091, 547978, 543462, 537860, 532174, 527088, 522594, 518432, 514448, 510457, 506147, 501317, 496154, 491115, 486514, 482217, 477805, 472999, 467778, 462034, 455442, 447968, 440288, 433270, 427098]
60948D27098n772n524m815l771l058k796k297j039P38K463L843M761N000M476
60934D19307L521K745K478K531K422J878J125N95L96J63l59q46p58j52K11k59
60918D34998j218j693j159r4O81J060J709K942M041M096L289K647K560K352J507
60903D57718N53J41q5r90k580l964m568m687m814n050n313n597n754n497m875
60888D04638m379m316m314l728k386p50O20J550K317L238M276N091N596O249P460
60873D21162Q727Q810O960L770O53j315j865j269K5J535K862L790M215M041L283
60858D65384K252J407R90R05J018J362J940K428K306J364k0j171j677j656j566
60843D75266j802k395l061l468l473l081k312j336o13o17j246j871k097k236k696
$$ y = [427098, 421326, 415802, 410987, 407216, 404158, 401362, 399065, 398026, 398764, 401227, 405070, 409831, 414831, 419307, 422828, 425573, 428051, 430582, 433004, 434882, 436007, 436602, 436998, 437161, 436802, 435956, 435198, 435046, 435257, 434998, 433780, 432087, 430928, 430834, 431515, 432575, 434284, 437226, 441267, 445363, 448652, 451299, 453859, 456211, 457718, 458271, 458412, 458327, 457337, 454757, 450793, 446225, 441538, 436724, 431674, 426361, 420764, 415010, 409513, 404638, 400259, 395943, 391629, 387901, 385515, 384765, 385385, 386935, 389252, 392490, 396766, 401857, 407453, 413702, 421162, 429889, 438699, 445659, 449429, 450082, 448767, 446902, 445633, 445658, 447193, 450055, 453845, 458060, 462101, 465384, 467636, 469043, 470033, 470938, 471956, 473318, 475258, 477686, 479992, 481356, 481336, 480165, 478488, 476832, 475266, 473464, 471069, 468008, 464540, 461067, 457986, 455674, 454338, 453725, 453108, 451862, 449991, 447894, 445658, 442962]
60828D42962l296l605l667l880m209m234l938l826m049m063l505k860k775l108
60814C91947l128k430j276k23K53K2m56l99M19J319J612J538J753K203K213J593
60798C96960R71Q61J023J011P98O13N27N80R94J870K807L184K796K073J638J765
60782D20471K201K505K522K500K663K806K547J905J333J177J334J543J670J623
60768D48800J267O93L66O88J468K045J969J410Q93P32Q41R16O86k8j252k765m069
60751D54660m712m701m511m615n074n620n971n978n612n012m494m303m291m037
60737C85729l328k445j842j579j223l87P60J660K038K131K186K100J784J569J805
60722C90958K245K306J861J230N07n04j593k166k148k232k850l578l990m356m905
$$ y = [442962, 439666, 436061, 432394, 428514, 424305, 420071, 416133, 412307, 408258, 404195, 400690, 397830, 395055, 391947, 388819, 386389, 385113, 384890, 385143, 385165, 384709, 384310, 384729, 386048, 387660, 389198, 390951, 393154, 395367, 396960, 397931, 398792, 399815, 400826, 401624, 402237, 402764, 403344, 404338, 406208, 409015, 412199, 414995, 417068, 418706, 420471, 422672, 425177, 427699, 430199, 432862, 435668, 438215, 440120, 441453, 442630, 443964, 445507, 447177, 448800, 450067, 450760, 451126, 451814, 453282, 455327, 457296, 458706, 459599, 460331, 461172, 462088, 462774, 462746, 461494, 458729, 454660, 449948, 445247, 440736, 436121, 431047, 425427, 419456, 413478, 407866, 402854, 398360, 394057, 389766, 385729, 382401, 379956, 378114, 376535, 375312, 374925, 375685, 377345, 379383, 381514, 383700, 385800, 387584, 389153, 390958, 393203, 395509, 397370, 398600, 399107, 398603, 397010, 394844, 392696, 390464, 387614, 384036, 380046, 375690, 370785]
60707C70785n036m187k986k628l286m063m362m372m234l676k699j829j406j261
60693C24760j235j397j481r91j60oq68j588r55N43J299P45N5N28J992L147L148
60676C27536K381J777J703J745J432R36Q61J479K476L394M086M659N194N677O080
60661C71416O419O800P393Q207Q894Q936Q152O925N869N263M797L880K419J149
60647D56519Q43J183J032jr71j043p53j029j601j528r22p88j283j445r43p12j385
60630D45173k280k626k657k727k428j503p27p87j058o08K20M52J80K52O05L36
60614D29817o15j241j081q11r02q87m50j98o54j375j634j413j067o35r6K39K08
60597D17205K10N83R40P84L94M11Q07R66O31J54j60l31l41q1K37K04j37k97j51
$$ y = [370785, 365749, 361562, 358576, 355948, 352662, 348599, 344237, 339865, 335631, 331955, 329256, 327427, 326021, 324760, 323525, 322128, 320647, 319656, 319496, 319490, 318622, 317034, 316079, 316622, 317921, 318666, 318721, 319249, 321241, 324388, 327536, 329917, 331694, 333397, 335142, 336574, 337510, 338371, 339850, 342326, 345720, 349806, 354465, 359659, 365336, 371416, 377835, 384635, 392028, 400235, 409129, 418065, 426217, 433142, 439011, 444274, 449071, 452951, 455370, 456519, 457362, 458545, 459577, 459576, 458605, 457562, 456809, 455780, 454179, 452651, 451729, 450941, 449658, 448213, 447270, 446558, 445173, 442893, 440267, 437610, 434883, 432455, 430952, 430225, 429438, 428380, 427772, 427992, 428444, 428624, 428876, 429481, 429817, 429202, 427961, 426880, 426069, 425167, 424280, 423830, 423632, 422978, 421603, 419969, 418556, 417489, 416854, 416758, 416997, 417205, 417415, 417998, 418938, 419722, 420116, 420527, 421334, 422300, 422931, 423085, 422925, 422594, 422253, 422172, 422409, 422613, 422476, 422179, 422028]
60578D22028j76o18r12m27N67J193J096P88Q79J392J908K073J793J116K33n15
60562D32418p19j12J230K795L856M091L980M355N500P010Q559J0423J2919J5707
60548E12012J8124K0092K2297K5381K9347L3655L7586M0383M1305L9730L5190
60537H55102K7496J7141N494n770j5479k3038k8037l0335l0495k9461k7572k4487
60525F90559k0305j6074j2771j0247p745n033k474k62J751L628N273O885R038
60512F42223J2216J6432K1197K5729K9351L2001L4140L5906L6609L5324L1703
60501I52831K5823J7763Q013j848r714j4364j5909j4932j1751o649j52P271J5489
60488I51871K4494L4147M4330N5115O6734P9483R3495J08248J22301J33811J41056
$$ y = [422028, 421852, 421234, 420322, 419895, 420462, 421655, 422751, 423539, 424418, 425810, 427718, 429791, 431584, 432700, 432933, 432418, 431699, 431587, 432817, 435612, 439468, 443559, 447539, 451894, 457394, 464404, 472963, 483386, 496305, 512012, 530136, 550228, 572525, 597906, 627253, 660908, 698494, 738877, 780182, 819912, 855102, 882598, 899739, 905233, 899463, 883984, 860946, 832909, 802574, 772079, 742618, 715046, 690559, 670254, 654180, 641409, 631162, 623417, 618384, 615910, 615648, 617399, 621027, 626300, 633185, 642223, 654439, 670871, 692068, 717797, 747148, 779149, 813289, 849195, 885804, 921128, 952831, 978654, 996417, 1004430, 1002582, 992868, 978504, 962595, 947663, 935912, 929263, 929111, 936382, 951871, 976365, 1010512, 1054842, 1109957, 1176691, 1256174, 1349669, 1457917, 1580218, 1714029, 1855085]
60477A855085J42177J34787J16885Q8590N2509J2212k9174o8791j03400j29848
60467B071032j46321j52962j51434j44014j32760j19222j04748r0820p8682o8594
60457H81475n9954n2280m5629m0000l4921l0068k5776k2448j9843j7425j5173
60446E17958j3472j2294j1019r206p165n622m974n007n179n133m865m484l948
60433D25590l180k347j705j244q35o65j084j931k465k159j228k52L71M95K29N0
60417D07640M70J325J910K035K341L247M196M495M308M210M254M197M217M633
60403D53478N244N772O572P974R164Q833O998N100M098L502K654J893J813K150
60389E25245K183J785J331Q96K15p06j417j483q14K82J152J199N50N7L45J071
$$ y = [1855085, 1997262, 2132049, 2248934, 2337524, 2390033, 2402245, 2373071, 2304280, 2200880, 2071032, 1924711, 1771749, 1620315, 1476301, 1343541, 1224319, 1119571, 1028751, 950069, 881475, 821521, 769241, 723612, 683612, 648691, 618623, 592847, 570399, 550556, 533131, 517958, 504486, 492192, 481173, 471967, 464802, 459180, 454206, 449199, 444020, 438887, 434022, 429538, 425590, 422410, 420063, 418358, 417114, 416279, 415614, 414530, 412599, 410134, 407975, 406747, 406495, 406866, 407361, 407590, 407640, 408110, 409435, 411345, 413380, 415721, 418968, 423164, 427659, 431967, 436177, 440431, 444628, 448845, 453478, 458722, 464494, 471066, 479040, 488204, 497037, 504035, 509135, 513233, 516735, 519389, 521282, 523095, 525245, 527428, 529213, 530544, 531440, 531655, 530949, 529532, 528049, 527235, 527517, 528669, 529868, 530418, 530475, 530820, 531891]
60373E31891J489J418J304J436J566J284N10l25m89L63J536J762O49p22j175r33
60357E41564j135k103k981l027k462j800j113l23L32O52Q85J334J829J929J540
60342E35121J004O55N40M46Q6o08j292j496j200q64p80q05q55j226k056k925l418
60325E20327l726m177m494m157l336k717k441j983j154m75l02k44J37N75N35J4
60309D92382n88j080j489j722j732j832k393l253l805l696l151k604k276k099
60295D60662j910j704j737k118k327j572J34J725K354K421K761L294L281K670
60281D67934K232K379K704K812K825K879K931L279M356N699O030M962L790L883
60267E18695N027O160O989P889Q670Q737Q283Q183Q592Q719Q197P679P715P878
$$ y = [531891, 533380, 534798, 536102, 537538, 539104, 540388, 540898, 540573, 540084, 540447, 541983, 543745, 544394, 543672, 542497, 541564, 540429, 538326, 535345, 532318, 529856, 528056, 526943, 526620, 526952, 527604, 528489, 529823, 531652, 533581, 535121, 536125, 536780, 537320, 537766, 537852, 537244, 535952, 534456, 533256, 532392, 531612, 530807, 529952, 528726, 526670, 523745, 520327, 516601, 512424, 507930, 503773, 500437, 497720, 495279, 493296, 492142, 491667, 491365, 491121, 491258, 491833, 492368, 492382, 491794, 490714, 489225, 487503, 485771, 483939, 481546, 478293, 474488, 470792, 467641, 465037, 462761, 460662, 458752, 457048, 455311, 453193, 450866, 449294, 449428, 451153, 453507, 455928, 458689, 461983, 465264, 467934, 470166, 472545, 475249, 478061, 480886, 483765, 486696, 489975, 494331, 500030, 506060, 511022, 514812, 518695, 523722, 529882, 536871, 544760, 553430, 562167, 570450, 578633, 587225, 595944, 604141, 611820, 619535, 627413]
60253F27413P659P446P870Q660Q940Q595Q515R435J1055J2570J3709J4907J6543
60240G63317J8443K0272K2102K4288K6871K9570L2407L5747L9547M3151M6345
60229A102060N0026N4967O0394O4759O7840P0933P4730P8102P9504P8670P6197
60218A858182P2289O6850O0330N3442M6182L7982K8806J9425J0474J919o405j4166
60206B235310k0693k5435k8279k9616l0019k9552k7560k3626j8457j3199p945
60195A980929j680O131J4711K3033L1042L9314M8048N6913O5503P3337P9650Q3734
60183B500665Q5425Q4795Q1615P5600O7049N6753M5264L2735J9434N842p767k1423
60171C025987l4818m7080n7397o5622p1950p6325p8368p7713p4200o7973n9680
$$ y = [627413, 635072, 642518, 650388, 659048, 667988, 676583, 685098, 694533, 705588, 718158, 731867, 746774, 763317, 781760, 802032, 824134, 848422, 875293, 904863, 937270, 973017, 1012564, 1055715, 1102060, 1152086, 1207053, 1267447, 1332206, 1400046, 1470979, 1545709, 1623811, 1703315, 1781985, 1858182, 1930471, 1997321, 2057651, 2111093, 2157275, 2195257, 2224063, 2243488, 2253962, 2255881, 2249476, 2235310, 2214617, 2189182, 2160903, 2131287, 2101268, 2071716, 2044156, 2020530, 2002073, 1988874, 1980929, 1979249, 1985380, 2000091, 2023124, 2054166, 2093480, 2141528, 2198441, 2263944, 2337281, 2416931, 2500665, 2586090, 2670885, 2752500, 2828100, 2895149, 2951902, 2997166, 3029901, 3049335, 3055177, 3047410, 3025987, 2991169, 2944089, 2886692, 2821070, 2749120, 2672795, 2594427, 2516714, 2442514, 2374541, 2314861]
60160B314861n0330m0566l0182j8671o217O116J7310K7176L6181M4545N1713N6654
60148B408590N8647N7755N4515M9319M2268L3644K4202J4721N452l734j2632k0456
60136B712291k6369l0115l2026l2455l1253k7815k1708j3251l372P219J8471L0548
60124B550165M3191N5894O8507Q1306R4537J08233J22405J36926J51169J64289
60114C576622J75954J86353J95231K01435K03729K01848J96346J87726J75947
60105E301191J60638J41535J18988R4123O8201M1582J3858j4671m2363o7674r0632
60094E724776j11953j31038j46075j56163j62258j65655j66455j64041j58258
60085D362880j49548j38519j25951j12757r9250q4840o9050n2530l6564k1908
$$ y = [2314861, 2264531, 2223965, 2193783, 2175112, 2168895, 2175011, 2192321, 2219497, 2255678, 2300223, 2351936, 2408590, 2467237, 2524992, 2579507, 2628826, 2671094, 2704738, 2728940, 2743661, 2749113, 2745379, 2732747, 2712291, 2685922, 2655807, 2623781, 2591326, 2560073, 2532258, 2510550, 2497299, 2493927, 2501146, 2519617, 2550165, 2593356, 2649250, 2717757, 2799063, 2893600, 3001833, 3124238, 3261164, 3412333, 3576622, 3752576, 3938929, 4134160, 4335595, 4539324, 4741172, 4937518, 5125244, 5301191, 5461829, 5603364, 5722352, 5816475, 5884676, 5926258, 5940116, 5925445, 5883082, 5815408, 5724776, 5612823, 5481785, 5335710, 5179547, 5017289, 4851634, 4685179, 4521138, 4362880, 4213332, 4074813, 3948862, 3836105, 3736855, 3652015, 3582965, 3530435, 3493871, 3471963]
60075C471963q677L053J3271K2394L0783L7965M2997M5576M6114M4750M1144L5324
60063C826657K7888J9090Q572l514j5883k7231l7511m7413n6980o5510p2588p8451
60051C477126q3233q6501q7719q6839q4209q0201p5011o8637o0967n1974m1835
60040B670000l0784j9027o956M886J6339K7900L9963N2002O3031P2731Q1396Q8740
60028C060221R3521R4756R2552Q7397P9264O8073N4557L9875K4474Q113r080k6287
60016C667436m2849n8700p3631q6619r6427j02606j05583j05841j03465r8429
60006B793286r1115q2279p2580o2174n0974l9229k7570j6297m878P367K0220L2836
59994B406613M4998N7436P0571Q3668R5726J06638J16653J25034J30160J31058
$$ y = [3471963, 3463286, 3466339, 3479610, 3502004, 3532787, 3570752, 3613749, 3659325, 3705439, 3750189, 3791333, 3826657, 3854545, 3873635, 3882207, 3878693, 3862810, 3835579, 3798068, 3750655, 3693675, 3628165, 3555577, 3477126, 3393893, 3307392, 3219673, 3132834, 3048625, 2968424, 2893413, 2824776, 2763809, 2711835, 2670000, 2639216, 2620189, 2613233, 2618119, 2634458, 2662358, 2702321, 2754323, 2817354, 2890085, 2971481, 3060221, 3153742, 3248498, 3341050, 3428447, 3507711, 3575784, 3630341, 3670216, 3694690, 3702803, 3693723, 3667436, 3624587, 3565887, 3492256, 3405637, 3309210, 3206604, 3101021, 2995180, 2891715, 2793286, 2702171, 2619892, 2547312, 2485138, 2434164, 2394935, 2367365, 2351068, 2346190, 2353557, 2373777, 2406613, 2451611, 2509047, 2579618, 2663286, 2759012, 2865650, 2982303, 3107337, 3237497, 3368555]
59984C368555J28006J21437J11119R6907P9725O1106M2028K2693L203j6199l5424
59973C983156n4324p1982q6819r7754j04862j08647j09067j05775r9032q9741
59963C055153p8664o6176n2793l9358k6310j3319o4J2936K4809L5459M5544N5363
59951B952580O4306P1633P7120Q0708Q1926Q0302P6106P0261O3471N5837M7310
59940C721560L8166K8893J9868J1337L573k996p837j0464j0679q569m172K740
59928C781420J2400K4505L8195N2647O7602Q3274R9825J16876J33446J48439J61289
59917D719918J72050J80664J86340J87818J84151J74918J59925J39200J13348
59908F218332Q3472N0586J5563k0140n4266q4766j10772j32196j48654j59377
$$ y = [3368555, 3496561, 3617998, 3729117, 3826024, 3905749, 3966855, 4008883, 4031576, 4034779, 4018580, 3983156, 3928832, 3856850, 3770031, 3672277, 3567415, 3458768, 3349701, 3243926, 3144894, 3055153, 2976489, 2910313, 2857520, 2818162, 2791852, 2778533, 2778469, 2791405, 2816214, 2851673, 2897217, 2952580, 3016886, 3088519, 3165639, 3246347, 3328273, 3408575, 3484681, 3554942, 3618413, 3674250, 3721560, 3759726, 3788619, 3808487, 3819824, 3823397, 3820401, 3812564, 3802100, 3791421, 3782852, 3778680, 3781420, 3793820, 3818325, 3856520, 3909167, 3976769, 4060043, 4159868, 4276744, 4410190, 4558629, 4719918, 4891968, 5072632, 5258972, 5446790, 5630941, 5805859, 5965784, 6104984, 6218332, 6301804, 6352390, 6367953, 6347813, 6293547, 6208781, 6098009, 5965813, 5817159, 5657782]
59898E657782j64210j64065j60161j53106j43044j30376j15952j00454q3951o6332
59888D376131m8130l0558j4503M11J5381L0971M6382O0298P2151Q2231R0650R6648
59876D778063R9009R6945R0466Q0094O6467N0108L1404J0745j1239l3482n4700
59865E203880p4029r1520j07661j22248j33998j41717j45585j46822j46061j42783
59855C951456j36545j28033j18367j07965r6837q5666p5626o7154n9684n2760
59845C022819m6690m1795l7619l3474k9281k5464k2256j9614j7604j6437j6117
59834B716468j6475j7459j9062k0920k2338k2807k2345k1329k0090j8628j6585
59823B498430j3555r619n471j850J103L724O212Q427J0227J1637J2670J3245J3363
$$ y = [5657782, 5493572, 5329507, 5169346, 5016240, 4873196, 4742820, 4626868, 4526414, 4442463, 4376131, 4328001, 4297443, 4282940, 4283351, 4298732, 4329703, 4376085, 4436383, 4508534, 4590765, 4681415, 4778063, 4877072, 4974017, 5064483, 5144577, 5211044, 5261152, 5292556, 5303301, 5292062, 5258580, 5203880, 5129851, 5038331, 4930670, 4808422, 4674424, 4532707, 4387122, 4240300, 4094239, 3951456, 3814911, 3686878, 3568511, 3460546, 3363709, 3278043, 3202417, 3135263, 3075579, 3022819, 2976129, 2934334, 2896715, 2863241, 2833960, 2808496, 2786240, 2766626, 2749022, 2732585, 2716468, 2699993, 2682534, 2663472, 2642552, 2620214, 2597407, 2575062, 2553733, 2533643, 2515015, 2498430, 2484875, 2475256, 2469785, 2467935, 2469038, 2472762, 2478974, 2487401, 2497628, 2509265, 2521935, 2535180, 2548543]
59810B548543J3039J2025R955O891L489L55k457n031o910p264n723k744R26M974
59796B570068R684J5598K3133L2408M3295N5633O9443Q4890J02050J20794J40966
59785C267962J62567J85476K08681K29631K44316K48065K36460K06278J56809
59776E146245R1313J7216n5924j19516j67954j98863k12811k12972k03852j89077
59766C893805j70295j48410j25304j03454q4128o6881n0948l6300k3147j1274
59756C073664m34R191J7575K5443L3630M2061N0016N7247O4259P1472P8777Q6142
59744C609043R4067J03114J13240J24032J35493J48239J62808J78982J96000K13382
59734E078400K31331K50270K70177K90625L11184L31201L49147L62772L70231
$$ y = [2548543, 2561582, 2573607, 2583562, 2590453, 2593942, 2594297, 2591840, 2586809, 2579899, 2572635, 2566912, 2564168, 2565094, 2570068, 2579752, 2595350, 2618483, 2650891, 2694186, 2749819, 2819262, 2904152, 3006202, 3126996, 3267962, 3430529, 3616005, 3824686, 4054317, 4298633, 4546698, 4783158, 4989436, 5146245, 5237558, 5254774, 5198850, 5079334, 4911380, 4712517, 4499706, 4286734, 4082882, 3893805, 3723510, 3575100, 3449796, 3346342, 3262214, 3195333, 3144385, 3108085, 3084938, 3073664, 3073230, 3082421, 3099996, 3125439, 3159069, 3201130, 3251146, 3308393, 3372652, 3444124, 3522901, 3609043, 3703110, 3806224, 3919464, 4043496, 4178989, 4327228, 4490036, 4669018, 4865018, 5078400, 5309731, 5560001, 5830178, 6120803, 6431987, 6763188, 7112335, 7475107, 7845338]
59725G845338L70779L64193L50022L28071K99419K66550K32584K00608J73211
59716A0430775J51838J36592J27060J23196J24826J30566J38046J45303J51289
59707A1659491J55045J55417J51948J45254J35999J24113J09596R3445P7132O1572
59697A2869012M7197L4731K5185J9214J7049J8969K5344L6284N1688P1538R5691
59686A3311902J23527J54053J86320K19421K52358K84343L14864L42865L66023
59677A5555676L81569L87746L83936L69322L42349L01693K47305J80345J02814
59668A8252755J7778p0471j57058k37481l07983l65709m08940m37189m50800m50787
59658A5384115m39653m22412m06315l98812m05002m26185m59855n00433n40155
$$ y = [7845338, 8216117, 8580310, 8930332, 9258403, 9557822, 9824372, 10056956, 10257564, 10430775, 10582613, 10719205, 10846265, 10969461, 11094287, 11224853, 11362899, 11508202, 11659491, 11814536, 11969953, 12121901, 12267155, 12403154, 12527267, 12636863, 12730308, 12807440, 12869012, 12916209, 12950940, 12976125, 12995339, 13012388, 13031357, 13056701, 13092985, 13144673, 13216211, 13311902, 13435429, 13589482, 13775802, 13995223, 14247581, 14531924, 14846788, 15189653, 15555676, 15937245, 16324991, 16708927, 17078249, 17420598, 17722291, 17969596, 18149941, 18252755, 18270533, 18200062, 18043004, 17805523, 17497540, 17131831, 16722891, 16285702, 15834902, 15384115, 14944462, 14522050, 14115735, 13716923, 13311921, 12885736, 12425881, 11925448, 11385293]
59649A1385293n70635n85655n83687n67719n42207n10339m74119m35923l98552
59640F716457l63735l31601l01837k74591k50035k27857k07620j89098j72011
59631D398072j55980j41081j27796j16061j04954r3827q3181p3906o6078n9144
59621C376064n2845m7300m2541l8609l5813l4253l3294l2239l1353l1507l2840
59610B963470l4579l6230l8164m0705m3263m4836m4978m3923m2072l9723l7163
59599B517834l4710l2544l0577k8457k5823k2661j9395j6440j3746j1014q223
59588B274244n639l339j025J608M568P636J0544J3089J5276J7342J9471K1599
59576B375374K3634K5693K7812K9740L1436L3547L6792M0962M5210M9286N3744
$$ y = [11385293, 10814658, 10229003, 9645316, 9077597, 8535390, 8025051, 7550932, 7115009, 6716457, 6352722, 6021121, 5719284, 5444693, 5194658, 4966801, 4759181, 4570083, 4398072, 4242092, 4101011, 3973215, 3857154, 3752200, 3658373, 3575192, 3501286, 3435208, 3376064, 3323219, 3275919, 3233378, 3194769, 3158956, 3124703, 3091409, 3059170, 3027817, 2996310, 2963470, 2928891, 2892661, 2854497, 2813792, 2770529, 2725693, 2680715, 2636792, 2594720, 2554997, 2517834, 2483124, 2450580, 2420003, 2391546, 2365723, 2343062, 2323667, 2307227, 2293481, 2282467, 2274244, 2268605, 2265266, 2264241, 2265849, 2270417, 2278053, 2288597, 2301686, 2316962, 2334304, 2353775, 2375374, 2399008, 2424701, 2452513, 2482253, 2513689, 2547236, 2584028, 2624990, 2670200, 2719486, 2773230]
59565B773230N8771O3678O8030P2517P8003Q4212R0088R5163R9842J04446J08760
59554C696740J12634J16367J20163J23413J24660J22009J13808R9694Q1569O3137
59544D774194M7631L5613K5172J4260K546r049j9997l0640m1128n0715n8506o4457
59532D624924o9093p2499p4141p3628p1075o6639o0159n1533m1124k9546j7164
59521C998323l833J1003K7860M6504O5833Q4804J03398J22016J40043J55689J67385
59510D919025J74502J76400J71884J60293J42377J19246R1007N7544K0238j8142
59500F014374n5206q9707j20627j46645j66676j80209j86922j86872j81318j72343
59490D527849j61168j47465j30893j12567r4293p6894n9954m2955k6006r651N477
$$ y = [2773230, 2832001, 2895679, 2963709, 3036226, 3114229, 3198441, 3288529, 3383692, 3483534, 3587980, 3696740, 3809374, 3925741, 4045904, 4169317, 4293977, 4415986, 4529794, 4629488, 4711057, 4774194, 4821825, 4857438, 4882610, 4896870, 4899416, 4890367, 4870370, 4839730, 4798602, 4747887, 4689381, 4624924, 4555831, 4483332, 4409191, 4335563, 4264488, 4197849, 4137690, 4086157, 4045033, 4015487, 3998323, 3994490, 4005493, 4033353, 4079857, 4145690, 4230494, 4333892, 4455908, 4595951, 4751640, 4919025, 5093527, 5269927, 5441811, 5602104, 5744481, 5863727, 5954734, 6012278, 6032516, 6014374, 5959168, 5869461, 5748834, 5602189, 5435513, 5255304, 5068382, 4881510, 4700192, 4527849, 4366681, 4219216, 4088323, 3975756, 3881463, 3804569, 3744615, 3701660, 3675654, 3666003, 3671480]
59479C671480J8866L0358M0020M7620N2618N5004N5591N4835N1924M5761L6541
59468D160618K5457J3042j177j7339l4458n1266o7006q1158r3177j02992j11068
59457C639476j17511j21698j23334j23129j21819j19061j14317j08424j03124
59448B587059r8955r4601q8693q1511p4397o8118o2374n6653n0960m5653m0950
59437A824194l6656l2350k7824k3335j9237j5382j1250o682k107K156O398J0889
59425A668814J4961J7121J6181J2103O029k33m914p053o760m642j064L851R687
59412A724081J5506K0027K1745J9303J2678M196k498n070l969j109K420O861J2529
59399A826700J8922K5172L0779L5765M0418M5118N0151N5460O0696O5617P0454
$$ y = [3671480, 3690346, 3720704, 3760724, 3808344, 3860962, 3915966, 3971557, 4026392, 4078316, 4124077, 4160618, 4186075, 4199117, 4197940, 4180601, 4146143, 4094877, 4027871, 3946713, 3853536, 3750544, 3639476, 3521965, 3400267, 3276933, 3153804, 3031985, 2912924, 2798607, 2690183, 2587059, 2488104, 2393503, 2304810, 2223299, 2148902, 2080784, 2018410, 1961757, 1910797, 1865144, 1824194, 1787538, 1755188, 1727364, 1704029, 1684792, 1669410, 1658160, 1651478, 1649371, 1651527, 1657925, 1668814, 1683775, 1700896, 1717077, 1729180, 1735209, 1734976, 1730062, 1723009, 1716249, 1711607, 1710543, 1714394, 1724081, 1739587, 1759614, 1781359, 1800662, 1813340, 1817536, 1815038, 1809968, 1805999, 1804890, 1807310, 1814171, 1826700, 1845622, 1870794, 1901573, 1937338, 1977756, 2022874, 2073025, 2128485, 2189181, 2254798, 2325252]
59388B325252P5767Q1999Q9098R6546J03801J10803J17933J25579J33900J43184
59378C403862J54044J66978J81883J98395K16536K36614K58490K81279L03795
59369E401876L25012L44003L59852L71641L78363L78818L72115L58447L39111
59360H629238L15602K88858K59400K27734J94383J59769J24277Q8199N1426J3473
59350A0352359k6042o7155j09845j54051j99089k43317k84713l21614l52669l76552
59340H217312l92298l99788l99540l92205l78657l60340l38935l15706k91585
59331D948258k67679k45138k24395k05122j86919j69671j53246j37513j22842
59322C235733j10002r9197q9629q0388p1407o3206n6040m9774m4345l9796l5887
$$ y = [2325252, 2401019, 2483018, 2572116, 2668662, 2772463, 2883266, 3001199, 3126778, 3260678, 3403862, 3557906, 3724884, 3906767, 4105162, 4321698, 4558312, 4816802, 5098081, 5401876, 5726888, 6070891, 6430743, 6802384, 7180747, 7559565, 7931680, 8290127, 8629238, 8944840, 9233698, 9493098, 9720832, 9915215, 10074984, 10199261, 10287460, 10338886, 10352359, 10326317, 10259162, 10149317, 9995266, 9796177, 9552860, 9268147, 8946533, 8593864, 8217312, 7825014, 7425226, 7025686, 6633481, 6254824, 5894484, 5555549, 5239843, 4948258, 4680579, 4435441, 4211046, 4005924, 3819005, 3649334, 3496088, 3358575, 3235733, 3125731, 3026534, 2936905, 2856517, 2785110, 2721904, 2665864, 2616090, 2571745, 2531949, 2496062]
59311B496062l2118k8235k4489k1254j8516j5863j2917r768o940m878l446k048
59299B315590j96K074M352O271P809R383J1603J4677J8126K1324K4293K7520L0994
59286B493820L3931L5662L6398L6742L6769L5949L3800L0274K5612K0040J3541
59275B832538N900k805j1781j9954k7044l3694m0263m6070n0281n3139n5590n7948
59263B439869n9562n9708n8366n6115n3739n1844n0370m8622m6094m3170m0554
59252A871725l8216l5411l1584k6791k1472j6398j2518j0086q038m997q11L636
59240A669039P877J2037J5776J8425K0445K3420K7979L2928L7199M1423M6675
59229A953223N2771N9017O5790P3920Q3114R2467J02195J13416J26252J39596
$$ y = [2496062, 2463944, 2435709, 2411220, 2389966, 2371450, 2355587, 2342670, 2332902, 2325962, 2321084, 2317638, 2315590, 2315394, 2317468, 2321820, 2328091, 2335900, 2345283, 2356886, 2371563, 2389689, 2411013, 2435306, 2462826, 2493820, 2527751, 2563413, 2599811, 2636553, 2673322, 2709271, 2743071, 2773345, 2798957, 2818997, 2832538, 2838438, 2835633, 2823852, 2803898, 2776854, 2743160, 2702897, 2656827, 2606546, 2553407, 2497817, 2439869, 2380307, 2320599, 2262233, 2206118, 2152379, 2100535, 2050165, 2001543, 1955449, 1912279, 1871725, 1833509, 1798098, 1766514, 1739723, 1718251, 1701853, 1689335, 1679249, 1671211, 1666214, 1665403, 1669039, 1676916, 1688953, 1704729, 1723154, 1743599, 1767019, 1794998, 1827926, 1865125, 1906548, 1953223, 2005994, 2065011, 2130801, 2204721, 2287835, 2380302, 2482497, 2595913, 2722165, 2861761]
59219B861761J52931J67079J82601J98598K13584K26632K37087K43857K45669
59210D729799K41616K31027K13304J88340J56633J18813P5528K8254k0368o7521
59200E895425j11262j50373j83651k09936k28560k39458k43076k40500k33245
59191D055364k22517k08997j93626j78045j63605j50200j36819j23171j10135
59182B568249r8640q8654p9472p0563o1874n3649m6185l9707l4298k9936k6519
59171A938752k3858k1692j9877j8423j7354j6662j6490j7073j8300j9543k0095
59160A729385j9717j8662j7338j6146j5320j4640j3541j1764r788q349p651p383
59148A569086p258p211p099o640n791m915m495m715n336n862n935n662n471n600
$$ y = [2861761, 3014692, 3181771, 3364372, 3562970, 3776554, 4003186, 4240273, 4484130, 4729799, 4971415, 5202442, 5415746, 5604086, 5760719, 5879532, 5955060, 5983314, 5962946, 5895425, 5784163, 5633790, 5450139, 5240203, 5011643, 4772185, 4529109, 4288609, 4055364, 3832847, 3623850, 3430224, 3252179, 3088574, 2938374, 2801555, 2678384, 2568249, 2469609, 2380955, 2301483, 2230920, 2169046, 2115397, 2069212, 2029505, 1995207, 1965271, 1938752, 1914894, 1893202, 1873325, 1854902, 1837548, 1820886, 1804396, 1787323, 1769023, 1749480, 1729385, 1709668, 1691006, 1673668, 1657522, 1642202, 1627562, 1614021, 1602257, 1592469, 1584120, 1576469, 1569086, 1561828, 1554617, 1547518, 1540878, 1535087, 1530172, 1525677, 1520962, 1515626, 1509764, 1503829, 1498167, 1492696, 1487096]
59134A487096n888o106o219o182n828n169m542m132l660k726j275N67K700M871
59120A443507O605P753Q735R837J0765J1338J2102J3524J5002J5581J5336J5079
59108A585164J4873J4019J2585J1779J2381J3712J4666J5005J5221J5776J6970
59097A742151J8943K1358K3573K5524K7814L0627L3207L4977L6330L7656L8305
59086B070465L7447L5391L3082L0517K6739K1322J4908Q149R74o802j4742k2014
59074B235436k8165l3447l8520m3753m8673n2306n4247n5035n5207n4549n2876
59063A718658n0956m9671m8528m6142m2239l8198l5272l3244l1235k8962k6588
59052A287623k3950k0763j7273j4115j1638r838q708q152p711o928o023n851o968
$$ y = [1487096, 1481208, 1475102, 1468883, 1462701, 1456873, 1451704, 1447162, 1443030, 1439370, 1436644, 1435369, 1435936, 1438636, 1443507, 1450112, 1457865, 1466600, 1476437, 1487202, 1498540, 1510642, 1524166, 1539168, 1554749, 1570085, 1585164, 1600037, 1614056, 1626641, 1638420, 1650801, 1664513, 1679179, 1694184, 1709405, 1725181, 1742151, 1761094, 1782452, 1806025, 1831549, 1859363, 1889990, 1923197, 1958174, 1994504, 2032160, 2070465, 2107912, 2143303, 2176385, 2206902, 2233641, 2254963, 2269871, 2278020, 2278994, 2272192, 2257450, 2235436, 2207271, 2173824, 2135304, 2091551, 2042878, 1990572, 1936325, 1881290, 1826083, 1771534, 1718658, 1667702, 1618031, 1569503, 1523361, 1481122, 1442924, 1407652, 1374408, 1343173, 1314211, 1287623, 1263673, 1242910, 1225637, 1211522, 1199884, 1190046, 1181338, 1173186, 1165475, 1158547, 1152524, 1146673, 1139705]
59039A139705r000j1033j2505j3516j4343j4877j4776j4033j3009j1805j0121
59028A000687p964o059m997m396l529k554k237k597k735k143j268m95M82J847
59014I62042L072L704M089M632N068N205N687P135R019J0377J1308J2628J4292
59001A058258J5342J5536J5901J7269J9185K0684K1442K1679K1551K1156K0665
58990A268668J9904J8266J5572J2658J0538R227P947O312M658L345K269J227K03
58977A380794r09k377m071n189m976l654k178j067J33K015M362O388P813R150
58963A386234J0929J3032J5007J6609J7739J8204J8013J7672J7703J7953J7867
58952A566962J7385J7070J7228J7440J7197J6587J6084J5898J5925J6176J6974
$$ y = [1139705, 1130705, 1119672, 1107167, 1093651, 1079308, 1064431, 1049655, 1035622, 1022613, 1010808, 1000687, 992723, 986664, 981667, 977271, 973742, 971188, 968951, 966354, 963619, 961476, 960208, 959713, 960195, 962042, 965114, 968818, 972907, 977539, 982607, 987812, 993499, 1000634, 1009653, 1020030, 1031338, 1043966, 1058258, 1073600, 1089136, 1105037, 1122306, 1141491, 1162175, 1183617, 1205296, 1226847, 1248003, 1268668, 1288572, 1306838, 1322410, 1335068, 1345606, 1354833, 1362780, 1369092, 1373750, 1377095, 1379364, 1380591, 1380794, 1379885, 1377508, 1373437, 1368248, 1363272, 1359618, 1357440, 1356373, 1356506, 1358521, 1362883, 1369271, 1377084, 1386234, 1397163, 1410195, 1425202, 1441811, 1459550, 1477754, 1495767, 1513439, 1531142, 1549095, 1566962, 1584347, 1601417, 1618645, 1636085, 1653282, 1669869, 1685953, 1701851, 1717776, 1733952, 1750926]
58941A750926J8693K1444K4898K8489L1860L5192L8913M3085M7218N0689N2990
58930B144397N3749N2985N1517N0538N0490N0815N1194N2422N5451N9988O4940
58919B738486P0001P5882Q2790Q9704R5577J00651J05951J11902J18078J24055
58909C713077J29825J35467J41084J47203J54657J63672J73377J82617J91062
58900E132041J99066K06511K12300K15354K15768K14581K12421K08863K03230
58891G020135J95507J86022J74569J60468J43531J24312J03224P9941N4072K6064
58881H267845l034l2376o1379q9174j14684j37373j57394j74916j89755k01837
58871G105923k11464k18823k23663k25771k25411k23000k18728k12927k06291
$$ y = [1750926, 1769619, 1791063, 1815961, 1844450, 1876310, 1911502, 1950415, 1993500, 2040718, 2091407, 2144397, 2198146, 2251131, 2302648, 2353186, 2403676, 2454491, 2505685, 2558107, 2613558, 2673546, 2738486, 2808487, 2884369, 2967159, 3056863, 3152440, 3253091, 3359042, 3470944, 3589022, 3713077, 3842902, 3978369, 4119453, 4266656, 4421313, 4584985, 4758362, 4940979, 5132041, 5331107, 5537618, 5749918, 5965272, 6181040, 6395621, 6608042, 6816905, 7020135, 7215642, 7401664, 7576233, 7736701, 7880232, 8004544, 8107768, 8187709, 8241781, 8267845, 8264811, 8232435, 8171056, 8081882, 7967198, 7829825, 7672431, 7497515, 7307760, 7105923, 6894459, 6675636, 6451973, 6226202, 6000791, 5777791, 5559063, 5346136, 5139845]
58862E139845j99194j91190j81827j71742j62088j53042j43784j33981j24315
58853C678682j15329j06606r7638q8746q0461p2695o5222n8436n2720m7456m1567
58842B851806l5020k8867k3751j9178j4521r986o198l231m73K781O805J1287J5610
58829B747064J9433K3026K6833L0834L4699L8461M2454M6641N0560N4129N7935
58818C172069O2516O7835P3645P9880Q6486R3331J00574J08641J17512J26546
58808D089035J35342J44324J54040J64361J74754J84925J94647K03413K10864
58799E655705K17222K22684K26556K27628K25124K18820K08551J94282J76401
58790G572973J55209J30295J01326O9331L6290L345k9738o3007r5163j24488j50284
$$ y = [5139845, 4940651, 4749461, 4567634, 4395892, 4233804, 4080762, 3936978, 3802997, 3678682, 3563353, 3456747, 3359109, 3270363, 3189902, 3117207, 3051985, 2993549, 2940829, 2893373, 2851806, 2816786, 2787919, 2764168, 2744990, 2730469, 2720483, 2714285, 2711054, 2710581, 2713362, 2720167, 2731454, 2747064, 2766497, 2789523, 2816356, 2847190, 2881889, 2920350, 2962804, 3009445, 3060005, 3114134, 3172069, 3234585, 3302420, 3376065, 3455945, 3542431, 3635762, 3736336, 3844977, 3962489, 4089035, 4224377, 4368701, 4522741, 4687102, 4861856, 5046781, 5241428, 5444841, 5655705, 5872927, 6095611, 6322167, 6549795, 6774919, 6993739, 7202290, 7396572, 7572973, 7728182, 7858477, 7959803, 8029134, 8065424, 8068769, 8039031, 7976024, 7880861, 7756373, 7606089]
58779G606089j72844j92498k09225k22972k33785k41697k46730k48938k48311
58770E589089k44869k38974k31199k21892k11149j99379j87395j75707j64226
58761C714299j52899j42149j32301j22991j13692j04465r5747q7661q0054p3047
58751B609293o6896o1372n5840n0038m4404l9529l5575l2301k9445k6993k5179
58740B141721k4194k3812k3497k3016k2701k2948k3726k4877k6550k8925l1787
58729A865688l4748l7695m0450m2243m2268m0798l9111l8126l7650l7096l6388
58718A439115l5793l5297l4569l3334l1568k9511k7577k6002k4404k2032j8690
58707A120338j5101j2126r848p741n579l940l775n558q804j2384j5451j7999k0358
$$ y = [7606089, 7433245, 7240747, 7031522, 6808550, 6574765, 6333068, 6086338, 5837400, 5589089, 5344220, 5105246, 4874047, 4652155, 4441006, 4241627, 4054232, 3878525, 3714299, 3561400, 3419251, 3286950, 3163959, 3050267, 2945802, 2850055, 2762394, 2682340, 2609293, 2542397, 2481025, 2425185, 2375147, 2330743, 2291214, 2255639, 2223338, 2193893, 2166900, 2141721, 2117527, 2093715, 2070218, 2047202, 2024501, 2001553, 1977827, 1952950, 1926400, 1897475, 1865688, 1830940, 1793245, 1752795, 1710552, 1668284, 1627486, 1588375, 1550249, 1512599, 1475503, 1439115, 1403322, 1368025, 1333456, 1300122, 1268554, 1239043, 1211466, 1185464, 1161060, 1139028, 1120338, 1105237, 1093111, 1083263, 1075522, 1069943, 1066003, 1062228, 1056670, 1047866, 1035482, 1020031, 1002032, 981674]
58694I81674k2328k3326k3253k2644k1736k0119j7633j4982j2892j1149r067o571
58682G75974m155k036n9J693K943L878N078O653Q080R039R860J0859J1844J2591
58668H52242J3319J4237J4995J4939J3742J1407P952L550j245n880j0292j4615
58656I14351j8440k0925k1720k1323k0300j8575j5844j2437r255o885n144l624
58644G39879k267j133N4J634L346M474M794M951N600O463O728O199N669O051P520
58629G99962R479J1135J2105J2726J3735J5401J7087J8015J8395J9314K1383K4047
58617I92784K6434K8423L0488L2853L5265L7389L9139M0724M2648M5398M8866
58606A400411N2282N5026N7329N9741O2256O4412O6053O7345O7987O7003O3690
$$ y = [981674, 959346, 936020, 912767, 890123, 868387, 848268, 830635, 815653, 802761, 791612, 782545, 775974, 771819, 769783, 769724, 771417, 774360, 778238, 783316, 789969, 798049, 807088, 816948, 827807, 839651, 852242, 865561, 879798, 894793, 909732, 923474, 934881, 942833, 946383, 945138, 939258, 928966, 914351, 895911, 874986, 853266, 831943, 811643, 793068, 777224, 764787, 755532, 748647, 743503, 739879, 737612, 736479, 736533, 738167, 741513, 745987, 750781, 755732, 761332, 767795, 774523, 780722, 786391, 792442, 799962, 809441, 820576, 832681, 845407, 859142, 874543, 891630, 909645, 928040, 947354, 968737, 992784, 1019218, 1047641, 1078129, 1110982, 1146247, 1183636, 1222775, 1263499, 1306147, 1351545, 1400411, 1452693, 1507719, 1565048, 1624789, 1687045, 1751457, 1817510, 1884855, 1952842, 2019845, 2083535]
58595B083535N8385N2002M4900L6562K6313J4316J734j0081k0573k9948l8264
58584B218881m4900m9316n1983n3863n5124n4935n2815m9572m6479m3893m1144
58573A674857l7668l3764l0125k6977k3952k0731j7546j4959j3245j2291j2082
58562A431517j2951j5058j7848k0403k2257k3539k4305k4235k3178k1626k0315
58551A205802j9417j8439j6915j5064j3725j3670j5042j7439k0400k3565k6396
58540A005730k8155k8453k7635k6325k4759k2807k0501j8144j5995j4203j2915
58529G65838j2072j1258j0131r009q530q794r262r421r110q239o824n288m182
58516F53718l466k667j706q86pJ558L661N104N171M663M773N569O346O935P762
$$ y = [2083535, 2141920, 2193922, 2238822, 2275384, 2301697, 2316013, 2317747, 2307666, 2287093, 2257145, 2218881, 2173981, 2124665, 2072682, 2018819, 1963695, 1908760, 1855945, 1806373, 1759894, 1716001, 1674857, 1637189, 1603425, 1573300, 1546323, 1522371, 1501640, 1484094, 1469135, 1455890, 1443599, 1431517, 1418566, 1403508, 1385660, 1365257, 1343000, 1319461, 1295156, 1270921, 1247743, 1226117, 1205802, 1186385, 1167946, 1151031, 1135967, 1122242, 1108572, 1093530, 1076091, 1055691, 1032126, 1005730, 977575, 949122, 921487, 895162, 870403, 847596, 827095, 808951, 792956, 778753, 765838, 753766, 742508, 732377, 723368, 714838, 706044, 696782, 687361, 678251, 670012, 663188, 657900, 653718, 650252, 647585, 645879, 644993, 644986, 646544, 650205, 655309, 660480, 665143, 669916, 675485, 681831, 688766, 696528]
58501F96528Q857R651R740R322Q877Q819R294R985J0248R756Q796P709O427M925
58487H18934L624K840K205J156l15j955l808n879p674q836r825j1237j2740j3483
58473G53007j3332j2806j2106j1077j0000r440r324r100q749q726q895q547p581
58460F23324o665o055n241l982k760j868j042l19k74q69j063j74J166K024K406
58445E98608K795L186L370L591M132M676M746M546M711N474O600P777Q675Q905
58431F71792Q342P240N794M046K407J561J467J203K78o07p41n76q89j446j467
58416F98404r03k90K99J079J639J383P63J022K561M363N304N278M954N033N806
58401G36695O861P162O006L982K435K026K363K885L379L610L310K798K845L663
$$ y = [696528, 705385, 715036, 724776, 734098, 742975, 751794, 761088, 771073, 781321, 791077, 799873, 807582, 814009, 818934, 822558, 825398, 827603, 828759, 828444, 826489, 822681, 816802, 809128, 800292, 790467, 779230, 766490, 753007, 739675, 726869, 714763, 703686, 693686, 684246, 674922, 665822, 657073, 648347, 639452, 630905, 623324, 616659, 610604, 605363, 601381, 598621, 596753, 595711, 595392, 595118, 594249, 593186, 593012, 594178, 596202, 598608, 601403, 604589, 607959, 611550, 615682, 620358, 625104, 629650, 634361, 639835, 646435, 654212, 662887, 671792, 680134, 687374, 693168, 697214, 699621, 701182, 702649, 703852, 704130, 703523, 702782, 702206, 701317, 699871, 698404, 697501, 697211, 697510, 698589, 700228, 701611, 702374, 703396, 705957, 710320, 715624, 720902, 725856, 730889, 736695, 743556, 750718, 756724, 760706, 763141, 765167, 767530, 770415, 773794, 777404, 780714, 783512, 786357, 790020]
58387G90020M587M987M980M975N063N162N345N699O173O724P257P430O935O159
58373H71496N991O698P458P400O684O140O099O134N944N964O822Q358R583R747
58359I70518R171Q717Q632Q415P886P636Q078Q709Q861Q728Q993R719J0331J0486
58345A094880J0347J0172J0164J0550J1253J1720J1678J1715J2473J3550J4096
58334A222598J4170J4551J5369J5951J6075J6288J6871J7509J8189J9378K0927
58323A407876K1851K1619K0888K0500K0511K0576K0606K0583K0428K0377K0781
58312A636596K1284K1054K0189J9905K0810K1996K2488K2629K3316K4630K6187
58301A881084K8024L0207L2143L3268L3931L4790L5807L6723L7894L9672M1408
$$ y = [790020, 794607, 799594, 804574, 809549, 814612, 819774, 825119, 830818, 836991, 843715, 850972, 858402, 865337, 871496, 877487, 884185, 891643, 899043, 905727, 911867, 917966, 924100, 930044, 936008, 942830, 951188, 960771, 970518, 979689, 988406, 997038, 1005453, 1013339, 1020975, 1029053, 1037762, 1046623, 1055351, 1064344, 1074063, 1084394, 1094880, 1105227, 1115399, 1125563, 1136113, 1147366, 1159086, 1170764, 1182479, 1194952, 1208502, 1222598, 1236768, 1251319, 1266688, 1282639, 1298714, 1315002, 1331873, 1349382, 1367571, 1386949, 1407876, 1429727, 1451346, 1472234, 1492734, 1513245, 1533821, 1554427, 1575010, 1595438, 1615815, 1636596, 1657880, 1678934, 1699123, 1719028, 1739838, 1761834, 1784322, 1806951, 1830267, 1854897, 1881084, 1909108, 1939315, 1971458, 2004726, 2038657, 2073447, 2109254, 2145977, 2183871, 2223543, 2264951]
58290B264951M2247M2591M3652M5678M7813M9621N1669N4353N7203N9629O1630
58279B821037O3403O4918O6178O7355O8422O9048O9037O8495O7547O6342O5307
58268C557089O4822O4578O3911O2970O3014O5142O9083P3570P7660Q1448Q5633
58257D328920R0669R6316J01977J07314J12475J17782J23490J29836J36853J43997
58247E489629J50518J56530J63154J71112J79717J88026J96450K06299K17913
58238G119348K30226K42317K54478K67568K82072K98080L15594L34402L54098
58229I698183L74667L96821M21489M49039M79169N11452N45970N83553O25394
58220A4085737O72289P24431P81967Q45512R15879R93739J080071J176713J285919
$$ y = [2264951, 2307198, 2349789, 2393441, 2439119, 2486932, 2536553, 2588222, 2642575, 2699778, 2759407, 2821037, 2884440, 2949358, 3015536, 3082891, 3151313, 3220361, 3289398, 3357893, 3425440, 3491782, 3557089, 3621911, 3686489, 3750400, 3813370, 3876384, 3941526, 4010609, 4084179, 4161839, 4243287, 4328920, 4419589, 4515905, 4617882, 4725196, 4837671, 4955453, 5078943, 5208779, 5345632, 5489629, 5640147, 5796677, 5959831, 6130943, 6310660, 6498686, 6695136, 6901435, 7119348, 7349574, 7591891, 7846369, 8113937, 8396009, 8694089, 9009683, 9344085, 9698183, 10072850, 10469671, 10891160, 11340199, 11819368, 12330820, 12876790, 13460343, 14085737, 14758026, 15482457, 16264424, 17109936, 18025815, 19019554, 20099625, 21276338, 22562257]
58211B2562257J409623J549852J709866J894431K108963K358808K648739K981653
58203C9224192L357229L773799M234813M756152N367486O104710O998075Q065339
58195H1881795R314978J0755345J2400572J4267351J6361947J8656613K1052109
58188A84690710K3327901K5096853K5800918K4794481K1540083J5872016Q196931
58181C29319893n19565r026564j6195587k1342922k4319051k5383666k4995903
58174B07536635k3639034k1723212j9553422j7335683j5199392j3220337j1437234
58167H5428321r862983q493589p315108o308212n451458m723978m106879l583241
58159C5582873l138023k758444k434110k156481j918292j713182j535435j380081
$$ y = [22562257, 23971880, 25521732, 27231598, 29126029, 31234992, 33593800, 36242539, 39224192, 42581421, 46355220, 50590033, 55346185, 60713671, 66818381, 73816456, 81881795, 91196773, 101952118, 114352690, 128620041, 144981988, 163638601, 184690710, 208018611, 233115464, 258916382, 283710863, 305250946, 321122962, 329319893, 328800328, 319773764, 303578177, 282235255, 257916204, 232532538, 207536635, 183897601, 162174389, 142620967, 125285284, 110085892, 96865555, 85428321, 75565338, 67071749, 59756641, 53448429, 47996971, 43272993, 39166114, 35582873, 32444850, 29686406, 27252296, 25095815, 23177523, 21464341, 19928906, 18548825]
58151A8548825j243501j123554j018558r26332q44618p72045p07930o51221o00377
58142A0660689n54238n12425m74833m41163m10912l83481l58317l35224l14286
58133F875810k95171k76987k59278k42758k28356k15890k04385j93308j82740
58124D776937j72596j62703j53508j45748j39279j33149j26848j20727j15067
58115C507312j09656j04423r9621r5050q9974q4251p8760p4249p0391o6503o2597
58104B571837n9120n6122n3305n0545m7866m5139m2297l9673l7709l6535l6124
58093B067402l6600l8061m0236m2657m4903m6456m6647m5276m3093m1179l9838
58082A602456l8468l6558l4434l2904l2337l2239l1707l0324k8574k7215k6322
$$ y = [18548825, 17305324, 16181770, 15163212, 14236880, 13392262, 12620217, 11912287, 11261066, 10660689, 10106451, 9594026, 9119193, 8678030, 8267118, 7883637, 7525320, 7190096, 6875810, 6580639, 6303652, 6044374, 5801616, 5573260, 5357370, 5152985, 4959677, 4776937, 4604341, 4441638, 4288130, 4142382, 4003103, 3869954, 3743106, 3622379, 3507312, 3397656, 3293233, 3193612, 3098562, 3008588, 2924337, 2845577, 2771328, 2700937, 2634434, 2571837, 2512717, 2456595, 2403290, 2352745, 2304879, 2259740, 2217443, 2177770, 2140061, 2103526, 2067402, 2030802, 1992741, 1952505, 1909848, 1864945, 1818489, 1771842, 1726566, 1683473, 1642294, 1602456, 1563988, 1527430, 1492996, 1460092, 1427755, 1395516, 1363809, 1333485, 1304911, 1277696, 1251374]
58071A251374k5255k3637k2010k1085k0658j9786j7990j5818j4119j3169j2696
58060A045151j2451j2323j2125j1658j1042j0663j0625j0553j0199r927j0251
58049I23334j0934j1111j0397r453r103r297r334q857q151p487o722n667m505
58036H12316l667l407l586l758l538l019k744l046l613l953m101m411m772m636
58022G60065l904l178k931k985l127l669m756n568n007l170j436q58j035q54M7
58007G17634J143K031K963M198N372N915N862N861O374P182P695P547O811N964
57993G92552N626O012O602O691O346O373P133P967Q147P854P646P410O663N646
57979H88668N146N201M828L323J082j295m010p604j1885j5940j9145k1543k3303
$$ y = [1251374, 1226119, 1202482, 1180472, 1159387, 1138729, 1118943, 1100953, 1085135, 1071016, 1057847, 1045151, 1032700, 1020377, 1008252, 996594, 985552, 974889, 964264, 953711, 943512, 933585, 923334, 912400, 901289, 890892, 881439, 872336, 863039, 853705, 844848, 836697, 829210, 822488, 816821, 812316, 808649, 805242, 801656, 797898, 794360, 791341, 788597, 785551, 781938, 777985, 773884, 769473, 764701, 760065, 756161, 752983, 750052, 747067, 743940, 740271, 735515, 729947, 724940, 721770, 720334, 719476, 718441, 717587, 717634, 718777, 720808, 723771, 727969, 733341, 739256, 745118, 750979, 757353, 764535, 772230, 779777, 786588, 792552, 798178, 804190, 810792, 817483, 823829, 830202, 837335, 845302, 853449, 861303, 868949, 876359, 883022, 888668, 893814, 899015, 903843, 907166, 908248, 906953, 902943, 895339, 883454, 867514, 848369, 826826, 803523]
57966H03523k4199k3817k2099j9574j7051j4968j3089j0894q348n985m257l026
57954F36216j897p83R2O13R26J213J468J465R13l29k052l789n148o063o729p381
57938F08735q101q638q454p168n008k715q67N38J845L284M755N863O105N234L535
57923E98943J532n41k793n149p126q357r053r701j0358j0520r711q100o462n504
57909E07100n206m890l937k349n80R07J696J430J82j323k346k880l405m021m445
57894D75933m729n311o207o823o786o381n908n256m422l829l592l066j719n6R01
57879D12749Q56M22L11Q68K138L790N093N466N079M495L904L140K260J585J156
57864D53312O57p4r21j830k871l843m273l955l234k634k375k298k060j520j032
$$ y = [803523, 779324, 755507, 733408, 713834, 696783, 681815, 668726, 657832, 649484, 643499, 639242, 636216, 634319, 633536, 633628, 634241, 635167, 636380, 637848, 639313, 640226, 639897, 637845, 634056, 628908, 622845, 616116, 608735, 600634, 591996, 583542, 576374, 571366, 568651, 567784, 568322, 570167, 573451, 578206, 584069, 590174, 595408, 598943, 600475, 599934, 597141, 591992, 584866, 576509, 567456, 557755, 547397, 536877, 527166, 519066, 512604, 507100, 501894, 497004, 493067, 490718, 490138, 491045, 492741, 494171, 494353, 493030, 490684, 487804, 484399, 480378, 475933, 471204, 465893, 459686, 452863, 446077, 439696, 433788, 428532, 424110, 420281, 416689, 413623, 411904, 411848, 412749, 413605, 414027, 414338, 415206, 417344, 421134, 426227, 431693, 436772, 441267, 445171, 448311, 450571, 452156, 453312, 453969, 453895, 452974, 451144, 448273, 444430, 440157, 436202, 432968, 430334, 427959, 425661, 423601, 422081, 421049]
57849D21049j218k134k899k559j178L78J602K610L414L637L286K993L161L320
57835D35462K911K215J844J620O25j608m569p533j0197j2261j3010j1990r882
57822C73627q072p226o709n596l723j504P75K942M587N426N961P037Q596R598
57808C85719R486R077R545J0951J2411J3353J4020J4803J5666J6251J6162J5093
57796E42537J2979J0069O662K870j117m764p534r531j1353j3364j5281j6496j6612
57783D79065j5742j4542j3836j3879j4100j3820j3010j2018j0831r118o995n136
57771C36038m023l503l178k815k323j670r95m89q0M73J168J709J969K144K393
57756C26818K623K801L104L664M324M872N260N529N652N601N476N490N874O653
$$ y = [421049, 419831, 417697, 414798, 412239, 411061, 411439, 413041, 415651, 419065, 422702, 425988, 428981, 432142, 435462, 438373, 440588, 442432, 444052, 444677, 443069, 438500, 430967, 420770, 408509, 395499, 383509, 373627, 365555, 358329, 351620, 346024, 342301, 340797, 341572, 344514, 349101, 354527, 360488, 367525, 376121, 385719, 395205, 404282, 413827, 424778, 437189, 450542, 464562, 479365, 495031, 511282, 527444, 542537, 555516, 565585, 572247, 575117, 574000, 569236, 561702, 552171, 540818, 527454, 512173, 495677, 479065, 463323, 448781, 434945, 421066, 406966, 393146, 380136, 368118, 357287, 348169, 341174, 336038, 332015, 328512, 325334, 322519, 320196, 318526, 317531, 317042, 316962, 317435, 318603, 320312, 322281, 324425, 326818, 329441, 332242, 335346, 339010, 343334, 348206, 353466, 358995, 364647, 370248, 375724, 381214, 387088, 393741]
57742C93741P430P618P067O275N730N345M895M604M702M749M131L151K736L100
57728D65274L529L659M076N230O558P243P301P352P684Q100Q377Q449Q355Q262
57714E59449Q373Q655Q999R771J1592J4314J6792J8140J8698J9334K0245K0992
57702G35354K1348K1458K1528K1852K2976K5234K8299L1606L5020L8685M2529
57691A045889M6372N0295N4395N8481O2440O6619P1293P6010Q0047Q3262Q6020
57680A781123Q8538R0925R3428R5899R7425R7460R7253R9130J04312J12239J21642
57669B879374J30536J34242J24742R4123M0134l0576j04145j65332k04210k19569
57659B679319k16812k02828j82753j60194j38163j18524j01399q6164p2749o1280
$$ y = [393741, 401171, 408789, 415856, 422131, 427861, 433206, 438101, 442705, 447407, 452156, 456287, 459438, 462174, 465274, 468803, 472462, 476538, 481768, 488326, 495569, 502870, 510222, 517906, 526006, 534383, 542832, 551187, 559449, 567822, 576477, 585476, 595247, 606839, 621153, 637945, 656085, 674783, 694117, 714362, 735354, 756702, 778160, 799688, 821540, 844516, 869750, 898049, 929655, 964675, 1003360, 1045889, 1092261, 1142556, 1196951, 1255432, 1317872, 1384491, 1455784, 1531794, 1611841, 1695103, 1781123, 1869661, 1960586, 2054014, 2149913, 2247338, 2344798, 2442051, 2541181, 2645493, 2757732, 2879374, 3009910, 3144152, 3268894, 3363017, 3403151, 3372575, 3268430, 3103098, 2898888, 2679319, 2462507, 2259679, 2076926, 1916732, 1778569, 1660045, 1558646, 1472482, 1399733, 1338453]
57649A338453n1272m2065l3848k7272k2201j7650j2948q264l980j42L390O775
57637A128976J0267J4006J7705K0933K3667K6213K8698L1125L3799L7123M0948
57626A413460M4616M7724N0298N2347N3823N5016N6188N6575N4640M9749M2940
57615A977376L5553K7702J8738Q654j835j2245k2511l2275m0822m7850n3669n8479
57603A798337o2052o4261o5334o5307o3765o0643n6866n3617n1106m8483m5043
57592A161860m1060l7399l4543l2232k9907k7276k4458k1771j9548j8038j7220
57581H58408j6563j5336j3356j1324j0035r385q569p208n821n024m690m162l040
57568G43895j529j85N32O75Q37J552K623L462M083N103O535P395P088O470O718
$$ y = [1338453, 1287181, 1245116, 1211268, 1183996, 1161795, 1144145, 1131197, 1122933, 1118953, 1118811, 1122201, 1128976, 1139243, 1153249, 1170954, 1191887, 1215554, 1241767, 1270465, 1301590, 1335389, 1372512, 1413460, 1458076, 1505800, 1556098, 1608445, 1662268, 1717284, 1773472, 1830047, 1884687, 1934436, 1977376, 2012929, 2040631, 2059369, 2068023, 2066188, 2053943, 2031432, 1999157, 1958335, 1910485, 1856816, 1798337, 1736285, 1672024, 1606690, 1541383, 1477618, 1416975, 1360109, 1306492, 1255386, 1206903, 1161860, 1120800, 1083401, 1048858, 1016626, 986719, 959443, 934985, 913214, 893666, 875628, 858408, 841845, 826509, 813153, 801829, 791794, 782409, 773840, 766632, 760811, 755787, 751097, 746935, 743895, 742366, 742181, 742713, 743388, 744225, 745777, 748400, 751862, 755945, 761048, 767583, 774978, 782066, 788536, 795254]
57553G95254P721Q577R266J0590J2503J3862J4235J4741J6469J8951K0993K2309
57541I65471K3461K4726K5992K7491K9700L2483L5090L7134L9034M1286M3757
57530A325625M5894M7303M8008M8316M8463M8235M7005M4357M0562L6140L1048
57519A810956K4680J6736P792j093r150j6295k2860k8966l4152l7796l9930m1318
57507A628604m2493m3069m2388m0545l8214l5679l2605k8808k4770k1201j8481
57496A260351j6524j4823j2719r980p178n086l645k063Q1K356M286O113Q308J0801
57482A220278J3131J5120J7009J9043K1248K3505K5684K7749K9908L2462L5321
57471A480458L7952M0035M1966M4309M6905M8830M9301M8277M6153M3108L8985
$$ y = [795254, 802975, 811552, 820818, 831408, 843911, 857773, 872008, 886749, 903218, 922169, 943162, 965471, 988932, 1013658, 1039650, 1067141, 1096841, 1129324, 1164414, 1201548, 1240582, 1281868, 1325625, 1371519, 1418822, 1466830, 1515146, 1563609, 1611844, 1658849, 1703206, 1743768, 1779908, 1810956, 1835636, 1852372, 1860164, 1859071, 1849921, 1833626, 1810766, 1781800, 1747648, 1709852, 1669922, 1628604, 1586111, 1543042, 1500654, 1460109, 1421895, 1386216, 1353611, 1324803, 1300033, 1278832, 1260351, 1243827, 1229004, 1216285, 1206305, 1199127, 1194041, 1190396, 1188333, 1188414, 1190770, 1195056, 1201169, 1209477, 1220278, 1233409, 1248529, 1265538, 1284581, 1305829, 1329334, 1355018, 1382767, 1412675, 1445137, 1480458, 1518410, 1558445, 1600411, 1644720, 1691625, 1740455, 1789756, 1838033, 1884186, 1927294, 1966279]
57460A966279L3638K7160J9798J1817L582m381j1648j8318k4860l1345l7069m1196
57448A893457m3643m4936m5389m4841m3284m1139l8767l6123l3152l0103k7207
57437A464873k4321k1336j8589j6484j4826j2963j0604q141o153m814l883l071
57425A319688k339j841j621j340n61O69J762K291K590L327M563N591N781N344
57411A343904N163N883P334Q757R537R679R568R515R631J0024J0729J1462J1781
57398A462967J1609J1316J1215J1231J1275J1546J2195J2973J3540J3888J4185
57387A597940J4411J4504J4712J5267J5818J5745J5072J4634J5078J6089J6773
57376A766043J6670J6090J5632J5560J5646J5510J5070J4671J4697J5131J5660
$$ y = [1966279, 1999917, 2027077, 2046875, 2058692, 2062274, 2057893, 2046245, 2027927, 2003067, 1971722, 1934653, 1893457, 1849814, 1804878, 1759489, 1714648, 1671364, 1630225, 1591458, 1555335, 1522183, 1492080, 1464873, 1440552, 1419216, 1400627, 1384143, 1369317, 1356354, 1345750, 1337609, 1331456, 1326642, 1322759, 1319688, 1317349, 1315508, 1313887, 1312547, 1311986, 1312655, 1314417, 1316708, 1319298, 1322625, 1327188, 1332779, 1338560, 1343904, 1349067, 1354950, 1362284, 1371041, 1380578, 1390257, 1399825, 1409340, 1418971, 1428995, 1439724, 1451186, 1462967, 1474576, 1485892, 1497107, 1508338, 1519613, 1531159, 1543354, 1556327, 1569867, 1583755, 1597940, 1612351, 1626855, 1641567, 1656834, 1672652, 1688397, 1703469, 1718103, 1733181, 1749270, 1766043, 1782713, 1798803, 1814435, 1829995, 1845641, 1861151, 1876221, 1890892, 1905589, 1920720, 1936380]
57365A936380J6155J6824J7783J8711J9103J8856J8381J8107J8058J8083J8304
57354B134745J9001J9993K0571K0369K0026K0460K1602K2466K2476K2121K2029
57343B365859K2047K1750K1361K1545K2472K3696K4812K5691K6139K5908K5182
57332B626462K4592K4615K5216K6072K6795K7056K6835K6655K7101K8074K8915
57321B918388K9292K9525K9956L0452L0694L0608L0359L0277L0880L2463L4382
57310C257276L5331L4724L3485L3047L3839L5165L6248L6805L6823L6383L5792
57299C644918L5393L5056L4193L2459L0194K8070K6443K5115K3561K1305J8310
57288C955017J5118J2539J1056J0511J0368J0247J0157J0323J0860J1657J2519
$$ y = [1936380, 1952535, 1969359, 1987142, 2005853, 2024956, 2043812, 2062193, 2080300, 2098358, 2116441, 2134745, 2153746, 2173739, 2194310, 2214679, 2234705, 2255165, 2276767, 2299233, 2321709, 2343830, 2365859, 2387906, 2409656, 2431017, 2452562, 2475034, 2498730, 2523542, 2549233, 2575372, 2601280, 2626462, 2651054, 2675669, 2700885, 2726957, 2753752, 2780808, 2807643, 2834298, 2861399, 2889473, 2918388, 2947680, 2977205, 3007161, 3037613, 3068307, 3098915, 3129274, 3159551, 3190431, 3222894, 3257276, 3292607, 3327331, 3360816, 3393863, 3427702, 3462867, 3499115, 3535920, 3572743, 3609126, 3644918, 3680311, 3715367, 3749560, 3782019, 3812213, 3840283, 3866726, 3891841, 3915402, 3936707, 3955017, 3970135, 3982674, 3993730, 4004241, 4014609, 4024856, 4035013, 4045336, 4056196, 4067853, 4080372]
57277D080372J3339J4057J4608J5098J5905J7335J9071K0359K0877K1104K1533
57266D273658K1873K1451K0263J9197J9093K0031K1460K2732K3317K3020K2232
57255D508327K1722K1883K2332K2480K2315K2238K2318K2156K1514K0732K0346
57244D748363K0533K1092K1728K2148K2043K1314K0281J9443J8979J8637J8174
57233D972735J7678J7435J7598J8074J8612J8946J8993J9051J9632K0915K2393
57222E182062K3347K3569K3529K3670K3867K3730K3326K3213K3651K4072K3687
57211E441723K2534K1528K1321K1500K1297K0733K0451K0569K0428J9687J8970
57200E670741J8959J9420J9770K0210K1561K4054K7074L0061L2942L5397L6410
$$ y = [4080372, 4093711, 4107768, 4122376, 4137474, 4153379, 4170714, 4189785, 4210144, 4231021, 4252125, 4273658, 4295531, 4316982, 4337245, 4356442, 4375535, 4395566, 4417026, 4439758, 4463075, 4486095, 4508327, 4530049, 4551932, 4574264, 4596744, 4619059, 4641297, 4663615, 4685771, 4707285, 4728017, 4748363, 4768896, 4789988, 4811716, 4833864, 4855907, 4877221, 4897502, 4916945, 4935924, 4954561, 4972735, 4990413, 5007848, 5025446, 5043520, 5062132, 5081078, 5100071, 5119122, 5138754, 5159669, 5182062, 5205409, 5228978, 5252507, 5276177, 5300044, 5323774, 5347100, 5370313, 5393964, 5418036, 5441723, 5464257, 5485785, 5507106, 5528606, 5549903, 5570636, 5591087, 5611656, 5632084, 5651771, 5670741, 5689700, 5709120, 5728890, 5749100, 5770661, 5794715, 5821789, 5851850, 5884792, 5920189, 5956599]
57189E956599L5084L1639K7184K2819J9155J6405J4374J2427R954O979M046J514
57177F158179p97l168n487p352q589r429j0195j1052j2161j3856j6366j9334k1984
57164F018409k3945k5595k7381k9056l0025l0227l0116k9823k8957k7362k5496
57153E710426k3774k1989j9811j7474j5561j4270j3262j2236j1341j1019j1562
57142E538127j2810j4242j5487j6779j8599k0849k2760k3815k4300k4667k4720
57131E319099k3967k2494k0903j9553j8367j7321j6582j6032j5173j3726j1927
57120E123054r985p447l323L256J2623K4577L8490N3190O6988P8171Q6094R1990
57108E557678R8560J08447J23121J43049J68484J99758K37255K81748L34633L97395
$$ y = [5956599, 5991683, 6023322, 6050506, 6073325, 6092480, 6108885, 6123259, 6135686, 6145640, 6152619, 6156665, 6158179, 6157382, 6154214, 6148727, 6141375, 6132786, 6123357, 6113162, 6102110, 6089949, 6076093, 6059727, 6040393, 6018409, 5994464, 5968869, 5941488, 5912432, 5882407, 5852180, 5822064, 5792241, 5763284, 5735922, 5710426, 5686652, 5664663, 5644852, 5627378, 5611817, 5597547, 5584285, 5572049, 5560708, 5549689, 5538127, 5525317, 5511075, 5495588, 5478809, 5460210, 5439361, 5416601, 5392786, 5368486, 5343819, 5319099, 5295132, 5272638, 5251735, 5232182, 5213815, 5196494, 5179912, 5163880, 5148707, 5134981, 5123054, 5113069, 5105622, 5102299, 5105555, 5118178, 5142755, 5181245, 5234435, 5301423, 5379594, 5465688, 5557678, 5656238, 5764685, 5887806, 6030855, 6199339, 6399097, 6636352, 6918100, 7252733, 7650128]
57098G650128M70826N55218O51252P60116Q82444J017418J163026J316866J476380
57089A5943674J638386J798361J949947K085033K194322K267734K294077K260807
57081C2432341K155390J968532J697973J351288R46435N09053O6544l58387p50986
57072D0018183j103333j411218j671790j882608k041503k147105k199895k202863
57064B5357868k161230k081819j972690j842565j699749j551240j402758j258974
57056A1386843j123231r97279q81895p77704o85194o04121n33484m72013m18493
57047D893429l71708l30615k94653k63560k36935k14232j95035j78867j64806
57038B643018j51775j39430j28249j18528j09755j01319r3429q6813q1570p6868
$$ y = [7650128, 8120954, 8676172, 9327424, 10087540, 10969984, 11987402, 13150428, 14467294, 15943674, 17582060, 19380421, 21330368, 23415401, 25609723, 27877457, 30171534, 32432341, 34587731, 36556263, 38254236, 39605524, 40551959, 41061012, 41127556, 40769169, 40018183, 38914850, 37503632, 35831842, 33949234, 31907731, 29760626, 27560731, 25357868, 23196638, 21114819, 19142129, 17299564, 15599815, 14048575, 12645817, 11386843, 10263612, 9266333, 8384438, 7606734, 6921540, 6317419, 5783935, 5311922, 4893429, 4521721, 4191106, 3896453, 3632893, 3395958, 3181726, 2986691, 2807824, 2643018, 2491243, 2351813, 2223564, 2105036, 1995281, 1893962, 1800533, 1713720, 1632150, 1555282]
57028A555282p1898o6758o2115n8264n4857n1555m8531m6083m3993m1711l9084
57017I70433l6530l4389l2555l0904k9648k8877k8079k6635k4630k2693k1124
57006F54369j9694j8342j7453j7245j7295j6993j6235j5386j4790j4419j3893
56995D72624j2805j1146r432q125o978n391l369j569k88R95K655M186M934N039
56981D31330M949M426K915P04j266k803m703p287r499j0132r295q136p403o914
56967C76886o193n062l559j768J22J828L095L829M242M898O234P813Q371O953
56953D07689L895M10k556m793o461p790r044j0211j0830j0456r306p950o466m468
56939C21663j961M66K463M392O627Q888J0603J1619J2210J2536J2290J0774P358
$$ y = [1555282, 1483384, 1416626, 1354511, 1296247, 1241390, 1189835, 1141304, 1095221, 1051228, 1009517, 970433, 933903, 899514, 866959, 836055, 806407, 777530, 749451, 722816, 698186, 675493, 654369, 634675, 616333, 598880, 581635, 564340, 547347, 531112, 515726, 500936, 486517, 472624, 459819, 448673, 439241, 431116, 424138, 418747, 415378, 413809, 413521, 414516, 417171, 421357, 426291, 431330, 436279, 440705, 443620, 444324, 443058, 440255, 435552, 428265, 418766, 408634, 399339, 391203, 383800, 376886, 370693, 365631, 362072, 360304, 360426, 362254, 365349, 369178, 373420, 378318, 384552, 392365, 400736, 407689, 411584, 411994, 409438, 404645, 398184, 390394, 381350, 371139, 360309, 349853, 340547, 332597, 326131, 321663, 319702, 320168, 322631, 327023, 333650, 342538, 353141, 364760, 376970, 389506, 401796, 412570, 419928]
56926D19928K278l084p259j0123j2704j5417j7329j7594j6751j5838j4911j3402
56914B77794j1462r800q459o840n002l846l751l923l528k662j799j013l04o2n15
56899B14828j062q07L84J858L001L706M131M462M897N590O546P649Q716R402R371
56884B82672Q676P739O643M817J803j787m561n583n122m214l656l445k984j795
56870B79203r4J505K850M575P296J0736J3885J5942J6955J7650J8834K0672K2275
56857D32284K2057J8965J3352O564j99o346j1444j4917j6372j5995j4399j2130
56845D01420r376o103k365J551N326Q925J2512J6179J9948K4002K8447L2705L5535
56832E68706L5902L3498K8232J9860Q746l393j4251k2535k8295l1892l3314l2536
$$ y = [419928, 422206, 419122, 411863, 401740, 389036, 373619, 356290, 338696, 321945, 306107, 291196, 277794, 266332, 256532, 248073, 241233, 236231, 232385, 228634, 224711, 221183, 218521, 216722, 215709, 215405, 215343, 214828, 213766, 212959, 213343, 215201, 218202, 221908, 226039, 230501, 235398, 240988, 247534, 255183, 263899, 273301, 282672, 291348, 299087, 305730, 310547, 312350, 310563, 306002, 300419, 295297, 291083, 287427, 283982, 280998, 279203, 279109, 280614, 283464, 288039, 295335, 306071, 319956, 335898, 352853, 370503, 389337, 410009, 432284, 454341, 473306, 486658, 493222, 493023, 486677, 475233, 460316, 443944, 427949, 413550, 401420, 392044, 385941, 383576, 385127, 390453, 399378, 411890, 428069, 448017, 472019, 500466, 533171, 568706, 604608, 638106, 666338, 686198, 694944, 691551, 677300, 654765, 626470, 594578, 561264, 528728]
56820E28728k9897k5907k1129j6337j2190q568m652j2M875R367J3489J7552K1314
56807D76633K3983K4856K3530J9726J3409N149l972j2824k0461k6064k9155k9959
56795D64851k9181k7262k4213k0260j6239j2891j0031o889l227L98L541O390R140
56782C34127J1359J2537J2823J2527J1103P569K080l810q719j2535j5587j7559
56770C45915j8063j7680j7393j7266j6526j4847j2784j0895r248p861o852n993
56758A90507m862l591k811k591k188j242m82o70j484j993j880j542j280j127j217
56743A61547j721k373k540j907p90K02N95K90l47p30o46m96o57q12l64N67J067
56726A50885N18n57j084o64K5J09m26p98m71K19O57P72Q63Q38L50l67n32R2Q19
$$ y = [528728, 498831, 472924, 451795, 435458, 423268, 414700, 410048, 410036, 414911, 424278, 437767, 455319, 476633, 500616, 525472, 549002, 568728, 582137, 587286, 583314, 570490, 550029, 523965, 494810, 464851, 435670, 408408, 384195, 363935, 347696, 334805, 324774, 317885, 314658, 315056, 318597, 324987, 334127, 345486, 358023, 370846, 383373, 394476, 402045, 404125, 400315, 391596, 379061, 363474, 345915, 327852, 310172, 292779, 275513, 258987, 244140, 231356, 220461, 211213, 203352, 196500, 190507, 185645, 182054, 179243, 176652, 174464, 173222, 172740, 172070, 170586, 168593, 166713, 165171, 163891, 162764, 161547, 159826, 157453, 154913, 153006, 152216, 152418, 153013, 153303, 152956, 152226, 151580, 151084, 150427, 149615, 149251, 149818, 150885, 151403, 150846, 149762, 149098, 149123, 149232, 148806, 148008, 147537, 147756, 148413, 149185, 150048, 150886, 151236, 150869, 150337, 150429, 151248]
56707A51248J131J375J926K304J890J051O59Q32R97J017J332J956K280K050J720
56692A73768J568J181L08m99o21k91j72l73m61k95k61o25j112j286j027n47o9
56675A69186L48O82P60L62m25j059j050n13m2M2p0j76m24r08j298j243r10p41
56657A62521p65o17k22j4l02q14j130j330j787k430k635k038j148p89j043j155
56641A44302n62L80Q69O33J24j04J03N42R17R95Q05O59P83Q87L83q27k050k382
56623A46457j543n5J204J577R96np29q68o09k33J54N02O96P46Q84J228J537J518
56605A53457J266J116J113R30L67l20p18o99l97N4N83R85R98O64M56P77J422J762
56587A63816J478Q80M43L10L56M67M91K70n2P6R05J806J993J718K065L373M583
$$ y = [151248, 152379, 153754, 155680, 157984, 159874, 160925, 161584, 162416, 163413, 164430, 165762, 167718, 169998, 172048, 173768, 175336, 176517, 176825, 176326, 175705, 175414, 175242, 174869, 174408, 174113, 173852, 173227, 172115, 170829, 169802, 169255, 169186, 169534, 170216, 170976, 171338, 170913, 169854, 168804, 168291, 168249, 168291, 168221, 168045, 167621, 166713, 165415, 164172, 163262, 162521, 161756, 161139, 160917, 160903, 160601, 159787, 158657, 157327, 155540, 153110, 150475, 148437, 147289, 146500, 145457, 144302, 143740, 144120, 144989, 145622, 145746, 145642, 145745, 146287, 147204, 148199, 149004, 149663, 150446, 151333, 151716, 150889, 148839, 146457, 144914, 144859, 146063, 147640, 148636, 148631, 147902, 147034, 146425, 146192, 146346, 146848, 147544, 148290, 149174, 150402, 151939, 153457, 154723, 155839, 156952, 157882, 158249, 157929, 157211, 156512, 156115, 156169, 156752, 157737, 158735, 159399, 159855, 160632, 162054, 163816, 165294, 166174, 166617, 166927, 167283, 167750, 168241, 168511, 168459, 168535, 169440, 171246, 173239, 174957, 177022, 180395, 184978]
56570A84978M578L668L116L521M314M779M842M806M830M947N226N584N710N389
56556B50288M852M496M459M470M137L176J575l25j939k832l009k820k652k826
56542B61050l530m628n576n866n603n446n846o505o728o170n091m029l364l121
56528A89547l050k895k641k430k187j595n77M41R75R87O43j17j232k008j680n79
56512A71602mo22j711k266k219k042j826j527j581k336l151k996j885q05k87L8
56496A46382L49J95n12r69o07N4K87K67N84J121J332J259J449J935K138J849J564
56479A58677J671J894J829J576J615K256L311M125L958K728J352R41J602K416
56465A89951K664K515K443K449K275J923J515R32Nr78j471j326r97j012j497k174
$$ y = [184978, 189556, 193224, 196340, 199861, 204175, 208954, 213796, 218602, 223432, 228379, 233605, 239189, 244899, 250288, 255140, 259636, 264095, 268565, 272702, 275878, 277453, 277128, 275189, 272357, 269348, 266528, 263876, 261050, 257520, 252892, 247316, 241450, 235847, 230401, 224555, 218050, 211322, 205152, 200061, 196032, 192668, 189547, 186497, 183602, 180961, 178531, 176344, 174749, 174172, 174613, 175588, 176575, 177218, 177101, 175869, 173861, 172181, 171602, 171598, 170976, 169265, 166999, 164780, 162738, 160912, 159385, 157804, 155468, 152317, 149321, 147436, 146631, 146344, 146382, 146731, 146926, 146414, 145445, 144838, 144892, 145179, 145446, 146030, 147151, 148483, 149742, 151191, 153126, 155264, 157113, 158677, 160348, 162242, 164071, 165647, 167262, 169518, 172829, 176954, 180912, 183640, 184992, 185933, 187535, 189951, 192615, 195130, 197573, 200022, 202297, 204220, 205735, 206667, 206672, 205694, 204223, 202897, 201900, 200888, 199391, 197217]
56449A97217k579k342j436k43P48J235J113L51q25j849k215j972j541j085m97
56434A84080L1o2r26j906k333k311k309k187j343J83J404J511Q97O12J053J603
56418A77997J526Q33J40p5J33M62P91J211J712K083K214K301K519K680K512K237
56402B01276K358K842K979K334J412R97J124J219J057R54J031Q71J56p29j087
56387B18794p69l42m01q84j201r90n62m30n54l99K32Q83J150J218J309J120L79
56370B18553l28o7J176K457L041L018K711K204J704J613J918K038J674J272J285
56355B44269J493J481J348J430J700J882J959K027J984J708J400J319J428J598
56341B67026J943K535L075L277L279L312L285L148L287L991M784M980M695M556
$$ y = [197217, 194638, 192296, 190860, 190617, 191365, 192600, 193713, 194064, 193239, 191390, 189175, 187203, 185662, 184577, 184080, 184111, 184049, 183123, 181217, 178884, 176573, 174264, 172077, 170734, 170917, 172321, 173832, 174729, 175341, 176394, 177997, 179523, 180356, 180496, 180421, 180554, 181016, 181807, 183018, 184730, 186813, 189027, 191328, 193847, 196527, 199039, 201276, 203634, 206476, 209455, 211789, 213201, 214198, 215322, 216541, 217598, 218552, 219583, 220454, 220610, 219881, 218794, 218025, 217683, 217282, 216398, 215197, 214207, 213645, 213215, 212661, 212262, 212494, 213377, 214527, 215745, 217054, 218174, 218553, 218225, 218158, 219334, 221791, 224832, 227850, 230561, 232765, 234469, 236082, 238000, 240038, 241712, 242984, 244269, 245762, 247243, 248591, 250021, 251721, 253603, 255562, 257589, 259573, 261281, 262681, 264000, 265428, 267026, 268969, 271504, 274579, 277856, 281135, 284447, 287732, 290880, 294167, 298158, 302942, 307922, 312617, 317173]
56327C17173M635M429L908L707M106M642M962N324N867O029N297M046L138K938
56313C80201L179L508L702L556K990K290J863J778J823J874K026K394K969L618
56299D17771M076M106L837L832M478N482O268O798P596Q950J0497J1811J3006
56286E08508J4360J5640J6361J6714J7557J9287K1228K2612K3777K5701K8553
56275G30298L1521L4157L7035M0811M5316N0109N5358O1492O8398P5660Q3378
56264A313533R2050J01746J11997J22449J32983J43206J52453J60349J66747J70988
56254B668501J71948J69046J62688J53294J40358J22923J00843P5311M8301K1648
56244C834861l645k7452m9801p0067q7165j00576j10936j19359j26436j32035
$$ y = [317173, 321808, 326237, 330145, 333852, 337958, 342600, 347562, 352886, 358753, 364782, 370079, 374125, 377263, 380201, 383380, 386888, 390590, 394146, 397136, 399426, 401289, 403067, 404890, 406764, 408790, 411184, 414153, 417771, 421847, 425953, 429790, 433622, 438100, 443582, 449850, 456648, 464244, 473194, 483691, 495502, 508508, 522868, 538508, 554869, 571583, 589140, 608427, 629655, 652267, 676044, 701745, 730298, 761819, 795976, 833011, 873822, 919138, 969247, 1024605, 1086097, 1154495, 1230155, 1313533, 1405583, 1507329, 1619326, 1741775, 1874758, 2017964, 2170417, 2330766, 2497513, 2668501, 2840449, 3009495, 3172183, 3325477, 3465835, 3588758, 3689601, 3764912, 3813213, 3834861, 3831216, 3803764, 3753963, 3683896, 3596731, 3496155, 3385219, 3265860, 3139424, 3007389]
56234C007389j35824j37745j38066j37104j34847j30996j25586j19411j13456
56225A834354j07972j02504r6739r0739q4412p7461p0103o3188n7177n1561m5762
56214I86736m0163l5669l2557l0230k7977k5507k2895k0432j8422j6844j5229
56203G00811j3180j0906r030q003p792p970p894p114n833m732m094l361j952j28
56189F08822J313K095K651L360M033M290M114L888L971M414N043N853P111Q857
56175F69815J0477J1194J1095J1200J2253J3870J5067J5255J4507J3342J2592
56164H10667J2946J4142J5040J5066J5102J6347J8736K1240K3544K6473L0800
56153A020103L6513M3423N1807O2111P4465Q8731J04463J20452J34543J44190
$$ y = [3007389, 2871565, 2733820, 2595754, 2458650, 2323803, 2192807, 2067221, 1947810, 1834354, 1726382, 1623878, 1527139, 1436400, 1351988, 1274527, 1204424, 1141236, 1084059, 1032498, 986736, 946573, 910904, 878347, 848117, 820140, 794633, 771738, 751306, 732884, 716040, 700811, 687631, 676725, 667695, 659692, 651900, 643930, 636036, 628922, 623089, 618357, 614263, 610902, 608950, 608822, 610135, 612230, 614881, 618241, 622274, 626564, 630678, 634566, 638537, 642951, 647994, 653847, 660958, 669815, 680292, 691486, 702581, 713781, 726034, 739904, 754971, 770226, 784733, 798075, 810667, 823613, 837755, 852795, 867861, 882963, 899310, 918046, 939286, 962830, 989303, 1020103, 1056616, 1100039, 1151846, 1213957, 1288422, 1377153, 1481616, 1602068, 1736611, 1880801]
56143A880801J47248J42517J30230J12412R2605P4823O2268N6108N4764N4338
56133B808114N0530M0859K5572P134j0822k4689l2492l5186l6337m0180m9581
56122B702922o4974q4375j04307j21319j32996j37912j35420j26239j12781r7871
56112A584728q3016o8518n4896m3080l3226k4525j6586r991n009q74K940N716
56100A253663O667O489O617P398P945P621O714N717M748L801K909K002J093O37
56086A324021J196K676M363N740O868P920Q829R545J0289J1322J2730J4424J6165
56073A436088J7563J8320J8515J8508J8617J9058J9990K1323K2608K3453K3984
56062A658027K4579K5332K6134K7083K8298K9405K9814K9603K9609L0479L2031
$$ y = [1880801, 2028049, 2170566, 2300796, 2413208, 2505813, 2580636, 2642904, 2699012, 2753776, 2808114, 2858644, 2899503, 2925075, 2932209, 2921387, 2896698, 2864206, 2829020, 2792683, 2752503, 2702922, 2637948, 2553573, 2449266, 2327947, 2194951, 2057039, 1921619, 1795380, 1682599, 1584728, 1501712, 1433194, 1378298, 1335218, 1301992, 1277467, 1260881, 1250890, 1245881, 1245007, 1247947, 1253663, 1260330, 1266819, 1273436, 1280834, 1288779, 1296400, 1303114, 1308831, 1313579, 1317380, 1320289, 1322291, 1323384, 1324021, 1325217, 1327893, 1332256, 1337996, 1344864, 1352784, 1361613, 1371158, 1381447, 1392769, 1405499, 1419923, 1436088, 1453651, 1471971, 1490486, 1508994, 1527611, 1546669, 1566659, 1587982, 1610590, 1634043, 1658027, 1682606, 1707938, 1734072, 1761155, 1789453, 1818858, 1848672, 1878275, 1907884, 1938363, 1970394]
56051A970394L3693L5154L6346L7216L7786L8278L9005M0204M1913M3756M5010
56040B398755M5316M5281M5837M7028M8104M8958N0573N3619N7360O0686O3578
56029B965095O6756P0262P3373P5848P8320Q1297Q4436Q7162Q9465R1805R4484
56018C858303R7353J00007J02285J04716J08206J12998J18147J22589J26476J30870
56008D981950J36241J42079J48002J54350J61436J68969J76654J84682J93325
55999F447688K02609K12841K24593K37721K51115K64073K77370K92199L08770
55990H718979L26663L45975L67055L89711M13733M39872M69083N01072N34879
55981A2507022N70850O10726O55644P05319P59529Q19220Q85625R59385J041210
$$ y = [1970394, 2004087, 2039241, 2075587, 2112803, 2150589, 2188867, 2227872, 2268076, 2309989, 2353745, 2398755, 2444071, 2489352, 2535189, 2582217, 2630321, 2679279, 2729852, 2783471, 2840831, 2901517, 2965095, 3031851, 3102113, 3175486, 3251334, 3329654, 3410951, 3495387, 3582549, 3672014, 3763819, 3858303, 3955656, 4055663, 4157948, 4262664, 4370870, 4483868, 4602015, 4724604, 4851080, 4981950, 5118191, 5260270, 5408272, 5562622, 5724058, 5893027, 6069681, 6254363, 6447688, 6650297, 6863138, 7087731, 7325452, 7576567, 7840640, 8118010, 8410209, 8718979, 9045642, 9391617, 9758672, 10148383, 10562116, 11001988, 11471071, 11972143, 12507022, 13077872, 13688598, 14344242, 15049561, 15809090, 16628310, 17513935, 18473320, 19514530]
55972A9514530J132636J235523J351578J482936J632666J804311K001649K229286
55964C2385115K492994K799404L156464L574569M066386M645290N325076O121350
55956F4566648P051427Q131874R377778J0806067J2438308J4296836J6392309
55949A43061247J8701519K1130810K3464404K5314921K6116017K5205849K2025432
55942C05020199J6386775Q680887j26913q766709j6078141k1347055k4407446
55935B59361597k5518908k5150047k3794593k1870162j9686642j7453447j5301709
55928A10586089j3307313j1508900r920406q539337p352052o338140n475101m742009
55920D3402831m120383l593502l146386k766242k442007k163810j923697j716300
$$ y = [19514530, 20647166, 21882689, 23234267, 24717203, 26349869, 28154180, 30155829, 32385115, 34878109, 37677513, 40833977, 44408546, 48474932, 53120222, 58445298, 64566648, 71618075, 79749949, 89127727, 99933794, 112372102, 126668938, 143061247, 161762766, 182893576, 206357980, 231672901, 257788918, 282994767, 305020199, 321406974, 330087861, 329960948, 321194239, 305116098, 283769043, 259361597, 233842689, 208692642, 184898049, 163027887, 143341245, 125887798, 110586089, 97278776, 85769876, 75849470, 67310133, 59958081, 53619941, 48144840, 43402831, 39282448, 35688946, 32542560, 29776318, 27334311, 25170501, 23246804, 21530504]
55912B1530504j537539j382807j247286j127595j021914r28512q45361p71218
55904A2668272p05806o48543n97952n52598n11808m75200m42164m12128l84763
55895G937310l59702l36506l14953k94939k76079k58081k41362k26680k14007
55886E415001k02506j91751j82210j74272j67363j60437j52969j45191j37625
55877C900677j30586j23977j17502j11229j05674j01040r6772r2283q7786q3786
55867B850042q0106p6270p2545o9639o7384o4770o1394n7943n5000n2320m9641
55856B143030m7284m5480m3893m2338m1251m0861m0531l9566l8202l7142l6492
55845A689990l5719l4386l2487l0275k8149k6414k4892k3111k1179k0019k0260
$$ y = [21530504, 19992965, 18610158, 17362872, 16235277, 15213363, 14284851, 13439490, 12668272, 11962466, 11313923, 10715971, 10163373, 9651565, 9176365, 8734201, 8322073, 7937310, 7577608, 7241102, 6926149, 6631210, 6355131, 6097050, 5855688, 5629008, 5415001, 5212495, 5020744, 4838534, 4664262, 4496899, 4336462, 4183493, 4038302, 3900677, 3770091, 3646114, 3528612, 3417383, 3311709, 3210669, 3113897, 3021614, 2933828, 2850042, 2769936, 2693666, 2621121, 2551482, 2484098, 2419328, 2357934, 2299991, 2244991, 2192671, 2143030, 2095746, 2050266, 2006373, 1964035, 1922784, 1881923, 1841392, 1801826, 1763624, 1726482, 1689990, 1654271, 1619885, 1587398, 1557123, 1528974, 1502560, 1477668, 1454557, 1433378, 1413359, 1393099]
55834A393099k1256k1772k1361k0559k0009j9911k0145k0406k0261j9528j8643
55823A169248j8265j8523j8912j8939j8613j8247j7945j7433j6389j4954j3808
55812I77220j3487j3684j3500j2340j0323p884n496l763l151l351l376k644j601
55799H82620r93r33j095j504k662n093q966j3828j8492k1556k2487k1953k0807
55786G42251j9107j6524j3377j0623q900q043p469o797o050n526n440n646n829
55773F22920o058o767q042r332j0097j0380j0427j0242r855r585r565r434r057
55760E04079r048r906j0921j0832r470p974p344p404p322o561n161l628k718k899
55746D02891l844m740n206n531o034o611p001p129o971o450n593m616l778l333
$$ y = [1393099, 1371843, 1350071, 1328710, 1308151, 1288142, 1268231, 1248086, 1227680, 1207419, 1187891, 1169248, 1150983, 1132460, 1113548, 1094609, 1075996, 1057749, 1039804, 1022371, 1005982, 991028, 977220, 963733, 950049, 936549, 924209, 913886, 906002, 900506, 896743, 893592, 890241, 886865, 884221, 882620, 881627, 880694, 879599, 878095, 875433, 870340, 861374, 847546, 829054, 807498, 785011, 763058, 742251, 723144, 706620, 693243, 682620, 673720, 665677, 658208, 651411, 645361, 639835, 634395, 628749, 622920, 616862, 610095, 602053, 592721, 582624, 572244, 561817, 551575, 541720, 532135, 522570, 513136, 504079, 495031, 485125, 474204, 463372, 453902, 445928, 438584, 431180, 423858, 417297, 412136, 408508, 405790, 402891, 399047, 394307, 389101, 383570, 377536, 370925, 363924, 356795, 349824, 343374, 337781, 333165, 329387, 326054]
55732C26054l482m103m593m420l767l243l009k699k152j692j548j580j752k316
55718B85698l251l978m009l476k762j940j027l52k05l31k76j01j96m98m03L74
55702B63267J343J819J668J204P22L76L44O42Q92O67J11j60J05M14K64j35k24
55685B73319N1K45Q3l86j216k497l783m223l585k612k084k040k179k491k936l021
55669B40645k309j120j47L53N77O55O72R10J499K043K198K383L179M283M908N049
55653B65778N432O085O019M630K604R76p4r91k022l060l921m338m018l119k343
55638B67638k188k434k610k642k702k817k926l071l261l432l810m790o179p005
55624B17771o652n785n542o037o315n721m674m004m031m460m878n056m954m578
$$ y = [326054, 322572, 318469, 313876, 309456, 305689, 302446, 299437, 296738, 294586, 292894, 291346, 289766, 288014, 285698, 282447, 278469, 274460, 270984, 268222, 266282, 265255, 264903, 264698, 264367, 264091, 263990, 263794, 263296, 262893, 263267, 264610, 266429, 268097, 269301, 270023, 270399, 270743, 271385, 272277, 272944, 273055, 272895, 273000, 273414, 273678, 273543, 273319, 273370, 273615, 273698, 273312, 272096, 269599, 265816, 261593, 258008, 255396, 253312, 251272, 249093, 246602, 243666, 240645, 238336, 237216, 237069, 237422, 237999, 238654, 239326, 240236, 241735, 243778, 245976, 248359, 251538, 255821, 260729, 265778, 271210, 277295, 283314, 287944, 290548, 291524, 291450, 290459, 288437, 285377, 281456, 277118, 273100, 269981, 267638, 265450, 263016, 260406, 257764, 255062, 252245, 249319, 246248, 242987, 239555, 235745, 230955, 224776, 217771, 211119, 205334, 199792, 193755, 187440, 181719, 177045, 173041, 169010, 164550, 159672, 154616, 149662, 145084]
55610A45084l898k993k162j738j710j724j559j333j199j112j099j352j839k166
55596A19200k074j807j686j599j280q17m88l25k19k47m72o28l64K97J082J880
55580A10453K613K966K746K420K698L570M191L809K449P04p99j726k213k777l690
55565A27414m491m458l596k674k308k363k366k010j188m6Q34P57k50j256j475
55550A00524j133j039j466j890j734j106o63q82j513j780j283m98k09n58r90j099
55534H2681j022r41o78j10M96Q46J027J196J235J070R93J222J471J407J344J825
55518I4062K677L146L042L072L754M614M846M363L706L204K678J887Q01n44k045
55503A33263l382m181m444m580m866n145n189n111n186n401n446n061m220l014
$$ y = [145084, 141186, 138193, 136031, 134293, 132583, 130859, 129300, 127967, 126768, 125656, 124557, 123205, 121366, 119200, 117126, 115319, 113633, 112034, 110754, 109937, 109449, 109124, 108905, 108658, 108186, 107558, 107194, 107491, 108573, 110453, 113066, 116032, 118778, 121198, 123896, 127466, 131657, 135466, 137915, 138619, 137820, 136094, 133881, 131104, 127414, 122923, 118465, 114869, 112195, 109887, 107524, 105158, 103148, 101960, 101914, 102748, 103505, 103255, 101999, 100524, 99391, 98352, 96886, 94996, 93262, 92156, 91493, 90611, 89098, 87318, 86035, 85537, 85328, 84770, 83780, 82681, 81659, 80718, 80040, 79930, 80426, 81272, 82299, 83495, 84730, 85800, 86793, 88015, 89486, 90893, 92237, 94062, 96739, 99885, 102927, 105999, 109753, 114367, 119213, 123576, 127282, 130486, 133164, 135051, 135852, 135308, 133263, 129881, 125700, 121256, 116676, 111810, 106665, 101476, 96365, 91179, 85778, 80332, 75271, 71051, 68037]
55489F8037j625m49L0l14j001j364j162p86q28j482k379k920k766k046j177n82
55473D7186m34n33m11J79Q28P71j40j093j279q91p35q98o31L43J126P54m60j356
55455D2326j423j197j212j269r51l08K58N31N57L93O7l01n35n35k97J33O34J016
55437C7887J154J068P99L44k74q88j217j042m04K73L72l79j559k354k304j589
55421B9887o70J79Q80J362J546J437J078N51Mm41q42j264j410p52O43J774J664
55404C5626N19m42m63NJ31j67l82l16k62l78m03j91n4k85o03m48K51J002J316
55385C4456J145O88P8n57r72r68o31k36jO8M2o3l06o88j020j074q66o96p13o10
55365B7076p5N70N53l63j480j956j726j373j276j192p16P8N65J83q37j486r99
$$ y = [68037, 66412, 65963, 65993, 65679, 64678, 63314, 62152, 61366, 60538, 59056, 56677, 53757, 50991, 48945, 47768, 47186, 46752, 46219, 45808, 45987, 46815, 47586, 47446, 46353, 45074, 44183, 43448, 42550, 41919, 42262, 43388, 44142, 43682, 42326, 40903, 39706, 38494, 37225, 36274, 35966, 36224, 36755, 37312, 37705, 37772, 37471, 36936, 36401, 36104, 36237, 36871, 37887, 39041, 40109, 40908, 41252, 40978, 40090, 38873, 37831, 37427, 37700, 38072, 37693, 36134, 33780, 31476, 29887, 29217, 29396, 30276, 31638, 33184, 34621, 35699, 36250, 36254, 35813, 34971, 33707, 32297, 31545, 32188, 33962, 35626, 36145, 35703, 35240, 35245, 35376, 35209, 34827, 34511, 34249, 33871, 33468, 33277, 33223, 32938, 32335, 31887, 32138, 33140, 34456, 35601, 36289, 36367, 35810, 34838, 33870, 33239, 33003, 33002, 33070, 33112, 33049, 32743, 32055, 31035, 29961, 29095, 28399, 27686, 27076, 27001, 27571, 28124, 27761, 26281, 24325, 22599, 21226, 19950, 18758, 18042, 18120, 18685, 18868, 18031, 16545, 15546]
55348A5546K14J067J153J058J240J281P47J03M6M08M80J99J71N16N96Q0n51p89
55330B3565p85q70r02n66Q6P24J113J088M96m91j258j255m77O55J616J871J165
55313B5775L7l80M45J693K056J138l43j477j839j488p83j98O8K37M36K71n77j534
55295B3537j534l48J004J438R53L54J90K59J23k75n80n28l05k69l44n0P04J181
55277B5510O65n02j228j069o58o44p62m06L35P06K37p76j675j969j480l98O65
55260A6551J026N30k47o40n67m32m46l48J18O99Q43L13n48j155j105l82O53J436
55242A6299J579J190P29N12M76L89J06l72q34q17PJ283K117J980J262P08N97P00
55224B7911P31M67l05j439k215j926p90J98L81P5k7K63N33L51k17o50n06N0L96
$$ y = [15546, 15760, 16827, 17980, 19038, 20278, 21559, 22306, 22409, 22455, 22863, 23343, 23542, 23713, 24229, 24825, 24905, 24354, 23565, 22780, 21910, 21008, 20442, 20528, 21252, 22365, 23453, 23949, 23458, 22200, 20945, 20468, 21123, 22739, 24610, 25775, 25812, 25432, 25877, 27570, 29626, 30764, 30421, 28944, 27105, 25617, 24834, 24636, 24704, 24941, 25377, 25648, 25071, 23537, 22003, 21655, 22659, 24097, 25050, 25404, 25594, 25853, 25976, 25701, 25121, 24593, 24288, 24019, 23675, 23625, 24329, 25510, 26175, 25673, 24445, 23376, 22718, 22074, 21312, 20906, 21241, 21947, 22184, 21408, 19733, 17764, 16284, 15886, 16551, 17577, 18107, 17860, 17220, 16653, 16221, 15775, 15427, 15545, 16244, 17087, 17400, 16852, 15697, 14592, 14210, 14863, 16299, 17878, 19068, 19797, 20309, 20785, 21174, 21280, 20908, 20074, 19257, 19264, 20547, 22664, 24644, 25906, 26614, 27211, 27911, 28642, 29109, 28804, 27365, 25150, 23224, 22434, 22632, 23013, 23088, 23061, 23324, 23857, 24208, 23991, 23341, 22835, 22885, 23281]
55205B3281J69l69q12j125j284q67L73J720K049J254L74J31N4n43j412j769j384
55188A9840p17k55j60l61n35k31M54O28l53j785k197j113L57R05M36j80l59k90
55170A4084l05k62J93R21J234P08r7j75O82J549J542Q40K67J70K45K36K27K03
55152B2262k9m15o03m86l50l16j59J07jo77j260j018j92K77k9n88p51m47O5O24
55132A6014J123J354J223R51P99P16M28j49p44r20l74P56J865K269J849J130O68
55115B8958N26N36Q01J517K426K893K599J810Q75q5q73j082o95m19q94j758k018
55098C5117j275j35O97J083J152Q56L00M4N31J308J351K44j302k253k253j656
55082C3809q88j02O06J060J201J224J327J355R82K35m15n74m02l67o97j257j814
$$ y = [23281, 23450, 23081, 22269, 21144, 19860, 18993, 19366, 21086, 23135, 24389, 24763, 24894, 24948, 24405, 22993, 21224, 19840, 19123, 18868, 18708, 18347, 17812, 17581, 18035, 18663, 18310, 16525, 14328, 13215, 13572, 14477, 14913, 14733, 14374, 14084, 13779, 13517, 13710, 14631, 15865, 16573, 16476, 16301, 16983, 18532, 20074, 20914, 21181, 21351, 21596, 21832, 22059, 22262, 22233, 21818, 21215, 20729, 20379, 20063, 19904, 20011, 20010, 19333, 18073, 17055, 16863, 17140, 17111, 16523, 15772, 15325, 15390, 16014, 17137, 18491, 19714, 20665, 21464, 22180, 22608, 22459, 21715, 20795, 20421, 21177, 23042, 25311, 27160, 28290, 28958, 29484, 30020, 30821, 32338, 34764, 37657, 40256, 42066, 42941, 42856, 41983, 40901, 40206, 39787, 38893, 37135, 35117, 33842, 33707, 34404, 35487, 36639, 37495, 37795, 37839, 38370, 39678, 41029, 41273, 39971, 37718, 35465, 33809, 32921, 32819, 33425, 34485, 35686, 36910, 38237, 39592, 40574, 40809, 40394, 39820, 39418, 39051, 38354, 37097, 35283]
55065C5283k132j929j075J07J005J320J240R93N72M0k34K6N87R76R95P28K10n38
55047C8174j188j253o95j10j26p24j281j250o86p1K81N56J051J626J801J425R51
55030C8481R21J333J728J721J367J070J271J997K592K245R97n6N2J003J592J098
55014E9412j19j227j601j048O6R19Q81J45o82j491k541l523l556k495j406j231
54998D0503j503j091J66J311J549J061N17L47N43P48M58m51j316j241j50R76J166
54981D3593M65k55l05K02P15R50J190J798K634L149L159L194L837M871N535N512
54965H0244N301N508O204P126Q157R378J0833J2490J4333J6196J7517J7480J5544
54952B26311J1889P342K731j673o061j0314j3618j5155j5090j4415j3778j2932
$$ y = [35283, 33151, 31222, 30147, 30254, 31259, 32579, 33819, 34812, 35384, 35424, 35190, 35216, 35803, 36779, 37774, 38502, 38712, 38174, 36986, 35733, 35038, 34928, 34802, 34078, 32797, 31547, 30861, 30790, 31071, 31627, 32678, 34304, 36105, 37530, 38481, 39402, 40735, 42463, 44184, 45551, 46621, 47892, 49889, 52481, 54726, 55723, 55667, 55719, 56722, 58314, 59412, 59293, 58066, 56465, 55417, 55483, 56402, 57283, 57428, 56746, 55255, 52714, 49191, 45635, 43140, 41734, 40503, 39000, 37909, 38075, 39386, 40935, 41996, 42513, 42860, 43403, 44151, 44609, 44158, 42842, 41601, 41451, 42427, 43593, 44058, 43803, 43498, 43700, 44415, 45365, 46555, 48353, 50987, 54136, 57295, 60489, 64326, 69197, 74732, 80244, 85545, 91053, 97257, 104383, 112540, 121918, 132751, 145241, 159574, 175770, 193287, 210767, 226311, 238200, 245542, 248273, 246600, 240539, 230225, 216607, 201452, 186362, 171947, 158169, 145237]
54940A45237j1546j0022r030q524p813o568n188m060l014j846r38q67j431j614
54926G2776o92R12K163K619K847L602M908O144O968P803R335J1644J4021J5614
54912A60664J6082J5619J4470J2581R630N378K8n595j0368j3513j5087j5688j5736
54899A58465j5182j3972j2441j1015r683q207o740n790n464n183m429l404k531
54886E4424j687m76Q43J395Q36o5l35P7M58L27j38n39p02p04o49n43k63K89R02
54867E3450J096O80N3k92m49q27j347j415q28j69r9n61j038j194r95n38j08j33
54849D5286o50j038p36j13l9o94j326j238n77K9J85q4m38m02J72P15M72m37j019
54830C8068o88O6O16J086J755K221J976J430J391J807J918J611J592K137K613
$$ y = [145237, 133691, 123669, 114639, 106115, 98302, 91734, 86546, 82486, 79472, 77626, 76688, 75821, 74390, 72776, 72084, 72996, 75159, 77778, 80625, 84227, 89135, 95279, 102247, 110050, 119385, 131029, 145050, 160664, 176746, 192365, 206835, 219416, 229046, 234424, 234452, 228857, 218489, 204976, 189889, 174201, 158465, 143283, 129311, 116870, 105855, 96172, 87965, 81225, 75435, 69971, 64788, 60359, 56955, 54424, 52737, 52261, 53104, 54499, 55335, 55270, 54935, 55012, 55470, 55797, 55659, 55120, 54418, 53714, 53065, 52522, 52259, 52548, 53450, 54546, 55226, 55279, 54987, 54538, 53711, 52364, 50949, 50121, 49952, 49853, 49292, 48254, 47060, 46065, 45527, 45419, 45286, 44636, 43598, 42862, 42749, 42710, 42016, 40690, 39452, 38875, 38904, 39089, 39005, 38567, 38165, 38337, 39052, 39524, 39087, 38068, 37380, 37446, 38062, 39148, 40903, 43124, 45100, 46530, 47921, 49728, 51646, 53257, 54849, 56986, 59599]
54815E9599K581K464K714L115L400L835M623N386N945O975R086J1700J3711J4944
54801A50078J6054J7120J7262J5705J2450P846K323l267p805j0799j2611j3582
54789A90774j3546j2515j1216j0345r691q586o955n384m264l408k574j887j538
54776I8865j361r65k28N59J112J537K066K546K579K290K528L922O024P901R330
54761A38705J0797J2439J3781J4586J5165J5477J4642J1869P491K586j966n630
54749B49942p946q807q779q475p791o279m076j882j31J136J705J177l68k362m530
54734A92534p042r651j1382j1571j0782j0129r953r655q671p161n704m678m068
54721H2087l654l281k999k953l129l260l067k550j953j516j185o20M49J751K503
$$ y = [59599, 62180, 64644, 67358, 70473, 73873, 77708, 82331, 87717, 93662, 100637, 109723, 121423, 135134, 150078, 166132, 183252, 200514, 216219, 228669, 236515, 238838, 235571, 227766, 216967, 204356, 190774, 177228, 164713, 153497, 143152, 133461, 124875, 117920, 112536, 108272, 104864, 102290, 100403, 98865, 97504, 96539, 96311, 96870, 97982, 99519, 101585, 104131, 106710, 109000, 111528, 115450, 121474, 129375, 138705, 149502, 161941, 175722, 190308, 205473, 220950, 235592, 247461, 254952, 257538, 255572, 249942, 241996, 233189, 224410, 215935, 208144, 201865, 197789, 195907, 195776, 196912, 198617, 199794, 199426, 197064, 192534, 185492, 175841, 164459, 152888, 142106, 131977, 122024, 112369, 103698, 96537, 90833, 86155, 82087, 78433, 75152, 72153, 69200, 66071, 62811, 59744, 57194, 55241, 53725, 52540, 51920, 52369, 54120, 56623]
54706E6623K071O57q89j828j946j334k46P63J062O26K14M58J049J154M97l94r48
54689E7589j147j246j271r62j37J065K170K650K344J677J274J325J484J392J119
54674F9326R50R79J062J061Q95M87r3m88k99M12J100J296R95N00M1k13k4O45J366
54655G9998J588J332J197J546K026K138K012K227K990L940M685N225N700O093
54641A22697O422O950P920R185J0347J1322J2495J4258J6486J8588J9962K0328
54629B76960J9612J7696J4361R508L370l402r815j4836j7923j9335j9773j9622
54617B36801j8765j7196j5484j4321j3686j2870j1329r321p648o873o804o636
54605I5868n707m230l126k978l342l357k775j940j054p9O19L96p12j771k078j905
$$ y = [56623, 58694, 59351, 58462, 56634, 54688, 53354, 53108, 53871, 54933, 55559, 55773, 56231, 57280, 58434, 58931, 58537, 57589, 56442, 55196, 53925, 52963, 52826, 53891, 56061, 58711, 61055, 62732, 64006, 65331, 66815, 68207, 69326, 70276, 71255, 72317, 73378, 74273, 74760, 74667, 74179, 73880, 74292, 75392, 76688, 77683, 78183, 78224, 78011, 77987, 78632, 79998, 81586, 82918, 84115, 85661, 87687, 89825, 91837, 94064, 97054, 100994, 105679, 110904, 116604, 122697, 129119, 136069, 143989, 153174, 163521, 174843, 187338, 201596, 218082, 236670, 256632, 276960, 296572, 314268, 328629, 338137, 341507, 338105, 328290, 313454, 295531, 276196, 256423, 236801, 218036, 200840, 185356, 171035, 157349, 144479, 133150, 123829, 116181, 109308, 102504, 95868, 90161, 85931, 82805, 79827, 76485, 73128, 70353, 68413, 67359, 67280, 67899, 68295, 67583, 65812, 63734, 61829]
54589F1829j721j351n54J03j84j178j742j297m18J10J49p5m29p72q11n07k57l43
54571E0552n30m91l45l45l34J7O18J007R28N16m4o23r69q23l05J53L69N71Q99
54552E0821J071P97K64n6RK78N65Q16R49Q72P31Q37J312J901K268K318K151J957
54534F9861K011K531L324L808L664L345L648M743N988O753P114P595Q458R440
54520A42283J0037R827Q618O520L925J231j403l969o370q389r848j0648j0643
54507A31171r741q200o721n974n999o087n417l928k495k065k563k930k367j313
54493F5371q54j316j910j801j071k72M39J257J984J959R17m73j280j220o88j13
54477F0929L05L55k07j161j700j220r8N86J87q83j697j746j254p51n59n96n19
$$ y = [61829, 60108, 58757, 58203, 58306, 58122, 56944, 55202, 53905, 53487, 53597, 53746, 53671, 53242, 52470, 51659, 51152, 50895, 50552, 50022, 49531, 49186, 48841, 48507, 48524, 49142, 50149, 51077, 51593, 51549, 50926, 49957, 49134, 48829, 48982, 49351, 49922, 50821, 51892, 52689, 52953, 52897, 52906, 53184, 53749, 54565, 55514, 56386, 57117, 57954, 59266, 61167, 63435, 65753, 67904, 69861, 71872, 74403, 77727, 81535, 85199, 88544, 92192, 96935, 102923, 109676, 116790, 124385, 132843, 142283, 152320, 162147, 170765, 177285, 181210, 182441, 181038, 177069, 170699, 162310, 152462, 141814, 131171, 121430, 113230, 106509, 100535, 94536, 88449, 83032, 79104, 76609, 74544, 71981, 69051, 66684, 65371, 64517, 63201, 61291, 59490, 58419, 58147, 58586, 59843, 61827, 63786, 64703, 64230, 62950, 61730, 61042, 60929, 61234, 61589, 61382, 60221, 58521, 57301, 57203, 57789, 57976, 57093, 55396, 53650, 52396, 51645, 51086, 50490, 49971]
54460D9971p7N83J014R28N57L68M96O45N30K77J89L04L44J13k21l34j22J97L46
54441E6108K38J3j23l4J87K26j92r22j380j102k68M10M41Ll36k29J59M43M85N19
54421E4646P90J113J007L92j19R8Q21J242J064Q33J041J369J258Q78R99J976L299
54404G2707M129L975K885J357J57k59k44o02j560k400k412j821j420j476j534
54389G1482j280j045j197j469j267m98L59Q84J070R38L57n87j327j344q34m59
54373F3783n48p99p95m90j70j56n46j007r20j00P53P52N6j84P01K034K754K641
54355F7759K155J552Q64M31P12J533K159K162J759J250O77O6m06p12j003j228
54339G9730j120p34n75r89j684k113k073j792j654j885k352k534k016j077m42
$$ y = [49971, 49894, 50477, 51491, 52419, 52976, 53344, 53840, 54485, 55015, 55292, 55481, 55785, 56129, 56242, 56021, 55687, 55565, 55762, 56108, 56346, 56359, 56236, 56202, 56389, 56615, 56423, 55501, 54121, 53019, 52751, 53161, 53602, 53605, 53269, 53040, 53199, 53642, 54127, 54646, 55436, 56549, 57556, 57948, 57829, 57927, 58748, 59990, 61054, 61887, 62928, 64297, 65555, 66433, 67432, 69408, 72707, 76836, 80811, 83696, 85053, 85210, 84951, 84707, 84105, 82545, 80145, 77733, 75912, 74492, 73016, 71482, 70202, 69157, 67960, 66491, 65224, 64726, 65085, 65969, 67039, 67977, 68334, 67747, 66420, 65076, 64242, 63783, 63235, 62436, 61641, 61151, 60981, 60825, 60279, 59272, 58352, 58252, 59005, 59757, 59813, 59629, 60330, 62364, 65118, 67759, 69914, 71466, 72330, 72761, 73473, 75006, 77165, 79327, 81086, 82336, 83013, 83079, 82673, 81961, 80958, 79730, 78610, 77876, 77301, 76312, 74628, 72515, 70442, 68650, 66996, 65111, 62759, 60225, 58209, 57132, 56690]
54324E6690l45k79J37N42M07j75o89r71j261j661j923j785j234m74J03O9n75j177
54306D5399j057l26K50K78J60M64J156J729J816J466R09L00k84q18j239j374r90
54289D7839j13P54R66L87m60r76j027p75l02K26K90m89j544j757q33K50N68L39
54271D3343K68M49O41J023J734K033J105m61j181p07j75l12m85q9L57K76J06L51
54253D8276N13N1l63K00J307J761J420J128J056N10o17j499j689j645j582j042
54237D7785J1O47K58m76n33J95J139J912K285J915P67n27j294j535j588j500j201
54220D8260q60n82j39M98P03k8j198j816j579r93n11k11r4p1K06Q61J265O94n12
54201D3893j220j008o12o63p75l80K16K61l18q57q73n11j46K6o2m50j052j587
$$ y = [56690, 56345, 56066, 56203, 56745, 57152, 56977, 56288, 55317, 54056, 52395, 50472, 48687, 47453, 46979, 47082, 47151, 46576, 45399, 44342, 44016, 44266, 44544, 44704, 45168, 46324, 48053, 49869, 51335, 52244, 52544, 52260, 51442, 50203, 48829, 47839, 47726, 48480, 49446, 49833, 49373, 48397, 47370, 46595, 46293, 46519, 46809, 46320, 44776, 43019, 42186, 42436, 43004, 43343, 43611, 44060, 44701, 45724, 47458, 49491, 50596, 50135, 48954, 48247, 48072, 47760, 47275, 47186, 47543, 47819, 47925, 48276, 48789, 48840, 48477, 48677, 49984, 51745, 53165, 54293, 55349, 55859, 55242, 53743, 52054, 50409, 48827, 47785, 47796, 48443, 48701, 48225, 47692, 47887, 49026, 50938, 53223, 55138, 55905, 55378, 54084, 52549, 50961, 49461, 48260, 47400, 46818, 46679, 47177, 47880, 47852, 46654, 44838, 43259, 42266, 41755, 41544, 41450, 41379, 41585, 42446, 43711, 44405, 43893, 42673, 41665, 41053, 40390, 39615, 39235, 39451, 39712, 39394, 38537, 37664, 37153, 37007, 37033, 36971, 36521, 35469, 33882]
54183C3882j688j123l3R76J222O67N5O2M32M32J1p6N64J224J004L6o97o60k73
54164C6017j35l29o72j079j381j130j27J077J647J412R51Q06R42J031Q82N18N1
54147D0481l78o68q18q22o02k15L0l3o2L43R24R84L57l58o00l60K67J314K419
54128D2203K714J856O63J21J90J63p8j06j5m43j372j787j004L03R58P64N47R10
54110D6587J537J734J228L27m51p32m52J32O35Q38Q35Q63R32P90L15j56k02P0
54092E4830J33j29j83L25Q73P35Q0k21J45N49M39J01L4J16j17o46r80q74n44j77
54072E4489K59O53O92L64K01O91J607K187J967J214N80N18J020J646J853J454
54056G1395R15R80J813K756L141L224L816N032N888N453M105L164L402M290M727
$$ y = [33882, 32194, 31071, 31038, 32014, 33236, 33903, 33958, 34020, 34452, 34884, 34895, 34819, 35383, 36607, 37611, 37647, 36950, 36290, 36017, 35882, 35553, 34881, 33802, 32421, 31291, 31164, 32241, 33888, 35300, 36251, 37057, 37999, 39030, 39912, 40430, 40481, 40103, 39435, 38617, 37795, 37193, 36978, 37008, 36975, 36913, 37256, 38180, 39164, 39521, 39163, 38563, 38203, 38470, 39784, 42203, 44917, 46773, 47436, 47557, 47747, 47910, 47832, 47726, 47711, 47268, 45896, 44109, 43105, 43408, 44366, 45130, 45677, 46587, 48124, 49858, 51086, 51413, 50962, 50230, 49778, 49910, 50545, 51383, 52218, 53081, 54013, 54803, 55118, 54962, 54760, 54830, 54963, 54834, 54651, 54976, 55849, 56584, 56664, 56443, 56588, 57137, 57576, 57677, 57711, 57827, 57710, 57064, 56084, 55210, 54666, 54489, 54748, 55401, 56093, 56457, 56658, 57349, 58956, 61143, 63110, 64324, 64904, 65422, 66442, 68088, 69941, 71395, 72310, 73290, 75103, 77859, 81000, 84224, 88040, 93072, 98960, 104413, 108518, 111682, 115084, 119374, 124101]
54041A24101M230L209K337J891J659J343R37O51N64M69K10n5r9on8k73m03m23
54023A40284p52j725l034l962m107l721l332l213l300l430l525l513l248k643
54009I6779j868j269j059j141j288j419j597j808j936j875j638j294q64l95p0
53994G7258j34o09j103j138p09l06k54k65P2N84P80P07R22J475J580O32q95k003
53976G6594k239j787r14J39R47J232J210J197J028L97l78o57m22k92n20o53l07
53959G4575L39R92J620K098K067J481Q52O34Q12J246J951K709K990K687K492K995
53943A02540L815M178M091M357N492P159Q630R454R729R937J0457J1015J0923
53930B01777R990Q886Q216P674O590N019L649K783K028R71l26j503k197k233j903
$$ y = [124101, 128331, 131540, 133877, 135768, 137427, 138770, 139707, 140358, 140922, 141391, 141601, 141546, 141447, 141441, 141383, 141110, 140707, 140284, 139532, 137807, 134773, 130811, 126704, 122983, 119651, 116438, 113138, 109708, 106183, 102670, 99422, 96779, 94911, 93642, 92583, 91442, 90154, 88735, 87138, 85330, 83394, 81519, 79881, 78587, 77723, 77328, 77258, 77124, 76515, 75412, 74274, 73565, 73259, 73005, 72740, 72812, 73396, 74176, 74883, 75805, 77280, 78860, 79492, 78597, 76594, 74355, 72568, 71654, 71793, 72740, 73972, 75182, 76379, 77407, 77804, 77426, 76769, 76347, 76055, 75535, 74882, 74575, 74914, 75906, 77526, 79624, 81691, 83172, 84024, 84658, 85470, 86716, 88667, 91376, 94366, 97053, 99545, 102540, 106355, 110533, 114624, 118981, 124473, 131632, 140262, 149716, 159445, 169382, 179839, 190854, 201777, 211767, 220653, 228869, 236543, 243133, 248152, 251801, 254584, 256612, 257583, 257257, 255754, 253557, 251324, 249421]
53915B49421j891k537l321l582l494l694m168m299m028m009m485m824m608m411
53901A96070m901n804o320o185n718n151m526m068m040m291m379m112l665l199
53887A29711k762k549k791l398l878l795l179k495k250k477k584j922o70J42k50
53872I4853j425k375k650k528k179j389k19O14M12o55j716k093j883j580j368
53857G3819r62j92N05N14k1k14L94J141J139N71L46O85Q34L49j31J69J002J493
53839H1441J281P42K74j0M6O27J432J716J157L59J84P30J237J033L29j7M69J301
53821I4331J561J041N71J034K275L339L657L566L586L728L757L699L677L530L058
53806A36410K491K217K122J743J070O70Q58J219J218Q62M68J09k93o44q83j299
$$ y = [249421, 247530, 244993, 241672, 238090, 234596, 230902, 226734, 222435, 218407, 214398, 209913, 205089, 200481, 196070, 191169, 185365, 179045, 172860, 167142, 161991, 157465, 153397, 149357, 145066, 140687, 136575, 132910, 129711, 126949, 124400, 121609, 118211, 114333, 110538, 107359, 104864, 102614, 100137, 97553, 95631, 94961, 95103, 94853, 93428, 91053, 88403, 85875, 83696, 82307, 82088, 82702, 83114, 82459, 80743, 78650, 76767, 75187, 73819, 72857, 72665, 73170, 73684, 73663, 73449, 73843, 74984, 76123, 76694, 77040, 77725, 78559, 78908, 78777, 78946, 79948, 81441, 82722, 83464, 83738, 83728, 83774, 84401, 85833, 87549, 88706, 89065, 89249, 89979, 91216, 92249, 92578, 92561, 93030, 94331, 95892, 96933, 97504, 98538, 100813, 104152, 107809, 111375, 114961, 118689, 122446, 126145, 129822, 133352, 136410, 138901, 141118, 143240, 144983, 146053, 146723, 147581, 148800, 150018, 150880, 151348, 151457, 151164, 150520, 149637, 148338]
53790A48338k147l020l101k182j026o35j316k551l537l794l487l214l330l521
53776A11477l241k494j801j436j136o78k77k14m19p27j196j855k421k643k722
53761H8217l015l474l718l549l037k234j220l87k23p08j248j292q48l34r9j65
53745F2666j98K28J097J718J360J89q20r93o60n47q12j014q27m19j66k24m10m04
53727E9764o0M53Q20Q95P21L25k44o62m63L19J016J009M43q0k92l45k96K3N25
53708F3871P80N50J83K33P99J431J570J058K95l9L54J036J327J196J263J859K451
53691H0217K355J679J140J041R84N74J2k21K9N03Q63R29P68O38P55J009J039O73
53673I4987J61j51j58K7K91M88M61L19M55J023J527J342N28k42n53n95n93m10
$$ y = [148338, 146191, 143171, 140070, 137888, 136862, 136227, 134911, 132360, 128823, 125029, 121542, 118328, 114998, 111477, 108236, 105742, 103941, 102505, 101369, 100691, 100414, 100200, 99781, 99054, 97858, 96003, 93582, 90939, 88217, 85202, 81728, 78010, 74461, 71424, 69190, 67970, 67583, 67360, 66652, 65404, 64112, 63264, 62930, 62831, 62666, 62468, 62696, 63793, 65511, 66871, 67060, 66240, 65247, 64587, 64040, 63228, 62214, 61387, 60968, 60802, 60578, 60168, 59764, 59704, 60157, 60977, 61872, 62593, 62918, 62674, 62012, 61549, 61868, 62884, 63893, 64336, 64256, 63964, 63619, 63323, 63346, 63871, 64651, 65201, 65384, 65617, 66416, 67847, 69417, 70475, 70770, 70731, 71085, 72121, 73448, 74644, 75907, 77766, 80217, 82572, 84251, 85391, 86432, 87416, 87990, 88002, 87781, 87810, 88313, 89176, 90105, 90873, 91511, 92266, 93275, 94314, 94987, 95148, 94997, 94839, 94866, 95157, 95645, 96106, 96425, 96880, 97903, 99430, 100772, 101300, 101058, 100505, 99910, 99317, 98907]
53655I8907P3N59P11O58P83J127J335J148O95L42L50O71Q97O21o3n57n26l91p72
53636A06568j549j948j544p60k71k65m33m48k05K16O22P97O70L45Rj18K07J054
53618A02947K075K724K712K165J371O17J68N8m1l62m42L83J815K616K187J456
53602A22449J570K229K244J420Q32J171J789J793J282R13Q21P08O38R95J684K000
53586A44538J524P19L52O36J113J255R38M74L12O38J145J254O72k40q10p29l06
53569A53485n3j38l41l99k82j82k71n20o28k81M22R29Q19L37L4j3k00n59m71L78
53549A52066J311J427Q96P05J203J599J131J68l60k55j62n15q20k84J151K613
53533A61874L177K798K178J856J667J274R19J177K058K847K942K536K234K404
$$ y = [98907, 98980, 99539, 100250, 100908, 101691, 102818, 104153, 105301, 105996, 106338, 106688, 107359, 108256, 108877, 108814, 108257, 107731, 107340, 106568, 105019, 103071, 101527, 100767, 100496, 100231, 99798, 99350, 99145, 99361, 99983, 100780, 101450, 101795, 101804, 101686, 101893, 102947, 105022, 107746, 110458, 112623, 113994, 114611, 114779, 114837, 114796, 114434, 113992, 114375, 116190, 118806, 120993, 122449, 124019, 126248, 128492, 129912, 130744, 131915, 133704, 135497, 136779, 137692, 138513, 139221, 139859, 140854, 142538, 144538, 146062, 146781, 147133, 147769, 148882, 150137, 151075, 151549, 151861, 152499, 153644, 154898, 155570, 155330, 154520, 153791, 153485, 153432, 153294, 152953, 152554, 152272, 152090, 151819, 151299, 150671, 150390, 150812, 151741, 152560, 152897, 152931, 152918, 152718, 152159, 151688, 152066, 153377, 154804, 155700, 156405, 157608, 159207, 160338, 160506, 160146, 159891, 159729, 159214, 158394, 158110, 159261, 161874, 165051, 167849, 170027, 171883, 173550, 174824, 175743, 176920, 178978, 181825, 184767, 187303, 189537, 191941]
53519A91941L014L799M306M131L490L245L967N177N955O117O205O485O586O303
53505B60721O145O657P622Q290Q297Q049Q235R202J0718J2166J2986J3099J2882
53492C85069J2752J2820J2916J2844J2545J2155J1989J2305J2990J3572J3688
53481E25645J3420J3100J2892J2739J2593J2532J2603J2722J2713J2426J1867
53470F65252J1249J0859J0755J0689J0452J0165J0097J0272J0411J0241R720Q920
53458G89082P937O860N712M392K800J051n92j996l223m321n260o066o733o952
53444G82691o390n387m945n598o638p041o906p297q637j0063j0579j0177r436
53431F83597q644p911p643q098q760q854q363p850p345o241m364k428j129m13
$$ y = [191941, 194955, 198754, 203060, 207191, 210681, 213926, 217893, 223070, 229025, 235142, 241347, 247832, 254418, 260721, 266866, 273523, 281145, 289435, 297732, 305781, 314016, 323218, 333936, 346102, 359088, 372187, 385069, 397821, 410641, 423557, 436401, 448946, 461101, 473090, 485395, 498385, 511957, 525645, 539065, 552165, 565057, 577796, 590389, 602921, 615524, 628246, 640959, 653385, 665252, 676501, 687360, 698115, 708804, 719256, 729421, 739518, 749790, 760201, 770442, 780162, 789082, 797019, 803879, 809591, 813983, 816783, 817834, 817242, 815246, 812023, 807702, 802442, 796376, 789643, 782691, 776301, 770914, 765969, 760371, 753733, 746692, 739786, 732489, 723852, 713789, 703210, 693033, 683597, 674953, 667042, 659399, 651301, 642541, 633687, 625324, 617474, 610129, 603888, 599524, 597096, 595967, 595554]
53417E95554M5K51K02K52O34J009J032J008J529K695M121N470O567P233P527P968
53401F43097Q919J0071J0960J1726J2692J3487J3480J2936J2944J4022J5617J7189
53389G97140J8789K0356K1329K1590K1994K3231K4696K5390K5430K5834K6922
53378A052701K7912K8186K8126K8393K8921K9124K8755K8189K7889K7843K7575
53367A363614K6650K5122K3409K1763K0018J7973J5771J3762J2133J0882R949
53356A561046R041P576N092J765j767n065q147j1236j4455j7793k1042k3700k5267
53343A456048k5698k5481k5249k5383k5893k6369k6145k4826k2738k0698j9290
53332A188278j8556j8322j8561j9301k0438k1725k2859k3529k3556k3046k2270
$$ y = [595554, 595599, 595850, 596052, 596304, 596938, 597947, 598979, 599987, 601516, 604211, 608332, 613802, 620369, 627602, 635129, 643097, 652016, 662087, 673047, 684773, 697465, 710952, 724432, 737368, 750312, 764334, 779951, 797140, 815929, 836285, 857614, 879204, 901198, 924429, 949125, 974515, 999945, 1025779, 1052701, 1080613, 1108799, 1136925, 1165318, 1194239, 1223363, 1252118, 1280307, 1308196, 1336039, 1363614, 1390264, 1415386, 1438795, 1460558, 1480576, 1498549, 1514320, 1528082, 1540215, 1551097, 1561046, 1570087, 1577663, 1582755, 1584520, 1582753, 1577688, 1569541, 1558305, 1543850, 1526057, 1505015, 1481315, 1456048, 1430350, 1404869, 1379620, 1354237, 1328344, 1301975, 1275830, 1251004, 1228266, 1207568, 1188278, 1169722, 1151400, 1132839, 1113538, 1093100, 1071375, 1048516, 1024987, 1001431, 978385, 956115]
53321I56115k1338k0100j8439j6560j4869j3626j2690j1701j0512r406q720q348
53309G89806p952p719q342r961j1528j1806j0804r622q971q562p964p394p221
53296F71960p157o499n039l359k175j573j067k97N10R88J421K599M621O418O962
53281F68313O702P060Q604J0430J1402J1366J0905J0591J0740J1327J1782J1405
53269G90627J0377R805J0322J1110J0868R411P709O580N909N117L871K304Q39
53256H84849k04r72j964l381m913o392q227j0683j3129j4551j4731j4333j3905
53243G77464j3426j2813j2355j2391j2908j3554j3884j3524j2461j1132j0131
53232F38885r750r989j0675j1398j1606j1271j1145j1856j2930j3338j2873j2258
$$ y = [956115, 934777, 914677, 896238, 879678, 864809, 851183, 838493, 826792, 816280, 806874, 798154, 789806, 781854, 774135, 765793, 755832, 744304, 732498, 721694, 712072, 703101, 694539, 686575, 679181, 671960, 664803, 658304, 653265, 649906, 647731, 646158, 645091, 644794, 645304, 646292, 647713, 650312, 654933, 661351, 668313, 675015, 682075, 690679, 701109, 712511, 723877, 734782, 745373, 756113, 767440, 779222, 790627, 801004, 810809, 821131, 832241, 843109, 852520, 860229, 866809, 872718, 877835, 881706, 884010, 884849, 884645, 883673, 881709, 878328, 873415, 867023, 858796, 848113, 834984, 820433, 805702, 791369, 777464, 764038, 751225, 738870, 726479, 713571, 700017, 686133, 672609, 660148, 649016, 638885, 629135, 619146, 608471, 597073, 585467, 574196, 563051, 551195, 538265, 524927, 512054, 499796]
53220D99796j1934j1483j0476r122p845o773n951n524n397n202m922n051n793
53207D04323o662p239p800q731r785j0469j0731j0756j0497j0000r801j0229j0533
53194B81090r595p503n663n139n539n831n628n316n243n267n047m531m111m337
53180B02340n271o240o468n911n215m840m594m118l497l074k972k967k761k232
53166A42180j453o65j24Q7O3o6k18l20l48l90m51l23J44O29N72j30r10j139o70
53147A36468K71J332K041J984J317P63P75R51O67M7j86K18O53M40l59j050j032
53130A45300l31M41N89lp43r97q02o60p44o83j59O43J308J546J238M06n66j093
53112A44690j022q64j112j543j541r32j79J62j58j044k040k463j941r33l26m55
$$ y = [499796, 487862, 476379, 465903, 456781, 448936, 442163, 436212, 430688, 425291, 420089, 415167, 410116, 404323, 397661, 390422, 382622, 373891, 364106, 353637, 342906, 332150, 321653, 311653, 301852, 291623, 281090, 271495, 263992, 258329, 253190, 247651, 241820, 236192, 230876, 225633, 220366, 215319, 210788, 206677, 202340, 197069, 190829, 184361, 178450, 173235, 168395, 163801, 159683, 156186, 153112, 150140, 147173, 144412, 142180, 140727, 140062, 139938, 140025, 140088, 140022, 139804, 139484, 139136, 138746, 138295, 137972, 138116, 138745, 139317, 139187, 138277, 137138, 136468, 136739, 138071, 140112, 142096, 143413, 144176, 144951, 145902, 146569, 146616, 146430, 146648, 147301, 147741, 147382, 146332, 145300, 144969, 145410, 145999, 145996, 145253, 144256, 143454, 142794, 142050, 141367, 141208, 141851, 143159, 144705, 145943, 146349, 145783, 144690, 143668, 142804, 141692, 140149, 138608, 137676, 137497, 137659, 137501, 136457, 134417, 131954, 130013, 129080, 128754, 128299]
53096A28299q68j071j108j211j335j247r20n29k81l64q61j508j799j574j248j163
53080A11212j074o95m14p79j464j534q92o04j323k149j780m19M65J72l49O1J181
53063I9615J875J669J165J019J152J083O42R4j62J31R47J869K311J980J134K89
53047A16813k05k12K56R60J331Q70l31j572k172k017j543j306j516j891j914j363
53031A04188o18k38l77o90q25p27m72j31M3l27j272k187k405j947j437j275j196
53014H8107p50J9O24P81P39Q73J112J036N41J01J82O08Q11N92L37L95N94M91p6
52995I7117q00j143q02j01J01o81j791k044j119P7O68P51Q05Q30P19Q41J481K027
52977I6936J683Q21O06J271J739J275N31M65R52J150O70k08j036j333o22R14K131
$$ y = [128299, 127431, 126360, 125252, 124041, 122706, 121459, 120539, 120010, 119729, 119365, 118504, 116996, 115197, 113623, 112375, 111212, 110138, 109443, 109029, 108250, 106786, 105252, 104360, 103756, 102433, 100284, 98504, 98085, 98550, 98722, 98373, 98434, 99615, 101490, 103159, 104324, 105343, 106495, 107578, 108220, 108314, 108152, 108283, 109230, 111099, 113410, 115390, 116524, 116813, 116608, 116396, 116652, 117612, 118943, 119813, 119482, 117910, 115738, 113721, 112178, 110872, 109356, 107465, 105551, 104188, 103570, 103332, 102955, 102265, 101440, 100713, 100241, 100110, 100153, 99826, 98554, 96367, 93962, 92015, 90578, 89303, 88107, 87357, 87376, 88000, 88781, 89520, 90393, 91505, 92541, 93082, 93183, 93365, 93973, 94784, 95376, 95713, 96108, 96702, 97193, 97117, 96317, 95174, 94372, 94271, 94372, 93691, 91900, 89856, 88737, 88814, 89482, 90233, 91038, 91868, 92587, 93428, 94909, 96936, 98619, 99440, 100046, 101317, 103056, 104331, 104862, 105327, 106279, 107429, 108099, 107891, 106855, 105522, 104900, 105814, 107945]
52960A07945K058J229J038J749K063J003o00j191n41J73J89R4O51J455J433M09
52944A19157o48r50p36n16j58O48J511J668J057L14k36p72j139p34L56R67L06
52927A20095p51p00O21J885K009J191K41l66m92q4O37J128J045O12J89j76n35
52910A26549n93k5R91J916K608L370M185M390L539K260J643J817J776P93n43j141
52894A53535q30l95m37q25j212j477j518j220p58n06m96l71o6Ml41p19q49j054
52876A40465j626k240k365j914j065N4J041J218N25qM90J503J925J656J408J187
52860A42254K74j276k308k084j250p96q95j178j484j808k009k047k072j999j529
52845A19793q83q54j665k416k175j187m22l29n85p94q24p07o20q01j130j141p21
$$ y = [107945, 110003, 111232, 112270, 114019, 116082, 117085, 116485, 115294, 114753, 114926, 115115, 115209, 115860, 117315, 118748, 119157, 118509, 117559, 116823, 116307, 116149, 116797, 118308, 119976, 121033, 121347, 121111, 120339, 119200, 118466, 118822, 119789, 120095, 119344, 118644, 119265, 121150, 123159, 124350, 124591, 124225, 123733, 123649, 124286, 125414, 126459, 127071, 127260, 127084, 126549, 125956, 125931, 126922, 128838, 131446, 134816, 139001, 143391, 146930, 149190, 150833, 152650, 154426, 155219, 154676, 153535, 152705, 152310, 151873, 151048, 149836, 148359, 146841, 145621, 144863, 144357, 143861, 143490, 143424, 143428, 143087, 142368, 141519, 140465, 138839, 136599, 134234, 132320, 131255, 131309, 132350, 133568, 134093, 134085, 134575, 136078, 138003, 139659, 141067, 142254, 142528, 141252, 138944, 136860, 135610, 134814, 133919, 132741, 131257, 129449, 127440, 125393, 123321, 121322, 119793, 118910, 118056, 116391, 113975, 111800, 110613, 110191, 109862, 109277, 108483, 107659, 106952, 106332, 105531, 104401, 103260, 102539]
52828A02539l83m80o14l60p7m19j270j898j889j413p69k11l3k50l86r2K39O8l88
52809I1914n50m34n01p10n58m2L10L06K52J53l22j001j182p14j89J26O73J552
52791H9083K025J637J044J070J537J737J460R34L04k01n0R15K001K466K371K060
52775A10393J409L59m43n56p08j686k715k420j153p80j890k903k511j499j182
52760I1715j380j219r09j226j878j873j226q86j028q19q1K36k49m21P48K521L257
52743H5282K400Q06n71j448j882j919j683j318p82n6N21N18j4o06r70j176j321
52726G5781j367j315j163p33O3P89Q33K80o6K47P55P80L41r3l47n88p93o91k47
52707G2466J94L38L07M10P54J149J365J361J292J267J195R75P31O79P54O36K57
$$ y = [102539, 102156, 101676, 101062, 100702, 100625, 100206, 98936, 97038, 95149, 93736, 92967, 92756, 92723, 92473, 92087, 91995, 92234, 92302, 91914, 91364, 90930, 90429, 89719, 89161, 89119, 89429, 89735, 89987, 90140, 89818, 88817, 87635, 86921, 86732, 86858, 87531, 89083, 91108, 92745, 93789, 94859, 96396, 98133, 99593, 100527, 100831, 100630, 100580, 101495, 103496, 105962, 108333, 110393, 111802, 112161, 111718, 111162, 110454, 108768, 106053, 103633, 102480, 101700, 99810, 96907, 94396, 92897, 91715, 90335, 89116, 88207, 86981, 85103, 83230, 82004, 81118, 80090, 79271, 79190, 79426, 79177, 78756, 79504, 82025, 85282, 87682, 88488, 87917, 86469, 84587, 82668, 80985, 79667, 78885, 78829, 79350, 79868, 79854, 79248, 78278, 77102, 75781, 74414, 73099, 71936, 71203, 71266, 72055, 72888, 73168, 73102, 73349, 74104, 74884, 75225, 75132, 74785, 74197, 73404, 72713, 72466, 72660, 72998, 73305, 73715, 74469, 75618, 76983, 78344, 79636, 80903, 82098, 83073, 83804, 84483, 85237, 85873, 86130]
52690H6130jJ23K81q4r28j461r31N38J918K148J117j54n29O6P27P96N52M99N22
52671I1329K30k45l93j79q5k82l40J19Q49J328J337R86L98l26r15r49j87J041
52653I3716J853J502K03r42j106o18l87o69q73m72L78J119J273P05j79n06K65
52636I5262J623K524K642K499K395J997J247Q65J366K143K115J022m54j519j788
52621A13939j304n81m04j011j661j505p26k84o10j076q70R7J233J909J929J558
52605A10633J135O61m9p98j001m86Q6L9l94n24k19J22L55O81R70Q13K78l9Q3J44
52585A12490k91r62j284r61p2J026J714J561Q75M80O95J079J203J156J099R35
52569A20743P48Q80J210R64j52j275j493j133j155j581j492n32M61N53k32j131
$$ y = [86130, 86129, 86252, 86533, 86449, 85521, 84060, 83129, 83667, 85585, 87733, 88850, 88696, 88167, 88233, 88960, 89756, 90308, 90807, 91329, 91559, 91314, 90921, 90742, 90657, 90375, 90035, 90154, 91003, 92331, 93668, 94654, 95052, 94726, 93811, 92862, 92675, 93716, 95569, 97071, 97274, 96332, 95226, 94608, 94221, 93552, 92679, 92207, 92585, 93704, 94977, 95682, 95503, 94997, 95262, 96885, 99409, 102051, 104550, 106945, 108942, 110189, 111054, 112420, 114563, 116678, 117700, 117246, 115727, 113939, 112635, 112054, 111650, 110639, 108978, 107473, 106747, 106463, 105853, 104777, 103907, 104004, 105237, 107146, 109075, 110633, 111768, 112429, 112380, 111582, 110581, 110095, 110181, 110220, 109826, 109302, 109083, 109205, 109560, 110241, 111211, 112024, 112302, 112263, 112346, 112490, 112199, 111237, 109953, 108992, 108920, 109946, 111660, 113221, 114096, 114576, 115271, 116350, 117553, 118709, 119808, 120743, 121491, 122371, 123581, 124545, 124393, 123118, 121625, 120492, 119337, 117756, 116264, 115732, 116193, 116746, 116514, 115383]
52553A15383j476j031J4J118J677J470P15k40j109j562j375p32j16K10L52M81
52537A13779O30P91R13P75K27m30o58l87r8r9j49pO6k81q44j159j194j312j582
52518A08981j591j057l05J14P8p8r3r7l43p71j042r65p47p55j109j550j699j347
52500I5624o02J50M75K38k34m23p4O02J150J282J114R89R97P66m0j059j494j110
52482I8351n71n06o16k57M97R70Q80N42J30n47j373j739j361p58n37n94m50LM54
52463I2518O34M97J86L6L69J025J376J078N17K50L09L93M16M55M17K11K7J5n8
52444A00671m38q53q47m59j19j8j8m0o5J19O68J293J584J550J397J046M86K64
52426A06221Q14J470J177J40k86M31J248J146M98K26M43P19R69J241J164M08n88
$$ y = [115383, 113907, 112876, 112890, 114008, 115685, 117155, 117870, 117630, 116521, 114959, 113584, 112852, 112736, 112946, 113298, 113779, 114409, 115200, 116113, 116888, 117115, 116685, 116027, 115640, 115542, 115443, 115294, 115287, 115353, 115072, 114228, 113069, 111875, 110563, 108981, 107390, 106333, 106028, 106142, 106220, 106142, 106049, 105952, 105609, 104838, 103796, 102831, 102084, 101329, 100220, 98670, 96971, 95624, 95022, 95172, 95647, 95885, 95651, 95228, 95154, 95756, 96906, 98188, 99302, 100291, 101288, 102054, 102014, 100955, 99461, 98351, 97780, 97274, 96658, 96401, 96898, 97868, 98748, 99290, 99420, 98873, 97500, 95761, 94400, 93642, 93105, 92511, 92061, 92064, 92518, 93152, 93649, 93835, 93871, 94240, 95265, 96641, 97719, 98236, 98486, 98795, 99188, 99604, 100059, 100476, 100687, 100714, 100729, 100671, 100233, 99380, 98533, 98074, 97955, 97937, 97919, 97879, 97814, 97933, 98601, 99894, 101478, 103028, 104425, 105471, 105957, 106221, 107035, 108505, 109682, 109822, 109536, 109967, 111215, 112361, 112859, 113085, 113528, 114247, 115216, 116457, 117621, 118029, 117441]
52409A17441j104r89m94L41J383J936J458N33K47P00R38M02l64o05j94N66J317
52392A23512J632J220M03q7LJ96L7l15m86l74p5L32O89Q15P63P32O67M14K53P29
52372A31060J744K477K445K130K125K241J880R80J9o08q38p20m21j99o0M05J452
52355A46112K646L238L010K410J968J872K020K177K129J894J712J751J918K125
52341A76982K453K808K823K446K296K980M164M905M822M511M664N261N756N837
52327B32708N719N853O467P405Q400R462J0760J2082J2757J2477J1878J1933J2845
52314C60746J3944J4584J4793J5025J5591J6430J7131J7226J6653J5873J5306
52303E33302J4774J3874J2655J1510J0419Q910O931N199M400M349M257L556K271
$$ y = [117441, 116337, 115348, 114854, 115195, 116578, 118514, 119972, 120505, 120752, 121452, 122390, 122792, 122428, 121823, 121629, 122195, 123512, 125144, 126364, 126767, 126680, 126683, 126879, 126916, 126601, 126115, 125741, 125666, 125998, 126687, 127502, 128265, 128997, 129664, 130078, 130331, 131060, 132804, 135281, 137726, 139856, 141981, 144222, 146102, 147082, 147101, 146493, 145655, 144935, 144514, 144315, 144255, 144660, 146112, 148758, 151996, 155006, 157416, 159384, 161256, 163276, 165453, 167582, 169476, 171188, 172939, 174857, 176982, 179435, 182243, 185066, 187512, 189808, 192788, 196952, 201857, 206679, 211190, 215854, 221115, 226871, 232708, 238427, 244280, 250747, 258152, 266552, 276014, 286774, 298856, 311613, 324090, 335968, 347901, 360746, 374690, 389274, 404067, 419092, 434683, 451113, 468244, 485470, 502123, 517996, 533302, 548076, 561950, 574605, 586115, 596534, 605444, 612375, 617574, 621974, 626323, 630580, 634136, 636407]
52290F36407P89m67j295j835k460l354m370n221n701n665n075m165l385k954k631
52275E88618k021j018J34J125J893K713L982N749P553Q846R548J0000J0432J0801
52261F58355J1012J1076J1042J1111J1655J2636J3173J2380J0685R548R550R566
52249G91789Q362O328M776M027L212J787K17j022k201l696n212o243o843p417
52235G87864q003q371q647r214j0014j0444j0219r745r368q706p323n690m794
52222F77326m771m648l714k446j644j270p74j62J20J55N61J422K088K185K174
52207F66602K524L028L283L351L426L379L148L125L512L735L113J934J090P92
52193G06042L50o58j694j986j486p47k74k69q02j801k907l575l472k811k174k017
$$ y = [636407, 637196, 636729, 635434, 633599, 631139, 627785, 623415, 618194, 612493, 606828, 601753, 597588, 594203, 591249, 588618, 586597, 585579, 585713, 586838, 588731, 591444, 595426, 601175, 608728, 617574, 627122, 637122, 647554, 658355, 669367, 680443, 691485, 702596, 714251, 726887, 740060, 752440, 763125, 772673, 782223, 791789, 800151, 806479, 811255, 815282, 818494, 820281, 820498, 819476, 817275, 813579, 808367, 802124, 795281, 787864, 779861, 771490, 762843, 753629, 743615, 733171, 722952, 713207, 703839, 695133, 687810, 682120, 677326, 672555, 667907, 664193, 661747, 660103, 658833, 658059, 657897, 658017, 658172, 658733, 660155, 662243, 664428, 666602, 669126, 672154, 675437, 678788, 682214, 685593, 688741, 691866, 695378, 699113, 702226, 704160, 705250, 706042, 706392, 705734, 704040, 702054, 700568, 699821, 699547, 699278, 698476, 696675, 693768, 690193, 686721, 683910, 681736, 679719]
52177F79719k328k794l209l496l506l135k638k453k565k524k245k283k948l611
52163F39984l431k439j422r40j012j473k017k087j456p91r65j836k409k192j654
52148F13860j212o60N9L29k95j247j642j454j391j778k127j906j229o43l56N5
52132E98363J145K791M200M840N078N518O055O228O363P433R557J1544J2409J2617
52118F94141J3190J4191J4901J5064J5108J5276J5326J5143J4956J4922J4936
52107H57154J5014J5282J5555J5288J4208J2576J0750Q787O646M488K582J008
52095I79338l57j690k973l898m197m212m837o500q372r157q591p642p196p141
52081I02575o968o610o256n730m646l008j259J66J101J580J909K672M239O202
$$ y = [679719, 677391, 674597, 671388, 667892, 664386, 661251, 658613, 656160, 653595, 651071, 648826, 646543, 643595, 639984, 636553, 634114, 632692, 631752, 630740, 629267, 627250, 625163, 623707, 622916, 621951, 620115, 617706, 615514, 613860, 612648, 611988, 612047, 612376, 612081, 610834, 609192, 607738, 606347, 604569, 602442, 600536, 599307, 598664, 598308, 598363, 599508, 602299, 606499, 611339, 616417, 621935, 627990, 634218, 640581, 648014, 657571, 669115, 681524, 694141, 707331, 721522, 736423, 751487, 766595, 781871, 797197, 812340, 827296, 842218, 857154, 872168, 887450, 903005, 918293, 932501, 945077, 955827, 964614, 971260, 975748, 978330, 979338, 978981, 977291, 974318, 970420, 966223, 962011, 957174, 950674, 942302, 933145, 924554, 916912, 909716, 902575, 895607, 888997, 882741, 877011, 872365, 869357, 868098, 868264, 869365, 870945, 872854, 875526, 879765, 885967]
52067H85967P699Q369Q726R393J0317J0907J0772J0054R161Q370P743P152O434
$$ y = [885967, 893666, 902035, 910761, 920154, 930471, 941378, 952150, 962204, 971365, 979735, 987478, 994630, 1001064]
$$ [...]
##END NTUPLES=NMR SPECTRUM
##END=
