##TITLE=NES1037_878015026_9242866_9XMLrb76ax
##JCAMPDX= 6.0         $$ Bruker NMR JCAMP-DX V2.0
##DATA TYPE= NMR SPECTRUM
##DATA CLASS= NTUPLES
##ORIGIN= BRUKER
##OWNER= Administrator
$$ 1.72 TOPSPIN		Version 2.1
$$ 2015-08-24 14:01:07.951 -0700  Administrator@X
$$ Compression mode = diff/dup
##.OBSERVE FREQUENCY= 400.02188249412
##.OBSERVE NUCLEUS= ^1H
##.ACQUISITION MODE= SIMULTANEOUS (DQD)
##.ACQUISITION SCHEME= undefined
##.AVERAGES= 64
##.DIGITISER RES= 22
##SPECTROMETER/DATA SYSTEM= spect
##.PULSE SEQUENCE= noesygpps1d.comp
##.SOLVENT NAME= COFFEE_meoh
##.SHIFT REFERENCE= INTERNAL, COFFEE_meoh, 1, 14.96246
##AUDIT TRAIL= $$ (NUMBER, WHEN, WHO, WHERE, PROCESS, VERSION, WHAT)
$$ ##TITLE= Audit trail, TOPSPIN		Version 2.1
$$ ##JCAMPDX= 5.01
$$ ##ORIGIN= Bruker BioSpin GmbH
$$ ##OWNER= Administrator
$$ $$ E:\/data/COFFEE/nmr/NES1037_878015026_9242866_9XMLrb76ax/42/pdata/1/auditp.txt
$$ ##AUDIT TRAIL=  $$ (NUMBER, WHEN, WHO, WHERE, PROCESS, VERSION, WHAT)
(   1,<2015-08-24 14:01:02.498 -0700>,<Administrator>,<X>,<go>,<TOPSPIN 2.1>,
      <created by zg
	started at 2015-08-24 13:49:32.639 -0700,
	POWCHK enabled, PULCHK disabled,
       configuration hash MD5:
       21 0F 79 D6 B3 7B B4 F6 88 20 88 DB 03 48 BD 9F
       data hash MD5: 64K
       BD 60 19 54 3F 30 04 B3 B2 FF 3A B6 39 A6 79 EA>)
(   2,<2015-08-24 14:01:05.858 -0700>,<Administrator>,<X>,<proc1d>,<TOPSPIN 2.1>,
      <Start of raw data processing
       efp LB = 0.3 FT_mod = 6 PKNL = 1 PHC0 = 0 PHC1 = 0 SI = 128K 
       data hash MD5: 128K
       47 22 B7 5A E4 B9 DE 67 0D 55 1E FB F8 32 3E 12>)
(   3,<2015-08-24 14:01:06.748 -0700>,<Administrator>,<X>,<proc1d>,<TOPSPIN 2.1>,
      <pk PHC0 = -87.22046 PHC1 = 0 
       data hash MD5: 128K
       C3 79 96 F7 64 96 C1 23 8C 91 B6 96 8B 04 7E 30>)
(   4,<2015-08-24 14:01:07.123 -0700>,<Administrator>,<X>,<proc1d>,<TOPSPIN 2.1>,
      <abs ABSG = 1 
       data hash MD5: 128K
       EE 17 78 5A 04 8F 88 19 DB EC FE E2 3B 24 61 E6>)
(   5,<2015-08-24 14:01:07.233 -0700>,<Administrator>,<X>,<proc1d>,<TOPSPIN 2.1>,
      <abs ABSG = 2 
       data hash MD5: 128K
       19 5F 65 FA D2 33 E4 1E F1 E6 3D 5F 89 23 FE 7C>)
(   6,<2015-08-24 14:01:07.311 -0700>,<Administrator>,<X>,<proc1d>,<TOPSPIN 2.1>,
      <abs ABSG = 3 
       data hash MD5: 128K
       23 41 C5 3C 15 85 2A 54 2F E9 5B D7 BA 2C CD B0>)
(   7,<2015-08-24 14:01:07.405 -0700>,<Administrator>,<X>,<proc1d>,<TOPSPIN 2.1>,
      <abs ABSG = 4 
       data hash MD5: 128K
       E5 97 A8 00 A7 B7 E3 4A B2 39 1E E5 80 C7 91 31>)
(   8,<2015-08-24 14:01:07.530 -0700>,<Administrator>,<X>,<proc1d>,<TOPSPIN 2.1>,
      <abs ABSG = 5 
       data hash MD5: 128K
       A0 96 D4 15 A1 70 64 4A 7A A4 CF C7 8D E1 5C 1F>)
$$ ##END=
$$ 
$$ $$ hash MD5
$$ $$ 1C 82 4C D6 B9 81 1A 6D 12 62 79 46 C2 92 5B 96
##$RELAX= 
##$RELAX= 
##$RELAX= 
##$RELAX= 
##$RELAX= 
##$RELAX= 
##$RELAX= 
##$RELAX= 
$$ Bruker specific parameters
$$ --------------------------
##$DU= <E:\>
##$EXPNO= 42
$$ [...]
##$TP07= 0
##$TPNAME0= <>
##$TPNAME1= <>
##$TPNAME2= <>
##$TPNAME3= <>
##$TPNAME4= <>
##$TPNAME5= <>
##$TPNAME6= <>
##$TPNAME7= <>
##$TPOAL= (0..7)
0.5 0.5 0.5 0.5 0.5 0.5 0.5 0.5
##$TPOFFS= (0..7)
0 0 0 0 0 0 0 0
##$TUNHIN= 0
##$TUNHOUT= 0
##$TUNXOUT= 0
##$USERA1= <user>
##$USERA2= <user>
##$USERA3= <user>
##$USERA4= <user>
##$USERA5= <user>
##$V9= 5
##$VALIST= <valist>
##$VCLIST= <CCCCCCCCCCCCCCC>
##$VD= 0
##$VDLIST= <DDDDDDDDDDDDDDD>
##$VPLIST= <PPPPPPPPPPPPPPP>
##$VTLIST= <TTTTTTTTTTTTTTT>
##$WBST= 2048
##$WBSW= 25
##$XGAIN= (0..3)
0 0 0 0
##$XL= 0
##$YL= 0
##$YMAX_a= 5337997
##$YMIN_a= -10214197
##$ZGOPTNS= <>
##$ZL1= 120
##$ZL2= 120
##$ZL3= 120
##$ZL4= 120
##$ABSF1= 14.96246
##$ABSF2= -5.595722
##$ABSG= 5
##$ABSL= 3
##$ALPHA= 0
##$AQORDER= 0
##$ASSFAC= 0
##$ASSFACI= 0
##$ASSFACX= 0
##$ASSWID= 0
##$AUNMP= <proc_prof1d_extract.lims>
##$AXLEFT= 0
##$AXNAME= <>
##$AXNUC= <1H>
##$AXRIGHT= 0
##$AXTYPE= 0
##$AXUNIT= <>
##$AZFE= 0.1
##$AZFW= 0.1
##$BCFW= 0
##$BC_mod= 0
##$BYTORDP= 0
##$COROFFS= 0
##$CY= 15
##$DATMOD= 1
##$DC= 0
##$DFILT= <>
##$DTYPP= 0
##$F1P= 0
##$F2P= 0
##$FCOR= 0.5
##$FTSIZE= 131072
##$FT_mod= 6
##$GAMMA= 0
##$GB= 0
##$INTBC= 1
##$INTSCL= 1
##$ISEN= 128
##$LB= 0.3
##$LEV0= 0
##$LPBIN= 0
##$MAXI= 10000
##$MC2= 0
##$MEAN= 0
##$ME_mod= 0
##$MI= 0
##$NCOEF= 0
##$NC_proc= -2
##$NLEV= 6
##$NOISF1= 0
##$NOISF2= 0
##$NSP= 0
##$NTH_PI= 0
##$NZP= 0
##$OFFSET= 14.96246
##$PC= 1
##$PHC0= -87.22046
##$PHC1= 0
##$PH_mod= 1
##$PKNL= yes
##$PPARMOD= 0
##$PPDIAG= 0
##$PPIPTYP= 0
##$PPMPNUM= 2147483647
##$PPRESOL= 1
##$PSCAL= 4
##$PSIGN= 0
##$PYNMP= <proc.py>
##$REVERSE= no
##$SF= 400.020009053432
##$SI= 131072
##$SIGF1= 0
##$SIGF2= 0
##$SINO= 400
##$SIOLD= 131072
##$SPECTYP= <>
##$SREGLST= <1H.CDCl3>
##$SSB= 0
##$STSI= 131072
##$STSR= 0
##$SW_p= 8223.68421052631
##$SYMM= 0
##$S_DEV= 0
##$TDeff= 65536
##$TDoff= 0
##$TI= <>
##$TILT= no
##$TM1= 0
##$TM2= 0
##$TOPLEV= 0
##$USERP1= <user>
##$USERP2= <user>
##$USERP3= <user>
##$USERP4= <user>
##$USERP5= <user>
##$WDW= 1
##$XDIM= 131072
##$YMAX_p= 312631881
##$YMIN_p= -11304
##$CURPLOT= <Network HP LaserJet P1505>
##$CURPRIN= <$Network HP LaserJet P1505>
##$DFORMAT= <normdp>
##$LAYOUT= <+/1D_H.xwp>
##$LFORMAT= <normlp>
##$PFORMAT= <normpl>
##$SURQMSG= 1
$$ End of Bruker specific parameters
$$ ---------------------------------
##NTUPLES= NMR SPECTRUM
##VAR_NAME=  FREQUENCY,     SPECTRUM/REAL,   SPECTRUM/IMAG
##SYMBOL=    X,             R,               I
##VAR_TYPE=  INDEPENDENT,   DEPENDENT,       DEPENDENT
##VAR_FORM=  AFFN,          ASDF,            ASDF
##VAR_DIM=   131072,        131072,          131072
##UNITS=     HZ,            ARBITRARY UNITS, ARBITRARY UNITS
##FACTOR=    0.0627417313425164, 1,          1
##FIRST=     8223.62146879497, 1494,         -35237
##LAST=      0,             2962,            -35279
##MIN=       0,             -11304,          0
##MAX=       8223.62146879497, 312631881,    0
$$ Real data points
##PAGE= N=1
##DATA TABLE= (X++(R..R)), XYDATA
$$ [...]
64900 55091 56236 56680 56406 55896 55677 55862 56177 56406 56638 57083 57773 58469 58811 58547 57773 56921 56445 56433 56613
64881 56613 56745 56891 57282 57997 58871 59572 59704 59013 57734 56675 56625 57604 58848 59591 59657 59257 58560 57775 57371
64862 57371 57754 58732 59621 59982 59943 59791 59583 59360 59333 59547 59572 58906 57622 56298 55425 55208 55778 57054 58320
64843 58320 58567 57651 56675 56710 57384 57311 55851 53787 52204 51353 50969 51041 51663 52488 53046 53439 54042 54554 54148
64824 54148 52757 51465 51232 51839 52583 53362 54369 55185 55120 54331 53718 53621 53484 53042 52987 53941 55347 56054 55656
64805 55656 54707 53821 53167 52783 52849 53467 54455 55439 56022 55914 55151 54167 53476 53242 53237 53165 52929 52693 52803 53547
64785 53547 54808 56072 56914 57378 57660 57654 57114 56189 55441 55255 55423 55361 54593 53058 51181 49674 49072 49350
64767 49350 50007 50550 50820 50949 51111 51282 51171 50531 49584 48947 48950 49234 49214 48762 48213 47916 48091 48875 50067 50939
64747 50939 50862 50065 49326 48890 48292 47363 46772 47139 48109 48833 49095 49426 50172 51007 51507 51861 52692 54293 56216
64728 56216 57677 58237 58042 57491 56887 56448 56439 57014 57971 58917 59624 60084 60231 59875 58945 57641 56307 55271
64710 55271 54677 54265 53428 51847 50046 48953 48834 49051 48933 48531 48303 48448 48880 49618 50839 52579 54554
64693 54554 56248 57158 57129 56523 55903 55490 55137 54846 54975 55761 56903 57806 58102 57786 57121 56529 56403 56810 57521
64674 57521 58295 58958 59222 58867 58135 57559 57273 56933 56441 56177 56263 56215 55686 55037 54657 54283 53555 52804 52592 52787
64654 52787 52843 52770 53087 53922 54839 55513 55929 55997 55634 55211 55266 55697 55903 55784 55926 56673 57588 58020 57656 56473
64634 56473 54798 53601 53946 55803 57928 59224 59712 59953 60216 60616 61378 62385 62971 62738 62188 62037 62365
64617 62365 62894 63619 64518 65060 64773 64040 63661 63836 64210 64625 65100 65260 64665 63679 63184 63340 63416 62994 62495
64598 62495 62245 61883 61147 60565 60715 61319 61623 61308 60514 59387 58208 57573 57751 58062 57645 56734 56403 57038
64580 57038 57893 58353 58786 59656 60475 60362 59300 58142 57589 57765 58660 60229 61872 62523 61722 60205 59080
64563 59080 58649 58398 57907 57307 56933 56904 57153 57567 57976 58155 57950 57383 56634 55975 55620 55596 55831 56371 57273 58227
64543 58227 58627 58325 57985 58255 58807 58714 57695 56440 55691 55583 55966 56715 57428 57428 56529 55461 55042 55174 55054
64524 55054 54214 52976 51994 51662 51877 52143 52043 51775 52011 53021 54287 55277 56156 57243 58120 58036 57056 56083
64506 56083 55680 55570 55416 55439 55948 56789 57646 58460 59155 59283 58409 56706 54825 53315 52391 52122 52531 53542
64488 53542 55018 56749 58295 59059 58777 57844 56904 56281 56009 56186 56864 57620 57718 56899 55758 55115 55196 55550
64470 55550 55598 55072 54072 52961 52198 52040 52295 52519 52516 52545 52962 53830 54999 56397 57964 59327 59892 59420
64452 59420 58325 57269 56544 55970 55249 54291 53358 52971 53468 54481 55140 55057 54860 55368 56444 57154 56975 56242
64434 56242 55389 54384 53185 52211 51889 52065 52263 52348 52543 52968 53533 54181 54869 55362 55434 55309 55588 56597 57928
64415 57928 58785 58725 58023 57369 57196 57338 57418 57440 57706 58142 58173 57492 56539 55813 55056 53771 52325 51802 52626 53970
64395 53970 54803 54988 54986 54973 54806 54570 54560 54769 54924 55049 55522 56447 57424 58185 59053 60383 61806 62584 62630 62641
64375 62641 63070 63462 63195 62510 62262 62783 63516 63858 63846 63766 63551 62970 62182 61679 61712 62125 62711 63455 64409 65566
64355 65566 66850 68049 68828 69088 69270 69944 71051 71906 72101 72080 72620 73989 75840 77716 79329 80446 80857
64338 80857 80606 80054 79641 79613 79976 80638 81553 82764 84334 86269 88527 91047 93721 96430 99241 102488
64322 102488 106446 110970 115646 120341 125323 130815 136767 143205 150447 158612 167119 175082 182183 188767
64308 188767 195023 200332 203609 204180 202200 198309 193061 186740 179691 172601 166223 160790 155972 151465
64294 151465 147389 143942 140946 138089 135454 133415 132065 131037 129909 128491 126737 124668 122452 120252
64280 120252 117953 115236 112040 108670 105405 102276 99297 96637 94411 92559 91076 90072 89448 88811 87978
64265 87978 87329 87327 87859 88325 88275 87667 86702 85726 85212 85437 86154 86884 87575 88646 90346 92368 94315 96251
64247 96251 98581 101461 104530 107227 109310 111062 113012 115401 117904 119902 120946 120932 120018 118659 117568
64232 117568 117187 117065 116068 113481 109780 106178 103581 102109 101400 101047 100776 100446 100054 99723 99658 100025 100739
64215 100739 101427 101809 102127 102890 104059 104908 105031 105166 106486 109182 112342 115227 118054 121258 124594 127516
64199 127516 130111 133044 136702 140941 145669 151101 157258 163722 170221 177089 184733 192873 200745 207866
64185 207866 214127 219161 222219 222878 221473 218540 214157 208194 200966 193207 185404 177531 169551 161832
64171 161832 154900 148942 143713 138892 134404 130397 126961 123929 121081 118550 116870 116436 117033 118088 119316
64156 119316 120873 122914 125275 127618 129648 131108 131844 131985 131855 131643 131411 131498 132504 134570 136933 138606
64140 138606 139413 140089 141446 143787 147067 151214 156044 161033 165387 168455 170169 171137 172163 173544 174852
64125 174852 175462 175121 173921 171987 169474 166650 163704 160586 157403 154769 153297 152811 152613 152582 153407 155614
64109 155614 158875 162638 166891 171922 177713 184113 191302 199467 208183 216710 224878 233181 241840 250207
64095 250207 257233 262269 265345 267033 268144 269149 269669 268806 266149 262189 257613 252552 246823 240579 234288
64080 234288 228194 222223 216381 210839 205589 200384 195103 189918 185001 180372 176233 173167 171717 171817
64066 171817 172821 174008 174986 175781 176770 178446 181000 184207 187889 192352 198024 204712 211617 218206 224704
64051 224704 231521 238545 245337 251726 257787 263391 268232 272245 275506 277698 278208 276962 274660 271817
64037 271817 268028 262703 256309 250243 245459 241760 238552 235749 233616 232098 230784 229493 228574 228651 230186
64022 230186 233245 237462 242255 247264 252609 258615 265277 272129 278715 285122 291962 299810 308595 317573
64008 317573 325994 333825 341716 350208 359165 368054 376497 384303 391163 396798 401456 405892 410794 416532
63994 416532 423514 432335 443317 456246 470895 487512 506394 527219 549286 572391 597040 623797
63982 623797 652845 684236 718159 754812 794364 837210 883981 935180 991192 1052876 1121779
63971 1121779 1199553 1287611 1387834 1503260 1637465 1793396 1973448 2180693 2419396 2694076
63961 2694076 3008425 3365106 3765635 4209557 4693797 5213392 5763001 6337535 6931510
63952 6931510 7538193 8149235 8754365 9340789 9893044 10394248 10828605 11183843 11452236
63943 11452236 11629938 11715490 11708685 11610148 11421267 11144173 10782263 10341600 9832382 9269075
63933 9269075 8668758 8048548 7423410 6805030 6201988 5620902 5067687 4547906 4066261
63924 4066261 3626209 3230104 2879083 2572207 2305959 2075350 1875885 1704363 1558012
63915 1558012 1433543 1327369 1236357 1157953 1089927 1030460 978273 932118 890236 850806 813005
63904 813005 777129 743528 711829 681335 651695 622849 594634 566852 539547 512915 487080
63893 487080 462208 438667 416715 396200 376900 359056 343161 329274 316914 305632 295347
63882 295347 286048 277538 269603 262168 255201 248709 242881 237953 233783 229874 225949 222275 219276 217082
63868 217082 215604 214797 214600 214824 215350 216256 217509 218746 219640 220381 221481 223156 225127 226965 228324 228860
63852 228860 228219 226243 223055 218905 214062 208823 203395 197695 191426 184499 177345 170704 165030 160093
63838 160093 155182 149821 144217 138934 134162 129616 125192 121303 118318 115921 113452 110767 108351 106572
63824 106572 105200 103764 102093 100383 98950 98026 97619 97478 97305 97035 96757 96375 95593 94325 92923 91883
63808 91883 91471 91602 91867 91654 90560 88879 87442 86828 86893 87210 87638 88225 88769 88896 88526 87994 87680 87678 87818
63789 87818 87824 87471 86750 85908 85226 84751 84328 83803 83067 82001 80572 78958 77422 76099 75022 74274 73893 73708
63771 73708 73490 73227 73055 72955 72829 72834 73283 74074 74583 74332 73541 72792 72392 72328 72594 73155 73673 73716 73336 73130
63751 73130 73588 74596 75683 76487 76830 76614 76052 75896 77024 79536 82484 84719 85931 86618 87183 87559 87854
63734 87854 88841 91153 94153 96290 96789 96463 96516 97085 97495 97516 97509 97374 96302 93915 91088 89188 88892 90127
63716 90127 92668 96148 99730 102501 104316 105799 107442 109150 110728 112281 113838 114990 115339 115125 114974
63701 114974 115045 114747 113431 111133 108489 106053 103916 101957 100206 98775 97573 96369 95154 94185 93607
63686 93607 93290 93176 93477 94299 95343 96290 97284 98660 100388 102196 104050 105982 107493 107825 107003 106014 105637
63669 105637 105569 105076 104118 103324 103030 102814 102067 100788 99710 99576 100225 100580 99874 98747 98604 99940 101978
63652 101978 104078 106579 109818 113151 115853 118425 122008 126768 131757 136310 140719 145525 150968 157277
63638 157277 164733 173205 182232 191762 202274 213973 226390 238953 251447 263787 275882 287870
63626 287870 299771 310733 319329 324928 328133 329555 329007 326413 322685 318849 314882 310313 305535 301586
63612 301586 298824 296715 294762 292769 290193 286155 280299 272935 264264 254229 243378 233015 223963
63599 223963 215818 208019 201141 196358 193827 192347 190718 188877 187491 186877 186812 187333 189220 193342 199592
63584 199592 206772 213621 219721 225358 230892 236567 242643 249219 255977 262516 268944 275804 283407 291585
63570 291585 300091 308898 318006 327306 336633 345600 353306 358699 361413 361867 360464 357166 352161 346386
63556 346386 340881 335879 331057 326448 322631 319936 317886 315523 312153 307785 302921 297852 292093 284800
63542 284800 275860 266259 257094 248569 240321 232347 224994 218205 211466 204571 197900 191790 186100 180561
63528 180561 175163 170006 165139 160696 156874 153579 150505 147730 145795 144870 144246 143080 141400 139874 138828
63513 138828 137982 137032 135966 134736 133196 131565 130588 130870 132180 133600 134322 134238 133855 133764 134113 134519 134487 133878
63495 133878 132915 131872 130927 130296 130305 131236 133185 135992 139227 142358 145174 147931 150805 153276 154526 154511
63479 154511 154264 154883 156518 158554 160446 162042 163360 164468 165539 166736 168092 169697 171839 174673 177959
63464 177959 181433 185223 189452 193584 196862 199455 202479 206523 210709 213761 215650 217609 220689 224932
63450 224932 229941 235638 242161 249466 257485 266474 276796 288397 300930 314501 329903 347754 367515
63437 367515 387698 406979 424774 440684 453917 463681 469940 473313 474262 472790 468977 463461 457231
63424 457231 451235 446248 442733 440464 438445 435494 430863 424308 415861 405890 395048 383721 371582
63411 371582 358112 343618 329368 316580 305539 295734 286553 277719 269409 262220 256771 253058 250377
63398 250377 248162 246733 246861 248664 251399 254358 257540 261223 265320 269589 274261 280029 287423 296491
63384 296491 307000 318557 330574 342621 354986 368460 383289 398742 413956 428720 442895
63373 442895 455448 464866 470504 472920 472799 470282 465627 459867 454238 449238 444715 440636 437297 434823
63359 434823 432874 430854 428146 424177 418485 410882 401461 390550 378724 366717 355099 344058 333566
63346 333566 323648 314410 305984 298554 292213 286681 281453 276474 272329 269395 267002 263912 259533 254256
63332 254256 248721 243259 238045 233241 228794 224473 220321 216767 214181 212557 211720 211488 211486 211196 210397 209346
63316 209346 208403 207757 207634 208285 209479 210414 210585 210422 210560 210741 210126 208696 207697 208337 210462 212811 214299
63299 214299 214707 214355 213579 212588 211483 210222 208684 206925 205280 204080 203324 202729 202081 201453 201078 201114 201508
63282 201508 201972 202146 201920 201582 201477 201518 201257 200554 199893 199854 200443 201209 201895 202694 203917 205628 207617 209563
63264 209563 211240 212730 214368 216319 218356 220264 222292 224876 228008 231288 234562 238079 241981 246106
63250 246106 250457 255405 261159 267431 273966 281160 289724 299867 311098 322824 334884 347537 361108
63237 361108 375676 391012 406848 423160 440006 457080 473762 489739 505293 520750 536022
63226 536022 550979 565978 581534 597616 613705 629489 645058 660415 675259 689272 702155
63215 702155 713187 721221 725412 725648 722043 714366 702408 686685 668250 647886 625953 603047 580200
63202 580200 558211 537249 517540 500063 485970 475436 467674 462137 459121 459007 461512 466082 472666
63189 472666 481553 492629 505255 518868 533372 548988 565975 584389 603837 623559 643055 662421
63177 662421 681800 700777 718833 736120 753126 769685 785028 798831 811354 822317 830448 834589
63165 834589 834652 831043 823700 812204 796374 776311 752352 725427 696986 668040 638796 609746
63153 609746 582414 558093 536293 515481 495191 476424 460062 446016 434103 424636 417567 411827
63141 411827 406232 400627 395610 391471 387886 384428 380932 377420 374028 371028 368724 367278 366643 366577 366736
63126 366736 366886 367021 367137 367062 366690 366279 366132 366107 365821 365258 364756 364477 364360 364636 365803 367951 370514 372823
63108 372823 374532 375510 375901 376412 377949 380680 383907 387070 390282 393662 396818 399459 401972 404852 408009
63093 408009 411162 414446 417936 420997 422882 423861 425089 427367 430633 434536 438825 443154 447184 451156
63079 451156 455854 461716 468286 474741 480700 486409 492383 499092 506785 515511 525337 536460 548879 562078
63065 562078 575385 588719 602725 618146 635330 654385 675445 698620 723865 751087 780229
63054 780229 811120 843338 876357 909863 943942 978899 1014713 1050623 1085532 1119019 1151732
63043 1151732 1184584 1217841 1251329 1285145 1319465 1353774 1387014 1418686 1449193 1478699 1506079
63032 1506079 1529325 1546731 1557372 1560703 1556148 1543127 1521395 1491445 1454612 1412600 1366802 1318249
63020 1318249 1268205 1218400 1170444 1125371 1084023 1047495 1016700 991665 971697 956324 945736
63009 945736 940308 940034 944574 953659 967237 985238 1007275 1032583 1060321 1089910 1121000 1153111
62997 1153111 1185567 1217908 1250189 1282730 1315669 1348886 1382089 1414689 1445744 1474295 1499696
62986 1499696 1521323 1538118 1548851 1552860 1550145 1540624 1523657 1498532 1465161 1424124 1376281 1322667
62974 1322667 1264631 1203725 1141437 1079181 1018452 960598 906307 855441 807600 762765 721307
62963 721307 683442 648904 617214 588196 562081 539111 519141 501639 485983 471674 458378
62952 458378 445982 434663 424736 416268 408843 401845 395052 388818 383559 379064 374527 369351 363802 358681
62938 358681 354371 350479 346500 342603 339511 337704 336967 336691 336310 335398 333692 331328 328900 326989 325601
62923 325601 324252 322608 320733 318636 315873 311923 306938 301802 297340 293583 290019 286415 283198 280955
62909 280955 279733 279012 278288 277492 276812 276272 275693 275018 274480 274325 274431 274276 273348 271608 269590 267973 266954
62892 266954 266004 264341 261714 258665 256018 254189 253038 252176 251296 250271 249174 248215 247578 247330 247509 248121
62876 248121 248856 248985 247963 246167 244644 244024 244008 244071 244177 244490 244794 244782 244714 245125 245866 246068 245260 244012 243145
62857 243145 242695 242073 240949 239519 237986 236246 234146 231762 229298 226880 224559 222444 220841 220183 220693
62842 220693 221964 223066 223297 222814 222332 222289 222496 222524 222185 221651 221333 221641 222638 223963 225370 227240 230187
62825 230187 234094 237966 240935 243120 245302 248103 251706 255998 260547 264646 267872 270568 273442 276782
62811 276782 280389 284163 288320 293070 298545 305081 313018 322056 331368 340673 350807 362826 376852
62798 376852 392244 408597 426072 444891 465133 487115 511485 538724 568972 602562 640373
62787 640373 683288 731437 784238 841029 901356 964626 1029806 1095650 1161015 1224764 1285353
62776 1285353 1340773 1389032 1428648 1458580 1477861 1485662 1481853 1467215 1442835 1409453 1367660 1318604
62764 1318604 1264094 1205951 1145553 1084010 1022422 961793 902977 846888 794436 745929 700734
62753 700734 657952 617435 579939 546326 516852 491146 468554 448443 430427 414413 400339
62742 400339 387874 376558 366250 357191 349542 343093 337552 332936 329475 327222 325939 325341 325341 326048 327610
62727 327610 330028 333115 336724 341044 346572 353675 362234 371796 382001 392841 404696 418285 434445
62714 434445 453687 475958 500973 528779 559823 594472 632781 674766 720668 770739 824893
62703 824893 882710 943604 1006822 1071410 1136355 1200645 1262954 1321373 1373793 1418544 1454464
62692 1454464 1480323 1494650 1496390 1485555 1463031 1429918 1387312 1336541 1279252 1217183 1152066
62681 1152066 1085704 1019777 955365 892832 832448 775072 722001 674068 631026 591897 555931
62670 555931 523103 493744 467852 444896 424214 405384 388153 372261 357501 343938 331869
62659 331869 321543 312891 305446 298464 291330 284033 277186 271381 266515 261905 257035 252040 247464 243759
62645 243759 241037 239162 237902 236988 236031 234514 232140 229346 227206 226459 226670 226644 225675 224133 222877 222457
62629 222457 222888 223801 224676 225224 225682 226460 227474 228216 228605 229282 230789 232894 235113 237579 240909 245432
62613 245432 250918 256982 263403 270250 278078 287853 300296 315314 332377 351240 371960 394492 418824
62600 418824 445360 474495 505701 537627 569217 600289 630856 660360 687786 712028 731839
62589 731839 745852 753116 753555 747760 736568 720914 701727 679657 655127 628767 601495 573975
62577 573975 546327 518653 491499 465562 441251 418825 398548 380344 363677 348298 334808
62566 334808 323918 315365 308188 301916 296764 292688 289061 285560 282655 280689 278946 276167 271735 265963
62552 265963 259473 252875 246945 242442 239485 237392 235346 233079 230850 229033 227958 227924 229016 230888 232965
62537 232965 235025 237462 240873 245522 251348 258352 266704 276459 287492 299946 314489 331785 351710
62524 351710 373375 396069 419951 445668 473548 503440 535255 569178 605100 642004 678212
62513 678212 712154 742706 768898 789742 804556 813210 815769 812044 801781 785235 763310 737203
62501 737203 708124 677242 645478 613265 580839 548854 518389 490161 464063 439756 417429
62490 417429 397628 380518 365679 352621 341166 331312 322941 315746 309342 303446 298004 293093 288675
62477 288675 284649 281265 279097 278238 277788 276712 275167 274404 275223 276999 278515 279307 279889 281022 283213 286693
62461 286693 291348 296623 301912 307196 313044 319921 327674 335775 343817 351635 359126 366197 372801 378812
62447 378812 383805 387065 387908 385996 381419 374623 366278 357087 347554 337942 328398 318994 309604 299940
62433 299940 289970 280304 271929 265483 260872 257549 254996 252870 250966 249271 247948 247138 246813 246928 247551
62418 247551 248708 250220 251921 253925 256509 259777 263632 268009 272883 278057 283149 287869 292236 296563
62404 296563 301325 306871 313047 319170 324621 329430 334035 338567 342687 346105 348870 351079 352679 353700
62390 353700 354364 354740 354554 353611 352239 351113 350783 351524 353501 356858 361723 368238 376511 386472 398014
62375 398014 411377 427196 445976 467676 491877 518189 546310 575917 606706 638333 670144
62364 670144 701156 730485 757534 781621 801842 817683 829429 837535 841908 842367 839486 834253 826956
62351 826956 817074 804283 788858 771029 750777 728590 705709 683154 661062 639443 618966 600318
62339 600318 583221 566877 551175 536680 523466 510706 497594 484176 471078 458817 447507
62328 447507 436872 426403 415854 405717 396885 389718 383764 378551 374211 371088 369114 368015 367895
62315 367895 369104 371531 374343 376558 377779 378336 378820 379442 379818 379467 378509 377641 377309 377132 376348 374653 372359
62298 372359 369893 367420 364857 362012 358840 355825 353914 353594 354130 354245 353624 353192 353811 355350 357390 360234
62282 360234 364488 370023 376139 382677 390222 399072 408811 419281 431346 446046 463368 482535 503382
62269 503382 526728 553197 582213 612483 643125 673974 704924 735289 763768 788832 809295
62258 809295 824767 835601 842259 844808 843133 837433 828081 815075 798047 777051 753042 727361
62246 727361 700924 674118 647223 620685 595114 571333 550254 532322 517080 503659 491756
62235 491756 481787 473985 467744 462162 456999 452752 449903 448385 447756 447591 447635 447725 447721 447512 447155 447072 447942 450168
62217 450168 453428 456955 460328 463806 467819 472333 476893 481175 485300 489610 494321 499425 504836 510523
62203 510523 516561 523110 530262 537888 545706 553604 561799 570571 579899 589556 599545 610119 621254 632335
62189 632335 642693 652310 661723 671299 681001 690963 701882 714522 729002 744838 761639 779535
62177 779535 799005 820473 843963 868820 893715 917187 938346 957010 973078 985972 994915 999760
62165 999760 1001444 1001449 1000737 999157 995932 990660 983714 975671 966649 956507 945554 934666 924562 915251
62151 915251 906438 898311 891642 887105 884699 883952 884502 886266 889040 892142 894612 895749 895429 893963 891900
62136 891900 889942 888763 888593 889089 889837 890999 893190 896723 901191 905906 910499 914908 919036 922782 926368
62121 926368 930270 934747 939685 945050 951157 958136 965267 971359 975953 979810 983927 988348 992344 995605
62107 995605 998694 1002194 1005923 1009361 1012545 1016061 1020247 1024818 1029298 1033517 1037584 1041641 1045732 1049744
62093 1049744 1053480 1056984 1060795 1065558 1071339 1077665 1084365 1091994 1101133 1111531 1122292 1132756 1142918
62080 1142918 1153130 1163864 1175720 1189206 1204214 1219946 1235498 1250372 1264261 1276595 1286573
62069 1286573 1293640 1297666 1298620 1296303 1290569 1281778 1270816 1258532 1245168 1230370 1213703 1195077 1174718
62056 1174718 1152966 1130225 1107008 1083832 1061097 1039152 1018367 998918 980554 962852 945810
62045 945810 929994 915923 903474 892023 881023 870205 859385 848392 837316 826625 816898 808492
62033 808492 801388 795250 789588 784008 778354 772532 766300 759493 752499 746168 741040 736801 732648 727987
62019 727987 722604 716484 709911 703651 698520 694615 691246 687755 684188 681085 678868 677576 676917 676357 675305
62004 675305 673495 671155 668702 666298 663760 660825 657457 653950 650698 647696 644387 640292 635768 631617
61990 631617 627860 623425 617467 610548 604003 598462 593549 588844 584390 580264 576361 572843 570239 568711
61976 568711 567644 566312 564713 563371 562524 561909 561311 560946 561178 562031 563114 564065 565008 566478 568833 571864
61960 571864 575117 578523 582469 587303 593015 599446 606534 614294 622765 632070 642338 653532 665595
61947 665595 678723 693167 708686 724625 740777 757877 776940 798272 821355 845478 870191
61936 870191 895367 921153 947931 976103 1005922 1037583 1071341 1107434 1146079 1187718 1233062
61925 1233062 1282630 1336427 1394360 1456947 1525321 1600572 1683225 1773345 1870974 1976488 2090600
61914 2090600 2213960 2346636 2488025 2637301 2793693 2956233 3123486 3293669 3464641
61905 3464641 3633330 3795421 3946147 4081517 4198409 4293504 4362702 4402071 4409366 4384510
61895 4384510 4328827 4244205 4133198 3999681 3848826 3685971 3515489 3340862 3165537 2993074
61885 2993074 2826317 2666902 2515795 2373762 2241038 2117139 2001650 1894890 1797296 1708477
61875 1708477 1627524 1553962 1487581 1427427 1371892 1320091 1272424 1229494 1191070 1156523 1125734
61864 1125734 1098947 1075952 1055836 1037535 1020426 1004541 990375 978404 968660 960872 954866 950516
61852 950516 947304 944467 941706 939291 937277 935137 932505 929777 927479 925397 922958 920270 918247 917671
61838 917671 918647 920917 924244 928313 932623 936731 940576 944528 949176 954925 961581 968349 974438 979667
61824 979667 984380 988972 993760 999232 1005979 1014245 1023784 1034309 1045986 1059365 1074905 1092650 1112444
61811 1112444 1134460 1159353 1187676 1219095 1252571 1287531 1324618 1364966 1409012 1456436 1507156
61800 1507156 1561835 1621359 1686241 1756772 1833343 1916396 2006261 2103338 2208370 2322456 2446859
61789 2446859 2582772 2730965 2891533 3064331 3249868 3449498 3664457 3894887 4140122
61780 4140122 4399574 4672706 4958062 5252804 5553281 5855449 6154271 6443079 6714082
61771 6714082 6959536 7172153 7344671 7469962 7542234 7558247 7517494 7421664 7274334 7080907
61761 7080907 6848308 6584337 6297060 5994336 5683369 5370491 5061311 4760772 4472589
61752 4472589 4198684 3939649 3696018 3468813 3258676 3064903 2885803 2719975 2566856
61743 2566856 2426054 2296613 2177210 2066848 1965025 1871246 1784694 1704524 1630324 1562030
61733 1562030 1499411 1441798 1388380 1338586 1292116 1248811 1208634 1171587 1137388 1105381 1074997
61722 1074997 1046280 1019696 995470 973314 952720 933196 914236 895483 877096 859698 843753
61711 843753 829162 815506 802464 789812 777302 764721 752004 739191 726458 714192 702822
61700 702822 692430 682721 673392 664265 655065 645500 635743 626423 617944 610177 603020 596687 591026 585111
61686 585111 578186 570746 563946 558066 552250 545779 538882 532116 525504 518614 511175 503307 495388 487820
61672 487820 480763 474000 467291 460864 455264 450645 446529 442390 438244 434524 431595 429455 427724 425886
61658 425886 423790 421944 420994 420879 420810 420168 418997 417530 415708 413526 411475 410153 409492 408791 407568 406181
61642 406181 405536 406228 407979 409867 411119 411646 411783 411751 411671 411877 412727 413999 414973 415278 415267 415350 415382 415015 414304
61623 414304 413602 413032 412399 411443 409934 407724 404995 402218 399638 397026 394203 391467 389111 386819 384097
61608 384097 381123 378558 376525 374341 371389 367819 364269 361257 359033 357672 357004 356591 355952 354802 353208
61593 353208 351678 350992 351571 352990 354377 355310 356117 357331 359262 362106 365984 370663 375581 380419 385432
61578 385432 391007 397155 403629 410335 417420 425064 433430 442674 452885 464056 476152 489041 502379
61565 502379 515874 529754 544589 560438 576456 591613 605543 618447 630474 641606 651905
61554 651905 661492 670323 678369 685938 693485 701175 708904 716641 724435 732172 739709 747125 754446 761174
61540 761174 766595 770587 773636 775960 777102 776604 774655 771820 768540 765195 762211 759725 757433 755180
61526 755180 753476 752971 753679 755257 757943 762602 769680 778562 788211 798211 809013 821390 835919 852926
61512 852926 872747 895916 922922 953719 987643 1024161 1063730 1107677 1157154 1212399 1272994
61501 1272994 1338496 1408613 1482982 1561138 1642690 1727296 1814353 1902686 1990546 2075944 2157089
61490 2157089 2232553 2300952 2360491 2408990 2444536 2466232 2474390 2470152 2454937 2430180 2397392 2358263
61478 2358263 2314544 2267852 2219686 2171495 2124391 2078648 2033882 1989964 1947465 1906937 1868171
61467 1868171 1830732 1794983 1761871 1731751 1704154 1678798 1656135 1636631 1620268 1607157 1598006
61456 1598006 1593350 1592808 1595662 1601765 1611192 1623399 1637501 1653230 1670845 1690205 1710787 1732686
61444 1732686 1756807 1783637 1812434 1841997 1871807 1902064 1932854 1963570 1992883 2019125 2041023
61433 2041023 2058362 2071834 2082173 2089689 2094664 2097689 2099389 2100129 2100277 2100357 2100604 2100592 2099670 2097610 2094586
61418 2094586 2090830 2086621 2082350 2078054 2072894 2065397 2054279 2038954 2019534 1996793 1972127 1947146
61406 1947146 1923097 1900682 1880288 1862139 1846265 1832493 1820414 1809292 1798282 1787168 1776833
61395 1776833 1768663 1763364 1760549 1759405 1759556 1761304 1765375 1772572 1783508 1798591 1818223 1842859 1872741
61382 1872741 1907805 1948132 1994323 2047052 2106380 2171961 2243837 2322390 2407285 2496912 2589079
61371 2589079 2681920 2773909 2863524 2949303 3029868 3103297 3166675 3216869 3251862 3271057 3274430
61360 3274430 3261967 3234096 3192159 3138076 3073718 3000767 2920899 2835734 2746639 2654797 2561460
61349 2561460 2467923 2375290 2284431 2196150 2111256 2030473 1954456 1883836 1819024 1759917 1706014
61338 1706014 1656986 1612974 1574279 1540883 1512454 1488619 1469110 1453741 1442488 1435436 1432456 1433054
61326 1433054 1436864 1444161 1455416 1470301 1487572 1506157 1525935 1547055 1568791 1589530 1607859 1623318
61314 1623318 1636159 1646831 1655841 1663755 1670959 1677501 1683324 1688709 1694325 1700787 1708155 1715873 1723169
61301 1723169 1729512 1734627 1738186 1739650 1738558 1734903 1729131 1721751 1712931 1702423 1689872 1675304 1659311
61288 1659311 1642598 1625354 1607249 1588134 1568435 1548715 1529120 1509569 1490349 1472232 1456043
61277 1456043 1442269 1430887 1421236 1412128 1402442 1391668 1379776 1366744 1352616 1337850 1323103 1308557
61265 1308557 1293931 1279284 1265419 1253312 1243496 1236243 1231940 1230948 1233312 1239009 1248304 1261532 1278604
61252 1278604 1299094 1322787 1349922 1380888 1415984 1455481 1499651 1548471 1601297 1656865 1713673
61241 1713673 1770421 1826021 1878995 1926816 1966159 1994234 2010018 2014225 2008276 1993485 1971012 1942106
61229 1942106 1908099 1870234 1829581 1787099 1743746 1700566 1658638 1618844 1581745 1547718 1517106
61218 1517106 1489940 1465411 1441810 1417289 1390868 1362822 1334110 1305548 1277542 1250539 1225292
61207 1225292 1202308 1181061 1160165 1138612 1116637 1095225 1075006 1055992 1038252 1022341 1008831
61196 1008831 997600 987800 978415 968758 958513 947554 935863 923623 911236 899050 886989 874553
61184 874553 861283 847240 832963 818980 805444 792201 779146 766478 754594 743710 733643
61173 733643 724109 715239 707638 701852 697902 695386 693859 692992 692522 692215 691715 690257 686764 680543 671863
61158 671863 661590 650382 638501 626294 614346 603033 592322 582222 573136 565481 559134 553567
61146 553567 548454 543887 539941 536339 532740 529290 526634 525194 524500 523449 521287 518202 514939 512085
61132 512085 509892 508421 507458 506459 505103 503934 503976 505523 507720 509602 511293 513867 518152 523912 530092
61117 530092 535625 539980 543022 544423 543467 539770 534063 527738 521453 514644 506655 497858 489250 481372
61103 481372 474095 467132 460132 452517 443930 434832 426059 417716 409162 400145 391236 382861 374558 365722
61089 365722 356631 348246 341265 335803 331691 328550 325737 322832 320175 318515 318033 318108 318126 318085 318219 318337
61073 318337 317914 316763 315424 314825 315557 317420 319616 321423 322749 324081 326064 329149 333380 338234 342785
61058 342785 346386 349280 352268 355714 359126 361788 363516 364588 365265 365682 366061 366622 367250 367575 367462 367255
61042 367255 367371 367795 368156 368308 368639 369649 371201 372399 372435 371498 370612 370483 370868 371256 371806 373111 375225
61025 375225 377600 380242 384392 391623 402515 416700 434052 455417 482153 515307 555253 601821
61013 601821 654781 714500 781714 855435 930313 996736 1045095 1071055 1077262 1070675 1058898 1048497
61001 1048497 1044655 1049954 1062208 1073720 1073860 1054035 1011862 951744 881804 809891 741519 680072
60989 680072 627438 584018 548793 520271 497534 480288 468144 460221 455388 452566 450915 450024 449925
60976 449925 450673 451960 453336 454730 456436 458542 460629 462018 462152 460863 458534 455950 453646 451439 448863
60961 448863 445899 442808 439370 434970 429614 424197 419373 414653 409055 402348 395187 388266 381785 375564
60947 375564 369287 362697 355864 349262 343400 338606 335284 333956 334595 336205 337620 338598 339692 341280 343284
60932 343284 345678 348514 351377 353476 354533 355048 355493 355819 355999 356499 357665 358988 359542 359003 357861 356718
60916 356718 355769 354949 354276 353951 354202 355029 356078 356914 357487 358166 359282 360875 362975 365744 369079 372368
60900 372368 375003 377042 379048 381433 384180 387008 389364 390367 389234 385945 381286 376144 370940 365687
60886 365687 360319 354840 349360 344125 339458 335643 332954 331687 332006 333739 336519 340086 344319 348975
60872 348975 353623 357906 361683 364891 367389 369041 369867 370072 369985 369970 370314 371251 373035 375768 378957 381521
60856 381521 382664 382763 383041 384322 386466 389026 391976 395461 399188 402518 405039 406713 407491 407200 405913
60841 405913 404201 402817 402160 402026 401819 401030 399622 398017 396598 395283 393676 391687 389785 388452 387463
60826 387463 385936 383257 379769 376364 373432 370491 366932 362799 358496 353963 348680 342648 336892 332569
60812 332569 329750 327469 324919 322246 320134 318932 318421 318205 318116 318293 318985 320206 321485 322129 321932 321558
60796 321558 321968 323466 325490 327350 328849 330082 330982 331452 331814 332690 334341 336454 338703 341245 344406
60781 344406 348087 351777 355108 358122 361000 363781 366421 368963 371542 374291 377231 380163 382711 384683
60767 384683 386357 388188 390183 391949 393468 395421 398302 401533 403991 405370 406378 407500 408253 408074 407400
60752 407400 407135 407247 406583 404178 400149 395138 389459 383126 376320 369392 362653 356467 351272 347075 343207
60737 343207 339105 335128 332078 330011 328227 326473 325355 325288 325754 326157 326868 328661 331429 334185 336324
60722 336324 338155 340074 341814 342898 343416 343907 344591 345035 344623 343208 341296 339617 338526 337757 336791 335369
60706 335369 333540 331328 328606 325402 322047 318789 315406 311484 307081 302862 299422 296606 293687 290138
60692 290138 286030 281700 277395 273429 270373 268634 267924 267537 267161 267049 267390 268042 269010 270580 272638 274397
60676 274397 275335 275969 277049 278319 278872 278644 278695 279870 281926 284259 286814 289798 293078 296451 300225 304926
60660 304926 310489 316204 321540 326696 332244 338407 344797 350794 356102 360893 365398 369529 373073 376082
60646 376082 378726 380875 382285 383233 384463 386265 388066 389239 389962 390935 392529 394529 396441 397726 398006
60631 398006 397444 396704 396231 395785 395006 394035 393078 391734 389511 386853 384829 383734 382727 381100 379197 377717
60615 377717 376682 375592 374199 372558 370518 367730 364217 360604 357633 355519 353786 351700 349007 346256
60601 346256 344259 343196 342559 341996 341802 342265 342951 343086 342530 341944 342065 343165 345120 347594 350070 352063
60585 352063 353492 354618 355609 356411 357048 357708 358414 358951 359335 360007 361296 362927 364356 365375 366088 366542 366807
60568 366807 367281 368397 369988 371387 372248 372866 373555 374218 374834 375935 378133 381366 385045 388875 393256 398966
60552 398966 406749 417013 429622 444049 460071 478247 499418 523875 551317 581412 613768 647329
60540 647329 680370 711159 738116 759265 772293 775661 769417 754733 733189 706816 678165 649529
60528 649529 622229 597004 574731 556091 540766 527751 516575 507718 501774 498684 497952 499176 502195
60515 502195 507112 514346 524421 537535 553545 572399 594348 619596 647920 678645 710777 743048
60503 743048 773949 801735 824444 840314 848612 850011 845884 837496 826328 814891 806354 803214 806892
60490 806892 818681 840184 872404 915168 968115 1031788 1107101 1194091 1291870 1399404 1515215
60479 1515215 1635915 1755582 1866851 1962379 2035354 2079537 2089980 2064338 2003772 1912836 1798525
60468 1798525 1669023 1532560 1396537 1266847 1147445 1040305 945865 863626 792587 731561
60458 731561 679481 635461 598483 567111 539770 515379 493671 474859 459023 445778 434402
60447 434402 424265 415125 407006 399828 393309 387229 381583 376340 371272 366329 362064 359313 358262 357976
60433 357976 357056 354845 351898 349265 347346 345578 343282 340577 338248 336824 336112 335664 335298 334957 334408 333462
60417 333462 332405 331900 332412 333889 335920 338060 340080 342124 344606 347781 351476 355422 359741 364886 371069
60402 371069 377991 385161 392268 399167 405710 411743 417224 422220 426765 430779 434130 436770 438842 440615
60388 440615 442354 444238 446299 448293 449735 450298 450199 449905 449433 448284 446293 444182 442902 442614 442645 442353
60372 442353 441692 440991 440572 440598 440995 441445 441683 441854 442347 443299 444487 445699 446916 448083 448970 449353 449107 448103
60354 448103 446302 444084 442187 441086 440521 439813 438576 437021 435660 434803 434331 433942 433673 434018 435281 436906
60338 436906 437820 437570 436755 436098 435426 433968 431485 428614 426015 423590 420802 417539 414313 411631 409485
60323 409485 407567 405722 403966 402228 400406 398619 397115 395886 394752 393930 394029 395229 396810 397883 398237
60308 398237 398057 397146 395145 392420 389945 388102 386231 383642 380601 377878 375762 373989 372367 371043 370193
60293 370193 369830 369863 370095 370192 369931 369494 369333 369681 370283 370669 370724 370986 372301 375025 378608 382112 385056 387555
60275 387555 389769 391682 393492 395730 398724 402231 405786 409182 412427 415599 418981 423013 427804 432902
60261 432902 437823 442549 447290 452096 457025 462386 468279 474152 479267 483540 487546 491886 496949 503097
60247 503097 510514 518877 527660 536757 546430 556717 567436 578811 591572 606332 623294 642630
60235 642630 664635 689277 716079 744743 775683 809813 848098 891281 939511 992000 1047523
60224 1047523 1105534 1166411 1230359 1296525 1363572 1430528 1496508 1559930 1618778 1671661 1718123
60213 1718123 1757966 1790762 1816074 1833682 1843455 1845369 1839809 1827616 1809736 1787122 1761048 1733189
60201 1733189 1705161 1678109 1652869 1630353 1611636 1597844 1590106 1589458 1596517 1611290 1633451 1662807
60189 1662807 1699419 1743285 1794100 1851263 1914010 1981380 2052097 2124555 2196895 2267101 2333092
60178 2333092 2392855 2444624 2486969 2518761 2539183 2547820 2544685 2530024 2504113 2467385 2420777 2365900
60166 2365900 2304851 2239926 2173459 2107679 2044579 1985898 1933231 1887986 1851070 1822708 1802676
60155 1802676 1790699 1786691 1790791 1803309 1824481 1854020 1890785 1932912 1978226 2024576 2070017 2112887
60143 2112887 2151694 2184947 2211321 2230124 2241456 2245680 2242911 2233285 2217568 2197160 2173583 2148394
60131 2148394 2123653 2101877 2085167 2074609 2070867 2075130 2089036 2113732 2149477 2196367 2255131 2326853
60119 2326853 2411981 2509900 2619666 2741047 2874597 3020533 3177585 3343144 3514536 3689889
60109 3689889 3867565 4044953 4218185 4383095 4536143 4674331 4794605 4893855 4969635 5020759
60099 5020759 5047069 5048682 5025415 4977015 4904142 4809344 4696872 4571150 4435352 4291706 4143092
60088 4143092 3993693 3847678 3707634 3574768 3450324 3336095 3233523 3143010 3064415 2997784
60078 2997784 2943293 2900893 2870459 2851943 2844899 2848002 2859434 2877704 2901736 2930299 2961748 2994289
60066 2994289 3026085 3055149 3079722 3098935 3112687 3120686 3121919 3115238 3100029 3076012 3042903 3000802
60054 3000802 2950731 2894244 2832504 2766204 2696417 2625021 2554008 2484619 2417473 2353406 2293931
60043 2293931 2240755 2194968 2156850 2126482 2104410 2091555 2088554 2095446 2112017 2138105 2173402 2217359
60031 2217359 2269649 2330453 2399751 2476329 2557812 2641570 2725184 2806155 2881801 2949599 3007205
60020 3007205 3052038 3081567 3094408 3090786 3071564 3037287 2988545 2926771 2854033 2772315 2683655
60009 2683655 2590803 2496996 2405028 2317025 2234953 2160584 2094779 2037561 1989184 1950637 1922772
59998 1922772 1905527 1898408 1901379 1914850 1939205 1974771 2021929 2080757 2150699 2230943 2320899 2419823
59986 2419823 2526130 2637422 2750946 2863588 2971606 3071033 3158489 3231449 3288059 3327331
59976 3327331 3349403 3354906 3343921 3316092 3271821 3212760 3140980 3058356 2967235 2871169 2774347
59965 2774347 2680381 2591860 2510733 2438642 2376982 2327019 2289833 2265855 2254560 2254948 2266368 2288664
59953 2288664 2321641 2364620 2416457 2475731 2540921 2610599 2683392 2757590 2830882 2900820 2965639
59942 2965639 3024562 3077336 3123564 3162442 3193063 3215006 3228763 3235603 3237088 3234864 3230840 3227158
59930 3227158 3225803 3228486 3237120 3254042 3281428 3320709 3372841 3438836 3519436 3614391 3722525 3842480
59918 3842480 3972985 4112385 4258349 4408005 4557877 4703631 4840430 4963775 5069710
59909 5069710 5154268 5213468 5244433 5246318 5219917 5166777 5089102 4990216 4874469 4746471 4610486
59898 4610486 4470415 4330043 4193179 4063451 3943655 3835203 3738505 3654153 3583422 3527343
59888 3527343 3485677 3457411 3442148 3440414 3452540 3477823 3514979 3562946 3620801 3687133 3759878
59877 3759878 3836650 3914873 3991622 4063688 4128049 4182206 4223990 4251140 4261248 4252301 4223442
59866 4223442 4175412 4110375 4031312 3941379 3843477 3740066 3633172 3524534 3415757 3308289
59856 3308289 3203204 3101053 3002014 2906276 2814340 2727063 2645527 2570853 2503851 2444559 2392094
59845 2392094 2345187 2303040 2265581 2232911 2204709 2180338 2159349 2141572 2126841 2114854 2105250
59834 2105250 2097484 2090649 2083753 2076306 2068388 2060030 2050818 2040213 2027984 2014206 1999160 1983545 1968532
59821 1968532 1955190 1943888 1934419 1926587 1920399 1915926 1913381 1913310 1916241 1922021 1929871 1939227 1950194 1962947
59807 1962947 1976961 1991153 2004592 2016672 2026677 2033630 2036859 2036523 2033375 2028170 2021504 2014197 2007501
59794 2007501 2002799 2001199 2003523 2010601 2023443 2043199 2070993 2107731 2154057 2210728 2279180 2361478
59782 2361478 2459436 2573868 2704859 2852348 3015823 3193427 3381818 3576611 3771801 3958060
59772 3958060 4122274 4249924 4328780 4351391 4315966 4226695 4093387 3929495 3749093 3564590
59762 3564590 3385911 3220225 3071772 2942300 2832172 2741158 2668523 2612944 2572596 2545161
59752 2545161 2527963 2518782 2516830 2522522 2536141 2557131 2584802 2619092 2660249 2708349 2763668 2827126
59740 2827126 2899615 2981050 3070762 3168887 3276852 3396417 3528679 3674145 3833329 4006990
59730 4006990 4196018 4401381 4624090 4864911 5123962 5400458 5692710 5998306 6314253
59721 6314253 6636862 6961433 7282223 7592991 7887764 8161410 8410138 8632028 8827176
59712 8827176 8997228 9144929 9274294 9390644 9499547 9605214 9709944 9814818 9920213
59703 9920213 10025467 10128756 10227933 10321387 10407741 10485129 10551392 10605109 10646150 10675374 10694280
59692 10694280 10704984 10710125 10712499 10715005 10720985 10734264 10758630 10797437 10853814 10930910 11031549 11157727
59680 11157727 11310677 11491159 11699221 11933632 12191873 12470704 12766293 13073532 13385484
59671 13385484 13693744 13989232 14262533 14503875 14703316 14851327 14939500 14961321 14913098 14794574
59661 14794574 14608821 14361744 14061794 13719747 13347958 12959105 12565008 12175778 11799076
59652 11799076 11439594 11098988 10775829 10464954 10156950 9839455 9500572 9132505 8733462
59643 8733462 8307655 7864181 7415046 6972516 6546850 6145378 5772612 5430518 5118923
59634 5118923 4836423 4581347 4351964 4146124 3961310 3795176 3645779 3511253 3389676
59625 3389676 3279478 3179785 3090231 3010428 2939602 2876557 2820019 2769177 2723811 2683642 2647660
59614 2647660 2614459 2583216 2553942 2526670 2500776 2475200 2448899 2420925 2390608 2358120 2324544
59603 2324544 2290861 2256961 2222085 2186145 2150158 2115349 2082227 2050700 2020834 1993166 1968334
59592 1968334 1946493 1927161 1909645 1893663 1879528 1867741 1858530 1851825 1847460 1845287 1845232 1847464 1852343
59579 1852343 1859954 1869826 1881394 1894695 1910262 1928338 1948484 1970095 1993037 2017637 2044235 2072959
59567 2072959 2103872 2137180 2173234 2212326 2254555 2300053 2349388 2403444 2462673 2526618 2594475
59556 2594475 2665998 2741528 2821380 2905700 2994786 3088787 3186868 3287307 3388649 3489904 3588931
59545 3588931 3681323 3762119 3828796 3882003 3923483 3954193 3974565 3985448 3987803 3981808 3967049 3943515
59533 3943515 3911878 3872806 3826665 3774109 3716571 3655779 3592996 3529043 3465039 3402851 3344737
59522 3344737 3292670 3248112 3212361 3186941 3173428 3172892 3185668 3211888 3252199 3307703 3379038 3465697
59510 3465697 3566416 3680044 3805591 3941373 4084458 4231142 4377598 4519567 4651645
59501 4651645 4767603 4861857 4930586 4971551 4983417 4965696 4919127 4845638 4747975 4629667 4495228
59490 4495228 4349874 4198789 4046757 3898395 3758192 3629838 3515481 3415805 3330857 3260791
59480 3260791 3205937 3166314 3141232 3129398 3129338 3139619 3158711 3185011 3217162 3254014 3293864 3334046
59468 3334046 3371792 3405394 3433910 3455710 3468085 3468639 3456507 3431835 3394682 3345054 3283643 3211799
59456 3211799 3130846 3041992 2946851 2847514 2746050 2644260 2543782 2445840 2350857 2258793 2170003
59445 2170003 2085367 2005553 1930688 1860878 1796469 1737435 1682990 1632224 1584913 1541379 1501892
59434 1501892 1466615 1435879 1409975 1388674 1371346 1357597 1347525 1341336 1338984 1340234 1344821 1352448
59422 1352448 1362683 1374758 1387171 1397515 1403189 1402813 1397219 1389033 1381171 1375439 1372223 1371238 1372500
59409 1372500 1376532 1383566 1392530 1400920 1405930 1406021 1401696 1394993 1388339 1383706 1382359 1384884 1391341 1401706
59395 1401706 1416284 1435482 1459065 1486059 1515767 1548583 1585412 1626550 1671709 1720974 1774984
59384 1774984 1834054 1897853 1966261 2039927 2119574 2205233 2296711 2394438 2499370 2612418 2734554
59373 2734554 2867279 3012377 3171283 3345237 3535891 3745077 3973742 4221534 4487471
59364 4487471 4770446 5068845 5379998 5700181 6024740 6348072 6664046 6967111 7253112
59355 7253112 7518863 7761128 7976395 8161785 8315997 8439199 8531864 8593665 8623370 8619656
59345 8619656 8581780 8509378 8401956 8259031 8080871 7869004 7626083 7355632 7062038 6750603
59335 6750603 6427381 6098838 5771369 5450735 5141614 4847473 4570634 4312334 4072882
59326 4072882 3852036 3649281 3463767 3294350 3140035 3000268 2874511 2761705 2660452
59317 2660452 2569533 2487866 2414203 2347443 2287204 2233520 2185962 2143639 2106088 2073528 2046015
59306 2046015 2022928 2003512 1987394 1974260 1963675 1955559 1950357 1948248 1948682 1951220 1956290 1964388 1974911
59293 1974911 1986610 1999113 2013229 2029716 2048466 2069063 2091499 2115944 2142215 2169840 2198468
59282 2198468 2227960 2258164 2288745 2319094 2348289 2375212 2398805 2418254 2433000 2442615 2446590 2444233
59270 2444233 2434938 2418644 2395812 2366854 2331917 2291466 2246713 2199022 2149091 2097105 2043451
59259 2043451 1988793 1933636 1878435 1824090 1771710 1721786 1674181 1629027 1587031 1548643 1513462
59248 1513462 1480842 1450701 1423439 1399438 1378991 1362310 1349230 1339119 1331455 1326238 1323607 1323436
59236 1323436 1325729 1331040 1339912 1352090 1366872 1384083 1404134 1427202 1453050 1481821 1514395 1551707
59224 1551707 1594261 1642645 1698031 1761592 1833726 1914338 2003830 2103331 2213973 2336382 2470946
59213 2470946 2618194 2778537 2951653 3136180 3329920 3530287 3734477 3939075 4139386
59204 4139386 4329385 4502648 4653461 4776968 4868705 4924732 4942586 4921831 4863591 4770020
59194 4770020 4644612 4492645 4320641 4135198 3942313 3747289 3554564 3367424 3188252
59185 3188252 3019074 2861594 2716780 2584797 2465368 2357818 2260873 2173090 2093695 2022590
59175 2022590 1959361 1902898 1852226 1807074 1767149 1731443 1698897 1669351 1643009 1619195 1596463
59164 1596463 1573977 1552043 1531120 1510925 1490855 1470798 1451190 1432514 1414950 1398320 1382239
59153 1382239 1366565 1351818 1338891 1328264 1319707 1312802 1307436 1303646 1301307 1300163 1299974 1300548 1301900
59140 1301900 1304429 1308587 1314160 1320121 1325421 1329743 1333380 1336598 1339330 1341286 1342213 1342211 1341783 1341347 1340697 1339381
59124 1339381 1337720 1336885 1337694 1339776 1342324 1345199 1348809 1353235 1358103 1363147 1368323 1373438 1378191 1382591
59110 1382591 1386857 1390908 1394407 1397345 1400085 1402744 1405016 1406837 1408886 1412145 1417172 1423910 1431964 1440980
59096 1440980 1451047 1462894 1477456 1495103 1515522 1538414 1563827 1591549 1620586 1649797 1678934
59085 1678934 1708558 1738847 1768836 1796929 1821882 1843137 1860441 1873375 1881266 1883376 1879180 1868532
59073 1868532 1851616 1828759 1800361 1767001 1729519 1688884 1646009 1601761 1557085 1512916 1469808
59062 1469808 1427775 1386662 1346668 1308362 1272200 1238258 1206475 1176888 1149463 1123923 1100071
59051 1100071 1078155 1058575 1041199 1025331 1010464 996775 984732 974464 965786 958586 952834 948253
59039 948253 944337 940731 937191 933079 927321 919334 909824 900170 890975 881669 871743 861921 853655 847587
59025 847587 842973 838571 833686 828337 822921 817989 814017 811013 808419 805679 802779 800125 798074 796834
59011 796834 796654 797692 799767 802494 805742 809707 814574 820360 827099 834886 843630 853031 862969 873698
58997 873698 885511 898390 912151 926858 942894 960608 979927 1000218 1020491 1039874 1058043
58986 1058043 1075159 1091304 1106058 1118769 1129226 1137919 1145594 1152541 1158309 1162140 1163687 1163382 1162129
58973 1162129 1160655 1159212 1157810 1156596 1155848 1155607 1155530 1155327 1155420 1156918 1160691 1166561 1173582 1181030 1188712 1196353
58957 1196353 1203364 1209557 1215618 1222276 1229320 1236017 1242338 1249044 1256572 1264619 1273031 1282332 1292944 1304431
58943 1304431 1316155 1328269 1341488 1356122 1371980 1389106 1407952 1428751 1451260 1475313 1501223
58932 1501223 1529462 1560282 1593838 1630383 1670036 1712508 1757260 1803812 1851743 1900469 1949280
58921 1949280 1997725 2045960 2094710 2144861 2197122 2252116 2310737 2374130 2443210 2518381 2599883
58910 2599883 2688104 2783195 2884678 2992042 3105660 3226488 3354758 3489665 3630730 3778824
58900 3778824 3935254 4100182 4272529 4451086 4634947 4822869 5012967 5203230 5391750
58891 5391750 5576232 5753844 5921973 6078808 6222860 6352305 6465320 6560815 6638271 6696831
58881 6696831 6735024 6751457 6745468 6717023 6666408 6594332 6502260 6392405 6267277 6129019 5979007
58870 5979007 5818267 5648577 5473111 5295522 5118227 4941917 4766876 4594291 4425901
58861 4425901 4262790 4105166 3953213 3807472 3668285 3535465 3408852 3288798 3175671
58852 3175671 3069243 2969081 2875415 2789084 2710491 2638980 2573460 2513411 2459052 2410706 2368222
58841 2368222 2330965 2298193 2269457 2244781 2224445 2208530 2196669 2188286 2182986 2180679 2181434 2185434
58829 2185434 2192925 2203989 2218278 2235181 2254368 2276072 2300771 2328709 2359835 2394173 2432103
58818 2432103 2474192 2520652 2570986 2624355 2680522 2740350 2805168 2875789 2952481 3035804 3126842
58807 3126842 3226349 3334182 3450016 3574269 3707727 3850461 4001707 4160752 4327363 4501207
58797 4501207 4681315 4866261 5054391 5243677 5431726 5616117 5794426 5963780 6120877
58788 6120877 6262727 6386962 6491132 6572176 6627173 6654521 6654055 6626270 6571838 6491724 6387256
58777 6387256 6260149 6112827 5948633 5771181 5583407 5387506 5185795 4981235 4777009
58768 4777009 4575875 4379946 4190707 4008975 3835004 3668771 3510200 3359272 3216169
58759 3216169 3081306 2954988 2837123 2727449 2625974 2532780 2447393 2368768 2296056 2229206
58749 2229206 2168694 2114831 2067312 2025181 1987196 1952404 1920408 1890894 1863104 1836153 1809718
58738 1809718 1783962 1758735 1733434 1707762 1682174 1657349 1633631 1611103 1589688 1568932 1548207
58727 1548207 1527415 1506919 1486299 1463776 1437646 1408102 1376998 1345909 1314980 1283580 1251372
58716 1251372 1218514 1185411 1152610 1120711 1090049 1060535 1031940 1004268 977889 953434 931560
58705 931560 912618 896491 882875 871682 863087 857161 853586 851624 850207 848175 844647 839216 831635
58692 831635 821468 808298 792395 774919 757296 740391 724364 709290 695715 684424 675630 668742
58680 668742 663168 659062 656856 656233 656266 656647 658019 660797 664326 667710 670900 674310 677854 681160 684359
58665 684359 687778 690917 692629 692399 690757 688347 685409 682344 679965 678687 678062 677583 677510 678450 680401 682548
58649 682548 683710 682723 678805 672089 663595 654419 645098 636027 628068 622191 618600 616627 615545 615191 615844
58634 615844 617723 620635 624015 627393 630943 635364 641113 647937 655390 663553 672924 683697 695486 707723
58620 707723 720195 733231 747619 764213 783402 804906 828207 853086 879651 908062 938416
58609 938416 970826 1005364 1042017 1080877 1122245 1166348 1213033 1261976 1313097 1366493 1421937
58598 1421937 1478587 1535218 1590651 1644083 1695184 1743758 1789138 1829970 1864706 1892198 1911626
58587 1911626 1922128 1922947 1914031 1896270 1871058 1839700 1803168 1762182 1717579 1670755 1623691 1578259
58575 1578259 1535405 1495133 1457284 1422149 1390263 1361799 1336293 1313023 1291616 1272201 1254857
58564 1254857 1239008 1223663 1208312 1193199 1178481 1163444 1146901 1128165 1107264 1084476 1060168
58553 1060168 1035089 1010293 986538 964004 942588 922215 902833 884472 867523 852768 841002
58542 841002 832612 827395 824532 822812 821166 819051 816101 811556 804399 794070 780731 764849 746885
58529 746885 727467 707448 687643 668772 651660 636999 624637 613535 602779 592448 583237 575484
58517 575484 568878 562971 557596 552815 548695 545253 542571 540921 540687 541983 544430 547521 551097 555199
58503 555199 559546 563683 567678 572090 577073 582133 587126 592865 600090 608266 616111 623121 629888 637043
58489 637043 644549 652109 659542 666515 672402 676711 679408 680659 680622 679572 677790 675040 670538 663812 655386
58474 655386 646310 637221 628147 619041 610052 601255 592545 583936 575749 568319 561657 555523 549658 543789
58460 543789 537508 530472 522836 515300 508541 502631 497163 491889 487075 483201 480559 479235 479259 480519 482556
58445 482556 484707 486533 488005 489249 490226 490786 490993 491280 492223 494172 497111 500826 505063 509544 514031
58430 514031 518504 523191 528276 533675 539306 545394 552163 559261 565917 571821 577431 583188 588756 593393
58416 593393 596869 599626 602110 604288 605860 606732 607141 607386 607460 607038 606035 605123 605363 607128 609658 611921
58400 611921 613624 615188 616960 618864 620615 621957 622808 623469 624498 626143 628127 630302 633131 637031 641605
58385 641605 646220 651096 657021 664064 671413 678600 685953 693508 700353 705678 709894 714096 718822 723853
58371 723853 728906 733899 738774 743601 748717 754356 760257 766022 771719 777722 784127 790722 797394 804112
58357 804112 810639 816776 822847 829477 836801 844359 851866 859631 867977 876615 884935 892748 900446 908484
58343 908484 916953 925664 934535 943754 953558 963883 974336 984529 994395 1004182 1014211 1024671 1035517
58330 1035517 1046508 1057456 1068520 1080107 1092478 1105581 1119277 1133459 1147895 1162229 1176397
58319 1176397 1190875 1206259 1222732 1240051 1257874 1275889 1293847 1311742 1329824 1348208 1366613
58308 1366613 1384643 1402170 1419242 1435947 1452650 1470122 1488944 1508902 1529324 1549881 1570732
58297 1570732 1592038 1613881 1636623 1660837 1686732 1713973 1742115 1770913 1800216 1830054 1860983
58286 1860983 1893845 1928945 1965725 2003519 2042359 2082833 2125415 2170299 2217773 2268322 2322210
58275 2322210 2379039 2437828 2497571 2557648 2617701 2677175 2735238 2791236 2845093 2897135 2947753
58264 2947753 2997467 3047167 3098017 3151120 3207369 3267422 3331604 3399943 3472534 3549730 3631787
58253 3631787 3718515 3809561 3904920 4004985 4110293 4221474 4339134 4463452 4594146 4731176
58243 4731176 4875214 5027070 5187050 5355404 5533015 5720959 5919744 6129716 6352022
58234 6352022 6588395 6840119 7107981 7393062 7696646 8019463 8362173 8726857 9117141
58225 9117141 9536542 9987458 10472012 10993112 11554459 12160382 12816160 13528043 14302897
58216 14302897 15148572 16074704 17092442 18213665 19451728 20823426 22349551 24054027
58208 24054027 25964353 28113615 30541485 33294331 36427374 40007723 44113515 48830547
58200 48830547 54255105 60505382 67730602 76106914 85822659 97062075 109989000 124726294
58192 124726294 141331137 159769805 179890608 201389433 223762658 246243060 267728013
58185 267728013 286752794 301602825 310620798 312631881 307289678 295165824 277560308
58178 277560308 256158286 232690052 208685156 185339010 163475496 143577723 125854467
58171 125854467 110314963 96837936 85229933 75269254 66733724 59415585 53129029
58164 53129029 47713096 43030871 38966852 35424417 32323410 29597376 27191090 25058829
58156 25058829 23162576 21469907 19952681 18587057 17353575 16236291 15221736 14298416
58148 14298416 13456319 12686190 11979451 11328903 10728937 10174680 9661362 9184773 8741683
58139 8741683 8329270 7944514 7584672 7247990 6933279 6638901 6362669 6102661 5857635
58130 5857635 5626629 5408580 5202533 5007838 4823853 4649557 4483771 4325841 4175838
58121 4175838 4033811 3898998 3770219 3647085 3530200 3419799 3314706 3213324 3115353 3021791
58111 3021791 2933318 2849469 2769447 2692881 2619432 2548393 2479251 2412260 2347960 2286431 2227466
58100 2227466 2171174 2118040 2068588 2023300 1982576 1946288 1913540 1883201 1854565 1827169 1800140
58089 1800140 1772163 1742112 1709593 1675057 1639576 1604225 1569238 1533909 1497682 1461211 1425916
58078 1425916 1392607 1360991 1330494 1301012 1272716 1245585 1219395 1193931 1169068 1144962 1122251
58067 1122251 1101673 1083218 1065931 1048896 1032195 1016635 1002709 990186 978508 967130 955488
58056 955488 943137 930127 916953 903956 891029 878045 865260 853037 841403 830211 819546
58045 819546 809619 800373 791639 783652 776918 771399 766191 760333 753718 746973 740624 734651 728746 722759
58031 722759 716873 711467 706765 702511 698072 692926 686988 680473 673756 667446 662181 657971 653976 649396
58017 649396 644488 640300 637465 635627 634053 632366 630620 629088 628209 628432 629781 631675 633362 634523 635415
58002 635415 636549 638315 640815 644001 647916 652623 657844 662913 667431 671787 676634 681910 686826 690880
57988 690880 694526 698733 704258 711417 720087 729613 739045 747807 756037 764071 771808 778719 784288 788260
57974 788260 790606 791376 790366 786854 779927 769255 755355 738986 720635 700755 680137 659694 640063
57961 640063 621591 604453 588564 573731 560194 548693 539649 532621 526984 522797 520409 519494 519212
57948 519212 519233 519899 521246 522561 523126 522854 521875 520008 517016 513084 508674 504136 499753 495929 492970 490765
57932 490765 488962 487335 485821 484415 483300 482902 483507 484952 487062 490196 494814 500390 505277 507970 508209
57917 508209 506592 503416 498375 491197 482084 471458 459728 447490 435582 424644 414779 405912 398251
57904 398251 392098 387288 383196 379395 376040 373538 371978 370941 369803 368191 366248 364333 362391 359766
57890 359766 355909 351111 346223 341758 337628 333721 330222 327297 324942 323315 322802 323483 324899 326592 328478
57875 328478 330465 332227 333785 335840 338949 342682 346168 349250 352383 355566 358108 359525 359944 359468 357847
57860 357847 355117 351969 348947 345699 341560 336669 331982 328127 324718 321002 316921 313254 310765 309501
57846 309501 309084 309465 310952 313437 316137 318510 321068 324738 329565 334625 339150 343084 346469 349054 350841
57831 350841 352313 353527 353400 350508 344444 335929 325842 314719 303069 291546 280675 270821 262425
57818 262425 255829 250706 246200 241871 238242 236164 235915 237124 239307 242160 245546 249590 254761 261575
57804 261575 270174 280274 291459 303339 315541 327821 340178 352676 365107 377019 387993 397624
57792 397624 405194 409712 410552 407899 402472 395017 386170 376496 366305 355490 343826 331397 318562
57779 318562 305664 293022 281050 270048 259930 250473 241790 234209 227749 222161 217526 214287 212482
57766 212482 211401 210298 209102 208125 207405 206737 206096 205588 205148 204690 204494 205056 206504 208441 210395 212246
57750 212246 214265 216877 220317 224323 228223 231482 234121 236528 239063 241971 245373 249088 252674 255933
57736 255933 259136 262562 266088 269519 272910 276148 278696 280390 282151 285030 288677 291648 293345 294816
57722 294816 297367 301114 305268 309187 312666 315732 318725 322296 326862 332203 337890 343845 350192 356865
57708 356865 363725 370876 378530 386693 395224 404076 413297 422985 433447 445178 458478 473252 489381
57695 489381 507042 526492 547726 570612 595234 621956 651291 683814 719950 759696 802756
57684 802756 849106 899326 954420 1015620 1084303 1161588 1247817 1342836 1446911 1560932 1685533
57673 1685533 1820394 1964540 2116767 2275523 2438676 2602859 2761163 2900286 3001231
57664 3001231 3045610 3023621 2937702 2800204 2628266 2439120 2247054 2062289 1891499 1738546
57654 1738546 1604436 1487613 1385651 1296927 1220319 1153971 1095581 1043890 998843 960200 926938
57643 926938 898173 873706 853319 836410 822711 812607 806216 802769 801387 801993 805058 810888 819512
57630 819512 830783 844229 859301 876157 895700 918486 944052 971794 1002037 1035637 1072853
57619 1072853 1113086 1155504 1199516 1244806 1291296 1338892 1386920 1433916 1478161 1518182 1552580
57608 1552580 1579896 1599117 1610032 1612709 1606876 1592198 1568899 1537677 1499252 1454450 1404559 1351221
57596 1351221 1295960 1240032 1184401 1129550 1075572 1022831 972312 924911 880634 838928 799589
57585 799589 762903 729084 698033 669523 643174 618421 594991 573313 553989 536961 521622
57574 521622 507611 494919 483323 472314 461706 451816 442952 435111 428218 422213 416869 411981 407782
57561 407782 404729 402807 401435 400143 398846 397429 395653 393764 392671 393117 394974 397612 400660 404163
57547 404163 408322 413452 419935 427854 436770 446129 455767 465840 476482 487870 500482 514929 531440
57534 531440 549722 569452 590797 614350 640564 669305 700070 732586 767023 803508 841714
57523 841714 881182 921809 963557 1005757 1047137 1086615 1123682 1157917 1188538 1214594 1235261
57512 1235261 1249758 1257326 1257542 1250506 1236572 1216109 1189642 1157989 1122144 1083262 1042713 1001721
57500 1001721 960803 919955 879522 840447 803495 768773 736367 706868 680775 657834 637538
57489 637538 619859 604867 591953 580220 569579 560732 554066 549274 546131 544929 545863 548557 552583
57476 552583 558047 565278 574249 584691 596627 610506 626819 645738 667031 690281 715306 742459
57464 742459 772318 805032 840079 876713 914393 952668 990848 1027943 1062832 1094425 1121747
57453 1121747 1143927 1160041 1169106 1170526 1164545 1151981 1133407 1108869 1078447 1042754 1002767 959506
57441 959506 914125 867984 822275 777633 734317 692639 652993 615671 580800 548379 518245
57430 518245 490184 464205 440499 418928 398832 379626 361331 344237 328330 313445 299740
57419 299740 287469 276372 265851 255775 246616 238647 231509 224714 218116 211652 205130 198698 193127
57406 193127 189074 186210 183562 180614 177603 174763 171809 168365 164494 160538 156673 152976 149783 147606
57392 147606 146603 146261 145757 144590 142899 141201 139895 138941 137966 136585 134574 131859 128552 125073 122020
57377 122020 119678 117674 115372 112639 110023 108039 106502 104795 102737 100926 100193 100867 102625 104867 107128
57362 107128 109240 111213 113008 114534 116029 118292 122099 127250 132544 136985 140753 144651 148900 152990
57348 152990 156571 159827 162868 165411 167369 169223 171311 173117 173848 173548 173092 173085 173338 173432 173302 173056 172707
57331 172707 172372 172425 173087 174123 175209 176394 177852 179426 180838 182254 184124 186466 188756 190679 192579
57316 192579 194964 197968 201527 205729 210546 215560 220411 225400 231147 237668 244328 250759 257290 264278
57302 264278 271529 278817 286555 295401 305352 315707 325826 335448 344292 351864 357886 362511 365910 367965
57288 367965 368580 367985 366410 363635 359243 353238 346023 337795 328290 317303 305272 293119 281566 270707
57274 270707 260256 250068 240276 230976 222034 213403 205496 198913 193774 189568 185776 182344 179415 176952
57260 176952 174860 173196 171836 170178 167653 164588 162094 160933 160808 160863 160596 160094 159654 159406 159231 158842
57244 158842 158061 157081 156360 156170 156365 156721 157298 158294 159689 161209 162630 163909 165035 165925 166505 166846 167094
57227 167094 167288 167325 167176 167146 167740 169106 170695 171655 171587 170888 170446 171131 173306 176480 179524 181648 183168
57210 183168 184947 187168 189270 191189 193889 198089 203010 207180 210253 213355 217640 223139 229154 235172
57196 235172 241101 247054 253289 260164 267822 275988 284184 292088 299628 306861 313861 320639 327097 333101
57182 333101 338585 343486 347587 350590 352304 352604 351213 347811 342414 335544 327921 320024 311952 303628
57168 303628 295221 287427 281140 276650 273332 270571 268902 269846 274495 282633 293290 305788 320041 336254
57154 336254 354671 375403 398168 422266 447007 472097 497503 523067 548456 573422 598007
57143 598007 622484 647142 672045 697119 722567 749000 776817 805650 834912 864772 895890
57132 895890 928095 960152 991246 1022073 1053883 1087045 1121219 1156487 1193422 1232281 1272978
57121 1272978 1315851 1361721 1411119 1464133 1521123 1582933 1650211 1723107 1801879 1887245 1979839
57110 1979839 2079884 2187878 2305360 2434702 2578447 2739178 2919868 3124239 3357060
57101 3357060 3624219 3932098 4286588 4692972 5156874 5684627 6281903 6951799 7694248
57092 7694248 8506632 9384044 10318744 11299907 12314433 13348291 14387616 15419244 16430730
57083 16430730 17409867 18343652 19216611 20008674 20693858 21241567 21620965 21806590 21782665
57074 21782665 21544946 21100331 20464827 19660728 18714444 17655720 16517209 15332859 14135201
57065 14135201 12953073 11810544 10726533 9714554 8782818 7934843 7170310 6485955 5876618
57056 5876618 5336195 4858145 4435701 4062322 3732246 3440500 3182384 2953282 2749043
57047 2749043 2566257 2402017 2253701 2119182 1996934 1885580 1783463 1688891 1600735 1518522
57037 1518522 1441960 1370595 1303923 1241621 1183542 1129562 1079422 1032631 988548 946672 906980
57026 906980 869892 835787 804481 775179 746942 719287 692355 666603 642334 619513 597947
57015 597947 577549 558391 540482 523593 507385 491775 477064 463580 451213 439436 427719
57004 427719 415771 403429 390658 377767 365338 353625 342160 330144 317157 303347 289149
56993 289149 275091 261691 249203 237511 226562 216789 208742 202355 197022 192420 188818 186436 184917
56980 184917 183686 182503 181334 179950 178023 175518 172749 170163 168288 167714 168779 171240 174486 178083
56966 178083 181951 186089 190425 195002 200119 206127 213108 220775 228643 236308 243561 250197 255648 258943
56952 258943 259227 256447 251455 245416 239103 232716 226273 220025 214386 209525 205297 201733 199418 199089 200927
56937 200927 204513 209508 216019 224214 233891 244583 255760 266634 275981 282557 285793 285902 283342 278272
56923 278272 270548 260129 247535 233867 220309 207547 195762 185059 175635 167554 160729 155193
56911 155193 151002 147739 144585 141182 137996 135482 133297 130916 128640 127418 127800 129641 132639 136478
56897 136478 140409 143426 145164 146261 147697 150122 153845 158942 165106 171720 178330 184813 191062 196866
56883 196866 202070 206382 208980 208974 206537 203040 199659 196309 192420 188261 184878 183002 182702 184019 187252
56868 187252 192444 199174 207195 216979 229206 243746 259423 274957 290007 304979 319761 332974
56856 332974 342840 348556 350342 348366 342467 333170 322181 311322 301382 292482 285102 280041 277691 278071
56842 278071 281456 288334 298753 312307 328783 348276 370554 394829 420202 445723 469793 489976
56830 489976 503800 509650 507016 496421 479357 457846 433726 408520 383904 361647 342746 327051
56818 327051 314165 304325 298038 295283 295715 299512 307315 319279 334548 351789 369861 387884 404998
56805 404998 420212 432298 439759 441231 436202 425318 409929 391475 371375 351162 332312 315780
56793 315780 301829 290394 281561 275625 272752 272727 275082 279425 285558 293278 302166 311629 321088 330049
56779 330049 337989 344180 347667 347488 343103 334669 322925 308796 293152 276903 261039 246321 232982
56766 232982 220907 210108 200801 192915 185809 178845 172228 166922 163547 161551 159729 157462 155157 153487
56752 153487 152545 151840 150866 149412 147501 145297 143140 141461 140533 140226 139994 139204 137683 135952 134709 134105
56736 134105 133770 133506 133492 133690 133571 132858 132123 132120 132790 133497 134032 134749 135713 136427 136526 136192 135661 134849 133764 132805
56716 132805 132293 132056 131811 131678 131939 132488 132901 132931 132713 132593 132900 133705 134667 135340 135805 136702 138424 140545
56698 140545 142312 143458 144245 144956 145675 146420 147160 147811 148366 148880 149146 148797 148005 147639 148255 149285 149885 150255
56680 150255 151327 153233 154938 155597 155561 155692 156317 157227 158255 159280 160044 160444 160873 161772 162945 163712 163760
56663 163760 163482 163428 163735 164202 164579 164557 163698 161809 159429 157573 156756 156482 155969 155169 154658 154549 154113 152769
56645 152769 150873 149151 147679 146041 144242 142876 142394 142736 143650 144854 145771 145738 144735 143512 142721 142295
56629 142295 141930 141753 142120 142964 143736 143918 143400 142453 141541 141054 141067 141431 142102 143178 144541 145780 146562 146791
56611 146791 146325 144967 143058 141608 141342 141835 142055 141653 141202 141248 141670 142123 142707 143862 145749 147957 149797
56594 149797 150842 151194 151201 150945 150200 148967 147839 147623 148696 150869 153694 156630 159079 160706 161761 162831
56578 162831 164186 165547 166465 166772 166656 166518 166771 167596 168887 170594 172997 176417 180731 185459 190289 195181
56562 195181 200014 204545 208814 213201 217902 222675 227268 231730 236051 239824 242677 244867 247064 249563
56548 249563 251973 253595 253874 252599 250016 246752 243349 239808 235862 231586 227378 223243 218606 213137
56534 213137 207456 202581 198797 195454 191864 188048 184523 181689 179540 177765 175938 173777 171381 169130
56520 169130 167300 165934 165126 165066 165593 165985 165602 164622 163749 163331 163162 163104 163342 163889 164389 164669 165076 165841 166479
56501 166479 166294 165306 164216 163535 163134 162642 161902 160986 160085 159489 159421 159843 160510 161178 161573 161308 160249 158970
56483 158970 158488 159326 161087 162955 164319 164872 164617 164154 164597 166704 170094 173647 176591 178972 181120 183103
56467 183103 184877 186684 188988 191995 195365 198497 201013 202952 204477 205550 206027 206025 205953 206074 206173 205834 204895
56450 204895 203467 201617 199354 196973 195090 194098 193721 193299 192477 191390 190253 189068 187872 186984 186683 186700
56434 186700 186342 185215 183628 182170 181068 180099 179004 177797 176744 176185 176349 177157 178163 178834 178918 178538
56418 178538 177928 177180 176248 175168 174276 174141 175112 176834 178381 179080 179146 179355 180184 181427 182612 183540 184451
56401 184451 185824 188031 191019 194315 197419 200166 202622 204803 206729 208558 210358 211849 212745 213302 214055
56386 214055 214957 215261 214473 212999 211605 210612 209905 209367 208905 208302 207476 206752 206507 206657 206852 207059 207566 208455
56368 208455 209486 210549 211861 213615 215758 218180 220821 223443 225551 226793 227317 227687 228526 230220 232678
56353 232678 235240 237050 237788 237968 238395 239416 240819 242271 243639 244888 245956 246809 247547 248334 249245 250154
56337 250154 250834 251234 251692 252760 254716 257365 260344 263514 266839 270035 272728 275052 277761 281466 285886
56322 285886 290136 293696 296816 300017 303502 307171 310854 314357 317546 320680 324451 329246 334444 338863
56308 338863 342050 344792 348177 352401 356775 360727 364389 368180 372096 375668 378551 380945 383332 385914
56294 385914 388497 390927 393478 396683 400906 406172 412256 418796 425474 432426 440386 450108 461565 474021
56280 474021 486957 500666 515803 532614 550851 570362 591537 615086 641363 670022 700635
56269 700635 733802 771260 814475 863425 917383 976712 1043006 1117437 1199951 1290529 1390144
56258 1390144 1499606 1618093 1743792 1875542 2012755 2153916 2296247 2436906 2573530
56249 2573530 2703369 2822907 2928837 3018827 3090983 3143348 3174566 3184608 3174304 3144667 3097235
56238 3097235 3034639 2959974 2875561 2782816 2683230 2578819 2471470 2362296 2251935 2141272
56228 2141272 2031657 1924496 1820698 1720445 1623475 1529697 1439500 1353548 1272486 1196986
56218 1196986 1127747 1064996 1008022 955620 907192 863173 824247 790336 760580 734165 710874
56207 710874 690773 673637 658876 645906 634288 623499 612963 602557 592834 584352 576855 569583
56195 569583 562380 555981 550994 547103 543634 540533 538237 536842 535974 535450 535468 536040 536808 537672 539175 541904
56179 541904 545808 550447 555611 561238 566972 572450 578045 584710 592794 601490 609929 618426 628128 639579
56165 639579 652258 665558 679552 694446 709853 725217 740823 757842 777310 799458 824189
56154 824189 851885 883556 920374 963291 1013138 1070889 1137712 1214633 1302104 1399819 1506627
56143 1506627 1620120 1735976 1848115 1950244 2037961 2109868 2167362 2213758 2253159 2288928
56133 2288928 2322194 2351415 2373375 2384801 2383758 2370507 2347536 2318413 2285879 2250532 2210851
56122 2210851 2164030 2106856 2036641 1952403 1855739 1750662 1642518 1536705 1437714 1348632 1271103
56111 1271103 1205612 1151783 1108587 1074662 1048733 1029814 1017001 1009222 1005285 1004167 1005277 1008423
56099 1008423 1013444 1019820 1026865 1034444 1043189 1053649 1065449 1077678 1089828 1101772 1113042 1123012
56087 1123012 1131866 1140494 1149066 1156558 1162241 1166875 1171672 1176698 1181188 1185077 1189238 1194334 1200307 1207050
56073 1207050 1214717 1223211 1232135 1241572 1252350 1265184 1280014 1296377 1313850 1331788 1349182 1365491
56061 1365491 1381409 1398195 1416259 1434913 1453537 1472473 1492423 1513351 1534550 1555728 1577497
56050 1577497 1600541 1624694 1649285 1674199 1700114 1727705 1757038 1787753 1819393 1851530 1884126
56039 1884126 1917945 1954049 1992607 2032785 2074146 2117602 2164407 2214666 2267385 2321553 2376464
56028 2376464 2431345 2485500 2538780 2591360 2643312 2695111 2748348 2805026 2866041 2930982 2999373
56017 2999373 3071325 3146932 3225904 3308133 3393929 3483477 3576658 3673690 3775274 3881776 3992889
56006 3992889 4108437 4228950 4355012 4486629 4623702 4766716 4916510 5073761 5239122
55997 5239122 5413484 5597709 5792464 5998715 6218014 6451765 6700502 6964468 7244822
55988 7244822 7543845 7864006 8207185 8574828 8968621 9390984 9845059 10334244 10861846
55979 10861846 11431390 12047296 12715056 13440881 14231586 15094998 16040333 17078379 18221879
55970 18221879 19485956 20888264 22449525 24195094 26156579 28372146 30886585 33753197
55962 33753197 37037109 40817830 45190818 50269414 56185972 63089338 71138960 80498328
55954 80498328 91326904 103766364 117920635 133833646 151465574 170664117 191128709
55947 191128709 212364966 233621441 253816537 271516009 285060223 292885608 293942837
55940 293942837 288009427 275738999 258448792 237779165 215372813 192652517 170708300
55933 170708300 150273760 131762768 115336510 100976837 88552408 77871851 68721728
55926 68721728 60890553 54182726 48425454 43469993 39189413 35476218 32240887 29409818
55918 29409818 26922072 24726600 22780901 21049927 19504339 18119067 16872918 15748397
55910 15748397 14730846 13807500 12967108 12199939 11497746 10853700 10262097 9717622 9214826
55901 9214826 8748720 8315744 7913513 7539456 7190320 6863228 6556655 6269861 6001725
55892 6001725 5750506 5514527 5292621 5083927 4887548 4702475 4527766 4362779 4207112
55883 4207112 4060130 3920599 3787084 3658692 3535213 3416565 3302519 3193087 3088705
55874 3088705 2989669 2895624 2805886 2720157 2638642 2561536 2488628 2419369 2353156 2289538 2228233
55863 2228233 2169037 2111760 2056329 2002956 1952028 1903825 1858370 1815529 1775157 1737170 1701599
55852 1701599 1668440 1637237 1606942 1576530 1545719 1514741 1483416 1451004 1417175 1382709 1348879
55841 1348879 1316486 1285812 1257144 1230755 1206480 1183824 1162542 1142663 1123934 1105789 1088092
55830 1088092 1071481 1056524 1042846 1029536 1016277 1003526 991539 979707 967120 953429 938809
55819 938809 923364 907033 890039 872969 856257 839899 823786 808010 792681 777768 763398
55808 763398 750089 738366 728282 719601 712293 706479 702044 698732 696636 696095 696954 698410 699832 701420
55794 701420 703645 706234 707969 707321 702987 694081 680466 663112 643761 623936 604475 586053 569765
55781 569765 556621 546508 538148 530269 522535 515144 507949 500556 493189 486781 481964 478332 475051 471808
55767 471808 468679 465313 460908 455109 448423 441522 434518 427119 419131 410453 400866 390314 379286 368548
55753 368548 358481 349018 340210 332431 325876 320198 314899 309784 304779 299540 293703 287505 281776 277178
55739 277178 273707 270933 268377 265493 261742 257163 252676 249297 247006 244799 241909 238525 235225 232170
55725 232170 229226 226470 224078 221954 219902 218039 216523 214923 212434 208876 205019 201661 198776 195855
55711 195855 192839 190299 188787 188336 188580 189114 189714 190327 190886 191113 190632 189458 188207 187554 187432 187025 185646
55694 185646 183487 181404 180147 179972 180822 182490 184473 185993 186594 186740 187505 189482 192269 195147 198014
55679 198014 201274 204932 208297 210676 211957 212295 211544 209328 205541 200498 194662 188501 182530 177186 172554
55664 172554 168487 165101 162983 162656 163865 165625 167089 168262 169756 171938 174604 177509 180870 185025
55650 185025 189722 194149 197670 200289 202382 204320 206375 208609 210646 211838 211932 211288 210254 208654 206247
55635 206247 203367 200588 197946 195052 191958 189290 187392 185871 184288 182821 181828 181012 179501 176698 172758
55620 172758 168252 163639 159085 154499 149657 144485 139332 134851 131452 128859 126261 122964 118873 114366
55606 114366 109785 105249 101010 97663 95648 94594 93510 91744 89418 86876 84099 81035 78154 76129
55592 76129 74995 74098 73017 72108 71880 72096 71890 70785 69280 68296 68157 68322 68123 67572 67242 67472 67987 68371
55574 68371 68590 68782 68802 68296 67145 65517 63639 61885 61009 61677 63571 65375 65965 65337 64192 63036 62025
55557 62025 61348 61191 61410 61650 61742 61709 61452 60865 60149 59612 59162 58436 57445 56670 56415 56444 56389 56129 55648 54950
55537 54950 54275 54014 54170 54319 54316 54544 55096 55281 54532 53419 53063 53727 54703 55527 56511 57971 59561 60745
55519 60745 61484 62169 63229 64965 67423 70176 72581 74445 76149 77931 79514 80739 82122 84289 87153
55504 87153 90163 93057 95748 97587 97597 95677 92982 90665 88607 85887 82229 78433 75315 72723 69862
55489 69862 66313 62337 58344 54527 51135 48676 47412 46814 45926 44346 42529 41062 39985 38994 38015
55474 38015 37179 36394 35284 33651 31779 30199 29268 28995 29168 29547 29951 30189 29987 29184 28029 27147 26985
55457 26985 27297 27325 26518 25065 23715 23087 23091 23080 22621 21993 21767 21988 22124 21806 21209 20557 19698 18518 17380
55438 17380 16719 16408 16023 15571 15478 15887 16445 16837 17124 17475 17921 18496 19258 20029 20425 20273 19691 18685 17029
55419 17029 14791 12659 11466 11514 12495 13796 14745 14859 14205 13388 12915 12763 12736 13042 14030 15448 16388 16163
55401 16163 14988 13700 12917 12649 12622 12765 13210 13874 14297 14137 13743 13888 14835 15953 16397 15936 14932 13777
55383 13777 12679 11824 11353 11201 11216 11454 12154 13341 14634 15496 15622 15133 14500 14232 14487 14981 15306 15254 14826
55364 14826 14167 13663 13835 14787 15890 16374 16134 15663 15286 14888 14397 14068 14086 14242 14241 14122 14143 14427 14863 15262
55344 15262 15456 15356 14998 14439 13601 12388 11001 9890 9297 9034 8850 8758 8870 9174 9652 10354 11131 11566
55326 11566 11532 11605 12482 14059 15478 16106 16072 15805 15485 15200 15232 15793 16565 16859 16303 15206 14196 13627 13382
55307 13382 13160 12840 12516 12246 11909 11422 11011 11063 11637 12271 12455 12216 12067 12339 12741 12717 12197 11788 12116 13086
55287 13086 14004 14402 14513 14794 15190 15175 14517 13644 13096 12849 12467 11801 11249 11264 11865 12770 13742 14582 14976 14693
55267 14693 13975 13392 13220 13164 12836 12253 11672 11157 10615 10083 9618 8968 7780 6218 5024 4741 5187 5858
55249 5858 6601 7565 8662 9458 9606 9211 8736 8652 9128 9911 10571 10957 11314 11894 12635 13361 14063 14741 15136
55230 15136 14973 14400 13889 13736 13922 14327 14737 14718 13923 12550 11159 10046 9220 8939 9628 11087 12400 12979
55212 12979 13213 13725 14433 14871 14980 14973 14682 13776 12503 11574 11247 11136 10994 11106 11705 12496 13000 12973 12276 10804
55192 10804 8903 7465 7189 7918 8995 9989 10729 10948 10441 9571 9123 9507 10392 11223 11777 12060 11923 11081
55174 11081 9552 7858 6724 6462 6702 6840 6805 7227 8602 10391 11349 10943 10145 10529 12610 15368 17389
55157 17389 18127 17939 17263 16213 14909 13718 12955 12583 12432 12474 12674 12785 12613 12323 12118 11753 10888 9870
55139 9870 9567 10166 10706 10251 9164 8686 9480 11018 12286 12608 11896 10666 9868 10177 11226 11980 12053 12206
55121 12206 13191 14558 15155 14629 13820 13613 13956 14306 14620 15374 16701 18022 18754 19053 19520 20321 21055 21522
55103 21522 22131 23245 24477 25111 25098 25091 25441 25691 25358 24807 24891 25883 27120 27708 27277 26084 24672 23547
55085 23547 22968 22876 23046 23330 23694 24062 24323 24575 25178 26353 27738 28570 28429 27718 27270 27448 27804 27680 26930
55066 26930 25849 24588 23144 21922 21722 22765 24096 24511 23888 23076 22579 22048 21181 20391 20125 20128 20019 20156
55048 20156 21096 22362 22677 21667 20569 20763 22185 23684 24554 24965 25154 24960 24345 23755 23698 24304 25498
55031 25498 27211 29107 30471 30781 30278 29634 29187 28838 28597 28780 29579 30762 31939 32898 33581 33979 34255
55014 34255 34772 35760 37063 38376 39618 40839 41859 42326 42202 41928 41944 42233 42441 42300 41712 40559 38760
54997 38760 36588 34651 33380 32671 32205 31989 32295 33184 34307 35214 35632 35435 34638 33591 32892 32840 33095 33054
54979 33054 32493 31659 30910 30571 30982 32328 34336 36419 38173 39503 40305 40478 40367 40744 41970 43506 44688
54962 44688 45775 47723 50936 54821 58666 62493 66770 71777 77737 85211 94693 105776 117342 128788
54948 128788 140626 153467 166716 178759 188278 194928 198735 199343 196145 188934 178248 165294 151594
54935 151594 138407 126173 114688 103956 94590 87109 81145 75831 70873 66712 63619 61186 58979
54922 58979 57263 56650 57182 58128 58716 58888 59332 60887 63942 68352 73881 80592 88648 97818 107462 117180
54906 117180 127229 138113 149824 161583 172225 180771 186732 189988 190384 187503 181029 171287 159155
54893 159155 145434 130691 115821 102232 90951 81804 73940 67018 61401 57247 54021 51146 48698
54880 48698 47119 46446 46146 45631 44727 43614 42537 41661 41132 41101 41593 42333 42857 42878 42508 42094 41956 42315 43274
54861 43274 44662 45989 46745 46742 46075 44917 43503 42124 40877 39522 37854 36112 34760 33995 33723 33860
54845 33860 34174 33996 32733 30768 29326 29176 29922 30765 31427 31929 31975 31189 29801 28570 28060 28315 29078 29922
54827 29922 30320 30071 29652 29713 30252 30718 30953 31452 32498 33537 33827 33410 33049 33385 34477 36042 37782 39466
54809 39466 40978 42395 43902 45628 47691 50309 53660 57675 62162 67241 73382 80902 89601 99084
54795 99084 109314 120529 132653 145052 157023 168241 178363 186322 190491 189899 185114 177694 168843
54782 168843 158861 147860 136599 126319 117900 111363 106108 101426 96868 92422 88506 85585 83675
54769 83675 82329 81194 80457 80518 81355 82456 83419 84341 85489 86837 88263 90126 93321 98543 105625 113759
54753 113759 122357 131550 141856 153472 166003 178821 191506 203748 214853 223649 229166 231394
54741 231394 231141 229135 225541 220489 214706 209131 203928 198275 191250 182662 172813 161858 149821 137181
54727 137181 125013 114338 105464 97937 90972 83969 76910 70383 65009 60786 57196 54055 51816 50807
54713 50807 50490 49930 48782 47363 45921 44422 43080 42503 43000 44125 45127 45601 45544 45181 44915 45056 45313
54696 45313 44933 43649 42132 41116 40520 39886 39320 39292 39781 40368 41085 42387 44169 45616 46301 46789 47746
54679 47746 49021 50039 50688 51292 52018 52828 53881 55497 57720 60202 62464 64125 64996 65175 64935 64369
54663 64369 63343 61939 60665 59944 59643 59390 59145 59066 59072 58964 58851 58982 59264 59436 59713 60757 62884 65723
54645 65723 68757 71817 74947 78208 81912 86636 92695 99809 107625 116339 126425 137915 150383 163655
54631 163655 178088 193943 210772 227646 243777 258568 271158 280331 285052 284899 279874 270116 256137
54618 256137 239222 221174 203542 187153 172208 158519 145711 133672 122865 113820 106250 99180
54606 99180 92142 85692 80400 75926 71652 67809 65142 63633 62315 60455 58296 56491 55308 54565 53913
54591 53913 52947 51430 49582 47883 46517 45320 44335 43916 44141 44545 44692 44663 44750 45015 45372 45756 45959 45644
54573 45644 44833 44053 43691 43459 42894 42130 41761 42072 42749 43276 43353 43039 42740 42923 43638 44475 45214 46202 47710
54554 47710 49162 49542 48537 46894 45615 45163 45424 46025 46538 46665 46451 46235 46345 46894 47776 48693 49327 49708
54536 49708 50321 51580 53298 54981 56549 58373 60638 63085 65494 68067 71215 75240 80302 86373 93106
54521 93106 100044 107140 114795 123164 131683 139474 145959 150777 153338 152964 149629 144292 138234 132034 125309
54506 125309 117468 108685 100008 92496 86439 81472 77229 73595 70507 67893 65819 64365 63282 62106
54492 62106 60678 59279 58108 56958 55573 54051 52649 51412 50218 49051 48006 47171 46659 46615 46986 47416
54476 47416 47632 47813 48345 49263 50149 50603 50612 50401 50080 49540 48723 47952 47798 48475 49446 49941 49809 49544 49421 49116
54456 49116 48378 47638 47503 47936 48341 48264 47600 46350 44692 43158 42253 41916 41779 41833 42296 42927 43164 43031 43164
54437 43164 43689 43795 42953 41935 41964 43169 44507 45010 44543 43484 42329 41564 41374 41352 41006 40645 41255 43254
54419 43254 45765 47445 47765 47268 46856 47135 48256 50023 52093 54209 56249 58047 59426 60482 61623
54404 61623 63148 64970 66872 68785 70574 71840 72328 72329 72286 72090 71214 69482 67279 64956 62540 60172
54388 60172 58368 57476 57226 57139 57128 57325 57519 57215 56242 54927 53648 52507 51488 50658 50092 49755 49532 49276
54370 49276 48871 48394 48166 48411 48948 49454 50005 50954 52250 53323 53936 54746 56584 59363 62120 64111 65427
54353 65427 66451 67146 67211 66774 66546 67223 68898 71118 73359 75272 76537 76789 75890 74197 72366 70850
54337 70850 69696 68763 67866 66690 64900 62604 60513 59348 59105 59080 58613 57590 56329 55235 54573 54281
54321 54281 53874 52797 51033 49265 48190 47779 47309 46153 44410 42789 41970 42078 42679 43196 43263 42748 41643
54304 41643 40192 39057 38953 39841 40730 40599 39470 38275 37738 37804 38189 38993 40329 41650 42060 41358 40350
54287 40350 39895 39972 39956 39602 39343 39641 40413 41251 41940 42583 43323 44128 44830 45227 45176 44713 44117 43697 43497 43252
54267 43252 42723 42055 41689 41956 42750 43654 44265 44443 44319 44157 44176 44351 44436 44300 44218 44646 45613 46551 46878 46599
54247 46599 46160 45923 46017 46564 47599 48765 49437 49353 48925 48796 49237 49968 50391 49990 48818 47615 47094 47050 46591
54228 46591 45350 43970 43110 42576 41893 41229 40999 40960 40477 39534 38666 37982 37168 36501 36825 38118 39061 38683
54210 38683 37726 37511 38065 38300 37762 37117 36907 36813 36403 35898 35731 35833 35731 35038 33581 31454 29248 27847
54192 27847 27585 27862 27963 28003 28578 29678 30571 30842 30991 31700 32871 33737 33787 33237 32640 32327 32281 32347 32406 32376
54172 32376 32165 31681 30974 30361 30279 30889 31889 32852 33658 34410 35028 35213 34927 34543 34339 34110 33522 32673 31973
54153 31973 31562 31254 30974 30935 31291 31919 32611 33172 33347 32979 32418 32382 33157 34182 34703 34653 34567 34818 35250 35534
54133 35534 35618 35762 36256 37073 37761 37833 37376 37068 37410 38164 38768 39073 39355 39773 40204 40541 40809 40981 41016 41075
54113 41075 41390 41891 42262 42383 42422 42445 42256 41687 40843 39971 39318 39126 39458 40031 40448 40631 40745 40776 40600 40484
54093 40484 41007 42245 43487 44088 44259 44714 45781 47190 48513 49460 49923 50030 50115 50426 50955 51648 52505 53266
54075 53266 53353 52517 51342 50724 50948 51626 52355 53026 53547 53808 53989 54530 55574 56742 57596 58136 58680 59439
54057 59439 60322 61169 62065 63411 65614 68664 72137 75647 79115 82491 85533 88167 90836 94080 97841
54042 97841 101595 105096 108575 112193 115691 118746 121288 123347 124903 126097 127307 128805 130384 131464
54028 131464 131490 130295 128339 126565 125697 125507 124962 123202 120201 116471 112482 108540 104904 101724 98959
54013 98959 96505 94295 92204 90051 87797 85534 83227 80747 78251 76170 74638 73267 71761 70372
53999 70372 69418 68643 67533 66093 64857 64179 63957 64047 64502 65280 66036 66347 66017 65127 63999 63072 62528 62037
53981 62037 61129 59848 58747 58152 57776 57234 56700 56768 57768 59393 60991 62116 62780 63249 63547 63282 62102
53964 62102 60353 59059 59077 60319 61914 63089 63822 64664 66023 67732 69315 70625 72023 73919 76291
53949 76291 78789 81138 83285 85294 87408 90104 93721 97970 102118 105771 109259 113198 117966 123684
53935 123684 130357 137761 145434 153086 160858 168980 177325 185519 193278 200331 206206 210577 213796 216641
53921 216641 219425 221680 222850 222928 222194 220641 218029 214363 210053 205641 201577 198137 195252 192485 189449
53906 189449 186248 183254 180451 177352 173648 169546 165206 160249 154292 147826 141995 137381 133411 129194
53892 129194 124609 120222 116409 113008 109847 107187 105385 104311 103361 101982 100069 97900 95827 94056
53878 94056 92536 90972 89007 86493 83611 80739 78238 76356 75205 74662 74332 73825 73121 72531 72257 72130
53862 72130 71862 71351 70586 69446 67903 66322 65164 64376 63455 62297 61619 62161 63676 65083 65675 65868 66605
53845 66605 68203 70046 71449 72611 74435 77309 80361 82247 82599 82262 82098 82042 81568 80555 79232 77605
53829 77605 75605 73714 72812 73201 74263 75240 75954 76521 76843 76867 77148 78609 81592 85407 88991 91919 94688
53812 94688 98030 102057 106158 109665 112468 114885 117147 119241 121182 123089 124996 126814 128620 130749
53798 130749 133444 136492 139264 140975 140990 139215 136352 133486 131229 129399 127596 125720 123710 121139 117600
53783 117600 113395 109416 106278 103846 101646 99433 97223 95040 92813 90465 87995 85531 83245 81179
53769 81179 79165 77052 74983 73275 72022 71048 70269 69920 70178 70686 70710 69906 68808 68325 68732 69346 69341 68637
53751 68637 67764 67008 66206 65378 64947 65006 64892 64022 62812 62179 62240 62150 61279 59954 58871 58313 58181 58337 58551
53732 58551 58454 57916 57292 57002 57051 57236 57567 58167 58911 59547 60066 60589 60969 60878 60318 59664 59127 58510 57620 56676
53712 56676 56154 56393 57441 59070 60810 62222 63294 64397 65660 66636 66868 66608 66600 67213 68172 69186 70387
53695 70387 71921 73436 74415 74941 75701 77172 79091 80903 82511 84347 86767 89549 92010 93548 94102
53680 94102 94154 94252 94503 94574 94168 93425 92794 92684 93252 94351 95508 96136 96033 95568 95197 94945 94570 94068 93582
53661 93582 92939 91800 90396 89584 89892 90883 91793 92502 93460 94867 96339 97379 97826 97806 97473 96904 96114 95216
53643 95216 94569 94630 95502 96830 98316 100022 101873 103200 103303 102347 101195 100361 99707 99154 99051 99546 100131
53626 100131 100205 99774 99260 98921 98808 98980 99384 99641 99409 98864 98571 98954 100083 101789 103658 105124 105970 106645
53608 106645 107724 109159 110469 111631 113207 115475 117891 119753 121088 122584 124806 127687 130650 133029
53594 133029 134517 135427 136479 138162 140302 142308 143745 144515 144646 144145 143109 141783 140429 139224 138393
53579 138393 138279 139038 140220 140919 140606 139748 139307 139687 140474 141252 142148 143275 144130 144125 143452 142770 142136 140994
53561 140994 139378 138380 138929 140580 142023 142502 142260 141795 141285 140760 140382 140307 140498 140795 141075 141342 141725 142360
53543 142360 143163 143780 143927 143718 143568 143846 144763 146422 148706 151147 153210 154753 156111 157704 159769 162428
53527 162428 165708 169346 172764 175468 177495 179376 181676 184654 188316 192628 197501 202584 207345 211554
53513 211554 215604 220142 225474 231489 238081 245312 253161 261478 270223 279461 289041 298756 308891 320164
53499 320164 332800 346112 359282 372117 384714 396897 408590 420312 432630 445380 458037
53488 458037 470599 483369 496095 508210 519890 531984 544747 557434 569393 580780 591943
53477 591943 602856 613570 624500 635732 646660 656846 666754 677036 687566 697780 707576 717225
53465 717225 726661 735517 743709 751350 758162 763502 766996 768741 768988 767968 765931 762980 758973 753900
53451 753900 748136 741933 734992 727089 718910 711578 705355 699468 693199 686471 679238 671090 661901 652302
53437 652302 643018 634016 624764 615114 605530 596480 587987 579856 572121 565119 559121 553992 549325 544936
53423 544936 541099 538218 536402 535536 535625 536789 538990 541954 545344 548864 552310 555763 559645 564376 570037
53408 570037 576509 583713 591495 599527 607746 616702 627045 638777 651430 664805 679019 693926 709157
53395 709157 724775 741310 759010 777608 797000 817565 839563 862722 886695 911518 937323
53384 937323 964000 991436 1019680 1048586 1077672 1106655 1135817 1165522 1195656 1225780 1255441
53373 1255441 1284051 1310831 1335336 1357833 1378853 1398655 1417392 1435421 1452930 1469434 1484028
53362 1484028 1496025 1505071 1510953 1513717 1513803 1511625 1507153 1500180 1490771 1479055 1464851 1447995 1428833
53349 1428833 1407869 1385052 1360010 1332990 1304998 1276946 1249204 1222110 1196345 1172412 1150035
53338 1150035 1128448 1107191 1086458 1066694 1047911 1029382 1010018 989178 967106 944600 922424
53327 922424 901131 881116 862456 844787 827714 811376 796403 783359 772345 763025 754701 746518
53315 746518 737964 729158 720421 711629 702322 692366 682117 671910 661715 651447 641390 632192 624513
53302 624513 618549 613777 609277 604494 599601 595091 591401 589130 589026 591132 594329 597431 600500 604441
53288 604441 609544 615377 621978 630101 640032 651088 662582 674446 686551 698301 709504 720911
53276 720911 733177 745851 757990 769248 779701 789169 797566 805505 813612 821372 827574 831871 835151
53263 835151 838233 840901 842428 842393 840694 837247 832083 825518 817962 809640 800549 790522 779316 766837
53249 766837 753292 738976 723993 708472 692980 678307 664754 651887 639106 626215 613391
53238 613391 600889 588933 577718 567301 557463 547685 537279 525784 513432 501121 489696 479245
53226 479245 469226 459122 448764 438228 427801 417985 409137 401096 393470 386301 380124 375289 371543
53213 371543 368335 365182 361646 357273 351742 344957 336973 328041 318743 309726 301171 292664 283665 273947
53199 273947 263668 253362 243829 235603 228416 221570 214934 209099 204326 199877 194873 189480 184720 181170
53185 181170 178337 175318 171721 167842 164189 161000 158125 155212 152013 148513 144884 141425 138514 136413
53171 136413 135056 134163 133496 132828 131772 130101 128278 127207 127172 127459 127270 126656 126164 125995 126029 126430 127524
53154 127524 129125 130560 131503 132321 133421 134654 135527 135726 135258 134324 133259 132457 132223 132737 134015 135661
53138 135661 136787 136653 135542 134632 134736 135388 135370 134002 131793 129997 129656 130850 132635 133808 133854 133114 132180
53121 132180 131419 131086 131339 131874 131961 131273 130349 129776 129197 127814 125746 124149 123716 123679 122755 120721 118593 117389
53103 117389 117145 117102 116514 115162 113388 111834 111026 111065 111654 112384 112900 112838 111836 109849 107416 105383 104210
53086 104210 103542 102617 101076 99284 97817 96742 95600 94059 92390 91155 90524 90084 89365 88450 87921 88202
53070 88202 89037 89696 89686 89174 88698 88554 88559 88336 87733 86933 86243 85772 85315 84596 83675 83058 83198 83894 84369 84063
53050 84063 83176 82276 81555 80794 80032 79830 80600 81939 83015 83605 84348 85865 87968 90026 91864 93900 96431
53033 96431 99199 101705 103557 104340 103660 101784 99959 99437 100098 100521 99597 97643 95677 94086 92543 90961
53017 90961 89817 89411 89335 89046 88675 88875 89947 91398 92370 92330 91345 89914 88669 88081 88207 88618 88665 87950
52999 87950 86634 85273 84306 83769 83486 83439 83711 84128 84171 83471 82239 81024 80126 79454 78921 78754 79263 80433
52981 80433 81828 82880 83274 83198 83231 83784 84574 84827 84153 83072 82401 82306 82297 82136 82266 83154 84591 85999 87225
52962 87225 88585 90183 91586 92324 92402 92147 91809 91532 91556 92076 92885 93415 93305 92857 92799 93570 94878 95921
52944 95921 96056 95277 94083 92985 92234 91961 92360 93519 95210 97036 98823 100692 102701 104578 105920 106535
52928 106535 106494 105965 105193 104579 104530 105094 105832 106146 105760 104909 104138 103950 104507 105505 106364 106683 106587 106556 106902 107527
52908 107527 108162 108677 109053 109291 109522 110127 111409 113205 115004 116482 117600 118227 118084 117318 116751 117126 118222
52891 118222 119110 119227 118821 118419 118336 118881 120520 123372 126707 129363 130722 131111 131293 131790 132638 133457 133645
52874 133645 132775 131021 129191 128112 127946 128145 128091 127702 127373 127450 127899 128512 129173 129775 129989 129424 128041 126127
52856 126127 123807 120862 117256 113553 110475 108083 105760 103038 100196 97942 96731 96486 96780 97135 97320
52841 97320 97449 97637 97490 96234 93667 90742 88774 88096 87926 87587 87292 87501 87985 88116 87804 87528 87457 87147
52823 87147 86288 85205 84303 83448 82342 81180 80410 80005 79531 78937 78726 79235 80153 80945 81382 81416 80955 80066
52805 80066 79166 78656 78491 78390 78272 78202 78044 77563 76853 76349 76388 76867 77295 77020 75635 73513 71814 71498 72328
52786 72328 73191 73385 73148 72919 72761 72760 73433 75155 77504 79684 81405 82856 83963 84328 83957 83526 83629 84146
52768 84146 84589 84762 84778 84661 84337 83970 83992 84688 85925 87313 88485 89137 88976 87868 86090 84326 83209
52751 83209 82730 82120 80469 77630 74561 72686 72765 74257 75804 76403 76176 76025 76520 77219 77152 75911 74098
52734 74098 72635 71794 71115 70203 69289 68834 68800 68657 68159 67700 67706 67903 67571 66441 64997 63815 63002 62424 62131
52715 62131 62176 62240 61864 61075 60413 60282 60575 61051 61772 62927 64389 65715 66599 67133 67657 68454 69556 70737
52697 70737 71646 72044 71975 71785 71948 72739 73913 74765 74787 74304 74253 75167 76591 77679 78126 78229 78208 77973 77589
52678 77589 77515 78039 78735 78797 77936 76719 75961 75903 76055 75850 75358 75287 76225 78003 79886 81267 81946 81875 81116
52659 81116 80167 79885 80663 81857 82459 82254 81941 82123 82592 82774 82502 82097 81904 82052 82569 83366 84090 84255 83698
52640 83698 82703 81589 80311 78702 77030 75977 75875 76186 76058 75385 75034 75874 77772 79727 80838 80879 80105
52623 80105 78920 77861 77590 78573 80728 83518 86342 88830 90867 92533 94039 95650 97581 99906 102393
52608 102393 104480 105597 105665 105198 104796 104600 104346 103793 102911 101723 100291 98936 98253 98651 99904 101234 101852
52591 101852 101377 99920 98027 96555 96333 97561 99553 101231 101990 102051 101954 101940 101941 101989 102330 103127 104256 105462
52573 105462 106574 107473 108046 108276 108316 108394 108622 108879 108782 107877 106144 104345 103554 104110 105227 105788 105356 104241
52555 104241 102864 101442 100163 99223 98596 98032 97361 96618 95903 95338 95153 95499 96144 96598 96659 96601 96768 97276
52537 97276 98171 99515 101104 102422 103145 103492 103857 104329 104826 105403 106029 106256 105633 104402 103293 102639 102120
52520 102120 101437 100698 99976 98999 97655 96354 95445 94575 93194 91486 90221 89725 89615 89600 89904 90562 90899
52503 90899 90281 89055 88194 88105 88262 88026 87319 86395 85408 84456 83800 83710 84162 84848 85379 85454 84995 84257 83683 83476
52483 83476 83428 83259 82968 82735 82602 82466 82288 82107 81949 81857 81932 82165 82297 82048 81441 80743 80171 79811 79767 80137
52463 80137 80856 81763 82771 83823 84714 85223 85428 85643 86065 86679 87518 88692 90072 91241 91886 92030 91743
52446 91743 90939 89699 88571 88243 88891 90002 90838 90988 90629 90384 90836 91988 93203 93730 93314 92302 91303
52429 91303 90829 91083 91890 92860 93709 94400 94966 95340 95472 95465 95500 95713 96224 97148 98452 99906 101263 102369 103038
52410 103038 103072 102614 102263 102583 103583 104859 106065 107011 107521 107633 107822 108617 109903 110971 111306 111038 110538
52393 110538 109981 109437 109037 108800 108547 108293 108464 109366 110501 110863 109995 108578 107851 108593 110674 113393 116112
52376 116112 118572 120744 122450 123281 123023 122145 121642 122242 123821 125641 127072 127988 128601 129211 130154 131676
52360 131676 133677 135714 137432 138877 140170 141121 141546 141843 142751 144438 146283 147805 149369 151576 154326
52345 154326 156936 158990 160529 161559 162042 162566 164394 168391 174099 180180 185650 190499 195330 200740 207008
52330 207008 214066 221638 229523 237763 246463 255534 264781 274309 284687 296524 309856 324045 338350
52317 338350 352556 367001 382010 397433 412789 427699 442091 456076 469774 483229 496346
52306 496346 508933 520868 532091 542334 551008 557723 562871 567337 571493 574735 576245 576057 575123 574335
52292 574335 573661 572259 569354 564959 559785 554565 549553 544611 539499 533942 527742 521271 515772 512636
52278 512636 512148 513253 514809 516817 520201 525590 532706 540875 549745 559386 569869 580974 592243 603262
52264 603262 613882 624241 634645 645361 656398 667412 677908 687669 696858 705555 713335 719564
52252 719564 724055 727159 729215 730263 730272 729215 726864 722964 717881 712600 707698 702624 696387 688693 680028
52237 680028 670901 661604 652563 644248 636584 628946 620995 613232 606486 601056 596556 592441 588544 585108
52223 585108 582368 580203 578410 577290 577554 579317 581603 583423 585150 588068 592519 597259 600969 603723
52209 603723 606492 609713 612983 615910 618582 621235 623897 626458 628793 630822 632618 634374 636045 637189
52195 637189 637473 637207 637034 637156 637220 636956 636472 635900 635115 634004 632675 631180 629246 626527 623063 619349 615958
52178 615958 613059 610255 606928 602918 598724 594890 591364 587876 584761 582789 582085 581808 581196 580388 579795
52163 579795 579152 577812 575751 573647 571992 570633 569257 567875 566725 565987 565650 565389 564637 563103 561230
52148 561230 559780 558976 558419 557784 557146 556563 555923 555323 555074 555063 554714 553939 553598 554557 556720 559585 563278 568302
52130 568302 574521 581313 588697 597402 607525 617981 627855 637738 649006 662075 676065 690128 704372
52117 704372 719154 734006 747942 760729 773312 786646 800446 813488 825006 835288 844900 853858
52105 853858 861852 868774 874613 879151 882233 884086 884867 884089 881159 876426 871032 865614 859757 852911 845238
52090 845238 837290 829362 821569 814139 807225 800770 794925 790248 787118 785225 784080 783716 784424 786005 787896
52075 787896 789986 792878 797342 803814 812359 822647 833953 845545 857157 868836 880392 891390
52063 891390 901685 911554 921180 930279 938357 945091 950351 954084 956295 957008 956270 954282 951371 947522
52049 947522 942041 934155 923985 912483 900307 887237 872879 857461 841524 825215 808425 791475
52037 791475 775081 759525 744302 728789 713089 697902 683686 670201 657016 644268 632677
52026 632677 622727 614079 605916 597728 589505 581333 573167 565034 557085 549308 541386 533021 524214 515079
52012 515079 505579 495642 485345 474774 463796 452269 440437 428831 417661 406497 394762 382421
52000 382421 370009 357917 345871 333309 320188 307125 294728 283077 272037 261707 252211 243228
51988 243228 234280 225480 217527 210804 204899 199293 194145 190033 187078 184680 182069 178857 175077 170944
51974 170944 166744 162796 159433 156873 155043 153497 151627 149044 145775 142137 138554 135373 132650 130125
51960 130125 127628 125435 123908 122770 121267 119239 117555 117044 117312 117188 116206 115066 114549 114492 114115 113049
51944 113049 111687 110593 109857 109131 108181 107163 106306 105539 104708 104053 104021 104493 104647 103899 102631 101538 100548
51927 100548 98960 96593 94212 92695 92237 92513 93179 93949 94516 94742 94800 94890 94966 94852 94473 93751 92499 90633
51909 90633 88443 86397 84734 83359 82047 80598 78932 77215 75829 75031 74657 74364 74107 74170 74682 75343
51893 75343 75764 75960 76307 76992 77621 77545 76618 75526 75178 75781 76717 77405 78020 79094 80595 81759 81932 81297
51875 81297 80638 80580 81211 82266 83445 84550 85496 86264 86801 87029 86981 86851 86760 86575 86112 85465 84912 84531 84169
51856 84169 83831 83780 84122 84591 84976 85478 86306 87163 87608 87823 88487 89738 90872 91333 91535 92198 93248 93966
51838 93966 94160 94529 95704 97422 98931 99944 100739 101505 101968 101795 101153 100691 100997 102125 103621 104951 105898
51821 105898 106580 107225 108096 109602 112219 116100 120793 125649 130625 136625 144857 155862 169244 184284
51807 184284 200564 217825 235491 252677 268722 283327 295862 304739 307932 304357 294680 280719
51795 280719 264211 246289 227843 209887 193300 178439 165283 153877 144328 136430 129629 123548
51783 123548 118268 113888 110106 106545 103292 100690 98681 96796 94876 93335 92530 92183 91719 90925 90006
51768 90006 89169 88453 87862 87414 87058 86735 86494 86463 86739 87363 88223 88922 88967 88301 87460 87017 87027 87201 87438 87882
51748 87882 88580 89364 89995 90182 89603 88303 86983 86551 87291 88746 90365 91925 93363 94592 95620 96545
51732 96545 97285 97632 97683 97897 98531 99304 99879 100445 101477 103004 104424 105112 105093 105016 105509 106558 107586 108126
51714 108126 108303 108552 109018 109505 109929 110480 111305 112328 113487 114840 116286 117428 117920 117770 117236 116615 116220
51697 116220 116245 116447 116199 115111 113442 111790 110615 110291 111232 113434 116029 117742 117922 116876 115247 113370
51681 113370 111256 108874 106296 103744 101555 99934 98683 97358 95738 93987 92399 91226 90793 91343 92558
51666 92558 93480 93341 92358 91425 91023 90772 90090 88959 87849 87146 86856 86671 86109 84817 83101 81977 82200
51649 82200 83273 83916 83650 83303 83709 84545 84995 85044 85309 85834 85946 85399 84838 84849 85190 85328 85225 85114 84949
51630 84949 84543 84017 83688 83711 84100 84933 86135 87332 88286 89284 90713 92416 93945 95308 96984 99215 101711
51613 101711 104102 106206 107838 108814 109395 110282 111878 113735 115015 115365 115111 114738 114436 114201 114140 114473 115208
51596 115208 115924 116099 115769 115719 116811 119122 121890 124290 126123 127707 129316 130881 132178 133112 133714 133936
51580 133936 133593 132616 131273 130006 129070 128452 128019 127518 126499 124542 121659 118233 114529 110615 106795 103693
51564 103693 101607 100120 98652 97107 95728 94608 93724 93173 92954 92704 92047 91144 90553 90694 91664 93329
51548 93329 95235 96730 97631 98536 99959 101435 102034 101586 100743 100028 99568 99624 100456 101491 101531 100178 98390
51531 98390 97226 96618 95762 94195 92077 89907 88426 88341 89620 91301 92419 92847 92966 92945 92808 92833 93316
51514 93316 94100 94819 95506 96538 98062 99822 101524 103118 104765 106689 108950 111234 113138 114754 116658
51499 116658 119142 121822 124233 126377 128390 130171 131741 133539 135795 137982 139448 140295 141085 141934 142540
51484 142540 142844 142984 142729 141596 139510 136798 133682 130345 127315 125026 123090 120824 118517 117296 117481
51469 117481 117923 117381 115879 114247 112991 112195 112072 112845 114246 115651 116720 117562 118324 118890 119060 118851 118577
51452 118577 118513 118435 117651 115801 113523 111886 111167 110609 109427 107614 105635 103885 102608 101842 101221 100228 98904
51435 98904 97843 97254 96551 95235 93692 92647 92253 92157 92072 91802 91045 89783 88601 88077 88048 87994 87928 88298 89100
51416 89100 89713 89596 88730 87384 85931 84796 84134 83588 82815 82106 81947 82152 82135 82018 82558 83700 84079 82547
51398 82547 79686 77191 76069 75996 76181 76248 76233 76244 76353 76670 77389 78702 80529 82329 83415 83625 83469 83494
51380 83494 83753 84065 84506 85265 86230 87089 87830 88711 89748 90575 90974 91298 92077 93324 94480 95090 95354 95783
51362 95783 96384 96478 95544 93964 92574 91568 90372 88686 87095 86271 85973 85375 84100 82477 80896 79495
51346 79495 78473 78095 78231 78376 78351 78474 78802 78662 77492 75795 74684 74562 74804 74714 74274 73852 73678 73814
51328 73814 74218 74576 74412 73705 73088 73077 73335 73146 72439 71856 71861 72244 72578 72681 72463 71798 70806 70013 69923 70591
51308 70591 71736 72985 73844 73816 72921 71877 71446 71721 72295 72853 73205 73090 72479 71876 71734 71686 71055 70107 69951
51289 69951 70977 72154 72378 71886 71716 72243 73054 73924 75032 76090 76144 74701 72665 71678 72588 74744 76701
51272 76701 77462 77119 76474 76179 76262 76445 76687 77260 78379 79950 81630 83025 83925 84470 85013 85661 86157 86397
51254 86397 86838 87986 89664 91223 92469 93805 95403 96818 97732 98491 99420 100019 99516 98090 96808 96241
51238 96241 95659 93965 91112 88191 86269 85506 85403 85547 85850 86227 86410 86229 85890 85691 85541 85045 84148 83410
51220 83410 83364 83836 84179 84140 84177 84844 86151 87660 88985 90012 90726 91067 90944 90313 89307 88387 88213 89008
51202 89008 90053 90160 88931 87326 86651 87102 87639 87310 86252 85290 84981 85389 86388 87624 88367 88052 87076
51185 87076 86549 87009 87798 87949 87281 86290 85370 84548 83773 82913 81597 79560 77219 75451 74704 74719 75136 75925
51167 75925 76981 77729 77553 76486 75185 74292 74055 74422 75192 76023 76518 76471 76023 75572 75496 75923 76689 77520 78222
51148 78222 78649 78608 78030 77227 76732 76799 77258 77923 78843 79958 80822 81053 80945 81191 81989 82695 82561 81594 80548
51129 80548 80145 80442 80960 81292 81467 81711 82112 82731 83945 86192 89209 91891 93241 93307 92913 92712 92866 93390
51111 93390 94210 94878 94797 94001 93328 93600 94858 96561 98237 99757 101190 102625 103987 104945 105252 105280 105845
51094 105845 107235 108758 109583 109755 109960 110493 111014 111258 111467 111984 112790 113646 114356 114744 114657 114195 113752 113629
51076 113629 113700 113627 113310 112979 112904 113105 113323 113183 112496 111515 110783 110593 110600 110097 108729 106819 104956 103398 102078
51057 102078 101155 101219 102641 104806 106380 106526 105626 104644 104047 103657 103374 103559 104600 106416 108552 110540 112058
51040 112058 112936 113156 112867 112367 112127 112686 114253 116426 118533 120253 121696 122903 123689 124083 124507 125252 126103
51023 126103 126818 127708 129381 132008 135134 138140 140662 142730 144773 147348 150568 153901 156873 159799 163402
51008 163402 167731 171937 175182 177448 179412 181969 185932 191698 198798 206109 212844 219214 225919 233288
50994 233288 241228 249832 259586 270899 283707 297676 312684 329035 347244 367598 389998 414285
50982 414285 440687 469752 501863 537005 575029 615745 658674 703140 748920 796507 846272
50971 846272 897516 948647 998078 1044599 1087217 1125328 1159059 1188828 1214433 1235067 1250439
50960 1250439 1261350 1268975 1274031 1276896 1278018 1277721 1276047 1273349 1270756 1269418 1269417 1269941 1270449 1270955 1271091 1269554
50944 1269554 1264877 1256368 1243951 1227412 1206208 1179892 1148457 1112303 1072119 1028641 982362 933552
50932 933552 882796 831402 781035 732972 687827 645745 606587 570036 536042 505238 478493
50921 478493 455810 435971 417599 400409 385135 372341 361663 352279 343815 336565 330932 326848
50909 326848 323804 321320 319266 317693 316502 315466 314538 313943 313894 314452 315726 317902 320786 323629 325851
50894 325851 327882 330793 335047 340071 345167 350317 355814 361588 367460 373774 381227 390122 400222 411264
50880 411264 423132 435564 448270 461548 476342 493424 512859 534424 558249 584711 614100
50869 614100 646808 683706 725953 774371 829176 890240 957494 1031157 1111675 1199259 1293350
50858 1293350 1392810 1496791 1605056 1717074 1831092 1944596 2055445 2161932 2261857 2352314
50848 2352314 2430693 2495492 2546082 2582363 2605055 2615843 2616745 2609600 2596545 2580534 2564694 2551209
50836 2551209 2541329 2536283 2537418 2545162 2558344 2574819 2592331 2608351 2619540 2622159 2613202 2590896
50824 2590896 2554192 2502454 2435893 2355810 2263854 2161266 2049380 1930736 1808949 1687245
50814 1687245 1567631 1451709 1341642 1239594 1146511 1062172 986357 919275 860788 809903
50804 809903 765415 726638 693201 664498 639750 618371 600008 584385 571346 560761 552090 544272
50792 544272 536472 528894 522496 517892 514748 512205 509661 507140 505055 503608 502423 500925 499185 498105
50778 498105 498546 500477 503250 506425 509921 513571 517047 520294 523552 526830 529637 531357 531726 530938 529499
50763 529499 528007 526861 526174 526171 527524 531076 537343 546554 558922 574454 592691 613307 636986 665010
50749 665010 697784 734364 773764 816188 862631 913712 969295 1028869 1091750 1157112 1224177
50738 1224177 1292187 1359809 1424894 1485315 1539971 1588584 1630612 1664806 1689744 1704432 1708496
50727 1708496 1702374 1687563 1666367 1641210 1614251 1587566 1563316 1543513 1529678 1522642 1522348 1527744
50715 1527744 1537069 1548421 1560042 1570206 1577107 1578952 1573952 1560264 1536295 1501421 1456347 1402621
50703 1402621 1341919 1275939 1206860 1137386 1069915 1005699 945057 888404 836656 790430 749251
50692 749251 712073 678508 649049 624094 603337 586310 572911 563023 556046 551352 548954 549258 552295
50679 552295 557565 564430 572317 580830 590129 600982 613846 628023 642261 656060 669757 683420
50667 683420 696555 709069 721672 734769 747471 758255 766410 772510 777861 783891 791782 802088
50655 802088 814602 828818 844467 861573 880248 900673 922998 946971 971847 996869 1021652
50644 1021652 1045868 1068906 1090225 1109741 1127375 1142412 1153882 1161629 1166538 1169586 1171077 1170824
50632 1170824 1168645 1164407 1157987 1149605 1140082 1130475 1121458 1113191 1105675 1099011 1093242 1088155 1083364 1078611
50618 1078611 1073902 1069285 1064545 1059334 1053695 1048368 1044298 1041721 1039820 1037266 1032959 1026260 1016783 1004278
50604 1004278 988650 969781 947188 920180 888695 854024 818374 783511 749926 717376 685915
50593 685915 656119 628524 603290 580510 560408 543048 528108 515242 504518 496313 490788 487669
50581 487669 486473 486868 488806 492401 497678 504476 512666 522375 533738 546366 559420 572382 585544
50568 585544 599463 614128 629031 644004 659604 676444 694328 712260 729398 745905 762704
50557 762704 780319 798109 814865 830014 843801 856281 866768 874745 880997 887335 895297 905573
50545 905573 918535 934736 954692 978622 1006657 1039114 1076311 1118364 1165314 1217284 1274243
50534 1274243 1335638 1400400 1467248 1534863 1601891 1667061 1729418 1788265 1842650 1890886 1930745
50523 1930745 1960272 1978459 1985152 1980550 1964996 1939098 1903705 1859782 1808594 1752052 1692396 1631347
50511 1631347 1569911 1509212 1451056 1397213 1348465 1304949 1267288 1236738 1214134 1199126 1190635
50500 1190635 1187692 1189730 1196436 1207638 1223169 1242641 1265300 1289983 1314941 1337768 1355816 1366851
50488 1366851 1369237 1361727 1343588 1315131 1277731 1233101 1182725 1128073 1071056 1013860 958321 905482
50476 905482 855696 809127 766223 727626 693505 663195 635837 611268 589927 571976 557150
50465 557150 545460 537336 532759 530838 530740 532558 536708 542841 550016 557797 566559 576741 588358 601290
50451 601290 615463 630492 645560 659998 673882 687775 701959 716082 729501 741812 752930
50440 752930 762770 771005 777312 781785 784987 787596 790106 792818 795870 799285 803178 807922 813873 820987
50426 820987 829081 838477 849945 863926 880347 899357 921603 947297 975508 1004945 1035122 1066177
50414 1066177 1097846 1129224 1159329 1187285 1212051 1232610 1248401 1259125 1264183 1262866 1254943 1240486
50402 1240486 1219253 1190994 1156330 1116611 1072870 1025771 976716 927999 881372 837201 795462
50391 795462 756846 722242 691828 665405 643167 625426 612002 602643 597730 597754 602337 610538 621895
50378 621895 636314 652977 670270 686968 702611 716475 727019 732862 733721 729877 721235 707586
50366 707586 689492 668225 644924 620288 595101 570459 547250 525689 505539 486652 469164
50355 469164 453367 439532 427798 418036 409787 402517 396013 390488 386208 383049 380647 379011 378755 380524
50341 380524 384346 389748 396399 404305 413435 423518 434339 445953 458374 471233 483955 496217
50329 496217 508074 519668 530995 541972 552635 563173 573681 583874 593143 600948 607071 611434
50317 611434 613924 614667 614289 613492 612369 610529 607953 605281 603092 601291 599437 597275 594607 591023 586291
50302 586291 580935 575980 572095 569193 566793 564494 562220 560318 559301 559207 559332 558899 557824 556443 554696
50287 554696 552228 549308 546998 546173 546799 548326 550274 552206 553713 554864 556261 558212 560131 561172 561090
50272 561090 560063 558017 554785 550720 546494 542314 537886 533139 528406 523790 518904 513436 507508 501343
50258 501343 495113 489377 485116 482854 482057 481815 481903 482768 484629 487044 489353 491196 492630 493983 495658
50243 495658 497883 500586 503556 506596 509435 511678 513098 513837 514152 514035 513382 512303 510927 508945 505777
50228 505777 501278 495941 490283 484303 477730 470579 463224 456049 449161 442371 435348 427897 420261 413054
50214 413054 406810 401576 397010 392824 389076 386060 383937 382449 381017 379188 376981 374701 372478 370141
50200 370141 367512 364598 361466 358164 354873 351896 349324 346839 344022 340767 337258 333634 329823 325637
50186 325637 320916 315693 310335 305339 300789 296092 290542 284116 277479 271272 265646 260483 255694 251156
50172 251156 246658 242225 238388 235806 234553 233893 232816 230778 228003 225216 223125 222051 221898 222345 223003
50157 223003 223508 223696 223718 223845 224070 224115 223909 223931 224861 226979 230108 234053 238829 244455 250820 257917 265974
50140 265974 275164 285249 295749 306424 317452 329099 341437 354496 368541 383900 400413 417215
50128 417215 433370 448747 464033 479744 495399 509886 522532 533497 543255 552147 560522 568812
50116 568812 576992 584231 589476 592298 592805 590797 585591 576884 565511 553008 540476 528000 515142
50103 515142 501880 489033 477752 468566 461057 454633 449434 446153 445010 445391 446695 449117 453274 459314
50089 459314 466718 474756 482773 490264 497191 504294 512579 522313 532743 542939 552641 562151 571638 580795
50075 580795 589074 596079 601765 606393 610286 613608 616369 618572 620128 620663 619640 616812 612364 606581
50061 606581 599690 592224 585202 579484 574992 570950 566920 563252 560429 558373 556647 555081 553862 553213
50047 553213 553404 554976 558439 563566 569368 575059 580782 587049 593689 599887 605223 610155 615242 620315
50033 620315 624755 628333 631358 634067 636209 637258 636856 635080 632520 630055 628309 627282 626682 626638 627864
50018 627864 631140 636886 645218 656003 668689 682392 696426 710613 724914 738977 752358 765018
50006 765018 777308 789482 801553 813561 825650 837682 848919 858212 864443 866860 865181 859507
49994 859507 850050 836874 819929 799282 775183 747967 718157 686781 655312 624986 596180 568584
49982 568584 541873 515982 490831 466315 442777 421219 402612 386963 373323 360730 348954
49971 348954 338297 328920 320543 312722 305293 298581 293107 288924 285269 281126 276232 271205 266572 262040
49957 262040 257139 252181 247963 244596 241350 237823 234622 232509 231308 230150 228548 226715 224963 223360
49943 223360 222010 221238 221265 221930 222879 223864 224724 225239 225209 224691 224080 223916 224551 225987 228043 230638 233700 236708
49925 236708 238712 239165 238688 238534 239187 239883 239671 238610 237630 237436 237938 238614 239042 239062 238776 238577 238930 239979
49907 239979 241465 243156 245200 247964 251668 256389 262260 269420 277735 286831 296454 306701 317889 330369
49893 330369 344433 360058 376570 392794 407829 421553 434163 445385 454528 461343 466462 470877
49881 470877 475209 479621 484091 488461 492295 494934 495723 494102 489601 481917 470998 457012 440319 421623
49867 421623 402074 382990 365397 349810 336335 324834 314977 306318 298472 291332 285126 280184 276502
49854 276502 273626 271120 269026 267579 266493 265005 262802 260438 258497 256800 254909 253044 251762 250834
49840 250834 249309 246807 244065 241836 239960 237986 236164 235098 234687 234115 232864 231230 229841 229133 229251
49825 229251 229964 230595 230586 230270 230574 231760 232923 233110 232447 231722 231234 230714 230194 230200 230960 231926 232356 231947 230750
49806 230750 228904 226800 225191 224654 225002 225530 225731 225471 224655 223168 221251 219539 218485 217920 217355 216568
49790 216568 215729 215121 214913 215176 215888 216825 217606 217962 217925 217684 217272 216588 215745 215229 215472 216387 217549 218771
49772 218771 220148 221550 222505 222785 222725 222665 222530 222352 222772 224316 226373 227660 227746 227436 227500 227766 227743 227485 227330
49753 227330 227305 227348 227785 229058 231150 233635 236041 237871 238663 238565 238508 239259 240582 241893 243387 245656 248344
49736 248344 250178 250604 250554 251150 252277 253010 252961 252655 252716 253153 253339 252468 250260 247483 245574 245345 246160 246678
49718 246678 246241 245237 244262 243420 242503 241452 240386 239367 238392 237533 236907 236474 235968 235160 234172 233410 233108
49701 233108 233059 232929 232726 232713 232926 233080 233006 232929 233121 233471 233604 233278 232571 231840 231605 232251 233599 234902 235508
49682 235508 235462 235206 234818 233961 232660 231720 232009 233411 234832 235362 235222 235364 236326 237773 239146 240313 241376
49665 241376 242199 242612 242954 243863 245433 246951 247641 247376 246506 245419 244556 244506 245627 247621 249832 251873 253671
49648 253671 255020 255512 255094 254319 253865 253915 254146 254218 254100 253937 253785 253538 253077 252398 251583 250740 250029 249709 249987
49629 249987 250836 252067 253527 255098 256547 257635 258458 259413 260710 262155 263547 264980 266477 267595 267878
49614 267878 267596 267604 268430 269872 271615 273753 276405 279148 281322 282868 284430 286523 288928 291122 293059
49599 293059 295213 297924 301073 304476 308286 312715 317594 322453 327021 331417 335874 340505 345359 350463
49585 350463 355750 361125 366586 372141 377633 382947 388421 394630 401618 408644 414989 420794 426854 433782
49571 433782 441649 450300 459571 469191 478718 487721 496018 503813 511723 520481 530373 540922 551292 561027
49557 561027 570341 579776 589671 599820 609570 618401 626538 634772 643475 652051 659667 666324 672756 679403
49543 679403 685982 692104 697808 703206 708033 711897 714780 717007 718817 720272 721499 722739 724109 725494
49529 725494 726787 728050 729369 730687 731989 733582 735991 739438 743582 747878 752112 756455 761139 766303
49515 766303 772113 778675 785749 792747 799110 804522 808829 812085 814774 817591 820722 823616 825679 826941
49501 826941 827770 828244 828191 827668 826964 826131 824854 822786 819823 816129 812109 808177 804267 799693 793779 786574
49485 786574 778692 770659 762730 755079 747654 739965 731515 722431 713236 704124 695026 686250 678257 670729
49471 670729 662680 653886 645467 638511 632696 626961 621064 615646 610867 605842 599706 592735 586094 580697
49457 580697 576561 573089 569720 566308 562994 559874 556864 553910 551184 549065 547928 547930 548889 550385 552060
49442 552060 553859 555937 558485 561749 565949 570765 574953 576930 575921 572378 567363 561835 556534 551983
49428 551983 548314 545415 543384 542454 542344 542246 541855 541900 543158 545283 547238 548693 550370 553050 556841 561411
49412 561411 566395 571375 575935 580054 584196 588761 593722 598951 604634 611020 617928 624835 631456 637914
49398 637914 644283 650340 655978 661587 667574 673497 678171 680880 682139 682899 683352 683025 681830 680346 679032
49383 679032 677800 676545 675488 674644 673494 671624 669321 667138 665225 663508 662142 661238 660395 659109 657544
49368 657544 656335 655706 655281 654735 654146 653723 653652 654212 655575 657435 659263 660943 662750 664813 667158 670260
49352 670260 674770 680455 686110 690950 695584 701122 707859 715336 723265 731622 740062 748000 755435 763142
49338 763142 771926 782018 793254 805375 817999 830730 843611 857140 871507 886035 899792 912763
49326 912763 926027 940665 956726 973373 989806 1005856 1021789 1037822 1053874 1069675 1085057
49315 1085057 1100129 1115102 1129839 1143747 1156248 1167278 1177095 1185758 1193179 1199689 1206042 1212576
49303 1212576 1218722 1223625 1227038 1229345 1230955 1232053 1232706 1232863 1232349 1231224 1229996 1229165 1228720 1228509 1228867 1230275
49287 1230275 1232468 1234591 1236443 1238929 1242972 1248444 1254550 1260821 1267404 1274667 1282917 1292202 1302016 1311437
49273 1311437 1319891 1327526 1334557 1340666 1345609 1350059 1355029 1360490 1365258 1368417 1370199 1371151 1371087 1369417 1366190
49258 1366190 1362159 1357851 1353031 1347111 1339732 1330826 1320452 1308892 1296756 1284715 1273079 1261747
49246 1261747 1250517 1239274 1227875 1216143 1204192 1192618 1182083 1172668 1163875 1155329 1147233 1139990
49234 1139990 1133548 1127424 1121293 1115309 1109784 1104748 1099949 1095171 1090448 1086057 1082387 1079759 1078188 1077244
49220 1077244 1076199 1074503 1072241 1070195 1069317 1070024 1071879 1073966 1075565 1076535 1077218 1078075 1079370 1081018 1082671
49205 1082671 1084005 1085011 1085979 1087202 1088706 1090271 1091612 1092560 1093241 1094195 1096155 1099468 1103738 1108212 1112482
49190 1112482 1116620 1120654 1124286 1127288 1129904 1132579 1135517 1138724 1142238 1145977 1149619 1153171 1157516 1163705
49176 1163705 1171577 1179688 1186951 1193778 1201187 1209281 1217281 1224787 1232353 1240756 1250227 1260441 1270821
49163 1270821 1280780 1290097 1299241 1309048 1319931 1331601 1343512 1355284 1366684 1377537 1387785 1397381
49151 1397381 1406125 1413911 1421173 1428749 1437178 1446448 1456425 1467087 1478159 1488955 1498868 1507786 1515935
49138 1515935 1523645 1531396 1539583 1547984 1555874 1563048 1570218 1578029 1586102 1593637 1600595 1607589 1614839 1621946
49124 1621946 1628658 1635114 1641236 1646594 1651134 1655479 1660162 1664942 1669207 1672639 1675181 1676679 1676966 1676124
49110 1676124 1674349 1671703 1668274 1664442 1660723 1657437 1654748 1652834 1651720 1651118 1650788 1651062 1652610 1655620 1659533
49095 1659533 1663662 1667808 1672124 1676662 1681355 1686280 1691628 1697377 1703137 1708342 1712510 1715437 1717318 1718690
49081 1718690 1720048 1721369 1722113 1721737 1720156 1717719 1714832 1711680 1708206 1704216 1699566 1694251 1688317 1681645
49067 1681645 1673965 1665217 1655776 1646161 1636511 1626518 1615839 1604451 1592604 1580620 1568745 1557028
49055 1557028 1545241 1533033 1520366 1507681 1495591 1484394 1474031 1464414 1455668 1447928 1441009 1434422
49043 1434422 1427747 1420952 1414327 1408262 1403167 1399387 1396864 1394900 1392607 1389770 1386972 1384726 1382850 1380944
49029 1380944 1379166 1377969 1377206 1376070 1373968 1371054 1367810 1364485 1361096 1357618 1354022 1350374 1347018 1344345
49015 1344345 1342304 1340475 1338731 1337505 1337184 1337582 1338245 1338937 1339622 1340297 1341119 1342430 1344366 1346700 1349274 1352184
48999 1352184 1355261 1357724 1358869 1358842 1358386 1358097 1358347 1359511 1361618 1363934 1365581 1366602 1367861 1369863 1372178
48984 1372178 1373985 1374700 1374099 1372519 1371126 1371329 1373573 1377075 1380981 1385316 1390488 1396350 1402234 1407704 1412821
48969 1412821 1417801 1422777 1427901 1433392 1439430 1446090 1453315 1460883 1468441 1475663 1482302 1488139 1493075 1497291
48955 1497291 1501132 1504791 1508245 1511454 1514372 1516828 1518838 1521058 1524447 1529257 1534735 1540114 1545526 1551667
48941 1551667 1558978 1567638 1578033 1590579 1605122 1621121 1638593 1658410 1681316 1706892 1733888 1761595
48929 1761595 1790589 1821957 1855903 1891434 1927463 1963913 2001457 2040335 2079910 2119434 2158796
48918 2158796 2198320 2238117 2277868 2316986 2354808 2390864 2425205 2458283 2490289 2520861 2549607
48907 2549607 2576660 2602418 2627027 2650478 2672977 2694802 2715962 2736439 2756668 2777210 2797962
48896 2797962 2818152 2837271 2855576 2873528 2891125 2908030 2924081 2939357 2953921 2967690 2980442
48885 2980442 2991739 3001024 3008064 3013273 3017325 3020359 3021641 3020067 3015003 3006610 2995440 2981760 2965345
48872 2965345 2945912 2923643 2899168 2873035 2845264 2815473 2783339 2748913 2712496 2674352 2634672
48861 2634672 2593898 2552867 2512390 2472720 2433691 2395364 2358252 2322821 2289122 2257048 2226666
48850 2226666 2198000 2170839 2145101 2121182 2099521 2079959 2061983 2045545 2031231 2019598 2010710
48839 2010710 2004258 1999727 1996478 1994185 1993310 1994687 1998401 2003534 2009232 2015548 2022871 2030932 2038998 2046820
48825 2046820 2054795 2063151 2071514 2079565 2087746 2096927 2107396 2118453 2129090 2138950 2148479 2158244 2168362
48812 2168362 2178663 2189085 2199643 2210181 2220596 2231239 2242706 2255154 2268206 2281617 2295552
48801 2295552 2310066 2324855 2339900 2355891 2373415 2392008 2410580 2428692 2446801 2465330 2484130
48790 2484130 2502959 2521839 2540615 2558702 2575725 2592115 2608595 2625262 2641591 2657254 2672427
48779 2672427 2687198 2701029 2713079 2722937 2730893 2737587 2743504 2748708 2752834 2755241 2755315 2752805 2747948 2741146
48765 2741146 2732464 2721550 2708164 2692716 2676069 2658797 2640857 2621994 2602220 2581741 2560680
48754 2560680 2539134 2517448 2496149 2475618 2455996 2437372 2419828 2403291 2387589 2372774 2359269
48743 2359269 2347602 2338099 2330842 2325738 2322544 2320971 2320828 2321953 2324008 2326602 2329738 2333870 2339298 2345818
48729 2345818 2353218 2361822 2371985 2383117 2393767 2402841 2410423 2417328 2424256 2431572 2439462 2447947 2456935
48716 2456935 2466514 2476951 2488145 2499388 2510111 2520683 2532023 2544457 2557355 2569866 2581665
48705 2581665 2592909 2603868 2614666 2625094 2634574 2642591 2649278 2655259 2660842 2665653 2669233 2671635 2673178
48692 2673178 2673833 2673241 2671251 2668204 2664617 2660672 2655984 2649899 2642153 2633223 2623854 2614279 2604132 2593068
48678 2593068 2581089 2568225 2554448 2540149 2526155 2512848 2499648 2485844 2471605 2457616 2444029
48667 2444029 2430440 2416735 2403242 2390016 2376662 2363000 2349268 2335475 2321117 2305820 2289715
48656 2289715 2272826 2254612 2234534 2212659 2189266 2164303 2137778 2110358 2082904 2055584 2028029
48645 2028029 2000264 1972808 1945834 1918945 1891963 1865377 1839706 1814884 1790631 1767032 1744332
48634 1744332 1722427 1700939 1679650 1658552 1637686 1617283 1597947 1580210 1563869 1548086 1532287
48623 1532287 1516717 1502144 1489198 1477980 1467931 1458078 1447785 1437461 1428163 1420296 1413047 1405505
48611 1405505 1397993 1391727 1387189 1383482 1379500 1375316 1372071 1370696 1371063 1372258 1373405 1374227 1375066 1376460 1378607
48596 1378607 1381179 1383608 1385507 1386868 1388067 1389714 1392256 1395558 1399069 1402563 1406535 1411579 1417573 1423818
48582 1423818 1429832 1435593 1441018 1445694 1449261 1451668 1452820 1452403 1450370 1447392 1444417 1441861 1439479 1436964
48568 1436964 1434365 1431955 1429947 1428403 1427259 1426374 1425608 1424810 1423689 1421880 1419346 1416559 1414021 1411666 1409032
48553 1409032 1405975 1402916 1400296 1398132 1396204 1394431 1392846 1391422 1390153 1389231 1388873 1388960 1388991 1388510 1387597 1386963
48537 1386963 1387546 1389851 1393573 1397875 1402073 1406073 1410272 1415218 1421344 1428790 1437288 1446313 1455429 1464463
48523 1464463 1473357 1482040 1490585 1499262 1508260 1517461 1526712 1536207 1546340 1557179 1568291 1579094 1589145
48510 1589145 1598124 1605880 1612602 1618704 1624331 1629231 1633344 1637298 1641917 1647258 1652505 1656893 1660357 1663142
48496 1663142 1665198 1666352 1666856 1667241 1667595 1667426 1666397 1664809 1663108 1661212 1658707 1655540 1652063 1648417 1644260
48481 1644260 1639240 1633473 1627382 1621301 1615397 1609763 1604308 1598608 1592054 1584245 1575194 1565268 1555049 1545160
48467 1545160 1536020 1527648 1519677 1511557 1502855 1493621 1484525 1476357 1469116 1461803 1453482 1444506 1436274 1429716
48453 1429716 1424379 1419181 1413596 1407775 1401841 1395646 1389197 1382780 1376512 1370153 1363620 1357370 1351934 1347222
48439 1347222 1342629 1337748 1332652 1327473 1322065 1316205 1309863 1303107 1295916 1288315 1280563 1273004 1265773 1258755
48425 1258755 1251807 1244857 1237904 1231059 1224488 1218080 1211239 1203292 1194262 1185023 1176522 1168861 1161235 1152741
48411 1152741 1143232 1133414 1124159 1115701 1107500 1098875 1089659 1080216 1071003 1062313 1054329 1047114 1040452 1033871
48397 1033871 1026968 1019658 1012172 1004940 998413 992725 987494 982113 976256 969945 963241 956236 949335 943081
48383 943081 937519 932175 926898 922314 919089 917075 915615 914392 913517 912961 912477 912028 911833 911950 912255 912755
48367 912755 913449 913883 913408 912033 910490 909249 907933 906015 903597 901099 898536 895623 892349 888957 885414
48352 885414 881435 877058 872833 869304 866506 864097 861775 859514 857495 855873 854541 853161 851495 849655
48338 849655 847961 846594 845474 844308 842647 840083 836701 833221 830405 828383 826829 825702 825413 826171 827573
48323 827573 829065 830621 832634 835261 838093 840522 842365 844083 846351 849351 852568 855397 857853 860454
48309 860454 863526 866921 870427 874015 877522 880517 882802 884756 886788 888723 890168 891269 892566 894136
48295 894136 895421 896052 896333 896692 897086 897297 897483 897980 898692 899118 899038 898936 899609 901442 904177 907385 911119
48278 911119 915893 921835 928072 933356 937338 940762 944341 947946 951193 954241 957410 960396 962584 963987
48264 963987 965201 966439 967267 967432 967334 967503 968055 968890 969945 971027 971850 972538 973683 975632 978037 980410
48248 980410 982767 985400 988342 991382 994249 996490 997500 997063 995621 993630 990972 987351 982882 977730
48234 977730 971557 963999 955524 947155 939363 931844 924299 916798 909315 901574 893549 885601 877899 870100
48220 870100 861791 852958 843919 835094 826772 818714 810016 799894 788640 777219 765918 754089 741468
48207 741468 728929 717481 707048 696863 686642 676771 667565 658958 650915 643623 637189 631420 626031
48194 626031 621008 616718 613591 611610 610203 608887 607891 607892 609308 612320 617387 624992 634843 646151 659087
48179 659087 675452 697673 727697 766932 816307 875922 945423 1025208 1116577 1220258 1335588
48168 1335588 1460834 1591406 1715203 1811220 1857220 1841815 1769940 1657656 1523217 1382081
48158 1382081 1245974 1122554 1015109 923732 847278 784250 732789 691033 657579 631136 609950
48147 609950 592231 577077 564483 554467 546556 540062 534498 529720 525894 523306 521994 521599 521649 521855
48133 521855 522146 522697 523993 526458 529855 533436 536835 540309 543805 546418 547359 547062 546677 546697 546777 546754 547112
48116 547112 548353 550525 553571 557602 562579 568124 573918 580047 586738 594018 601886 610539 620123 630347
48102 630347 640665 650781 660723 670501 680041 689593 699866 711385 723814 736283 748422 760725
48090 760725 773698 787076 800174 812798 825302 837866 850257 862347 874341 886228 897405
48079 897405 907174 915400 922475 928875 934946 940810 946180 950449 953259 954892 955897 956450 956305 955247 953399
48064 953399 951187 949048 946952 944134 939711 933821 927781 922730 918418 913777 908352 902572 896745 890409
48050 890409 882821 873628 863002 851518 839995 829051 818613 808120 797261 786186 775015 763512
48038 763512 751471 739062 726614 714295 702167 690249 678335 665946 652745 638879 624771
48027 624771 610759 597079 583991 571666 560050 549021 538602 528853 519638 510729 502147 494229
48015 494229 487292 481338 476133 471535 467684 464834 463029 462023 461505 461265 461062 460557 459638 458704 458345 458719
47999 458719 459517 460542 461978 463974 466266 468445 470395 472291 474279 476325 478300 480054 481518 482773
47985 482773 483948 484999 485717 486080 486369 486788 487142 487009 486098 484354 482005 479668 478044 477128 475972 473674
47969 473674 470459 467268 464395 461130 456925 452232 447898 444186 440888 438052 436017 434745 433645 432157
47955 432157 430202 428022 425917 424189 423097 422650 422634 422967 423919 425879 429028 433253 438164 443119 447462
47940 447462 450943 453873 456759 459829 462934 465731 467907 469413 470554 471661 472511 472305 470438 467080 462833
47925 462833 458035 452729 447100 441479 435964 430365 424565 418600 412345 405504 398030 390310 382826 375843
47911 375843 369486 363865 359038 355028 351945 349900 348874 348840 349868 351740 353652 354878 355819 357779 361481
47896 361481 366360 371538 376965 383165 390366 398375 406949 415817 424624 433283 442093 451035 459374 466547
47882 466547 473126 480178 487794 494878 500378 504091 506353 507638 508503 509307 509770 509320 507885 505818 503038
47867 503038 499036 493911 488631 483847 479095 473638 467606 461780 456673 452373 448920 446262 444043 441941
47853 441941 440020 438378 436736 434929 433562 433497 434710 436220 437255 437983 438999 440588 442694 445168 447714
47838 447714 449834 451105 451520 451436 451386 451897 453203 454926 456273 456752 456551 456091 455387 454093 452056 449524 446783
47821 446783 443843 440559 436924 433100 429273 425567 422094 418999 416470 414672 413603 412982 412348 411465 410644
47806 410644 410576 411791 414348 418023 422608 427940 433820 440074 446634 453429 460279 467109 474186 481888 490254
47791 490254 498919 507464 515559 522775 528686 533424 537840 542714 547854 552299 555472 557793 559991 562021
47777 562021 562998 562221 560045 557538 555392 553383 550908 547755 544204 540608 537160 533988 531174 528629 526166
47762 526166 523807 521845 520566 520039 520165 520711 521264 521447 521376 521760 523362 526417 530625 535603 541111 546933
47746 546933 552726 558164 563252 568501 574669 582194 590899 600279 609986 619899 629836 639558 649075 658697
47732 658697 668651 678749 688449 697079 704038 709148 712872 715925 718509 720169 720438 719331 717052 713537
47718 713537 708540 701940 693756 684076 673128 661152 648008 633311 617258 600932 585355 570512
47706 570512 555882 541665 528832 517979 508809 500957 494758 490813 489168 489246 490423 492440 495429 499685
47692 499685 505302 511885 518822 526005 534044 543550 554332 565529 576393 586675 596370 605457 614027
47679 614027 622371 630641 638474 645153 650174 653590 655728 656689 656192 653852 649552 643600 636625 629240 621662
47664 621662 613660 605043 596155 587707 580056 572875 565669 558419 551543 545416 540178 535893 532591 530116
47650 530116 528115 526270 524492 522927 521822 521265 520953 520355 519265 518017 516916 515590 513310 509974 506336
47635 506336 503068 499902 496026 491201 486106 481538 477533 473514 469154 464763 460731 456909 452914 448975
47621 448975 446014 444638 444344 444036 443165 442074 441322 441066 441175 441599 442352 443255 443874 443788 442911 441479 439622
47604 439622 436926 432600 426268 418529 410505 402831 395236 387110 378307 369334 360934 353603 347465 342433
47590 342433 338390 335185 332617 330571 329123 328289 327697 326818 325613 324665 324547 325351 326925 329094 331307 332526
47574 332526 332127 330762 329751 329662 329886 329552 328330 326365 324005 321724 319855 318210 316320 314065 311640
47559 311640 308903 305421 301316 297424 294232 291279 288030 284827 282337 280429 278326 275672 272890 270483
47545 270483 268530 266899 265556 264580 264120 264287 264848 265129 264628 263640 262936 262834 262924 262657 261799 260388 258747
47528 258747 257638 257879 259513 261621 263149 263747 263753 263779 264508 266467 269573 273080 276301 279232 282241 285370
47512 285370 288325 291053 293865 296979 300306 303769 307488 311457 315330 318767 321865 324988 328176 330915
47498 330915 332516 332618 331332 329096 326503 324179 322575 321688 320986 319729 317484 314374 310898 307565 304674
47483 304674 302317 300510 299410 299428 300924 303597 306366 308167 308880 309281 310100 311424 312986 314592 316054
47468 316054 317103 317745 318421 319446 320447 320734 320069 318761 317185 315728 314993 315399 316551 317639 318626 320397
47452 320397 323459 327170 330673 333989 337585 341394 345032 348685 352989 358074 363459 368922 374862 381677
47438 381677 389358 397834 407128 416937 426604 435806 444908 454328 463920 473260 482182 490653 498440 505307
47424 505307 511412 517114 522399 526765 529670 530935 530720 529289 526792 523163 518234 511976 504613 496520
47410 496520 488050 479441 470784 462178 454010 446870 440890 435405 429738 424248 420015 417427 415717 414119
47396 414119 412845 412515 413190 414533 416539 419497 423400 427938 432959 438474 444332 450376 456774 463720 470906
47381 470906 477791 484373 491132 498150 504846 510728 515879 520404 523854 525525 525092 522669 518556 513192
47367 513192 507077 500326 492401 482710 471515 459959 449064 438904 428871 418531 407996 397575
47355 397575 387431 377678 368578 360306 352648 345254 338245 332219 327513 323747 320285 316899 313706 310722
47341 310722 307873 305409 303864 303488 303927 304522 304831 304878 305094 305962 307553 309380 310850 311843 312781 314244 316611
47324 316611 319811 323122 325437 326155 325828 325570 325865 326267 326208 325608 324581 323076 321037 318613 315918 312833
47308 312833 309314 305707 302529 300064 298308 297122 296283 295610 295210 295389 296149 296973 297359 297404 297649 298500 300062
47291 300062 302382 305526 309360 313556 317875 322476 327923 334809 343115 351869 359756 366345 372474 379260
47277 379260 386979 395227 403778 412662 421566 429866 437342 444301 450750 456026 459617 461873 463433 464288
47263 464288 463960 462433 460247 457709 454631 451040 447593 444858 442537 439817 436339 432462 428753 425590
47249 425590 423210 421633 420427 418961 417104 415429 414522 414339 414443 414635 415086 416019 417589 419964 423237 427302
47233 427302 432056 437622 444075 451082 458269 465899 474684 484743 495210 505117 514297 523103 531637 539675
47219 539675 547040 553555 558761 562241 564209 565272 565515 564320 561238 556581 550896 544342 536968 529248
47205 529248 521768 514526 507016 499055 491074 483589 476784 470739 465680 461735 458718 456411 454922 454610
47191 454610 455820 458778 463449 469264 475351 481410 488187 496676 507002 518494 530691 543702 557534
47178 557534 571761 586161 601191 617321 634129 650400 665018 677546 688145 697281 705442 712756
47166 712756 718859 723255 725715 726230 724824 721687 717307 712125 706159 699293 691769 683919 675525 665986
47152 665986 655312 644518 634726 626205 618502 611246 604503 598495 593343 589085 585745 583348 581948 581636
47138 581636 582411 584044 586085 588029 589536 590673 591942 593941 596879 600535 604669 609304 614514 620163
47124 620163 626036 632099 638338 644322 649166 652123 653234 653269 652957 652295 650661 647545 642915 636871 629273
47109 629273 620058 609715 598980 588027 576429 564070 551630 539800 528317 516351 503842 491926
47097 491926 481877 473953 467558 462231 457954 454537 451241 447406 443222 439460 436549 434293 432478 431205
47083 431205 430426 429627 428494 427640 428174 430562 434211 438111 441526 444162 446166 448086 450468 453350 456355
47068 456355 459287 462264 465288 468147 470914 474081 477869 481714 484785 486846 488376 489977 491896 493958
47054 493958 495741 496946 497771 498824 500584 503104 506328 510364 515265 520780 526547 532310 537703 542185
47040 542185 545600 548664 552488 557621 563783 570411 577146 583826 590337 596561 602391 607890 613579 620308
47026 620308 628493 637501 646140 653772 660751 667751 674936 681885 688201 694024 699895 705980 711511 715269
47012 715269 716741 716525 715526 714158 712584 711184 710129 708793 706315 702830 699491 697200 695768 694483 692987
46997 692987 691378 689857 688605 687788 687427 687456 687999 689347 691531 694222 697164 700471 704306 708584 713172
46982 713172 718097 723309 728456 733245 737845 742632 747644 752601 757438 762532 768266 774557 780826 786412
46968 786412 791014 794830 798246 801288 803480 804380 804228 803867 803917 804194 804119 803581 803042 802711 802025 800381 798229
46951 798229 796833 796794 797416 797857 798372 799807 802183 804561 806289 807731 809596 812127 815169 818604 822451
46936 822451 826786 831718 837069 842078 845935 848880 852219 856946 862798 869046 875621 882842 890415 897589
46922 897589 904284 911245 918927 926752 933792 939772 944990 949487 952722 954083 953499 951391 948111 943629
46908 943629 937885 931332 924871 919191 914409 910463 907552 905929 905512 906099 907955 911813 918201 926895 937033
46893 937033 947681 958406 969498 981634 995152 1009694 1024523 1038972 1052473 1064522 1075043
46882 1075043 1084590 1093765 1102483 1110125 1116321 1121188 1124880 1127369 1128752 1129398 1129773 1130441 1132227 1135817 1141046
46867 1141046 1146996 1153021 1159282 1166117 1173352 1180638 1188101 1196206 1205054 1214182 1223018 1231343 1239324 1247203
46853 1247203 1254860 1261607 1266589 1269408 1270209 1269221 1266653 1263045 1259095 1254837 1249536 1242801 1235275 1227697
46839 1227697 1219826 1211120 1202095 1194101 1187804 1182804 1178770 1176011 1174654 1174178 1174320 1175725 1179083 1184124
46825 1184124 1190120 1196978 1205176 1214856 1225639 1237239 1249658 1262800 1276382 1290201 1304021 1317210
46813 1317210 1329009 1339237 1348269 1356236 1362722 1367337 1370129 1371147 1370122 1366931 1362059 1356199 1349600
46800 1349600 1342162 1333997 1325471 1316724 1307606 1298130 1288821 1280444 1273567 1268328 1264424 1261310 1258600 1256407
46786 1256407 1255146 1254986 1255610 1256592 1257833 1259546 1261941 1265117 1269131 1273977 1279466 1285338 1291585 1298462 1306057
46771 1306057 1313950 1321590 1328946 1336516 1344574 1352739 1360513 1368012 1375813 1384198 1393015 1402276 1412413 1423602
46757 1423602 1435171 1446115 1456155 1465980 1476491 1487967 1499979 1511840 1523063 1533516 1543229 1552038
46745 1552038 1559506 1565302 1569549 1572585 1574464 1574966 1574095 1572287 1569997 1567426 1564772 1562448 1560687 1559199
46731 1559199 1557690 1556669 1557296 1560244 1565171 1571464 1579049 1588034 1597886 1607596 1616685 1625446 1634063 1642020
46717 1642020 1648707 1654121 1658500 1661544 1662592 1661463 1658538 1653932 1647083 1637370 1624830 1610063 1593746
46704 1593746 1576393 1558300 1539451 1519643 1498901 1477654 1456337 1435001 1413479 1391767 1370020
46693 1370020 1348330 1326737 1305377 1284499 1264370 1245162 1226776 1208768 1190755 1173080 1156733
46682 1156733 1142415 1129910 1118561 1108000 1098101 1088593 1079316 1070737 1063710 1058650 1055247 1052887 1051080
46669 1051080 1049654 1048943 1049686 1052314 1056423 1061371 1067209 1074486 1083204 1092633 1102200 1111838 1121236 1129439
46655 1129439 1135631 1139879 1142720 1144432 1145071 1144789 1143634 1141324 1137635 1132825 1127344 1121414 1115242 1109404
46641 1109404 1104520 1100696 1097670 1095431 1094312 1094551 1096135 1099079 1103638 1110220 1119232 1130817 1144527 1159382
46627 1159382 1174479 1189409 1203965 1217785 1230614 1242523 1253373 1262351 1268608 1272209 1273826 1273565
46615 1273565 1270795 1265217 1257373 1247810 1236394 1222948 1208135 1193128 1178552 1164161 1149507 1134610
46603 1134610 1119952 1106068 1093151 1080974 1069162 1057618 1046616 1036484 1027363 1019335 1012573 1007135
46591 1007135 1002643 998353 993595 988192 982488 976959 971723 966427 960722 954764 949070 943855 938783 933443
46577 933443 927873 922459 917494 913060 909229 906110 903661 901632 899804 898247 897275 897113 897667 898686 900141
46562 900141 902275 905243 908818 912623 916530 920681 925203 930178 935835 942459 950001 957974 965886 973690
46548 973690 981769 990580 1000292 1010586 1020793 1030473 1039970 1050218 1061933 1075122 1089417 1104684
46536 1104684 1121128 1138921 1157857 1177391 1197034 1216819 1237319 1259106 1282249 1306449 1331511
46525 1331511 1357388 1383909 1410883 1438409 1466589 1494819 1521914 1547179 1570898 1593440 1614370
46514 1614370 1632902 1648860 1662603 1674205 1683360 1690028 1694632 1697485 1698400 1697044 1693413 1687882 1681064
46501 1681064 1673648 1666051 1658113 1649354 1639715 1629838 1620440 1611481 1602054 1591169 1578669 1565339 1552003
46488 1552003 1538546 1524128 1508356 1491746 1474763 1456952 1437559 1416618 1394697 1371791 1347327
46477 1347327 1321279 1294454 1267447 1240151 1212659 1185886 1160715 1137139 1114883 1094404 1076503
46466 1076503 1061313 1048403 1037798 1030045 1025266 1022809 1022065 1023091 1026206 1031416 1038459 1047000 1056512
46453 1056512 1066307 1076031 1085946 1096404 1107142 1117311 1126130 1133294 1138764 1142426 1144101 1143871 1142160
46440 1142160 1139390 1135654 1130912 1125438 1119711 1113801 1107365 1100533 1094378 1089965 1087195 1085199 1083771 1083746
46426 1083746 1085981 1090656 1097737 1107440 1119830 1134474 1150962 1169387 1189937 1212328 1236107 1261256
46414 1261256 1288099 1316754 1347011 1378545 1410854 1443141 1474662 1505097 1534314 1561916 1587323
46403 1587323 1610128 1630040 1646684 1659768 1669319 1675386 1677741 1676236 1671202 1663005 1651476 1636475
46391 1636475 1618843 1600048 1580767 1560530 1538969 1516737 1494857 1473799 1453696 1434996 1418283
46380 1418283 1403581 1390390 1378485 1368475 1361514 1358495 1359399 1363469 1370199 1380057 1393905 1411803 1432913
46367 1432913 1456640 1483271 1513302 1546768 1583630 1624183 1668422 1715334 1763455 1812033 1861167
46356 1861167 1910949 1960929 2010301 2058157 2103534 2145539 2183414 2216292 2243152 2263328 2276868
46345 2276868 2283985 2284407 2277681 2263889 2243529 2216901 2184287 2146702 2105788 2062734 2017820 1971135
46333 1971135 1923258 1875010 1827098 1780311 1735685 1694077 1655757 1620618 1588638 1559957 1534713
46322 1534713 1513052 1495187 1481355 1471717 1466198 1464303 1465202 1468421 1474374 1483830 1496858 1512759 1531060
46309 1531060 1551921 1575264 1600086 1625219 1650464 1676460 1703581 1731430 1759379 1787116 1814469
46298 1814469 1840970 1865871 1888582 1909010 1927382 1943676 1957295 1967396 1973518 1975783 1974537 1970069
46286 1970069 1962617 1952355 1939279 1923386 1905043 1885017 1864091 1842884 1822015 1802038 1783145
46275 1783145 1765297 1748821 1734499 1722854 1713744 1706922 1702555 1700844 1701466 1703841 1707716 1713072 1719629
46262 1719629 1726915 1734721 1743161 1752283 1761975 1772112 1782396 1792022 1799916 1805462 1808827 1810560 1811025 1810167
46248 1810167 1807585 1802751 1795340 1785433 1773389 1759571 1744159 1727092 1708158 1687424 1665649 1643973
46236 1643973 1623006 1602543 1582308 1562538 1543494 1524915 1506566 1488978 1472932 1458369 1444519
46225 1444519 1431108 1418738 1407957 1398627 1390434 1383452 1377832 1373411 1369972 1367624 1366577 1366865 1368495
46212 1368495 1371517 1375646 1380138 1384495 1389101 1394775 1401738 1409402 1417143 1424915 1433012 1441500 1450049 1458197
46198 1458197 1465654 1472380 1478476 1484028 1489043 1493470 1497225 1500214 1502438 1504113 1505619 1507202 1508748 1509911
46184 1509911 1510578 1511208 1512527 1514764 1517340 1519638 1522036 1525758 1531580 1539022 1547049 1555112 1563175 1571128
46170 1571128 1578847 1586687 1595297 1604848 1614930 1625269 1636130 1647825 1660205 1672838 1685427 1697901
46158 1697901 1710277 1722529 1734429 1745544 1755612 1764868 1773795 1782652 1791475 1800309 1808972 1816872 1823626
46145 1823626 1829733 1835918 1841868 1846438 1849237 1851106 1852738 1853678 1853163 1851151 1847869 1843117 1836831 1829776
46131 1829776 1822786 1815667 1807727 1799084 1790534 1782245 1773537 1763991 1753968 1743889 1733771 1723683 1713999
46118 1713999 1704883 1696032 1687211 1678644 1670648 1663290 1656560 1650467 1644749 1638969 1633136 1627799 1623247 1619041
46104 1619041 1614720 1610667 1607759 1606288 1605574 1604628 1602976 1600857 1598801 1597050 1595423 1593810 1592657 1592517 1593119
46089 1593119 1593418 1592891 1592377 1593108 1595169 1597484 1599280 1600989 1603529 1607136 1611282 1615467 1619676 1624075 1628636
46074 1628636 1633247 1637970 1642970 1648284 1653926 1660111 1667048 1674444 1681618 1688358 1695394 1703671 1713311 1723575
46060 1723575 1733718 1743564 1753408 1763763 1775184 1787912 1801624 1815795 1830259 1845087 1860067 1874835
46048 1874835 1889445 1904159 1918623 1932002 1944188 1956089 1968220 1979779 1989846 1998884 2008082 2017522
46036 2017522 2026026 2032784 2038183 2042844 2046766 2049811 2052283 2054536 2056559 2058447 2060671 2063223 2064903 2064325
46022 2064325 2061533 2057873 2054245 2050234 2045146 2039165 2032955 2026613 2019727 2012248 2004695 1997442 1990324 1983110
46008 1983110 1975985 1969281 1963069 1957257 1951913 1947149 1942819 1938664 1934706 1931186 1928090 1925050 1921874 1918884
45994 1918884 1916607 1915237 1914540 1914128 1913667 1912961 1912071 1911369 1911345 1912287 1914061 1916065 1917423 1917492 1916342 1914565 1912482
45977 1912482 1909821 1906479 1903275 1901367 1900866 1900599 1899528 1898031 1897326 1897903 1899078 1900101 1901187 1903204 1906658
45962 1906658 1911380 1917003 1923283 1929911 1936469 1942896 1949777 1957867 1967320 1977628 1988239 1998998 2009955
45949 2009955 2021069 2032296 2043864 2056219 2069711 2084367 2099875 2115737 2131555 2147310 2163339
45938 2163339 2179977 2197275 2215079 2233141 2250968 2267743 2282770 2296110 2308588 2321009 2333412
45927 2333412 2345162 2355616 2364591 2372244 2378763 2384281 2389005 2393252 2397306 2401268 2405049 2408467 2411340
45914 2411340 2413571 2415125 2415855 2415462 2413855 2411604 2409692 2408594 2407813 2406556 2404653 2402449 2400005 2396956 2393181
45899 2393181 2389071 2385023 2381143 2377620 2374819 2372655 2370373 2367530 2364841 2363479 2363655 2364461 2364957 2364833 2364020
45884 2364020 2362378 2360023 2357464 2355100 2352859 2350539 2348159 2345748 2343066 2339884 2336263 2332280 2327705 2322296
45870 2322296 2316218 2309767 2302760 2294654 2285288 2275099 2264411 2252901 2240068 2226048 2211620 2197428
45858 2197428 2183456 2169286 2154603 2139300 2123321 2106686 2089643 2072660 2056173 2040444 2025613
45847 2025613 2011775 1998925 1986940 1975633 1964855 1954600 1945093 1936656 1929292 1922476 1915635 1908762
45835 1908762 1902320 1896556 1891244 1886180 1881456 1877100 1872845 1868563 1864526 1860838 1856953 1852226 1846763 1841265
45821 1841265 1836154 1831345 1826740 1822398 1818238 1814111 1810179 1806727 1803506 1799748 1794990 1789459 1783578 1777590
$$ [...]
##END NTUPLES=NMR SPECTRUM
##END=
