##TITLE=NES1038_872015070_9266380_ttNlsKnYZi
##JCAMPDX= 6.0         $$ Bruker NMR JCAMP-DX V2.0
##DATA TYPE= NMR SPECTRUM
##DATA CLASS= NTUPLES
##ORIGIN= BRUKER
##OWNER= Administrator
$$ 1.72 TOPSPIN		Version 2.1
$$ 2015-07-09 18:09:58.097 -0700  Administrator@X
$$ Compression mode = diff/dup
##.OBSERVE FREQUENCY= 400.02188249412
##.OBSERVE NUCLEUS= ^1H
##.ACQUISITION MODE= SIMULTANEOUS (DQD)
##.ACQUISITION SCHEME= undefined
##.AVERAGES= 64
##.DIGITISER RES= 22
##SPECTROMETER/DATA SYSTEM= spect
##.PULSE SEQUENCE= noesygpps1d.comp
##.SOLVENT NAME= COFFEE_meoh
##.SHIFT REFERENCE= INTERNAL, COFFEE_meoh, 1, 14.96335
##AUDIT TRAIL= $$ (NUMBER, WHEN, WHO, WHERE, PROCESS, VERSION, WHAT)
$$ ##TITLE= Audit trail, TOPSPIN		Version 2.1
$$ ##JCAMPDX= 5.01
$$ ##ORIGIN= Bruker BioSpin GmbH
$$ ##OWNER= Administrator
$$ $$ E:\/data/COFFEE/nmr/NES1038_872015070_9266380_ttNlsKnYZi/12/pdata/1/auditp.txt
$$ ##AUDIT TRAIL=  $$ (NUMBER, WHEN, WHO, WHERE, PROCESS, VERSION, WHAT)
(   1,<2015-07-09 18:09:51.972 -0700>,<Administrator>,<X>,<go>,<TOPSPIN 2.1>,
      <created by zg
	started at 2015-07-09 17:58:22.206 -0700,
	POWCHK enabled, PULCHK disabled,
       configuration hash MD5:
       21 0F 79 D6 B3 7B B4 F6 88 20 88 DB 03 48 BD 9F
       data hash MD5: 64K
       D9 42 EF 20 62 68 92 2F AA E3 74 9A 9A CA 2B D6>)
(   2,<2015-07-09 18:09:56.003 -0700>,<Administrator>,<X>,<proc1d>,<TOPSPIN 2.1>,
      <Start of raw data processing
       efp LB = 0.3 FT_mod = 6 PKNL = 1 PHC0 = 0 PHC1 = 0 SI = 128K 
       data hash MD5: 128K
       C5 49 0E 76 5B F3 1F CA E9 05 A9 D8 26 91 16 E3>)
(   3,<2015-07-09 18:09:56.894 -0700>,<Administrator>,<X>,<proc1d>,<TOPSPIN 2.1>,
      <pk PHC0 = -86.92932 PHC1 = 0 
       data hash MD5: 128K
       7A B5 4B AF D0 67 DB 47 15 69 55 91 1B 89 E0 32>)
(   4,<2015-07-09 18:09:57.285 -0700>,<Administrator>,<X>,<proc1d>,<TOPSPIN 2.1>,
      <abs ABSG = 1 
       data hash MD5: 128K
       96 2D B5 D6 01 3E F5 6D 40 4E B4 25 BD 3B EF 17>)
(   5,<2015-07-09 18:09:57.378 -0700>,<Administrator>,<X>,<proc1d>,<TOPSPIN 2.1>,
      <abs ABSG = 2 
       data hash MD5: 128K
       93 7A D8 38 45 8C 86 18 21 6A 7E 2B 3C 8D 42 84>)
(   6,<2015-07-09 18:09:57.472 -0700>,<Administrator>,<X>,<proc1d>,<TOPSPIN 2.1>,
      <abs ABSG = 3 
       data hash MD5: 128K
       76 5C 14 66 FE 32 2A 02 66 1A 14 FD 7C 80 32 B5>)
(   7,<2015-07-09 18:09:57.550 -0700>,<Administrator>,<X>,<proc1d>,<TOPSPIN 2.1>,
      <abs ABSG = 4 
       data hash MD5: 128K
       5D D7 3F 17 50 68 FF B8 3E 30 5D 74 59 A5 0B 3A>)
(   8,<2015-07-09 18:09:57.675 -0700>,<Administrator>,<X>,<proc1d>,<TOPSPIN 2.1>,
      <abs ABSG = 5 
       data hash MD5: 128K
       40 0D 59 E2 1F 18 4F 9F 7F 5B 5A CB 9E D6 8A D2>)
$$ ##END=
$$ 
$$ $$ hash MD5
$$ $$ C3 7E F8 A2 82 E7 78 39 70 55 23 0D 3B DA BD 2F
##$RELAX= 
##$RELAX= 
##$RELAX= 
##$RELAX= 
##$RELAX= 
##$RELAX= 
##$RELAX= 
##$RELAX= 
$$ Bruker specific parameters
$$ --------------------------
##$DU= <E:\>
##$EXPNO= 12
$$ [...]
##$TP07= 0
##$TPNAME0= <>
##$TPNAME1= <>
##$TPNAME2= <>
##$TPNAME3= <>
##$TPNAME4= <>
##$TPNAME5= <>
##$TPNAME6= <>
##$TPNAME7= <>
##$TPOAL= (0..7)
0.5 0.5 0.5 0.5 0.5 0.5 0.5 0.5
##$TPOFFS= (0..7)
0 0 0 0 0 0 0 0
##$TUNHIN= 0
##$TUNHOUT= 0
##$TUNXOUT= 0
##$USERA1= <user>
##$USERA2= <user>
##$USERA3= <user>
##$USERA4= <user>
##$USERA5= <user>
##$V9= 5
##$VALIST= <valist>
##$VCLIST= <CCCCCCCCCCCCCCC>
##$VD= 0
##$VDLIST= <DDDDDDDDDDDDDDD>
##$VPLIST= <PPPPPPPPPPPPPPP>
##$VTLIST= <TTTTTTTTTTTTTTT>
##$WBST= 2048
##$WBSW= 25
##$XGAIN= (0..3)
0 0 0 0
##$XL= 0
##$YL= 0
##$YMAX_a= 6463924
##$YMIN_a= -12863844
##$ZGOPTNS= <>
##$ZL1= 120
##$ZL2= 120
##$ZL3= 120
##$ZL4= 120
##$ABSF1= 14.96335
##$ABSF2= -5.594831
##$ABSG= 5
##$ABSL= 3
##$ALPHA= 0
##$AQORDER= 0
##$ASSFAC= 0
##$ASSFACI= 0
##$ASSFACX= 0
##$ASSWID= 0
##$AUNMP= <proc_prof1d_extract.lims>
##$AXLEFT= 0
##$AXNAME= <>
##$AXNUC= <1H>
##$AXRIGHT= 0
##$AXTYPE= 0
##$AXUNIT= <>
##$AZFE= 0.1
##$AZFW= 0.1
##$BCFW= 0
##$BC_mod= 0
##$BYTORDP= 0
##$COROFFS= 0
##$CY= 15
##$DATMOD= 1
##$DC= 0
##$DFILT= <>
##$DTYPP= 0
##$F1P= 0
##$F2P= 0
##$FCOR= 0.5
##$FTSIZE= 131072
##$FT_mod= 6
##$GAMMA= 0
##$GB= 0
##$INTBC= 1
##$INTSCL= 1
##$ISEN= 128
##$LB= 0.3
##$LEV0= 0
##$LPBIN= 0
##$MAXI= 10000
##$MC2= 0
##$MEAN= 0
##$ME_mod= 0
##$MI= 0
##$NCOEF= 0
##$NC_proc= -2
##$NLEV= 6
##$NOISF1= 0
##$NOISF2= 0
##$NSP= 0
##$NTH_PI= 0
##$NZP= 0
##$OFFSET= 14.96335
##$PC= 1
##$PHC0= -86.92932
##$PHC1= 0
##$PH_mod= 1
##$PKNL= yes
##$PPARMOD= 0
##$PPDIAG= 0
##$PPIPTYP= 0
##$PPMPNUM= 2147483647
##$PPRESOL= 1
##$PSCAL= 4
##$PSIGN= 0
##$PYNMP= <proc.py>
##$REVERSE= no
##$SF= 400.020008696098
##$SI= 131072
##$SIGF1= 0
##$SIGF2= 0
##$SINO= 400
##$SIOLD= 131072
##$SPECTYP= <>
##$SREGLST= <1H.CDCl3>
##$SSB= 0
##$STSI= 131072
##$STSR= 0
##$SW_p= 8223.68421052631
##$SYMM= 0
##$S_DEV= 0
##$TDeff= 65536
##$TDoff= 0
##$TI= <>
##$TILT= no
##$TM1= 0
##$TM2= 0
##$TOPLEV= 0
##$USERP1= <user>
##$USERP2= <user>
##$USERP3= <user>
##$USERP4= <user>
##$USERP5= <user>
##$WDW= 1
##$XDIM= 131072
##$YMAX_p= 416069174
##$YMIN_p= -11290
##$CURPLOT= <Network HP LaserJet P1505>
##$CURPRIN= <$Network HP LaserJet P1505>
##$DFORMAT= <normdp>
##$LAYOUT= <+/1D_H.xwp>
##$LFORMAT= <normlp>
##$PFORMAT= <normpl>
##$SURQMSG= 1
$$ End of Bruker specific parameters
$$ ---------------------------------
##NTUPLES= NMR SPECTRUM
##VAR_NAME=  FREQUENCY,     SPECTRUM/REAL,   SPECTRUM/IMAG
##SYMBOL=    X,             R,               I
##VAR_TYPE=  INDEPENDENT,   DEPENDENT,       DEPENDENT
##VAR_FORM=  AFFN,          ASDF,            ASDF
##VAR_DIM=   131072,        131072,          131072
##UNITS=     HZ,            ARBITRARY UNITS, ARBITRARY UNITS
##FACTOR=    0.0627417313425164, 1,          1
##FIRST=     8223.62146879497, -115,         -40889
##LAST=      0,             1048,            -40669
##MIN=       0,             -11290,          0
##MAX=       8223.62146879497, 416069174,    0
$$ Real data points
##PAGE= N=1
##DATA TABLE= (X++(R..R)), XYDATA
$$ [...]
63361D85204j981l930n746p193q216q913r267r180q839q665q698q418p375n889
63347C82894m841m823n538o009n513m389l762m250n208n575n182m594l965k884
63333C16361j470o35p67r79k81R69J607J245O12M55Q76J648K590L461M146M960
63317C34798O201P230O737M248R39j510k579k985l551m500n654o680p116o635
63303C18943n517m519m109m095m106m036l865l409k580j703j173r42o51k14P7
63288B78101M5j38k56k96k59n8K60L51o0q04j416j600j446j247j204j219r54j87
63270B67613Q76J762K299K698L081L226L010K753K771K875K748K593K895L622
63256C04822M182M256M161M284M545M714M821M972N130N290N658O364P215P980
$$ plain form
63361 485204 483223 479293 473547 466354 458138 449225 439958 430778 421939 413274 404576 396158 388783 382894
63347 382894 378053 373230 367692 361683 356170 351781 348019 343769 338561 332986 327804 323210 319245 316361
63333 316361 314891 314256 313489 312510 312229 313198 314805 316050 316662 317117 317993 319641 322231 325692 329838 334798
63317 334798 340999 348229 354966 359214 360153 358643 356064 353079 349528 345028 339374 332694 325578 318943
63303 318943 313426 308907 304798 300703 296597 292561 288696 285287 282707 281004 279831 278889 278238 278024 278101
63288 278101 278146 278008 277752 277456 277197 277139 277399 277750 277690 276886 275470 273870 272424 271177 269973 268754 267800 267613
63270 267613 268489 270251 272550 275248 278329 281555 284565 287318 290089 292964 295712 298305 301200 304822
63256 304822 309004 313260 317421 321705 326250 330964 335785 340757 345887 351177 356835 363199 370414 378394
63242C78394Q684R397J0012J0511J1178J2159J3089J3559J3780J4255J4981J5502
63230E25501J5753J6240J7281J8564J9676K0519K1015K0926K0283J9619J9333
63219G34710J9207J9004J9182K0404K2471K4208K4515K3135K0501J7163J3458
63208I57958R393M811k52n424j0361j4949j8872k1411k2255k2174k2192k2212
63196H12060k1295j9278j7077j5157j2796r419n807l074j102J071L688O077P831
63183G25722R335J1008J2761J4348J5706J6880J8035J9474K1150K2233K1835K0239
63171I28726J8812J8533J9186K0012K0510K0379J9375J7644J5787J4146J2350
63160A125460R824O452K486j774n992r850j3394j6968k0503k3214k4310k3774
$$ plain form
63242 378394 387078 396475 406487 416998 428176 440335 453424 466983 480763 495018 509999 525501
63230 525501 541254 557494 574775 593339 613015 633534 654549 675475 695758 715377 734710
63219 734710 753917 772921 792103 812507 834978 859186 883701 906836 927337 944500 957958
63208 957958 967351 972162 971910 966486 956125 941176 922304 900893 878638 856464 834272 812060
63196 812060 790765 771487 754410 739253 726457 717038 711231 708157 707055 708126 711814 717891 725722
63183 725722 735057 746065 758826 773174 788880 805760 823795 843269 864419 886652 908487 928726
63171 928726 947538 966071 985257 1005269 1025779 1046158 1065533 1083177 1098964 1113110 1125460
63160 1125460 1135284 1141736 1144222 1142448 1136456 1126606 1113212 1096244 1075741 1052527 1028217 1004443
63148A004443k2179k0051j7776j5686j3850j2028j0101q368p199o712p033q383
63136H55077j0476j2254j2829j2418j1804j1200j0204q676o982n478m326l727
63124G44703l665l544k705j346k68L32R82J800K095J550R47J099J617J534P35
63109G45866j7l13m48n59k68N29J163J051O07P44J638K563K877K644K208J664
63093G61949J110R29J399K134K413K005J353R72J056J617K531L313L376K730K183
63078G91070K430L237L772L542K784K076J892K394L364M375N230O134P307Q606
63064H48213R746J0632J1281J1684J2064J2940J4530J6258J7423J8223J9565K1927
63052A024486K4922K8012L1008L3674L5435L5957L5666L5336L5318L5410L5221
$$ plain form
63148 1004443 982264 962213 944437 928751 914901 902873 892772 884404 877205 870493 863460 855077
63136 855077 844601 832347 819518 807100 795296 784096 773892 765216 758234 752756 748430 744703
63124 744703 741038 737494 734789 733443 733175 733507 734489 736289 738384 739934 740881 741980 743597 745131 745866
63109 745866 745849 745536 745088 744529 744261 744790 745953 747004 747611 748355 749993 752556 755433 758077 760285 761949
63093 761949 763059 763988 765387 767521 769934 771939 773292 774264 775320 776937 779468 782781 786157 788887 791070
63078 791070 793500 796737 800509 804051 806835 808911 810803 813197 816561 820936 826166 832300 839607 848213
63064 848213 857959 868591 879872 891556 903620 916560 931090 947348 964771 982994 1002559 1024486
63052 1024486 1049408 1077420 1108428 1142102 1177537 1213494 1249160 1284496 1319814 1355224 1390445
63041A390445L4415L2776L0522K8450K7371K7355K7757K8022K8181K8432K8560
63030A712286K8091K6868K5159K3023J9841J4716P354j582j0931j9730k7530l4252
63018A763313l9932m4598m8301n1108n2856n2954n0791m6598m1635l7147l3228
63007A264165k9071k4165j8776j3311p916k775J833O101J0707J5842K0708K4435
62995A247777K7109K9332L1161L2139L2219L1953L1746L1487L0995L0397K9918
62984A586233K9502K8764K7225K4577K0910J6486J1242M833k656j0462j8003k5629
62972A693022l3924m2524n0233n6216o0413o2897o3591o2826o1470o0038n8068
62961A080822n4813n0366m5748m1926l8958l6225l3299l0358k7645k4959k2084
$$ plain form
63041 1390445 1424860 1457636 1488158 1516608 1543979 1571334 1599091 1627113 1655294 1683726 1712286
63030 1712286 1740377 1767245 1792404 1815427 1835268 1849984 1857338 1855756 1844825 1825095 1797565 1763313
63018 1763313 1723381 1678783 1630482 1579374 1526518 1473564 1422773 1376175 1334540 1297393 1264165
63007 1264165 1235094 1210929 1192153 1178842 1170926 1168151 1169984 1176085 1186792 1202634 1223342 1247777
62995 1247777 1274886 1304218 1335379 1367518 1399737 1431690 1463436 1494923 1525918 1556315 1586233
62984 1586233 1615735 1644499 1671724 1696301 1717211 1733697 1744939 1749772 1747116 1736654 1718651 1693022
62972 1693022 1659098 1616574 1566341 1510125 1449712 1386815 1323224 1260398 1198928 1138890 1080822
62961 1080822 1026009 975643 929895 887969 849011 812786 779487 749129 721484 696525 674441
62950F74441j9525j8039j7360j6223j4074j1936j0913j0629j0000q950q282q159
62938E20351p941p402p047p069o981o496n914n457n036m783n006n421n311m696
62924D35791m473m969n301m683l564k888k801k746k400j876j365j022r95j219
62910C95489j445j614j816j861j459j010j339k387k965k324j245r09j372j833
62896C71910j865j601j180p35o73j180j737j693j197r34j166j542j666j376o88
62881C52677O3L05n3k58L71J451K000J691J030M94J15j63l05l86n13n88n01m21
62863C57009n30o63n91m35m11l99k39j46l35n35m56m35r04j483j390o92l17p26
62845C46322j363j563j351r72l51N82J357J308L99n69o70K19J229J363O17p5r7
$$ plain form
62950 674441 654916 636877 619517 603294 589220 577284 566371 555742 545742 536792 528510 520351
62938 520351 512410 505008 497961 490892 483911 477415 471501 466044 461008 456225 451219 445798 440487 435791
62924 435791 431318 426349 421048 416365 412801 409913 407112 404366 401966 400090 398725 397703 396708 395489
62910 395489 394044 392430 390614 388753 387294 386284 384945 382558 379593 377269 376024 375115 373743 371910
62896 371910 370045 368444 367264 366529 365856 364676 362939 361246 360049 359115 357949 356407 354741 353365 352677
62881 352677 352740 353045 352992 352734 353105 354556 356556 358247 359277 359771 359886 359723 359418 359032 358519 357931 357430 357009
62863 357009 356479 355816 355225 354790 354379 353980 353741 353595 353260 352725 352269 351834 350930 349447 348057 347365 347048 346322
62845 346322 344959 343396 342045 341073 340722 341304 342661 343969 344368 343799 343129 343348 344577 345940 346557 346482 346385
62828C46385J52R4pM63J290J610J194P77R58J423J566J366J318J721K355K719
62812C65384K629K526L052M159N031N133M966N243N795N955N820O207P390Q728
62798D38018R731J0757J2240J3961J5472J6866J8619K0917K3510K6098K8607L1183
62786F65979L4020L7099M0164M3093M6129M9531N3082N6275N8855O0789O1815
62775A206831O1494N9656N6424N1817M5707L8076K8966J8319O444n540j6341k5627
62763A526226l3950m1614m8209n3330n6993n9221n9924n9405n8382n7209n5522
62752I42467n2932m9590m5877m2095l8599l5698l3169l0427k7387k4629k2495
62741E39569k0643j8755j7016j5496j3755j1540r364p834o882o131n508m933l920
$$ plain form
62828 346385 346537 346631 346624 347087 348377 349987 351181 351958 352916 354339 355905 357271 358589 360310 362665 365384
62812 365384 368013 370539 373591 377750 382781 387914 392880 398123 403918 409873 415693 421900 429290 438018
62798 438018 447749 458506 470746 484707 500179 517045 535664 556581 580091 606189 634796 665979
62786 665979 699999 737098 777262 820355 866484 916015 969097 1025372 1084227 1145016 1206831
62775 1206831 1268325 1327981 1384405 1436222 1481929 1520005 1548971 1567290 1573734 1568194 1551853 1526226
62763 1526226 1492276 1450662 1402453 1349123 1292130 1232909 1172985 1113580 1055198 997989 942467
62752 942467 889535 839945 794068 751973 713374 677676 644507 614080 586693 562064 539569
62741 539569 518926 500171 483155 467659 453904 442364 433000 425166 418284 412153 406645 401712 397792
62728C97792k227n46K27K74O88J998L533M388M565M880N933P464Q759R657J0815
62713D58200J2756J4935J6407J7356J9076K2224K5946K9194L2128L5479L9282
62702G22983M3132M7194N1888N6785O0856O3749O5877O7184O6811O4297O0221
62691A370977N5162M8686M0011K9218J7296N153o894j8704k9820l9563m7439n3406
62679A370677n7769o0820o2655o3271o2700o0944n8001n4172n0132m6433m3037
62668G50743l9604l6093l2668k9247k5687k2430k0305j9387j8632j7080j5056
62657D74554j3691j3418j3534j3189j2286j1215j0173r148q287p799p468o751
62645C47595n582m667m671n292n542m917l847k990k458j976j413q71m69l49p08
$$ plain form
62728 397792 395565 395019 395246 395520 396208 398206 401739 406127 410692 415572 421505 428969 437728 447385 458200
62713 458200 470956 485891 502298 519654 538730 560954 586900 616094 648222 683701 722983
62702 722983 766115 813309 865197 921982 982838 1046587 1112464 1179648 1246459 1310756 1370977
62691 1370977 1426139 1474825 1514836 1544054 1561350 1566503 1559609 1540905 1511085 1471522 1424083 1370677
62679 1370677 1312908 1252088 1189433 1126162 1063462 1002518 944517 890345 840213 793780 750743
62668 750743 711139 675046 642378 613131 587444 565014 544709 525322 506690 489610 474554
62657 474554 460863 447445 433911 420722 408436 397221 387048 377900 369613 361814 354346 347595
62645 347595 342013 337346 332675 327383 321841 316924 313077 310087 307629 305653 304240 303369 302900 302551 301843
62630C01843j491k142k097j440q52p63r38r54q20p92p94l77O50J815K422K336
62614B95606K153K514L423M393N157N990P253Q813J0064J0617J0856J1687J3647
62601C92173J6333J8937K1210K3548K6113K8398K9985L1216L2562L3615L3438
62590F87528L1797K9290K6279K2528J8025J3301Q513L035l355r533j4103j7078
62578G96227j9636k2417k4921k6508k7156k7050k6145k4608k3094k2092k1284
62567E31316j9988j8047j5944j4109j2555j1258j0495j0489j0865j0852j0169
62556C86545r374r005q634p317n062l160k731l364l750l297k487j795j076j71
62542C25322O13J009J281J709K002J835J752K748M856O905P943Q410R307J0777
$$ plain form
62630 301843 300352 298210 296113 294673 293821 293058 292120 291166 290346 289554 288760 288383 289033 290848 293270 295606
62614 295606 297759 300273 303696 308089 313246 319236 326489 335302 345366 355983 366839 378526 392173
62601 392173 408506 427443 448653 472201 498314 526712 556697 587913 620475 654090 687528
62590 687528 719325 748615 774894 797422 815447 828748 837261 840296 836941 827408 813305 796227
62578 796227 776591 754174 729253 702745 675589 648539 622394 597786 574692 552600 531316
62567 531316 511328 493281 477337 463228 450673 439415 428920 418431 407566 396714 386545
62556 386545 377171 368166 359532 352215 347153 343993 341262 337898 334148 330851 328364 326569 325493 325322
62542 325322 325935 326944 328225 329934 331936 333771 335523 338271 343127 350032 357975 366385 375692 386469
62528C86469J2247J3707J5792J8466K0685K1920K3189K5716K9127L2011L3857
62517F33186L5405L7100L8375L8754L8599L8285L7436L5583L2823K9220K4218
62506A018984J7496R884K592m167j0937j7702k3687k8487l2448l5788l8094l8997
62494H18649l8730l7678l5880l3366l0620k8231k6225k4089k1402j8272j5166
62483E08990j2507j0486r148q526q469q454p862o642n363m497l864l116k317j617
62469D16122o94Q14K511L572L948M485N681O948P501P427P384P625P806P563O890
62454D95583O006N193M580L853K289n51m170p461r624j0601j0761j0521j0238
62441D53577j0077r834r183q223p474p134o693n634m300l432k969j980k8K031
$$ plain form
62528 386469 398716 412423 428215 446681 467366 489286 512475 538191 567318 599329 633186
62517 633186 668591 705691 744066 782820 821419 859704 897140 932723 965546 994766 1018984
62506 1018984 1036480 1046364 1048956 1044789 1033852 1016150 992463 963976 931528 895740 857646 818649
62494 818649 779919 742241 706361 672995 642375 614144 587919 563830 542428 524156 508990
62483 508990 496483 485997 476849 468323 459854 451400 443538 436896 431533 427036 423172 420056 417739 416122
62469 416122 415428 416242 418753 422325 426273 430758 436439 443387 450888 458315 465699 473324 481130 488693 495583
62454 495583 501589 506782 511362 515215 517504 516953 512783 505322 495698 485097 474336 463815 453577
62441 453577 443500 433666 424483 416260 408786 401652 394959 389325 385025 381593 378624 376644 376616 378647
62427C78647L174L601M252N294O015O195O538P401P990P532O524O030O238O610
62413D62041P091Q141R531J0153R361P806O521N727M977M021K994K017J069K25
62399E41675l29n43n68n91o51n84j34P84J941L060M182N501O902Q004Q795R787
62383E87231J1342J3134J4617J5769J7098J9012K1473K4163K6754K9007L0851
62372H10451L2320L3363L3800L3554L2735L1236K8486K3969J7942J1364N168j49
62360A094239m283p105q995j0871j3429j6522j9511k2077k4355k6351k7620k7675
62348H85445k6552k4795k3007k1404j9808j7985j6045j4373j3115j1908j0435
62337F86018q999q149p798p266o294n339m628l610j882j05P85R24J257K079K758
$$ plain form
62427 378647 381821 385422 389674 394968 400983 407178 413716 421117 429107 436639 443163 449193 455431 462041
62413 462041 469132 477273 486804 496957 506318 514124 520645 526372 531349 535370 538364 540381 541450 541675
62399 541675 541346 540803 540235 539644 538993 538409 538275 539059 541000 544060 548242 553743 560645 568649 577444 587231
62383 587231 598573 611707 626324 642093 659191 678203 699676 723839 750593 779600 810451
62372 810451 842771 876134 909934 943488 976223 1007459 1035945 1059914 1077856 1089220 1094388 1094239
62360 1094239 1089956 1082851 1073856 1062985 1049556 1033034 1013523 991446 967091 940740 913120 885445
62348 885445 858893 834098 811091 789687 769879 751894 735849 721476 708361 696453 686018
62337 686018 677019 668870 661072 653806 647512 642173 637545 633935 632053 631948 632733 633657 634914 636993 639751
62322F39751K903K899L096L190K833K163J379L79p56j435j215l50O51J605K417
62307F59510K796K722K724L149L586L578L473L815M235L827K472J017J58j18j3
62292F96931M31J027J461J884K871M508O046O782O915P208Q079R327J0628J1962
62278G76060J3553J5490J7499J9224K0718K2434K4604K6900K8882L0430L1475
62267A027269L1699L0941K9515K7571K4592K0202J5175J0818P393M026J41l846
62255A225496p376j0403j2976j4948j6431j7878j9342k0287k0420k0079j9475
62244A045881j8189j5935j3211j0705q459o197m041k417j465r17l21Q12K612M318
62230I71766M698L422J610N13J90q0o21j301k171l304m211m180l170j850q41l97
$$ plain form
62322 639751 642654 645553 648649 651839 654672 656835 658214 658593 657837 656402 655187 654837 655488 657093 659510
62307 659510 662306 665028 667752 670901 674487 678065 681538 685353 689588 693415 695887 696904 697062 696944 696931
62292 696931 697362 698389 699850 701734 704605 709113 715159 721941 728856 736064 744143 753470 764098 776060
62278 776060 789613 805103 822602 841826 862544 884978 909582 936482 965364 995794 1027269
62267 1027269 1058968 1089909 1119424 1146995 1171587 1191789 1206964 1217782 1225175 1229201 1229342 1225496
62255 1225496 1218120 1207717 1194741 1179793 1163362 1145484 1126142 1105855 1085435 1065356 1045881
62244 1045881 1027692 1011757 998546 987841 979382 973185 969144 966727 965262 964345 964024 964836 967448 971766
62230 971766 976464 979886 981496 982009 982199 982119 981498 980197 978026 974722 970511 966331 963161 961311 960470 960073
62214I60073n58r50o78P97K806M185M853N780P328Q588Q765Q413Q716J0021J1708
62199A039847J3102J3971J4360J4547J5003J5907J6635J6248J4661J2947J2261
62188A199489J2657J3275J3532J3744J4548J6038J7757J9325K0683K1778K2439
62177A385265K2687K2706K2267K0584J7186J2731Q494N212K877J437R24P97q6
62164A523081k291n043p170q553j0064j2233j4462j5675j5320j3653j1418r494
62152A397705q449q144p929p466p185p642q633r398r577r507r484r264q607p876
62138A278544p651p911q039p607o773n934n310m930m748m658m571m499m452m262
62124A197199l751l048k437j878r84M59K194L845N354O952Q857J0883J2064J0788
$$ plain form
62214 960073 959515 958565 957887 958684 961490 965675 970528 976308 983636 992224 1000989 1009402 1018118 1028139 1039847
62199 1039847 1052949 1066920 1081280 1095827 1110830 1126737 1143372 1159620 1174281 1187228 1199489
62188 1199489 1212146 1225421 1238953 1252697 1267245 1283283 1301040 1320365 1341048 1362826 1385265
62177 1385265 1407952 1430658 1452925 1473509 1490695 1503426 1511920 1517132 1520009 1521446 1522370 1523167 1523081
62164 1523081 1520790 1515747 1508577 1500024 1489960 1477727 1463265 1447590 1432270 1418617 1407199 1397705
62152 1397705 1389256 1381112 1373183 1365717 1358532 1350890 1342257 1332859 1323282 1313775 1304291 1295027 1286420 1278544
62138 1278544 1270893 1262982 1254943 1247336 1240563 1234629 1229319 1224389 1219641 1214983 1210412 1205913 1201461 1197199
62124 1197199 1193448 1190400 1187963 1186085 1185101 1185560 1187754 1191599 1196953 1203905 1212762 1223645 1235709 1246497
62110A246497O064r75p308j0321r768p240m252j453N32N93j990o543j1363j5017
62096A177456j7126j7967j7734j6409j4168j1607r302p213m882k265j05R27J202
62083A060807J790L159M678N643O259P150Q177Q382P161M911K421J8k262m154
62069A114140n340o026o834q030r250j0118j0811j1874j3628j5888j8073j9622
62057I78646k0474k1038k1533k1505k0446j8673j7012j5685j4328j3108j2839
62046G82005j3535j3856j2729j0798r410q794q223p508p151p200p104o759o675
62033F62263o991p142o807o357o175o193o311o544o581n940m757l780l328k991
62019E82366k498k093j770j072r5K70l52j060r16k22K41N38J227K121K365J620
$$ plain form
62110 1246497 1252561 1251586 1244278 1233957 1224189 1216949 1212697 1211244 1211776 1212369 1210379 1203836 1192473 1177456
62096 1177456 1160330 1142363 1124629 1108220 1094052 1082445 1073143 1065930 1061048 1058783 1058678 1059605 1060807
62083 1060807 1062597 1065756 1070434 1076077 1082336 1089486 1097663 1106045 1113206 1118117 1120538 1120556 1118294 1114140
62069 1114140 1108800 1102774 1095940 1087910 1078660 1068542 1057731 1045857 1032229 1016341 998268 978646
62057 978646 958172 937134 915601 894096 873650 854977 837965 822280 807952 794844 782005
62046 782005 768470 754614 741885 731087 721677 712883 704660 697152 690001 682801 675697 668938 662263
62033 662263 655272 648130 641323 634966 628791 622598 616287 609743 603162 597222 592465 588685 585357 582366
62019 582366 579868 577775 576005 574933 574838 575108 574756 573696 572780 572558 572799 573337 574564 576685 579050 580670
62003E80670L25j033k259l146l522l598l776m038m001l541k984k697k748k906
61989E40746k742j930o66M82J299K185L422M605N215N332N374N468N594N925O515
61974E86824P016P237P623Q538R450R632R380R678J0693J1538J1618J1429J1721
61961G12377J2467J3087J3293J3391J3905J5124J6871J8691K0290K1688K2926
61950H94110K3907K4794K6161K8306L0694L2558L3882L5239L6880L8564M0166
61939A245261M1891M3880M6136M8810N2077N5738N9451O3375O8173P4304Q1735
61928A880831R0316J00055J10981J23204J37105J53064J70866J89702K08804K27934
61918C392862K47311K67154K86964L04905L18146L24206L21683L09313K84938
$$ plain form
62003 580670 580995 579962 577703 574557 571035 567437 563661 559623 555622 552081 549097 546400 543652 540746
61989 540746 538004 536074 535408 535890 537189 539374 542796 547401 552616 557948 563322 568790 574384 580309 586824
61974 586824 593840 601077 608700 617238 626688 636320 645700 655378 666071 677609 689227 700656 712377
61961 712377 724844 737931 751224 764615 778520 793644 810515 829206 849496 871184 894110
61950 894110 918017 942811 968972 997278 1027972 1060530 1094412 1129651 1166531 1205095 1245261
61939 1245261 1287152 1331032 1377168 1425978 1478055 1533793 1593244 1656619 1724792 1799096 1880831
61928 1880831 1971147 2071202 2182183 2305387 2442492 2595556 2766422 2956124 3164928 3392862
61918 3392862 3640173 3907327 4194291 4499196 4817342 5141548 5463231 5772544 6057482
61909F057482K46338J93148J27595N3748k3189r7445j63911k19485k62917k93612
61899E617752l11439l17603l14654l05228k91255k74318k55876k36802k17479
61890C093098j98525j80778j64375j48725j33735j20224j08721r8583q8840p9343
61880A771249p0529o2708n6044n0698m6377m2206l7616l2996k8964k5441k1923
61869A295747j8307j4889j1810r082o845n078l261q19K127M917P090Q692J0005
61856A258487J1278J2575J3584J3835J3357J2913J3166J3761J3629J2208J0056
61845A398849Q269P419P041O173M459K641J684J602J655J586J863K556K770J845
61831A450412M64r7N57J782K907L778M573N646P465J0182J3362J6458J9358K2225
$$ plain form
61909 6057482 6303820 6496968 6624563 6678311 6655122 6557677 6393766 6174281 5911364 5617752
61899 5617752 5306313 4988710 4674056 4368828 4077573 3803255 3547379 3310577 3093098
61890 3093098 2894573 2713795 2549420 2400695 2266960 2146736 2038015 1939432 1850592 1771249
61880 1771249 1700720 1638012 1581968 1531270 1484893 1442687 1405071 1372075 1343111 1317670 1295747
61869 1295747 1277440 1262551 1250741 1241659 1234814 1229736 1226475 1225656 1227783 1232700 1239790 1248482 1258487
61856 1258487 1269765 1282340 1295924 1309759 1323116 1336029 1349195 1362956 1376585 1388793 1398849
61845 1398849 1407118 1414537 1421578 1427751 1432210 1434851 1436535 1438137 1439792 1441378 1443241 1445797 1448567 1450412
61831 1450412 1450876 1450779 1451336 1453118 1456025 1459803 1464376 1470022 1477487 1487669 1501031 1517489 1536847 1559072
61817A559072K5106K8115L1556L5344L8775M1508M4421M8654N4077N9592O4827
61806B031047P0557P7345Q4808R2586J01149J11093J22287J34333J47351J61699
61796C134255J77388J94449K13627K35892K61294K88903L18022L48919L82070
61787E554819M17093M52596M86748N17480N42214N57595N59581N43777N06232
61778A0138135M44562L58896K52031J29101k639j34236k56398l61520m44998n05116
61768I617818n42428n59363n59621n47013n24665m95390m62198m27786l93642
61759E105712l60329l28488k98963k71971k46996k23756k02617j83768j66678
61750B822146j50835j36442j23892j12969j03105r4113q6129p9045p2549o6612
$$ plain form
61817 1559072 1584178 1612293 1643849 1679193 1717968 1759476 1803897 1852551 1906628 1966220 2031047
61806 2031047 2101604 2178949 2263757 2356343 2457492 2568585 2690872 2825205 2972556 3134255
61796 3134255 3311643 3506092 3719719 3955611 4216905 4505808 4823830 5172749 5554819
61787 5554819 5971912 6424508 6911256 7428736 7970950 8528545 9088126 9631903 10138135
61778 10138135 10582697 10941593 11193624 11322725 11320086 11185850 10929452 10567932 10122934 9617818
61768 9617818 9075390 8516027 7956406 7409393 6884728 6389338 5927140 5499354 5105712
61759 5105712 4745383 4416895 4117932 3845961 3598965 3375209 3172592 2988824 2822146
61750 2822146 2671311 2534869 2410977 2298008 2194903 2100790 2014661 1935616 1863067 1796455
61740A796455o1476n7120n3150m9255m5489m2130l9380l7145l4965l2310k9204
61729A314831k6350k4465k3517k2828k1717j9969j7866j6060j5156j5179j5587
61718A096137j5916j6116j6099j5459j4140j2949j2737j3275j3525j2997j2240
61707I40684j1951j2145j2338j2059j0998r114o875n096m207l856l317k190o72
61694H45866O84J272P65o56k477m277n951p525q931j0088j0994j1705j2288j2795
61680G60900j3153j3117j2481j1416j0279r094p455n196k852j175k75L26P42K61
61666F75736j801n046q138j0035j0733j0794j0574j0139r551q819p781o492n527
61653E70306n381n643n365m337l412l346l839m093l873l501l157k753k400k384
$$ plain form
61740 1796455 1734979 1677859 1624709 1575454 1529965 1487835 1448455 1411310 1376345 1344035 1314831
61729 1314831 1288481 1264016 1240499 1217671 1195954 1175985 1158119 1142059 1126903 1111724 1096137
61718 1096137 1080221 1064105 1048006 1032547 1018407 1005458 992721 979446 965921 952924 940684
61707 940684 928733 916588 904250 892191 881193 872079 865204 860108 855901 852045 848728 846538 845866
61694 845866 846550 847822 848587 847931 845454 841177 835226 827701 818770 808682 797688 785983 773695 760900
61680 760900 747747 734630 722149 710733 700454 691360 683905 678709 675857 674682 674407 674733 675475 675736
61666 675736 673935 668889 660751 650716 639983 629189 618615 608476 598925 590106 582325 575833 570306
61653 570306 564925 559282 553917 549580 546168 542822 538983 534890 531017 527516 524359 521606 519206 516822
61639E16822k650k721k309j690j268j044p05j66K78L39J38J01M61J052J521J641
61623E09800J357P83K63J41K37r0j037j784j432l19K41l79j406j731j155k20N37
61606E03806Q59P17M51O39J454K414K989L136L014K691K409K668L580M583N275
61591E40685O015P182Q334Q838Q917R265R891J0198J0148J0450J1549J3133J4854
61578F69459J6763J8867K0843K2572K4435K6769K9368L1729L3504L4537L4745
61567I63591L4129L2583K9674K4983J8837J2380O750K432n89k523l725m537m950
61554A109035m710l836k647j222O24K640M077M687N159O030O663O040M244K351
61540A139135R30m85k340m207n448o060o382o299n410l843k327j336n78N09K107
$$ plain form
61639 516822 514172 511451 509142 507452 506184 505140 504435 504269 504547 504886 505024 505125 505586 506638 508159 509800
61623 509800 511157 511940 512203 512344 512581 512491 511454 509670 508238 507919 508160 507781 506375 504644 503489 503269 503806
61606 503806 504665 505382 505833 506472 507926 510340 513329 516465 519479 522170 524579 527247 530827 535410 540685
61591 540685 546700 553882 562216 571054 579971 589236 599127 609325 619473 629923 641472 654605 669459
61578 669459 686222 705089 725932 748504 772939 799708 829076 860805 894309 928846 963591
61567 963591 997720 1030303 1059977 1084960 1103797 1116177 1122927 1125359 1124770 1122247 1118522 1113985 1109035
61554 1109035 1104325 1100489 1097842 1096620 1097244 1099884 1103961 1108648 1113807 1119837 1126500 1132540 1136784 1139135
61540 1139135 1140065 1139580 1137240 1133033 1127585 1121525 1115143 1108844 1103434 1099591 1097264 1095928 1095350 1095859 1097966
61525A097966M133O664R810J3221J6268J8833K1635K5378K9833L4060L7501M0492
61513A355794M3675M7363N1633N6736O2967P0258P8264Q6815R5993J05653J15286
61502B170437J24407J32785J40034J45383J48191J48408J46171J41166J32953
61493C429935J21746J08186R2431P4261N4311L4408J6265M81j2723k2619k8573
61482C868109l1100l1522l0929l0165l0369l2507l6578m2188m9675n9540p0764
61471C422772q1027q8822r4270r7501r7527r3505q6240p7419o8022n8281m8621
61460B531537l9735l1898k4919j8584j2696p030j720K689O072R166J2608J6014
61448B441504J8764K1281K4699K9527L5365M1864M9130N7167O5500P3311P9373
$$ plain form
61525 1097966 1102099 1108763 1118573 1131794 1148062 1166895 1188530 1213908 1243741 1277801 1315302 1355794
61513 1355794 1399469 1446832 1498465 1555201 1618168 1688426 1766690 1853505 1949498 2055151 2170437
61502 2170437 2294844 2427629 2567663 2713046 2861237 3009645 3155816 3296982 3429935
61493 3429935 3551681 3659867 3752298 3826559 3880870 3915278 3931543 3932024 3919301 3896682 3868109
61482 3868109 3837009 3805487 3774558 3744393 3714024 3681517 3644939 3602751 3553076 3493536 3422772
61471 3422772 3341745 3252923 3158653 3061152 2963625 2870120 2783880 2706461 2638439 2580158 2531537
61460 2531537 2491802 2459904 2434985 2416401 2403705 2396675 2394955 2397644 2403716 2412882 2425490 2441504
61448 2441504 2460268 2481549 2506248 2535775 2571140 2613004 2662134 2719301 2784801 2858112 2937485
61437B937485Q1926P9270P0703N6768L9001J9942K822r935j8145k3303k6604k8103
61425C181827k7661k5767k3099j9845j5776j0587m065L575J1397J7980K1962K1959
61413C131900J6314M018j3551l2379m7871n7328o0688n9548n5777n0577m4385
61402B730128l7579l1137k6197k2867k0030j6656j3021j0179q461o872m107J10
61390B533132M946R743J5053K2024L0827M0260M9220N8003O7620P8216Q8910R9019
61378C096973J08700J18218J27224J35016J40983J44565J45061J41726J33867
61369D292333J20842J02414P9339N3351K6363k19k5436m8468o8696q5907j00294
61358D345622j12262j22224j30401j36636j40501j41697j40491j37707j34091
$$ plain form
61437 2937485 3019411 3098681 3169384 3226152 3265153 3285095 3287917 3277982 3259837 3236534 3209930 3181827
61425 3181827 3154166 3128399 3105300 3085455 3069679 3059092 3055027 3058602 3069999 3087979 3109941 3131900
61413 3131900 3148214 3152232 3138681 3106302 3058431 3001103 2940415 2880867 2825090 2774513 2730128
61402 2730128 2692549 2661412 2635215 2612348 2592318 2575662 2562641 2552462 2544001 2537129 2533022 2533132
61390 2533132 2538078 2547821 2562874 2584898 2615725 2655985 2705205 2763208 2830828 2909044 2997954 3096973
61378 3096973 3205673 3323891 3451115 3586131 3727114 3871679 4016740 4158466 4292333
61369 4292333 4413175 4515589 4594928 4648279 4674642 4674423 4648987 4600519 4531823 4445916 4345622
61358 4345622 4233360 4111136 3980735 3844099 3703598 3561901 3421410 3283703 3149612
61349C149612j29566j23396j15422j06823r9003r1859q4049p5079o6166n8459
61339B199790n1434m3881l5748k7992k1044j4498q093j926M137J0357J6373K1486
61327B047527K5619K9194L1918L2723L1128K7919K4229K0619J7346J4765J3006
61316B315993J1770J0796J0201J0152J0568J1362J2524J3820J4757J5047J4862
61305B451852J4595J4640J5293J6370J7048J6537J4924J2854J0505P413L312j451
61293B593892o328j0838j4506j7173j9383k1796k4113k5199k4302k1635j7799
61282B390820j3336q966n558l669l488n164q467j2221j4927j6194j6911j7877
61270B264042j8955j9604j9497j8509j6823j5147j4061j3050j1059q055n044k429
$$ plain form
61349 3149612 3020046 2896650 2781228 2674405 2575402 2483543 2399494 2324415 2258249 2199790
61339 2199790 2148356 2104475 2068727 2040735 2019691 2005193 1997100 1995174 1999311 2009668 2026041 2047527
61327 2047527 2073146 2102340 2134258 2166981 2198109 2226028 2250257 2270876 2288222 2302987 2315993
61316 2315993 2327763 2338559 2348760 2358912 2369480 2380842 2393366 2407186 2421943 2436990 2451852
61305 2451852 2466447 2481087 2496380 2512750 2529798 2546335 2561259 2574113 2584618 2592031 2595343 2593892
61293 2593892 2587564 2576726 2562220 2545047 2525664 2503868 2479755 2454556 2430254 2408619 2390820
61282 2390820 2377484 2368518 2362960 2359291 2355803 2350639 2342172 2329951 2315024 2298830 2281919 2264042
61270 2264042 2245087 2225483 2205986 2187477 2170654 2155507 2141446 2128396 2117337 2109282 2104238 2101809
61258B101809N60M449Q721J2938J7652K3527L0428L8079M6661N6048O5255P3602
61246B479729Q1753R0685J00098J08743J15694J20092J19787J11562R3310O5769
61236C487222L2221l041l6034o3906q5258r9918j08339j11031j08439j01265r0798
61225B711414p8559o5380n1105l5513j9323l886R604J9912K5120K3347J4329k58
61213B549702j7922l6133n2215o3766o9753p0675o7693o2242n6170n1005m6764
61202A955364m2551l8420l5489l4061l2983l1418k9871k8848k7749k6048k4408
61191A603518k3559k2995k1888k0512j9660j9241j8564j7581j6851j6500j6031
61180A390136j5001j3322j1187r139p839p247o536n208l767k867k546k843m528
$$ plain form
61258 2101809 2102369 2106818 2115539 2128477 2146129 2169656 2200084 2238163 2284824 2340872 2406127 2479729
61246 2479729 2561482 2652167 2752265 2861008 2976702 3096794 3216581 3328143 3421453 3487222
61236 3487222 3519443 3516402 3480368 3416462 3331204 3231286 3122947 3011916 2903477 2802212 2711414
61225 2711414 2632855 2567475 2516370 2480857 2461534 2457648 2467252 2487164 2512284 2535631 2549960 2549702
61213 2549702 2531780 2495647 2443432 2379666 2309913 2239238 2171545 2109303 2053133 2002128 1955364
61202 1955364 1912813 1874393 1838904 1804843 1771860 1740442 1710571 1681723 1653974 1627926 1603518
61191 1603518 1579959 1556964 1535076 1514564 1494904 1475663 1457099 1439518 1422667 1406167 1390136
61180 1390136 1375135 1361813 1350626 1341487 1333648 1326401 1319865 1314657 1310890 1308023 1305477 1302634 1298106
61167A298106q383j4130k0565k6332l0314l1973l1844l1062l0060k8453k6431
61156A018559k5149k5089k5153k4201k2547k1027j9641j8089j6751j5924j4880
61145G90108j2876j0539r009q217p141n413l600k117r19R2J146K763N011O954
61131G46243P775P970Q705J0266J2011J3347J3922J3234J1005P784M523J800o2
61118H58523q13q12j093k085k903k690j910j430j133n37q1n99j921l096l699m069
61102H29652m562n314o331p167p176o586o524p256p539o609n588n716o342o104
61088G40838n088m249l557k364r73j81K13Q78J503J387R85J394K654M009N334
61073G42783O874Q137Q565Q792R735J0907J1104J0351R579Q980Q165P379O940
$$ plain form
61167 1298106 1289723 1275593 1255028 1228696 1198382 1166409 1134565 1103503 1073443 1044990 1018559
61156 1018559 993410 968321 943168 918967 896420 875393 855752 837663 820912 804988 790108
61145 790108 777232 766693 757684 749467 742326 736913 733313 731196 730277 730369 731515 734278 739289 746243
61131 746243 754018 761988 770693 780959 792970 806317 820239 833473 844478 852262 856785 858585 858523
61118 858523 857710 856898 855805 853720 850817 848127 846217 844787 843654 843117 843036 842437 840516 837420 833721 829652
61102 829652 825090 819776 813445 806278 799102 792516 785992 778736 771197 764588 759000 753284 746942 740838
61088 740838 735750 731501 727944 725580 724607 724426 724639 725517 727020 728407 729392 730786 733440 737449 742783
61073 742783 749657 757794 766359 775151 784886 795793 806897 817248 826827 835807 843972 851351 858291
61060H58291O050L890J425M00R85J987K876L920M896N510O506Q654J1180J2931
61046I29501J4259J5954J7346J7615J7982K0161K3445K5928K7754L0370L3280
61035A173595L4608L4560L5267L7391L9817M2437M6195N0556N4057N7334O2369
61024A668186O8681P3501P5802P7023P7967P8514Q0307Q5976R5553J07302J21794
61013B610606J40714J61835J80239J95198K11053K31201K56903K92220L43150
61004D623119M10346M89826N82679O96420Q35140R98767J196378J449913J779938
60995A3062526K198959K715030L298386L802228L943447L454547K329353R15165
60987C5719641k85767r35453r99344o26088J6790P43767J262093J224315M66070
$$ plain form
61060 858291 864341 868231 869656 870056 871041 873028 875904 879824 884720 890230 896736 905390 916570 929501
61046 929501 943760 959714 977060 994675 1012657 1032818 1056263 1082191 1109945 1140315 1173595
61035 1173595 1208203 1242763 1278030 1315421 1355238 1397675 1443870 1494426 1548483 1605817 1668186
61024 1668186 1736867 1810368 1886170 1963193 2041160 2119674 2199981 2285957 2381510 2488812 2610606
61013 2610606 2751320 2913155 3093394 3288592 3499645 3730846 3987749 4279969 4623119
61004 4623119 5033465 5523291 6105970 6802390 7637530 8636297 9832675 11282588 13062526
60995 13062526 15261485 17976515 21274901 25077129 29020576 32475123 34804476 35719641
60987 35719641 35433874 34498421 33499077 32872989 32889779 33633546 34895639 36119954 36586024
60978C6586024q10385k136584l088004l512570l507727l250403k876426k468801
60970A4935124k081282j741453j450854j202069r92944q21772o80427n60965m62995
60961D940363l88421l33745k92582k61378k37918k18066j98601j80487j65391
60952B663774j51442j35725j18530j01924q6440p2260o1501n6060n4562n4076
60942A771254n3433n2808n1716m9764m7878m6603m4667m1036l6860l3495l0330
60931A282664k6538k3178k1417k0338j8745j7602j8298j9866k0371j9928j9946
60920A056437k0357j9962j8816j7993j7429j6099j3902j1635r505p393o051o293
60908H91002p389p938p857q051q578q685q318q061p928p528p092o974o656n501
$$ plain form
60978 36586024 35775639 33639055 30551051 27038481 23530754 20280351 17403925 14935124
60970 14935124 12853842 11112389 9661535 8459466 7466522 6644750 5964323 5403358 4940363
60961 4940363 4551942 4218197 3925615 3664237 3426319 3208253 3009652 2829165 2663774
60952 2663774 2512332 2376607 2258077 2156153 2069713 1997453 1935952 1879892 1825330 1771254
60942 1771254 1717821 1665013 1613297 1563533 1515655 1469052 1424385 1383349 1346489 1312994 1282664
60931 1282664 1256126 1232948 1211531 1191193 1172448 1154846 1136548 1116682 1096311 1076383 1056437
60920 1056437 1036080 1016118 997302 979309 961880 945781 931879 920244 910739 903346 897295 891002
60908 891002 883613 875675 867818 859767 851189 842504 834186 826125 818197 810669 803577 796603 789947 784446
60894G84446m033l153k594j544k74L24L70P37J528K121K389K502J976L51j492
60879G83654k204j954k101l084m040m482m842n263n128m120k719j477o62n29j008
60864G40041j260m72J049K468L780N463P035P206N542K873J27k221l656l772k986
60849G61217k161j619j478k661o098j0862j4557j5838j5455j4535j3227j1462
60837F51264r745q449p220n737m274k982j500R0Q07P8j145j405n17M41O21K13
60821F10540j08N0O10J180J300Q99N30R57K303L685L930K825J459J045J439J416
60805F34060M30o47r36q84j430k390k711k089j340j122j226j382j893l064m524
60790F08852n645o176o199n767m946m090l642l731m022m040l531k653j750j078
$$ plain form
60894 784446 780413 777260 774666 773122 772848 773172 773542 774279 775807 777928 780317 782819 784795 785146 783654
60879 783654 781450 779496 777395 774311 770271 765789 760947 755684 750556 746436 743717 742240 741578 741049 740041
60864 740041 738781 738309 739358 741826 745606 751069 758104 765310 770852 773725 773852 771631 767975 764203 761217
60849 761217 759056 757437 755959 753298 747200 736338 721781 705943 690488 675953 662726 651264
60837 651264 641519 633070 625850 620113 615839 612857 611357 611447 612254 612332 611187 609782 609265 609706 610327 610540
60821 610540 610432 610482 611092 612272 613572 614471 615001 615958 618261 621946 625876 628701 630160 631205 632644 634060
60805 634060 634490 633843 632907 632023 630593 628203 625492 623403 622063 620941 619715 618333 616440 613376 608852
60790 608852 603207 597031 590832 585065 580119 576029 572387 568656 564634 560594 557063 554410 552660 551582
60776E51582p40q13j200j457j148m31J69N82J204J927J997J194M34N58J201J489
60760E56548J341J243J338J501J930K755L412L284K609J922R62q03k888m091m083
60745E66980l613l208k735k256k211k464k341j871j987l083m303m729m472m032
60731E23675l423k556j860j853k462l245l902m255m180l915l942m291m370l887
60717D75534l358l295l410l102k333j534r37m69o1L23P36J073J119R97J216J917
60701D64416K484K273J457P37M83O03R99J696K539L166L309L026K635K556K948
60686D95327L468L599L312L079L133L092K616K020J923K492L326L830L569K551
60672E37337J448J091J501J776J351Q41J087J826K116J824J765K291K651K181
$$ plain form
60776 551582 550842 550029 548829 547372 546224 545793 545962 546544 547748 549675 551672 552866 553300 553858 555059 556548
60760 556548 557889 559132 560470 561971 563901 566656 570068 573352 575961 577883 578845 578042 575154 571063 566980
60745 566980 563367 560159 557424 555168 552957 550493 548152 546281 544294 541211 536908 532179 527707 523675
60731 523675 520252 517696 515836 513983 511521 508276 504374 500119 495939 492024 488082 483791 479421 475534
60717 475534 472176 468881 465471 462369 460036 458502 457565 457096 457035 457358 458094 459167 460286 461283 462499 464416
60701 464416 466900 469173 470630 471367 471850 472453 473452 475148 477687 480853 484162 487188 489823 492379 495327
60686 495327 498795 502394 505706 508785 511918 515010 517626 519646 521569 524061 527387 531217 534786 537337
60672 537337 538785 539876 541377 543153 544504 545345 546432 548258 550374 552198 553963 556254 558905 561086
60658E61086J366J137J523J657R40m53k141m013n849p070p267o754o220n938n669
60643E16335n299n055n002m794m149l256k428j733j249j316k047k856l060k745
60629D71346k523k531k358j973j914k357k678k352j681j174p80l41l05j167k428
60614D44784k915k210j045k44J20L21M33N60J027J879K587K775K889L506M227
60599D58694M057K879J741J417J444J053M05J61K74P4n88j051q11j06O24J231
60583D71498J538J217L78j52K88J386K282K584K498K266J915J474J069P52N26
60568D91519M30M34L66J28j65l89n41n00m5P29J426J996K814L789M060L245K424
60551E11720K975M751O357P111P690Q868J0543J2352J4359J6755J9477K2559K6302
$$ plain form
60658 561086 562452 563589 565112 566769 567709 567256 565115 561102 555253 548183 540916 534162 527942 522004 516335
60643 516335 511036 505981 500979 496185 492036 488780 486352 484619 483370 482054 480007 477151 474091 471346
60629 471346 468823 466292 463934 461961 460047 457690 455012 452660 450979 449805 449025 448684 448379 447212 444784
60614 444784 441869 439659 438614 438370 438490 438811 439244 439804 440831 442710 445297 448072 450961 454467 458694
60599 458694 462751 465630 467371 468788 470232 471285 471690 471851 472125 472199 471611 470560 469749 469643 470267 471498
60583 471498 473036 474253 474631 474479 474767 476153 478435 481019 483517 485783 487698 489172 490241 490993 491519
60568 491519 491949 492383 492749 492877 492712 492323 491782 491282 491237 491966 493392 495388 498202 501991 506051 509296 511720
60551 511720 514695 519446 525803 532914 540604 549472 560015 572367 586726 603481 622958 645517 671819
60538F71819L0761L5538M0378M5587N1548N8215O5145P1443P5297P4382O7379
60527A287492N4926L8640J9736q50k1340l9097n1967n9335o1801o0377n6152n0344
60515I99531m4164l8333l2798k7122k1234j5689j1039p104l161J208N791J0223
60503H16109J4484J8883K3884K9956L7254M5371N3648O1563O8334P2200P0954
60492A312640O3596N1067L5154J7279j273j8505l1948l9791m1627l8389l1850
60481A276353k3750j4868m902O541J9183L2483M6268O0413P4039Q5459R2631R3375
60469A743225Q5679O8801M4175J4767j6441m6882p3814r4413j07022j11921j10640
60458A395514j04921r6468q6936p7455o8309n9450n1168m3949l7875l2587k7797
$$ plain form
60538 671819 702580 738118 778496 824083 875631 933846 998991 1070434 1145731 1220113 1287492
60527 1287492 1342418 1381058 1400794 1399944 1378604 1339507 1287540 1228205 1166404 1106027 1049875 999531
60515 999531 955367 917034 884236 857114 835880 820191 809152 802048 798887 800095 805886 816109
60503 816109 830593 849476 873360 903316 940570 985941 1039589 1101152 1169486 1241686 1312640
60492 1312640 1376236 1427303 1462457 1479736 1478463 1459958 1428010 1388219 1346592 1308203 1276353
60481 1276353 1252603 1237735 1232833 1239374 1258557 1291040 1337308 1397721 1471760 1557219 1649850 1743225
60469 1743225 1828904 1897705 1941880 1956647 1940206 1893324 1819510 1725097 1618075 1506154 1395514
60458 1395514 1290593 1194125 1107189 1029734 961425 901975 850807 806858 768983 736396 708599
60447G08599k3516j9800j6571j3796j1523r616p717n627l660k281j502r26l78
60434E91686j56m22p06l80M60J057Q98J71p72j919l338m723n548n455m281k105
60418E64467L85J947J945J369J979M243O718P798P584P448Q205R401J0395J1349
60404F45233J2793J4724J6590J7950J8701J8759J8026J6789J5700J5085J4537
60393H24887J3448J1743R807P814N608L267J387N60P15J232J554J589J521J446
60379H86578J274R22M57n0p04j647k678l307l313l034k919k900k527j642o67j75
60363H63668l19p60j076j281j901l218m522m624l371k046j721j807j048M42J299
60348H37715R38K21j93r02k557m576n970o700p267p492o749n182l638k525j565
$$ plain form
60447 708599 685083 665283 648712 634916 623393 613777 606060 600433 596773 594492 592990 592064 591686
60434 591686 591530 591108 590402 590022 590482 591539 592437 592608 591836 589917 586579 581856 576308 570853 566572 564467
60418 564467 564852 566799 568744 570113 572092 576335 583053 590851 598435 605883 614088 623489 633884 645233
60404 645233 658026 672750 689340 707290 725991 744750 762776 779565 795265 810350 824887
60393 824887 838335 850078 859885 867699 873307 876574 877961 878521 879236 880468 882022 883611 885132 886578
60379 886578 887852 888774 889231 889181 888477 886830 884152 880845 877532 874498 871579 868679 866152 864510 863843 863668
60363 863668 863349 862589 861513 860232 858331 855113 850591 845967 842596 840550 838829 837022 835974 836416 837715
60348 837715 838653 838874 838681 837779 835222 830646 824676 817976 810709 803217 796468 791286 787648 785123 783558
60333G83558o63k02l60q15j392k332l777n437o909p880q018p208n964n063m671
60318G22867m383m181m569n544o226n963n107m268l448k485j708j373r41K26J745
60303F74642K746L341M626P176J0390J3408J5758J6884J6063J3389J0064O992
60291G95479L643q39n847r597j1095j0955j0110q682o525m184k561j809j225k68
60277G25425Q22J581K195L390N495P900R716J0828J1997J3861J6055J7597J7990
60264H44852J7713J7718J8595K0178K1690K2301K1742K0473J9125J7936J6813
60253A059136J5744J4787J3845J2814J1993J1912J2788J4494J7010K0428K4478
60242A229429K8548L2330L5918L9225M1969M4441M7456N1193N4829N7921O1363
$$ plain form
60333 783558 782895 782693 782333 781518 780126 777794 774017 768580 761671 753791 745773 738565 732601 727538 722867
60318 722867 718484 714303 709734 704190 697964 692001 686894 682626 679178 676693 674985 673612 672671 672897 674642
60303 674642 677388 680729 685355 692531 702921 716329 732087 748971 765034 778423 788487 795479
60291 795479 799122 798283 792436 782839 771744 760789 750679 741997 735472 731288 728727 726918 725693 725425
60277 725425 726247 727828 730023 733413 738908 746808 756524 767352 779349 793210 809265 826862 844852
60264 844852 862565 880283 898878 919056 940746 963047 984789 1005262 1024387 1042323 1059136
60253 1059136 1074880 1089667 1103512 1116326 1128319 1140231 1153019 1167513 1184523 1204951 1229429
60242 1229429 1257977 1290307 1326225 1365450 1407419 1451860 1499316 1550509 1605338 1663259 1724622
60231A724622O6099P1507P6134P9659Q2959Q6351Q8981R0098Q9832Q8311Q4998
60220B629551P9523P2555O5148N7656M9796M1383L2539K3397J4131N127l072j0034
60208C057700j5574j9905k3561k6759k8734k8331k5395k1047j6282j0856m030
60197B837226M194J3167K2533L2361M2477N2257O1076O8605P4709P9361Q2492
60186C370458Q3607Q1874P7001O9832O1563N2483M1917K9367J5223L55j4559k9200
60174C839921m3466n7185o9794q0311q7932r2635r4908r5044r2945q8612q2342
60163B954747p4436o5012n4214m2386l0024j7729o169M236J3501K1710K8518L3297
60151B766039L5715L5812L3640K9254K3039J5626P452j247r994j8114k5257l1347
$$ plain form
60231 1724622 1790721 1862228 1938362 2018021 2100980 2187331 2276312 2366410 2456242 2544553 2629551
60220 2629551 2709074 2781629 2846777 2904433 2954229 2995612 3028151 3051548 3065679 3070806 3067734 3057700
60208 3057700 3042126 3022221 2998660 2971901 2943167 2914836 2889441 2868394 2852112 2841256 2837226
60197 2837226 2841420 2854587 2877120 2909481 2951958 3004215 3065291 3133896 3208605 3287966 3370458
60186 3370458 3454065 3535939 3612940 3682772 3744335 3796818 3838735 3868102 3883325 3883680 3869121 3839921
60174 3839921 3796455 3739270 3669476 3589165 3501233 3408598 3313690 3218646 3125701 3037089 2954747
60163 2954747 2880311 2815299 2761085 2718699 2688675 2670946 2664777 2669013 2682514 2704224 2732742 2766039
60151 2766039 2801754 2837566 2871206 2900460 2923499 2939125 2946577 2945330 2935336 2917222 2891965 2860618
60139B860618l5929l8109l7537l4874l0917k5583j8313r176R63J1336K1788L2381
60127B696648M3003N3560O4287P5601Q7789J00919J14909J29577J44687J60070
60117C671050J75496J90307K03259K13070K19162K21772K21197K17104K08754
60108E541171J95765J78414J57211J32565J05033P5671M5742J6028j3395m2643
60098F391562p1361r8656j23528j45306j63643j78140j88183j93267j93380j88911
60088D847187j80307j68159j53547j37692j21029j03032q3399o3014m3279k4773
60078C768956p204R538K5019L8924N1301O1842O9520P3348P3128O9153O1631N0884
60066D346040L7743K3232Q038p374k2381l6388m9320o1420p2631q2606r1255r8796
$$ plain form
60139 2860618 2824689 2786580 2749043 2714169 2683252 2657669 2639356 2630180 2631143 2642479 2664267 2696648
60127 2696648 2739651 2793211 2857498 2933099 3020888 3121807 3236716 3366293 3510980 3671050
60117 3671050 3846546 4036853 4240112 4453182 4672344 4894116 5115313 5332417 5541171
60108 5541171 5736936 5915350 6072561 6205126 6310159 6385830 6431572 6447600 6434205 6391562
60098 6391562 6320201 6221545 6098017 5952711 5789068 5610928 5422745 5229478 5036098 4847187
60088 4847187 4666880 4498721 4345174 4207482 4086453 3983421 3900022 3837008 3793729 3768956
60078 3768956 3761752 3771290 3796309 3835233 3886534 3948376 4017896 4091244 4164372 4233525 4295156 4346040
60066 4346040 4383783 4407015 4415053 4407679 4385298 4348910 4299590 4238170 4165539 4082933 3991678 3892882
60054C892882j05125j09596j11591j11021j08079j02793r5091q5202p3762o1500
60044B929122m8818l5649k1813p545O474J9850L2925M5960N8059O7596P4018P8524
60032C198703Q2492Q5719Q6824Q4995Q0577P4129O5709N5249M2942K8959J3303
60021C899601l677k0977l7486n2620o6233p8129q7974r5441j00125j01544r9492
60010C155903r4326q6694p7136o6165n4468m2687l1041j9401p633M376J6798K9705
59998B727231M2831N5786O8416Q0698R2526J03791J14484J24305J32304J37361
59988C679733J38896J36701J30266J19057J03604Q5671O6888M7624K7461O415
59978D542316j4798l5430n5135p3671r0391j04182j13885j18913j19493j16211
$$ plain form
60054 3892882 3787757 3678161 3566570 3455549 3347470 3244677 3149586 3064384 2990622 2929122
60044 2929122 2880304 2844655 2822842 2815297 2821771 2841621 2874546 2920506 2978565 3046161 3120179 3198703
60032 3198703 3281195 3366914 3453738 3538733 3619310 3693439 3759148 3814397 3857339 3886298 3899601
60021 3899601 3895924 3874947 3837461 3784841 3718608 3640479 3552505 3457064 3356939 3255395 3155903
60010 3155903 3061577 2974883 2897747 2831582 2777114 2734427 2703386 2683985 2676352 2680728 2697526 2727231
59998 2727231 2770062 2825848 2894264 2974962 3067488 3171279 3285763 3410068 3542372 3679733
59988 3679733 3818629 3955330 4085596 4204653 4308257 4393928 4460816 4508440 4535901 4542316
59978 4542316 4527518 4492088 4436953 4363282 4272891 4168709 4054824 3935911 3816418 3700207
59968C700207j09361r8952q5398o9962n4313l9677k6333j3657o90J3024K6963
59957C241851M0089N1761O2012P1030P8725Q4823Q8937R0543Q9350Q5765Q0512
59946D065398P3726O5025N4642M3782L3476K3754J4373N699j841q468j4336j8455
59934D336775j9379j6813j1620m217N995J9454L5538N3290P2372R2797J14281
59923D678473J36354J58798J81378K03262K23045K39305K50946K57118K56945
59914F585624K49252K32572K05899J69643J25633P6088K3110l0588q1160j24746
59904G431327j59242j84524k01133k09366k09677k03206j91373j75318j56053
59895E741435j34821j12687q9925o6321m2084j7987N582K9238N3892P9510J04730
$$ plain form
59968 3700207 3590846 3491894 3406496 3336534 3282221 3242544 3216211 3202554 3201864 3214888 3241851
59957 3241851 3281940 3333701 3395713 3466743 3545468 3630291 3719228 3809771 3899121 3984886 4065398
59946 4065398 4139124 4204149 4258791 4302573 4336049 4359803 4374176 4379875 4378034 4369566 4355230 4336775
59934 4336775 4317396 4300583 4288963 4284746 4290741 4310195 4345733 4399023 4471395 4564192 4678473
59923 4678473 4814827 4973625 5155003 5358265 5581310 5820615 6071561 6328679 6585624
59914 6585624 6834876 7067448 7273347 7442990 7568623 7644711 7667821 7637233 7556073 7431327
59904 7431327 7272085 7087561 6886428 6677062 6467385 6264179 6072806 5897488 5741435
59895 5741435 5606614 5493927 5404002 5337681 5295597 5277610 5283192 5312430 5366322 5445832 5550562
59884E550562J27527J46011J58770J64787J63313J53979J37304J15130R0141O4463
59874F871987L8742J2651j3947m0659o7078r3007j18050j41334j61654j77652
59864F109999j87998j92055j90517j84887j76100j63977j48216j29429j08895
59855D627925q7671o6303m5042k4014l342J6536L4853N1115O5547P8779R1190
59844D739573J02561J11797J16588J13882J01550P9948N1860K1152q482l4185
59834E396244n4333o8621p7684q2749q5592q8146r1414r4913r7722r9812j01822
59823D453436j03709j04445j03167r9985r5432q9578q2142p3307o4182n6374n0946
59812C530169m7730m5741m4386m3946m4603m5517m5386m3671m0597l6176k9996
$$ plain form
59884 5550562 5678089 5824100 5982870 6147657 6310970 6464949 6602253 6717383 6807524 6871987
59874 6871987 6910729 6923380 6909433 6868774 6801696 6708689 6590639 6449305 6287651 6109999
59864 6109999 5922001 5729946 5539429 5354542 5178442 5014465 4866249 4736820 4627925
59855 4627925 4540254 4473951 4428909 4404895 4401553 4418089 4452942 4504057 4569604 4648383 4739573
59844 4739573 4842134 4953931 5070519 5184401 5285951 5365899 5417759 5438911 5430429 5396244
59834 5396244 5341911 5273290 5195606 5112857 5027265 4939119 4847705 4752792 4655070 4555258 4453436
59823 4453436 4349727 4245282 4142115 4042130 3946698 3857120 3774978 3701671 3637489 3581115 3530169
59812 3530169 3482439 3436698 3392312 3348366 3303763 3258246 3212860 3169189 3128592 3092416 3062420
59801C062420k2009j2746k574Q649K1026L4400M8979O5494Q4308J04936J26917
59790C519800J50688J76897K04946K32524K56069K70853K70781K49493K03391
59781E535442J34625N1629l3536j09277j67733k05844k24574k27344k18481k02107
59771D332800j81672j59927j38758j18870r9961q1649o4246m8453l4612k2579
59761C382073j2144l076N175J3251K1324K9099L6395M3334M9954N6135O2128O8713
59749C752361P6566Q5605R5171J04720J14436J25252J38173J53228J69343J85582
59739E000437K02368K20830K41180K62513K84145L06135L28004L47817L63164
59730G556593L72571L75319L70483L57018L34805L05207K70845K35400K03267
$$ plain form
59801 3062420 3040411 3027665 3025091 3033740 3054766 3089166 3138145 3203639 3287947 3392883 3519800
59790 3519800 3670488 3847385 4052331 4284855 4540924 4811777 5082558 5332051 5535442
59781 5535442 5670067 5721696 5688160 5578883 5411150 5205306 4980732 4753388 4534907 4332800
59771 4332800 4151128 3991201 3852443 3733573 3633612 3551963 3487717 3439264 3404652 3382073
59761 3382073 3369929 3366853 3372028 3385279 3406603 3435702 3472097 3515431 3565385 3621520 3683648 3752361
59749 3752361 3828927 3914532 4009703 4114423 4228859 4354111 4492284 4645512 4814855 5000437
59739 5000437 5202805 5423635 5664815 5927328 6211473 6517608 6845612 7193429 7556593
59730 7556593 7929164 8304483 8674966 9031984 9366789 9671996 9942841 10178241 10381508
59721A0381508J78478J63294J57803J60769J70711J86230K05649K26472K45449
59712A2076363K59532K67047K67745K61736K48863K29304K04181J75004J42868
59703A4132643J08810P4652M2707J4608q977k7419l9489m3923m0177k8363q830
59692A4176242J7960N1241Q9951J32954J79266K28130K78865L30391L80954M28384
59682A6294338M70572N05480N30716N43389N40323N18294M74398M07084L17396
59673B0601990K09108Q7562m1218j70149k90822l95016m77294n36056n72169n87170
59663A7828766n83276n64871n39312n15862n03403n07925n30377n65637o03832
59654A2914271o34182o49291o47290o30798o04180n71223n34452m95740m57068
$$ plain form
59721 10381508 10559986 10723280 10881083 11041852 11212563 11398793 11604442 11830914 12076363
59712 12076363 12335895 12602942 12870687 13132423 13381286 13610590 13814771 13989775 14132643
59703 14132643 14241453 14316105 14358812 14373420 14364443 14337024 14297535 14253612 14213435 14185072 14176242
59692 14176242 14194202 14245443 14335394 14468348 14647614 14875744 15154609 15485000 15865954 16294338
59682 16294338 16764910 17270390 17801106 18344495 18884818 19403112 19877510 20284594 20601990
59673 20601990 20811098 20898660 20857442 20687293 20396471 20001455 19524161 18988105 18415936 17828766
59663 17828766 17245490 16680619 16141307 15625445 15122042 14614117 14083740 13518103 12914271
59654 12914271 12280089 11630798 10983508 10352710 9748530 9177307 8642855 8147115 7690047
59645G690047m20358l86629l55645l26723k99765k75160k52772k31567k10502
59636D930926j89615j69871j51987j35609j19809j04267q9697p7016o6269n6794
59626C769992m8315m1433l6712l3783l1745l0232k9525k9778l0685l1983l3732
59615C392069l5979l8542m1320m4375m7547n0288n2128n3032n2971n1505m8169
59604B876213m3320l8273l4382l2001l0400k8706k6799k5105k3605k1613j8712
59593B553297j5462j2589r890o637k862N88L337N992R109J2367J5153J7370J9233
59580B589006K0797K2181K3908K6493K9950L4077L8883M4387N0348N6540O3001
59569B999571O9587P5772Q1306Q6798R2993R9797J06584J13189J19895J26590
$$ plain form
59645 7690047 7269689 6883060 6527415 6200692 5900927 5625767 5372995 5141428 4930926
59636 4930926 4741311 4571440 4419453 4283844 4164035 4059768 3970071 3893055 3826786 3769992
59626 3769992 3721677 3680244 3643532 3609749 3578004 3547772 3518247 3488469 3457784 3425801 3392069
59615 3392069 3356090 3317548 3276228 3231853 3184306 3134018 3081890 3028858 2975887 2924382 2876213
59604 2876213 2832893 2794620 2760238 2728237 2697837 2669131 2642332 2617227 2593622 2572009 2553297
59593 2553297 2537835 2525246 2515356 2508719 2505857 2506445 2509782 2515774 2524883 2537250 2552403 2569773 2589006
59580 2589006 2609803 2631984 2655892 2682385 2712335 2746412 2785295 2829682 2880030 2936570 2999571
59569 2999571 3069158 3144930 3226236 3313034 3406027 3505824 3612408 3725597 3845492 3972082
59559C972082J32822J38612J44406J49992J54251J56359J56551J55263J52213
59550E312551J46976J39862J31065J18878J00072P3019M0229P083k2024m5970
59540F001741o5727q2050r4994j04909j12658j18602j22035j22007j18174j10668
59530D949917r9670q5491o8738m9869k8847n595J9376M5227P1496R8137J24849
59519D970792J50644J73974J92904K05346K09555K04488J89617J64628J29912
59510F591860Q7278L9652j0198o0303j08760j52879j89621k17015k34923k44351
59500E500740k46225k41007k29429k13212j94580j75059j54973j34193j13071
59491C798991r2359p2538n3609l5383j7647j00J7475L4820N1295O6404Q0139R2678
$$ plain form
59559 3972082 4104904 4243516 4387922 4537914 4692165 4848524 5005075 5160338 5312551
59550 5312551 5459527 5599389 5730454 5849332 5949404 6022423 6062652 6069735 6047711 6001741
59540 6001741 5936014 5853964 5758970 5654061 5541403 5422801 5300766 5178759 5060585 4949917
59530 4949917 4850247 4764756 4696018 4646149 4617302 4611707 4631083 4676310 4747806 4845943 4970792
59519 4970792 5121436 5295410 5488314 5693660 5903215 6107703 6297320 6461948 6591860
59510 6591860 6679138 6718790 6708592 6648289 6539529 6386650 6197029 5980014 5745091 5500740
59500 5500740 5254515 5013508 4784079 4570867 4376287 4201228 4046255 3912062 3798991
59491 3798991 3706632 3634094 3580485 3545102 3527455 3527355 3544830 3579650 3630945 3697349 3777488 3870166
59479C870166J03946J13440J20297J23548J22432J16683J06411R1818P3058N0435
59469D892234K4575l530l2513o0755q6775j09679j29107j44741j56093j62918
59459D030698j65667j65312j62702j58252j52185j44818j36533j27633j18415
59450B699181j09269j00469r1936q3473p5270o7913o1683n6126n0525m4625l8669
59439A919223l2886k7355k2201j7562j3260q919m532n55K774N851R100J2253J4795
59426A836726J7087K0319K4681K8003K7062K0744J1556L618n86j153Q01M585R842
59413B003285J6216K3517L1367L8046M0672L7759L1275K5314K2767K3930K7786
59402B321934L3432M0134M7187N4316O1677O9246P6661Q3810R1003R8523J06510
$$ plain form
59479 3870166 3974112 4087552 4207849 4331397 4453829 4570512 4676923 4768741 4841799 4892234
59469 4892234 4916809 4913279 4880766 4820011 4733236 4623557 4494450 4349709 4193616 4030698
59459 4030698 3865031 3699719 3537017 3378765 3226580 3081762 2945229 2817596 2699181
59450 2699181 2589912 2489443 2397507 2314034 2238764 2170851 2109168 2053042 2002517 1957892 1919223
59439 1919223 1886337 1858982 1836781 1819219 1805959 1797040 1792508 1791953 1794727 1800578 1809678 1821931 1836726
59426 1836726 1853813 1874132 1898813 1926816 1953878 1974622 1986178 1989796 1989210 1988057 1988858 1993443 2003285
59413 2003285 2019501 2043018 2074385 2112431 2153103 2190862 2222137 2247451 2270218 2294148 2321934
59402 2321934 2355366 2395500 2442687 2497003 2558680 2627926 2704587 2788397 2879400 2977923 3084433
59391C084433J15291J25065J35178J44400J52086J58545J64195J69244J74441
59382D422878J81359J91483K05488K23533K45517K70764K97964L25599L51747
59373F716332L73601L88243L94332L92268L82579L65389L41817L14556K86211
59364I955328K57990K30566K04954J81366J58111J32793J03932P0567L1285j4943
59354A1311949o7530j25063j86571k50556l13223l69299m14777m47837m67618
59345H669475m73748m67326m50973m27424l98902l67794l36677l07118k79439
59336E160074k53997k31882k13959j99885j88513j78638j69204j59461j49340
59327C415195j39207j29129j18862j08543r8758q9834q1682p4344o8003o2366
$$ plain form
59391 3084433 3199724 3324789 3459967 3604367 3756453 3914998 4079193 4248437 4422878
59382 4422878 4604237 4795720 5001208 5224741 5470258 5741022 6038986 6364585 6716332
59373 6716332 7089933 7478176 7872508 8264776 8647355 9012744 9354561 9669117 9955328
59364 9955328 10213318 10443884 10648838 10830204 10988315 11121108 11225040 11295607 11326892 11311949
59354 11311949 11244419 11119356 10932785 10682229 10369006 9999707 9584930 9137093 8669475
59345 8669475 8195727 7728401 7277428 6850004 6451102 6083308 5746631 5439513 5160074
59336 5160074 4906077 4674195 4460236 4260351 4071838 3893200 3723996 3564535 3415195
59327 3415195 3275988 3146859 3027997 2919454 2820696 2730862 2649180 2574836 2506833 2444467
59317B444467n6873n1535m6836m2665l8197l3093k7937k3184j8481j3450q323
59306B083893l333J834P406J2921J7854K2409K7156L2234L7398M2566M7919N3797
59294B384054O0756O9164P8077Q4717Q5931Q0660P1108O1515N5448N3624N3936
59283C138990N3585N1188M6794M0390L1270J9036M455j1118k6688m1578n4905
59272C251419o5722p3614p8829q1813q2862q2137p9888p6585p2779o8836o4882
59261B423472o1020n7310n3447m8915m3787l8886l4624l0158k4527j8252j2833
59250A999713q654m529M83N742J0020J3091J5809J9081K3183K7717L1977L5680
59238B169313L9498M4371N0246N6070O1243O6456P2780Q0634R0024J01109J13962
$$ plain form
59317 2444467 2387594 2336059 2289223 2246558 2208361 2175268 2147331 2124147 2105666 2092216 2083893
59306 2083893 2080560 2082394 2089800 2102721 2120575 2142984 2170140 2202374 2239772 2282338 2330257 2384054
59294 2384054 2444810 2513974 2592051 2676768 2762699 2843359 2914467 2975982 3031430 3085054 3138990
59283 3138990 3192575 3243763 3290557 3330947 3362217 3381253 3385708 3374590 3347902 3306324 3251419
59272 3251419 3185697 3112083 3033254 2951441 2868579 2786442 2706554 2629969 2557190 2488354 2423472
59261 2423472 2362452 2305142 2251695 2202780 2158993 2120107 2085483 2055325 2030798 2012546 1999713
59250 1999713 1991059 1986530 1987013 1992755 2002775 2015866 2031675 2050756 2073939 2101656 2133633 2169313
59238 2169313 2208811 2253182 2303428 2359498 2420741 2487197 2559977 2640611 2730635 2831744 2945706
59227B945706J28158J43220J59220J76567J95376K15279K35411K54284K69913
59218D723134K80357K83903K78862K63766K38194K02840J58628J06451M8177j2834
59208F571478p2947j29577j80730k23879k56302k76624k85428k84417k75635k61292
59198D324647k43508k23709k02558j80691j59257j39534j22110j06601r2190p8413
59188B776076o5397n3422m2449l2254k2884j4540p113k53N847J0124J1370R194
59176B574299M079l280j2488k3400l5701m8427n9948o8659p3938p6352p6903p6113
59164B023169p3834o9780o4218n8190n2851m8455m4230l9413l4182k9252k4966
59153A483798k1294j8326j6051j3862j0987p470m058j150J548M287O880R074J0809
$$ plain form
59227 2945706 3073864 3217084 3376304 3552871 3748247 3963526 4198937 4453221 4723134
59218 4723134 5003491 5287394 5566256 5830022 6068216 6271056 6429684 6536135 6584312 6571478
59208 6571478 6498531 6368954 6188224 5964345 5708043 5431419 5145991 4861574 4585939 4324647
59198 4324647 4081139 3857430 3654872 3474181 3314924 3175390 3053280 2946679 2854489 2776076
59188 2776076 2710679 2657257 2614808 2582554 2559670 2545130 2538017 2537764 2543611 2553735 2565105 2574299
59176 2574299 2578378 2575098 2562610 2539210 2503509 2455082 2395134 2326475 2252537 2176185 2099282 2023169
59164 2023169 1949335 1879555 1815337 1757147 1704296 1655841 1611611 1572198 1538016 1508764 1483798
59153 1483798 1462504 1444178 1428127 1414265 1403278 1395808 1391750 1390600 1392148 1396435 1403315 1412389 1423198
59140A423198J2025J2738J3264J3780J3781J2728J1086R892R308Q550P301O135
59128A553786N373M610L757L548M440N893P263Q667J0391J2281J4284J6823J9978
59115A671094K2960K4996K6149K6798K6987K6899K7191K8090K8835K8721K8129
59104A966849K7844K7956K8203K8795L0118L2130L4845L8786M4067M9546N3878
59093B363017N7062N9986O2760O4464O4347O2271N8115N1658M3048L2617K0226
59082B939571N577j0728k7117m2109n4976o5493p3654p9631q3427q4661q3230
59071B340122q0032p6380p2756o8812o4484o0279n6474n2800m9163m5978m3409
59060A669555m0949l8127l5206l2693l0495k8017k5027k1973j9381j7299j5536
$$ plain form
59140 1423198 1435223 1447961 1461225 1475005 1488786 1501514 1512600 1522492 1531800 1540350 1547651 1553786
59128 1553786 1559159 1563769 1567526 1571074 1575514 1581407 1588670 1597337 1607728 1620009 1634293 1651116 1671094
59115 1671094 1694054 1719050 1745199 1771997 1798984 1825883 1853074 1881164 1909999 1938720 1966849
59104 1966849 1994693 2022649 2050852 2079647 2109765 2141895 2176740 2215526 2259593 2309139 2363017
59093 2363017 2420079 2480065 2542825 2607289 2671636 2733907 2792022 2843680 2886728 2919345 2939571
59082 2939571 2945148 2934420 2907303 2865194 2810218 2744725 2671071 2591440 2508013 2423352 2340122
59071 2340122 2260090 2183710 2110954 2042142 1977658 1917379 1860905 1808105 1758942 1712964 1669555
59060 1669555 1628606 1590479 1555273 1522580 1492085 1464068 1439041 1417068 1397687 1380388 1364852
59049A364852j4202j3675j3941j4446j4776j5146j5781j6193j5742j4610j3474
59038A202866j2207r920o472l033o83P99K265L985N633O884P550P600P513Q087
59024A220867R527J1181J2519J3681J4799J5652J6450J8026K0555K2995K4660
59013A400912K6432K9423L3303L7053M0706M5074N0217N5463O0543O5426O9341
59002A913893P1175P0742O8432O3737N5432M3309K8700J3212j956j5468k5934
58991B285274l3056l7849m1313m3575m4512m4320m3199m1202l8776l6808l5776
58980A844888l5292l4674l3483l1487k8646k5332k1999j8585j4679j0326o050
58969A584335k066J922O056R996J3321J5749J6992J6965J6235J5684J5623J5674
$$ plain form
59049 1364852 1350650 1336975 1323034 1308588 1293812 1278666 1262885 1246692 1230950 1216340 1202866
59038 1202866 1190659 1180739 1174267 1171234 1170551 1171350 1173615 1177600 1183233 1190117 1197667 1205267 1212780 1220867
59024 1220867 1230394 1241575 1254094 1267775 1282574 1298226 1314676 1332702 1353257 1376252 1400912
59013 1400912 1427344 1456767 1490070 1527123 1567829 1612903 1663120 1718583 1779126 1844552 1913893
59002 1913893 1985068 2055810 2124242 2187979 2243411 2286720 2315420 2328632 2326676 2311208 2285274
58991 2285274 2252218 2214369 2173056 2129481 2084969 2040649 1997450 1956248 1917472 1880664 1844888
58980 1844888 1809596 1774922 1741439 1709952 1681306 1655974 1633975 1615390 1600711 1590385 1584335
58969 1584335 1582269 1584191 1590247 1600243 1613564 1629313 1646305 1663270 1679505 1695189 1710812 1726486
58957A726486J5507J5198J4911J4772J5027J5884J7201J8804K0816K3296K5812
58946A923714K8063L0610L4231L8857M3925M9486N6063O3522P1136P8518Q5312
58935B503437Q9994R0312Q5322P6104O4411N1718L9824L1021K6742K6722K9993
58924C115600L5920M3941N3139O2834P2987Q3521R3855J03671J13532J24205J35807
58913D039012J48227J61840J77113J93741K10749K27323K43241K58556K73001
58904E932803K85477K94108K97316K95191K89521K82422K75318K69051K64075
58895H485282K59893K54750K46379K32947K13196J86209J51577J09774O2232J1194
58885A0213433m0666r1010j38505j82506k22165k56151k83397l03625l17202l24839
$$ plain form
58957 1726486 1741993 1757191 1772102 1786874 1801901 1817785 1834986 1853790 1874606 1897902 1923714
58946 1923714 1951777 1982387 2016618 2055475 2099400 2148886 2204949 2268471 2339607 2418125 2503437
58935 2503437 2593431 2683743 2769065 2845169 2909580 2961298 3001122 3032143 3058885 3085607 3115600
58924 3115600 3151520 3195461 3248600 3311434 3384421 3467942 3561797 3665468 3779000 3903205 4039012
58913 4039012 4187239 4349079 4526192 4719933 4930682 5158005 5401246 5659802 5932803
58904 5932803 6218280 6512388 6809704 7104895 7394416 7676838 7952156 8221207 8485282
58895 8485282 8745175 8999925 9246304 9479251 9692447 9878656 10030233 10140007 10202239 10213433
58885 10213433 10172767 10081757 9943252 9760746 9538581 9282430 8999033 8695408 8378206 8053367
58875H053367l27542l26317l21824l14516l05066k94217k82270k69209k55293
58866E357113k41035k26630k12010j97459j83557j70500j57980j45862j34370
58857C687710j23590j13342j03599r4477q5791p7136o8466o0102n2258m5064l8856
58846B825029l3703k8850k3466j7854j3009r101n372j506K079N465R510J4491
58834B723713J9558K4088K8585L3649L9017M4310M9906N6280O3011O9178P4255
58823C225550P8116Q0642Q2076Q3392Q5740Q9587R4777J01154J08895J18380J29922
58812D278231J43394J58207J73986J91014K09410K28146K45750K61973K77708
58803F167819K93172L07134L18115L25326L28063L25240L15950K99662K75513
$$ plain form
58875 8053367 7725825 7399508 7077684 6763168 6458102 6163885 5881615 5612406 5357113
58866 5357113 5116078 4889448 4677438 4479979 4296422 4125922 3967942 3822080 3687710
58857 3687710 3564120 3450778 3347179 3252702 3166911 3089775 3021309 2961207 2908949 2863885 2825029
58846 2825029 2791326 2762476 2739010 2721156 2708147 2699046 2693674 2692168 2694247 2699712 2709222 2723713
58834 2723713 2743271 2767359 2795944 2829593 2868610 2912920 2962826 3019106 3082117 3151295 3225550
58823 3225550 3303666 3384308 3466384 3549776 3635516 3725103 3819880 3921034 4029929 4148309 4278231
58812 4278231 4421625 4579832 4753818 4944832 5154242 5382388 5628138 5890111 6167819
58803 6167819 6460991 6768125 7086240 7411566 7739629 8064869 8380819 8680481 8955994
58794H955994K42454K00686J52100R8881M2560j5206p2043j25789j75091k18597
58784I085949k54567k82084l01661l14015l19319l18592l14654l10382l06456
58775F364219l01766k95243k86299k74351k59410k42873k26519k10889j95551
58766D071318j80616j66802j54281j42480j31088j20371j10495j01334r2831q4879
58756B786141p6926o8468n9850n1935m5096l9065l3547k8289k2843j7026j1370
58745B331726o417j667L837J0019J5743K0311K3970K6611K6718K2347J2886l30
58733B485754j4871k8395l9336m6984n1246n2587n2041n0916n0150n0022n0467
58722A998739n1336n2261n2664n2169n0746m8318m4631l9624l3556k6558j8543
$$ plain form
58794 8955994 9198448 9399134 9551234 9650115 9692675 9677469 9605426 9479637 9304546 9085949
58784 9085949 8831382 8549298 8247637 7933622 7614303 7295711 6981057 6670675 6364219
58775 6364219 6062453 5767210 5480911 5206560 4947150 4704277 4477758 4266869 4071318
58766 4071318 3890702 3723900 3569619 3427139 3296051 3175680 3065185 2963851 2871020 2786141
58756 2786141 2709215 2640747 2580897 2528962 2483866 2444801 2411254 2382965 2360122 2343096 2331726
58745 2331726 2325309 2323642 2327479 2337498 2353241 2373552 2397522 2424133 2450851 2473198 2486084 2485754
58733 2485754 2470883 2442488 2403152 2356168 2304922 2252335 2200294 2149378 2099228 2049206 1998739
58722 1998739 1947403 1895142 1842478 1790309 1739563 1691245 1646614 1606990 1573434 1546876 1528333
58711A528333r734p60P795J5313K0372K0948J6105O926m609j7083k9471m0320
58699A513815m8131n2335n3313n1629m7792m2436l6334l0318k5357k2160k0385
58688A083625j8950j7518j6894j7395j7760j6622j4328j2182j0412q177n389l210
58676I24788k503k757k838k145p26J214L612O542R995J3348J5204J4078R400J879
58662I89091o794j4503j9592k1807k2182k1752k0637j8612j5906j2952r872o774
58650G97708m130k260p62R63K897M619N974P038P760Q167Q580R120R387R140Q783
58635H72984Q615Q118O856N637N841P687J0037J1871J3225J4591J6124J7732J9487
58622A018805K1677K4498K7708L0573L2444L3585L5093L7804M1611M5974N0612
$$ plain form
58711 1528333 1518599 1517839 1525634 1540947 1561319 1582267 1598372 1605298 1600689 1583606 1554135 1513815
58699 1513815 1465684 1413349 1360036 1308407 1260615 1218179 1181845 1151527 1126170 1104010 1083625
58688 1083625 1064675 1047157 1030263 1012868 995108 978486 964158 951976 941564 933387 927998 924788
58676 924788 922285 919528 916690 914545 913819 915033 918645 925187 935182 948530 963734 977812 987212 989091
58662 989091 982297 967794 948202 926395 904213 882461 861824 843212 827306 814354 804482 797708
58650 797708 793578 791318 790556 791519 794416 799035 805009 812047 819807 827974 836554 845674 855061 864201 872984
58635 872984 881599 889717 896573 902210 908051 915738 925775 937646 950871 965462 981586 999318 1018805
58622 1018805 1040482 1064980 1092688 1123261 1155705 1189290 1224383 1262187 1303798 1349772 1400384
58611A400384N5475O0515O5883P1797P7971Q3702Q8810R3713R8223J01090J01254
58600B298817R8715R3573Q5097P2644N6780L8638J8854j840k1734l9083n3569
58589B646892o5725p5173q0709q2063q0437p7114p2392o6229n9171n2310m6560
58578A889009m2133l8712l6150l4949l5526l7118l8197l8297l8421l9153l9375
58567A470978l7770l4811l2243l1147l1391l2344l3212l3112l1883l0423k9366
58556A113276k7934k5123k1581j9134j8632j9231j9733j9688j9293j8957j8937
58545H85033j8919j8133j6464j4898j4288j4176j3563j2336j1123j0238r556r032
58533G22307q537p640o294n227m954m965m626m111l660k754j098M71J202J767
$$ plain form
58611 1400384 1455859 1516374 1582257 1654054 1732025 1815727 1904537 1998250 2096473 2197563 2298817
58600 2298817 2397532 2491105 2576202 2648846 2705626 2744264 2763118 2761278 2739544 2700461 2646892
58589 2646892 2581167 2505994 2425285 2343222 2262785 2185671 2113279 2047050 1987879 1935569 1889009
58578 1889009 1846876 1808164 1772014 1737065 1701539 1664421 1626224 1587927 1549506 1510353 1470978
58567 1470978 1433208 1398397 1366154 1335007 1303616 1271272 1238060 1204948 1173065 1142642 1113276
58556 1113276 1085342 1060219 1038638 1019504 1000872 981641 961908 942220 922927 903970 885033
58545 885033 866114 847981 831517 816619 802331 788155 774592 762256 751133 740895 731339 722307
58533 722307 713770 706130 699836 694609 689655 684690 680064 675953 672293 669539 668441 668912 670114 671881
58519F71881L126M843N908O566P812R567J0948J1940J3279J4875J5854J5989J5772
58506H08360J5183J3719J1498R088O306K523j964o006q890j0534j0780r721q395
58493H10387p893p957p652o965o515o187n528n062n678p010p937q289q518q281
58479G10915p072n816n762o195n415l808l506m807n448m092k227j623j978k141
58465F51025k021k044k084j993k181k751l132l156l444m097m207l312k253j925
58451F12425k131k275k238k023j505r30p90q07j16J263K210K155J791J729J603
58436F10361J106Q03J247K077K650K861K907K891K994L416L939M157M186M543
58422F50138N302O023O379O269N598M663M271M614M717L945L256L585L980L012
$$ plain form
58519 671881 675007 679850 685758 692324 700136 709703 720651 732591 745870 760745 776599 792588 808360
58506 808360 823543 837262 848760 857848 864154 866677 864713 858707 849817 839283 828503 818782 810387
58493 810387 802494 794537 786885 779920 773405 767218 761690 756628 750950 743940 736003 727714 719196 710915
58479 710915 703843 698027 692265 686070 680655 676847 673341 668534 663086 658994 656767 655144 653166 651025
58465 651025 649004 646960 644876 642883 640702 637951 634819 631663 628219 624122 619915 616603 614350 612425
58451 612425 610294 608019 605781 603758 602253 601323 600533 599726 599610 600873 603083 605238 607029 608758 610361
58436 610361 611467 612270 613517 615594 618244 621105 624012 626903 629897 633313 637252 641409 645595 650138
58422 650138 655440 661463 667842 674111 679709 684372 688643 693257 697974 701919 705175 708760 712740 715752
58408G15752J277N30R47J314J477K301L468L677L058L039L726L740K905K657L377
58393G53245L676K944K295K362K349K026K383L440L639K353R89N74L19l77m61
58378G81756R29K924M417N539O579P013O621O215O291O337O175O470P283P678
58364H62227P413P393P863P915P330P072P346P147O360O190O773O629N389M809
58350I57856N920P359P789P881Q543R149R028Q854R287R784J0011J0731J2248
58337A074440J3592J4228J4859J5707J5948J5672J6295J8139J9728K0455K1574
58326A260637K3585K5085K5391K5785K6818K6958K5324K3249K1580J8994J4693
58315A518099J0252P066M438J930R58K155L697M277N176P405R410R914J0490J2797
$$ plain form
58408 715752 717029 717559 718506 719820 721297 723598 727066 730743 733801 736840 740566 744306 747211 749868 753245
58393 753245 756921 759865 762160 764522 766871 768897 771280 774720 778359 780712 781701 782275 782594 782217 781756
58378 781756 782685 785609 790026 795565 802144 809157 815778 821993 828284 834621 840796 847266 854549 862227
58364 862227 869640 877033 884896 892811 900141 907213 914559 921706 928066 934256 941029 947658 953047 957856
58350 957856 963776 971135 978924 986805 995348 1004497 1013525 1022379 1031666 1041450 1051461 1062192 1074440
58337 1074440 1088032 1102260 1117119 1132826 1148774 1164446 1180741 1198880 1218608 1239063 1260637
58326 1260637 1284222 1309307 1334698 1360483 1387301 1414259 1439583 1462832 1484412 1503406 1518099
58315 1518099 1528351 1535417 1539855 1541785 1542743 1544898 1548595 1552872 1558048 1565453 1574863 1584777 1595267 1608064
58301A608064J5623J7125J7863J9188K0738K1852K3417K5946K7895K8168K8135
58290A854014K9104L0090L0269L1119L3710L6401L7777L9342M2691M6463M8844
58279B259824N0506N2381N3088N1507M9325M8123M6567M3567M1373M2163M4231
58268B782655M5121M5866M8446N1573N3008N3790N6198N9554O1984O4322O8373
58257C390890P3170P6741P9773Q3970Q8711R2809R7471J03961J10586J15539J20264
58246D433885J26514J32804J37512J42529J49851J57760J64431J71968J82329
58237E799583J92901K01068K09598K22233K37422K51951K67068K85140L03930
58228G970894L20585L37826L59743L84920M10289M37963M71250N07945N44972
$$ plain form
58301 1608064 1623687 1640812 1658675 1677863 1698601 1720453 1743870 1769816 1797711 1825879 1854014
58290 1854014 1883118 1913208 1943477 1974596 2008306 2044707 2082484 2121826 2164517 2210980 2259824
58279 2259824 2310330 2362711 2415799 2467306 2516631 2564754 2611321 2654888 2696261 2738424 2782655
58268 2782655 2827776 2873642 2922088 2973661 3026669 3080459 3136657 3196211 3258195 3322517 3390890
58257 3390890 3464060 3540801 3620574 3704544 3793255 3886064 3983535 4087496 4198082 4313621 4433885
58246 4433885 4560399 4693203 4830715 4973244 5123095 5280855 5445286 5617254 5799583
58237 5799583 5992484 6193552 6403150 6625383 6862805 7114756 7381824 7666964 7970894
58228 7970894 8291479 8629305 8989048 9373968 9784257 10222220 10693470 11201415 11746387
58219A1746387N85661O34465O88854P44814Q05932Q77979R59301J046422J144264
58210A9234079J260355J394122J543570J717048J925856K171392K454046K788927
58202C4489395L197263L689152M272676M972723N820321O831973Q025666R451904
58194H0751073J1183136J3283292J5823350J8917240K2691895K7197134L2302507
58187B22149627L7493121M1506803M2195523L7260101K5824080R639919p404393
58180D08664781k1333678l0004496l3443304l2857135k9671241k5318237k1279035
58173B14757655j8709030j7853531j7980376j8025689j7348532j5951301j4171321
58166I4717875j2315026j0546281q948076p566137o402039n424670m606040l931322
$$ plain form
58219 11746387 12332048 12966513 13655367 14400181 15206113 16084092 17043393 18089815 19234079
58210 19234079 20494434 21888556 23432126 25149174 27075030 29246422 31700468 34489395
58202 34489395 37686658 41375810 45648486 50621209 56441530 63273503 71299169 80751073
58194 80751073 91934209 105217501 121040851 139958091 162649986 189847120 222149627
58187 222149627 259642748 301149551 343345074 380605175 406429255 416069174 408664781
58180 408664781 387331103 357326607 323883303 291026168 261354927 236036690 214757655
58173 214757655 196048625 178195094 160214718 142189029 124840497 108889196 94717875
58166 94717875 82402849 71856568 62908492 55342355 48940316 43515646 38909606 34978284
58158C4978284l379851k920517k529889k199188j920809j682207j476536j306175
58150A7563112j170159j058028r60723q78307q11757p55252p01968o50782o02268
58141I973868n54231n05967m61375m23124l88414l54536l23659k97967k74853
58132F389742k51360k29543k13261k03131j97844j96625j97080j94464j86744
58123D519690j77056j68234j58772j47147j35839j27334j20005j11817j04454
58114C269032r9863r6098r0665q4897q1007p7706p2840o7689o4501o2099n7971
58103B413696n2663m8262m4434l9704l4877l1653k9587k7868k8197l2230l7809
58092B006412m1310m2344m2726m2405m0058l6489l3845l2338l0906l0083l0993
$$ plain form
58158 34978284 31598433 28677916 26148027 23948839 22028030 20345823 18869287 17563112
58150 17563112 16392953 15334925 14374202 13495895 12684138 11928886 11226918 10576136 9973868
58141 9973868 9419637 8913670 8452295 8029171 7640757 7286221 6962562 6664595 6389742
58132 6389742 6138382 5908839 5695578 5492447 5294603 5097978 4900898 4706434 4519690
58123 4519690 4342634 4174400 4015628 3868481 3732642 3605308 3485303 3373486 3269032
58114 3269032 3169169 3073071 2982406 2897509 2816502 2738796 2665956 2598267 2533766 2471667 2413696
58103 2413696 2361033 2312771 2268337 2228633 2193756 2162103 2132516 2104648 2076451 2044221 2006412
58092 2006412 1965102 1922758 1880032 1837627 1797569 1761080 1727235 1694897 1663991 1633908 1602915
58081A602915l2442l2268l0902l0566l1537l2188l2002l1707l1019k8997k6306
58070A262981k4443k3319k1894k0559k0334k0413j9028j6273j3678j1640r665
58059A061735q428r013j0640j1662j2241j3589j5143j5145j3603j2101j1022r569
58047I19579q241q477r824j0170r039q117q211q155p291o661o882o817n339k961
58033H13394q89L17O43J91o67j512k293k903k722j520j75N73J419L202N109N817
58017H17984N795O617Q429R934J0689J1599J3200J5168J7451K0305K3276K5719
58005I86166K8137L1445L5111L7724L9291M1142M3701M6086M7995N0079N2148
57994A439025N2780N1177M7930M3567L7833L0809K3441J6650J1071P752P656J0309
$$ plain form
58081 1602915 1570473 1538205 1507303 1476737 1445200 1413012 1381010 1349303 1318284 1289287 1262981
58070 1262981 1238538 1215219 1193325 1172766 1152432 1132019 1112991 1096718 1083040 1071400 1061735
58059 1061735 1053307 1044294 1033654 1021992 1009751 996162 981019 965874 952271 940170 929148 919579
58047 919579 911338 902861 893037 882867 873828 865711 857500 849345 842054 835393 828511 821694 816355 813394
58033 813394 812505 812822 813465 813656 812989 811477 809184 806281 803559 802039 801864 802437 803856 807058 812167 817984
58017 817984 823779 830396 838825 848759 859448 871047 884247 899415 916866 937171 960447 986166
58005 986166 1014303 1045748 1080859 1118583 1157874 1199016 1242717 1288803 1336798 1386877 1439025
57994 1439025 1491805 1542982 1590912 1634479 1672312 1703121 1726562 1743212 1754283 1762035 1769691 1780000
57982A780000J4241J8873K4403K9566L1277K7172J7345L191j4027l2752n0602
57971A848687o5307p5658q1310q2474q0191p5874p0165o2926n4538m6201l8601
57960A115442l1313k3917j6949j1241p037l995j558Q56L301M953N008L975L232
57947A040757L341L721L897M116M681N684P474J0422J4088J7645K1146K5310K9992
57934A192274L4050L6864L8633L8749L5286K6914J4445j54j5301k9706m1781n0286
57922A279987n5290n7673n7952n6146n2578m8249m4195m0680l7042l2576k7616
57911G69990k3413k0589j8279j5420j2402j0496r908r570q789q056p996q521r277
57898F07274j0096j0689j0669j0141r624r237q547p412o133m741k905p94Q07J599
$$ plain form
57982 1780000 1794241 1813114 1837517 1867083 1898360 1925532 1942877 1946068 1932041 1899289 1848687
57971 1848687 1783380 1707722 1626412 1543938 1463747 1387873 1317708 1254782 1200244 1154043 1115442
57960 1115442 1084129 1060212 1043263 1032022 1024985 1020990 1019432 1020288 1023589 1028542 1033550 1037525 1040757
57947 1040757 1044098 1047819 1051716 1055832 1060513 1066197 1073671 1084093 1098181 1115826 1136972 1162282 1192274
57934 1192274 1226324 1263188 1301821 1340570 1375856 1402770 1417215 1417061 1401760 1372054 1330273 1279987
57922 1279987 1224697 1167024 1109072 1052926 1000348 952099 907904 867224 830182 797606 769990
57911 769990 746577 725988 707709 692289 679887 669391 659483 649913 641124 633068 625072 616551 607274
57898 607274 597178 586489 575820 565679 556055 546818 538271 530859 524726 519985 517080 516286 517093 518692
57884E18692K234L366M892O410P821R109J0113J0819J1396J1750J1540J0770R784
57871F28696Q556O706M335K144M73j145l077m940o216o983p666q506r544j0674
57857E92159j1424j1173r878q249o915n825m639l290j826j27J856L710M681M305
57843E43365K966J837J890K818L370K965K340K096J483m17k855m068l467k068
57829E52255q26K52J304K098K568K883K903K560K739M600P781J0634J2525J4607
57815F18883J7839K1650K5305K9172L3468L6810L7430L5450L2930L1980L3568
57804I54485L7597M3054M8063N0574M9149M3017L1978J6858j99j6585l0417m0897
57792A186677m8040n2490n5080n6112n5381n3115n0280m7509m4368m0350l6024
$$ plain form
57884 518692 520926 524292 529184 535594 543415 552524 562637 573456 584852 596602 608142 618912 628696
57871 628696 637252 643958 648293 650437 650910 649765 646688 641748 635532 628549 620883 612377 602833 592159
57857 592159 580735 569562 559684 551435 544520 538695 534056 530766 528940 528813 530669 534379 539060 543365
57843 543365 546331 548168 550058 552876 556246 559211 561551 563647 565130 564713 561858 557790 554323 552255
57829 552255 551429 551681 552985 555083 557651 560534 563437 565997 568736 573336 581117 591751 604276 618883
57815 618883 636722 658372 683677 712849 746317 783127 820557 856007 888937 920917 954485
57804 954485 992082 1035136 1083199 1133773 1182922 1225939 1257917 1274775 1274576 1257991 1227574 1186677
57792 1186677 1138637 1086147 1031067 974955 919574 866459 816179 768670 724302 683952 647928
57781F47928l2467k9893k7589k4982k2133j9307j6677j4388j2428j0545q597o820
57769D22102n429m286l281k656k524k444j964j235n97P5J021J955K471K844L655
57754D09707M776N526N791O273P474R091J0613J1890J2903J3425J3212J2158J0130
57741E32969P061L418J35k181l694m757n307n217m800m420l854k597q23O19J259
57726E07811J608K405L739N222O625P840Q589Q737Q771R268R963J0114R870J0393
57712F10955J2256J4521J6057J7043J8425K0395K2376K4227K6446K9197L2010
57701H43908L4609L7264M0204M3335M6755N0895N5973O1801O8276P5441Q2929
57690A441390R0029R6470J02478J07763J11165J11710J09437J04709R7304Q6763
$$ plain form
57781 647928 615461 585568 557979 532997 510864 491557 474880 460492 448064 437519 428922 422102
57769 422102 416673 412387 409106 406450 403926 401482 399518 398283 397686 397761 398782 400737 403208 406052 409707
57754 409707 414483 420009 425800 432073 439547 448638 459251 471141 484044 497469 510681 522839 532969
57741 532969 540030 543448 543583 541402 537708 532951 527644 522427 517627 513207 509353 506756 505933 506552 507811
57726 507811 509419 511824 515563 520785 527410 535250 543839 552576 561347 570615 580578 590692 600562 610955
57712 610955 623211 637732 653789 670832 689257 709652 732028 756255 782701 811898 843908
57701 843908 878517 915781 955985 999320 1046075 1096970 1152943 1214744 1283020 1358461 1441390
57690 1441390 1531419 1627889 1730367 1838130 1949295 2061005 2170442 2275151 2372455 2459218
57680B459218P3219N7508M0891K5066J1969L012j178R0Q054K3599M6125P3133
57668B820706R9226J14371J05381O3520o768q7443j56925k01753k20228k17994
57658B312093k02457j80220j56276j33321j12051r2793p6445o3444n2687m2512
57648A199887l2506k3567j6316j0342n036k05M393R244J4412J9296K3676K8353
57636A211289L4106M0469M6326N1503N6928O3220O9813P5618Q0032Q3124Q5118
57625A897546Q5846Q4593Q0485P3164O2849M9685L3571J5025m347k2869l9992
57614B315556n5743o9475q0062q7189r1408r3077r2242q9625q6509q3253p8999
57603A407974p3335o7251o1842n6923n1796m6650m2275l8811l5720l2719k9964
$$ plain form
57680 2459218 2532437 2589945 2630836 2655902 2667871 2670883 2669705 2669795 2677849 2701448 2747573 2820706
57668 2820706 2919932 3034303 3139684 3203204 3196436 3108993 2952068 2750315 2530087 2312093
57658 2312093 2109636 1929416 1773140 1639819 1527768 1434975 1358530 1295086 1242399 1199887
57648 1199887 1167381 1143814 1127498 1117156 1112120 1111915 1116308 1125552 1139964 1159260 1182936 1211289
57636 1211289 1245395 1285864 1332190 1383693 1440621 1503841 1573654 1649272 1729304 1812428 1897546
57625 1897546 1983392 2067985 2148470 2221634 2284483 2334168 2367739 2382764 2378417 2355548 2315556
57614 2315556 2259813 2190338 2110276 2023087 1931679 1838602 1746360 1656735 1570226 1486973 1407974
57603 1407974 1334639 1267388 1205546 1148623 1096827 1050177 1007902 969091 933371 900652 870688
57592H70688k7457k4993k2663k0760j9217j7642j5924j4328j3032j1990j1200
57581F71482j0643r924q534o586m882l988l592l002k074j249q20m63L14J466K439
57566F19944K845K905L080L453L777L925L984L983L936M101M828O045P328Q562
57552F82696J0144J2334J4794J7037J9048K1120K3289K5337K7218K9258L1863
57541I14138L5225L9182M3323M7311N1211N5338N9711O3874O7318O9865P1419
57530A517915P1536O9523O4932N7824M8566L7530K4903J0775m492k0006l4493
57519A844513m6802n6270o2730o6360o7595o6984o5070o2342n9190n5743n1920
57508A183507m7750m3512l9444l5559l1918k8730k5904k2880j9361j5887j3164
$$ plain form
57592 870688 843231 818238 795575 774815 755598 737956 722032 707704 694672 682682 671482
57581 671482 660839 650915 642381 635795 630913 626925 623333 620331 618257 617008 616188 615725 616039 617505 619944
57566 619944 622789 625694 628774 632227 636004 639929 643913 647896 651832 655933 660761 666806 674134 682696
57552 682696 692840 705174 719968 737005 756053 777173 800462 825799 853017 882275 914138
57541 914138 949363 988545 1031868 1079179 1130390 1185728 1245439 1309313 1376631 1446496 1517915
57530 1517915 1589451 1658974 1723906 1781730 1830296 1867826 1892729 1903504 1899012 1879006 1844513
57519 1844513 1797711 1741441 1678711 1612351 1544756 1477772 1412702 1350360 1291170 1235427 1183507
57508 1183507 1135757 1092245 1052801 1017242 985324 956594 930690 907810 888449 872562 859398
57497H59398j1071q996o847m984l281j194J256L418N135P088R739J2694J5475
57484H77830J8187K1019K3775K6369K9282L2977L7328M1941M6575N0916N4565
57473A260764N7663O0853O4074O6002O5364O2290N7608N1269M2338L0362J5998
57462A834585L90j5306k9914m2539n3073o1881o8872p3367p4963p4142p1839o8724
57450A200355o5052o0961n6719n2680m8909m4982m0477l5786l2016k9719k8129
57439G04925k6013k3098k0150j7879j6304j5080j3983j2904j1816j0759r774q783
57427E18382p692o597n735n292n264n383n175m448l726l750m413m727m130l223
57413D48827k769k608k136j356o79p3P79J661J988J693J254R00N31L26O90J483
$$ plain form
57497 859398 848327 839331 832484 827500 824219 823025 824281 827699 832834 839922 849661 862355 877830
57484 877830 896017 917036 940811 967180 996462 1029439 1066767 1108708 1155283 1206199 1260764
57473 1260764 1318427 1379280 1443354 1509356 1574720 1637010 1694618 1745887 1788225 1818587 1834585
57462 1834585 1834975 1819669 1789755 1747216 1694143 1632262 1563390 1490023 1415060 1340918 1269079 1200355
57450 1200355 1135303 1074342 1017623 964943 916034 871052 830575 794789 762773 733054 704925
57439 704925 678912 655814 635664 617785 601481 586401 572418 559514 547698 536939 527165 518382
57427 518382 510690 504093 498358 493066 487802 482419 477244 472796 469070 465320 460907 456180 452050 448827
57413 448827 446058 443450 441314 439958 439279 439206 439985 441646 443634 445327 446581 447481 448012 448338 449028 450511
57397D50511K003J923J586J333J212J420K259L326L631K954K375K846L827L998
57383D85204K982J632Q66Q07J046J119P77J67j20L84J464K458L016L233L110K450
57367E10595J461R77J674L277M847N682N698N172M506M168M392M880N128N156
57353E67613N393N835N853N161M430M360M636M534M195M393N195N821O009O402
57339F39830P210P561O829N786N545O077O661P225Q180R274R814R883J0257J1053
57325G51185J1537J1446J1452J1971J2502J2587J2564J2885J3407J3914J4636
57314H90086J5636J6405J6766J7446J8957K0525K1088K0875K0942K1459K1642
57303A101827K1205K0655K0027J8548J5934J3007J0457P927M929J798r60l592
$$ plain form
57397 450511 452514 454437 456023 457356 458568 459988 462247 465573 469204 472158 474533 477379 481206 485204
57383 485204 488186 489818 490684 491491 492537 493656 494433 494600 494480 494864 496328 498786 501802 505035 508145 510595
57367 510595 512056 513033 514707 517984 522831 528513 534211 539383 543889 548057 552449 557329 562457 567613
57353 567613 573006 578841 584694 589855 594285 598645 603281 607815 612010 616403 621598 627419 633428 639830
57339 639830 647040 654601 661430 667216 672761 678838 685499 692724 700904 710178 719992 729875 740132 751185
57325 751185 762722 774168 785620 797591 810093 822680 835244 848129 861536 875450 890086
57314 890086 905722 922127 938893 956339 975296 995821 1016909 1037784 1058726 1080185 1101827
57303 1101827 1123032 1143687 1163714 1182262 1198196 1211203 1221660 1229587 1234516 1236314 1235354 1231762
57291A231762o520r290j0964j1268j0663r571q251p105o305n282l381r35J061
57278A143288K237L061L858M514N167O242P531Q223Q121Q015Q474R077R323R425
57264A236556R682R828R728R999J1121J2482J3142J3116J3143J3524J4045J4607
57252A380973J5181J5372J4941J4422J4483J4920J5203J5601J6681J7913J8098
57241A553788J7177J6391J6356J6271J5490J4768J5095J6214J7067J7235J7061
57230A732913J6844J6616J6521J6801J7448J8182J8732J8982J9034J9232J9831
57219A931136K0584K1067K1383K2047K3040K3603K3234K2292K1346K0551J9942
57208B170225J9814K0299K0991K1376K1270K0674J9738J9075J9379K0397K1078
$$ plain form
57291 1231762 1225242 1215952 1204988 1193720 1183057 1173486 1165235 1158130 1151825 1146543 1143162 1142227 1143288
57278 1143288 1145525 1148586 1152444 1156958 1162125 1168367 1175898 1184121 1192242 1200257 1208731 1217808 1227131 1236556
57264 1236556 1246238 1256066 1265794 1275793 1286914 1299396 1312538 1325654 1338797 1352321 1366366 1380973
57252 1380973 1396154 1411526 1426467 1440889 1455372 1470292 1485495 1501096 1517777 1535690 1553788
57241 1553788 1570965 1587356 1603712 1619983 1635473 1650241 1665336 1681550 1698617 1715852 1732913
57230 1732913 1749757 1766373 1782894 1799695 1817143 1835325 1854057 1873039 1892073 1911305 1931136
57219 1931136 1951720 1972787 1994170 2016217 2039257 2062860 2086094 2108386 2129732 2150283 2170225
57208 2170225 2190039 2210338 2231329 2252705 2273975 2294649 2314387 2333462 2352841 2373238 2394316
57197B394316K1083K1378K2612K3871K3998K3448K3693K5066K6458K7025K7081
57186B660029K7142K7127K6878K6717K6914K7125K6901K6414K6284K6724K7294
57175B955549K7481K7365K7451K7920K8394K8634K9087L0177L1353L1623L1098
57164C276132L1105L2359L3948L4676L4651L4788L5353L5881L6020L5518L3794
57153C654225L0667K7304K5342K5008K5068K4604K3773K2627K0481J7033J3150
57142C909282R780O768L459o3l162n672p891r672j0326r526p710n416k723M55
57128C867583L865P052R756J1943J3542J4399J4480J3912J2935J2012J1956J3703
57116D007138J7724K3692L0809L8307M5641N2401N8484O4421P1351Q0428R2216
$$ plain form
57197 2394316 2415399 2436777 2459389 2483260 2507258 2530706 2554399 2579465 2605923 2632948 2660029
57186 2660029 2687171 2714298 2741176 2767893 2794807 2821932 2848833 2875247 2901531 2928255 2955549
57175 2955549 2983030 3010395 3037846 3065766 3094160 3122794 3151881 3182058 3213411 3245034 3276132
57164 3276132 3307237 3339596 3373544 3408220 3442871 3477659 3513012 3548893 3584913 3620431 3654225
57153 3654225 3684892 3712196 3737538 3762546 3787614 3812218 3835991 3858618 3879099 3896132 3909282
57142 3909282 3919062 3925830 3929289 3929226 3926064 3920392 3912501 3902829 3892503 3882977 3875267 3869851 3867128 3867583
57128 3867583 3871448 3878500 3888256 3900199 3913741 3928140 3942620 3956532 3969467 3981479 3993435 4007138
57116 4007138 4024862 4048554 4079363 4117670 4163311 4215712 4274196 4338617 4409968 4490396 4582612
57105D582612J06588J23310J42752J66107J94876K30256K73242L25283L88408
57096F533434M64479N54604O59364P79091R13393J060610J218030J382098J547809
57087A5112912J707801J852255J969124K044206K062155K009086J874455J650655
57079C0282649J333708R29426M61310k9981m99345r13106j255787j525858j727848
57070B7055168j867371j949565j979129j961058j901560j808185j689079j552465
57062A2346756j406407j258323j114149r78066q52800p39893o39674n51589m74933
57053D330922m09230l53921l07879k69431k36814k08643j84048j62615j44263
57044B054078j29022j16519j05735r5639q6163p8034p1400o5337n9168n3510m9189
$$ plain form
57105 4582612 4689200 4812510 4955262 5121369 5316245 5546501 5819743 6145026 6533434
57096 6533434 6997913 7552517 8211881 8990972 9904365 10964975 12183005 13565103 15112912
57087 15112912 16820713 18672968 20642092 22686298 24748453 26757539 28631994 30282649
57079 30282649 31616357 32545783 33007093 32977112 32477767 31564661 30308874 28783016 27055168
57070 27055168 25187797 23238232 21259103 19298045 17396485 15588300 13899221 12346756
57062 12346756 10940349 9682026 8567877 7589811 6737011 5997118 5357444 4805855 4330922
57053 4330922 3921692 3567771 3259892 2990461 2753647 2545004 2360956 2198341 2054078
57044 2054078 1925056 1808537 1702802 1607163 1521000 1442966 1371566 1306229 1247061 1193551 1144362
57033A144362m5778m2141l7934l3435k8497k2876j7236j2278p202n13Q032J7953
57021I22457L0040M5836O5792R0261J20443J52708J71201J53709R1823L760p7769
57010A770261j30377j52767j55033j45865j30249j12558r6328q2337o9761n8482
57000F36504m8848m0414l2613k5793k0358j5727j1205p047l682p69J968L815M116
56987D39947L604L767N234P516R820J1282J0935Q279L771j653p156j1774j4388
56974D69184j4674j3703j2885j2537j1863j0169p622n085l397k578j648L40L088
56961C76451N484P279R431J2507J5657J7630J7876J6011J1219L357n707j3088
56949D74107j7247j8767j8908j8191j6468j3716j0369p069m278k068k51J371L059
$$ plain form
57033 1144362 1098584 1056443 1018509 985074 956577 933701 916465 904187 896985 896472 904504 922457
57021 922457 952497 998333 1064125 1154386 1274829 1427537 1598738 1752447 1844270 1848030 1770261
57010 1770261 1639884 1487117 1332084 1186219 1055970 943412 847084 764747 694986 636504
57000 636504 587656 547242 514629 488836 468478 452751 441546 434499 430817 430048 432016 435831 439947
56987 439947 443551 447318 452552 460068 469888 481170 492105 500384 504155 502502 495346 483572 469184
56974 469184 454510 440807 427922 415385 403522 393353 385731 380646 377249 374671 373023 373363 376451
56961 376451 381935 389214 398645 411152 426809 444439 462315 478326 489545 492902 487195 474107
56949 474107 456860 438093 419185 400994 384526 370810 360441 353372 349094 347026 346775 348146 351205
56936C51205N333Q655J2787J6829K0154K2925K5267K6222K4003J7453P211m371
56924E33673j4407k0987k4001k4690k4372k3601k2335k0525j8390j6216j4176
56913C09973j2312j0695r455q572p674o381m826l522k628j846j110q03r46q70
56899B38333j90N30P22P81J304K024K451L048M616O822Q561R679J1144J3416J5703
56884C18944J6860J6079J2717O750l04o048r273j0681j1243j0963r509p184m578
56871C01567j981M95K779N129P873J0755J3252J5677J9025K3506K8273L2714L6749
56858D95813L9252L7553K9744J6901K310j0925k0964k6925k8890k7986k5603k2410
56846D57870j8441j3902r268m821m50M152R310J5159K1469K7944L4737M2328N0692
$$ plain form
56936 351205 356538 365193 377980 394809 414963 437888 463155 489377 513380 530833 538044 533673
56924 533673 519266 498279 474278 449588 425216 401615 379280 358755 340365 324149 309973
56913 309973 297661 286966 277511 268939 261265 254884 250058 246536 243908 242062 240952 240149 239203 238333
56899 238333 238143 238673 239395 240176 241480 243504 245955 249003 253619 260441 269002 278681 289825 303241 318944
56884 318944 335804 351883 364600 371350 371046 364998 355725 345044 333801 322838 313329 306145 301567
56871 301567 299586 300081 302860 307989 315862 326617 339869 355546 374571 398077 426350 459064 495813
56858 495813 535065 572618 602362 619263 621573 610648 589684 562759 533869 505883 480280 457870
56846 457870 439429 425527 416259 411438 410988 415140 424450 439609 461078 489022 523759 566087 616779
56833F16779N8716O4127O3659N4152L5016R977j4668l4030m6591n2851n3720n0598
56821F49968m5509l9950l4130k7836k1302j4824q422k348K934P784J3404K0253
56809E00022K7436L4169M0636M6274M8228M2909K9143R349j1733k9195l9982m4180
56797F53076m4164m2059l8474l3656k8527k3672j8569j2857p555l770j059J772
56785D00486M954Q084J1540J6037K1027K4700K5467K2530J5532M963p108j7876
56773E30336k5552k9775l0766k9165k6383k3886k1985k0080j7970j6005j4151
56762B74618j1928r382p201n749m741l963l502l229k743k011j403j030o47k35
56748B16854o6j17k1K69K82k90j048j295q01j38k07j258k388k432j408n10m91
$$ plain form
56833 616779 675495 739622 803281 857433 892449 902426 887758 853728 807137 754286 700566 649968
56821 649968 604459 564509 530379 502543 481241 466417 457995 455647 458581 466365 479769 500022
56809 500022 527458 561627 602263 648537 696765 739674 768817 778166 766433 737238 697256 653076
56797 653076 608912 566853 528379 494723 466196 442524 423955 411098 403543 399773 398714 400486
56785 400486 405440 413524 425064 441101 462128 486828 512295 534825 550357 555320 548212 530336
56773 530336 504784 475009 444243 415078 388695 364809 342824 322744 304774 288769 274618
56762 274618 262690 253308 246107 240358 235617 231654 228152 224923 222180 220169 218766 217736 217089 216854
56748 216854 216788 216671 216650 216919 217201 216911 215863 214568 213767 213629 213422 212164 209776 207344 205936 205426 204935
56731B04935p98o86l32k80m22l63j56L7M60J157J426P60j05p0P91J508J717J976
56713B11555K738L906N229O413P044P091P164P631P866P153N805M452K853N60
56699B87460j610k161q99Q23J813J943J461O33J44O68J810K478K385K257K418
56684C01623K281J506O27J10k92r17j638k236k652k650j997j230j322k397l455
56669B85361l756l655l768m062m149l866l226k436k168l009m333m576l210j573
56655B37574j169j705j688m98R43J439P71l28r43n94N33J746K316J956R68j4m76
56638B40831m16k00l2K28N79N87k9q42j233j261j477k019k501k746l021l425l549
56621B19474k999j873o18M00J058J480J849K226K568K947L452L752L319K339J815
$$ plain form
56731 204935 204137 203451 203119 202839 202417 202054 201898 201935 202395 203552 204978 205738 205633 205563 206354 207862 209579 211555
56713 211555 214293 218199 223428 229841 236885 243976 251140 258771 266637 273790 279595 284047 286900 287460
56699 287460 285850 283689 282790 283613 285426 287369 288830 289463 289607 290275 292085 294563 296948 299205 301623
56684 301623 303904 305410 306037 306147 305855 304938 303300 301064 298412 295762 293765 292535 291213 288816 285361
56669 285361 281605 277950 274182 270120 265971 262105 258879 256443 254275 251266 246933 242357 239147 237574
56655 237574 236405 234700 233012 232514 233457 234896 235667 235339 234396 233802 234335 236081 238397 240353 241321 241307 240831
56638 240831 240415 240215 240183 240411 240990 241577 241548 240706 239473 238212 236735 234716 232215 229469 226448 223023 219474
56621 219474 216475 214602 213984 214384 215442 216922 218771 220997 223565 226512 229964 233716 237035 239374 241189
56606B41189K239K787K384J199K54k4K5K64R33J886K487K418J967J456R67O11
56590B63042M52K37l43j135j754k079k005j143N06J929K091J345Q78R45P72K03
56574B63941J14R17J720J614Q94M33M93P16P95O33K09l31p37j034j445j888k033
56557B65011j944k077k461k567k239k141k792l680l889l321k778k928l574l949
56543B24671l513k485j593j361j769k527l369l880l476k050m11N26P51R58J414
56528B01886J694J485J106J011J251J437J033k39j997l280l436k794k187k052
56514A94918k278k656k935k757k067j412j303j471j285o76j34L9j10n49j160j460
56498A72704j041j66N48Q99J073J192J372J932K904L666L716L473L619M016M006
$$ plain form
56606 241189 243428 246215 248599 249798 250052 250028 250053 250317 251250 253136 255623 258041 260008 261464 262431 263042
56590 263042 263494 263731 263388 262253 260499 258420 256415 255272 255778 257707 259798 261143 262021 262966 263738 263941
56574 263941 264055 264972 266692 268306 269200 269633 270126 270842 271637 272270 272479 272148 271411 270377 268932 267044 265011
56557 265011 263067 260990 258529 255962 253723 251582 248790 245110 241221 237900 235122 232194 228620 224671
56543 224671 221158 218673 217080 215719 213950 211423 208054 204174 200698 198648 198237 198763 199514 200472 201886
56528 201886 203580 205065 206171 207182 208433 209870 210903 210664 208667 205387 201951 199157 196970 194918
56514 194918 192640 189984 187049 184292 182225 180813 179510 178039 176754 176078 175944 175983 175873 175324 174164 172704
56498 172704 171663 171497 172045 172944 174017 175209 176581 178513 181417 185083 188799 192272 195891 199907 203913
56483B03913L450K661J689N24k59m7P81J271J168R63Q42N93L30L05J20q57k218
56466B15229k721j893o03J39J70j08k94j19L53N91J79n49r54r09o20n5P00R89
56448B09525M00l54m03q7l58j138j518j321j157j109o83n2Kn36q03m81j47j12
56430A99668o4K7k34o88n86K75J311K103K656K767K219J531J436J772J890J962
56414B18045K467K772J857L65O6J150J846J160J23k20k61n13m99J1J64n44j213
56397B26776r13j25J97Mk62n82r55q72j6J116J877K133J890J107K79K57J036J570
56379B34517J245N75N8m83r62n70R19K364K592J793R66O48P98J199J472J309R96
56362B49436J059J300J050M71M70J185J734J809K109K853L204K737K188K101K050
$$ plain form
56483 203913 207363 210024 211713 212237 211978 211931 212712 213983 215151 216114 216956 217549 217879 218184 218304 217447 215229
56466 215229 212508 210615 210012 210151 210321 210213 209919 209800 210153 210744 210923 210374 209420 208511 207891 207836 208536 209525
56448 209525 209925 209571 209168 209081 208723 207585 206067 204746 203589 202480 201797 201745 201747 201211 200408 199927 199780 199668
56430 199668 199604 199631 199397 198709 198123 198398 199709 201812 204468 207235 209454 210985 212421 214193 216083 218045
56414 218045 220512 223284 225141 225506 225572 226722 228568 229728 229851 229631 229370 228857 228358 228369 228533 227989 226776
56397 226776 225863 225738 225935 225939 225677 225095 224140 223268 223252 224368 226245 228378 230268 231375 231654 231911 232947 234517
56379 234517 235762 236337 236395 235912 234950 234380 235299 237663 240255 242048 243014 243662 244460 245659 247131 248440 249436
56362 249436 250495 251795 252845 253316 253786 254971 256705 258514 260623 263476 266680 269417 271605 273706 275756
56347B75756J834K150L205L993L804L316L296L408L279L577M847O153O168N014
56333C29800L977L826M236M493M148L345K866L351M280M474L687K780K182J410
56319C78855M27J04O67R92K40r02j340j015m91l7K43K26K54R28K000K509K387
56302C86047K696L811M682M565M201M515N314O079O866P672Q018P958Q449R922
56288D70795J1498J2345J2847J3696J4858J6083J7482J9025K0427K1965K4369
56277F55390K7534L0580L3423L6919M1164M5223M8995N3642N9636O6094P2640
56266A171240Q0071Q8427R6264J02738J08597J14224J18531J20777J21584J21070
56256B243523J17864J11225J02213R1614P8651O3162M7004L1719J6701J256j3314
$$ plain form
56347 275756 277590 279740 282945 286938 290742 294058 297354 300762 304041 307618 312465 318618 324786 329800
56333 329800 333777 337603 341839 346332 350480 353825 356691 360042 364322 368796 372483 375263 377445 378855
56319 378855 379282 379386 380053 381045 381285 380383 379043 378028 377537 377500 377743 377969 378223 379151 381151 383660 386047
56302 386047 388743 392554 397236 401801 406002 410517 415831 421910 428776 436448 444466 452424 460873 470795
56288 470795 482293 494638 507485 521181 536039 552122 569604 588629 609056 631021 655390
56277 655390 682924 713504 746927 783846 825010 870233 919228 972870 1032506 1098600 1171240
56266 1171240 1251311 1339738 1436002 1538740 1647337 1761561 1880092 2000869 2122453 2243523
56256 2243523 2361387 2472612 2574825 2666439 2745090 2808252 2855256 2886975 2903676 2904932 2891618
56245B891618k5590l6231m6435n5735o3187o9356p5275q0692q5098q9052r2826
56234B172141r5156r5140r4021r3284r2378r0144q7009q3833q0016p4858o9437
56223A216865o4996o0701n5220m9413m5130m2194l8807l4353k9729k5559k1915
56212G48848j9253j7829j6729j5008j3090j1664j0205q131o279n587n388m684
56200F15001m001m162m375l476j992j154p83j4R40J581K571M552O515P278P495
56185F25976Q368R498R957J0283J1328J2240J1773J0660J0470J0982J0827R882
56173G52244R005Q227P225O724P487Q750R477J0222J1854J3636J4559J5489J7891
56160H92790K1508K5314K9596L5100M1390M8163N6905O8969Q3379R8771J16134
$$ plain form
56245 2891618 2866028 2829797 2783362 2727627 2664440 2595084 2519809 2439117 2354019 2264967 2172141
56234 2172141 2076985 1981845 1887824 1794540 1702162 1612018 1525009 1441176 1361160 1286302 1216865
56223 1216865 1151869 1091168 1035948 986535 941405 899211 860404 826051 796322 770763 748848
56212 748848 729595 711766 695037 680029 666939 655275 645070 636939 630660 625073 619685 615001
56200 615001 611000 606838 602463 598987 596995 595841 595058 595044 595984 597565 600136 604688 611203 618481 625976
56185 625976 634344 643842 653799 664082 675410 687650 699423 710083 720553 731535 742362 752244
56173 752244 761249 769476 776701 783425 790912 799662 809139 819361 831215 844851 859410 874899 892790
56160 892790 914298 939612 969208 1004308 1045698 1093861 1150766 1219735 1303114 1401885 1518019
56149A518019J36963J59766J80760J96797K05244K02650J86975J60828J30340
56140C078342J01457P8924O6445O4147O6436O5347N6079L8239J4021j1959l2868
56129C584610m3791m5807m4303m4660n1372o8525r6710j30265j60769j82883j94781
56118B520744j95367j84974j67400j47379j26667j05405q5647o9809n7062m5143
56108A335891l4577k7391k2879j8676j4951j3478j3543j2881j1814j2328j3819
56097A139554j3875j2581j1923j1632r836p146n857n645m263j896n72K5J781L921
56083A060055M138L283M198O430P036O216P008R542J0725R883R686J1067J2151
56070A161418J2597J4179J6547J7177J6091J6031J7500J8122J7341J7116J7680
$$ plain form
56149 1518019 1654982 1814748 1995508 2192305 2397549 2600199 2787174 2948002 3078342
56140 3078342 3179799 3258723 3325168 3389315 3455751 3521098 3577177 3615416 3629437 3617478 3584610
56129 3584610 3540819 3495012 3450709 3406049 3354677 3286152 3189442 3059177 2898408 2715525 2520744
56118 2520744 2325377 2140403 1973003 1825624 1698957 1593552 1507905 1438096 1381034 1335891
56108 1335891 1301314 1273923 1251044 1232368 1217417 1203939 1190396 1177515 1165701 1153373 1139554
56097 1139554 1125679 1113098 1101175 1089543 1079707 1072561 1066704 1061059 1056796 1054900 1054328 1054353 1056134 1060055
56083 1060055 1064193 1067476 1071674 1078104 1085140 1091356 1098364 1107906 1118631 1128514 1138200 1149267 1161418
56070 1161418 1174015 1188194 1204741 1221918 1238009 1254040 1271540 1289662 1307003 1324119 1341799
56059A341799J7188J5958J6320J8109J8888J8825K0413K3312K4497K3821K4210
56048A563340K6148K7172K7134K8560L1382L2738L2429L3219L5309L6066L5600
56037A909097L6874L9850M1324M1020M1918M4125M4615M3655M5134M9648N3522
56026B390782N5477N7927O0893O1302N9354N9054O1286O2754O2726O4203O7580
56015C063338O9940P1388P5219Q1042Q4988Q7268R2082R9464J05098J08746J14560
56004D053133J22486J28070J31511J37865J47305J54652J59586J67459J78780
55995E380847J88092J94764K04371K17797K29812K40113K54398K72668K88372
55986G471234L01208L18428L41321L63440L84590M12628M48554M84279N18476
$$ plain form
56059 1341799 1358987 1374945 1391265 1409374 1428262 1447087 1467500 1490812 1515309 1539130 1563340
56048 1563340 1589488 1616660 1643794 1672354 1703736 1736474 1768903 1802122 1837431 1873497 1909097
56037 1909097 1945971 1985821 2027145 2068165 2110083 2154208 2198823 2242478 2287612 2337260 2390782
56026 2390782 2446259 2504186 2565079 2626381 2685735 2744789 2806075 2868829 2931555 2995758 3063338
56015 3063338 3133278 3204666 3279885 3360927 3445915 3533183 3625265 3724729 3829827 3938573 4053133
56004 4053133 4175619 4303689 4435200 4573065 4720370 4875022 5034608 5202067 5380847
55995 5380847 5568939 5763703 5968074 6185871 6415683 6655796 6910194 7182862 7471234
55986 7471234 7772442 8090870 8432191 8795631 9180221 9592849 10041403 10525682 11044158
55977A1044158N59767O10577O63561P17876P82646Q60068R42364J029981J134694
55968A8345692J260049J398391J552265J737870J962181K219729K518249K882824
55960C3877250L328326L855317M480731N242820O168525P271021Q589724J0195666
55952H3009380J2149620J4502439J7348711K0820392K4986284K9740614L4640530
55945B37197970L8576690L9561610L5317162K4776764R372867p292583k1365826
55938C56144654l0639935l5001037l5571532l3702519l0513669k6822415k3142025
55931A40751522j9721707j6665102j4023477j1797972r935246q374676p081027
55924E3152315o020283n141437m402814l788823l285063k862226k497772k189323
$$ plain form
55977 11044158 11603925 12214502 12878063 13595939 14378585 15238653 16181017 17210998 18345692
55968 18345692 19605741 21004132 22556397 24294267 26256448 28476177 30994426 33877250
55960 33877250 37205576 41060893 45541624 50784444 56952969 64223990 72813714 83009380
55952 83009380 95159000 109661439 127010150 147830542 172816826 202557440 237197970
55945 237197970 275774660 315336270 350653432 375430196 384803063 377510480 356144654
55938 356144654 325504719 290503682 254932150 221229631 190715962 163893547 140751522
55931 140751522 121029815 104364713 90341236 78543264 68608018 60233342 53152315
55924 53152315 47132032 41990595 37587781 33798958 30513895 27651669 25153897 22964574
55916B2964574j933651j713673j517259j348396j208682j086248r72840q74234
55908A2309591p94027p23353o55685n96394n48884n05679m61666m22688l92838
55899G208377l65874l36942l10793k90942k72127k50732k31997k19757k09009
55890D720204j95308j82096j72428j62542j49680j37778j29693j22029j12750
55881C355900j05704j02517r8162q9624q1079p5511o9039n8790m9188m5304m6531
55870B534451n1204o0471p2872q1780q3204q0514p7564p3175o6126n9192n4084
55859A774265m8315m0895l5274l3049l0793k6716k4269k5334k6088k3627k0803
55848A439102k0330j9910j7478j5649j6586j7692j6739j6169j8133k0191k0106
$$ plain form
55916 22964574 21030923 19317250 17799991 16451595 15242913 14156665 13183825 12309591
55908 12309591 11515564 10792211 10136526 9540132 8991248 8485569 8023903 7601215 7208377
55899 7208377 6842503 6505561 6194768 5903826 5631699 5380967 5148970 4929213 4720204
55890 4720204 4524896 4342800 4170372 4007830 3858150 3720372 3590679 3468650 3355900
55881 3355900 3250196 3147679 3049517 2959893 2878814 2803303 2734264 2675474 2626286 2580982 2534451
55870 2534451 2483247 2422776 2349904 2268124 2184920 2104406 2026842 1953667 1887541 1828349 1774265
55859 1774265 1725950 1685055 1649781 1616732 1585939 1559223 1534954 1509620 1483532 1459905 1439102
55848 1439102 1418772 1398862 1381384 1365735 1349149 1331457 1314718 1298549 1280416 1260225 1240119
55837A240119k0130k2266k4041k3140k1754k2068k1936j9325j6749j6941j8008
55826A013761j7216j5804j5846j5978j4477j3221j4404j6373j6558j5608j5072
55815H43204j4010j1450r230q923q843p361o214p256q950r283r222j0065j0444
55802G21953r227q327r232r685p299l742j829j006Q14L236M563M773M347K456
55788F91795q52k988k155o0J211K256L641L235n04n339q680j1575j5900k0220
55774F33865k2075k2157k2526k2692k1107j8815j7888j7746j6342j3859j2001
55763D26657j0910r678q730q807q827p500n857n636o384o537o081n792n292m244
55749C26382l896n114o388o155n462n885o633o238n403n429n425l985k117j653
$$ plain form
55837 1240119 1219989 1197723 1173682 1150542 1128788 1106720 1084784 1065459 1048710 1031769 1013761
55826 1013761 996545 980741 964895 948917 934440 921219 906815 890442 873884 858276 843204
55815 843204 829194 817744 808514 799591 790748 783387 777173 769917 760967 751684 742462 732397 721953
55802 721953 712726 704399 695167 685482 678183 674441 672612 671606 672420 675656 680219 684992 689339 691795
55788 691795 690943 687955 685800 685740 686951 689207 692848 696083 695579 690240 681560 669985 654085 633865
55774 633865 611790 589633 567107 544415 523308 504493 486605 468859 452517 438658 426657
55763 426657 415747 406069 397339 388532 379705 372205 366348 360712 354328 347791 341710 335918 330626 326382
55749 326382 322486 317372 310984 304829 299367 293482 286849 280611 275208 269779 264354 260369 258252 256599
55735B56599k005j320K40J128J277J689K106J632P60M50J49r93j977j368J57R59
55719B59483J095J611K254K224K216L374N074N895N919O082O254O022O270P797
55705C21570R483R937R817J0343J0707R401P007N240M099K420M51n62p61j355
55691C97797k447l293m123n656p395q329q683r106q966p389n228m040l877l890
55677C15375m185n104n647m703l086k282k052j170K97J575L096N642Q447J0331
55663C16534J1918J4482J7292J8449J7738J6372J4508J1326P165L287j48l749
55651D45174o905q294q121p782p535o438m443k559j111L95J820K506K536K306
55637D01549J200j633n605r379j2740j6145j8985k0096j9596j8568j7393j5939
$$ plain form
55735 256599 254594 253274 253514 254642 255919 257608 259714 261346 262106 262556 262705 261712 259735 258367 258524 259483
55719 259483 260578 262189 264443 266667 268883 272257 277331 283226 289145 295227 301481 307503 313773 321570
55705 321570 331053 340990 350807 361150 371857 381258 388265 393505 397604 400024 400475 399913 399152 397797
55691 397797 395350 392057 387934 382278 374883 366554 357871 348765 339799 332410 327182 323142 319265 315375
55677 315375 311190 306086 300439 295736 292650 290368 288316 287146 287443 289018 292114 297756 306203 316534
55663 316534 328452 342934 360226 378675 396413 412785 427293 438619 445784 449071 448923 445174
55651 445174 438269 429975 421854 414072 406537 400099 395656 393097 391986 392381 394201 396707 399243 401549
55637 401549 402749 401116 395511 386132 373392 357247 338262 318166 298570 280002 262609 246670
55625B46670j4678j3956j2893j0781q758q193q265p275n552m732m780m210k947
55612A39650k442k983l207k430j480r57n83l55o14j007r51r75j856k768k208n96
55596A14238P8q71k119k554k377j892j013j33R8j3L90J165J450J270J381J850
55580A10948K236K835M092N198N065M263M187M734M775M488N052O205O382N317
55566A75777M318L799K730P98r22j905k874m126m928n028n142n501n449m876m496
55551A42175m500m276l730l411l239k589j686j399j626j461r30r02j224q02L76
55536A10776J074R03P97J165J393J459K231L736M871N267N783O757P481P904R098
55521A70695J1329J3240J3737J3292J2717J1979J0819R304P204L864o62n407r667
$$ plain form
55625 246670 231992 218036 205143 194362 185604 177411 169146 161871 156319 151587 146807 142597 139650
55612 139650 137208 134225 131018 128588 127108 126151 125568 125213 124599 123592 122641 121666 119810 117042 114834 114238
55596 114238 114316 113445 111326 108772 106395 104503 103490 103357 103455 103442 103832 104997 106447 107717 109098 110948
55580 110948 113184 116019 120111 125309 130374 134637 138824 143558 148333 152821 157873 164078 170460 175777
55566 175777 180095 183894 186624 187422 186500 184595 181721 177595 172667 167639 162497 156996 151547 146671 142175
55551 142175 137675 133399 129669 126258 123019 120430 118744 117345 115719 114258 113328 112426 111202 110400 110776
55536 110776 111850 112753 113550 114715 116108 117567 119798 123534 128405 133672 139455 146212 153693 161597 170695
55521 170695 182024 195264 209001 222293 235010 246989 257808 267112 274316 278180 277518 272111 262444
55508B62444j3336j5986j6958j6566j5918j5330j4186j2501j1116j0121q606o406
55496A05414m720m421m991n478n468m892l966l455l807m110l208j675j115j655
55482E2453j915j487j455k141k344j410k76K24M86Q70R04L87p2k23n01p84l28
55465D2388O22Q14N6l86j4P4o53j016j55Q63P30k30r71j301j449j130k08N61M27
55446C9022l79j205j761j811j034K56J120J180R33O90K29l04l58q4j69l87J97
55429C6135J340J605O60j08J29M93K30p7j5k69j017j088P2J150R69L09L42N37
55411D1397k80j820k783k689j960r28J02M60k3m13J23J068J406J022M27j78o83
55394C4248o65n3L91Q0n67r24j083j295j326j056r34j142j111n29K9J38K55P67
$$ plain form
55508 262444 249108 233122 216164 199598 183680 168350 154164 141663 130547 120426 111820 105414
55496 105414 100694 96273 91282 85804 80336 75444 71478 68023 64216 60106 56898 55223 54108 52453
55482 52453 50538 49051 47596 45455 43111 41701 41425 41649 42135 43005 43909 44296 44224 44001 43500 42716 42388
55465 42388 43010 43824 43880 43494 43480 43554 42901 41885 41730 42593 43323 43093 42122 40821 39372 38242 38034 38595 39022
55446 39022 38643 37438 35677 33866 32832 33088 34208 35388 36321 37011 37240 36936 36578 36494 36325 35938 36135
55429 36135 37475 39080 39740 39632 39761 40254 40484 40407 40392 40123 39106 38018 38090 39240 40209 40518 40860 41397
55411 41397 41117 39297 36514 33825 31865 30937 31039 31499 31476 31063 31186 32254 33660 34682 35109 34931 34248
55394 34248 33583 33530 33921 34001 33434 32510 31427 30132 28806 27750 26816 25674 24563 24034 24063 24201 24456 25223
55376B5223J154R17N13N20P12O66M90K37n02j687k372j935r75l27jK31J67j65
55358B2866j38M24P29L47M0M90J128J149Q13P47P92M79m2l49m49l76J16Q52J035
55339C0653L85l80p64j192j831j906j016j7L24N27J217J810J473N06l04r14j572
55322B6999j923j558q09j05O30J255J036j08j009q13j99q2j99L2L03K75M93J223
55304B5441J472N13o20n74K59O14M12M27O09L26k20l04M0L13O33J263J617J026
55286C3247M2l32j73j87l09m0L65L52J51J95Rr07j752j446m01J68J97M72R48R51
55266C1550O60O55M59p32k156k222j032k23l28k34M84O91k43j247j243o13j83
55249B4043O0M20O76O32O40Q97R11K77n82r58p19k47J14L07N19R50J369J143J38
$$ plain form
55376 25223 26377 27294 27807 28327 29039 29705 30195 30432 29930 28243 25871 23936 22961 22634 22633 22864 23031 22866
55358 22866 22728 23152 23881 24228 24268 24758 25886 27035 27848 28595 29387 29866 29824 29475 29026 28650 28766 29618 30653
55339 30653 31038 30658 29894 28702 26871 24965 23949 23932 24256 24783 26000 27810 29283 29789 29485 28571 26999
55322 26999 25076 23518 22709 22604 23234 24489 25525 25417 24408 23595 23396 23314 23115 23147 23450 23725 24218 25441
55304 25441 26913 27426 26806 26232 26491 27105 27517 27944 28553 28879 28659 28355 28395 28708 29341 30604 32221 33247
55286 33247 33289 32957 32784 32597 32288 32248 32613 32965 33116 33311 33320 32413 30661 29215 28814 28982 29179 29651 30599 31550
55266 31550 32210 32865 33324 32592 30436 28214 27182 26959 26631 26397 26881 27572 27329 26082 24839 24226 24043
55249 24043 24103 24523 25199 25831 26471 27368 28279 28556 27974 27016 26297 26050 26164 26471 26990 27940 29309 30452 30590
55230C0590p74p39p8K68P6k05m39p64q49k90M50N02m7l27j17j5j57O8Q59J601
55210B9613J855J790J492P74j14n13l29j67k52r7M74Q47N81R2l1K04N16P80Q16
55191C8331K85p39j477j226k92K26l70j603k249j665n11J06L2J01P10J228J107
55174C1994P50P04P69O16N23P47P83J77n47o89n18p03j121j227j078r87o91Q1
55156B9583P46P13M98P74R35P5j128j166j02N62L13J85O92R73M86kK36Q17J158
55137C6348J301J324R34K46l4K53M26J95K69J068J841J771J152P80P26M52l21
55120D8731j381k305k596j977q35mJ55O3J87M90O71N53N0o87j109q04j52J25M6
55101C9221K92J081J831K009J582O44o45j629j573o77P7K34K25L27J99k68m62
$$ plain form
55230 30590 29816 29077 28999 29267 29343 29138 28699 27935 27086 26796 27246 27748 27701 27374 27257 27242 27085 27153 28012 29613
55210 29613 31468 33258 34750 35524 35410 34897 34568 34401 34149 34052 34526 35373 35954 36046 36015 36219 36735 37515 38331
55191 38331 38616 37877 36400 35174 34882 35108 34738 33135 30886 29221 28710 28816 28848 28949 29659 30887 31994
55174 31994 32744 33448 34217 34833 35356 36103 36886 37063 36516 35827 35309 34606 33485 32258 31180 30193 29502 29583
55156 29583 30329 31042 31540 32314 33249 33324 32196 31030 30928 31490 31803 31988 32680 33653 34139 34137 34373 35190 36348
55137 36348 37649 38973 39907 40153 40119 40372 40798 40993 41262 42330 44171 45942 47094 47874 48600 49052 48731
55120 48731 47350 45045 42449 40472 39637 39633 39788 39851 40038 40528 41199 41752 41802 41115 40006 39202 39050 39175 39221
55101 39221 39513 40594 42425 44434 46016 46660 46015 44386 42813 42136 42213 42447 42672 42999 43198 42930 42468
55084D2468N5Q31J179J019P65P42R51J153R91M28o3j31j48o47j370j592j227q02
55066D4602m67O5O48P45M04L25P14R80P24K11k68p52j107j002o10n72j037j422
55048D2181j207m01Q25K127K736K105R26N32J164J772J661J253J027P58K48j12
55032E7595QL97Q64J456J915J685Q23J04j11l09q51j367j470j339j275j291j406
55015E5428j653j671j076k80m8k32j0N33L19q76j812j559p22k10Q1N59Q98O16
54997D8285J4k80j65J72P01J271J418J079Q55J143J566J665J504J241Q48O28J135
54980F3080K099K393J640J005J644L172M461N239O069P237Q482R602J0624J1633
54966A38380J2791J4297J6026J7494J8270J7989J6068J2124O770J150m282r588
$$ plain form
55084 42468 42523 43354 44533 45552 46317 47059 48010 49163 50154 50582 50519 50388 50240 49593 48223 46631 45404 44602
55066 44602 44135 44200 44848 45593 45997 46322 47036 48016 48740 48951 48683 47931 46824 45822 45212 44640 43603 42181
55048 42181 40974 40573 41398 43525 46261 48366 49292 49824 50988 52760 54421 55674 56701 57459 57707 57595
55032 57595 57603 58000 58864 60320 62235 63920 64743 64847 64736 64427 63576 62209 60739 59400 58125 56834 55428
55015 55428 53775 52104 51028 50748 50700 50468 50458 50991 51310 50434 48622 47063 46341 46131 46212 46771 47669 48285
54997 48285 48299 48019 47854 48026 48727 49998 51416 52495 53350 54493 56059 57724 59228 60469 61317 61945 63080
54980 63080 65179 67572 69212 70217 71861 75033 79494 84733 90802 98039 106521 116123 126747 138380
54966 138380 151171 165468 181494 198988 217258 235247 251315 263439 270209 271359 267077 257489
54954B57489j4117j6737j7489j7543j7233j5707j3067j1041j0489r915p837n249
54942A01065m045m118l796k485j094k15M67J012R06J25n43l86P32K584M590N862
54926A00661O027N958O873Q970J1505J3841J5667J6491J5885J4065J1552Q302
54914B35797L873j643p373j2229j5357j6437j6002j5080j4083j2533j0299q328
54902A10306p439p111o351n150m169l478k669j869j508j363q90l36m40j129j433
54887F4971q54P5O10N04j27r69j434j146n29l83q84j478j748j787j769j615j300
54870E0137j007r76j278j733j912j551j037j028j444j398m72O42J180J254J272
54855D0649J143P14L86M64N42K42m3R5K07k54q91r84n86q4O68J729K177J162n55
$$ plain form
54954 257489 243372 226635 209146 191603 174370 158663 145596 134555 124066 114151 106314 101065
54942 101065 97020 92902 89106 86621 85527 85312 85779 86791 87697 87822 87279 86893 87625 90209 94799 100661
54926 100661 106688 112646 119519 128489 139994 153835 169502 185993 201878 215943 227495 235797
54914 235797 239670 238027 230654 218425 203068 186631 170629 155549 141466 128933 118634 110306
54902 110306 102867 95756 89405 84255 80086 76608 73939 72070 70562 69199 68309 67973 67533 66404 64971
54887 64971 64117 64192 64802 65306 65179 64210 62776 61630 61101 60718 59834 58356 56608 54821 53052 51437 50137
54870 50137 49130 48154 46876 45143 43231 41680 40643 39615 38171 36773 36301 36943 38123 39377 40649
54855 40649 41792 42506 42892 43356 43898 44140 44097 44192 44399 44145 43254 42270 41684 41600 42268 43997 46174 47336 46781
54836D6781j329p34K73R76J439J579J132N60P80J701K214J855J443J743K501L129
54820F6043L515L790M005M363N154O322P565Q894J0447J1892J2816J3599J4905
54807A73310J6297J6312J4197J0625O520K107k497o718j0031j2355j3591j3468
54795A80708j2220j0808r898r223q230o878n438m085l063k749l044l133k246n00
54781I9193J364K823L903M831N644O094N969N574N724O999R095J1216J2810J3753
54767A94992J4094J4128J4333J4605J3861J1103O665J752k992p632j1890j5068
54755B47951j6999j8112j8418j7428j5302j3129j1618j0367q861p406o497n954
54743I7860n272m424l747l388l282l360l420l049k087r47k26j56n15r21j095j107
$$ plain form
54836 46781 45452 44718 44991 45967 47406 48985 50117 50677 51457 53158 55372 57227 58670 60413 62914 66043
54820 66043 69558 73348 77353 81716 86870 93192 100757 109651 120098 131990 144806 158405 173310
54807 173310 189607 205919 220116 230741 237261 239368 236871 230153 220122 207767 194176 180708
54795 180708 168488 157680 147782 138559 130329 123451 118013 113928 110865 108116 105072 101939 99693 99193
54781 99193 100557 103380 107283 112114 117758 123852 129821 135395 141119 148118 157213 168429 181239 194992
54767 194992 209086 223214 237547 252152 266013 277116 283781 285533 282541 274909 263019 247951
54755 247951 230952 212840 194422 176994 161692 148563 136945 126578 117717 110311 103814 97860
54743 97860 92588 88164 84417 81029 77747 74387 70967 67918 65831 64884 64658 64502 63987 63066 61971 60864
54727F0864j301j766k027j656j003p27p67n05J03M29K91L43R69J560J368N26k52
54710E6449n41l25K94J067J591J694J626J609J458R24J47m89p30n60j63J27J37
54693F4315P0J94L15J01j75J80J161J872J676J001O10O54Q67J215J770K245K284
54676H0355K029K008K400K795K714K189J760J964K724L360L346L028L241M267
54662A18180N540O488P209Q085R073R743R802R216P914N672K457j231m599p159
54648A86390q989j0297j0858j0340r067p890p173o430n362m604m802n407n240
54635H9931m026k581j608j063p28o15o46n43k53k7O6K31N09O76O19L95p2q19j435
54616G8011j427r88q45j211j534j370j017r55j205j453j438j085n08k2Q0k07p60
$$ plain form
54727 60864 59563 57797 55770 54114 53111 52384 51617 51112 51215 51644 51935 52278 53247 54807 56175 56701 56449
54710 56449 55908 55583 55877 56944 58535 60229 61855 63464 64922 65846 65993 65504 64774 64214 64051 64178 64315
54693 64315 64385 64579 64894 64995 64820 65000 66161 68033 69709 70710 71320 71974 72841 74056 75826 78071 80355
54676 80355 82384 84392 86792 89587 92301 94490 96250 98214 100938 104298 107644 110672 113913 118180
54662 118180 123720 130208 137417 145502 154575 164318 174120 183336 191250 196922 199379 198148 193549 186390
54648 186390 177401 167104 156246 145906 136839 128949 121776 115346 109984 105380 100578 95171 89931
54635 89931 85905 83324 81716 80653 79925 79310 78664 78121 77868 77841 77907 78138 78647 79323 79942 80337 80265 79446 78011
54616 78011 76584 75596 74751 73540 72006 70636 69619 68664 67459 66006 64568 63483 62975 62953 63033 62826 62066
54599F2066j496k039j696l27J087J461R60N46M70J72m06n66p7L58K13j69l62m81
54581E9714o70o72m03k99o57j151j365j285j010m80K60R50J402J518J101K75r9
54564E7129P10K025K401J605Q31Q15R61P10M94O80P90N82P99J935L166L586L598
54547H2817M032M599M436L630K988K641K012R80Rp91j796l008l865m048l844l688
54531H7104l779m063m171l616k476j588j498j616j087j53J56m60j188j278q43
54516E9444l97k00k12k67j50J64L32M1m77o75l86P9M10N79O58O87O38L53k85r08
54496E9428p68L57J640K085J708J305J259J207Q25L56J42R5j15n61r32q93n46
54479F6592m68j056j891k063j283k93L8l16p90r89q40l30M28J035J141Q16L34
$$ plain form
54599 62066 60570 58531 56835 56508 57595 59056 60016 60562 61032 61204 60798 60232 60155 60513 60726 60557 60195 59714
54581 59714 59044 58372 57969 57670 57013 55862 54497 53212 52202 51722 51982 52932 54334 55852 56953 57228 57129
54564 57129 57839 59864 62265 63870 64701 65516 66477 67187 67681 68361 69151 69733 70532 72467 75633 79219 82817
54547 82817 86849 91448 95884 99514 102502 105143 107155 108135 108144 107353 105557 102549 98684 94636 90792 87104
54531 87104 83325 79262 75091 71475 68999 67411 65913 64297 63210 63057 63213 62753 61565 60287 59444
54516 59444 59047 58847 58635 58368 58218 58382 58714 58755 58278 57603 57217 57296 57706 58285 58943 59630 60268 60621 60336 59428
54496 59428 58660 59017 60657 62742 64450 65755 67014 68221 69046 69402 69544 69639 69524 68963 68031 67138 66592
54479 66592 66124 65068 63177 61114 59831 59538 59576 59260 58470 57481 56641 56311 56739 57774 58915 59731 60065
54462F0065j89o03n09K84J206J388O65j96l67J95P81P07M5m56k84K35M31K36R0
54443F3724O9j66n18m30M9J01n41r72m99K63M15K21M73J006R27J28n51n53j21
54424F3025M51J171J837J965J495R76Q66J160J745K520L118L036K277J480J143
54409H8265J155J147J006Q19O50N18L99J32m35j166j654j595j058m14j17m03j050
54392H6199j518j489j126p54n18m80p37j173j378j127p33o29q24j051j171j148
54376G0343q59k77L07N44M07J33m3L8L49N65M23K53O15J300J406O72rJ69Q50J237
54356G8423J222J109R09O81R39J833K435J798L44p17r81r41q64o88q21j773k985
54339G9923l165k010o64k45o81j266j526j332q84p51j243j667j000N44J473Q93
$$ plain form
54462 60065 59876 59273 58764 59048 60254 61642 62307 62111 61744 61939 62720 63427 63472 63016 62732 62967 63398 63634 63724
54443 63724 63793 63627 63109 62679 62728 62829 62288 61316 60817 61080 61495 61716 62189 63195 64122 64250 63699 63146 63025
54424 63025 63476 64647 66484 68449 69944 70920 71786 72946 74691 77211 80329 83365 85642 87122 88265
54409 88265 89420 90567 91573 92392 93042 93560 93959 94091 93656 92490 90836 89241 88183 87769 87652 87249 86199
54392 86199 84681 83192 82066 81312 80794 80314 79577 78404 77026 75899 75166 74537 73713 72662 71491 70343
54376 70343 69484 69207 69514 70058 70465 70598 70555 70593 70942 71507 71930 72183 72798 74098 75504 76176 76167 76336 77186 78423
54356 78423 79645 80754 81663 82344 83283 85116 87551 89349 89693 88976 87995 87054 86190 85502 84681 82908 79923
54339 79923 76758 74748 74084 73839 73158 71892 70366 69034 68150 67399 66156 64489 63489 64033 65506 66399
54323F6399l59r28n77j02j33n46q85r29q76j084j532j749j532j390j748j991j176
54306D8862M56J560J467R59R54J284J238O84M0l90n93o10n62o29p72p39m42j07
54288E2660J37L98P11R20R65Q58M41l03p89l87N01P64J91j03O47J666J695O57
54270F1629m61r46q05l04K73N73N69P96J647K591K722K009J341J237J164M77n27
54253G3985r62n49k1j62q81j383j185o44l70m26l74N2N73P29L95j54n40o66p50
54234F6667j011j294j206p32l74n37r94j242j090o24P9Q81J441J574J537J545
54218F4620J292M87m24o82k60J90L63N74R94J219R01L08%K57Q09J001L43q02j355
54199F9835q09K4J36k62l03n0l23j121j443r46n01o91q96m93M6O7j90k55m46j211
$$ plain form
54323 66399 66040 65112 64535 64433 64300 63754 62869 61940 61064 59980 58448 56699 55167 53777 52029 50038 48862
54306 48862 49318 50878 52345 53304 54258 55542 56780 57464 57504 57114 56521 55911 55349 54720 53948 53209 52767 52660
54288 52660 52797 53195 53906 54826 55791 56649 57090 56787 55998 55611 56112 56876 57067 56964 57611 59277 60972 61629
54270 61629 61168 60222 59417 59113 59386 59959 60528 61324 62971 65562 68284 70293 71634 72871 74035 74512 73985
54253 73985 73023 72474 72453 72291 71410 70027 68842 68198 67828 67402 67028 67080 67653 68382 68777 68623 68083 67417 66667
54234 66667 65656 64362 63156 62424 62050 61513 60519 59277 58187 57563 57642 58523 59964 61538 63075 64620
54218 64620 65912 66399 65975 65293 65033 65223 65586 66160 67154 68373 69274 69582 69582 69839 70648 71649 71992 71190 69835
54199 69835 69026 69050 69186 68924 68621 68571 68248 67127 65684 64738 64237 63546 62650 62157 62203 62270 62080 61825 61379 60168
54179F0168k023j963j143n88p39r71p02k58k93q41j294j211q10n86n67l01K97
54162D6175N32j19r83q48M21J727K250K211J916J140o0q36o49j90l58q89q65k06
54144E0369L37M34N26Q93J185J049N87M2n13r77j074o44J02P54J004Q24L88r7
54126E5189n03o47k36O63J249O75p00j464q55K84O90K79q2J09N62Q32P12J38o43
54107E6252j017o36KJ52j27j25L73P95P11M45M83P74Q99O60K12k23n82r00j189
54088E6959j335j249j053r62r09o11o2L22L24L53Q62J602J919J564Q92L63K21
54071E9200N31J111J466J243O59K73L34O74J071J378J416J166R76J168J490J435
54055G5591J006P14P96R38Q83Q11R29J086J071J022J199J523J568J042J76l35
$$ plain form
54179 60168 58145 56182 55039 54451 53712 52741 52039 51781 51488 50647 49353 48142 47332 46746 46179 45878 46175
54162 46175 46707 46588 45605 44757 45178 46905 49155 51366 53282 54422 54362 53526 52877 52687 52329 51440 50575 50369
54144 50369 50706 51140 51666 52559 53744 54793 55380 55422 54909 53932 52858 52214 52316 53070 54074 54898 55286 55189
54126 55189 54686 54039 53803 54466 55715 56390 55690 54226 53371 53655 54345 54624 54542 54651 55213 56045 56757 56895 56252
54107 56252 55235 54599 54601 54753 54626 54501 54874 55669 56380 56825 57308 58082 58981 59641 59853 59630 59048 58148 56959
54088 56959 55624 54375 53322 52360 51451 50840 50778 51100 51424 51777 52639 54241 56160 57724 58616 58979 59200
54071 59200 59731 60842 62308 63551 64210 64483 64817 65491 66562 67940 69356 70522 71498 72666 74156 75591
54055 75591 76597 77311 78107 79045 79928 80739 81668 82754 83825 84847 86046 87569 89137 90179 90355 90020
54039I0020J50J585L166M002L924L481L278L510M031M523M611M182L658L586L860
54024A41567L777K950J833R98L62m06r88o31O94J987K320J812J180O77L1q24j571
54007A55768k158k980m145n016m911l974k966k392k223k279k458k589k534k405
53993A12738k398k377k058j552j337j578j807j519q08k34k06n79q40o86m49p19
53977I3591j447j749r88K44Q26M75j60o55j199j791j862j113r7M45M25L07M66
53960H5718Q80J222J114O10M11J096K255K887K653K073J521R72P82J638L329M601
53944A13762M802M756N345O155O371O193O372O893P124O831O157M924K965Q14
53930A89464p97j856k688l028k423j328o85n26m6J025K097K821L451L968L842
$$ plain form
54039 90020 90170 91755 94921 98923 102847 106328 109606 113116 117147 121670 126281 130463 134121 137707 141567
54024 141567 145344 148294 150127 151125 151487 151081 150093 149462 150156 152143 154463 156275 157455 158132 158163 157339 155768
54007 155768 153610 150630 146485 141469 136558 132584 129618 127226 125003 122724 120266 117677 115143 112738
53993 112738 110340 107963 105905 104353 103016 101438 99631 98112 97304 97070 96864 96285 95445 94759 94310 93591
53977 93591 92144 90395 89407 89651 90477 90952 90792 90137 88938 87147 85285 84172 84075 84520 84945 85252 85718
53960 85718 86598 87820 88934 89544 89955 91051 93306 96193 98846 100919 102440 103412 104194 105832 109161 113762
53944 113762 118564 123320 128665 134820 141191 147384 153756 160649 167773 174604 180761 185685 188650 189464
53930 189464 188667 186811 184123 181095 178672 177344 176659 176133 176087 177112 179209 182030 185481 189449 193291
53915A93291L041K393K516L141L803M522N337N897N963N843N805N506M460K816
53901B54334J222J21n77j258k220l335m073m092l800l931m529m930m828m769n249
53886B08086n896o020n593n155m943m634l974l230k903l144l593l751l486l073
53872A48691k771k479k039j645j644j980k200k060j796j754k002k409k816l017
53858A18079k873k565k429k467k259j565p54m06o06r53j095j057j009r56p86n72
53842I5727n93r89j435j388o89J90O47M89mm94q40j042j019n48M74J641K120J473
53824I3720L23k22K10R72J340J196P09L2m41j74P06J261Q77P3k81OO90J699K781
53805A05477L158K487J716K034L228M068M170M310M909N312M871L828K808K105
$$ plain form
53915 193291 196332 198725 201241 204382 208185 212707 218044 223941 229904 235747 241552 247058 251518 254334
53901 254334 255556 255677 255100 253842 251622 248287 244214 240122 236322 232391 227862 222932 218104 213335 208086
53886 208086 202190 196170 190577 185422 180479 175845 171871 168641 165738 162594 159001 155250 151764 148691
53872 148691 145920 143441 141402 139757 138113 136133 133933 131873 130077 128323 126321 123912 121096 118079
53858 118079 115206 112641 110212 107745 105486 103921 103167 102761 102155 101202 100107 99050 98041 97085 96299 95727
53842 95727 95134 94145 92710 91322 90633 90823 91470 91959 91955 91461 90621 89579 88560 88012 88486 90127 92247 93720
53824 93720 94043 93821 94031 95003 96343 97539 98248 98280 97839 97665 98371 99632 100509 100582 100301 100307 100997 102696 105477
53805 105477 108635 111122 112838 114872 118100 122168 126338 130648 135557 140869 145740 149568 152376 154481
53791A54481J783J808J828J443Q61O73Q99R30N84K99R4o76k071l064k957k472
53775A54443k613l122l080k533k445l126l763l708l325l214l231k829k036j520
53761A13898j639j933j780j313j218j699k112j863j226q21o67l66m6l08j197j975
53745I3735k133j962j804j386m07O97J154Q03J58l00n20o97j033j564j992j876
53729H0873j294r76j411k066j959r24K51R64J455K075K494K144J196M51K31k7
53713H3477q16j730k010j611j081o15R3J056J773J990J992J887J349M37q3J48
53697H6256L80p1n87p1J404K793L542L816L542K418R61K71M97N74j60j008j010
53680A03547j61R45J883K308J807N48m66l76N62J407J599J256P93N62O48P47N13
$$ plain form
53791 154481 156264 158072 159900 161343 162204 162877 163776 164706 165290 165589 165683 165007 162936 159872 156915 154443
53775 154443 151830 148708 145628 143095 140650 137524 133761 130053 126728 123514 120283 117454 115418 113898
53761 113898 112259 110326 108546 107233 106015 104316 102204 100341 99115 98294 97627 97261 97215 96907 95710 93735
53745 93735 91602 89640 87836 86450 86043 86740 87894 88697 88855 88555 88035 87338 86305 84741 82749 80873
53729 80873 79579 78603 77192 75126 73167 72243 72494 73458 74913 76988 79482 81626 82822 83273 83504 83477
53713 83477 82661 80931 78921 77310 76229 75614 75707 76763 78536 80526 82518 84405 85754 86191 86108 86256
53697 86256 86636 86565 85978 85907 87311 90104 93646 97462 101004 103422 104383 104654 105151 105725 105565 104557 103547
53680 103547 103386 104331 106214 108522 110329 110877 110411 110035 110597 112004 113603 114859 115652 116214 116862 117609 118122
53663A18122J36J36N25P18M48K08M65J005J318J186O55j21p27p79n13n10p02l34
53645A21236P61J676J628Q55j5p49j136p51K53Q31L14o38j092j105j194j195o94
53628A18985m7N7k49k69J39N96J023J453J376M00n93k75J186K128J607M94%J84
53610A28195M30N78Q63J296J689J947J923J404N79J25M13J056J506J768K078K351
53594A48201K400K397K529K491J878R82O03R97J607J885J934K024K055J860J725
53579A75568K009K484K611K452K554K919K747J685O06M82J036J233Q28M69M31
53564B00114J88n74j361j649j526j263q65m00k09m36p93j034j152r00J11J513
53548A89764K153J519M56p9k54o10q66m83R2m8p42q62l5P65N54l99j059q16O8
$$ plain form
53663 118122 118258 118394 118919 119637 120085 120293 120758 121763 123081 124267 124922 124801 124074 123295 122782 122272 121570 121236
53645 121236 121997 123673 125301 126156 126141 125392 124256 123505 123758 124589 124903 124265 123173 122068 120874 119679 118985
53628 118985 118938 118995 118746 118477 118616 119212 120235 121688 123064 123464 122871 122596 123782 125910 127517 128011 128011 128195
53610 128195 128625 129203 130066 131362 133051 134998 136921 138325 138904 139029 139442 140498 142004 143772 145850 148201
53594 148201 150601 152998 155527 158018 159896 160878 161481 162478 164085 165970 167904 169928 171983 173843 175568
53579 175568 177577 180061 182672 185124 187678 190597 193344 195029 195635 196117 197153 198386 199214 199683 200114
53564 200114 200302 199728 198367 196718 195192 193929 193064 192664 192455 192019 191226 190192 189040 188140 188251 189764
53548 189764 191917 193436 193892 193813 193559 192949 192083 191600 191692 191644 190902 190040 190005 190770 191324 190925 189866 189050 189118
53529A89118Q55R92N78K89O35J374J890J924J740J667J854K301K833L189L303
53514B14542L346L315K991K507K424K949L569L853M092M607N113N384N883O920
53500B71495P797P764P375P752Q848R585R558R461R793J0281J0718J1344J2191
53487C93962J2893J3348J3751J3976J3761J3538J4070J5131J5671J5416J5189
53476E50706J5349J5204J4518J4267J5043J5809J5333J4033J3212J3071J2706
53465G09251J1760J0887J0600J0593J0495J0488J0858J1453J1825J1757J1378
53454H31345J0923J0409R636Q553P513O902O521N752M346K594O48j733m454o743
53440H92212p928q165q009p668p180o877p119p748q358q888r542j0253j0665j0608
$$ plain form
53529 189118 189973 190965 191543 191832 192467 193841 195731 197655 199395 201062 202916 205217 208050 211239 214542
53514 214542 217888 221203 224194 226701 229125 232074 235643 239496 243588 248195 253308 258692 264575 271495
53500 271495 279292 287056 294431 302183 311031 320616 330174 339635 349428 359709 370427 381771 393962
53487 393962 406855 420203 433954 447930 461691 475229 489299 504430 520101 535517 550706
53476 550706 566055 581259 595777 610044 625087 640896 656229 670262 683474 696545 709251
53465 709251 721011 731898 742498 753091 763586 774074 784932 796385 808210 819967 831345
53454 831345 842268 852677 862313 870866 878379 885281 891802 897554 901900 904494 905142 903409 898955 892212
53440 892212 884284 876119 868110 860442 853262 846385 839266 831518 823160 814272 804730 794477 783812 773204
53426G73204j0251r905r890j0397j1234j1880j2111j2218j2331j1861j0167p574
53414F43385n219l858l339l105k794k249j428m78L66J105J971L056M105M793N078
53399F41389N156N248N528O156P273Q798J0309J1280J1630J1868J2520J3503J4457
53386G65115J5414J6641J7823J8170J7661J7524J8879K1321K3474K4696K5552
53375I82270K6693K8000K9004K9613L0086L0571L0977L1194L1254L1232L1113
53364A312007L0784L0255K9774K9483K9022K7830K5986K4318K3379K2654K1253
53353A606745J9139J7098J5590J4255J2586J0564Q341N781K642j013m937r012
53341A697779j3208j7289k0856k3673k5766k7264k8227k8667k8638k8304k8005
$$ plain form
53426 773204 762953 753048 743158 732761 721527 709647 697536 685318 672987 661126 650959 643385
53414 643385 638166 634308 630969 627864 625070 622821 621393 620915 621281 622386 624357 627413 631518 636311 641389
53399 641389 646545 651793 657321 663477 670750 679548 689857 701137 712767 724635 737155 750658 765115
53386 765115 780529 797170 814993 833163 850824 868348 887227 908548 932022 956718 982270
53375 982270 1008963 1036963 1065967 1095580 1125666 1156237 1187214 1218408 1249662 1280894 1312007
53364 1312007 1342791 1373046 1402820 1432303 1461325 1489155 1515141 1539459 1562838 1585492 1606745
53353 1606745 1625884 1642982 1658572 1672827 1685413 1695977 1704318 1710099 1712741 1711728 1706791 1697779
53341 1697779 1684571 1667282 1646426 1622753 1596987 1569723 1541496 1512829 1484191 1455887 1427882
53330A427882k8061k8414k8479k7626k5888k3988k2613k1902k1715k2100k3120
53319A153976k4408k5312k5537k5243k4451k2950k0957j9346j8646j8179j6776
53308I12171j4228j1489r490q353p773p583p691p958q371r008r643r822r502r247
53294G82013r449r745r518q658p437o010m450l089k272j817j145m3J105J896K424
53279G23805L058L912M730N241N508N923O844Q271R858J1209J2035J2187J1765
53266H24346J1242J1115J1362J1481J1266J1148J1495J1877J1532J0385R109Q172
53254I54530P315O167M824L517K092L35j393k391k652l176m938p860j1006j3633
53240I31731j5587j6861j7355j7174j6768j6476j6221j5911j5736j5732j5412
$$ plain form
53330 1427882 1399821 1371407 1342928 1315302 1289414 1265426 1242813 1220911 1199196 1177096 1153976
53319 1153976 1129568 1104256 1078719 1053476 1029025 1006075 985118 965772 947126 928947 912171
53308 912171 897943 886454 876964 868611 860838 853255 845564 837606 829235 820227 810584 800762 791260 782013
53294 782013 772564 762819 753301 744643 737206 731196 726746 723657 721385 719568 718423 718380 719485 721381 723805
53279 723805 726863 730775 735505 740746 746254 752177 759021 767292 777150 788359 800394 812581 824346
53266 824346 835588 846703 858065 869546 880812 891960 903455 915332 926864 937249 946358 954530
53254 954530 961845 968012 972836 976353 978445 978780 977387 974996 972344 969168 964230 956370 945364 931731
53240 931731 916144 899283 881928 864754 847986 831510 815289 799378 783642 767910 752498
53229G52498j4288j2664j1382j0878j0917j1205j1758j2538j3236j3660j4008
53218F15964j4550j5216j5695j5679j4948j3480j1665j0160r318q908q478p751
53206D70116o654n246l854l041l168m097n290o160o376o151o229p143q436r055
53192C89216q763q542r268j0482j0993j0421r485q878q533q064p445o885o438
53179B75019n980n525n306n463n809n949n694n319n286n673o045n988n586n227
53165A96169n051m854m502m151l956l759l267k478j701j144p34m36n01j067j698
53150A56870j750j237q59j059j469j558j334j053o72j49J15k18o99n66J70O88
53134A45220M25m12j421k332k791k436j439m78M8K72L61L17K76M02L29m70j644
$$ plain form
53229 752498 738210 725546 714164 703286 692369 681164 669406 656868 643632 629972 615964
53218 615964 601414 586198 570503 554824 539876 526396 514731 504571 495253 486345 477867 470116
53206 470116 463462 458216 454362 451321 448153 444056 438766 432606 426230 420079 413850 406707 398271 389216
53192 389216 380453 371911 362643 352161 341168 330747 321262 312384 303851 295787 288342 281457 275019
53179 275019 269039 263514 258208 252745 246936 240987 235293 229974 224688 219015 212970 206982 201396 196169
53165 196169 191118 186264 181762 177611 173655 169896 166629 164151 162450 161306 160572 160136 159635 158568 156870
53150 156870 155120 153883 153024 151965 150496 148938 147604 146551 145879 145730 145845 145627 144928 144362 144532 145220
53134 145220 145645 145233 143812 141480 138689 136253 134814 134336 134384 134656 135017 135334 135610 136012 136341 135871 134227
53117A34227k069j378n49n26r73j030o40m01n28o33l83J81P91J045O55q7m56k08
53099A27038O6j68o52q58p15l52K30P42N04n23j194m86J049J989J846J266Q23
53082A30605N43N42J080J947K459K266J503L34j010j858j602o31%j24m83o34p33
53065A34204r33j068j138j388j704j613j136r21j212j394r59k78N5P7J43K09j4
53048A20930m57p50p19m97k79j87k39k37J14P82J384J641J633J433Q94M0o28n64
53030A24294J95J035J354J069O28N10O55N30l0l53K64J428K024J616Q10K08k29
53013A36008n41l50M25J108J091O45L53K35K0j22J64O80Q85P72P76R35P88K20
52995A44092k27q8M50R12J078J016R86J352K256L117K928J465k20q38k52O63J229
$$ plain form
53117 134227 132158 130780 130231 129705 128732 127702 127062 126661 126133 125500 125117 125298 126089 127134 127789 127702 127246 127038
53099 127038 127104 126936 126284 125426 124711 124359 124589 125331 125835 125312 124118 123632 124681 126670 128516 129782 130605
53082 130605 131148 131690 132770 134717 137176 139442 140945 141279 140269 138411 136809 136178 136178 136054 135571 134937 134204
53065 134204 133271 132203 131065 129677 127973 126360 125224 124303 123091 121697 120738 120460 120515 120592 120735 120944 120930
53048 120930 120473 119723 119004 118507 118228 118041 117802 117565 117679 118461 119845 121486 123119 124552 125446 125486 124858 124294
53030 124294 124489 125524 126878 127947 128575 129085 129740 130270 130240 129887 130151 131579 133603 135219 136029 136237 136008
53013 136008 135467 135117 135542 136650 137741 138386 138739 138974 138994 138872 139036 139716 140601 141373 142149 143084 143872 144092
52995 144092 143865 143777 144227 145139 146217 147233 148219 149571 151827 154944 157872 159337 159117 158279 158027 158690 159919
52978A59919J541J792J770J314Q32R05J495J988J955J581J309J319J454J495J332
52963A82001J009O40K69j27m27l53J47P08R74J074J301J444J045K43k32m2L64
52946A90038N52O02N95K51l94o02J24J232J920K237K610K734J958N78k84j37M90
52929B04504J139J906K639K624J627M66n0j78o87j665k464k554j967j147p16j095
52913B02382k019k650k483j892j529j507j520j430j281j036o94n85r93j602j776
52898A79385j412j124j405j942j962j141M8Q60J004Q11O43M06k13j124j719j513
52882A69602o81J00K87j00n20l95K78Q96R86Q33J038J582J799J341O41J87j68
52865A77706q27j726k349k378j975j531j385j647k093k275j951j321p82n53o25
$$ plain form
52978 159919 161460 163252 165022 166336 167168 168073 169568 171556 173511 175092 176401 177720 179174 180669 182001
52963 182001 183010 183650 183919 183792 183365 183012 183159 183867 184841 185915 187216 188660 189705 189948 189716 189674 190038
52946 190038 190590 191192 191787 192038 191644 191042 191166 192398 194318 196555 199165 201899 203857 204435 204151 204014 204504
52929 204504 205643 207549 210188 212812 214439 214905 214855 214677 213990 212325 209861 207307 205340 204193 203477 202382
52913 202382 200363 197713 195230 193338 191809 190302 188782 187352 186071 185035 184341 183756 182763 181161 179385
52898 179385 177973 176849 175444 173502 171540 170399 170447 171307 172311 173122 173765 174171 173958 172834 171115 169602
52882 169602 168921 169021 169308 169208 168688 168293 168571 169467 170453 171286 172324 173906 175705 177046 177687 177874 177706
52865 177706 176879 175153 172804 170426 168451 166920 165535 163888 161795 159520 157569 156248 155466 154913 154288
52850A54288r21j300j562j557j319j018q62j017j427j751j739j667k054k844l250
52835A30000k685j600j044j409k006j924j080l04l61j104j656j367l53Q68J829
52820A15804K120J411lj033p96L64J338J645J720J984K313K563K810K918K471
52805A37629J482O05L11M13O31J059J719K162K041J573J113O62J32l93j028k088
52789A48023l284l547k396q74l56p88r94m53J88K95L4j76k75l40l42l20l51k73
52771A33771J41O22N74k8m46j47M50N88K01j27m2J33l9m41m64K00J060J302P68
52752A38076J77K08O80Q84N48M6k67n14q88j192j049m72Lj81r89j782j931j428
52734A29929p70l26N5P16J690K651L241L335L086K755K471K150J749J503J648
$$ plain form
52850 154288 153367 152067 150505 148948 147629 146611 145749 144732 143305 141554 139815 138148 136094 133250 130000
52835 130000 127315 125715 124671 123262 121256 119332 118252 117948 117587 116483 114827 113460 113107 113975 115804
52820 115804 117924 119335 119332 118299 117503 117867 119205 120850 122570 124554 126867 129430 132240 135158 137629
52805 137629 139111 139716 140027 140440 141071 142130 143849 146011 148052 149625 150738 151400 151532 151139 150111 148023
52789 148023 144739 141192 138796 137922 137566 136778 135784 135331 135519 135814 135848 135672 135397 135057 134715 134395 134044 133771
52771 133771 133912 134534 135108 135080 134634 134487 134937 135525 135726 135599 135557 135690 135651 135210 134746 134946 136006 137308 138076
52752 138076 138253 138461 139141 140025 140573 140619 140352 139838 138950 137758 136709 136237 136240 136059 135070 133288 131357 129929
52734 129929 129159 128833 128888 129604 131294 133945 137186 140521 143607 146362 148833 150983 152732 154235 155883
52719A55883K031K259K256K295K447K447K214K085K296K558K395J616L78r09j670
52704A80581j600j148j048j306j209n60q6k13k73M18J427J862J676J409J169P07
52688A81806K57K85O12O47L79K77L42J52k18k06K20M38J94j55m70j090j968k426
52670A79076k097j469j081r53j021j455k053k101j298k80K59L77L85J74l33o44
52654A65486l72k0k99r44j032l50L01K16m46j181j741k073k033j624j219j172
52638A51497j322j161n13J75L98K99M55J000J303Q18l2l22J42O14M49j85p50r82
52620A51883q65m22R4K36q5l77k16J29J84ml8J03O6j72j32N07J369J724J230K98
52600A55512k83p3N42P64L28j65p2L78M29j22o14m51N9R4o63j691k319k441k406
$$ plain form
52719 155883 157914 160173 162429 164724 167171 169618 171832 173917 176213 178771 181166 182782 183160 182251 180581
52704 180581 178981 177833 176785 175479 174270 173710 173624 173411 173138 173556 174983 176845 178521 179930 181099 181806
52688 181806 182063 182348 182960 183607 183986 184263 184605 184757 184539 184333 184553 184991 185185 185030 184560 183470 181502 179076
52670 179076 176979 175510 174429 173476 172455 171000 168947 166846 165548 165268 165527 165904 166289 166463 166130 165486
52654 165486 165114 165094 164795 163851 162819 162469 162770 162986 162540 161359 159618 157545 155512 153888 152669 151497
52638 151497 150175 149014 148501 148676 149074 149373 149828 150828 152131 152949 152917 152595 152737 153351 153800 153615 152865 151883
52620 151883 151018 150596 150690 150926 150841 150464 150248 150377 150561 150557 150519 150622 150688 150516 150384 150891 152260 153984 155214 155512
52600 155512 155229 155156 155698 156462 156790 156625 156553 156931 157360 157238 156624 156173 156232 156326 155663 153972 151653 149212 146806
52581A46806k367k131j679j393j475j423o57M51Q54K35m87m61q1k71j020j406
52565A33495j049o73r97j648j614n55P52J233N80m82q65j39J091J744J289J58
52549A32320p57r18m48J19L00l1o78j317j730j859j738j436j029n81j37J78J92
52532A20450p6l38l10k9K74N31Q15R70O22k53j093j346j184j193j478j456o99
52515A14207M07J061R06K04n82j087j041m50K03L06j50m79j57N32Q89O61K12o1
52497A15581j18j40k44m37o58p31m89K4M79N04K4o15q76n20J23M31J41m18p43
52478A11318o58k97J50M87M64L9l72k32M85J171J208N87j11k70K00Q17R69N15
52460A16470j50n50n82m30k74k09k56l59m45o07r69j243q26L93J605J894J280
$$ plain form
52581 146806 144439 142308 140629 139236 137761 136338 135681 136132 136986 137221 136734 136273 136192 135921 134901 133495
52565 133495 132446 131773 130776 129128 127514 126959 127711 128944 129524 129042 128177 128038 129129 130873 132162 132320
52549 132320 131563 130645 130197 130316 130616 130585 129907 128590 126860 125001 123263 121827 120798 120217 120080 120258 120450
52532 120450 120374 120036 119726 119697 119971 120502 121317 122287 122909 122656 121563 120217 119033 117840 116362 114906 114207
52515 114207 114614 115675 116581 116785 116203 115116 114075 113625 113828 114134 113984 113505 113348 113880 114769 115430 115642 115581
52497 115581 115463 115323 115079 114642 113984 113253 112764 112788 113267 113771 113795 113180 112304 111784 111907 112338 112479 112061 111318
52478 111318 110660 110363 110513 111000 111464 111503 111131 110899 111384 112555 113763 114350 114239 113969 114169 114986 115955 116470
52460 116470 116320 115770 115188 114758 114484 114275 114019 113660 113215 112608 111639 110396 109570 109963 111568 113462 114742
52443A14742N70L26M79Q20J281J649J561R39J62l98p26r38j026r51p45m69k26
52426A17050k16n11p70n63k1K30j24p07j007r31o22q9O50J263J299O23m56j366
52408A13732j538p60M94J300J109K85l55l81k3K90M00M11M14L39R4k71n66o59
52390A14315n03m2O71J193R46L3n67o1J086J680J288O31M40N42L49j82n14k32
52372A21073M95J097J149P51L85L64N09N27M37M59O57J006J525J964J752P57j97
52355A34710k05M84R08Q67J081J876K671K948K859K569J882R65N97J129J868K006
52339A59215J601J116N97p7n94n34O4Q21J386J373N79m07m50P30J979K149J502
52322A71050J096J416K246L258L974L767K790K325L196M477M802M438M699N685
$$ plain form
52443 114742 115312 115638 116117 116937 118218 119867 121428 122367 122529 122131 121405 120467 119441 118490 117745 117276 117050
52426 117050 116834 116323 115553 114990 114969 115199 115075 114368 113361 112430 111808 111719 112369 113632 114931 115554 115098 113732
52408 113732 112194 111434 111928 113228 114337 114622 114267 113886 113863 114153 114553 114964 115378 115717 115811 115540 114974 114315
52390 114315 113812 113770 114441 115634 116580 116613 116046 115985 117071 118751 120039 120670 121110 121652 122001 121819 121305 121073
52372 121073 121568 122665 123814 124565 124950 125314 125823 126350 126787 127246 127903 128909 130434 132398 134150 134907 134710
52355 134710 134505 134989 135897 136764 137845 139721 142392 145340 148199 150768 152650 153615 154212 155341 157209 159215
52339 159215 160816 161932 162529 162452 161858 161324 161388 162209 163595 164968 165547 165140 164690 165420 167399 169548 171050
52322 171050 172146 173562 175808 179066 183040 186807 189597 191922 195118 199595 204397 208835 213534 219219
52308B19219O154N626N100N372N901N905N526N286N278N406N784O333O598O426
52294B99914O276O499O810O860O789O900P223P689Q292Q794Q840Q616Q798R532
52280D07832J0067R841R315R241R626R950R994R872R595R180Q878Q859Q894Q837
52266E39981Q996R538R887R399Q477Q172Q722R199Q823P949P429P386P129O198
52252F57285N030M434M555M596L722K037N08j24o6j00o80j569k080j631j91J625
52236F77351L014L705M094M665N455O138O439O433O555P285Q594R791J0226J0096
52222G69841J0088J0308J0230R741R542J0078J0759J0787J0252R810R635R398
52210H90469R010Q681Q319P507O144M606L195J816K72j519l488n321o450o592
$$ plain form
52308 219219 225373 230999 236099 241471 247372 253277 258803 264089 269367 274773 280557 286890 293488 299914
52294 299914 306190 312689 319499 326359 333148 340048 347271 354960 363252 372046 380886 389502 398300 407832
52280 407832 417899 427740 437055 446296 455922 465872 475866 485738 495333 504513 513391 522250 531144 539981
52266 539981 548977 558515 568402 577801 586278 594450 603172 612371 621194 629143 636572 643958 651087 657285
52252 657285 662315 666749 671304 675900 679622 681659 682167 682043 681977 681877 681197 679628 677548 675917 675726 677351
52236 677351 680365 684070 688164 692829 698284 704422 710861 717294 723849 731134 739728 749519 759745 769841
52222 769841 779929 790237 800467 810208 819750 829828 840587 851374 861626 871436 881071 890469
52210 890469 899479 908160 916479 923986 930130 934736 937931 939747 940019 938500 935012 929691 923241 916649
52196I16649o297o486p407q412q849q745q517q356q107p562o757o076n986o455
52182H12637o813o548o016n871n969n569m585l803l657l637l340l300m077n123
52168G44329n422m877m239l888l551l200l290l869m255l992l571l648m091m254
52154F88182l954l597l451l239k600j635q41n99p92r93j016j184j902k976l724
52139F55679l766l432l214l144l034k967l173l564l756l602l338l262l402l567
52125F08458l525l207k897l029l595l978l718l177l002l118k881k133j434j053
52111E67711m84P05K126L093L451L478L336L142L220L741M328M528M504M735N174
52096F16788N349N271N634O874Q493R653J0094J0265J0733J1716J3044J4334J5146
$$ plain form
52196 916649 910352 903866 896459 888047 879198 870453 861936 853580 845473 837911 831154 825078 819092 812637
52182 812637 805824 799276 793260 787389 781420 775851 771266 767463 763806 760169 756829 753529 749452 744329
52168 744329 738907 734030 729791 725903 722352 719152 715862 711993 707738 703746 700175 696527 692436 688182
52154 688182 684228 680631 677180 673941 671341 669706 668865 668266 667474 666481 665465 664281 662379 659403 655679
52139 655679 651913 648481 645267 642123 639089 636122 632949 629385 625629 622027 618689 615427 612025 608458
52125 608458 604933 601726 598829 595800 592205 588227 584509 581332 578330 575212 572331 570198 568764 567711
52111 567711 567227 567932 570058 573151 576602 580080 583416 586558 589778 593519 597847 602375 606879 611614 616788
52096 616788 622137 627408 633042 639916 648409 658062 668156 678421 689154 700870 713914 728248 743394
52083G43394J5181J4540J3830J3836J4753J5767J5790J4709J3561J3216J3366
52072I01943J3234J2770J2466J2280J1571J0212Q862P939P003N622M214L421L037
52059A014574K225P22p48j423j422j492k067k870l479m023n031o602q040q565
52045I71759q166p483o988o690o592o891p534q004p818p049o130n365m809m436
$$ plain form
52083 743394 758575 773115 786945 800781 815534 831301 847091 861800 875361 888577 901943
52072 901943 915177 927947 940413 952693 964264 974476 983338 991277 998280 1003902 1008116 1011537 1014574
52059 1014574 1016799 1017521 1016773 1015350 1013928 1012436 1010369 1007499 1004020 999997 994966 988364 980324 971759
52045 971759 963593 956110 949122 942432 935840 928949 921415 913411 905593 898544 892414 887049 882240 877804
$$ [...]
##END NTUPLES=NMR SPECTRUM
##END=
