##TITLE=NES1039_872015048_9242671_qEZkBcLU37
##JCAMPDX= 6.0         $$ Bruker NMR JCAMP-DX V2.0
##DATA TYPE= NMR SPECTRUM
##DATA CLASS= NTUPLES
##ORIGIN= BRUKER
##OWNER= Administrator
$$ 1.72 TOPSPIN		Version 2.1
$$ 2015-07-01 19:02:43.242 -0700  Administrator@X
$$ Compression mode = diff/dup
##.OBSERVE FREQUENCY= 400.02188249412
##.OBSERVE NUCLEUS= ^1H
##.ACQUISITION MODE= SIMULTANEOUS (DQD)
##.ACQUISITION SCHEME= undefined
##.AVERAGES= 8
##.DIGITISER RES= 22
##SPECTROMETER/DATA SYSTEM= spect
##.PULSE SEQUENCE= zg30
##.SOLVENT NAME= COFFEE_meoh
##.SHIFT REFERENCE= INTERNAL, COFFEE_meoh, 1, 14.98509
##AUDIT TRAIL= $$ (NUMBER, WHEN, WHO, WHERE, PROCESS, VERSION, WHAT)
$$ ##TITLE= Audit trail, TOPSPIN		Version 2.1
$$ ##JCAMPDX= 5.01
$$ ##ORIGIN= Bruker BioSpin GmbH
$$ ##OWNER= Administrator
$$ $$ E:\/data/COFFEE/nmr/NES1039_872015048_9242671_qEZkBcLU37/20/pdata/1/auditp.txt
$$ ##AUDIT TRAIL=  $$ (NUMBER, WHEN, WHO, WHERE, PROCESS, VERSION, WHAT)
(   1,<2015-07-01 19:02:35.992 -0700>,<Administrator>,<X>,<go>,<TOPSPIN 2.1>,
      <created by zg
	started at 2015-07-01 19:01:29.867 -0700,
	POWCHK enabled, PULCHK disabled,
       configuration hash MD5:
       21 0F 79 D6 B3 7B B4 F6 88 20 88 DB 03 48 BD 9F
       data hash MD5: 64K
       37 35 69 A5 76 27 35 91 6C 7F BD 7F AF E9 33 09>)
(   2,<2015-07-01 19:02:39.102 -0700>,<Administrator>,<X>,<proc1d>,<TOPSPIN 2.1>,
      <Start of raw data processing
       efp LB = 0 FT_mod = 6 PKNL = 1 PHC0 = 0 PHC1 = 0 SI = 32K 
       data hash MD5: 32K
       0E 79 FA 9A 86 88 E0 F7 E0 6B 04 71 EB 32 88 1A>)
(   3,<2015-07-01 19:02:39.367 -0700>,<Administrator>,<X>,<proc1d>,<TOPSPIN 2.1>,
      <pk PHC0 = 92.55432 PHC1 = 0 
       data hash MD5: 32K
       14 A1 52 0A D5 D0 FC C2 B8 40 1A 86 1F 08 54 0F>)
(   4,<2015-07-01 19:02:39.477 -0700>,<Administrator>,<X>,<proc1d>,<TOPSPIN 2.1>,
      <abs ABSG = 1 
       data hash MD5: 32K
       99 42 77 F4 1D 58 DB 69 E3 43 2D 23 0D AB 4B 8C>)
(   5,<2015-07-01 19:02:39.524 -0700>,<Administrator>,<X>,<proc1d>,<TOPSPIN 2.1>,
      <abs ABSG = 2 
       data hash MD5: 32K
       DB 22 F0 4C 5B 28 79 EA E6 69 16 75 10 13 8C B7>)
(   6,<2015-07-01 19:02:39.586 -0700>,<Administrator>,<X>,<proc1d>,<TOPSPIN 2.1>,
      <abs ABSG = 3 
       data hash MD5: 32K
       84 B8 33 38 72 0A 3E 41 AA 81 80 97 1F 42 44 B5>)
(   7,<2015-07-01 19:02:39.649 -0700>,<Administrator>,<X>,<proc1d>,<TOPSPIN 2.1>,
      <abs ABSG = 4 
       data hash MD5: 32K
       2F 8F BE FA C1 2A 4C 1B 50 D3 2D C0 91 D4 01 6A>)
(   8,<2015-07-01 19:02:39.711 -0700>,<Administrator>,<X>,<proc1d>,<TOPSPIN 2.1>,
      <abs ABSG = 5 
       data hash MD5: 32K
       13 63 E7 84 85 44 DB 21 33 F1 BB 71 BC 43 38 6F>)
$$ ##END=
$$ 
$$ $$ hash MD5
$$ $$ F0 D8 13 29 92 92 07 40 67 4F 39 2B 04 B7 AA 3F
##$RELAX= 
##$RELAX= 
##$RELAX= 
##$RELAX= 
##$RELAX= 
##$RELAX= 
##$RELAX= 
$$ Bruker specific parameters
$$ --------------------------
##$DU= <E:\>
##$EXPNO= 20
##$NAME= <NES1039_872015048_9242671_qEZkBcLU37>
$$ [...]
150 150 150 150 150 150 150 150
##$TP07= 0
##$TPNAME0= <>
##$TPNAME1= <>
##$TPNAME2= <>
##$TPNAME3= <>
##$TPNAME4= <>
##$TPNAME5= <>
##$TPNAME6= <>
##$TPNAME7= <>
##$TPOAL= (0..7)
0.5 0.5 0.5 0.5 0.5 0.5 0.5 0.5
##$TPOFFS= (0..7)
0 0 0 0 0 0 0 0
##$TUNHIN= 0
##$TUNHOUT= 0
##$TUNXOUT= 0
##$USERA1= <user>
##$USERA2= <user>
##$USERA3= <user>
##$USERA4= <user>
##$USERA5= <user>
##$V9= 5
##$VALIST= <valist>
##$VCLIST= <CCCCCCCCCCCCCCC>
##$VD= 0
##$VDLIST= <DDDDDDDDDDDDDDD>
##$VPLIST= <PPPPPPPPPPPPPPP>
##$VTLIST= <TTTTTTTTTTTTTTT>
##$WBST= 2048
##$WBSW= 25
##$XGAIN= (0..3)
0 0 0 0
##$XL= 0
##$YL= 0
##$YMAX_a= 612564
##$YMIN_a= -513150
##$ZGOPTNS= <>
##$ZL1= 120
##$ZL2= 120
##$ZL3= 120
##$ZL4= 120
##$ABSF1= 14.98509
##$ABSF2= -5.573092
##$ABSG= 5
##$ABSL= 3
##$ALPHA= 0
##$AQORDER= 0
##$ASSFAC= 0
##$ASSFACI= 0
##$ASSFACX= 0
##$ASSWID= 0
##$AUNMP= <proc_prof1d_extract_pilot.lims>
##$AXLEFT= 0
##$AXNAME= <>
##$AXNUC= <1H>
##$AXRIGHT= 0
##$AXTYPE= 0
##$AXUNIT= <>
##$AZFE= 0.1
##$AZFW= 0.1
##$BCFW= 0
##$BC_mod= 0
##$BYTORDP= 0
##$COROFFS= 0
##$CY= 15
##$DATMOD= 1
##$DC= 0
##$DFILT= <>
##$DTYPP= 0
##$F1P= 0
##$F2P= 0
##$FCOR= 0.5
##$FTSIZE= 32768
##$FT_mod= 6
##$GAMMA= 0
##$GB= 0
##$INTBC= 1
##$INTSCL= 1
##$ISEN= 128
##$LB= 0
##$LEV0= 0
##$LPBIN= 0
##$MAXI= 10000
##$MC2= 0
##$MEAN= 0
##$ME_mod= 0
##$MI= 0
##$NCOEF= 0
##$NC_proc= -8
##$NLEV= 6
##$NOISF1= 0
##$NOISF2= 0
##$NSP= 0
##$NTH_PI= 0
##$NZP= 0
##$OFFSET= 14.98509
##$PC= 1
##$PHC0= 92.55432
##$PHC1= 0
##$PH_mod= 1
##$PKNL= yes
##$PPARMOD= 0
##$PPDIAG= 0
##$PPIPTYP= 0
##$PPMPNUM= 2147483647
##$PPRESOL= 1
##$PSCAL= 4
##$PSIGN= 0
##$PYNMP= <proc.py>
##$REVERSE= no
##$SF= 400.02
##$SI= 32768
##$SIGF1= 0
##$SIGF2= 0
##$SINO= 400
##$SIOLD= 32768
##$SPECTYP= <>
##$SREGLST= <1H.CDCl3>
##$SSB= 0
##$STSI= 32768
##$STSR= 0
##$SW_p= 8223.68421052631
##$SYMM= 0
##$S_DEV= 0
##$TDeff= 65536
##$TDoff= 0
##$TI= <>
##$TILT= no
##$TM1= 0
##$TM2= 0
##$TOPLEV= 0
##$USERP1= <user>
##$USERP2= <user>
##$USERP3= <user>
##$USERP4= <user>
##$USERP5= <user>
##$WDW= 1
##$XDIM= 32768
##$YMAX_p= 441992094
##$YMIN_p= -645335
##$CURPLOT= <Network HP LaserJet P1505>
##$CURPRIN= <$Network HP LaserJet P1505>
##$DFORMAT= <normdp>
##$LAYOUT= <+/1D_H.xwp>
##$LFORMAT= <normlp>
##$PFORMAT= <normpl>
##$SURQMSG= 1
$$ End of Bruker specific parameters
$$ ---------------------------------
##NTUPLES= NMR SPECTRUM
##VAR_NAME=  FREQUENCY,     SPECTRUM/REAL,   SPECTRUM/IMAG
##SYMBOL=    X,             R,               I
##VAR_TYPE=  INDEPENDENT,   DEPENDENT,       DEPENDENT
##VAR_FORM=  AFFN,          ASDF,            ASDF
##VAR_DIM=   32768,         32768,           32768
##UNITS=     HZ,            ARBITRARY UNITS, ARBITRARY UNITS
##FACTOR=    0.250966925370066, 1,           1
##FIRST=     8223.43324360094, -37942,       -122471
##LAST=      0,             -50865,          -139713
##MIN=       0,             -645335,         0
##MAX=       8223.43324360094, 441992094,    0
$$ Real data points
##PAGE= N=1
##DATA TABLE= (X++(R..R)), XYDATA
$$ [...]
19486f4490j30669Q5332I5732b14015r4741P6133K4345Q3561F2049l0231a44494
19474a1521C5966M0943J62673b45309A09201j0505l8515b32679D5245j9424L5775
19463F1596h3472j90674b478k0678n7602G772O4114b2557k20406O3148P4521l1697
19451a36991K5288r149p1818A24747c53878O2991d0165C07452c37619C74287b6377
19439b6759j24141B26704a36222H3525j0685b49131J10051f2934j58716j543O3082
19428a60111D7568P3147b73968a20328j5172B06034c26966A33383b32391C16042
19417H562a05036e1213j66438H5960a53908q4277L0451k22935a81297k2585D5767
19405a25769K3699n9061k5405D68601d0439j89632m2582M262J18403G8834b01408
$$ y = [-64490, -195159, -109827, 95732, -214015, -308756, -232623, -208278, -124717, 62049, 31818, -144494, -11521, 35966, 76909, 239582, -245309, 109201, 98696, 60181, -232679, 45245, 25821, 61596, -83472, -274146, -2478, -23156, -80758, 7772, 71886, -22557, -242963, -179815, -105294, -136991, -111703, -120852, -192670, 124747, -353878, -290887, -40165, 307452, -337619, 374287, -26377, -26759, -150900, 226704, -136222, 83525, 72840, -249131, -139080, -62934, -221650, -223193, -160111, 47568, 120715, -273968, -120328, -135500, 206034, -326966, 133383, -232391, 316042, 8562, -105036, -51213, -217651, 85960, -153908, -238185, -207734, -430669, -181297, -203882, 45767, -125769, -102070, -161131, -186536, 468601, -40439, -230071, -272653, -268391, -149988, 78834, -201408]
19393a40739f8545o4109b7928q1024n0429D1238a6582j59305B0363L1552c17219
19381c63362e4040I7762C6904a28729G4173f7692B9920J39897p6944K41138d0792
19369H0571b00740k8144A88772c14941a20970j45786P9120M8408H4577b02085
19358b47975a06729A74740c84157A75793a55230B47450h5367I47K61403B4962
19347g2570j9226L2425q658k4706A27041b04407d1222j80928Q117k07365E0106
19335g4031A99992a89882j55338a3059A21462h4087j74822N1097G1615J70653
19325B42268a42461A9562c0382m8039o2103L2927j59643A19971i2562A6000N7071
19314G3071f076E17c74194d8007j24465k02974i4821n3852c2598F5075J6348g0865
$$ y = [-140739, -68545, -132654, -27928, -108952, -159381, 41238, -16582, -175887, 20363, 51915, -317219, -363362, -54040, 97762, 36904, -128729, 74173, -67692, 29920, 169817, 92873, 334011, -40792, 80571, -200740, -228884, 188772, -314941, -120970, -266756, -187636, -139228, 84577, -202085, -247975, -106729, 174740, -384157, 175793, -155230, 247450, -85367, 947, 262350, 24962, -72570, -91796, -59371, -68029, -92735, 127041, -204407, -41222, -222150, -214033, -421398, 50106, -74031, 199992, -189882, -345220, -13059, 121462, -84087, -258909, -207812, 71615, 242268, -142461, 19562, -30382, -78421, -140524, -107597, -267240, 119971, -92562, 16000, 73071, -6076, 517, -374194, -48007, -172472, -375446, -94821, -148673, -32598, 65075, 81423, -70865]
19301c48700A18169O0485b25763h1885a4702m4671r7900A49514j7388K88630b81541
19289A5658R7553a54849n9263q249h65j84873h4787F0985a58116B12842g2484
19277b119k61718a30810k02639B30240p5283o2400a68226c3464F6376j5571J06033
19266A56838b66303B34349a15296J4282k36414e6441H5441a81646G7129d0226
19255b8995k04392L5842o6592N6105e1223n0573M3536q1171E3870d5847j48325
19244a94172r5248D3726b974j32546j34351J16477a0621j85277H8144b76984a27563
19232e4097D8062h186G0935J92384m2357G6378a1781j3451I0114b13353P5115
19221a38238a5872A79652J53700j30442k6024m743b0008A24743a62955D9451c06079
$$ y = [-348700, 118169, 178654, -225763, -81885, -14702, -59373, -157273, 149514, 132126, 420756, -281541, 15658, 113211, -154849, -214112, -222361, -865, -185738, -84787, 60985, -158116, 212842, -72484, -2119, -263837, -130810, -333449, 230240, 154957, 92557, -168226, -33464, 66376, 50805, 156838, -266303, 234349, -115296, -101014, -337428, -56441, 85441, -181646, 77129, -40226, -28995, -233387, -197545, -264137, -208032, -51223, -101796, -58260, -139431, 53870, -45847, -194172, -289420, 43726, -2974, -135520, -269871, -153394, -10621, -195898, 88144, -276984, -127563, -54097, 48062, -8186, 70935, 263319, 220962, 76378, -11781, -25232, 90114, -213353, -138238, -15872, 179652, 333352, 202910, 176886, 172143, -20008, 124743, -162955, 49451, -306079]
19209b52750J8400o9669C7581c35048a38735p3744l58672K78683A77401E6352
19198e2480a5154B99646q0774a22479q5856M9252j80185A9162a18150A19792a52127
19186a39367f2176A10190f2548A75112a52229n1699P441a0678j84495O6835G2402
19174I7682a21595A86635b80744a1742m38721K07390m0508Q2381O4909A1619b17446
19162G7179l1904M0611M0136a68581C3731K4233J75217a26061k10749i8693m9763
19151a48456M5225J3801K5065G2670J60472b1318l57457a80374c8410k73256E3562
19139G9368a72608C6701M15b77227Q7651c7494J0714m4757k7128j97403a09866
19127a64724c7748j26771b1282A09821a48335B41396C3525b57936J01413J5070
$$ y = [-252750, -234350, -304019, 37581, -335048, -138735, -212479, -571151, -292468, 177401, 56352, -52480, -15154, 299646, 218872, -122479, -208335, -159083, -339268, 19162, -118150, 119792, -152127, -139367, -62176, 110190, -62548, 175112, -152229, -203928, -196487, -10678, -195173, -128338, 72402, 97682, -121595, 186635, -280744, -11742, -450463, -243073, -283581, -201200, -136291, 11619, -217446, 77179, 45275, 85886, 126022, -168581, 33731, 57964, 233181, -126061, -336810, -98693, -148456, -103231, -89430, -64365, 72670, 233142, -21318, -378775, -180374, -38410, -311666, 53562, 79368, -172608, 36701, 37116, -277227, -189576, -37494, -26780, -71537, -98665, -296068, -109866, -164724, -37748, -164519, -21282, 109821, -148335, 241396, 33525, -257936, -156523, -141453]
19117a41453A086P7769a90517c5659r790j03060I770a9726j6491D5118N7476g2889
19104d30423c7548A87258J50050A06842a92189B6279e86k1133a606o9215j6996
19093h7817q0112N6278B26351r1657A6385J26211a39023H5245c28382f0911k24007
19082b84918r448b9595A54552a72429j58894I7760L8832N530c33783D3948d5932
19070a52296A5395a34200A14773a57103A18437J30579b3796E5044b0791e927I6294
19058F925c2492k89859J4942g1470A04472l2709A8738O5678i4783B24796c74115
19046C0692F592J1962L3285b21902p4706b0055j87423o5592a34234c7710p4620
19035a12330e1019A13194B927f0838O024p7841d6865r3253f9438j61141j02478
$$ y = [-141453, 1086, 78855, -190517, -35659, -45449, -148509, 9770, -19726, -36217, 45118, 102594, -72889, -430423, -37548, 187258, 337308, 106842, -192189, 26279, -586, -21719, -1606, -70821, -87817, -167929, -111651, 226351, 134694, 16385, 142596, -139023, 85245, -328382, -60911, -284918, -294366, -29595, 154552, -172429, -331323, 97760, 136592, 142122, -333783, 43948, -45932, -152296, 15395, -134200, 114773, -157103, 118437, 249016, -23796, 55044, -20791, -5927, 96294, 6925, -32492, -322351, -307409, -71470, 104472, 71763, 18738, 84416, -94783, 224796, -374115, 30692, 6592, 18554, 51839, -221902, -296608, -20055, -207478, -273070, -134234, -37710, -112330, -51019, 113194, 2927, -60838, -54814, -132655, -46865, -140118, -69438, -230579, -333057]
19024c33057a4783A93147r5655a612B82106f7903B5212b44511A5155O204N6101
19013G7460J26701g1272g162D3282a11439k0776j69321H8460D1488O6339c62339
19001A50292b74914k1088b2181n0414A80327d7197j22181q2961A12573g6637j19907
18990a96544h1490J9390F8123b52640i6778A05513b81A49216M6331D3829P8885
18979A22714K59686a36231e1855A38481a86155e643D68551a39323C3611f2269
18968A5605b42213q1442a45395D81396j73939j49014D9356i3045j96041H3033
18957A16440a02148l1463A98611q3447a29378p4283g6904B10451a56937A13750
18946G6686b90122i8856J8154A87120b58354C3340c92230c115E2780c93583A64831
$$ y = [-333057, -14783, 193147, 97492, -1612, 282106, -67903, 25212, -244511, 15155, 21359, 77460, 204161, -71272, -7162, 43282, -111439, -132215, -301536, 88460, 41488, 107827, -362339, 150292, -274914, -296002, -22181, -72595, 180327, -47197, -169378, -252339, 112573, -76637, -196544, -81490, -62100, 68123, -252640, -96778, 105513, -281, 149216, 195547, 43829, 122714, 382400, -136231, -51855, 138481, -186155, -5643, 468551, -139323, 33611, -62269, 15605, -242213, -323655, -145395, 481396, 307457, 158443, 49356, -93045, -289086, 83033, 116440, -102148, -133611, 198611, 115164, -129378, -203661, -76904, 210451, -156937, 113750, 76686, -290122, -98856, -80702, 187120, -258354, 33340, -392230, -3115, 52780, -393583, 164831]
18934F7734O198h9439j50645b3498k6329C6856L26409d1445k2044A96479e731
18922a04040l4527j50867a37638B51585A13874k2760a17156b4565B14563c303
18911d9242A80568d07182g3166C20522b63417A76132f3226F169N2378O5311c2471
18899C20340c9750j57097i6407d6584B54118c0602p4509o5958g5486B8026f4513
18887b05990m4064B4936l162a69402j9476d8853j15968f4791B01935H7267d65111
18875g7589E5216a12499F02a06001C05063a07900j4127A4776c722l4957j56441
18864a95120d9216G599a06464B57203a31768B15946j0940b23347O4068l947L2275
18853a30951N6688C19432m6062E0210b95717L2706G3976a14173e1508k38169B34812
$$ y = [67734, 73932, -89439, -240084, -23498, -49827, 36856, 363265, -41445, -63489, 196479, -5731, -104040, -138567, -289434, -137638, 251585, 113874, 91114, -117156, -24565, 214563, -3303, -49242, 180568, -407182, -73166, 320522, -263417, 176132, -63226, 6169, 58547, 123858, -32471, 320340, -39750, -196847, -96407, -46584, 254118, -30602, -105111, -171069, -75486, 28026, -64513, -205990, -250054, 24936, 21774, -169402, -188878, -48853, -164821, -64791, 201935, 87267, -465111, -77589, 55216, -112499, 602, -106001, 305063, -107900, -122027, 14776, -3722, -38679, -195120, -49216, 7599, -106464, 257203, -131768, 215946, 205006, -223347, -159279, -163226, -130951, -74263, 319432, 273370, 50210, -295717, -263011, 73976, -114173, -51508, -289677, 234812]
18841i6988K248m1302E7775a25852j83268B5109J1420d38141H1059J88927K8362
18830B98348A420c16150a10694c6043D7004a68973B28280a06550o4249o7007I6016
18818A76281H5598a52816H7136b95276a32883n4287G518Q7577J72864f3060j39545
18807b02605D04823j26100e1977I4643k0035a12582I746c56352A86159M7294a96328
18795b22635J10070a755j32229A04639A3600a25072j93934A48892a37789d7453
18784e9748K1497A3153O2336L4743r091R2015i7590b3444k21937h9550m6373i041
18771e0464l4867L3994j53545A18859a38869I2508g9724B19427h341J800B96052
18759b31581d2610n1034B4852G453b68368b2024j17812k08313B40425a77179G4200
$$ y = [-96988, -94740, -136042, 57775, -125852, -309120, 25109, 36529, -438141, 81059, 269986, 298348, 1420, -316150, -110694, -36043, 47004, -168973, 228280, -106550, -170799, -237806, 96016, 176281, 85598, -152816, 87136, -295276, -132883, -187170, 7518, 95095, 267959, -63060, -202605, 404823, 278723, -51977, 94643, 74608, -112582, 9746, -356352, 186159, 233453, -196328, -222635, -112565, -1755, -133984, 104639, 13600, -125072, -319006, 148892, -137789, -47453, -59748, -38251, 13153, 75489, 110232, 101141, 193156, -97590, -23444, -245381, -89550, -135923, -9041, -50464, -85331, -51337, -204882, 118859, -138869, 92508, -79724, 219427, -8341, -6541, 296052, -231581, -42610, -93644, 24852, 7453, -268368, -22024, -139836, -348149, 240425, -177179, 74200]
18747a73783f6821k4120H2305b36450J02840C3280j2296M2057f5409j30649A52949
18735B28597a43270A90082g7557A91967a03897c8152j56606k07799c9489j22339
18725a61828A32409a21288m8861A78728B6952J2282a43276a5174r9734j56885
18715b71793A76357a22131m1088M8817H1514b6774r2678A58430F519K8689J88131
18704B23339D2567c40574f9922l9643d9428A88742a7181A57700K76330b0194m9094
18693f9288J4288B56225a32949H0322a17235A36359o7652a58864c4036o1672j41195
18682b36903h3840c3769F54a97332h6833B72889b05999C8848F944P8486A3499
18670c46376d4113k11944N9947j55857B79461j12549b074m4606j36264k42048
$$ y = [-173783, -66821, -90941, 82305, -236450, -133610, 33280, 20984, 63041, -65409, -196058, 152949, 228597, -143270, 190082, -77557, 191967, -103897, -38152, -194758, -402557, -39489, -161828, 132409, -121288, -170149, 178728, 26952, 39234, -143276, -15174, -114908, -271793, 176357, -122131, -163219, -114402, 81514, -26774, -119452, 158430, 6519, 35208, 223339, 42567, -340574, -69922, -109565, -49428, 188742, -17181, 157700, 434030, -20194, -69288, -55000, 256225, -132949, 80322, -117235, 136359, 68707, -158864, -34036, -95708, -236903, -83840, -33769, 654, -197332, -86833, 272889, -205999, 38848, 6944, 85430, 13499, -346376, -44113, -256057, -196110, -351967, 279461, 166912, -2074, -46680, -182944, -424992]
18660d24992J06741L0144A65634c37613O4722n5005D3315i4937l1475k84865B20791
18648a26282d5414B8721J78236r2713b23498Q6481j3288k89170A8102e3176l406
18637e6582A7329e8909j45692O0417B00921F3986d60501C0215b73589A1629a4192
18625I3622C129a12508A91900h4288A1723b86155e4377C3877a47759B31099a5779
18613D6713a05025b1377k48366N2325M5626P195b6409I8332O559A6097R4610C8839
18600A96289a10308k935D6876a1655r8353H4239J39243B5664a7333f378l76487
18589c82865a05022o5332A07944e0130j61281p1742A63229a7970E3315j9518d8203
18577A82604l6179L6639b45527E5878e89A83113a1176A7155d4936j02930D3600
$$ y = [-424992, -318251, -288107, 165634, -337613, -272891, -327896, 43315, -94937, -126412, -411277, 220791, -126282, -45414, 28721, 206957, 114244, -223498, -137017, -150305, -439475, 18102, -53176, -56582, 17329, -58909, -204601, -144184, 200921, 63986, -460501, 30215, -273589, 11629, -14192, 93622, 3129, -112508, 191900, -84288, 11723, -286155, -54377, 33877, -147759, 231099, -15779, 46713, -105025, -21377, -269743, -217418, -171792, -164597, -26409, 98332, 104891, 16097, 110707, 38839, 196289, -110308, -113243, 46876, -11655, -110008, 84239, 223482, 25664, -17333, -6378, -382865, -105022, -170354, 107944, -50130, -211411, -283153, 163229, -17970, 53315, 33797, -48203, 182604, 146425, 183064, -245527, 55878, -589, 183113, -11176, 17155, -44936, -147866, 43600]
18565a79861e3472r4116A03h3774A34462b65941C17152e0274j48082k44361a52127
18553c9840D2741J7498a54287j56278l8333a34431Q051A60756l2191J3039e6398
18541F1293e8472j30027B90378A33542a38208A02789a25340j835M4390j49037
18531b31822B7120a60377M157j83753b8381q5874o2896B05430a65732A34451m3020
18520I1431J16818a64304A99115L44857B06730b58868B98216b13578A18119a61271
18509C33598o4236b02383a6840j74933N1112i432C0739K7241q479a13618C8554
18497b73633A54897b99710E9255A474Q3992a88410e941G3000N3126b46279H4365
18485e1716J1648k02402a8729A44982a04332A11826a45383j66819l2457c9640
$$ y = [-179861, -53472, -147588, 103, -83774, 134462, -265941, 317152, -50274, -198356, -442717, -152127, -39840, 42741, 60239, -154287, -310565, -348898, -134431, -126380, 160756, 128565, 141604, -56398, 61293, -58472, -188499, 290378, 133542, -138208, 102789, -125340, -127175, -82785, -231822, 27120, -160377, -156220, -339973, -28381, -114255, -177151, 205430, -165732, 134451, 91431, 208249, -164304, 199115, 543972, 206730, -258868, 298216, -213578, 118119, -161271, 333598, 269362, -202383, -16840, -191773, -140661, -9432, 30739, 57980, 49501, -113618, 38554, -273633, 154897, -299710, 59255, 1474, 85466, -188410, -5941, 73000, 126126, -246279, 84365, -51716, -40068, -242470, -18729, 144982, -104332, 111826, -145383, -312202, -344659, -39640]
18474a42990B33072j04236a14804E0244K39573F4087e4517o0457i259B75792b35433
18462e1849H3455d58147J77950M4090j45645J7228A47896j8181H211N2651g6550
18450a60052E4288a09707B6753J00439a10200j99180f8775k05586A20908i971
18439a97509D0455o766a12146k8422A37324b74711a040j19053n9180A8802J44908
18428A63710c11553A36643C0365i8493k0230p9757J9530P7377j26405k15868b1525
18416A04552P7135J42796C7750a54702j05255A06761b64743C8209a09819C39767
18405I754Q8401i804L363j97118B55391O7257A51964o2514a81167N5936J5996
18394a09235B54985b86783c1839q3219A17521a50605C4665J7197A2527O3752A2291
$$ y = [-142990, 233072, 128836, -114804, 50244, 289817, 64087, -54517, -114974, -9259, 275792, -235433, -51849, 83455, -458147, -280197, -236107, -381752, -364524, 147896, 129715, 8211, 60862, -76550, -160052, 54288, -109707, 26753, 127192, -110200, -309380, -68775, -274361, 120908, -9971, -197509, 40455, 33689, -112146, -140568, 137324, -274711, -1040, -120093, -179273, 18802, 163710, -311553, 136643, 30365, -98493, -118723, -198480, -178950, -101573, -227978, -443846, -21525, 104552, 181687, 324483, 37750, -154702, -259957, 106761, -264743, 38209, -109819, 339767, 9754, 98155, -9804, -6441, -203559, 255391, 322648, 151964, 89450, -181167, -125231, -109235, 254985, -286783, -31839, -115058, 117521, -150605, 34665, 51862, 12527, 76279, 12291]
18382f8201j2407J941j22441A24694A4757b0656n15243E805c33836f9932o7481
18371a37413j31523q2405B957a33653k23096F943O3266b57146G9415l3592J13826
18360A59649a52321j37976M7909r5250I0632b01351d1860n158l9374A81800C4812
18348b14499N9403l9791A12699J96574G9762Q9321a02818M0218j12103b2697B22284
18336a51981j68188G0574a6051j48054I8878b0463l347k81405A16368n2136a3583
18324B64488D7048K4714M3519g5128j37439D7613a02432p808N3444B35300b19720
18312B90795A22555c12751a17500F9272J92931b7265G5991b34196F552c9557j02443
18301a42000k2291A52152p0446b54015I2881J05471F5719K2531e3853b5305A11023
$$ y = [-68201, -80608, -78667, -201108, 124694, 14757, -20656, -535899, 5805, -333836, -69932, -137413, -268936, -351341, 2957, -133653, -356749, 6943, 70209, -257146, 79415, 45823, 159649, -152321, -290297, -242388, -337638, 90632, -201351, -41860, -47018, -86392, 181800, 34812, -214499, -155096, -194887, 112699, 309273, 79762, 169083, -102818, -62600, -174703, -22697, 222284, -151981, -320169, 70574, -16051, -164105, 98878, -20463, -23810, -305215, 116368, 64232, -13583, 264488, 47048, 71762, 115281, -75128, -212567, 47613, -102432, -110240, -56796, 235300, -219720, 290795, 122555, -312751, -117500, 69272, 262203, -27265, 75991, -234196, 6552, -39557, -142000, -164291, 152152, 81706, -254015, 92881, 198352, 65719, 88250, -53853, -25305, 111023]
18289A9020D127a54070e071C6557h6028L3824j56867A34033b93358F5741K14550
18278B80291e0544A23891h9145A16077r865g4770b4548j51159B23779q3476b16312
18266b45069h3228l16661J72713E3343i6149A56754K18014b9156A73232K6804
18256B00036j8948q2018d0919j0211k13042g719A16713a75581A51281f1122q5704
18245a46826q5842e8172l2530l999j98960C33348H1292K07707C7727b59975A79297
18233G1922a62947f1616j44429A3131e7361K4558H0932b09236p5835j94602d0003
18221D7728a03231a2926l25507e2483j32171l4819j14111J32317B06298d5821
18210A77254c53856g3409D8471c2130j2369n5369r7322A9153J07005J99699b18091
$$ y = [19020, 4127, -154070, -5071, 36557, -86028, -52204, -209071, 134033, -293358, 65741, 280291, -50544, 123891, -89145, 116077, 106212, -74770, -24548, -175707, 223779, 140303, -216312, -245069, -83228, -399889, -227176, 53343, -96149, 156754, 374768, -29156, 173232, 200036, 181088, 99070, -40919, -51130, -264172, -7719, 116713, -175581, 151281, -61122, -146826, -232668, -58172, -90702, -94701, -293661, 333348, 81292, 288999, 37727, -259975, 179297, 71922, -162947, -61616, -206045, 13131, -57361, -32803, 80932, -209236, -285071, -479673, -40003, 47728, -103231, -12926, -338433, -52483, -184654, -219473, -333584, -201267, 206298, -45821, 177254, -353856, -73409, 48471, -32130, -44499, -99868, -197190, 19153, 126158, 325857, -218091]
18198a02681a5174l6030j7806F9318c9448F0314k4407f8815b4093k39776f7110
18186A38504a89044b5859j75498F8896a4577I9016J49026k5804b31597J05529
18176a26068C0848j5164e3590o8722J5920p6484n8979J12909a5252B71150a41947
18164I84c2640E7151M3293K11877a3371N592A93546C7401e6842A10772g6871B64228
18151b33971d0566j45223M1599P0749A63366C2432c4610j9553B1223b99559C34551
18139C3821J4983g2615b5870j01730A0275J68454m0726a51821p8399Q7631k18357
18128c60946a32554A64420i1664q3809D762J2161J93551i7767j75872I7769e3466
18116c6350F8493j9826F535J7030J27715a23993A76429a71963k02750A22180E9644
$$ y = [-102681, -15174, -51204, -69010, 69318, -39448, 60314, 35907, -68815, -24093, -263869, -67110, 138504, -189044, -25859, -201357, 68896, -14577, 99016, 248042, 222238, -231597, -126068, 30848, 15684, -53590, -122312, -106392, -182876, -241855, -128946, -15252, 271150, -141947, 984, -32640, 57151, 100444, 312321, -13371, -7779, 193546, 37401, -56842, 110772, -76871, 264228, -233971, -40566, -185789, -144190, -73441, 163366, 32432, -34610, -54163, 21223, -299559, 334551, 33821, 48804, -72615, -25870, -127600, 10275, 178729, 138003, -151821, -230220, -142589, -360946, -132554, 164420, -91664, -175473, 4762, 16923, 210474, -97767, -273639, 97769, -53466, -36350, 68493, 48667, 6535, 23565, 151280, -123993, 176429, -171963, -374713, 122180, 59644]
18104A34181n0705P5786o580a14774M5925n9381e2012D9666d18083G666R3219
18093A00885c8973A40444B6587a64804A3596a31240j2733k6690A36231J15085
18083B51316a5363j19903k31309J70670A03061a13433J3545k40054B44658h3744
18072C1134a54630B19041I1125j8537g700B05846A9771b09262B4068J23875A4538
18060b74943B5667b334I7372J65768p3131h2945A38336C4039K72534B1978h56
18048c0665k26398c0811k44217F4770g1035E5499a6530j34990B32548I0710P2978
18037A63688a23324H3535J2856f215A2171K08225a14042A54914a97070C7220b88657
18025a71267a43A2379L2507b63336i0415o6319A05215g3795K2581k32460N0946
$$ y = [134181, 83476, 159262, 152682, -114774, -68849, -128230, -52012, 49666, -418083, 7666, 100885, -38973, 140444, 26587, -164804, 13596, -131240, -143973, -170663, 136231, 251316, -15363, -135266, -366575, -195905, 103061, -113433, -99888, -339942, 244658, -83744, 31134, -154630, 219041, 91125, 72588, -7700, 205846, 19771, -209262, 24068, 147943, 14538, -274943, 25667, -2334, 97372, 263140, 190009, -82945, 138336, 34039, 306573, 21978, -856, -30665, -257063, -30811, -275028, 64770, -71035, 55499, -16530, -151520, 232548, 90710, 163688, -123324, 83535, 96391, -6215, 12171, 220396, -114042, 154914, -197070, 37220, -288657, -171267, -143, 12379, 44886, -263336, -90415, -156734, 105215, -73795, -51214, -283674, -232728]
18014b32728d5051A20628b83499J40912r0262C09878a19179a9947B07791C9250
18003C28553k3088b69347O5878a9071C28664l4144b56561A56619O6047J50495
17993C73161j70351m9673E9612K01278A5707c48221J49629B6473a44713m488g4236
17981a04389B90900i3500B00930E3902b95008A29830B9139D596b7043B924J22636
17970A25560a33103E6231a6860l8250j60955P8192r1388J10651A32418K4926k6861
17959A30483g2094j43607B21891a27046I3323d8448B38278d10344H1376h9227
17948a9427l3592G1564k3768K56497a17205j52858B5983j2039J54675m7500a22266
17936c3412k39589b2196E09J56581e3521j1784m3031A94708a16626L6699b151
$$ y = [-232728, -45051, 120628, -283499, -142587, -232849, 309878, -119179, -19947, 207791, 39250, 328553, 305465, -269347, -203469, -19071, 328664, 294520, -256561, 156619, 222666, 373161, 202810, 153137, 59612, 260890, 15707, -348221, -198592, 26473, -144713, -149201, -74236, -104389, 290900, -93500, 200930, 53902, -295008, 129830, 29139, 4596, -27043, 2924, 125560, -133103, 56231, -16860, -55110, -216065, -137873, -229261, -118610, 132418, 157344, 130483, -72094, -215701, 221891, -127046, 93323, -48448, 238278, -410344, 81376, -89227, -19427, -53019, 71564, 47796, 304293, -117205, -270063, 25983, 13944, 168619, 121119, -122266, -33412, -273001, -22196, 509, 157090, -53521, -65305, -108336, 194708, -116626, -79927, -2151]
17924h6218C5335M8603a00734A02020a49621A25229d0469B43938B7175J76617
17914B03792J90111r3920A06057c0580C04170I061J1935K26853d6866k21245B61134
17902A20665J3320N5765G7963g6116k1244A38123A4409g4385F7316c4767C0548
17890a24007j8287n2960N2655a4062A71768C1980L230J47410R6669h7714H3265
17878a25145B74220Q9983I9122b4396A68756K11954i8726A69495j7353b01790
17867B03771A3902K23892a01060G2092b84681H6047A1564c46248A32483J63984
17857B96467A2836J38962b75588i7893k19604e7054b5664j71973i7649J8236K3529
17846e5884G4829a91973j4221A10889O7593b11362B8546J83565b5230E8815c4291
$$ y = [-86218, 35335, 83938, -100734, 102020, -149621, 125229, -40469, 243938, 27175, 203792, 393903, 299983, 106057, -30580, 304170, 9061, 20996, 247849, -46866, -268111, 261134, 120665, 133985, 189750, 77963, -76116, -97360, 138123, 14409, -74385, 67316, -34767, 30548, -124007, -142294, -195254, -142599, -14062, 171768, 31980, 35210, 182620, 279289, -87714, 83265, -125145, 274220, 364203, 99122, -24396, 168756, 380710, -98726, 169495, 152142, -201790, 203771, 13902, 237794, -101060, 72092, -284681, 86047, 11564, -346248, 132483, 296467, 12836, 151798, -275588, -97893, -317497, -57054, -25664, -197637, -97649, -79413, -55884, 74829, -191973, -206194, 110889, 178482, -211362, 28546, 212111, -25230, 58815, -34291]
17834A13749K322J31521D8032k0272a83620M717A91862F674a23243k84673i4498
17822a28780A40383P1739d6890j35521P8808C5751Q6214h0633l4780D6969L56337
17811D03306j99425e6916k16280C9976M20262a63712C75985f3208E5878c26780
17800a89274B61272b182B2854F941a64950A98425C4564g6684F9987Q9988b60577
17788A75319A9630a1198A75066i2757H435f5736I131J78382h2701A06771q939
17777I7832J71027a35524H7852R9422n5223h6367G3917R8804N4082f3F5971a43570
17764C6512o66b24945A60220c2063m6739H2456b2912B54640d864E9193M9589D0493
17751i4886q432C95527a04378E0380M163P6705e3787H6273k7065k0071K55329
$$ y = [113749, 116071, 247592, 48032, 27760, -183620, -178903, 191862, 6674, -123243, -407916, -94498, -128780, 140383, 212122, -46890, -182411, -103603, 35751, 121965, -80633, -115413, 46969, 403306, 203881, -56916, -273196, 39976, 460238, -163712, 375985, -63208, 55878, -326780, -189274, 261272, -2182, 22854, 6941, -164950, 198425, 34564, -76684, 69987, 159975, -260577, 175319, 19630, -11198, 175066, -92757, 8435, -65736, 9131, 187513, -82701, 106771, 97832, 268859, -135524, 87852, 187274, 132051, -86367, 73917, 172721, 226803, -63, 65971, -143570, 36512, 35846, -224945, 160220, -32063, -78802, 82456, -22912, 254640, -4864, 59193, 108782, 40493, -94886, -103318, 395527, -104378, 50380, 54543, 131248, -53787, 86273, 59208, 39137, 294466]
17740B94466C4409e0064C77499c8207A99557d275l71378a27260A72050c3901A35319
17728a77756B2746J33758Q3002o5290b07803o1947e6579A05605a24175A95839
17717B04402J99334j08625b7783k7409D35904a08529j6718r5929f4098A41754
17706I2458A1773K23642a69536B28282r5665J6635a38457j72466A54437M7297
17696B01734H3850K50936g4807H8520j3025a04495N255Q093A29400O0606G1535
17684c0403A54020e3439A91464O9911j20835J7567j1842J16586c38027I3537K1387
17673A14924R6452A04648a41770N0120A04420J65574a79946j68784c0717l910
17663c4627C26747A25158b61896F6389P193k0178c2548E1640J81608f6085E5957
$$ y = [294466, 34409, -50064, 377499, -38207, 199557, -4275, -375653, -127260, 172050, -33901, 135319, -177756, 22746, 156504, 239506, 174216, -207803, -269750, -56579, 105605, -124175, 195839, 204402, 403736, 295111, -27783, -55192, 435904, -108529, -125247, -221176, -64098, 141754, 92458, 11773, 235415, -169536, 228282, 132617, 149252, -138457, -310923, 154437, 201734, 83850, 334786, -74807, 88520, 75495, -104495, -99240, -91147, 129400, 190006, 71535, -30403, 154020, -53439, 191464, 261375, 140540, 158107, 146265, 262851, -338027, 93537, 114924, 211376, 104648, -141770, -91650, 104420, 269994, -179946, -348730, -30717, -34627, 326747, 125158, -261896, 66389, 73582, 53404, -32548, 51640, 233248, -66085, 55957]
17651C77059R3777A079K61024E8070e3484l5350A26367d5221A00537j8401a993
17639c79960a75973P911f4760B53811L61428H7661a04105j40733B76495C1900
17628a17987F3946N4776C1588J40273D5964K0837R2924K73563I715J52888b5288
17616A27467b128A73924E6159b99828A51960L39531H0405a29126B18195d27725
17605A79201Q4847n7538a42383A01133b84183A99705a67017A79424J06001J86272
17595D71697B16313M4714J31781H3813a8611A18281D1840e64737J46502C99373
17584a36071G3474b9470E6352a05643j0196A04821Q0689l9615L58238a62741A57132
17572A05917D6397d2018C95231o2930A45634c28452e9501D2440L71370b36455
$$ y = [377059, 470836, 1079, 262103, 58070, -53484, -88834, 126367, -45221, 100537, 82136, -1993, -379960, -175973, -168062, -64760, 253811, 615239, 87661, -104105, -244838, 276495, 31900, -117987, 63946, 118722, 31588, 171861, 45964, 66801, 159725, 433288, 9715, 162603, -25288, 127467, -2128, 173924, 56159, -299828, 151960, 491491, 80405, -129126, 218195, -427725, 179201, 264048, 206510, -142383, 101133, -284183, 199705, -167017, 179424, 285425, 471697, 216313, 261027, 392808, 83813, -18611, 118281, 41840, -564737, -418235, 399373, -136071, 73474, -29470, 56352, -105643, -115839, 104821, 185510, 145895, 504133, -162741, 157132, 105917, 46397, -42018, 395231, 332301, 145634, -328452, -59501, 42440, 413810, -236455]
17561A65696J44052B4212K56257a72q7271A07330O2332b72371A93523N5644g2409
17549A35064b33709A02003M7691C2203a46681H2500J99340j75a7256g280n8491
17538f5771C68844j7828f2937G3740J02673E1590h2007D0828K81116I6677k6088
17527G0589L58232A30611J33938f2948C51383J83639j62895J09074K3241I2541
17516B57288p0106p6610K47559q4196R350J73655G6796J15161J69328R0194n3197
17505C98282j60438p9436D9180L44316K7465H6125a35290B16090b6334p126l8605
17494g2065C58430R6078H7052a4033A64648G5718M19743A65627i4451d6474r532
17483e6006A37301k3567B0983Q2068L08372j92616M8741I2138N8827N11210B88782
$$ y = [165696, 309748, 24212, 280469, -172, -87443, 107330, 169662, -272371, 193523, 249167, -72409, 135064, -233709, 102003, 149694, 32203, -146681, 82500, 281840, 281665, -17256, -7280, -65771, 368844, 351016, -62937, 73740, 176413, 51590, -82007, 40828, 321944, 96677, 70589, 428821, 130611, 264549, -62948, 351383, 535022, 372127, 481201, 504442, 92541, 257288, 187182, 110572, 358131, 273935, 283285, 456940, 76796, 191957, 361285, 451479, 398282, 237844, 158408, 49180, 393496, 420961, 86125, -135290, 216090, -26334, -33460, -72065, 358430, 454508, 87052, -14033, 164648, 75718, 495461, 165627, -94451, -46474, -56006, 137301, 113734, 20983, 103051, 411423, 218807, 267548, 92138, 150965, 662175, 288782]
17471A77805o0182A2918K25333I7216M6226P0461j9011m898D4842J95796c7061
17459a22303C29586d3606B64415A26717L57235a15151A01526K27972j34246L98
17449A95650m0701L42131r0607J9074A7043M07503k474q5018F3164B1079J82787
17438B03866K1046R7327r8155J18706j02942j07693J71655J06480F0905K67369
17428C28274J72111j91242L0870j58584K82876D694L13525k4501J4907l3110J54024
17417D29539H5723M1408N04391d864D92732m0785A4219Q2563J06410F9827J04617
17406A74444l5350J31410i0561B96452b7899j2273A35457L74370C2533K07884
17396B40417a25081C05744f4103K8030E10275A98243K05183H4584a9365B29945
$$ y = [177805, 117623, 12918, 238251, 97216, 143442, 213903, 194892, 189994, 44842, 240638, -37061, -122303, 329586, -43606, 264415, 126717, 483952, -115151, 101526, 329498, 195252, 195650, 154949, 497080, 406473, 425547, 17043, 424546, 422072, 337054, 63164, 21079, 203866, 224912, 322239, 224084, 342790, 239848, 132155, 303810, 410290, 60905, 328274, 500385, 309143, 340013, 181429, 464305, 4694, 318219, 293718, 308625, 275515, 429539, 85723, 127131, 631522, -4864, 492732, 451947, 14219, 96782, 203192, 69827, 174444, 139094, 270504, -90561, 296452, -27899, -40172, 135457, 509827, 32533, 240417, -125081, 305744, -64103, -36073, 510275, 198243, 403426, 84584, -19365, 229945]
17385D00139j81675J64659i9731B69903E0910b59499F3212o495R6820L62652k07671
17374C08518h4438A66456J91736n2182O0520K92284B13348K8168J27578A73292
17363c1134D41515A10985i0195D6497L15433A54182m4663k238L06672G8440K32094
17352C10534B5499J72162E0047r561M26029e299A900P0567c8342B8893K45509
17341B74402R0070h9706D04531j80699l722J22721P848A45790K55481j69547r101
17330B22623J83591j30836j03111J51528d9075A83965P6939J87341p2892b7398
17319B15400Q5935j26861f4386B42486r527G2632K65421m6194L18727k12418A83016
17307B53578I5784P1565n0424n4786B8249J05144K0925B4626R7804J92634A32788
$$ y = [400139, 218464, 383123, -99731, 269903, 50910, -259499, 63212, 56717, 153537, 516189, 308518, -84438, 166456, 358192, 306010, 366530, 658814, 213348, 241516, 369094, 173292, -31134, 441515, 110985, -90195, 46497, 361930, 154182, 109519, 107281, 413953, 78440, 310534, 25499, 197661, 50047, 40486, 466515, -5299, 1900, 72467, -38342, 28893, 274402, 364472, -89706, 404531, 223832, 220110, 342831, 350679, 145790, 401271, 231724, 222623, 406214, 275378, 172267, 323795, -49075, 183965, 260904, 448245, 375353, -27398, 215400, 301335, 174474, -64386, 242486, 232959, 72632, 338053, 291859, 610586, 398168, 183016, 253578, 95784, 167349, 116925, 62139, 28249, 133393, 154318, 24626, 122430, 315064, 132788]
17295f4180B7152M39904D4480J88577A3656K24596R8861j52909J19147k7643N7941
17284C33649j05205C8491N4592K8581K40585P1966j91309p3400R1408A13614J66294
17273B79908J88828j60585f918D35594A98695K81253A01901K74201r2827J15426
17263C98701A00003J45260J08423J3699H0552M4556K40029j0578j56611n0066
17253A47882J89232J71360A81319k5890K07436J00698m0814j4753D0717J92478
17243B33195K27948J62156k52343A61541p5193K88481q8091r4622I923M49651
17233D59574O1267j76705A58986K52156j95122J35242j34775J23985J68477k8353
17223D80596B20788K74610A18167j3744L35404j08705l7156O5378J75939r4753
$$ y = [-64180, 27152, 467056, 44480, 233057, 13656, 238252, 337113, 184204, 303351, 275708, 333649, 228444, 38491, 93083, 121664, 362249, 434215, 242906, 169506, 260914, 113614, 279908, 468736, 308151, -6918, 435594, 198695, 479948, 101901, 376102, 283275, 398701, 100003, 245263, 353686, 367385, 80552, 125108, 365137, 354559, 197948, 147882, 337114, 508474, 181319, 155429, 362865, 463563, 422749, 407996, 40717, 233195, 461143, 623299, 370956, 161541, 86348, 374829, 286738, 192116, 9923, 459574, 520841, 344136, 158986, 411142, 216020, 351262, 216487, 340472, 508949, 480596, 220788, 495398, 118167, 104423, 439827, 331122, 293966, 359344, 535283, 440530]
17213D40530M1105j74176k2993L20403R5616A52446J32490G0262Q91K25370M9990
17202C46513K65791k09053B7775N70030B82405K33764B23283K58674J35102B69666
17191E20291n2028A65756J40780n874j47262L83487B28633O1083J00857A75486
17180G07740B38955J63147K9700J18860l9179J06991B74071J84116K0818j56781
17170C22224j00576H1097P15041j73965A57430L3859J18495R1770l7051P4738
17160D39241J66174A55292J97441L8458J43694J2291p8737j44559K51460Q8820
17150F64160p2479p2705O2469o2126p2393O5244J88539l28176K30283o9775B30173
17138E88640B26621K19639J32463q0199J35437k62220K59731q0417j51192J31109
$$ y = [440530, 481635, 307459, 284466, 604869, 700485, 152446, 284936, 70262, 71153, 296523, 346513, 612304, 403251, 27775, 597805, 282405, 516169, 223283, 481957, 617059, 269666, 520291, 468263, 165756, 306536, 300662, 153400, 536887, 228633, 289716, 390573, 175486, 707740, 238955, 402102, 431802, 550662, 511483, 618474, 274071, 458187, 479005, 322224, 221648, 81097, 796138, 622173, 157430, 191289, 309784, 401554, 364503, 439241, 605415, 155292, 352733, 391191, 534885, 547176, 468439, 323880, 575340, 664160, 591681, 518976, 581445, 519319, 446926, 512170, 700709, 372533, 602816, 533041, 230173, 588640, 226621, 446260, 578723, 498524, 633961, 371741, 631472, 551055, 399863, 530972]
17128E30972j51989K05004P8293k25673J71649J3388j44928N55774D73499j22098
17118C51401K38231j67528K77829r1579o5828J15171k20674N31973m78651J36031
17108F26376q6056K30234j18928Q6567l8161J6458k46742r0707K62465j2028k59478
17097C70000L92539l01934K78373p0328K1822N9911J15799l96795L59850j75928
17087F53309J34317M8216j0090l35223k4676K30766J12371J10438M4972k75906
17077F88494m768J09501j84042J69375N1836l2384K14338D06798L50506K99871
17067A057175q6327j67705k08899K75348l22901L08090j70734j4180K55445l67100
17057E58212K25238J73876o7048M2092j81776K29887k1173J53370k32885N3580
$$ y = [530972, 378983, 583987, 662280, 436607, 608256, 621644, 476716, 1032490, 473499, 351401, 589632, 422104, 699933, 608354, 542526, 657697, 437023, 968996, 490345, 626376, 540320, 770554, 651626, 738193, 700032, 716490, 469748, 379041, 641506, 629478, 370000, 762539, 460605, 738978, 668650, 690472, 750383, 866182, 469387, 829237, 653309, 787626, 835842, 825752, 490529, 465853, 696619, 808990, 919428, 964400, 688494, 683726, 793227, 609185, 778560, 830396, 798012, 1012350, 406798, 757304, 1057175, 970848, 803143, 594244, 869592, 546691, 854781, 684047, 669867, 925312, 558212, 783450, 957326, 890278, 932370, 750594, 980481, 959308, 1112678, 879793, 933373]
17047I33373L4364J78674K2852n60038L61364K75434k85034K9642o4796O7160
17037I92995q7708k18488M58211k85999K37924l70460K70362J202o3738k43103
17027F91198M81677K49544k81106o9928M9714k30624K82022k07482M3207j50047
17017H58175N99725l81963K71269j5765j49379j43584L90687j20727l90305M12674
17007A330807R7937r9856q5619q7094r4075K13628j08968K01787J60810k0753
16997A508604M7729j60376R9326l17280J47783m8708j34220R5234L06482n18638
16987A025936K34729O9141j78328j5471J59072J10488J48498J4362j52356m0885
16977A375186l4729l3204N39859n02708M51900j10466j98392k51790J26690J95581
$$ y = [933373, 967737, 1146411, 1169263, 609225, 970589, 1246023, 960989, 990631, 925835, 992995, 905287, 686799, 1145010, 859011, 1096935, 726475, 996837, 998039, 934301, 691198, 1172875, 1422419, 1141313, 1071385, 1121099, 890475, 1172497, 965015, 1008222, 858175, 1457900, 1075937, 1347206, 1331441, 1182062, 1038478, 1429165, 1308438, 918133, 1330807, 1428744, 1328888, 1243269, 1156175, 1062100, 1275728, 1166760, 1368547, 1529357, 1508604, 1556333, 1395957, 1495283, 1178003, 1325786, 1277078, 1142858, 1238092, 1544574, 1025936, 1260665, 1329806, 1151478, 1136007, 1295079, 1405567, 1554065, 1568427, 1416071, 1375186, 1340457, 1307253, 1847112, 1344404, 1796304, 1685838, 1487446, 1235656, 1362346, 1557927]
16967A557927R8838J28406k45149J88051j02976L4723R6827m34703M04085N85601
16957B311630p12553K47495O7002k25229K84353k7610k07125O3544L09229k37161
16947A873575K88723j9608q0850k12511n6788J48662j03959M84068k16119k8603
16937B076590L58797m66796L69061p259r9597j93803J35100K06336k02313r36
16927B175180K74135L1366K45886k09583n61007M86827l3968p5479N6615J5179
16917B405151L55040l8094j42525K42905K35206l20405M4106J22320j83943M14728
16907C134489k92102Q5430k08137L56969n1873k02357M72431j1395q2035p4005
16897C127415K0676P2610J01439L33517j24135P4352j74034N15920j23866j69816
$$ y = [1557927, 1656765, 1785171, 1540022, 1728073, 1625097, 1659820, 1756647, 1321944, 1726029, 2311630, 1599077, 1846572, 1913574, 1688345, 1972698, 1945088, 1737963, 1801507, 2110736, 1873575, 2162298, 2142690, 2061840, 1849329, 1792541, 1941203, 1837244, 2321312, 2105193, 2076590, 2435387, 1968591, 2337652, 2330393, 2230796, 2036993, 2172093, 2378429, 2176116, 2175180, 2449315, 2480681, 2726567, 2516984, 1955977, 2442804, 2408836, 2333357, 2389972, 2405151, 2760191, 2722097, 2579572, 2822477, 3057683, 2737278, 2781384, 2903704, 2719761, 3134489, 2842387, 2927817, 2719680, 3076649, 3024776, 2822419, 3294850, 3283455, 3201420, 3127415, 3148091, 3220701, 3322140, 3655657, 3531522, 3605874, 3431840, 3947760, 3823894, 3654078]
16887C654078J82705N4593n9405j46126K73446L689Q6206n3107J1046J96171K32088
16876D435384k53920P35190m94059K96295p4607k3699l32360N38781K42149K6756
16866E095910r8679J9975M82768k47910K23623k33928K22925l0195L4874K18856
16856E688219J71994j15656L22467J07076o3473M13701k74685L61895J76005j78579
16846F608964l5693K34859K34212l66150P03652J89865k01833J59841K54009n7968
16836G723758L58345q1384k328N46728J83349j51870O41415j67740K25034K36024
16826I511331N54980m65433M81823P1505K7903L06871N7623N39686k66048N56635
16816A1376876K52466J84308K04022N564K13860M94763K33745N36163M3250L33886
$$ y = [3654078, 3836783, 3891376, 3831971, 3685845, 3959291, 3962980, 4049186, 3996079, 4007125, 4203296, 4435384, 4181464, 4916654, 4422595, 4718890, 4644283, 4620584, 4288224, 4827005, 5069154, 5095910, 4997231, 5017206, 5499974, 5252064, 5475687, 5241759, 5464684, 5434489, 5469363, 5688219, 5860213, 5744557, 6067024, 6174100, 6110627, 6524328, 6249643, 6611538, 6787543, 6608964, 6573271, 6808130, 7042342, 6676192, 7379844, 7569709, 7367876, 7527717, 7781726, 7723758, 8082103, 8000719, 7998391, 8545119, 8728468, 8576598, 9218013, 9050273, 9275307, 9511331, 10066311, 9600878, 10082701, 10154206, 10182109, 10488980, 10546603, 11086289, 10820241, 11376876, 11629342, 11813650, 12017672, 12023236, 12237096, 12731859, 12965604, 13501767, 13545017, 13878903]
16806A3878903K31501P53985k073M00425K20150O56360K10410L41487M52171M55579
16796A7598898J99360N09901N29402K38088O75061L66087L61360Q20234L25280
16787B1623671N20894O52849N42444M11938N16471Q38636O97522N90153P80196
16778B7174774O46461P29847J100492O22761Q18856Q68303O40699J575737N75909
16769C4753839J306338R18970J027710R60361J544033J118176R04987J256782
16761D3791196J202925J659807J235611J162880J552611J569977J384161J395473
16753E4954641J356566J629447K025398J633852J768256J424894J827665J813090
16745F8433809J977446J495257J669291J756286J403628K031865J491889J398783
$$ y = [13878903, 14110404, 14864389, 14862316, 15262741, 15482891, 16139251, 16349661, 16691148, 17143319, 17598898, 17798258, 18308159, 18837561, 19075649, 19750710, 20116797, 20478157, 21298391, 21623671, 22144565, 22797414, 23339858, 23751796, 24268267, 25106903, 25804425, 26394578, 27174774, 27821235, 28551082, 29651574, 30274335, 31093191, 31961494, 32602193, 34177930, 34753839, 36060177, 36979147, 38006857, 38967218, 40511251, 41629427, 42534414, 43791196, 44994121, 46653928, 47889539, 49052419, 50605030, 52175007, 53559168, 54954641, 56311207, 57940654, 59966052, 61599904, 63368160, 64793054, 66620719, 68433809, 70411255, 71906512, 73575803, 75332089, 76735717, 78767582, 80259471, 81658254]
16737H1658254J666591J257118J627393J433559O17252J650434O90439P93537
16729I1394577P51629O28036M07320l7976P77785m0330j58091L4959j117315l08531
16719I2332063o79242q69830r92365j123852j035168j417952j615117j093244
16711H3505293j552378j833835j389756j363874j920047j405755j852131j759033
16703G0428484j605729j813697j515236j805211j708717j710005j337817j699389
16695E7232683j554374j397395j582207j507708j303406j292944j664329r61680
16687D5968640j587930n68456j758137r99932j000908j003449j135862r84108
16679C6929858j084069n45743j366926p17578r79546p11079p83962j010489n87763
$$ y = [81658254, 83324845, 84581963, 86209356, 87642915, 88260167, 89910601, 90601040, 91394577, 92146206, 92774242, 93181562, 93143586, 93921371, 93881041, 93722950, 93757909, 92640594, 92332063, 91652821, 90782991, 89790626, 88666774, 87631606, 86213654, 84598537, 83505293, 81952915, 80119080, 78729324, 77365450, 75445403, 74039648, 72187517, 70428484, 68822755, 67009058, 65493822, 63688611, 61979894, 60269889, 58932072, 57232683, 55678309, 54280914, 52698707, 51190999, 49887593, 48594649, 46930320, 45968640, 44380710, 43812254, 42054117, 41054185, 40053277, 39049828, 37913966, 36929858, 35845789, 35300046, 33933120, 33215542, 32235996, 31524917, 30740955, 29730466, 29142703]
16670B9142703n62127r31580o04734n67851q86252n28376o34942m07692j069237
16661B2949912J16968p08450p47125k56367k81528p37452o23168j01390n91265
16652A9020135m67261k35237m77128o37331J9131m51272l64261j45899m27017
16643A5833860j42561o74512l1541l85172j37348p50273P5957k92244j91510k24116
16633A3080540j69975j70626j69542l09057l27613k06511j58371k27006m13679
16624A0928160k1348k41464J33823m2319m45867j01659k72373r7791j24207j71038
16614I543917k53452l1236m33333L953j17366l4235m0811n05040L41522k22814
16604H251105m52725J74101j23549J59533n20610M6366j93742k36069r932k37770
$$ y = [29142703, 28580576, 27648996, 27044262, 26476411, 25590159, 25061783, 24426841, 24019149, 22949912, 23066880, 22358430, 21611305, 21354938, 21073410, 20335958, 19712790, 19611400, 19020135, 18552874, 18317637, 17840509, 17203178, 17222309, 16771037, 16406776, 16260877, 15833860, 15691299, 15016787, 14985246, 14600074, 14462726, 13712453, 13788410, 13496166, 13304656, 13080540, 12910565, 12739939, 12570397, 12261340, 11933727, 11727216, 11568845, 11341839, 10928160, 10906812, 10665348, 10799171, 10756852, 10310985, 10209326, 9936953, 9839162, 9714955, 9543917, 9290465, 9259229, 8825896, 8829849, 8712483, 8678248, 8637437, 8132397, 8473919, 8251105, 7798380, 7972481, 7848932, 8008465, 7487855, 7534221, 7340479, 7104410, 7094478, 6856708]
16594F856708Q766L002N2160k16078k64957K18504k99124l8842j6954j13726l52307
16583E837152P5629K60484k33039m242l12593M0232K4420j86236Q3899k70580
16573E315126j61250K30906j6044m57298L43582m444m91801K87411j63854K85513
16563E167847m13516O164k60599N07382l98673J09270o3198n34157N04784l16746
16553D308558k1481J38410k32786j37257L40156m36346J5576O817L12468n34393
16543C759722K04183k36210J79403p1380l00690N4352K14599m76098M07833o0957
16533C674757l64216M58853K8195j39831j18039j14443K64685l69789J9090p0522
16523C268740R5344j77175J03240j91004L16804l28507k98179M51106j54001m3219
$$ y = [6856708, 6865474, 6868476, 6920636, 6704558, 6439601, 6658105, 6358981, 6320139, 6303185, 6189459, 5837152, 5912781, 6173265, 5940226, 5935984, 5623391, 5663623, 5688043, 5501807, 5585706, 5315126, 5153876, 5384782, 5368738, 4911440, 5255022, 5250578, 4758777, 5046188, 4882334, 5167847, 4754331, 4760495, 4499896, 5007278, 4608605, 4717875, 4654677, 4120520, 4625304, 4308558, 4287077, 4425487, 4192701, 4055444, 4395600, 3959254, 3974830, 3981647, 4294115, 3759722, 3963905, 3727695, 3907098, 3835718, 3535028, 3589380, 3803979, 3327881, 3735714, 3674757, 3310541, 3769394, 3797589, 3657758, 3539719, 3425276, 3689961, 3320172, 3339262, 3268740, 3364084, 3186909, 3290149, 3099145, 3415949, 3087442, 2789263, 3240369, 3086368, 3043149]
16513C043149r5555J16828l3420j24717m49838L87271J24444l60917R111P4164
16503B690520O4605J68142r4226l79442l203J20663l37603O19842k32490J88385
16493B805193m12824K46836j28383N2703L8264r9074k13728J48001q8024o4089
16483B284875l44287L44089j2511j42285L38385k90714j14800L11105k54116j4965
16473B104776N0149j35876Q9863J89084j30247n92278N62596O6335l51014L32040
16463B185428l53949K48081l15632K0472O5103J85465k33790o2421K90402J6621
16453B045780J0622k09319r3534K59308R4228m20880O8295K70967J08067l53952
16443A779582j41442O9847j36022K63633o015j3419m68802K79131L31703j69201
$$ y = [3043149, 2947594, 3064422, 3031002, 2906285, 2456447, 2843718, 2968162, 2607245, 2616356, 2690520, 2755125, 2923267, 2829041, 2449599, 2446396, 2567059, 2229456, 2849298, 2616808, 2805193, 2392369, 2639205, 2510822, 2563525, 2601789, 2502715, 2288987, 2436988, 2348964, 2284875, 1940588, 2284677, 2272166, 2129881, 2468266, 2177552, 2062752, 2373857, 2119741, 2104776, 2154925, 2019049, 2108912, 2297996, 2167749, 1575471, 2138067, 2204402, 1853388, 2185428, 1831479, 2079560, 1763928, 1784400, 1849503, 2034968, 1801178, 1738757, 2029159, 2045780, 2056402, 1847083, 1753549, 2012857, 2107085, 1686205, 1754500, 2025467, 2133534, 1779582, 1638140, 1707987, 1571965, 1835598, 1829583, 1816164, 1347362, 1626493, 1958196, 1788995]
16433A788995j16942q3966R3649l78234L33504K96050q0925l85468J84722J84215
16423A835600k70243j12684Q6244K1274J25298o7229N6600j12244K38953q8239
16413A713330l84608L31930k41128j79840J52275J90705m17164J93908P9806j12733
16403A326481J99832J23759j92034n548j22807J39829m25075N68593k01114L31132
16393A743048m31832J05375O6188J42641k04374l50784J32647K36320l67381K20520
16383A292368J06544k81990j34409J25514j08871J55641J01135j48380J73570
16374A281122J00114j82802k0411o8246L9199M5000m7895p7882N442K41429l0000
16363A285070n80419P72418n91237J4904M04853k28402k17810L48238r1631J16061
$$ y = [1788995, 1672053, 1588087, 1681736, 1303502, 1637006, 1933056, 1852131, 1466663, 1651385, 1835600, 1565357, 1452673, 1538917, 1560191, 1685489, 1618260, 1674860, 1562616, 1801569, 1713330, 1328722, 1660652, 1419524, 1239684, 1391959, 1582664, 1165500, 1359408, 1439214, 1326481, 1526313, 1650072, 1458038, 1452490, 1329683, 1469512, 1044437, 1613030, 1411916, 1743048, 1311216, 1416591, 1482779, 1625420, 1421046, 1070262, 1202909, 1439229, 1071848, 1292368, 1398912, 1116922, 982513, 1108027, 999156, 1154797, 1255932, 1107552, 1281122, 1381236, 1198434, 1178023, 1109777, 1148976, 1193976, 1146081, 1068199, 1073641, 1315070, 1285070, 704651, 1477069, 885832, 900736, 1305589, 1077187, 859377, 1207615, 1115984, 1232045]
16353A232045k54195N86351p413m24029j89404J54410O954K9091R2113E97257
16342I70579J71027j95046R1537K0543j49988J95071l39807J06661J43368k18526
16332G95419m6519J6514O21805n84452k46728M97721j42007k39079L11110J25281
16322A109065n43301L61044O20467G37962K5174J92880k57797k7573l4538L3739
16312F69847L70846J56733n38062J65170j92900N72509m65302K5896J08903j0601
16302H63039k56517R8852Q1185L30710j00079P535m84353L49729l58699O39067
16292A170469m50382J29993k4830k91729N85172l48662L3930J18301l6831M0415
16282I25846L00295m73096k28317K34808j63969K77558l7233m5604m0384L99458
$$ y = [1232045, 977850, 1564201, 1556788, 1132759, 943355, 1097765, 1104719, 1133810, 1225923, 597257, 970579, 1141606, 946560, 1038097, 1058640, 908652, 1103723, 763916, 870577, 1013945, 795419, 748900, 765414, 1387219, 802767, 556039, 1053760, 911753, 672674, 983784, 1109065, 565764, 926808, 1547275, 737962, 763136, 956016, 698219, 670646, 636108, 669847, 1040693, 1197426, 659364, 824534, 631634, 1204143, 738841, 764737, 873640, 863039, 606522, 705374, 786559, 1117269, 1017190, 1024725, 540372, 890101, 531402, 1170469, 720087, 850080, 825250, 533521, 1118693, 770031, 803961, 922262, 885431, 925846, 1226141, 753045, 524728, 759536, 595567, 873125, 835892, 790288, 749904, 1149362]
16272A149362n63610l6541N12470r7765l08008L8848J5750K02344j61458j54101
16262E97291j72249J18042K6531J24559N5761J8644R2950j00698J3203l84973
16252C89061L42013p3352L07731j67134q519p1388k92245j02747K30279P2330
16242F26029m4207J86382j78201Q0057j24066N32226C86713L28422J25885r1813
16232G49207C56002J60879J36636j0504k35135L45387B46428L05630o892J66743
16222G11909k09308o3217J59920Q2441o0048j02674J12259B66182K83570M6619
16212E96371j1624M6427j67684J10716M7555j79913Q5726j40137K20959A4277
16201E19165k03167J62069j68097R9428J85267B36930N6437p4452K14101J15036
$$ y = [1149362, 585752, 549211, 1061681, 963916, 655908, 694756, 710506, 912850, 751392, 597291, 425042, 543084, 569615, 694174, 749935, 768579, 861529, 760831, 774034, 389061, 731074, 657722, 965453, 798319, 789800, 718412, 426167, 323420, 553699, 626029, 581822, 768204, 590003, 670060, 545994, 1078220, 386713, 715135, 841020, 749207, 356002, 516881, 653517, 643013, 407878, 753265, 246428, 552058, 545166, 711909, 502601, 439384, 599304, 681745, 621697, 519023, 631282, 266182, 549752, 596371, 584747, 631174, 463490, 574206, 621761, 441848, 527574, 387437, 608396, 14277, 519165, 315998, 478067, 309970, 409398, 594665, 236930, 293367, 218915, 433016, 548052]
16191E48052B03676L60100j19166J02681j61208A49985O43478k83763J35916B69847
16180D69321l7844a0847B64462K96319D2940N74886n2072l0373I4253K93728O4151
16169D52132J56219n5143B70780J52373Q2440j08873j41186G9151L93252j06258
16159C66145J28266J62844B62492N3906J3209n1262N4690J70990j75934p296A34445
16147B25733P1599K00704p4683n9198r1876M01331B66724K24087A72104J6534
16137A88638J67612J33919J40239A29137M0933L57082A85941J77688J60297J85120
16127G09046k8135l13985j82642M4035L17675B14449J84688A93065j9034k5233
16117A48798L03997B3670d3444C32605n2488j20855o4279P100O0674R1859J28465
$$ y = [548052, 203676, 563776, 444610, 547291, 386083, 149985, 793463, 509700, 645616, 269847, 469321, 431477, -10847, 264462, 560781, 42940, 617826, 565754, 535381, 94253, 387981, 452132, 608351, 553208, 270780, 423153, 505593, 396720, 255534, 79151, 472403, 366145, 494411, 657255, 262492, 316398, 329607, 278345, 333035, 504025, 328091, 320795, 134445, 225733, 297332, 498036, 423353, 364155, 272279, 673610, 266724, 490811, 172104, 188638, 356250, 490169, 630408, 129137, 170070, 527152, 185941, 363629, 523926, 709046, 680911, 366926, 184284, 228319, 545994, 214449, 399137, 193065, 174031, 148798, 452795, 23670, -43444, 332605, 280117, 159262, 94983, 102083, 162757, 254616, 383081]
16106C83081q9725J16725o8471J11481A395R7499M24809A34175K37978k5370a24680
16094B93822l7135M5705j21744J99214j36862Q6102j2514A37337J45864a56952
16083A02723R5589P3678R6243L70738F9244Q4095P6696m1395J64573j46594L5775
16072B42394J00847a45389B86094A40732j9265m7833J73543j00440N1171H0911
16061e9926D69099A21081M4483H1956L1782J81111R9336j91494K25929I696M29521
16050D39217A69769R5745h06E8554K17409h9320d01B21500Q6495A12664L42689
16039D55353F1615K18393r8925B1441K46199a13681b7637A71555H1728k112K65774
16028C45390F977J58724D6063K64980p0619a51595B24096a21737D1806N09309
$$ y = [383081, 293356, 410081, 341610, 453091, 1395, 98894, 523703, 134175, 372153, 346783, -124680, 293822, 256687, 302392, 180648, 379862, 243000, 329102, 316588, 137337, 283201, -156952, 102723, 198312, 271990, 368233, 738971, 69244, 153339, 230035, 188640, 353213, 206619, 242394, 343241, -145389, 286094, 140732, 121467, 73634, 247177, 146737, 197908, 80911, -59926, 469099, 121081, 165564, 81956, 113738, 294849, 394185, 202691, 428620, 9696, 439217, 169769, 265514, -806, 58554, 275963, -89320, -401, 221500, 307995, 112664, 455353, 61615, 280008, 181083, 21441, 267640, -113681, -27637, 171555, 81728, 79616, 345390, 6977, 165701, 46063, 311043, 240424, -151595, 224096, -121737, 41806, 551115]
16018E51115a59065C49318D1815L2880f422B87408A29580A9795J47783K69965
16008D37543l6016b6222J321A10896g3920C80585I493a1174B39370L50314C8531
15996B31634o9237J99459j51647q293J24319D5874K86449a02559F49974j11165
15986E38809o9104M5582J15274j85135L89379m3361l69448L2054p3831q3234J01629
15975C98614j02323j40264K65986j55031e9452B38554G7730h7774F3972B4819
15964A45474c4809H9138N2781a14587C69624b5756D19978I8339K42735j36250
15954B04824B4303J6671J16970j4174c6220n0850A52169l1489J3986c7631k38865
15943b76496A20257P0681h6074P030B07620p8099K197d999F0984b27346B24805
$$ y = [551115, -159065, 349318, 41815, 74695, -6422, 287408, 129580, 19795, 167578, 437543, 401527, -26222, -24901, 110896, -73920, 380585, 9493, -11174, 239370, 589684, 38531, 231634, 162397, 361856, 210209, 201916, 326235, 45874, 332323, -102559, 649974, 538809, 469705, 515287, 630561, 445426, 834805, 791444, 421996, 454050, 380219, 296985, 398614, 296291, 156027, 422013, 266982, -59452, 238554, 77730, -87774, 63972, 24819, 145474, -34809, 89138, 141919, -114587, 369624, -25756, 419978, 98339, 341074, 204824, 24303, 40974, 157944, 143770, -36220, -87070, 152169, 120680, 134666, -37631, -276496, 120257, 190938, -86074, -79044, 207620, 129521, 131718, -4999, 60984, -227346, 224805]
15931C73852i8889A16410h7355D6830R0802b919A60825M0051l8146d7826n13610
15920e61436h2209b7092l66k1398j85859B0745J95282n8530p752P3666N2923f8980
15907e5012C57758I456K54475C0342M0868C3001A1570b69840G5223K25704A50251
15895a9348A31910R082d6246A79637g60A38256C4588J40839b17409B887a07186
15883A65880b4073A93685B2501a43561e3876o9195A08007J05874I9799a72842
15872C01667H7204J69409q9076b08385g7164G917b2546G6187j796a62711l35808
15861d98519B32278B9789K6279Q5330a8512C0019R1086k6772P0775a49801B14121
15849E1794a44391A44414F5661A4045b48959B23324a01822B98195E8696M54635
$$ y = [373852, -98889, 116410, -87355, 46830, 137632, -2919, 160825, 200876, 162730, -47826, -561436, -82209, -27092, -27458, -48856, -234715, 20745, 216027, 157497, 149745, 223411, 276334, -68980, -55012, 357758, 9456, 263931, 30342, 71210, 33001, 11570, -269840, 75223, 300927, 150251, -19348, 131910, 140992, -46246, 179637, -760, 138256, 34588, 175427, -217409, 2887, -107186, 165880, -24073, 193685, 22501, -143561, -53876, -123071, 108007, 213881, 99799, -172842, 301667, 87204, 256613, 167537, -208385, -77164, 7917, -22546, 76187, 74391, -162711, -498519, 232278, 29789, 56068, 141398, -18512, 30019, 121105, 94333, 165108, -149801, 214121, 51794, -144391, 144414, 65661, 14045, -248959, 223324, -101822, 298195, 58696, 513331]
15839E13331B34479E88J88491G7653J86644r5550b16425A65763a8607C6025M5736
15828H1761b03152A11115l2024k6457H664J3718K27839C0108d4774j3169j08267
15817a66210A20604J38160G986L3104M2851i7634c0517j42807b2192c292C4254
15805B40301a21900C7473c5719A84864a70180j78731A6863K962b00937E0009b72111
15793a13050A14281j5252J68689j00504q0408j5839d6965o4647j09633B21924
15782b00424F3241B3073p338d6376J5509k51075i9377j6436e772j44652o6481
15771b16905R9382r7764G2620Q5052J02939A03010a82993A21648C931a09196A59300
15759B05792I635a72686B00264p981J3624o8341b10144A42245m6970b0748o357
$$ y = [513331, 234479, 588, 189079, 77653, 264297, 168747, -216425, 165763, -18607, 36025, 81761, -203152, 111115, 79091, 52634, 8664, 22382, 250221, 30108, -44774, -57943, -166210, 120604, 258764, 7986, 41090, 83941, -97634, -30517, -173324, -22192, -3292, 34254, 240301, -121900, 37473, -35719, 184864, -170180, -348911, 16863, 19825, -200937, 50009, -272111, -113050, 114281, 99029, 267718, 167214, 86806, 70967, -46965, -111612, -221245, 221924, -200424, 63241, 23073, 15735, -46376, -30867, -281942, -99377, -115813, -5772, -150424, -216905, -117523, -215287, 72620, 157672, 260611, 103010, -182993, 121648, 3931, -109196, 159300, 205792, 9635, -172686, 200264, 192283, 205907, 137566, -210144, 142245, 95275, -20748, -27105]
15748b7105j10411c2847m10932K19888E9896B2035J13126h0296k09178G4512o24
15737G3888K7532d30940A52534m8613F187N767b6703C43332r0573h3129B71314
15725b09354f2118b5511j17303q071A0836b70954Q3779l4057E1022b54198m1128
15714b95326B66699G3366a09114k64325J74521B33645a79224C28570B507a55594
15703A33560A2811a77277j09288B34545c07082b6797E0875O9858b82417F8605
15692A14459B9773J33771C3360b85891e6322o0971A43458J32213A33475e3408
15681a38524j25887C50294b13468I7525j8537b55727L2000e2338D2502K88170
15671C30672D1017j9801N4683b41491f2369H969b24935I0468d8731A20189l5035
$$ y = [-27105, -137516, -32847, -443779, -223891, 59896, 22035, 135161, -80296, -289474, 74512, 73888, 101420, -430940, 152534, 103921, 6187, 11954, -26703, 343332, 252759, -83129, 271314, -209354, -62118, -25511, -142814, -150885, 10836, -270954, -187175, -221232, 51022, -254198, -295326, 266699, 73366, -109114, -373439, -198918, 233645, -179224, 328570, 2507, -155594, 133560, 12811, -177277, -286565, 234545, -307082, -26797, 50875, 120733, -282417, 68605, 114459, 29773, 163544, 33360, -285891, -56322, -117293, 143458, 275671, 133475, -53408, -138524, -264411, 350294, -213468, 97525, 78988, -255727, -223727, -52338, 42502, 330672, 41017, 21216, 75899, -241491, -62369, 8969, -224935, 90468, -48731, 120189, 85154]
15660H5154b37285A3640a00518J9521F7748J4007a10212j33924j61851A65034
15649a01829c4515l64215B97177j05674c0431q1483k5173C01752F6150J11978
15639A78128B0945c59592a75415C45797A06375n2285a55403B85509I0323a31136
15628H0968L0548b76067o1675H7375c46396A11629m6626a91515f4059j5875A00413
15616E2884K25741A20197J52957b67737a18815B92934a16886j36298P3691A89843
15605b42497O6087E5878b99917J12908b1687D5341e5058j50746A19350i599l02845
15594c12444E00107B0367J30728E7193a2016j47943I7115b51444A21831l2197
15584H9634a46977B66809a30399I8658a04268C511b8000l6902j3937B4770h025
$$ y = [85154, -237285, 13640, -100518, -80997, 67748, 81755, -110212, -244136, -405987, 165034, -101829, -34515, -398730, 297177, 191503, -30431, -111914, -137087, 301752, 66150, 178128, 20945, -359592, -175415, 345797, 106375, 54090, -155403, 285509, 90323, -131136, 80968, 111516, -276067, -337742, 87375, -346396, 111629, 65003, -191515, -64059, -79934, 100413, 52884, 278625, 120197, 273154, -267737, -118815, 292934, -116886, -253184, -179493, 189843, -242497, -176410, 55878, -299917, -187009, -21687, 45341, -55058, -205804, 119350, -9599, -312444, 500107, 20367, 151095, 57193, -12016, -159959, 97115, -251444, 121831, 89634, -146977, 266809, -130399, 98658, -104268, 3511, -28000, -64902, -78839, 24770, -8025]
15572a30203C15131A09721Q8540B3862b2233j64057j7201A41257j7725d72242
15561b69290D8561c8785E2702J36152H1610a75538a9505p9915d870B04145J1531
15550B15676b52539f8729a6553j45047j54217i8213k97733h2400C95426A73246
15539C54992A68652j0993j8565a54025n6526a7380A68949c348D8797L04353A72416
15527E7728J97933A13634d527G0065c8369B51491b13025E75535a36001F5767g6217
15515a46891H4040B9666K08073A12415a64052G7834l0707J43080b18365e3171
15504a41712C27715m7279G128d14619B18096b92667B65738C7093J83845b62902
15493A16372b49189f9479j61283j8436a9735j57822k19944A57905b26089A4832
$$ y = [-130203, 315131, 109721, 198261, 23862, -22233, -186290, -203491, 141257, 123532, -472242, -269290, 48561, -38785, 52702, 188854, 81610, -175538, -19505, -99420, -4870, 204145, 215676, -252539, -68729, -16553, -161600, -315817, -98213, -395946, -82400, 395426, 173246, 354992, 168652, 157659, 139094, -154025, -210551, -17380, 168949, -3348, 48797, 353150, 172416, 57728, 255661, 113634, -4527, 70065, -38369, 251491, -213025, 575535, -136001, 65767, -76217, -146891, 84040, 29666, 237739, 112415, -164052, 77834, 47127, 190207, -218365, -53171, -141712, 327715, 280436, 7128, -414619, 218096, -292667, 265738, 37093, 220938, -262902, 116372, -249189, -69479, -230762, -249198, -19735, -177557, -397501, 157905, -226089, 14832]
15482b72878C96213c54598J06892b0246j43393P5503F0037J54002L06376A34116
15471g7564K7309B28344m4950b30617b1160k78434E2620b9777E4726M7421J62051
15460B64198a05722F2391d88910b28944Q1482j61254A2296c0298q717r5715A98829
15448B07781K5833H9036P7121K40363A82384B5454K02363q9828K16059J2108o7378
15437B98778n3089O6893F6179i7072m5240A15226b37111B66828o6631g3448A24902
15425A08713a40439G396b40699G5618j6919c50723I840b04524i6490M5834A39576
15413e8328q8617n6192H001a44964E514a32369B06188J0529b35900l5640K806
15402b68734D8764j9396c89296O7230J37535B992b47853J9071e6403J3428C2018
$$ y = [-272878, 396213, -354598, -247706, -20246, -163639, -88136, 60037, 214039, 520415, 134116, -77564, -50255, 228344, 183394, -230617, -21160, -299594, 52620, -29777, 54726, 102147, 264198, -105722, 62391, -488910, -228944, -147462, -308716, 12296, -30298, -39015, -134730, 198829, 207781, 233614, 89036, 166157, 406520, 182384, 25454, 227817, 137989, 354048, 366156, 298778, 245689, 312582, 66179, -97072, -142312, 115226, -237111, 266828, 200197, -73448, 124902, 108713, -140439, 7396, -240699, 75618, 58699, -350723, 9840, -204524, -96490, -50656, 139576, -58328, -146945, -203137, 8001, -144964, 5514, -132369, 206188, 216717, -235900, -271540, -268734, 48764, 29368, -389296, -322066, -184531, 2992, -247853, -228782, -56403, -42975, 32018]
15390a03818C68518C6460a09661j43894A22497J35174A2398L84406B7373K61821
15380B89194h340j1692B22496m2964H6584a22822B91303h0571B56689P4390c85984
15368b65172J14226H2727a8817C77031b04152A52815q137b272j21525A37275J14149
15357B51424A16446d9259C09582a26497A40318a18365B33557q57A08508a81609
15346H1092C1676a605B02886J20108b6154l6209I1097L6497k9351a86406B1175
15334b4792D05216j8752b00171L6465A81839H7834c5927A44572k8376c92842d2013
15322C71459j57366a38936E90933a85600B10647b16671a2540B55407I5509h4k21798
15311b21882B89681d1045a1381B86121h0238l6393A1925J74214j1704J02K2476
$$ y = [-103818, 368518, 36460, -109661, -253555, 122497, 257671, 12398, 396804, 27373, 289194, -8340, -20032, 222496, 179532, 86584, -122822, 291303, -80571, 256689, 331079, -385984, -265172, -150946, 82727, -18817, 377031, -204152, 152815, 144678, -2272, -123797, 137275, 251424, 116446, -49259, 309582, -126497, 140318, -118365, 233557, 232700, 108508, -181609, 81092, 31676, -1605, 202886, 322994, -26154, -62363, 91097, 127594, 98243, -186406, 21175, -24792, 405216, 386464, -200171, -163706, 181839, 87834, -35927, 144572, 116196, -392842, -42013, 371459, 214093, -138936, 590933, -185600, 210647, -216671, -12540, 255407, 95509, -84, -221882, 289681, -41045, -11381, 286121, -80238, -116631, 11925, 186139, 174435, 174537, 197013]
15300A97013M9103j687M8709I8902C2832N2416M591O8398b0325E8121K37979D8503
15287B533a79402A38510m7542g090n789A79733a57288A13765K84325g3501j08099
15276a81600e1019j53201P227m1279e7956b3502k88690H2550b63266D09028r4053
15265C14975b21867d751A84225j5756L8400E528a65406a2945k8973B49117K12339
15254D61456c7520G672J58237j5664k1226L39371B8702P8496L5963J99316N05264
15243H47741M99232J767739r25623j32402O69828A071222G9743K13806P068e6863
15232A76490J49327j30073h3390C1804O5945f0675C19133G6223i0478B17651h560
15220h0199F0433A1696g4544c2656j17763H9664m4352L8365I796K81728j33971
$$ y = [197013, 246116, 244429, 293138, 98902, 32832, 85248, 89839, 158237, -20325, 58121, 296100, 48503, 2533, -179402, 138510, 90968, -7090, -12879, 179733, -157288, 113765, 398090, -73501, -181600, -51019, -204220, -196993, -238272, -57956, -23502, -312192, 82550, -263266, 409028, 314975, -221867, -4751, 184225, 168469, 206869, 5528, -165406, -12945, -41918, 249117, 461456, -37520, 7672, 165909, 150245, 129019, 468390, 28702, 107198, 143161, 342477, 847741, 1346973, 3114712, 2189089, 2056687, 2726515, 1071222, 79743, 293549, 300617, -56863, 176490, 325817, 195744, -83390, 31804, 97749, -60675, 319133, 76223, -90478, 217651, -8560, -80199, 60433, 11696, -74544, -32656, -150419, 89664, 45312, 83677, 9796, 291524, 157553]
15209A57553a96607a3713A24542b06215A0755a4859B60254a51945b0275j83350
15199b03625i3495A32601F4786a3578A51689m7677J0821K23902g5274J8307A72725
15187A77165N7461g0799k21192C8527K43721F8832C3319A1427K54789R1663E1301
15175c7392D7583Q0139a77381C30064d9902C02699M9010C4577A3070K34233J33158
15164C80461a185A38766F4097a95974B1810J9484J88470L343e0170B02989n1046
15153A51943F5676K18018b4527B9447a90378B62881b49932C06273q1042a381B55018
15141A0395J50195l5679i5644F1938a50300A05251J18603m4634J26898j4185A10456
15129A68885o8936a9861p161B44557k3394a69893C31164j44563k9920L96931k33061
$$ y = [157553, -196607, -13713, 124542, -206215, 10755, -14859, 260254, -151945, -20275, -203625, -93495, 132601, 64786, -13578, 151689, 104012, 114833, 338735, -75274, -56967, 172725, 177165, 234626, -70799, -291991, 38527, 282248, 68832, 33319, 11427, 266216, 357879, 51301, -37392, 47583, 127722, -177381, 330064, -49902, 302699, 351709, 34577, 13070, 247303, 380461, -1185, 138766, 64097, -195974, 21810, 41294, 229764, 233107, -50170, 202989, 151943, 65676, 283694, -24527, 29447, -190378, 262881, -249932, 306273, 225231, -1381, 255018, 10395, 160590, 124911, -95644, 61938, -150300, 105251, 223854, 179220, 306118, 291933, 110456, 168885, 99949, -19861, -27022, 244557, 221163, -169893, 331164, 186601, 156681, 553612, 320551]
15118C20551F3604J98498K15312R1154k82551b22877A19331K4983M3027e3668
15107I3245h2313J8687j4163A06619K4463m221m6255h3371j46407d8169B35223
15095A51419J30974j00590E0900b60382e1463A02717J17354C9596P5276J44242
15085B59114l9344h0601A02177K94271j49942j11095b97274G4038d404H7545M7649
15074A35194a7428m0192B33365A01106C3152a99043d3478B49410e2201A79817
15063A89351Q7644j05355F6205D297J41948J40757k1785l6107p1962p3754J63105
15052B46499n2744G4160M01726c9761B4834K80718J9191k2977A15223d0040B35705
15040D3320r532O24486C14182A2961J41252D0367H792B102M36813j63462l3221
$$ y = [320551, 63604, 262102, 477414, 568568, 286017, -222877, 119331, 144314, 187341, -53668, 93245, -82313, -63626, -77789, 106619, 131082, 126861, 80606, -83371, -229778, -48169, 235223, 151419, 282393, 181803, 50900, -260382, -51463, 102717, 220071, 39596, 114872, 259114, 219770, -80601, 102177, 396448, 246506, 135411, -297274, 74038, -4404, 87545, 135194, -17428, -57620, 233365, 101106, 33152, -199043, -43478, 249410, -52201, 179817, 189351, 276995, 171640, 66205, 4297, 146245, 287002, 265217, 229110, 157148, 83394, 246499, 193755, 74160, 475886, -39761, 24834, 305552, 324743, 301766, 115223, -40040, 235705, 43320, 33788, 658274, 314182, 12961, 154213, 40367, 8792, 2102, 438915, 275453, 242232]
15029B42232Q1331d9680A02464J6049J35421J53410j40147L08357a1813C05839
15018E07102B52891K927Q3044j64703J02260I6163R7591J84271K470j58249O5552
15007B87798J17313C9674b58973B44697a26056C07019j06951P6665G5644L94558
14997D70202B28773N2444I1579N87086B98317j20469K89837j33615k5754O2987
14987C71303j2719B9657Q9839L42795N8845E2874J80204Q2401m6438I3682M85388
14976E79070j71170K372j77674K77986m6872j88706J2361C8844M80868j46850
14966C72862J04373A99122J94487j40791n8612h9599D60977n0522K1852m8546
14956C83761F0149K32330q5315J72605A56968J09194J96081j90516J41860N0958
$$ y = [242232, 323563, -49680, 102464, 118513, 253934, 407344, 267197, 575554, -11813, 305839, 507102, 252891, 255818, 338862, 174159, 276419, 96163, 193754, 378025, 380495, 222246, 287798, 405111, 39674, -258973, 244697, -126056, 307019, 200068, 276733, 75644, 470202, 228773, 281217, 91579, 678665, 298317, 177848, 467685, 334070, 308316, 371303, 358584, 29657, 119496, 462291, 521136, 52874, 233078, 315479, 269041, 93682, 579070, 407900, 410272, 232598, 510584, 463712, 275006, 287367, 38844, 519712, 372862, 477235, 199122, 393609, 252818, 194206, -89599, 460977, 410455, 432307, 383761, 60149, 292479, 207164, 379769, 156968, 266162, 462243, 271727, 413587, 464545]
14946D64545A96912K75700j74907k202Q6194H8152K15009k1060N5031O1462j44895
14935B53699m8904L31982K72731m4050j70259B50013J97902R6983J96432J05925
14925H47255J14088l55132j64413j33477L17590J76311k78352J54800J14260R9794
14915H92724j63278N3340j56814k98793L97392k61152A23229J66385J04281O7542
14905D61437f760B45630J04866K10128B03048K11205a13345E31923J950F408K85041
14894B91449J1622j40040L24741q8105r4353K99650P1172D5894L93270o4633o3216
14883C11315K26064B56326O3607J00427L63824A80476M53482j75601n8320J55291
14873E55328j87259C4329L84834a20821E38481J82409j1243B35554M02325k54909
$$ y = [464545, 196912, 472612, 297705, 295503, 381697, 88152, 303161, 282101, 337132, 398594, 253699, 204795, 536777, 809508, 765458, 595199, 250013, 447915, 544898, 741330, 847255, 961343, 606211, 441798, 308321, 625911, 802222, 523870, 678670, 792930, 892724, 729446, 782786, 625972, 327179, 724571, 463419, 123229, 289614, 393895, 461437, -6760, 245630, 350496, 560624, 203048, 414253, -113345, 531923, 533873, 6408, 291449, 303071, 163031, 487772, 399667, 305314, 604964, 676136, 45894, 439164, 374531, 311315, 537379, 256326, 319933, 420360, 784184, 180476, 633958, 458357, 400037, 555328, 368069, 34329, 419163, -120821, 538481, 720890, 709647, 235554, 637879, 382970]
14863C82970J60922k09653A43788G1286J32517K68839R9989k69283I4220J06398
14853B00618K31400Q7882M922k43576K44185j83942R6195j23788J76476a037D65745
14841E42421j41462L48393r0867J41276k202K1641C78433j73177J44209M767L35562
14830F89794m8880l13953J15111j94144J10942L22657b50132C72661q4042M65534
14820G54153j01889J84856k41386o1837K76116B35785K86634k19283j8102J98859
14810D83893K45238k38587j47348O7501Q4606j68700M38764j56564J87363l7841
14800G58325l22572K8673q7768H6002L86404J00464k56267P6151J218K66391l19051
14789C41312A8195P38042j90172R980j78639q6989j33581P56986C33650K27444
$$ y = [382970, 543892, 334239, 143788, 71286, 203803, 472642, 572631, 303348, 94220, 200618, 432018, 519900, 524822, 281246, 525431, 341489, 437684, 313896, 490372, -1037, 465745, 542421, 400959, 749352, 658485, 799761, 797559, 819200, 378433, 205256, 349465, 354232, 689794, 640914, 326961, 442072, 247928, 358870, 681527, -250132, 372661, 288619, 754153, 652264, 837120, 595734, 533897, 810013, 235785, 522419, 303136, 285034, 483893, 729131, 490544, 343196, 410697, 495303, 326603, 765367, 608803, 796166, 758325, 435753, 464426, 376658, 86002, 472406, 572870, 316603, 392754, 393972, 660363, 341312, 18195, 756237, 566065, 576045, 397406, 310417, 176836, 933822, 333650, 561094]
14779E61094K3417j62529Q0202B49028K75348N052J42868K43020k13610l15838
14769C85868J87237K54260C67058Q2266K17863j9001j72880N8927l2217P0841
14759E72857k8555l8219P4663L7293J61973k09230P4053j07769q7899j9702J38999
14748E68464J14680j88249r5379N37950D10999M79154p9331C51287J45894L0521
14738E27702K36096k9828n7676j01810J92757o137k39654Q9415J61765l39391
14728D33239N23142p4383Q6551J75535l56376P8684j4252o82K54256k33003r8744
14717G73967M250J65450j40275J81701j20070k56253K77328k33301K02876n7959
14707G97714J59488n8243q2459o9894N6973j12558K84223D48272M46192o6200
$$ y = [561094, 584511, 421982, 502184, 249028, 524376, 529428, 672296, 915316, 701706, 385868, 573105, 827365, 367058, 449324, 667187, 648186, 475306, 534233, 502016, 572857, 544302, 506083, 580746, 618039, 780012, 570782, 644835, 537066, 449167, 429465, 568464, 683144, 494895, 399516, 937466, 410999, 890153, 810822, 351287, 497181, 527702, 763798, 733970, 676294, 574484, 767241, 761104, 521450, 610865, 772630, 433239, 956381, 881998, 968549, 1144084, 787708, 866392, 852140, 851458, 1105714, 872711, 773967, 778217, 943667, 803392, 985093, 865023, 608770, 886098, 652797, 855673, 797714, 957202, 898959, 816500, 746606, 803579, 691021, 975244, 448272, 894464, 828264]
14697H28264J18844J82301p1105q6100P2560k05426K73590j70673l20852M55226
14687A076629m07735K98515k23743L22816m4577j03758k61956N20427j69716l79743
14677F27159n793K72259J88064L8582n36503J57280K01151o2779m340k0509K13988
14666A068559Q2594K5114r3898j04549L1862l22802K02816K26304j07981j48255
14656H59764L30897l09333M71490l55468k07419N2846K53887j2502q8678k9165
14646I66319J10318O2695p7431k6477J98486R16J17751j86338k19784J826j19740
14635H28541M98306j90491k66632J79272K11576m58410L09069j91967K65012K82433
14625A466709m47714J29895N98038n11507o2464j97251N31345l46262M29473l05330
$$ y = [828264, 947108, 1129409, 1058304, 972204, 1044764, 839338, 1112928, 942255, 621403, 1076629, 668894, 967409, 743666, 1066482, 1021905, 918147, 656191, 1176618, 1006902, 627159, 621366, 893625, 1081689, 1120271, 583768, 741048, 942199, 879420, 875080, 854571, 1068559, 1151153, 1176267, 1082369, 977820, 1009682, 686880, 889696, 1116000, 1008019, 859764, 1190661, 881328, 1352818, 997350, 789931, 842777, 1096664, 1084162, 995484, 966319, 1076637, 1139332, 1061901, 1035424, 1233910, 1234826, 1352577, 1166239, 946455, 948281, 828541, 1326847, 1136356, 869724, 1048996, 1260572, 802162, 1111231, 919264, 1184276, 1466709, 1018995, 1148890, 1746928, 1235421, 1172957, 975706, 1507051, 1160789, 1590262, 1284932]
14615A284932q5641j02090J30908M62082m43497J04962K84735q7965k20338k53778
14605A074310L19527l14141M87024k2204j60521j04730K09069j1687j03273L03615
14595A676989k9510m6375O4742J39514m11879J04290j41874N14368j24200k5198
14585A720867k84209j33567M48259J92721j14122m2710J28362k997l53966M14943
14575A973581j93489L49367q1324o1061N5503K58950l67738K75542q1465J96579
14565B324445p3096m3873l420K81903K90338j82051K4792K66924l59785L95062
14555B921239L08111P5222L58366K66000P00993R43346K248654L599193O834501
14546A8255625J2309069O532148j5754404I676274m212781j715617m14451M88066
$$ y = [1284932, 1199291, 1097201, 1228109, 1690191, 1246694, 1351656, 1636391, 1548426, 1328088, 1074310, 1393837, 1079696, 1566720, 1544516, 1383995, 1279265, 1488334, 1476647, 1373374, 1676989, 1647479, 1601104, 1665846, 1805360, 1393481, 1497771, 1355897, 1870265, 1746065, 1720867, 1436658, 1303091, 1751350, 1944071, 1829949, 1787239, 1915601, 1912604, 1558638, 1973581, 1780092, 2129459, 2048135, 1987074, 2042577, 2301527, 1933789, 2209331, 2127866, 2324445, 2251349, 2207476, 2204056, 2485959, 2776297, 2594246, 2619038, 2885962, 2526177, 2921239, 3229350, 3304572, 3662938, 3928938, 4629931, 5573277, 7821931, 11421124, 18255625, 30564694, 37096842, 21342438, 9676274, 5463493, 3747876, 3333425, 3821491]
14538C821491J867073J219676C422439j005889o27346J03050n5122K47295j92425
14529A892002L46296j15708j91918J58958l08926P30744n40260q4494L70811r6277
14519B161228m009K97711l07170L66763k81181K11901k09844K89444j48521K53737
14509B630059q0500J57876j80424j9405J82329n7406J65373K26952n33525J95465
14499B686794L77494k98120K47633O8048j32884Q2215K50116p0940j80149J2042
14489C042249K28755r9607L48537j60042p6897K13870j57304K4977M04833l2221
14479C737150m07494M66233Q7171j8362p8030o0875K33497k35021K58771j85412
14469C797628J00298k40102N62660p058j0007L8216N0926K96300j46353j28376
$$ y = [3821491, 5688564, 6908240, 3422439, 2416550, 1789204, 1892254, 1837132, 2084427, 1892002, 2238298, 2122590, 1930672, 2089630, 1780704, 2511448, 1971188, 1886694, 2257505, 2161228, 2157219, 2454930, 2147760, 2514523, 2233342, 2445243, 2235399, 2524843, 2376322, 2630059, 2549559, 2707435, 2527011, 2507606, 2689935, 2632529, 2797902, 3024854, 2491329, 2686794, 3064288, 2766168, 3013801, 3081849, 2948965, 3031180, 3281296, 3210356, 3030207, 3042249, 3271004, 3171397, 3519934, 3359892, 3282995, 3496865, 3339561, 3364538, 3769371, 3737150, 3329656, 3795889, 3883060, 3864698, 3786668, 3725793, 3959290, 3724269, 3983040, 3797628, 3897926, 3657824, 4220484, 4213426, 4203419, 4241635, 4292561, 4588861, 4442508, 4314132]
14459D314132K32456P4042l3316N940L40503j79414N9811j57750K14556K7955
14449D898915L21140l05912N35612l48971Q8595P8530R1270J43982K0151R3797
14439E617109O7604K02887M0897K23146k34098J80636J70847j95709L34962K1775
14429F430056j12055J89897K19441n8287k8862L54540r5905j56668M53919K79288
14419G475364j18672N05773K3329K5418N72940k71211j06438J43886J02157Q7734
14409H440280N1716m4313N00840J59459l486J2841P68185j13207J47880j1889
14399I908306N06683j55854J78264M1574K39256K17388K69481p9071j3116L55789
14389A1468700J90529K70563K64636K23226M14447J73412p2787M08788O1148L83599
$$ y = [4314132, 4546588, 4620630, 4587314, 4593254, 4933757, 4754343, 4814154, 4656404, 4870960, 4898915, 5220055, 4914143, 5449755, 5100784, 5189379, 5267909, 5359179, 5503161, 5523312, 5617109, 5684713, 5887600, 5928497, 6151643, 5917545, 6098181, 6269028, 6073319, 6408281, 6430056, 6318001, 6507898, 6727339, 6669052, 6640190, 6994730, 6898825, 6742157, 7196076, 7475364, 7356692, 7862465, 7885794, 7911212, 8484152, 8212941, 8106503, 8250389, 8352546, 8440280, 8491996, 8447683, 8948523, 9107982, 9104496, 9117337, 9885522, 9772315, 9920195, 9908306, 10414989, 10259135, 10437399, 10478973, 10718229, 10935617, 11205098, 11126027, 11112911, 11468700, 11659229, 11929792, 12194428, 12417654, 12832101, 13005513, 12932726, 13341514, 13402662, 13786261]
14379A3786261J5133N59975K52950J45600L18015M83728K85227K21220M57092
14370A6525201r8881L57153M41547L88505N62542J36713L34654R05136m3272M63399
14360A9972697P05287K42451N08965M44774K79496L72791Q87037N14408K73619
14351B4201525R97403K64240O92948Q80343O81653N12804Q23649R11643O60594
14342C0626802Q56636O73980J001953J115394N78502J261842J179447M30009J600146
14333C9324711R98552J333762J229437J777860J073230J060781J616828J566557
14325D9981718J721887J829945J767578J890355J609441K697651J728473K172415
14317F5399463K719763K340366K715590K763907L034146L147720L042269L889044
$$ y = [13786261, 13801394, 14361369, 14614319, 14759919, 15077934, 15561662, 15846889, 16068109, 16525201, 16426320, 16783473, 17225020, 17613525, 18176067, 18312780, 18647434, 19552570, 19509298, 19972697, 20677984, 20920435, 21429400, 21874174, 22153670, 22526461, 23413498, 23927906, 24201525, 25198928, 25463168, 26156116, 27036459, 27718112, 28230916, 29054565, 29966208, 30626802, 31483438, 32157418, 33159371, 34274765, 34853267, 36115109, 37294556, 37724565, 39324711, 40323263, 41657025, 42886462, 44664322, 45737552, 46798333, 48415161, 49981718, 51703605, 53533550, 55301128, 57191483, 58800924, 61498575, 63227048, 65399463, 68119226, 70459592, 73175182, 75939089, 78973235, 82120955, 85163224, 89052268]
14309H9052268L617008L808733M089368M653640M406744N169904M640146N818960
14301A25256771N884486O345638O344936O997572P213969P977191Q351247Q760647
14293A83132457R224376R377068J0286942J0832686J1096581J1801004J2412801
14286B58163915J2751782J3626223J4061886J4265473J4625662J4602139J5130336
14279C57227416J4425932J4419939J3755466J2536991J1348669Q669806M132013
14272D36516232J533263K041916J900683j79662j753191l820497n453437p440046
14264D23345261r517819j1718645j2858736j4139906j4903697j5461968j5549831
14257C29194659j5289156j5129759j4796630j4502237j3762567j2896605j2808601
$$ y = [89052268, 92669276, 96478009, 100567377, 105221017, 109627761, 114797665, 119437811, 125256771, 131141257, 137486895, 143831831, 150829403, 158043372, 166020563, 174371810, 183132457, 192356833, 201733901, 212020843, 222853529, 233950110, 245751114, 258163915, 270915697, 284541920, 298603806, 312869279, 327494941, 342097080, 357227416, 371653348, 386073287, 399828753, 412365744, 423714413, 432384219, 436516232, 438049495, 440091411, 441992094, 441812432, 440059241, 436238744, 430785307, 423345261, 413827442, 402108797, 389250061, 375110155, 360206458, 344744490, 329194659, 313905503, 298775744, 283979114, 269476877, 255714310, 242817705, 230009104]
14250B30009104j1743957j1500776q802663r037677r600059r074165q252971q032846
14242A53963990p307740p020136o743962o230069n497926n342392n103438m648026
14234A06070301m694233m274665l762690l673265l733927l639743l104311k971908
14226G6215559k574509l314701k487564k562610k527801j751730k312435j667116
14218E7017093k229080k082272j450281j456231j392396j592599j242072j738643
14210D3833519j467992j528434p24091r91941p62036j063855j614480r24312q33989
14201C3922389n21872q93912q52166j033980j057282m31319p38062k41630j155619
14192B6996547n62959q87457n76295q83544m67542l18296n57389l33435o05674
$$ y = [230009104, 218265147, 206764371, 197961708, 188924031, 179323972, 170249807, 161996836, 153963990, 146656250, 139636114, 132892152, 126662083, 121164157, 115821765, 110718327, 106070301, 101376068, 97101403, 93338713, 89665448, 85931521, 82291778, 79187467, 76215559, 73641050, 70326349, 67838785, 65276175, 62748374, 60996644, 58684209, 57017093, 54788013, 52705741, 51255460, 49799229, 48406833, 46814234, 45572162, 43833519, 42365527, 40837093, 40113002, 39121061, 38359025, 37295170, 35680690, 34756378, 33922389, 33400517, 32506605, 31654439, 30620459, 29563177, 29131858, 28393796, 28152166, 26996547, 26433588, 25546131, 24969836, 24086292, 23618750, 23300454, 22743065, 22409630, 21803956]
14183B1803956m13526n65413m89543l02795n45201p10870K3091m98632k74967
14174A8026100o64792n7577n28191o1182l14189n16016l56752j18205n20301k02989
14164A4685906k86221M158m71515n8806k87022m76313p8036n61034k1230p0209
14154A2379678l31562k96192r965l20413k57775M9060k55377j43092l68667P3858
14144A0519553k44108J15593l87545j09119n2531k38880m96334K49418k96181
14135I059866K46718n75408L86104p20318L6833j25973k41479M47757l62472l85962
14125G765666j22101K66416k31477j17033k75859q8244k31930m9143j3780K25859
14115G128374k72685k30296O6478j57318K4919j20131m53953K25881M0779j23721
$$ y = [21803956, 21390430, 20825017, 20335474, 20032679, 19487478, 18776608, 18799699, 18301067, 18026100, 17361308, 17303731, 16775540, 16714358, 16400169, 15884153, 15527401, 15409196, 14888895, 14685906, 14399685, 14403843, 13932328, 13873522, 13586500, 13110187, 13032151, 12471117, 12449887, 12379678, 12048116, 11751924, 11741959, 11421546, 11163771, 11212831, 10957454, 10814362, 10445695, 10519553, 10275445, 10391038, 10003493, 9894374, 9841843, 9602963, 9106629, 9356047, 9059866, 9306584, 8731176, 9117280, 8396962, 8433795, 8307822, 8066343, 8514100, 8151628, 7765666, 7643565, 7909981, 7678504, 7561471, 7285612, 7197368, 6965438, 6916295, 6902515, 7128374, 6855689, 6625393, 6691871, 6534553, 6559472, 6439341, 5985388, 6211269, 6252048, 6128327]
14105F128327r0315J44874m00806k77011O25289p22607L09580n6685P6600m87439
14095E249807L7707O8875k45805j32418q6334o017L04852m53371L83364j86766
14085D933894j21153L5657j93322m1843m8313j84284J23374k68231J09655N674
14075D351108q5796L96887l22597J08097m11255K12287k40486J5662k05427K66320
14065D084800R082m38197L1920L06344m40449L22710k57658J08902l26660M37357
14055C838151j85229j62019J11016j21313k01j55443J99252l41889K23264l76011
14045C029578M05167m86157K91797n1755k33331J9767n8466j41852R0365J03892
14035B969005k16944M24999l06899J21416P4948j49757J85244J76516l67211q6529
$$ y = [6128327, 6038012, 6182886, 5782080, 5505069, 6130358, 5407751, 5717331, 5660646, 5737246, 5249807, 5287514, 5356389, 5110584, 4978166, 4891832, 4885815, 5190667, 4737296, 5120660, 4933894, 4812741, 4848398, 4655076, 4613233, 4564920, 4380636, 4504010, 4235779, 4345434, 4351108, 4265312, 4662199, 4339602, 4447699, 4036444, 4248731, 4008245, 4023907, 3818480, 4084800, 4093882, 3655685, 3687605, 3993949, 3553500, 3876210, 3618552, 3727454, 3400794, 3838151, 3652922, 3490903, 3601919, 3480606, 3480405, 3324962, 3524214, 3182325, 3405589, 3029578, 3434745, 2948588, 3240385, 3188630, 2955299, 2975066, 2916600, 2774748, 2865113, 2969005, 2752061, 3177060, 2870161, 2991577, 3066525, 2916768, 3102012, 3278528, 2911317, 2824788]
14025B824788L9312m38908P3164M51931n82304L50270n86646L67375r4231k02153
14015B202598J80188J73485J16431k00259j94392J00711k44977J14748J66973
14006B415506J0561p1609l06181K16894j05N6685n8899J0176k05474M1771j07602
13995B001723J98804j2150K83553l25971L99347K10310J426458K506253M758073
13986A1446400J1358070J4119675p699389j3240156o616764l157352j138478q11458
13978D260548q27019j51328m36131L8393l00941Q163r6249K99175n46915j85075
13968B062621K32172q4074J68786R780k62591o7173L6929k04398J18588J47721
13958B158361J50465k61459K11665j26097o2207n20167L73599r8030M3309j59789
$$ y = [2824788, 2864100, 2425192, 2498356, 2950287, 2367983, 2718253, 2131607, 2498982, 2404751, 2202598, 2382786, 2556271, 2672702, 2472443, 2278051, 2378762, 2133785, 2248533, 2415506, 2426067, 2354458, 2048277, 2265171, 2265066, 2321751, 2262852, 2273028, 2067554, 2109325, 2001723, 2200527, 2188377, 2471930, 2145959, 2545306, 2755616, 4182074, 6688327, 11446400, 22804470, 36924145, 29224756, 15984600, 9367836, 6210484, 5072006, 4260548, 3433529, 3282201, 2846070, 2884463, 2583522, 2591685, 2495436, 2794611, 2247696, 2062621, 2294793, 2210719, 2379505, 2389285, 2126694, 2059521, 2096450, 1892052, 2010640, 2158361, 2308826, 2047367, 2259032, 2132935, 2070728, 1550561, 1924160, 1826130, 1869439, 1709650]
13948A709650P7659J65766m32493j07591L46453j01319J85148j19815K00716n23818
13938A400356R6111L49705p8739N0349j31848k65125O1410j50227K34711M39115
13928B005818l63248k53865j69514L79025q6527j58838J52568J38905l8136k4543
13918A581645N3262o04443L77712K80527K5210m46612k24577O43741m82206M25223
13908A629482k55021r6099K3357J2525k55998K63841k44431J50878k58475M99936
13898A469995n2124k69008M8655K5866r5023K04888j73905j6604L2553j19167
13888A056126J73382L2720L30410o08767R5445M8834J14879q557r2607J83905
13878A325770m55239M57680k78539p5434J23562l77186N13755j68499Q449m1669
$$ y = [1709650, 1787309, 1953075, 1520582, 1412991, 1759444, 1658125, 1843273, 1723458, 1924174, 1400356, 1496467, 1846172, 1767433, 1817782, 1685934, 1420809, 1482219, 1331992, 1566703, 2005818, 1642570, 1388705, 1219191, 1598216, 1511689, 1352851, 1505419, 1644324, 1606188, 1581645, 1634907, 1030464, 1408176, 1688703, 1713913, 1267301, 1042724, 1686465, 1204259, 1629482, 1374461, 1278362, 1301719, 1314244, 1058246, 1322087, 1077656, 1228534, 970059, 1469995, 1417871, 1148863, 1197518, 1223384, 1128361, 1333249, 1159344, 1142740, 1175293, 1056126, 1229508, 1262228, 1592638, 983871, 1079316, 1128150, 1243029, 1234472, 1141865, 1325770, 870531, 1328211, 1049672, 974238, 1097800, 720614, 1234369, 1065870, 1074319, 1032650]
13868A032650N0974J63603L2122l87084J46972q261m42491L87935J76738n8132
13858A095026j19238k7825n6996K37826k50309K5774l71575L75126J69801j55152
13848I22458P4976j73627J29160k42506J64467J12521L36970m62448L47720r5114
13838A114577j65975r3871o754K24253k64515o3128K77431O6668P281J12333k50184
13827I58116j03148k13447L47255j30793l85429N44571j17327l40568L21526j4790
13817H65966j17182M9901l3330k35661J26566J52553j11100K5254L5404l7265
13807G21106Q2438K48989j11500j84389k52646K39786N1910M1927m640J16902
13797I49883D02545j3947N1835L49585k24125L04758j39084L32077J15673l96533
$$ y = [1032650, 1083624, 1247227, 1279349, 892265, 1039237, 1030976, 588485, 976420, 1153158, 1095026, 975788, 947963, 890967, 1128793, 878484, 904258, 532683, 907809, 1077610, 922458, 997434, 823807, 952967, 710461, 874928, 987449, 1324419, 861971, 1209691, 1114577, 948602, 854731, 847977, 1072230, 807715, 744587, 1022018, 1088686, 1095967, 1208300, 958116, 854968, 641521, 988776, 857983, 472554, 1017125, 899798, 559230, 880756, 865966, 748784, 798685, 765355, 529694, 656260, 808813, 697713, 722967, 758371, 721106, 803544, 1052533, 941033, 756644, 503998, 743784, 795694, 837621, 832981, 949883, 402545, 388598, 440433, 790018, 565893, 870651, 731567, 1063644, 1179317, 782784]
13787G82784j93422L03029l21362O2542J69514j28542K34556j23276k35589J23046
13777F73280k0286P5912K20187l66001J45767J67368j7846j82908o4191O3113
13767F94395r1609k05364L17626J21915l58083P1811M07029D52906j5264J87597
13757F25239J18634p644k84706J51287R3446j60957Q1381L43261j73445M4147
13747H30643k199k82359j17006J31274J89481k69301j45744K45797j4754k42032
13737C23800L06262n7279Q876k11337L31910k44500L53250k87665J19742k44740
13727C98319J44044J61666m3234A55668M77127l4235J29271k42359J58087k33187
13717D10372K52848B80987L70150J94449m10362Q1275J0461o5653L4643P5612
$$ y = [782784, 589362, 892391, 571029, 633571, 803085, 674543, 909099, 785823, 550234, 673280, 652994, 728906, 949093, 583092, 728859, 896227, 878381, 695473, 631282, 694395, 602786, 397422, 715048, 836963, 478880, 550691, 957720, 452906, 437642, 625239, 743873, 736229, 451523, 602810, 696256, 535299, 616680, 959941, 786496, 830643, 828444, 546085, 429079, 560353, 749834, 480533, 334789, 580586, 565832, 323800, 630062, 572783, 581659, 370322, 702232, 457732, 810982, 523317, 643059, 398319, 542363, 704029, 660795, 155668, 632795, 598560, 727831, 485472, 643559, 410372, 663220, 280987, 651137, 845586, 435224, 516499, 526960, 461307, 495950, 571562]
13707E71562J3985J49349l13113J44545l713o9467Q7522J55452k72993J75586
13697F38715K75051l58442k39313N16733l70539R0091A94461K95488J53223k55630
13687C87542O04754D06901J90845j56184A45104L95762j92956j30271I2401J46490
13677B38891J25776L65855k05611p9781K79458q1767K6789l26929l5094K51280
13667E58867k73931N26540j86268k06349Q4075j91572M2531J2807N2595K59298
13657F78593k26514M8916A79995J0451L7139M4478b0438F14426k10780J79700
13647E83346k27047L22609k48830j37285N2022L5673J16426p8331J49693A92450
13636E06846j03408J31677M4894J14712h0865H16368C58485A59768J82627R5141
$$ y = [571562, 585547, 734896, 421783, 566328, 562615, 493148, 580670, 736122, 463129, 638715, 913766, 555324, 316011, 832744, 462205, 552296, 194461, 489949, 643172, 387542, 992296, 406901, 597746, 441562, 145104, 540866, 347910, 217639, 92401, 238891, 364667, 730522, 524911, 445130, 724588, 642821, 669610, 342681, 307587, 558867, 284936, 811476, 625208, 418859, 502934, 311362, 353893, 366700, 419295, 678593, 452079, 500995, 179995, 190446, 227585, 272063, -20438, 614426, 403646, 583346, 356299, 678908, 430078, 292793, 344815, 380488, 496914, 418583, 568276, 192450, 506846, 403438, 535115, 580009, 694721, -80865, 816368, 358485, 159768, 342395, 437536]
13626D37536m2115j15105J01596a57264D05918j2219J17809k25026K60517j83573
13616C63426o5707L73955E3461L58152j64538J51933j4225j58118K32306k03040
13606B55931J43698q6812O0526m326r7312J30990A97307R4746r8524K40722J572
13595D35823j42812C1323K53415A07349L55175K01313k92388l4680H6156L84579
13585D70735k23685K351K27847L0464L3612E7486b00196D7115L12348r687K8313
13574C78089r9116K72196A99771k6769K69508J19013k38551B3032K52355P4838
13564C50225n5166A19336J63901J50494A09409M29029m0668j25170A70300K90510
13554D60810H8992M06734A15187M23761j21072A27561J45715M321O2209f2744
$$ y = [437536, 395421, 280316, 381912, -157264, 405918, 393699, 511508, 286482, 546999, 363426, 297719, 671674, 53461, 411613, 247075, 399008, 384783, 226665, 458971, 255931, 399629, 312817, 373343, 369017, 271705, 402695, 197307, 292053, 193529, 434251, 435823, 293011, 31323, 284738, 107349, 462524, 663837, 371449, 336769, 86156, 470735, 247050, 249401, 477248, 507712, 541324, 57486, -200196, 47115, 359463, 349776, 378089, 278973, 551169, 199771, 173002, 442510, 561523, 322972, 23032, 275387, 350225, 295059, 119336, 283237, 433731, 109409, 538438, 497770, 372600, 170300, 460810, 88992, 495726, 115187, 538948, 417876, 127561, 273276, 277597, 339806, -62744]
13543E8742L77783q6447j08270E6208J45351J6377R4744J87731j52173a22076
13532B45153M1962r5149q216l5759J0198N21352k47267K05981j95688A35714J27396
13521B63110o3986f548F7374K25461A07491N6733L44882A89322J81122Q852j76324
13510B02972N1624K38N0535j9272n9604C464L70982A13532J97940J08992j07458
13499C13006q9316K96668A98981J10357K3340J22153j08368N1329D3500J0221
13489E3721P5488J13086m7882D4394L74533j68448J20676G4742a37246E35672
13478i5720F7030M15011a10457D16985A29735M470M13920B64607M6405r8226J237
13467B14023I1513O2360a8018C43063j71256P6844P6842j44312K0656J62154A39560
$$ y = [58742, 436525, 350078, 241808, 56208, 201559, 217936, 312680, 500411, 348238, -122076, 245153, 287115, 191966, 183750, 147991, 158189, 679541, 432274, 638255, 442567, 135714, 263110, 199124, -6548, 67374, 292835, 107491, 164224, 509106, 189322, 370444, 379296, 202972, 254596, 254834, 305369, 286097, 226493, 3464, 374446, 113532, 311472, 420464, 313006, 223690, 520358, 198981, 309338, 332678, 454831, 346463, 397792, 43500, 53721, 129209, 242295, 194413, 44394, 418927, 250479, 371155, 74742, -137246, 535672, -95720, 67030, 482041, -110457, 416985, 129735, 134205, 548125, 264607, 311012, 212786, 214023, 91513, 153873, -18018, 343063, 171807, 248651, 325493, 181181, 201837, 363991, 139560]
13455A26107L6555K49594F5527K51404A11444J27531F712a19869A84685p635a75040
13443B65990J38915a34601b8825H2281a15176B26327p039J36081j0647K77195
13433F21917B09567r1755m283A4522M28291C6434J09819K4664L9369E6026Q1306
13422A37332J75198I9844J17910Q5059J99256g17D39499B806K21722O0790K4570
13411C09888J19588j56025C3122P1597c9261o3185M8554E6013K79786r3176F0816
13399B92165j16478a30232B49288r9077o8558i7519B9765A1554J20809E1567b45474
13387C99587A28324M71574k88870j0181A01199a90986h3169B67277L774a86631
13376B68627l6353Q3062R1456j09587J52354o9648j85179a1706o0489E29772a11820
$$ y = [126107, 162662, 412256, 65527, 316931, 111444, 238975, 6712, -119869, 184685, 177050, -175040, 265990, 404905, -134601, -28825, 82281, -115176, 226327, 219288, 355369, 344722, 621917, 209567, 117812, 113529, 14522, 442813, 36434, 146253, 170917, 210286, 56026, 137332, 312530, 99844, 217754, 302813, 502069, -717, 439499, 2806, 224528, 285318, 309888, 429476, 273451, 33122, 104719, -39261, -102446, -53892, 56013, 335799, 242623, 60816, 292165, 175687, -130232, 249288, 150211, 81653, -97519, 29765, 11554, 132363, 51567, -245474, 399587, 128324, 599898, 311028, 300847, 101199, -190986, -83169, 267277, 271051, -186631, 268627, 232274, 315336, 406792, 297205, 449559, 379911, 194732, -11706, -72195, 529772, -111820]
13364B98560j02632A1902b69168A63809K6419k2869k5754a44720C26741j34222
13354A92519d0360A94904q5829K91061j26596j2289A4009N177J39475F5042K42493
13343C07535j08762o972a8406A90413b6065B21620A06639L2005k3374J81129h325
13331B05594J22251K6915B2092b72237a25753E14274p8404j59131K4343I0969
13320A3796d3883C13065m10J8964l7467A19603m3741k186d9590J7344J0329C71036
13307G6886J11422a0491b007B35498O7738A2490J18297K58976l1543j00015O7707
13296C25912c20202E6866K49431G7315Q5138B6859e0783H0727J4717k0879K27405
13285C01970f697F6536k4759a49124B35065a01093e944B93881J59849j29327a33891
$$ y = [298560, 195928, 11902, -269168, 163809, 190228, 167359, 141605, -144720, 326741, 192519, -40360, 194904, 109075, 400136, 273540, 261251, 14009, 19186, 158661, 65042, 307535, 198773, 191801, -18406, 190413, -26065, 221620, 106639, 138644, 115270, 296399, -8325, 205594, 327845, 354760, 22092, -272237, -125753, 514274, 435870, 276739, 301082, 90969, 13796, -43883, 313065, 312655, 331619, 294152, 119603, 75862, 73676, -49590, -32246, -21917, 371036, 76886, 188308, -10491, -2007, 235498, 303236, 12490, 130787, 389763, 358220, 258205, 325912, -320202, 56866, 306297, 77315, 162453, 26859, -50783, 80727, 95444, 74565, 301970, -6697, 66536, 41777, -149124, 235065, -101093, -5944, 293881, 453730, 324403, -133891]
13273A81277L0981n4115b81B56734c82487A18492K28503j42517N4555I2890C3368
13261D2212K35972C8907g3417C09143J0521a58037H2019R5841H6287R5474J37145
13250C18906a6029C71094Q3188B10211r7416b2885B56018o5970J67138f8651j2280
13239h0931H213L11340g1689F4683K24477a44186A9106f9147D61645d6499o3783
13228a10282k3738j717D51381b33641A26398M9228d4406A81235J76373E1373F545
13216A77321P6129G55J35764n846L6140E4317a70037B21099q3408J64720j45195
13205A57216n1644L48511j0131c3568J5278p855A21366a08661G8235a03809B74113
13193A58823J74291A0726N8560l1041a76629f3664A7475M0529e0378k5884H0881
$$ y = [181277, 212258, 158143, -281, 256734, -382487, 118492, 346995, 204478, 259033, 92890, 33368, 42212, 278184, 38907, -73417, 309143, 319664, -158037, 82019, 177860, 86287, 181761, 318906, -16029, 371094, 454282, 210211, 112795, -22885, 256018, 190048, 357186, -68651, -80931, 8213, 319553, -71689, 64683, 289160, -144186, 19106, -69147, 461645, -46499, -110282, -134020, -135737, 451381, -233641, 126398, 175626, -44406, 181235, 357608, 51373, 6545, 177321, 253450, 755, 136519, 130673, 166813, 54317, -170037, 221099, 137691, 302411, 157216, 105572, 454083, 443952, -33568, -18290, -26145, 121366, -108661, 78235, -103809, 274113, 158823, 333114, 10726, 69286, 38245, -176629, -63664, 17475, 58004, -50378, -76262, 80881]
13181G6304M696g8382C79202k8191j57422G9759J69025j12453i4593B22061d5065
13169A55494E1570i5204C77116e3320G2840g4616H3296L91703j21566d9231B67174
13157B11492A03113e3709A56586J964K38649j66064D2256A5518M4997N4524J18097
13146B33136o339j09120a69665B41334l0517a79965A29406J6415E2004c1514H7910
13134a66039B72768b17104B42655a55247C14470A17922M6700G7120a37347A54687
13123A24579R4812a06735j68996d9780B11911e0757b2414m4342C7460L37423H8622
13111e8047A75546n6767P1380q6930K9429a36019G3856J67133J34519c1896a4233
13099g9096B41468J67067a57319g3739K1370a4681G8160f8458K3624n881B06651
$$ y = [76304, 81000, -78382, 379202, 351011, 193589, 79759, 248784, 136331, -94593, 222061, -45065, 155494, 51570, -95204, 377116, -53320, 72840, -74616, 83296, 474999, 353433, -49231, 267174, 211492, 103113, -53709, 156586, 158550, 397199, 231135, 42256, 15518, 60515, 115039, 233136, 226797, 117677, -169665, 241334, 210817, -179965, 129406, 145821, 52004, -31514, 87910, -166039, 272768, -217104, 242655, -155247, 314470, 117922, 164622, 77120, -137347, 154687, 124579, 219391, -106735, -275731, -49780, 211911, -50757, -22414, -66756, 37460, 374883, 88622, -58047, 175546, 118779, 190159, 103229, 132658, -136019, 73856, 240989, 375508, -31896, -14233, -79096, 241468, 408535, -157319, -73739, -52369, -14681, 78160, -68458, -44834, -50715, 206651]
13087A8628J3571A1066K2057q038a04545d2327B25524g7716H1611A8940c48285
13075A46557B5189J30433a05877d5859C84820d1028G4496L13551A50366a48804
13064C49657h108j1828j67754O1734D3539L8660Q370h6086B72269A23019B1323
13052I7393i923B16814a69043e5332j41945H8677C9958a46817L6145B9169K96947
13041C26116c93276B83939n0728l5272c2003C77235c4106A85126d5653N507A29414
13029b8225E0297O2463R2949I3033d1071A50017K11774O7918h8849n4032A68364
13017h9257B19495m1913F289J15359N1221i233A12088N6597J3549b48610a08079
13005D78c1457A78323b12225A02967e8274D5846N9746a42834b0647r5349e2422
$$ y = [18628, 32199, 11066, 33123, 25085, -104545, -42327, 225524, -77716, 81611, 18940, -348285, 146557, 25189, 155622, -105877, -45859, 384820, -41028, 74496, 388047, 150366, -148804, 349657, -8108, -19936, -187690, -125956, 43539, 82199, 90569, -86086, 272269, 123019, 21323, 97393, -9923, 216814, -169043, -55332, -197277, 88677, 39958, -146817, -110672, 29169, 326116, -393276, 283939, 233211, 197939, -32003, 377235, -34106, 185126, -45653, -40146, 129414, -28225, 50297, 112760, 205709, 93033, -41071, 150017, 361791, 429709, -88849, -142881, 168364, -89257, 219495, 177582, 6289, 121648, 172869, -9233, 112088, 168685, 182234, -248610, -108079, 478, -31457, 178323, -212225, 102967, -58274, 45846, 105592, -142834, -20647, -115996, -52422]
12993A1383K30225a47796A25294K36375c3640n6375C24777K15084a6463H6401
12982A39569j341K0024c5421B41234b04155i6152b4897G5229b99673A59164o2996
12971I6168a06335A5540a38013d1560J8543A88056M081L3771E835e0436B08368
12959B69253A10797H153K56224e9532G1468b77788A47502J78409F0935J09372
12949A70307J56262A11555P6411a14960p3698D26647a47622d2284A07323P5164
12939A82487b80177D3345i1515F4424h4807E2159J7788g014B18919f9224j56732
12928b25956D02848b22745J04529l4819B35402Q4108D4394a59020b9430B12781
12917I9107k0087m121i5759B39169a43345M4944j6786M3332C8879c5335P32A41888
$$ y = [11383, 241608, -147796, 125294, 361669, -33640, -90015, 324777, 539861, -16463, 86401, 139569, 138228, 158252, -35421, 241234, -204155, -96152, -24897, 75229, -299673, 159164, 96168, -106335, 15540, -138013, -41560, -23017, 188056, 192137, 225908, 5835, -50436, 208368, 269253, 110797, 8153, 264377, -59532, 71468, -277788, 147502, 325911, 60935, 170307, 326569, 111555, 187966, -114960, -188658, 426647, -147622, -42284, 107323, 182487, -280177, 43345, -91515, 64424, -84807, 52159, 69947, -7014, 218919, -69224, -225956, 402848, -222745, -118216, -153035, 235402, 319510, 44394, -159020, -29430, 212781, 99107, 79020, 74899, -95759, 239169, -143345, -98401, -115187, -71855, 38879, -35335, -34603, 141888]
12904b10404M5363F7968g5196J3900o0493A6147O7274k6636h6851A21386J35276
12893B56662A976J70361e8995A04039a09894B93207A20904K19140a42563n5059
12883a97622C15967H9756h6313l3908G0924D026a45798J101M0902A04435J80985
12872B85420a92433A34556l6921A7862c04872b0473k05803G3162K479B8849b25215
12860b3450j36087o506B8128R8269a85347A29207d73846b30033n7175F3299a46705
12848F1275a728G6390R3533C3683M4968b09313D9687a34413d3349B9980K07681
12837B37661p9505m5608J80746g512A7029l820a2097r9563E018a5695p5008A34272
12824a44553O1673c6943I6942P8825d616l7321J5904A59885M3589e8918A33555
$$ y = [-210404, -165041, 67968, -75196, -61296, -121789, 16147, 83421, 56785, -86851, 121386, 256662, 1976, 172337, -58995, 104039, -109894, 293207, 120904, 340044, -142563, -197622, 315967, 89756, -86313, -120221, 70924, 4026, -145798, -144697, -103795, 104435, 285420, -192433, 134556, 97635, 17862, -304872, -20473, -226276, 73162, 75641, 28849, -225215, -23450, -159537, -166043, 28128, 126397, -185347, 129207, -473846, -230033, -287208, 63299, -146705, 61275, -1728, 76390, 169923, 33683, 78651, -209313, 49687, -134413, -43349, 29980, 237661, 158156, 112548, 293294, -7512, 17029, 13209, -12097, -111660, 5018, -15695, -90703, 134272, -144553, -82880, -36943, 96942, 175767, -4616, -41937, -26033, 159885, 203474, -58918, 133555]
12812b27144A25561B5837a47631I6870J15128l711J418a82754N1353N8646I7966
12800a18304L7834n7902H5492P1630a22470H907N3671O3335B802J56244a48857
12788i3895B60523L7636J54135b6548d650c98B3528J65183A4458J79547J12837
12777C06842l8622e7699H4640J22934l2733b4968C04159j48393i2157E2724m549
12766D8175K10837i4749j25706j29341h3670A08502a31538A46194a6661B07809
12755A01120e3E737a19960M8571C46000a38780q2090D1973K21017D0627K22256
12744B62883a87162J6433f4654B29954c59309a36597A43807o9416c07832a17A08601
12732D80603a09134c5125A26668J70721A44270J20560a26752j7096B72975j23376
$$ y = [-227144, 125561, 25837, -147631, 96870, 211998, 208287, 209705, -182754, -131401, -72755, 97966, -118304, -80470, -138372, 85492, 157122, -122470, 8907, 62578, 125913, 2802, 159046, -148857, -93895, 260523, 298159, 452294, -26548, -4650, -398, 23528, 188711, 14458, 194005, 306842, 268220, -57699, 84640, 207574, 174841, -24968, 304159, 155766, -92157, 52724, 48175, 259012, -94749, -220455, -349796, -83670, 108502, -131538, 146194, -16661, 207809, 101120, -53, 5737, -119960, -71389, 346000, -138780, -220870, 41973, 262990, 40627, 262883, -187162, -170729, -64654, 229954, -359309, -136597, 143807, 74391, -307832, -117, 108601, 480603, -109134, -35125, 126668, 297389, 144270, 264830, -126752, -143848, 272975, 149599]
12722A49599J48184D2154b51379P7130F9403K9394J9532N0303c2646j35301i527
12710F5845a27357l7475j19673k4486O8267A54253a08488j04799f2363A22243
12699B31706q4358a13827A57607M5421a96326i7538B8223O9142a63522C5548b29225
12687I0260b28905M1201B40128A18103G134e8584B60351j17601E426K13651D650
12675f1539C54606A08154J0666J9955J3395J51035j12114a64194p274B370b63016
12663A99391i1794A71442B1142c3535F4084J07786e5645B70764j32100K1640R0545
12652B50849A9073J83250a15646d9810C8428e4653o2521J5028A06365a5860B65170
12640D6485L34474a8293p8869a1623C8785K5511a63329c1000A38833R0496k8151
$$ y = [149599, 297783, 42154, -251379, -174249, 69403, 98797, 118329, 168632, -32646, -167947, -9527, 65845, -127357, -164832, -284505, -308991, -240724, 154253, -108488, -213287, -62363, 122243, 231706, 147348, -113827, 157607, 203028, -196326, -97538, 28223, 97365, -163522, 35548, -229225, 90260, -228905, -187704, 240128, 118103, 7134, -58584, 260351, 142750, 5426, 219077, 4650, -61539, 354606, 108154, 118820, 138775, 152170, 303205, 191091, -164194, -171468, 2370, -263016, 199391, -91794, 171442, 21142, -33535, 64084, 171870, -55645, 270764, 138664, 160304, 250849, 19073, 202323, -115646, -49810, 38428, -54653, -117174, -102146, 106365, -15860, 265170, 46485, 380959, -18293, -97162, -11623, 38785, 64296, -163329, -31000, 138833, 229329, 201178]
12629B01178A5255L38427a49548B70876C5463b67964i5963A65071j4113a72322
12618G3545f0769l31286a11187o8834B15999c3881A01636b01378B69157b19204
12607b99521J41343A54720g4246j75672a07572k51443J70852I0459Q0037p2051
12597I8445O3994J69171j38127o2894c41981A8080K11712J26854b83764B52687
12586d5062A17020k3381a58536A6556b70638A25243l2194L1064a78295A73808
12575D3093K6032L03555G5421j0822J13982E3600c4701C2752P5571f5694e971
12563a81409j2052J2085K7214j09939e9388C5271b34382h5432j12176A59396f3212
12551A45904O8197C3224J74938r2951g7452k4188l8762A28342b03600f0032E6384
$$ y = [201178, 15255, 353682, -149548, 270876, 35463, -267964, -95963, 165071, 150958, -172322, 73545, -60769, -392055, -111187, -180021, 215999, -33881, 101636, -201378, 269157, -219204, -299521, -158178, 154720, -74246, -249918, -107572, -359015, -188163, 90459, 170496, 98445, 162439, 331610, 193483, 130589, -341981, 18080, 229792, 356646, -283764, 252687, -45062, 117020, 93639, -158536, 16556, -270638, 125243, 93049, 124113, -178295, 173808, 43093, 69125, 372680, 75421, 64599, 178581, 53600, -34701, 32752, 108323, -65694, -5971, -181409, -193461, -181376, -154162, -264101, -59388, 35271, -234382, -85432, -197608, 159396, -63212, 145904, 214101, 33224, 208162, 115211, -77452, -101640, -140402, 128342, -203600, -60032, 56384]
12539C961J81534K33902c28106j03386B2487N9568J57057a56674j21544J08298
12529a69920K8036l3197e698j16299c1234D6063J2360K92430H4905a9382o20C71430
12516a20232j37460B477a14544h422E8239a90793a4404k49283A58347a19538E07676
12504B85113a14177A71803d5758l6060A30797a38835c2348j33065J8041C3878
12493g4845q7690A45136C722J71328a4080A87666a95998C4875L07967C6718l241
12482C3477J17217G124f2606B23250p2175L5852a52069c1596I6039a08966E2208
12470A31811J49642E51K48028j05387a79494G3669K8457c7254B57612d6762j5683
12459f2445A07433a98788F1329K1043K8203b0295j75668c1331H4452J19662E2825
$$ y = [3961, 185495, 419397, -328106, -431492, 22487, 82055, 239112, -156674, -278218, -169920, -141884, -175081, -5698, -121997, -31234, 46063, 58423, 350853, 84905, -19382, -20002, 371430, -120232, -257692, 2477, -114544, -8422, 58239, -190793, -14404, -263687, 158347, -119538, 507676, 285113, -114177, 171803, -45758, -81818, 130797, -138835, -32348, -165413, -147372, 33878, -74845, -162535, 145136, 3722, 175050, -14080, 187666, -195998, 34875, 342842, 36718, 33477, 150694, 7124, -62606, 223250, 151075, 186927, -152069, -31596, 96039, -108966, 52208, 131811, 281453, 551, 248579, 143192, -179494, 73669, 102126, -37254, 257612, -46762, -62445, 107433, -198788, 61329, 82372, 110575, -20295, -195963, -31331, 84452, 204114, 52825]
12447D1118b00268b597k82603J31046e6424k06835J27040A0996Q1689a6200E6653
12435a8416A56129J48570a8848l00654e3066k02015e8315n1449G1611e9807B8537
12423b87716M7921g6178E8207a0698o7665k5396j64160d1229K0383j96162R2659
12412a24349d0269H8531K17135q9838K17557A74845F2328b05701l508F3910c6603
12400h3253k38320b7426C3132a24795I1059b1070o01D369L54155j01707h5773
12388B10643b10594e8131F6597a279E8333b35109H4646b09126a471r7462p8236
12377a77169f8203H042a35678j72415a40840j81391d0494D79117A2315K12809
12367B25124a396l4547G0230a67668A12736b30678a06713a9124k23948Q7539L3399
$$ y = [41118, -200268, -2597, -285200, -154154, -56424, -263259, -136219, 10996, 92685, -16200, 56653, -18416, 156129, 304699, -18848, -319502, -53066, -255081, -58315, -109764, 71611, -59807, 28537, -287716, -239795, -76178, 58207, -10698, -78363, -103759, -267919, -41229, -20846, -217008, -124349, -40269, 88531, 305666, 215828, 433385, 174845, 62328, -205701, -209209, 63910, -36603, -83253, -321573, -27426, 33132, -124795, 91059, -21070, -21671, 4369, 358524, 256817, -85773, 210643, -210594, -58131, 66597, -1279, 58333, -235109, 84646, -209126, -1471, -98933, -177169, -68203, 8042, -135678, -308093, -140840, -322231, -40494, 479117, 12315, 225124, -1396, -35943, 70230, -167668, 112736, -230678, -106713, -19124, -243072, -155533, -122134]
12356a22134A20779a81092E0132J41586h2095D564h327C5187a08367I0394f7944
12344b73211f2773B33085a24981G3978J41395o8409a98027B22539q0791K58842
12334D00590e9588K9247A03316c04921A96149a27166m9201a5534B03247a71838
12323A76665D7362c1566A80130n2509l1250J4640J7741J00119H2491a05809A9002
12311A36516l2528J19043k6822g2335A87757b02084A09244J07158a62757B18554
12300H6255J65647J90354b7142A56059a30325j13484J16145B0714L6318J904a26661
12288f9689A0664R8286J07833a30594F6032K70997b15942B80921I1219j5124d4551
12276c3089k9560J7801k14679N4622c3747j17867A04336M14264k06585C2322J60223
$$ y = [-122134, 120779, -181092, 50132, 191718, -82095, 4564, -8327, 35187, -108367, 90394, -67944, -273211, -62773, 233085, -124981, 73978, 215373, 146964, -198027, 222539, 141748, 400590, -59588, -30341, 103316, -304921, 196149, -127166, -176367, -15534, 203247, -171838, 176665, 47362, -31566, 180130, 127621, 96371, 111011, 128752, 228871, 82491, -105809, 19002, 136516, 103988, 223031, 196209, -72335, 187757, -202084, 109244, 216402, -162757, 218554, 86255, 251902, 442256, -27142, 156059, -130325, -243809, -127664, 20714, 57032, 58936, -126661, -69689, 10664, 108950, 216783, -130594, 66032, 337029, -215942, 280921, 91219, 76095, -44551, -33089, -62649, -44848, -259527, -204905, -33747, -151614, 104336, 518600, 312015, 32322, 192545]
12265A92545M3793I5617P096B7365J08674N9679G0796a12747k40477b9373A8662
12253a07356D7385b613n2294A04204I089N32461B16063M4120b52473r8644d9989
12241B25197i4562o3260p445A24490h3321A87110c8324A01746g5426A87409R2515
12230B79924h6255c399A44359i452B0756J43811G3754K55588b9799C73361j80507
12219A92854L0330m0660a30866B602f3346F9704J37246M5268C8470M91560A72345
12207f9181g418l3121H5565J64675k4162C3362J39971a11312C54794c2583C31127
12195a57378A50501K73118a96806B36211r3238J8730g7533G4693J84659K9115
12185B88467p2060k5636e1377A02868d8648C66443q0747g9355L6700k51067D7256
$$ y = [192545, 236338, 95617, 102713, 27365, 136039, 195718, 70796, -112747, -353224, -29373, 18662, -107356, 47385, -2613, -54907, 104204, 9089, 541550, 216063, 260183, -252473, -351117, -49989, 225197, -94562, -157822, -165267, 124490, -83321, 187110, -38324, 101746, -75426, 187409, 279924, -86255, -3399, 144359, -9452, 20756, 164567, 73754, 329342, -29799, 373361, 192854, 223184, 182524, -130866, 2602, -63346, 69704, 206950, 252218, 38470, 530030, 172345, -69181, -7418, -40539, 85565, 250240, 226078, 33362, 173333, -111312, 354794, -32583, 331127, -157378, 150501, 423619, -196806, 236211, 142973, 161703, -77533, 74693, 259352, 288467, 216407, 190771, -51377, 102868, -48648, 366443, 285696, -79355, -42655, -293722, 47256]
12173D5896O9146J60316p2880D6858K92341l0212a58270A9279Q8858P4385a056
12161B96202a53365A12792a58783D15033A97648o0469d8739k70103d1109A52271
12150B55618J5410M9505C8874i2508B13466L8565q3543k0361f1795C65668f2150
12138A86465O5157a49252C02085I6158K04938D7443K26814k3187c8063A47280
12127F0422c2409B6486K47374l0803a17134A60437h7926B82436b6673k6520A76328
12115b35369a173A87395E4108P6906J36646D2417N6095M5402b31853h8774n1615
12104a40389M2937j01578Q5798A9452b9173C51078B5706K50386a57453H7500J43151
12093B30651c8519o3818E4440c49022c8171j15251g4821A18568a56598j8455j78168
$$ y = [45896, 115042, 275358, 202478, 46858, 339199, 308987, -158270, 19279, 108137, 182522, -1056, 296202, -153365, 112792, -158783, 415033, 197648, 137179, -48739, -318842, -41109, 152271, 255618, 271028, 320533, 38874, -92508, 213466, 252031, 168488, 148127, -61795, 365668, -62150, 186465, 251622, -149252, 302085, 96158, 301096, 47443, 274257, 251070, -38063, 147280, 60422, -32409, 26486, 273860, 243057, -117134, 160437, -87926, 282436, -26673, -53193, 176328, -235369, -1173, 187395, 54108, 131014, 267660, 42417, 98512, 143914, -231853, -88774, -140389, -97452, -199030, -113232, 19452, -29173, 351078, 25706, 276092, -157453, 87500, 230651, -38519, -102337, 54440, -349022, -38171, -153422, -74821, 118568, -156598, -175053, -353221]
12082c53221E6527b08225A39075a34534n6833I4979B5498c32518a22584n8428
12072a81012F9420O2907j3222J4952j205p701K8944c1777l1509j4179c2067J3075
12060a8992B27101K64711r0585F0783N9867k8652b1550I3852r037J51908a89076
12048a46108C06446n4075h523C4792f3053k24806B16283E3732b01792H7526J11525
12037A99051a13951K5083m3405p7360b5180A46974C1480g9318k05709N3443j47058
12026c78642A5379f7048H6503e43806a685j4675j5629A86864g833B14223c39463
12014b69934F3268L20861a28257A01532C3718a66627A22341P6319d1262A58785
12003f7049G072b22409K3463A83294a18212A5150g5542B01090M7179o6817C9730
$$ y = [-353221, 56527, -208225, 139075, -134534, -191367, 94979, 25498, -332518, -122584, -181012, 69420, 132327, 119105, 134057, 132852, 125151, 154095, -31777, -63286, -77465, -32067, -18992, 227101, 491812, 401227, 60783, 120650, 91998, -21550, 93852, 84815, 236723, -189076, -146108, 306446, 252371, -8523, 34792, -63053, -287859, 216283, 53732, -201792, 87526, 199051, -113951, -88868, -132273, -209633, -25180, 146974, 31480, -79318, -285027, -231584, -378642, 15379, -67048, 86503, -543806, -1685, -16360, -31989, 186864, -7833, 214223, -339463, -269934, 63268, 384129, -128257, 101532, 33718, -166627, 122341, 198660, -41262, 158785, -67049, 7072, -222409, -198946, 183294, -118212, 15150, -75542, 201090, 248269, 181452, 39730]
11991A11142L1865b44406A78430F6690b69938l8090G6140a72992j86822A4171
11980A4416b17303I2138b51984D23454b11493A05333i0212o4223p1550J06677
11970a19308E3206b33443G0911P7937g4825C2390O2746a67624g3962G4915j5186
11959E9729g4744A67374A1573M6445O684a01654L9502B10348d661m7994q0697
11948a33352k29099J06997P5443h0800A66691b0170j44532B30011p6566g736C6873
11936b17559A9217M6641k7981d54006b5574q0106A89426n5360a4264j66493n9184
11925b39941J8184a8775k1953B08137a24410A14010a37690l36874A8883J28224
11915A47107E0066h8339j65951F1821j3029c6745C8826a14063d7085l05224J22443
$$ y = [111142, 143007, -244406, 178430, 66690, -269938, -308028, 76140, -172992, -359814, 14171, 14416, -217303, 92138, -251984, 423454, -211493, 105333, -90212, -154435, -225985, -119308, 53206, -233443, 70911, 148848, -74825, 32390, 95136, -167624, -73962, 74915, 59729, -74744, 167374, 11573, 58018, 64702, -101654, -62152, 210348, -4661, -52655, -133352, -362451, -255454, -180011, -80800, 166691, -20170, -164702, 230011, 153445, -7736, 36873, -217559, 19217, 65858, 37877, -454006, -25574, -105680, 189426, 134066, -14264, -180757, -239941, -221757, -18775, -40728, 208137, -124410, 114010, -137690, -474564, 18883, 147107, 50066, -88339, -254290, 61821, 48792, -36745, 38826, -114063, -47085, -352309, -229866]
11904b29866E3592b15456F0729C199N7733b75529B50706a25672j6099f7843m8290
11893a16133B41114j20394b04726N5738E2706q970b1385p64j46640B4890b57800
11881C92578B9858a18867B33612c35750F9404b396A13341F425a26605A12245b04586
11869D51627A3006a96205i1756E637L04716K2957b76626a15546q4168B38823d532
11857d28075a63944C16542q5377C9998E609c523B95261a33939o1061e3606j04095
11846a57701A5854b2154B01704g015l6575A99134a53314A3602a97178B7422a13249
11834h6240g852A18988a19155I1593J87862H3969a5007k38586A36784L9002a32373
11822a7308l38904h4924A69208a18125F1707a74111j1099F9130j1994b14113A31748
$$ y = [-229866, 53592, -215456, 60729, 3199, 60932, -275529, 250706, -125672, -141771, -67843, -116133, 241114, 120720, -204726, -148988, 52706, 43736, -21385, -22149, -168789, 24890, -257800, 392578, 29858, -118867, 233612, -335750, 69404, -2396, 113341, 6425, -126605, 112245, -204586, 451627, 13006, -196205, -91756, 5637, 310353, 333310, -276626, -115546, -199714, 238823, -4532, -428075, -163944, 316542, 231165, 39998, 5609, -3523, 295261, -133939, -195000, -53606, -157701, 15854, -22154, 201704, -7015, -43590, 199134, -153314, 13602, -197178, 27422, -113249, -86240, -7852, 118988, -119155, 91593, 279455, 83969, -15007, -253593, 136784, 175786, -132373, -17308, -356212, -84924, 169208, -118125, 61707, -174111, -185210, 69130, 57136, -214113, 131748]
11810D2385a22048B13435p1893a62290A29996k0608c85731C5804Q4022f0815A42370
11798b7201k3032j52807K8029G7865a88131O6260A89253c39183A26526L6859E8006
11786A89001a86195a0863k54551G3478a49953H7617h0245K6641m7719j40482B10117
11774a88909e3791k85996D0814d06177B6533h4252q503A86100E843J6556a96357
11762A69065a12636k23271i5473B74652D2879R9330J128a01009F3528i5539G352
11750h377j23173j16830A60911b66430C45313b68375a8125n2049a4882r8912j52532
11739b66326e9120I9290a25784b4942j07549B779L82763j79901b19927f9039A43691
11727e56698b4405j12146j0778m0838B20388a2179p4518E820i8826l25828H2730
$$ y = [42385, -122048, 213435, 141542, -162290, 129996, 109388, -385731, 35804, 119826, -60815, 142370, -27201, -50233, -203040, -175011, 77865, -188131, -121871, 189253, -339183, 126526, 163385, 58006, 189001, -186195, -10863, -265414, 73478, -149953, 87617, -80245, -53604, -101323, -241805, 210117, -188909, -53791, -339787, 40814, -406177, 26533, -84252, -92755, 186100, 5843, 22399, -196357, 169065, -112636, -335907, -95473, 274652, 42879, 142209, 143337, -101009, 63528, -95539, 7352, -8377, -131550, -248380, 160911, -266430, 345313, -268375, -18125, -70174, -14882, -113794, -266326, -59120, 99290, -125784, -24942, -132491, 2779, 385542, 205641, -219927, -69039, 143691, -556698, -24405, -136551, -147329, -188167, 220388, -12179, -86697, 5820, -98826, -424654, 82730]
11715i3287I6785L1214f3735n7285B32884q1731b80012B4784J47265b59070A89818
11703f1847a0146r3312B05439c3225I1798K28785j12193o4484e7885A59398e5975
11691A2010b11327D6844b80148J32476H6038K63311r2707d25157f0791A78143
11680f5076H154J57203O2551o377a12098D389a89992A17504n0438J25781b87065
11668A1907a66583n1329C0570J34246E526b53113a513j44189J2579k47964J06910
11657b74177a28718b0139C1604b29759O2090A99681n5020b51919f3150j88384
11647b51534b3564j25407M7981B8734J43607b31781g8086C407L02947A14088C9685
11635A23432a0942A4346K3043b14445K3818A89570a15701A61193b2328j11872
$$ y = [-93287, 96785, 127999, -63735, -121020, 232884, 151153, -280012, 24784, 172049, -259070, 189818, -61847, -10146, -103458, 205439, -33225, 91798, 320583, 208390, 143906, -57885, 159398, -55975, 12010, -211327, 46844, -280148, -147672, 86038, 349349, 256642, -425157, -60791, 178143, -65076, 8154, 165357, 227908, 221531, -112098, 4389, -189992, 117504, 67066, 192847, -287065, 11907, -166583, -217912, 30570, 164816, 5526, -253113, -1513, -145702, -133123, -381087, -274177, -128718, -20139, 31604, -229759, -167669, 199681, 144661, -251919, -63150, -251534, -23564, -148971, -100990, 28734, 172341, -231781, -78086, 3407, 306354, 114088, 39685, 123432, -10942, 14346, 37389, -214445, -190627, 189570, -115701, 161193, -22328, -134200]
11625a34200H9194a94232g1226j36335A9361J2853b15904e3481J2351B2243b07721
11613d0289p5243k44532B69055J31777c47230J22724f0263A7742a49880F4898
11602A20319b1170B90427A20626g8273f542j92087c4000m0674A78124a59763D7379
11590D7050A5151K3617b9225l23926a50325a6209A33523b33836O2980M7e8421
11578B56127c1015k47829C26907a84351A04686c5521q938A18907a30397o3037
11568a93434h9928B0846d5821l0431k02307d4057l4564l7009j40290A64583O0970
11557B25553a01019A4615f9158A9544B371a22239A3358Q8704J12468C4090a18668
11545B80767b42767h0932J9605B94741a15646r1390C1703a05714L7901j06674
$$ y = [-134200, 89194, -194232, -71226, -207561, 19361, 32214, -215904, -53481, -41130, 22243, -207721, -40289, -115532, -360064, 269055, 400832, -347230, -224506, -60263, 17742, -149880, 64898, 120319, -21170, 290427, 120626, -78273, -6542, -198629, -34000, -74674, 178124, -159763, 47379, 47050, 15151, 38768, -29225, -353151, -150325, -16209, 133523, -233836, -170856, -170809, -58421, 256127, -31015, -278844, 326907, -184351, 104686, -35521, -44459, 118907, -130397, -193434, -89928, 20846, -45821, -76252, -278559, -44057, -78621, -115630, -255920, 164583, 225553, -101019, 14615, -69158, 19544, 2371, -122239, 13358, 102062, 214530, 34090, -118668, 280767, -242767, -80932, -61327, 294741, -115646, -207036, 31703, -105714, -67813, -174487]
11535a74487A9001D995g4799F1848b90465a26062c3324C7299K34716g2627E5885
11523H2720c86l3957D1344a24389B05353a47192A46234L1554L8013P445G8150
11511b26512j00849J20456Q3817A72387e8723D15854E9616L34364D7682J8135
11501F5817R5580q0532K26136E4223b0566A30549n3775k0796k4741K7605J5118
11490G3960P8096E3336K11201I9643l7598I837K32149a0196G8301M1023b95016
11478b11415H7150b48518E48R9060J09250a9681p2946F42658b02465A71873J57429
11467C29302g6774o933B2734N4969K25149b51785H6500l085c3249j80805q8804
11456c02858h8765J7071A65244a75199g965D15410A33053m0643e9378b6972A07507
$$ y = [-174487, 19001, 4995, -74799, 61848, -290465, -126062, -33324, 37299, 272015, -72627, 55885, 82720, -386, -34343, 41344, -124389, 205353, -147192, 146234, 177788, 215801, 223246, 78150, -226512, -327361, -206905, -123088, 172387, -58723, 415854, 59616, 393980, 47682, 65817, 161397, 80865, 307001, 54223, -20566, 130549, 76774, 55978, 31237, 58842, 73960, 152056, 53336, 264537, 99643, 62045, 9837, 241986, -10196, 78301, 119324, -295016, -211415, 87150, -248518, 548, 99608, 208858, -19681, -92627, 642658, -202465, 171873, 329302, -76774, -83707, 22734, 77703, 302852, -251785, 86500, 83415, -33249, -214054, -302858, -88765, -71694, 165244, -175199, -7965, 415410, 133053, 92410, -59378, -26972, 107507]
11444E2687i5354K0562D1499b78209G5331c5687A14443c39774A98141I5382O267
11433A01649j2683c14522A9279a37710A48150a47588A81602i5578A1321O1197
11423G2518a39732c2850H3456f214H3120c16321J42344a4819r0964j9870B19476
11411B25821q463r5209a13157B94209a01837p0710A10004b28924C46953C0162
11400h0461k03771a17825I4687J54951A14508j6486b92561f160k12497E1007M9714
11389A00721c42487I6277b1367k14895G260d8693p0465A45478c13635e8850a5168
11377B74861A30005E3445a02706B82188p6019a46747F1174b24460j49343D595
11366A0522K00653j00272b28936c4319D3900e2933k55733g464j68961O6413G127
$$ y = [52687, -95354, -74792, 41499, -278209, 75331, -35687, 114443, -339774, 198141, 95382, 101649, 88966, -314522, 19279, -137710, 148150, -147588, 181602, -95578, 11321, 72518, -139732, -32850, 83456, -6214, 83120, -316321, -173977, -14819, -105783, -125653, 219476, 225821, 217358, 122149, -113157, 294209, -101837, -172547, 110004, -228924, 346953, 30162, -80461, -284232, -117825, 94687, 249638, 114508, 98022, -292561, -6160, -218657, 51007, 100721, -342487, 96277, -21367, -236262, 7260, -48693, -119158, 145478, -313635, -58850, -15168, 274861, 130005, 53445, -102706, 282188, 206169, -146747, 61174, -224460, -373803, 4595, 10522, 211175, 110903, -228936, -34319, 43900, -52933, -308666, -7464, -176425, -110012, 7127]
11354b72715h7908A03335a03580g078B49078A07682C8819Q1180c55740I3443a48151
11342a00032A40359a83871N9148A4366P7644c54416I9207c87461J85831A48088
11331F12a15988F4085L5967m8274c27739c3137k87672C3618J48269b26687I0958
11319a85056o6265C66928f7715H3078b07745f1261j7804j527l4145N246l47074
11308d56565A20252j2845N768K60933i009j57957A56771d64779K27133a6665k62994
11297b79659a17118A03247a17861e1578l1701H5305J02753o8728i6776L8871K824
11286e5081A72860O1540b60649a28371A14767f2477a5973j24632j27436F9209
11275b06075j53971B12186a30140A87286J37230a52299E8398g6685k44784A40178
$$ y = [-272715, -87908, 103335, -103580, -7078, 249078, 107682, 38819, 119999, -355740, 93443, -148151, -100032, 140359, -183871, -124723, 14366, 92010, -354416, 99207, -387461, -201630, 148088, 612, -115988, 64085, 100052, 51778, -327739, -33137, -320809, 33618, 181887, -226687, 90958, -185056, -251321, 366928, -67715, 83078, -207745, -61261, -79065, -80592, -114737, -109491, -456565, 120252, 107407, 113175, 374108, -9009, -166966, 156771, -464779, -237646, -16665, -279659, -117118, 103247, -117861, -51578, -83279, 85305, 188058, 119330, -96776, -57905, -55081, 172860, 234400, -260649, -128371, 114767, -62477, -15973, -140605, -268041, 69209, -206075, -360046, 212186, -130140, 187286, 324516, -152299, 58398, -76685, -321469, 140178]
11264A07916i1095n863m932l02017A13762b7928A8828L42623I0578J41873b7862
11252a0539p988j5992j77143H8224b06240A93287b12570f0435B6823K21876k5796
11241B22903b49084a09760A36625A7469c8194k43882I9081R1350a92846j00286
11231b93132A98222a60939I0495d2753j49102j08758A77017b71260C3512a52888
11220a52413C14734E2690J90168F9087K72473b09562a1851q3583A88517a70275
11209i9955A45685g5609A36917c4537m02482A57026F723b65323A61654F7222J25003
11198A92225i8927A89508E5492J73523d4293j78199P5981E5911b70259A25386
11187c38295A42728a2564l0624A04513A1772b9596B91532c6888j17047f569B42628
$$ y = [107916, -91095, -96958, -101890, -403907, 113762, -27928, 18828, 361451, 90578, 232451, -27862, -10539, -18527, -34519, -211662, 88224, -206240, 193287, -212570, -60435, 26823, 248699, 222903, -249084, -109760, 136625, 17469, -38194, -282076, 99081, 190431, -192846, -293132, 198222, -160939, 90495, -42753, -191855, -300613, 177017, -271260, 33512, -152888, -152413, 314734, 52690, 242858, 69087, 341560, -209562, -11851, -95434, 188517, -170275, -99955, 145685, -75609, 136917, -34537, -437019, 157026, 6723, -265323, 161654, 67222, 192225, -98927, 189508, 55492, 229015, -44293, -222492, -146511, 55911, -270259, 125386, -338295, 142728, -12564, -43188, 104513, 11772, -29596, 291532, -36888, -153935, -6569, 242628]
11175b96517A65327d10942O6216e6785B9985b62702P1440B47371J7632d9415A32761
11163H111c9082j87763A65773N1038C3114a8033A73796L896a07719m5221C04772
11151b52258A26470F376c86291b640o8222l27185F87K22907a73378A8118M6223
11140F4341k3419J82896B6735J60101b14259A49837b07922j62438C32134a11232
11129G8838a86741d1904A37438A382a85425j2917C44316C2881J66183J99311D3573
11117h3338A38949g7200A30331a63172g0604A0437b95280M3451A37330Q9891f092
11105a86174D1991K68982a83048A92657k5548h8228A48100m0966h6349I4945L30946
11094D25891C4935K6879K03667a3986G3086Q7788J02895A26177R3111r0434a25313
$$ y = [-296517, 165327, -410942, -344726, -56785, 29985, -262702, -191262, 247371, 265003, -49415, 132761, 8111, -39082, -226845, 165773, 216811, 33114, -18033, 173796, 177692, -107719, -152940, 304772, -252258, 126470, 6376, -386291, -2640, -70862, -398047, 687, 223594, -173378, 18118, 64341, 40922, 223818, 26735, 186836, -214259, 149837, -207922, -370360, 332134, -111232, 78838, -186741, -41904, 137438, 1382, -185425, -198342, 344316, 32881, 199064, 398375, 43573, -83338, 138949, -77200, 130331, -163172, -70604, 10437, -295280, -251829, 137330, 227221, -6092, -186174, 41991, 310973, -183048, 192657, 167109, -88228, 148100, 107134, -86349, 94945, 425891, 34935, 61814, 265481, -13986, 73086, 160874, 263769, 126177, 219288, 128854, -125313]
11082D9412P3048c51516C62267A5326a256B9560O1008a52600d0120E9354J83848
11071B43202A14469m4701J90731j17218J09891n9902a88480a996D7571J84453
11061B32024O5285R6823j17640A0614M36321j69209n3323M01983A03730J17472
11051B21202J44931L1174K5185A24018J40296R3744j54187Q3135r3466J87633
11041C81173L966M5007j03385J06565l0582m7466j75959J33996J28455m8267A37533
11029B65639Q506J9235A09082J01269K11886k00122K84464j16478A85276n895
11019A79381Q0370A14612J22473K95645l6959a49085B67933l1462j10573a67572
11008E05330A87084J55183r1001K96134J22200B25929E5960L22607d0760A24119
$$ y = [49412, 122460, -351516, 362267, 15326, -1256, 29560, 90568, -152600, -40120, 59354, 243202, 114469, 69768, 260499, 143281, 253172, 193270, -188480, -1996, 47571, 232024, 297309, 394132, 276492, 10614, 446935, 277726, 224403, 626386, 103730, 221202, 366133, 397307, 422492, 124018, 264314, 358058, 203871, 287006, 193540, 381173, 385139, 430146, 326761, 433326, 402744, 355278, 179319, 313315, 441770, 393503, 137533, 265639, 274145, 293380, 109082, 210351, 422237, 222115, 506579, 390101, 185276, 179381, 259751, 114612, 237085, 532730, 495771, -149085, 267933, 236471, 125898, -167572, 505330, 187084, 342267, 251266, 547400, 669600, 225929, 55960, 378567, -40760, 124119]
10997H8762L40403A45628J58957R9793a51440C98261j89767J71091I4073J57116
10987B51189R0803N18M0632J13890j07663q7928K78119A93218J75067P9312J68467
10976F16064B41842K46452N19134C97494K77881K76008j48675R3615K81579L9068
10966A216970j2007O8663j56077j22644R7652o7614j96529k48030B00152L29242
10956E29394p409K75516k7610j57647K0037L248l03379K84656j70141m3135c2282
10944D63065j25086f0260C81502A80584a54418I9347O4034h3701D0116K72769
10934C12885A40864i8182L6145A33532J46417a5815C8372a3147B16273J07216
10924C23489I4576a24754A14258a54405B42101c6895A95624H2049a08653G3831
$$ y = [88762, 429165, 145628, 304585, 404378, -151440, 398261, 208494, 379585, 94073, 251189, 341992, 342510, 383142, 497032, 389369, 301441, 579560, 193218, 368285, 447597, 616064, 241842, 488294, 1007428, 397494, 675375, 951383, 802708, 896323, 1177902, 1216970, 1204963, 1273626, 1117549, 994905, 1092557, 1024943, 828414, 580384, 200152, 529394, 521985, 797501, 769891, 612244, 632281, 635529, 332150, 616806, 446665, 403530, -32282, 463065, 337979, -60260, 381502, 180584, -154418, 99347, 163381, -83701, 40116, 312885, 140864, -98182, -62037, 133532, 279949, -15815, 38372, -13147, 216273, 323489, 94576, -124754, 114258, -154405, 242101, -36895, 195624, 82049, -108653, 73831]
10913A49652b5178G907K53431d6636p6687a4796m4072j17944g849B40558F8873
10901a91456e5866G5392a64586a8985j34274N9098i385r3598H0314Q885a32508
10889C6162a43650k4427j2511N0811l8406F5094J28156G6671J47694E9413a71303
10877d05157c7378I3828J48678j00093a16630D359a52838j29347R7788Q3119n0187
10866a51465H1259a09812B1911b78501g8899P000B11183h3946B12935b14554C6788
10854h2068B19036b19636A82652q0092k0592a05042k34332J51005E6329a0270
10843D3840M8938O6139b82514A0815d8288j3065A27175E6096k7564a65793L9605
10832a26188B67691D8347b4602I8431D0882d5979C12465a8392j08616C3226a61011
$$ y = [149652, -25178, 7907, 261338, -46636, -123323, -14796, -58868, -176812, -7849, 240558, 68873, -191456, -55866, 75392, -164586, -18985, -153259, -94161, -9385, -102983, 80314, 89199, -132508, 36162, -143650, -168077, -180588, -129777, -168183, 65094, 193250, 76671, 224365, 59413, -171303, -405157, -37378, 93828, 242506, 142413, -116630, 4359, -152838, -282185, -184397, -101278, -151465, 81259, -109812, 21911, -278501, -78899, -71899, 211183, -83946, 212935, -214554, 36788, -82068, 219036, -219636, 182652, 102560, 81968, -105042, -339374, -188369, 56329, -10270, 43840, 92778, 158917, -282514, 10815, -48288, -61353, 127175, 56096, 28532, -165793, -126188, 267691, 48347, -24602, 98431, 40882, -45979, 312465, -18392, -127008, 33226, -161011]
10820a87064n8418c1118k36246A589g0568k33393J28646j30869B20762c51813
10809d4698l71524a4872m2538j52363P8833j62423l9090b3297j54592A80736A4314
10797C25075A10983a63004p1829F693J78454G2557i8904L9300j32374j03798J33110
10786a62666A46155C3196c2303F2560f0770j08794j4576q0325j13934A32572A0550
10774b34948A48437a05370G41g5784l233E2282k5954P6956g8446j59893d5277
10762a2951A28531A6510a64421L4189A45749D3245i4346n6984G4054a29553F7943
10750d6569k6437B34512i7389k85051A34026k3892a73711h2938j6557A93105C9281
10738h8253K9252k09203P1434P9676j40670F2212R140h5683A89951A107K86929
$$ y = [-187064, -245482, -31118, -267364, 1589, -70568, -303961, -175315, -306184, 220762, -351813, -44698, -416222, -14872, -57410, -209773, -130940, -293363, -332453, -23297, -177889, 180736, 14314, 325075, 110983, -163004, -234833, 6693, 185147, 72557, -98904, -59604, -191978, -295776, -162666, 146155, 33196, -32303, 62560, -60770, -169564, -184140, -264465, -378399, 132572, 10550, -234948, 148437, -105370, 741, -75784, -79017, 52282, 26328, 103284, -78446, -238339, -45277, -12951, 128531, 16510, -164421, -130232, 145749, 43245, -94346, -151330, 74054, -129553, 67943, -46569, -73006, 234512, -97389, -382440, 134026, 110134, -173711, -82938, -99495, 193105, 39281, -88253, -59001, -268204, -196770, -117094, -257764, 62212, 71352, -85683, 189951, 1107, 288036]
10727B88036f6605k08668J29458K1967O1849l11775a71570c320B87801F0743a24300
10715I9052J18194B9809R4066n5782R5197b2589E3604m829Q8890a35631k5794
10704a61425H034a55790J4846B16067I6396a91327H1450c7299k595k79355I149
10692A77798e8216k5107l3337k19374a3287B94905a90447A18911a96764a4689
10681a2821j12860A0742J08653c97665a86834K7962a9813A62525g7452o8193g443
10669a86816h2146I2720B9651a87633c8771I494J46631a06266r7195B221P8943
10658H1164h9771l0379b6615A4741b0616B5481M82a57715E1501b50430J12447
10647a37983K7332l55j2323q9047k42521N7871A30042R117b87149B70013a4490
$$ y = [288036, -66605, -275273, -145815, -123848, -61999, -373774, -171570, -3320, 287801, 60743, -124300, 99052, 217246, 29809, 123875, 68093, 163290, -22589, 53604, 48775, 137665, -135631, -161425, 8034, -155790, -140944, 216067, 96396, -191327, 81450, -37299, -39894, -319249, 9149, 177798, -58216, -83323, -116660, -336034, -13287, 294905, -190447, 118911, -196764, -14689, -12821, -125681, 10742, 119395, -397665, -186834, -158872, -19813, 162525, -77452, -145645, -7443, -186816, -82146, 92720, 29651, -187633, -38771, 9494, 156125, -106266, -203461, 2221, 81164, -89771, -120150, -26615, 14741, -20616, 25481, 25963, -157715, 51501, -250430, -137983, -110651, -111006, -123329, -212376, -454897, -397026, 130042, 139159, -287149, 270013, -14490]
10635A82716l7628j8375a28813D3461N1480N5085b51261A7040a63573j1333N3034
10624a21872A49732e4149A4493a38228a7186m2109j45905E326a88621A2961J04955
10613A17916m1150N3288K1986a65917P3842A53898c77708a65127O3838D1057g4164
10601b20009c4416G0317D805a69135j16168e0823K4198A79554J50411a47306A39945
10589d2770j30692b5308A55586g9475A57234B4583c8674G0016a06097r539o1375
10578a77011m3367j20340f981r8823G7053K01823f9765o2187k1441B77329A15478
10566b62782B30820L2989a08003A6824a26950M9763n5011c030k60187f6419A06298
10554a77101D5435f7073h258n2933j03607C1613J25908j0377d7190H202J81517
$$ y = [182716, 145088, 126713, -128813, 43461, 94941, 150026, -251261, 17040, -163573, -174906, -121872, 149732, -54149, 14493, -138228, -17186, -59295, -205200, 5326, -188621, 12961, 117916, 76766, 130054, 152040, -165917, -92075, 153898, -377708, -165127, -101289, 41057, -74164, -220009, -34416, 70317, 4805, -169135, -285303, -50823, -26625, 179554, 329965, -147306, 139945, -42770, -173462, -25308, 155586, -79475, 157234, 24583, -38674, 70016, -106097, -115636, -177011, -220378, -340718, -6981, -105804, 77053, 278876, -69765, -131952, -153393, 277329, 115478, -262782, 230820, 263809, -108003, 16824, -126950, -77187, -132198, -3030, -263217, -66419, 106298, -177101, 45435, -67073, -8258, -61191, -164798, 31613, 157521, 147144, -47190, 8202, 189719]
10543A89719E5523j9330K54419a04035o2231B8608b32905A60685K02334I3496
10532c68421a8208G490a63584P6978A02171g9797p8616p7265d0245m4694L6877
10521d8062j73641j58381A71859f2265m5485L1468p3759M6647j07488A79162C4252
10509a11651l04059a20026A11591O9055b54866O4038O4270H8366A0421c19057
10498B72603b075k15342I9969d97849J79835Q2317A93516b91462g9508r2979A57040
10486A62791b18635i1229A6717e5294C30836b53198M0611f7684r7194g7757F9072
10474A9232c66981B07434g7879D3443b13521C84269b33732M2257A34708B2482
10463h193A02261B8070K64622D2138m672j5869i480F9519a76444C63094c67323
$$ y = [189719, 55523, 36193, 290612, -104035, -166266, 28608, -232905, 160685, 363019, 93496, -368421, -18208, 7490, -163584, -86606, 102171, -79797, -158413, -235678, -40245, -84939, -48062, -221703, -380084, 171859, -62265, -107750, -76282, -150041, -103394, -210882, 179162, 34252, -111651, -415710, -120026, 111591, 180646, -254866, -190828, -126558, 88366, 10421, -319057, 272603, -2075, -217417, 99969, -497849, -318014, -235697, 193516, -291462, -79508, -172487, 157040, 162791, -218635, -91229, 16717, -55294, 330836, -253198, -212587, -67684, -164878, -77757, 69072, 19232, -366981, 207434, -77879, 43443, -213521, 384269, -233732, -191475, 134708, 22482, -8193, 102261, 28070, 292692, 42138, 37466, 21597, -9480, 69519, -176444, 363094, -367323]
10451A08906a21239j4426j6889K0967a0791o3228k06917M8587p1239a05157D7976
10439f0136A73769c93554a531q1997h246m2432A19667a14431k13405a10801D5925
10427a13301N0892R373j50993A57780e2912m1908j21392R6707I3654e1727j14579
10416a66306D4948Q8637D3993a02738a0678C08046b33940d2968j65088A66755
10405A45214a18228K0059j40729b3214k59268A63087d0512B3502K66959a85287
10394H981J70537G8033M4715J42943a30709c0881l51459h9853A41131b7617B21941
10382D77185j99019j02196l0993J1356B6473O2287f5201H3853a02732A02041O0569
10371A62610e9634A81555E1778a10490A62587r295i42B89086A19798D1472J01759
$$ y = [108906, -121239, -135665, -152554, -131587, -10791, -74019, -280936, -232349, -303588, -105157, 47976, -60136, 173769, -393554, -1531, -83528, -8246, -50678, 119667, -114431, -327836, -110801, 45925, -113301, -62409, -53036, -204029, 157780, -52912, -94820, -216212, -119505, 93654, -51727, -166306, 44948, 133585, 43993, -102738, -10678, 308046, -233940, -42968, -208056, 166755, 145214, -118228, -98169, -238898, -23214, -282482, 163087, -40512, 23502, 290461, -185287, 8981, 179518, 78033, 122748, 265691, -130709, -30881, -382340, -89853, 141131, -27617, 221941, 477185, 278166, 175970, 144977, 156333, 26473, 88760, -65201, 83853, -102732, 102041, 162610, -59634, 181555, 51778, -110490, 162587, 153292, -942, 289086, 119798, 41472, 143231]
10360A43231m5414K7261K03095J73953k33212j5423J71313k00587K13270e707
10349b04102Q744A54551Q0160p7669K32263A65371K31345d8403C15456a47709
10338i2221B1461b1049A92874r1993d38522K12731N4547I165O9932Q727K4642
10327A12466b7633C05170F1370J34412L3484r0065c230B43864E2926J99944J49431
10316D02301a32412N9719k3360A76824E7994J97176a30408c6462C28575a14741
10305g9715B37523a21408b6350j98576e7098m0837L0737a0191k30277A12464L6683
10294A49147D8682N9646k4290e5083r1674B6288b05443B81244a0706B20983k0033
10283B00950a95627A16608b33929J01732n2804I1837h202G9338h9426A78289b50862
$$ y = [143231, 97817, 125078, 328173, 502126, 268914, 253491, 424804, 224217, 437487, -5707, -204102, -195358, 154551, 234711, 157042, 389305, 165371, 396716, -48403, 315456, -147709, -92221, 21461, -21049, 192874, 100881, -438522, -225791, -171244, 9165, 79097, 87824, 112466, -27633, 305170, 61370, 195782, 229266, 139201, -3230, 243864, 52926, 252870, 402301, -132412, -72693, -96053, 176824, 57994, 255170, -130408, -36462, 328575, -114741, -79715, 237523, -121408, -26350, -224926, -57098, -97935, -67198, -10191, -240468, 112464, 149147, 48682, 108328, 84038, -55083, -146757, 26288, -205443, 281244, -10706, 220983, 200950, -195627, 116608, -233929, -132197, -185001, 91837, -8202, 79338, -89426, 178289, -250862]
10271b64775B31833c5847B97596a77693F4598b85314e4767j4233F3938b05573
10260a21684A54918c98995A06830a28030b7635A93090E2900A3881K15675D9812
10249B8842Q6187a10163C0643J20007h0224j69060A63193b41141B5579P7514R0974
10238A94067b54961C3731b96618J35932f8387p8034n3075j12250M6519c8821C1792
10226B31412a72005j56998a13634k30044d8341l2545h648m6935j83756B1667h8904
10214b46501J3232A59713a98865h1889p4594b2130j24210C4251N0786a28458D2475
10202i0905j25205j06648a5321A7929P1699d3992j9517K6493F6519K58645b14837
10190E2004b84213k40851a68273A82935h4752d2110A3724a74457q2383B6865L3464
$$ y = [-264775, 231833, -35847, 297596, -177693, 64598, -285314, -54767, -69000, 63938, -205573, -121684, 154918, -398995, 106830, -128030, -27635, 193090, 52900, 13881, 229556, 49812, 28842, 115029, -110163, 30643, 150650, -80224, -249284, 163193, -241141, 25579, 103093, 194067, -254961, 33731, -296618, -160686, -68387, -146421, -199496, -311746, -265227, -38821, 31792, 231412, -172005, -329003, -113634, -343678, -48341, -80886, -8648, -55583, -239339, 21667, -88904, -246501, -233269, 159713, -198865, -81889, -156483, -22130, -146340, 34251, 85037, -128458, 42475, -90905, -216110, -322758, -15321, 17929, 89628, -43992, -63509, -37016, 66519, 325164, -214837, 52004, -284213, -525064, -168273, 182935, -84752, -42110, 13724, -174457, -256840, 26865, 60329]
10179F0329m798b33300A35455a57095e4816A3041K3050c945B08202a42835A71190
10167c0122j03654J9498j23813i8550k18400A93637h2535a4635A75248a35230
10156D304L49559c116k5594A59983b18993P9733c610a08m55703C27707b20578
10144G2075c46493B05962G3937A950a81365a8910o254C8740r016P0198a29056
10132b40185D916c15023M8105A15896a83786B49673a35792p8395O0108H2109a88895
10120g6410n5730J9427j02009d5979F962a78727r831f2671j03074O4321A73694
10108a86491j22920A36360D9804a4422m543A08452b22533O3245C33737f7968n7440
10097a25408E3816h7900a1904B30909e8648k53232e3700A50465h8567o1752j2879
$$ y = [60329, 55531, -233300, 135455, -157095, -54816, 13041, 36091, -3945, 208202, -142835, 171190, -30122, -133776, -114278, -238091, -98550, -316950, 193637, -82535, -14635, 175248, -135230, 4304, 353863, -3116, -28710, 159983, -218993, -139260, -3610, -108, -455811, 327707, -220578, 72075, -346493, 205962, 73937, 1950, -181365, -18910, -25164, 38740, 29724, 99922, -129056, -240185, 4916, -315023, -266918, 115896, -183786, 249673, -135792, -214187, -154079, 82109, -188895, -76410, -132140, -112713, -214722, -45979, 6962, -178727, -188558, -62671, -165745, -101424, 173694, -186491, -309411, 136360, 49804, -14422, -18965, 108452, -222533, -159288, 333737, -67968, -125408, 53816, -87900, -11904, 230909, -58648, -311880, -53700, 150465, -88567, -150319, -163198]
10086a63198C13617A4831a29853e0784A09281a73306A49095E2225N3149B4573
10075B83677c92193g5865B47647i9187j48316J04657a3736k34605k8598G1797
10064a01511r2205B52926a45165m9370H8821j8967a66139H5110R5660b1555k9097
10053e0652D25457h9516B6045b94788A60700J175b05254B8800Q18a47425D2707
10041e8968k55038E2161b29472J05053c6919m4281L8657A2759a8750n1248m5602
10030a15600A94607p0128N0040o3227J70137a52268I5571g5526b0515A73045b95484
10018b07274M5464r884N3062A45347O4544F9424c7441a6927n1356n8608l7122
10007a64013C4962J65625g8944p3226a5365j82525R085B52896j20389b14531A35473
$$ y = [-163198, 313617, 14831, -129853, -50784, 109281, -173306, 149095, 52225, 105374, 24573, 283677, -392193, -75865, 247647, -99187, -247503, -142846, -13736, -248341, -276939, 71797, -101511, -193716, 252926, -145165, -194535, 88821, 69854, -166139, 85110, 180770, -21555, -50652, 425457, -89516, 26045, -294788, 160700, 161875, -205254, 28800, 29618, -147425, 42707, -58968, -314006, 52161, -229472, -124419, -36919, -81200, -42543, 12759, -18750, -69998, -115600, 194607, 124479, 174519, 111292, 281429, -152268, 95571, -75526, -20515, 173045, -295484, -207274, -161810, -171694, -118632, 145347, 209891, 69424, -37441, -16927, -68283, -126891, -164013, 34962, 200587, -78944, -152170, -15365, -197890, -188805, 252896, 132507, -214531, 135473]
9995F3155b88900b9632l43848b5126B1638b56509d7957I3116A7481J19065b3469
9983a42875J9009B39823f4957J5212b1382j69487b7700j14607e8644c730k5069
9972b8799l3302a9286k55379B7496a88030e8808B87551A33453a29271k28453j29274
9961d86998B7372K5421j0845a16091B89324G3262O4241a5902j79353R0871j56293
9950b60677L9485H1396d58010f8986m117c90k6997j48715B51989A4905a1515j68833
9938a80348B09487c31287R5517R1224f6059j95277C856K59802A22794f4471a0570
9926A67198a81164b1937n2650L1064k45346M3056A37861b7513l24168J07645g0832
9914b3426l22927C4888f5069l1211A12169c75030a2873A01249a19138H4268J42676
$$ y = [63155, -288900, -29632, -373480, -25126, 21638, -256509, -47957, 93116, 17481, 136546, -23469, -142875, -123866, 239823, -64957, -49745, -21382, -190869, -27700, -142307, -58644, -3730, -28799, -62101, -19286, -274665, 27496, -188030, -58808, 287551, 133453, -129271, -357724, -486998, 27372, 52793, 41948, -116091, 289324, 73262, 137503, -15902, -195255, -104384, -260677, -221192, 81396, -458010, -68986, -73103, -390, -27387, -176102, 251989, 14905, -11515, -180348, 209487, -331287, -235770, -144546, -66059, -261336, 3856, 263658, 122794, -64471, -10570, 167198, -181164, -21937, -74587, -43523, -288869, -245813, 137861, -27513, -351681, -244036, -70832, -23426, -346353, 34888, -65069, -96280, 112169, -375030, -12873, 101249, -119138, 84268, 226944]
9903B26944a25732j45254J07296O8260E7512a71521A10168A9652b86430a20683
9892a15057A5932a55145A18349a6584j47867A00636J12903R361a94299B04394
9881b28104a00208E0092a46726j92932i2373k50021K9116D201a15604p08C3512
9869E68957A45079a54841N6386J8749j48271B02997i5637J3687K4370L40B23564
9857b25429J05694q5424O3323d2725A97193a22382q7315B49149I2125B4908J02169
9846A27077b57974A78276d4948A43473f1220j96390A0483J24921L1226K42049
9836D08679a17218A14604A6350a09667l728j24791b953m7644k12757N6851L4508
9825a71995O5194F4016a13953j71713g7682j97635f9192a0906I7502J00038d70641
$$ y = [226944, -125732, -270986, -163690, -95430, 57512, -171521, 110168, 19652, -286430, -120683, -115057, 15932, -155145, 118349, -16584, -164451, 100636, 213539, 222900, -194299, 204394, -228104, -100208, 50092, -146726, -339658, -92373, -342394, -313278, 4201, -115604, -116312, 33512, 568957, 145079, -154841, -98455, -79706, -227977, 202997, -95637, -81950, -57580, -57240, 223564, -225429, -119735, -205159, -141836, -42725, 197193, -122382, -209697, 249149, 92125, 24908, 127077, -257974, 178276, -44948, 143473, -61220, -257610, 10483, 135404, 166630, 408679, -117218, 114604, 16350, -109667, -113395, -238186, -2953, -50597, -263354, -206503, -171995, -106801, 64016, -113953, -285666, -77682, -275317, -69192, -10906, 97502, 197540, -470641]
9813A03144A0851g2312A83599a56627F384K68397f3128j00247D4938P5830a94155
9801c63634A86557a63034B2090a19105j86172i3831K8127r0555p0525J06680D2391
9789d47368A10809i4229B17920e1406c499B40351o2248c98321F2195a01972K4342
9778g7630l02804O0814f7809j57221R2051B28562a67578c2521C3592a83902A33281
9766g0074L0561h052l1116A0848b57218B18166a29392N7963E7316a5599k9863
9755d5462A12111a44934c5733A03947c0499j75313a01640A7080d02866I2779f037
9743E1279a18476F7008K2067h7792m304A38241C2314i0764K4505k9722a549j22294
9731a23843A9072b0650k34779A98877c49367J65016F0858c60221C74018A8951
$$ y = [103144, 10851, -72312, 183599, -156627, 6384, 274781, -63128, -163375, 44938, 120768, -194155, -363634, 186557, -163034, 22090, -119105, -305277, -93831, -65704, -156259, -226784, -120104, 42391, -447368, 110809, -94229, 217920, -51406, -3499, 240351, 178103, -398321, 62195, -101972, -77630, -380434, -319620, -67809, -225030, -132979, 228562, -167578, -32521, 33592, -183902, 133281, -70074, -39513, -8052, -39168, 10848, -257218, 218166, -129392, -71429, 57316, -15599, -45462, 112111, -144934, -35733, 103947, -30499, -205812, -101640, 17080, -402866, 92779, -6037, 51279, -118476, 67008, 89075, -87792, -92096, 138241, 32314, -90764, -66259, -95981, -1549, -123843, 19072, -20650, -255429, 198877, -349367, -184351, 60858, -360221, 374018, 18951]
9720b51245b6195D7653e8287I3175a98149k09786C1248a6176k69551A02657c4955
9708A81648d0679l35848A48474b32066g3922K3973k39146O6131p2476a41218b304
9696h7125A7540g7523c3465C8458O1018b4284q7427j06718M6247k2656C88247
9684d00219a11280k71409J76075Q7977I1238c10170a24828B2125a08325e1808
9673a59216p4188J09251b2950k24052j24553A26502j5704b9290G4960b5594j04088
9662a29682A66857b4319j5534I5210b01793d4705k8534k85027h8957j23401Q8067
9651a24291C12678a73597A98460r1788a48858b4539p1334j4313B9960e9363K2838
9640c6525n6065I8708e9743f977j41888G8893j7892L1087g6710A95N5686k322
$$ y = [-251245, -26195, 47653, -58287, 93175, -198149, -407935, 31248, -16176, -285727, 102657, -34955, 181648, -40679, -376527, 148474, -232066, -73922, -49949, -289095, -222964, -295440, -141218, -2304, -87125, 17540, -77523, -33465, 38458, 99476, -24284, -111711, -218429, -172182, -194838, 388247, -400219, -111280, -382689, -206614, -118637, 91238, -310170, -124828, 22125, -108325, -51808, -159216, -233404, -124153, -22950, -247002, -371555, 126502, 110798, -29290, 74960, -25594, -129682, 166857, -24319, -39853, 95210, -201793, -44705, -73239, -358266, -88957, -212358, -124291, 312678, -173597, 198460, 106672, -148858, -24539, -95873, -110186, 29960, -59363, -36525, -92590, 98708, -59743, -6977, -148865, 78893, 61001, 92088, -76710, 195, 55881, 53559]
9628E3559a39337b9837B21677D2121a61203q3118M0493A55107D3299d80420b22954
9616A07767a77735J3487C0171J00679F621K00805k9277a3425k74624e8731k4897
9605h3628B17350a78080B42646F0246e9167p0975q1417B15037a73414c8505A42641
9593A80279G274a06908b8209F3721a20512m9899C5859h2088h812E2467K93283
9582C45750a71734A66700b03039j55330i7736m8650n6635k6889B67862j31863
9572A35999a74525k04646a64243M8818L7585B97187h5376j73045F6244b09064
9561C5944N0804f9352A05282d5304G5746b0908j36900B23224c76837B13881F7090
9549e6949A25105J15738B2515d5196k39677A43033b82691C8096H893a16051c8685
$$ y = [53559, -139337, -29837, 221677, 42121, -161203, -244321, -203828, 155107, 43299, -480420, -222954, 107767, -177735, -164248, 30171, 130850, 6621, 207426, 178149, -13425, -288049, -58731, -83628, 217350, -178080, 242646, 60246, -59167, -130142, -211559, 215037, -173414, -38505, 142641, 180279, 7274, -106908, -28209, 63721, -120512, -170411, 35859, -82088, -8812, 52467, 345750, -171734, 166700, -203039, -358369, -97736, -146386, -203021, -229910, 267862, 135999, -174525, -379171, -164243, -115425, -77840, 297187, -85376, -258421, 66244, -209064, 35944, 86748, -69352, 105282, -45304, 75746, -20908, -157808, 223224, -376837, 213881, 67090, -56949, 125105, 240843, 22515, -45196, -284873, 143033, -282691, 38096, 8893, -116051, -38685]
9537f7114a2419M526k42179D36744g7036F9758a15343B9116R6115a4133A9847
9525a52977A9480b5654C2202K47694B5427L5015d54466h8139n7201j20803g7384
9513H8299k4942a47785j47398i6491O861A35325a79200c727j3890j66398P9107
9502a04908b4402C5032b3884B12437n6844p4055b33466C63727A39956I390b68205
9490A31086B4331J4010a92403c0501m0292L1890J1322A8471M0622b13424i5634
9478C26511b45183l8528J17448L8328c5649k8569j8717b1897j50070n9533h7931
9466B27681i3301M0671k2913b3803l0825L116O771H1776a6036j5091B5224i1026
9453i1975d2039l31180K7717P0123A43513c4638A05421a28052k6291P5316A01183
$$ y = [-67114, -12419, -7893, -250072, 436744, -77036, 69758, -115343, 29116, 125231, -14133, 19847, -152977, 19480, -25654, 32202, 279896, 25427, 60442, -454466, -88139, -145340, -266143, -77384, 88299, 63357, -147785, -295183, -96491, -89630, 135325, -179200, -3727, -17617, -184015, -104908, -24402, 35032, -23884, 212437, 155593, 81538, -233466, 363727, 139956, 9390, -268205, 131086, 24331, 38341, -192403, -30501, -70793, -38903, -27581, 18471, 59093, -213424, -95634, 326511, -245183, -283711, -166263, -127935, -35649, -64218, -82935, -21897, -171967, -231500, -87931, 227681, -93301, -52630, -75543, -23803, -54628, -51512, -44741, 81776, -16036, -31127, 25224, -91026, -91975, -42039, -373219, -345502, -275379, 143513, -34638, 105421, -128052, -154343, -79027, 101183]
9441B3997c4967r6234M2898j40108I4297a72336O9500o8397d533C14017i5068
9429b20818A26174b45531G11a40290B1610R2246a8497k97886f2615k04527A67640
9417c17971B07020b996p3597B89173g3950m9839c8210k05753D7357a60876C40733
9405B6714d3213D0719L5405a2240j20172r695j67726f8598B55268E9949R0584
9394A50533J23771b53611A90461a47428c5296k23930c8007j56617I719a46827
9383a81431P500L5327H3727d2554F6817a9486q9772j62805B58310p7316a29410
9371I2727D931g5098j24391j32606a1592j59187L3187I549J3479a83892l8271
9360b22163a05189e2396k12282A04074e8473A07119N8271D8167K38990d7265j17138
$$ y = [23997, -34967, -131201, -88303, -228411, 94297, -172336, -102836, -171233, -4533, 314017, -95068, -220818, 126174, -245531, 711, -140290, 21610, 113856, -18497, -316383, -62615, -267142, 167640, -317971, 207020, -2996, -76593, 289173, -73950, -123789, -38210, -243963, 47357, -160876, 340733, 26714, -43213, 40719, 76124, -12240, -132412, -142107, -309833, -68598, 255268, 59949, 150533, 274304, -253611, 190461, -147428, -35296, -259226, -38007, -194624, 9719, -146827, -181431, -173931, -138604, 83727, -42554, 66817, -19486, -109258, -272063, 258310, 180994, -129410, 92727, 4931, -75098, -199489, -332095, -11592, -170779, -137592, 9549, 23028, -183892, -222163, -105189, -52396, -264678, 104074, -58473, 107119, 165390, 48167, 287157, -47265, -164403]
9349a64403B18878O8726c88200B31072H7602b6291A12595a05365k08652a30787
9338c00892H1004j9401b1213E8554a11498C72781a20129k05741E6138f9029j05008
9327a74037E4419c81246a8363H2740l1958a26451A90304H4237J10547i0835j94614
9316b85449Q0397l1582a6104C6514c34931A34692f2195A36157J9159c206j90226
9305a93432m8505a05814C49563A19355f2382q195A1834a2226k37682i8946k50649
9294c49595Q5078e4236k00321k781q4410K7027h7192o2869k60886P8951R5410
9283b36586j4381e2817A86770D9005g6842j9837B10634b19185D6513J6459f435
9271a60280l1085B01773J27253m6569A5076a22727j06033A38172F6694c25227
$$ y = [-164403, 218878, 287604, -388200, 231072, 87602, -26291, 112595, -105365, -314017, -130787, -300892, 81004, 61603, -21213, 58554, -111498, 372781, -120129, -325870, 56138, -69029, -174037, 54419, -381246, -18363, 82740, 50782, -126451, 190304, 84237, 194784, -90835, -285449, -205052, -236634, -16104, 36514, -334931, 134692, -62195, 136157, 155316, -3206, -193432, -241937, -105814, 349563, 119355, -62382, -70577, 11834, -12226, -249908, -98946, -349595, -264517, -54236, -254557, -257338, -341748, -314721, -87192, -150061, -410947, -331996, -236586, -250967, -52817, 186770, 49005, -76842, -96679, 210634, -219185, 46513, 62972, -6435, -160280, -191365, 201773, 329026, 282457, 15076, -122727, -228760, 138172, 66694, -325227]
9260a49248j25483N0294C1238b1653n1108A24074b50381a24178k2775e817j8048
9249b3865n4880j38631B173b71591A12050F079c83091I8650b80221f7161A7099
9237A31238L6688h3183C5680L16534g0448l1280q9992L0534C599a68420K363C17742
9224A9400R1620e1518n8121M372B1026h8553G3607g9220p8450j9892C5732P0201
9212A05933a50857C14947A20806g71A41894b51364d3560A8562R1368a03381L6344
9201f7037G5726K69137a90140B2941a53799j28374A11596a92122B99162F1658
9190a72477B01826a4093A43120E174e10210B4251a07025O224j67086A76717g2080
9178a52590P3165j11178B94225a87366A32266a20010m9308O493k16610D15591
$$ y = [-149248, -274731, -224437, 31238, -21653, -72761, 124074, -250381, -124178, -146953, -5817, -23865, -78745, -217376, 2173, -271591, 112050, 6079, -383091, 98650, -280221, -67161, 17099, 131238, 167926, -83183, 35680, 352214, -70448, -101728, -191720, -161186, 3599, -168420, -166057, 317742, 19400, 111020, -51518, -109639, -105267, 21026, -88553, 73607, -79220, -157670, -177562, 35732, 105933, -150857, 314947, 120806, -771, 141894, -251364, -43560, 18562, 109930, -103381, -67037, 75726, 344863, -190140, 22941, -153799, -282173, 111596, -192122, 299162, 61658, -172477, 201826, -14093, 143120, 5174, -510210, 24251, -107025, -100801, -267887, 176717, -72080, -152590, -79425, -190603, 294225, -187366, 132266, -120010, -169318, -162825, -379435, 415591]
9167D1530a58894J9316F1263J558K51542a73034P0697J5561k41692P8858a4029
9155e1546j89809m5495A7158J65547c104k40044A04648R7577a90203G7393R9375
9144A76768a6367m8580r3427B28137a33559m9102H2348A6378b67492G6405a44157
9132A32943b44711D5800a2102m8384m9157j01772P1629C21644A20350d5134m530
9121d9664j91701A08597n4048a6480j0204B03973Q169B3390a06616B44294b24801
9109d3032k07182G8525b01864m5387B6036c9695m403F2016B7610L89425A07846
9097c6757I7972c5265n3920D6344b50546D9569d39730A8907J16798E4963K8883
9086H3846Q2468D4564J80117a22886A0457b49317B33572o7409g5714a8411j31024
$$ y = [41530, -158894, -139578, 61263, 62821, 314363, -173034, -102337, -86776, -328468, -249610, -14029, -51546, -241355, -286850, 17158, 182705, -3104, -243148, 104648, 202225, -190203, 77393, 176768, -16367, -64947, -158374, 228137, -133559, -182661, 82348, 16378, -267492, 76405, -144157, 132943, -244711, 45800, -12102, -60486, -109643, -211415, -139786, 321644, 120350, -45134, -49664, -241365, 108597, 54549, -16480, -26684, 203973, 212142, 23390, -106616, 244294, -224801, -43032, -250214, 78525, -201864, -247251, 26036, -39695, -44098, 62016, 27610, 417035, 107846, -36757, 97972, -35265, -89185, 46344, -250546, 49569, -439730, 18907, 135705, 54963, 83846, 166314, 44564, 224681, -122886, 10457, -249317, 233572, 166163, -75714, -18411, -149435]
9075a49435J2070p0670j19342m2919A56383E3753J68286B5417b45349A57270a38397
9063A84627l9140a71193M9044d8663o0332l0855A47429a45797a3221A89868b41769
9051a48633H453M37283b8486k17403F7824l18J45330a02575k31857g2722L1085
9040d1637G9507a86826H0283b89442M7750D6168F685K18314a25242j12246h5182
9028b35672B0690L82886d4857D2035K9600a86568C7000d79870K39764A58686a3611
9016a11494N4941l4530r9922h4172k37435F5515b78816b8341A03976e340k83938
9005b89278A03232b78627A49409a92167D8323J58a18790J1938o6373I8478f9243
8993b54894a22154B17584L5738b77773i7086k07942g4103H5383J93659A3620a41662
$$ y = [-149435, -137365, -208035, -327377, -370296, 156383, 53753, 222039, 25417, -245349, 157270, -138397, 184627, 145487, -171193, -122149, -48663, -108995, -139850, 147429, -145797, -13221, 189868, -241769, -148633, 8453, 445736, -28486, -245889, 67824, 67506, 212836, -102575, -334432, -72722, -41637, 79507, -186826, 80283, -289442, -241692, 46168, 6685, 224999, -125242, -237488, -85182, -235672, 20690, 403576, -44857, 42035, 71635, -186568, 37000, -479870, -240106, 158686, -13611, -111494, -56553, -91083, -191005, -84172, -321607, 65515, -278816, -28341, 103976, -5340, -289278, 103232, -278627, 149409, -192167, 48323, 48481, -118790, -106852, -173225, 98478, -69243, -254894, -122154, 217584, 253322, -277773, -97086, -305028, -74103, 85383, 279042, 13620, -141662]
8981A74861e2727k77631I8177I805K64359b11728A43300l4518r585b25770E7221
8969C1730b8541p1947M6755A31552G571J96243m1539K9490J05756a16915A39530
8957b09373K0548j39074B734a96086m62q0596N9111j471M2169C33687j31998q4203
8945A17486a80605A16162B44b66009C4996K46816I981a15220A39608b52803A23804
8933I207a09568d9553j73230P0058I1586C9232c91990A60765B2855l103b32608
8921C6772a08291j42205E06124j36760p8800j38559Q4298a07591M3039D4439b46540
8909A1546M7037P3101L63072a8809o4230o3280A08716a37095k18207g971j60386
8898a68357J237E4238i0586D1224b11258E7464a80707f9554L3340l0731a6680
$$ y = [174861, -52727, -330358, 98177, 9805, 274164, -211728, 143300, 108782, 99197, -225770, 57221, 31730, -28541, -100488, -53733, 131552, 7571, 203814, 162275, 191765, 297521, -116915, 139530, -209373, -188825, -327899, 2734, -196086, -196548, -277144, -218033, -219504, -177335, 333687, 201689, 117486, -180605, 116162, 244, -266009, 34996, 281812, 9981, -115220, 139608, -252803, 123804, 9207, -109568, -49553, -222783, -152725, 91586, 39232, -391990, 160765, 22855, 19752, -232608, 36772, -108291, -250496, 506124, 369364, 290564, 152005, 236303, -107591, -64552, 44439, -246540, 11546, 58583, 131684, 494756, -18809, -83039, -146319, 108716, -137095, -355302, -7971, -168357, -167120, 54238, -90586, 41224, -211258, 57464, -180707, -69554, -36214, -66945, -16680]
8886c98034b6548r1246D8642a86069A03639b18253R3447b0510k43430J06702C3917
8874b19824K0522N9163m9197h05E7087K27607j24152a65799I5800p455j3991K51430
8862C25784a41374G0452J82456A7304K5141a87271R473D6052g7446i580A20049
8850A85241R4659A19307J02770a73589B51929H1121l0215a80856j1855O8549A2561
$$ y = [-398034, -26548, -117794, 48642, -186069, 103639, -218253, -124806, -20510, -263940, -157238, 33917, -219824, -199302, -140139, -189336, -805, 57087, 284694, 160542, -165799, 95800, 88345, 74354, 325784, -141374, 70452, 252908, 17304, 42445, -187271, -177798, 46052, -77446, -9580, 120049, 185241, 279900, 119307, 222077, -173589, 251929, 81121, 50906, -180856, -192711, -124162, 12561]
$$ [...]
##END NTUPLES=NMR SPECTRUM
##END=
