##TITLE=NES1039_872015048_9242671_qEZkBcLU37
##JCAMPDX= 6.0         $$ Bruker NMR JCAMP-DX V2.0
##DATA TYPE= NMR SPECTRUM
##DATA CLASS= NTUPLES
##ORIGIN= BRUKER
##OWNER= Administrator
$$ 1.72 TOPSPIN		Version 2.1
$$ 2015-07-01 19:15:46.664 -0700  Administrator@X
$$ Compression mode = diff/dup
##.OBSERVE FREQUENCY= 400.02188249412
##.OBSERVE NUCLEUS= ^1H
##.ACQUISITION MODE= SIMULTANEOUS (DQD)
##.ACQUISITION SCHEME= undefined
##.AVERAGES= 64
##.DIGITISER RES= 22
##SPECTROMETER/DATA SYSTEM= spect
##.PULSE SEQUENCE= noesygpps1d.comp
##.SOLVENT NAME= COFFEE_meoh
##.SHIFT REFERENCE= INTERNAL, COFFEE_meoh, 1, 14.96331
##AUDIT TRAIL= $$ (NUMBER, WHEN, WHO, WHERE, PROCESS, VERSION, WHAT)
$$ ##TITLE= Audit trail, TOPSPIN		Version 2.1
$$ ##JCAMPDX= 5.01
$$ ##ORIGIN= Bruker BioSpin GmbH
$$ ##OWNER= Administrator
$$ $$ E:\/data/COFFEE/nmr/NES1039_872015048_9242671_qEZkBcLU37/22/pdata/1/auditp.txt
$$ ##AUDIT TRAIL=  $$ (NUMBER, WHEN, WHO, WHERE, PROCESS, VERSION, WHAT)
(   1,<2015-07-01 19:15:41.258 -0700>,<Administrator>,<X>,<go>,<TOPSPIN 2.1>,
      <created by zg
	started at 2015-07-01 19:04:11.914 -0700,
	POWCHK enabled, PULCHK disabled,
       configuration hash MD5:
       21 0F 79 D6 B3 7B B4 F6 88 20 88 DB 03 48 BD 9F
       data hash MD5: 64K
       82 06 6B 4F 80 01 8B 73 49 ED C8 2C 81 DB 08 52>)
(   2,<2015-07-01 19:15:44.617 -0700>,<Administrator>,<X>,<proc1d>,<TOPSPIN 2.1>,
      <Start of raw data processing
       efp LB = 0.3 FT_mod = 6 PKNL = 1 PHC0 = 0 PHC1 = 0 SI = 128K 
       data hash MD5: 128K
       99 BC C8 17 7A 25 22 AA 11 FF BA 48 8C AF A5 FD>)
(   3,<2015-07-01 19:15:45.477 -0700>,<Administrator>,<X>,<proc1d>,<TOPSPIN 2.1>,
      <pk PHC0 = -82.51831 PHC1 = 0 
       data hash MD5: 128K
       F8 75 0F 91 8B 97 E6 3F C6 63 E2 7D 92 6B C6 87>)
(   4,<2015-07-01 19:15:45.852 -0700>,<Administrator>,<X>,<proc1d>,<TOPSPIN 2.1>,
      <abs ABSG = 1 
       data hash MD5: 128K
       D3 F8 57 E8 B8 52 80 A7 17 BA 68 74 92 E9 BF 3F>)
(   5,<2015-07-01 19:15:45.961 -0700>,<Administrator>,<X>,<proc1d>,<TOPSPIN 2.1>,
      <abs ABSG = 2 
       data hash MD5: 128K
       5E 5D 53 CD 08 9C 15 79 A5 59 1D B1 C9 9C 20 D6>)
(   6,<2015-07-01 19:15:46.039 -0700>,<Administrator>,<X>,<proc1d>,<TOPSPIN 2.1>,
      <abs ABSG = 3 
       data hash MD5: 128K
       02 74 F8 31 2F F9 04 85 9B 05 B5 27 D0 98 74 3F>)
(   7,<2015-07-01 19:15:46.133 -0700>,<Administrator>,<X>,<proc1d>,<TOPSPIN 2.1>,
      <abs ABSG = 4 
       data hash MD5: 128K
       DF 0C BB 6C 00 7F B5 5B B2 7F 21 D6 29 A4 21 72>)
(   8,<2015-07-01 19:15:46.258 -0700>,<Administrator>,<X>,<proc1d>,<TOPSPIN 2.1>,
      <abs ABSG = 5 
       data hash MD5: 128K
       A2 81 8F EB 4F 1E C7 79 7D 5E BE 3A 42 7B 56 FD>)
$$ ##END=
$$ 
$$ $$ hash MD5
$$ $$ 57 08 C9 ED 48 CC 79 38 69 02 33 9D 7A 22 F2 BB
##$RELAX= 
##$RELAX= 
##$RELAX= 
##$RELAX= 
##$RELAX= 
##$RELAX= 
##$RELAX= 
##$RELAX= 
$$ Bruker specific parameters
$$ --------------------------
##$DU= <E:\>
##$EXPNO= 22
$$ [...]
##$TP07= 0
##$TPNAME0= <>
##$TPNAME1= <>
##$TPNAME2= <>
##$TPNAME3= <>
##$TPNAME4= <>
##$TPNAME5= <>
##$TPNAME6= <>
##$TPNAME7= <>
##$TPOAL= (0..7)
0.5 0.5 0.5 0.5 0.5 0.5 0.5 0.5
##$TPOFFS= (0..7)
0 0 0 0 0 0 0 0
##$TUNHIN= 0
##$TUNHOUT= 0
##$TUNXOUT= 0
##$USERA1= <user>
##$USERA2= <user>
##$USERA3= <user>
##$USERA4= <user>
##$USERA5= <user>
##$V9= 5
##$VALIST= <valist>
##$VCLIST= <CCCCCCCCCCCCCCC>
##$VD= 0
##$VDLIST= <DDDDDDDDDDDDDDD>
##$VPLIST= <PPPPPPPPPPPPPPP>
##$VTLIST= <TTTTTTTTTTTTTTT>
##$WBST= 2048
##$WBSW= 25
##$XGAIN= (0..3)
0 0 0 0
##$XL= 0
##$YL= 0
##$YMAX_a= 5547409
##$YMIN_a= -11526728
##$ZGOPTNS= <>
##$ZL1= 120
##$ZL2= 120
##$ZL3= 120
##$ZL4= 120
##$ABSF1= 14.96331
##$ABSF2= -5.594872
##$ABSG= 5
##$ABSL= 3
##$ALPHA= 0
##$AQORDER= 0
##$ASSFAC= 0
##$ASSFACI= 0
##$ASSFACX= 0
##$ASSWID= 0
##$AUNMP= <proc_prof1d_extract.lims>
##$AXLEFT= 0
##$AXNAME= <>
##$AXNUC= <1H>
##$AXRIGHT= 0
##$AXTYPE= 0
##$AXUNIT= <>
##$AZFE= 0.1
##$AZFW= 0.1
##$BCFW= 0
##$BC_mod= 0
##$BYTORDP= 0
##$COROFFS= 0
##$CY= 15
##$DATMOD= 1
##$DC= 0
##$DFILT= <>
##$DTYPP= 0
##$F1P= 0
##$F2P= 0
##$FCOR= 0.5
##$FTSIZE= 131072
##$FT_mod= 6
##$GAMMA= 0
##$GB= 0
##$INTBC= 1
##$INTSCL= 1
##$ISEN= 128
##$LB= 0.3
##$LEV0= 0
##$LPBIN= 0
##$MAXI= 10000
##$MC2= 0
##$MEAN= 0
##$ME_mod= 0
##$MI= 0
##$NCOEF= 0
##$NC_proc= -2
##$NLEV= 6
##$NOISF1= 0
##$NOISF2= 0
##$NSP= 0
##$NTH_PI= 0
##$NZP= 0
##$OFFSET= 14.96331
##$PC= 1
##$PHC0= -82.51831
##$PHC1= 0
##$PH_mod= 1
##$PKNL= yes
##$PPARMOD= 0
##$PPDIAG= 0
##$PPIPTYP= 0
##$PPMPNUM= 2147483647
##$PPRESOL= 1
##$PSCAL= 4
##$PSIGN= 0
##$PYNMP= <proc.py>
##$REVERSE= no
##$SF= 400.020008711293
##$SI= 131072
##$SIGF1= 0
##$SIGF2= 0
##$SINO= 400
##$SIOLD= 131072
##$SPECTYP= <>
##$SREGLST= <1H.CDCl3>
##$SSB= 0
##$STSI= 131072
##$STSR= 0
##$SW_p= 8223.68421052631
##$SYMM= 0
##$S_DEV= 0
##$TDeff= 65536
##$TDoff= 0
##$TI= <>
##$TILT= no
##$TM1= 0
##$TM2= 0
##$TOPLEV= 0
##$USERP1= <user>
##$USERP2= <user>
##$USERP3= <user>
##$USERP4= <user>
##$USERP5= <user>
##$WDW= 1
##$XDIM= 131072
##$YMAX_p= 344464174
##$YMIN_p= -11971
##$CURPLOT= <Network HP LaserJet P1505>
##$CURPRIN= <$Network HP LaserJet P1505>
##$DFORMAT= <normdp>
##$LAYOUT= <+/1D_H.xwp>
##$LFORMAT= <normlp>
##$PFORMAT= <normpl>
##$SURQMSG= 1
$$ End of Bruker specific parameters
$$ ---------------------------------
##NTUPLES= NMR SPECTRUM
##VAR_NAME=  FREQUENCY,     SPECTRUM/REAL,   SPECTRUM/IMAG
##SYMBOL=    X,             R,               I
##VAR_TYPE=  INDEPENDENT,   DEPENDENT,       DEPENDENT
##VAR_FORM=  AFFN,          ASDF,            ASDF
##VAR_DIM=   131072,        131072,          131072
##UNITS=     HZ,            ARBITRARY UNITS, ARBITRARY UNITS
##FACTOR=    0.0627417313425164, 1,          1
##FIRST=     8223.62146879497, 3280,         -28693
##LAST=      0,             2791,            -28277
##MIN=       0,             -11971,          0
##MAX=       8223.62146879497, 344464174,    0
$$ Real data points
##PAGE= N=1
##DATA TABLE= (X++(R..R)), XYDATA
$$ [...]
63606C39756l219k863k538k896m082n331n785n386m613l726k840k362k558k773
$$ 339756 336537 333674 331136 328240 324158 318827 313042 307656 303043 299317 296477 294115 291557 288784
63592B88784j994l07J079J475J506J834K021J437M85RM6J17L32J100K003K133
$$ 288784 286790 286483 287562 289037 290543 292377 294398 295835 296320 296329 296375 296492 296824 297924 299927 302060
63576C02060J556J364K100L134L811M313N071O084P185Q240Q835Q545P790P560
$$ 302060 303616 304980 307080 310214 314025 318338 323409 329493 336678 344918 353753 362298 370088 377648
63562C77648P934P808O520M814L531K319O04j046j664j521j731k492k845k248
$$ 377648 385582 393390 399910 404724 408255 410574 411178 410132 408468 406947 405216 402724 399879 397631
63548C97631j345j000j411k399l741n022n746n987o372p102p509o973n878n196
$$ 397631 396286 395286 393875 391476 387735 382713 376967 370980 364608 357506 349997 343024 337146 331950
63534C31950n323n729n690n074m400m311n013o082o806o734n956m918l986l239
$$ 331950 326627 320898 315208 310134 305734 301423 296410 290328 283522 276788 270832 265914 261928 258689
63520B58689k628k282k500l295m128m325l771k892k032j194m84l40r68j894k378
$$ 258689 256061 253779 251279 247984 243856 239531 235760 232868 230836 229642 229158 228818 227850 225956 223578
63505B23578k168j690j565k031k649k612j606l05L88N56J013J871K209J566Q24
$$ 223578 221410 219720 218155 216124 213475 210863 209257 208952 209340 209896 210909 212780 214989 216555 217379
63490B17379R37J571J868J937K502L431L821L394K801K430J951J185M80l8p31
$$ 217379 218316 219887 221755 223692 226194 229625 233446 236840 239641 242071 244022 245207 245687 245649 244918
63475B44918j594j897j220k01K47J9l55n63p34j022j390j651j481o65M74J163
$$ 244918 243324 241427 240207 240006 240253 240272 239917 239354 238620 237598 236208 234557 233076 232411 232885 234048
63459B34048R62K67k12j51L73J215K284L463M680N817O576O744O661O958P698
$$ 234048 235010 235277 235065 234914 235287 236502 238786 242249 246929 252746 259322 266066 272727 279685 287383
63444B87383Q287Q421Q591R257J0123J0751J1411J2570J3910J4619J4578J4450
$$ 287383 295670 304091 312682 321939 332062 342813 354224 366794 380704 395323 409901 424351
63432D24351J4536J4239J2928J0673P894M840J836l96j323j374j625k597l792
$$ 424351 438887 453126 466054 476727 484621 489461 491297 490901 489578 488204 486579 483982 480190
63419D80190m482m618m652m746m559l968l614m301n992p717q593q607q264p834
$$ 480190 475708 471090 466438 461692 457133 453165 449551 445250 439258 431541 422948 414341 406077 398243
63405C98243p258o592o022n437m486l190k140j753j636j051J08J277K107K880
$$ 398243 390985 384393 378371 372934 368448 365258 363118 361365 359729 358678 358786 360063 362170 365050
63391C65050L902M924N533N843O369P310Q380R306J0076J0611J0676J0338J0141
$$ 365050 368952 373876 379409 385252 391621 398931 407311 416617 426693 437304 447980 458318 468459
63378D68459J0508J1190J1627J1685J1668J1684J1367J0319Q574O534M587K888
$$ 468459 478967 490157 501784 513469 525137 536821 548188 558507 567081 573615 578202 581090
63366E81090J446K82n28j003j409k054k873l348l094k419k135k879m622o759q488
$$ 581090 582536 582818 582290 581287 579878 577824 574951 571603 568509 566090 563955 561076 556454 549695 541207
63351E41207r219q911q074p344o996o904o802o507n961n304m824m731m954n204
$$ 541207 531988 523077 515003 507659 500663 493759 486957 480450 474489 469185 464361 459630 454676 449472
63337D49472n196m750l828k640j634j216j464k102k663k769k412k055k189k728
$$ 449472 444276 439526 435698 433058 431424 430208 428744 426642 423979 421210 418798 416743 414554 411826
63323D11826l082k921k580k532k774k919k674j982r78n1L25R1k71k82Q0N78R41
$$ 411826 408744 405823 403243 400711 397937 395018 392344 390362 389384 389333 389658 389749 389478 389196 389276 389854 390795
63306C90795O93o46k737m335m618m169l992m076l745l061k811l165l353k877k181
$$ 390795 391488 390842 388105 383770 379152 374983 370991 366915 363170 360109 357298 354133 350780 347903 345722
63291C45722j815j698j514j287j169j129j145j314j607j819j887j875j665j156
$$ 345722 343907 342209 340695 339408 338239 337110 335965 334651 333044 331225 329338 327463 325798 324642
63277C24642p21r26j677k299k448k358k148j620r30o47q64j022q94r21j225j173
$$ 324642 323921 322995 321318 319019 316571 314213 312065 310445 309515 308868 308004 306982 306088 305167 303942 302769
63261C02769m69J31j08p82j057q82o70l54L05Q80O62k50j101j572j907k078j696
$$ 302769 302300 302431 302323 301541 300484 299602 298932 298578 298883 299763 300425 300175 299074 297502 295595 293517 291821
63244B91821q52k40k25l76j74L36P53Q33O12L17L34Q80J642J986J653J021O98
$$ 291821 290969 290729 290504 290128 289954 290290 291043 291876 292488 292805 293139 294019 295661 297647 299300 300321 301019
63227C01019R35J513J948J912J582J516K051K954L771M248M337M051L623L481
$$ 301019 301954 303467 305415 307327 308909 310425 312476 315430 319201 323449 327786 331837 335460 338941
63213C38941L785M228M600N108N792O092N533M488L642L097K627K504L052L621
$$ 338941 342726 346954 351554 356662 362454 368546 374079 378567 382209 385306 387933 390437 393489 397110
63199C97110K971R31j155j953j436m26N19J365K241L151L840L920L490L538N006
$$ 397110 400081 401012 399857 397904 396468 396042 396561 397926 400167 403318 407158 411078 414568 418106 423112
63184D23112P389R021R044Q360Q222Q758R389R949J0492J0619R960R068Q899R477
$$ 423112 430501 439522 448566 456926 465148 473906 483295 493244 503736 514355 524315 533383 542282 551759
63170E51759R892R597Q924Q262P603P060O983P239P091O264N445N168M863L703
$$ 551759 561651 571248 580172 588434 596037 603097 610080 617319 624410 630674 636119 641287 646150 649853
63156F49853J947N50k34r65j881k634l202m046n058n374m741m173m489m962m358
$$ 649853 651800 652350 652116 651151 649270 646636 643434 639388 634330 628956 624215 620042 615553 610591 606233
63141F06233k801j484q91m24L17J047J638K377L052K918J899R32N62K16n68j190
$$ 606233 603432 601948 601057 600633 600950 601997 603635 606012 609064 611982 613881 614813 615375 615591 615023 613833
63125F13833j062p57j031j464j270r17j557l051l865l092j501k86K27L07J72O6
$$ 613833 612771 612014 610983 609519 608249 607332 605775 602724 598859 595767 594266 593980 594207 594514 594686 594752
63109E94752K54M75J1j228k230j983o95N89J233J455J730K223K804L314L760M299
$$ 594752 595006 595481 595492 594264 592034 590051 589356 589945 591178 592633 594363 596586 599390 602704 606464 610763
63093F10763M996N703O324P031P882Q375P943O895O247O467O956O973O520N930
$$ 610763 615759 621462 627786 634817 642699 651074 659017 665912 672159 678626 685582 692555 699075 705005
63079G05005N100L773K227J113O43L25m52j786l193m000l949l464l265l606m126
$$ 705005 710105 713878 716105 717218 717861 718186 717734 715948 712755 708755 704806 701342 698077 694471 690345
63064F90345m413m460m427m398m480m837n347n557n294m978m981n024m570l592
$$ 690345 685932 681472 677045 672647 668167 663330 657983 652426 647132 642154 637173 632149 627579 623987
63050F23987k530j684j041n63k22R0M04N34M62O55J523K700L410L534L716M314
$$ 623987 621457 619773 618732 618169 617947 618037 618441 618975 619437 620092 621615 624315 627725 631259 634975 639289
63034F39289M893M980M862N099N649N927N573M734L688K662K011K024K396K308
$$ 639289 644182 649162 654024 659123 664772 670699 676272 681006 684694 687356 689367 691391 693787 696095
63020F96095J397K94k06k64p84k063l339l854l857m084m617m770m118l072k403
$$ 696095 697492 697786 697580 697316 696532 694469 691130 687276 683419 679335 674718 669948 665830 662758 660355
63005F60355k448k852k855j870l0J844L036L660M340N322O384P499Q937J0571
$$ 660355 657907 655055 652200 650330 650300 652144 655180 658840 663180 668502 674886 682385 691322 701893
62991G01893J1710J1929J1606J1281J0913J0289R661R456R609R748R933J0470
$$ 701893 713603 725532 737138 748419 759332 769621 779282 788738 798347 808095 818028 828498
62979H28498J1056J0744R015O389L757J446p39k927n037p067r225j1737j4669
$$ 828498 839554 850298 859313 865702 869459 870905 870166 867239 862202 855135 845910 834173 819504
62966H19504j7856k0865k3091k4165k4311k4147k4081k4010k3586k2625k1176
$$ 819504 801648 780783 757692 733527 709216 685069 660988 636978 613392 590767 569591
62955E69591j9478j7978j7172j7108j7068j6176j4404j2615j1488j0780r939r022
$$ 569591 550113 532135 514963 497855 480787 464611 450207 437592 426104 415324 405385 396363
62943C96363q487q355q196p887p755p838p602o716n605m928m757m701m534m291
$$ 396363 387876 379521 371325 363438 355683 347845 340243 333527 327922 322994 318237 313536 309002 304711
62929C04711l909l297k630k284k347k529k595k656k912l288l492l329k895k399
$$ 304711 300802 297505 294875 292591 290244 287715 285120 282464 279552 276264 272772 269443 266548 264149
62915B64149j844j094k66J31k33q85r74l37K78K62j01k43k05l16l33L42J617K580
$$ 264149 262305 261211 260945 261076 260843 259958 258984 258647 258925 259187 259086 258843 258638 258322 257989 258331 259948 262528
62897B62528K633K168J868J834J803J848K276L008L596L863M083M407M503M046
$$ 262528 265161 267329 269197 271031 272834 274682 276958 279966 283562 287425 291508 295915 300418 304464
62883C04464L276K704K383J864Q72l07j267j965k561l010l184l236l460l824m027
$$ 304464 307740 310444 312827 314691 315563 315256 313989 312024 309463 306453 303269 300033 296573 292749 288722
62868B88722m062m346n028n553n250m192l228l130l892m770m860l733j841k83
$$ 288722 284660 280314 275286 269733 264483 260291 257063 253933 250041 245271 240411 236678 234837 234554
62854B34554k0j083k564l362k959j662l34K21j74r56j364j170q13p33p65l82M88
$$ 234554 234534 233451 230887 227525 224566 222904 222570 222791 222617 221661 220297 219127 218314 217581 216816 216434 216922
62837B16922J171J016K76j47K02Q23J005O57J29m03r12j109o52K14P85O73J10
$$ 216922 218093 219109 219385 219238 219440 220263 221268 221925 222054 221651 220739 219630 218978 219192 219977 220650 220760
62820B20760o10j416k090k159j525p53l59j99J23N26O16L43M7o4j10k33l89m15
$$ 220760 220150 218734 216644 214485 212960 212207 211848 211649 211772 212298 212914 213257 213304 213240 213130 212897 212508 212093
62802B12093k05J41J88m66j540k061j419j70O12N95L45L60N43O73Q67J325J939
$$ 212093 211888 212029 212217 211751 210211 208150 206731 206561 207173 207768 208113 208473 209016 209689 210556 211881 213820
62785B13820K377K470K335K258K452K845L176L416L895M844N974O804P346P964
$$ 213820 216197 218667 221002 223260 225712 228557 231733 235149 239044 243888 249862 256666 264012 271976
62771B71976Q614Q724P952O709N704N216N030M831M388L548K335J034n2r58k023
$$ 271976 280590 289314 297266 303975 309679 314895 319925 324756 329144 332692 335027 336061 336009 335051 333028
62756C33028l415m755n443n397n333n980p111p793p666p496q047q854q736p391
$$ 333028 329613 324858 319415 314018 308685 302705 295594 287801 280135 272639 264592 255738 247002 239611
62742B39611n776m829m464m060l457l013k976l168l244l014k592k308k349k435
$$ 239611 233835 229006 224542 220482 217025 214012 211036 207868 204624 201610 199018 196710 194361 191926
62728A91926k044j134l41k53o65q35l82L88R81J256J390J587J949K449K908L091
$$ 191926 189882 188748 188407 188154 187489 186654 186272 186660 187641 188897 190287 191874 193823 196272 199180 202271
62712B02271L035L155L800M730N333N453N712O665P926Q622Q708R215J0966J3528
$$ 202271 205306 208461 212261 216991 222324 227777 233489 240154 248080 256702 265410 274625 285591 299119
62698B99119J5792J7302J8424J9537K0594K1542K2592K3822K4833K5067K4333
$$ 299119 314911 332213 350637 370174 390768 412310 434902 458724 483557 508624 532957
62687E32957K2907K1161J9212J6902J4112J1036P995M932J397k754o964j0585
$$ 532957 555864 577025 596237 613139 627251 638287 646282 651214 652611 649857 642893 632308
62675F32308j3580j6224j8391j9717k0394k1050k1791k1976k1221j9991j8872
$$ 632308 618728 602504 584113 564396 544002 522952 501161 479185 457964 437973 419101
62664D19101j7786j6372j4805j3645j3098j2850j2531j1966j1056r792q447p459
$$ 419101 401315 384943 370138 356493 343395 330545 318014 306048 294992 285200 276753 269294
62652B69294p032o934o713o037n000m129l962m466m985m897m200l321k594k104
$$ 269294 262262 255328 248615 242578 237578 233449 229487 225021 220036 215139 210939 207618 205024 202920
62638B02920j883j889j907j682j262j039j366k160k909l111k764k349k160j934
$$ 202920 201037 199148 197241 195559 194297 193258 191892 189732 186823 183712 180948 178599 176439 174505
62624A74505j358q03q91j424j454o95j18n22j206q82M40J450J351P62N70P65P91
$$ 174505 173147 172344 171453 170029 168575 167880 167762 167240 166034 165152 165592 167042 168393 169155 169725 170490 171281
62607A71281M91J97J79M50Q60J130R95O39O91J502K629L333L404L221L199L490
$$ 171281 171772 171969 172148 172598 173458 174588 175583 176222 176913 178415 181044 184377 187781 191002 194201 197691
62591A97691M086M831N385N467N171M787M446M089L704L273K575J458K69m03m90
$$ 197691 201777 206608 211993 217460 222631 227418 231864 235953 239657 242930 245505 246963 247232 246829 246339
62576B46339o14j285k279l008l233l161k995k794k636k647k765k757k507k180
$$ 246339 245725 244440 242161 239153 235920 232759 229764 226970 224334 221687 218922 216165 213658 211478
62562B11478k002j956j837j555j246j094j101j175j347j709k063j948j244n52
$$ 211478 209476 207520 205683 204128 202882 201788 200687 199512 198165 196456 194393 192445 191201 190649
62548A90649n84j252j765j599r93m07M5L60L73N0k25q5L51P85J223J744K068J913
$$ 190649 190065 188813 187048 185449 184456 184049 184094 184454 184827 184877 184652 184567 184918 185703 186926 188670 190738 192651
62530A92651J629J913K889L985M699M974M874M490M267M753N853O861P536Q488
$$ 192651 194280 196193 199082 203067 207766 212740 217614 222104 226371 231124 236977 243838 251374 259862
62516B59862J0166J2073J3479J4469J5590J6800J7445J7240J6651J6303J6347
$$ 259862 270028 282101 295580 310049 325639 342439 359884 377124 393775 410078 426425
62505D26425J6519J6423J5688J4108J1725Q753N476K221o73l075n116o988q836
$$ 426425 442944 459367 475055 489163 500888 509641 515117 517338 516665 513590 508474 501486 492650
62492D92650j0833j2947j4613j5152j4739j4374j4529j4402j3128j1165r686q979
$$ 492650 481817 468870 454257 439105 424366 409992 395463 381061 367933 356768 347082 338103
62480C38103q362p530p026p137p228o560n215l890l155l184l808m526m760m333
$$ 338103 329741 322211 315185 308048 300820 294260 289045 285155 282000 278816 275008 270482 265722 261389
62466B61389l522k610j666p95j98J27M25Q11J178J572K214L068L734L932L771
$$ 261389 257867 255257 253591 252796 252598 252725 253150 253961 255139 256711 258925 261993 265727 269659 273430
62451B73430L444K991K492K084J709J215P80P55R80P81j47j376k393l105l441
$$ 273430 276874 279865 282357 284441 286150 287365 288145 288900 289880 290661 290514 289138 286745 283640 280199
62436B80199l145k399k002k368k848k693k175k050k217j831o74M62Q92Q98J257
$$ 280199 277054 274655 272653 270285 267437 264744 262569 260519 258302 256471 255797 256259 257151 258049 259306
62421B59306K349L959N546O545O705O332N967N819N726N717O133P084Q089Q547
$$ 259306 261655 265614 271160 277705 284410 290742 296709 302528 308254 313971 320104 327188 335277 343824
62407C43824Q365P919P595P548P743Q013Q103P884P477P023O429N543M555L903
$$ 343824 352189 360108 367703 375251 382994 391007 399110 406994 414471 421494 427923 433466 438021 441924
62393D41924L642L234K256J142P35J079J265P32K41R83K960M973O181O970Q182
$$ 441924 445566 448800 451056 452198 452933 454012 455277 456009 456250 457233 460193 465166 471347 478317 486499
62378D86499J0042J2210J4393J6524J8636K0923K3701K6935L0017L2382L4141
$$ 486499 496541 508751 523144 539668 558304 579227 602928 629863 659880 692262 726403
62367G26403L5851L7648L8947L8996L7563L5159L2572L0172K7619K4430K0612
$$ 726403 762254 799902 838849 877845 915408 950567 983139 1013311 1040930 1065360 1085972
62356A085972J6459J1850O485P80m161p958j1529j5755k0167k3673k6128k8223
$$ 1085972 1102431 1114281 1120766 1121546 1117385 1109427 1097898 1082143 1061976 1038303 1012175 983952
62344I83952l0144l1274l1228l0356k9095k7576k6036k4850k3837k2207j9620
$$ 983952 953808 922534 891306 860950 831855 804279 778243 753393 729556 707349 687729
62333F87729j6845j4908j3947j3245j2169j0674r100p832p017o397n471m010k368
$$ 687729 670884 655976 642029 628784 616615 605941 596841 589009 581992 575595 570124 566114 563746
62320E63746j113m81l05k61q9L47R65J453J538J219P27K89K6r3k47o06j107j349
$$ 563746 562633 562152 561847 561586 561497 561844 562809 564262 565800 567019 567746 568035 568061 567968 567721 567115 566008 564659
62302E64659r22J02J038J083J41q12m99J326L447M399L915K953K363K110J896
$$ 564659 563737 563839 564877 565960 566101 565289 564790 566116 569563 573962 577877 580830 583193 585303 587199
62287E87199J967K846M441N920O575O545O532O940P547Q007Q442R343J0940J2903
$$ 587199 589166 592012 596453 602373 608948 615493 622025 628965 636512 644519 652961 662304 673244 686147
62273F86147J4728J6295J7931K0042K2699K5484K7689K8886K9361K9738L0103
$$ 686147 700875 717170 735101 755143 777842 803326 831015 859901 889262 919000 949103
62262I49103K9782K8226K5753K3085K0411J7404J4037J0775P919N186K212q91
$$ 949103 978885 1007111 1032864 1055949 1076360 1093764 1107801 1118576 1126495 1131681 1133893 1133002
62250A133002l722o093q132r969j1546j2776j3747j4606j5258j5304j4531j3291
$$ 1133002 1129280 1123187 1115055 1105086 1093540 1080764 1067017 1052411 1037153 1021849 1007318 994027
62238I94027j2159j1240j0218r063q162p572o788n664m931n157n755n782n383
$$ 994027 981868 970628 960410 951347 943185 935613 928825 923161 918230 913073 907318 901536 896153
62225H96153n466o183o715o629o476o768p242p484p565p618p467p081o852o979
$$ 896153 890687 884504 877789 871160 864684 857916 850674 843190 835625 828007 820540 813459 806607 799628
62211G99628p077o797o339n961n511m809m015l180k005m82P86J474K128L218M205
$$ 799628 792551 785754 779415 773454 767943 763134 759119 755939 753934 753452 754238 755712 757840 761058 765263
62196G65263M437M499N604P848J0039J1328J1982J2468J2707J2589J2501J2852
$$ 765263 769700 774199 779803 787651 797690 809018 821000 833468 846175 858764 871265 884117
62184H84117J3543J4337J5279J6523J8041J9752K1618K3425K4831K5855K6879
$$ 884117 897660 911997 927276 943799 961840 981592 1003210 1026635 1051466 1077321 1104200
62173A104200K7991K8747K8790K8306K7444K5822K3049J9490J6018J3169J0984
$$ 1104200 1132191 1160938 1189728 1218034 1245478 1271300 1294349 1313839 1329857 1343026 1354010
62162A354010R428Q368P198N140K164p64k688l653m456n544o525o821o522o309
$$ 1354010 1363438 1371806 1379004 1384144 1386308 1385544 1382856 1379203 1374747 1369203 1362678 1355857 1349335 1343026
62148A343026o506o544n632l857k271j800k298k875k931k595k274k077j797j298
$$ 1343026 1336520 1329976 1324344 1320487 1318216 1316416 1314118 1311243 1308312 1305717 1303443 1301366 1299569 1298271
62134A298271p31l31n3M05J076J431R92K06K12J466K968L342K431J399J283K033
$$ 1298271 1297540 1297209 1297156 1297561 1298637 1300068 1301060 1301266 1301478 1302944 1305912 1309254 1311685 1313084 1314367 1316400
62118A316400K930L518L758L676L178K293J389J066J692K887L695L491K711K311
$$ 1316400 1319330 1322848 1326606 1330282 1333460 1335753 1337142 1338208 1339900 1342787 1346482 1349973 1352684 1354995
62104A354995K605L054L289L715M822O434Q070R738J1840J4395J6859J8582J9063
$$ 1354995 1357600 1360654 1363943 1367658 1372480 1378914 1386984 1396722 1408562 1422957 1439816 1458398 1477461
62091A477461J7941J5320J2209J0042R542J0223J1084J1462J1206J0435R324P866
$$ 1477461 1495402 1510722 1522931 1532973 1542515 1552738 1563822 1575284 1586490 1596925 1606249 1614115
62079A614115N766K932J40j370j314r14j528l022m114m139l792m039n010o248
$$ 1614115 1619881 1622813 1622953 1621583 1620269 1619355 1617827 1614805 1610691 1606552 1602760 1598721 1593711 1587463
62065A587463p554q968j0262j1104j1749j2965j4993j6990j7958j7962j7946j8450
$$ 1587463 1579909 1570941 1560679 1549575 1537826 1524861 1509868 1492878 1474920 1456958 1439012 1420562
62053A420562j9101j9454j9648j9900j9861j9032j7603j6251j5305j4588j3999
$$ 1420562 1401461 1382007 1362359 1342459 1322598 1303566 1285963 1269712 1254407 1239819 1225820
62042A225820j3680j3570j3360j2925j2376j1688j0805j0143j0269j1019j1586
$$ 1225820 1212140 1198570 1185210 1172285 1159909 1148221 1137416 1127273 1117004 1105985 1094399
62031A094399j1702j1920j2455j2602j1943j1264j1505j2384j2942j2982j3013
$$ 1094399 1082697 1070777 1058322 1045720 1033777 1022513 1011008 998624 985682 972700 959687
62020I59687j3119j2951j2628j2623j2743j2261j1172j0347j0146r863q974q044
$$ 959687 946568 933617 920989 908366 895623 883362 872190 861843 851697 841834 832860 824816
62008H24816p856q248q532q517q461q398q156p912q108q879r882j0656j0866j0413
$$ 824816 816960 808712 800180 791663 783202 774804 766648 758736 750628 741749 731867 721211 710345 699932
61994F99932r629r216r616j0503j1124j1047j0390r472q602q020p805p754p596
$$ 699932 690303 681087 671471 660968 649844 638797 628407 618935 610333 602313 594508 586754 579158
61981E79158p235o656n797m758l955l742l907l896l436k701j862q56K72J133J360
$$ 579158 571923 565267 559470 554712 550757 547015 543108 539212 535776 533075 531213 530357 530629 531762 533122
61966E33122J115R71J361K191L151M128N207O293P036P243P204P406Q081R158
$$ 533122 534237 535208 536569 538760 541911 546039 551246 557539 564575 571818 579022 586428 594509 603667
61952F03667J0520J2033J3437J4499J5335J6262J7323J8289J9112K0032K1114
$$ 603667 614187 626220 639657 654156 669491 685753 703076 721365 740477 760509 781623
61941G81623K2011K2415K2460K2478K2544K2554K2553K2721K3039K3266K3288
$$ 781623 803634 826049 848509 870987 893531 916085 938638 961359 984398 1007664 1030952
61930A030952K3398K4087K5528K7338K9031L0787L3521L7905M3573M9558N5502
$$ 1030952 1054350 1078437 1103965 1131303 1160334 1191121 1224642 1262547 1306120 1355678 1411180
61919A411180O1982O9649P8486Q7964R7571J07073J16599J26538J36934J46931
$$ 1411180 1473162 1542811 1621297 1709261 1806832 1913905 2030504 2157042 2293976 2440907
61909B440907J55234J61202J64896J65910J62828J54277J40025J20559R6204O7441
$$ 2440907 2596141 2757343 2922239 3088149 3250977 3405254 3545279 3665838 3762042 3829483
61899C829483L5707L049k9079o0060q9064j14476j34706j49267j58785j64114
$$ 3829483 3865190 3868239 3839160 3779100 3690036 3575560 3440854 3291587 3132802 2968688
61889B968688j65730j63895j59158j52465j44696j36232j27127j17627j08183
$$ 2968688 2802958 2639063 2479905 2327440 2182744 2046512 1919385 1801758 1693575
61880A693575r9019r0084q1480p3551o6375n9640n3225m7463m2434l7562l2351
$$ 1693575 1594556 1504472 1422992 1349441 1283066 1223426 1170201 1122738 1080304 1042742 1010391
61869A010391k7116k2466j8406j4572j1034q122n613k888R5K733M774O707Q896
$$ 1010391 983275 960809 942403 927831 916797 908675 903062 900174 900269 903002 907776 914483 923379
61856I23379J0963J2442J3516J4640J5726J6184J5652J4351J2704J0929R022P031
$$ 923379 934342 946784 960300 974940 990666 1006850 1022502 1036853 1049557 1060486 1069508 1076539
61844A076539N130L481K068Q91J66J53P38J495K291L432M933O025N907M727L332
$$ 1076539 1081669 1085150 1087218 1088109 1088275 1088428 1089166 1090661 1092952 1096384 1101317 1107342 1113249 1117976 1121308
61829A121308K145Q24j005l238n565p764r664j1104j2070j2540j2314j1386j0225
$$ 1121308 1123453 1124277 1123272 1120034 1114469 1106705 1097041 1085937 1073867 1061327 1049013 1037627 1027402
61816A027402r128p494m544q05K090L390M111N579P882J0412J3088J6148J9294
$$ 1027402 1018274 1010780 1006236 1005431 1007521 1010911 1015022 1020601 1028483 1038895 1051983 1068131 1087425
61803A087425K2070K4748K7879L1159L3777L5945L9043M3918M9942N6177O2740
$$ 1087425 1109495 1134243 1162122 1193281 1227058 1263003 1302046 1345964 1395906 1452083 1514823
61792A514823P0330P9098Q8674R9044J10543J23172J36526J50535J65675J82275
$$ 1514823 1585153 1664251 1752925 1851969 1962512 2085684 2222210 2372745 2538420 2720695
61782B720695K00034K18336K36714K54711K71524K85895K96243L00740K97570
$$ 2720695 2920729 3139065 3375779 3630490 3902014 4187909 4484152 4784892 5082462
61773E082462K85355K63404K31598J90418J41251Q6383K8416l0191q6884j38828
$$ 5082462 5367817 5631221 5862819 6053237 6194488 6280871 6309287 6279096 6192212 6053384
61763F053384j83581k20027k48272k68677k81389k86763k85644k79016k67793
$$ 6053384 5869803 5649776 5401504 5132827 4851438 4564675 4279031 4000015 3732222
61754C732222k53187k36880k20314k04032j87969j72268j57445j43834j31275
$$ 3732222 3479035 3242155 3021841 2817809 2629840 2457572 2300127 2156293 2025018
61745B025018j19420j08203r7914q8913q1219p4413o7996o1823n6063n0794m5940
$$ 2025018 1905598 1797395 1699481 1610568 1529349 1454936 1386940 1325117 1269054 1218260 1172320
61734A172320m1600l8016l5034l2003k8531k5072k2381k0668j9572j8704j7813
$$ 1172320 1130720 1092704 1057670 1025667 997136 972064 949683 929015 909443 890739 872926
61723H72926j6650j5175j3791j2969j2643j2335j1779j1074j0360r777r598r931
$$ 872926 856276 841101 827310 814341 801698 789363 777584 766510 756150 746373 736775 726844
61711G26844j0389j0499j0415j0636j1107j1188j0649j0002r671r429q950q361
$$ 726844 716455 705956 695541 684905 673798 662610 651961 641959 632288 622859 613909 605548
61699F05548p912p514p010o536o158n549m402k969j798j141r80j286j844k091
$$ 605548 597636 590122 583112 576576 570418 564869 560467 557498 555700 554559 553579 552293 550449 548358
61685E48358j700j167j244j862k184j849j559k166l541m749n163n048n090n575
$$ 548358 546658 545491 544247 542385 540201 538352 536793 534627 531086 526337 521174 516126 511036 505461
61671E05461o144o221n658m872m329l981l336k125p08K57N25M96P58J446K117
$$ 505461 499317 493096 487438 482566 478237 474256 470920 468795 468087 468344 468869 469365 470123 471569 473686
61656D73686K239J730R28J78m80j139j805k388k895l420m010m588m973m932m340
$$ 473686 475925 477655 478583 478761 478281 477142 475337 472949 470054 466634 462624 458036 453063 448131 443791
61641D43791l408k660k492k740k860k533j918j304p69l47k43n79j043j129p01
$$ 443791 440383 437723 435231 432491 429631 427098 425180 423876 423107 422760 422517 421938 420895 419766 419065
61626D19065l9O44J248J455Q67j75n83J38R99O68p16j772j760j382j453j798j909
$$ 419065 419026 419670 420918 422373 423240 423065 422482 422620 423619 424287 423571 421799 420039 418657 417204 415406 413497
61609D13497j887k038k120j804j464j733k451k829k537j965j413p65l6L92K57
$$ 413497 411610 409572 407452 405648 404184 402451 400000 397171 394634 392669 391256 390491 390455 390847 391104
61594C91104l00j036j757k144j932j312p02r8P95J837K489K754L333M554N832
$$ 391104 390804 389768 388011 385867 383935 382623 381921 381823 382618 384455 386944 389698 393031 397585 403417
61579D03417O568O914P246P451P397P590Q612J0295J2040J3724J5488J6954J7511
$$ 403417 409985 416899 424145 431596 438993 446583 455195 465490 477530 491254 506742 523696 541207
61566E41207J7349J7293J7415J6699J4537J1804R781Q533P105N102L201K048J351
$$ 541207 558556 575849 593264 609963 624500 636304 646085 654618 661723 666825 670026 672074 673425
61553F73425N39k69m85o3L75N17Q21J725K737K878J891N64k27m03m46o52r32j177
$$ 673425 673964 673695 673210 673147 673522 674039 674860 676585 679322 682200 684091 684655 684428 684025 683579 682927 681995 680818
61535F80818j522k144l021l951m675m948m571l539k181r80j31O39J597K493K909
$$ 680818 679296 677152 674131 670180 665505 660557 655986 652447 650266 649286 649155 649794 651391 653884 656793
61520F56793L149M228O630R462J1478J2718J4526J7856K2156K6105K9065L1475
$$ 656793 659942 664170 670800 680262 691740 704458 718984 736840 758996 785101 814166 845641
61508H45641L4196L7786M2274M7323N2522N7619O2485O6982P1015P4638P7806
$$ 845641 879837 917623 959897 1007220 1059742 1117361 1179846 1246828 1317843 1392481 1470287
61497A470287Q0071Q0870Q0140P8275P5425P1217O5273N7611M8450L8047K7061
$$ 1470287 1550358 1631228 1711368 1789643 1865068 1936285 2001558 2059169 2107619 2145666 2172727
61486B172727J6592P413n91p791j3886j8140k0455k1675k2689k3586k3961k3739
$$ 2172727 2189319 2196732 2196141 2188350 2174464 2156324 2135869 2114194 2091505 2067919 2043958 2020219
61474B020219k3468k3868k5301k7651l0546l3547l6228l8271l9628m0392m0411
$$ 2020219 1996751 1972883 1947582 1919931 1889385 1855838 1819610 1781339 1741711 1701319 1660908
61463A660908l9212l6575l3026k9389k5914k2228j8181j4249j0857p727m314o27
$$ 1660908 1621696 1585121 1552095 1522706 1496792 1474564 1456383 1442134 1431277 1423550 1419236 1418609
61451A418609K833N803Q474J0983J3125J4850J6708J9402K2873K6256K8853L0899
$$ 1418609 1421442 1427245 1435719 1446702 1459827 1474677 1491385 1510787 1533660 1559916 1588769 1619668
61439A619668L2916L4565L4721L2830K9539K5665K1154J5678R838M891J349j311
$$ 1619668 1652584 1687149 1721870 1754700 1784239 1809904 1831058 1846736 1856574 1861465 1862814 1861503
61427A861503l557n162n859n900n634n075m199l119j747J84K313L483K836P17
$$ 1861503 1857946 1852784 1846925 1841025 1835391 1830316 1826117 1822998 1821251 1821435 1823748 1827231 1830067 1830784
61413A830784j946m793q023j1653j5385j8989k2267k4706k5721k5290k4030k2573
$$ 1830784 1828838 1824045 1816022 1804369 1788984 1769995 1747728 1723022 1697301 1672011 1647981 1625408
61401A625408k1137j9586j7769j5795j4137j3207j2743j1923j0276q155o011l638
$$ 1625408 1604271 1584685 1566916 1551121 1536984 1523777 1511034 1499111 1488835 1480680 1474669 1471031
61389A471031o09K936O484R930J3675J8071K3170K8907L5089M1380M7619N4019
$$ 1471031 1470422 1473358 1479842 1489772 1503447 1521518 1544688 1573595 1608684 1650064 1697683 1751702
61377A751702O0606O6696P1481P4966P7650P9470P9715P8090P5037P0834O5008
$$ 1751702 1812308 1879004 1950485 2025451 2103101 2182571 2262286 2340376 2415413 2486247 2551255
61366B551255N7074M7344L6649K5572J4398L453p014j7062k6702l5362m2333m7865
$$ 2551255 2608329 2655673 2692322 2717894 2732292 2735745 2728731 2711669 2684967 2649605 2607272 2559407
61354B559407n3329n9814o6756p2417p5703p7108p7709p7763p6722p4296p0805
$$ 2559407 2506078 2446264 2379508 2307091 2231388 2154280 2076571 1998808 1922086 1847790 1776985
61343A776985o6596o1756n6595n1723m7349m2985l8258l3523k9265k5375k1550
$$ 1776985 1710389 1648633 1592038 1540315 1492966 1449981 1411723 1378200 1348935 1323560 1302010
61332A302010j7945j4730j1315o948j964K333N270P493R870J2353J4378J5850
$$ 1302010 1284065 1269335 1258020 1251072 1249108 1251441 1256711 1264204 1274074 1286427 1300805 1316655
61320A316655J7092J8227J9125J9930K1046K2528K3859K4486K4378K3870K3123
$$ 1316655 1333747 1351974 1371099 1391029 1412075 1434603 1458462 1482948 1507326 1531196 1554319
61309A554319K1921J9952J7120J3580R644N721K210p06l089n015o470p522q383
$$ 1554319 1576240 1596192 1613312 1626892 1636536 1642257 1644467 1643761 1640672 1635657 1629187 1621665 1613282
61296A613282r043r099q318p218o652o843p233p287o955o303n263l895k450r52
$$ 1613282 1604239 1595140 1586822 1579604 1572952 1566109 1558876 1551589 1544634 1538331 1533068 1529173 1526723 1525771
61282A525771Q33K883M804O380P759Q978R901J0741J1871J2863J2605J0946R332
$$ 1525771 1526604 1529487 1534291 1540671 1548430 1557408 1567309 1578050 1589921 1602784 1615389 1626335 1635667
61269A635667R009R415R253Q462P858P291N598K426j157m147o591q757j0209j0358
$$ 1635667 1644676 1654091 1663344 1671806 1679664 1686955 1692553 1694979 1693822 1689675 1683084 1674327 1664118 1653760
61255A653760r260p361m866j695K294P296J3390K0076K6491L2296L7937M3739
$$ 1653760 1644500 1637139 1632273 1630578 1632872 1640168 1653558 1673634 1700125 1732421 1770358 1814097
61243A814097M9057N2677N3755N2072M7706M0856L1902K1314R587k607j4320k4623
$$ 1814097 1863154 1915831 1969586 2021658 2069364 2110220 2142122 2163436 2173023 2170416 2156096 2131473
61231B131473l3035l9622m4743m8669n1306n2240n1089m7829m2867l6907l0884
$$ 2131473 2098438 2058816 2014073 1965404 1914098 1861858 1810769 1762940 1720073 1683166 1652282
61220A652282k5711k1902j9542j8641j9250k1083k3435k5766k8041l0145l1377
$$ 1652282 1626571 1604669 1585127 1566486 1547236 1526153 1502718 1476952 1448911 1418766 1387389
61209A387389l1036k9205k6407k2788j8192j2852p278j711L684Q181J0927J1994
$$ 1387389 1356353 1327148 1300741 1277953 1259761 1246909 1239631 1237920 1241604 1249785 1260712 1272706
61197A272706J2222J1915J0516P871M895K586R15p71k782m993p300r639j1782
$$ 1272706 1284928 1296843 1307359 1315230 1320125 1322711 1323626 1322855 1320073 1315080 1307780 1298141 1286359
61184A286359j3518j4905j6112j7214j8323j9606k0877k1468k0938j9709j8537
$$ 1286359 1272841 1257936 1241824 1224610 1206287 1186681 1165804 1144336 1123398 1103689 1085152
61173A085152j7497j5992j3818j1707j0490j0036r482q372p032n765m323k570
$$ 1085152 1067655 1051663 1037845 1026138 1015648 1005612 996130 987758 980726 974961 970638 968068
61161I68068j096m37pJ253L263M723M819L862K110r14n227r632j3108j6022j9008
$$ 968068 966972 966535 966528 967781 971044 975767 980586 984448 986558 985644 980417 970785 957677 941655 922647
61146I22647k1523k2731k3098k3682k4356k4156k3084k2071k1266j9944j8057
$$ 922647 901124 878393 855295 831613 807257 783101 760017 737946 716680 696736 678679
61135F78679j6362j4849j2682j0016q246p809p346n909m468m118m056k816n64
$$ 678679 662317 647468 634786 624770 616524 608715 601369 595460 590992 586874 582818 580002 579438
61122E79438J270K113K561K971L093L150L986N839P866R215R925J0431J0731J0524
$$ 579438 580708 582821 585382 588353 591446 594596 598582 604421 612287 621502 631427 641858 652589 663113
61108F63113R823Q954P950O342L801Q34j593l149m394n680o362n718m256l210
$$ 663113 672936 681890 689840 696182 699983 700817 699224 696075 691681 686001 679639 673921 669665 666455
61094F66455k976k886k553k339k328j894q15J2l34j581k696l091k853k225j477
$$ 666455 663479 660593 658040 655701 653373 651479 650664 650676 650342 648761 646065 642974 640121 637896 636419
61079F36419j007j066j379j386p74K90J343J979K251K622L335L964M052L856L928
$$ 636419 635412 634346 632967 631581 630807 631097 632440 634419 636670 639292 642627 646591 650643 654499 658427
61064F58427M245M439M633N095N378M834L995M149N430O513O523O040N788N591
$$ 658427 662672 667111 671744 676839 682217 687051 691046 695195 700625 707138 713661 719701 725489 731080
61050G31080N198M999N219N325N013M799N018N130M786M654N410O693P846Q902
$$ 731080 736278 741277 746496 751821 756834 761633 766651 771781 776567 781221 786631 793324 801170 810072
61036H10072J0047J1018J1856J3388J5955J8457J9688K0083K1002K2774K4473
$$ 810072 820119 831137 842993 856381 872336 890793 910481 930564 951566 974340 998813
61025I98813K5356K5650K6019K6980K8625L0468L1865L2866L4157L5880L7351
$$ 998813 1024169 1049819 1075838 1102818 1131443 1161911 1193776 1226642 1260799 1296679 1334030
61014A334030L8327L9669M2157M5484M9076N3029N7619O2730O8381P4784Q1313
$$ 1334030 1372357 1412026 1454183 1499667 1548743 1601772 1659391 1722121 1790502 1865286 1946599
61003A946599Q6596R0403R4345R9935J07217J16110J27578J42126J58643J76122
$$ 1946599 2033195 2123598 2217943 2317878 2425095 2541205 2668783 2810909 2969552 3145674
60993C145674J95393K17849K43898K74216L11111L57122M13634M82217N65123
$$ 3145674 3341067 3558916 3802814 4077030 4388141 4745263 5158897 5641114 6206237
60984F206237O62542P72181Q95032J039798J218637J441657J720062K068431K488252
$$ 6206237 6868779 7640960 8535992 9575790 10794427 12236084 13956146 16024577 18512829
60975A8512829K940181L338419L583712L609033L401318K994943K459093J888415
$$ 18512829 21453010 24791429 28375141 31984174 35385492 38380435 40839528 42727943
60967D2727943J383325J014380P92622O71326N75270M30701J80919k03204p09714
$$ 42727943 44111268 45125648 45918270 46589596 47164866 47595567 47776486 47573282 46863568
60958D6863568j282885j847245k344347k747864l046636l224747l267167l180212
$$ 46863568 45580683 43733438 41389091 38641227 35594591 32369844 29102677 25922465
60950B5922465k995401k750797k474109k183871j897392j630255j390880j181033
$$ 25922465 22927064 20176267 17702158 15518287 13620895 11990640 10599760 9418727
60942I418727j000902q50449p27069o25705n41722m72021m13888l64728l22791
$$ 9418727 8417825 7567376 6840307 6214602 5672880 5200859 4786971 4422243 4099452
60933D099452k86739k54917k26195k00831j79285j60939j45059j32009j22102
$$ 4099452 3812713 3557796 3331601 3130770 2951485 2790546 2645487 2513478 2391376
60924B391376j14148j06693r9949r4925r1237q7398q2817p8012p3167o7996o2779
$$ 2391376 2277228 2170535 2070586 1975661 1884424 1797026 1714209 1636197 1563030 1495034 1432255
60913A432255n8118n3858m9489m5474m2771m1081l8958l5823l2696l0690k9729
$$ 1432255 1374137 1320279 1270790 1225316 1182545 1141464 1102506 1066683 1033987 1003297 973568
60902I73568k9052k8145k6852k5166k3277k1501k0065j9148j8757j8373j7187
$$ 973568 944516 916371 889519 864353 841076 819575 799510 780362 761605 743232 726045
60891G26045j5162j3351j2538j2102j0945r054p358o432o109o079o050n557m358
$$ 726045 710883 697532 684994 672892 661947 652893 645535 639103 632994 626915 620865 615308 610950
60878F10950k903j814j171q12q69j416j986k173k299k786l291l242k817k535k233
$$ 610950 608047 606233 605062 604250 603381 601965 599979 597806 595507 592721 589430 586188 583371 580836 578603
60863E78603j342O3J306K007K171J732P91P4K43R12J110O52K76N05J100J533J423
$$ 578603 577261 577324 578630 580637 582808 584540 585331 585405 585648 586560 587670 588322 588598 589103 590203 591736 593159
60846E93159O11o39j655k106k499l450m789n902o522o609o019n005m527n234o523
$$ 593159 593770 593131 591476 589370 586871 583421 578632 572730 566208 559599 553580 548575 544048 538814 532291
60831E32291p389p735p960p873p105o132n769n927n956n927o340o832o445n140
$$ 532291 524902 517167 509207 501334 494229 488097 482328 476401 470445 464518 458178 451346 444901 439761
60817D39761l881l207k802k481k387k209j397k69K62J99N18J528K337K398K371
$$ 439761 435880 432673 429871 427390 425003 422794 421397 421128 421390 421589 422107 423635 425972 428370 430741
60802D30741K975L949M686N029N034M637M049L717L626L278K605K056J687J096
$$ 430741 433716 437665 442351 447380 452414 457051 461100 464817 468443 471721 474326 476382 478069 479165
60788D79165M67O20J520J922J131J02J7N31M36n69j674k190k198k164k404k909
$$ 479165 479632 480252 481772 483694 484825 484927 484944 485475 485911 485342 483668 481478 479280 477116 474712 471803
60772D71803l310l326l302l882m968n636n418m978n052n331n021l997k816j944
$$ 471803 468493 465167 461865 457983 453015 447379 441961 436983 431931 426600 421579 417582 414766 412822
60758D12822j574j794k395k731k345j508q01m02j91j85l97n05k70j6k32q37j361
$$ 412822 411248 409454 407059 404328 401983 400475 399674 399272 399081 398896 398499 397994 397724 397708 397476 396639 395278
60741C95278j696k080k388k089j067N0P15J227K244L644M415L889K753K311K863
$$ 395278 393582 391502 389114 387025 385958 386008 386723 387950 390194 393838 398253 402142 404895 407206 410069
60726D10069L367K833J471J56o42r22o99j99j70j090k301k740k422k278k613k720
$$ 410069 413436 416269 417740 417896 417254 416332 415633 415434 415264 414174 411873 409133 406711 404433 401820 399100
60710C99100k210j676j652j820j776j735j897j773q86L34J025R11M42J60L97J155
$$ 399100 396890 395214 393562 391742 389966 388231 386334 384561 383675 384009 385034 385945 386387 386547 386944 388099
60694C88099J913J921J115L48L16O45N44n2n55n90k39L07Q27R50N33L0L2N25R38
$$ 388099 390012 391933 393048 393396 393712 394357 394901 394849 394294 393704 393465 393772 394599 395549 396082 396112 396144 396669 397607
60675C97607Q89N14J56K5J78O00J298K297L356L844L361K481K222K622K628J754
$$ 397607 398496 399010 399166 399191 399369 399969 401267 403564 406920 410764 414125 416606 418828 421450 424078 425832
60659D25832J046J646L148M261M583M712M838M443L426K448J883J273K62o94j048
$$ 425832 426878 428524 431672 435933 440516 445228 450066 454509 457935 460383 462266 463539 463801 463107 462059
60644D62059j061j383k108k739k953k907k865k922l090l324l408k989j961p33
$$ 462059 460998 459615 457507 454768 451815 448908 446043 443121 440031 436707 433299 430310 428349 427616
60630D27616o8m91j788l115l775l857l949m214m154l466k776l058m316n438n465
$$ 427616 427548 427057 425269 422154 418379 414522 410573 406359 402205 398739 395963 392905 388589 383151 377686
60615C77686m643l903l692l770l856l883l646k897j821q87o7J083K418L070K831
$$ 377686 373043 369140 365448 361678 357822 353939 350293 347396 345575 344688 344621 345704 348122 351192 354023
60600C54023K802L911N429N984N512N082N032M639L686L035L144L160K161N14
$$ 354023 356825 360736 366165 372149 377661 382743 387775 392414 396100 399135 402279 405439 407600 408114
60586D08114p60j342j646j972k301k579k669k237j226j55M63P30J020J372J625
$$ 408114 407354 406012 404366 402394 400093 397514 394845 392608 391382 391227 391690 392420 393440 394812 396437
60571C96437J808J936J779J386J387K140K894K602J441P29J325K800M247N235
$$ 396437 398245 400181 401960 403346 404733 406873 409767 412369 413810 414539 415864 418664 422911 428146
60557D28146N686N515M861M301M346M925N664O481P517Q644R535J0250J1380J3298
$$ 428146 433832 439347 444208 448509 452855 457780 463444 469925 477442 486086 495621 505871 517251 530549
60543E30549J5622J7750J9791K2559K6558L1426L6603M2119M8380N5509O3341
$$ 530549 546171 563921 583712 606271 632829 664255 700858 742977 791357 846866 910207
60532I10207P1961Q1602R1970J02038J10473J15973J17313J13624J04838R1518
$$ 910207 982168 1063770 1155740 1257778 1368251 1484224 1601537 1715161 1819999 1911517
60522A911517P4227N3490L0395O684j5882l5890n2141o3881p1439p5944p8115
$$ 1911517 1985744 2039234 2069629 2076313 2060431 2024541 1972400 1908519 1837080 1761136 1683021
60511A683021p7760p4774p0001o4603n9022n3035m6447l9215l1294k2834j4331
$$ 1683021 1605261 1530487 1460486 1395883 1336861 1283826 1237379 1198164 1166870 1144036 1129705
60500A129705o087K264J1295K1053L1165M1446N2021O2909P3866Q4390R3551J00040
$$ 1129705 1123618 1125882 1137177 1158230 1189395 1230841 1282862 1345771 1419637 1504027 1597578 1697618
60488A697618J02721J01117R5191Q4989P0927N4217L6763K0547P273j819o163
$$ 1697618 1800339 1901456 1996647 2081636 2152563 2206780 2243543 2264090 2271363 2269544 2263381
60477B263381n757o74R087K3209M0857O1014Q2441J03077J20041J30758J33759
$$ 2263381 2257624 2256950 2266037 2289246 2330103 2391117 2473558 2576635 2696676 2827434 2961193
60466B961193J28152J13122Q8684N6500J9260k0517o0499r7971j30245j55731
$$ 2961193 3089345 3202467 3291151 3347651 3366911 3346394 3285895 3187924 3057679 2901948
60456B901948j73945j84726j88121j85050j77239j66335j53504j39755j26010
$$ 2901948 2728003 2543277 2355156 2170106 1992867 1826532 1673028 1533273 1407263
60447A407263j12771j00194q8535p8028o8472n9575n1624m5201m0198l5821l1643
$$ 1407263 1294492 1194298 1105763 1027735 959263 899688 848064 802863 762665 726844 695201
60436F95201k7916k4684k1328j7491j3817j1269j0032r523r274r324r788j0446
$$ 695201 667285 642601 621273 603782 589965 578696 568664 559141 549867 540543 530755 520309
60424E20309j0798j0471r566q596p998p752p492o897n856m434k940j903j621j821
$$ 520309 509511 499040 489474 480878 472880 465128 457636 450739 444883 440449 437509 435606 433985 432164
60410D32164j954j739j230n13L47J136J666J991K208K229K187K710M236O095O949
$$ 432164 430210 428471 427241 426728 427075 428211 429877 431868 434076 436305 438492 441202 445438 451533 458482
60395D58482O282M923L916L446L114K769K626K767K940K838K352J639R83O17N93
$$ 458482 464764 469687 473603 477049 480163 482932 485558 488325 491265 494103 496455 498094 499077 499694 500287
60380E00287P77R16P11J1r52j755k303k879l567l959l738l192k767k464k099j816
$$ 500287 501064 501980 502691 502702 501750 499995 497692 494813 491246 487287 483549 480357 477590 475126 473027 471211
60364D71211j812j849j638j505k015l021l713l629l048k374j700j068o26l96l12
$$ 471211 469399 467550 465912 464407 462392 459371 455658 452029 448981 446607 444907 443839 443213 442817 442505
60349D42505l85n49m53O9N35M52J44K63O36M73k67p44o06n17r79j559j701j504
$$ 442505 442120 441571 441118 441187 441722 442174 442318 442581 443217 443690 443423 442679 442073 441556 440577 439018 437317 435813
60331D35813j182n74K47O25K55q2M53J526K096J872J553J808K618L487L857L402
$$ 435813 434631 434057 434304 434929 435184 435102 435555 437081 439177 441049 442602 444410 447028 450515 454372 457774
60315D57774K420J718J788K257K458K313K214K297K297K076J806J734J978K491
$$ 457774 460194 461912 463700 465957 468415 470728 472942 475239 477536 479612 481418 483152 485130 487621
60301D87621K975L039K676K430K856M074N931Q168J0158J1088J0852J0228R603
$$ 487621 490596 493635 496311 498741 501597 505671 511602 519770 529928 541016 551868 562096 571699
60288E71699Q039M531j49l918n753o627p902r582j0650j0540r609q390o988n267
$$ 571699 579738 584269 584120 580202 574449 567822 559920 550338 539688 529148 519539 511149 504161 498894
60274D98894l378j815r09l61M20J491K272K528K923M032N247N506M943M831N741
$$ 498894 495516 493701 492792 492431 492851 494342 496614 499142 502065 506097 511344 516850 521793 526624 532365
60259E32365O725O814O481O822P898Q760Q892Q755Q829Q925Q675Q209P936P997
$$ 532365 539090 545904 552385 559207 567105 575865 584757 593512 602341 611266 619941 628150 636086 644083
60245F44083Q209Q404Q575Q852R460J0623J2357J4446J6669J8888K0933K2693
$$ 644083 652292 660696 669271 678123 687583 698206 710563 725009 741678 760566 781499 804192
60233H04192K4503K7056L0601L4445L7625M0015M2291M4838M7168M8606M9129
$$ 804192 828695 855751 886352 920797 958422 998437 1040728 1085566 1132734 1181340 1230469
60222A230469M9157M8785M7671M5606M2864L9890L6827L3388K9186K4144J8703
$$ 1230469 1279626 1328411 1376082 1421688 1464552 1504442 1541269 1574657 1603843 1627987 1646690
60211A646690J3563R180N539K371n59l341n837p612q188p589o448n458m772m050
$$ 1646690 1660253 1669433 1674972 1677343 1676784 1673443 1667606 1659994 1651806 1644217 1637769 1632311 1627539 1623489
60197A623489k796n44K951P398J2067J6415K0459K4342K7971L1333L4719L8105
$$ 1623489 1620693 1620149 1623100 1630498 1642565 1658980 1679439 1703781 1731752 1763085 1797804 1835909
60185A835909M0692M1692M1312M0268L8481L5148L0053K3967J7521J0542K940
$$ 1835909 1876601 1918293 1959605 1999873 2038354 2073502 2103555 2127522 2145043 2155585 2158525
60174B158525m577j1257j7281k3286k9228l4366l8225m0955m2738m3364m2549
$$ 2158525 2153948 2142691 2125410 2102124 2072896 2038530 2000305 1959350 1916612 1873248 1830699
60163A830699m0349l7047l2817k7735k2044j6202j0506m803J177P221J2641J7001
$$ 1830699 1790350 1753303 1720486 1692751 1670707 1654505 1643999 1639196 1640373 1647594 1660235 1677236
60151A677236K0434K3019K4368K4279K3320K2098K0250J6996J2594Q277M781J847
$$ 1677236 1697670 1720689 1745057 1769336 1792656 1814754 1835004 1852000 1864594 1872871 1877652 1879499
60139A879499o42k092k164j368n7K288O018J0329J4224J7827K1784K5811K8899
$$ 1879499 1878857 1876765 1874601 1873233 1873176 1875464 1881482 1891811 1906035 1923862 1945646 1971457 2000356
60126B000356L0787L2205L3693L5266L7340M0990M6724N3735O0887O7971P5474
$$ 2000356 2031143 2063348 2097041 2132307 2169647 2210637 2257361 2311096 2371983 2439954 2515428
60115B515428Q3472R1263R8011J03343J07263J09696J10237J08343J03705R6426
$$ 2515428 2598900 2690163 2788174 2891517 2998780 3108476 3218713 3327056 3430761 3527187
60105C527187Q6799P5136O1835M7421L2328J6799J167j4053k8529m2293n5164
$$ 3527187 3613986 3689122 3750957 3798378 3830706 3847505 3848672 3834619 3806090 3763797 3708633
60094C708633o6366p5224q1931q6985r0061r0211q7290q2343p6270o8880n9756
$$ 3708633 3642267 3567043 3485112 3398127 3308066 3217855 3130565 3048222 2971952 2903072 2843316
60083B843316m9532l9528l0412k1947j4013p194k091J533M541P491J0187J2074
$$ 2843316 2793784 2754256 2723844 2701897 2687884 2680690 2678599 2680132 2684673 2692164 2702351 2714425
60071B714425J2823J2514J1381R627P362M609J233k960p981j3520j9142k4554
$$ 2714425 2727248 2739762 2751143 2760770 2768132 2772741 2773974 2771014 2763033 2749513 2730371 2705817
60059B705817k9690l4660l9620m4593m9254n3137n6174n8778o1154o2782o2980
$$ 2705817 2676127 2641467 2601847 2557254 2508000 2454863 2398689 2339911 2278757 2215975 2152995
60048B152995o1762n9589n6378n1460m4842l7756l1354k5265j8225j0018j929
$$ 2152995 2091233 2031644 1975266 1923806 1878964 1841208 1809854 1784589 1766364 1756346 1754417
60037A754417M978J1253J8100K5621L2693L8444M2988M6591M8867M9251M7700
$$ 1754417 1759395 1770648 1788748 1814369 1847062 1885506 1928494 1975085 2023952 2073203 2120903
60026B120903M4527L9935L4265K8211K2112J5290O939k402j1089j8238k4462l0484
$$ 2120903 2165430 2205365 2239630 2267841 2289953 2305243 2312182 2309780 2298691 2280453 2255991 2225507
60014B225507l5838l9559m1467m2054m1539l9829l7104l3666k9352k3857j7625
$$ 2225507 2189669 2150110 2108643 2066589 2025050 1985221 1948117 1914451 1885099 1861242 1843617
60003A843617j1661o369j199M411J0395J6494K2691K8881L4675L9970M5221N0643
$$ 1843617 1831956 1825587 1824388 1828799 1839194 1855688 1878379 1907260 1941935 1981905 2027126 2077769
59991B077769N5596N9209O1372O2562O2959O2266O0161N6354N0384M2175L2843
$$ 2077769 2133365 2192574 2253946 2316508 2379467 2441733 2501894 2558248 2608632 2650807 2683650
59980B683650K4077J6429Q833K32q968j7668k5546l2945l9571m4410m6998m7879
$$ 2683650 2707727 2724156 2732989 2733221 2724253 2706585 2681039 2648094 2608523 2564113 2517115 2469236
59968B469236m7620m6131m3375l9893l6043l1371k5404j8615j1764m724L178J1680
$$ 2469236 2421616 2375485 2332110 2292217 2256174 2224803 2199399 2180784 2169020 2164296 2167474 2179154
59956B179154J9415K5389K9939L3937L7700M0904M3107M3996M3521M2061M0147
$$ 2179154 2198569 2223958 2253897 2287834 2325534 2366438 2409545 2453541 2497062 2539123 2579270
59945B579270L7775L4306K9339K3407J7559J2475Q153M250N20k909n555o972p096
$$ 2579270 2617045 2651351 2680690 2704097 2721656 2734131 2742284 2746534 2747054 2744145 2738590 2731618 2724522
59932B724522n924l051J961Q752J6362K4466L3730M4687N6780O8944Q0634R1840
$$ 2724522 2718598 2715547 2717508 2726260 2742622 2767088 2800818 2845505 2902285 2971229 3051863 3143703
59920C143703J02519J12396J20999J27484J30839J30600J26851J19306J07071
$$ 3143703 3246222 3358618 3479617 3607101 3737940 3868540 3995391 4114697 4221768
59911D221768R0014O9670M8000K5707K602k0753m2786o2043p7713q9304r6815
$$ 4221768 4311782 4381452 4429452 4455159 4457761 4437008 4394222 4332179 4254466 4165162 4068347
59900D068347j01192j03490j03513j00311r4079q6448p8461o9455n8588m6577
$$ 4068347 3967155 3863665 3760152 3659841 3565762 3479314 3400853 3331398 3272810 3226233
59890C226233l4953k4213j3585k375R250K0695L1622M2136N2605O3050P2552P9567
$$ 3226233 3191280 3167067 3153482 3151107 3160357 3181052 3212674 3254810 3307415 3370465 3443017 3522584
59878C522584Q3204Q3809Q1854P6702O7101N2816L5129J5797m000k3665m2634
$$ 3522584 3605788 3689597 3771451 3848153 3915254 3968070 4003199 4018996 4014996 3991331 3948697
59867C948697o0065p4870q6124r3621r7974r9956r9882r7885r4439r0087q4804
$$ 3948697 3888632 3813762 3727638 3634017 3536043 3436087 3336205 3238320 3143881 3053794 2968990
59856B968990p8307p0936o3591n6682m9779m2511l5099k7666j9789j1474l920
$$ 2968990 2890683 2819747 2756156 2699474 2649695 2607184 2572085 2544419 2524630 2513156 2509236
59845B509236J669N893J0746J7237K4283L0198L4450L7407L9092L8986L6826L2820
$$ 2509236 2510905 2516798 2527544 2544781 2569064 2599262 2633712 2671119 2710211 2749197 2786023 2818843
59833B818843K7120J9759J1209K545n166j1474j6505k0615k4086k6987k9337l1527
$$ 2818843 2845963 2865722 2876931 2879476 2874310 2862836 2846331 2825716 2801630 2774643 2745306 2713779
59821B713779l4303l7929m1624m4262m5542m5923m5626m4421m2424m0305l8451
$$ 2713779 2679476 2641547 2599923 2555661 2510119 2464196 2418570 2374149 2331725 2291420 2252969
59810B252969l6605l4697l3306l2926l3250l3732l4208l4529l4110l2558l0372
$$ 2252969 2216364 2181667 2148361 2115435 2082185 2048453 2014245 1979716 1945606 1913048 1882676
59799A882676k8318k6449k4274k1592j8383j4269q889k722L335R230J5777K3428
$$ 1882676 1854358 1827909 1803635 1782043 1763660 1749391 1740502 1737780 1741115 1750345 1766122 1789550
59787A789550L1795M0569N0061O0541P1684Q3053R4404J05076J13547J18213J18308
$$ 1789550 1821345 1861914 1911975 1972516 2044200 2127253 2221657 2326733 2440280 2558493 2676801
59776B676801J13562J03395Q7142O5196L9416J2331j3868l7611n7781p3648q4857
$$ 2676801 2790363 2893758 2980900 3046096 3085512 3097843 3083975 3046364 2988583 2914935 2830078
59765B830078r1272r2903r0191q4301p6740o8442n9430m9675m0040l1790k5203
$$ 2830078 2738806 2645903 2555712 2471411 2394671 2326229 2266799 2217124 2177084 2145294 2120091
59754B120091j9427j3830q790m676q80L347P653J1214J4303J8089K2876K7674
$$ 2120091 2100664 2086834 2078044 2073368 2072488 2075835 2083488 2094702 2109005 2127094 2149970 2177644
59742B177644L1860L6237M1899M8828N6241O3816P1833Q0462Q9605R9272J09636
$$ 2177644 2209504 2245741 2287640 2336468 2392709 2456525 2528358 2608820 2698425 2797697 2907333
59731B907333J20689J32234J44090J56060J67864J79315J90284K00144K07547
$$ 2907333 3028022 3160256 3304346 3460406 3628270 3807585 3997869 4198013 4405560
59722D405560K11342K11607K09244K04615J97280J87275J76116J65840J57283
$$ 4405560 4616902 4828509 5037753 5242368 5439648 5626923 5803039 5968879 6126162
59713F126162J49923J43442J38742J36878J37410J38543J38904J38452J37331
$$ 6126162 6276085 6419527 6558269 6695147 6832557 6971100 7110004 7248456 7385787
59704G385787J34599J28818J19649J08112R5368Q1743O7024N1103L4335J7747
$$ 7385787 7520386 7649204 7768853 7876965 7972333 8054076 8121100 8172203 8206538 8224285
59694H224285K979q519j6394k1182k3138k1745j6419p075O141K3041M3033O5008
$$ 8224285 8227264 8218745 8202351 8181169 8158031 8136286 8119867 8112792 8118933 8141974 8185007 8250015
59682H250015Q8029J11696J35726J59660J83271K06441K28088K45854K57575K62655
$$ 8250015 8338044 8449740 8585466 8745126 8928397 9134838 9362926 9608780 9866355 10129010
59672A0129010K61223K52324K33993K05119J66508J20063O7800J1848m5335j01351
$$ 10129010 10390233 10642557 10876550 11081669 11248177 11368240 11436040 11447888 11402553 11301202
59662A1301202j54109k01481k41209k71603k92265l03856l07534l04891k98230
$$ 11301202 11147093 10945612 10704403 10432800 10140535 9836679 9529145 9224254 8926024
59653H926024k90358k83795k80177k80102k83320k88963k95787l02366l07278
$$ 8926024 8635666 8351871 8071694 7791592 7508272 7219309 6923522 6621156 6313878
59644F313878l09367l07981l02975k94515k83019k69153k53689k37206k20145
$$ 6313878 6004511 5696530 5393555 5099040 4816021 4546868 4293179 4055973 3835828
59635C835828k03063j86539j70763j55548j40878j27099j14317j02074r0063p8938
$$ 3835828 3632765 3446226 3275463 3119915 2979037 2851938 2737621 2635547 2545484 2466546
59625B466546o9676o2229n5463m8569m1914l6236l1663k7941k5099k3229k1906
$$ 2466546 2396870 2334641 2279178 2230609 2188695 2152459 2120796 2092855 2067756 2044527 2022621
59614B022621k0599j9486j9213j9780k0354k0468k0716k1910k3884k5629k6406
$$ 2022621 2002022 1982536 1963323 1943543 1923189 1902721 1882005 1860095 1836211 1810582 1784176
59603A784176k6387k6216k6157k5848k4832k3309k2052k1521k1335k0925k0360
$$ 1784176 1757789 1731573 1705416 1679568 1654736 1631427 1609375 1587854 1566519 1545594 1525234
59592A525234j9973j9410j7882j5331j2591j0284q283o472n135m119k497J94L044
$$ 1525234 1505261 1485851 1467969 1452638 1440047 1429763 1421480 1415008 1409873 1405754 1403257 1403451 1406495
59579A406495M863N741O791Q600J0721J2505J3832J5102J6918J9570K2513K4731
$$ 1406495 1411358 1417099 1423890 1432490 1443211 1455716 1469548 1484650 1501568 1521138 1543651 1568382
59567A568382K6069K7606L0156L3057L5328L7379M0417M4576M8826N2622N6418
$$ 1568382 1594451 1622057 1652213 1685270 1720598 1757977 1798394 1842970 1891796 1944418 2000836
59556B000836O0504O4551O8508P2832P7374Q1160Q3647Q5434Q7186Q8649Q9189
$$ 2000836 2061340 2125891 2194399 2267231 2344605 2425765 2509412 2594846 2682032 2770681 2859870
59545B859870Q8543Q6529Q2639P6481O8154N7853M5695L2269J8697N620p216j9852
$$ 2859870 2948413 3034942 3117581 3194062 3262216 3320069 3365764 3398033 3416730 3422350 3415134 3395282
59533C395282l1246m0189m6727n1981n6792o1025o3923o4650o2729n8496n2940
$$ 3395282 3364036 3323847 3277120 3225139 3168347 3107322 3043399 2978749 2916020 2857524 2804584
59522B804584m6719l9519l0677k0160q459M151J7692L1846M5779N8750P0604Q1503
$$ 2804584 2757865 2718346 2687669 2667509 2659050 2663201 2680893 2712739 2758518 2817268 2887872 2969375
59510B969375R1186R8581J02342J01762R7050Q8561P6199N9933M0574J9391k860
$$ 2969375 3060561 3159142 3261484 3363246 3460296 3548857 3625056 3684989 3725563 3744954 3742094
59499C742094k5762m8227o8530q5553r9225j09562j16190j19021j18667j15732
$$ 3742094 3716332 3668105 3599575 3514022 3414797 3305235 3189045 3070024 2951357 2835625
59489B835625j10386j02974r4309q4965p4880o4097n3101m2055l0610j8951q175
$$ 2835625 2725239 2622265 2527956 2442991 2368111 2304014 2250913 2208858 2178248 2159297 2151122
59478B151122J221J0300K0148L0086L8472M4857N0108N4690N8013N9515N9279
$$ 2151122 2152343 2162643 2182791 2212877 2251349 2296206 2346314 2401004 2459017 2518532 2577811
59467B577811N7299N2938M5646L5787K4404J2382k9j2994k6410l9540n1466o1958
$$ 2577811 2635110 2688048 2733694 2769481 2793885 2806267 2806238 2793244 2766834 2727294 2675828 2613870
59455B613870p1299p9228q4638q6946q7136q6824q6486q5311q2597p8683p4472
$$ 2613870 2542571 2463343 2378705 2291759 2204623 2117799 2031313 1946002 1863405 1784722 1710250
59444A710250p0478o6475o1893n6575n1095m6149m1756l7562l3806l1074k8964
$$ 1710250 1639772 1573297 1511404 1454829 1403734 1357585 1315829 1278267 1244461 1213387 1184423
59433A184423k6056k1719j7014j3196j0214p455n037l278j593Q56L857O602R074
$$ 1184423 1158367 1136648 1119634 1106438 1096224 1088769 1083732 1080454 1078861 1079717 1083574 1090176 1099250
59420A099250J1770J4273J5300J4267J1917R355P158N367L659J742J83M10L038
$$ 1099250 1111020 1125293 1140593 1154860 1166777 1176132 1183290 1188657 1192316 1194058 1194241 1194651 1197689
59407A197689O619R109J0160J0811J1348J1030R889R179R627J0667J1872J3827
$$ 1197689 1204308 1213417 1223577 1234388 1245736 1256766 1266655 1275834 1285461 1296128 1308000 1321827
59395A321827J6959K0587K3966K7387L1477L6134M0881M5690N0730N5731O0214
$$ 1321827 1338786 1359373 1383339 1410726 1442203 1478337 1519218 1564908 1615638 1671369 1731583
59384A731583O4078O7542P0816P4175P7978Q2336Q7113R2419R8688J06149J14726
$$ 1731583 1795661 1863203 1934019 2008194 2086172 2168508 2255621 2348040 2446728 2552877 2667603
59373B667603J24622J36300J49628J63722J77942J92329K06644K19615K29738
$$ 2667603 2792225 2928525 3078153 3241875 3419817 3612146 3818790 4038405 4268143
59364D268143K36367K39562K39364K35734K28819K18863K06163J91450J75807
$$ 4268143 4504510 4744072 4983436 5219170 5447989 5666852 5873015 6064465 6240272
59355F240272J59704J42478J23257J01999P9172N4803K8553N03k8797n9056r0350
$$ 6240272 6399976 6542454 6665711 6767710 6846882 6901685 6930238 6930741 6901944 6842888 6752538
59344F752538j22282j53404j81724k05735k24898k39309k49010k53711k53261
$$ 6752538 6630256 6476852 6295128 6089393 5864495 5625186 5376176 5122465 4869204
59335D869204k48161k39441k28090k14967k01079j87454j74496j61823j48971
$$ 4869204 4621043 4381602 4153512 3938545 3737466 3550012 3375516 3213693 3064722
59326C064722j36071j23709j12412j02366r3406q5025p6706o8434o0751n4183
$$ 3064722 2928651 2804942 2692530 2590164 2496758 2411733 2335027 2266593 2205842 2151659
59316B151659m8680m3689l8721l3730k9081k5073k1608j8408j5603j3611j2366
$$ 2151659 2102979 2059290 2020569 1986839 1957758 1932685 1911077 1892669 1877066 1863455 1851089
59305A851089j1158r665q529q356q629q460q003q078q621q659p905p161o829o106
$$ 1851089 1839931 1830266 1821737 1813381 1804752 1796292 1788289 1780211 1771590 1762931 1755026 1747865 1741036 1734930
59291A734930m308k015j20J650M350Q299J2692J6660K0166K3821K8030L2378L5846
$$ 1734930 1730622 1728607 1728487 1730137 1734487 1742786 1755478 1772138 1792304 1816125 1844155 1876533 1912379
59278A912379L7856L8973M0241M1827M2815M2293L9966L5576K8554J8749O980
$$ 1912379 1950235 1989208 2029449 2071276 2114091 2156384 2196350 2231926 2260480 2279229 2286209
59267B286209n627j8468l1255m3312n3592o1217o5875o7898o8139o7405o5841
$$ 2286209 2280582 2262114 2230859 2187547 2133955 2072738 2006863 1938965 1870826 1803421 1737580
59256A737580o3137n9391n5367n1744m8542m5358m1785l7478l2406k7096k2211
$$ 1737580 1674443 1615052 1559685 1507941 1459399 1414041 1372256 1334778 1302372 1275276 1253065
59245A253065j7826j3747j0324q081o465m077n28K974N432P437J0007J3033J5862
$$ 1253065 1235239 1221492 1211168 1203087 1196622 1192545 1192017 1194991 1200423 1207860 1217867 1230900 1246762
59232A246762J8615K1848K5426K8846L2371L6753M1973M7339N2717N8787O5972
$$ 1246762 1265377 1287225 1312651 1341497 1373868 1410621 1452594 1499933 1552650 1611437 1677409
59221A677409P3977Q2533R1786J01728J11864J21762J31447J40968J49906J57539
$$ 1677409 1751386 1833919 1925705 2027433 2139297 2261059 2392506 2533474 2683380 2840919
59211B840919J63115J65839J64868J59639J50085J36435J18902R7562P2577M4522
$$ 2840919 3004034 3169873 3334741 3494380 3644465 3780900 3899802 3997364 4069941 4114463
59201D114463J4672j5263m3722o9720r2655j11922j26883j37133j42809j44695
$$ 4114463 4129135 4113872 4070150 4000430 3907775 3795853 3668970 3531837 3389028 3244333
59191C244333j43847j40811j35360j27360j17725j07866r8283q8481p8303o8443
$$ 3244333 3100486 2959675 2824315 2696955 2579230 2471364 2373081 2284600 2206297 2137854
59181B137854n9315n0361m1242l2859k6363k1604j7569j4035j1847j1622j3004
$$ 2137854 2078539 2028178 1986936 1954077 1927714 1906110 1888541 1874506 1862659 1851037 1838033
59170A838033j5324j8194k1232k3795k5412k6218k6696k7044k6972k6060k4234
$$ 1838033 1822709 1804515 1783283 1759488 1734076 1707858 1681162 1654118 1627146 1601086 1576852
59159A576852k1895j9480j7026j4384j1817r912q833q093p269o528o180o166o312
$$ 1576852 1554957 1535477 1518451 1504067 1492250 1482338 1473505 1465412 1458143 1451615 1445435 1439269 1432957
59146A432957o738p603q686r584j0155j0543j0975j1672j2574j3084j2560j1293
$$ 1432957 1426219 1418616 1409930 1400346 1390191 1379648 1368673 1357001 1344427 1331343 1318783 1307490
59134A307490j0353j0232j0215r630q866q595q527p835o436m971l705k287n13
$$ 1307490 1297137 1286905 1276690 1267060 1258194 1249599 1241072 1233237 1226801 1221830 1218125 1215838 1215325
59121A215325J345L060M698O344P990R680J1348J2537J2797J2285J1637J1186
$$ 1215325 1216670 1219730 1224428 1230772 1238762 1248442 1259790 1272327 1285124 1297409 1309046 1320232
59109A320232J0648R584P966O287N184M851M756M311L792M119N573P347Q701R904
$$ 1320232 1330880 1340464 1348430 1354717 1359901 1364752 1369508 1373819 1377611 1381730 1387303 1394650 1403351 1413255
59095A413255J1593J3849J6440J9365K2459K4990K6506K7673K9369L1215L1809
$$ 1413255 1424848 1438697 1455137 1474502 1496961 1521951 1548457 1576130 1605499 1636714 1668523
59084A668523L0300K7014K2645J7620J2123O087q61q826j6999k4142k9662l3862
$$ 1668523 1698823 1725837 1748482 1766102 1778225 1784312 1783451 1774625 1757626 1733484 1703822 1669960
59072A669960l7339m0534m3529m5774m6355m5100m3018m1055l8965l6210l3311
$$ 1669960 1632621 1592087 1548558 1502784 1456429 1411329 1368311 1327256 1288291 1252081 1218770
59061A218770l1215k9665k7559k4767k2356k0868j9588j7797j5671j3608j1639
$$ 1218770 1187555 1157890 1130331 1105564 1083208 1062340 1042752 1024955 1009284 995676 984037
59050I84037r812q329o859m652j752P25J973K393K626K488J443m54k717m992o953
$$ 984037 974225 965896 959037 954385 952633 953358 955331 957724 960350 962838 964281 963827 961110 956118 949165
59035I49165q152q530q674r000r052q217o733n387m450l561k528j591q57rJ204
$$ 949165 941013 932483 923809 914809 905757 897540 890807 885420 880970 877409 874881 873290 872433 872424 873628
59020H73628K522L443L849M165M989O590Q774J1023J2755J3612J3851J4370J5957
$$ 873628 876150 879593 883442 887607 892596 899186 907960 918983 931738 945350 959201 973571 989528
59007I89528J8334K0354K1365K1962K3012K4476K5734K6587K7132K6871K4904
$$ 989528 1007862 1028216 1049581 1071543 1094555 1119031 1144765 1171352 1198484 1225355 1250259
58996A250259K1082J6199J0943N393k92n420r464j2664j5517j7962j9460j9661
$$ 1250259 1271341 1287540 1298483 1303876 1303584 1298164 1288700 1276036 1260519 1242557 1223097 1203436
58984A203436j8774j7408j6161j5211j4280j3134j1971j1026j0024q497o570m839
$$ 1203436 1184662 1167254 1151093 1135882 1121602 1108468 1096497 1085471 1075447 1066950 1060380 1055541
58972A055541l477k071m03J233K662M167N898P407Q285Q815R581J0605J1298J1268
$$ 1055541 1052064 1049993 1049590 1050823 1053485 1057652 1063550 1070957 1079242 1088057 1097638 1108243 1119541 1130809
58958A130809J0786J0365J0007R168P541N683M520M294M393M399M715N832P453
$$ 1130809 1141595 1151960 1161967 1171135 1178676 1184359 1188879 1193173 1197566 1201965 1206680 1212512 1219965
58945A219965Q888J0000J1147J2408J3443J4031J4341J4739J5704J7568K0071
$$ 1219965 1228853 1238853 1250000 1262408 1275851 1289882 1304223 1318962 1334666 1352234 1372305
58934A372305K2508K4747K7622L1725L6359M0328M3261M5390M6501M6217M4891
$$ 1372305 1394813 1419560 1447182 1478907 1515266 1555594 1598855 1644245 1690746 1736963 1781854
58923A781854M3179M1062L8419L6205L5743L6868L8226L9501M1943M6421N2328
$$ 1781854 1825033 1866095 1904514 1940719 1976462 2013330 2051556 2091057 2133000 2179421 2231749
58912B231749N8904O6289P4664Q3500R2405J01717J11550J21170J30003J38429
$$ 2231749 2290653 2356942 2431606 2515106 2607511 2709228 2820778 2941948 3071951 3210380
58902C210380J46972J55537J64053J72885J81785J89331J94337J97083J98291
$$ 3210380 3357352 3512889 3676942 3849827 4031612 4220943 4415280 4612363 4810654
58893D810654J97569J93864J86877J77000J64285J48378J29197J06804Q1002N2049
$$ 4810654 5008223 5202087 5388964 5565964 5730249 5878627 6007824 6114628 6195630 6247679
58883F247679K1599q088l5883o2083q6997j09994j30043j46627j59965j70657
$$ 6247679 6269278 6261190 6225307 6163224 6076227 5966233 5836190 5689563 5529598 5358941
58873E358941j79169j85409j88967j89836j88658j86020j82026j76785j70786
$$ 5358941 5179772 4994363 4805396 4615560 4426902 4240882 4058856 3882071 3711285
58864C711285j64344j57242j49531j42054j35398j28812j21168j12720j04870
$$ 3711285 3546941 3389699 3240168 3098114 2962716 2833904 2712736 2600016 2495146
58855B495146r8198r1818q4905p7948p1891o6746o1681n6166n0470m5093m0210
$$ 2495146 2396948 2305130 2220225 2142277 2070386 2003640 1941959 1885793 1835323 1790230 1750020
58844A750020l5732l1610k7821k4215k0581j6937j3562j0627p902n029j909J320
$$ 1750020 1714288 1682678 1654857 1630642 1610061 1593124 1579562 1568935 1561033 1556004 1554095 1555415
58832A555415M566P783J0864J3866J7191K1130K5271K8890L1825L4533L7343M0231
$$ 1555415 1559981 1567764 1578628 1592494 1609685 1630815 1656086 1684976 1716801 1751334 1788677 1828908
58820A828908M3258M6517M9548N1636N2957N4718N7733O1537O5370O9429P4550
$$ 1828908 1872166 1918683 1968231 2019867 2072824 2127542 2185275 2246812 2312182 2381611 2456161
58809B456161Q1073Q8617R6749J05359J14511J24250J34455J44747J54757J64448
$$ 2456161 2537234 2625851 2722600 2827959 2942470 3066720 3201175 3345922 3500679 3665127
58799C665127J73737J81830J87620J90878J92231J91613J87523J78492J64640
$$ 3665127 3838864 4020694 4208314 4399192 4591423 4783036 4970559 5149051 5313691
58790E313691J47104J26427J02308P4749M4806J4286j4938m1566o5259q6232j04420
$$ 5313691 5460795 5587222 5689530 5764279 5809085 5823371 5808433 5766867 5701608 5615376 5510956
58779E510956j19419j31456j41744j51359j60257j67870j74110j79175j82782
$$ 5510956 5391537 5260081 5118337 4966978 4806721 4638851 4464741 4285566 4102784
58770D102784j84225j83050j79193j72850j64639j55537j46185j36582j26793
$$ 4102784 3918559 3735509 3556316 3383466 3218827 3063290 2917105 2780523 2653730
58761B653730j17369j08635j00144r1457q2922p5013o7448n9795n2410m5898m0006
$$ 2653730 2536361 2427726 2327582 2236125 2153203 2078190 2010742 1950947 1898537 1852639 1812633
58750A812633l4042k8087k2842j8381j4076r745n936k938m13J852L603M844O086
$$ 1812633 1778591 1750504 1727662 1709281 1695205 1685460 1679524 1676586 1676173 1678025 1681628 1686472 1692558
58737A692558P549Q674Q976Q914R474J1003J2791J3683J2924J0476O758K118l350
$$ 1692558 1700107 1708781 1717757 1726671 1736145 1747148 1759939 1773622 1786546 1797022 1803780 1805898 1802548
58724A802548r542j6140k2793k9252l5227m0319m4309m7343m9596n1041n1602
$$ 1802548 1793006 1776866 1754073 1724821 1689594 1649275 1604966 1557623 1508027 1456986 1405384
58713A405384n1242m9730m6845m3032l9345l6278l3113k8971k4090j9410j5233
$$ 1405384 1354142 1304412 1257567 1214535 1175190 1138912 1105799 1076828 1052738 1033328 1018095
58702A018095j1060o734l085j192j359k955n106p457j0290j3819j7463k0208k1595
$$ 1018095 1007035 1000301 997216 996024 994665 991710 986604 979147 968857 955038 937575 917367 895772
58689H95772k1876k1148j9133j6074j2945j0217p107k780K284O906J0740J4366
$$ 895772 873896 852748 833615 817541 804596 794379 787272 784492 786776 793682 804422 818788
58677H18788J8138K1725K4655K6635K7491K7332K6722K6228K6039K6179K6551
$$ 818788 836926 858651 883306 909941 937432 964764 991486 1017714 1043753 1069932 1096483
58666A096483K6275K3762J8301J1068L672l728j1856k0441k8186l4431l9424m2957
$$ 1096483 1122758 1146520 1164821 1175889 1179561 1175833 1163977 1143536 1115350 1080919 1041495 998538
58654I98538m4129m2830m0276l7524l4402l0487k6264k2600j9652j7030j4597
$$ 998538 954409 911579 871303 833779 799377 768890 742626 720026 700374 683344 668747
58643F68747j2490j0531q276n666l252j664r22m17M31J444J918J623J252J520
$$ 668747 656257 645726 637450 631784 628532 626868 625946 625529 625960 627404 629322 630945 632197 633717
58629F33717K234K716K882L280M164N223O238P455R057J0787J2290J3500J4620
$$ 633717 635951 638667 641549 644829 648993 654216 660454 667909 676966 687753 700043 713543 728163
58616G28163J5948J7771K0096K2521K4600K6408K8401L0778L3359L6051L9078
$$ 728163 744111 761882 781978 804499 829099 855507 883908 914686 948045 984096 1023174
58605A023174M2586M6358M9960N3081N5661N7821N9569O0487N9906N7532N3704
$$ 1023174 1065760 1112118 1162078 1215159 1270820 1328641 1388210 1448697 1508603 1566135 1619839
58594A619839M8885M3103L6111K7814J8404Q345j557j0469j8164k4918l0545l4120
$$ 1619839 1668724 1711827 1747938 1775752 1794156 1802501 1800944 1790475 1772311 1747393 1716848 1682728
58582A682728l5151l4519l3567l2578l0786k7669k3608j9414j5785j3151j1482
$$ 1682728 1647577 1613058 1579491 1546913 1516127 1488458 1464850 1445436 1429651 1416500 1405018
58571A405018j0169q560o611m861l761l320l220l149l142l645n026p042r209j1605
$$ 1405018 1394849 1386289 1379678 1374817 1371056 1367736 1364516 1361367 1358225 1354580 1349554 1342512 1333303 1321698
58557A321698j4660j8132k1109k3307k5529k8421l1590l4363l6508l7774l7702
$$ 1321698 1307038 1288906 1267797 1244490 1218961 1190540 1158950 1124587 1088079 1050305 1012603
58546A012603l6586l5582l5107l4100l1753k8961k6968k5567k3812k1653j9539
$$ 1012603 976017 940435 905328 871228 839475 810514 783546 757979 734167 712514 692975
58535F92975j7175j4252j1753j0928j1330j1386j0626r801r067p806o228n454
$$ 692975 675800 661548 649795 638867 627537 616151 605525 595724 586657 578851 572623 567169
58523E67169n596n331l864k072j155j175j405j323p93K8P78J377K414M329O452
$$ 567169 561573 556242 552378 550306 549151 547976 546571 545248 544455 544483 545261 546638 549052 553381 559833
58508E59833P775Q429R250J0115J0115R413R369J0413J1179J0444Q802P634P392
$$ 559833 567608 576037 585287 595402 605517 614930 624299 634712 645891 656335 665137 672771 680163
58495F80163P597P826P947P776P233O529N877N259M606L864K806J246n17j970
$$ 680163 687760 695586 703533 711309 718542 725071 730948 736207 740813 744677 747483 748729 748212 746242
58481G46242l073m236n639p094q488r756j0564j0617j0244j0009r881r431q693
$$ 746242 743169 738933 733294 726200 717712 707956 697392 686775 676531 666522 656641 647210 638517
58468F38517q124p842p603p390p318p130o492n656n069m567l685k581j828j473
$$ 638517 630393 622551 614948 607558 600240 593110 586618 580962 575893 571326 567641 565060 563232 561759
58454E61759j162r11r39q84j32J240K579L577M299M597M285L574K706J608N25
$$ 561759 560597 559686 558747 557863 557731 558971 561550 565127 569426 574023 578308 581882 584588 586196 586721
58439E86721K65R07J263O33J15P28J375M75j241j628l51R27J312J481J793J786
$$ 586721 586986 587893 589156 589789 589904 590632 592007 592482 591241 589613 589262 590189 591501 592982 594775 596561
58423E96561J669K326L479L737K816J938J791J859K071L125M756N546N102M694
$$ 596561 598230 600556 604035 607772 610588 612526 614317 616176 618247 621372 626128 631674 636776 641470
58409F41470N044N245M574L823L967M812N682O264O272N418M224L670L781L690
$$ 641470 646514 651759 656333 660156 664123 668935 674617 680881 687153 692571 696795 700465 704246 707936
58395G07936L151K752K585K242J999K426K842K041N22oO25Q82L63M87J960L770
$$ 707936 711087 713839 716424 718666 720665 723091 725933 727974 728496 728490 729115 729997 730360 730847 732807 736577
58379G36577N244O844Q240Q020O153M574M345M406M029M243N648O958P116O905
$$ 736577 741821 748665 756905 764925 771078 775652 779997 784403 788432 792675 798323 805281 812397 819302
58365H19302P156P239O603O058O235O401N990N647N736N610N246N701O893P038
$$ 819302 826458 833697 840300 846358 852593 858994 864984 870631 876367 881977 887223 892924 899817 906855
58351I06855N554M381N045O403O845O752P142P685P737P810Q468R173R528J0078
$$ 906855 912409 916790 921835 928238 935083 941835 948977 956662 964399 972209 980677 989850 999378 1009456
58337A009456J0782J0529R396R305J1108J2969J3182J2606J2739J3385J3923J4919
$$ 1009456 1020238 1030767 1040163 1049468 1060576 1073545 1086727 1099333 1112072 1125457 1139380 1154299
58325A154299J6693J8114J8544J9116K0516K1447K1042K0677K1465K2055K0989
$$ 1154299 1170992 1189106 1207650 1226766 1247282 1268729 1289771 1310448 1331913 1353968 1374957
58314A374957J9334J8703J8516J7440J5893J4977J4416J3638J3338J4018J4563
$$ 1374957 1394291 1412994 1431510 1448950 1464843 1479820 1494236 1507874 1521212 1535230 1549793
58303A549793J4170J4075J5463J7336J8366J9064K0312K1551K2334K3697K6020
$$ 1549793 1563963 1578038 1593501 1610837 1629203 1648267 1668579 1690130 1712464 1736161 1762181
58292A762181K7628K7539K7505K9165L1400L2754L4172L6879L9850M1911M4205
$$ 1762181 1789809 1817348 1844853 1874018 1905418 1938172 1972344 2009223 2049073 2090984 2135189
58281B135189M7837N1230N2473N2288N2042N1068M8648M6401M5858M5835M5000
$$ 2135189 2183026 2234256 2286729 2339017 2391059 2442127 2490775 2537176 2583034 2628869 2673869
58270B673869M4604M5753M6498M4986M2972M2858M3655M3395M3140M4912M7879
$$ 2673869 2718473 2764226 2810724 2855710 2898682 2941540 2985195 3028590 3071730 3116642 3164521
58259C164521N0378N3439N8444O3589O6590O8814P2681P7221Q0280Q3022Q7887
$$ 3164521 3214899 3268338 3326782 3390371 3456961 3525775 3598456 3675677 3755957 3838979 3926866
58248C926866R4099R9397J04285J10399J16759J21868J27337J35156J43689J50705
$$ 3926866 4020965 4120362 4224647 4335046 4451805 4573673 4701010 4836166 4979855 5130560
58238E130560J57865J67597J78277J87379J96614K08877K22902K36234K50417
$$ 5130560 5288425 5456022 5634299 5821678 6018292 6227169 6450071 6686305 6936722
58229F936722K67649K85490L01054L17281L38528L63156L87417M13384M45427
$$ 6936722 7204371 7489861 7790915 8108196 8446724 8809880 9197297 9610681 10056108
58220A0056108M81927N18591N57354O03622O57232P14876P78986Q55136R42955
$$ 10056108 10538035 11056626 11613980 12217602 12874834 13589710 14368696 15223832 16166787
58211A6166787J039219J148046J278225J432484J609786J816724K066346K367661
$$ 16166787 17206006 18354052 19632277 21064761 22674547 24491271 26557617 28925278
58203B8925278K727335L160070L685653M316545N057953N916405O898282Q009445
$$ 28925278 31652613 34812683 38498336 42814881 47872834 53789239 60687521 68696966
58195F8696966R275000J0754873J2522880J4636761J7138042K0032486K3177268
$$ 68696966 77971966 88726839 101249719 115886480 133024522 153057008 176234276
58188A76234276K6144725K8248077K8780991K7291202K3699108J8270924J1549217
$$ 176234276 202379001 230627078 259408069 286699271 310398379 328669303 340218520
58181C40218520M245654k940165r489053j5079777j9484214k2518293k4121052
$$ 340218520 344464174 341524009 332034956 316955179 297470965 274952672 250831620
58174B50831620k4431481k3735539k2336427k0481082j8370033j6176359j4032907
$$ 250831620 226400139 202664600 180328173 159847091 141477058 125300699 111267792
58167A11267792j2019620j0177350q526506p066518n769376m590830l491350k437871
$$ 111267792 99248172 89070822 80544316 73477798 67708422 63117592 59626242 57188371
58159E7188371j386080k84947Q70446J983122K869712L348272L316417K765066
$$ 57188371 55802291 55517344 56387790 58370912 61240624 64588896 67905313 70670379
58151G0670379J763821M60489r38127k241289l347113m228094m858213n192745
$$ 70670379 72434200 72894689 71956562 69715273 66368160 62140066 57281853 52089108
58143E2089108n224217n018207m669753m244301l776470l300549k852219k448917
$$ 52089108 46864891 41846684 37176931 32932630 29156160 25855611 23003392 20554475
58135B0554475k091430j781820j524047j311915j132690r81143q58161p58814
$$ 20554475 18463045 16681225 15157178 13845263 12712573 11731430 10873269 10114455
58127A0114455o73935o01251n43714m98649m58719m21932l90997l64177l36067
$$ 10114455 9440520 8839269 8295555 7796906 7338187 6916255 6525258 6161081 5825014
58118E825014l06433k79638k56106k32332k08500j88352j72081j56715j42985
$$ 5825014 5518581 5238943 4982837 4750505 4542005 4353653 4181572 4024857 3881872
58109C881872j34625j31051j27494j22323j18008j14980j10718j04958r9992r5660
$$ 3881872 3747247 3616196 3488702 3366379 3248371 3133391 3022673 2917715 2817723 2722063
58099B722063q9442q1712p5753p2419o9514o6301o3975o1938n8339n4160n2123
$$ 2722063 2632621 2550909 2475156 2402737 2333223 2266922 2202947 2141009 2082670 2028510 1976387
58088A976387n1802n0276m7343m5508m5066m3776m1357l9820l9294l7841l5527
$$ 1976387 1924585 1874309 1826966 1781458 1736392 1692616 1651259 1611439 1572145 1534304 1498777
58077A498777l4412l4420l3352l1116k9818k9570k8306k5972k4731k4739k3784
$$ 1498777 1464365 1429945 1396593 1365477 1335659 1306089 1277783 1251811 1227080 1202341 1178557
58066A178557k1589k0435k0841k0505j8394j6352j5700j5573j5379j5778j6477
$$ 1178557 1156968 1136533 1115692 1095187 1076793 1060441 1044741 1029168 1013789 998011 981534
58055I81534j6089j4831j4443j4960j4501j2680j1278j1057j0845j0203j0088
$$ 981534 965445 950614 936171 921211 906710 894030 882752 871695 860850 850647 840559
58044H40559j0417r870q557q044q398q051o898o582p328p514o818o657p056o289
$$ 840559 830142 820272 811715 803671 795273 787222 780324 773742 766414 758900 752082 745425 738369 732080
58030G32080m377l659m987o387o496o371o735o415m927l858m182m553l676k217
$$ 732080 727703 724044 719057 712670 706174 699803 693068 686653 681726 677868 673686 669133 665457 663240
58016F63240j149k69M93M24k09J79K008L702M350N109O918Q873J0039J1010J2495
$$ 663240 662091 661822 662315 662739 662530 662709 664717 668419 672769 677878 684796 693669 703708 714718 727213
58001G27213J4106J5537J7239J9065J9963J9830J9869K0449K0535J9951K0018
$$ 727213 741319 756856 774095 793160 813123 832953 852822 873271 893806 913757 933775
57990I33775K1036K1261J9528J6891J4514J1932Q667N679L794K350P40k41J81
$$ 933775 954811 976072 995600 1012491 1027005 1038937 1047604 1053283 1057077 1059427 1060167 1059926 1060107
57977A060107J496L125N331P857R238Q653O900M551Q18m594j0277j5138j9882
$$ 1060107 1061603 1064728 1070059 1077916 1087154 1095807 1102707 1107258 1108076 1103482 1093205 1078067 1058185
57964A058185k5065k9305l1083l0950l0278k9148k7095k4805k3302k2284k0813
$$ 1058185 1033120 1003815 972732 941782 911504 882356 855261 830456 807154 784870 764057
57953G64057j8879j6949j4806j2153r620p749n819k920M87L357N711Q301J1234
$$ 764057 745178 728229 713423 701270 691650 683901 678082 675162 675649 679006 684717 693018 704252
57940G04252J4108J6917J9694K1911K3265K4425K5920K6915K6363K4758K3485
$$ 704252 718360 735277 754971 776882 800147 824572 850492 877407 903770 928528 952013
57929I52013K2742K1327J8268J3649P922J389n607j2574j9060k4620k8913l2064
$$ 952013 974755 996082 1014350 1027999 1035921 1037310 1031703 1019129 1000069 975449 946536 914472
57917I14472l4532l6340l7003l6432l5197l3597l1309k8341k5419k2887k0180
$$ 914472 879940 843600 806597 770165 734968 701371 670062 641721 616302 593415 573235
57906E73235j7017j4189j2356j0941r042o838n183m389m109l959l620k785j638
$$ 573235 556218 542029 529673 518732 509690 502852 497669 493280 489171 485212 481592 478807 477169
57893D77169p65k12P32K298L604L889L563L312K938J917N10n77j166j544j911
$$ 477169 476404 476192 476924 479222 482826 486715 490278 493590 496528 498445 498955 498378 497212 495668 493757
57878D93757k487l619n131o101n921n030m079k998j577k57M46Q44J597K775L998
$$ 493757 491270 487651 482520 476419 470498 465468 461389 458391 456814 456557 457003 457847 459444 462219 466217
57863D66217N187O518P976R377J0533J1088J0719R840R291R059Q155O230M330
$$ 466217 471404 477922 485898 495275 505808 516896 527615 537455 546746 555805 563960 570190 574520
57850E74520L286K340L43k424m691n930o612p193p790q636r835j0807j0747r588
$$ 574520 577806 580146 580489 578065 573374 567444 560832 553639 545849 537213 527378 516571 505824 496236
57836D96236p969o353m765l250k088j473j239p81O08K955N146N950N536N248N706
$$ 496236 488267 481914 477149 473899 471811 470338 469099 468318 468926 471881 477027 482977 488513 493761 499467
57821D99467O113N729M896M023K729Q62o41r52p19j116k081k524j914o38Q98K641
$$ 499467 505580 511309 516205 520228 522957 523819 523178 522226 521507 520391 518310 515786 513872 513234 514132 516773
57805E16773M487O317Q296J0600J2998J5227J7437J9757K1759K2867K2941K1894
$$ 516773 521260 527577 535873 546473 559471 574698 592135 611892 633651 656518 679459 701353
57793G01353J9289J4960R667M495j85m517q341j1212j2991j3891j4077j3610j2529
$$ 701353 720642 735602 745269 749764 749579 745062 736721 725509 712518 698627 684550 670940 658411
57780F58411j0730q214n629m023l691l899m089m629n878p343q392r117r933j0943
$$ 658411 647681 639467 633838 629815 626124 622225 618136 613507 607629 600286 591894 582777 572844 561901
57766E61901j2247j4003j5616j5818j4458j3162j3274j3981j3693j2385j1186
$$ 561901 549654 535651 520035 504217 489759 476597 463323 449342 435649 423264 412078
57755D12078j0266q798o683m819l619k610j552p72k07P06K024L077L629M282N438
$$ 412078 401812 393014 386331 381512 377893 375283 373731 372959 372752 373458 375482 378559 382188 386470 391908
57740C91908O520O741O083N197M540L887K615N33j487k145j265k57n13j814k807
$$ 391908 398428 405169 411252 416449 420989 424876 427491 428024 426537 424392 423127 422870 422357 420543 417736
57725D17736k693j755o04L84J064J577K195K756K702K126K083L190M580N123N092
$$ 417736 415043 413288 412684 413068 414132 415709 417904 420660 423362 425488 427571 430761 435341 440464 445556
57710D45556N533O486P109P254P671Q716R932J0991J1990J2748J2836J2461J2435
$$ 445556 451089 457575 464684 471938 479609 488325 498257 509248 521238 533986 546822 559283 571718
57697E71718J3072J3897J4574J5278J6039J6613J7240J8689K1203K4151K6985
$$ 571718 584790 598687 613261 628539 644578 661191 678431 697120 718323 742474 769459
57686G69459K9976L3591L7764M2138M6627N1371N6463O1887O7489P2943P7962
$$ 769459 799435 833026 870790 912928 959555 1010926 1067389 1129276 1196765 1269708 1347670
57675A347670Q2564Q6864R0820R4410R7955J01818J06009J10316J14248J16193
$$ 1347670 1430234 1517098 1607918 1702328 1800283 1902101 2008110 2118426 2232674 2348867
57665B348867J12959J01280Q0066N0953J6929j8894n3501q4152j08992j27226
$$ 2348867 2461826 2563106 2643172 2694125 2711054 2692160 2638659 2554507 2445515 2318289
57655B318289j38650j43409j42129j35918j26176j14550j02704r1579q1078p0819
$$ 2318289 2179639 2036230 1894101 1758183 1632007 1517457 1414753 1323174 1242096 1171277
57645A171277o0952n1824m3381l5576k8940k3990k0332j7086j3871j0694p273
$$ 1171277 1110325 1058501 1015120 979544 950604 926614 906282 889196 875325 864631 857358
57634H57358l429J86K760M591O707R431J2305J5303J8879K2802K6083K8357L0394
$$ 857358 853929 854115 856875 861466 868173 877604 889909 905212 924091 946893 972976 1001333 1031727
57621A031727L2921L5835L8755M1537M3947M5587M6380M6444M5401M2570L7923
$$ 1031727 1064648 1100483 1139238 1180775 1224722 1270309 1316689 1363133 1408534 1451104 1489027
57610A489027L2098K5378J7572Q958L45p955j6202k4061l0513l5323l9458m3409
$$ 1489027 1521125 1546503 1564075 1573033 1573378 1565423 1549221 1525160 1494647 1459324 1419866 1376457
57598A376457m6163m6675m5490m3982m2553m0556l7670l4434l1592k9477k8012
$$ 1376457 1330294 1283619 1238129 1194147 1151594 1111038 1073368 1038934 1007342 977865 949853
57587I49853k6869k5658k4170k2380k0186j7558j5016j3368j2745j2324j1330
$$ 949853 922984 897326 873156 850776 830590 813032 798016 784648 771903 759579 748249
57576G48249r891q589p662o961o400n967n561n015m249l259k162j261p85n93m17
$$ 748249 738358 729769 722107 715146 708746 702779 697218 692203 687954 684695 682533 681272 680487 679894 679477
57561F79477k55j64J66J027K045K532K508K698L514M637N653O396O653O259N660
$$ 679477 679222 679058 679224 680251 682296 684828 687336 690034 693548 698185 703838 710234 716887 723146 728806
57546G28806N612O245O994P584Q275R074R617J0060J1159J3137J5202J6590J7430
$$ 728806 734418 740663 747657 755241 763516 772590 782207 792267 803426 816563 831765 848355 865785
57533H65785J8222J9287K0984K3602K6654K9110L0732L2389L4663L7042L8948
$$ 865785 884007 903294 924278 947880 974534 1003644 1034376 1066765 1101428 1138470 1177418
57522A177418M0533M1843M2118M0771L8274L5265L1533K6675K1051J5104Q523
$$ 1177418 1217951 1259794 1301912 1342683 1380957 1416222 1447755 1474430 1495481 1510585 1519108
57511A519108J070o328j2502j7570k2382k6757k9549l0439l0461l0589l0690l0163
$$ 1519108 1520178 1513850 1501348 1483778 1461396 1434639 1405090 1374651 1344190 1313601 1282911 1252748
57499A252748k8850k7049k5151k3455k1906k0035j7613j5224j3603j2429j0567
$$ 1252748 1223898 1196849 1171698 1148243 1126337 1106302 1088689 1073465 1059862 1047433 1036866
57488A036866p617m514k363j224l59Q11K381M211O020P403Q116Q426Q969J0227
$$ 1036866 1029249 1024735 1022372 1021148 1020789 1021600 1023981 1028192 1034212 1041615 1049731 1058157 1067126 1077353
57474A077353J2135J4166J5773J6837J7799J9367K2001K5473K8902L1390L2874
$$ 1077353 1089488 1103654 1119427 1136264 1154063 1173430 1195431 1220904 1249806 1281196 1314070
57463A314070L4154L5922L7908L9279L9584L8850L6935L3531K8886K3806J8673
$$ 1314070 1348224 1384146 1422054 1461333 1500917 1539767 1576702 1610233 1639119 1662925 1681598
57452A681598J2983O259j051p967j3932j9048k3609k7638l0747l2372l2402l1542
$$ 1681598 1694581 1700840 1699789 1691822 1677890 1658842 1635233 1607595 1576848 1544476 1512074 1480532
57440A480532l0637k9647k7866k5179k2411k0240j8477j6782j5343j4341j3324
$$ 1480532 1449895 1420248 1392382 1367203 1344792 1324552 1306075 1289293 1273950 1259609 1246285
57429A246285j1714r553p308n292l665k573j897j294p52o41q64o16N49K021L035
$$ 1246285 1234571 1225018 1217710 1212418 1208753 1206180 1204283 1202989 1202237 1201596 1200732 1200116 1200665 1202686 1205721
57414A205721L642M186M477M299M269N192O780P812P586O600N910O240P516Q858
$$ 1205721 1209363 1213549 1218026 1222325 1226594 1231786 1238566 1246378 1253964 1260564 1266474 1272714 1280230 1289088
57400A289088R249Q634Q050Q309R048R603J0106J0970J1803J1874J1395J1350
$$ 1289088 1298337 1306971 1315021 1323330 1332378 1341981 1352087 1363057 1374860 1386734 1398129 1409479
57388A409479J2076J2884J3162J3035J2825J2566J2256J2077J2172J2522J3041
$$ 1409479 1421555 1434439 1447601 1460636 1473461 1486027 1498283 1510360 1522532 1535054 1548095
57377A548095J3555J3831J3946J4282J4846J5020J4476J3888J3971J4327J4163
$$ 1548095 1561650 1575481 1589427 1603709 1618555 1633575 1648051 1661939 1675910 1690237 1704400
57366A704400J3776J4177J5358J6065J5557J4517J3880J3648J3361J3002J2851
$$ 1704400 1718176 1732353 1747711 1763776 1779333 1793850 1807730 1821378 1834739 1847741 1860592
57355A860592J2861J2753J2540J2537J2911J3465J3837J3921J4035J4468J4884
$$ 1860592 1873453 1886206 1898746 1911283 1924194 1937659 1951496 1965417 1979452 1993920 2008804
57344B008804J4620J3787J3439J4165J5139J5264J4769J4729J5366J5882J5864
$$ 2008804 2023424 2037211 2050650 2064815 2079954 2095218 2109987 2124716 2140082 2155964 2171828
57333B171828J5774J5934J6058J6011J6205J6877J7671J8226J8578J8862J9078
$$ 2171828 2187602 2203536 2219594 2235605 2251810 2268687 2286358 2304584 2323162 2342024 2361102
57322B361102J9316J9636J9782J9573J9513K0254K1479K2222K2338K2629K3405
$$ 2361102 2380418 2400054 2419836 2439409 2458922 2479176 2500655 2522877 2545215 2567844 2591249
57311B591249K3961K3850K3628K3823K4168K4411K5010K6174K7103K7022K6429
$$ 2591249 2615210 2639060 2662688 2686511 2710679 2735090 2760100 2786274 2813377 2840399 2866828
57300B866828K6413K7097K7635K7528K7155K7085K7395K7800K8008K7888K7489
$$ 2866828 2893241 2920338 2947973 2975501 3002656 3029741 3057136 3084936 3112944 3140832 3168321
57289C168321K6775K5475K3464K1323J9898J9156J8102J6107J3762J2084J1415
$$ 3168321 3195096 3220571 3244035 3265358 3285256 3304412 3322514 3338621 3352383 3364467 3375882
57278C375882J1480J1918J2326J2323J2086J2305J3183J4032J4294J4333J4643
$$ 3375882 3387362 3399280 3411606 3423929 3436015 3448320 3461503 3475535 3489829 3504162 3518805
57267C518805J4946J4778J4423J4418J4678J4847J5092J5691J6254J6289J6147
$$ 3518805 3533751 3548529 3562952 3577370 3592048 3606895 3621987 3637678 3653932 3670221 3686368
57256C686368J6509J7172J7371J7087J7008J7265J7279J6858J6442J6145J5622
$$ 3686368 3702877 3720049 3737420 3754507 3771515 3788780 3806059 3822917 3839359 3855504 3871126
57245C871126J4992J4912J5389J5559J5031J4569J4914J5734J6307J6469J6318
$$ 3871126 3886118 3901030 3916419 3931978 3947009 3961578 3976492 3992226 4008533 4025002 4041320
57234D041320J5632J4345J3084J2522J2651J3150J4005J5175J6179J6679J7023
$$ 4041320 4056952 4071297 4084381 4096903 4109554 4122704 4136709 4151884 4168063 4184742 4201765
57223D201765J7519J7641J6807J5559J5018J5326J5563J5123J4294J3448J2574
$$ 4201765 4219284 4236925 4253732 4269291 4284309 4299635 4315198 4330321 4344615 4358063 4370637
57212D370637J1761J1260J0879J0225R679J0164J1526J2303J1721J0992J1590
$$ 4370637 4382398 4393658 4404537 4414762 4424441 4434605 4446131 4458434 4470155 4481147 4492737
57201D492737J3119J4031J3987J4126J5130J6350J7042J7373J7746J8047J8128
$$ 4492737 4505856 4519887 4533874 4548000 4563130 4579480 4596522 4613895 4631641 4649688 4667816
57190D667816J8318J8901J9604K0101K0562K1226K1997K3079K5710L1491M0913
$$ 4667816 4686134 4705035 4724639 4744740 4765302 4786528 4808525 4831604 4857314 4888805 4929718
57179D929718N2800O4914P4692P9895P9551P4580O7104N8941N0923M3454L7068
$$ 4929718 4982518 5047432 5122124 5202019 5281570 5356150 5423254 5482195 5533118 5576572 5613640
57168E613640L2067K7996K3816J8660J2379N503j166o996j1712j5336j8057k0075
$$ 5613640 5645707 5673703 5697519 5716179 5728558 5734061 5732895 5725899 5714187 5698851 5680794 5660719
57156E660719k1375k1648k0745j9236j8144j7846j7669j6891j5763j5070j5068
$$ 5660719 5639344 5617696 5596951 5577715 5559571 5541725 5524056 5507165 5491402 5476332 5461264
57145E461264j5488j6392j8201k0746k2975k3978k3888k3468k3149k2837k2334
$$ 5461264 5445776 5429384 5411183 5390437 5367462 5343484 5319596 5296128 5272979 5250142 5227808
57134E227808k1694k1107k0643k0189j9594j8919j8391j8038j7528j6601j5451
$$ 5227808 5206114 5185007 5164364 5144175 5124581 5105662 5087271 5069233 5051705 5035104 5019653
57123E019653j4342j3024j1029q487o118m324k788j107P69L025O485J2108K0271
$$ 5019653 5005311 4992287 4981258 4972771 4966653 4962329 4959541 4958434 4959203 4962228 4968713 4980821 5001092
57110E001092L0819M3672N8924P6546R6511J19332J46247J78819K18642K67285
$$ 5001092 5031911 5075583 5134507 5211053 5307564 5426896 5573143 5751962 5970604 6237889
57100F237889L25960L94813M72812N58831O52980P56716Q71582R97926J134633
$$ 6237889 6563849 6958662 7431474 7990305 8643285 9400001 10271583 11269509 12404142
57091A2404142J279475J429447J580940J729745J870095J992439K081198K114729
$$ 12404142 13683617 15113064 16694004 18423749 20293844 22286283 24367481 26482210
57083B6482210K069647J930026J698156J398109J064487P21811L73660J4308l49521
$$ 26482210 28551857 30481883 32180039 33578148 34642635 35364446 35738106 35752414 35402893
57074C5402893o92896r90293j235119j438517j612065j756573j866462j938574
$$ 35402893 34709997 33719704 32484585 31046068 29434003 27677430 25810968 23872394
57066B3872394j973690j972956j936512j865223j762070j632607j485240j330246
$$ 23872394 21898704 19925748 17989236 16124013 14361943 12729336 11244096 9913850
57058I913850j177027j031996q98816p79302o73426n79834m97507m26507l66650
$$ 9913850 8736823 7704827 6806011 6026709 5353283 4773449 4275942 3849435 3482785
57049C482785l16681k75394k42391k16781j96254j78583j63093j49688j37548
$$ 3482785 3166104 2890710 2648319 2431538 2235284 2056701 1893608 1743920 1606372
57040A606372j26057j16002j08194j01591r4363q6284p8574p1737o5113n8384
$$ 1606372 1480315 1364313 1256119 1154528 1060165 973881 895307 823570 758457 700073
57030G00073n2000m6144m0618l5762l2168k9424k6412k2876j9588j6846j4059
$$ 700073 648073 601929 561311 525549 493381 463957 437545 414669 395081 378235 364176
57019C64176j0947p964n305k580L09L026N632Q621J2018J5620K0058K6307L4068
$$ 364176 353229 345265 339960 337380 337689 340715 346347 354968 366986 382606 402664 428971 463039
57006D63039M2130N0744O2125P8043R8150J21073J45445J69010J88155J99283
$$ 463039 505169 555913 618038 696081 794231 915304 1060749 1229759 1417914 1617197
56996A617197J99478J85415J54074J06507M9575q210o1683j08430j45020j67354
$$ 1617197 1816675 2002090 2156164 2262671 2312246 2304036 2242353 2133923 1988903 1821549
56986A821549j74858j71607j62247j48833j32273j14653r8329q3947p0939n9412
$$ 1821549 1646691 1475084 1312837 1164004 1031731 917078 818749 734802 663863 604451
56976F04451n0181m3374l8234l4114l0817k8010k5164k2161j9344j6919j4744
$$ 604451 554270 510896 472662 438548 407731 379721 354557 332396 313052 296133 281389
56965B81389j2646j0601q493o123l420m35K761N830Q005Q650P995O895N781M252
$$ 281389 268743 258142 249649 243526 240106 239671 242432 248262 256267 264917 272912 279807 285588 289840
56951B89840J789j478m908p921j0196j1585j2104j1958j1332j0202q508o371m008
$$ 289840 291629 290151 285243 277322 267126 255541 243437 231479 220147 209945 201437 195066 191058
56938A91058j509J131L843O544R301J2160J4837J6781J7603J7237J5651J2663
$$ 191058 189549 190680 194523 201067 210368 222528 237365 254146 271749 288986 304637 317300
56926C17300Q256K944k434p227j1215j4372j6593j7735j7881j7425j6853j6360
$$ 317300 325556 328500 326066 318839 307624 293252 276659 258924 241043 223618 206765 190405
56914A90405j5765j4777j3271j1262q817o207m039k845k560k618k605k519k354
$$ 190405 174640 159863 146592 135330 126513 120306 116267 113422 110862 108244 105639 103120 100766
56901A00766j853r48n6M10O16J055J874K860L885N065O471Q055R783J1601J3207
$$ 100766 98913 97965 97909 98319 98935 99990 101864 104724 108609 113674 120145 128200 137983 149584 162791
56886A62791J4207J4463J4069J2970J1002Q335N547L094R20j204l148m446m801
$$ 162791 176998 191461 205530 218500 229502 237837 243384 246478 247398 246194 243046 238600 233799
56873B33799m428l815l161k121k67K276M836P009R119J1748J5010J8586K2130
$$ 233799 229371 225556 222395 220274 220007 222283 227119 234128 243247 254995 270005 288591 310721
56860C10721K5149K6755K6105K3261J9151J4552R513L861k133p793j2397j5351
$$ 310721 335870 362625 388730 411991 431142 445694 455207 459068 456935 449142 436745 421394
56848D21394j6366j5724j4128j2079r563o413k717J376N905J0927J6338K2116
$$ 421394 405028 389304 375176 363097 353534 347121 344404 345780 351685 362612 378950 401066
56836D01066K8446L5171M1141M4587M4288M0306L3612K5225J5744N505n057j5160
$$ 401066 429512 464683 505824 550411 594699 635005 668617 693842 709586 715091 710034 694874
56824F94874k3716k9732l2824l3473l2660l1112k8832k5409k0784j5540j0375
$$ 694874 671158 641426 608602 575129 542469 511357 482525 457116 436332 420792 410417
56813D10417n449l14N556J2210J8997K4777K8524K9735K8286K4105J7407R209
$$ 410417 404968 404654 410210 422420 441417 466194 494718 524453 552739 576844 594251 603460
56801F03460R14o811j4246k1300k6792k9614l0083k9358k7907k5476k2244j8917
$$ 603460 604374 597563 583317 562017 535225 505611 475528 446170 418263 392787 370543 351626
56789C51626j5675j2132q373n089k290J035N451J0048J3436J5051J4912J2874
$$ 351626 335951 323819 315446 310357 308067 309102 314553 324601 338037 353088 368000 380874
56777C80874Q970M033q52n339r662j3753j7139j9551k1031k1582k1244k0345j9281
$$ 380874 389844 393877 393025 387686 378024 364271 347132 327581 306550 284968 263724 243379 224098
56764B24098j8044j6396j4428j2482j0686q918p213n783m739m055l736l728l775
$$ 224098 206054 189658 175230 162748 152062 143144 135931 130148 125409 121354 117618 113890 110115
56751A10115l649l392l104k723k271k024k059j997j566j118j096j248j026m82
$$ 110115 106466 103074 99970 97247 94976 92952 90893 88896 87330 86212 85116 83868 82842 82360
56737H2360j69k10k55k71o69j450j908j510n48L24P95Q71O02K03P6L51N40O6q91
$$ 82360 82191 81981 81726 81455 80786 79336 77428 75918 75370 75694 76489 77360 77962 78165 78241 78592 79132 79198 78307
56718G8307j423q43M88J398J101%p77o98k62r1KN44J358J668J221O94Q33J592
$$ 78307 76884 76041 76529 77927 79028 79028 78251 77553 77291 77200 77202 77746 79104 80772 81993 82687 83520 85112
56700H5112K338K599K376J995J832K003K250K239J975J744J666J594J396J067
$$ 85112 87450 90049 92425 94420 96252 98255 100505 102744 104719 106463 108129 109723 111119 112186
56686A12186N72n2n19n51l12j84r9L93J312K058K265K313K606K804K282J107L3
$$ 112186 112758 112706 112187 111636 111324 111140 111041 111434 112746 114804 117069 119382 121988 124792 127074 128181 128214
56669A28214l63j48L42Q87J301J334Q51M6p34j316j774k147k303k118j795j760
$$ 128214 127851 127703 128045 128932 130233 131567 132418 132464 131730 130414 128640 126493 124190 122072 120277 118517
56653A18517k118k412k123j324n78k74l51n94q69r95p74l14m7k19n39n63k37J26
$$ 118517 116399 113987 111864 110540 109962 109688 109337 108743 107874 106879 106105 105791 105744 105525 104986 104423 104186 104312
56635A04312L47N71R40J312J377J021M85J20L1O7J08J81K64J93m3j02L15R38J115
$$ 104312 104659 105230 106170 107482 108859 109880 110365 110485 110516 110583 110691 110872 111136 111329 111286 111184 111499 112437 113552
56616A13552N38m45j233j497j306r37n81j55N56J432J893J531P27L18O47J318
$$ 113552 114090 113645 112412 110915 109609 108672 108091 107936 108492 109924 111817 113348 114075 114393 115040 116358
56600A16358J826K041K055J926J713J495J244Q85N03K61R0j75l78j37N96J373
$$ 116358 118184 120225 122280 124206 125919 127414 128658 129543 130046 130307 130397 130222 129844 129707 130303 131676
56584A31676J771J730J299N38j90k89M37J493K218K394K180J832J686K021K658
$$ 131676 133447 135177 136476 137014 136824 136535 136972 138465 140683 143077 145257 147089 148775 150796 153454
56569A53454K995K758K369K270K344K345K498L024L385K824J612J028J774L071
$$ 153454 156449 159207 161576 163846 166190 168535 171033 174057 177442 180266 181878 182906 184680 187751
56555A87751L673L362K946L029L372L479L286L067K989L050L278L645L917L895
$$ 187751 191424 194786 197732 200761 204133 207612 210898 213965 216954 220004 223282 226927 230844 234739
56541B34739L757L778L710K984J638N39L34O37P12N09M12K80l89j476k165k056
$$ 234739 238496 242274 245984 248968 250606 251145 251479 252116 252828 253337 253749 254029 253640 252164 249999 247943
56525B47943j651j562j800k128k511k879k999k910l115l925m911n415n293m858
$$ 247943 246292 244730 242930 240802 238291 235412 232413 229503 226388 222463 217552 212137 206844 201986
56511B01986m425m202m377m845n149m969m567m321m118l552k602j756j498j888
$$ 201986 197561 193359 188982 184137 178988 174019 169452 165131 161013 157461 154859 153103 151605 149717
56497A49717k606l115k986k251j490j286j677k170k208j525k62J059J771J534
$$ 149717 147111 143996 141010 138759 137269 135983 134306 132136 129928 128403 128141 129200 130971 132505
56483A32505N45o03j238q98L48J843K817K932K247R56m71j142m93Q11J489J228
$$ 132505 133050 132447 131209 130311 130659 132502 135319 138251 140498 141454 140983 139841 139348 140159 141648 142876
56467A42876R22J196J533J319Q55P24P97O18K63P7rk07k36L14J177J626J470J222
$$ 142876 143798 144994 146527 147846 148701 149425 150222 150840 151103 151180 151171 150964 150728 151042 152219 153845 155315 156537
56449A56537J362J859K346K444K065J689J974K813L281K904K433K704L295L229
$$ 156537 157899 159758 162104 164548 166613 168302 170276 173089 176370 179274 181707 184411 187706 190935
56435A90935K601K473L249M169M471M246L862L324K570J865J593J871K520L169
$$ 190935 193536 196009 199258 203427 207898 212144 216006 219330 221900 223765 225358 227229 229749 232918
56421B32918L404L087K481J780Q00n47j726k112j891j866k374k956l048k531j659
$$ 232918 236322 239409 241890 243670 244470 243923 242197 240085 238194 236328 233954 230998 227950 225419 223760
56406B23760q72o32j009j481j570j467j590j795j623j136q96j210j901k728l425
$$ 223760 222888 222256 221247 219766 218196 216729 215139 213344 211721 210585 209689 208479 206578 203850 200425
56391B00425l538k846j852j284j246j388j587j799j596p58l6l25j233j523r57
$$ 200425 196887 194041 192189 190905 189659 188271 186684 184885 183289 182531 182495 182170 180937 179414 178457
56376A78457n51r18j460j497j132o62j00L31J48n58r65o57j20J62L08M38L71L15
$$ 178457 177906 176988 175528 174031 172899 172237 172137 172468 172616 172058 171093 170436 170316 170478 170786 171224 171595 171910
56358A71910Q86J943K377J632N88K17K62P2o1N29J619K363K567K693K824K530
$$ 171910 172796 174739 177116 178748 179336 179553 179815 179887 179826 180355 181974 184337 186904 189597 192421 194951
56342A94951J686P68K43J68L53N48N40M07N59J227K042K398K082J422J014J319
$$ 194951 196637 197405 197648 197816 198169 198717 199257 199664 200223 201450 203492 205890 207972 209394 210408 211727
56326B11727K215K904K719K046J954K741L577L774L657L799M087M069L737L437
$$ 211727 213942 216846 219565 221611 223565 226306 229883 233657 237314 241113 245200 249269 253006 256443
56312B56443L397L754M553N439N853N760N632N489M817L746L347M072M796M284
$$ 256443 259840 263594 268147 273586 279439 285199 290831 296320 301137 304883 308230 312302 317098 321382
56298C21382K892J901J809K203K806L529L811L019J411l1p18p72n19k83m28q92
$$ 321382 324274 326175 327984 330187 332993 336522 340333 343352 344763 344732 344014 343242 342723 342440 342012 341120
56282C41120r81l36K84J1o82n38O15J618J679J377J670K652L705M387M824N429
$$ 341120 340139 339803 340087 340098 339416 338878 339493 341111 342790 344167 345837 348489 352194 356581 361405 366834
56266C66834O443P673Q706R467J0315J1457J2627J3659J4885J6611J8535K0202
$$ 366834 373277 380950 389656 399123 409438 420895 433522 447181 462066 478677 497212 517414
56254E17414K1690K3318K5000K6393K7380K7933K7854K7217K6597K6246K5443
$$ 517414 539104 562422 587422 613815 641195 669128 696982 724199 750796 777042 802485
56243H02485K3466K0846J8823J7663J6394J4180J1264Q463O329M894L830K693
$$ 802485 825951 846797 865620 883283 899677 913857 925121 933584 939913 944807 948637 951330
56231I51330J247n22k762n629q676j0965j2262j3436j5137j6840j7911j8757j9966
$$ 951330 952577 952055 949293 943664 934988 924023 911761 898325 883188 866348 848437 829680 809714
56218H09714k0982k0926k0253k0241k0977k1220k0300j8906j7784j6828j5801
$$ 809714 788732 767806 747553 727312 706335 685115 664815 645909 628125 611297 595496
56207E95496j4919j4235j3234j1542r537p801o440n260m188l221k188r02N77J818
$$ 595496 580577 566342 553108 541566 532029 524228 517788 512528 508340 505119 502931 502029 502606 504424
56193E04424K258J749R35P06J143J545J610J856K481K750K199J626J977K926L511
$$ 504424 506682 508431 509366 510072 511215 512760 514370 516226 518707 521457 523656 525282 527259 530185 533696
56178E33696L573L524L279K582J911J984K652L372M258N620O884P218O881O741
$$ 533696 537269 540793 544072 546654 548565 550549 553201 556573 560831 566451 573335 580553 587434 594175
56164E94175O873O891P204Q408R789J0048R357R166J0045J1284J2470J3760J4646
$$ 594175 601048 607939 615143 623551 633340 643388 652745 661911 671956 683240 695710 709470 724116
56151G24116J4373J3763J4744J7628K0629K2715K5100K9070L4099L9306M5420
$$ 724116 738489 752252 766996 784624 805253 827968 853068 882138 916237 955543 1000963
56140A000963N3932O5175P8408R3169J09652J28103J48383J69550J89507K05719
$$ 1000963 1054895 1120070 1198478 1291647 1401299 1529402 1677785 1847335 2036842 2242561
56130B242561K16622K21882K21460K15429K04851J91620J77111J61811J46169
$$ 2242561 2459183 2681065 2902525 3117954 3322805 3514425 3691536 3853347 3999516
56121C999516J30600J14446R6383P6193N5130L4410J4677l095j8056l1333m5803
$$ 3999516 4130116 4244562 4340945 4417138 4472268 4506678 4521355 4518260 4500204 4468871 4423068
56110D423068o3192q2748j03192j24235j45342j64685j80484j92122j99068k00096
$$ 4423068 4359876 4277128 4173936 4049701 3904359 3739674 3559190 3367068 3168000 2967904
56100B967904j94733j84447j71325j56578j41024j25801j11543r7967q5140p4060
$$ 2967904 2773171 2588724 2417399 2260821 2119797 1993996 1882453 1784486 1699346 1625286
56090A625286o5168n7518n0357m4204l9407l4987l0113k5533k2299j9992j7454
$$ 1625286 1560118 1502600 1452243 1408039 1368632 1333645 1303532 1277999 1255700 1235708 1218254
56079A218254j4411j1339q598o546n575n142l820j180J475L052M050N136N900
$$ 1218254 1203843 1192504 1183906 1177360 1171785 1166643 1162823 1161643 1163118 1166170 1170220 1175356 1181256
56066A181256O121O813Q603J0437J1344J2154J3933J5913J6745J6722J7092J8000
$$ 1181256 1187377 1194190 1202793 1213230 1224574 1236728 1250661 1266574 1283319 1300041 1317133 1335133
56054A335133J8766J9387K0236K0944K1124K1496K2827K4502K5486K6049K7073
$$ 1335133 1353899 1373286 1393522 1414466 1435590 1457086 1479913 1504415 1529901 1555950 1583023
56043A583023K8467K9626L0770L2350L3723L3838L2680L0887K8643K6121K4326
$$ 1583023 1611490 1641116 1671886 1704236 1737959 1771797 1804477 1835364 1864007 1890128 1914454
56032A914454K4168K5392K7443L0580L4965L9589M3342M6372M9333N2207N4911
$$ 1914454 1938622 1964014 1991457 2022037 2057002 2096591 2139933 2186305 2235638 2287845 2342756
56021B342756N7945O1353O4204O6122O8008P0256P1848P2451P3610P6370P9478
$$ 2342756 2400701 2462054 2526258 2592380 2660388 2730644 2802492 2874943 2948553 3024923 3104401
56010C104401Q1614Q3614Q6699R0316R3683R7692J03136J08794J13569J18798
$$ 3104401 3186015 3269629 3356328 3446644 3540327 3638019 3741155 3849949 3963518 4082316
56000D082316J26104J34556J42338J49716J57965J66949J76199J86769J99462
$$ 4082316 4208420 4342976 4485314 4635030 4792995 4959944 5136143 5322912 5522374
55991E522374K12761K25060K37368K51395K66723K82459K99640L19302L40266
$$ 5522374 5735135 5960195 6197563 6448958 6715681 6998140 7297780 7617082 7957348
55982G957348L61768L86045M15110M47326M80542N16370N57800O05055O57704
$$ 7957348 8319116 8705161 9120271 9567597 10048139 10564509 11122309 11727364 12385068
55973A2385068P18218P89427Q70911R62314J067636J191916J336796J504282J702129
$$ 12385068 13103286 13892713 14763624 15725938 16793574 17985490 19322286 20826568 22528697
55964B2528697J940595K227268K570590K985046L487081M088670M798565N623874
$$ 22528697 24469292 26696560 29267150 32252196 35739277 39827947 44626512 50250386
55956E0250386O566931P632810Q851397J0283818J1997668J4047326J6479265
$$ 50250386 56817317 64450127 73301524 83585342 95583010 109630336 126109601
55949A26109601J9299933K2351873K5189419K7125402K7475322K5823226K2138657
$$ 126109601 145409534 167761407 192950826 220076228 247551550 273374776 295513433
55942B95513433J6744970J0220629L256001l523486r674794j4911587j9008298
$$ 295513433 312258403 322479032 325735033 322211547 312536753 297625166 278616868
55935B78616868k1787893k3211622k3432626k2726273k1374458j9613163j7641274
$$ 278616868 256828975 233617353 210184727 187458454 166083996 146470833 128829559
55928A28829559j5625185j3684910j1892687j0288040q886256p679234o645021
$$ 128829559 113204374 99519464 87626777 77338737 68452481 60773247 54128226
55921E4128226n761894n010748m370093l818940l343712k935856k584915k280198
$$ 54128226 48366332 43355584 38985491 35166551 31822839 28886983 26302068 24021870
55913B4021870k016489j791336j598389j429311j280491j151954j040971r42296
$$ 24021870 22005381 20214045 18615656 17186345 15905854 14753900 13712929 12770633
55905A2770633q53588p75455p06831o44901n88858n39429m95315m53988m15394
$$ 12770633 11917045 11141590 10434759 9789858 9201000 8661571 8166256 7712268 7296874
55896G296874l81167l50986l23085k97447k75022k54686k34412k14606j97021
$$ 7296874 6915707 6564721 6241636 5944189 5669167 5414481 5180069 4965463 4768442
55887D768442j81194j65293j49650j35959j23654j10502r6416q3320p1512n9545
$$ 4768442 4587248 4421955 4272305 4136346 4012692 3902190 3805774 3722454 3650942 3591397
55877C591397m7745l8709l3897l2505l3930l8704m6472n5439o4456p3688q2860
$$ 3591397 3543652 3504943 3471046 3438541 3404611 3365907 3319435 3263996 3199540 3125852 3042992
55866C042992r0657r6175r9395j00152r8221r4287q9256q2812p4226o4458n5697
$$ 3042992 2952335 2856160 2756765 2656613 2558392 2464105 2374849 2292037 2217811 2153353 2097656
55855B097656m8986m3923m0383l8815l8920l9724m0935m2708m4353m4899m4675
$$ 2097656 2048670 2004747 1964364 1925549 1886629 1846905 1805970 1763262 1718909 1674010 1629335
55844A629335m4654m4429m2603l9039l4970l0964k6556k2044j8772j7236j6393
$$ 1629335 1584681 1540252 1497649 1458610 1423640 1392676 1366120 1344076 1325304 1308068 1291675
55833A291675j5319j4241j3743j4082j5551j8224k1195k3154k3964k4577k5429
$$ 1291675 1276356 1262115 1248372 1234290 1218739 1200515 1179320 1156166 1132202 1107625 1082196
55822A082196k6039k6167k6176k6070k5387k4125k2817k1538j9975j8379j7393
$$ 1082196 1056157 1029990 1003814 977744 952357 928232 905415 883877 863902 845523 828130
55811H28130j6838j5765j3839j1681r774q008o303m693k871p14Q48O67q50k039
$$ 828130 811292 795527 781688 770007 760233 752225 745922 741229 738358 737644 738492 739159 738309 736270
55797G36270k187k288l372n155o723p592p699p193o595o514o935p377p776q506
$$ 736270 734083 731795 728423 723268 716545 708953 701254 694061 687466 680952 674017 666640 658864 650358
55783F50358r517j0226j0393j0387j0446j0353r815q759p283n916n602o641q001
$$ 650358 640841 630615 620222 609835 599389 589036 579221 570462 563179 557263 551661 545020 537019
55770E37019q542q574r150j0192j0604j0173r900j0286j0592j0213r594r273q978
$$ 537019 528477 519903 510753 500561 489957 479784 469884 459598 449006 438793 429199 419926 410948
55757D10948q321p537o986o561o079n702n576n488n291n094m874m376l706l455
$$ 410948 402627 395090 388104 381543 375464 369762 364186 358698 353407 348313 343439 339063 335357 331902
55743C31902l975m888n531n582n091m335l726l520l491l213k655k177j999k048
$$ 331902 327927 323039 317508 311926 306835 302500 298774 295254 291763 288550 285895 283718 281719 279671
55729B79671k189k273k134j923k096k730l141k836k350k502l191l672l721l651
$$ 279671 277482 275209 273075 271152 269056 266326 263185 260349 257999 255497 252306 248634 244913 241262
55715B41262l487l010k454k235k122j586p85k96n0M67J081J188J031J519K581
$$ 241262 237775 234765 232311 230076 227954 226368 225583 225287 225237 225704 226785 227973 229004 230523 233104
55700B33104K980K175J215J214J886K207J894J609K131L655N525O566O166N067
$$ 233104 236084 238259 239474 240688 242574 244781 246675 248284 250415 254070 259595 266161 272327 277394
55686B77394M492M526M186L020J706Q22n1j549l558n394o437o440n765n371n871
$$ 277394 281886 286412 290598 293618 295324 296146 296095 294546 290988 285594 279157 272717 266952 261581 255710
55671B55710o617o495n539m829m728m476l687l014k793k297j008M19J328K226
$$ 255710 249093 242598 237059 232230 227502 223026 219339 216325 213532 211235 210227 210646 211974 214200
55657B14200L783N468O245O157O111O389O272N191L488K005J249R85M17j040k961
$$ 214200 217983 223451 229696 235853 241964 248353 254625 259816 263304 265309 266558 267543 267960 266920 263959
55642B63959m221m281l719l325l184l039k899k809k466j675q48m70m47m18m01
$$ 263959 259738 255457 251738 248413 245229 242190 239291 236482 234016 232341 231493 231023 230576 230158 229757
55627B29757o17r54j311k181m135o689q429q511p639p106p218p107o102m773m232
$$ 229757 229140 228186 226875 224694 220559 213870 205441 196930 189291 182185 174967 167860 161758 156985 152753
55612A52753m652n074m680l679k650j730j001r92j989l140l285k502j908j916
$$ 152753 148101 143027 138347 134668 132018 130288 129287 128295 126306 123166 119881 117379 115471 113555
55598A13555j764r54j28n4n03p66o69n29m94m03p7N11J140J398J188J092J658
$$ 113555 111791 110837 110709 110655 110152 109386 108717 108188 107694 107291 107214 107725 108865 110263 111451 112543 114201
55581A14201K399K274J242N28J010K186L052L326L345L439L930N099O649P633
$$ 114201 116600 118874 120116 120644 121654 123840 126892 130218 133563 137002 140932 146031 152680 160313
55567A60313P403O265M878L549K369J415M29j065k913m209m566m744n478o295
$$ 160313 167716 173981 178859 182408 184777 186192 186621 185556 182643 178434 173868 169124 163646 157351
55553A57351o298n582m985m815m643m233l873l762l681l439l191l135l152k846
$$ 157351 151053 145471 140486 135671 131028 126795 122922 119160 115479 112040 108849 105714 102562 99716
55539I9716j948p59n8k78q36q04k44j99j172k355k718k223j416n03N92J660K378
$$ 99716 97768 97009 96951 96673 95837 95033 94789 94590 93418 91063 88345 86122 84706 84203 84795 86455 88833
55522H8833K754K927K772K173J481J264J808L051M656N951O296N817N297N061
$$ 88833 91587 94514 97286 99459 100940 102204 104012 107063 111719 117670 123966 129783 135080 140141
55508A40141M599L645K822K576K168N74j955m149n202n326n010m515m078l995
$$ 140141 144740 148385 151207 153783 155951 156525 154570 150421 145219 139893 134883 130368 126290 122295
55494A22295m371n066n802o142n736m877m365m451m403l572k361j572j319j224
$$ 122295 117924 112858 107056 100914 95178 90301 85936 81485 77082 73510 71149 69577 68258 67034
55480F7034j229j417j431r52m79p79j664k108j606o68j5J50o0n03j014j399j533
$$ 67034 65805 64388 62957 62005 61526 60747 59083 56975 55369 54701 54686 54836 54776 54273 53259 51860 50327
55463E0327j267m86M41P29J14o11o33k95m73j089j111m1J366K001J493K99p90
$$ 50327 49060 48574 49015 49744 49858 49247 48614 48319 47846 46757 45646 45605 46971 48972 50465 50764 49974
55446D9974j169p91j20M73J002J395J224L95l53l37K7j62r15j362j030l01L29
$$ 49974 48805 48014 47894 48367 49369 50764 51988 52383 52030 51693 51720 51558 50643 49281 48251 47950 48279
55429D8279P38R26R30R72J170J139N14l46p72p61p73q00m63J07L88M55Q84J588
$$ 48279 49017 49943 50873 51845 53015 54154 54668 54322 53550 52789 52016 51216 50753 50860 51248 51703 52587 54175
55411E4175J791J285Q21Q37P74L3j087j899k126j828j073j25N74R15J189J435
$$ 54175 55966 57251 58072 58909 59683 59716 58629 56730 54604 52776 51703 51578 52152 53067 54256 55691
55395E5691J349R69P59P55L58n88j276j067m78m47j048j572j548j128o89n65q81
$$ 55691 57040 58009 58768 59523 59881 59293 58017 56950 56472 56025 54977 53405 51857 50729 50040 49475 48594
55378D8594j333j368r64p91j184j452q13L54Q89L55n43j034j093j095j134j046
$$ 48594 47261 45893 44929 44138 42954 41502 40689 41043 41932 42287 41744 40710 39617 38522 37388 36342
55362C6342p82m93l34l01k70j64m0R6M49J202K023K164J307R4m93j78M63P52N09
$$ 36342 35560 35067 34733 34432 34162 33998 33958 34054 34503 35705 37728 39892 41199 41293 40800 40622 41085 41837 42346
55343D2346p2p26j147j006k37O99J136Q34J90k51l57l48l11j37R4J8n16j106j163
$$ 42346 42274 41548 40401 39395 39158 39857 40993 41827 42017 41766 41409 41061 40750 40613 40707 40725 40209 39103 37940
55324C7940n41L94J122J265P60J4l17N7P19J039Q91O71P78J279J910K189J781
$$ 37940 37399 37793 38915 40180 40940 40954 40637 40694 41413 42452 43343 44014 44792 46071 47981 50170 51951
55307E1951R40L04K4m68j467k222j778l25R67J281P48j20r23j300j054m77j10
$$ 51951 52891 53195 53219 52751 51284 49062 47284 46959 47926 49207 49955 49835 48912 47612 46558 46081 45971
55290D5971q2j39k11m66q27r91r24p97n22Q9P25Q12L61LP2L06N26Q39J112R03
$$ 45971 45889 45750 45539 45073 44246 43255 42331 41534 41012 41101 41826 42638 42999 43002 43074 43380 43906 44745 45857 46760
55270D6760K42k29j73Nj06l37l71k13J01O65J249J297O85j5l27l90l97j54L35
$$ 46760 47002 46773 46600 46605 46499 46162 45791 45578 45679 46344 47593 48890 49575 49560 49233 48843 48446 48292 48627
55251D8627N26J05m97q37j228k074k892k733j406L09J488J746J272O61M87P63
$$ 48627 49153 49258 48761 47924 46696 44622 41730 38997 37591 37900 39388 41134 42406 43067 43554 44317
55235D4317R18O16J78k6j65m80o74l40K54M41M4m53n55k13K34L12j66p48p36j43
$$ 44317 45235 45851 46029 46003 45838 45358 44684 44344 44598 45039 45083 44630 44075 43862 44096 44408 44242 43494 42758 42615
55215D2615J55l41r25o52K81Q26M87k30o76o97m57j47N4J27K71N27N53J28l04
$$ 42615 42770 42429 41504 40852 41133 41959 42446 42216 41540 40843 40386 40239 40293 40420 40691 41218 41771 41899 41595
55196D1595j68L80O57M77L61O92J190J360J028K79p08j608j966j521n13M51P98
$$ 41595 41427 41807 42464 42941 43302 43994 45184 46544 47572 47851 47143 45535 43569 42048 41535 41986 42784
55179D2784M54o2k05q7k45o64o37J39R07Q72L48J82N05Q12R96J329J573J076p3
$$ 42784 43238 43176 42971 42884 42639 41975 41338 41477 42384 43256 43604 43786 44291 45103 46099 47428 49001 50077 50004
55160E0004r22q99m90l22l26j87m5k06n45o64m21rK77K18k00o23o28k55O0J49
$$ 50004 49082 48183 47693 47371 47045 46858 46813 46607 46062 45398 44977 44968 45245 45463 45263 44640 44012 43757 43817 43966
55140D3966K57M14K07m78r81o28L27J031J045N92on86q46m12N60J218Q38l31j257
$$ 43966 44223 44637 44844 44366 43385 42757 43084 44115 45160 45752 45746 45160 44314 43902 44462 45680 46518 46187 44930
55121D4930j174k33Q63J626K016K097J876J549J536J885J984J277J62l74o3K41
$$ 44930 43756 43523 44386 46012 48028 50125 52001 53550 55086 56971 58955 60232 60394 60020 59957 60198
55105F0198k64j231j645j133k96J16n5n12r65j277j371j218q95m93n6L53N71N02
$$ 60198 59934 58703 57058 55925 55629 55745 55690 55178 54213 52936 51565 50347 49452 48959 48903 49256 49827 50329
55087E0329K86J61J79J47o9l10l30q5K47M74M84K94J11J95M84N17Po70q88n95
$$ 50329 50615 50776 50955 51102 51033 50723 50393 50308 50555 51029 51513 51807 51918 52113 52597 53114 53121 52451 51563 50968
55067E0968k85k33k69l40o33r37n97M58J260J012K17o8J82P0o86j229q04K54J077
$$ 50968 50683 50450 50181 49841 49208 48271 47674 48132 49392 50404 50621 50553 50735 50805 50119 48890 48086 48340 49417
55048D9417J290J096P75N40N37O60N39M9l61j34P17J640K168K232J994J692J581
$$ 49417 50707 51803 52578 53118 53655 54315 54854 54903 54542 54408 55125 56765 58933 61165 63159 64851 66432
55031F6432J731J772J219J95l26N56K501M006L893K496J197Q86J254J461J126
$$ 66432 68163 69935 71154 71349 71023 71579 74080 78086 81979 84475 85672 86558 87812 89273 90399
55016I0399M87Kk4L86Q82J083J007R69R80O21l25j455k236k597k739k702k461
$$ 90399 90886 90888 90864 91250 92132 93215 94222 95191 96171 96792 96467 95012 92776 90179 87440 84738 82277
54999H2277k144j744r67J31P06Nj487k452k278j543r70o13k43N7L8l63j019j622
$$ 82277 80133 78389 77422 77553 78259 78264 76777 74325 72047 70504 69534 68921 68678 68735 68773 68410 67391 65769
54981F5769j674q75L30J085J105R15R72J135J188J282J493J456J013P51J367K728
$$ 65769 64095 63220 63550 64635 65740 66655 67627 68762 69950 71232 72725 74181 75194 75945 77312 80040
54965H0040M081N003N628O064O163N923N661N743O362P541R124J0676J1811J2564
$$ 80040 84121 89124 94752 100816 106979 112902 118563 124306 130668 138209 147333 158009 169820 182384
54951A82384J3172J3510J3099J1730R750P540N070K192q89l775o372q858j1109
$$ 182384 195556 209066 222165 233895 243645 251185 256255 258447 257558 253783 247411 238553 227444
54938B27444j2535j2697j1971j1269j1143j1295j0997r844q045o226m993m498
$$ 227444 214909 202212 190241 178972 167829 156534 145537 135693 127648 121422 116429 111931
54926A11931m230l441j992o31j56m47o87m06J64Q57K093M201O548P960Q081P863
$$ 111931 107701 104260 102268 101637 101481 101034 100347 99941 100105 100962 103055 107256 113804 121764 129845 137708
54910A37708Q497J0090J1726J2568J2493J1560R495O242K701J67j144k428m835
$$ 137708 146205 156295 168021 180589 193082 204642 214137 220379 223080 223247 222103 219675 214840
54897B14840q114j1045j2731j2974j1880r918q105p316p328p212o623n937n163
$$ 214840 206726 195681 182950 169976 158096 148178 140073 132757 125429 118217 111594 105657 100494
54884A00494l751j822n74p18j336j148l25l7n81j048q71n68n89m71K53J009Q47
$$ 100494 96743 94921 94347 93629 92293 91145 90820 90783 90202 89154 88283 87715 87126 86655 86908 87917 88764
54867H8764j47r34r63q63j390k255k458j634n44j87p06j415j684j524j313j259
$$ 88764 88617 87683 86720 85857 84467 82212 79754 78120 77576 77389 76683 75268 73584 72060 70747 69488
54851F9488j217r78n51k28l71j059j964k594k686k334j776j209p39l27J29N62
$$ 69488 68271 67293 66742 66514 66143 65084 63120 60526 57840 55506 53730 52521 51782 51455 51584 52146
54835E2146O23J58l69k94K93N44j1p42p71r8N87R41J128J167Q44L83M25J059J527
$$ 52146 52769 52927 52558 52264 52557 53101 53090 52348 51577 51479 52066 53007 54135 55302 56146 56529 56954 58013 59540
54816E9540J285Q28Q88J361J665J866K522L556M194M173M172M711N466O155P311
$$ 59540 60825 61653 62541 63902 65567 67433 69955 73511 77705 81878 86050 90761 96227 102382 109693
54801A09693R359J1499J2497J2356J2154J2400J2468J1862J0906R825Q086N330
$$ 109693 119052 130551 143048 155404 167558 179958 192426 204288 215194 225019 233105 238435
54789B38435K200m67k763n241p713r281r491q744p664o602n690m924m185l508
$$ 238435 240635 240168 237405 232164 224451 215170 205679 196935 189271 182669 176979 172055 167870 164362
54775A64362l135k944k173l42J823L088L274L342M025N174O527Q262J0430J2595
$$ 164362 161227 158283 156110 155768 157591 160679 163953 167295 171320 176494 183021 191283 201713 214308
54761B14308J4404J5970J7311J7953J7499J6142J4231J1811Q995O273L924J442
$$ 214308 228712 244682 261993 279946 297445 313587 327818 339629 348624 354897 358821 360263
54749C60263j777n438q597j0862j2791j5040j7458j9185j9522j8562j7070j5719
$$ 360263 358486 353048 344451 333589 320798 305758 288300 269115 249593 231031 213961 198242
54737A98242j4519j3109j1491j0121r260q618p853p058o526o237n876n165m088
$$ 198242 183723 170614 159123 149002 139742 131124 123271 116213 109687 103450 97574 92409 88321
54724H8321k978k413k658l131k892j772o21j21MK87N66L11m23j032j133p84j13
$$ 88321 85343 82930 80272 77141 74249 72477 71856 71735 71739 72026 72592 72903 72480 71448 70315 69531 69418
54707F9418P03J242J149O47K69J86J76J79L86P64R91Q93N63Q7m71p90m66M30J326
$$ 69418 70121 71363 72512 73159 73428 73614 73790 73969 74355 75119 76110 77003 77566 77653 77182 76392 75926 76356 77682
54688G7682J775J784J465Q45K01J61J097K541L528L522K890K431K553L002L336
$$ 77682 79457 81241 82706 83551 83752 83913 85010 87551 91079 94601 97491 99922 102475 105477 108813
54673A08813L482L597L579L157K528K341K817L306L224K956L273M154M914N335
$$ 108813 112295 115892 119471 122628 125156 127497 130314 133620 136844 139800 143073 147227 152141 157476
54659A57476N937P058Q412R767J1411J3578J5902J7874J9555K1424K3632K5615
$$ 157476 163413 170471 178883 188650 200061 213639 229541 247415 266970 288394 312026 337641
54647C37641K6392K5189K1938J7323J2135O673Q67n052j0486j5073j8905k1913
$$ 337641 364033 389222 411160 428483 440618 447291 448158 443106 432620 417547 398642 376729
54635C76729k3616k3759k2884k1805k0758j9428j7638j5664j3856j2311j0871
$$ 376729 353113 329354 306470 284665 263907 244479 226841 211177 197321 185010 174139
54624A74139r241p215n023l389k958l639m671n258n054m164l022k233k168k608
$$ 174139 164898 157683 152660 149271 146313 142674 138003 132745 127691 123527 120505 118272 116104 113496
54610A13496k945k823k353j750j116p34j081k208l290l377k502j618j393j509
$$ 113496 110551 107728 105375 103625 102509 101775 100694 98486 95196 91819 89317 87699 86306 84797
54596H4797j367r64o69n37l18l7j4l21o33p03n89l89j16J35K44L72P35J039P29
$$ 84797 83430 82466 81797 81260 80942 80905 80891 80570 79937 79234 78645 78256 78140 78275 78519 78891 79626 80665 81394
54577H1394j17p24o69l97l25j37M71R86Q67N98J021J835J801N07r58j399p95O7
$$ 81394 81277 80553 79884 79487 79162 79025 79496 80482 81349 81947 82968 84803 86604 87111 86153 84754 83959 84026
54559H4026O34Q65R92J372K201L157L595L321K788K449K317K335K632L236L932
$$ 84026 84660 85525 86517 87889 90090 93247 96842 100163 102951 105400 107717 110052 112684 115920 119852
54544A19852M735N980P639R068R807J0229J0902J1689J2002J1614J0648R064O718
$$ 119852 124587 130567 138206 147274 157081 167310 178212 189901 201903 213517 224165 233229 239947
54531B39947L878J078j480l918o113p689q638r382j0164j0700j0594r807q583
$$ 239947 243825 244903 243423 239505 233392 225703 217065 207683 197519 186819 176225 166418 157835
54518A57835p261o266n891n912n714n003m182l811l876l860l373k495j528p12
$$ 157835 150574 144308 138417 132505 126791 121788 117606 113795 109919 106059 102686 100191 98663 97951
54504I7951j68P2R3Q3J63K72K71J49Q3J81K36n2n47o44K0R82J381R46K25j56r5
$$ 97951 97783 97855 97948 98031 98194 98466 98737 98886 98969 99150 99386 99334 98787 98143 98163 99145 100526 101472 101697 101541 101446
54483A01446K01O08R27P20j88j157j212k16Q39R25N8r22j408j460j308r26k93
$$ 101446 101647 102255 103182 103902 103714 102557 101345 101129 101968 102893 102951 102029 100621 99161 97853 96927 96634
54466I6634J94J2p86j440j294n95j95m31o99l40L34L95m20j366j738j720j826
$$ 96634 96828 96840 96054 94614 93320 92725 92530 92099 91400 91060 91394 91789 91369 90003 88265 86545 84719
54449H4719j987j708q33L44J523K400K441J393j1o74n48o52j400j802r66M12R45
$$ 84719 82732 81024 80191 80535 82058 84458 86899 88292 88281 87607 87059 86407 85007 83205 82239 82651 83596
54432H3596M61L7K73N56K08m91q66p53m34m9L99O82N01j3k67J37R25J432J367
$$ 83596 84057 84094 84367 84923 85131 84640 83774 83021 82587 82538 82937 83619 84120 84107 83840 83977 84902 86334 87701
54413H7701J164J433K166K745K761K487K343K217J736R94N17N80R30J187J165
$$ 87701 88865 90298 92464 95209 97970 100457 102800 105017 106753 107747 108264 108844 109774 110961 112126
54398A12126P48j04j102j710j664j204p20m08l03m30p70j194j540j642j370q78
$$ 112126 112874 112770 111668 109958 108294 107090 106370 105962 105659 105229 104459 103265 101725 100083 98713 97835
54382I7835o88j204k145k772k657j982j134m19j33m38r84j107n86Q0K85l8n47
$$ 97835 97147 95943 93798 91026 88369 86387 85253 84834 84701 84263 83279 82172 81586 81666 81951 81913 81366
54365H1366q84q05k12O29J203J262J062J015J284J830K534L154L398L223K842
$$ 81366 80482 79677 79465 80094 81297 82559 83621 84636 85920 87750 90284 93438 96836 100059 102901
54350A02901K388J861J388J178J113Q14K24k91n71r21j489j903j853j590j493
$$ 102901 105289 107150 108538 109716 110829 111643 111867 111576 111005 110084 108595 106692 104839 103249 101756
54335A01756j532j532j566j659j562j320j568k656l771l750k547j214m93k16j09
$$ 101756 100224 98692 97126 95467 93905 92585 91017 88361 84590 80840 78293 77079 76586 76370 76261
54320G6261l44r72j510j538j336j491k127k820l110k759j793n94J25j12r42j407
$$ 76261 75917 74945 73435 71897 70561 69070 66943 64123 61013 58254 56461 55867 55992 55880 54938 53531
54304E3531r98k08J20j31k53L10J245J828J736J183M61j80m39k29n2n01j323j554
$$ 53531 52533 52325 52445 52314 52061 52371 53616 55444 57180 58363 58824 58644 58205 57976 57924 57423 56100 54546
54286E4546p76K99Q06P51O70P28O47K56l00p29o98n4P95J077N91k3k29l60q46
$$ 54546 53770 54069 54875 55626 56296 57024 57671 57927 57627 56898 56200 56146 56941 58018 58609 58586 58357 57997 57151
54267E7151j240q20J72P14L56l04m78L4R06J500J143j64j387j454n35K94N78Q17
$$ 57151 55911 55091 55263 55977 56333 56029 55551 55585 56491 57991 59134 58970 57583 56129 55594 55888 56466 57283
54249E7283J297J605J496J327J221O70n39j617j718j042m06j45k3J38L02M65N53
$$ 57283 58580 60185 61681 63008 64229 64899 64360 62743 61025 59983 59577 59432 59409 59547 59849 60314 60867
54232F0867K79m62j245j501j149n53p7K3l81j015j246p73n0L37L91L75K00k76
$$ 60867 61146 60684 59439 57938 56789 56236 56159 56182 55801 54786 53540 52767 52717 53054 53445 53820 54020 53744
54214E3744o60m53O8R5n34j169j363j295j018j18J392K508K244R07k66n61l45
$$ 53744 53084 52631 52699 52794 52260 51091 49728 48433 47415 47297 48689 51197 53441 54348 54082 53521 53176
54197E3176k62m64p23q33o48n6Q07J470J484P98j97r43j037n33L1R7l09o52o28
$$ 53176 52914 52450 51727 50894 50246 50190 50997 52467 53951 54749 54552 53609 52572 52039 52070 52167 51858 51206 50578
54178E0578m87m52k74K97R03R74N15l2n78j313j966j881j101m78m60m49J25Q02
$$ 50578 50091 49639 49365 49662 50565 51539 52054 52022 51444 50131 48165 46284 45183 44705 44245 43796 43921 44723
54160D4723Q39L40j09m15p78r14m27L01N60M76P40J241J129L20j96J01N26M14
$$ 44723 45562 45902 45793 45378 44600 43686 43259 43560 44120 44596 45336 46577 47706 48026 47830 47931 48457 48871
54142D8871J19J40J51k78p28n24J51N93O13N23M19K09J12M00Q59J135J352J723
$$ 48871 48990 49130 49281 49003 48275 47751 47902 48495 49108 49631 50050 50259 50371 50771 51630 52765 54117 55840
54124E5840J776P89j024k508k794k065j049l42j88m55o58m39K1L62N85P35M32
$$ 55840 57616 58405 57381 54873 52079 50014 48965 48623 48435 47980 47322 46883 46904 47266 47851 48586 49018
54107D9018n61j466j157J95J165R12J46j43QQ5J15L23L64j93q53o21N23J388J029
$$ 49018 48457 46991 45834 46029 47194 48106 48252 48109 48117 48202 48317 48640 49004 48811 47958 47337 47860 49248 50277
54088E0277j58j078j227r74p41m35K44J119J491R23j09o43l60L8k25r69j290q22
$$ 50277 50119 49041 47814 46840 46099 45664 45908 47027 48518 49441 49332 48689 48329 48367 48142 47173 45883 45061
54070D5061k28l06q60r00N3J213J429O39n0K14J034J494J411J309J416J379R64
$$ 45061 44833 44527 43667 42767 42820 44033 45462 46101 46051 46265 47299 48793 50204 51513 52929 54308 55272
54053E5272M10rk38j39M47J150J237O26J59M27R32J010R08J185J530J210M97N41
$$ 55272 55682 55673 55435 55296 55743 56893 58130 58756 58915 59342 60274 61284 62192 63377 64907 66117 66614 67155
54035F7155J663K792K955K526K394K578K425J779J204J119J381J718K137K694
$$ 67155 68818 71610 74565 77091 79485 82063 84488 86267 87471 88590 89971 91689 93826 96520
54021I6520L205L413L256K866K373J760R35j7o93o47R2R40J378J424J339J123
$$ 96520 99725 103138 106394 109260 111633 113393 114328 114311 113618 112971 113063 114003 115381 116805 118144 119267
54005A19267O06j30q17j393j942k276k060j392p73m14r2J97k1q60j584j503r81
$$ 119267 119873 119743 118926 117533 115591 113315 111255 109863 109090 108676 108584 108781 108760 107900 106316 104813 103832
53988A03832q96j396j931k322k836l243k754j349k00k14q63j125r60r78j169j017
$$ 103832 102936 101540 99609 97287 94451 91208 88454 87105 86905 86691 85828 84703 83743 82765 81596 80579
53972H0579o91j014k046k771k470j607q95k85N23J199J254R09P33O23K5q88j089
$$ 80579 79888 78874 76828 74057 71587 69980 69085 68800 69323 70522 71776 72685 73418 74041 74066 73178 72089
53955G2089n3J463K254J882P92l85j143j083j03J347K489K884K742K618K850L323
$$ 72089 72036 73499 75753 77635 78427 78042 76899 75816 75713 77060 79549 82433 85175 87793 90643 93966
53939I3966L701L845L923M142M469M754N039N527O199O707O715O207N377M372
$$ 93966 97667 101512 105435 109577 114046 118800 123839 129366 135565 142272 148987 155194 160571 164943
53925A64943L305K342J622J159Q60N78J16o88j673k322k210j418m28L56Q52J187
$$ 164943 168248 170590 172212 173371 174231 174809 174925 174237 172564 170242 168032 166614 166186 166542 167394 168581
53909A68581J547K052K584K812K511J915J461J323J376J549J894K261K296J926
$$ 168581 170128 172180 174764 177576 180087 182002 183463 184786 186162 187711 189605 191866 194162 196088
53895A96088J485J138N42n54j688k162k035k037k441k659k190j485j373j902k406
$$ 196088 197573 198711 199253 198699 197011 194849 192814 190777 188336 185677 183487 182002 180629 178727 176321
53880A76321k492k459k619k823k895l083l656m302m399l781k849j965j174n86
$$ 176321 173829 171370 168751 165928 163033 159950 156294 151992 147593 143812 140963 138998 137824 137238
53866A37238n80j347k402k904k473j514q14q82j564k135j895r17j41m21j506k291
$$ 137238 136658 135311 132909 130005 127532 126018 125204 124322 122758 120623 118728 117811 117670 117249 115743 113452
53850A13452k133j599j581k093k397k117j687j536j510j379j456k104k908k996
$$ 113452 111319 109720 108139 106046 103649 101532 99845 98309 96799 95420 93964 91860 88952 85956
53836H5956k197j303r58q95n28R4M90N44N18M14o3p89j054m14O18J082O69j3j55
$$ 85956 83759 82456 81498 80603 80075 80169 80659 81203 81721 82135 82072 81283 80229 79815 80433 81515 82184 82171 82016
53817H2016M44J282J723J601J254R90O67k2r29j485j381r00m64j40K23O52J116
$$ 82016 82460 83742 85465 87066 88320 89310 89977 89955 89026 87541 86160 85260 84796 84656 84879 85531 86647
53800H6647J659K224K547K508K370K354K178J503O72M84J191K212K961L454L855
$$ 86647 88306 90530 93077 95585 97955 100309 102487 103990 104662 105146 106337 108549 111510 114964 118819
53785A18819L898L226K104J250J017J106J162J213J325J174M14o25j134q97o75
$$ 118819 122717 125943 128047 129297 130314 131420 132582 133795 135120 136294 136708 136083 134949 134052 133377
53770A33377j113j709j487o00l37j287k334k157j040m53j072k140k723k692k395
$$ 133377 132264 130555 129068 128468 128131 126844 124510 122353 121313 120860 119788 117648 114925 112233 109838
53755A09838k046j814j851j938j558o81n5l69j451k551l065k756j754o83l56r13
$$ 109838 107792 105978 104127 102189 100631 99950 99895 99526 98075 95524 92459 89703 87949 87266 86910 85997
53739H5997j544j459q61n13o73r46r93q89q34r13j062r96l96N34J045P75L51N42
$$ 85997 84453 82994 82133 81620 80947 80001 79008 78119 77285 76372 75310 74314 73918 74452 75497 76272 76623 77165
53721G7165J069J011K15n14o43n23n36m75j52N2k28o21m92R9M79K90j27l22k62
$$ 77165 78234 79245 79460 78946 78303 77780 77244 76769 76617 76669 76441 75820 75328 75427 75906 76196 76069 75747 75485
53702G5485j87j32J09O45J249J508J216N66m2l11j72K06M83L80jk82k86k65m18
$$ 75485 75298 75166 75275 75920 77169 78677 79893 80459 80417 80106 79934 80140 80623 81003 81002 80720 80434 80169 79751
53683G9751m68m1P43J378J555J282O78P1P9R55J959K032J217O43R13J281Q77J14
$$ 79751 79283 79242 79985 81363 82918 84200 84878 84949 85028 85983 87942 89974 91191 91834 92747 94028 94905 95019
53665I5019M5P45J090K78j078j682j057J9M95K41J0L18P29M85l74j007q11k1P72
$$ 95019 95064 95809 96899 97177 96099 94417 93360 93379 93874 94115 94125 94443 95172 95657 95283 94276 93465 93444 94216
53646I4216J181J028K94n85q43k28N57O67J05m07l94k8K87L97L70K92K04J32J05
$$ 94216 95397 96425 96719 96134 95291 95063 95620 96287 96392 95985 95591 95563 95850 96247 96617 96909 97113 97245 97350
53627I7350R2n8m69r12q54j30O23O58R5l18l55m66p79p80k46K76M10N77J101J476
$$ 97350 97442 97384 96915 96003 95149 95019 95642 96300 96395 96077 95722 95256 94477 93697 93451 93727 94137 94714 95815 97291
53607I7291J253J023J594K607L045K773K578K741K656J993J231P65L33k86o97
$$ 97291 98544 99567 101161 103768 106813 109586 112164 114905 117561 119554 120785 121550 121883 121597 120900
53592A20900n01J04P48J484K471L393L680L162K193J259O68M99N92O86O81P04
$$ 120900 120399 120503 121251 122735 125206 128599 132279 135441 137634 138893 139561 140060 140652 141338 142019 142723
53576A42723R11J287J626J606J040K00k22J62Q88J127O27j89r23j477j698j385
$$ 142723 143634 144921 146547 148153 149193 149393 149171 149333 150221 151348 151975 151786 150863 149386 147688 146303
53560A46303p53l58l91m84m28m88q26j090r40n82l84l33k14m0O0J06J05j14n03
$$ 146303 145550 145192 144801 144317 143889 143401 142575 141485 140545 139963 139579 139246 139032 138992 139052 139158 139263 139149 138646
53541A38646n45J63J241J839J568P39j74r10j267j011j78P57J233J117Q57R78
$$ 138646 138101 138264 139505 141344 142912 143651 143477 142567 141300 140289 140111 140868 142101 143218 144075 145053
53525A45053J460J678J145K28k11J74R15J491J901K302K562K561K627L177M089
$$ 145053 146513 148191 149336 149564 149353 149527 150442 151933 153834 156136 158698 161259 163886 167063 171152
53510A71152M861N270N498N661N645N435N286N481O036O723P226P367P325P529
$$ 171152 176013 181283 186781 192442 198087 203522 208808 214289 220325 227048 234274 241641 248966 256495
53496B56495Q171Q920R330R432R658J0207J0803J1140J1304J1617J2170J2655
$$ 256495 264666 273586 282916 292348 302006 312213 323016 334156 345460 357077 369247 381902
53484C81902J2651J2115J1486J1255J1417J1572J1547J1577J1787J1864J1509
$$ 381902 394553 406668 418154 429409 440826 452398 463945 475522 487309 499173 510682
53473E10682J0999J0815J0982J1111J1001J0747J0355R733R083Q806Q875Q728
$$ 510682 521681 532496 543478 554589 565590 576337 586692 596425 605508 614314 623189 631917
53461F31917Q038P188O664O375N925N321M941M799M369L347K230J783K008K035
$$ 631917 639955 647143 653807 660182 666107 671428 676369 681168 685537 688884 691114 692897 694905 696940
53447F96940J136m14j748k515l205m414o108p826r244j0244j0649j0328r600r169
$$ 696940 698076 697662 695914 693399 690194 685780 679672 671846 662602 652358 641709 631381 621781 612612
53433F12612r469j0237j0893j1187j1361j1691j2044j1962j1221j0173r458r367
$$ 612612 603143 592906 582013 570826 559465 547774 535730 523768 512547 502374 492916 483549
53421D83549r584r586r110q214p090n965n020m245l476k726k211j892j202K61
$$ 483549 473965 464379 455269 447055 439965 434000 428980 424735 421259 418533 416322 414430 413228 413489
53407D13489K012L107L357L616M616O015O925P123P211P749Q670R585J0386J1263
$$ 413489 415501 418608 421965 425581 430197 436212 443137 450260 457471 465220 473890 483475 493861 505124
53393E05124J2368J3538J4371J4561J4303J4289J5097J6542J7916J8882J9812
$$ 505124 517492 531030 545401 559962 574265 588554 603651 620193 638109 656991 676803
53382F76803K1092K2469K3536K4470K5685K6896K7283K6770K6377K6923K7938
$$ 676803 697895 720364 743900 768370 794055 820951 848234 875004 901381 928304 956242
53371I56242K8466K8413K8362K8347K7776K6505K5170K4224K3353K2130K0643
$$ 956242 984708 1013121 1041483 1069830 1097606 1124111 1149281 1173505 1196858 1218988 1239631
53360A239631J9175J7731J6281J4970J3799J2513J1085R832Q725P103M540J506
$$ 1239631 1258806 1276537 1292818 1307788 1321587 1334100 1345185 1355017 1363742 1370845 1375385 1376891
53348A376891j345m098p125j0163j2622j4537j6522j8806k1079k3193k5259k7014
$$ 1376891 1375546 1371448 1364323 1354160 1341538 1327001 1310479 1291673 1270594 1247401 1222142 1195128
53336A195128k7922k8075k8306k9042k9666k9373k8236k6990k6106k5461k4783
$$ 1195128 1167206 1139131 1110825 1081783 1052117 1022744 994508 967518 941412 915951 891168
53325H91168k4073k3614k3646k4010k4166k3756k3046k2472k1913k0919j9515
$$ 891168 867095 843481 819835 795825 771659 747903 724857 702385 680472 659553 640038
53314F40038j8251j7319j6249j4750j3243j2292j1878j1615j1241j0596r498q028
$$ 640038 621787 604468 588219 573469 560226 547934 536056 524441 513200 502604 493106 485078
53302D85078o595n412m288l199k589k650k744k089p78M71J313J888K179J995J675
$$ 485078 478483 473071 468783 465584 462995 460345 457601 455512 454734 455205 456518 458406 460585 462580 464255
53287D64255K157L925O266P803P792O805O275P203R148J0678J0977J0753J1236
$$ 464255 466412 470337 476603 484406 492198 499003 505278 512481 521629 532307 543284 554037 565273
53274E65273J2567J3797J4225J4070J3764J3323J2675J2065J1691J1312J0594
$$ 565273 577840 591637 605862 619932 633696 647019 659694 671759 683450 694762 705356
53263G05356R610Q679P912P201O520N915N313M532L527K426J370M03m43j158j851
$$ 705356 714966 723645 731557 738758 745278 751193 756506 761038 764565 766991 768361 768764 768321 767163 765312
53248G65312k829m446o671q847j0119j0383j0526j1434j2920j4085j4606j5091
$$ 765312 762483 758037 751366 742519 732400 722017 711491 700057 687137 673052 658446 643355
53236F43355j6017j6938j7077j6284j5181j4476j4500j5019j5340j4862j3835
$$ 643355 627338 610400 593323 577039 561858 547382 532882 517863 502523 487661 473826
53225D73826j3283j3832j4874j5271j4629j3494j2530j2016j2011j2418j2804
$$ 473826 460543 446711 431837 416566 401937 388443 375913 363897 351886 339468 326664
53214C26664j2698j2119j1465j0798r733q143o521n428m987n160n959p020p364
$$ 326664 313966 301847 290382 279584 269851 261708 255187 249759 244772 239612 233653 226633 219269
53201B19269o295m369k948k739l240l664l835l990m087l864l426l293l706m138
$$ 219269 212974 208605 205657 202918 199678 196014 192179 188189 184102 180238 176812 173519 169813 165675
53187A65675l828k717j640j451k077k622k409j714j336j621k133k305k118j978
$$ 165675 161847 159130 157490 156039 153962 151340 148931 147217 145881 144260 142127 139822 137704 135726
53173A35726k105k287k265k116k092k223k227j880j282p44n18o78j132j642j938
$$ 135726 133621 131334 129069 126953 124861 122638 120411 118531 117249 116505 115987 115309 114177 112535 110597
53158A10597j959j890j843j605r68k09P9k68o87n56M2M52K61l04o94o54m36n16
$$ 110597 108638 106748 104905 103300 102332 102123 102202 101934 101247 100691 100733 101185 101446 101142 100448 99794 99358 98842
53140I8842j063j714j911j547j069q69p37k23N96J075P46r5o96n80N6N49L14n98
$$ 98842 97779 96065 94154 92607 91538 90669 89932 89709 90305 91380 92126 92031 91335 90755 90811 91360 91674 91076
53122I1076j477j603r82k09L37Q36J417J601Q28n59j345o94Q27J757J271J3p02
$$ 91076 89599 87996 87014 86805 87142 87978 89395 90996 91824 91265 89920 89226 90053 91810 93081 93094 92392
53105I2392l40M61Q86R03R55J010O03k76q94p51l27m27j023j332r81n08o00j192
$$ 92392 92052 92513 93399 94302 95257 96267 96870 96594 95700 94949 94622 94195 93172 91840 90859 90351 89751 88559
53087H8559j564j137M3J384K196K144J458O28m2n10o85l85K80Q54J025J003J065
$$ 88559 86995 85858 85901 87285 89481 91625 93083 93711 93669 93159 92474 92089 92369 93223 94248 95251 96316
53070I6316J061P20K94L74J013J579J643J534J740K131K283K241K412K752K671
$$ 96316 97377 98097 98391 98765 99778 101357 103000 104534 106274 108405 110688 112929 115341 118093 120764
53055A20764J858O99l63j330k220k546j877o96j15o21j561k037j883j568j456
$$ 120764 122622 123321 122958 121628 119408 116862 114985 114289 114174 113553 111992 109955 108072 106504 105048
53040A05048j520j628j752j841j754j430j056r38j189j605j850j755j408j000
$$ 105048 103528 101900 100148 98307 96553 95123 94067 93129 91940 90335 88485 86730 85322 84322
53026H4322p13p25j079j494j509j055o12n91p60o52l44l15n67m94J56P46N82j24
$$ 84322 83609 82884 81805 80311 78802 77747 77135 76544 75784 75132 74788 74473 73906 73412 73568 74314 74896 74772
53008G4772n77m68k08k04k94j17L44P25O93K78j70l13j41Kk57r51j641j708r13
$$ 74772 74195 73727 73519 73315 73021 72904 73248 73973 74666 74944 74774 74461 74320 74322 74065 73114 71473 69765 68852
52989F8852K37Q96P68L94L49M60K64j30l42o46j646k864k842j147O54R12M2k72
$$ 68852 69089 69985 70753 71147 71496 71956 72220 72090 71748 71102 69456 66592 63750 62603 63257 64169 64211 63939
52971F3939M54J084P70P6q2M21J133J719J913J441M65k82k53K85P05P87P37O72
$$ 63939 64393 65477 66247 66323 66241 66662 67795 69514 71427 72868 73333 73051 72798 73083 73788 74575 75312 75984
52953G5984M67L3m57p08o38n86j007j761k002j152J92R11P81N20N12L08l58r48
$$ 75984 76451 76484 76027 75319 74681 74095 73088 71327 69325 68173 68365 69276 70057 70577 71089 71397 71039 70091
52935G0091r54o36l77K9P81J365J264R06J026J345Q73m28j311q22N09J540J928
$$ 70091 69137 68501 68124 68153 68934 70299 71563 72469 73495 74840 75713 75285 73974 73152 73661 75201 77129
52918G7129K203K726L213L205K665J933J274O39o1n61l84M63J191J014J27m64
$$ 77129 79332 82058 85271 88476 91141 93074 94348 94987 94926 94365 93981 94444 95635 96649 96776 96312
52902I6312j90L74K53p73j996k649k622k303j988j665j297j047j065j237j287
$$ 96312 96122 96496 96749 95976 93980 91331 88709 86406 84418 82753 81456 80409 79344 78107 76820
52887G6820j132q84n76r7M89Q09M94m72j701k580k558j592l94J71J4j34K32P30
$$ 76820 75688 74804 74228 74131 74620 75429 75923 75451 73750 71170 68612 67020 66626 66797 66811 66677 66909 67639
52869F7639Q28P31R76J414J333N45k53m05p7J86K61M34Q31J194J277J153J030
$$ 67639 68467 69198 70174 71588 72921 73466 73213 72808 72731 72917 73178 73612 74443 75637 76914 78067 79097
52852G9097R46P51M27J84K02L21J78l47j024j532j670j402r38p14r00r93m60K96
$$ 79097 80043 80794 81221 81405 81607 81928 82106 81759 80735 79203 77533 76131 75193 74479 73579 72586 72126 72422
52834G2422K89n08q41O1J181J061j52j047j049r74j478k092k167j832j473j011
$$ 72422 72711 72203 71362 71423 72604 73665 73513 72466 71417 70443 68965 66873 64706 62874 61401 60390
52818F0390l00L19M43K36N9j35n24q15n30J99O75M56k55j003j501j605j284o64
$$ 60390 60090 60409 60852 61088 61147 61012 60488 59673 59143 59342 60017 60473 60218 59215 57714 56109 54825 54161
52800E4161J8O70J382K185K887L201L013K534K137J999J902J613J329J432J779
$$ 54161 54179 54849 56231 58416 61303 64504 67517 70051 72188 74187 76089 77702 79031 80463 82242
52785H2242J712R99K96K93P42Q61M67O6j03m81j388k402k901k813k419j686m52
$$ 82242 83954 84953 85249 85542 86284 87145 87612 87678 87575 87094 85706 83304 80403 77590 75171 73485 73033
52768G3033P83R53k87j811k098r74K34L46m14j026j063q90q43q09p13p56r99j124
$$ 73033 73816 74769 74482 72671 70573 69599 69833 70179 69765 68739 67676 66786 65943 65134 64421 63665 62666 61542
52750F1542r39p47q52r59n03M65J218J231Q48Q14J311J721J377M24k61k1R05J716
$$ 61542 60603 59856 59004 58045 57542 58007 59225 60456 61304 62118 63429 65150 66527 66951 66690 66669 67574 69290
52732F9290J962J812J545J142N02k33q22j288j805k278k300j664p86m11p86j340
$$ 69290 71252 73064 74609 75751 76253 76020 75198 73910 72105 69827 67527 65863 65077 64666 63880 62540
52716F2540j299n48L35Q53R58P17P4o99q96k57M38L77n9J34Q95J064J11j059j508
$$ 62540 61241 60693 61028 61881 62839 63556 63630 62931 62035 61778 62216 62593 62534 62668 63563 64627 64738 63679 62171
52697F2171j459j529j549r90jP82J154J257R70J51o85p91k27K40K49J71L44O81
$$ 62171 60712 59183 57634 56644 56643 57425 58579 59836 60806 60957 60272 59481 59254 59494 59743 59914 60258 60939
52679F0939J059J394J368P15r2k26K82N11P2k89O3N61K90o13j223j140q19p06
$$ 60939 61998 63392 64760 65475 65383 65157 65439 65950 66022 65733 65796 66357 66647 66034 64811 63671 62852 62146
52661F2146o92m85n4L64M49J8o87j045o69Q6N30M76M29R39K056L356M284M529
$$ 62146 61454 60969 60915 61279 61728 61746 61059 60014 59345 59431 59961 60437 60866 61805 63861 67217 71501 76030
52643G6030M283M123M402M802M648L625K040M87n53r13q33p98j070j449j683j926
$$ 76030 80313 84436 88838 93640 98288 101913 103953 104440 103887 102974 102141 101343 100273 98824 97141 95215
52627I5215k450l084l365l231l053k962k666k075j632j664j807j538r57o03n57
$$ 95215 92765 89681 86316 83085 80032 77070 74404 72329 70697 69033 67226 65688 64731 64128 63571
52612F3571l17L91J075J068L69l36m54q5J65o3m71m73M6N13L33m03j025j042n37
$$ 63571 63254 63645 64720 65788 66157 65821 65367 65282 65447 65384 64913 64440 64486 64999 65332 64929 63904 62862 62325
52593F2325J60Q28J295J310Q27K03j47k34k86k25K57J020J348P85k01p29n46j72
$$ 62325 62485 63313 64608 65918 66745 66948 66801 66567 66281 66056 66313 67333 68681 69466 69265 68536 67990 67818
52575F7818q0j20J35P38J239J130L95l81m79K35J072J178M68l00m09Q1N56O07
$$ 67818 67738 67618 67753 68491 69730 70860 71255 70874 70395 70630 71702 72880 73348 73048 72639 72720 73276 73883
52557G3883L62J39L5o7j91j13L77J093J474J162M14k04m72n98p55p87m98O3O88
$$ 73883 74245 74384 74419 74352 74161 74048 74425 75518 76992 78154 78568 78364 77892 77294 76539 75752 75254 75317 76005
52538G6005J137J133N48l18r30j188j463j790j529l07J110J516P55j55m11k61
$$ 76005 77142 78275 78823 78505 77575 76387 74924 73134 71605 71298 72408 73924 74679 74524 74113 73852
52522G3852l17o32q13o79l76p7J20J27l7j48k8K51M73N47M85K97O7k0J12K57R9
$$ 73852 73535 72903 72090 71411 71035 70958 71078 71205 71168 71020 70992 71243 71716 72263 72748 73045 73112 73092 73204 73461 73560
52501G3560n00j426k321k621j896m48P13P99J20k78J91J090J551J192L83k09k58
$$ 73560 73060 71634 69313 66692 64796 64348 65061 65860 65980 65702 65893 66983 68534 69726 70109 69900 69642
52484F9642o9j88o59q64k51R10J763J749J011J15m01k69L06P20O05L07L61N55
$$ 69642 69573 69385 68726 67862 67611 68521 70284 72033 73044 73159 72758 72489 72795 73515 74120 74427 74788 75343
52466G5343J50q93j591j158j08M18K9o74r85o88R4J030J564J253L27m15m41j3
$$ 75343 75493 74600 73009 71851 71743 72161 72190 71516 70531 69843 69937 70967 72531 73784 74111 73696 73255 73242
52448G3242K08r9o57r37o80j93l0l24n22r9O96J154J071R49J144J400J387J216
$$ 73242 73450 73351 72694 71757 71077 70884 70854 70530 70008 69909 70605 71759 72830 73779 74923 76323 77710 78926
52430G8926J095Q61L50j03j9N20J002J203J275J146M47p74j768j838j056k1Q17
$$ 78926 80021 80882 81232 81129 81110 81630 82632 83835 85110 86256 86703 85929 84161 82323 81267 81246 82063
52413H2063J261J159M78m68j207j476j196l47P76J441J136L75J52N50N62l45j218
$$ 82063 83324 84483 84961 84493 83286 81810 80614 80267 81043 82484 83620 83995 84147 84697 85259 84914 83696
52396H3696q37M71J202O77k02l80L7L58M62O47P38K60n64q15j62N29L00n76r63
$$ 83696 82859 83330 84532 85209 85007 84627 84664 85022 85484 86131 86869 87129 86565 85750 85588 86117 86417 85841 84878
52377H4878m01L40L32l47q31o05lL89M31L57L12K70K69M02N58M84J86KJ86O18
$$ 84878 84477 84817 85149 84802 83971 83366 83363 83752 84183 84540 84852 85122 85391 85793 86351 86835 87021 87023 87209 87827
52357H7827J044J391J621J570J180P47N70M98K07j92j77M42J215J630J603J308
$$ 87827 88871 90262 91883 93453 94633 95380 95950 96448 96655 96463 96286 96728 97943 99573 101176 102484
52341A02484Q13K18j47pM95R04R13N70J97K10Q63J876K483K170J297O60N46N59
$$ 102484 103297 103515 103368 103361 103856 104760 105673 106243 106440 106650 107513 109389 111872 114042 115339 115999 116545 117104
52323A17104M06L33O02R91J113R91Q75O95J95m07m20M07J371J602J106O84R35
$$ 117104 117510 117843 118445 119436 120549 121540 122415 123110 123305 122898 122478 122885 124256 125858 126964 127648 128583
52306A28583J690K417K738K470J626O59L96J290K777L725L547K650J797J363J265
$$ 128583 130273 132690 135428 137898 139524 140183 140579 141869 144646 148371 151918 154568 156365 157728 158993
52291A58993J349J590K020K634L365M018M314M047L251K194J256P56P48R39R33
$$ 158993 160342 161932 163952 166586 169951 173969 178283 182330 185581 187775 189031 189787 190535 191474 192407
52276A92407O23L19L51O83R50Q43L29l75r90j287j229r79o79k53M95J506K302
$$ 192407 193030 193349 193700 194383 195333 196176 196505 196130 195140 193853 192624 191645 190966 190713 191208 192714 195016
52259A95016K399J841J154P60O14N71R04J986L473M301L818K642J950K138K570
$$ 195016 197415 199256 200410 201170 201784 202355 203259 205245 208718 213019 216837 219479 221429 223567 226137
52244B26137K641K473K430K448K275K045K151K642L069L034K614K224K221K659
$$ 226137 228778 231251 233681 236129 238404 240449 242600 245242 248311 251345 253959 256183 258404 261063
52230B61063L183L139K062L09r65p49P70K384L126L253L657M547N117M664L573
$$ 261063 264246 267385 269447 269756 268791 268042 268812 271196 274322 277575 281232 285779 290896 295560 299133
52215B99133K786K643K721K702K827L309L838L947L635L302L197L162K882K327
$$ 299133 301919 304562 307283 309985 312812 316121 319959 323906 327541 330843 334040 337202 340084 342411
52201C42411J935K272L345M339M429L840L644M369N320N516M891M072L471L057
$$ 342411 344346 346618 349963 354302 358731 362571 366215 370584 375904 381420 386311 390383 393854 396911
52187C96911K800K708K526J968J276R96J165J152N63k37p28r83j414j979k122
$$ 396911 399711 402419 404945 406913 408189 409185 410350 411502 412065 411828 411100 410117 408703 406724 404602
52172D04602j556q10p26j444k157k043j297q90j335k090k423k339k269k205j830
$$ 404602 403046 402236 401510 400066 397909 395866 394569 393679 392344 390254 387831 385492 383223 381018 379188
52157C79188j325j309j833k141j713j046r91j636k348k633k565k374k045j410
$$ 379188 377863 376554 374721 372580 370867 369821 368830 367194 364846 362213 359648 357274 355229 353819
52143C53819m74M51R15O62j76j264k352l234l536k944j722o42k25l26o07j033
$$ 353819 353345 353796 354711 355373 355197 353933 351581 348347 344811 341867 340145 339503 339278 338952 338345 337312
52127C37312j609j939j613q73m15n41r02j116j186j231j173r87r81j460k267k921
$$ 337312 335703 333764 332151 331278 330863 330322 329420 328304 327118 325887 324714 323727 322746 321286 319019 316098
52111C16098l166l174l096k758j950r11k01l8oL63Q98R98N78L17P93J636J984
$$ 316098 312932 309758 306662 303904 301954 301043 300842 300804 300798 301161 302059 303057 303635 303952 304745 306381 308365
52094C08365J624J248J520K336L150L665L876L753L288K835K897L466L887L622
$$ 308365 309989 311237 312757 315093 318243 321908 325784 329537 332825 335660 338557 342023 345910 349532
52080C49532K928K586L021L863M249L523J827J84k14Q25K134K343J379M49N58
$$ 349532 352460 355046 358067 361930 366179 369702 371529 371713 371499 372324 374458 376801 378180 378629 379187
52065C79187J429K081J992J402P91N22Q28J718K848L697L933L532K713J864J369
$$ 379187 380616 382697 384689 386091 386882 387404 388232 389950 392798 396495 400428 403960 406673 408537 409906
52050D09906J222J094Q46P31Q04N78k65j091j017j59M12L5q81j627j918j743j204
$$ 409906 411128 412222 413068 413799 414603 415181 414916 413825 412808 412649 413061 413096 412215 410588 408670 406927 405723
$$ [...]
##END NTUPLES=NMR SPECTRUM
##END=
