##TITLE=NES1039_872015048_9242671_qEZkBcLU37
##JCAMPDX= 6.0         $$ Bruker NMR JCAMP-DX V2.0
##DATA TYPE= NMR SPECTRUM
##DATA CLASS= NTUPLES
##ORIGIN= BRUKER
##OWNER= Administrator
$$ 1.72 TOPSPIN		Version 2.1
$$ 2015-07-02 05:54:56.524 -0700  Administrator@X
$$ Compression mode = diff/dup
##.OBSERVE FREQUENCY= 400.02188249412
##.OBSERVE NUCLEUS= ^1H
##.ACQUISITION MODE= SIMULTANEOUS (DQD)
##.ACQUISITION SCHEME= undefined
##.AVERAGES= 8
##.DIGITISER RES= 22
##SPECTROMETER/DATA SYSTEM= spect
##.PULSE SEQUENCE= zg30
##.SOLVENT NAME= COFFEE_meoh
##.SHIFT REFERENCE= INTERNAL, COFFEE_meoh, 1, 14.98509
##AUDIT TRAIL= $$ (NUMBER, WHEN, WHO, WHERE, PROCESS, VERSION, WHAT)
$$ ##TITLE= Audit trail, TOPSPIN		Version 2.1
$$ ##JCAMPDX= 5.01
$$ ##ORIGIN= Bruker BioSpin GmbH
$$ ##OWNER= Administrator
$$ $$ E:\/data/COFFEE/nmr/NES1039_872015048_9242671_qEZkBcLU37/20/pdata/1/auditp.txt
$$ ##AUDIT TRAIL=  $$ (NUMBER, WHEN, WHO, WHERE, PROCESS, VERSION, WHAT)
(   1,<2015-07-02 05:54:49.133 -0700>,<Administrator>,<X>,<go>,<TOPSPIN 2.1>,
      <created by zg
	started at 2015-07-02 05:53:43.399 -0700,
	POWCHK enabled, PULCHK disabled,
       configuration hash MD5:
       21 0F 79 D6 B3 7B B4 F6 88 20 88 DB 03 48 BD 9F
       data hash MD5: 64K
       63 CA 37 A5 9A CE C2 33 51 A4 2E B0 37 4A E0 CF>)
(   2,<2015-07-02 05:54:52.461 -0700>,<Administrator>,<X>,<proc1d>,<TOPSPIN 2.1>,
      <Start of raw data processing
       efp LB = 0 FT_mod = 6 PKNL = 1 PHC0 = 0 PHC1 = 0 SI = 32K 
       data hash MD5: 32K
       43 39 39 86 AD 29 A2 B7 71 F4 C2 A8 0D 39 75 C4>)
(   3,<2015-07-02 05:54:52.742 -0700>,<Administrator>,<X>,<proc1d>,<TOPSPIN 2.1>,
      <pk PHC0 = 91.34033 PHC1 = 0 
       data hash MD5: 32K
       8E 6D 88 BB F3 E9 C3 2F 9E 3C F2 13 4F 07 73 00>)
(   4,<2015-07-02 05:54:52.852 -0700>,<Administrator>,<X>,<proc1d>,<TOPSPIN 2.1>,
      <abs ABSG = 1 
       data hash MD5: 32K
       E0 D9 36 5A EB 7D C0 81 DA 3C A9 AB 60 E2 57 E4>)
(   5,<2015-07-02 05:54:52.914 -0700>,<Administrator>,<X>,<proc1d>,<TOPSPIN 2.1>,
      <abs ABSG = 2 
       data hash MD5: 32K
       DE 31 5E 54 7F 0A 0C 6D 16 3C DE 2F EC 7D 4D 7C>)
(   6,<2015-07-02 05:54:52.977 -0700>,<Administrator>,<X>,<proc1d>,<TOPSPIN 2.1>,
      <abs ABSG = 3 
       data hash MD5: 32K
       BD 27 19 54 14 B4 70 80 53 C2 C0 FA 72 FB 60 98>)
(   7,<2015-07-02 05:54:53.039 -0700>,<Administrator>,<X>,<proc1d>,<TOPSPIN 2.1>,
      <abs ABSG = 4 
       data hash MD5: 32K
       8B 5B 85 6F F1 54 85 6A 73 7F 91 3B CD B6 D0 4A>)
(   8,<2015-07-02 05:54:53.102 -0700>,<Administrator>,<X>,<proc1d>,<TOPSPIN 2.1>,
      <abs ABSG = 5 
       data hash MD5: 32K
       56 0A D0 C5 04 5B 46 30 36 D4 EE 4D 38 56 F2 90>)
$$ ##END=
$$ 
$$ $$ hash MD5
$$ $$ A8 1E C7 36 35 C8 AB BB 3A 02 EA CC 5E 49 7D CE
##$RELAX= 
##$RELAX= 
##$RELAX= 
##$RELAX= 
##$RELAX= 
##$RELAX= 
##$RELAX= 
$$ Bruker specific parameters
$$ --------------------------
##$DU= <E:\>
##$EXPNO= 20
##$NAME= <NES1039_872015048_9242671_qEZkBcLU37>
$$ [...]
150 150 150 150 150 150 150 150
##$TP07= 0
##$TPNAME0= <>
##$TPNAME1= <>
##$TPNAME2= <>
##$TPNAME3= <>
##$TPNAME4= <>
##$TPNAME5= <>
##$TPNAME6= <>
##$TPNAME7= <>
##$TPOAL= (0..7)
0.5 0.5 0.5 0.5 0.5 0.5 0.5 0.5
##$TPOFFS= (0..7)
0 0 0 0 0 0 0 0
##$TUNHIN= 0
##$TUNHOUT= 0
##$TUNXOUT= 0
##$USERA1= <user>
##$USERA2= <user>
##$USERA3= <user>
##$USERA4= <user>
##$USERA5= <user>
##$V9= 5
##$VALIST= <valist>
##$VCLIST= <CCCCCCCCCCCCCCC>
##$VD= 0
##$VDLIST= <DDDDDDDDDDDDDDD>
##$VPLIST= <PPPPPPPPPPPPPPP>
##$VTLIST= <TTTTTTTTTTTTTTT>
##$WBST= 2048
##$WBSW= 25
##$XGAIN= (0..3)
0 0 0 0
##$XL= 0
##$YL= 0
##$YMAX_a= 623349
##$YMIN_a= -522762
##$ZGOPTNS= <>
##$ZL1= 120
##$ZL2= 120
##$ZL3= 120
##$ZL4= 120
##$ABSF1= 14.98509
##$ABSF2= -5.573092
##$ABSG= 5
##$ABSL= 3
##$ALPHA= 0
##$AQORDER= 0
##$ASSFAC= 0
##$ASSFACI= 0
##$ASSFACX= 0
##$ASSWID= 0
##$AUNMP= <proc_prof1d_extract_pilot.lims>
##$AXLEFT= 0
##$AXNAME= <>
##$AXNUC= <1H>
##$AXRIGHT= 0
##$AXTYPE= 0
##$AXUNIT= <>
##$AZFE= 0.1
##$AZFW= 0.1
##$BCFW= 0
##$BC_mod= 0
##$BYTORDP= 0
##$COROFFS= 0
##$CY= 15
##$DATMOD= 1
##$DC= 0
##$DFILT= <>
##$DTYPP= 0
##$F1P= 0
##$F2P= 0
##$FCOR= 0.5
##$FTSIZE= 32768
##$FT_mod= 6
##$GAMMA= 0
##$GB= 0
##$INTBC= 1
##$INTSCL= 1
##$ISEN= 128
##$LB= 0
##$LEV0= 0
##$LPBIN= 0
##$MAXI= 10000
##$MC2= 0
##$MEAN= 0
##$ME_mod= 0
##$MI= 0
##$NCOEF= 0
##$NC_proc= -8
##$NLEV= 6
##$NOISF1= 0
##$NOISF2= 0
##$NSP= 0
##$NTH_PI= 0
##$NZP= 0
##$OFFSET= 14.98509
##$PC= 1
##$PHC0= 91.34033
##$PHC1= 0
##$PH_mod= 1
##$PKNL= yes
##$PPARMOD= 0
##$PPDIAG= 0
##$PPIPTYP= 0
##$PPMPNUM= 2147483647
##$PPRESOL= 1
##$PSCAL= 4
##$PSIGN= 0
##$PYNMP= <proc.py>
##$REVERSE= no
##$SF= 400.02
##$SI= 32768
##$SIGF1= 0
##$SIGF2= 0
##$SINO= 400
##$SIOLD= 32768
##$SPECTYP= <>
##$SREGLST= <1H.CDCl3>
##$SSB= 0
##$STSI= 32768
##$STSR= 0
##$SW_p= 8223.68421052631
##$SYMM= 0
##$S_DEV= 0
##$TDeff= 65536
##$TDoff= 0
##$TI= <>
##$TILT= no
##$TM1= 0
##$TM2= 0
##$TOPLEV= 0
##$USERP1= <user>
##$USERP2= <user>
##$USERP3= <user>
##$USERP4= <user>
##$USERP5= <user>
##$WDW= 1
##$XDIM= 32768
##$YMAX_p= 452062692
##$YMIN_p= -660374
##$CURPLOT= <Network HP LaserJet P1505>
##$CURPRIN= <$Network HP LaserJet P1505>
##$DFORMAT= <normdp>
##$LAYOUT= <+/1D_H.xwp>
##$LFORMAT= <normlp>
##$PFORMAT= <normpl>
##$SURQMSG= 1
$$ End of Bruker specific parameters
$$ ---------------------------------
##NTUPLES= NMR SPECTRUM
##VAR_NAME=  FREQUENCY,     SPECTRUM/REAL,   SPECTRUM/IMAG
##SYMBOL=    X,             R,               I
##VAR_TYPE=  INDEPENDENT,   DEPENDENT,       DEPENDENT
##VAR_FORM=  AFFN,          ASDF,            ASDF
##VAR_DIM=   32768,         32768,           32768
##UNITS=     HZ,            ARBITRARY UNITS, ARBITRARY UNITS
##FACTOR=    0.250966925370066, 1,           1
##FIRST=     8223.43324360094, -387564,      28184
##LAST=      0,             -69363,          -235778
##MIN=       0,             -660374,         0
##MAX=       8223.43324360094, 452062692,    0
$$ Real data points
##PAGE= N=1
##DATA TABLE= (X++(R..R)), XYDATA
$$ [...]
19463a23565r95N3521A60472b56654A92810n0663f3417g543m8729j69768h1251
19451c04431a3344E9135b00583I3705B1955a5261B17018b05194A03512a19542
19440C28196A14831a85602A21441h9502j94791K3637A29295a99019i4135k41037
19430c35172G9643K44128c67640B64488f490A78511f0577l68768f5917G4009c30006
19418a82654h9352j00888A65570b87732d9728j00678B09425a38303C57994a24280
19407c09265a03519A81080J72002c05129C410g1263j37563K3747A8453a50632
19396b45392D91864E366d33635A46686a21466k0452A30163B5132d83805A21930
19385f9971d445j66646I6847O1264L2201b28971L5411h8431l4550B27854I7638
$$ y = [-123565, -124560, -71039, 160472, -256654, 192810, 142147, -63417, -7543, -56272, -226040, -81251, -304431, -13344, 59135, -200583, 93705, 21955, -15261, 217018, -205194, 103512, -119542, 328196, 114831, -185602, 121441, -89502, -284293, -260656, 129295, -199019, -94135, -335172, 79643, 323771, -367640, 264488, -6490, 178511, -60577, -429345, -65917, 74009, -330006, -182654, -89352, -190240, 165570, -287732, -49728, -150406, 209425, -138303, 357994, -124280, -309265, -103519, 181080, 353082, -305129, 3410, -71263, -208826, -185079, 18453, -150632, -245392, 491864, 5366, -433635, 146686, -121466, -141918, 130163, 25132, -483805, 121930, -69971, -4445, -171091, 96847, 158111, 190312, -228971, -193560, -88431, -122981, 227854, 97638]
19373a29813I5061d0342E1330b14386J1116A23747e3774j28384Q0594q6804J2153
19362a76215C9432a79172D1842a3505G7986K03874j35750R6639F6623d3507B9329
19350H9752a24617B9703H427P7482i2495b8243B4629b89364H490J8307e1261l30837
19338c82098a69076e1784J8733a1225r5109d7827k47983Q0992f2743j03043g7787
19326a40640r1939C3796j0397a23286N614j23707b0713j65992b2658n1145o7136
19315a40939O6423j15133a6536k47412J00454k48258B0731a24624a1831k78755
19305b90586G4447b59072N2323f2285E6867J10168a113j26109C31980A65822d76345
19293G433J38073a30280k9119j11705J34662j05836k2861f4676a7128k38930G5064
$$ y = [-129813, 95061, -40342, 51330, -214386, -203270, 123747, -53774, -182158, -101564, -188368, -176215, 39432, -179172, 41842, -13505, 77986, 281860, 146110, 242749, 66623, -43507, 29329, 89752, -124617, 29703, 8427, 85909, -92495, -28243, 24629, -289364, 8490, 26797, -51261, -382098, -169076, -51784, -33051, -11225, -106334, -47827, -295810, -214818, -62743, -165786, -77787, -140640, -232579, 33796, 23399, -123286, -117672, -241379, -20713, -186705, -22658, -73803, -140939, -74516, -189649, -16536, -263948, -163494, -411752, 20731, -124624, -11831, -290586, 74447, -259072, -206749, -62285, 56867, 167035, -1113, -127222, 331980, 165822, -476345, 7433, 145506, -130280, -159399, -271104, -136442, -242278, -265139, -64676, -17128, -256058, 75064]
19281b77742d3797k15737I1478C6104b01846k4710D1523a40851j06846i7219n9822
19270a57041l24091a99322R2924a9487r4515A52093b51049A01440m9465a57009
19259a39600A08453a75134L7558Q850d5048k22644f4103a1183l2794j5567E2682
19247G7377a01412j01618Q4482A89195n6982c06951R8042H5259K0923L9768o8155
19236G7795a74524H4473j4912Q741J0814e6830j94498M8081C25599b41860j10811
19225c52671J69355M938k62885a16464E6302b60659J05670j18150c258E97b89597
19213C06660F9859a52251A71826K38558b50818b5111p3384j64783a25151j58659
19203b83810B26503a27392I1013r953d2880j94886M5699A5169i8388j01182A55369
$$ y = [-277742, -43797, -259534, 91478, 36104, -201846, -226556, 41523, -140851, -247697, -97219, -157041, -481132, -199322, -106398, -19487, -114002, 152093, -251049, 101440, 51975, -157009, -139600, 108453, -175134, -137576, -128726, -45048, -267692, -64103, -11183, -43977, -59544, 52682, 77377, -101412, -203030, -118548, 189195, 132213, -306951, -208909, 85259, 106182, 145950, 77795, -174524, 84473, 69561, 78302, 89116, -56830, -251328, -203247, 325599, -241860, -352671, -183316, -178378, -441263, -116464, 56302, -260659, -154989, -273139, -3258, 597, -289597, 306660, 69859, -152251, 171826, 410384, -250818, -25111, -98495, -263278, -125151, -283810, 226503, -127392, 91013, 81060, -42880, -237766, -192067, 15169, -98388, -199570, 155369]
19191B61900q6540G3147A0794J07684K37504G9094P5577e1999A02616d23484e6742
19179a23948d0292j49151B43844p5905D8722c6569n5179I9399a19105p6921B15723
19167D8010P7350k5819C383g9245m7127F8055a40802j24588N4120n8329B8382
19155H091i6435k24137B72446F6183a3814H1085a43004r0360Q1587a4398j04663
19144a19061a363C5358f3939B35750Q2901a64413A738b12641B3859a28219k890
19133a31109c8669l17775E6007J10509g2215C4800g2395l6537r014A06196d0501
19121D7269b30357b5378q2064q7932o0059d6145l9925I6982b33665b2423B2316
19109B35305D1850a5837A0700e5951k00188C28837H0195c16705C30244H7189c3424
$$ y = [261900, 175360, 73147, 10794, 118478, 355982, 79094, 154671, -51999, 102616, -423484, -56742, -123948, -40292, -189443, 243844, 167939, 48722, -36569, -91748, 99399, -119105, -196026, 215723, 48010, 125360, 99541, 3383, -79245, -126372, 68055, -140802, -265390, -211270, -269599, 28382, 8091, -96435, -320572, 272446, 66183, -13814, 81085, -143004, -233364, -151777, -14398, -119061, -1363, 35358, -63939, 235750, 318651, -164413, 1738, -212641, 23859, -128219, -131109, -38669, -356444, 56007, 166516, -72215, 34800, -72395, -108932, -117946, 106196, -40501, 47269, -230357, -25378, -107442, -195374, -255433, -46145, -86070, 96982, -233665, -22423, 22316, 235305, 41850, -15837, 10700, -55951, -256139, 328837, 80195, -316705, 330244, 87189, -33424]
19097a80928c6712j30261P9810A15086n7175a70485A95588G5383Q5075a63278
19086A10717J21367r0326k2284O5476c20794A1207b48334i6322j14306j24245
19076c34873J39550I8040L1260J90293C3869e8711j32501k1169O2608p5708P2931
19065a52550A7400a58750L8288F1578a9054F1968P319M3082B1561K8304c8805
19053A07027b49146j74183J58007C7424J2325A1921L2114a78804K3952A53457
19042a99530L9453K6633B51957b71984c4783k47721q4162H5769a6083A22594d8882
19030a78620j51220g789j39845k64127a29663l3863B30250f5350k32645D6571
19019A10979e3052B84983C7919e193j72546N5715A83644a78153j41304F4906K69398
$$ y = [-180928, -36712, -166973, -87163, 115086, 57911, -170485, 195588, 75383, 160458, -163278, 110717, 232084, 141758, 119474, 184950, -320794, 11207, -248334, -96322, -210628, -334873, -195323, 98040, 129300, 319593, 33869, -58711, -191212, -212381, -149773, -225481, -152550, 17400, -158750, -120462, 61578, -19054, 61968, 69287, 112369, 21561, 49865, -38805, 107027, -249146, -423329, -265322, 37424, 49749, 11921, 44035, -178804, -154852, 153457, -199530, -160077, -133444, 251957, -271984, -34783, -282504, -366666, 85769, -16083, 122594, -48882, -178620, -329840, -7789, -147634, -411761, -129663, -163526, 230250, -65350, -297995, 46571, 110979, -53052, 284983, 37919, -5193, -177739, -122024, 183644, -178153, -319457, 64906, 334304]
19008C34304g3656b029A34782k3791n433J12494a64278b5011j59649c7684k74004
18997c11688h7641j24735c5218J1293p7456r8209f3108k40425c6076j1287B5124
18985a00161C18210a92768j14211A43115d3524F3469B4619N3129a36915J9494
18975a17421j05976B32965n4724c4050k76748J06169I2525J4399C0605K06122
18965B36727a3338q1357L1910B65724f4007l8672b0987o8692A6007a10550j85907
18954b96457k06653b1741p3040k69101B8203K4754J02698b03402A07203e32374
18943a01957A44230b24128e8488q9160L4658k2050B87415g2085j00416a6264F3141
18931c10860Q1146G2797h5373o2722k69198a36126O6961b8075q374n8087q5201
$$ y = [334304, -73656, -2029, 134782, 110991, 105558, 218052, -164278, -25011, -184660, -37684, -311688, -87641, -212376, -35218, -23925, -101381, -199590, -63108, -303533, -36076, -47363, 25124, -100161, 318210, -192768, -306979, 143115, -43524, 63469, 24619, 77748, -136915, -117421, -223397, 232965, 178241, -34050, -310798, -204629, 92525, 106924, 30605, 236727, -13338, -94695, -62785, 265724, -64007, -102679, -20987, -89679, 16007, -110550, -296457, -503110, -21741, -94781, -363882, 28203, 52957, 155655, -203402, 107203, -532374, -101957, 144230, -224128, -58488, -147648, -112990, -135040, 287415, -72085, -172501, -16264, 63141, -310860, -229714, 72797, -85373, -148095, -417293, -136126, -69165, -28075, -36449, -94536, -179737]
18920a79737B24541p3640P032B880a74109k6311c0237j41458K2863c2943B02256
18908a58676c1647j68151C1050K17537a14222C39816D0594K26699I851J66786
18898A76637J08076a43440p2334O4406k8126g539q5207o5117N3896d51A96198
18886H7630a39564A08281a63953L1676J6826q4131H7491b67087a6280n1321p1333
18875a38934A88356d56323A58997M1212f2265A31384c22632g2279j29420l0547
18865b32246i0396L6141A60018G0131g429k49053a20322A49074b65451f5710J858
18854f3852B46772a55712C80902c30511c4525A35809J75245g1269j81572R9131
18844a53710p5084A5575O7307C8303a19293M956r1767O6616I2664a01317C1946
$$ y = [-179737, 224541, 150901, 157933, 2880, -174109, -200420, -30237, -171695, -148832, -32943, 202256, -158676, -31647, -199798, 31050, 248587, -114222, 339816, 40594, 267293, 9851, 176637, 284713, -143440, -215774, -151368, -179494, -7539, -92746, -157863, -103967, -451, 196198, 87630, -139564, 108281, -163953, -132277, -115451, -199582, 87491, -267087, -16280, -67601, -138934, 188356, -456323, 158997, 200209, -62265, 131384, -322632, -72279, -201699, -232246, -90396, -54255, 160018, 70131, -7429, -256482, -120322, 149074, -265451, -65710, -63852, 246772, -155712, 380902, -330511, -34525, 135809, 311054, -71269, -252841, -153710, -228794, 15575, 82882, 38303, -119293, -114337, -206104, -139488, 92664, -101317, 31946]
18832B16849D9356b39906a8810k4099H734a89359B3093N0914d7078A03810m3629
18821F0181a89940q8044J37209a2059j75425A83759a46548A94978c12005a52517
18810E6095K9251g403A81427a8288G8329b42667c4551C40358f5970A38053M9599
18799A87652d826B8983a10540j02927h0541B20884a86321C99955A04076b52020
18788b7550o8491K5530j98603A84879a88985C8755M7353d0532k69402Q5337k0441
18777b45038e7982a5808j11205M0418j41058A52963h6292j3013B6907b72460C9376
18765a63714q544g7513A97903F2439d3654B32382D9299O2973a70832g3664A26324
18753b11834R2785j17762E8961b11989f1395j69420k2327B726J52523c29886e726
$$ y = [216849, 49356, -239906, -18810, -42909, 8734, -189359, 23093, 74007, -47078, 103810, 60181, -189940, -277984, -140775, -12059, -187484, 183759, -146548, 194978, -312005, -152517, 56095, 85346, -7403, 181427, -18288, 78329, -242667, -34551, 340358, -65970, 138053, 187652, -4826, 28983, -110540, -213467, -80541, 220884, -186321, 399955, 104076, -252020, -27550, -96041, -70511, -269114, 184879, -188985, 38755, 86108, -40532, -309934, -224597, -245038, -57982, -15808, -127013, -86595, -227653, 152963, -86292, -99305, 26907, -272460, 39376, -163714, -172258, -77513, 197903, 62439, -43654, 232382, 49299, 112272, -170832, -73664, 126324, -211834, -119049, -236811, 58961, -211989, -61395, -230815, -253142, 2726, 155249, -329886, -5726]
18741e0182l0560B1435J28168f6308A27469E4057b02504G9385j8205J4947J2889
18730H9016b532j92898f5043k70269J57741A15211b27914E9651N5583d10473J44368
18719b66105d7109l226j42755P5553b0617A32326a83997h4619A73296b7596C4223
18707a43347F6483c72039J42075L9893A98533b32331i6178A37821a69045f7843
18696F0184c15357p3789a40201k1664f9915i272j69251E708a17492l3584k24528
18685c75604a55179b8047A21854b00028g3324B30349D9103A7575N2943d09925
18674b25444J2975G041J13674b9115k184k08351g8820r4960B29886a29417k287
18663a31704O3328A0524a02748j10805C1985b22977J07327d6291k1966j44232
$$ y = [-50182, -80742, 21435, 149603, -66308, 127469, 54057, -202504, 79385, 61180, 76127, 89016, -2532, -195430, -65043, -335312, -177571, 115211, -227914, 59651, 115234, -410473, -266105, -47109, -50335, -193090, -117537, -20617, 132326, -183997, -84619, 173296, -27596, 34223, -143347, 66483, -372039, -229964, -190071, 198533, -232331, -96178, 137821, -169045, -67843, 60184, -315357, -389146, -140201, -161865, -69915, -9272, -178523, 5708, -117492, -151076, -375604, -155179, -28047, 121854, -200028, -73324, 230349, 49103, 17575, 70518, -409925, -225444, -212469, 7041, 120715, -29115, -31299, -239650, -78820, -173780, 229886, -129417, -131704, -68376, 10524, -102748, -213553, 31985, -222977, -115650, -46291, -68257, -212489]
18653b12489g2683r7401A10878J08987d6731m3273A60727c6607j2458A244b72606
18641H3583b09699o82M6674A72200C6478b51279A9010J90848a53549A22196J4833
18630A37029C1387O7248a23205A45290d5033B1267J19334E2122f9817c1441B53246
18618F0099b7012G9701j2122a21193d6838E850d9383J6854j31952a7990C16035
18606a50878r5360c2881I0908C1732L6789a78854p9224C7392i1373r110A87050
18594b10001B12876H5023c30205J46637M8228A09154h5616F9359d47663a76647
18583C637L5099f257p4835D6092a85775h3283o1106k2638g6876I1837c64011a49805
18570a37125F5373d3779j06173O6499A99543k8757h8511B04934r4167G39a06243
$$ y = [-212489, -72683, -170084, 110878, 219865, -46731, -90004, 160727, -36607, -49065, 1244, -272606, 83583, -209699, -210381, -163707, 172200, 36478, -251279, 19010, 209858, -153549, 122196, 137029, 31387, 98635, -123205, 145290, -45033, 21267, 140601, 52122, -69817, -31441, 253246, 60099, -27012, 79701, 67579, -121193, -46838, 5850, -49383, -32529, -164481, -17990, 316035, -150878, -246238, -32881, 90908, 31732, 68521, -178854, -258078, 37392, -91373, -100483, 187050, -210001, 212876, 85023, -330205, -183568, -135340, 109154, -85616, 69359, -447663, -176647, 3637, 38736, -6257, -81092, 46092, -185775, -83283, -144389, -167027, -76876, 91837, -364011, -149805, -137125, 65373, -43779, -149952, -83453, 199543, 170786, -88511, 204934, 110767, 739, -106243]
18558h6189q0709B30515d6699G7636A8814a08180D7850K5438G36c10561a49571
18546A31623E7023J0115a04304j9054E6477K2944J01074a85408Q73H6521K6229
18535A12750b21350g3419p2782C91477h9494B50551e139C10011H1396K06729A3626
18523e0790E8687q136j5435e8940o8216F4346b49824Q5761k41061A1321c2637
18511b7308n7888k30161q485B38037K8730i5167C4121c886C1453c20373A61902
18499a30046j19170o6975f088E8533b44204J20521j93253n8673H6428e8967a9251
18487A1853a67453M0816j17582e4087r3464d4199j67873J3017P858D862a89928
18475F3862a49976g1275I6860I037b67063C13032C9558M2946J2671c51543A96208
$$ y = [-86189, -166898, 230515, -46699, 77636, 18814, -108180, 47850, 73288, 736, -310561, -149571, 131623, 57023, 67138, -104304, -123358, 56477, 79421, 180495, -185408, -184535, 86521, 112750, -221350, -73419, -146201, 391477, -89494, 250551, -5139, 310011, 81396, 288125, 13626, -50790, 58687, 50551, 35116, -58940, -127156, 64346, -249824, -164063, -405124, 11321, -32637, -27308, -85196, -315357, -323842, 238037, 266767, -95167, 34121, -3886, 31453, -320373, 161902, -130046, -249216, -316191, -6088, 58533, -244204, -123683, -316936, -375609, 86428, -58967, -19251, 11853, -167453, -126637, -244219, -54087, -147551, -44199, -212072, -199055, -191197, 4862, -189928, 63862, -149976, -71275, 96860, 9037, -267063, 313032, 39558, 82504, 95175, -351543, 196208]
18463a62580E8001c3680k9009A12819B549J0403c67587F8381k4286c57146J74665
18452a82481a2364C5531c33656L454B1040K47685j25252b3414D4914d2609l39862
18441c82471A75382J61804c5945k06349R7234k6738A03887L7875a12783F7571
18430a35866O5641B4328j0152a17458l4549A1935Q4502a14617k44849h6523D6643
18418A16450C7832j2645N3592c001k39165a1098j51222D3431K04200b3909j01089
18407a24998m1043M5285k2915q7295A89568B7516j2387K19594f9568j84650f1818
18395I9837b5948k10741i8073A89887O3673A13989b95780g9074B55J48458F3363
18383a3776C1441f1551r4757b1257I379a76492e1029B53560a26738A9316f8113
$$ y = [-162580, 58001, -33680, -62689, 112819, 2549, 12952, -367587, 68381, 44095, -357146, -182481, -12364, 35531, -333656, -330202, 21040, 268725, 143473, -23414, 44914, -42609, -382471, 175382, 337186, -35945, -242294, -145060, -171798, 103887, 141762, -112783, 67571, -135866, -70225, 24328, 14176, -117458, -152007, 11935, 96437, -114617, -359466, -86523, 46643, 116450, 37832, 25187, 78779, -3001, -242166, -11098, -162320, 43431, 247631, -23909, -124998, -166041, -120756, -143671, -230966, 189568, 27516, 15129, 234723, -69568, -254218, -61818, 99837, -25948, -236689, -98073, 189887, 253560, 113989, -295780, -79074, 255, 148713, 63363, -13776, 31441, -61551, -156308, -21257, 9379, -176492, -51029, 253560, -126738, 19316, -68113]
18371b28504A63046a75280A24478g2540B162a6150l55707C40166d39078i2165
18360C65927i6203A18905a89579A41542J77302H595O9980I189P5156K43970B1286
18348b98515a39403b6041H4692J5183k7958a72751F0851a36601A65899b41687
18337a65192r6466e8016k73960f2489A98387c27962b086B6228h16C08239d6422
18325F6216A921a8027F955a08114B13729a07049r9269D00200A61615d06470J14687
18314b91783a35559H518J27693f3939A3355a02583A69732C1686J79707A9549a61264
18302B12062f5655A7768K23005H7282c60882h4578p2699J7018K0080d0352l0915
18291g1267A21227a59729j8785M8278j15930g3173C5921o448d2530k33756D8460
$$ y = [-228504, 163046, -175280, 124478, -72540, 2162, -16150, -371857, 340166, -439078, -92165, 365927, -96203, 118905, -189579, 141542, 318844, 8595, 78575, 9189, 84345, 328315, 21286, -298515, -139403, -26041, 84692, 99875, 71917, -172751, 60851, -136601, 165899, -241687, -165192, -261658, -58016, -331976, -62489, 198387, -327962, -2086, 26228, -816, 308239, -46422, 66216, 1921, -18027, 6955, -108114, 213729, -107049, -206318, 400200, 161615, -406470, -291783, -135559, 8518, 136211, -63939, 13355, -102583, 169732, 31686, 211393, 19549, -161264, 212062, -65655, 17768, 240773, 87282, -360882, -84578, -157277, -140259, -120179, -40352, -71267, 121227, -159729, -178514, -130236, -246166, -73173, 35921, 29473, -42530, -276286, 48460]
18279c65831a29594o3074B79407j36246a88145D2998J58622b17462C13849f7206
18268F3492a22280o2316h8950H1081a8859j5762a1176C4187c9625r2949f1482
18256a86635B2891a68096O4549k18847J4990J20718P4886A3073c07720I6404a4029
18244a46798a2699k86318C84283a4869k322L625j91106j80732G37J95296c40484
18232c64972a41992A80526a4374E6507P7651l6120a29016E3512a47627A1468O0978
18221G2446d9274J4833D2625K8072a63451e0911r4099D1507N3581k9892A2196
18209b38108d5253m71423C0792f7785a603j49137A56208J25054H5767M787a24966
18197B04087l1524m8326j1286a17463n0931c1252j8249F3080J086f8660A72747
$$ y = [-365831, -129594, -192668, 279407, 143161, -188145, 42998, 201620, -217462, 313849, -67206, 63492, -122280, -184596, -88950, 81081, -18859, -34621, -11176, 34187, -39625, -132574, -61482, -186635, 22891, -168096, -103547, -322394, -307404, -186686, -111800, 13073, -307720, 96404, -14029, -146798, -12699, -299017, 384283, -14869, -17191, -13566, -204672, -385404, 737, 196033, -340484, -364972, -141992, 180526, -14374, 56507, 134158, 98038, -129016, 53512, -147627, 11468, 72446, -49274, -34441, 42625, 70697, -163451, -50911, -145010, 41507, 95088, 65196, 12196, -238108, -45253, -516676, 30792, -67785, -1603, -150740, 156208, 281262, 85767, 90554, -124966, 204087, 172563, 124237, 112951, -117463, -168394, -31252, -49501, 63080, 64166, -68660, 172747]
18185a06388F9779J20208a7397k10421j64388D3407f3155B02211a31710B11703
18174a68144B70342o1007q6015b96268f538G81c37571H7605E883g9035m8946D1390
18161g0210j42365k9854i6144A62013Q0780a8200C46348a85403E5165A4246a14626
18149A20032a46662F672R938Q9611A5945b36265A4819a75940K5989k4839r8089
18138b72879J35929A71634b01761B0747e3770A39217M40921A23770f6373K3654
18128d2719A28231J59586D3526J97427r5310B0270J4095P1229O6041q5653J5805
18117A01787c78937A52288B3268d26512D1399P0866B953M01148b14718D727b55652
18105a81487B1753c26800B97150A06766b13455I3210c60454P128c248j25r1537
$$ y = [-106388, 69779, 189987, -17397, -227818, -392206, 43407, -63155, 202211, -131710, 211703, -168144, 270342, 209335, 123320, -296268, -6538, 781, -337571, 87605, 5883, -79035, -127981, 41390, -70210, -212575, -242429, -96144, 162013, 242793, -18200, 346348, -185403, 55165, 14246, -114626, 120032, -146662, 6672, 16610, 106221, 15945, -236265, 14819, -175940, -149951, -174790, -272879, -136950, 171634, -201761, 20747, -53770, 139217, 580138, 123770, -66373, -42719, 128231, 287817, 43526, 240953, 145643, 20270, 34365, 105594, 171635, 85982, 101787, -378937, 152288, 23268, -426512, 41399, 112265, 2953, 404101, -214718, 4727, -255652, -181487, 21753, -326800, 297150, 106766, -213455, 93210, -360454, -353326, -3248, -3373, -94910]
18094i4910c3266D9646a92910K0817j29868N6691G3363J85464i7091n5901D4558
18082D3477a26379A5665i0262k3774j1038A43461a83516H2666a48024c8136A97739
18070A20666c7970j23138B95515j45706a98391B449J4226N8056b97072Q0357r8134
18059c14849J38974A27875a32537o713B2148a22327E5346a98482o7965J32477
18049a33970E3424N5842B0214b860j95689C65021a06250l8654A2288M5295N1507
18038A09090D6838A3580K19795b47541C45897c385A6928L33046C2168L9423L7781
18027A09372a79714d7323m536A4311K51688d2903H9289a02660l239D8190Q7571
18016A35761n7562h1008B61382d8358j38985B27864q275a24367E7696R1648a38431
$$ y = [-94910, -33266, 49646, -192910, -172093, -301961, -245270, 73363, 258827, -97091, -152992, 44558, 43477, -126379, 15665, -90262, -114036, -125074, 143461, -183516, 82666, -148024, -38136, 197739, 120666, -37970, -161108, 295515, 149809, -198391, 2449, 16675, 74731, -297072, -216715, -314849, -175875, 127875, -132537, -139250, 22148, -122327, 55346, -198482, -266447, -133970, 53424, 109266, 20214, -2860, -198549, 365021, -106250, -144904, 12288, 57583, 109090, 46838, 13580, 233375, -247541, 345897, -3385, 16928, 349974, 32168, 71591, 109372, -179714, -47323, -51859, 14311, 265999, -42903, 89289, -102660, -105899, 48190, 135761, 78199, -81008, 261382, -48358, -187343, 227864, 219589, -124367, 57696, 149344, -138431]
18004h247E3414L05225F7448a34179b1446k5890A63210L1844B3470c3908B64284
17992H2029B111K21236i703j3855A50771d6908j25535a1212j75733C85215a38765
17980c02382G8207a33100M9206p4474o1334A14739g6299A73204e4867j99362j20169
17969c74398C9110a4079j13399c982E7355B2447a74167E9362b06597D1986a54707
17957d4269r476j07414I0836K84884b67765D6457c66177G125h3949C77207b58007
17945C29832b50695B0142L29353d66439A694a96121L6419A16821J40634f1863
17934C44357d13345c1757C73156A57373K16951A85267a17205b6090k15844e4684
17923a57299d9026A25467F1781J2368a03349j63530e6077A50928O9322j9651a23893
$$ y = [-8247, 53414, 358639, 67448, -134179, -21446, -47336, 163210, 195054, 23470, -33908, 264284, 82029, 2111, 223347, -9703, -23558, 150771, -46908, -172443, -11212, -186945, 385215, -138765, -302382, 78207, -133100, -83894, -158368, -219702, 114739, -76299, 173204, -54867, -254229, -374398, 39110, -14079, -127478, -3982, 57355, 22447, -174167, 59362, -206597, 41986, -154707, -44269, -53745, -161159, 90836, 375720, -267765, 46457, -366177, 7125, -83949, 377207, -258007, 329832, -250695, 20142, 349495, -466439, 1694, -196121, -159702, 116821, 257455, -61863, 344357, -413345, -31757, 373156, 157373, 374324, 185267, -117205, -26090, -241934, -54684, -157299, -49026, 125467, 61781, 74149, -103349, -266879, -56077, 150928, 220250, 200599, -123893]
17911D7385q611a45190A56134l3424K0840k308c02811A17232k7770J46674D9896
17899a05395A08267E2641a41700f5396C11683a15320A59866b1714A81981f0108
17888A75686b60142R8635m7357G8202a93553K4510P6108l37857B19528a93417
17877H8715g5194G0244Q1119g4798p4573E25656B35382a0102l02249c6592C57720
17865c7330D42390a23847N9962C01306A0363J91982f3519k07077I7883L26945
17855D24828j88783k9216a89755B7806J76819a15015N4695B26131a60066N9510
17845a00556G0567b1869B6073K25128A7939a13071B0786i4326A35200b65524e6299
17833b58198A30025a78l74923i1848A08853L7458f3532j7772A98643j2487o6973
$$ y = [47385, 38774, -145190, 156134, 122710, 143550, 141242, -302811, 117232, 89462, 236136, 49896, -105395, 108267, 52641, -141700, -65396, 311683, -115320, 159866, -21714, 181981, -60108, 175686, -260142, -161507, -208864, 78202, -193553, -169043, -92935, -430792, 219528, -193417, 88715, -75194, 70244, 151363, -74798, -149371, 525656, 235382, -10102, -312351, -36592, 357720, -37330, 442390, -123847, -63885, 301306, 10363, 202345, -63519, -270596, 97883, 424828, 236045, 206829, -189755, 27806, 204625, -115015, -60320, 226131, -160066, -100556, 70567, -21869, 26073, 251201, 17939, -113071, 20786, -94326, 135200, -265524, -56299, -258198, 130025, -178, -375101, -91848, 108853, 146311, -63532, -81304, 198643, 186156, 119183]
17822A19183E9542K26746H7307J75500b66591B10653d13694a40141A68609i3916
17811a02308A68693J5906P8161j02338Q0585J46280a11579I3782D4573J46903
17801A91476b51777G9767J18295r7939h7500A38268h5073A12986J53501m0724
17791B25763a84765A23227Q7036b14172B35934I6989j047J42214a0719A32481
17780A1790K79107F8170K11236j4837J9556j26631i601j09907d7131k53474h9942
17768H4245K6625i4526J4804A03257e9096b9061A17833L38966h4533C7444a0441
17756C67881d6694B20481k5773c7589A64579F7464l1699K82901A47570J09936
17746B57506d3310j71600m4122A31111J861L42623A77853a602j0411G4406c9846
$$ y = [119183, 59542, 286288, 87307, 262807, -266591, 210653, -413694, -140141, 168609, -93916, -102308, 168693, 184599, 262760, 160422, 241007, 387287, -111579, 93782, 44573, 191476, -251777, 79767, 198062, 100123, -87500, 138268, -85073, 112986, 266487, 225763, -184765, 123227, 210263, -214172, 235934, 96989, 95942, 238156, -10719, 132481, 11790, 290897, 68170, 279406, 264569, 284125, 157494, -9601, -119508, -47131, -300605, -89942, 84245, 110870, -94526, -79722, 103257, -59096, -29061, 117833, 456799, -84533, 37444, -10441, 367881, -46694, 220481, 194708, -37589, 164579, 67464, 35765, 318666, 147570, 257506, -43310, -214910, -259032, 131111, 132972, 475595, 177853, -1602, -12013, 74406, -39846]
17734B13094c439D1569M3663J17352f4098p1675r3422J06850B58986a86861D18323
17722B18869a39473L7791f594B77170g7299B6182a64120k5655A746b9317B18883
17710B73229C244a43680f5480A43064i8511k10712d2429j71856B62010b17178
17699e9179k7833M465D5526N6351J73171A06820k3428L0917E4787M42594B22535
17687G8524a24447C11740A08613p307J6752a16162I3790J68667B1196a05564j89692
17676b95256A51699L5059c00944a00624k9066A59340E3309K03960A08128J58727
17666B66855i3929D3157c5376l72279B21338H2541l5689P7417a40123L4584B92062
17654c9596F02733A26656J26398A04915k1341o834K29320a80744A87422f8085
$$ y = [213094, -3439, 41569, 85232, 202584, -64098, -135773, -229195, -122345, 258986, -186861, 418323, 218869, -139473, -101682, -6594, 277170, -77299, 26182, -164120, -189775, 1746, -29317, 218883, 273229, 3244, -143680, -65480, 143064, -98511, -309223, -42429, -214285, 262010, -217178, -59179, -87012, -82547, 45526, 101877, 275048, 106820, 83392, 114309, 54787, 497381, 222535, 78524, -124447, 311740, 108613, 101306, 118058, -116162, 93790, 262457, 21196, -105564, -295256, 151699, 186758, -300944, -100624, -129690, 159340, 53309, 257269, 108128, 266855, -93929, 43157, -35376, -407655, 221338, 82541, 46852, 124269, -140123, -105539, 292062, -39596, 602733, 126656, 253054, 104915, 83574, 76740, 306060, -180744, 187422, -68085]
17643c5950F0795g5222C01452a03812A01479b41041E7627b62364c8967r631A37248
17631A76428a44798O9671I3398L05051c00891A58930a07727E0473h9012C1527
17620C24343j58438P0958J01212F379L4175J3435L4044d131A15285e228C7444
17608G8031J31911g8024j8593d4131G2662O2946R3915E2414J24839F3914K39592
17597C03506o7599K0645i3502D00097q1316b3169E0018L8261M3310Q9545P716
17586B28850a00968k0558c169l6245A08352b6952H4552Q31A564K3302J08143J89438
17574C22447A21367n0457a5450A82856a68925B88732r8728M3968g1390B21581
17563A96880k5245n1279a20592j10986c1791A76783n292K34663a21831j38054
$$ y = [-35950, 60795, -75222, 301452, -103812, 101479, -241041, 57627, -262364, -38967, -48598, 137248, 176428, -144798, -75127, 93398, 398449, -300891, 158930, -107727, 50473, -89012, 31527, 324343, 165905, 236863, 338075, 6379, 40554, 53989, 88033, -4131, 115285, -5228, 37444, 78031, 209942, -78024, -96617, -44131, 72662, 135608, 229523, 52414, 177253, 63914, 303506, 235907, 256552, -93502, 400097, 318781, -23169, 50018, 88279, 131589, 221134, 228850, -100968, -121526, -3169, -39414, 108352, -26952, 84552, 85383, 1564, 24866, 133009, 322447, 121367, 70910, -15450, 182856, -168925, 288732, 190004, 233972, -71390, 221581, 196880, 171635, 120356, -120592, -231578, -31791, 176783, 171491, 406154, -121831, -259885]
17553b59885d8762C77124d8874j16174n667A76370M9611j5518G8162O8838j357
17542A45643E6078A5063O0191J54721K17197j41236j19784J7990A00988J5887
17532A16875O1218J69305A00436Q5598j9019H3411L1301K61129c2187B34917J14842
17521C49759j02815J14826k3098J26364B11122E0146K23970J57715j93969Q2250
17511C20112i0208A15981J15647C4772R6887K30525L22741B34355L35567k60298
17501C09624A43460N1500K64882A72047E4670A6772J04547J31051j01897B9111
17490f449k2534a0139D0106J12979K25292D9735J08273Q4879d6463C12961j09479
17479B03482P2324C8223J49591a67541A29853c2492A00575N60396H6107Q1792
$$ y = [-259885, -48762, 377124, -48874, -165048, -170715, 176370, 225981, 210463, 78162, 147000, 145643, 56078, 15063, 75254, 229975, 447172, 305936, 186152, 204142, 100988, 116875, 178093, 347398, 100436, 186034, 167015, 83411, 114712, 375841, -32187, 234917, 349759, 246944, 361770, 338672, 465036, 211122, 50146, 274116, 431831, 237862, 320112, -90208, 115981, 231628, 34772, 131659, 362184, 684925, 234355, 569922, 309624, 143460, 194960, 459842, 172047, 54670, 16772, 121319, 252370, 150473, 29111, -6449, -28983, -10139, 40106, 153085, 378377, 49735, 158008, 242887, -46463, 312961, 203482, 275806, 38223, 187814, -167541, 129853, -32492, 100575, 660971, 86107, 167899]
17469A67899J82278A26867O4367J09817q7293a16854C61191p8209D320L7334K94749
17458C36403j59587J11088m9671M8787A8448a072I3164J13954O3146a20590B61605
17446E34547j27717r4626n2765j21871K48777c0198I0823K22867J26596j65374
17436B74912K10437k24027J42495e2492C332J96642h9254C98130K06977j85641
17426D19466B05870J21080A35007A8925J04244P0902M1117Q4455J49809k06764
17416B62688M3547N2606A52163J33642H1640R5828J44853J73933E4524a06893
17405A88153L665L08264B43095P4553a1886C53355j14937K55928M1123a2802D00728
17393B22974J05126A25494K0765K65492a52862F1989J71384C5168K58671E187
$$ y = [167899, 350177, 126867, 191234, 301051, 213758, -116854, 361191, 282982, 4320, 41654, 336403, 176816, 287904, 238233, 287020, 18448, -1072, 93164, 207118, 270264, -120590, 261605, 534547, 406830, 312204, 259439, 137568, 386345, -30198, 90823, 313690, 440286, 274912, 485349, 261322, 403817, -52492, 3332, 199974, -89254, 398130, 605107, 419466, 205870, 326950, 135007, 18925, 123169, 194071, 235188, 319643, 469452, 262688, 306235, 358841, 152163, 285805, 81640, 177468, 322321, 496254, 54524, -106893, 188153, 191818, 500082, 243095, 317648, -11886, 353355, 238418, 494346, 535469, -12802, 400728, 222974, 328100, 125494, 146259, 411751, -152862, 61989, 233373, 35168, 293839, 5187]
17382D0396R6148O8137n0901l5802R8277K04960A23834J59342E7545k2396c6182
17370B2939K76355K31891a2035B80989K98325A49080F0774K86976A25750J08691
17360B34441b82680A09873D908M30829N9672A00095a38370C77a9573D674R9461
17349A04135K98226F5924L04121r7405K65369A45003K55385j80227A678R9483
17339A01161a870C13692m1992j26386l2388L61944A0885e1215D94020j44825q5521
17328B63674F9237L93047A4603a1697C04288J03158J76317e0399G5008b1483A9210
17316f7084l0152C79576c7732F03638j48830j94273A2919J8331K39009Q8015A75415
17304b7123C20372A38181n269L65738q6952j61645j5542n7725H4835K99265L8845
$$ y = [40396, 136544, 204681, 153780, 117978, 216255, 421215, 123834, 283176, 57545, 35149, -36182, 22939, 299294, 531185, -12035, 280989, 579314, 149080, 60774, 347750, 125750, 234441, -282680, 109873, 4908, 435737, 495409, 100095, -138370, 377, -19573, 4674, 104135, 402361, 65924, 370045, 272640, 538009, 145003, 400388, 220161, 1678, 101161, -1870, 313692, 271700, 145314, 112926, 474870, 10885, -51215, 494020, 349195, 263674, 69237, 462284, 14603, -11697, 304288, 407446, 583763, -50399, 75008, -21483, 19210, -67084, -97236, 379576, -37732, 603638, 454808, 260535, 12919, 31250, 270259, 358274, 175415, -27123, 320372, 138181, 132912, 498650, 411698, 250053, 234511, 176786, 84835, 384100, 422945]
17293D22945j56635A8825K78893j19301j672b27750C44346j38121K3148L39203
17283E68576A61198a30534C92870p4371p3669r8348J67827A25416J07273H9448
17272C51647Q8942B20241p6719K86630K97088B03484R928b9612C56083r0016n9794
17261B06273J35119A12355M18439m8255J14242k08804j68607Q9946k0697l4596
17251B54023r66J73899r1495Q5181j25343J7758Q6758o5672f9379C05316M30121
17240G35437C47971J3668M4921j63449M94R208N4817J14947q8913p6857L6939
17229B93746l7489p9328M67880A26052L20311A30746K52742N4972J45857B90050
17218E21399k33790l494R9991n3822i2912B27035K50158j64778K2070B8329O11779
$$ y = [422945, 266310, 18825, 297718, 178417, 176745, -227750, 344346, 206225, 229373, 568576, 161198, -130534, 392870, 318499, 244830, 146482, 314309, 125416, 232689, 89448, 351647, 440589, 220241, 143522, 430152, 727240, 203484, 213412, -29612, 356083, 266067, 206273, 341392, 112355, 530794, 482539, 596781, 387977, 219370, 309316, 288619, 254023, 253057, 426956, 335461, 420642, 295299, 313057, 399815, 334143, -69379, 305316, 735437, 347971, 361639, 406560, 243111, 243605, 252813, 307630, 422577, 333664, 256807, 293746, 256257, 176929, 644809, 126052, 446363, 130746, 383488, 438460, 584317, 290050, 521399, 287609, 284115, 384106, 330284, -92912, 227035, 477193, 312415, 334485, 28329, 640108]
17207F40108j33302l933q3818n6752r7582K81383J8414q3959o5123K61354B20970
17195D33688D2641J4734b4568D77512D4756K97996K43471I4062O62667C70857
17184D59558r4837K41425j10525j76326J88618M5847j09242K43567o2112k7972
17174E98001O2313r5864j30121j36344J60717L2916K0677F8877a1005B81225M60845
17163G42070j78114m9715A95433L63309m1711P1371j2387A28502L79304m8834
17153D58972J44465k11085J4954K18758m6535J42791C03923N20192k87350K71519
17143H08284l52922J88005B60392N05573C62419J58573k50995J42896L6465K55951
17133G05309L8618j75047Q5111j33914K41049l19250m0401K55550j78297J99352
$$ y = [640108, 506806, 502873, 419055, 362303, 264721, 546104, 564518, 480559, 415436, 676790, 220970, 433688, 42641, 57375, -24568, 477512, 44756, 342752, 586223, 94062, 756729, 370857, 459558, 364721, 606146, 495621, 319295, 507913, 553760, 444518, 688085, 625973, 598001, 660314, 564450, 434329, 297985, 458702, 491618, 512295, 68877, -11005, 281225, 742070, 563956, 514241, 195433, 558742, 517031, 588402, 576015, 128502, 507806, 458972, 603437, 392352, 407306, 626064, 579529, 722320, 303923, 824115, 536765, 808284, 455362, 643367, 260392, 765965, 362419, 520992, 269997, 412893, 449358, 705309, 743927, 568880, 653991, 520077, 761126, 441876, 401475, 657025, 478728, 678080]
17123F78080p6636P4618k85785M47893k63452k8912K1455P6426j10676k57167
17113B75844K55917J92821B35537L96059J5251B27304M78690B66810L16320J40211
17103G23341l09351M36873l34076L31743j66894O6690r2710r5864Q9599J51601
17093H00952r4222A55256N29852l2324J28067C47238J13929K31000J59400j24236
17083G27331M04138E04755L21920k04872m4733J90442L34688j43269j64983l48474
17073D45474N40822l21282K14427o6329L9744J12164k90280J39554k23037K10702
17063H01959O9721O1218j83266r1337j63522J38329j91887L87752m5007J0391
17053G94351P1165k98424L77791r7928j6890K24783l42211K12982j28816M7753
$$ y = [678080, 601444, 676062, 390277, 838170, 574718, 545806, 567261, 643687, 533011, 275844, 531761, 724582, 235537, 631596, 646847, 227304, 705994, 266810, 583130, 723341, 413990, 850863, 516787, 848530, 681636, 748326, 655616, 559752, 649351, 800952, 706730, 155256, 685108, 652784, 780851, 347238, 461167, 692167, 851567, 727331, 1131469, 504755, 826675, 621803, 577070, 767512, 1102200, 958931, 793948, 445474, 986296, 665014, 879441, 813112, 852856, 965020, 674740, 814294, 591257, 801959, 871680, 932898, 749632, 658295, 494773, 633102, 441215, 828967, 783960, 794351, 865516, 567092, 944883, 846955, 830065, 1054848, 712637, 925619, 796803, 844556]
17043H44556k59881L59692J15080M7498p1272k19459M1180J273J68448j39501
17033H87614P5543m3026P3199j95643K33078k39844L80075o7062k30004J03941
17023I77871j72993J50215J94423Q5973n9177L7874j37795K58457j00130l5179
17013A199539O1627n4852M3300k27012M12929o9699j81315K9280j52699K51909
17003A313007j09278K9991P8696l08868L53464P7738O2237M9913m41439L73097
16993A478558k10159P4283k62950K46156j161k2774o4069L60620j40931K07059
16983A664632k58595j62195J32977J54738l2313j80999Q8674m03J33566J76142
16973A716224r9445N32371p50940L43970j33732J22614k45967J72250J05331K7170
$$ y = [844556, 584675, 944367, 1059447, 1106945, 1035673, 816214, 857394, 858667, 1027115, 887614, 963157, 920131, 993330, 797687, 1030765, 790921, 1170996, 1103934, 873930, 977871, 804878, 955093, 1149516, 1235489, 1176312, 1214186, 1076391, 1334848, 1234718, 1199539, 1261166, 1206314, 1249614, 1022602, 1435531, 1365832, 1184517, 1213797, 1061098, 1313007, 1203729, 1233720, 1312416, 1003548, 1357012, 1434750, 1496987, 1546900, 1105461, 1478558, 1268399, 1342682, 1079732, 1325888, 1324727, 1301953, 1237884, 1598504, 1457573, 1664632, 1406037, 1243842, 1376819, 1531557, 1499244, 1318245, 1406919, 1406516, 1540082, 1716224, 1616779, 2149150, 1398210, 1742180, 1608448, 1731062, 1485095, 1657345, 1762676, 1789846]
16963A789846K16372p4990j64452k12105K98251j54299K949L48657m39441L54291
16953A965079l0340j20453J59429k97754L73373J15610j77334j35609j77792K2630
16943A696839M12818J99907n39924L46270m2911R0748J82009j33766m028J68204
16933B376166R3650R9346k67575K14545l58632M12346j74371L31158k52146j99873
16923B274614M02484p1032J52753K4190k09454J0727O943L0456K05134J05844
16913B932659O2408k49021k78516M47566K10175L0772l6212r6395J55272j89227
16903B989481J25788j80431L62565Q3015J79021O7097p361m30674K50620p3760
16893C365361N2732K37949j1469k16786Q2422M15797J26089o69273O64342R8467
$$ y = [1789846, 2006218, 1931228, 1766776, 1554671, 1852922, 1698623, 1701572, 2050229, 1610788, 1965079, 1934739, 1814286, 1973715, 1675961, 2049334, 2164944, 1987610, 1852001, 1674209, 1696839, 2109657, 2309564, 1769640, 2115910, 2072999, 2163747, 2345756, 2211990, 2207962, 2376166, 2469816, 2569162, 2301587, 2516132, 2157500, 2569846, 2395475, 2726633, 2474487, 2274614, 2677098, 2606066, 2758819, 2783009, 2573555, 2584282, 2591225, 2621681, 2826815, 2932659, 2995067, 2746046, 2467530, 2915096, 3125271, 3156043, 3119831, 3023436, 3178708, 2989481, 3115269, 2934838, 3297403, 3380418, 3559439, 3626536, 3619175, 3188501, 3439121, 3365361, 3418093, 3656042, 3644573, 3427787, 3510209, 3926006, 4052095, 3382822, 4047164, 4145631]
16883D145631j03410K41553k0908k32779M62651L3904l03902L58250Q3107k44239
16873D419858J1327J70192J78977J00139L76614j90205J51903O7381J67977l21144
16863E133019r7284N07020k78722j23800O51843j66398K7558N1502N97424l85778
16853E916384L94222j42186M1510M08824K11021j26151J97359j70792j73892N34107
16843G090406q5132M11321q8011L36798P0621j40570M08583K30556j56889L10921
16833H388604l449L37334k15550O01448k75110K76854J63807N72634k9181J128
16823I818519L31881L50499O9357J49046M15069J13660J52739J29239L84966N0995
16813A1965970J93446N76170k05481N16209K20749K84191L39380M03684L44990
$$ y = [4145631, 4042221, 4283774, 4262866, 4030087, 4492738, 4526642, 4222740, 4580990, 4664097, 4419858, 4431185, 4601377, 4780354, 4880493, 5257107, 5066902, 5218805, 5286186, 5454163, 5133019, 5035735, 5542755, 5264033, 5140233, 5792076, 5625678, 5653236, 5704738, 6302162, 5916384, 6310606, 6168420, 6209930, 6618754, 6829775, 6703624, 6900983, 6730191, 6556299, 7090406, 7005274, 7416595, 7328584, 7665382, 7736003, 7595433, 8004016, 8234572, 8077683, 8388604, 8385155, 8722489, 8506939, 9108387, 8833277, 9110131, 9273938, 9846572, 9817391, 9818519, 10150400, 10500899, 10570256, 10719302, 11134371, 11248031, 11400770, 11530009, 11914975, 11965970, 12159416, 12735586, 12530105, 13046314, 13267063, 13551254, 13890634, 14294318, 14639308]
16804A4639308N25740o5853N52477K38221L39527N99974J14383M02464N41426
16795A7887667N57490M98404J55950K74236M60713Q78427L5824P04692L07944
16786B1761347J072241M95717K71679J092862O73636J18220J039295P48772R51541
16777B8225310K67403J324522O51843O47386R88554O19749J197557P06910J375951
16768C6005185Q67741J090995J172586R88236R96498J464329Q06385J537205J371306
16759D6300466J504425J043012J631840J619594J605710Q26841K245094J322900
16751E8099882J653970J818090J338073J988166J886886J506070J933086J624256
16743G1848479J668650K094236J325394J933497J681085J658965J755026J107442
$$ y = [14639308, 15165048, 15099195, 15651672, 15889893, 16229420, 16829394, 16943777, 17346241, 17887667, 18445157, 18943561, 19099511, 19373747, 19834460, 20712887, 20748711, 21453403, 21761347, 22833588, 23329305, 23600984, 24693846, 25367482, 25485702, 26524997, 27273769, 28225310, 28492713, 29817235, 30469078, 31116464, 32105018, 32724767, 33922324, 34629234, 36005185, 36872926, 37963921, 39136507, 40124743, 41121241, 42585570, 43391955, 44929160, 46300466, 47804891, 48847903, 50479743, 52099337, 53705047, 54531888, 56776982, 58099882, 59753852, 61571942, 62910015, 64898181, 66785067, 68291137, 70224223, 71848479, 73517129, 75611365, 76936759, 78870256, 80551341, 82210306, 83965332, 85072774]
16735H5072774J593162J619284J343773J118393R44889J123073P11414P71983
16727I4298745L62986N09408M40568M2337j03771k58099K36130q73009l85504
16718I4269791j043545q26920q27129j246705j269667j322611r74537j492072
16710H5266605j765810j785517j416056j721142j749163j911843j382776j827234
16702G1707064j793318j661027j771291j423008k024179j075726k002705j517483
16694E8438327j777688j384981j502487j319957j885059j129783j399624j024694
16686D7014054j538774r01410j372371j342798j056421r34424j023450j114115
16678C7730291j241414q98261j193046o59255o99339p81373q86196p71993p38180
$$ y = [85072774, 86665936, 88285220, 89628993, 90747386, 91692275, 92815348, 93526762, 94298745, 94661731, 95171139, 95611707, 95654044, 95550273, 95292174, 95528304, 94655295, 94269791, 93226246, 92399326, 91572197, 90325492, 89055825, 87733214, 86758677, 85266605, 83500795, 81715278, 80299222, 78578080, 76828917, 74917074, 73534298, 71707064, 69913746, 68252719, 66481428, 65058420, 63034241, 61958515, 59955810, 58438327, 56660639, 55275658, 53773171, 52453214, 50568155, 49438372, 48038748, 47014054, 45475280, 44573870, 43201499, 41858701, 40802280, 39867856, 38844406, 37730291, 36488877, 35590616, 34397570, 33738315, 33038976, 32257603, 31371407, 30599414, 29861234]
16669B9861234q88573m83392r33465n50348q34929l74587n03456k90172j485444
16660B3516868J83312o47802o17320m14818r21141P0145p22785k44943q68531
16651A9332985j80690j65296o18793k72242m33299l90917k23462m45524k08814
16642A6393948o61763m8682o75928J81556o07615k86726M11146q35749j9212n79090
16632A3271885P3113o57716j3055k38766l18749l25963N3356n9556l39834m48184
16622A0996531j1860l75299P6114j45251j88072j61933k76411l26363R2415j8599
16612I661272m77870J74603j30618l12906J04898k7899l85292m5030m731l06536
16602H249891K0551m1853j54322j47660k06537l58900k1091j61257j08255J60128
$$ y = [29861234, 28972661, 28489269, 27555804, 27005456, 26170527, 25795940, 25292484, 25002312, 23516868, 23700180, 23052378, 22435058, 22020240, 21099099, 21169244, 20446459, 20201516, 19332985, 19152295, 18986999, 18368206, 18095964, 17662665, 17271748, 17048286, 16602762, 16393948, 15732185, 15683503, 15007575, 15189131, 14581516, 14294790, 14705936, 13870187, 13850975, 13271885, 13344998, 12687282, 12674227, 12435461, 12116712, 11790749, 11844105, 11784549, 11444715, 10996531, 10984671, 10609372, 10685486, 10540235, 10352163, 10190230, 9913819, 9587456, 9679871, 9661272, 9183402, 9358005, 9227387, 8914481, 9019379, 8991480, 8606188, 8561158, 8556427, 8249891, 8270442, 8228589, 8074267, 7926607, 7720070, 7361170, 7340079, 7178822, 7070567, 7230695]
16592G230695j50044l38868m64739M19215j3351k53234J24547k07456J8969J82138
16582F547872m26376R7903k79541N1191n2956l4106k57110l7191k7499r8865r9227
16571E384095r7798L0894L01191j94690l24447M49231m31108J150k41962J01285
16561D977841n7763M6708q2831q3998K29490n41075K45175K55157n89448P1843
16551D471099j70453j8997K53665k22569L2456k96334O5488J4542J8298k56875
16541C890320J12079r2603p0263M44478n20410M15760m83949l8737J77848m22282
16531C412241j86756J56378J98251L7376j99869K1561k42242K76001k32425J32242
16521C372758j653l2639M5371l51460K18219j52214J48216k04873j02364Q6170
$$ y = [7230695, 7080651, 6741783, 6277044, 6696259, 6682908, 6429674, 6554221, 6346765, 6365734, 6547872, 6121496, 6219399, 5939858, 5991049, 5938093, 5903987, 5646877, 5609686, 5582187, 5483322, 5384095, 5286297, 5317191, 5618382, 5423692, 5099245, 5548476, 5117368, 5118518, 4876556, 4977841, 4920078, 4966786, 4883955, 4799957, 5029447, 4488372, 4733547, 4988704, 4399256, 4471099, 4300646, 4281649, 4535314, 4312745, 4345201, 4048867, 4114355, 4128897, 4147195, 3890320, 4002399, 3909796, 3839533, 4284011, 3763601, 4179361, 3695412, 3656675, 3834523, 3412241, 3225485, 3381863, 3580114, 3617490, 3417621, 3439182, 3196940, 3472941, 3240516, 3372758, 3371105, 3338466, 3383837, 3032377, 3250596, 3098382, 3246598, 3041725, 2939361, 3025531]
16511C025531J18475l03509K86520r9650M17301n99344J35798j62398j05368j62524
16501B550832L74358n34721M30233k5611r1472N09089l96993j60186J70526k61037
16491B565018l90171N39189m11691Q3518L35720l94325L46169p251J06130l09614
16481B462692j4562q1184k79791J63568L21877l72062k0544K80395K16281o98630
16471A978040L10607j17959R6092l09247k64808M66444L2862p4268J20080l0238
16461B207605R3280l18877K93966k08122M0748M0477j20736K03594j74730j17856
16451A939349p9682J91662l6231j33071j2931l1842k14758M45251m20277O7862
16441A715332p1097L45693l95125K09567j62518K94556j47953O5024j28521K8851
$$ y = [3025531, 3144006, 2840497, 3127017, 3027367, 3444668, 2845324, 2981122, 2818724, 2713356, 2550832, 2925190, 2390469, 2820702, 2795091, 2703619, 3212708, 2815715, 2655529, 2826055, 2565018, 2174847, 2714036, 2302345, 2385863, 2721583, 2327258, 2673427, 2666176, 2772306, 2462692, 2448130, 2366946, 2087155, 2250723, 2572600, 2200538, 2179994, 2460389, 2676670, 1978040, 2288647, 2170688, 2266780, 1957533, 1692725, 2159169, 2192031, 2117763, 2237843, 2207605, 2300885, 1982008, 2275974, 2067852, 2108600, 2149077, 2028341, 2231935, 2057205, 1939349, 1859667, 2051329, 2015098, 1882027, 1869096, 1837254, 1622496, 2067747, 1647470, 1715332, 1644235, 1989928, 1594803, 1804370, 1641852, 1936408, 1788455, 1853479, 1724958, 1753809]
16431A753809j83283R221J93024J35808o767j87947P8326l28777J2168N727J60148
16420A641457l24744M85628K03981o13804M05188n72992L96919q6702k09996L8068
16410A363003L59593k4834l67249K78000o0766j68347L34094k09365J3029j03615
16400A413543q7225J25646R8174j44378n2939K77386l97517K31077p1809j22392
16390A269566K18607j30139j71650q5413L91279j87944k7230N3626p2426J10567
16380A368843L6034o5790J50697P7931m78513J90681L1054l28882L50826j8423
16370A314458m8883j41798O5648n07815N73385j17812O8792j86524K07253q1819
16360A144885J74387K8301l04193M5126j92218j5038J45881p9562J00070p4436
$$ y = [1753809, 1570526, 1579747, 1772771, 1908579, 1901812, 1713865, 1792191, 1463414, 1475582, 1481309, 1641457, 1316713, 1802341, 2006322, 1392518, 1797706, 1224714, 1621633, 1534931, 1324935, 1363003, 1722596, 1697762, 1330513, 1608513, 1547747, 1379400, 1713494, 1504129, 1517158, 1413543, 1326318, 1451964, 1550138, 1405760, 1352821, 1630207, 1232690, 1463767, 1391958, 1269566, 1488173, 1358034, 1186384, 1100971, 1492250, 1304306, 1277076, 1330702, 1258276, 1368843, 1404877, 1339087, 1489784, 1567715, 1089202, 1279883, 1310937, 982055, 1332881, 1314458, 1265575, 1123777, 1189425, 681610, 1254995, 1137183, 1205975, 1019451, 1226704, 1144885, 1319272, 1347573, 1043380, 1088506, 896288, 881250, 1027131, 947569, 1047639, 973203]
16350I73203Q3465p6363M79795m95648J27641J35416k26044J52824J28567l90800
16340H92056k04822L78642J76182l36298N5643K93682l118j39099k26251o9207
16330H17410L834J66481l55821J88230K93223j92289J28781n9880r8403j20553
16320G71013J61693j1605J62828k36910N8354q6822k10824K63941K1088m7901
16310H44855l11842L66925o8943q8767L10981n3442k84245j16216J18493J00199
16300H17998m295k3147K67353n9740k79596j13855o5736K71148l08321L12858
16290H14667K14470p6246k8389m22324K06886j48814M20346q2092k22326A53571
16279F78538K02018k86078M53295l75106q406l7615j74677K69287k51368P6700
$$ y = [973203, 1056668, 980305, 1460100, 964452, 1092093, 1227509, 1001465, 1154289, 1282856, 892056, 687234, 1065876, 1242058, 905760, 961403, 1255085, 1251967, 1112868, 886617, 817410, 821244, 987725, 631904, 820134, 1113357, 921068, 1049849, 989969, 891566, 771013, 932706, 921101, 1083929, 847019, 905373, 818551, 607727, 871668, 892756, 844855, 533013, 899938, 830995, 742228, 1053209, 999767, 715522, 599306, 717799, 817998, 813703, 790556, 1057909, 998169, 718573, 604718, 538982, 810130, 501809, 814667, 1029137, 952891, 924502, 502178, 709064, 560250, 980596, 898504, 676178, 153571, 678538, 880556, 594478, 1047773, 672667, 664261, 626646, 451969, 721256, 469888, 546588]
16269E46588q390L07069j42960m5666B08420N47118R8578k53741J67575K37580
16259A005530C29987L39172J69471k31379Q7712j55007l5174l6164K04880O4936
16249G38434j09662k36608J94167B68087J60235j5573J18056m0773L84901l92128
16239D82805J61302k72799J48653M1051j34224N23766C95447K36609K89182l29710
16229E91528J23074k03501L9764O0983j6188J19202n2635C16694L59274P9326
16219G55294J42836k65809I0109O53757j33543j29291Q3716k07763J43493k0722
16209D79756P8515P1483O4358k25542j18907J07465P0880B21850K87608A47811
16198F60869J02467C53708K52891O5466O6376l11415J06450M06854A88872K01225
$$ y = [546588, 538198, 845267, 702307, 656641, 208420, 755538, 854116, 600375, 767950, 1005530, 329987, 669159, 838630, 607251, 694963, 539956, 504782, 468618, 673498, 738434, 628772, 392164, 586331, 268087, 428322, 412749, 530805, 490032, 874933, 482805, 644107, 371308, 519961, 561012, 426788, 950554, 395447, 632056, 921238, 591528, 714602, 511101, 550865, 611848, 595660, 714862, 662227, 316694, 675968, 755294, 898130, 632321, 90109, 743866, 610323, 481032, 564748, 356985, 500478, 479756, 558271, 629754, 694112, 468570, 349663, 457128, 528008, 221850, 509458, 147811, 660869, 763336, 353708, 606599, 672065, 738441, 427026, 533476, 940330, 188872, 390097]
16188C90097J00257r59J47329B04411q6259N02038p1754J9158k26513N42685l71036
16177E12730B11860P8571K77305j00605j97096K68387B39703M16729j92559M5374
16167E09247J5978l9662j75785o585j27009A6381N77052j70712j56241L92049
16157F58529A97204M72100C18279A30096L38880A72064J34615J3166L88308l37259
16147C70894K11642L2166k26466K3668J1863j68672A05789L48316A08980J55865
16137B64845m9360N8036J76577A42093L72402m1218j04391J29019a255F64362
16126C86449J1741J18631A09696N34421k60995q680h649C44922j40788K00239
16116D04373a866B22089m9040J016G4702M52075I4624J54346j0110m3985R7871
$$ y = [390097, 490354, 489395, 636724, 204411, 118152, 620190, 548436, 567594, 341081, 883766, 512730, 211860, 290431, 567736, 467131, 270035, 538422, 239703, 656432, 463873, 509247, 525225, 485563, 309778, 303193, 176184, 16381, 593433, 422721, 266480, 658529, 197204, 669304, 318279, 130096, 468976, 172064, 306679, 319845, 708153, 370894, 582536, 614702, 388236, 411904, 423767, 255095, 105789, 454105, 108980, 264845, 215485, 273521, 450098, 142093, 514495, 473277, 368886, 497905, -1255, 664362, 386449, 398190, 516821, 109696, 644117, 383122, 374442, -8649, 344922, 204134, 404373, -1866, 222089, 173049, 174065, 74702, 526777, 94624, 248970, 238860, 194875, 292746]
16105B92746L9294m3840O95A4196K99611D9210J65187A9830a3558B79638q3901
16094A95737a12890H53307D16829j47097K45756A43107F5228g5244A62193O8337
16084B30530c9239C74957j78655J9374B9034Q0767N8471K5555Q1826k6335A17696
16072D47657A2432L30431I6852D4269K53132l461R1916N6509A47734K8895R1086
16061B67715a34785A71122h7027B18285M6547A8693K2016K54172J07970A11877
16050C07694r6709K88825h71E0790K19367Q317H0574K33380k4049J3193A24219
16038F75797F523M33815j95827a6400D46219k02116d7003A39669E9644N2480J58249
16027B70373A6484b39970A3101K70848m1230F9661K30478j01638A4704J32646
$$ y = [292746, 332040, 288200, 288895, 14196, 313807, 49210, 214397, 19830, -13558, 279638, 195737, -112890, 853307, 416829, 269732, 515488, 143107, 65228, -75244, 162193, 230530, -39239, 374957, 196302, 215676, 29034, 109801, 168272, 193827, 275653, 249318, 117696, 447657, 12432, 342863, 96852, 44269, 297401, 293940, 385856, 442365, 147734, 176629, 267715, -134785, 171122, -87027, 218285, 264832, 18693, 40709, 294881, 402851, 111877, 307694, 210985, 499810, -871, 50790, 270157, 278474, 80574, 313954, 289905, 303098, 124219, 675797, 6523, 440338, 244511, -16400, 446219, 244103, -47003, 139669, 59644, 112124, 270373, 16484, -239970, 13101, 283949, 242719, 69661, 300139, 198501, 14704, 147350]
16017A47350L18648j20057c4006D61780A47021A0245J61074l1470f0822l4815
16007i5637c9823j0319J437B65809e0713j96883B93192h8987A75940J17152A21669
15995f3578B00336a0894A01447K15308C7795g1298l3476B77144p3120o2328L92209
15984E33905L9373N3856n3507K13563k97298R0703A23881N3736j2598J76051A68833
15972I8870J03087g9120a7370A61582N5638K58805B2354a9654A12247K0978J02838
15961B36063a04427I5219J08762b07268B2377J51280C0457g8915A38433K05528
15951C43961b5134C2692J66629I4352b15604C8629K0335L7184m822h9546n1552
15940a41098A23171b23932J02421C66234d88643a23910A36618N9363B0856J90028
$$ y = [147350, 465998, 345941, -34006, 461780, 147021, 10245, 171319, 139849, -60822, -95637, -39823, -50142, -48705, 265809, -50713, -247596, 293192, -88987, 175940, 293092, 121669, -63578, 200336, -10894, 101447, 316755, 37795, -71298, -104774, 277144, 204024, 141696, 533905, 573278, 627134, 573627, 787190, 489892, 580595, 123881, 177617, 165019, 341070, 168833, 98870, 201957, -79120, -17370, 161582, 217220, 476025, 22354, -19654, 112247, 133225, 236063, -104427, 95219, 203981, -207268, 22377, 173657, 30457, -78915, 138433, 343961, -25134, 32692, 199321, 94352, -215604, 38629, 58964, 96148, 91326, -89546, -141098, 123171, -223932, -121511, 366234, -488643, -123910, 136618, 195981, 20856, 210884]
15930B10884J8176C6784K68910A00196C2969b09319F3852K6515c38384B29039
15919c80872J86069G8987g2449k4435A68702E9120f4899E0015M43189j79167a92033
15907d71688a14930k62588a82366f6436B9131M5324K17109J46943g6878F1637
15896A28299M41462A54871h746m6804G8635L28054H2386M6255C9426M6026l0553
15885E4899Q2044c2305k4002e313A68436E4970L35796a43023e8502G6945a897
15873F7220J03664j8595o6423a52525M8258A90595c1379j6130k9987l57495a42513
15861A21502e0658A3617R8536K08413j29122L4860c183q5863l01653E5285a03252
15849A3661J72951Q8237D7389L84551f5517j44694A34478K13162G172b79693A83006
$$ y = [210884, 229060, 36784, 305694, 100196, 32969, -209319, 63852, 90367, -338384, 229039, -380872, -194803, 78987, -72449, -96884, 168702, 59120, -64899, 50015, 493204, 314037, -192033, -471688, -114930, -377518, -182366, -66436, 29131, 74455, 291564, 438507, -76878, 61637, 128299, 569761, 154871, -8746, -55550, 78635, 406689, 82386, 128641, 39426, 85452, 54899, 136943, -32305, -56307, -5313, 168436, 54970, 390766, -143023, -58502, 76945, -1897, 67220, 170884, 152289, 85866, -152525, -104267, 190595, -31379, -47509, -77496, -434991, -142513, 121502, -50658, 13617, 112153, 320566, 191444, 226304, -3183, -89046, -390699, 55285, -103252, 13661, 186612, 274849, 47389, 431940, -65517, -210211, 134478, 347640, 7172, -279693, 183006]
15837B73953b37698d6432p0663b0793k4998E058c3048A28927B6074a33449c9584
15825A36817L4379E0030h537B02843A5239M6048a46690A57164i9040b9181m7525
15814g6706A68765h0180g038F6278N0300c0857k61036C2923J6543A1083K54978
15803B66061P3751a35780b0109j30668f452n1796F8089c3430k06204g3868B68887
15791F66J5281a530k81104F0267f5113A10620O7096L8158M3332H2139i0986A4590
15778a26694M5812k3830F6913Q6649m4640P6685M56b36088b3295H3254a56453
15766B46938a27811A40775A8380a77309I439K49786a50956O1487D2306c17742
15755A90375E4397A2645i0226j67063d9421o7533A34294b4714I658K35219c8284
$$ y = [273953, -237698, -46432, -117095, -20793, -45791, 5058, -33048, 128927, 26074, -133449, -39584, 136817, 171196, 50030, -8537, 202843, 15239, 61287, -146690, 157164, -99040, -29181, -76706, 168765, -80180, -7038, 66278, 116578, -30857, -291893, 32923, 49466, 11083, 266061, 339812, -135780, -20109, -150777, -6452, -58248, 68089, -33430, -239634, -73868, 268887, 666, 15947, -1530, -282634, 60267, -65113, 110620, 177716, 215874, 259206, 82139, -90986, 14590, -126694, -80882, -104712, 66913, 153562, 108922, 185607, 186063, -236088, -23295, 83254, -156453, 246938, -127811, 140775, 18380, -177309, 9439, 259225, -150956, -89469, 42306, -317742, 190375, 54397, 12645, -90226, -257289, -49421, -116954, 134294, -24714, 9658, 244877, -38284]
15743H6539d790D5632L4298a9674k40700C48761b1771B22977E6731Q694h66A31915
15730g3816l9578e867l76769A61418c71212A82351H4229O4512a82802a1584D209
15718F8762k6853h3120l29104A54434c12747a9834A00703C3448b8124A17179h0782
15706a28705D974N0979K0115C3616J2897a2535A16093d2022A83546b39446f9874
15694D8263h7825j14729A84987o9294b62738g8905k07429B1209L02508c41539
15683A38289a36118B775L9886J74957H7374a79395a1119C02922G3144a10179A90617
15671B1657i5183C38037a08553j18818b9825k83278j7669B87036j35768a44784
15660a99290H301a72363J7215N8066A02045a77382H9282Q3215A7489f062l52631
$$ y = [86539, -4790, 45632, 79930, -19674, -260374, 348761, -21771, 222977, 56731, 65425, -866, 131915, -73816, -113394, -5867, -382636, 161418, -371212, 182351, 84229, 148741, -182802, -11584, 4209, 68762, 41909, -83120, -412224, 154434, -312747, -19834, 100703, 33448, -28124, 117179, -80782, -128705, 4974, 55953, 76068, 33616, 46513, -12535, 116093, -42022, 183546, -239446, -69874, 48263, -87825, -202554, 184987, 115693, -262738, -78905, -286334, 21209, 323717, -341539, 138289, -136118, 2775, 42661, 217618, 87374, -179395, -11119, 302922, 73144, -110179, 190617, 21657, -95183, 338037, -108553, -227371, -29825, -313103, -330772, 287036, 151268, -144784, -199290, 8301, -172363, -155148, -97082, 102045, -177382, 89282, 172497, 17489, -6062, -358693]
15649c58693C473d1671B79480e5283B6274f508B8085a05517i600j58484b8888
15637F257N0008J58474D6899c9680j23303J0100j8283A01706m6633e0823k64167
15626c14990R2895O9128A72756m3592E9151i1937B4538e1645G0982a37180C9018
15614a83609b1956k9387l2253n9j02129G4363c0148A07465R0235c3005j36646
15603a69651f0485A84454J42768A4320K02510b27929B01866c3531j4895H0025
15592b20241g9538H2069a17433B5851J53780a1524n6172K4564L784D3677N2663
15581I6340e2306m127C7153J02174f771A72072E3422f5988k81868O1516j4091
15570c00431I8621b14520L7046A62019a65374B03138r2041g0713G7029Q9632G5209
$$ y = [-358693, 3473, -41671, 279480, -55283, 26274, -6508, 28085, -105517, -9600, -168084, -28888, 6257, 56265, 214739, 46899, -39680, -162983, -152883, -171166, 101706, 55073, -50823, -314990, -222095, -152967, 172756, 129164, 59151, -91937, 24538, -51645, 70982, -137180, 39018, -183609, -21956, -51343, -83596, -83655, -185784, 74363, -30148, 107465, 197700, -33005, -169651, -60485, 184454, 327222, 14320, 216830, -227929, 201866, -33531, -48426, 80025, -220241, -79538, 82069, -117433, 25851, 179631, -11524, -67696, -43132, -39348, 43677, 96340, -52306, -56433, 37153, 139327, -6771, 172072, 53422, -65988, -347856, -286340, -300431, 98621, -214520, -177474, 162019, -165374, 203138, 111097, -70713, 77029, 166661, 75209]
15558a37731B1953p936J69690n4849g1580D0026o670n542Q8212a74497q8449n4613
15546c17559J35766A25873l6604a92680H9224H883O8474j1672a13931D19105a89436
15534I463a69529E6719P1917C5224j3279i0676B00741r3281R2316b9055l2411
15523f1466H9723f8630l74343B70495I7434l2873R163K14638B4634K2478O377
15512E3489J14081e7768I8411b44196B4718L9670J4195a19511B9917A581d9619
15500B42567A3940K56966b09787j50058A40360c55611D908b45509A54870c01767
15489a02567K5936C6032K7633M98547A15788c0370A56532L3368N8106c0830F4727
15477G586g2069m0943A10228K94097F2350K12354E5105H777J17095m1368K0381
$$ y = [-137731, 21953, 14017, 183707, 128858, -71580, 40026, 33356, 27814, 116026, -174497, -262946, -317559, -181793, 125873, 89269, -192680, 89224, 8883, 77357, 65685, -113931, 419105, -189436, 9463, -169529, 56719, 128636, 35224, 21945, -90676, 200741, 107460, 199776, -29055, -61466, 89723, -68630, -442973, 270495, 97434, 64561, 73724, 288362, 24634, 47112, 53489, 167570, -57768, 98411, -244196, 24718, 64388, 78583, -119511, 29917, 1581, -49619, 242567, 13940, 270906, -209787, -359845, 140360, -355611, 4908, -245509, 154870, -301767, -102567, -76631, 36032, 63665, 562212, 115788, -30370, 156532, 189900, 248006, -30830, 64727, 7586, -72069, -113012, 110228, 404325, 62350, 274704, 55105, 8777, 125872, 84504, 104885]
15466A04885i8907A09550K1863P1129J6194a47364j14785F9180K5992K6265J17757
15455B39194c73663h3231e346C4778N1470P6084j1145h7712F5333L2803J82579
15444B80715a27080A74246E9284L22900A18269h893A96458f6514b2981j45763
15434a68744H1703c3166G434a39873C7317L0277J33918r3927Q1824r4248Q9209
15423A84370c27997R26g5789k47247A15247k7071e2880j33571F3683c0535I2762
15411A10728M8922g1158b2452m2905o8659A80089b20949d3389n3A58290J37527
15400B95817C500a20023j19706F6172K588A5404L91909a55750E9198i2661k8582
15389a21243B61390e089B32669a597j30795c4420A18463a04456A60673a76836
$$ y = [104885, -98907, 109550, 131413, 202542, 218736, -147364, -262149, 69180, 95172, 121437, 239194, -373663, -83231, -5346, 34778, 86248, 162332, 151187, -87712, 65333, 98136, 280715, -127080, 174246, 59284, 382184, 118269, -8893, 196458, -66514, -22981, -168744, 81703, -33166, 7434, -139873, 37317, 67594, 201512, 107585, 189409, 95161, 184370, -327997, -327071, -75789, -323036, 115247, 88176, -52880, -186451, 63683, -30535, 92762, 110728, 159650, -71158, -22452, -65357, -134016, 180089, -220949, -43389, -43442, 158290, 295817, 3500, -120023, -239729, 66172, 68760, 15404, 407313, -155750, 59198, -92661, -121243, 261390, -5089, 232669, -1597, -132392, -34420, 118463, -104456, 160673, -176836]
15378D25172A10221J54286a84070D63915B3532b5185A1731L96488A16518Q8096
15368B04614a34315B04953B8247D635J443R3242A7853b97057i4026F6034L40281
15357D06315i2183B25510o2688J30488L87272l13815D1477f2958C77889j27538
15347B50351a50356B96288a68046B52871j09032J2390K7803A9335L18326J38927
15337D76588B30523a23847E0034F375J30109L7320p2444K09282j23989I1805Q3785
15326A75590L36462A03574K33584E2312J26275b27624B12303A1214J83923a08979
15315A44507A8582n852a84747n2838C7434f4641A49993E6663a46508d8058H0188
15303h3105E1680a61163B53394b7389A45161N7929O0273B5775a01146L4403m78036
$$ y = [425172, 110221, 264507, -184070, 463915, 23532, -25185, 11731, 408219, 116518, 204614, -134315, 204953, 28247, 4635, 6078, 99320, 17853, -297057, -94026, 66034, 406315, -92183, 225510, 162822, 293310, 680582, 366767, 41477, -62958, 377889, 250351, -150356, 296288, -168046, 252871, 143839, 156229, 184032, 19335, 337661, 476588, 230523, -123847, 50034, 6375, 136484, 173804, 101360, 310642, 186653, 91805, 175590, 512052, 103574, 337158, 52312, 178587, -227624, 212303, 11214, 195137, -108979, 144507, 18582, 12730, -184747, -237585, 37434, -64641, 149993, 56663, -146508, -48058, 80188, -83105, 51680, -161163, 253394, -27389, 145161, 203090, 263363, 25775, -101146, -66743, -544779]
15292e44779a55911A52041c43550B28685A03058a63919p680A8436J7576O0992
15282I7004J11490K44325A19584g0247A07117B1421K87275F6006L87151a0522
15271A41100j0650D6052a28114C4360c2921A25971l5071j6312A4708b66024J04995
15260a61029A81921a68844B28384c4558J2116A54073E258K02209d9807A23426
15249B85309I2011k6397M65781A19201L04273J05631J011702J637583o26542j20476
15239B431372Q576A092106E27520B43707I3314M9080J11108A23894c9805A60675
15228B45609c67942f9487o2962J878B50025K8366C1088L30115b97647H9165J22838
15217B12003b36760c8674E3039R4368b3760A17744K2209o1782b421o1442B92895
$$ y = [-544779, -155911, 152041, -343550, 228685, 103058, -163919, -171599, 18436, 36012, 97004, 208494, 452819, 119584, -70247, 107117, 21421, 308696, 66006, 453157, -10522, 141100, 130450, 46052, -128114, 34360, -32921, 125971, 90900, 74588, 14708, -266024, -161029, 181921, -168844, 228384, -34558, -22442, 154073, 5258, 207467, -49807, 123426, 285309, 92011, 65614, 531395, 119201, 423474, 529105, 1540807, 3178390, 2551848, 2431372, 2439948, 1092106, 527520, 243707, 93314, 142394, 253502, 123894, -39805, 160675, 245609, -367942, -69487, -132449, -130571, 250025, 278391, 31088, 361203, -297647, 89165, 212003, -236760, -38674, 53039, 147407, -23760, 117744, 139953, 78171, -2421, -63863, 292895]
15205A48783M8539a7888A09088D8555J06867a26607k9258A10458J05838L27458
15195E43754e0710n3762C65057A71757e348B63822J33429F9561k1561J10694g3983
15183g7179k32688B50102j7531A3578K08039E3024i5729C80084a25296j50353
15173b75649A87474k8515N0328J28509j02618c4569l6529F8456K2176O4004E5039
15161A14758i9057D0425Q2186J27828L8469p8912c8404B23648J12662K6254e9384
15149a52586O5600m152A91060q657D6973R0859B9543L6872O3157q817J22924J02035
15137C45714B2682n455J65960F4419b28976J05978A67120R2757B4351J16759j0601
15126A30509D5264K42643J3603K8457D9798K23908j18517j7450j0534K02160n5881
$$ y = [148783, 197322, -17888, 109088, 48555, 155422, -126607, -155865, 110458, 216296, 543754, -50710, -104472, 365057, 171757, -5348, 263822, 397251, 69561, 48000, 158694, -73983, -77179, -309867, 250102, 232571, 13578, 221617, 53024, -95729, 380084, -125296, -275649, 187474, 158959, 209287, 337796, 235178, -34569, -71098, 68456, 90632, 154636, 55039, 114758, -99057, 40425, 122611, 250439, 288908, 209996, -38404, 223648, 336310, 362564, -59384, -152586, -86986, -91138, 191060, 182403, 46973, 137832, 29543, 66415, 129572, 120755, 243679, 345714, 22682, 17227, 183187, 64419, -228976, -122998, 167120, 259877, 24351, 141110, 130509, 45264, 287907, 301510, 329967, 49798, 273706, 155189, 137739, 127205, 329365, 273484]
15115B73484K42601B54604F8106L19680b44276B22681c4383C8374K18468r5336
15105A61506e7749B38801a48490F9200L3813a04213j52452A26197j2081M65165
15095E79281A64310b48899C8660K18800I0656a09351C99221D7983P3929J57891
15085B79803h8042L3009E1085K20026Q1070B8355L6109L57332j17325b4364l2315
15074e6679D37840A68435b88607A98024a60304C85526j09168a28976A64228I76
15063A47541a58849G2588Q6832b23937A47501J13185M9489p9530n2692J61681
15053C39634j12281Q0668A19578a6857A74630D5852J80933K89504A16417h644
15042B79286D6178c3947E5957A2431L53978a6208j2133A45020M19618e7270D74856
$$ y = [273484, 516085, 254604, 68106, 387786, -244276, 222681, -34383, 38374, 256842, 161506, -57749, 238801, -148490, 69200, 103013, -104213, -256665, 126197, 114116, 579281, 164310, -248899, 38660, 257460, 90656, -109351, 399221, 47983, 121912, 279803, -88042, -55033, 51085, 271111, 352181, 28355, 64464, 421796, 304471, -24364, -56679, 437840, 168435, -288607, 198024, -160304, 385526, 276358, -128976, 164228, 976, 147541, -158849, 72588, 159420, -223937, 147501, 260686, 310175, 230645, 177953, 339634, 227353, 308021, 119578, -16857, 174630, 45852, 226785, 516289, 116417, -8644, 279286, 46178, -33947, 55957, 12431, 366409, -16208, -28341, 145020, 564638, -57270, 474856]
15030E7775K11259D3299J11283L77126j8315k38929J05514o5643A33634c8324
15019B00284J63635j07816a482C74291A33065K24768k6884J84032k34180I9485
15008D29302j09938H9398K15293f9423A70206K92562A26286K31166j10920J61814
14998D08346m4819q1790l0214o1620K55609G1638J21854J70866j6393N5039R5428
14987D98432A90631N62479A47892J97202J91507B61142B5601J81611J6937Q5781
14977C09930J55028k6907j62805J31405j72275Q9826M5274r4410L04228r2668
14967D86626m6340o4324n9809p3349o7728J76892j71341J83550n279D4804J55309
14956B00113D0071K01277K74674B11161K31414n1012G0515L11412A63931K07004
$$ y = [57775, 269034, 43299, 154582, 531708, 513393, 274464, 379978, 314335, 133634, -38324, 200284, 363919, 256103, -1482, 374291, 133065, 357833, 330949, 514981, 280801, 99485, 429302, 319364, 89398, 304691, -69423, 170206, 462768, 126286, 357452, 246532, 408346, 363527, 281737, 251523, 189903, 445512, 71638, 193492, 364358, 347965, 403004, 498432, 190631, 753110, 147892, 345094, 536601, 261142, 25601, 207212, 224149, 309930, 464958, 438051, 275246, 406651, 234376, 324202, 369476, 275066, 579294, 486626, 440286, 375962, 316153, 242804, 175076, 351968, 180627, 364177, 358898, 44804, 200113, 40071, 241348, 516022, 211161, 442575, 391563, 70515, 381927, 163931, 370935]
14946C70935E2045L57294J58637k46617K39425B39846J77051R3501R0928B29906
14935D89292j01679J12002B20432J15122L12659L8760k98152K15492M9215K42516
14925H96044j57782k05203K01570j04664M9085j99725N57467D77242N57975k24079
14915H11138l40515K36907Q1750l44268J94431j54353M59554D70952J31906j99703
14905D03155j13395R7556J01102k08530j38832K00938A9656L70039j19398K80014
14895E50311j56282Q4836j17782j78127R3210K00181J8841B7490M95315B36576
14884D19908J97118k81885P8716r5918r529M147m4008O5954r3447P8275L64078
14873F83409M3826C06002K91907O579B62437k198j08560J48054J86808k4956r4921
$$ y = [370935, 52045, 409339, 567976, 321359, 560784, 239846, 416897, 510398, 601326, 229906, 489292, 387613, 499615, 220432, 335554, 648213, 686973, 388821, 604313, 653528, 896044, 738262, 533059, 734629, 629965, 679050, 479325, 1036792, 477242, 1035217, 811138, 470623, 707530, 789280, 445012, 639443, 485090, 944644, 470952, 602858, 403155, 289760, 387316, 488418, 279888, 141056, 341994, 19656, 389695, 270297, 550311, 394029, 478865, 361083, 182956, 276166, 476347, 495188, 27490, 522805, 236576, 419908, 617026, 335141, 413857, 317939, 308410, 312557, 268549, 334503, 241056, 319331, 683409, 727235, 306002, 597909, 604488, 262437, 260239, 151679, 299733, 486541, 461585, 366664]
14862C66664j06871J02660o2787R3034Q077N1925A16499L95699K41235k08043
14852E45390j09730J49121G3001K22896R7352D20J25924L35170j85673J58886
14842D34727L6282J84390N2829L8959K29970m00492J95355J49836o6669l63253
14832D91934k45048M05229A36318J71896q9536M04807B12065M16496A15077J85256
14822C00333M54944J5300C36849N01487C96583J91146B67868K53526J91165J39665
14812H52224l85210q6928J40120j55064j60240L36244o3881o6846J71540L7871
14802F19830p9307O9115A62443M98742j70108J59141j98497J72237k23537R2380
14792D92801j39224J90225j60079K04324k81935K47413o1222n2578J65577B97959
$$ y = [366664, 259793, 362453, 299666, 392700, 400777, 452702, 116499, 512198, 753433, 545390, 435660, 584781, 73001, 295897, 393249, 420, 126344, 461514, 275841, 434727, 471009, 655399, 708228, 747187, 977157, 576665, 772020, 921856, 855187, 491934, 246886, 652115, 136318, 308214, 218678, 623485, 212065, 628561, 115077, 300333, 755277, 770577, 336849, 838336, 396583, 587729, 267868, 521394, 712559, 852224, 467014, 380086, 520206, 365142, 204902, 541146, 477265, 410419, 581959, 619830, 540523, 609638, 162443, 661185, 491077, 650218, 451721, 623958, 400421, 492801, 353577, 543802, 383723, 588047, 306112, 553525, 492303, 439725, 605302, 297959]
14781E07517K5626O3433B91625K7172K99330Q5060j30548J80282C02093J02164
14771D04257J69741K86144o1889l97649K39064j97597j47418L69156k46364K86347
14761G03792P878l8945K1315Q6706l44678L36749n9715l20463J21432J18218j7869
14750F14420O5231K9500j27894k30721M62029l47406N5700j0462L49016l17627
14740E41786L78234B93772N22678r4663J35662j55610j34701K35674k15184K57985
14730H45613C51375N49734k43043L54492l10194J49604K18866m0034p7741K73970
14720A227029K90858n04981J37384l16895M2568j43840J45407j35514M9724j11287
14710F80453J58346k17722J30198K88162j05438J38499j02492L8033j81681q6406
$$ y = [507517, 533143, 596576, 291625, 318797, 618127, 703187, 572639, 752921, 302093, 404257, 573998, 860142, 798253, 400604, 639668, 442071, 294653, 663809, 417445, 703792, 711670, 672725, 694040, 780746, 436068, 772817, 713102, 392639, 514071, 632289, 614420, 679651, 709151, 581257, 350536, 812565, 465159, 520859, 510397, 859413, 541786, 920020, 293772, 816450, 721787, 857449, 701839, 567138, 802812, 587628, 845613, 351375, 901109, 658066, 1012558, 702364, 851968, 1070834, 1030800, 953059, 1227029, 1517887, 1012906, 1150290, 833395, 875963, 732123, 877530, 742016, 791740, 680453, 838799, 621077, 751275, 1039437, 933999, 1072498, 970006, 1008039, 826358, 739952]
14700G39952J04223K65469L3542M4097l27220M39040m24679L66182m62140N4495
14690H32961J78984m1051n6268r1965j26286K24561j5587K37285E24885M43162
14680I68047N715J31997l40015j02449P3991j60559L32424j51460k595K44361
14670I99457k30082L14582j96115J70989j98464M12304m34743L52245l54949J66122
14660A001346J78547k14893K51012q0990k49417P4385l36972M85943N8985l5253
14650A132693j42527K43260l68607J8897J91555K63023j48550R5674j01487K05083
14640A389014k41394J84564p9914J5156r1529M600r3796P3596j62018j04326L49452
14629A243405k96717L45819j93615M13337j96323l3015P4236K04643l56192J82994
$$ y = [739952, 844175, 1109644, 1143186, 1187283, 860063, 1299103, 874424, 1240606, 778466, 832961, 1011945, 970894, 914626, 822661, 696375, 920936, 905349, 1142634, 524885, 968047, 973762, 1105759, 765744, 663295, 737286, 576727, 909151, 757691, 755096, 999457, 769375, 1083957, 887842, 1058831, 860367, 1272671, 837928, 1190173, 835224, 1001346, 1179893, 965000, 1216012, 1135022, 885605, 959990, 623018, 1108961, 1167946, 1132693, 990166, 1233426, 864819, 883716, 1075271, 1338294, 1189744, 1285418, 1183931, 1389014, 1147620, 1332184, 1252270, 1267426, 1175897, 1180497, 1086701, 1160297, 998279, 893953, 1243405, 946688, 1292507, 1098892, 1512229, 1315906, 1282891, 1357127, 1561770, 1205578, 1388572]
14619A388572N6757j88555j65147K27878k20234j14875J35074J86905R7337L958
14609A407670K29883m54558L52824k79302L37291L2065p2202M57599l97117j70748
14599A443405M0660o2176J19937k3214j18836M2951K12199j62956l3690J44635
14589A602915K18503k23848K2024r547J07347q3981k3611Q4626K56570l21518
14579A629480L77948J70182j7870j14517k49686j51391K28144M9527M0155J47238
14569B109210k9779K8425Q7083N13418k67210j84942J5037M68843j06842m4078
14559B589165J3087K65796j23867M65988J91058N2819j10205N89629L47384J124733
14549E405587J340945L673194P791455J5392154P581360B0280142A0095456m445021
$$ y = [1388572, 1445329, 1256774, 1091627, 1319505, 1099271, 984396, 1119470, 1306375, 1403712, 1407670, 1637553, 1182995, 1535819, 1256517, 1593808, 1625873, 1553671, 2011270, 1614153, 1443405, 1484065, 1421889, 1541826, 1518612, 1399776, 1442727, 1654926, 1491970, 1458280, 1602915, 1821418, 1597570, 1619594, 1610047, 1717394, 1633413, 1609802, 1694428, 1950998, 1629480, 2007428, 2177610, 2159740, 2045223, 1795537, 1644146, 1872290, 1921817, 1961972, 2109210, 2079431, 2107856, 2194939, 2708357, 2441147, 2256205, 2271242, 2740085, 2633243, 2589165, 2602252, 2868048, 2744181, 3210169, 3401227, 3454046, 3343841, 3933470, 4280854, 5405587, 6746532, 10419726, 18211181, 33603335, 41184695, 20280142, 10095456, 5650435]
14541E650435j888518l44171N08548K172859R18676l464248j105414P2225k26694
14532B293698k87557j09509L46552J15921j68330o2808J3713K04805j43174p1844
14522B131467L03297k98271J82594j59567J59327j28801J5238L71918M4779k00143
14512B421838M22536k19812r3999K20456j38111J76108k53551K55077J31349j22759
14502B799132K7991J28609k36250J75031K64696j17966M9835o481J28960j39653
14492C073904J41318j19766K54954n8770N0510L0124K49031j10134R6305j5262
14482C592214J1725Q033j40081j35073K24726M40354l59516L74154m43594O58835
14472D231777l10028K93983J01178j88720Q8809k32439J89893K9219L03627P2633
$$ y = [5650435, 3761917, 3417746, 3926294, 6099153, 7017829, 3553581, 2448167, 2520392, 2293698, 2006141, 1896632, 2243184, 2359105, 2190775, 2127967, 2141680, 2346485, 2203311, 2131467, 2434764, 2136493, 2319087, 2159520, 2318847, 2190046, 2205284, 2577202, 2621981, 2421838, 2844374, 2624562, 2530563, 2751019, 2612908, 2789016, 2535465, 2790542, 2921891, 2799132, 2827123, 2955732, 2719482, 2894513, 3159209, 3041243, 3091078, 3084597, 3213557, 3073904, 3215222, 3095456, 3350410, 3291640, 3342150, 3372274, 3621305, 3511171, 3607476, 3592214, 3603939, 3611972, 3471891, 3336818, 3561544, 4001898, 3642382, 4016536, 3572942, 4231777, 3921749, 4215732, 4316910, 4128190, 4216999, 3984560, 4174453, 4203672, 4507299, 4579932]
14462D579932k09067J94356l1325j13772L60932K60607k29682K33226j36708j76791
14452D731708J83399K30849k854J73366k21726M30540n30958M31848J58820N7557
14442E642549q3666N348M29593j21817N590j31296J30648N2956M36147N5454J74731
14431F596237o4281J52792o6417L2056K87580j97806L81354k07303M78252K58336
14421G650800k02973L38538K77836L04754m71112M29751K7593J26526j15802N7424
14411H423335L27671J09755p7105k08594M82946J29941j70355N21324j03665P11245
14401A0146498l70709M88746k8231Q5162N36996j74062M35435m52645N21117M68382
14391A1656689J0346N10723k4877j96104M86999j3644K50389L42357L31959L05427
$$ y = [4579932, 4370865, 4565221, 4533896, 4420124, 4781056, 5041663, 4811981, 5045207, 4908499, 4731708, 4915107, 5145956, 5143102, 5316468, 5094742, 5525282, 4994324, 5426172, 5584992, 5642549, 5558883, 5564231, 5993824, 5872007, 5877597, 5746301, 5876949, 5929905, 6366052, 6421506, 6596237, 6531956, 6684748, 6618331, 6650387, 6937967, 6740161, 7121515, 6914212, 7392464, 7650800, 7447827, 7786365, 8064201, 8368955, 7897843, 8327594, 8355187, 8481713, 8365911, 8423335, 8751006, 8860761, 8783656, 8575062, 9058008, 9187949, 9017594, 9538918, 9435253, 10146498, 9775789, 10264535, 10236304, 10321466, 10858462, 10684400, 11119835, 10667190, 11188307, 11656689, 11667035, 12177758, 12152881, 11956777, 12443776, 12430132, 12680521, 13022878, 13354837, 13660264]
14381A3660264O6087L62744J46763K18347L71436M56568P500L03396O04693L07097
14371A6504895K17012l2014N61766L52534L67299K69417L42518N51706O97000
14362A9832133M1408L37072N59583M99141M64461M17445K71261Q02220O16877
14353B3841601L35864R52179L62025M68325L48383Q92743Q84452N69620P33168
14344B9388360P55255O05757J245834O84805O81978J442664Q63467Q39247J169937
14335C7677304J038812J361554R61130J195312Q85202J762912J522447J105222
14327D7509895K069235J504060J532403K127362J576393J839891K379942J959326
14319F2498507K214591K522366K007650L104293K544379L002119L019882L742055
$$ y = [13660264, 13726351, 14089095, 14235858, 14454205, 14825641, 15282209, 15289709, 15593105, 16197798, 16504895, 16721907, 16689893, 17251659, 17604193, 17971492, 18240909, 18583427, 19135133, 19832133, 19873541, 20210613, 20770196, 21269337, 21733798, 22151243, 22422504, 23224724, 23841601, 24177465, 25129644, 25491669, 25959994, 26308377, 27201120, 28085572, 28655192, 29388360, 30143615, 30749372, 31995206, 32680011, 33361989, 34804653, 35668120, 36507367, 37677304, 38716116, 40077670, 41038800, 42234112, 43119314, 44882226, 46404673, 47509895, 49579130, 51083190, 52615593, 54742955, 56319348, 58159239, 60539181, 62498507, 64713098, 67235464, 69243114, 72347407, 74891786, 77893905, 80913787, 84655842]
14311H4655842K793203L670569L760190M355023M078238M738967M490511N296830
14303A17839373N293298N545492N913044O443747O988852O932850P776392Q104563
14295A70837611Q324152R182831R353178R819130J0568725J0698434J1605322
14288B40389383J2020672J2440629J3429538J3631037J4088830J4569657J4768717
14281C35338463J4934280J4903375J4248201J4525348J3205328J2463789J1343703
14274D30962487R590525P240216K989821L41284R38359o67502n013030m934665
14266D41447495m657049p391095r546276j1802231j3400049j4454388j4978626
14259C65217781j5176729j5478690j5358490j5223128j4938710j4550704j3549100
$$ y = [84655842, 87449045, 91119614, 94879804, 99234827, 103313065, 108052032, 112542543, 117839373, 123132671, 128678163, 134591207, 141034954, 148023806, 154956656, 162733048, 170837611, 179161763, 188344594, 197697772, 207516902, 218085627, 228784061, 240389383, 252410055, 264850684, 278280222, 291911259, 306000089, 320569746, 335338463, 350272743, 365176118, 379424319, 393949667, 407154995, 419618784, 430962487, 440553012, 447793228, 450783049, 451124333, 452062692, 451395190, 446382160, 441447495, 436790446, 429399351, 419853075, 408050844, 394650795, 380196407, 365217781, 350041052, 334562362, 319203872, 303980744, 289042034, 274491330, 260942230]
14252B60942230j3369676j3114016j1936807j1861592q108026r324558j0220697
14245A83006858q998535q496487p845083p910713p101138o317756o596164n575665
14237A24165317n100940n723300m639623m897167m406611m092233l429009l797650
14229H8078784l569622l194425l006295k746302l181820k425102k716440k420790
14221F4817988k165416k035052k052581j954451j850326j925733j781489j313637
14213D9739303j472551j295139j650257j395172j495418q18575q23293j137726
14205C9651172j462140j144771j157101r50991o85438o97236j114784p82177q94824
14196C0761710r22407q40808j44025o79667j030990o58479m07837q74425m21845
$$ y = [260942230, 247572554, 234458538, 222521731, 210660139, 202552113, 193227555, 183006858, 174008323, 165511836, 157666753, 149756040, 142654902, 136337146, 129740982, 124165317, 119064377, 113341077, 108701454, 103804287, 99397676, 95305443, 91876434, 88078784, 84509162, 81314737, 78308442, 75562140, 72380320, 69955218, 67238778, 64817988, 62652572, 60617520, 58564939, 56610488, 54760162, 52834429, 51052940, 49739303, 48266752, 46971613, 45321356, 43926184, 42430766, 41612191, 40788898, 39651172, 38189032, 37044261, 35887160, 34936169, 34250731, 33553495, 32438711, 31656534, 30761710, 29839303, 28998495, 28854470, 28174803, 27143813, 26485334, 26077497, 25203072, 24781227]
14187B4781227m27631j079746m72830l76845n58685l97207l03879n23845l82161
14178B0258398o19264j80402m04111l35068o14799p3548o71529l11503j63313
14169A6884861k73846k32397n65241l71360r9799m78708k95475q4277k57947k56209
14159A3969602j74534j25761k24241m04950m34232k4167p2361m30962M2864l56658
14149A1764600k61827l25556k44862j0957k07234J63024k15352l88630j74853
14140A0098353O9670m73557J87992m97384j062N1602k34828J04308n76797K0001
14130H748298N4523k96540k39249l0788q0167j67221r5721j47955O3410j64447
14120G644143n6875Q1403n49740L2971L5743k14427L9498l72573k3212j10380
$$ y = [24781227, 24353596, 23273850, 22801020, 22424175, 21865490, 21468283, 21164404, 20640559, 20258398, 19639134, 19458732, 19054621, 18719553, 18104754, 18031206, 17359677, 17048174, 16884861, 16611015, 16378618, 15813377, 15442017, 15342218, 14863510, 14568035, 14483758, 14225811, 13969602, 13795068, 13669307, 13445066, 13040116, 12605884, 12581717, 12509356, 12078394, 12121258, 11764600, 11502773, 11177217, 10932355, 10921398, 10714164, 10877188, 10661836, 10273206, 10098353, 10168023, 9694466, 9882458, 9385074, 9384012, 9435614, 9200786, 9305094, 8728297, 8748298, 8802821, 8506281, 8267032, 8236244, 8156077, 7988856, 7893135, 7745180, 7808590, 7644143, 7587268, 7668671, 7118931, 7151902, 7187645, 6973218, 7012716, 6640143, 6616931, 6506551]
14110F506551R573r1666Q062O19R2199j89359k66853J70035l32967j60747K75859
14099F021306j18104k36023K9282P1875l23345N3331J17661j76784K23030k61099
14089E401130j18566M0163r1837j89435o7815l1258j33682J6652m69552j43764
14079D212036N11051k14792J8131k5137p7925n4305k26199J13329r1760K3914
14069D188343n28501Q08941o58468J57348l24942K15491O7584J75678j46968j00366
14059C854140K05243k27300j68000k56668J38507R9465k45491K05522J65596m64963
14049C306051J24613O6649k79035K4767j074o6029j6528p0068j10213L8185J01403
14038C118721k61731n200J09039J71983k76678k6194P7648K82554Q0822l05703
$$ y = [6506551, 6516124, 6424458, 6432520, 6433139, 6525338, 6335979, 6069126, 6239161, 5906194, 5745447, 6021306, 5903202, 5667179, 5696461, 5768336, 5444991, 5498322, 5615983, 5439199, 5662229, 5401130, 5282564, 5322727, 5230890, 5041455, 4973640, 4942382, 4808700, 4825352, 4355800, 4212036, 4723087, 4508295, 4526426, 4501289, 4423364, 4369059, 4142860, 4256189, 4164429, 4188343, 3659842, 4468783, 3810315, 3967663, 3642721, 3858212, 3925796, 4101474, 3954506, 3854140, 4059383, 3832083, 3664083, 3407415, 3545922, 3645387, 3399896, 3605418, 3771014, 3306051, 3430664, 3497313, 3218278, 3243045, 3241971, 3175942, 3159414, 3089346, 2979133, 3017318, 3118721, 2856990, 2851790, 2960829, 3132812, 2856134, 2829940, 2907588, 3190142, 3270964, 2965261]
14028B965261K21248n04874Q1739o4308J25028k61722J65468k73565K68344Q574
14018B731193k10189q8940J26398k47309K23631n9294J4482j66000J67389o9186
14008B422175o5061m76678M49412j80248L5249M0252l136J0872p4347O0834K41230
13997B460554n05228o4380L52357r6099j7722Q6925k3294O38026P38998J891006
13987E461143N359160J3204927J8574852j4250436j2108375o446967k894508j863554
13979E036242n75016o84381m46576j77689l99849K23216j75458K09436l71525
13970B638400k59572P7921j37015J20101k85607p9914P3241K11283l01694J47862
13960B205006j80124k25477L15010k61694L17991j81645p9706j05082L22980j91523
$$ y = [2965261, 3186509, 2681635, 2763374, 2699066, 2824094, 2562372, 2727840, 2454275, 2722619, 2731193, 2521004, 2432064, 2558462, 2311153, 2534784, 2475490, 2489972, 2323972, 2491361, 2422175, 2357114, 1880436, 2329848, 2149600, 2184849, 2225101, 2221965, 2232837, 2158490, 2219324, 2460554, 1955326, 1890946, 2243303, 2147204, 2129482, 2216407, 2193113, 2831139, 3570137, 5461143, 10820303, 24025230, 42600082, 28349646, 16241271, 9794304, 6899796, 5036242, 4461226, 3776845, 3330269, 3152580, 2752731, 2975947, 2800489, 3009925, 2638400, 2378828, 2456749, 2319734, 2439835, 2154228, 2074314, 2147555, 2358838, 2057144, 2205006, 2024882, 1799405, 2114415, 1852721, 2170712, 1989067, 1909361, 1804279, 2127259, 1935736]
13950A935736J13110m6102m14359L8987K03999j2772M5494m1601k308R344L4088
13939A863616j44130L4895j75931o3591o0680L17763k82283k9840M98278m07332
13929A550765j77933K65714L62152l53617M0821J73665j98299j92528J22974l77585
13919A216129L47234j37860r232J53659k05599K25073j8971j69740J25590k67876
13909A258407K92911m83983P3883L14575l30200K84644J34134O9155o48340K30706
13899A195892N4202J69887j36208r5208R9015j80596K22946J55673k08781J59341
13889A436163n5184k47923K76429j36739p9526k07123J20025M77884m77327J02083
13879A208762m9825K53420j38031m70934M58833k50102N179K7118p1035M6235
$$ y = [1935736, 2048846, 2002744, 1588385, 1627372, 1831371, 1818599, 1864093, 1822492, 1820184, 1829528, 1863616, 1719486, 1754381, 1578450, 1514859, 1454179, 1771942, 1489659, 1459819, 1958097, 1550765, 1372832, 1638546, 2000698, 1647081, 1687902, 1861567, 1663268, 1470740, 1593714, 1216129, 1563363, 1425503, 1416271, 1569930, 1364331, 1589404, 1570433, 1400693, 1526283, 1258407, 1551318, 1067335, 1141218, 1455793, 1125593, 1410237, 1544371, 1613526, 965186, 1195892, 1250094, 1419981, 1283773, 1188565, 1287580, 1106984, 1329930, 1485603, 1276822, 1436163, 1380979, 1133056, 1409485, 1272746, 1193220, 986097, 1106122, 1584006, 1106679, 1208762, 1158937, 1412357, 1274326, 803392, 1262225, 1012123, 1017302, 1044420, 973385, 1019620]
13869A019620N59377m88214L07683n11598L97094l69554P8019K2696j86228L74102
13859A202997k01198k7695k93680L44337q8498q7942N28247k40373R2418k54561
13849I74052l9784K971L19532l20234j2137L98096k77708O39J78354j51826j39372
13838I32583l30155L78200L4801k93802L30809j66930k03877M83387E14692K71747
13828G86439J41707C87453M41200l8368N0678j68649L94716j30022k17209J34574
13818H54373L5977J63027j6684k8290K65513D00745L75620J90905o8691K27605
13808A126184k84795j61457K52831k83629R4105K86836q1100k5778P9775o472
13798I96500k56896K78652M0665l43891K71727k55008J83827K9102k72319K49718
$$ y = [1019620, 1578997, 1090783, 1398466, 886868, 1283962, 914408, 992427, 1015123, 828895, 1202997, 1001799, 974104, 680424, 1024761, 936263, 848321, 1376568, 1136195, 1228613, 974052, 934268, 937239, 1256771, 936537, 924400, 1322496, 1044788, 1045427, 1223781, 1071955, 932583, 602428, 980628, 1015429, 721627, 1052436, 885506, 681629, 1165016, 514692, 786439, 928146, 387453, 828653, 790285, 840963, 672314, 1067030, 937008, 719799, 854373, 890350, 1053377, 1036693, 1008403, 1273916, 400745, 776365, 967270, 898579, 1126184, 841389, 679932, 932763, 649134, 743239, 1030075, 948975, 923197, 1002972, 996500, 739604, 1018256, 1058921, 715030, 986757, 731749, 915576, 944678, 672359, 922077]
13788I22077j95093m8130J10362j24145J48852j25697j36208J72535q6761j60248
13778D77544K77876l9981Q3583j78950B98592N93106k50260r6460O7946n1050
13768E61874Q9443m0019J06843j48477K97497j90814B78276L7634L57173N1979
13758G25062j46007j2008r842K7135L9177J0948j94998L49566l12269N8791R6388
13747F31943k74899K45904j79703M88200r4312j87816r9240L3724L58360j89123
13737G33038J5024P9624B25514N22583j41475J48966k2713k05651Q2020q3704
13727E25540J04947j48092k8991L0742J34013j50798p3137K69299J22658j14302
13717F71879k50507J1370L28722C00628K25337o2236l6347j74113K91751k34027
$$ y = [922077, 726984, 678854, 789216, 665071, 813923, 688226, 552018, 724553, 637792, 477544, 755420, 715439, 799022, 620072, 298592, 891698, 641438, 544978, 612924, 561874, 651317, 611298, 718141, 569664, 867161, 676347, 278276, 315910, 673083, 725062, 579055, 567047, 557205, 584340, 623517, 634465, 439467, 789033, 476764, 535555, 631943, 357044, 602948, 423245, 911445, 817133, 629317, 530077, 563801, 922161, 733038, 748062, 827686, 225514, 748097, 606622, 755588, 732875, 527224, 609244, 525540, 630487, 482395, 453404, 484146, 618159, 467361, 394224, 663523, 786181, 671879, 421372, 432742, 761464, 300628, 525965, 463729, 427382, 253269, 545020, 310993]
13707C10993K27296J05318k80873O8547K57326B89488M14236j06004B01851R9173
13697C01024L14392j37548r2028L67552j3795B84313K00735k5650j95913n4188
13687B09297N12699n439j61482O7453j8637k90383M39396J6964L6405C35176L5302
13676C70478L0077Q5559J97367K40754D9211M25535r1736Q2282M29308l33481
13666E61119j17746j74215Q7925j69281J79102K2569J73899L0589F1242O29009
13656F90251l20748j81733L76823r6492k21391K40274j76511J2705m7752K59942
13646E35368j12157B02864L44208J5289B25077K95775q5953K058J58990k29179
13636C66768J57844B56886Q9901k1679J38598A15510J83343K04240j99427J96438
$$ y = [310993, 538289, 643607, 362734, 431281, 688607, 289488, 703724, 597720, 201851, 301024, 615416, 477868, 385840, 753392, 739597, 284313, 485048, 459398, 263485, 209297, 721996, 716557, 555075, 622528, 603891, 313508, 752904, 769868, 806273, 335176, 370478, 400555, 486114, 683481, 924235, 49211, 474746, 383010, 465292, 894600, 561119, 443373, 269158, 357083, 187802, 366904, 389473, 563372, 593961, 61242, 690251, 369503, 187770, 564593, 468101, 246710, 486984, 310473, 323178, 275426, 535368, 423211, 202864, 547072, 562361, 225077, 520852, 434899, 436957, 595947, 366768, 524612, 256886, 346787, 325108, 463706, 115510, 298853, 503093, 303666, 500104]
13626E00104a49C09138K27732B31661K37911J76211A7552N09265A52005J40874
13616B92879p1070J56327m5977L53396B72675J81523j33846Q849L17311j69506
13606D77006g1990A79831L27063J12251k29576K17933B87266R0524F4129N15769
13596E79898A00482J94695K52380k51638A16747K22544L29456B35418J44753j01242
13586B78929R8244A86027o5170O2940n5095K73181j92731K61810l2275j15954
13576C22733Q7004D7352M52908B33868K68712j52000k4320A19890O01836k24572
13566D97154k05575l9319D8599j4029L57691E9531K93126K89959l2359j42368
13556D67889j53111j682L1416o0110l2130H7080J37159J41534J54830J6295B35190
$$ y = [500104, -149, 309138, 536870, 231661, 469572, 645783, 17552, 526817, 152005, 292879, 221809, 378136, 332159, 685555, 272675, 454198, 320352, 329201, 646512, 477006, -71990, 179831, 506894, 619145, 389569, 607502, 287266, 377790, 64129, 579898, 100482, 295177, 547557, 295919, 116747, 339291, 668747, 235418, 380171, 278929, 377173, 186027, 120857, 183797, 128702, 401883, 209152, 470962, 438687, 322733, 409737, 47352, 500260, 233868, 502580, 350580, 326260, 119890, 721726, 497154, 291579, 252260, 48599, 34570, 392261, 59531, 352657, 642616, 610257, 467889, 314778, 313096, 344512, 284402, 252272, 87080, 224239, 365773, 520603, 536898, 235190]
13544B49972B6460J70397J3891N1670A00651K3983K29582j45401J84797m237j4785
13533C74590L8967J22548E2371K55989j46623C1616O21458B13978P6473j07286
13523A83165J65222n2208A02483J13746l4234n0937L10414A95197M7692M9121
13513B92010o3509Q4962m017M985D0329N57888J8826D3446K73363A6822B996Q5878
13501H8874L96437o6243A57841j176k8554m6089Q4128j6767J94254j30863K09873
13490D22647j50010j29805k8557K72716A66233P7469m2254m8461J6759B7461J82768
13479B10229K19343H6861K17580j14830a12850A42757L09936j57773a0219F62592
13468A41116k4684K80029I4970m5931L49921p2673j06003M4176J06114J3106r4815
$$ y = [249972, 26460, 196857, 210748, 262418, 100651, 124634, 354216, 208815, 393612, 389375, 374590, 413557, 536105, 52371, 308360, 161737, 31616, 653074, 213978, 290451, 183165, 348387, 296179, 102483, 216229, 181995, 131058, 441472, 195197, 242889, 292010, 228501, 313463, 309446, 314431, 40329, 598217, 617043, 43446, 316809, 16822, 2996, 88874, 485311, 419068, 157841, 156665, 128111, 82022, 166150, 149383, 343637, 212774, 422647, 272637, 142832, 114275, 386991, 166233, 243702, 201448, 152987, 169746, 27461, 210229, 429572, 86861, 304441, 189611, -112850, 142757, 452693, 294920, -10219, 662592, 141116, 116432, 396461, 94970, 49039, 398960, 326287, 220284, 264460, 370574, 383680, 288865]
13457B88865P3316a03516E41178k65051n8755N6895A0563J72044C1398L86932
13447D18330I5417m91J76934R3507j61521l149I9112J21340m6763J56292J16944
13436D46925B18207K7101o3505J69045J90906e4126C53296Q4615j98764K53241
13426D92388A01781M44452k46396R2774A70937l5325L03791H1100J73558c8497
13415C15601r3642J26447p659c3501C74145Q0041B15535N8719a72564B28202A10196
13403A26403J0118J72143P3841r7869P4089C4508J22389n8323D3609L6950a07776
13391C95909a92012B00202K28622d01511h1361A93796b15000B87709J30444k2667
13381C95486R0898p8858h1056j49017A08748L40210a64352H6158K83620H6171
$$ y = [288865, 362181, -103516, 541178, 276127, 217372, 274267, 10563, 182607, 31398, 418330, 95417, 94926, 271860, 365367, 203846, 200697, 99112, 220452, 173689, 329981, 446925, 218207, 245308, 181803, 350848, 541754, -54126, 353296, 437911, 239147, 492388, 101781, 546233, 299837, 392611, 170937, 135612, 439403, 81100, 254658, -38497, 315601, 221959, 348406, 340747, -33501, 374145, 454186, 215535, 274254, -172564, 228202, 110196, 126403, 136521, 308664, 382505, 284636, 358725, 34508, 156897, 98574, 43609, 80559, -107776, 395909, -192012, 200202, 428824, -401511, -81361, 193796, -215000, 287709, 418153, 395486, 486384, 407526, -81056, -230073, 108748, 448958, -164352, 86158, 369778, 86171]
13370A77146n5115K77208N613A15160K30976I2437K89631A13695m9331C1827P0476
13359A02303M9332a742C22751j48292J20314g5120I4781J39829j0602h5052D78498
13347E74528k75398L6931I3919K39461K03978A93076j1369K6790G9048C0197L91309
13336D21506j41421g0616B29020m2433J33194J0947c6103E10148a32521C13537
13325B19891J10380C9370M4607J06923C4154N5872J50980a11595M0446G8011k1194
13314E6817L74061j40454l2560A27735c4656A88634a7635D32545J05014j56307
13304C81252A55627N0040a99802j67180A38091F6592J82682e1790E9257J29749
13294A89006D265M5473J4594e259r8667C63259j17599l9479p8761a70379B48799
$$ y = [177146, 122031, 399239, 404852, 115160, 346136, 92437, 382068, 113695, 64364, 31827, 102303, 151635, -1742, 322751, 174459, 294773, -75120, 94781, 234610, 224008, -85052, 478498, 574528, 299130, 336061, 93919, 333380, 537358, 193076, 181707, 208497, 79048, 30197, 421506, 280085, -70616, 229020, 186587, 319781, 330728, -36103, 510148, -132521, 313537, 219891, 330271, 39370, 83977, 190900, 34154, 90026, 241006, -111595, -71149, 78011, 56817, 430878, 290424, 257864, 127735, -34656, 188634, -17635, 432545, 537559, 381252, 155627, 205667, -199802, -366982, 138091, 66592, 249274, -51790, 59257, 189006, 4265, 49738, 64332, -5259, -103926, 363259, 245660, 206181, 127420, -170379, 248799]
13282B11939n2630D8925c8774q6598D17949F044J76142P2747J51857p9603m6400
13271B80787G3530b17401A46145g0546C1243b59706i17C7250J26569C5766K83795
13260C19561A58167P3904m9783R5744b6006k3526C17870A32983d2540A5245K87658
13249C02903O0214a54472D3381L93491j06121F1805j4384O21309A19611J54053
13239B73664f1954A08327J36547a91057A835K23055E0986J28865M27675a10904
13228B4976Q3710K37615A3648J35685l915a25884A62441L74692j82689H2229L47888
13217D30117A67635k8405f4951B78362M8333j01412j12516a60803A03663O5514
13207A69177J9063a84552P9284K1800A62912C5150R9832O900K3456L01775k06437
$$ y = [211939, 159309, 48925, -38774, -125372, 417949, 6044, 182186, 254933, 406790, 327187, 280787, 73530, -217401, 146145, -70546, 31243, -259706, -917, 37250, 163819, 35766, 319561, 158167, 232071, 182288, 278032, -26006, -49532, 317870, 132983, -42540, 15245, 302903, 363117, -154472, 43381, 436872, 330751, 61805, 47421, 668730, 119611, 273664, -61954, 108327, 244874, -191057, 1835, 224890, 50986, 179851, 607526, -110904, 24976, 108686, 346301, 13648, 149333, 145418, -125884, 162441, 537133, 354444, 82229, 430117, 167635, 139230, -64951, 278362, 326695, 225283, 112767, -160803, 103663, 169177, 188240, -184552, -105268, -83468, 162912, 35150, 134982, 141882, 165338, 467113, 260676]
13196B60676a81338A44752a20985B3458K94231j34815p1820K51055P834A18361
13185B3734L65704c16397b2795a1204k35528j0893C3364J17536R1084e9121B10446
13173A7323L27167a14983o8835B54474a51148a8106P086B97871q1278b2419p0571
13162i2990C38292A06439a38727D6246f3651q775j00309B34847b66135A91233
13151B83949a14306m7122A69222k9713F5799K43270c5517A8704a06773B46942
13140C81177j50535j07404E7637p295b27783C6727N6735Q1139G7150a72384H0350
13128e1215B74800D852M7469K34649j27628a23236K863L551B12548J27060a72956
13116a19235j9889a4537j52613f4805p024B67009C7428K82056A19024A4222K96658
$$ y = [260676, -181338, 144752, -120985, 23458, 317689, 182874, 111054, 362109, 369943, 118361, 23734, 389438, -316397, -22795, -11204, -246732, -257625, 33364, 150900, 241984, -59121, 210446, 17323, 344490, -114983, -183818, 254474, -151148, -18106, -11020, 297871, 216593, -22419, -92990, 338292, 106439, -138727, 46246, -63651, -72426, -172735, 234847, -266135, 191233, 283949, -114306, -161428, 169222, 139509, 65799, 309069, -35517, 18704, -106773, 246942, 381177, 230642, 123238, 57637, 50342, -227783, 36727, 93462, 174601, 77150, -172384, 80350, -51215, 274800, 4852, 52321, 286970, 159342, -123236, -120373, -116822, 212548, 339608, -172956, -119235, -139124, -14537, -167150, -64805, -71829, 267009, 37428, 319484, 119024, 14222, 310880]
13105C10880r2962a02980A77917M1104A00857K45233A43330K9964a38389A72658
13094A39662L03509C1378J38587M1682B127e90C29663J3448A14711a46768e3944
13082a44371g0387n1514B85565q9067c03474A75340b04020C5733P056M4041L10797
13071C97627E0592a46939q83B7584j2439a94061A71669Q7719a60998M6591l3244
13060a47651j7261N3397c6522A58023J0486A7675P8584f079C38424A54408J03146
13049B57554N4481j02308L7445j17387J08473j11471b051C2751D696c8670p9454
13038a18124N2901D48092p2523A74829J42029a2366D7138J89186k1357O9570n9792
13027B24745I1413a49787B4744K7730g3925L3324j15330O2596A62791k6099g9764
$$ y = [310880, 217918, -102980, 177917, 219021, 100857, 346090, 143330, 173294, -138389, 172658, 139662, 443171, 31378, 169965, 211647, 2127, -590, 329663, 343111, 114711, -146768, -53944, -144371, -70387, -121901, 285565, 196498, -303474, 175340, -204020, 35733, 42789, 86830, 397627, 50592, -146939, -147822, 27584, 15145, -194061, 171669, 259388, -160998, -114407, -147651, -164912, -111515, -36522, 158023, 168509, 17675, 96259, -6079, 338424, 154408, 257554, 312035, 209727, 247172, 129785, 238258, 126787, -2051, 32751, 4696, -38670, -118124, -65223, 448092, 375569, 174829, 316858, -12366, 47138, 236324, 214967, 284537, 224745, 91413, -149787, 24744, 52474, -73925, -40601, -155931, -93335, 162791, 136692, -79764]
13015A69081J0658p7237L63874j73296p0534F3781N8780a57303A12744C1172J36627
13004A67799d7697B8231L31700j65730C5757J55777e5506B15354b45454N4189
12994a91265g7566B29450d5561n4618k1382d0820C87820A5033K42984g3065l57675
12983d30740D1439e6540j78885A56675b7449C8024c5511B10379p0482h870A8109
12971A40787a76158C33681c30432G0443K55494b8415A81654D2809c15906b0720
12960A9761a93292D5539c30577K7495c3828A28441a02668A8079L09998D2483e3868
12948b7887k26686e2104j34436j27448A50285f1147B02818a94794D97474a53831
12937C9886f9464n6130M2400B46421o4149d4478I6340a13518b2507A45928a02003
$$ y = [169081, 179739, 102502, 466376, 293080, 222546, 63781, 122561, -157303, 112744, 31172, 167799, -47697, 28231, 359931, 194201, 35757, 191534, -55506, 215354, -245454, -191265, -77566, 229450, -45561, -100179, -121561, -40820, 387820, 15033, 258017, -73065, -430740, 41439, -56540, -235425, 156675, -27449, 38024, -35511, 210379, 139897, -8870, 18109, 140787, -176158, 333681, -330432, 70443, 325937, -28415, 181654, 42809, -315906, -20720, 19761, -193292, 45539, -330577, -303082, -33828, 128441, -102668, 18079, 328077, 42483, -53868, -27887, -254573, -52104, -186540, -313988, 150285, -61147, 202818, -194794, 497474, -153831, 39886, -69464, -125594, -83194, 246421, 182272, -44478, 96340, -113518, -22507, 145928, -102003]
12925e4590A89695b6975B6508g9479m3774E52928a64498A34821M6038J87229a7344
12913A2196J10951n7429J55129L4059H3929a01566H8265J08320o9846Q0511q7183
12902A20067i319r2309F2923c54963A33883b05673e9521j68805B14475q6857a17306
12890D7806a57119c2813k23045a3997A62330a61847F1982g571A42198b2883j88521
12879b11404D47103a69325q765k69378A32947n1649J79384e4201p0408B05528
12868C10694j32218l4127K1114a38380L8279j22788A49292c19811a51608C22853
12857D6922e880j74664C48122a16083e4544F4167R3144K10822j53289c10322A06340
12845A99484b3962k44531h7589A36414k1879c9712A4659c18076B28746F1409b39497
$$ y = [-54590, 189695, -26975, 26508, -79479, -123253, 552928, -164498, 134821, 180859, 368088, -17344, 12196, 123147, 65718, 220847, 254906, 83929, -101566, 88265, 196585, 126739, 207250, 120067, -9319, -101628, 62923, -354963, 133883, -205673, -59521, -228326, 214475, 127618, -117306, 47806, -157119, -32813, -255858, -13997, 162330, -161847, 61982, -7571, 142198, -22883, -211404, 447103, -169325, -178090, -447468, 132947, 81298, 260682, -54201, -124609, 205528, 310694, 178476, 144349, 165463, -138380, -100101, -222889, 149292, -319811, -151608, 322853, 46922, -5880, -180544, 348122, -116083, -54544, 64167, 157311, 368133, 214844, -310322, 106340, 199484, -23962, -268493, -87589, 136414, 114535, -39712, 14659, -318076, 228746, 61409, -239497]
12833A28570l4635e4053A93270a12046D2238a63842a8786j53269k1766D22717
12822a21572K2191l03915C90048l9388E4452K72259A62446j6972k4399a36440
12811b9021a0512A1949f8754J3540A18872A1819L80377b7853h746j44587b9870
12799f6652j07365a8364j18294B10723J43042D2300b5100j9127k06954B01662
12788c00434F2619J87959A12434B9358R7554D5693q451a70345H7497J81257A17174
12776b67230e0404n5297M2262j14286N6816A398a44416N4676A28598f5714G2389
12764F4072d09562C46185A8432d83894a20943N1699F5318b25275A48734n4176
12754I4558J06261q9340a68402B03480a34626N5803K6934B61595r644A0019a6880
$$ y = [128570, 93935, -54053, 193270, -112046, 42238, -163842, -18786, -172055, -193821, 422717, -121572, -99381, -403296, 390048, 350660, 54452, 326711, 162446, 145474, 121075, -136440, -29021, -10512, 11949, -68754, -55214, 118872, 11819, 392196, -27853, -8746, -153333, -29870, -66652, -174017, -18364, -136658, 210723, 353765, 42300, -25100, -44227, -251181, 201662, -300434, 62619, 250578, 112434, 29358, 126912, 45693, 37242, -170345, 87497, 268754, 117174, -267230, -50404, -105701, -63439, -177725, -120909, 1398, -144416, -89740, 128598, -65714, 72389, 64072, -409562, 346185, 18432, -483894, -120943, -69244, 65318, -225275, 148734, 94558, 200819, 111479, -168402, 203480, -134626, -78823, -51889, 261595, 251951, 10019, -16880]
12742e3105B74239b0947r0205D7065a3028B65850E5894J57695a27894A27126j2760
12731A14366a21151j0872j47839B17371f3650E1691K13893a160n2603l7802H2193
12719d5228l1411c6352C18100g71j77192E4717b6141j12890a5469k085C89047
12707e8078A64157a23864G7943f4963b2600l01315A65809a1780A93950a17695
12696c2493r5369C15519b80328D0613f7577a9241F6782b09894j92549a16901B3999
12684b12552B10342b99729C08393o7434j13667L2750b48212i2366j75073I8863
12673F7507L18215D1391a95147G3188a63779K2013A8291J86643I4985a32629p7364
12662b09993D4952f220k52372J11450A28457a91691C12854A14855g5397j38997
$$ y = [-53105, 274239, -20947, -111152, 47065, -13028, 265850, 55894, 213589, -127894, 127126, 114366, -121151, -132023, -279862, 217371, -63650, 51691, 265584, -1160, -53763, -91565, 82193, -45228, -76639, -36352, 318100, -771, -177963, 54717, -26141, -139031, -15469, -17554, 389047, -58078, 164157, -123864, 77943, -64963, -22600, -323915, 165809, -11780, 193950, -117695, -32493, -127862, 315519, -280328, 40613, -67577, -19241, 66782, -209894, -402443, -116901, 23999, -212552, 210342, -299729, 308393, 240959, 127292, 160042, -248212, -92366, -267439, 98863, 67507, 385722, 41391, -195147, 73188, -163779, -141766, 18291, 204934, 94985, -132629, -209993, 44952, -6220, -258592, -147142, 128457, -191691, 312854, 114855, -75397, -214394]
12652b14394k9211C7887i5630B15818F7764e8299B3894O3773b9333C9684b04599
12640a2824F5573b16749A51584L9396a5105A13016b25664j12370H1498J65759
12630B47257L6758m780J25926j25529A31446c9479O462B9125K01099q3141J13736
12619B60819j02033G1907J71040b7251k7802r0440N7090B5390K24875A24478a00376
12607A48867O48e9866k70756A90730J15572J9968l5297a55708N7218C2333K67730
12596C00063a71556j31544A90000j5686A0815c151H8459B7156J29674A2691b32467
12584A09991o071d3446a3694j62841A25896J32958a7925F927R9773a10829o6992
12573a77821d2913B71052g7759A34792b14695A01120D3255c2643I2833o189J50132
$$ y = [-214394, -243605, 37887, -95630, 215818, 67764, -58299, 23894, 87667, -29333, 39684, -204599, -12824, 65573, -216749, 151584, 190980, -15105, 113016, -225664, -338034, 81498, 247257, 284015, 279235, 405161, 279632, 131446, -39479, -33017, 29125, 230224, 147083, 260819, 158786, 71907, 242947, -27251, -55053, -145493, -88403, 25390, 250265, 124478, -100376, 148867, 149515, -59866, -330622, 190730, 306302, 326270, 290973, -155708, -98490, 32333, 300063, -171556, -303100, 190000, 174314, 10815, -3151, 88459, 27156, 156830, 12691, -232467, 109991, 103920, -43446, -13694, -176535, 125896, 258854, -17925, 6927, 106700, -110829, -177821, -42913, 271052, -77759, 134792, -214695, 101120, 43255, -32643, 92833, 86644, 236776]
12562B36776E9475f9749l2187B32702j11016b77401a24171p3574B7711L21007
12552C48718a59078A83015g8885j11263N9732C75219E1609J26594b42027R5390
12542a46637A82912a33336N0552C31537a85363C55960m3558c8665k24980B1136
12531b75829G3890a48693A34685m0562J03545J23067H4423C0177J08110i6538
12520H3585H055B382L7983a4136m0215k15740P8238l55065a0987c082m4999o5331
12508a13412o285j96776i4675A56498b70891A01433r237J54680h82l9092r6953
12497a36927C59847A57258i7160a5845j53864B6965h5385n4490L9125l8269D1911
12485g8867A67715B9543d00256B10875d3834C92929f6889q2510j52442A98715
$$ y = [236776, 59475, -69749, -101936, 232702, 121686, -277401, -124171, -197745, 27711, 348718, -159078, 183015, -78885, -190148, -130416, 375219, 51609, 178203, -242027, -146637, 182912, -133336, -82784, 331537, -185363, 355960, 312402, -38665, -263645, 21136, -275829, 73890, -148693, 134685, 94123, 197668, 320735, 84423, 30177, 138287, -96538, 83585, 8055, 2382, 40365, -14136, -54351, -270091, -191853, -546918, -10987, -3082, -48081, -113412, -119697, -316473, -94675, 156498, -270891, 101433, 92196, 246876, -882, -39974, -136927, 359847, 157258, -97160, -15845, -169709, 26965, -85385, -139875, -100750, -139019, 41911, -78867, 167715, 29543, -400256, 210875, -43834, 392929, -66889, -149399, -301841, 198715]
12474A69839j149d8189j77195G7575j3090J09421c6385A11585l4838c48065A07885
12462B16978a27845r3588B8469J19438n7654f354p0671E0619J04614a37663e3941
12450B35753A00089f66k62340f1584n5819G4012L5039c3076j73434f6050c432
12438A21637K97912H2889d1581p0k70982G2677b920n1850A91844h9734k66649
12427c56383a52301E4461F033b03094A1493c78926d0207A08618i131o2221D570
12415A904a38371C83057A2685M8572g1356k15733A9868R959e5278A86964b74515
12403C39886a32801E2803H005b21720f7739D45395D1558J41381J2217c55434K2130
12392c33304G7431c54505A61447f5240B20415e6617B83238a167C10732a3822A9196
$$ y = [169839, 168690, -48189, -225384, 77575, 64485, 173906, -36385, 111585, 76747, -348065, 107885, 216978, -127845, -221433, 28469, 147907, 90253, -6354, -77025, 50619, 155233, -137663, -53941, 235753, 100089, -666, -263006, -61584, -117403, 74012, 109051, -33076, -206510, -66050, -3432, 121637, 419549, 82889, -41581, -41651, -312633, 72677, -2920, -54770, 191844, -89734, -356383, -152301, 54461, 6033, -203094, 11493, -378926, -40207, 108618, -9131, -71352, 4570, 1904, -138371, 383057, 12685, 61257, -71356, -287089, 19868, 29827, -55278, 186964, -274515, 339886, -132801, 52803, 8005, -221720, -67739, 445395, 41558, 182939, 195156, -355434, -333304, 77431, -354505, 161447, -65240, 220415, -56617, 283238, -1167, 310732, -13822, 19196]
12380B42733j15951N2622E1645K55805j14090d5880C92517a53882K6825H6131
12369a92701I3665O3741l5358a19883n4522A75570b50099a19266l3919o0401J02020
12358a11566K3501j42740j68267a42438m6358F1543b14822B31899e9868k044A19411
12346C1565K19061H8296Q6665F4992P0547f5310Q994B94911f0227A8229J8081
12335C6310N4483B1395Q3078G400J09671E0254J25528i153A1148M3833i9253j17953
12323b17206b1309j01021d9484k27785n5513G4169o914a55129A18346b09124A56628
12311G1939h9495E3614P3047b53073A20167b33644j11946J11854R3099C4482M7677
12300H2159Q3397h7701C24235A16503C7891P1624B9526b05210O8061G1912j1122
$$ y = [242733, 126782, 179404, 51645, 307450, 193360, -45880, 392517, -153882, -127057, 86131, -192701, 93665, 157406, 122048, -119883, -174405, 175570, -250099, -119266, -153185, -213586, -111566, -88065, -230805, -399072, -142438, -188796, 61543, -214822, 231899, -59868, -61912, 119411, 31565, 250626, 88296, 174961, 64992, 135539, -65310, -56316, 294911, -60227, 18229, 36310, 90793, 21395, 104473, 7400, 117071, 50254, 175782, -9153, 11148, 54981, -99253, -217206, -21309, -122330, -49484, -277269, -332782, 74169, 67255, -155129, 118346, -209124, 156628, 71939, -89495, 53614, 126661, -253073, 120167, -233644, -345590, -233736, -140637, 34482, 82159, 165556, -87701, 324235, 116503, 37891, 109515, 29526, -205210, -137149, 71912, 60790]
12289F0790h9519j428d548j51397F8294j5019b52183f6424j6125K0983B16952
12277B43683H721b92595M050J41396H2592g983k51767a097A03494m6423k139c8842
12264D22478A50958a81790D308c90464A35054I509M29418j91587b1573I742J30063
12253A39805a59644F9077a29092A27524f7700H0011J28054L4509a7329j18582
12243a35911C24413b2517B4519L0871j5804J93431n2463g7726K1396J730m0702
12232i5302A05008L5776Q0712m4219j2647O2910G409K32677C5016K15030A00642
12220A58713D03L74325J53333G6081J27490A00255k5630L94346A02287g9407c6482
12208E5117j0964L0888A9577L11714C2815K73830k7379r1039c1420A09498l5338
$$ y = [60790, -89519, -90947, -4548, -155945, 68294, 53275, -252183, -66424, -82549, -61566, 216952, 243683, 8721, -292595, -288545, -147149, 82592, -7983, -259750, -1097, 103494, 57071, 54932, -38842, 422478, 150958, -181790, 4308, -390464, 135054, 9509, 438927, 247340, -21573, 9742, 139805, -159644, 69077, -129092, 127524, -67700, 80011, 208065, 242574, -17329, -135911, 324413, -22517, 24519, 55390, 39586, 233017, 180554, -77726, -56330, -54600, -95302, 105008, 140784, 221496, 177277, 164630, 227540, 7409, 240086, 35016, 250046, 100642, 158713, 403, 374728, 528061, 76081, 203571, 100255, 74625, 468971, 102287, -79407, -36482, 55117, 44153, 75041, 19577, 331291, 32815, 306645, 279266, 188227, -31420, 109498, 74160]
12197G4160e2059H519f9297A23381b61607n3426d2651B21126p0158n2188d6807
12185B40919l5685C1571J76837A1211K98739J2869j42447m8032J99411a57171
12174F8951J493J45491J14635d819A39733j8259J03841J02500A38465M8946k2222
12163A65189a54699A02000j4627Q3369k1339m8670b05389A24532N1445D1661i1317
12151A65294a45195f1067B18330a43013B2915P5340c88486E5806L57074A19601
12140C60691p6880b25323C36392j65482b76576B12195I7866B2081L06559m9493
12130B79147b2528B09940a30014a7556G8808L06023B8743i968B76978a6835B34604
12118e0950n4459B868L98518a22407a8762D12055A06292L59j3064a84180Q1707
$$ y = [74160, -52059, 8519, -69297, 123381, -261607, -315033, -42651, 221126, 150968, 98780, -46807, 240919, 205234, 31571, 208408, 11211, 309950, 322819, 180372, 132340, 331751, -157171, 68951, 70444, 215935, 330570, -4819, 139733, 121474, 225315, 327815, 138465, 187411, 165189, -154699, 102000, 87373, 170742, 149403, 100733, -205389, 124532, 175977, 41661, -91317, 165294, -145195, -61067, 218330, -143013, 22915, 98255, -388486, 55806, 412880, 119601, 360691, 283811, -225323, 336392, 170910, -276576, 212195, 97866, 22081, 328640, 279147, -22528, 209940, -130014, -17556, 78808, 384831, 28743, -9968, 276978, -16835, 234604, -50950, -105409, 2868, 401386, -122407, -18762, 412055, 106292, 106651, 93587, -184180, -102473]
12107a02473K5653C3203b38587I9398l063d01260G2047P3056f3458l4640O080
12096i2018A70210F5749i6210G5282J46477C9004L62673b94469a05122a0897G5262
12084B51199d386G7668c940E1687c9481m12771A65207A4070J77779K4700B4879
12072A2832a43379q3423L5164B97466a39712A40417b43495C0285p576a1690C03240
12060a27690E47208L36690D07002p871c09481E151K15172i3556J6006j21015f2269
12048c4509j3261r656B635d47641a78885f6613m30a7780B41935G268J66571n9233
12036A14606a66301A79948l7464h6537m9472B44532a34815D4848c79889I1440
12025A35034a14717B61278A29651g4755I6957K07075i7443K3532l0352j68607
$$ y = [-102473, -76820, 33203, -238587, 99398, 96335, -401260, 72047, 145103, -63458, -98098, -92018, 170210, 65749, -96210, 75282, 221759, 39004, 401677, -294469, -105122, -10897, 75262, 251199, -4386, 77668, -3940, 51687, -39481, -452252, 165207, 14070, 191849, 216549, 24879, 12832, -143379, -226802, -191638, 297466, -139712, 140417, -243495, 30285, 22709, -11690, 303240, -127690, 547208, 883898, 407002, 399131, -309481, 5151, 220323, -93556, -77550, -198565, -62269, -34509, -47770, -57426, 2635, -447641, -178885, -66613, -67043, -17780, 241935, 7268, 173839, 114606, -166301, 179948, 142484, -86537, -136009, 244532, -134815, 44848, -379889, 91440, 135034, -114717, 261278, 129651, -74755, 96957, 304032, -97443, -73911, -104263, -272870]
12015b72870D02429C2077O5027J31497A4999L25563i8836I6339a51938N4008a8457
12003a31157N9174A61982O3973I9036G909d9113A32513c3411A02347f0232A17499
11991d9105J8555A11327D6702J09027A5937a56885A13859G371a82266o8410R2947
11980a57729A14215D3296b03419B8083d94812B88713h9623k69627J13538F6025
11969c65815a27503j97014g343r3999l2797A74073c1603C3079h7601A09966d6636
11957b05957A95666M6005b2616F4290m980g2531k0265j09979E5829A2594b10880
11945a44752j72720o1293f877k10267h7634j2995a9536j85161F7146L086c33942
11933a56475n2046c8097A47629D2179K87676C8950O2592b08169E0896h4365B7177
$$ y = [-272870, 402429, 32077, 97104, 228601, 14999, 340562, -98836, 96339, -151938, -97930, -18457, -131157, -71983, 161982, 225955, 99036, 7909, -49113, 132513, -33411, 102347, -60232, 117499, -49105, -30550, 111327, 46702, 155729, 15937, -156885, 113859, 7371, -182266, -250676, -157729, 114215, 43296, -203419, 28083, -494812, 288713, -89623, -359250, -245712, 66025, -365815, -127503, -324517, -7343, -101342, -134139, 174073, -31603, 33079, -87601, 109966, -46636, -205957, 195666, 241671, -22616, 64290, 59310, -72531, -92796, -202775, 55829, 12594, -210880, -144752, -317472, -378765, -6877, -217144, -87634, -100629, -19536, -204697, 67146, 70232, -333942, -156475, -208521, -38097, 147629, 42179, 329855, 38950, 101542, -208169, 50896, -84365, 27177]
11921a15556L678A94498F8672f7389B55841j15759B5325i7631r5358C3490a41406
11909B72600p2917b1053A50934Q7297h4657i572l46824J4772B81777A14763a13446
11897b73638d6938B39104q2178b73469A93973O3334b00879d4274l31564a03770
11886B1804c51401A00135R2534E3574d1480B29119b4243g801I6390h5114E6864
11874e5888j30377C1844K14671i4426A18113k2007a24307J1754i855C235K6116
11863B9351R8408m0055a55310a6784j38501P2187d0790r3428b1341R768m17537
11852d29110A05278H751Q972b653k0654b042B81784g8364A39281a09522A47774
11840h693n5930j9501k62223a0129C6106Q596b13907G2434h4253c5302D5091g0947
$$ y = [-115556, -111878, 194498, 68672, -67389, 255841, 140082, 25325, -97631, -192989, 33490, -141406, 272600, 199683, -21053, 150934, 238231, -84657, -9572, -356396, -341624, 281777, 114763, -113446, -273638, -46938, 239104, 156926, -273469, 193973, 257307, -200879, -44274, -375838, -103770, 21804, -351401, 100135, 192669, 53574, -41480, 229119, -24243, -7801, 96390, -85114, 56864, -55888, -186265, 31844, 246515, -94426, 118113, 96106, -124307, -112553, -9855, 3235, 29351, 127759, 87704, -155310, -16784, -155285, -83098, -40790, -134218, -21341, -11573, -429110, 105278, 8751, 17723, -2653, -23307, -2042, 281784, -78364, 139281, -109522, 147774, -8693, -64623, -84124, -346347, -10129, 36106, 44702, -213907, 72434, -84253, -35302, 45091, -70947]
11827B06587B4131c78006B08050a69118A65249F2252k7171L0961L2119l0275a06086
11815A48370P1148B4378j720b4671B10761c91874B4823a74629d6968j83500b7729
11803f7207C6259a63608j07898D4779a73777d0382h852n73972K25730B68840E4667
11791b521j28285E0504b51870d8649a7967r7008G0394c26272a03739J6524L6430
11780e0785o2002J323d0451A86125P0383f7636j94541B19873h2198m05055A73053
11768c8327j37493B7663i6849j66709b2118C1403b15875c3095j35477b2556b714
11756f4739j52971C23175a08177A14358a5885A90301g030F3357a99349M6359b3411
11744A41712f4477A67249P11H1649c3693n598B17295b86288h4183B53691a88100
$$ y = [206587, 24131, -378006, 208050, -169118, 165249, 62252, 35081, 66042, 98161, 67886, -106086, 148370, 219518, 24378, 22658, -24671, 210761, -391874, 24823, -174629, -46968, -230468, -27729, -67207, 36259, -163608, -271506, 44779, -173777, -40382, -8852, -582824, -357094, 268840, 54667, -2521, -130806, 50504, -251870, -48649, -17967, -114975, 70394, -326272, -103739, -87215, -50785, -112787, -111464, -40451, 186125, 256508, -67636, -262177, 219873, -82198, -487253, 173053, -38327, -175820, 27663, -96849, -263558, -22118, 31403, -215875, -33095, -168572, -22556, -2714, -64739, -217710, 323175, -108177, 114358, -15885, 190301, -7030, 63357, -199349, -152990, -23411, 141712, -64477, 167249, 167960, 81649, -33693, -39291, 217295, -286288, -84183, 253691, -188100]
11732b14905g053I0689d0145p6130c2791C85348A76752c79681A28740a86376E557
11720b23315J03019d100I4701a59306m8258D0670c13251r0059e3716C22056j32777
11709A89279K7477r3716b9982r9339A31916g0111l5734B1580a49585C2035K38322
11698B70357d22677A69336a2684A55088L6011p2400a88504C20898b31546e9190
11687A49501a33381C7184Q9140b36843g6535A12521c75303b5330k33084b4517
11676D4499a94941N8566j87835i737A00847a44603e3317r2374j08808A16801h7710
11664a19554J7516q5637j00322d4362A28243a08037A91110N5687b98721F5994
11653D9715K1817d28263C6810a08437B6253O1476j5134K0434K30554b17048C68015
$$ y = [-214905, -7053, 90689, -40145, -116275, -32791, 385348, 176752, -379681, 128740, -186376, 5557, -223315, -120296, -4100, 94701, -159306, -207564, 40670, -313251, -403310, -53716, 322056, 189279, 216756, 123040, -29982, -129321, 131916, -70111, -105845, 21580, -149585, 32035, 270357, -422677, 169336, -12684, 155088, 191099, 118699, -188504, 320898, -231546, -59190, 149501, -133381, 37184, 126324, -236843, -76535, 112521, -375303, -25330, -258414, -24517, 44499, -194941, -136375, -324210, -9737, 100847, -144603, -53317, -145691, -254499, 116801, -87710, -119554, -102038, -187675, -287997, -44362, 128243, -108037, 191110, 246797, -298721, 65994, 49715, 71532, -428263, 36810, -108437, 26253, 87729, 72595, 93029, 323583, -217048, 368015]
11641A30015m9288a33135n9842f6848A00436e5277k19951L9073H803J50886a99056
11629B34051d5947B5798a46998f2869k42140c0738k12768a12502k0827M8889R106
11618g5334a974j1210k13340J08998j38318A03045b25636b5255k37588D8315g1065
11606A32823n0317h0307j1478K1027C63572c7921q6158B13737k6314k4769F5701
11594C14363a8265A36458B6069J68693J00952a82614K7246j19439A60590b29337
11583A96758a32540L9138d4690E6349a45675m3992A81666p2120c94507A42363
11572H2533c09252J41621j04618B18256c15821J52382e4622B08105i5086B41704
11561c16652F9980b76787d3815j63317d4717k14175A55986K0871a48208c5416
$$ y = [130015, 80727, -133135, -192977, -66848, 100436, -55277, -275228, -236155, 8803, 159689, -199056, 234051, -45947, 25798, -146998, -62869, -305009, -30738, -243506, -112502, -133329, -84440, -75334, -1974, -13184, -226524, -117526, -255844, 103045, -225636, -25255, -262843, 48315, -71065, 132823, 82506, -80307, -91785, -70758, 363572, -37921, -124079, 213737, 187423, 162654, 65701, 314363, -18265, 136458, 26069, 194762, 295714, -182614, -155368, -274807, 160590, -229337, 196758, -132540, -93402, -44690, 56349, -145675, -189667, 181666, 109546, -394507, 142363, 82533, -309252, -167631, -272249, 218256, -315821, -163439, -54622, 208105, -95086, 241704, -316652, 69980, -276787, -43815, -207132, -44717, -258892, 155986, 176857, -148208, -35416]
11550a1100I0385a66039D85239F1020d04210B00260k7785f4223m5246l09270P2178
11539c46561B6848h0145A63745B8600a11881q8688f7003j50465e824I0692l500
11528H7192f215l2766k3680Q464k51476a30900B44175d017k01271c0268B61735
11516b25199F999J37776a56702c8820I2409e3359A87142a73013j75095O2918G5410
11504f0966r4152A34739J2816E3859k4334J88683a35706a8513o2641H2604C982
11492B39271F5333L12726j72801I3257N7825m7381h6462B97172G69b33994K1381
11481b12613q8305C18477A50438F7843b38065r0353B01655a64553b4576G7803
11470H1460N2828k7491h2674E8716N4557O7037K14817A00580K21410A06569b24512
$$ y = [-11100, 90385, -166039, 485239, 61020, -404210, 200260, 172475, -64223, -109469, -418739, -346561, 26848, -80145, 163745, 28600, -111881, -200569, -67003, -217468, -5824, 90692, 87192, -6215, -38981, -62661, -54197, -305673, -130900, 244175, -4017, -205288, -30268, 261735, -225199, 6999, 144775, -156702, -38820, 92409, -53359, 187142, -173013, -348108, -285190, 75410, -60966, -155118, 134739, 147555, 53859, 29525, 218208, -135706, -18513, -81154, 82604, 3982, 239271, 65333, 378059, 205258, 93257, 151082, 103701, -86462, 297172, 769, -233994, -212613, -300918, 318477, 150438, 67843, -238065, -328418, 201655, -164553, -24576, 77803, 81460, 134288, 106797, -82674, 58716, 113273, 180310, 395127, 100580, 321990, 106569, -224512]
11458a9615l06950f8583j46061P8862O3520B21697K98877B9026J22977a93464
11447B02570b5317A10918Q5163L1118k6986i2449K7411q0698O4822E6552b37660
11435A98184b1197B75921q1972c83164e7201A29059C6237J59333h9860a888D47068
11423A8931a70673L2521B0791c58118B09615J7725C1403b43586B6737J99554b49742
11411a52808L0461B84547g5707b6881i291M057j74176K6810E8641K4301J6884
11400I9826a45264j28451j07761H0942c4851q9634M0450d1461m80518B56084a88829
11388b3220k5151A87488j0266a60616pJ5796j40193a37510J4682A87507E8764
11376D2813c29314a4588l16538D8120O0578D7110c16001a10706d4463K430A33542
$$ y = [-19615, -326565, -68583, -214644, -135782, -72262, 221697, 520574, 29026, 152003, -193464, 202570, -25317, 110918, 196081, 227199, 200213, -92449, -65038, -145736, -80914, 56552, -237660, 198184, -21197, 275921, 193949, -383164, -57201, 129059, 36237, 195570, -89860, -1888, 447068, 18931, -170673, -138152, 20791, -358118, 209615, 227340, 31403, -243586, 26737, 226291, -249742, -152808, -122347, 284547, -75707, -26881, -9291, -5234, -179410, -152600, 58641, 82942, 99826, -145264, -273715, -381476, 80942, -34851, -124485, -84035, -41461, -521979, 256084, -188829, -23220, -48371, 187488, 177222, -160616, -160623, -144827, -285020, -137510, -122828, 187507, 58764, 42813, -329314, -14588, -331126, 48120, 108698, 47110, -316001, -110706, -44463, -42033, 133542]
11364a79351m4553B06144I2904C5431b00003D6892O1245M7380m1859a12489J2028
11353a00461C53528a10092l8781A03409K55237c09853q5690a73023K3936j3758
11343a62845A4623J47665a44450b8008p1364o450A46971b56479E467L0227A2634
11331B03155c04859a4120B12667H5856a87254O2790j71916f0753j6154j41488
11321b18395A7563i9604D6991J8511a74727A9574i8619K9293k0395B19034i0322
11309F1205h0944G8483K79030b57945I4811a86779k56760J55589A50837j6123
11299A34714n9023f2F3904a77084j94508c9678A57174h817r7410I2861b76382
11287A14063D7130a34677l77349C3684b95390A42547m7212A261a38743A23334
$$ y = [-179351, -223904, 206144, 92904, 35431, -200003, 46892, 108137, 155517, 113658, -112489, -100461, 353528, -110092, -148873, 103409, 358646, -309853, -395543, -173023, -149087, -162845, 14623, 162288, -144450, -28008, -99372, -105822, 146971, -256479, 5467, 35694, 12634, 203155, -304859, -14120, 212667, 85856, -187254, -124464, -296380, -60753, -76907, -218395, 17563, -99604, 46991, 65502, -174727, 19574, -98619, -69326, -89721, 219034, -90322, 61205, -80944, 78483, 357513, -257945, 94811, -186779, -443539, -287950, 150837, 134714, 75691, -62, 63904, -177084, -371592, -39678, 157174, -8817, -106227, 92861, -276382, 114063, 47130, -134677, -512026, 33684, -295390, 142547, 95335, 1261, -138743, 123334]
11276A46591c15045J53580j31293D4748a86081k2616K9350B02465M7514E3608
11265d5048B2150e2345J1304a3736r8995j9538A45604a26764j17372a314B22474
11253B7532a57199a0588A49616M8122a48072C07573b13005d9715l61338e5802
11242A95678C2153J70965a95250J1086A8548a90549g0692I8996h7176C1010a30442
11230A19965M3297D3399a82088J9865N0774a0418m7753A21092b63322G0123b15182
11218h88j30820J0660B3627g2529c3951c418B87926j31004K1294D4201O7871a24082
11205e6299A52718c64790a62666A52546g1472c5429k11982A09198D1545a08688
11194A17571B2792d54587a37594k08908a21912h183l68525J39872d1945A78856
$$ y = [146591, -315045, -161465, -292758, 44748, -186081, -208697, -179347, 202465, 249979, 53608, -45048, 22150, -52345, -41041, -13736, -112731, -132269, 145604, -126764, -244136, -1314, 222474, 27532, -157199, -10588, 149616, 197738, -148072, 307573, -213005, -49715, -411053, -55802, 195678, 32153, 203118, -195250, -184164, 18548, -190549, -70692, 98996, -87176, 31010, -130442, 119965, 163262, 43399, -182088, -162223, -111449, -10418, -58171, 121092, -263322, 70123, -215182, -888, -131708, -121048, 23627, -72529, -33951, -3418, 287926, 156922, 178216, 44201, 112072, -124082, -56299, 152718, -364790, -162666, 152546, -71472, -35429, -247411, 109198, 41545, -108688, 117571, 22792, -454587, -137594, -346502, -121912, -8183, -376708, -236836, -41945, 178856]
11183A06034b2040q988B58192b16649J03841e2006m7930G8556c7536l6379G5712
11171b79056B17815m2132c37839a17633E5257M53613H3243d1559j50840P9578
11161a12821J6280k715n3791j08496I279J12404B2569L47202a39850a4793B43671
11149a60510g474r369k11453N7617C82456c7325I2729J94947K2271g9710A93759
11137G0572a08672A05082j4068b13009I8466i2684j655L8340E2636a09325A56616
11125c6514B5527M7018M6237k4772f9380A34666C3561J90472I066J48361e0083
11113d142m1456j708A73519l6276j4980n7434L8946a3337k48053A18079j2717
11102A05362B0845Q1131C7441d1931B09816J54225a30508A08664P1876q2525e2981
$$ y = [106034, -22040, -31028, 258192, -216649, -112808, -52006, -99936, 78556, -37536, -73915, 75712, -279056, 217815, 175683, -337839, -117633, 55257, 508870, 83243, -41559, -192399, -112821, -96541, -99256, -153047, -261543, 9279, 121683, 22569, 369771, -139850, -14793, 243671, -160510, -7474, -16843, -228296, -170679, 382456, -37325, 92729, 287676, 309947, -79710, 193759, 70572, -108672, 105082, 91014, -213009, 98466, -92684, -94339, -55999, 52636, -109325, 156616, -36514, 25527, 72545, 118782, 94010, -69380, 134666, 33561, 224033, 9066, 157427, -50083, -4142, -45598, -47306, 173519, 137243, 122263, 64829, 103775, -13337, -261390, 118079, 105362, 20845, 101976, 37441, -41931, 209816, 364041, -130508, 108664, 180540, 98015, -52981]
11090A32270B6487L57425A62211R9446f5822D97126B9248K10963a42228K2578
11080a19650A64799c04650B45696L0904A5577K77328G3655b68702F741a06536
11069B03475E1681a63143P176P6843H9464g8926C07959E5970h1297p3558B90092
11057b38906C1823J62141E7961N2556K8268J17908J07256B3999K36371q3132O6067
11046B43305P4475K1307A21662J47800J96485j69871R0499J41103D9100K70153
11036C19253K28117M2861f3844A75887J38667M4459l7072J0579A58916M8865K62433
11025D70214k04004Q3241J9148M7871j46633J52979j23164a38663H38382C66715
11014E66336q4439j84548A01600K73895j33982l6102R0667p7391I4737j7847O0555
$$ y = [132270, 26487, 383912, 162211, 261657, -65822, 497126, 29248, 240211, -142228, -119650, 164799, -304650, 245696, 276600, 15577, 292905, 73655, -268702, 6741, -106536, 203475, 51681, -163143, -155967, -79124, 89464, -78926, 307959, 55970, -81297, -154855, 290092, -238906, 31823, 193964, 57961, 110517, 138785, 256693, 363949, 23999, 260370, 177238, 243305, 317780, 339087, 121662, 269462, 465947, 296076, 386575, 527678, 49100, 319253, 547370, 590231, -63844, 175887, 314554, 359013, 321941, 332520, 158916, 207781, 470214, 266210, 349451, 368599, 416470, 269837, 422816, 299652, -138663, 838382, 366715, 566336, 481897, 297349, 101600, 375495, 241513, 205411, 296078, 218687, 94737, 76890, 137445]
11003A37445N1525O2689K76804j57600j34012K42756j21659j32970J20019m0100
10993C04897G0005K91237j13696H291J47270D4907J61059K35275A13120K72369
10983C85489k413m9662o1407K86847J00144j25886Q418k58207P97894D60048j41333
10972C18715M26315m5280J36N43001j36595L88909k71251K85853j88742j34225
10962A186836Q0830m84593k17468O821J297J15449j10844L23318j74951l21319
10952D05376n2485J18423L64785k42967J37525k08215n9884A32763Q4087l5205
10942A81645f8350B27693A7371J37560J15572e3336J3142A29758E2497L9881N1962
10931A44340O1931h2836n834A01382L6457k8360A3468L397a02928A4811L05547
$$ y = [137445, 188970, 251659, 528463, 370863, 236851, 479607, 357948, 224978, 344997, 304897, 70005, 361242, 247546, 8291, 155561, 44907, 205966, 441241, 113120, 385489, 383076, 333414, 272007, 558854, 658998, 533112, 541530, 283323, 1081217, 460048, 318715, 745030, 699750, 699886, 1242887, 1106292, 1495201, 1223950, 1509803, 1321061, 1186836, 1267666, 783073, 565605, 572426, 573723, 689172, 578328, 901646, 726695, 405376, 352891, 471314, 836099, 593132, 730657, 522442, 462558, 132763, 216850, 181645, -68350, 227693, 17371, 154931, 270503, -53336, -40194, 129758, 52497, 92378, 144340, 206271, -82836, -88670, 101382, 137839, 109479, 13468, 16865, -102928, 14811, 320358]
10920C20358b80558J02253n8363B09325f6873A18357a1105E9167b14453D7829
10909I0552J52885J80348c44673H1834a3887B52121a30193A82415a96385C22563
10898a16525d6842B15724j02854a80448G8581M3448C6188J17676O9416e861m3120
10887d8981B7697b10301I5348b02063j87656Q3698R6216h3234j7174a8036I4988
10875a31111b0436B19008a24900A14585b40137i0011p1140g2071I9366N1689o9929
10864H1126a03905o9616H7988M8112b16616B14036b95493A77576a01332r918M8547
10853f2703B2255K28234a58088k7849C59848g2867a1918B49773A16523O6797g151
10841i6319l8968A47882b04914M9619A51854j040R8998d4139a7441F9464i2570
$$ y = [320358, -280558, -178305, -236668, 209325, -66873, 118357, -11105, 59167, -214453, 47829, 90552, 243437, 423785, -344673, 81834, -13887, 252121, -130193, 182415, -196385, 322563, -116525, -46842, 215724, 112870, -180448, 78581, 122029, 36188, 153864, 223280, -5861, -48981, 27697, -210301, 95348, -202063, -389719, -306021, -209805, -83234, -100408, -18036, 94988, -131111, -20436, 219008, -124900, 114585, -240137, -90011, -161151, -72071, 99366, 151055, 81126, -103905, -173521, 87988, 136100, -216616, 214036, -295493, 177576, -101332, -111250, -62703, 22255, 250489, -158088, -185937, 359848, -72867, -11918, 249773, 116523, 183320, -7151, -96319, -135287, 147882, -204914, -155295, 151854, 150814, 249812, -44139, -17441, 69464, -92570]
10829B54381g4792B20360a13503B1148h4883k03675A39542a01888J6353C7433
10818A07916a47505p4970c7936i956l6207B01096r6798b04332f9106I228a98234
10806d5157J7068o4234o808k3167D9225A0984R8150L7048D8713e1314A21655K58296
10794C79951E0577Q94P659a18399G351a05150l236b0365j25665F5988J33833b4362
10781c14365G1708j4732J56088H9910a41903J0322k87048a38871F8652a2815p7337
10770i0152o5245C3499i7749G3124J9461B5070J02837a6108l60669a34356j82910
10759c17266J43831B38193C2701a8011j38610j3803A07926c76792a04682L4391
10749g0291j8958r0285o0774A18049J5653a61432I7232l6398J69624F5879i5362
$$ y = [254381, -74792, 220360, -113503, 21148, -84883, -288558, 139542, -101888, -85535, 37433, 107916, -147505, -222475, -37936, -9956, -46163, 201096, 104298, -204332, -69106, 9228, -198234, -45157, -28089, -92323, -99131, -122298, 49225, 10984, 109134, 146182, 48713, -51314, 121655, 379951, 50577, 51471, 59130, -118399, 7351, -105150, -108386, -20365, -146030, 65988, 199821, -24362, -314365, 71708, 56976, 213064, 89910, -141903, -131581, -418629, -138871, 68652, -12815, -90152, -155397, 33499, -97749, 73124, 92585, 25070, 127907, -16108, -376777, -134356, -317266, -173435, 238193, 32701, -18011, -156621, -170424, 107926, -376792, -104682, -70291, -89249, -179534, -240308, 118049, 133702, -161432, 97232, 60834, 230458, 65879, -95362]
10737A42630o9434J2629d2107j731l58806a98832g0366j9781r2951f5587k15351
10726b80938k4583J13136e7186J0438B572a78803C6794a11197c9589A03402c15892
10714a01029C8575e8261B23673L2051a90134k76940F4189O0929b49767K9641i5499
10702H5717b99416A75703a12870l2311j93276a55519B68814q2708c78026G1261
10691A52411J35631D8870C455J21886f4793l7594n4731K4941b0192B92495c69394
10679B7612i7355j01362A14831n5431b06609H1716J7261b877j44187G4811c05834
10667A46596O5726j04604b41691A623a14257M3551k6321K8097I7418l6425f3103
10655e1966C8778a68928A19862g1193J5988C60877A47178A3522M7187a40810n6304
$$ y = [142630, 73196, 85825, -42107, -43838, -402644, -198832, -70366, -90147, -183098, -65587, -280938, -305521, -192385, -57186, -46748, 2572, -178803, 36794, -111197, -39589, 103402, -315892, -101029, 38575, -58261, 223673, 255724, -190134, -467074, 64189, 125118, -249767, -220126, -95499, 85717, -299416, 175703, -112870, -145181, -338457, -155519, 268814, 186106, -378026, 71261, 152411, 288042, 48870, 3455, 125341, -64793, -102387, -157118, -132177, -20192, 292495, -369394, 27612, -97355, -198717, 114831, 59400, -206609, 81716, 98977, -2877, -147064, 74811, -305834, 146596, 212322, 107718, -241691, 1623, -114257, -70706, -97027, -68930, 97418, 60993, -63103, -51966, 38778, -168928, 119862, -71193, -55205, 360877, 147178, 13522, 60709, -140810, -197114]
10644a97114A59405a9695j64496D6727a21454l47900G4182a71103C1364J81966
10634B13330b73512h4891A24128c98874A8660a91756K1662C2085a92096A1432
10623a01970A80516D6838n753c2777j08766I3779b12860K2859p8388J09667A50330
10611A19675b04943p6589C15636I8153j6614b00052h041L91m58579J44335J26983
10600a94911G0753k0470c92254B815a8485n5320b5953j40132f8475k81981B05014
10588a45886n1296i2379c4046C6427J06014b05550D1513d557D0994a79895k6532
10577b06427B7892b23737a04542j17478P6001e0896a0821q6897a1767A68824b83259
10565C036e5295B67261A02622g2302j5411o0605k86889B60332b22899N0112A61763
$$ y = [-197114, 159405, -19695, -184191, 46727, -121454, -469354, 74182, -171103, 31364, 213330, -273512, -84891, 124128, -398874, 18660, -191756, -170094, 32085, -192096, 11432, -101970, 180516, 46838, 41085, -32777, -141543, 93779, -212860, -190001, -268389, -158722, 150330, 119675, -204943, -281532, 315636, 98153, 81539, -200052, -8041, -7650, -466229, -321894, -194911, 70753, 50283, -392254, 2815, -18485, -73805, -25953, -166085, -68475, -350456, 205014, -145886, -197182, -92379, -34046, 36427, 142441, -205550, 41513, -4557, 40994, -179895, -206427, 27892, -223737, -104542, -222020, -146019, -50896, -10821, -97718, -11767, 168824, -283259, 3036, -55295, 267261, 102622, -72302, -87713, -148318, -435207, 260332, -222899, -172787, 161763]
10553A1658a53339G6715C2097b41688I3981O979h5272G843L19667I6379a67556
10541i9858A07120E0402a44914k3020N6143E8830e3277A39389e083n2402k41256
10530b98741A66627b09432g1098a4876d184C03110a35207A5220a72234b0510l78047
10519c98557A19002M463P8551p0657D3328J30372A6385b03764m5494O7286k3062
10508b05034j82894B20502a22763E7150a08541B43228d2029j59202F3826J16625
10498A80451b05661g238A02779b20271H1708M8457b39948g4828L4320G7163a93963
10486G5861b32000e7782H0097b58143i0967o1784j00177M9960g8340A54836k0313
10475A34523D9591a57561K3852o3641m6527G3712b84120B58305c34716F5023a93223
$$ y = [11658, -153339, 76715, 32097, -241688, 93981, 100960, -85272, 7843, 327510, 96379, -167556, -99858, 107120, 50402, -144914, -167934, -111791, 58830, -53277, 139389, -5083, -57485, -298741, 166627, -209432, -71098, -14876, -4184, 303110, -135207, 15220, -172234, -20510, -398557, 119002, 123465, 202016, 131359, 43328, 173700, 16385, -203764, -249258, -181972, -205034, -387928, 220502, -122763, 57150, -108541, 243228, -42029, -201231, 63826, 180451, -205661, -7238, 102779, -220271, 81708, 130165, -239948, -74828, -40508, 77163, -193963, 75861, -232000, -57782, 80097, -258143, -90967, -152751, -252928, -202968, -78340, 154836, 134523, 49591, -157561, -133709, -197350, -243877, 73712, -284120, 258305, -334716, 65023, -193223]
10463H1196H674a2488A01058a17033B1004b23436A187a12656G2406e5255h103
10451G9309c51990A10213e9596b4074j70419A86306g8589A14834L3197a33745
10440d25633D852J73988b17461k04115a14253A25591E7163B2937i735B05731g0303
10428B3393J59390F4700O730i0873C57999e6965D0668i163l02418a15008A56696
10416a58928g9420D87083B00397r9726d6562A3617d9431l4016A39200b55665D1030
10404b11238j06219e4679A20465f4588n8928C88779A41586F0393e5453c061j87573
10393a90634e8681l01427A07676K66030D4153K61962d17087B66334D1253b20874
10382C51017j48617d32914a59663B8680b55757c9783A303e118j12746k6288G9468
$$ y = [81196, 8674, -12488, 101058, -117033, 21004, -223436, 1187, -112656, 72406, -55255, -8103, 79309, -351990, 110213, -59596, -24074, -194493, 186306, -78589, 114834, 148031, -133745, -425633, 4852, 178840, -217461, -421576, -114253, 125591, 57163, 22937, -9735, 205731, -70303, 23393, 182783, 64700, 71430, -90873, 357999, -56965, 40668, -9163, -311581, -115008, 156696, -158928, -79420, 487083, 200397, 100671, -46562, 13617, -49431, -83447, 139200, -255665, 41030, -211238, -317457, -54679, 120465, -64588, -123516, 388779, 141586, 60393, -55453, -3061, -190634, -58681, -360108, 107676, 373706, 44153, 306115, -417087, 266334, 41253, -220874, 351017, 202400, -432914, -159663, 28680, -255757, -39783, 1303, -5118, -117864, -144152, 79468]
10370H1337k7684L02312i8730G9698a33940e0912A78608m7548J03468G2331K95350
10359C67681d6766B57922H3585i3966A96057N3122c1753A57870K46683i51B46829
10347C95112N2084j83784j9626k2010K75386a87397Q8522c3739A54917P6791A11948
10335D4534b0675l06854H7503J09735b9057A66487i3950A18769F89J24493l3294
10324I1888J18779C941K9614a6474j87830A57481A3180d6169F1127o063a92892
10312A64885i516k22911B72926k1626A12884F189f6273A21369a95890D32K72029
10301B72461k5222e5694j89606m0596c1073m1683B49151d6411C2440b2953k01059
10290b24012j996p1128J21158g5809A46404a31804B4571d6604k23533f104B33746
$$ y = [81337, 53653, 355965, -98730, 79698, -133940, -50912, 178608, 131060, 234528, 72331, 367681, -46766, 257922, 83585, -93966, 196057, 249179, -31753, 157870, 404553, -951, 246829, 395112, 447196, 263412, 243786, 221776, 497162, -187397, -98875, -33739, 154917, 231708, 111948, 44534, -20675, -327529, 87503, 197238, -29057, 166487, -93950, 118769, 689, 125182, 91888, 210667, 3941, 33555, -16474, -204304, 157481, 13180, -46169, 61127, 55064, -192892, 164885, -9516, -232427, 272926, 251300, 112884, 6189, -66273, 121369, -195890, 432, 272461, 247239, -55694, -245300, -285896, -31073, -72756, 249151, -46411, 32440, -22953, -224012, -226008, -297136, -175978, -75809, 146404, -131804, 24571, -46604, -270137, -6104, 233746]
10278e997A22506k0145C8340e1459k97739O1678A26780d2690A02319a69765f1066
10266b87345D7263K9683M9570b07308B38423E9092A8300g1068j2265j80344J21023
10255a42654k2712O85I1385G966J9634K04975C8588K26503A00553b0638A21230
10243f0069m925D4763I989b63008L58F8890N5150J23261a06687l02994H6251J20733
10231B06984F8462e38653G6946L41223B9039a43198d1914C1917c12993o8089J66441
10220b14641A94341C7223d70864a8047j81303r4519B69356j028a71899A28475
10209h9183m2028n6149O9623D0906J4132O0492c14229j3190A7338K22576b88846
10197b1808H258h2159l2539c0064o6279m7464j03844j4687G6018b28699a8531
$$ y = [-5997, 122506, 102361, 38340, -51459, -349198, -287520, 126780, -42690, 102319, -169765, -61066, -287345, 47263, 76946, 126516, -207308, 238423, 59092, 18300, -71068, -83333, -263677, -142654, -165366, -164681, 91385, 7966, 27600, 232575, 38588, 265091, 100553, -20638, 121230, -60069, -64994, 44763, 9989, -263008, -262650, 68890, 124040, 247301, -106687, -409681, 86251, 206984, 68462, -538653, 76946, 418169, 29039, -143198, -41914, 31917, -312993, -381082, -214641, 194341, 37223, -470864, -18047, -199350, -293869, 269356, 268328, -171899, 128475, -89183, -131211, -187360, -117737, 40906, 55038, 115530, -314229, -327419, 17338, 239914, -288846, -21808, 8258, -82159, -114698, -30064, -96343, -143807, -247651, -262338, 76018, -228699, -18531]
10185e27182f258j04660N111C0891a13946J8466c022E2327b67718k44642d0619
10173d4683j72986P191b4522B05370g0452r7391b140k7161F4316h3606m9037M0906
10161i1737E9373i9633F9555a02857A33734D466e6672A0457M5996i7540g327j92742
10149b00069i4588j02753j9937I9759a74179A62421c35256H3857c77504h5448
10138H0594c19463a506o3543j41639j42600g6934p5260H7995h6462c7827A82686
10126B93975i6949A185J27941b2173A09975J15636b0839k91715a1820A46106c90130
10114C96719c84320h8764k60226I5141b74474a6182A05603a12426j09835A3015
10103b13713F7659a0450A41774i863m9383l1518c4055m5395k26616J16091j40746
$$ y = [-527182, -6258, -110918, -105807, 30891, -113946, -95480, -3022, 52327, -267718, -512360, -40619, -44683, -217669, -210478, -24522, 205370, -70452, -167843, -2140, -29301, 64316, -83606, -132643, -91737, 59373, -99633, 69555, -102857, 133734, 4466, -56672, 10457, 56453, -97540, -7327, -200069, -94588, -197341, -217278, 99759, -174179, 162421, -335256, 83857, -377504, -85448, 80594, -319463, -1506, -65049, -206688, -349288, -76934, -152194, 87995, -86462, -37827, 182686, 293975, -96949, 1185, 129126, -22173, 109975, 225611, -20839, -312554, -11820, 146106, -390130, 396719, -384320, -88764, -348990, 95141, -274474, -16182, 105603, -112426, -222261, 13015, -213713, 67659, -10450, 141774, -9863, -59246, -90764, -34055, -79450, -306066, -189975, -330721]
10092c30721H052K30637p6340a26479j43615A054J24633D3280O85j8984a3743
10080H9964a60746I1686b22397I9838a41523p0393C72787b28264b0107j18286
10070a38393A63265A0579h1937b91o8411j31070l1648c3959B63222A13331a59335
10058a93318J7142P6812l49915i6304r5088B4552R4335b70101N0188P4536i898
10046b92709a4487H0917a55491F9143O3844b92006A75661F9452a89436h8846H0436
10034a92088O7964K4040M6777b701m2065l09855a17970C71806b38378A75827g8073
10022A65564c48053A38239b87418j32974d3091j23389O1921C325J76444Q1191
10012B60960b9366A10710J83194M9329f5521q8355j700K7854k8016P5640B43534
$$ y = [-330721, 8052, 238689, 162349, -126479, -270094, 1054, 125687, 43280, 43965, 24981, -13743, 89964, -160746, 91686, -222397, 99838, -141523, -211916, 372787, -228264, -20107, -138393, 163265, 10579, -81937, -291, -68702, -199772, -231420, -33959, 263222, 113331, -159335, -193318, -176176, -99364, -449279, -96304, -191392, 24552, 118887, -270101, -219913, -145377, -9898, -292709, -14487, 80917, -155491, 69143, 132987, -292006, 175661, 69452, -189436, -88846, 80436, -192088, -124124, -100084, -53307, -2701, -44766, -354621, -117970, 371806, -238378, 175827, -78073, 165564, -348053, 138239, -287418, -420392, -43091, -166480, -104559, 3325, 179769, 260960, -29366, 110710, 293904, 343233, -65521, -153876, -155576, -127722, -155738, -80098, 243534]
10000b13097A17359j5623a35455o8800D8742h3497j05641M3082b2072j10974c0586
9988a12804G938a82413d3204B41719c1809j44655P3801c6924E9036a77623b6095
9976g291r9394f147l82507J62151h4032R532l84110B14270i8685C2888c48259
9964a93131f1144A54026d7168A25595k2083R6768q4893N7988L1062p5122a47439
9952b37874R8641C13954h7641j50074A63476c69530f3725j77806P8944G3709c40518
9940h1352c5135B12857a31102m83548a84389A03942a32405N2227C04479b4018
9929g7069H3955c58995A11821d7125C29125G2943e4424l74012B8453j1771a39585
9917b12570o8943a7555B19195b56575i8440c5769A58787g4594j24814j49804C66984
$$ y = [-213097, 117359, 101736, -135455, -204255, 48742, -83497, -189138, -146056, -22072, -133046, -30586, -112804, 7938, -182413, -43204, 241719, -31809, -176464, -102663, -36924, 59036, -177623, -26095, -7291, -106685, -6147, -388654, -226503, -84032, -74500, -458610, 214270, -98685, 32888, -348259, -193131, -61144, 154026, -47168, 125595, 103512, 200280, 115387, 173375, 204437, 129315, -147439, -237874, -139233, 313954, -87641, -237715, 163476, -369530, -63725, -241531, -162587, 73709, -340518, -81352, -35135, 212857, -131102, -614650, -184389, 103942, -132405, -80178, 304479, -24018, -77069, 83955, -358995, 111821, -47125, 329125, 72943, -54424, -428436, 28453, 16682, -139585, -212570, -281513, -17555, 219195, -256575, -98440, -35769, 158787, -74594, -199408, -349212, 366984]
9905B22466l9893N7899F8479J06859B8588K0876h3188F3673k5063f6008p379b3394
9892a14993p9132j03168Q8030B11892a67444C68777f6513j20182E0925b9785R098
9881b0687o1602B1664a97647G1217J30986I9930R8586K07615b62027A75893a03380
9869A61590a65314D4914J6423a02844E9523b08516d3553B7505a18757J5724B92263
9857D8889a03354A6584c9854l39117B6910a8236j87497A0171a56540B86547c43363
9845a39612d3917k918m9880G0897A9948b1049l47032J53652B36299e6880n3732
9834a10612A05130a06084B172c10703a0521F6027j3261J01616D8007b58480A97172
9822i8050m622F6571c1189E8253a23941d2200m3957a6454n179r5707K4821E1163
$$ y = [222466, 182573, 240472, 68479, 175338, 28588, 49464, -83188, 63673, 38610, -66008, -73387, -23394, -114993, -194125, -297293, -209263, 211892, -167444, 368777, -66513, -186695, 50925, -29785, -20687, -82289, 21664, -197647, 71217, 202203, 99930, 198516, 406131, -262027, 175893, -103380, 161590, -165314, 44914, 61337, -102844, 59523, -208516, -43553, 27505, -118757, -103033, 292263, 48889, -103354, 16584, -39854, -378971, 26910, -18236, -205733, 10171, -156540, 286547, -343363, -139612, -43917, -46835, -96715, 70897, 19948, -21049, -368081, -214429, 236299, -56880, -110612, 105130, -106084, 2172, -310703, -10521, 66027, 52766, 154382, 48007, -258480, 197172, -98050, -102672, 66571, -31189, 58253, -123941, -42200, -86157, -16454, -21633, -117340, -92519, 51163]
9809d77975a97688Q6795d6399A13423d09726J59748n6208a13971d2261H7344I06
9797c4970E3133A0681J69181a58830k75860b5126M912L93E6217Q593a25769c5519
9784E8030b19400B8947K232d0540r5722d4919C4542j4509J3550n103K43027B9627
9771a94456B17751a60877e1123d266B08350d8845B22106o0482f6957M579j82610
9760b44988N3162m0597O5842A45260a35763I6442a13963k76277J69861A99431
9749G5306b3847r5942B55415a30297M5046j24087j89758f2830A01027b65128g5607
9737c66098f6422C4208b39631I8872e5338j85577i9228q0927Q3746A30213b93536
9725B38336J5612o7997H4994J17373M8886d03288h5357K5543j10498k26825E0204
$$ y = [-477975, -197688, -110893, -46399, 113423, -409726, -249978, -306186, -113971, -42261, 87344, 906, -34970, 53133, 10681, 179862, -158830, -434690, -25126, -20214, -19821, 56217, 64810, -125769, -35519, 58030, -219400, 28947, 31179, -40540, -136262, -44919, 34542, 20033, 33583, 28480, 271507, 29627, -194456, 217751, -160877, -51123, -4266, 208350, -48845, 222106, 161624, -66957, -62378, -244988, -191826, -232423, -166581, 145260, -135763, 96442, -113963, -390240, -220379, 199431, 75306, -23847, -119789, 255415, -130297, -85251, -209338, -399096, -62830, 101027, -265128, -75607, -366098, -66422, 34208, -239631, 98872, -55338, -240915, -99228, -180155, -96409, 130213, -293536, 238336, 253948, 185951, 84994, 202367, 251253, -403288, -85357, -59814, -170312, -397137, 50204]
9713A0520J77091b43173M6239F760J37204G00b16033H9470b73597C0373b151j66381
9701a68532A2658J69022c6256G0725b97144a12346K9124H2775M2875b7976k12568
9690b40544J07582H7823a71943G2638Q2130B1275a25707e3541l50972e0678C64638
9678A83779q7965h045j85331g8335j17151G4448a86870D6952c86159C8388R4531
9667A32919a62735e4944J8974j97068C5389b92437M2932O7943r3013A10152E3604
9655A04483a40441H0407J6048J33456a05497k11719B198M2960h0568m1100c062
9643B85701A38455a20199j15651a8292o6839A993a84120k30092g0505n7371c7766
9631B68030b02980G34f1580j22641k3407j74432l9516H4345k049C3199a23534
$$ y = [10520, 187611, -243173, -196934, 6760, 143964, 700, -216033, 89470, -273597, 30373, -2151, -168532, 12658, 181680, -36256, 70725, -297144, -112346, -83222, 82775, 125650, -27976, -240544, -132962, 87823, -171943, 72638, 154768, 21275, -125707, -53541, -404513, -50678, 364638, 183779, 95814, -8045, -193376, -78335, -195486, 74448, -186870, 46952, -386159, 38388, 132919, -162735, -54944, -35970, -233038, 35389, -292437, -249505, -181562, -274575, 110152, 53604, 104483, -140441, 80407, 96455, 229911, -105497, -317216, 2198, 45158, -80568, -121668, -3062, 285701, 138455, -120199, -235850, -18292, -85131, 1993, -184120, -414212, -70505, -127876, -37766, 268030, -202980, 734, -61580, -184221, -207628, -382060, -421576, 84345, 82296, 33199, -123534]
9619b87946f7297K4142k6339B10056k7081a60023k07320C35354E0694b02866q745
9608b11611a01125a9795j47451M6085B21632d9879k4165H5644a52582J1541M4387
9597i6654E5838j8378M864O3611Q5665a1443k45049j91274d4520F6400a41620
9585a70337O4658M0688j68817g3092A02013B7017N9155J20112A8863c46758J19030
9574b27728P5273g273j9410A43113c84311A36870c11260H9047h182o0291G4634
9562a69613g0400j25999g3272l23299a42984k35370E103J00811a00194c855j74097
9551a77952h460E00110A03144Q880J28K08706h3727D7901b85905e5610a6934n9390
9539g6324l63294A31940b14154d7030A3753b35593F5708k3833A4264d0650k30024
$$ y = [-287946, -67297, -43155, -69494, 210056, 182975, -160023, -367343, 335354, 50694, -202866, -211611, -101125, -19795, -167246, -121161, 221632, -49879, -74044, 85644, -152582, -141041, -96654, 55838, 37460, 42324, 105935, 191600, -11443, -256492, -447766, -44520, 66400, -141620, -170337, -105679, -64991, -233808, -73092, 102013, 27017, 86172, 206284, 18863, -346758, -227728, -152455, -7273, -26683, 143113, -384311, 136870, -311260, 89047, -8182, -68473, 74634, -169613, -70400, -196399, -73272, -396571, -142984, -378354, 5103, 105914, -100194, -3855, -177952, -8460, 500110, 103144, 112024, 112152, 320858, -83727, 47901, -285905, -55610, -16934, -76324, -439618, 131940, -214154, -47030, 13753, -235593, 65708, 41875, 14264, -40650, -270674]
9528b70674H3903j0100M0919a58517g0860k18168F7287d3397j28372F0731e5069
9516a07089I4210a13625Q149k58054a57017D5229a33793G7773b59298A32313d2350
9504B6717c09923L4045D48019a47374e1789k35810m4697E4708b67799j1519F4883
9492b74824C17956A33006K037D6410J33520c48969J47197a8227k87303e6719j60242
9481b16961q1695Q3015g6315m1114A09206a10663B15618Q646I4024J02254B5587
9469f1537n9650A94520e2523j32879D6156I169J58606O7314A01216b96165Q8200
9458b07965G7586c983n9647n4166k9527k4204C9624Q8143E0790c15694k49549
9447e65243a56897j92379a9262j2088D6111J13263g8304D5498h6083H2893K8383
$$ y = [-270674, 83903, 73803, 114722, -158517, -70860, -289028, 67287, -43397, -171769, 60731, -55069, -107089, 94210, -113625, -105476, -363530, -157017, 45229, -133793, 77773, -259298, 132313, -42350, 26717, -309923, -275878, 448019, -147374, -51789, -287599, -332296, 54708, -267799, -279318, 64883, -274824, 317956, 133006, 135043, 46410, 179930, -348969, -201772, -18227, -305530, -56719, -216961, -298656, -215641, -76315, -117429, 109206, -110663, 215618, 224264, 94024, 196278, 25587, -61537, -121187, 194520, -52523, -185402, 46156, 9169, 167775, 235089, 101216, -296165, -207965, 77586, -3983, -63630, -117796, -147323, -171527, 39624, 127767, 50790, -315694, -565243, -156897, -349276, -19262, -31350, 46111, 159374, -78304, 45498, -86083, 82893, 111276]
9436A11276Q98b24756g6927p6641p8979n2894A54169K7931a37944m4785j87122
9425c69851J60871k41202a57140A45968c94468A10425a19356A10490a9419B79677
9414i8986k06500K0603H8639b00620p9663d0902q6114B1879J7553b46806L0680
9403b16126n2558A09136B508i3968c6176A13073a51499a9497m778D01666g9135
9391b41967A17088i9258H3919a44777k436C6499O7953B6895g8111A76979J8914
9380A95893h6348q5443g0349c5096j97309Q0332R502o277j9333A07217f1009J0346
9368e0663B1472g0648H1877g577D21304a7375l02812f2131E0187G382b40533A76364
9355a12858k93559a03123R231m78J7572j66097k0917a29798q5311L8222B11072
$$ y = [111276, 112174, -224756, -76927, -153568, -232547, -285441, 154169, 182100, -137944, -182729, -369851, -208980, -450182, -157140, 145968, -394468, 110425, -119356, 110490, -19419, 279677, -98986, -305486, -284883, 88639, -200620, -280283, -40902, -127016, 21879, 39432, -246806, -216126, -268684, 109136, 2508, -93968, -36176, 113073, -151499, -19497, -24275, 401666, -79135, -241967, 117088, -99258, 83919, -144777, -147213, 36499, 104452, 26895, -78111, 176979, 195893, -86348, -171791, -70349, -35096, -232405, -152073, -142571, -148848, -168181, 107217, -61009, -50663, 21472, -70648, 81877, -7577, 421304, -17375, -320187, -62131, 50187, 7382, -240533, 176364, -112858, -406417, -103123, -93892, -94370, -76798, -242895, -263812, -129798, -215109, -176887, 211072]
9343A04031B4925b34340P7963d8358k4601K9042E6242d4144n9383j3795B29944
9331c21722O8029G185b8837r6257B5688b36686a1041A11183j8838b09175k3257
9320b32432K1625d3466q5069B99320a26687M6927J7322r5084B3503a6227l75090
9309c91317a53145k58705Q7958a8000j16371K6072D03451a42012F4663D292d7117
9297A00172a18077m9334N8355k9821B74923q0433a28381C8197P3004C4465b37549
9285C5706a30762K2327j72326J07902I2874k3339k0680a04165j18556F3371b56783
9273A42669a7508j11779p4710E4305a12637k36133A36710P9197b40009J13819
9263a26190I4769N1200l5740a79489p3437B62367a51910M5878k830A74555e4868
$$ y = [104031, 24925, -234340, -156377, -48358, -72959, -43917, 56242, -44144, -103527, -117322, 229944, -321722, -253693, 7185, -28837, -125094, 25688, -236686, -11041, 111183, 92345, -209175, -232432, -210807, -43466, -128535, 299320, -126687, -79760, -62438, -157522, 23503, -16227, -391317, -153145, -411850, -323892, -18000, -134371, -108299, 403451, -142012, 64663, 4292, -47117, 100172, -118077, -167411, -109056, -138877, 274923, 194490, -128381, 38197, 111201, 34465, -237549, 35706, -130762, -108435, -280761, -172859, 92874, 69535, 48855, -104165, -222721, 63371, -256783, 142669, -17508, -129287, -203997, 54305, -112637, -348770, 136710, 215907, -240009, -126190, 94769, 145969, 110229, -179489, -252926, 262367, -151910, -106032, -108862, 174555, -54868]
9251a54538b7815j2694m37109B85432C9951K44976a35610A4584J07730c32599
9240g6942F2814a54690j56183B97875a26783B4523J60676f6836j51144d3222j61295
9229b04517j49292a19351j91992B22920b05784I8802D8094q950d738H6110d6933
9217a35443N6953B65055d5862j90637A9356a05221K3613n7539L5805b1802J047
9206b0755k1722F8139J18397a8686j7170I6990K3138L34821i613I6985a98749
9194b45642b0113j35608A7583b87339A16500A4047K15442D7522J39807K6685e2685
9182c05126B71158c0723J3834D8527a29656a5667F817J97113E9791a68051a2051
9170a80072h5309j13170j18900a03379M3317j98680A2237a69948c5717A69604
$$ y = [-154538, -27815, -40509, -477618, 285432, 39951, 284927, -135610, 14584, 122314, -332599, -76942, 62814, -154690, -310873, 297875, -126783, 24523, 185199, -66836, -217980, -43222, -204517, -353809, -119351, -311343, 222920, -205784, 98802, 48094, 39144, -4738, 86110, -46933, -135443, -78490, 265055, -45862, -236499, 19356, -105221, -81608, -139147, -103342, -21802, -20755, -42477, 68139, 186536, -18686, -35856, 96990, 120128, 454949, -9613, 96985, -198749, -245642, -20113, -155721, 17583, -287339, 116500, 14047, 229489, 47522, 187329, 214014, -52685, -305126, 271158, -30723, -16889, 48527, -129656, -15667, 6817, 203930, 59791, -168051, -12051, -180072, -85309, -198479, -317379, -103379, -60062, -258742, 12237, -169948, -35717, 169604]
9159i674H9034J18848c73508J36055A96084a90443K4935L4751M8206l8452e0304
9147b82386A27560C3068J85282o8664A4883a8523D01865g5821j80088H6659c13061
9135a99559l8912A52999M626F1876a14556k6367j34547h2300c0584C3738M4262
9124G8000J06096q1282b91889J30503e7309j94505A63600k2393f271C9301A2236
9112a62826C4447e133k68875a25735j59710b5570k1379j14967O2876j50932P4519
9101a75453D3717O7987b81883B28924e3027k19119A89068B5738N0100a58658A02681
9089c96844A43057b33057h1462G0927B2072G860a18399M1604n9012b4077p8725
9078a02802A66484C3539J26036b5786A70324c91687J88194C6446K44929b02373
$$ y = [-9674, 89034, 207882, -373508, -237453, 196084, -190443, -165508, -130757, -82551, -121003, -50304, -282386, 127560, 33068, 218350, 149686, 14883, -18523, 401865, -75821, -255909, 86659, -313061, -199559, -238471, 152999, 157625, 61876, -114556, -140923, -275470, -82300, -30584, 33738, 78000, 184096, 102814, -291889, -161386, -57309, -251814, 163600, 141207, -6271, 39301, 12236, -162826, 34447, -5133, -274008, -125735, -285445, -25570, -46949, -161916, -99040, -249972, -175453, 43717, 111704, -281883, 228924, -53027, -272146, 189068, 25738, 75838, -158658, 102681, -396844, 143057, -233057, -81462, 70927, 22072, 7860, -118399, -76795, -135807, -24077, -102802, 166484, 33539, 159575, -25786, 170324, -391687, -203493, 36446, 281375, -202373]
9067c33759A81747b86172I6272c11242C4435J16235e9827E4441f8339k80306K8024
9056c20621d5487F3135k9255K86222F8361N6668o0018b8680j86238M3803F6926
9044G0255K64362A45038b23045j05853J1878B95059H5654e6848j32932C04266
9033b35514b2558o4038j21511c9540e831j2002C08223F9664a10691M4471E6269
9021A17096D7361J63367A02639d00804R7011d4521G1792c5010m2988l4517o1945
9010a74460j76322i4860B51844c2488a0862l32676a59898I5579b68582A37155
8999A24896a06506o3583H6756b51926J4862a10456A5558h4248B1673a1974G6323
8987a6839C54041B6653a11717C3256j0893a950l46232a34897C1832L689a51991
$$ y = [-333759, 181747, -286172, 96272, -311242, 34435, 150670, -59827, 54441, -68339, -348645, -320621, -45487, 63135, 33880, 320102, 68361, 125029, 65011, -28680, -214918, -171115, 66926, 70255, 334617, 145038, -223045, -328898, -317020, 295059, 85654, -56848, -189780, 304266, -235514, -22558, -86596, -208107, -39540, -5831, -17833, 308223, 69664, -110691, -66220, 56269, 117096, 47361, 210728, 102639, -400804, -303793, -44521, 71792, -35010, -77998, -112515, -174460, -350782, -94860, 251844, -32488, -10862, -343538, -159898, 95579, -268582, 137155, 124896, -106506, -170089, 86756, -251926, -237064, -110456, 15558, -84248, 21673, -11974, 76323, -16839, 354041, 26653, -111717, 33256, 22363, -1950, -348182, -134897, 31832, 35521, -151991]
8975D82725c23052M5999b1587k74919j15380e7587k76323h1505A16551f913k28994
8964b35907D1066J2098b63408J13170c5504J3858k80789a34073B07437a58729
8953b0498C5R7777b03350K8861N9728G9907K68766c52313a4600k76725c5643m41287
8941d76930A68273M6821p4650K26723g3913B5123a53104A01921b09872P1113e7208
8929C13367H5459F45a7289l3491A24451b61443d2101P03o9902d5505C19298L55381
8917F74679j2784B19823l717F3951K0148R3447e9034a7868o2473m5453m2207F8643
8904E0130b8057l27224B35813f7018G6052k6730e9777A3391O4704A5560b80893
8892a36588A40151h5766k22360L4717d6364p0254q6494B68207b00318C07164f3782
$$ y = [482725, -323052, -277053, -21587, -296506, -411886, -57587, -333910, -81505, 116551, -6913, -235907, 41066, 53164, -263408, -150238, -35504, -21646, -302435, -134073, 207437, -158729, -20498, 35, 97812, -203350, -174489, -114761, 79907, 348673, -352313, -14600, -291325, -35643, -476930, 168273, 215094, 140444, 367167, -73913, 25123, -153104, 101921, -209872, -138759, -57208, 313367, 85459, 645, -17289, -50780, 124451, -261443, -42101, -41398, -111300, -45505, 319298, 674679, 661895, 219823, 216106, 63951, 84099, 177546, -59034, -17868, -80341, -125794, -168001, 68643, 50130, -28057, -355281, 235813, -67018, 76052, 49322, -59777, 13391, 78095, 15560, -280893, -136588, 140151, -85766, -308126, -273409, -46364, -116618, -203112, 268207, -200318, 307164, -63782]
8880c7344l12881A38201b64904a00078o0533I9633a27842A48228o7204C9417J62009
8869B01426a57011K016e9128k64388i0910m63872I0970c60502b7178M863p983
8858c0298H399J24294E5721J92630A19690a47400P2520B80103a92831Q105A36213
8846B0389e0831I4855b80714a08785A6107K5352c5379k26551J02663B58814a49086
8834c574o1908A465a56195a5441j48303A06196m4499k6887j2104d5814Q855j22862
$$ y = [-37344, -350225, 138201, -264904, -100078, -160611, 99633, -127842, 148228, 81024, 39417, 201426, -157011, -154995, -59128, -323516, -90910, -554782, 90970, -360502, -27178, -22315, -30298, 8399, 132693, 55721, 248351, 119690, -147400, -74880, 280103, -192831, -184726, 136213, 20389, -50831, 94855, -280714, -108785, 16107, 41459, -35379, -261930, -159267, 258814, -149086, -3574, -65482, 1465, -156195, -15441, -163744, 106196, 61697, 34810, 22706, -45814, -36959, -159821]
$$ [...]
##END NTUPLES=NMR SPECTRUM
##END=
