##TITLE=NES1039_872015048_9242671_qEZkBcLU37
##JCAMPDX= 6.0         $$ Bruker NMR JCAMP-DX V2.0
##DATA TYPE= NMR SPECTRUM
##DATA CLASS= NTUPLES
##ORIGIN= BRUKER
##OWNER= Administrator
$$ 1.72 TOPSPIN		Version 2.1
$$ 2015-07-02 06:08:00.258 -0700  Administrator@X
$$ Compression mode = diff/dup
##.OBSERVE FREQUENCY= 400.02188249412
##.OBSERVE NUCLEUS= ^1H
##.ACQUISITION MODE= SIMULTANEOUS (DQD)
##.ACQUISITION SCHEME= undefined
##.AVERAGES= 64
##.DIGITISER RES= 22
##SPECTROMETER/DATA SYSTEM= spect
##.PULSE SEQUENCE= noesygpps1d.comp
##.SOLVENT NAME= COFFEE_meoh
##.SHIFT REFERENCE= INTERNAL, COFFEE_meoh, 1, 14.96323
##AUDIT TRAIL= $$ (NUMBER, WHEN, WHO, WHERE, PROCESS, VERSION, WHAT)
$$ ##TITLE= Audit trail, TOPSPIN		Version 2.1
$$ ##JCAMPDX= 5.01
$$ ##ORIGIN= Bruker BioSpin GmbH
$$ ##OWNER= Administrator
$$ $$ E:\/data/COFFEE/nmr/NES1039_872015048_9242671_qEZkBcLU37/22/pdata/1/auditp.txt
$$ ##AUDIT TRAIL=  $$ (NUMBER, WHEN, WHO, WHERE, PROCESS, VERSION, WHAT)
(   1,<2015-07-02 06:07:55.070 -0700>,<Administrator>,<X>,<go>,<TOPSPIN 2.1>,
      <created by zg
	started at 2015-07-02 05:56:25.602 -0700,
	POWCHK enabled, PULCHK disabled,
       configuration hash MD5:
       21 0F 79 D6 B3 7B B4 F6 88 20 88 DB 03 48 BD 9F
       data hash MD5: 64K
       55 B9 0B 5A 77 9D 5E 15 D3 E2 02 DF 3D 91 14 B7>)
(   2,<2015-07-02 06:07:58.492 -0700>,<Administrator>,<X>,<proc1d>,<TOPSPIN 2.1>,
      <Start of raw data processing
       efp LB = 0.3 FT_mod = 6 PKNL = 1 PHC0 = 0 PHC1 = 0 SI = 128K 
       data hash MD5: 128K
       60 34 AD A5 72 86 C7 7D 16 20 F4 19 1C BB C6 5D>)
(   3,<2015-07-02 06:07:59.352 -0700>,<Administrator>,<X>,<proc1d>,<TOPSPIN 2.1>,
      <pk PHC0 = -85.60547 PHC1 = 0 
       data hash MD5: 128K
       2B B1 74 61 DE 03 B9 9F D1 D0 B8 CF 75 14 86 6E>)
(   4,<2015-07-02 06:07:59.758 -0700>,<Administrator>,<X>,<proc1d>,<TOPSPIN 2.1>,
      <abs ABSG = 1 
       data hash MD5: 128K
       89 3D AE F0 52 85 F6 3C 5F 5D 79 51 42 CD 05 10>)
(   5,<2015-07-02 06:07:59.836 -0700>,<Administrator>,<X>,<proc1d>,<TOPSPIN 2.1>,
      <abs ABSG = 2 
       data hash MD5: 128K
       C5 99 47 78 A0 73 BC 46 81 40 1A ED 4C 11 F5 F0>)
(   6,<2015-07-02 06:07:59.930 -0700>,<Administrator>,<X>,<proc1d>,<TOPSPIN 2.1>,
      <abs ABSG = 3 
       data hash MD5: 128K
       B5 A3 05 DE 75 4B 3D 93 88 91 CB EF D9 92 BD 4A>)
(   7,<2015-07-02 06:08:00.008 -0700>,<Administrator>,<X>,<proc1d>,<TOPSPIN 2.1>,
      <abs ABSG = 4 
       data hash MD5: 128K
       42 20 1D E0 85 1E 16 E9 77 C1 1A 99 96 F4 A2 C4>)
(   8,<2015-07-02 06:08:00.086 -0700>,<Administrator>,<X>,<proc1d>,<TOPSPIN 2.1>,
      <abs ABSG = 5 
       data hash MD5: 128K
       01 DE DD 6A 4A 66 22 18 74 08 9B 96 B6 E2 C2 4E>)
$$ ##END=
$$ 
$$ $$ hash MD5
$$ $$ C1 73 EC 2E 38 71 70 7E 62 42 E3 5C 54 3A 7C E4
##$RELAX= 
##$RELAX= 
##$RELAX= 
##$RELAX= 
##$RELAX= 
##$RELAX= 
##$RELAX= 
##$RELAX= 
$$ Bruker specific parameters
$$ --------------------------
##$DU= <E:\>
##$EXPNO= 22
$$ [...]
##$TP07= 0
##$TPNAME0= <>
##$TPNAME1= <>
##$TPNAME2= <>
##$TPNAME3= <>
##$TPNAME4= <>
##$TPNAME5= <>
##$TPNAME6= <>
##$TPNAME7= <>
##$TPOAL= (0..7)
0.5 0.5 0.5 0.5 0.5 0.5 0.5 0.5
##$TPOFFS= (0..7)
0 0 0 0 0 0 0 0
##$TUNHIN= 0
##$TUNHOUT= 0
##$TUNXOUT= 0
##$USERA1= <user>
##$USERA2= <user>
##$USERA3= <user>
##$USERA4= <user>
##$USERA5= <user>
##$V9= 5
##$VALIST= <valist>
##$VCLIST= <CCCCCCCCCCCCCCC>
##$VD= 0
##$VDLIST= <DDDDDDDDDDDDDDD>
##$VPLIST= <PPPPPPPPPPPPPPP>
##$VTLIST= <TTTTTTTTTTTTTTT>
##$WBST= 2048
##$WBSW= 25
##$XGAIN= (0..3)
0 0 0 0
##$XL= 0
##$YL= 0
##$YMAX_a= 5523242
##$YMIN_a= -11373950
##$ZGOPTNS= <>
##$ZL1= 120
##$ZL2= 120
##$ZL3= 120
##$ZL4= 120
##$ABSF1= 14.96323
##$ABSF2= -5.594952
##$ABSG= 5
##$ABSL= 3
##$ALPHA= 0
##$AQORDER= 0
##$ASSFAC= 0
##$ASSFACI= 0
##$ASSFACX= 0
##$ASSWID= 0
##$AUNMP= <proc_prof1d_extract.lims>
##$AXLEFT= 0
##$AXNAME= <>
##$AXNUC= <1H>
##$AXRIGHT= 0
##$AXTYPE= 0
##$AXUNIT= <>
##$AZFE= 0.1
##$AZFW= 0.1
##$BCFW= 0
##$BC_mod= 0
##$BYTORDP= 0
##$COROFFS= 0
##$CY= 15
##$DATMOD= 1
##$DC= 0
##$DFILT= <>
##$DTYPP= 0
##$F1P= 0
##$F2P= 0
##$FCOR= 0.5
##$FTSIZE= 131072
##$FT_mod= 6
##$GAMMA= 0
##$GB= 0
##$INTBC= 1
##$INTSCL= 1
##$ISEN= 128
##$LB= 0.3
##$LEV0= 0
##$LPBIN= 0
##$MAXI= 10000
##$MC2= 0
##$MEAN= 0
##$ME_mod= 0
##$MI= 0
##$NCOEF= 0
##$NC_proc= -2
##$NLEV= 6
##$NOISF1= 0
##$NOISF2= 0
##$NSP= 0
##$NTH_PI= 0
##$NZP= 0
##$OFFSET= 14.96323
##$PC= 1
##$PHC0= -85.60547
##$PHC1= 0
##$PH_mod= 1
##$PKNL= yes
##$PPARMOD= 0
##$PPDIAG= 0
##$PPIPTYP= 0
##$PPMPNUM= 2147483647
##$PPRESOL= 1
##$PSCAL= 4
##$PSIGN= 0
##$PYNMP= <proc.py>
##$REVERSE= no
##$SF= 400.020008744135
##$SI= 131072
##$SIGF1= 0
##$SIGF2= 0
##$SINO= 400
##$SIOLD= 131072
##$SPECTYP= <>
##$SREGLST= <1H.CDCl3>
##$SSB= 0
##$STSI= 131072
##$STSR= 0
##$SW_p= 8223.68421052631
##$SYMM= 0
##$S_DEV= 0
##$TDeff= 65536
##$TDoff= 0
##$TI= <>
##$TILT= no
##$TM1= 0
##$TM2= 0
##$TOPLEV= 0
##$USERP1= <user>
##$USERP2= <user>
##$USERP3= <user>
##$USERP4= <user>
##$USERP5= <user>
##$WDW= 1
##$XDIM= 131072
##$YMAX_p= 399564157
##$YMIN_p= -11470
##$CURPLOT= <Network HP LaserJet P1505>
##$CURPRIN= <$Network HP LaserJet P1505>
##$DFORMAT= <normdp>
##$LAYOUT= <+/1D_H.xwp>
##$LFORMAT= <normlp>
##$PFORMAT= <normpl>
##$SURQMSG= 1
$$ End of Bruker specific parameters
$$ ---------------------------------
##NTUPLES= NMR SPECTRUM
##VAR_NAME=  FREQUENCY,     SPECTRUM/REAL,   SPECTRUM/IMAG
##SYMBOL=    X,             R,               I
##VAR_TYPE=  INDEPENDENT,   DEPENDENT,       DEPENDENT
##VAR_FORM=  AFFN,          ASDF,            ASDF
##VAR_DIM=   131072,        131072,          131072
##UNITS=     HZ,            ARBITRARY UNITS, ARBITRARY UNITS
##FACTOR=    0.0627417313425164, 1,          1
##FIRST=     8223.62146879497, 742,          -31642
##LAST=      0,             1753,            -31769
##MIN=       0,             -11470,          0
##MAX=       8223.62146879497, 399564157,    0
$$ Real data points
##PAGE= N=1
##DATA TABLE= (X++(R..R)), XYDATA
$$ [...]
$$ plain form
61134 635726 622675 610886 600928 592683 585522 579175 573983 570436 568726 568589 569351 570262 570988 571742 572988
61119 572988 575233 578966 584362 591014 598427 606771 616665 628222 640990 654877 670138 685913 699590
61106 699590 708490 711968 711280 707832 702253 695002 686982 679204 672202 666008 660598 656259 653409 651961
61092 651961 650987 649393 647032 644769 643295 642276 640898 638898 636679 634648 632791 630797 628431 625867
61078 625867 623726 622577 622358 622516 622756 623332 624556 626487 629189 632787 637012 641164 644907 648814 653766
61063 653766 659985 666908 673740 679947 685436 690525 695589 700622 705356 709869 714696 720129 725750 730890
61049 730890 735337 739366 743281 747119 750726 754040 757369 761310 766277 772237 779098 787020 796000 805564
61035 805564 815505 826629 840100 856139 874020 893104 913191 934159 956264 980581 1007966 1037525
$$ packed form
61134F35726j3051j1789r958q245p161o347n192l547j710j37P62R11P26P54J246
61119E72988K245L733N396O652P413Q344R894J1557J2768J3887J5261J5775J3677
61106F99590Q900L478o88l448n579p251q020p778p002o194n410m339k850j448
61092F51961r74j594k361k263j474j019j378k000k219k031j857j994k366k564
61078F25867k141j149k19J58K40N76J224J931K702L598M225M152L743L907M952
61063F53766O219O923O832O207N489N089N064N033M734M513M827N433N621N140
61049G30890M447M029L915L838L607L314L329L941M967N960O861P922Q980R564
61035H05564R941J1124J3471J6039J7881J9084K0087K0968K2105K4317K7385K9559
$$ plain form
61023 1037525 1067272 1096437 1125951 1156443 1187158 1217538 1248682 1282354 1319231 1358786 1400195
61012 1400195 1442871 1486876 1533446 1584588 1641749 1705405 1775961 1854067 1939630 2031403 2127860
61001 2127860 2227703 2329697 2433598 2541864 2659270 2790498 2939183 3109098 3303757 3523785
60991 3523785 3766462 4029267 4313121 4622762 4967319 5362434 5829932 6394199 7080525
60982 7080525 7916644 8931773 10153772 11614395 13362718 15471989 18036316 21171551
60974 21171551 25007436 29610108 34812897 40077146 44581805 47584221 48816859 48605230
60966 48605230 47638814 46632102 46130301 46461305 47667726 49384324 50845443 51173534 49813845
60957 49813845 46790741 42606727 37917345 33252725 28925290 25070553 21714130 18821133
$$ packed form
61023A037525K9747K9165K9514L0492L0715L0380L1144L3672L6877L9555M1409
61012A400195M2676M4005M6570N1142N7161O3656P0556P8106Q5563R1773R6457
61001B127860R9843J01994J03901J08266J17406J31228J48685J69915J94659K20028
60991C523785K42677K62805K83854L09641L44557L95115M67498N64267O86326
60982G080525Q36119J015129J221999J460623J748323K109271K564327L135235
60974B1171551L835885M602672N202789N264249M504659L002416J232638k11629
60966D8605230r66416j006712n01801L31004J206421J716598J461119L28091j359689
60957D9813845l023104m184014m689382m664620m327435l854737l356423k892997
$$ plain form
60949 18821133 16333785 14197981 12371185 10817790 9505669 8405998 7490811 6729948
60941 6729948 6092947 5553792 5092276 4692328 4341600 4031889 3757398 3512495 3292300
60932 3292300 3094428 2918222 2762606 2625860 2506317 2401353 2306193 2215414 2125490 2035009
60922 2035009 1943586 1852335 1764541 1683605 1610079 1541965 1477624 1417003 1360463 1308079 1260142
60911 1260142 1216859 1177394 1140340 1105152 1072094 1040974 1011133 982540 955537 929506 903182
60900 903182 876504 850884 827284 805173 783808 763536 745221 729120 714825 701816 689716
60889 689716 678438 668256 659376 651507 644316 638104 633319 629555 625931 622405 619772 618203 616776 614752
60875 614752 612380 609994 607144 603332 599085 595542 593230 591724 590405 589130 588160 587702 587599 587471 587209
$$ packed form
60949A8821133k487348k135804j826796j553395j312121j099671r15187p60863
60941F729948o37001n39155m61516l99948l50728l09711k74491k44903k20195
60932C292300j97872j76206j55616j36746j19543j04964r5160r0779q9924r0481
60922B035009r1423r1251q7794q0936p3526o8114o4341o0621n6540n2384m7937
60911A260142m3283l9465l7054l5188l3058l1120k9841k8593k7003k6031k6324
60900I03182k6678k5620k3600k2111k1365k0272j8315j6101j4295j3009j2100
60889F89716j1278j0182q880p869p191o212m785l764l624l526k633j569j427k024
60875F14752k372k386k850l812m247l543k312j506j319j275r70m58j03j28k62
$$ plain form
60860 587209 587156 587728 588984 590775 593014 595472 597600 599049 600234 601860 603960 605906 607230 607882 607736
60845 607736 606457 603935 600332 595628 589625 582527 574971 567363 559615 551678 543883 536621 530124 524621
60831 524621 520126 515819 510208 502425 493139 483847 475461 467917 460914 454554 449119 444534 440334 436241
60817 436241 432603 430031 428572 427505 426097 424345 422743 421610 420927 420663 420868 421549 422785 424904 428199
60802 428199 432440 436966 441264 445330 449574 454528 460382 466536 471921 476157 480068 484546 489195 492784
60788 492784 494859 496113 497123 497589 497122 496084 495193 494739 494550 494319 493565 491642 488305 484094 479822 475819
60772 475819 471951 468143 464486 460906 457110 452887 448176 442932 437236 431578 426653 422687 419276 416076
60758 416076 413372 411563 410276 408607 406369 404534 404026 404531 405035 405166 405244 405150 404077 401676 398684 395989
$$ packed form
60860E87209n3N72J256J791K239K458K128J449J185J626K100J946J324O52j46
60845F07736j279k522l603m704o003p098p556p608p748p937p795p262o497n503
60831E24621m495m307n611p783r286r292q386p544p003o360n435m585m200m093
60817D36241l638k572j459j067j408j752j602j133o83k64K05O81J236K119L295
60802D28199M241M526M298M066M244M954N854O154N385M236L911M478M649L589
60788D92784K075J254J010M66m67j038q91m54j89k31p54j923l337m211m272m003
60772D75819l868l808l657l580l796m223m711n244n696n658m925l966l411l200
60758D16076k704j809j287j669k238j835n08N05N04J31P8r4j073k401k992k695
$$ plain form
60742 395989 393634 391254 388994 387434 386930 387546 389317 392041 395050 397759 400296 403176 406575 410354 414476
60727 414476 418824 422793 425759 427796 429311 430071 429322 426876 423434 419750 416104 412718 409974 407885 405842
60712 405842 403193 399820 396050 392431 389673 388289 388073 388300 388576 389033 389587 389663 389000 388157 387776 387770 387742 387823
60694 387823 388470 389616 390647 391229 391702 392569 393991 395911 398301 401014 403524 405118 405463 404945 404380 404354
60678 404354 404853 405464 405835 405850 405495 404790 403897 403199 403205 404385 406915 410432 414096 417201 419756 422314 425241
60661 425241 428332 431213 433877 436743 440309 444795 450027 455588 461134 466549 471680 476000 478782 479700
60647 479700 479090 477512 475170 471890 467639 462890 458376 454442 450759 446785 442456 438266 434701 431875
60633 431875 429723 428155 426802 424990 422373 419433 416919 414853 412473 409133 404939 400424 395971 391674
$$ packed form
60742C95989k355k380k260j560n04O16J771K724L009K709K537K880L399L779M122
60727D14476M348L969K966K037J515P60p49k446l442l684l646l386k744k089k043
60712D05842k649l373l770l619k758j384k16K27K76M57N54P6o63q43l81ok8Q1
60694C87823O47J146J031N82M73Q67J422J920K390K713K510J594L45n18n65k6
60678D04354M99O11L71J5l55p05q93o98OJ180K530L517L664L105K555K558K927
60661D25241L091K881K664K866L566M486N232N561N546N415N131M320K782R18
60647D79700o10j578k342l280m251m749m514l934l683l974m329m190l565k826
60633D31875k152j568j353j812k617k940k514k066k380l340m194m515m453m297
$$ plain form
60619 391674 387526 383480 379368 374922 369968 364695 359737 355886 353568 352599 352437 352603 352914 353511 354679
60604 354679 356423 358279 359875 361690 364769 369488 375081 380661 386225 392226 398616 404900 410839 416416
60590 416416 421213 424471 425847 425680 424473 422449 419633 416096 412099 408216 405128 402992 401228 399256
60576 399256 397267 395848 395096 394627 394284 394368 395239 397149 400230 404104 407699 410140 411808 413869 416826 420181
60560 420181 423472 426819 430363 434001 437981 442983 449195 455883 462354 468797 475701 482916 489926 496838
60546 496838 504610 514315 526402 540634 556591 574389 595034 619934 650017 685581 727029 775377
60534 775377 831987 898152 975162 1064404 1167069 1283789 1414296 1556612 1705838 1853814
60524 1853814 1990416 2105730 2191747 2243178 2257776 2236585 2184081 2107824 2017009 1920094 1822918
$$ packed form
60619C91674m148m046m112m446m954n273m958l851k318r69j62J66L11N97J168
60604C54679J744J856J596J815L079M719N593N580N564O001O390O284N939N577
60590D16416M797L258J376j67j207k024k816l537l997l883l088k136j764j972
60576C99256j989j419p52m69l43Q4Q71J910L081L874L595K441J668K061K957L355
60560D20181L291L347L544L638L980N002O212O688O471O443O904P215P010O912
60546D96838P772R705J2087J4232J5957J7798K0645K4900L0083L5564M1448M8348
60534G75377N6610O6165P7010Q9242J02665J16720J30507J42316J49226J47976
60524A853814J36602J15314Q6017N1431J4598k1191n2504p6257r0815r6915r7176
$$ plain form
60513 1822918 1728588 1638535 1553325 1472990 1397650 1328182 1265910 1211656 1165626 1128185 1099986
60502 1099986 1081124 1070804 1068291 1073748 1087957 1111699 1145803 1191383 1249627 1321530 1407954 1509384
60490 1509384 1625020 1751936 1884931 2016739 2138467 2240826 2316200 2360342 2372978 2357822
60480 2357822 2322273 2276186 2229745 2191740 2169115 2167119 2189484 2238885 2317515 2426798 2566107
60469 2566107 2731708 2916408 3109233 3295295 3457374 3579151 3647832 3654963 3597106 3477467
60459 3477467 3306416 3098960 2870720 2635422 2404150 2184800 1981674 1796348 1629301
60450 1629301 1480552 1349265 1233819 1132672 1044733 968788 903092 845895 796111 753241
60440 753241 716702 685424 658208 634511 614642 598837 586190 574954 564015 553553 544117 535581
$$ packed form
60513A822918r4330r0053q5210q0335p5340o9468o2272n4254m6030l7441k8199
60502A099986j8862j0320k513N457J4209K3742L4104M5580N8244P1903Q6424J01430
60490A509384J15636J26916J32995J31808J21728J02359P5374M4142J2636j5156
60480B357822l5549m6087m6441l8005k2625j996K2365M9401P8630J09283J39309
60469B566107J65601J84700J92825J86062J62079J21777O8681P131n7857j19639
60459C477467j71051k07456k28240k35298k31272k19350k03126j85326j67047
60450A629301j48749j31287j15446j01147q7939p5945o5696n7197m9784m2870
60440G53241l6539l1278k7216k3697j9869j5805j2647j1236j0939j0462r436q536
$$ plain form
60428 535581 527349 519080 510755 502438 494350 486761 479387 471482 463006 455158 449025 444124 439091 433496
60414 433496 428160 423865 420624 418254 416817 416306 416508 417363 419012 421370 424090 427045 430463 434524 439177
60399 439177 444321 449854 455609 461581 468039 474938 481388 486322 489653 492243 494702 496851 498415 499580
60385 499580 500643 501623 502492 503371 504228 504735 504672 504245 503805 503461 503016 502045 500033 496753 492542 487941 483134
60368 483134 478096 473192 469070 465924 463374 461206 459675 458855 458190 457023 455188 452828 450029 447013 444318
60353 444318 442322 440721 438849 436517 434311 433114 433471 435263 437771 440087 441622 442249 442037 441066 439569
60338 439569 437992 436696 435714 434909 434262 433869 433742 433735 433701 433700 434062 435114 436751 438461 439970 441666 444063 446916
60320 446916 449389 451141 452821 455305 458814 463020 467586 472178 476183 478958 480443 481232 481987 482953 484044
$$ packed form
60428E35581q232q269q325q317q088p589p374p905q476p848o133m901n033n595
60414D33496n336m295l241k370j437n11K02Q55J649K358K720K955L418M061M653
60399D39177N144N533N755N972O458O899O450M934L331K590K459K149J564J165
60385D99580J063R80Q69Q79Q57N07o3m27m40l44m45r71k012l280m211m601m807
60368D83134n038m904m122l146k550k168j531q20o65j167j835k360k799l016k695
60353D44318j996j601j872k332k206j197L57J792K508K316J535O27k12r71j497
60338D39569j577j296r82q05o47l93j27pl4jL62J052J637J710J509J696K397K853
60320D46916K473J752J680K484L509M206M566M592M005K775J485P89P55R66J091
$$ plain form
60305 484044 485149 486137 486706 486544 485825 485385 486125 488251 491448 496033 503500 515343 531260 548919 565584
60290 565584 579691 590821 598670 602500 601455 595113 583882 569142 552947 537312 523542 512169
60278 512169 503283 496744 492240 489455 488292 488753 490559 493040 495543 497809 499943 502121 504490 507226
60264 507226 510455 514121 518147 522740 528270 534769 541827 549247 557514 567164 577828 588384 598168 607555
60250 607555 617142 626780 635791 643824 651135 658104 664928 671767 678934 686895 696233 707541 721167 737059
60236 737059 755057 775291 798183 824116 853352 886187 922928 963576 1007680 1054605 1103862
60225 1103862 1155086 1207726 1260913 1313744 1365683 1416455 1465410 1511193 1552319 1588067 1618527
60214 1618527 1643872 1663979 1678807 1688710 1694112 1695246 1692468 1686601 1678604 1669087 1658374 1646899 1635310
$$ packed form
60305D84044J105R88N69j62p19m40P40K126L197M585P467J1843J5917J7659J6665
60290E65584J4107J1130P849L830j045o342j1231j4740j6195j5635j3770j1373
60278E12169q886o539m504k785j163M61J806K481K503K266K134K178K369K736
60264E07226L229L666M026M593N530O499P058P420Q267R650J0664J0556R784R387
60250F07555R587R638R011Q033P311O969O824O839P167P961R338J1308J3626J5892
60236G37059J7998K0234K2892K5933K9236L2835L6741M0648M4104M6925M9257
60225A103862N1224N2640N3187N2831N1939N0772M8955M5783M1126L5748L0460
60214A618527K5345K0107J4828R903N402J134k778n867p997r517j0713j1475j1589
$$ plain form
60201 1635310 1624289 1614433 1606197 1599893 1595909 1594960 1597874 1605098 1616759 1633226 1655147 1682766 1715721
60188 1715721 1753695 1796637 1843864 1893505 1943389 1992086 2038533 2081166 2118173 2148392 2171322
60177 2171322 2186421 2193070 2191096 2180721 2162082 2135402 2101501 2061574 2016639 1967836 1917104 1866751
60165 1866751 1818409 1773011 1731698 1695797 1665803 1641266 1621944 1608365 1601082 1600167 1605796 1618495
60153 1618495 1638245 1663826 1693431 1725428 1758189 1789875 1819016 1844881 1866760 1883352 1893495
60142 1893495 1897202 1895499 1889559 1880576 1870164 1860174 1852172 1847574 1848095 1855294 1869533 1889841 1914852
60129 1914852 1943477 1974683 2007282 2040306 2073347 2106370 2139623 2174105 2211904 2255596 2307237
60118 2307237 2368108 2439213 2521460 2614992 2718517 2829654 2945983 3065640 3187021 3308247
$$ packed form
60201A635310j1021r856q236o304l984r49K914P224J1661J6467K1921K7619L2955
60188A715721L7974M2942M7227M9641M9884M8697M6447M2633L7007L0219K2930
60177B171322J5099O649j974j0375j8639k6680l3901l9927m4935m8803n0732n0353
60165A866751m8342m5398m1313l5901k9994k4537j9322j3579p283r15N629J2699
60153A618495J9750K5581K9605L1997L2761L1686K9141K5865K1879J6592J0143
60142A893495L707j703n940q983j0412r990q002m598N21P199J4239K0308K5011
60129A914852K8625L1206L2599L3024L3041L3023L3253L4482L7799M3692N1641
60118B307237O0871P1105Q2247R3532J03525J11137J16329J19657J21381J21226
$$ plain form
60108 3308247 3426956 3540286 3644932 3737564 3815594 3877489 3922268 3948996 3956986 3946194 3917025
60097 3917025 3870011 3806218 3727909 3638252 3540286 3436645 3330297 3224919 3124019 3029869
60087 3029869 2943567 2865982 2798387 2742263 2698666 2667687 2648306 2638681 2636670 2640233 2647623 2657520
60075 2657520 2669118 2682094 2696423 2712071 2728606 2745031 2760197 2773440 2784441 2792352 2795504 2792434
60063 2792434 2782860 2767217 2745597 2717703 2683646 2643994 2599030 2548600 2492739 2431907 2366573
60052 2366573 2297272 2225392 2153337 2083536 2017455 1955701 1898710 1847166 1802008 1764239 1734510
60041 1734510 1712920 1699451 1694450 1698237 1710376 1730044 1757149 1792351 1835698 1885903 1941196 2000203
60029 2000203 2061426 2122398 2180015 2231597 2275384 2310402 2336288 2353078 2360749 2359101 2348182 2328487
$$ packed form
60108C308247J18709J13330J04646R2632P8030O1895M4779K6728P990j0792k9169
60097C917025m7014o3793p8309q9657r7966j03641j06348j05378j00900r4150
60087C029869q6302p7585o7595n6124m3597l0979j9381r625k011L563P390R897
60075B657520J1598J2976J4329J5648J6535J6425J5166J3243J1001P911L152l070
60063B792434r574j5643k1620k7894l4057l9652m4964n0430n5861o0832o5334
60052B366573o9301p1880p2055o9801o6081o1754n6991n1544m5158l7769k9729
60041A734510k1590j3469n001L787J2139J9668K7105L5202M3347N0205N5293N9007
60029B000203O1223O0972N7617N1582M3787L5018K5886J6790P671j648j0919j9695
$$ plain form
60017 2328487 2300587 2264998 2222721 2175488 2125130 2073080 2020893 1970724 1924664 1883829 1848638
60006 1848638 1819733 1797924 1783272 1774864 1771814 1774178 1782732 1798098 1820170 1848279 1881835 1920890
59994 1920890 1966076 2017987 2076665 2141623 2212031 2286617 2363463 2440007 2513294 2580464 2639479
59983 2639479 2689548 2730574 2762105 2783192 2793391 2793360 2784045 2765582 2737474 2699718 2653465 2600670
59971 2600670 2543478 2483989 2424352 2366806 2313375 2265288 2222754 2185684 2154681 2131070 2115973
59960 2115973 2109765 2112473 2124106 2144307 2172080 2206213 2245700 2289596 2336896 2386797 2438650 2491286
59948 2491286 2542769 2591165 2635238 2674202 2707293 2734043 2754520 2768811 2776591 2777690 2772761 2762943
59936 2762943 2749295 2733105 2716385 2701298 2689258 2681181 2678439 2682995 2696710 2721150 2757861 2808046
$$ packed form
60017B328487k7900l5589m2277m7233n0358n2050n2187n0169m6060m0835l5191
60006A848638k8905k1809j4652q408l050K364Q554J5366K2072K8109L3556L9055
59994A920890M5186N1911N8678O4958P0408P4586P6846P6544P3287O7170N9015
59983B639479N0069M1026L1531K1087J0199l1r315j8463k8108l7756m6253n2795
59971B600670n7192n9489n9637n7546n3431m8087m2534l7070l1003k3611j5097
59960B115973o208K708J1633K0201K7773L4133L9487M3896M7300M9901N1853N2636
59948B491286N1483M8396M4073L8964L3091K6750K0477J4291P780J099m929r818
59936B762943j3648j6190j6720j5087j2040q077k742M556J3715K4440L6711N0185
$$ plain form
59924 2808046 2871883 2948819 3038717 3142168 3259485 3389795 3531190 3681165 3836481 3992740
59914 3992740 4144286 4284568 4406975 4505958 4577680 4619644 4630178 4608970 4558126 4482068 4386084
59903 4386084 4275182 4154223 4028339 3902499 3780629 3665235 3557738 3459053 3370009 3291425
59893 3291425 3223942 3168047 3124337 3093486 3075601 3069896 3075528 3092627 3122035 3164127 3218489 3284684
59881 3284684 3362560 3451458 3549624 3654530 3763032 3870618 3970896 4056503 4120672 4158114
59871 4158114 4165483 4142251 4091292 4017845 3927263 3823709 3710776 3592682 3474238 3359550
59861 3359550 3250862 3148603 3052395 2962024 2877754 2800084 2729505 2666483 2611404 2564389 2525303
59850 2525303 2494115 2471182 2456901 2451026 2452550 2460412 2474148 2493729 2518973 2549524 2585426 2627238
$$ packed form
59924B808046O3837P6936Q9898J03451J17317J30310J41395J49975J55316J56259
59914C992740J51546J40282J22407R8983P1722M1964J0534k1208n0844p6058r5984
59903D386084j10902j20959j25884j25840j21870j15394j07497r8685q9044p8584
59893C291425o7483n5895m3710l0851j7885n705N632J7099K9408M2092N4362O6195
59881C284684P7876Q8898R8166J04906J08502J07586J00278Q5607O4169L7442
59871D158114P369k3232n0959p3447r0582j03554j12933j18094j18444j14688
59861C359550j08688j02259r6208r0371q4270p7670p0579o3022n5079m7015l9086
59850B525303l1188k2933j4281n875J524P862J3736J9581K5244L0551L5902M1812
$$ plain form
59838 2627238 2675130 2727780 2782166 2834271 2879893 2915230 2937432 2945125 2938610 2919709 2891442 2857474
59826 2857474 2821310 2785657 2752335 2722202 2694461 2666049 2632522 2590430 2539282 2481536 2421178
59815 2421178 2362409 2309033 2263931 2228193 2200354 2176661 2152729 2125606 2094632 2060608 2024569
59804 2024569 1987494 1950528 1914635 1880069 1846819 1815589 1787660 1763652 1743086 1725446 1711106
59793 1711106 1701005 1696054 1697347 1706355 1724298 1751555 1788202 1834851 1892554 1962182 2044472 2140447
59781 2140447 2251154 2376780 2516051 2665887 2820669 2971458 3106377 3212656 3279596 3301233
59771 3301233 3277723 3214832 3121907 3009510 2887627 2764499 2645988 2535779 2436196 2348782
59761 2348782 2274305 2212747 2163516 2125419 2096530 2074689 2058431 2047086 2039982 2036234 2035488 2038067
$$ packed form
59838B627238M7892N2650N4386N2105M5622L5337K2202P693o515j8901k8267l3968
59826B857474l6164l5653l3322l0133k7741k8412l3527m2092n1148n7746o0358
59815B421178n8769n3376m5102l5738k7839k3693k3932k7123l0974l4024l6039
59804B024569l7075l6966l5893l4566l3250l1230k7929k4008k0566j7640j4340
59793A711106j0101m951J293R008J7943K7257L6647M6649N7703O9628Q2290R5975
59781B140447J10707J25626J39271J49836J54782J50789J34919J06279O6940K1637
59771C301233k3510o2891r2925j12397j21883j23128j18511j10209r9583q7414
59761B348782p4477o1558m9231l8097k8889k1841j6258j1345p104l748p46K579
$$ plain form
59749 2038067 2043961 2052450 2063311 2077738 2097285 2122352 2152416 2187278 2227379 2273286 2325672 2385523
59737 2385523 2453544 2529566 2613223 2705133 2806805 2919728 3045180 3184510 3338649 3507464
59727 3507464 3690380 3887331 4098017 4320184 4549633 4781941 5013180 5238881 5453668
59718 5453668 5652882 5834223 5997671 6144771 6278624 6403925 6526000 6649522 6777931
59709 6777931 6913268 7055821 7204095 7355544 7507310 7656186 7798354 7929615 8045968
59700 8045968 8144013 8221262 8276522 8309963 8322668 8316235 8292887 8255842 8209360 8158378 8108046
59689 8108046 8063408 8029281 8010099 8009493 8029972 8073383 8141834 8237800 8363218 8518935 8705223
59678 8705223 8921978 9167727 9438895 9730739 10038412 10355971 10674436 10981664 11264065
$$ packed form
59749B038067N894Q489J0861J4427J9547K5067L0064L4862M0101M5907N2386N9851
59737B385523O8021P6022Q3657R1910J01672J12923J25452J39330J54139J68815
59727C507464J82916J96951K10686K22167K29449K32308K31239K25701K14787
59718E453668J99214J81341J63448J47100J33853J25301J22075J23522J28409
59709F777931J35337J42553J48274J51449J51766J48876J42168J31261J16353
59700H045968R8045P7249N5260L3441J2705o433k3348l7045m6482n0982n0332
59689H108046m4638l4127j9182o06K0479M3411O8451R5966J25418J55717J86288
59678H705223K16755K45749K71168K91844L07673L17559L18465L07228K82401
$$ plain form
59669 11264065 11507717 11698523 11823532 11873714 11845677 11740897 11564346 11324349 11032718 10703658
59659 10703658 10351848 9991026 9633272 9288547 8964278 8664633 8389119 8131448 7880485
59650 7880485 7623622 7350536 7055568 6738539 6404375 6061372 5718612 5383954 5063281
59641 5063281 4760352 4476835 4212956 3968563 3743618 3537856 3350606 3181073 3028361
59632 3028361 2891095 2767557 2656439 2557130 2469204 2392084 2325239 2268113 2219621 2178219 2142616
59621 2142616 2112021 2085650 2062569 2042144 2024032 2007580 1991904 1976675 1961990 1947129 1930300
59610 1930300 1910247 1887451 1863187 1837993 1811714 1784481 1756768 1728758 1700431 1672231 1645064
59599 1645064 1619552 1595663 1573020 1551330 1530583 1511036 1492894 1475919 1459659 1444137 1429936
$$ packed form
59669A1264065K43652J90806J25009N0182k8037j04780j76551k39997k91631l29060
59659A0703658l51810l60822l57754l44725l24269k99645k75514k57671k50963
59650G880485k56863k73086k94968l17029l34164l43003l42760l34658l20673
59641E063281l02929k83517k63879k44393k24945k05762j87250j69533j52712
59632C028361j37266j23538j11118r9309q7926p7120o6845n7126m8492m1402l5603
59621B142616l0595k6371k3081k0425j8112j6452j5676j5229j4685j4861j6829
59610A930300k0053k2796k4264k5194k6279k7233k7713k8010k8327k8200k7167
59599A645064k5512k3889k2643k1690k0747j9547j8142j6975j6260j5522j4201
$$ plain form
59588 1429936 1417494 1406823 1398167 1392311 1389711 1389655 1390895 1392911 1396180 1401413 1408881 1418312 1429044 1440407
59574 1440407 1452259 1465085 1479476 1495789 1514377 1535691 1559807 1586254 1614675 1645407 1679079
59563 1679079 1715935 1755853 1798709 1844442 1893138 1945343 2001972 2063572 2130037 2201338 2277979
59552 2277979 2360253 2447479 2538561 2632871 2729890 2828240 2925935 3021630 3115051 3205957 3292758
59541 3292758 3371801 3437633 3484597 3509467 3513148 3499616 3473039 3435945 3389541 3334783 3272801
59530 3272801 3204879 3132528 3057525 2981772 2907299 2836348 2771065 2712996 2663143 2622578 2592685
59519 2592685 2574727 2569663 2578618 2603123 2644395 2702448 2776350 2865234 2968426 3084270 3209122
59508 3209122 3337864 3465129 3585589 3693341 3782051 3846391 3883158 3890852 3868758 3817178 3738394
$$ packed form
59588A429936j2442j0671q656n856k600n6J240K016L269N233P468R431J0732J1363
59574A440407J1852J2826J4391J6313J8588K1314K4116K6447K8421L0732L3672
59563A679079L6856L9918M2856M5733M8696N2205N6629O1600O6465P1301P6641
59552B277979Q2274Q7226R1082R4310R7019R8350R7695R5695R3421R0906Q6801
59541C292758P9043O5832M6964K4870L681j3532k6577l7094m6404n4758o1982
59530C272801o7922p2351p5003p5753p4473p0951o5283n8069m9853m0565k9893
59519B592685j7958n064Q955K4505M1272N8053P3902Q8884J03192J15844J24852
59508C209122J28742J27265J20460J07752Q8710O4340L6767P694k2094n1580p8784
$$ plain form
59497 3738394 3636736 3517504 3385978 3247143 3105637 2965671 2831060 2705037 2589588
59488 2589588 2485105 2391286 2308431 2237529 2179305 2133804 2100834 2080060 2070595 2071317 2081877 2102879
59476 2102879 2134800 2177126 2228612 2287774 2352934 2422393 2494761 2568586 2641460 2710118 2771650
59465 2771650 2824005 2865100 2892265 2903122 2896537 2872352 2830895 2773367 2702305 2621022 2532646
59454 2532646 2439721 2344142 2247079 2149380 2052394 1957957 1867412 1781279 1700165 1625170 1556844
59443 1556844 1494408 1436778 1383869 1336191 1293588 1255154 1220233 1188845 1161208 1137289 1116840
59432 1116840 1099607 1085546 1074854 1067528 1062926 1060293 1059736 1061978 1067047 1074056 1082591 1093514 1108010
59419 1108010 1126458 1148233 1171330 1191688 1204528 1207864 1204211 1198073 1192496 1188807 1188333 1192694 1202784
$$ packed form
59497C738394j01658j19232j31526j38835j41506j39966j34611j26023j15449
59488B589588j04483r3819q2855p0902n8224m5501l2970k0774r465P22J0560K1002
59476B102879L1921M2326N1486N9162O5160O9459P2368P3825P2874O8658O1532
59465B771650N2355M1095K7165J0857o585k4185m1457n7528p1062q1283q8376
59454B532646r2925r5579r7063r7699r6986r4437r0545q6133q1114p4995o8326
59443A556844o2436n7630n2909m7678m2603l8434l4921l1388k7637k3919k0449
59432A116840j7233j4061j0692p326m602k633n57K242N069P009Q535J0923J4496
59419A108010J8448K1775K3097K0358J2840L336l653o138n577l689m74M361J0090
$$ plain form
59406 1202784 1218691 1239964 1264477 1287594 1304387 1313199 1316234 1316956 1318130 1321984 1330374 1344020 1362588
59393 1362588 1385963 1414640 1448653 1487145 1529481 1576066 1627737 1684967 1747840 1816040 1888516
59382 1888516 1963861 2041396 2121417 2204229 2289621 2377707 2470002 2569412 2679421 2803149 2942675
59371 2942675 3099062 3273101 3465665 3676899 3905383 4148612 4403739 4666905 4932179
59362 4932179 5192573 5442582 5679276 5901138 6106847 6295392 6466327 6619336 6753905
59353 6753905 6869491 6965346 7039922 7090784 7115004 7109110 7069065 6991422 6874785 6719691 6527530
59342 6527530 6300975 6045603 5769782 5482347 5190991 4902739 4624254 4360525 4113985
59333 4113985 3885542 3675694 3484050 3308829 3148027 3000768 2866750 2744905 2633527
$$ packed form
59406A202784J5907K1273K4513K3117J6793Q812L035P22J174L854Q390J3646J8568
59393A362588K3375K8677L4013L8492M2336M6585N1671N7230O2873O8200P2476
59382A888516P5345P7535Q0021Q2812Q5392Q8086R2295R9410J10009J23728J39526
59371B942675J56387J74039J92564K11234K28484K43229K55127K63166K65274
59362D932179K60394K50009K36694K21862K05709J88545J70935J53009J34569
59353F753905J15586R5855P4576N0862K4220n894m0045p7643j16637j55094j92161
59342F527530k26555k55372k75821k87435k91356k88252k78485k63729k46540
59333D113985k28443k09848j91644j75221j60802j47259j34018j21845j11378
$$ plain form
59324 2633527 2531484 2438494 2354365 2278694 2211228 2151803 2099794 2054080 2013699 1978267 1947782
59313 1947782 1922206 1901200 1883996 1869579 1857186 1846596 1837779 1830337 1823447 1816354 1808894 1801510
59301 1801510 1794683 1788228 1781340 1773496 1765083 1756846 1748947 1741047 1733160 1725904 1719959 1715843 1714177 1715595
59287 1715595 1720353 1728610 1741181 1759313 1783471 1812889 1846558 1884114 1925445 1969984 2016890 2065524
59275 2065524 2115214 2164752 2212690 2258207 2301046 2339823 2369955 2383747 2373849 2337865 2279921
59264 2279921 2207683 2128165 2046169 1965098 1887282 1813383 1742775 1675079 1610770 1550382 1494115
59253 1494115 1442435 1396061 1354950 1318175 1285202 1256478 1232292 1211982 1194912 1181469 1172301
59242 1172301 1167052 1164673 1164601 1166965 1171882 1179202 1188858 1200986 1215791 1233602 1254773 1279209 1306327
$$ packed form
59324B633527j02043r2990q4129p5671o7466n9425n2009m5714m0381l5432l0485
59313A947782k5576k1006j7204j4417j2393j0590q817p442o890p093p460p384
59301A801510o827o455o888p844q413q237p899p900p887p256n945m116j666J418
59287A715595M758Q257J2571J8132K4158K9418L3669L7556M1331M4539M6906M8634
59275B065524M9690M9538M7938M5517M2839L8777L0132J3792r898l5984n7944
59264B279921p2238p9518q1996q1071p7816p3899p0608o7696o4309o0388n6267
59253A494115n1680m6374m1111l6775l2973k8724k4186k0310j7070j3443r168
59242A172301n249k379p2K364M917P320R656J2128J4805J7811K1171K4436K7118
$$ plain form
59229 1306327 1335910 1368759 1406046 1448300 1495509 1548080 1607188 1674100 1749554 1833904 1927732
59218 1927732 2032235 2148954 2279022 2422588 2578986 2747262 2926116 3113243 3304945
59209 3304945 3496348 3681704 3854538 4008155 4136527 4234837 4299417 4327671 4318333 4271772
59199 4271772 4190197 4077880 3940959 3786449 3621031 3450597 3280279 3114123 2954764 2803918
59189 2803918 2663210 2534100 2417254 2312662 2220280 2139934 2070815 2011921 1963023 1924313
59179 1924313 1895034 1873311 1857512 1846890 1840618 1836955 1833704 1828768 1820121 1806214 1786951 1763702
59167 1763702 1737937 1710332 1681324 1651735 1622510 1594530 1568813 1546124 1526150 1507996 1491793
59156 1491793 1478767 1469270 1461955 1455542 1450258 1446570 1443558 1439771 1434997 1429920 1424451 1417623 1409020 1399257
$$ packed form
59229A306327K9583L2849L7287M2254M7209N2571N9108O6912P5454Q4350R3828
59218A927732J04503J16719J30068J43566J56398J68276J78854J87127J91702
59209C304945J91403J85356J72834J53617J28372R8310O4580K8254r338m6561
59199D271772q1575j12317j36921j54510j65418j70434j70318j66156j59359j50846
59189B803918j40708j29110j16846j04592r2382q0346o9119n8894m8898l8710
59179A924313k9279k1723j5799j0622o272l663l251m936q647j3907j9263k3249
59167A763702k5765k7605k9008k9589k9225k7980k5717k2689j9974j8154j6203
59156A491793j3026r497p315o413n284l688l012l787m774n077n469o828q603r763
$$ plain form
59142 1399257 1389028 1378448 1367338 1355560 1343090 1330269 1317839 1306230 1295022 1283548 1271834
59131 1271834 1260467 1249796 1239759 1230332 1221664 1213929 1207449 1202768 1200307 1200165 1202475 1207482 1214955
59118 1214955 1223986 1233851 1244693 1256943 1270516 1284986 1300013 1315041 1329010 1340972 1350730 1358434
59106 1358434 1363990 1367377 1369163 1370150 1370822 1371578 1373142 1376291 1381542 1389452 1400669 1415253 1432572 1452379
59092 1452379 1475298 1501621 1530457 1560922 1593489 1629034 1666915 1704978 1741096 1773691 1801017
59081 1801017 1821052 1832217 1833550 1824437 1805096 1777201 1743012 1703731 1659438 1610632 1559073 1506944
59069 1506944 1455843 1406655 1359818 1315494 1273861 1235229 1199666 1166803 1136440 1108926 1084344
59058 1084344 1061820 1040427 1020461 1002857 987593 973692 960851 950040 942252 937416 934849 934152
$$ packed form
59142A399257j0229j0580j1110j1778j2470j2821j2430j1609j1208j1474j1714
59131A271834j1367j0671j0037r427q668p735o480m681k461j42K310N007P473
59118A214955R031R865J0842J2250J3573J4470J5027J5028J3969J1962R758P704
59106A358434N556L387J786R87O72P56J564L149N251P910J1217J4584J7319J9807
59092A452379K2919K6323K8836L0465L2567L5545L7881L8063L6118L2595K7326
59081A801017K0035J1165J333r113j9341k7895l4189l9281m4293m8806n1559n2129
59069A506944n1101m9188m6837m4324m1633l8632l5563l2863l0363k7514k4582
59058A084344k2524k1393j9966j7604j5264j3901j2841j0811p788m836k567o97
$$ plain form
59046 934152 935344 938535 943593 949761 955593 959633 961105 959657 954847 946612 935961 924376 912582
59033 912582 900671 889290 879685 872425 867016 863065 860950 860885 862021 863116 863653 863926 864425 865594 867855
59018 867855 871378 875909 881167 887353 895118 905011 917037 930716 945550 961461 978731 997588 1018076
59005 1018076 1040283 1064359 1090261 1117946 1147831 1180320 1214465 1247751 1277741 1303290 1323601
58994 1323601 1336986 1341769 1338083 1327624 1311868 1291644 1268335 1244126 1220558 1197739 1175424 1154119
58982 1154119 1134664 1117393 1102238 1089235 1078435 1069568 1062159 1055887 1050667 1046508 1043333 1040883 1038951
58969 1038951 1037949 1039005 1043124 1050391 1060257 1072241 1085825 1100028 1113879 1127180 1140063 1151873
58957 1151873 1161332 1167964 1172605 1176318 1179505 1182391 1185711 1190357 1196615 1204114 1212378 1221188 1230551 1240513
$$ packed form
59046I34152J192L191N058O168N832M040J472j448m810q235j0651j1585j1794
59033I12582j1911j1381r605p260n409l951k115o5J136J095N37K73M99J169K261
59018H67855L523M531N258O186P765R893J2026J3679J4834J5911J7270J8857K0488
59005A018076K2207K4076K5902K7685K9885L2489L4145L3286K9990K5549K0311
58994A323601J3385M783l686j0459j5756k0224k3309k4209k3568k2819k2315k1305
58982A154119j9455j7271j5155j3003j0800q867p409o272n220m159l175k450j932
58969A038951j002J056M119P267R866J1984J3584J4203J3851J3301J2883J1810
58957A151873R459O632M641L713L187K886L320M646O258P499Q264Q810R363R962
$$ plain form
58943 1240513 1251046 1262145 1273982 1286707 1300061 1313579 1327447 1342790 1360821 1382184 1407454
58932 1407454 1437688 1473765 1515609 1562680 1614652 1670623 1727948 1782907 1832622 1875855 1912505
58921 1912505 1943591 1971567 1999310 2028415 2059229 2092620 2130574 2174803 2225894 2284376 2351671
58910 2351671 2429220 2517325 2615525 2723667 2842011 2970597 3109092 3257112 3414364 3580691
58900 3580691 3756242 3941417 4136335 4340273 4551451 4767048 4983540 5197462 5405980
58891 5405980 5606474 5795719 5969804 6124543 6255383 6357238 6425503 6457744 6454071 6415965
58881 6415965 6345408 6245195 6119153 5971372 5805538 5625190 5434230 5236711 5036211 4835365
58871 4835365 4635665 4437706 4242038 4049975 3863389 3683790 3511969 3348368 3193324
$$ packed form
58943A240513J0533J1099J1837J2725J3354J3518J3868J5343J8031K1363K5270
58932A407454L0234L6077M1844M7071N1972N5971N7325N4959M9715M3233L6650
58921A912505L1086K7976K7743K9105L0814L3391L7954M4229N1091N8482O7295
58910B351671P7549Q8105R8200J08142J18344J28586J38495J48020J57252J66327
58900C580691J75551J85175J94918K03938K11178K15597K16492K13922K08518
58891E405980K00494J89245J74085J54739J30840J01855O8265L2241l673l8106
58881F415965p0557j00213j26042j47781j65834j80348j90960j97519k00500k00846
58871D835365j99700j97959j95668j92063j86586j79599j71821j63601j55044
$$ plain form
58862 3193324 3046968 2909359 2780670 2660829 2549098 2444543 2346859 2256187 2172224 2094211
58852 2094211 2021765 1955071 1894164 1838652 1788290 1743241 1703535 1668705 1638058 1611008 1587215
58841 1587215 1566828 1550452 1538356 1529838 1523895 1520340 1519595 1521624 1525897 1532351 1541553 1553843 1569110
58828 1569110 1587567 1610010 1637080 1668842 1705115 1745612 1789707 1836673 1886159 1937857 1990842
58817 1990842 2044041 2097359 2151642 2207659 2265989 2327865 2394999 2468429 2548456 2635905 2732460
58806 2732460 2839485 2957413 3086611 3227901 3381826 3548133 3726360 3916095 4116220
58797 4116220 4324515 4538266 4754515 4969294 5177318 5372903 5550796 5705990 5833490
58788 5833490 5928726 5988118 6009592 5993514 5943099 5863068 5757798 5631577 5490212 5340618
$$ packed form
58862C193324j46356j37609j28689j19841j11731j04555r7684r0672q3963p8013
58852B094211p2446o6694o0907n5512n0362m5049l9706l4830l0647k7050k3793
58841A587215k0387j6376j2096q518n943l555p45K029M273O454R202J2290J5267
58828A569110J8457K2443K7070L1762L6273M0497M4095M6966M9486N1698N2985
58817A990842N3199N3318N4283N6017N8330O1876O7134P3430Q0027Q7449R6555
58806B732460J07025J17928J29198J41290J53925J66307J78227J89735K00125
58797D116220K08295K13751K16249K14779K08024J95585J77893J55194J27500
58788E833490R5236N9392K1474j6078n0415q0031j05270j26221j41365j49594
$$ plain form
58778 5340618 5187898 5033411 4875629 4711687 4538096 4352168 4154524 3949915 3744790
58769 3744790 3544493 3352805 3172658 3005890 2852750 2712518 2584375 2467333 2360091
58760 2360091 2261727 2172134 2091264 2018474 1953040 1894691 1843176 1797978 1758903 1726291 1700089
58749 1700089 1679321 1662982 1650839 1642870 1638579 1637391 1639075 1643252 1649121 1656138 1664282 1673146 1681569
58736 1681569 1688882 1696008 1704749 1716449 1731681 1750309 1771098 1791689 1809461 1822066 1827142 1822695
58724 1822695 1808411 1785740 1756066 1719591 1676509 1628123 1575923 1520527 1462574 1403827 1346239
58713 1346239 1290542 1236854 1186171 1140123 1099595 1064643 1035492 1012615 995898 984530 977696
58702 977696 974857 975541 979314 985495 992229 996192 993985 983900 966219 942477 914982 886374 858711
$$ packed form
58778E340618j52720j54487j57782j63942j73591j85928j97644k04609k05125
58769C744790k00297j91688j80147j66768j53140j40232j28143j17042j07242
58760B360091r8364q9593q0870p2790o5434n8349n1515m5198l9075l2612k6202
58749A700089k0768j6339j2143p969m291j188J684M177N869P017Q144Q864Q423
58736A681569P313P126Q741J1700J5232J8628K0789K0591J7772J2605N076m447
58724A822695j4284k2671k9674l6475m3082m8386n2200n5396n7953n8747n7588
58713A346239n5697n3688n0683m6048m0528l4952k9151k2877j6717j1368o834
58702I77696k839O84L773O181O734L963k207j0085j7681k3742k7495k8608k7663
$$ plain form
58689 858711 832988 809831 790099 774340 762264 753468 748309 747527 751466 760246 774133 793143 816703
58676 816703 844245 875518 909650 944396 977067 1006017 1030957 1052660 1073075 1095065 1120829
58665 1120829 1150212 1180369 1206404 1222245 1222407 1204450 1169964 1123024 1068211 1010063 952806 899211
58653 899211 850086 805618 766554 733422 705467 681495 661199 644827 632074 622225 614864 609581
58641 609581 605512 602067 599642 598802 599272 600481 602473 605394 608687 611740 614812 618358 622004 625122 627961
58626 627961 631285 635411 640480 647087 655622 665463 675804 686859 699399 713665 729646 747803 768465
58613 768465 791122 815399 842118 872183 905004 939373 975561 1015251 1059572 1108397 1161347
58602 1161347 1218287 1278860 1342502 1408792 1476901 1544878 1610253 1671026 1725350 1770886 1805590
$$ packed form
58689H58711k5723k3157j9732j5759j2076q796n159p82L939Q780J3887J9010K3560
58676H16703K7542L1273L4132L4746L2671K8950K4940K1703K0415K1990K5764
58665A120829K9383L0157K6035J5841J62j7957l4486m6940n4813n8148n7257n3595
58653H99211m9125m4468l9064l3132k7955k3972k0296j6372j2753r849p361n283
58641F09581m069l445k425q40M70J209J992K921L293L053L072L546L646L118K839
58626F27961L324M126N069O607Q535R841J0341J1055J2540J4266J5981J8157K0662
58613G68465K2657K4277K6719L0065L2821L4369L6188L9690M4321M8825N2950
58602A161347N6940O0573O3642O6290O8109O7977O5375O0773N4324M5536L4704
$$ plain form
58591 1805590 1828718 1840076 1838930 1824894 1799446 1765310 1724739 1679574 1632472 1586523 1543695
58580 1543695 1504840 1470942 1443016 1420920 1403565 1390226 1380509 1373209 1366643 1360114 1353962 1348276
58568 1348276 1342817 1338088 1335142 1334219 1334674 1336121 1338384 1340232 1339382 1333943 1322956 1305740 1282089 1253247
58554 1253247 1221529 1188680 1155381 1122056 1088833 1054670 1017906 978180 936983 896193 856910
58543 856910 819693 784955 752948 724056 698951 677692 659018 641536 625322 611282 599362
58532 599362 588628 578757 570077 562364 555102 548792 544472 541856 539405 536327 533095 529987 526685 523545
58518 523545 521646 521094 520671 519675 518917 519428 521403 524842 530069 537035 545079 553822 563465 573967 584858
58503 584858 596049 607802 619733 630881 640903 650100 658200 664414 669005 673533 679114 685505 692213
$$ packed form
58591A805590K3128J1358j146j4036k5448l4136m0571m5165m7102m5949m2828
58580A543695l8855l3898k7926k2096j7355j3339r717p300o566o529o152n686
58568A348276n459m729k946r23M55J447K263J848q50n439j0987j7216k3651k8842
58554A253247l1718l2849l3299l3325l3223l4163l6764l9726m1197m0790l9283
58543H56910l7217l4738l2007k8892k5105k1259j8674j7482j6214j4040j1920
58532E99362j0734r871q680p713p262o310m320k616k451l078l232l108l302l140
58518E23545j899n52m23r96p58N11J975L439N227O966Q044Q743R643J0502J0891
58503E84858J1191J1753J1931J1148J0022R197Q100O214M591M528N581O391O708
$$ plain form
58490 692213 699274 706467 712876 717876 721715 724743 726834 727824 727619 725581 720688 712681 702349 690653
58476 690653 678358 666418 655602 645622 635651 625763 616753 608609 600434 592064 584432 577992 571952
58463 571952 565443 558433 551198 543962 537332 532070 528159 524930 522164 520128 518657 517381 516808 517895
58449 517895 520553 523858 527694 532735 538794 544794 550451 556296 561788 565235 566179 566188 566599 566987 566580 565694
58433 565694 564835 563654 561774 559717 558266 557701 558099 559441 561040 561923 562148 562725 563961 565077 565823 567129
58417 567129 569656 572924 576376 580177 584436 588776 593132 597940 603112 607879 611990 615990 620105 624015
58403 624015 627921 632541 637771 642615 646732 650752 654834 658270 660815 663000 664912 666087 666822 668094
58389 668094 669907 671318 672302 673898 676141 677764 678503 679887 682999 687101 691197 695378 699888 704449 709201
$$ packed form
58490F92213P061P193O409N000L839L028K091R90k05k038m893q007j0332j1696
58476F90653j2295j1940j0816r980r971r888r010q144q175q370p632o440o040
58463E71952o509p010p235p236o630n262l911l229k766k036j471j276n73J087
58449E17895K658L305L836N041O059O000N657N845N492L447R44RM11L88m07q86
58433E65694q59j181j880k057j451n65L98J342J599Q83K25N77J236J116P46J306
58417E67129K527L268L452L801M259M340M356M808N172M767M111M000M115L910
58403F24015L906M620N230M844M117M020M082L436K545K185J912J175P35J272
58389F68094J813J411R84J596K243J623P39J384L112M102M096M181M510M561M752
$$ plain form
58374 709201 714869 721282 727196 732164 737108 742537 747824 752808 758428 765057 771800 778061 784217 790246
58360 790246 795444 800116 805760 812832 820037 826464 832633 838843 844413 849341 854798 861154 867375 873137
58346 873137 879530 886841 893679 899291 904775 911056 917622 924240 931850 940752 949923 959211 970082 983068
58332 983068 996553 1009254 1021874 1035098 1048190 1060938 1074932 1091399 1109613 1128701 1149040
58321 1149040 1170592 1191999 1212717 1234081 1256848 1279579 1300698 1320114 1337620 1351967 1362955
58310 1362955 1372339 1381358 1389561 1397267 1406597 1418557 1431594 1444629 1459006 1475861 1494199 1513334
58298 1513334 1534505 1558164 1582372 1605982 1630730 1658040 1686459 1714628 1744066 1776414 1810435
58287 1810435 1844423 1879218 1916130 1954060 1991513 2029470 2069738 2112439 2157639 2207361 2263362
$$ packed form
58374G09201N668O413N914M968M944N429N287M984N620O629O743O261O156O029
58360G90246N198M672N644P072P205O427O169O210N570M928N457O356O221N762
58346H73137O393P311O838N612N484O281O566O618P610Q902R171R288J0871J2986
58332I83068J3485J2701J2620J3224J3092J2748J3994J6467J8214J9088K0339
58321A149040K1552K1407K0718K1364K2767K2731K1119J9416J7506J4347J0988
58310A362955R384R019Q203P706R330J1960J3037J3035J4377J6855J8338J9135
58298A513334K1171K3659K4208K3610K4748K7310K8419K8169K9438L2348L4021
58287A810435L3988L4795L6912L7930L7453L7957M0268M2701M5200M9722N6001
$$ plain form
58276 2263362 2324573 2388713 2454216 2518546 2577330 2627849 2671274 2709377 2741748 2768558 2792984
58265 2792984 2818030 2843719 2870082 2899905 2935433 2975345 3018188 3065788 3119906 3178580 3239480
58254 3239480 3304036 3374494 3449614 3527195 3608291 3695102 3787214 3883726 3986529 4097626 4215623
58243 4215623 4338531 4467406 4603670 4745813 4892560 5046286 5209483 5381108 5560326
58234 5560326 5750229 5953603 6168828 6394560 6634526 6892681 7167705 7457699 7766364
58225 7766364 8098791 8455066 8834061 9239683 9677193 10147226 10649883 11190888 11777355
58216 11777355 12411765 13096992 13842818 14660404 15555259 16533630 17611105 18806913 20135418
58207 20135418 21612639 23266335 25130734 27237970 29626486 32354113 35494868 39133266
$$ packed form
58276B263362O1211O4140O5503O4330N8784N0519M3425L8103L2371K6810K4426
58265B792984K5046K5689K6363K9823L5528L9912M2843M7600N4118N8674O0900
58254C239480O4556P0458P5120P7581Q1096Q6811R2112R6512J02803J11097J17997
58243D215623J22908J28875J36264J42143J46747J53726J63197J71625J79218
58234E560326J89903K03374K15225K25732K39966K58155K75024K89994L08665
58225G766364L32427L56275L78995M05622M37510M70033N02657N41005N86467
58216A1777355O34410O85227P45826Q17586Q94855R78371J077475J195808J328505
58207B0135418J477221J653696J864399K107236K388516K727627L140755L638398
$$ plain form
58199 39133266 43378809 48384689 54343841 61476208 70033318 80306585 92620300 107336623
58191 107336623 124895227 145842646 170799491 200358842 234837064 273686732 314622052
58184 314622052 353118558 383176332 399424828 399376475 384290455 358178781 325884427
58177 325884427 291534398 257941368 226699858 198516362 173539543 151635276 132571481
58170 132571481 116097779 101964736 89936015 79798112 71354024 64416076 58818581
58163 58818581 54433947 51165189 48930428 47675542 47403773 48178690 50109626 53362376
58155 53362376 58131631 64412707 71592887 78247262 82551246 83179987 80000968 73995218
58147 73995218 66564830 58867766 51590182 45048463 39336173 34414176 30185831 26558894
$$ packed form
58199C9133266M245543N005880N959152P132367Q557110J0273267J2313715J4716323
58191A07336623J7558604K0947419K4956845K9559351L4478222L8849668M0935320
58184C14622052L8496506L0057774J6248496m8353j5086020k6111674l2294354
58177C25884427l4350029l3593030l1241510k8183496k4976819k1904267j9063795
58170A32571481j6473702j4133043j2028721j0137903q444088o937948n597495
58163E8818581m384634l268758k234761j254886k71769P74917J930936L252750
58155E3362376M769255O281076P180180O654375M303984O28741l179019o005750
58147G3995218p430388p697064p277584o541719n712290m921997m228345l626937
$$ plain form
58139 26558894 23458507 20811661 18549680 16622110 14990239 13611352 12442775 11454271
58131 11454271 10621762 9913583 9295777 8746841 8255751 7809322 7392395 6997288 6623063
58122 6623063 6267826 5930136 5614675 5327511 5067637 4830248 4615306 4425523 4258828
58113 4258828 4110374 3979335 3865963 3763704 3661463 3552856 3437772 3317055 3192048
58104 3192048 3067800 2950425 2841716 2740828 2649317 2569396 2499061 2434221 2374124 2319769
58094 2319769 2268889 2217878 2167220 2119748 2074710 2028639 1981098 1934584 1889544 1844251 1799023
58083 1799023 1756005 1715142 1674475 1633937 1595051 1557594 1520406 1484648 1452352 1422425 1391965
58072 1391965 1360972 1332021 1305816 1280748 1256377 1233796 1212841 1192271 1172290 1153866 1136259
$$ packed form
58139B6558894l100387k646846k261981j927570j631871j378887j168577r88504
58131A1454271q32509p08179o17806n48936m91090m46429m16927l95107l74225
58122F623063l55237l37690l15461k87164k59874k37389k14942j89783j66695
58113D258828j48454j31039j13372j02259j02241j08607j15084j20717j25007
58104C192048j24248j17375j08709j00888r1511p9921p0335o4840o0097n4355
58094B319769n0880n1011n0658m7472m5038m6071m7541m6514m5040m5293m5228
58083A799023m3018m0863m0667m0538l8886l7457l7188l5758l2296k9927l0460
58072A391965l0993k8951k6205k5068k4371k2581k0955k0570j9981j8424j7607
$$ plain form
58061 1136259 1118363 1101683 1088584 1078174 1067176 1054279 1040486 1025997 1010127 993786 978607
58050 978607 964051 948546 933034 920083 909914 900584 891662 884304 877904 870266 861278 853145 846660
58037 846660 840260 833177 826594 821201 816156 810921 805804 800477 794132 787169 780594 773975 766251 758248
58023 758248 751915 747298 742710 737725 733467 730135 726843 723822 722261 722070 722337 723833 728341 735471 742793
58008 742793 749294 756154 764074 772581 782145 794186 808481 823148 837724 853773 871939 890857
57996 890857 909605 928877 949080 969600 990601 1013242 1037270 1060461 1081155 1099342 1114597
57985 1114597 1125185 1130173 1130674 1128245 1123818 1118892 1115875 1116302 1120149 1127407 1138583 1153111 1168923
57972 1168923 1184154 1197542 1206671 1207917 1199120 1180907 1154874 1122233 1084870 1045778 1007302 970253
$$ packed form
58061A136259j7896j6680j3099j0410j0998j2897j3793j4489j5870j6341j5179
58050I78607j4556j5505j5512j2951j0169r330q922p358o400p638q988q133o485
58037H46660o400p083o583n393n045n235n117n327o345o963o575o619p724q003
58023G58248o333m617m588m985m258l332l292l021j561j91K67J496M508P130P322
58008G42793O501O860P920Q507R564J2041J4295J4667J4576J6049J8166J8918
57996H90857J8748J9272K0203K0520K1001K2641K4028K3191K0694J8187J5255
57985A114597J0588M988N01k429m427m926l017M27L847P258J1176J4528J5812
57972A168923J5231J3388R129J246q797j8213k6033l2641l7363l9092l8476l7049
$$ plain form
57960 970253 935370 904001 876499 851581 828299 807255 788985 772606 757189 743292 732079
57949 732079 723831 718208 715116 714560 716400 720840 728418 739112 752307 767901 786480 808187 832426
57936 832426 858805 887221 916903 946677 976349 1006407 1036132 1063449 1086966 1106626 1121868
57925 1121868 1130691 1131162 1122529 1104419 1076571 1040206 998320 953802 908303 863275 820535 780919
57913 780919 743794 708827 677102 649673 626213 605997 589016 575162 563349 552524 542750 534515
57901 534515 527753 522210 517866 514314 510698 507001 504506 504269 505966 508859 512858 517860 523055 527774
57887 527774 532165 536233 539121 540245 540330 540297 539856 538120 535048 531273 527032 522130 516680 511157 506011
57872 506011 501765 499011 497743 497084 496258 495508 495761 497840 502305 509405 518700 529214 540328 552084
$$ packed form
57960I70253l4883l1369k7502k4918k3282k1044j8270j6379j5417j3897j1213
57949G32079q248n623l092n56J840M440P578J0694J3195J5594J8579K1707K4239
57936H32426K6379K8416K9682K9774K9672L0058K9725K7317K3517J9660J5242
57925A121868Q823M71q633j8110k7848l6365m1886m4518m5499m5028m2740l9616
57913G80919l7125l4967l1725k7429k3460k0216j6981j3854j1813j0825r774q235
57901E34515o762n543m344l552l616l697k495k37J697K893L999N002N195M719
57887E27774M391M068K888J124Q5l3m41j736l072l775m241m902n450n523n146
57872E06011m246k754j268o59q26p50K53K079M465P100R295J0514J1114J1756
$$ plain form
57858 552084 564418 576792 588838 600529 611410 620496 627433 632884 637180 639378 638397 634426 628499
57845 628499 621230 612610 602606 591286 578745 565465 552439 540542 530059 521026 513558 507563
57833 507563 502754 499356 498302 500258 504798 510787 517213 523553 529888 536783 544517 552319 558942 563944
57819 563944 567682 570156 570889 569989 568177 565539 561481 556319 551606 548305 545827 543674 542855 544694 549211
57804 549211 555833 564984 577834 594862 615639 639707 666883 696789 728528 760475 789919 813543
57792 813543 828913 835315 833019 822593 805515 784567 762641 741451 721885 704909 691268 680762
57780 680762 672655 666593 662553 660272 659293 659183 659144 657843 654315 648710 641487 632219 619936 604560 587309
57765 587309 569651 552225 534824 517194 499811 483800 469872 457574 446114 435786 427723 422198
$$ packed form
57858E52084J2334J2374J2046J1691J0881R086O937N451M296K198r81l971n927
57845F28499p269q620j0004j1320j2541j3280j3026j1897j0483r033p468n995
57833E07563m809l398j054J956M540N989O426O340O335O895P734P802O623N002
57819E63944L738K474P33r00j812k638m058n162m713l301k478k153q19J839M517
57804E49211O622R151J2850J7028K0777K4068K7176K9906L1739L1947K9444K3624
57792H13543J5370O402k296j0426j7078k0948k1926k1190j9566j6976j3641j0506
57780F80762q107o062m040k281r79j10l9j301l528n605p223r268j2283j5376j7251
57765E87309j7658j7426j7401j7630j7383j6011j3928j2298j1460j0328q063n525
$$ plain form
57753 422198 418117 414511 411619 410072 409898 410864 413012 416244 420111 424583 430348 437735 446002 454189 461895
57738 461895 468672 473604 476325 477658 478359 477939 475650 471957 467975 464047 459964 456174 453608 452492 452347
57723 452347 452964 454450 456475 458438 460360 462833 466067 469718 473574 477751 482220 486845 491813 497498
57709 497498 503923 510887 518471 526920 536197 546235 557408 570108 584034 598521 613367 628593
57697 628593 643488 656782 668062 678427 689532 702405 717356 734626 754782 778559 806397
57686 806397 838172 873555 912742 956609 1005992 1061081 1121680 1187756 1259493 1337079 1420579
57675 1420579 1509678 1603367 1700249 1799367 1900411 2003220 2108023 2216799 2333819 2463624
57665 2463624 2606867 2755668 2890799 2984299 3009606 2954499 2827079 2649985 2448799 2243916
$$ packed form
57753D22198m081l606k892j547j74R66K148L232L867M472N765P387Q267Q187P706
57738D61895O777M932K721J333P01m20k289l693l982l928m083l790k566j116j45
57723D52347O17J486K025J963J922K473L234L651L856M177M469M625M968N685
57709D97498O425O964P584Q449R277J0038J1173J2700J3926J4487J4846J5226
57697F28593J4895J3294J1280J0365J1105J2873J4951J7270K0156K3777K7838
57686H06397L1775L5383L9187M3867M9383N5089O0599O6076P1737P7586Q3500
57675A420579Q9099R3689R6882R9118J01044J02809J04803J08776J17020J29805
57665B463624J43243J48801J35131R3500K5307n5107j27420j77094k01186k04883
$$ plain form
57655 2243916 2048638 1870189 1711177 1571556 1450316 1345778 1255445 1177105 1110028 1054141
57645 1054141 1008221 969956 937589 910468 888094 869806 855519 845622 839825 836968 836256 837879
57633 837879 842174 848964 858059 869738 884267 901427 920842 942458 966563 993670 1024373 1058884
57621 1058884 1096718 1137258 1180585 1227246 1277224 1329629 1383328 1437213 1489773 1538869 1582085
57610 1582085 1617025 1641538 1654257 1654932 1643850 1621210 1587765 1545814 1498576 1448418 1396331 1343070
57598 1343070 1289921 1238122 1188413 1141494 1098183 1058666 1022192 988041 956402 927894 902532
57587 902532 879568 858152 837859 818763 801203 785334 770893 757549 745351 734452 724457 714634
57575 714634 704917 696200 689345 684234 680034 676151 672685 670143 668846 668524 668437 668050 667526 667391 667796 668381
$$ packed form
57655B243916j95278j78449j59012j39621j21240j04538r0333p8340o7077n5887
57645A054141m5920l8265l2367k7121k2374j8288j4287r897n797k857p12J623
57633H37879M295O790R095J1679J4529J7160J9415K1616K4105K7107L0703L4511
57621A058884L7834M0540M3327M6661M9978N2405N3699N3885N2560M9096M3216
57610A582085L4940K4513J2719O75j1082k2640l3445m1951m7238n0158n2087n3261
57598A343070n3149n1799m9709m6919m3311l9517l6474l4151l1639k8508k5362
57587I02532k2964k1416k0293j9096j7560j5869j4441j3344j2198j0899r995r823
57575G14634r717q717o855n111m200l883l466k542j297l22q7l87n24j35M05N85
$$ plain form
57559 668381 668795 669098 669705 671176 673875 677509 681241 684730 688793 694493 701679 709105 716007 722884 730570
57544 730570 739167 748213 757425 766878 776760 787281 798681 811135 824753 839747 856460 875157
57532 875157 895894 918530 942815 968661 996618 1027875 1063392 1103046 1145832 1190728 1237079
57521 1237079 1284359 1332027 1379420 1425316 1467667 1504187 1533154 1553353 1563681 1563519 1553467 1535025
57509 1535025 1509584 1478280 1442713 1404909 1366349 1327704 1289720 1253622 1220206 1189146 1159702
57498 1159702 1131799 1105991 1082666 1061802 1043362 1027509 1014331 1003526 994522 986969 981061 977241
57486 977241 975541 975517 976879 979789 984270 989894 996509 1004727 1014937 1026234 1037297 1048157 1060118
57473 1060118 1073905 1088976 1104959 1122775 1143753 1168282 1195899 1226212 1259181 1294822 1333085
$$ packed form
57559F68381M14L03O07J471K699L634L732L489M063N700P186P426O902O877P686
57544G30570Q597R046R212R453R882J0521J1400J2454J3618J4994J6713J8697
57532H75157K0737K2636K4285K5846K7957L1257L5517L9654M2786M4896M6351
57521A237079M7280M7668M7393M5896M2351L6520K8967K0199J0328j62j0052j8442
57509A535025k5441l1304l5567l7804l8560l8645l7984l6098l3416l1060k9444
57498A159702k7903k5808k3325k0864j8440j5853j3178j0805r004p553n908l820
57486I77241j700k4J362K910M481N624O615Q218J0210J1297J1063J0860J1961
57473A060118J3787J5071J5983J7816K0978K4529K7617L0313L2969L5641L8263
$$ plain form
57462 1333085 1373799 1416466 1460248 1504333 1547946 1589821 1628000 1660382 1685268 1701397 1708003
57451 1708003 1705093 1693343 1673518 1646404 1613404 1576665 1538202 1499164 1460156 1421919 1385395
57440 1385395 1351352 1320157 1291726 1265674 1241821 1220601 1202550 1187385 1174100 1162163 1152019
57429 1152019 1144119 1137968 1132550 1127358 1122656 1119011 1116934 1116597 1117512 1118699 1119543 1120379 1122007 1124853 1128740
57414 1128740 1133264 1138114 1143219 1148772 1154977 1161678 1168421 1174937 1181300 1187575 1193715 1199857 1206342 1213256
57400 1213256 1220341 1227530 1235170 1243516 1252372 1261444 1270663 1279942 1288994 1297708 1306387 1315417 1324948 1335066
57386 1335066 1345894 1357292 1368850 1380397 1392239 1404728 1417920 1431768 1446118 1460378 1473818
57375 1473818 1486549 1499567 1513371 1527115 1539722 1551437 1563597 1577154 1592040 1607745 1623775
$$ packed form
57462A333085M0714M2667M3782M4085M3613M1875L8179L2382K4886J6129O606
57451A708003k910j1750j9825k7114l3000l6739l8463l9038l9008l8237l6524
57440A385395l4043l1195k8431k6052k3853k1220j8051j5165j3285j1937j0144
57429A152019p900o151n418n192m702l645k077l37R15J187Q44Q36J628K846L887
57414A128740M524M850N105N553O205O701O743O516O363O275O140O142O485O914
57400A213256P085P189P640Q346Q856R072R219R279R052Q714Q679R030R531J0118
57386A335066J0828J1398J1558J1547J1842J2489J3192J3848J4350J4260J3440
57375A473818J2731J3018J3804J3744J2607J1715J2160J3557J4886J5705J6030
$$ plain form
57364 1623775 1639560 1654516 1668442 1681640 1694615 1707848 1721664 1735995 1750318 1764055 1776994
57353 1776994 1789283 1801207 1813089 1825082 1836907 1848106 1858768 1869614 1881128 1893035 1904929
57342 1904929 1916913 1929212 1941636 1954028 1966870 1980761 1995496 2010263 2024629 2038797 2053063
57331 2053063 2067638 2082903 2099245 2116506 2134129 2151860 2169914 2188413 2207095 2225696 2244259
57320 2244259 2263028 2282275 2302187 2322677 2343411 2364361 2386138 2409333 2433649 2458155 2482321
57309 2482321 2506226 2529809 2552709 2575082 2597917 2622031 2647087 2672106 2696784 2721910 2748473
57298 2748473 2776640 2805699 2834914 2864242 2894099 2924423 2954250 2982436 3008632 3033208 3056342
57287 3056342 3077640 3096741 3113826 3129176 3142523 3153281 3161468 3168131 3174635 3181631 3188878 3196058
$$ packed form
57364A623775J5785J4956J3926J3198J2975J3233J3816J4331J4323J3737J2939
57353A776994J2289J1924J1882J1993J1825J1199J0662J0846J1514J1907J1894
57342A904929J1984J2299J2424J2392J2842J3891J4735J4767J4366J4168J4266
57331B053063J4575J5265J6342J7261J7623J7731J8054J8499J8682J8601J8563
57320B244259J8769J9247J9912K0490K0734K0950K1777K3195K4316K4506K4166
57309B482321K3905K3583K2900K2373K2835K4114K5056K5019K4678K5126K6563
57298B748473K8167K9059K9215K9328K9857L0324K9827K8186K6196K4576K3134
57287C056342K1298J9101J7085J5350J3347J0758Q187O663O504O996P247P180
$$ plain form
57275 3196058 3203508 3211974 3221866 3233092 3245557 3259301 3274068 3289246 3304566 3320491 3337546 3355556
57263 3355556 3374005 3392872 3412580 3433250 3454529 3476169 3498215 3520496 3542432 3563647 3584495
57252 3584495 3605715 3627689 3650267 3673159 3696238 3719407 3742363 3764724 3786479 3808155 3830330
57241 3830330 3853066 3876092 3899473 3923598 3948353 3972828 3996297 4019181 4042556 4066938 4091963
57230 4091963 4117013 4141690 4165828 4189599 4213549 4238078 4262940 4287661 4312350 4337505 4363075
57219 4363075 4388335 4412744 4436347 4459135 4480655 4500602 4519433 4538067 4557287 4577608 4599270
57208 4599270 4622046 4645352 4668920 4693172 4718723 4745817 4774408 4804464 4835858 4868220 4901179
57197 4901179 4934550 4968111 5001536 5034842 5068504 5102781 5137242 5171444 5205690 5240613 5276209
$$ packed form
57275C196058P450Q466R892J1226J2465J3744J4767J5178J5320J5925J7055J8010
57263C355556J8449J8867J9708K0670K1279K1640K2046K2281K1936K1215K0848
57252C584495K1220K1974K2578K2892K3079K3169K2956K2361K1755K1676K2175
57241C830330K2736K3026K3381K4125K4755K4475K3469K2884K3375K4382K5025
57230D091963K5050K4677K4138K3771K3950K4529K4862K4721K4689K5155K5570
57219D363075K5260K4409K3603K2788K1520J9947J8831J8634J9220K0321K1662
57208D599270K2776K3306K3568K4252K5551K7094K8591L0056L1394L2362L2959
57197D901179L3371L3561L3425L3306L3662L4277L4461L4202L4246L4923L5596
$$ plain form
57186 5276209 5311987 5347952 5384801 5423294 5464461 5510804 5566352 5634383 5714854 5804034 5896220
57175 5896220 5985465 6066525 6135691 6191594 6235035 6267653 6290724 6305116 6311816 6312029 6306783 6296688
57163 6296688 6282076 6263257 6240723 6215256 6187803 6159182 6130034 6101094 6073116 6046115 6018890
57152 6018890 5989880 5958644 5926160 5893607 5861300 5829005 5796759 5764894 5733564 5702864 5673433
57141 5673433 5646427 5622632 5601759 5582745 5564604 5546976 5529996 5513811 5498248 5482977 5467877
57130 5467877 5452911 5437543 5420617 5401242 5379694 5357043 5333976 5310492 5286826 5264108 5243722
57119 5243722 5226334 5211940 5200621 5192736 5188413 5187439 5189940 5196866 5209511 5228795 5255480 5291097
57107 5291097 5338281 5400324 5481221 5586712 5724520 5902116 6123686 6390149 6703148 7069201
$$ packed form
57186E276209L5778L5965L6849L8493M1167M6343N5548O8031Q0471Q9180R2186
57175E896220Q9245Q1060O9166N5903M3441L2618K3071J4392O700K13n246j0095
57163F296688j4612j8819k2534k5467k7453k8621k9148k8940k7978k7001k7225
57152F018890k9010l1236l2484l2553l2307l2295l2246l1865l1330l0700k9431
57141E673433k7006k3795k0873j9014j8141j7628j6980j6185j5563j5271j5100
57130E467877j4966j5368j6926j9375k1548k2651k3067k3484k3666k2718k0386
57119E243722j7388j4394j1319p885m323r74K501O926J2645J9284K6685L5617
57107E291097M7184O2043Q0897J05491J37808J77596K21570K66463L12999L66053
$$ plain form
57097 7069201 7500098 8010232 8614448 9327636 10164069 11135220 12247675 13502654 14896134
57088 14896134 16418068 18051392 19772089 21548902 23340591 25093170 26743915 28234813
57080 28234813 29527304 30605339 31462892 32086783 32450046 32520398 32275242 31712199 30851342
57071 30851342 29731597 28404041 26923352 25339549 23693071 22014421 20326915 18650429
57063 18650429 17004626 15410457 13889282 12460409 11138832 9933989 8849240 7882204
57055 7882204 7026413 6273562 5614707 5040167 4539626 4103092 3721671 3387371 3092852
57046 3092852 2831924 2599933 2393141 2207816 2040172 1886981 1745935 1615649 1495521
57037 1495521 1385287 1284363 1191757 1106766 1029315 959244 895733 837866 785380 738250 695916
$$ packed form
57097G069201M30897N10134O04216P13188Q36433R71151J112455J254979J393480
57088A4896134J521934J633324J720697J776813J791689J752579J650745J490898
57080B8234813J292491J078035Q57553O23891L63263P0352k45156n63043q60857
57071C0851342j119745j327556j480689j583803j646478j678650j687506j676486
57063A8650429j645803j594169j521175j428873j321577j204843j084749r67036
57055G882204q55791p52851o58855n74540n00541m36534l81421l34300k94519
57046C092852k60928k31991k06792j85325j67644j53191j41046j30286j20128
57037A495521j10234j00924r2606q4991p7451p0071o3511n7867n2486m7130m2334
$$ plain form
57026 695916 657587 623017 592243 564790 539987 517987 499582 484908 473212 463987 457406 453315
57014 453315 450741 449020 448732 451011 456697 466843 483373 508390 543210 588893 647564 722624 818053
57001 818053 938377 1089317 1277697 1509435 1784436 2088068 2384095 2619118 2742944 2733502
56991 2733502 2606606 2403221 2166805 1928561 1705817 1506483 1332804 1183693 1056744
56982 1056744 949346 858598 781224 714086 654620 600891 551865 507628 468676 434721 404501
56971 404501 376765 350935 326854 304527 284271 266585 251661 239407 230008 223878 220977 220773
56959 220773 223187 228960 238695 251870 266897 281502 292777 297741 294776 284500 268904 250049
56947 250049 229871 210418 193157 178103 164457 152176 142298 135695 132220 131302 132802 136959 143952
$$ packed form
57026F95916l8329l4570l0774k7453k4803k2000j8405j4674j1696r225o581m091
57014D53315k574j721k88K279N686J0146J6530K5017L4820M5683N8671P5060R5429
57001H18053J20324J50940J88380K31738K75001L03632K96027K35023J23826r442
56991B733502j26896k03385k36416k38244k22744j99334j73679j49111j26949
56982A056744j07398r0748p7374o7138n9466n3729m9026m4237l8952l3955l0220
56971D04501k7736k5830k4081k2327k0256j7686j4924j2254r399o130k901k04
56959B20773K414N773R735J3175J5027J4605J1275M964k965j0276j5596j8855
56947B50049k0178j9453j7261j5054j3646j2281r878o603l475r18J500M157O993
$$ plain form
56934 143952 153961 167473 185173 207393 233516 261627 288556 310521 324087 326979 318740 301173
56922 301173 277911 252756 228020 204476 182620 163218 146551 131945 118646 106801 97035 89352
56910 89352 83034 77521 72851 69189 66344 63926 61665 59465 57350 55462 54000 53086 52781 53180 54298
56895 54298 55970 58138 61256 66062 72903 81536 91674 103420 116951 132058 148196 164657 180352
56882 180352 193646 202888 207208 206692 202016 194261 184907 175488 167014 159944 154614 151305 149928 150213
56868 150213 152442 157520 166073 177901 192671 210745 232905 259601 290880 326565 365534 404655
56856 404655 439038 463781 475718 474160 460853 439332 413583 386747 360913 337715 318404 303381
56844 303381 292402 285499 283230 285921 293440 306059 324888 350937 384361 425177 474097 531627
$$ packed form
56934A43952J0009J3512J7700K2220K6123K8111K6929K1965J3566K892q239j7567
56922C01173k3262k5155k4736k3544k1856j9402j6667j4606j3299j1845r766p683
56910H9352o318n513m670l662k845k418k261k200k115j888j462r14l05L99J118
56895E4298J672K168L118M806O841Q633J0138J1746J3531J5107J6138J6461J5695
56882A80352J3294R242M320n16m676p755r354r419q474p070n330l309j377K85
56868A50213K229N078Q553J1828J4770J8074K2160K6696L1279L5685L8969L9121
56856D04655L4383K4743J1937j558j3307k1521k5749k6836k5834k3198j9311j5023
56844C03381j0979o903k269K691P519J2619J8829K6049L3424M0816M8920N7530
$$ plain form
56832 531627 596027 662247 722414 767394 789440 785529 758948 717119 667463 615199 563945 516534
56820 516534 474540 438057 406816 381225 361932 349024 342216 341397 346420 356885 372913 395840
56808 395840 427262 467198 513444 562141 607936 643814 662630 660498 638970 603626 560628 514602
56796 514602 468797 425755 387219 353878 325727 302658 284571 271091 261517 255210 252116 252930
56784 252930 258641 269740 285869 306246 330111 356190 381560 401665 412118 410817 398567 378111
56772 378111 352802 325588 298277 271366 244825 219162 195521 174779 156918 141469 128257
56761 128257 117375 108622 101281 94573 88191 82381 77524 73697 70739 68624 67414 66727 65662 63763
56747 63763 61778 60798 60685 60156 58572 56852 56162 56362 56441 55991 55422 54944 54234 53206 52374 52137 52186 51941
$$ packed form
56832E31627O4400O6220O0167M4980K2046l911k6581m1829m9656n2264n1254m7411
56820E16534m1994l6483l1241k5591j9293j2908o808q19N023J0465J6028K2927
56808C95840L1422L9936M6246M8697M5795L5878J8816k132k1528l5344m2998m6026
56796E14602m5805m3042l8536l3341k8151k3069j8087j3480r574o307l094Q14
56784B52930N711J1099J6129K0377K3865K6079K5370K0105J0453j301j2250k0456
56772C78111k5309k7214k7311k6911k6541k5663k3641k0742j7861j5449j3212
56761A28257j0882q753p341o708o382n810m857l827k958k115j210o87j065j899
56747F3763j985r80j13n29j584j720o90K00P9m50n69m78p10j028q32k37M9k45
$$ plain form
56729 51941 51251 50455 49998 50212 51187 52653 54088 55090 55562 55557 55209 54889 55111 56088 57511 58922 60105 60989
56711 60989 61471 61643 62062 63385 65669 68303 70799 73391 76626 80406 83834 86154 87668 89474 92353
56696 92353 96162 100255 104100 107348 109658 110838 111054 110648 109817 108642 107300 105994 104785 103747 103120
56681 103120 102969 102849 102280 101572 101626 102780 104311 105400 106137 107140 108500 109662 110294 110677 111092 111308 110999
56664 110999 110361 109843 109356 108230 106108 103532 101320 99588 97799 95696 93703 92242 91109 89847 88464
56649 88464 87297 86347 85253 83972 82988 82647 82595 82151 81081 79809 79022 79204 80371 82043 83568 84670
56633 84670 85615 86773 88187 89717 91307 92734 93298 92366 90402 88934 89134 90675 92277 93138 93392 93406
56617 93406 93266 93115 93381 94282 95406 96184 96601 97075 97762 98354 98576 98570 98788 99716 101617 104232 106840 108930
$$ packed form
56729E1941o90p96m57K14R75J466J435J002M72nl48l20K22R77J423J411J183Q84
56711F0989M82J72M19J323K284K634K496K592L235L780L428K320J514J806K879
56696I2353L809M093L845L248K310J180K16m06q31j175j342j306j209j038o27
56681A03120j51j20n69p08N4J154J531J089P37J003J360J162O32L83M15K16l09
56664A10999o38n18m87j126k122k576k212j732j789k103j993j461j133j262j383
56649H8464j167r50j094j281r84l41n2m44j070j272p87J82J167J672J525J102
56633H4670R45J158J414J530J590J427N64r32j964j468K00J541J602Q61K54J4
56617I3406j40j51K66R01J124P78M17M74O87N92K22oK18R28J901K615K608K090
$$ plain form
56599 108930 110758 112823 114927 116407 117358 118826 121327 123772 124564 123517 122059 121686 122754 124714 126845
56584 126845 128601 129692 130240 130698 131511 132879 134770 136966 139074 140766 142019 143036 143966 144882 145903
56569 145903 147106 148363 149554 150907 152839 155511 158817 162759 167468 172770 178105 182968 187231 190971
56555 190971 194333 197614 201108 204665 207777 210339 213046 216694 221315 226248 230922 235222 239192 242763
56541 242763 245863 248536 250824 252689 254109 255213 256230 257311 258325 258768 257983 255668 252253 248722 245955
56526 245955 244165 242893 241444 239356 236573 233310 229796 226078 221980 217213 211637 205551 199660 194576
56512 194576 190249 185939 180868 174923 168712 162963 157895 153199 148597 144266 140656 137906 135623 133276
56498 133276 130706 128141 125852 123900 122161 120504 118937 117677 117000 116961 117318 117798 118299 118740 118836 118239 116941
$$ packed form
56599A08930J828K065K104J480R51J468K501K445P92j047j458l73J068J960K131
56584A26845J756J091N48M58Q13J368J891K196K108J692J253J017R30R16J021
56569A45903J203J257J191J353J932K672L306L942M709N302N335M863M263L740
56555A90971L362L281L494L557L112K562K707L648M621M933M674M300L970L571
56541B42763L100K673K288J865J420J104J017J081J014M43p85k315l415l531k767
56526B45955j790j272j449k088k783l263l514l718m098m767n576o086n891n084
56512A94576m327m310n071n945o211n749n068m696m602m331l610k750k283k347
56498A33276k570k565k289j952j739j657j567j260o77l9L57M80N01M41R6n97j298
$$ plain form
56481 116941 115431 114457 114592 115837 117496 118610 118784 118537 118673 119399 120304 121119 122085 123476 125094 126470
56465 126470 127393 128021 128592 129283 130308 131903 134103 136656 139243 141728 144094 146204 147773 148719 149413 150401
56449 150401 151850 153455 154958 156577 158701 161271 163734 165654 167195 168897 171175 174214 178253 183564
56435 183564 189972 196568 202222 206510 209992 213539 217496 221524 224986 227407 228752 229560 230620 232258
56421 232258 234026 235311 236106 236838 237569 237806 237143 235645 233563 231056 228320 225555 222689 219541 216465
56406 216465 214381 213797 214084 214011 212838 210669 208101 205800 204126 202789 201071 198684 196208 194398 193261
56391 193261 192179 190715 188938 187061 185154 183183 181056 178693 176257 174266 173208 173055 173264 173146 172192
56376 172192 170345 168137 166310 165126 164223 163300 162545 162184 162040 161903 161996 162628 163702 164942 166289 167669
$$ packed form
56481A16941j510r74J35J245J659J114J74k47J36P26R05Q15R66J391J618J376
56465A26470R23O28N71O91J025J595K200K553K587K485K366K110J569R46O94R88
56449A50401J449J605J503J619K124K570K463J920J541J702K278L039M039N311
56435A83564O408O596N654M288L482L547L957M028L462K421J345Q08J060J638
56421B32258J768J285P95P32P31K37o63j498k082k507k736k765k866l148l076
56406B16465k084n84K87p3j173k169k568k301j674j337j718k387k476j810j137
56391A93261j082j464j777j877j907j971k127k363k436j991j058j53K09j18r54
56376A72192j847k208j827j184r03r23p55l61j44j37R3O32J074J240J347J380
$$ plain form
56360 167669 168678 169033 169055 169233 169562 169833 170267 171238 172565 173724 174679 175856 177348 178761 179815 180581 181161
56343 181161 181673 182558 184316 186848 189510 191839 193829 195557 197038 198449 200006 201631 203208 205070 207673
56328 207673 210867 214052 217018 219994 222922 225396 227449 229678 232374 235161 237765 240589 244254 249005
56314 249005 254695 260897 266920 272244 277101 282172 287638 293123 298605 304569 311028 317181 322470 327222
56300 327222 331739 335432 337571 338457 339113 340099 341235 342311 343458 344797 346174 347320 347985 348014 347498 346846
56284 346846 346481 346497 346663 346637 346143 345129 343891 342889 342394 342455 343172 344655 346733 349051 351535 354483 358173
56267 358173 362799 368792 376677 386423 397438 409446 422924 438363 455517 473786 493025 513589
56255 513589 535801 559765 585532 613076 642139 672280 702997 733679 763605 792236 819397
$$ packed form
56360A67669J009L55K2J78L29K71M34R71J327J159R55J177J492J413J054P66N80
56343A81161N12Q85J758K532K662K329J990J728J481J411J557J625J577J862K603
56328B07673L194L185K966K976K928K474K053K229K696K787K604K824L665M751
56314B49005N690O202O023N324M857N071N466N485N482N964O459O153N289M752
56300C27222M517L693K139Q86O56R86J136J076J147J339J377J146O65K9n16o52
56284C46846l65J6J66k6m94j014j238j002m95O1P17J483K078K318K484K948L690
56267C58173M626N993P885R746J1015J2008J3478J5439J7154J8269J9239K0564
56255E13589K2212K3964K5767K7544K9063L0141L0717L0682K9926K8631K7161
$$ plain form
56244 819397 845008 868741 890100 908786 924841 938474 949839 958971 965903 970817 973935 975297
56232 975297 974800 972568 968982 964116 957396 948124 936167 921850 905398 886864 866473 844646 821822
56219 821822 798568 775572 753097 730607 707449 683755 660322 637843 616730 597361 579887
56208 579887 563968 549328 536379 525689 517118 510182 505005 502035 500973 500927 501602 503357 506024 508630
56194 508630 510608 512456 514894 517998 521426 524873 528049 530731 533044 535314 537680 540227 543194 546370
56180 546370 548693 549402 549417 550481 553050 556136 559105 562341 566042 569830 573867 579033 585516 592445 599402
56165 599402 607002 615480 624002 632126 640669 650252 660109 669339 678332 687910 697947 707982 718547
56152 718547 730753 744985 760908 778363 797484 818343 841282 867250 897207 931592 971017
$$ packed form
56244H19397K5611K3733K1359J8686J6055J3633J1365R132O932M914L118J362
56232I75297m97k232l586m866o720r272j1957j4317j6452j8534k0391k1827k2824
56219H21822k3254k2996k2475k2490k3158k3694k3433k2479k1113j9369j7474
56208E79887j5919j4640j2949j0690q571o936n177k970j062m6O75J755K667K606
56194E08630J978J848K438L104L428L447L176K682K313K270K366K547K967L176
56180E46370K323P09J5J064K569L086K969L236L701L788M037N166O483O929O957
56165E99402P600Q478Q522Q124Q543R583R857R230Q993R578J0037J0035J0565
56152G18547J2206J4232J5923J7455J9121K0859K2939K5968K9957L4385L9425
$$ plain form
56141 971017 1017035 1071657 1136548 1213494 1305371 1416121 1549888 1710318 1900018 2119825
56131 2119825 2368076 2639634 2924318 3206433 3468096 3695529 3883640 4035982 4161901
56122 4161901 4273239 4380342 4487445 4590355 4678635 4740547 4767800 4759046 4721316 4667459 4609745
56111 4609745 4553698 4495967 4426141 4330652 4197921 4023259 3810545 3569905 3314315 3057488
56101 3057488 2812005 2586877 2386504 2212110 2063313 1938029 1832356 1742122 1664337 1596838
56091 1596838 1537560 1485007 1438681 1398293 1363134 1332615 1306488 1283985 1263766 1245252 1228984
56080 1228984 1215191 1203216 1192877 1184933 1179398 1174886 1170644 1167818 1167594 1169453 1172467 1177059 1184055
56067 1184055 1193079 1203141 1213933 1225453 1237415 1250128 1264834 1281973 1300154 1317985 1335828
$$ packed form
56141I71017M6018N4622O4891P6946R1877J10750J33767J60430J89700K19807
56131B119825K48251K71558K84684K82115K61663K27433J88111J52342J25919
56122D161901J11338J07103J07103J02910Q8280O1912K7253q754l7730n3857n7714
56111D609745n6047n7731o9826r5489j32731j74662k12714k40640k55590k56827
56101C057488k45483k25128k00373j74394j48797j25284j05673r0234p7785o7499
56091A596838n9278n2553m6326m0388l5159l0519k6127k2503k0219j8514j6268
56080A228984j3793j1975j0339p944n535m512m242k826k24J859L014M592O996
56067A184055R024J0062J0792J1520J1962J2713J4706J7139J8181J7831J7843
$$ plain form
56056 1335828 1354680 1374566 1395227 1417141 1440506 1464343 1487880 1511772 1536798 1562598 1588758
56045 1588758 1615801 1643891 1671965 1699380 1726959 1755273 1783719 1812724 1844965 1882504 1924189
56034 1924189 1967487 2011172 2054483 2095601 2133291 2168775 2204138 2240253 2277885 2318918 2364460
56023 2364460 2413405 2464759 2519488 2578138 2638953 2700743 2765355 2834586 2906790 2979465 3053155
56012 3053155 3129763 3209059 3290185 3374768 3464994 3560134 3658388 3760692 3869360 3984402 4104601
56001 4104601 4230755 4364439 4505083 4651748 4806258 4971085 5145646 5328297 5520332
55992 5520332 5724435 5941085 6170330 6415070 6678391 6959462 7256346 7570946 7906970
55983 7906970 8265249 8645757 9051945 9488053 9954438 10450918 10982638 11557281 12178970
$$ packed form
56056A335828J8852J9886K0661K1914K3365K3837K3537K3892K5026K5800K6160
56045A588758K7043K8090K8074K7415K7579K8314K8446K9005L2241L7539M1685
56034A924189M3298M3685M3311M1118L7690L5484L5363L6115L7632M1033M5542
56023B364460M8945N1354N4729N8650O0815O1790O4612O9231P2204P2675P3690
56012C053155P6608P9296Q1126Q4583R0226R5140R8254J02304J08668J15042J20199
56001D104601J26154J33684J40644J46665J54510J64827J74561J82651J92035
55992E520332K04103K16650K29245K44740K63321K81071K96884L14600L36024
55983G906970L58279L80508M06188M36108M66385M96480N31720N74643O21689
$$ plain form
55974 12178970 12850843 13581231 14381209 15258593 16221007 17282713 18462091 19775509 21241007
55965 21241007 22885511 24741791 26842832 29228608 31956708 35101120 38749505 43016035
55957 43016035 48056732 54066215 61267512 69915361 80301004 92745394 107607710 125326677
55949 125326677 146450354 171608037 201413005 236197787 275380560 316543397 354949020
55942 354949020 384416167 399564157 398107301 381608225 354315268 321155143 286221609
55935 286221609 252254213 220777253 192439821 167351141 145354103 126195409 109596268
55928 109596268 95280237 82991000 72491028 63547758 55935788 49454428 43932581
55921 43932581 39218222 35175848 31694479 28686187 26074300 23790429 21781387 20008408
$$ packed form
55974A2178970O71873P30388P99978Q77384R62414J061706J179378J313418J465498
55965B1241007J644504J856280K101041K385776K728100L144412L648385M266530
55957D3016035N040697O009483P201297Q647849J0385643J2444390J4862316J7718967
55949A25326677K1123677K5157683K9804968L4784782L9182773M1162837L8405623
55942C54949020K9467147J5147990j456856j6499076k7292957l3160125l4933534
55935B86221609l3967396l1476960k8337432k5088680k1997038j9158694j6599141
55928A09596268j4316031j2289237j0499972q943270p611970o481360n521847
55921D3932581m714359m042374l481369l008292k611887k283871k009042j772979
$$ plain form
55913 20008408 18437355 17036029 15779948 14652346 13637344 12718965 11886079 11131522
55905 11131522 10446159 9819441 9245108 8720383 8239933 7796333 7385911 7008389 6660976
55896 6660976 6338298 6037919 5760538 5504611 5265885 5042458 4835559 4645084 4468812
55887 4468812 4306173 4158421 4024817 3902782 3792119 3695303 3613458 3545724 3492456 3455018
55877 3455018 3432007 3419142 3412817 3409932 3404019 3385628 3347922 3289604 3212495 3119445 3014805 2903458
55865 2903458 2788335 2671016 2554695 2443741 2340306 2244167 2156015 2078003 2010980 1954169
55855 1954169 1907982 1874042 1851352 1834554 1816673 1792046 1757066 1711053 1657135 1600249 1543670
55844 1543670 1488798 1437567 1392439 1354078 1321472 1294504 1274031 1259357 1248126 1238954 1231841 1225748
$$ packed form
55913B0008408j571053j401326j256081j127602j015002r18379q32886p54557
55905A1131522o85363o26718n74333n24725m80450m43600m10422l77522l47413
55896F660976l22678l00379k77381k55927k38726k23427k06899j90475j76272
55887D468812j62639j47752j33604j22035j10663r6816q1845o7734n3268l7438
55877C455018k3011j2865o325k885n913j8391l7706n8318p7109r3050j04640j11347
55865B903458j15123j17319j16321j10954j03435r6139q8152p8012o7023n6811
55855A954169m6187l3940k2690j6798j7881k4627l4980m6013n3918n6886n6579
55844A543670n4872n1231m5128l8361l2606k6968k0473j4674j1231r172p113o093
$$ plain form
55832 1225748 1218269 1208226 1196294 1182539 1165497 1144412 1120422 1094846 1068006 1040260 1012463
55821 1012463 984805 956684 928191 900400 873998 848948 825500 804080 784299 765617 748803
55810 748803 735116 724291 715125 707697 703007 700642 698989 697820 698417 700980 704043 706738 709415 711560
55796 711560 711282 707568 701289 693358 683732 672869 662493 654109 647955 643599 639989 634754 625393 611802
55782 611802 596252 580627 565342 551116 539684 531908 526784 523002 520085 517464 514025 509233 503370
55769 503370 496207 486831 475249 462771 450388 438108 426075 414819 404181 393658 384035 376842
55757 376842 371807 366773 360682 354659 349488 344108 337592 330728 324385 318074 311365 305191 300318 295857
55743 295857 290636 284960 279766 275101 270590 266447 262915 259523 255937 252717 250344 248351 246282 244620
$$ packed form
55832A225748p479j0043j1932j3755j7042k1085k3990k5576k6840k7746k7797
55821A012463k7658k8121k8493k7791k6402k5050k3448k1420j9781j8682j6814
55810G48803j3687j0825r166p428m690k365j653j169N97K563L063K695K677K145
55796G11560k78l714o279p931r626j0863j0376q384o154m356l610n235r361j3591
55782F11802j5550j5625j5285j4226j1432p776n124l782k917k621l439m792n863
55769E03370p163r376j1582j2478j2383j2280j2033j1256j0638j0523r623p193
55757C76842n035n034o091o023n171n380o516o864o343o311o709o174m873m461
55743B95857n221n676n194m665m511m143l532l392l586l220k373j993k069j662
$$ plain form
55729 244620 243887 243635 243186 242496 241518 239602 236422 232676 229071 225426 221505 217842 214881 212141 209100
55714 209100 206108 203632 201406 199164 197429 196706 196631 196759 197463 199146 201278 203149 204968 207291 209900
55699 209900 212143 213918 215505 216806 217619 218376 219917 222752 227006 232717 239690 247310 254901 261981 268050
55684 268050 272709 276121 278653 279840 278516 274320 268195 261069 253016 244231 235773 228468 221843 214957
55670 214957 207648 200310 193146 186504 181302 178259 176961 176379 176012 176078 176992 179083 182385 186362 190352
55655 190352 194502 199612 205786 212079 217826 223353 228842 233467 236366 237678 237831 236572 233566 229297
55641 229297 224593 219792 215042 210812 207431 204755 202933 202770 204468 206735 208085 208439 208452 207848 205555
55626 205555 201280 195806 189813 183275 176068 168397 160547 152808 145690 139730 134939 130759 126619 122427
$$ packed form
55729B44620p33k52m49o90r78j916l180l746l605l645l921l663k961k740l041
55714B09100k992k476k226k242j735p23p5J28P04J683K132J871J819K323K609
55699B09900K243J775J587J301Q13P57J541K835M254N711O973P620P591P080O069
55684B68050M659L412K532J187j324m196o125p126q053q785q458p305o625o886
55670B14957p309p338p164o642n202l043j298n82l67O6R14K091L302L977L990
55655A90352M150N110O174O293N747N527N489M625K899J312J53j259l006m269
55641B29297m704m801m750m230l381k676j822j63J698K267J350L54J3o04k293
55626B05555m275n474n993o538p207p671p850p739p118n960m791m180m140m192
$$ plain form
55612 122427 118624 115781 113895 112110 109561 106427 103629 101540 99756 98139 97094 96548 95718 94310 92952
55597 92952 91940 90579 88479 86499 85574 85474 85553 85918 86854 87863 88340 88662 89589 91050 92513 94068 96161
55580 96161 98545 100505 101926 103374 105291 107756 110719 113929 117035 120356 124964 131309 138364 144881
55566 144881 150766 156265 160595 162665 162664 161655 159926 156999 153009 148716 144204 138904 132965 127326 122227
55551 122227 116841 110735 104638 99372 94981 91334 88643 86836 85096 82649 79533 76285 73365 71226
55537 71226 70342 70679 71535 72295 73038 73997 74791 74694 73582 72244 71664 72162 73294 74512 75785 77428 79431
55520 79431 81314 82796 84321 86644 90103 94490 99419 104540 109640 114801 120250 125854 131000 135172
55506 135172 138316 140408 141082 140044 137431 133422 127925 121122 113907 107208 101182 95583 90575 86481
$$ packed form
55612A22427l803k843j886j785k549l134k798k089j784j617j045n46q30j408j358
55597I2952j012j361k100j980r25j00P9L65R36J009M77L22R27J461J463J555K093
55580I6161K384J960J421J448J917K465K963L210L106L321M608O345P055O517
55566A44881N885N499M330K070jj009j729k927l990m293m512n300n939n639n099
55551A22227n386o106o097n266m391l647k691j807j740k447l116l248k920k139
55537G1226q84L37Q56P60P43R59P94r7j112j338n80M98J132J218J273J643K003
55520G9431J883J482J525K323L459M387M929N121N100N161N449N604N146M172
55506A35172L144K092O74j038k613m009n497o803p215o699o026n599n008m094
$$ plain form
55492 86481 82973 79226 74886 70369 66284 63015 60728 59270 58048 56452 54434 52362 50456 48725
55478 48725 47285 46324 45752 45221 44475 43486 42373 41351 40574 39933 39245 38723 38751 39063 38757 37532 36287 36029
55460 36029 36669 37409 37773 37676 37054 36125 35592 35870 36473 36788 37042 37782 38826 39589 40091 40783 41639 42260 42698
55441 42698 43295 43822 43618 42564 41163 39746 38352 37346 37309 38216 39346 40087 40333 40230 40129 40625 41890
55424 41890 43064 43086 42026 40863 40073 39329 38599 38570 39707 41687 43995 46364 48430 49684 50094 50134 49952
55407 49952 49124 47506 45687 44236 43077 42011 41332 41447 42212 43046 43510 43502 43111 42535 42041 41846 42082 42799
55389 42799 43802 44584 44689 44100 43072 41805 40529 39647 39319 39087 38375 37201 35938 34654 33308 32395
55373 32395 32634 33994 35651 36985 37997 38773 39160 39151 38978 38703 38136 37286 36411 35606 34767 33987 33502 33264
$$ packed form
55492H6481l508l747m340m517m085l269k287j458j222j596k018k072j906j731
55478D8725j440r61n72n31p46r89j113j022p77o41o88n22K8L12l06j225j245k58
55460C6029O40P40L64r7o22r29n33K78O03L15K54P40J044P63N02O92Q56O21M38
55441D2698N97N27k04j054j401j417j394j006l7R07J130P41K46j03j01M96J265
55424D1890J174K2j060j163p90p44p30k9J137J980K308K369K066J254M10M0j82
55407D9952q28j618j819j451j159j066o79J15P65Q34M64ql91n76m94j95K36P17
55389D2799J003P82J05n89j028j267j276q82l28k32p12j174j263j284j346r13
55373C2395K39J360J657J334J012P76L87rj73k75n67q50q75q05q39p80m85k38
$$ plain form
55355 33264 33015 32763 32748 33009 33501 34429 35813 36889 36740 35515 34227 33297 32154 30419 28621 27386 26712
55338 26712 26414 26596 27231 27823 27943 27656 27163 26547 26158 26593 27836 28912 28966 28328 28032 28554 29495 30290 30733
55319 30733 30847 30662 30247 29775 29454 29293 29005 28346 27616 27509 28177 28839 28784 28424 28710 29642 30118 29335 27755
55300 27755 26580 26699 28122 29949 30962 30759 30293 30731 31977 32950 33141 33057 33158 33332 33557 34142 35036 35743
55282 35743 36225 37017 38134 38745 38413 37836 37790 38101 38253 38336 38673 39080 39203 39171 39229 39114 38461 37634 37442 38172
55262 38172 39344 40366 41011 41308 41308 40960 40062 38486 36510 34718 33502 32901 32864 33260 33669 33670 33383 33105 32462
55243 32462 30725 28153 26075 25220 24850 24110 23401 23598 24568 25402 25773 26202 27138 28496 29991 31362 32340
55226 32340 32882 33301 33752 33827 33111 31961 31255 31446 32203 32812 32590 31220 29114 27283 26409 26200 26038 26008
$$ packed form
55355C3264k49k52j5K61M92R28J384J076j49j225j288r30j143j735j798j235o74
55338B6712k98J82O35N92J20k87m93o16l89M35J243J076N4o38k96N22R41P95M43
55319C0733J14j85m15m72l21j61k88o59p30j07O68O62n5l60K86R32M76p83j580
55300B7755j175J19J423J827J013k03m66M38J246R73J91q4J01J74K25N85Q94P07
55282C5743M82P92J117O11l32n77m6L11J52Q3L37M07J23l2N8j15o53q27j92P30
55262C8172J172J022O45K97%l48q98j576j976j792j216o01l7L96M09Jk87k78o43
55243C2462j737k572k078q55l70p40p09J97R70Q34L71M29R36J358J495J371R78
55226C2340N42M19M51P5p16j150p06J91P57O09k22j370k106j831q74k09j62l0
$$ plain form
55208 26008 26797 28673 31019 32863 33603 33336 32767 32688 33294 34104 34672 35076 35500 35765 35636 35289 35074 35075 35242
55189 35242 35644 36132 36081 35020 33405 32249 32084 32663 33503 34289 34814 34968 34790 34293 33359 32099 31100 30949
55171 30949 31621 32672 33801 34873 35622 35842 35795 35969 36448 36894 37100 37210 37408 37725 38154 38681 39190 39578
55153 39578 39879 40104 40138 40062 40303 41034 41585 40914 38739 35874 33442 31988 31322 30900 30330 29694 29383 29552
55135 29552 29903 30155 30425 30825 30973 30374 29205 28272 28223 29102 30562 32066 33000 33104 32914 33373 34872 36980
55117 36980 39188 41467 43916 46293 48285 50038 52017 54342 56491 57759 57850 57017 55789 54655 53869
55102 53869 53363 52816 51951 50780 49463 48047 46623 45663 45710 46476 46790 45951 44763 44578 45505 46331 46222 45725
55084 45725 45867 46908 48325 49542 50300 50667 50949 51311 51443 50957 50160 49770 49770 49254 47758 46024 44970 44587
$$ packed form
55208B6008P89J876K346J844P40k67n69p9O06Q10N68M04M24K65j29l47k15JJ67
55189C5242M02M88n1j061j615j156j65N79Q40P86N25J54j78m97r34j260r99j51
55171C0949O72J051J129J072P49K20m7J74M79M46K06J10J98L17M29N27N09L88
55153C9578L01K25L4p6K41P31N51o71k175k865k432j454o66m22n70o36l11J69
55135B9552L51K52K70M00J48n99j169r33m9Q79J460J504R34J04j90M59J499K108
55117C6980K208K279K449K377J992J753J979K325K149J268R1q33j228j134p86
55102E3869n06n47q65j171j317j416j424r60M7P66L14q39j188j85R27Q26j09m97
55084D5725J42J041J417J217P58L67K82L62J32m86p97l90%n16j496j734j054l83
$$ plain form
55066 44587 44447 44678 45602 46794 47370 47085 46443 45804 44993 43848 42595 41538 40750 40146 39658 39335 39374 39918
55048 39918 40781 41627 42543 43942 45669 46748 46491 45436 44611 44287 44130 44249 45306 47556 50447 53265
55032 53265 55721 57898 60038 62413 65016 67378 69028 70092 71141 72544 74338 76555 79209 81906
55018 81906 83971 85123 85770 86560 87740 88922 89370 88651 87136 85679 84707 83871 82735 81349 79842 77894
55002 77894 75173 72045 69336 67504 66432 65851 65523 65119 64317 63001 61193 58981 56726 54957 53738
54987 53738 52527 51041 49809 49380 49510 49709 50140 51183 52461 53225 53504 54004 54936 55824 56513 57479 58942
54970 58942 60438 61557 62547 63965 66248 69736 74517 80017 85262 89910 94688 100657 108345 117682 128357
54955 128357 140024 152544 166196 181427 198274 216110 233826 249917 262667 270824 274153 272972
$$ packed form
55066D4587j40K31R24J192N76k85o42o39q11j145j253j057p88o04m88l23L9N44
55048C9918Q63Q46R16J399J727J079k57j055q25l24j57J19J057K250K891K818
55032E3265K456K177K140K375K603K362J650J064J049J403J794K217K654K697
55018H1906K065J152O47P90J180J182M48p19j515j457r72q36j136j386j507j948
55002G7894k721l128k709j832j072n81l28m04q02j316j808k212k255j769j219
54987E3738j211j486j232m29J30J99M31J043J278P64K79N00R32Q88O89R66J463
54970E8942J496J119R90J418K283L488M781N500N245M648M778N969P688R337J0675
54955A28357J1667J2520J3652J5231J6847J7836J7716J6091J2750Q157L329j181
$$ plain form
54943 272972 267256 256825 242411 225888 209140 193047 177668 162978 149234 136977 126807 118917
54931 118917 112720 107212 101787 96589 92168 89063 87477 86971 86606 85837 85200 85674 87541 90314 93664
54916 93664 97773 102844 108896 116096 124732 134808 146138 158816 172997 188115 202835 215849 226263
54903 226263 233263 236068 234384 228415 218490 205315 190553 176270 163416 151387 139382 127668
54891 127668 117194 108424 100941 94048 87593 82366 79545 79413 80759 82007 82666 83125 83384 82982 82134
54876 82134 81817 82495 83587 84427 84900 84867 83946 82277 80653 79361 77680 75050 71992 69293 67009 64905
54860 64905 63222 62268 61753 61188 60558 60011 59339 58337 57287 56545 55996 55365 54608 53531 51622 48837 46044
54843 46044 44042 42616 41220 40044 39612 39788 40076 40570 41664 42981 43580 43242 42760 42905 43787 45223 46965
$$ packed form
54943B72972n716j0431j4414j6523j6748j6093j5379j4690j3744j2257j0170p890
54931A18917o197n508n425n198m421l105j586n06l65p69o37M74J867K773L350
54916I3664M109N071O052P200Q636J0076J1330J2678J4181J5118J4720J3014J0414
54903B26263P000K805j684n969r925j3175j4762j4283j2854j2029j2005j1714
54891A27668j0474q770p483o893o455n227k821j32J346J248O59M59K59m02q48
54876H2134l17O78J092Q40M73l3r21j669j624j292j681k630l058k699k284k104
54860F4905j683r54n15n65o30n47o72j002j050p42n49o31p57j077j909k785k793
54843D6044k002j426j396j176m32J76K88M94J094J317N99l38m82J45Q82J436J742
$$ plain form
54826 46965 48427 48943 48572 48125 48142 48334 48270 48134 48447 49324 50362 51223 52121 53701 56379 59804 63175 66212
54808 66212 69540 73902 79267 85102 91281 98259 106446 115901 126663 138991 153110 168889 185714
54795 185714 202480 217735 230152 238922 243712 244475 241601 236055 228981 221110 212706 203888 194773 185489
54781 185489 176374 168072 161056 155120 149677 144597 140468 137966 137174 137576 138622 140292 143157 147840 154427
54766 154427 162575 172179 183615 197242 213028 230857 250713 272167 293935 314404 332489 347783
54754 347783 360149 369532 375899 379001 378319 373603 365170 353350 337906 318603 296201 272381 248721
54741 248721 226094 204959 185666 168473 153593 141263 131438 123467 116464 109977 103958 98258 92650
54728 92650 87382 83158 80360 78591 77119 75516 73738 71872 69968 68004 65951 63948 62307 61153
$$ packed form
54826D6965J462N16l71m47J7J92o4j36L13Q77J038Q61Q98J580K678L425L371L037
54808F6212L328M362N365N835O179O978Q187R455J0762J2328J4119J5779J6825
54795A85714J6766J5255J2417Q770M790P63k874n546p074p871q404q818r115r284
54781A85489r115q302p016n936n443n080m129k502p92M02J046J670K865M683O587
54766A54427Q148R604J1436J3627J5786J7829J9856K1454K1768K0469J8085J5294
54754C47783J2366R383O367L102o82m716q433j1820j5444j9303k2402k3820k3660
54741B48721k2627k1135j9293j7193j4880j2330r825p971p003o487o019n700n608
54728I2650n268m224k798j769j472j603j778j866j904j964k053k003j641j154
$$ plain form
54714 61153 60143 58829 57299 56183 55987 56626 57604 58484 59196 60029 61285 62791 63973 64578 65119 66249
54698 66249 67815 68929 68987 68293 67635 67450 67504 67290 66794 66802 68193 70833 73526 75293 76346 77556 79383
54681 79383 81775 84641 87779 90616 92709 94427 96575 99399 102518 105621 108630 111262 113176 114616
54667 114616 116212 118102 119909 121657 124007 127431 131826 137118 143547 151142 159691 169628 182168 198081
54653 198081 216955 238277 262568 290656 322241 355853 389864 422617 451718 474108 487230
54642 487230 489945 482520 466381 443856 417478 389085 359695 330188 301723 275436 252033 231731
54630 231731 214254 198911 185057 172651 162063 153334 146015 139864 135163 132049 129861 127626 124952
54617 124952 122058 119108 116003 112796 109810 107211 104847 102667 100879 99414 97576 94648 90711 86550
$$ packed form
54714F1153j010j314j530j116j96O39R78Q80P12Q33J256J506J182O05N41J130
54698F6249J566J114N8o94o58j85N4k14m96QJ391K640K693J767J053J210J827
54681G9383K392K866L138K837K093J718K148K824L119L103L009K632J914J440
54667A14616J596J890J807J748K350L424M395N292O429P595Q549R937J2540J5913
54653A98081J8874K1322K4291K8088L1585L3612L4011L2753K9101K2390J3122
54642D87230K715p425j6139k2525k6378k8393k9390k9507k8465k6287k3403k0302
54630B31731j7477j5343j3854j2406j0588q729p319o151m701l114k188k235k674
54617A24952k894k950l105l207k986k599k364k180j788j465j838k928l937m161
$$ plain form
54603 86550 82875 79990 78043 77054 76600 75951 74808 73618 72904 72546 71996 71011 69934 69379 69871 71592 74128
54586 74128 76495 77742 77661 76806 75905 75357 75167 75093 74861 74479 74333 74800 75734 76522 76670 76222 75589 75124 74904
54567 74904 74810 74750 74808 75132 75678 76229 76744 77504 78689 80033 81150 82145 83582 85820 88657 91653 94523
54550 94523 97101 99214 100913 102789 105827 110770 117613 125764 134695 144353 154963 166643 179445 193526
54536 193526 208847 224595 239300 251617 260650 265478 265105 259465 250041 238767 226459 212918 198414
54523 198414 184262 171703 160858 151117 142075 133713 126043 119075 113046 108283 104812 102298 100354
54510 100354 98740 97294 95856 94274 92416 90243 87980 86152 85274 85449 86339 87541 88903 90355 91592
54495 91592 92195 92107 91740 91421 90968 90095 89046 88442 88569 89172 89998 91062 92317 93547 94773 96244 97752
$$ packed form
54603H6550l675k885j947r89m54o49j143j190p14l58n50r85j077n55M92J721K536
54586G4128K367J247q1q55r01n48j90p4k32l82j46M67R34P88J48m48o33m65k20
54567G4904r4o0N8L24N46N51N15P60J185J344J117R95J437K238K837K996K870
54550I4523K578K113J699J876L038M943O843Q151Q931R658J0610J1680J2802J4081
54536A93526J5321J5748J4705J2317R033M828l73n640r424j1274j2308j3541j4504
54523A98414j4152j2559j0845r741r042q362p670o968o029m763l471k514j944
54510A00354j614j446j438j582j858k173k263j828q78J75Q90J202J362J452J237
54495I1592O03q8l67l19m53q73j049o04J27O03Q26J064J255J230J226J471J508
$$ plain form
54478 97752 98487 98015 96996 96435 96529 96754 96772 96628 96256 95432 94170 92611 90587 87881 84955 82877 82335
54461 82335 83036 84057 84400 83433 81437 79730 79572 80749 81738 81443 80178 78731 77205 75287 73188 71665
54445 71665 71250 71824 72859 73766 74135 73953 73565 73321 73378 73843 74798 76010 76933 77222 77022 76554 75755 74649
54427 74649 73759 73704 74420 75202 75564 75782 76509 78031 80001 81788 83046 83988 85177 87024 89472 92099 94464
54410 94464 96352 97798 98908 99715 100255 100758 101571 102750 103912 104618 104790 104616 104253 103871 103672 103519 102739
54393 102739 100817 98217 96027 94783 94048 93165 91895 90248 88282 86302 84844 84132 83826 83446 82740 81549
54377 81549 79781 77788 76345 75894 76043 76089 75764 75257 74825 74678 74956 75502 75872 75878 75898 76418 77462 78716 79947
54358 79947 81078 82123 83370 85323 88080 90988 93315 95066 96674 98112 98895 98978 99080 99870 101159 102139
$$ packed form
54478I7752P35m72j019n61R4K25J8j44l72q24j262j559k024k706k926k078n42
54461H2335P01J021L43r67j996j707j58J177R89k95j265j447j526j918k099j523
54445G1665m15N74J035R07L69j82l88k44N7M65R55J212R23K89k00m68p99j106
54427G4649q90n5P16P82L62K18P27J522J970J787J258R42J189J847K448K627K365
54410I4464J888J446J110Q07N40N03Q13J179J162P06J72j74l63l82j99j53p80
54393A02739j922k600k190j244p35q83j270j647j966j980j458p12l06l80p06j191
54377H1549j768j993j443m51J49M6l25n07m32j47K78N46L70OK0N20J044J254J231
54358G9947J131J045J247J953K757K908K327J751J608J438P83Q3J02P90J289R80
$$ plain form
54342 102139 102236 101583 100771 100285 100128 99898 99204 97970 96303 94269 91948 89615 87579 85814 83926 81595
54326 81595 78969 76570 74802 73598 72542 71286 69757 67961 65794 63248 60626 58303 56310 54466
54312 54466 52849 51733 51052 50338 49362 48459 48015 47978 48141 48536 49205 49847 50088 49924 49565 49002 48121 47155 46549
54293 46549 46363 46229 46030 46252 47369 49001 50042 49748 48548 47614 47596 47994 47915 47276 46909 47517 48889 50287
54275 50287 51250 51759 51852 51493 50823 50216 49968 49986 49927 49631 49377 49605 50359 51223 51865 52388 52895 53075 52688 52217
54255 52217 52431 53311 54043 54139 53943 53844 53699 53357 53097 53098 53022 52643 52417 52811 53498 53828 53814 54001 54592 55278 55795
54234 55795 55987 55512 54142 52349 51004 50447 50349 50431 50720 51054 50986 50380 49617 49003 48419 47737 47110 46619 46053
54215 46053 45326 44712 44363 43871 42675 40700 38414 36482 35597 36250 38200 40362 41707 42319 43183 44881
$$ packed form
54342A02139R7o53q12m86j57k30o94j234j667k034k321k333k036j765j888k331
54326H1595k626k399j768j204j056j256j529j796k167k546k622k323j993j844
54312E4466j617j116o81p14r76r03m44l7J63L95O69O42K41j64l59n63q81r66o06
54293D6549j86j34j99K22J117J632J041k94j200r34j8L98p9o39l67O08J372J398
54275E0287R63N09R3l59o70o07k48J8n9k96k54K28P54Q64O42N23N07J80l87m71
54255E2217K14Q80P32R6j96r9j45l42k60Jp6l79k26L94O87L30j4J87N91O86N17
54234E5795J92m75j370j793j345n57r8Q2K89L34o8o06p63o14n84o82o27m91n66
54215D6053p27o14l49m92j196j975k286j932q85O53J950K162J345O12Q64J698
$$ plain form
54199 44881 46864 48157 48487 48414 48547 48981 49473 49805 49814 49334 48370 47264 46439 46030 45906 45966 46201 46493 46667
54180 46667 46723 46696 46312 45211 43672 42738 43271 45070 47072 48214 47997 46593 44779 43548 43373 43881 44411
54163 44411 44683 44735 44507 43902 43113 42525 42364 42679 43526 44800 46036 46704 46714 46384 45983 45532 44908 43908 42388
54144 42388 40642 39487 39598 40867 42656 44452 45957 46823 46904 46622 46547 46676 46605 46302 46124 46062 45642 44694
54126 44694 43696 43193 43337 44088 45276 46317 46552 46175 46230 47264 48474 48725 47925 46863 46021 45278 44675 44757
54108 44757 45945 47914 49803 50860 50848 50055 48977 47909 46867 45877 45183 44924 44864 44748 44847 45701 47227
54091 47227 48423 48322 47118 46063 46180 47261 48195 48149 47217 46027 45011 44231 43684 43459 43580 43922 44363
54074 44363 44870 45369 45629 45374 44496 43150 41635 40215 39004 38097 37715 38062 38984 39971 40627 40988 41357 42047
$$ packed form
54199D4881J983J293L30p3J33M34M92L32Rm80r64j106q25m09j24O0K35K92J74
54180D6667N6k7l84j101j539r34N33J799K002J142k17j404j814j231j75N08N30
54163D4411K72N2k28o05p89n88j61L15Q47J274J236O68J0l30m01m51o24j000j520
54144D2388j746j155J11J269J789J796J505Q66Q1k82p5J29p1l03j78o2m20r48
54126D4694r98n03J44P51J188J041K35l77N5J034J210K51q00j062q42p43o03Q2
54108D4757J188J969J889J057j2p93j078j068j042r90o94k59o0j16R9Q54J526
54091D7227J196j01j204j055J17J081R34m6r32j190j016p80n47k25J21L42M41
54074D4363N07M99K60k55q78j346j515j420j211r07l82L47R22R87O56L61L69O90
$$ plain form
54056 42047 43373 45472 47823 49317 49324 48534 48203 48718 49513 50296 51529 53451 55373 56575 57387 58696 60605
54039 60605 62249 63005 63295 63984 65350 66935 68213 69111 69989 71336 73559 76806 80810 84956 88692 91924
54023 91924 94905 97773 100402 102688 104684 106332 107436 108146 109166 111050 113448 115442 116551 116986 116984 116410
54007 116410 115123 113321 111365 109565 108191 107280 106334 104631 102103 99542 97660 96297 94859 93256 91996
53992 91996 91432 91246 90681 89128 86632 83965 82106 81412 81320 80965 79989 78679 77515 76731 76248 75842 75410
53975 75410 75053 74810 74393 73495 72348 71603 71576 71977 72532 73312 74179 74461 73759 72702 72229 72293 71989 70935 69807
53956 69807 69370 69601 70051 70556 71185 71868 72498 73192 74067 74972 75781 76820 78565 80961 83481 85922 88764
53939 88764 92548 97169 102028 106713 111369 116488 122535 129671 137606 145705 153414 160546 167046 172526
$$ packed form
54056D2047J326K099K351J494Pp90l31N15P95P83J233J922J922J202Q12J309J909
54039F0605J644P56K90O89J366J585J278Q98Q78J347K223L247M004M146L736L232
54023I1924K981K868K629K286J996J648J104P10J020J884K398J994J109M35kn74
54007A16410j287j802j956j800j374r11r46j703k528k561j882j363j438j603j260
53992I1996n64j86n65j553k496k667j859o94r2l55r76j310j164p84m83m06m32
53975G5410l57k43m17q98j147p45k7M01N55P80Q67K82p02j057m73O4l04j054j128
53956F9807m37K31M50N05O29O83O30O94Q75R05Q09J039J745K396K520K441K842
53939H8764L784M621M859M685M656N119O047P136P935Q099P709P132O500N480
$$ plain form
53925 172526 176292 177932 177719 176361 174446 172189 169562 166555 163404 160602 158663 157855 158199 159606 161764
53910 161764 163988 165606 166671 167924 169822 171968 173849 175799 178640 182475 186380 189380 191270 192313
53896 192313 192624 192164 191107 189915 189080 188827 188911 188617 187275 184965 182497 180449 178380 175264 170626 165004
53880 165004 159306 154029 149199 144817 141099 138256 136230 134712 133295 131587 129368 126821 124544 123055
53866 123055 122278 121703 121061 120542 120268 119949 119294 118492 117927 117559 116919 115643 113740 111372 108687 105833 103005
53849 103005 100470 98649 97902 98025 98160 97519 96093 94388 92697 90978 89205 87372 85357 83301 81933
53834 81933 81855 82563 82833 82118 80907 79681 78320 76855 76023 76492 77962 79499 80437 80624 80222 79678 79512
53817 79512 79658 79329 78010 76290 75228 75148 75531 75902 76221 76493 76579 76475 76321 76074 75570 75037 75152 76399
$$ packed form
53925A72526L766J640k13j358j915k257k627l007l151k802j939q08L44J407K158
53910A61764K224J618J065J253J898K146J881J950K841L835L905L000J890J043
53896A92313L11m60j057j192q35k53Q4k94j342k310k468k048k069l116m638n622
53880A65004n698n277m830m382l718k843k026j518j417j708k219k547k277j489
53866A23055p77n75o42n19k74l19o55q02n65l68o40j276j903k368k685k854k828
53849A03005k535j821p47J23J35o41j426j705j691j719j773j833k015k056j368
53834H1933p8P08K70p15j211j226j361j465q32M69J470J537R38J87m02n44j66
53817G9512J46l29j319j720j062q0L83L71L19K72Q6j04j54k47n04n33J15J247
$$ plain form
53799 76399 78585 81175 83857 86637 89520 92360 95014 97500 99973 102636 105719 109406 113561 117466
53785 117466 120175 121427 122112 123514 126101 129278 132174 134291 135443 135663 135342 135042 134871 134387 133267 131690
53769 131690 129761 127094 123441 119416 116028 113543 111288 108580 105498 102700 100752 99705 99095 98275 96836
53754 96836 94784 92438 90265 88713 87870 87230 86141 84608 83318 82753 82624 82375 81809 80979 79819 78227
53738 78227 76242 73882 71216 68851 67796 68370 69657 70575 71013 71353 71418 70835 70075 70058 70742 71176 71056 71175
53720 71175 71924 72441 71952 71192 71547 73201 75012 76040 76334 76153 75336 73858 72436 71900 72122 72096 71200 69955
53702 69955 69311 69505 70008 70446 71078 72263 73971 76033 78443 80960 82728 82911 81675 80058 78827 77863
53686 77863 76761 75516 74387 73466 72798 72674 73393 74749 76131 77253 78551 80682 83705 86921 89443
$$ packed form
53799G6399K186K590K682K780K883K840K654K486K473K663L083L687M155L905
53785A17466K709J252O85J402K587L177K896K117J152K20l21l00j71m84j120j577
53769A31690j929k667l653m025l388k485k255k708l082k798j948j047o10q20j439
53754I6836k052k346k173j552q43o40j089j533j290n65j29k49n66q30j160j592
53738G8227j985k360k666k365j055N74J287R18M38L40O5n83p60j7O84M34j20J19
53720G1175P49N17m89p60L55J654J811J028K94j81q17j478j422n36K22k6q96j245
53702F9955o44J94N03M38O32J185J708K062K410K517J768J83j236j617j231r64
53686G7863j102j245j129r21o68j24P19J356J382J122J298K131L023L216K522
$$ plain form
53671 89443 90743 90698 89527 87906 86844 86943 87767 88341 88288 88108 88284 88656 88864 88918 88976 88960 88826 88921 89616 90746
53651 90746 91801 92454 92585 92100 91226 90719 91213 92458 93719 94782 95916 96931 97062 96008 94496 93476
53635 93476 93180 93195 93089 92689 92081 91609 91637 92098 92522 92679 92896 93569 94542 95216 95159 94520 94004 94374 95659 96833
53615 96833 96636 94929 92909 91895 92252 93650 95832 98617 101430 103473 104448 104821 105308 106285 107681 109229
53599 109229 110775 112448 114551 117198 120073 122686 124841 126730 128520 129993 130752 130827 130881 131655 133247 135144
53583 135144 136946 138691 140406 141710 142214 142056 141675 141307 141072 141318 142322 143727 144853 145556 146208 146813
53567 146813 146807 145959 144846 144121 143797 143575 143352 143023 142327 141357 140797 141023 141350 140823 139554 138544 138318 138420
53549 138420 138239 137596 136433 134703 132880 131906 132117 132716 132783 132421 132362 132811 133369 134009 135332 137702 140647
$$ packed form
53671H9443J300m5j171j621j062R9Q24N74n3j80J76L72K08N4N8j6j34R5O95J130
53651I0746J055O53J31m85q74n07M94J245J261J063J134J015J31j054j512j020
53635I3476k96J5j06m00o08m72K8M61M24J57K17O73R73O74n7o39n16L70J285J174
53615I6833j97j707k020j014L57J398K182K785K813K043R75L73M87R77J396J548
53599A09229J546J673K103K647K875K613K155J889J790J473P59P5N4P74J592J897
53583A35144J802J745J715J304N04j58l81l68k35K46J004J405J126P03O52O05
53567A46813oq48j113p25l24k22k23l29o96r70n60K26L27n27j269j010k26J02
53549A38420j81o43j163j730j823r74K11N99O7l62n9M49N58O40J323K370K945
$$ plain form
53532 140647 143334 145214 146017 145667 144583 143695 143652 144122 144285 143861 143327 143263 143966 145630 148370 151929 155730
53515 155730 159352 162683 165606 168005 170197 172880 176418 180576 185166 190481 196749 203569 210346 216999
53501 216999 223758 230567 237233 243983 251315 259330 267663 276172 285261 295527 307249 320226 333782
53488 333782 347082 359773 372255 385045 398026 410705 423047 435506 448230 460744 472487
53477 472487 483293 493323 502934 512657 522895 533578 544459 555651 567346 579040 589742 599161
53465 599161 608123 617475 627075 636171 644328 651598 658173 664318 670413 676635 682750 688462 693754 698624
53451 698624 702715 705564 707064 707365 706480 704308 700929 696524 691032 684217 676134 667282 658123 648595 638303
53436 638303 627262 616261 606160 596717 586468 574203 560394 546762 534458 523163 511995 500650
$$ packed form
53532A40647K687J880Q03l50j084q88m3M70J63m24n34o4P03J664K740L559L801
53515A55730L622L331K923K399K192K683L538M158M590N315O268O820O777O653
53501B16999O759O809O666O750P332Q015Q333Q509R089J0266J1722J2977J3556
53488C33782J3300J2691J2482J2790J2981J2679J2342J2459J2724J2514J1743
53477D72487J0806J0030R611R723J0238J0683J0881J1192J1695J1694J0702R419
53465E99161Q962R352R600R096Q157P270O575O145O095O222O115N712N292M870
53451F98624M091K849J500L01q85k172l379m405n492o815q083q852r159r528j0292
53436F38303j1041j1001j0101r443j0249j2265j3809j3632j2304j1295j1168j1345
$$ plain form
53424 500650 489372 478286 467327 456621 446564 437535 429726 423137 417542 412601 408225 404776 402695
53411 402695 402037 402457 403600 405321 407637 410562 414074 418209 423142 428998 435533 442277 449243 457159 466576
53396 466576 476989 487463 498063 509905 523651 538677 554028 569551 585612 602279 619475
53385 619475 637670 657736 680066 704189 729233 754546 779986 805884 832678 860379 888483
53374 888483 916516 944509 972789 1001476 1030346 1059034 1087211 1114737 1141745 1168354 1194182
53363 1194182 1218382 1240334 1260115 1278237 1295157 1311114 1326050 1339573 1351286 1361318 1370176
53352 1370176 1377952 1384078 1388023 1389741 1389234 1386157 1380148 1371038 1358474 1341933 1321518 1298237 1272944
53339 1272944 1245584 1216090 1185513 1155372 1126146 1097194 1068068 1039086 1010578 982345 954133
$$ packed form
53424E00650j1278j1086j0959j0706j0057r029p809o589n595m941m376l449k081
53411D02695o58M20J143J721K316K925L512M135M933N856O535O744O966P916R417
53396D66576J0413J0474J0600J1842J3746J5026J5351J5523J6061J6667J7196
53385F19475J8195K0066K2330K4123K5044K5313K5440K5898K6794K7701K8104
53374H88483K8033K7993K8280K8687K8870K8688K8177K7526K7008K6609K5828
53363A194182K4200K1952J9781J8122J6920J5957J4936J3523J1713J0032Q858
53352A370176P776O126L945J718n07l077o009r110j2564j6541k0415k3281k5293
53339A272944k7360k9494l0577l0141k9226k8952k9126k8982k8508k8233k8212
$$ plain form
53328 954133 926164 898950 872869 847950 823785 799683 775267 750903 727212 704236 681563
53317 681563 659276 638237 619208 602026 585846 570000 554423 539390 525130 511818 499880
53306 499880 489939 482165 475824 469976 464607 460512 457957 456179 454491 453124 452459 452166 451905 452248 453939
53291 453939 456572 459011 460969 463199 466215 469853 474235 480154 488066 497402 507252 517168 527055 536911
53277 536911 547065 558158 570484 583664 597189 610853 624472 637716 650611 663730 677379
53266 677379 690849 702941 713141 722027 730599 739342 747842 755198 760935 765530 769815 773902 777020
53253 777020 778468 778382 777434 776086 774238 771291 766446 759207 749753 738637 726082 711954 696426 680272
53239 680272 664261 648566 632940 617139 600983 584302 567157 550020 533586 518362 504376
$$ packed form
53328I54133k7969k7214k6081k4919k4165k4102k4416k4364k3691k2976k2673
53317F81563k2287k1039j9029j7182j6180j5846j5577j5033j4260j3312j1938
53306D99880r941p774o341n848n369m095k555j778j688j367o65k93k61L43J691
53291D53939K633K439J958K230L016L638M382N919P912R336R850R916R887R856
53277E36911J0154J1093J2326J3180J3525J3664J3619J3244J2895J3119J3649
53266F77379J3470J2092J0200Q886Q572Q743Q500P356N737M595M285M087L118
53253G77020J448q6r48j348j848k947m845p239r454j1116j2555j4128j5528j6154
53239F80272j6011j5695j5626j5801j6156j6681j7145j7137j6434j5224j3986
$$ plain form
53228 504376 491083 477670 463764 449793 436381 423454 410350 396756 383011 369474 356130
53217 356130 343038 330564 318853 307473 296001 284679 274126 264576 255726 247318 239632 233294
53205 233294 228571 224823 220866 216095 211068 206652 202811 198723 193949 188882 184058 179674 175846 172694
53191 172694 169952 167079 163941 160850 157803 154394 150712 147570 145439 143827 142155 140589 139467 138550
53177 138550 137477 136361 135205 133285 130049 126336 123794 123120 123539 123877 123464 122088 119820 117100 114468
53162 114468 112081 109787 107537 105316 102892 100191 97798 96455 96132 96163 96233 96567 97136 97445 97271 96933 96585
53145 96585 95926 94899 94065 93766 93442 92375 90812 89739 89666 90117 90342 90152 89926 90008 90261 90250 89856 89562 89909
53126 89909 90777 91561 92081 92889 94382 96012 96784 96349 95230 94077 93143 92482 92185 92187 92090 91470 90293 88934
$$ packed form
53228E04376j3293j3413j3906j3971j3412j2927j3104j3594j3745j3537j3344
53217C56130j3092j2474j1711j1380j1472j1322j0553r550q850q408p686o338
53205B33294m723l748l957m771n027m416l841m088m774n067m824m384l828l152
53191A72694k742k873l138l091l047l409l682l142k131j612j672j566j122r17
53177A38550j073j116j156j920l236l713k542o74M19L38m13j376k268k720k632
53162A14468k387k294k250k221k424k701k393j343l23L1P0L34N69L09j74l38l48
53145I6585o59j027q34k99l24j067j563j073p3M51K25j90k26Q2K53j1l94k94L47
53126H9909Q68P84N20Q08J493J630P72m35j119j153r34o61k97Kr7o20j177j359
$$ plain form
53108 88934 87834 87250 87158 87256 87085 86356 85200 84043 83292 83245 84151 86006 88170 89578 89674 88998 88478 88307
53090 88307 87922 87097 86445 86559 87084 87098 86234 85011 84162 84106 85044 87025 89623 91833 92722 92205 91014 89903
53072 89903 89046 88269 87612 87428 87938 88978 90320 92036 94256 96696 98831 100602 102601 105356 108656 111783
53056 111783 114211 115845 116744 116932 116438 115313 113612 111503 109314 107340 105648 104199 102954 101701 99952
53041 99952 97404 94379 91519 89067 86825 84793 83390 82828 82621 82024 80759 79150 77711 76803 76476 76351
53025 76351 75790 74500 72932 71828 71406 71263 71075 70980 71131 71212 70726 69640 68427 67511 66896 66340 65703 65105
53007 65105 64900 65460 66760 68156 68800 68369 67223 65878 64576 63458 62771 62619 62758 62892 63011 63196 63223
52990 63223 62699 61562 60185 59073 58571 58709 59077 59047 58429 57789 57780 58323 58866 59324 60175 61639 63277 64552
$$ packed form
53108H8934j100n84r2R8j71p29j156j157p51m7R06J855K164J408R6o76n20j71
53090H8307l85q25o52J14N25J4q64j223q49n6R38J981K598K210Q89n17j191j111
53072H9903q57p77o57j84N10J040J342J716K220K440K135J771J999K755L300L127
53056A11783K428J634Q99J88m94j125j701k109k189j974j692j449j245j253j749
53041I9952k548l025k860k452k242k032j403n62k07n97j265j609j439r08l27j25
53025G6351n61j290j568j104m22j43j88r5J51Q1m86j086j213r16o15n56o37n98
53007F5105k05N60J300J396O44m31j146j345j302j118o87j52J39J34J19J85K7
52990F3223n24j137j377j112n02J38L68l0o18o40rN43N43M58Q51J464J638J275
$$ plain form
52972 64552 65323 65650 65545 65149 64789 64650 64692 64986 65685 66532 66850 66327 65454 64937 65057 65811 67129 68587 69410
52953 69410 69276 68769 68496 68162 67131 65594 64425 63975 63763 63386 63037 62910 62713 62143 61432 61061 61177 61589
52935 61589 62151 62851 63599 64176 64412 64345 64136 63852 63382 62668 62006 61951 62835 64492 66548 68743 70852 72582
52917 72582 73898 75275 77307 80113 83392 86904 90516 93925 96756 98979 100810 102174 102637 101991 100569
52902 100569 98870 97195 95762 94768 94007 92767 90495 87494 84632 82353 80263 77768 74864 72065 69659
52887 69659 67362 64855 62472 61030 60947 61774 62703 63322 63755 64257 64851 65201 64701 62955 60388 58195 57333
52870 57333 57685 58478 59306 60376 61822 63257 64085 63929 62730 60814 59000 58268 59023 60787 62773 64650
52854 64650 66694 69371 72874 76834 80347 82431 82724 81753 80402 79114 77708 75909 73873 72069 70741
$$ packed form
52972F4552P71L27j05l96l60j39M2K94O99Q47L18n23q73n17J20P54J318J458Q23
52953F9410j34n07k73l34j031j537j169m50k12l77l49j27j97n70p11l71J16M12
52935F1589N62P00P48N77K36o7k09k84m70p14o62n5Q84J657K056K195K109J730
52917G2582J316J377K032K806L279L512L612L409K831K223J831J364M63o46j422
52902A00569j699j675j433r94p61j240k272l001k862k279k090k495k904k799k406
52887F9659k297k507k383j442q3Q27R29O19M33N02N94L50n00j746k567k193q62
52870E7333L52P93Q28J070J446J435Q28j56j199j916j814p32P55J764J986J877
52854F4650K044K677L503L960L513K084K93r71j351j288j406j799k036j804j328
$$ plain form
52839 70741 69678 68607 67595 66880 66469 66191 66078 66303 66728 66894 66574 65916 64941 63374 61211 58924 56771
52822 56771 54432 51864 49973 49671 50562 51349 51425 51289 51445 51725 51809 51667 51268 50547 49929 50222 51599 53224
52804 53224 54214 54502 54394 53897 53056 52538 53188 55143 57814 60620 63321 65824 68169 70644 73482 76342
52788 76342 78440 79311 79236 78895 78809 79133 79788 80628 81506 82208 82460 82160 81586 81146 80841 80212 78947 77302 75743
52769 75743 74382 73001 71515 70131 69099 68455 67979 67324 66272 64967 63782 62877 61979 60707 59006 57204
52753 57204 55793 55163 55312 55708 55697 55228 54954 55371 56107 56378 55971 55419 55263 55503 55847 56171 56561 57077 57748
52734 57748 58773 60527 63189 66365 69221 71085 71793 71431 70030 67798 65428 63691 62693 61909 60998 60202
52718 60202 59818 59785 59980 60496 61244 61618 61063 59839 58824 58633 59158 59894 60402 60527 60421 60375 60465 60472 60224 59794
$$ packed form
52839G0741j063j071j012p15m11k78j13K25M25J66l20o58r75j567k163k287k153
52822E6771k339k568j891l02Q91P87P6j36J56K80Q4j42l99p21o18K93J377J625
52804E3224R90K88j08m97q41n18O50J955K671K806K701K503K345K475K838K860
52788G6342K098Q71p5l41q6L24O55Q40Q78P02K52l00n74m40l05o29j265j645j559
52769G5743j361j381j486j384j032o44m76o55j052j305j185r05q98j272j701j802
52753E7204j411o30J49L96j1m69k74M17P36K71m07n52j56K40L44L24L90N16O71
52734E7748J025J754K662L176K856J864P08l62j401k232k370j737r98p84r11p96
52718F0202l84l3J95N16P48L74n55j224j015j91N25P36N08J25j06m6R0Pk48m30
$$ plain form
52698 59794 59225 58322 57026 55717 54802 54202 53649 53317 53686 54858 56428 57998 59375 60310 60570 60385 60364
52681 60364 60745 61096 60929 60343 59825 59653 59730 59840 59868 59899 60186 60877 61705 62164 62101 61912 62033 62426 62725 62660 62158
52660 62158 61275 60310 59809 60125 61025 62008 63013 64489 66698 69156 70978 71730 71846 72261 73661 76071 79082
52643 79082 82400 86131 90527 95549 100690 105174 108226 109275 108126 105144 101195 97239 93799 90796
52629 90796 87935 85203 82892 81083 79289 76860 73752 70711 68530 67194 65875 63768 60852 57849
52615 57849 55542 54200 53572 53286 53143 53094 53142 53353 53846 54603 55326 55720 55911 56346 57209 58137 58759 59261 60140
52596 60140 61446 62641 63279 63466 63524 63489 63257 62985 62942 63031 62817 62154 61437 61117 61230 61627 62374 63562 64830
52577 64830 65533 65495 65292 65568 66268 66819 66924 66877 67080 67580 68153 68561 68487 67501 65542 63379 62148 62315 63445
$$ packed form
52698E9794n69r03j296j309r15o00n53l32L69J172J570J570J377R35K60j85k1
52681F0364L81L51j67n86n18j72P7J10K8L1K87O91Q28M59o3j89J21L93K99o5n02
52660F2158q83r65n01L16R00R83J005J476K209K458J822P52J16M15J400K410L011
52643G9082L318L731M396N022N141M484L052J049j149k982l949l956l440l003
52629I0796k861k732k311j809j794k429l108l041k181j336j319k107k916l003
52615E7849k307j342o28k86j43m9M8K11M93P57P23L94J91M35Q63R28O22N02Q79
52596F0140J306J195O38J87N8l5k32k72m3Q9k14o63p17l20J13L97P47J188J268
52577F4830P03l8k03K76P00N51J05m7K03N00N73M08p4r86j959k163j231J67J130
$$ plain form
52558 63445 65017 66994 69294 71240 72117 72069 71867 71896 71936 71840 71779 71677 71070 69860 68662 68067 67946 67826 67562
52539 67562 67249 66904 66674 66985 67943 68902 69163 68884 68729 68829 68766 68488 68478 68886 69091 68414 66921 65355 64553
52520 64553 64902 65971 66653 66113 64656 63253 62276 61287 60089 59290 59522 60668 62205 63770 65026 65500
52504 65500 65118 64582 64700 65524 66478 67042 66914 65916 64336 63166 63296 64429 65335 65280 64730 64498 64677 64772 64567
52485 64567 64418 64677 65148 65303 64929 64400 64262 64630 65070 65026 64351 63518 63320 64211 65768 66999 67360 67276 67491
52466 67491 68220 69277 70642 72203 73152 72574 70766 69141 68497 68158 67310 66401 66456 67498 68517 68836 68708
52449 68708 68602 68639 68914 69806 71622 74129 76622 78447 79451 80006 80462 80566 79768 78221 77026 77049 77829
52432 77829 78161 77565 76648 76139 76142 76384 76713 77150 77686 78171 78303 77861 77116 76777 77255 78149 78806 79162 79594 80128
$$ packed form
52558F3445J572J977K300J946Q77m8k02K9M0r6o1j02o07j210j198n95j21j20k64
52539F7562l13l45k30L11R58R59K61k79j55J00o3k78j0M08K05o77j493j566q02
52520F4553L49J069O82n40j457j403r77r89j198p99K32J146J537J565J256M74
52504F5500l82n36J18Q24R54N64j28r98j580j170J30J133R06n5n50k32J79R5k05
52485F4567j49K59M71J55l74n29j38L68M40m4o75q33j98Q91J557J231L61q4K15
52466F7491P29J057J365J561R49n78j808j625o44l39q48r09N5J042J019L19j28
52449F8708j06L7K75Q92J816K507K493J825J004N55M56J04p98j547j195K3P80
52432G7829L32n96r17n09LK42L29M37N36M85J32m42p45l39M78Q94O57L56M32N34
$$ plain form
52412 80128 80367 80155 79819 79656 79611 79518 79311 78948 78506 78371 78930 80044 81158 81909 82253 82038 81063 79687 78872
52393 78872 79268 80561 81920 82789 83094 83039 82954 83126 83519 83855 84078 84476 85207 85925 86126 85684 84905 84166 83635
52374 83635 83238 82772 82198 81829 82053 82809 83555 83881 83999 84511 85748 87352 88474 88473 87594 86775 86592 86611 86146
52355 86146 85388 85222 86008 87165 88075 88756 89406 89965 90534 91689 93802 96333 98375 99700 100767 101817
52339 101817 102476 102404 101960 101990 103067 105005 107028 108414 109006 109162 109271 109538 110142 111241 112637 113708 113975
52322 113975 113623 113304 113522 114304 115248 115761 115501 114815 114575 115268 116424 117188 117352 117524 118354 119966 122177 124869
52304 124869 127953 131143 134009 136268 138024 139775 142154 145506 149582 153709 157318 160313 162948 165417
52290 165417 167659 169601 171446 173589 176212 179089 181867 184341 186266 187113 186444 184651 183018 182742 184007
$$ packed form
52412H0128K39k12l36j63m5r3k07l63m42j35N59J114J114P51L44k15r75j376q15
52393G8872L96J293J359Q69L05n5q5J72L93L36K23L98P31P18K01m42p79p39n31
52374H3635l97m66n74l69K24P56P46L26J18N12J237J604J122jq79q19j83J9m65
52355H6146p58j66P86J157R10O81O50N59N69J155K113K531K042J325J067J050
52339A01817O59p2m44L0J077J938K023J386N92J56J09K67O04J099J396J071K67
52322A13975l52l19K18P82R44N13k60o86k40O93J156P64J64J72Q30J612K211K692
52304A24869L084L190K866K259J756J751K379L352M076M127L609K995K635K469
52290A65417K242J942J845K143K623K877K778K474J925Q47o69j793j633k76J265
$$ plain form
52275 184007 186069 188091 189649 190603 190923 190810 190739 191033 191440 191417 190914 190655 191369 192949 194639 195966 197097
52258 197097 198250 199252 199961 200693 201885 203586 205642 208109 210997 213832 216026 217691 219584 222180 225199
52243 225199 228149 230909 233673 236643 239912 243383 246684 249481 251898 254345 256882 259138 260993 262940
52229 262940 265591 269056 272893 276338 278542 279076 278478 277982 278481 280025 282409 285719 289937 294422 298304
52214 298304 301311 303877 306563 309627 313001 316442 319780 323168 326923 330999 334892 338264 341407 344812
52200 344812 348505 352105 355354 358352 361419 364945 369224 374149 379235 384112 388811 393377 397491 400799
52186 400799 403486 406173 409249 412455 415016 416115 415535 414054 412905 412528 412098 410564 407929 405123 402861
52171 402861 401087 399411 397593 395564 393382 391258 389374 387567 385465 383035 380852 379675 379719 380275 380090
$$ packed form
52275A84007K062K022J558R54L20j13p1K94M07k3n03k59P14J580J690J327J131
52258A97097J153J002P09P32J192J701K056K467K888K835K194J665J893K596L019
52243B25199K950K760K764K970L269L471L301K797K417K447K537K256J855J947
52229B62940K651L465L837L445K204N34n98m96M99J544K384L310M218M485L882
52214B98304L007K566K686L064L374L441L338L388L755M076L893L372L143L405
52200C44812L693L600L249K998L067L526M279M925N086M877M699M566M114L308
52186D00799K687K687L076L206K561J099n80j481j149l77m30j534k635k806k262
52171D02861j774j676j818k029k182k124j884j807k102k430k183j177M4N56j85
$$ plain form
52156 380090 378374 375485 372411 369569 366544 363176 360235 358496 357537 356178 353967 351583 349763 348472
52142 348472 347311 346213 345405 344945 344562 343885 342778 341561 340797 340680 340693 340113 338751 336951 334985 332879
52126 332879 330854 329467 329139 329688 330413 330500 329474 327531 325445 323849 322585 320986 318715 315990 313000
52111 313000 309605 305740 301778 298214 295252 292944 291537 291364 292395 294065 295625 296654 297245 297778 298554
52096 298554 299705 301290 303261 305370 307512 310232 314400 320023 325746 330099 333044 335824 339402 343630
52082 343630 347851 351723 355272 358584 361687 364469 366580 367713 368027 368062 368246 368748 369696 371086 372569 373889
52066 373889 375529 378188 381472 383844 384373 383954 384235 385783 387906 389942 391930 394094 396350 398495 400421
52051 400421 402000 403151 404178 405654 407720 409775 411083 411487 411295 410700 409704 408516 407514 406692 405504
$$ packed form
52156C80090j716k889l074k842l025l368k941j739r59j359k211k384j820j291
52142C48472j161j098q08m60l83o77j107j217p64j17J3n80j362j800j966k106
52126C32879k025j387l28N49P25Q7j026j943k086j596j264j599k271k725k990
52111C13000l395l865l962l564k962k308j407j73J031J670J560J029N91N33P76
52096B98554J151J585J971K109K142K720M168N623N723M353K945K780L578M228
52082C43630M221L872L549L312L103K782K111J133L14L5J84N02R48J390J483J320
52066C73889J640K659L284K372N29m19K81J548K123K036J988K164K256K145J926
52051D00421J579J151J027J476K066K055J308M04j92n95r96j188j002q22j188
$$ plain form
52036 405504 403554 401171 398973 397017 394836 392189 389274 386144 382495 378287 374086 370441 367272 364319
52022 364319 361812 360166 359252 358479 357435 355969 353854 351029 348130 346128 345324 345219 345357 345705 346141 346267
52006 346267 346043 345989 346365 346614 345988 344350 342038 339394 336804 334790 333487 332256 330282 327444 324268 321232
51990 321232 318473 315972 313581 310957 307816 304222 300339 296137 291757 287960 285580 284346 282683 278965
51976 278965 272744 264624 255266 244938 233999 223298 213684 205225 197328 189768 183163 178032 173710
51963 173710 168871 163130 157515 153137 149983 147345 144893 142778 141002 139295 137533 135851 134384 133212
51949 133212 132468 132168 132039 131833 131642 131548 131161 130021 128407 127158 126582 126082 125064 123763 122780 122158 121362
51932 121362 120094 118636 117293 115873 114023 111923 110230 109187 108153 106403 104249 102794 102528 102720 102522
$$ packed form
52036D05504j950k383k198j956k181k647k915l130l649m208m201l645l169k953
52022C64319k507j646r14p73j044j466k115k825k899k002q04j05J38L48M36J26
52006C46267k24n4L76K49o26j638k312k644k590k014j303j231j974k838l176l036
51990C21232k759k501k391k624l141l594l883m202m380l797k380j234j663l718
51976B78965o221q120r358j0328j0939j0701r614q459p897p560o605n131m322
51963A73710m839n741n615m378l154k638k452k115j776j707j762j682j467j172
51949A33212p44l00j29k06j91r4l87j140j614j249n76n00j018j301r83o22p96
51932A21362j268j458j343j420j850k100j693j043j034j750k154j455k66J92j98
$$ plain form
51917 102522 102161 102466 103532 104508 104641 103963 102942 102051 101832 102715 104377 105671 105718 104870 104219 104282 104593 104575
51899 104575 104372 104549 105240 105951 106222 106194 106332 106736 107045 107019 106913 107112 107666 108415 109330 110354 111086 111108 110731
51880 110731 110984 112647 115521 118766 121653 123792 125026 125583 126232 127883 130842 134676 138777 142921 147249
51865 147249 151958 157229 163397 171051 180938 193716 209769 229220 252218 279178 310698 347162
51853 347162 388178 431858 474097 508700 529235 531932 517435 489917 454601 415920 377155 340545
51841 340545 307215 277412 251243 229012 210589 194905 180655 167456 155822 146063 137751 130396
51829 130396 124082 119122 115399 112402 109732 107286 105125 103416 102348 101806 101251 100186 98738 97485 96730
51814 96730 96232 95729 95391 95507 95888 95955 95428 94641 94002 93376 92342 90945 89755 89075 88527 87687 86780 86326
$$ packed form
51917A02522l61L05J066R76J33o78j021q91k19Q83J662J294M7q48o51O3L11j8
51899A04575k03J77O91P11K71k8J38M04L09k6j06J99N54P49R15J024P32K2l77
51880A10731K53J663K874L245K887K139J234N57O49J651K959L834M101M144M328
51865A47249M709N271O168P654R887J2778J6053J9451K2998K6960L1520L6464
51853C47162M1016M3680M2239L4603K0535K697j4497k7518l5316l8681l8765l6610
51841C40545l3330k9803k6169k2231j8423j5684j4250j3199j1634r759q312p355
51829A30396o314m960l723k997k670k446k161j709j068n42n55j065j448j253p55
51814I6730m98n03l38J16L81O7n27p87o39o26j034j397j190o80n48q40r07m54
$$ plain form
51796 86326 86406 86721 87220 88057 88937 89154 88457 87414 86694 86373 86088 85503 84466 83150 82187 82199 82947 83473 83354
51777 83354 83248 83826 84719 85097 84783 84143 83311 82314 81645 81913 82956 84019 84712 85143 85238 84807 84305 84659 86043
51758 86043 87573 88538 89196 90011 90772 91076 91105 91302 91560 91418 90948 90878 91775 93410 94923 95403 94507 92792
51740 92792 91392 91001 91163 90701 88881 86042 83170 81014 79641 78762 78373 78851 80203 81548 81833 81080
51724 81080 80347 80342 80657 80696 80722 81390 82668 83880 84672 85253 85741 85846 85386 84652 84100 83923 84004 84034 83710 83095
51704 83095 82774 83244 84134 84421 83487 81706 79907 78665 78161 78243 78343 77765 76445 75173 74743 75097 75644 76219
51686 76219 77240 78979 81111 83050 84408 84989 84694 83663 82356 81310 80799 80792 81162 81800 82558 83146 83155 82350
51668 82350 81043 80108 80389 81990 84217 86221 87572 88311 88763 89428 90728 92623 94541 95946 96915 98041
$$ packed form
51796H6326Q0L15M99Q37Q80K17o97j043p20l21k85n85j037j316r63J2P48N26j19
51777H3354j06N78Q93L78l14o40q32r97o69K68J043J063O93M31R5m31n02L54J384
51758H6043J530R65O58Q15P61L04K9J97K58j42m70p0Q97J635J513M80q96j715
51740I2792j400l91J62m62j820k839k872k156j373q79l89M78J352J345K85p53
51724H1080p33nL15L9K6O68J278J212P92N81M88J05m60p34n52j77Q1L0l24o15
51704H3095l21M70Q90K87r34j781j799j242n04Q2J00n78j320j272m30L54N47N75
51686G6219J021J739K132J939J358N81k95j031j307j046n11pL70O38P58N88Rq05
51668H2350j307r35K81J601K227K004J351P39M52O65J300J895J918J405R69J126
$$ plain form
51652 98041 99881 102643 106266 110434 114469 117523 119064 119214 118608 118006 117878 118112 118093 117317 115939 114531
51636 114531 113312 111940 110103 108004 106105 104629 103507 102571 101616 100499 99366 98583 98213 97781 96843 95594
51620 95594 94622 94223 94206 94236 94024 93346 92262 91257 90786 90679 90370 89730 89270 89387 89741 89570 88483 86870
51602 86870 85614 85343 85780 85949 85346 84695 85116 86629 88081 88570 88294 87830 87312 86780 86772 87819 89588 91133
51584 91133 91970 92469 93233 94434 95700 96392 96043 94864 93746 93480 94010 94675 95073 95373 95883 96607 97286 97622
51566 97622 97536 97346 97558 98321 99304 100348 101889 104251 106797 108392 108705 108538 108889 110225 112614 115817 119025
51549 119025 121186 122032 122295 122612 122697 122047 120951 120159 119870 119672 119310 118899 118449 117831 117305 117467 118399 119327
51531 119327 119447 118830 118192 118008 118207 118596 119191 119948 120417 119987 118547 116755 115417 114568 113396 111164 108038
$$ packed form
51652I8041J840K762L623M168M035L054J541J50o06o02j28K34j9p76j378j408
51636A14531j219j372j837k099j899j476j122r36r55j117j133p83l70m32r38j249
51620I5594r72l99j7L0k12o78j084j005m71j07l09o40m60J17L54j71j087j613
51602H6870j256k71M37J69o03o51M21J513J452M89k76m64n18n32qJ047J769J545
51584I1133Q37M99P64J201J266O92l49j179j118k66N30O65L98L00N10P24O79L36
51566I7622q6j90K12P63R83J044J541K362K546J595L13j67L51J336K389L203L208
51549A19025K161Q46K63L17Q5o50j096p92k89j98l62m11m50o18n26J62R32R28
51531A19327J20o17o38j84J99L89N95P57M69m30j440j792j338q49j172k232l126
$$ plain form
51514 108038 104834 102115 99802 97585 95400 93422 91803 90539 89469 88358 87088 85796 84727 83899
51500 83899 83040 81910 80583 79374 78566 78206 78071 77818 77250 76426 75474 74375 73115 72021 71685 72464 74158
51483 74158 76195 78017 79322 80146 80757 81349 81829 82084 82359 83014 83911 84433 84274 83848 83666 83735 83898 84440
51465 84440 85787 87736 89481 90465 90901 91396 92365 93887 95804 97895 100107 102658 105723 109108 112544
51450 112544 116191 120400 124893 128604 130596 130765 129419 126564 122087 116462 110761 105928 102334 100008
51436 100008 98940 98968 99609 100196 100204 99451 98199 97155 97175 98647 101034 103173 104149 103908 103002 101921 100891
51419 100891 100231 100467 101786 103603 105043 105738 105847 105349 103935 101716 99528 98098 97141 95688 93200 90032
51403 90032 86890 84233 82180 80655 79471 78505 77921 78035 78807 79589 79543 78326 76340 74359 72975 72341
$$ packed form
51514A08038l204k719k313k217k185j978j619j264j070j111j270j292j069q28
51500H3899q59j130j327j209q08l60j35k53n68q24r52j099j260j094l36P79J694
51483G4158K037J822J305Q24O11N92M80K55K75O55Q97N22j59m26j82O9J63N42
51465H4440J347J949J745R84M36M95R69J522J917K091K212K551L065L385L436
51450A12544L647M209M493L711J992J69j346k855m477n625n701m833l594k326
51436A00008j068K8O41N87Qp53j252j044K0J472K387K139R76k41r06j081j030
51419A00891o60K36J319J817J440O95J09m98j414k219k188j430r57j453k488l168
51403I0032l142k657k053j525j184r66n84J14P72P82m6j217j986j981j384o34
$$ plain form
51387 72341 72314 72656 73079 73286 73217 73215 73696 74573 75261 75397 75287 75460 76053 76923 78117 79756 81498 82655 82980
51368 82980 83053 83685 85162 87094 88736 89353 88675 87269 86167 85811 85558 84603 83183 82384 82803 83885 84740
51351 84740 85141 85432 85856 86451 87360 88669 89898 90196 89246 87636 86075 84598 82838 80796 78870 77297
51335 77297 76026 75095 74679 74727 74991 75505 76598 78231 79785 80793 81493 82284 82930 82819 81865 80704 80002
51318 80002 79905 80250 80958 82052 83435 84794 85741 86071 85876 85292 84209 82465 80350 78538 77296 76117
51302 76117 74455 72528 71018 70215 69913 69903 70047 69960 69262 68132 67153 66534 65990 65460 65428 66297 67878 69662
51284 69662 71243 72376 73099 74006 75912 78932 82278 85249 87947 90690 93221 95063 96332 97508 98546
51269 98546 98922 98542 97984 97586 96869 95228 92904 90787 89393 88398 87271 86006 84989 84342 83736 82926 82139
$$ packed form
51387G2341k7L42M23K07o9kM81Q77O88J36j10J73N93Q70J194J639J742J157L25
51368H2980P3O32J477J932J642O17o78j406j102l56k53r55j420p99M19J082Q55
51351H4740M01K91M24N95R09J309J229K98r50j610j561j477j760k042j926j573
51335G7297j271r31m16M8K64N14J093J633J554J008P00P91O46j11r54j161p02
51318H0002r7L45P08J094J383J359R47L30j95n84j083j744k115j812j242j179
51302G6117j662j927j510q03l02j0J44q7o98j130r79o19n44n30l2Q69J581J784
51284F9662J581J133P23R07J906L020L346K971K698K743K531J842J269J176J038
51269I8546L76l80n58l98p17j641k324k117j394r95j127j265j017o47o06q10p87
$$ plain form
51252 82139 81743 81724 81768 81754 81807 81951 81990 81840 81671 81616 81553 81278 80756 80151 79798 80148 81451 83376 85173 86300
51232 86300 86714 86585 86084 85524 85306 85498 85721 85690 85629 85926 86562 87072 86992 86289 85546 85689 87164 89312 90912
51213 90912 91430 91379 91449 91846 92608 93819 95153 95782 95308 94296 93425 92622 91600 90678 90291 90137 89667 89110
51195 89110 89097 89457 89363 88651 88030 87832 87545 86811 86064 85770 85739 85626 85476 85345 84959 84268 83925 84622 86272 88188
51175 88188 89839 91086 91997 92823 93879 95157 96229 96770 96834 96418 95233 93288 91247 89699 88446 87071
51159 87071 85877 85595 86309 87346 88218 89041 89989 90909 91698 92566 93678 94877 96003 97207 98709 100415
51143 100415 101993 103223 104098 104687 105056 105326 105739 106649 108332 110634 112847 114110 114086 113172 112038 111018
51127 111018 109987 108728 107332 106211 105689 105666 105828 106169 107035 108541 110238 111629 112817 114274 116043 117546
$$ packed form
51252H2139l96j9M4j4N3J44L9j50j69n5o3k75n22o05l53L50J303J925J797J127
51232H6300M14j29n01n60k18J92K23l1o1K97O36N10q0p03p43J43J475K148J600
51213I0912N18n1P0L97P62J211J334O29m74j012q71q03j022r22l87j54m70n57
51195H9110j3L60r4p12o21j98k87p34p47k94l1j13j50j31l86o91l43O97J650J916
51175H8188J651J247R11Q26J056J278J072N41O4m16j185j945k041j548j253j375
51159H7071j194k82P14J037Q72Q23R48R20P89Q68J112J199J126J204J502J706
51143A00415J578J230Q75N89L69K70M13R10J683K302K213J263k4r14j134j020
51127A11018j031j259j396j121n22k3J62L41Q66J506J697J391J188J457J769J503
$$ plain form
51111 117546 118236 118079 117332 116140 114506 112455 110073 107529 105129 103090 101201 99007 96560 94689 94156
51096 94156 94669 95108 94711 93718 92818 92364 92312 92605 93225 93994 94678 95285 95964 96574 96737 96491 96540 97485 98988
51077 98988 100110 100490 100791 101895 103939 106288 108146 108983 108676 107593 106470 105916 105975 106247 106321 105993 105250
51060 105250 104305 103509 102970 102340 101337 100382 100352 101599 103491 105033 105686 105515 104869 104120 103501 102999 102475 102016
51042 102016 101877 101974 101734 100826 99865 99967 101572 103997 106226 107880 109283 110780 112266 113372 113959 114290
51026 114290 114703 115211 115568 115749 116191 117434 119551 122006 124010 125006 124980 124466 124138 124212 124320 124066 123562 123154
51008 123154 122805 122143 121135 120290 120054 120318 120733 121292 122350 124277 127254 131217 135724 140022 143545 146369
50992 146369 148992 151764 154705 157800 161218 165227 170096 175997 182833 190173 197515 204525 210823 215740
$$ packed form
51111A17546O90j57p47j192j634k051k382k544k400k039j889k194k447j871n33
51096I4156N13M39l97r93r00m54n2K93O20P69O84O07O79O10J63k46M9R45J503
51077I8988J122L80L01J104K044K349J858Q37l07j083j123n54N9K72P4l28p43
51060A05250r45p96n39o30j003r55l0J247J892J542O53j71o46p49o19n02n24m59
51042A02016j39R7k40r08r61J02J605K425K229J654J403J497J486J106N87L31
51026A14290M13N08L57J81M42J243K117K455K004R96k6n14l28P4J08k54n04m08
51008A23154l49o62j008q45k36K64M15N59J058J927K977L963M507M298L523K824
50992A46369K623K772K941L095L418M009M869N901O836P340P342P010O298M917
$$ plain form
50978 215740 218726 220041 220670 221400 222332 223358 224693 226592 228908 231383 234257 238110 243098 248701 254394
50963 254394 260234 266608 273598 280920 288457 296555 305590 315437 325616 335969 346874 358684 371265
50950 371265 384343 398046 412640 427829 442835 457179 470924 483999 495755 505436 512626 516937
50938 516937 517804 515138 509831 502957 494599 484034 470921 455704 438938 420995 402602 384842 368177
50925 368177 351984 335568 319266 304045 290362 278039 267113 258037 250850 244646 238382 232044
50913 232044 226681 223213 221377 219910 217694 214606 211281 208299 205763 203569 201788 200673 200405 200894 201734
50898 201734 202395 202634 202780 203390 204565 205834 206800 207641 208779 210321 212101 214121 216563 219353 221961 223812
50882 223812 224871 225820 227594 230564 234137 237435 240456 244291 249951 257303 265496 274147 283660 294506
$$ packed form
50978B15740K986J315O29P30R32J026J335J899K316K475K874L853M988N603N693
50963B54394N840O374O990P322P537Q098R035R847J0179J0353J0905J1810J2581
50950C71265J3078J3703J4594J5189J5006J4344J3745J3075J1756R681P190M311
50938E16937Q67k666n307o874q358j0565j3113j5217j6766j7943j8393j7760j6665
50925C68177j6193j6416j6302j5221j3683j2323j0926r076p187o204o264o338
50913B32044n363l468j836j467k216l088l325k982k536k194j781j115k68M89Q40
50898B01734O61K39J46O10J175J269R66Q41J138J542J780K020K442K790K608J851
50882B23812J059R49J774K970L573L298L021L835N660P352Q193Q651R513J0846
$$ plain form
50868 294506 306777 320429 335410 351412 367974 384961 402454 419973 436337 450643 462998
50857 462998 473915 483467 491489 498205 504006 508949 513168 517684 523917 532218 541518 550695 559709 569177
50843 569177 579465 590678 603061 616881 632144 648914 667642 688680 711669 735939 761438
50832 761438 788823 818674 851050 885629 921652 957603 991500 1021775 1047553 1068050 1082228
50821 1082228 1089349 1089531 1083473 1071883 1055277 1033933 1007839 977130 942936 907357 872124 837565
50809 837565 803320 769677 737587 707555 679307 652672 628113 606147 586788 569894 555682
50798 555682 544500 536385 531215 529118 530269 534299 540301 547575 556108 566102 577147 588117 597970
50785 597970 606461 613924 620432 625468 628500 629630 629426 628185 625609 621249 615124 607822 600027 591960
$$ packed form
50868B94506J2271J3652J4981J6002J6562J6987J7493J7519J6364J4306J2355
50857D62998J0917R552Q022O716N801M943M219M516O233Q301R300R177R014R468
50843E69177J0288J1213J2383J3820J5263J6770J8728K1038K2989K4270K5499
50832G61438K7385K9851L2376L4579L6023L5951L3897L0275K5778K0497J4178
50821A082228P121J82o058j1590j6606k1344k6094l0709l4194l5579l5233l4559
50809H37565l4245l3643l2090l0032k8248k6635k4559k1966j9359j6894j4212
50798E55682j1182q115n170k097J151M030O002P274Q533R994J1045J0970R853
50785E97970Q491P463O508N036L032J130k04j241k576m360o125p302p795q067
$$ plain form
50771 591960 583296 573710 563522 553779 545638 539736 536047 534151 533644 534635 538041 545089 556286 570970
50757 570970 587948 606255 624983 642754 657882 669096 675918 678574 677909 675246 671781 667980 663724
50744 663724 658838 653187 646565 639034 631259 624025 617512 611570 606489 602786 600353 598671 598023 599558
50730 599558 603812 609896 616565 623358 630239 636840 642819 648409 653935 659244 664347 670230 678178 688429
50716 688429 700287 713359 727903 743936 760850 778117 795668 813336 830473 846463 861125
50705 861125 874240 885012 892400 895946 896126 893979 890465 886019 880632 874388 867685 860662 852558 842156
50691 842156 828971 813649 797112 779777 761790 743648 726282 710712 697849 688448 683023 681918
50679 681918 685542 694286 707969 725587 745888 768121 792060 817428 843591 869757 895285 919772
$$ packed form
50771E91960q664r586j0188r743q141n902l689j896n07R91L406P048J1197J4684
50757E70970J6978J8307J8728J7771J5128J1214O822K656o65k663l465l801m256
50744F63724m886n651o622p531p775p234o513n942n081l703k433j682o48J535
50730E99558M254O084O669O793O881O601N979N590N526N309N103N883P948J0251
50716F88429J1858J3072J4544J6033J6914J7267J7551J7668J7137J5990J4662
50705H61125J3115J0772P388L546J80k147l514m446n387o244o703p023q104j0402
50691H42156j3185j5322j6537j7335j7987j8142j7366j5570j2863r401n425j105
50679F81918L624Q744J3683J7618K0301K2233K3939K5368K6163K6166K5528K4487
$$ plain form
50667 919772 943084 965360 986795 1007321 1026556 1044163 1060170 1074867 1088443 1100841 1111947
50656 1111947 1121786 1130520 1138474 1146356 1155290 1166383 1180224 1196943 1216675 1239584 1265402 1293266
50644 1293266 1322145 1351074 1378812 1403649 1424002 1439080 1448746 1452976 1451890 1446160 1436879 1424888
50632 1424888 1410437 1393498 1374105 1352373 1328433 1302499 1274978 1246695 1219074 1193760 1171553
50621 1171553 1151707 1132633 1113314 1093906 1075227 1058148 1043422 1031553 1022636 1016513 1013055 1011977
50609 1011977 1012591 1014216 1016721 1020040 1023144 1024154 1021619 1015131 1004612 989885 971349 950274 927785
50596 927785 904001 878856 853269 828784 806252 785547 766400 748844 732935 718746 706702
50585 706702 697302 690413 685391 681993 680611 681326 683281 685329 686950 688189 688939 688703 686922 683291 677858
$$ packed form
50667I19772K3312K2276K1435K0526J9235J7607J6007J4697J3576J2398J1106
50656A111947R839Q734P954P882Q934J1093J3841J6719J9732K2909K5818K7864
50644A293266K8879K8929K7738K4837K0353J5078R666M230j086n730r281j1991
50632A424888j4451j6939j9393k1732k3940k5934k7521k8283k7621k5314k2207
50621A171553j9846j9074j9319j9408j8679j7079j4726j1869q917o123l458j078
50609A011977O14J625K505L319L104J010k535o488j0519j4727j8536k1075k2489
50596I27785k3784k5145k5587k4485k2532k0705j9147j7556j5909j4189j2044
50585G06702r400o889n022l398j382P15J955K048J621J239P50k36j781l631n433
$$ plain form
50570 677858 671095 663817 656802 650494 645193 641504 640343 642435 647832 655968 666199 678390 693022
50557 693022 710700 731459 754531 778795 803415 828106 852904 877839 902841 927906 953274
50546 953274 979395 1006671 1035271 1065218 1096559 1129328 1163430 1198758 1235508 1274248 1315628
50535 1315628 1360086 1407920 1459464 1514906 1574010 1636290 1701515 1769747 1840555 1912423 1983266
50524 1983266 2051496 2116130 2175722 2227763 2269621 2299886 2318378 2325003 2319219 2300663 2269755 2227455
50512 2227455 2174902 2113641 2045829 1973756 1899261 1823824 1748977 1676292 1607187 1543132 1485808
50501 1485808 1436500 1395380 1361865 1335724 1317373 1307119 1304782 1310229 1323492 1343752 1368651 1395290
50489 1395290 1421614 1446056 1466079 1478165 1479808 1470950 1452984 1426913 1393176 1352883 1308208 1261231
$$ packed form
50570F77858o763p278p015o308n301l689j161K092N397Q136J0231J2191J4632
50557F93022J7678K0759K3072K4264K4620K4691K4798K4935K5002K5065K5368
50546I53274K6121K7276K8600K9947L1341L2769L4102L5328L6750L8740M1380
50535A315628M4458M7834N1544N5442N9104O2280O5225O8232P0808P1868P0843
50524A983266O8230O4634N9592N2041M1858L0265J8492O625n784j8556l0908m2300
50512B227455n2553o1261o7812p2073p4495p5437p4847p2685o9105o4055n7324
50501A485808m9308m1120l3515k6141j8351j0254k337N447J3263K0260K4899K6639
50489A395290K6324K4442K0023J2086J643q858j7966k6071l3737m0293m4675m6977
$$ plain form
50477 1261231 1213003 1164031 1115125 1067187 1020430 974417 928974 884763 842953 804557 770030
50466 770030 739139 711118 685183 661108 639169 619580 602208 586846 573408 561766 551687
50455 551687 543145 536374 531332 527389 523927 521127 519793 520398 522622 525817 529693 534515 540888 549385
50441 549385 560100 572357 584960 596873 607657 617303 625877 633471 640423 647492 655754 666245 679547
50428 679547 695681 714383 735377 758301 782675 808332 835874 866264 899765 935535 972457
50417 972457 1010191 1049272 1090397 1133809 1179083 1225169 1270726 1314733 1356778 1396570 1433345
50406 1433345 1466106 1494316 1517780 1535743 1546620 1548967 1542351 1526989 1502969 1470462 1430509 1384947
50394 1384947 1335480 1283286 1229602 1175995 1123717 1073222 1024788 979304 937957 901400 869713
$$ packed form
50477A261231m8228m8972m8906m7938m6757m6013m5443m4211m1810l8396l4527
50466G70030l0891k8021k5935k4075k1939j9589j7372j5362j3438j1642j0079
50455E51687q542o771n042l943l462k800j334O05K224L195L876M822O373Q497
50441E49385J0715J2257J2603J1913J0784R646Q574P594O952P069Q262J0491J3302
50428F79547J6134J8702K0994K2924K4374K5657K7542L0390L3501L5770L6922
50417I72457L7734L9081M1125M3412M5274M6086M5557M4007M2045L9792L6775
50406A433345L2761K8210K3464J7963J0877K347o616j5362k4020l2507l9953m5562
50394A384947m9467n2194n3684n3607n2278n0495m8434m5484m1347l6557l1687
$$ plain form
50383 869713 843054 821754 805725 794307 786943 783699 784904 790455 799537 810779 822644 833950
50371 833950 844135 852810 859056 861569 859575 853211 842893 828816 811386 791651 770765 749233
50359 749233 727096 704589 682149 659975 638075 616711 596313 577058 558958 542226 527047
50348 527047 513065 499725 487192 476286 467361 459812 452907 446481 440549 434933 429827 426081 424174
50335 424174 423250 421959 420116 418758 418583 419106 419536 419761 420080 420449 420478 419916 418792 417321 416013 415631 416635
50318 416635 418754 421448 424686 428887 434170 440112 446379 453163 460741 468922 477320 486098 496022 507755
50304 507755 521428 537088 555258 576448 599790 622185 639203 647328 645842 636799 623312 607798
50292 607798 591625 575814 561406 548911 537835 527298 517131 508071 500808 495233 490789 487237
$$ packed form
50383H69713k6659k1300j6029j1418p364l244J205N551R082J1242J1865J1306
50371H33950J0185Q675O246K513j994o364j0318j4077j7430j9735k0886k1532
50359G49233k2137k2507k2440k2174k1900k1364k0398j9255j8100j6732j5179
50348E27047j3982j3340j2533j0906q925p549o905o426n932n616n106l746j907
50335D24174r24j291j843j358j75N23M30K25L19L69K9n62j124j471j308l82J004
50318D16635K119K694L238M201N283N942O267O784P578Q181Q398Q778R924J1733
50304E07755J3673J5660J8170K1190K3342K2395J7018Q125j486r043j3487j5514
50292F07798j6173j5811j4408j2495j1076j0537j0167r060p263n575m444l552
$$ plain form
50280 487237 484630 482603 480160 476429 471521 466472 462371 459584 457709 456156 454727 453680 453269 453334 453523
50265 453523 453938 455289 458143 462033 465601 467729 468439 468591 468883 469278 469203 468072 465673 462413 459189 456671
50249 456671 454543 451791 448057 444365 442036 441018 439935 437838 435316 433539 432825 432687 432877 433602 434754
50234 434754 435697 436050 436165 436563 437306 438267 439622 441664 444308 447123 449729 451887 453435 454438 455272 456148
50218 456148 456698 456481 455824 455710 456778 458873 461603 464799 468251 471532 474507 477705 481806 486944 492814
50203 492814 499297 506730 515722 526962 541023 558091 578066 601084 627563 657339 689061 720940
50191 720940 751902 781444 808653 832211 851585 867504 881014 892611 902566 911354 919102 924920
50179 924920 927319 925126 917609 904139 884473 859437 830796 800362 769468 739144 710190 682940
$$ packed form
50280D87237k607k027k443l731m908n049m101k787j875j553j429j047m11O5J89
50265D53523M15J351K854L890L568K128P10J52K92L95p5j131k399l260l224k518
50249D56671k128k752l734l692k329j018j083k097k522j777p14j38J90P25J152
50234D34754R43L53J15L98P43R61J355K042K644K815K606K158J548J003Q34Q76
50218D56148N50k17o57j14J068K095K730L196L452L281K975L198M101N138N870
50203D92814O483P433Q992J1240J4061J7068J9975K3018K6479K9776L1722L1879
50191G20940L0962K9542K7209K3558J9374J5919J3510J1597R955Q788P748N818
50179I24920K399k193p517j3470j9666k5036k8641l0434l0894l0324k8954k7250
$$ plain form
50167 682940 657467 634181 613761 596297 581006 567224 555290 545929 538953 533167 527576 522113
50155 522113 517064 512284 507408 502553 498313 494980 492146 489181 485931 482697 479649 476518 472945 468922
50141 468922 464665 460107 454823 448640 442126 436176 431091 426336 421315 416122 411354 407366 404064 401333
50127 401333 399295 398023 397275 396713 396193 395744 395447 395564 396632 399103 402853 407189 411394 415227 418997 423322
50111 423322 428726 435183 441972 448179 453451 458218 463198 468799 474989 481502 488085 494690 501528 508804
50097 508804 516321 523460 529736 535325 540947 547275 554570 562819 572053 582428 594135 607372 622457
50084 622457 639879 660193 683904 711544 743689 780730 822564 868577 917832 968979 1020028
50073 1020028 1068736 1113660 1154792 1192977 1228940 1263043 1295594 1326701 1355770 1381533 1402606
$$ packed form
50167F82940k5473k3286k0420j7464j5291j3782j1934r361o976n786n591n463
50155E22113n049m780m876m855m240l333k834k965l250l234l048l131l573m023
50141D68922m257m558n284o183o514n950n085m755n021n193m768l988l302k731
50127D01333k038j272p48n62n20m49k97J17J068K471L750M336M205L833L770M325
50111D23322N404O457O789O207N272M767M980N601O190O513O583O605O838P276
50097E08804P517P139O276N589N622O328P295Q249R234J0375J1707J3237J5085
50084F22457J7422K0314K3711K7640L2145L7041M1834M6013M9255N1147N1049
50073A020028M8708M4924M1132L8185L5963L4103L2551L1107K9069K5763K1073
$$ plain form
50062 1402606 1417597 1424768 1422295 1409399 1386959 1356795 1320556 1279497 1234860 1187919 1139707 1091066
50050 1091066 1042971 996576 952846 912321 875164 841363 810889 783744 759771 738485 719285
50039 719285 701975 686863 674267 664151 656275 650341 645754 641634 637477 633583 630409 627742 625005
50026 625005 622224 620074 618839 617839 616210 613926 611757 610303 609215 607259 603152 596543 588309 579784
50012 579784 571625 563608 555443 547430 540085 533415 526941 520408 514147 508659 504053 500102 496693 493967
49998 493967 491925 490168 488307 486493 485196 484427 483557 482124 480432 478985 477683 476044 474085 472297 470730
49983 470730 468744 465985 463057 460804 459300 458088 457056 456393 455754 454278 451721 449049 447478 447287 447975
49968 447975 449283 451540 455137 460211 466932 475684 486837 500716 517808 538514 562463 588443 615318
$$ packed form
50062A402606J4991P171k473j2896k2440l0164l6239m1059m4637m6941m8212m8641
50050A091066m8095m6395m3730m0525l7157l3801l0474k7145k3973k1286j9200
50039G19285j7310j5112j2596j0116p876n934m587m120m157l894l174k667k737
50026F25005k781k150j235j000j629k284k169j454j088j956m107o609q234q525
50012E79784q159q017q165q013p345o670o474o533o261n488m606l951l409k726
49998D93967k042j757j861j814j297p69q70j433j692j447j302j639j959j788j567
49983D70730j986k759k928k253j504j212j032o63o39j476k557k672j571j91O88
49968D47975J308K257L597N074O721Q752J1153J3879J7092K0706K3949K5980K6875
$$ plain form
49955 615318 642704 670547 698404 725465 750912 773811 793112 808476 820976 832359 843561
49944 843561 854294 863709 870687 873575 870576 860832 844655 822636 795249 763475 729056 693682
49932 693682 658481 624503 592931 564275 538078 513999 492541 474086 457894 443018 429773
49921 429773 419317 411908 406391 401412 396384 391333 386450 381930 377723 373437 368854 364349 360329 356553
49907 356553 352650 349006 346346 344555 342788 340688 338650 336885 335186 333758 333330 334066 335211 336157 337110
49892 337110 338260 339184 339645 340265 341644 343279 344069 343571 342193 340510 339024 338324 338736 339775 340465 340313
49876 340313 339744 339586 340333 341768 343107 343641 343429 343198 343415 343719 343482 342651 341811 341623 342384 343843 345235
49859 345235 345849 345835 346160 347504 349515 351423 352955 354254 355370 356398 357851 360256 363419 366587 369272
$$ packed form
49955F15318K7386K7843K7857K7061K5447K2899J9301J5364J2500J1383J1202
49944H43561J0733R415O978K888k999r744j6177k2019k7387l1774l4419l5374
49932F93682l5201l3978l1572k8656k6197k4079k1458j8455j6192j4876j3245
49921D29773j0456p409n517m979n028n051m883m520m207m286m583m505m020l776
49907C56553l903l644k660j791j767k100k038j765j699j428m28P36J145R46R53
49892C37110J150R24M61O20J379J635P90m98j378j683j486p00M12J039O90j52
49876C40313n69j58P47J435J339N34k12k31K17L04k37q31q40j88P61J459J392
49859C45235O14j4L25J344K011J908J532J299J116J028J453K405L163L168K685
$$ plain form
49844 369272 371463 373157 374200 374699 375097 375703 376422 377005 377297 377209 376764 376329 376531 377774 379823 381968 383553
49827 383553 384433 384968 385586 386359 387183 388316 390369 393599 397488 401305 404899 408643 412720 416769 420184
49812 420184 422585 424085 425196 426379 427598 428433 428703 428748 428962 429340 429598 429486 428783 427355 425453 423620
49796 423620 422086 420565 418881 417333 416081 414648 412622 410497 409137 408580 408023 406926 405561 404496 404036
49781 404036 404202 404763 405287 405502 405601 405746 405453 404075 401892 400107 399597 400184 401308 402834 404874 407251 409583
49764 409583 411738 413896 416292 419095 422475 426581 431414 436644 441530 445203 447268 448080 448252 448064 447581
49749 447581 447102 447003 447196 447217 446893 446561 446592 447101 448068 449264 450022 449601 448007 445966 443868 441211 437500 433301
49731 433301 429910 428068 427400 427101 426837 426884 427601 428912 430243 430839 430158 428164 425458 423037 421534 420541
$$ packed form
49844C69272K191J694J043M99L98O06P19N83K92q8m45m35K02J243K049K145J585
49827C83553Q80N35O18P73Q24J133K053L230L889L817L594L744M077M049L415
49812D20184K401J500J111J183J219Q35K70M5K14L78K58j12p03j428j902j833
49796D23620j534j521j684j548j252j433k026k125j360n57n57j097j365j065m60
49781D04036J66N61N24K15R9J45k93j378k183j785n10N87J124J526K040K377K332
49764D09583K155K158K396K803L380M106M833N230M886L673K065Q12J72j88m83
49749D47581m79r9J93K1l24l32L1N09R67J196P58m21j594k041k098k657l711m199
49731D33301l391j842o68k99k64M7P17J311J331N96o81j994k706k421j503r93
$$ plain form
49715 420541 418970 416285 413091 410285 408013 405886 403875 402333 401312 400475 399734 399359 399365 399307 398835 398059 397211
49698 397211 396379 395679 395366 395638 396565 398149 400089 401652 402381 402952 404663 407918 411847 415546 418994 422428
49682 422428 425540 427880 429516 430750 431585 431991 432394 433290 434576 435743 436632 437592 439014 441038 443602 446426
49666 446426 449021 450970 452144 452596 452554 452668 453723 455689 457398 457758 457012 456316 456238 456305 455996 455625 456108 458232
49648 458232 462285 468029 474756 481419 486780 489578 488948 485077 479346 473458 468352 464034 460244 456951
49634 456951 454249 452119 450407 448867 447263 445582 444096 443045 442352 441720 440952 440062 439257 438935 439500 441005
49618 441005 443122 445565 448304 451276 454260 457242 460491 464031 467528 471080 475514 481287 487568 493208
49604 493208 498317 504031 510915 518541 526586 535266 544417 553129 560859 568221 576139 584768 593768 603133
$$ packed form
49715D20541j571k685l194k806k272k127k011j542j021q37p41l75On8m72p76q48
49698C97211q32p00l13K72R27J584J940J563P29N71J711L255L929L699L448L434
49682D22428L112K340J636J234Q35M06M03Q96J286J167Q89R60J422K024K564K824
49666D46426K595J949J174M52m2J14J055J966J709L60p46o96p8O7l09l71M83K124
49648D58232M053N744O727O663N361K798o30l871n731n888n106m318l790l293
49634D56951k702k130j712j540j604j681j486j051o93o32p68q90q05l22N65J505
49618D41005K117K443K739K972K984K982L249L540L497L552M434N773O281N640
49604D93208N109N714O884P626Q045Q680R151Q712P730P362P918Q629R000R365
$$ plain form
49590 603133 613159 623882 635019 646205 656963 666837 676079 685817 696970 709132 721063 732068
49578 732068 742370 752312 761898 771167 780434 789940 799648 809501 819544 829671 839537 848817 857310
49565 857310 864784 871086 876453 881342 885860 889729 892878 895595 897965 899667 900578 901101 901431 901050 899506
49550 899506 897335 895480 893949 891832 888662 885038 881694 878702 875947 873746 872411 871607 870787 870021 869765
49535 869765 869930 869817 869100 868379 868474 869522 871009 872490 874032 876079 879136 883623 889857 897925 907413 917363
49519 917363 926765 935249 943102 950543 957261 962882 967554 971641 975039 977192 977725 976639 974047 970221
49505 970221 965800 961260 956057 948997 939752 929455 919373 909458 898737 886824 874457 862666 851855
49492 851855 841615 831096 819616 807322 795250 784463 775112 766522 758065 749652 741432 733449 725704
$$ packed form
49590F03133J0026J0723J1137J1186J0758R874R242R738J1153J2162J1931J1005
49578G32068J0302R942R586R269R267R506R708R853J0043J0127R866R280Q493
49565H57310P474O302N367M889M518L869L149K717K370J702R11N23L30l81j544
49550H99506k171j855j531k117l170l624l344k992k755k201j335q04q20p66k56
49535H69765J65j13p17p21R5J048J487J481J542K047L057M487O234Q068R488R950
49519I17363R402Q484P853P441O718N621M672M087L398K153N33j086k592l826
49505I70221m421m540n203p060r245j0297j0082r915j0721j1913j2367j1791j0811
49492H51855j0240j0519j1480j2294j2072j0787r351q590q457q413q220p983p745
$$ plain form
49479 725704 718258 711147 704343 697904 691986 686601 681445 676111 670481 664898 659874 655589 651718 647901
49465 647901 644271 641278 639011 637041 635051 633223 631771 630471 629003 627526 626509 626178 626447 627161 627986
49450 627986 628249 627455 625971 624760 624431 624950 626168 628018 630048 631478 632138 632990 635398 640134 647268 656439
49434 656439 666511 675234 680202 680652 678078 674785 671960 669273 666028 662251 658642 655871 654219 653707
49420 653707 654205 655333 656589 657787 659266 661482 664492 667917 671371 674813 678550 683001 688381 694516
49406 694516 701046 707795 714784 721870 728755 735526 742795 750867 759040 766264 772400 778232 784246 790012
49392 790012 794941 799067 802716 805953 808798 811636 814820 818066 820821 823192 825979 829714 834143 838834
49378 838834 843847 849481 855669 862010 868224 874245 880019 885575 891248 897400 903854 910057 916021 922663
$$ packed form
49479G25704p446p111o804o439n918n385n156n334n630n583n024m285l871l817
49465F47901l630k993k267j970j990j828j452j300j468j477j017l31K69P14Q25
49450F27986K63p94j484j211l29N19J218J850K030J430O60Q52K408M736P134R171
49434F56439J0072Q723M968M50k574l293k825k687l245l777l609k771j652n12
49420F53707M98J128J256J198J479K216L010L425L454L442L737M451N380O135
49406F94516O530O749O989P086O885O771P269Q072Q173P224O136N832O014N766
49392G90012M929M126L649L237K845K838L184L246K755K371K787L735M429M691
49378H38834N013N634O188O341O214O021N774N556N673O152O454O203N964O642
$$ plain form
49364 922663 930877 940516 950744 961206 972312 984382 997034 1009628 1021940 1034139 1046405 1058875
$$ packed form
49364I22663Q214R639J0228J0462J1106J2070J2652J2594J2312J2199J2266J2470
$$ [...]
##END NTUPLES=NMR SPECTRUM
##END=
