##TITLE=NES1039_872015048_9242671_qEZkBcLU37
##JCAMPDX= 6.0         $$ Bruker NMR JCAMP-DX V2.0
##DATA TYPE= NMR SPECTRUM
##DATA CLASS= NTUPLES
##ORIGIN= BRUKER
##OWNER= Administrator
$$ 1.72 TOPSPIN		Version 2.1
$$ 2015-08-24 21:44:47.639 -0700  Administrator@X
$$ Compression mode = diff/dup
##.OBSERVE FREQUENCY= 400.02188249412
##.OBSERVE NUCLEUS= ^1H
##.ACQUISITION MODE= SIMULTANEOUS (DQD)
##.ACQUISITION SCHEME= undefined
##.AVERAGES= 8
##.DIGITISER RES= 22
##SPECTROMETER/DATA SYSTEM= spect
##.PULSE SEQUENCE= zg30
##.SOLVENT NAME= COFFEE_meoh
##.SHIFT REFERENCE= INTERNAL, COFFEE_meoh, 1, 14.98509
##AUDIT TRAIL= $$ (NUMBER, WHEN, WHO, WHERE, PROCESS, VERSION, WHAT)
$$ ##TITLE= Audit trail, TOPSPIN		Version 2.1
$$ ##JCAMPDX= 5.01
$$ ##ORIGIN= Bruker BioSpin GmbH
$$ ##OWNER= Administrator
$$ $$ E:\/data/COFFEE/nmr/NES1039_872015048_9242671_qEZkBcLU37/30/pdata/1/auditp.txt
$$ ##AUDIT TRAIL=  $$ (NUMBER, WHEN, WHO, WHERE, PROCESS, VERSION, WHAT)
(   1,<2015-08-24 21:44:40.311 -0700>,<Administrator>,<X>,<go>,<TOPSPIN 2.1>,
      <created by zg
	started at 2015-08-24 21:43:34.530 -0700,
	POWCHK enabled, PULCHK disabled,
       configuration hash MD5:
       21 0F 79 D6 B3 7B B4 F6 88 20 88 DB 03 48 BD 9F
       data hash MD5: 64K
       8F 81 35 29 D2 91 BA 4C B1 23 A2 F8 A7 23 D9 1E>)
(   2,<2015-08-24 21:44:43.514 -0700>,<Administrator>,<X>,<proc1d>,<TOPSPIN 2.1>,
      <Start of raw data processing
       efp LB = 0 FT_mod = 6 PKNL = 1 PHC0 = 0 PHC1 = 0 SI = 32K 
       data hash MD5: 32K
       2B 05 0F B4 DD FD 7D 5A 55 96 18 1A D2 A2 97 E8>)
(   3,<2015-08-24 21:44:43.826 -0700>,<Administrator>,<X>,<proc1d>,<TOPSPIN 2.1>,
      <pk PHC0 = 92.45544 PHC1 = 0 
       data hash MD5: 32K
       C6 27 18 AE 4E 9F C8 49 49 AF 2B BB 19 68 D6 D2>)
(   4,<2015-08-24 21:44:43.936 -0700>,<Administrator>,<X>,<proc1d>,<TOPSPIN 2.1>,
      <abs ABSG = 1 
       data hash MD5: 32K
       2E 1E 27 3E FB A1 51 89 14 5E 42 6E 15 4E 17 A2>)
(   5,<2015-08-24 21:44:44.014 -0700>,<Administrator>,<X>,<proc1d>,<TOPSPIN 2.1>,
      <abs ABSG = 2 
       data hash MD5: 32K
       A4 A7 27 A3 20 75 9C 0C 17 29 43 C2 58 44 72 C4>)
(   6,<2015-08-24 21:44:44.076 -0700>,<Administrator>,<X>,<proc1d>,<TOPSPIN 2.1>,
      <abs ABSG = 3 
       data hash MD5: 32K
       59 09 4B 3D 21 80 24 BF FA 48 D1 C9 8E 80 C5 65>)
(   7,<2015-08-24 21:44:44.139 -0700>,<Administrator>,<X>,<proc1d>,<TOPSPIN 2.1>,
      <abs ABSG = 4 
       data hash MD5: 32K
       AB B4 A5 0A 5C 14 30 B4 09 6F E8 B7 20 EE C2 29>)
(   8,<2015-08-24 21:44:44.201 -0700>,<Administrator>,<X>,<proc1d>,<TOPSPIN 2.1>,
      <abs ABSG = 5 
       data hash MD5: 32K
       77 3D 50 07 6F 3D BC 2E DA 6B 27 9B A2 88 DC B4>)
$$ ##END=
$$ 
$$ $$ hash MD5
$$ $$ 03 53 15 63 1E 6F 9A 3D 4B 77 C0 9D D9 72 09 33
##$RELAX= 
##$RELAX= 
##$RELAX= 
##$RELAX= 
##$RELAX= 
##$RELAX= 
##$RELAX= 
$$ Bruker specific parameters
$$ --------------------------
##$DU= <E:\>
##$EXPNO= 30
##$NAME= <NES1039_872015048_9242671_qEZkBcLU37>
$$ [...]
150 150 150 150 150 150 150 150
##$TP07= 0
##$TPNAME0= <>
##$TPNAME1= <>
##$TPNAME2= <>
##$TPNAME3= <>
##$TPNAME4= <>
##$TPNAME5= <>
##$TPNAME6= <>
##$TPNAME7= <>
##$TPOAL= (0..7)
0.5 0.5 0.5 0.5 0.5 0.5 0.5 0.5
##$TPOFFS= (0..7)
0 0 0 0 0 0 0 0
##$TUNHIN= 0
##$TUNHOUT= 0
##$TUNXOUT= 0
##$USERA1= <user>
##$USERA2= <user>
##$USERA3= <user>
##$USERA4= <user>
##$USERA5= <user>
##$V9= 5
##$VALIST= <valist>
##$VCLIST= <CCCCCCCCCCCCCCC>
##$VD= 0
##$VDLIST= <DDDDDDDDDDDDDDD>
##$VPLIST= <PPPPPPPPPPPPPPP>
##$VTLIST= <TTTTTTTTTTTTTTT>
##$WBST= 2048
##$WBSW= 25
##$XGAIN= (0..3)
0 0 0 0
##$XL= 0
##$YL= 0
##$YMAX_a= 582208
##$YMIN_a= -487557
##$ZGOPTNS= <>
##$ZL1= 120
##$ZL2= 120
##$ZL3= 120
##$ZL4= 120
##$ABSF1= 14.98509
##$ABSF2= -5.573092
##$ABSG= 5
##$ABSL= 3
##$ALPHA= 0
##$AQORDER= 0
##$ASSFAC= 0
##$ASSFACI= 0
##$ASSFACX= 0
##$ASSWID= 0
##$AUNMP= <proc_prof1d_extract_pilot.lims>
##$AXLEFT= 0
##$AXNAME= <>
##$AXNUC= <1H>
##$AXRIGHT= 0
##$AXTYPE= 0
##$AXUNIT= <>
##$AZFE= 0.1
##$AZFW= 0.1
##$BCFW= 0
##$BC_mod= 0
##$BYTORDP= 0
##$COROFFS= 0
##$CY= 15
##$DATMOD= 1
##$DC= 0
##$DFILT= <>
##$DTYPP= 0
##$F1P= 0
##$F2P= 0
##$FCOR= 0.5
##$FTSIZE= 32768
##$FT_mod= 6
##$GAMMA= 0
##$GB= 0
##$INTBC= 1
##$INTSCL= 1
##$ISEN= 128
##$LB= 0
##$LEV0= 0
##$LPBIN= 0
##$MAXI= 10000
##$MC2= 0
##$MEAN= 0
##$ME_mod= 0
##$MI= 0
##$NCOEF= 0
##$NC_proc= -8
##$NLEV= 6
##$NOISF1= 0
##$NOISF2= 0
##$NSP= 0
##$NTH_PI= 0
##$NZP= 0
##$OFFSET= 14.98509
##$PC= 1
##$PHC0= 92.45544
##$PHC1= 0
##$PH_mod= 1
##$PKNL= yes
##$PPARMOD= 0
##$PPDIAG= 0
##$PPIPTYP= 0
##$PPMPNUM= 2147483647
##$PPRESOL= 1
##$PSCAL= 4
##$PSIGN= 0
##$PYNMP= <proc.py>
##$REVERSE= no
##$SF= 400.02
##$SI= 32768
##$SIGF1= 0
##$SIGF2= 0
##$SINO= 400
##$SIOLD= 32768
##$SPECTYP= <>
##$SREGLST= <1H.CDCl3>
##$SSB= 0
##$STSI= 32768
##$STSR= 0
##$SW_p= 8223.68421052631
##$SYMM= 0
##$S_DEV= 0
##$TDeff= 65536
##$TDoff= 0
##$TI= <>
##$TILT= no
##$TM1= 0
##$TM2= 0
##$TOPLEV= 0
##$USERP1= <user>
##$USERP2= <user>
##$USERP3= <user>
##$USERP4= <user>
##$USERP5= <user>
##$WDW= 1
##$XDIM= 32768
##$YMAX_p= 428992376
##$YMIN_p= -712684
##$CURPLOT= <Network HP LaserJet P1505>
##$CURPRIN= <$Network HP LaserJet P1505>
##$DFORMAT= <normdp>
##$LAYOUT= <+/1D_H.xwp>
##$LFORMAT= <normlp>
##$PFORMAT= <normpl>
##$SURQMSG= 1
$$ End of Bruker specific parameters
$$ ---------------------------------
##NTUPLES= NMR SPECTRUM
##VAR_NAME=  FREQUENCY,     SPECTRUM/REAL,   SPECTRUM/IMAG
##SYMBOL=    X,             R,               I
##VAR_TYPE=  INDEPENDENT,   DEPENDENT,       DEPENDENT
##VAR_FORM=  AFFN,          ASDF,            ASDF
##VAR_DIM=   32768,         32768,           32768
##UNITS=     HZ,            ARBITRARY UNITS, ARBITRARY UNITS
##FACTOR=    0.250966925370066, 1,           1
##FIRST=     8223.43324360094, -191537,      40672
##LAST=      0,             -14873,          -168453
##MIN=       0,             -712684,         0
##MAX=       8223.43324360094, 428992376,    0
$$ Real data points
##PAGE= N=1
##DATA TABLE= (X++(R..R)), XYDATA
$$ [...]
19506a54016d1087j23778g6091q8913k86376c6854k48119J30647K5980c8581j22067
$$ -154016 -41087 -164865 -76091 -165004 -451380 -36854 -284973 -154326 -128346 -38581 -160648
19495a60648p8710F2831O6749a9187j44315a4735j0305j30890e6762l30621a40945
$$ -160648 -239358 62831 129580 -19187 -163502 -14735 -25040 -155930 -56762 -387383 -140945
19483D5063O4709Q2997d91957h0108k78102A72993a43194L3960j32163C27488
$$ 45063 109772 192769 -491957 -80108 -358210 172993 -143194 -109234 -241397 327488
19472b34815j61034J17165C6611j7554K14045h5091B2041K48710a66583j078J4474
$$ -234815 -395849 -278684 36611 19057 233102 -85091 22041 270751 -166583 -167661 -153187
19461a53187J4886N1326A74427b23517A85839p5916h8914k58447a62541j22078
$$ -153187 -138301 -86975 174427 -223517 185839 109923 -88914 -347361 -162541 -284619
19451b84619I4717d5891J2485l11122O5114A42509o0285c34294A57286p1840c61915
$$ -284619 94717 -45891 -33406 -344528 -279414 142509 82224 -334294 157286 85446 -361915
19439a46682I7518J9505f4306B09081b78178a23457A36062b18387Q5976c1072
$$ -146682 97518 117023 -64306 209081 -278178 -123457 136062 -218387 -132411 -31072
19428a30098e3308D312a68003j21416J3030R4618m4212g4339A5789J69319b44119
$$ -130098 -53308 4312 -168003 -289419 -276389 -181771 -225983 -74339 15789 185108 -244119
19416A2247M1050a30356m018A70453d0717C5613a98905K2239N1168j03001M4268
$$ 12247 53297 -130356 -134374 170453 -40717 35613 -198905 -176666 -125498 -228499 -184231
19405a84231H858a4628p5801K6428H3992a29729A99707b72328A04255b25746j17846
$$ -184231 8858 -14628 -90429 -64001 83992 -129729 199707 -272328 104255 -225746 -343592
19394c43592A85369P6404j10436A1622c59455L7031E7718K31129a23847A22997
$$ -343592 185369 261773 151337 11622 -359455 -322424 57718 288847 -123847 122997
19383B0647L24732h1516B07233c09625a8209k4452j21267p2496B6941B742a2544
$$ 20647 345379 -81516 207233 -309625 -18209 -42661 -163928 -236424 26941 2742 -12544
19371c39478O2087g8634A66219b17516n1717h1761l64345a72706k0792A0601i0471
$$ -339478 -277391 -78634 166219 -217516 -269233 -81761 -446106 -172706 -193498 10601 -90471
19359i5640J9878j03646N4956b490A09535b05762j56172G0252c24492a43962f6828
$$ -95640 -75762 -179408 -124452 -2490 109535 -205762 -361934 70252 -324492 -143962 -66828
19347C0547a3926p416N999j86533B43350b25532K4986g2673j38530E8402c15906
$$ 30547 -13926 -21342 -15343 -201876 243350 -225532 -200546 -72673 -211203 58402 -315906
19335b06117E5685J91315j02853f5145D3408J16751d3120J8737j88042n6006a06784
$$ -206117 55685 247000 144147 -65145 43408 160159 -43120 -24383 -212425 -268431 -106784
19323A56046L4159n5563E5290e0805k59825d2937k98679P7385B19039a08778j88842
$$ 156046 190205 134642 55290 -50805 -310630 -42937 -341616 -264231 219039 -108778 -297620
19312b97620N5641B27156C1201d74064a48292G3391k2114J48064e9170b6201l04901
$$ -297620 -241979 227156 31201 -474064 -148292 73391 51277 199341 -59170 -26201 -331102
19301c31102f7833j25159R5072B17726b08570A32728h8355F5709c6319j4473J8489
$$ -331102 -67833 -192992 -97920 217726 -208570 132728 -88355 65709 -36319 -50792 -32303
19290c2303H170f6306B12480b12873Q9812e0305n93k99083a20114M1558j87464
$$ -32303 8170 -66306 212480 -212873 -123061 -50305 -50898 -349981 -120114 -78556 -266020
19279b66020R6449j21557A08449i9702A88046g1950j7988j94224B1880b16557
$$ -266020 -169571 -291128 108449 -99702 188046 -71950 -89938 -284162 21880 -216557
19268I0173k2115J19502c4738j84573A01590h7780n9596J2971F4498k3890L9011
$$ 90173 68058 187560 -34738 -219311 101590 -87780 -147376 -134405 64498 40608 79619
19257G9619L247J7466O6376g6962k18013A105b35855I528a92007K8073B12137
$$ 79619 82866 100332 166708 -76962 -294975 1105 -235855 9528 -192007 -163934 212137
19245A27671c0376A64942a9962k27651A81892c02001a29045j06015L3311O5116
$$ 127671 -30376 164942 -19962 -247613 181892 -302001 -129045 -235060 -201749 -136633
19235a36633E5709a67103H6226d0863j57474A624a10295d2132j31371C1819h2250
$$ -136633 55709 -167103 86226 -40863 -198337 1624 -110295 -42132 -173503 31819 -82250
19223C4613A4651P5620c4442H9754d68028a8510r063k90672H3209k5218K080J42246
$$ 34613 14651 90271 -34442 89754 -468028 -18510 -27573 -318245 83209 57991 60071 202317
19211B02317D9611K24357I8144P479a19520G0930b32450b5443G5503K4234M5665
$$ 202317 49611 273968 98144 105623 -119520 70930 -232450 -25443 75503 99737 145402
19200A45402I295b07893m9440A69523b00566e2427A69445b19450E7955e44044
$$ 145402 9295 -207893 -257333 169523 -200566 -52427 169445 -219450 57955 -544044
19189A79613a59243N5501E4413h9553b8112E2971c67054a71197I1737b09056a04248
$$ 179613 -159243 -103742 54413 -89553 -28112 52971 -367054 -171197 91737 -209056 -104248
19177a69219d0293C9835f3180a2885l07022B6410c76061a01640p0260l5615m9552
$$ -169219 -40293 39835 -63180 -12885 -319907 26410 -376061 -101640 -171900 -207515 -257067
19166b57067l0931J05799A33524a44420m442A36925C3750J3289J42982F7463a64973
$$ -257067 -287998 -182199 133524 -144420 -148862 136925 33750 47039 190021 67463 -164973
19154A19896a64816n405B2279Q5092D3509B1636a2942B68989b172m0653B060g8849
$$ 119896 -164816 -170221 22279 107371 43509 21636 -12942 268989 -2172 -42825 2060 -78849
19141c44752A18235b23121D3489f2214B44995a77711B16858a6018C35677a29637
$$ -344752 118235 -223121 43489 -62214 244995 -177711 216858 -16018 335677 -129637
19130b74093n4072a05909B79329i7232C2342H993K5193d9279A01307J43612b59623
$$ -274093 -328165 -105909 279329 -97232 32342 8993 34186 -49279 101307 244919 -259623
19118h336A14142n0822O0727b4450B02185a5962j23229B34695G9202L7261A9189
$$ -8336 114142 63320 124047 -24450 202185 -15962 -139191 234695 79202 116463 19189
19106a21511q2936A64623A4939a16766d9729j31263q1500m154f2408l7405k21607
$$ -121511 -204447 164623 14939 -116766 -49729 -180992 -262492 -266646 -62408 -99813 -321420
19095c21420C503O2588i066j4712B2733a00317A20353A5219a60307E2629J49722
$$ -321420 3503 66091 -9066 -23778 22733 -100317 120353 15219 -160307 52629 202351
19084B02351e9718i813n1192A41901a25751F3859a63318P1501A3403e0791A62823
$$ 202351 -59718 -9813 -61005 141901 -125751 63859 -163318 -91817 13403 -50791 162823
19072B33469a12765A58337d1902I1616M2400l6782l9295d27000a67527A70067
$$ 233469 -112765 158337 -41902 91616 134016 97234 57939 -427000 -167527 170067
19061A74002b00775P738j36400Q8691a6360j45715F3543J47485a50748A24078
$$ 174002 -200775 -193037 -329437 -240746 -16360 -162075 63543 211028 -150748 124078
19050g5474j67399J10177K0532j18955E1709b42801B59502c8047G7568a6711m5835
$$ -75474 -242873 -132696 -112164 -231119 51709 -242801 259502 -38047 77568 -16711 -62546
19039f2546k3666k36000a29700A39934C3571b45558I7556e1200C16944a46537
$$ -62546 -86212 -322212 -129700 139934 33571 -245558 97556 -51200 316944 -146537
19028C62951E2848b3962n2282q517k42509a00447A69483J1822H9792b15147D5590
$$ 362951 52848 -23962 -76244 -84761 -327270 -100447 169483 181305 89792 -215147 45590
19016c9561A14032b04922P7174j25398Q6703A46115k9782e9388F8698c95960J97227
$$ -39561 114032 -204922 -127748 -253146 -166443 146115 116333 -59388 68698 -395960 -198733
19005a98733F2132Q55e0721A83d3590j2236C312c43564g5662H9858d0441I2975
$$ -198733 62132 62987 -50721 183 -43590 -55826 3312 -343564 -75662 89858 -40441 92975
18992i9490j5799A48818j8711i7904C03397A7240b19918C931a17603J013d0868
$$ -99490 -115289 148818 130107 -97904 303397 17240 -219918 3931 -117603 -116590 -40868
18980a4363j11191K5912c8763n0082k67807G5992M3542c6117A43514c8033n5838
$$ -14363 -125554 -99642 -38763 -88845 -356652 75992 119534 -36117 143514 -38033 -93871
18969i3871A71175a74289N0264A2406h9569D29585F1511J08191N2581N2823f3030
$$ -93871 171175 -174289 -124025 12406 -89569 429585 61511 169702 222283 275106 -63030
18957e5928j14751K4283E921c4178j27120B96003C2217R0686B1861d35627a49737
$$ -55928 -170679 -146396 5921 -34178 -161298 296003 32217 122903 21861 -435627 -149737
18945D747d84978a24005l09593J86700j86078a89252A72921f279H486a23544a8052
$$ 4747 -484978 -124005 -433598 -246898 -432976 -189252 172921 -6279 8486 -123544 -18052
18933A46264J72263A4921P9323a49839L684j99091J55278l3797D274K2815a4002
$$ 146264 318527 14921 94244 -149839 -146155 -345246 -189968 -223765 4274 27089 -14002
18921D47881a63855d1078j08099j39574A4984c86176a45467E4026J08914a12799
$$ 447881 -163855 -41078 -149177 -288751 14984 -386176 -145467 54026 162940 -112799
18910A56630p4094a88236J1786J2186K4879A94584A7941h2768K3459D20431j30130
$$ 156630 82536 -188236 -176450 -164264 -139385 194584 17941 -82768 -59309 420431 290301
18899B90301a36055m3102b3692o497o7738k7522A82941c22780J680R6577A65528
$$ 290301 -136055 -179157 -23692 -30189 -97927 -125449 182941 -322780 -321100 -224523 165528
18887e6158A47443d02620a21412I8232J83100e524A2681c2523E9217a90699B51019
$$ -56158 147443 -402620 -121412 98232 281332 -5524 12681 -32523 59217 -190699 251019
18875B96168j36270a99596A95026d1281A65567a41765j75886i0227k9519q4981
$$ 296168 159898 -199596 195026 -41281 165567 -141765 -317651 -90227 -119746 -204727
18865b04727j30500g3726j15326p1898B68804b11830H0011K52276a12506B78927
$$ -204727 -335227 -73726 -189052 -260950 268804 -211830 80011 332287 -112506 278927
18854b28486A60150G9454j1318a60853d7048D919a20744j0985j12912i8406j6764
$$ -228486 160150 79454 68136 -160853 -47048 4919 -120744 -131729 -244641 -98406 -115170
18843a15170B8407J452L21913d5980o2360C39432D540a30489L6624A06790J55310
$$ -115170 28407 29859 351772 -45980 -108340 339432 4540 -130489 -93865 106790 262100
18832B62100a2676j73426A87510b6F1673a06459b3323n322C0437b95940A18002
$$ 262100 -12676 -186102 187510 -26 61673 -106459 -23323 -28645 30437 -295940 118002
18820a2378q1437A8986b17552B2329a74049N1146D2208a23118B7690a56105C230
$$ -12378 -93815 18986 -217552 22329 -174049 -122903 42208 -123118 27690 -156105 3230
18808C3789e864M67F9249b54447B0118b01730a0848q4694A41681h5435A6143K88884
$$ 33789 -5864 -5397 69249 -254447 20118 -201730 -10848 -95542 141681 -85435 16143 305027
18796C05027D8371c35805B4552a30092E4570d03544A1280R6704a19488C2345G244
$$ 305027 48371 -335805 24552 -130092 54570 -403544 11280 107984 -119488 32345 7244
18784a51474e4416a6686j76804a6045k86075f6093q896A40532a3606k73171A66883
$$ -151474 -54416 -16686 -193490 -16045 -302120 -66093 -74989 140532 -13606 -286777 166883
18772D1981N9129b26331O1792B1493L00775g685j531k11120B5358c95056j3252
$$ 41981 101110 -226331 -164539 21493 322268 -7685 -9216 -220336 25358 -395056 -408308
18761d08308B60078a84486J7819J7776D4796A4916b46494N9210B45003a38130
$$ -408308 260078 -184486 -166667 -148891 44796 14916 -246494 -187284 245003 -138130
18750a18935B25365I3363a73106j3375c7491E0045c27648f7882B28949b25045
$$ -118935 225365 93363 -173106 -186481 -37491 50045 -327648 -67882 228949 -225045
18739c6045A10074a64928g7134A451J51447q410a06460k5712b6610A50276a03858
$$ -36045 110074 -164928 -77134 1451 152898 144488 -106460 -132172 -26610 150276 -103858
18727A70073b09060h1601l80951C08355b7598j12247e9526j27267A44841a00789
$$ 170073 -209060 -81601 -462552 308355 -27598 -139845 -59526 -186793 144841 -100789
18716D7155a6087j76701A13807m6584c38265D05208E1385J4164B812b8656j68919
$$ 47155 -16087 -192788 113807 67223 -338265 405208 51385 65549 2812 -28656 -197575
18705a97575L0641B99645a06141D9005e32148E4707J72246a65150K4260e7574
$$ -197575 -166934 299645 -106141 49005 -532148 54707 226953 -165150 -140890 -57574
18694a68090f774j76806A19585K05147e0576j35642m2789j01023B7948c14855
$$ -168090 -6774 -183580 119585 324732 -50576 -186218 -229007 -330030 27948 -314855
18683B77481b65168i9885d7669k41803A06204c21311k5497h7220j64006M7426
$$ 277481 -265168 -99885 -47669 -289472 106204 -321311 -346808 -87220 -251226 -203800
18673b03800A61811a15082L3042A03180a01004I1095M258e5043k25651c7871q9751
$$ -203800 161811 -115082 -82040 103180 -101004 91095 95353 -55043 -280694 -37871 -127622
18662a27622o7513g4635j52360a6920H5668a20944O0364f45B132R801O7979a643
$$ -127622 -195135 -74635 -226995 -16920 85668 -120944 -60580 -645 2132 11933 79912 -1643
18649b93102A64026b95173b4887A35503i5016j60329f0909F7294J59935i2455
$$ -293102 164026 -295173 -24887 135503 -95016 -255345 -60909 67294 227229 -92455
18638a39332F709c06017b6020A01856a06584K6374k1760q0276b3477j32670A98556
$$ -139332 6709 -306017 -26020 101856 -106584 -80210 -101970 -182246 -23477 -156147 198556
18626E830c98068g4015A6623b63468G7351J93807j17082e8654j57606J06551A98684
$$ 5830 -398068 -74015 16623 -263468 77351 271158 154076 -58654 -216260 -109709 198684
18614a12141a2224k11690J9057g1194A98421l8475n4969c89412C26856a89394
$$ -112141 -12224 -223914 -204857 -71194 198421 159946 104977 -389412 326856 -189394
18603E143i8701j28143b5777m9027A0095J06579a03908k9885K7863d0785B22082
$$ 5143 -98701 -226844 -25777 -74804 10095 116674 -103908 -133793 -105930 -40785 222082
18591e2101A48963a15013A07097K3753b36374a6076A7712a5539C79722a31264
$$ -52101 148963 -115013 107097 130850 -236374 -16076 17712 -15539 379722 -131264
18580b47943j35142a79128A00636f6477k89124A9986a48993A04146i1180j81380
$$ -247943 -383085 -179128 100636 -66477 -355601 19986 -148993 104146 -91180 -272560
18570b72560H5254I143a04498k37581J0362B82120D2680a47999q8893c5575j50125
$$ -272560 85254 9143 -104498 -342079 -331717 282120 42680 -147999 -236892 -35575 -185700
18559a85700j88153G82b00382a4776A9476f8130H3195p185b60797L8067e1865
$$ -185700 -373853 782 -200382 -14776 19476 -68130 83195 76010 -260797 -222730 -51865
18547C3109d80885K14494H1985h8428A35599c33950C2395b06962A07125A0425
$$ 33109 -480885 -266391 81985 -88428 135599 -333950 32395 -206962 107125 10425
18536d76362K35349a04213A92153l896a22613A39533A9163b33176O1632A53655
$$ -476362 -241013 -104213 192153 188257 -122613 139533 19163 -233176 -171544 153655
18525B86911b34904C4034a63267g0092r5965E3057c9636O941k30564j50553B7889
$$ 286911 -234904 34034 -163267 -70092 -166057 53057 -39636 -32695 -263259 -413812 27889
18513b2883A5173L92246A2323g1461j03533A99904a15314F5954b02127h2198I0237
$$ -22883 15173 407419 12323 -71461 -174994 199904 -115314 65954 -202127 -82198 90237
18501e2904C5711g276m4713A97113b96634J07086Q2349d0495A25124b38138J16108
$$ -52904 35711 -7276 -51989 197113 -296634 -189548 -107199 -40495 125124 -238138 -122030
18490a22030a8740C8670K25425j21680c03049J46384f1191B273O2603a66221B1578
$$ -122030 -18740 38670 264095 142415 -303049 -156665 -61191 2273 64876 -166221 21578
18478b23974j60001R9887J40143B19227r9039N1863c5574l01755B27150A4215
$$ -223974 -383975 -284088 -143945 219227 120188 172051 -35574 -337329 227150 14215
18467c8553m5543j03613P2545N1381j69888M6470L149A30367a433n0754j06049
$$ -38553 -84096 -187709 -115164 -63783 -233671 -187201 -184052 130367 -1433 -52187 -158236
18456a58236d2896k22897A78059a18315A52432J5284B606f8228A27483J42942
$$ -158236 -42896 -265793 178059 -118315 152432 167716 2606 -68228 127483 270425
18446B70425n8256m1589k3641b28973M2682A0738a8130k30894E3456i2170j26574
$$ 270425 212169 170580 146939 -228973 -186291 10738 -18130 -249024 53456 -92170 -218744
18435b18744L6632r310A44141q987c1608m80416b03942A69962G4032b47357B0358
$$ -218744 -182112 -191422 144141 135154 -31608 -512024 -203942 169962 74032 -247357 20358
18423c9752P227j20655M3734j51152L4508d4375o7739c3660A76261d3146A81398
$$ -39752 -32525 -153180 -109446 -260598 -226090 -44375 -112114 -33660 176261 -43146 181398
18411B292J76453n2343i5132A55627F673c24064a06896D1991J0896K6290b7458
$$ 2292 178745 126402 -95132 155627 6673 -324064 -106896 41991 52887 79177 -27458
18399g5396h338A2639a16996k3813K7902H8039a57720p4806c7058j69672l3262
$$ -75396 -8338 12639 -116996 -140809 -112907 88039 -157720 -232526 -37058 -206730 -239992
18388b39992I2528l2436L0528b78103H0622J42214r5837k3695k0024c23418Q8410
$$ -239992 92528 60092 90620 -278103 80622 222836 126999 103304 83280 -323418 -235008
18377b35008A31215a28580k02344D4641J95518q6063c1972A69451D443g5440E3120
$$ -235008 131215 -128580 -330924 44641 240159 154096 -31972 169451 4443 -75440 53120
18365A08718k0364C6124b98367e5196E3371J40045n1831C0727a41936I915a50294
$$ 108718 88354 36124 -298367 -55196 53371 193416 141585 30727 -141936 9915 -150294
18353A69656d7814j15484A57816a8789j2705p2687D56516A86368a43512i46n5500
$$ 169656 -47814 -163298 157816 -18789 -31494 -104181 456516 186368 -143512 -946 -56446
18342e6446G8155J55977C2649a29764a0439d113j10328k81863f2694j40048A58005
$$ -56446 78155 234132 32649 -129764 -10439 -4113 -114441 -396304 -62694 -202742 158005
18330i0646j48099h0920B0118M2125M2301d47076a30372J1579j45470a8171j08013
$$ -90646 -238745 -80920 20118 62243 104544 -447076 -130372 -118793 -264263 -18171 -126184
18319a26184A64069f2041M818p0069A3025a20381k0963A2065B885K04990a37431
$$ -126184 164069 -62041 -57223 -127292 13025 -120381 -141344 12065 2885 207875 -137431
18307A36203J20835A18808h5238G3777H08d205B9458c31968J11834q1524e1004
$$ 136203 257038 118808 -85238 73777 808 -4205 29458 -331968 -220134 -301658 -51004
18295d47375B7320b06713h6527j80794A12768b66231l8483B39581e05800g5627
$$ -447375 27320 -206713 -86527 -267321 112768 -266231 -304714 239581 -505800 -75627
18284A18868b05885B09925b00410D7864P2387b07419e4371A2637J57131a1941
$$ 118868 -205885 209925 -200410 47864 120251 -207419 -54371 12637 169768 -11941
18273A15021i8726E5464i3060B39760H0221e1436A17571a7933I21e44875D1073
$$ 115021 -98726 55464 -93060 239760 80221 -51436 117571 -17933 921 -544875 41073
18261b0506m6726A04840J31875a97496i7270l13451J78531j28072A47066a14740
$$ -20506 -67232 104840 236715 -197496 -97270 -410721 -232190 -360262 147066 -114740
18250h7653k2426a8201C5534b01960g7332j29993j3540D5013a25622A72504c1651
$$ -87653 -110079 -18201 35534 -201960 -77332 -207325 -220865 45013 -125622 172504 -31651
18238H2657K3152l59b7964k00671M5299b5656H042O4055i0756B27190d43685F3650
$$ 82657 105809 105450 -27964 -228635 -183336 -25656 8042 72097 -90756 227190 -443685 63650
18225C7757J94006E6754L0118a8084k66829J03110A12939h6803j93447B9359A2462
$$ 37757 231763 56754 86872 -18084 -284913 -181803 112939 -86803 -280250 29359 12462
18213A98574J05962A51679h1403m7527Q297C865K55200a47174I3155N3452b54491
$$ 198574 304536 151679 -81403 -128930 -120633 3865 259065 -147174 93155 146607 -254491
18201B01023d933B76977D802a01900A00936b01032d7866C2577b75482B8890O1315
$$ 201023 -4933 276977 4802 -101900 100936 -201032 -47866 32577 -275482 28890 90205
18190I0205a62173C8899O4259g8113B87827a9461k64580d7274k35912R08E5341
$$ 90205 -162173 38899 103158 -78113 287827 -19461 -284041 -47274 -283186 -282278 55341
18178A33618e056A19655a16199a7472k30345a5971j55473A216f0796D327J85341
$$ 133618 -5056 119655 -116199 -17472 -247817 -15971 -171444 1216 -60796 4327 189668
18167A89668a06745a5562C7502O5524O3803a15308K9932A18479b69164D6323K94394
$$ 189668 -106745 -15562 37502 103026 166829 -115308 -85376 118479 -269164 46323 340717
18156C40717H212K88111j07060D0147h2967j09408E5343b24431d7331n5113F635
$$ 340717 8212 296323 189263 40147 -82967 -192375 55343 -224431 -47331 -102444 6635
18144H6027b63861l0233A59864J539o2557L9858P9035b44706J0383B369c28418
$$ 86027 -263861 -294094 159864 161403 98846 138704 217739 -244706 -234323 2369 -328418
18132I7972a6838j88818M4414j54379A21412k1519q070a20700k9898c3327p8307
$$ 97972 -16838 -205656 -161242 -315621 121412 99893 91823 -120700 -150598 -33327 -111634
18121a11634I5950C4724J8085g6467L8047p2689K0033k48260J10790A57693a01907
$$ -111634 95950 34724 52809 -76467 -38420 -111109 -91076 -339336 -228546 157693 -101907
18109b73419k24835K38423H0314b06358H2436J8390h4604o4650j43828R9913k17680
$$ -273419 -498254 -259831 80314 -206358 82436 100826 -84604 -149254 -293082 -193169 -410849
18098d10849A10576e3865n8870j33673J6572B87894b5272j9800p5686A6146J15396
$$ -410849 110576 -53865 -112735 -246408 -229836 287894 -25272 -45072 -120758 16146 131542
18087A31542b63296A88105a48753g0511j60115a14416J2844D4995Q9602A8102
$$ 131542 -263296 188105 -148753 -70511 -230626 -114416 -101572 44995 134597 18102
18076b9473a0309j54132A61631f435G9641l9714c4066C1932g2463B3689a85514
$$ -29473 -10309 -164441 161631 -6435 79641 39927 -34066 31932 -72463 23689 -185514
18064d4366A6445a57536A09492a98017D2201a123n1266H9941f5226I4715J31002
$$ -44366 16445 -157536 109492 -198017 42201 -1123 -52389 89941 -65226 94715 225717
18053B25717h6160D61b08644L6894A38310N1662e2798B3356J47779b03214D5440
$$ 225717 -86160 461 -208644 -171750 138310 189972 -52798 23356 171135 -203214 45440
18041C22846C4835J1180k2511J67340c42634F503J8197J15096a19065M1542K998
$$ 322846 34835 46015 23504 190844 -342634 6503 24700 139796 -119065 -77523 -74525
18030g4525b49H7423J1013b11712A60751l7311a69784A40999B1740a32116j8160
$$ -74525 -249 87423 98436 -211712 160751 123440 -169784 140999 21740 -132116 -150276
18019a50276N53r3545B37731p6398f2663A10761k0613k4107c0005j45951C14141
$$ -150276 -149723 -243268 237731 161333 -62663 110761 90148 66041 -30005 -175956 314141
18007A58166a54830B24168j00081a12554I0369g4540r268j1571A80775G9773a57620
$$ 158166 -154830 224168 124087 -112554 90369 -74540 -83808 -95379 180775 79773 -157620
17995B46993k0008R5652g1995B10829C0947R258a49051B39951b99036h3450A31728
$$ 246993 226985 322637 -71995 210829 30947 40205 -149051 239951 -299036 -83450 131728
17983a76520D5597J5845f4083I1583e5699j28973C3614F853b76554C30626e753
$$ -176520 45597 61442 -64083 91583 -55699 -184672 33614 6853 -276554 330626 -5753
17971G3358a84763K0630H5270b43376K3608B40899e5601I1239a02583m6104A17488
$$ 73358 -184763 -164133 85270 -243376 -219768 240899 -55601 91239 -102583 -148687 117488
17959A20368g4451B03667m2660a29759A01375m2189J95904a98765B3033J14517
$$ 120368 -74451 203667 161007 -129759 101375 59186 255090 -198765 23033 137550
17949A37550K24196e1541j15848M6310g558B24157J67324E405a73640k30354A38244
$$ 137550 361746 -51541 -167389 -121079 -7558 224157 391481 5405 -173640 -403994 138244
17937g1529D9872a12595A09677H476e4066G6985a99650I3665K34096c97206A6960
$$ -71529 49872 -112595 109677 8476 -54066 76985 -199650 93665 327761 -397206 16960
17925b16099B36378F9910a99872e4640A91280c65414J03470A2828a21848I2108
$$ -216099 236378 69910 -199872 -54640 191280 -365414 -261944 12828 -121848 92108
17914a81510H0531d37852B54580d75405b7093j0149B4238g8035C99070b45801
$$ -181510 80531 -437852 254580 -475405 -27093 -37242 24238 -78035 399070 -245801
17903C42295A34031b84582g5720l5905M8038C9136K61059j42134a36738F758c0590
$$ 342295 134031 -284582 -75720 -111625 -63587 39136 300195 158061 -136738 6758 -30590
17891B08368J71925e7895K2979k21176A03668J42728h5270O59B33399a86007A62523
$$ 208368 380293 -57895 -34916 -256092 103668 246396 -85270 -84611 233399 -186007 162523
17879A76449g2716j63083k6074J25545M7202q1116k4871A78914f3850F2541A8945
$$ 176449 -72716 -235799 -261873 -136328 -89126 -170242 -195113 178914 -63850 62541 18945
17867c6221D7024b7778j502A43165K0017J16098c1057j31786l3452a5296A40034
$$ -36221 47024 -27778 -29280 143165 163182 279280 -31057 -162843 -196295 -15296 140034
17855G9921O5841E6785k845c4881G9502O3641b78179g0873N987I2777D5176f5196
$$ 79921 145762 56785 53940 -34881 79502 143143 -278179 -70873 -64886 92777 45176 -65196
17842h144n6267A57307d7535l5179N296m195D9963N0346h364A30503e0852o4282
$$ -8144 -64411 157307 -47535 -82714 -77418 -81613 49963 100309 -8364 130503 -50852 -115134
17830a15134l03372C5787A2435a27031c781G3172J01303E5108A7730K23298D7627
$$ -115134 -418506 35787 12435 -127031 -3781 73172 174475 55108 17730 241028 47627
17818i5047j45392A021J93279a80472j29018f5704p614A25584N8109n2673J79831
$$ -95047 -240439 1021 194300 -180472 -309490 -65704 -73318 125584 183693 131020 310851
17807C10851A12855C19J81944C4866i3006j63308e8692k06108e0814a7253l9813
$$ 310851 112855 319 182263 34866 -93006 -256314 -58692 -264800 -50814 -17253 -57066
17796e7066B10261B0736J01163a6225A24858F0116d22594E3977h9772G5695a06001
$$ -57066 210261 20736 121899 -16225 124858 60116 -422594 53977 -89772 75695 -106001
17784A84934Q4612G932O2023a76439D4350a70116B14512A6868h3580I5199d2017
$$ 184934 269546 7932 69955 -176439 44350 -170116 214512 16868 -83580 95199 -42017
17772a04315F5531b57846F1012a30847R002n1307C7099L91621D9904K20334H8034
$$ -104315 65531 -257846 61012 -130847 -121845 -173152 37099 428720 49904 270238 88034
17760C53959A68762a21460E791M32942k04676j10432C9069J47287e6516k25669
$$ 353959 168762 -121460 5791 438733 234057 123625 39069 186356 -56516 -282185
17750b82185G0826h4633b2697l9305l1658A9108O3234K24919a6653A08516j8698
$$ -282185 70826 -84633 -22697 -62002 -93660 19108 82342 307261 -16653 108516 89818
17739H9818K59926m0401j21371b64767J01375l04720B10242a96985F2063h1758
$$ 89818 349744 309343 187972 -264767 -163392 -468112 210242 -196985 62063 -81758
17728A25622M3025H2617m0734d9790a8394C78468G9535b76765B96405a292E1174
$$ 125622 168647 82617 41883 -49790 -18394 378468 79535 -276765 296405 -1292 51174
17716A40759c1908C46995H1788a20804A6047b16444A23428F0093K57792b42988
$$ 140759 -31908 346995 81788 -120804 16047 -216444 123428 60093 317885 -242988
17705A61012b77435K7735M8083b8956m5075m1224F9708r595a12503A74163f0114
$$ 161012 -277435 -249700 -201617 -28956 -74031 -115255 69708 60113 -112503 174163 -60114
17693A12829c9940B83887a7145B04669b15762A10863b58833A3544a57964A31562
$$ 112829 -39940 283887 -17145 204669 -215762 110863 -258833 13544 -157964 131562
17682I937a60830A24125b28518c2147H5173b57673i571I9949j9687K4183a68937
$$ 9937 -160830 124125 -228518 -32147 85173 -257673 -9571 99949 80262 104445 -168937
17670b08374C35232j30059o6940B1386a31915B6119J78967a02441K6740H8230
$$ -208374 335232 205173 138233 21386 -131915 26119 205086 -102441 -75701 88230
17659B3909M9925K03255d0951B42083p5870a5224l8912j41774B2551N0724M9511
$$ 23909 73834 277089 -40951 242083 166213 -15224 -54136 -195910 22551 73275 122786
17648A22786c3821A91185J79229n2381A17108a25517d2623B39156H058J99890
$$ 122786 -33821 191185 370414 318033 117108 -125517 -42623 239156 8058 207948
17638B07948h554A68661G2311C708K87761j08459L2282A3633b20124d9414B01202
$$ 207948 -8554 168661 72311 3708 291469 183010 215292 13633 -220124 -49414 201202
17626B05165l2759K53852b6018C298K25892A12816K71073C5474Q1476m0911b46463
$$ 205165 172406 426258 -26018 3298 229190 112816 383889 35474 116950 76039 -246463
17614E4720R93a70759B14936N8849J13511E7886N5283R008p156j8089J14699B3210
$$ 54720 55713 -170759 214936 273785 387296 57886 113169 122177 115021 96932 211631 23210
17601A88990b4556A28616J28354b24807A91367F5865J97426i8764D14533A81933
$$ 188990 -24556 128616 256970 -224807 191367 65865 263291 -98764 414533 181933
17590E9204M9135J90042b28674E4120K56833j13640n3857A5065L15201A32010
$$ 59204 108339 298381 -228674 54120 310953 197313 143456 15065 330266 132010
17579A26264a9037A25170J4285B5668K50848O082j37706e6458A71463a13970I0703
$$ 126264 -19037 125170 139455 25668 276516 282598 144892 -56458 171463 -113970 90703
17567C2467a38915c9827D69659A57311e7132E1392e0410B49476L3099b26257C4558
$$ 32467 -138915 -39827 469659 157311 -57132 51392 -50410 249476 282575 -226257 34558
17555C5627a24768A12249m0814j9008j0114M8312K52706a62013h283j2580A85012
$$ 35627 -124768 112249 71435 52427 42313 90625 343331 -162013 -8283 -20863 185012
17543I8090L07367j73320k5513m4842C1229J12899F2929b21131C7827l750f7489
$$ 98090 405457 232137 206624 161782 31229 144128 62929 -221131 37827 34077 -67489
17531B65818K25497A58795L5466g3171C45463l9960N3589a12598E98847B79210
$$ 265818 491315 158795 194261 -73171 345463 305503 359092 -112598 598847 279210
17520D70344j70041C8580M87332k58631j06549K2941D8990Q1464a73A71262G3672
$$ 470344 300303 38580 525912 267281 160732 183673 48990 130454 -173 171262 73672
17508g0316B08036L39992j44328A76447L24830j23220j49137o7845K9685h117
$$ -70316 208036 548028 403700 176447 501277 378057 228920 161075 190760 -8117
17497B68823I6918B6523f571o0311A7570J39377J20626q4399q4732b337A25591
$$ 268823 96918 26523 -6571 -66882 17570 156947 277573 193174 108442 -2337 125591
17485b32280A41097K04589j45209E2460M59543b7991B62394I6207j0366J61336
$$ -232280 141097 345686 200477 52460 512003 -27991 262394 96207 85841 247177
17475B47177r5678K59751H4303J90410j05921J64775q2L7254A74831L6996K77013
$$ 247177 151499 411250 84303 274713 168792 333567 333485 370739 174831 211827 488840
17464D88840f2346I6245K48275d0367A70626l0527m1281l035J00859J7313L00862
$$ 488840 -62346 96245 344520 -40367 170626 140099 98818 95783 196642 213955 514817
17453E14817a47335e2896C16969J23997l147j29166a6355B15924N939q6509a1094
$$ 514817 -147335 -52896 316969 440966 437819 308653 -16355 215924 221863 135354 -11094
17441A09480K45887j49802C1940K12154Q3763p5796p3791O797J5799p2231l0150
$$ 109480 355367 205565 31940 244094 327857 252061 178270 185067 200866 128635 98485
17430I8485D7812L61486A48296m1082J49158j06801O1842R9979J58282A73636
$$ 98485 47812 409298 148296 107214 256372 149571 211413 311392 469674 173636
17419A61654j5101K24411I5612n885M56745A11854D6385K29428j33437J2437J42119
$$ 161654 146553 370964 95612 89727 546472 111854 46385 275813 142376 154813 296932
17408B96932G2936Q6322h203B00721K638e951A14287N01195k43663j19694B4343
$$ 296932 72936 159258 -8203 200721 203359 -5951 114287 615482 371819 252125 24343
17396B89589M5311g2267A76850R6305J67460q5680o9205c8390C080L00208A39740
$$ 289589 334900 -72267 176850 273155 440615 354935 285730 -38390 3080 303288 139740
17384G068L4178J13270M833k8757g6360E070J69405M26226F3091J87687M0872
$$ 7068 41246 154516 159349 130592 -76360 5070 174475 600701 63091 250778 291650
17373B91650j2452J27929j04369A6318J15679K11852A10257J39482o9323l2732
$$ 291650 279198 407127 302758 16318 131997 343849 110257 249739 180416 147684
17363A47684K0680p5367R4061D7784b80898B4785L9377h0680b9497C16869A00365
$$ 147684 168364 92997 187058 47784 -280898 24785 64162 -80680 -29497 316869 100365
17351B95971q1681a01816B03625r9450D8214J63181J59373A85123r2100J8856
$$ 295971 214290 -101816 203625 104175 48214 211395 370768 185123 93023 111879
17341A11879K5898m3338L2081J25357P7852A45016A2523K67572J1591A25722J00401
$$ 111879 137777 94439 126520 251877 329729 145016 12523 280095 291686 125722 226123
17330B26123F0933J24406I949K09817G8016K23745F1833K34763J3854K31876k67200
$$ 226123 60933 185339 9949 219766 78016 301761 61833 296596 310450 542326 275126
17319B75126A10699B2484L9062Q2392L0573E9744L59592j27037j25458e2652E07673
$$ 275126 110699 22484 61546 143938 174511 59744 419336 292299 166841 -52652 507673
17307D49899j96469O7063D2589K79098O332B788b90083C13229m7823e784A22204
$$ 449899 253430 320493 42589 321687 328019 2788 -290083 313229 265406 -5784 122204
17295B13102J00507A42294J25228K20064k15435N7587o7277D9508K79821O3821
$$ 213102 313609 142294 267522 487586 272151 329738 262461 49508 329329 393150
17285C93150j2009H2737L04760a2304B22131J41622J30922H0221g3998B77538
$$ 393150 381141 82737 387497 -12304 222131 363753 494675 80221 -73998 277538
17274a5843C87495j61201A1278L52075A30453Q1506J49912K5417m3944l2207j2883
$$ -15843 387495 226294 11278 363353 130453 211959 361871 387288 343344 311137 298254
17263B98254M3213K9781H9933M77660j57181A86060J56486o7234k5407J28318
$$ 298254 341467 371248 89933 567593 410412 186060 342546 275312 249905 378223
17253C78223A08639M42534p0357A26768J84654K99893C00952j1252A27943k4407
$$ 378223 108639 551173 480816 126768 311422 611315 300952 289700 127943 103536
17243A03536J71292K0363D2740K09773l5646J48481A66477m6024E9308M32235
$$ 103536 274828 295191 42740 252513 216867 365348 166477 120453 59308 491543
17233D91543j19871j54021k0206m3620K8504N5201k5551H3534k4571J26337K17136
$$ 491543 371672 217651 197445 153825 182329 237530 211979 83534 58963 185300 402436
17222D02436Q2025p9299P4426A36745K37740q920j23068J95962j92791O7833p6604
$$ 402436 484461 405162 479588 136745 374485 365565 242497 438459 245668 313501 236897
17211B36897j108J60041J61960A03253K63193K34959k98674p8848j3539L60424
$$ 236897 235789 395830 557790 103253 366446 601405 302731 223883 210344 570768
17201E70768B41256l2906o0393N46238k27950o1272M4535O2267I0625R6995m8537
$$ 570768 241256 208350 147957 694195 466245 404973 449508 511775 90625 187620 139083
17190A39083K78550q8093J4649K18353a957F08579j02907o1668B17371N9589L62464
$$ 139083 417633 329540 344189 562542 -1957 608579 505672 444004 217371 276960 639424
17179F39424j42342j20725J98203j39691O5554J39301k3184A88370J21951n496
$$ 639424 497082 376357 574560 434869 500423 639724 616540 188370 310321 304825
17169C04825M61597k51448A52550K10682J03299j59470K24633B47602p8193K22875
$$ 304825 766422 514974 152550 363232 466531 307061 531694 247602 169409 392284
17159C92284K14932A32978R9769K37603k7077K07968j18624j22839K76151K6406
$$ 392284 607216 132978 232747 470350 443273 651241 532617 409778 685929 712335
17149G12335j59635p3044j44945J79844M7884A63470O96281l99503R7392j17017
$$ 712335 552700 479656 334711 514555 562439 163470 859751 460248 557640 440623
17139D40623r556J55138k27780K21081P5361j37442J23734C01065K24360J65762
$$ 440623 431067 586205 358425 579506 654867 517425 641159 301065 525425 691187
17129F91187B77162o7151L79719A74845J82593O1095m4021R480J53559J62093
$$ 691187 277162 210011 589730 174845 357438 418533 374512 383992 537551 699644
17119F99644j75149K56326l26274N32992m25861j80996K89788l3899j4961C01554
$$ 699644 524495 780821 454547 987539 561678 380682 670470 636571 621610 301554
17108D00731K90874p4378N782j1130o0174J53700j09942R6983J52053l59054J87308
$$ 400731 691605 617227 623009 611879 551705 705405 595463 692446 844499 485445 672753
17097F72753k00584B16458P21471j67794m6071r3417j04389j91465J47530L75546
$$ 672753 472169 216458 937929 770135 724064 630647 526258 334793 482323 857869
17087H57869j06221K03357m38245L49203P7394D53432K41221J19096j30458j23030
$$ 857869 751648 955005 516760 865963 943357 453432 694653 813749 683291 560261
17077E60261J56629k33228J50318R9743p7099L3750M977l386J8243K62016k52801
$$ 560261 716890 483662 633980 733723 656624 690374 695351 691965 710208 972224 719423
17066G19423J98999j22520N7386k74887M58034m65409K30208J88305m13691J33760
$$ 719423 918422 795902 853288 578401 1036435 571026 801234 989539 575848 709608
17056G09608K80413l63158K82650j48114P1761p8499p7633j37697M18607J01837
$$ 709608 990021 626863 909513 761399 833160 754661 677028 539331 957938 1059775
17046A059775l70212J31253j62214L44939J67967j56289l34843Q3694L1850L84638
$$ 1059775 689563 820816 658602 1003541 1171508 1015219 680376 764070 795920 1180558
17036A180558r9525k77072L2913J45077l22525L95006j77167o9372K17148P5972
$$ 1180558 1081033 803961 836874 981951 659426 1054432 877265 807893 1025041 1101013
17026A101013l9844K05219K7247m15513J25072D76128M26330K94381N779j2545
$$ 1101013 1061169 1266388 1293635 878122 1003194 476128 902458 1196839 1202618 1190073
17016A190073k27603J49507K90781J91976n76820j23196J66931k850J10395L4097
$$ 1190073 962470 1111977 1402758 1594734 1017914 894718 1061649 1058799 1169194 1203291
17006A203291K16400j58627j20220K70375k12415j9008p3131J3527J51800l08108
$$ 1203291 1419691 1261064 1140844 1411219 1198804 1179796 1106665 1120192 1271992 963884
16996I63884L47082l74239L14904O0917K48502l08867J22700k01953J72169n0336
$$ 963884 1310966 936727 1251631 1312548 1561050 1252183 1374883 1172930 1345099 1294763
16986A294763L7034j75381N07309j05392k38392M50475j14177j8386q8800j88932
$$ 1294763 1331797 1156416 1663725 1558333 1319941 1770416 1656239 1637853 1549053 1360121
16976A360121j2834K6589J09853j09134O0600k8148K39613l98935K57991J93121
$$ 1360121 1347287 1373876 1483729 1374595 1435195 1407047 1646660 1247725 1505716 1698837
16966A698837k11036J14465L03230m11626J48196K6508M237P480o3181K82660
$$ 1698837 1487801 1602266 1905496 1493870 1642066 1668574 1672811 1680291 1617110 1899770
16956A899770k77849K58956P221q5046l7118k98805K82368J14690j65657j00287
$$ 1899770 1621921 1880877 1888098 1803052 1765934 1467129 1749497 1864187 1698530 1598243
16946A598243L62422k23663J95784L62534r4984n5078j16498q2193P3784K8322
$$ 1598243 1960665 1737002 1932786 2295320 2200336 2145258 2028760 1946567 2020351 2048673
16936B048673k932K26540l82066J22191J79058P9113j3730K8859J38613k10778
$$ 2048673 2045741 2272281 1890215 2012406 2191464 2270577 2256847 2285706 2424319 2213541
16926B213541K60048J20489j39810J39090j83202j4706O2006J13997J3305q0344
$$ 2213541 2473589 2594078 2454268 2593358 2410156 2395450 2457456 2571453 2584758 2504414
16916B504414L59690k73009j13931J12868k62084N24889k25671N82143m19445
$$ 2504414 2864104 2591095 2477164 2590032 2327948 2852837 2627166 3209309 2789864
16907B789864K63077N0546p4014O3047j99852Q9056j89115N00080r0590m7662
$$ 2789864 3052941 3103487 3029473 3092520 2892668 2981724 2792609 3292689 3202099 3154437
16897C154437M24171p5477k77867O2033J65151l0901k00682K61851L31860j95280
$$ 3154437 3578608 3503131 3225264 3287297 3452448 3421547 3220865 3482716 3814576 3619296
16887C619296j12286k73543P31671l32653K32295K26228N401J34312k55113L24301
$$ 3619296 3507010 3233467 3965138 3632485 3864780 4091008 4096409 4230721 3975608 4299909
16877D299909l16435K80502r0211K64205J37159k91594j1655K05185J23145k902
$$ 4299909 3983474 4263976 4173765 4437970 4575129 4283535 4271880 4477065 4600210 4597308
16867D597308K00156j38626L80562j80343J61332r935L17029r7697n5932L30580
$$ 4597308 4797464 4658838 5039400 4859057 5020389 5010454 5327483 5229786 5173854 5504434
16857E504434L7224K00127r4207K28874O1332j2966J15725K7088J2788m4437M22817
$$ 5504434 5541658 5741785 5647578 5876452 5937784 5924818 6040543 6067631 6080419 6035982 6458799
16846F458799j60411L04135Q959M30552k02563K33250L45874N5543j32144L05981
$$ 6458799 6298388 6602523 6611482 7042034 6839471 7072721 7418595 7474138 7341994 7647975
16836G647975k06094J67637L05774K35592J18711q914k245K24116K67566N06772
$$ 7647975 7441881 7609518 7915292 8150884 8269595 8260681 8258436 8482552 8750118 9256890
16826I256890m09549O28889J52446l24789N96197l03856P40226j34602M99273
$$ 9256890 8847341 9476230 9628676 9303887 9900084 9596228 10336454 10201852 10701125
16817A0701125M1426L90676L2666K44204J83408K94522K89016O6087K57218M32206
$$ 10701125 10742551 11133227 11165893 11410097 11593505 11888027 12177043 12243130 12500348 12932554
16807A2932554J54016M08429K04585J25276L99952O05738O1557O69762L63138
$$ 12932554 13086570 13494999 13699584 13824860 14224812 14830550 14892107 15561869 15925007
16798A5925007L64897o5040L37575O73739M97623J31079O42820M21840M32977
$$ 15925007 16289904 16224864 16562439 17236178 17733801 17864880 18507700 18929540 19362517
16789A9362517L16588L86003O82619N16168O89589O3166N74612Q57364M57076
$$ 19362517 19679105 20065108 20747727 21263895 21953484 22016650 22591262 23448626 23905702
16780B3905702M01346J114268M23682Q35515L77564J114996P46885R99795O29653
$$ 23905702 24307048 25421316 25844998 26680513 27058077 28173073 28919958 29919753 30549406
16771C0549406O75893R33071P69661P84021R03688J631548P93053Q11907J096511
$$ 30549406 31225299 32158370 32928031 33712052 34615740 36247288 37040341 37852248 38948759
16762C8948759J261805R12878J357912J316609J240797J129937J426430J668274
$$ 38948759 40210564 41123442 42481354 43797963 45038760 46168697 47595127 49263401
16754D9263401R08072J208004J456180J774068J576657J694472J486859J693407
$$ 49263401 50171473 51379477 52835657 54609725 56186382 57880854 59367713 61061120
16746F1061120J423311J436158J887667J446692J682065J601891J751231J202324
$$ 61061120 62484431 63920589 65808256 67254948 68937013 70538904 72290135 73492459
16738G3492459K027795J093647K136182J086601J416964J216249J104369J222540
$$ 73492459 75520254 76613901 78750083 79836684 81253648 82469897 83574266 84796806
16730H4796806P13215J053605M75758R77514M73112L38025L39513m1482k43442
$$ 84796806 85510021 86563626 87039384 88016898 88490010 88828035 89167548 89126066 88882624
16721H8882624l54514j60262n46648m43254n57909q85974j147559j262814r06794
$$ 88882624 88528110 88367848 87821200 87377946 86820037 85934063 84786504 83523690 82616896
16712H2616896j489307j043150j626079j619312j398036j433096j643890j560224
$$ 82616896 81127589 80084439 78458360 76839048 75441012 74007916 72364026 70803802
16704G0803802j809800j326227j825006j804517j499572j877666j064213j726017
$$ 70803802 68994002 67667775 65842769 64038252 62538680 60661014 59596801 57870784
16696E7870784j775725j155191j851152j568573j351435j448261j135470j276172
$$ 57870784 56095059 54939868 53088716 51520143 50168708 48720447 47584977 46308805
16688D6308805j279874j379479j045384j124447j158735j167290j180610q82669
$$ 46308805 45028931 43649452 42604068 41479621 40320886 39153596 37972986 37090317
16680C7090317j110261n86263j113695p62153j209232n52985j113299n98396j117655
$$ 37090317 35980056 35393793 34280098 33517945 32308713 31755728 30642429 30044033 28926378
16671B8926378o88925m82856n14777q41045p89923n94999n60203p14364n78459
$$ 28926378 28237453 27754597 27239820 26398775 25608852 25013853 24453650 23739286 23160827
16662B3160827m36201l56305o75855l71373n65953p49216k22515l55568n57987
$$ 23160827 22724626 22368321 21692466 21321093 20755140 20005924 19783409 19427841 18869854
16653A8869854q23117J22139l28596m54750o39481l51489n8866l20829k11228
$$ 18869854 18046737 18168876 17840280 17385530 16746049 16394560 16335694 16014865 15803637
16644A5803637o60518k86799l77954p407j88879p37635N7562m54151J38506k71405
$$ 15803637 15143119 14856320 14478366 14470959 14282080 13544445 13602007 13147856 13286362 13014957
16634A3014957n91257j34277j61364l31453j98317k98967l1672K5241n86396N1891
$$ 13014957 12423700 12289423 12128059 11796606 11598289 11299322 11267650 11292891 10706495 10758386
16624A0758386p1224l73151m576k24098l95674R9616l39966J15528n42272K58213
$$ 10758386 10687162 10314011 10309435 10085337 9689663 9789279 9449313 9564841 9022569 9280782
16614I280782k83731j38868j75982j61339n641k25159o9360j67122k71743p4704
$$ 9280782 8997051 8858183 8682201 8520862 8515221 8290062 8220702 8053580 7781837 7707133
16604G707133J1461j88591l31534m6418n5341O6561k27611k50498K86167p9110
$$ 7707133 7718594 7530003 7198469 7152051 7096710 7163271 6935660 6685162 6971329 6892219
16594F892219o5924l08333L6700J08441m7173q0577j53285o25336N70752k32482
$$ 6892219 6826295 6517962 6554662 6663103 6615930 6535353 6382068 5756732 6327484 6095002
16584F095002k11474k06249J69140j76502j15853n4205J92670j34317k84444j34654
$$ 6095002 5883528 5677279 5846419 5669917 5554064 5499859 5692529 5558212 5273768 5139114
16574E139114K83047k24623k96119J69413J57869m09176J56364k58835k15215
$$ 5139114 5422161 5197538 4901419 5070832 5228701 4819525 4975889 4717054 4501839
16565D501839K80596k42129o0157j08486j18893K75733q6836k15031K73540k25984
$$ 4501839 4782435 4540306 4480149 4371663 4252770 4528503 4441667 4226636 4500176 4274192
16555D274192n7198J08826j47523j00239m3958J62461k11181j68227K93364m00437
$$ 4274192 4216994 4325820 4178297 4078058 4034100 4196561 3985380 3817153 4110517 3710080
16545C710080p2370L77231j04264j37090l5498M2852l10044J37016j53130m83168
$$ 3710080 3637710 4014941 3910677 3773587 3738089 3780941 3470897 3607913 3454783 2971615
16535B971615N96772l3371j17793N2596k62220k42451L22427K19917n35997J90408
$$ 2971615 3568387 3535016 3417223 3469819 3207599 2965148 3287575 3507492 2971495 3161903
16525C161903q098k1702l88572K43144K47437j27754l49780K54343j64654J74548
$$ 3161903 3153805 3132103 2743531 2986675 3234112 3106358 2756578 3010921 2846267 3020815
16515C020815j14690k26989K88802k27440J04072Q7463l78595K74093L6492p9313
$$ 3020815 2906125 2679136 2967938 2740498 2844570 2932033 2553438 2827531 2864023 2784710
16505B784710j37477J48500K6429l92675K10987p0851L8180J57021j85343K05129
$$ 2784710 2647233 2795733 2822162 2429487 2640474 2569623 2607803 2764824 2579481 2784610
16495B784610k37179N0992k17246J45642j27795Q148N3322j33018k12995N10925
$$ 2784610 2547431 2598423 2381177 2526819 2399024 2407172 2460494 2327476 2114481 2625406
16485B625406l30711J71968l32529K28115j18051n4935k27160J16945L02469k21095
$$ 2625406 2294695 2466663 2134134 2362249 2244198 2189263 1962103 2079048 2381517 2160422
16475B160422r1137j71822L18055j12074R556q2051Q7386k71098L14855n34244
$$ 2160422 2069285 1897463 2215518 2103444 2113000 2030949 2118335 1847237 2162092 1627848
16465A627848M68541M0527k61064J65658M3575l92320J68729o3701L8275j27758
$$ 1627848 2096389 2136916 1875852 2041510 2085085 1692765 1861494 1797793 1836068 1708310
16455A708310j71049K68821n3863j1332K70313m54429K27714j39289P1429J43603
$$ 1708310 1537261 1806082 1752219 1740887 2011200 1556771 1784485 1645196 1716625 1860228
16445A860228k03573j0467J05430O1542l93231M84761n29995K15150J58306L80377
$$ 1860228 1656655 1646188 1751618 1813160 1419929 1904690 1374695 1589845 1748151 2128528
16435B128528o67618L08203o1287J2571M4842j02758p9303j21829J40504j27527
$$ 2128528 1460910 1769113 1707826 1720397 1765239 1662481 1583178 1461349 1601853 1474326
16425A474326L1708k63661K61877J80419L20294o79658q1186P9314K22426M7297
$$ 1474326 1506034 1242373 1504250 1684669 2004963 1325305 1244119 1323433 1545859 1593156
16415A593156M6960k11067J17333j59136o5507n4392K66583J91066l15138J2465
$$ 1593156 1640116 1429049 1546382 1387246 1321739 1267347 1533930 1724996 1409858 1422323
16405A422323J64552n9331k99218J19205l3748K14464k44120O9464j37019J32393
$$ 1422323 1586875 1527544 1228326 1347531 1313783 1528247 1284127 1353591 1216572 1348965
16395A348965j08886M20074k75318n5679l27484K70257N1413J53565m26604J43256
$$ 1348965 1240079 1660153 1384835 1329156 1001672 1271929 1323342 1476907 1050303 1193559
16385A193559j01554J37096k30344q0040P8280J34220j9045K89350k95025K2511
$$ 1193559 1092005 1229101 998757 918717 996997 1131217 1112172 1401522 1106497 1129008
16375A129008Q2548j5709L1917j23725r93L28040R9299l45463n4322j17250J80709
$$ 1129008 1211556 1195847 1227764 1104039 1103046 1431086 1530385 1184922 1130600 1013350 1194059
16364A194059j68093J47310j35674K98499k86032k50157L04905k47803K02573
$$ 1194059 1025966 1173276 1037602 1336101 1050069 799912 1104817 857014 1059587
16355A059587l3191K32156m07453L01129j33902J26491K31438j84015j55570J90442
$$ 1059587 1026396 1258552 851099 1152228 1018326 1144817 1376255 1192240 1036670 1227112
16345A227112l09288o2251K15689P2687E57238L82375K79315l31434K78873k11335
$$ 1227112 917824 855573 1071262 1143949 557238 939613 1218928 887494 1166367 955032
16335I55032K1412l59043L26819j62361P3986K01424j79080q7771L17897k93746
$$ 955032 976444 617401 944220 781859 855845 1057269 878189 790418 1108315 814569
16325H14569K40724J7828m33476K50904p7221O711q3338J81172M821k8957k46766
$$ 814569 1055293 1073121 639645 890549 813328 820039 736701 917873 922694 893737 646971
16314F46971M38737k03221J53320m6935j40514J04289D23747J96168L5329L95298
$$ 646971 1085708 882487 1035807 988872 848358 952647 423747 619915 655244 1050542
16304A050542E05981N01374D52151L87224K5792j57033K62490m01853L41884k6476
$$ 1050542 505981 1007355 452151 839375 865167 708134 970624 568771 910655 884179
16294H84179j74462K48816k93057k65160P2712L90130j41687J9466J6267n0466
$$ 884179 709717 958533 665476 400316 473028 863158 721471 740937 757204 706738
16284G06738K63403l19997k6068O2178K5113J77610j28493q7724k39623n2794
$$ 706738 970141 650144 624076 686254 711367 888977 760484 672760 433137 380343
16274C80343K03282L89969l15458J44587k19864K17162j73889J95281l51135K28405
$$ 380343 583625 973594 658136 802723 582859 800021 626132 821413 470278 698683
16264F98683N3119k89460J00215K26577C93277M97694m6360k47647J22409k51008
$$ 698683 751802 462342 562557 789134 393277 890971 844611 596964 719373 468365
16254D68365O0637q68J87670l0586J69707k1329j97735r251L57562C88863J56298
$$ 468365 529002 528134 715804 685218 854925 833596 635861 626610 984172 388863 545161
16243E45161m6644G7444Q30981L1391k74955k73661L6128j8919J10132q0412l2583
$$ 545161 498517 77444 908425 939816 664861 391200 427328 408409 518541 438129 405546
16232D05546N9946L66467l73819j54118O4310O2710K78673k61277J80686J23008
$$ 405546 465492 831959 458140 304022 368332 431042 709715 448438 629124 752132
16222G52132j8393k07267j53387p4324J67992n3471l5934J03379J60446B10256
$$ 752132 733739 526472 373085 298761 466753 413282 377348 480727 641173 210256
16211B46252K97072j7311m7750j74145J48781M06727l23450k02020J86323m9651
$$ 246252 543324 526013 478263 304118 452899 859626 536176 334156 520479 470828
16201D70828j25625K29972k03735J86473A76270L39654K12863p6982l20042J04818
$$ 470828 345203 575175 371440 557913 176270 515924 728787 651805 331763 436581
16191D36581P8881j70687K3172M32991l20784L41292l02991j80232k4341j0349
$$ 436581 515462 344775 367947 800938 480154 821446 518455 338223 313882 303533
16181C03533K25259p6412R9985k40979Q0940J3058n2382D8938O25161B87734l0435
$$ 303533 528792 452380 552365 311386 392326 405384 353002 48938 674099 287734 257299
16170B57299J15137J5721j24069J33127q6509j52995c6778B21029k805J67552
$$ 257299 372436 388157 264088 397215 310706 157711 -36778 221029 218224 385776
16160C85776K86510B91042K66703Q73A23369J12622L57377A97354P5862O2199
$$ 385776 672286 291042 557745 558618 123369 235991 593368 197354 273216 335415
16150C35415J25407K74278l10471j69684A19999M2691Q7533J02262q5996K9656
$$ 335415 460822 735100 424629 254945 119999 162690 250223 352485 266489 296145
16140B96145O2627A05215L09108K39715B98119J01649j8529A45426L1365K22159
$$ 296145 358772 105215 414323 654038 298119 399768 381239 145426 176791 398950
16130C98950j67445O3641L4305r3331K25697O8268j11953j34734J07820O865L09910
$$ 398950 231505 295146 329451 236120 461817 530085 418132 283398 391218 398083 707993
16119G07993A35066R822L18295j56263K38290a00916B85931l6561L1714N420m2523
$$ 707993 135066 144888 463183 306920 545210 -100916 285931 249370 281084 286504 243981
16108B43981R1039J365j37315K15647A46274J90664m555p4477J72326k12446K95416
$$ 243981 335020 336385 199070 414717 146274 336938 332383 257906 430232 217786 513202
16097E13202A98109K19098j17937j23334M600A9133K07188M2676K15248K5167
$$ 513202 198109 417207 299270 175936 180536 19133 226321 268997 484245 509412
16087E09412d1375G5221A578M53917A25792a79774G783J83433J512B277J44587
$$ 509412 -41375 75221 1578 455495 125792 -179774 7783 191216 192728 2277 146864
16076A46864l008J45938R240D0575K99104m9035r1368L5965J20037I5180D0943
$$ 146864 143856 289794 299034 40575 339679 290644 199276 235241 355278 95180 40943
16064C53534A1590Q9544K92651j53805n7974J18691M622G4041K44684j23767h9011
$$ 353534 11590 101134 393785 239980 182006 300697 305319 74041 318725 194958 -89011
16052a33812I3260J47838p5691J15614A15672J37704k2595e9679B43023k1282
$$ -133812 93260 241098 165407 281021 115672 253376 230781 -59679 243023 221741
16042B21741J51432i5528A88347R6806G0976J1840k723M80873B30334M5251A31331
$$ 221741 373173 -95528 188347 285153 70976 82816 80093 560966 230334 275585 131331
16030B63446I9195a8232j50684C89390j54427l3066n5851d7601A89187O7233b20207
$$ 263446 99195 -18232 -168916 389390 234963 201897 146046 -47601 189187 256420 -220207
16018a25383A14068K41354j27245n1566c2768B33275k1905j1072E9281I494i5960
$$ -125383 114068 355422 228177 176611 -32768 233275 211370 200298 59281 9494 -95960
16006F5073a53865m3150A08903N34b8361A17448K33771i9351G5231a79916B5304
$$ 65073 -153865 -197015 108903 109437 -28361 117448 351219 -99351 75231 -179916 25304
15994H1071H341K8007o570J09751o3314K47736j5138A53377M31894k09470L39919
$$ 81071 8341 36348 29778 139529 76215 323951 308813 153377 585271 375801 715720
15983G15720C10406J14753J7457j85374q9844l3750k6111L7117J56407b48783
$$ 715720 310406 425159 442616 257242 167398 133648 107537 144654 301061 -248783
15972a59165B62997J57897C3547b00969R0856q443B42671q3473J89472C4076J38369
$$ -159165 262997 420894 33547 -200969 -110113 -118556 242671 159198 348670 34076 172445
15961A72445a7012C29489E8890K31471j11013a75925b608A6417O6625B2695c7755
$$ 172445 -17012 329489 58890 290361 179348 -175925 -2608 16417 83042 22695 -37755
15949A99296N5731b43536I574J45064J17735j01723G7119N0153C8109J16255B8527
$$ 199296 255027 -243536 9574 154638 272373 170650 77119 127272 38109 154364 28527
15937A35265M8483a6441A40606a43890E7198a68690L7171j259b4006k5361R937
$$ 135265 183748 -16441 140606 -143890 57198 -168690 -131519 -132778 -24006 -49367 -39430
15926c9430A07142J27652b9597A1769e2254K4377A85116a73530q6913D22539o2904
$$ -39430 107142 234794 -29597 11769 -52254 -27877 185116 -173530 -260443 422539 359635
15915C59635I3247D1810J57293d3671J8949A27518B8791j2357J72740G3427i9299
$$ 359635 93247 41810 199103 -43671 -24722 127518 28791 16434 189174 73427 -99299
15903B80309N2615q6073c9763C51326j27266p2809D9769a29824B06617c06745
$$ 280309 332924 246851 -39763 351326 224060 151251 49769 -129824 206617 -306745
15892b1449p6461J4815j60159j01244A02851c13012a21617A75947n3712a65613
$$ -21449 -97910 -83095 -243254 -344498 102851 -313012 -121617 175947 122235 -165613
15881A60754m2003J06516n8347d7257B04532I5549K32206A05376A1577f0344A17481
$$ 160754 118751 225267 166920 -47257 204532 95549 327755 105376 11577 -60344 117481
15869B38501c17359E8444k1012a28715j99415A14094k5187k399f8345A60461a70858
$$ 238501 -317359 58444 37432 -128715 -328130 114094 88907 86508 -68345 160461 -170858
15857D68622A06311a14924L1775C32445b7284C8161L51514A01926h1058E8254
$$ 468622 106311 -114924 -83149 332445 -27284 38161 389675 101926 -81058 58254
15846E6783J19381a71060A90054L0764m8901a5186p6292I3402j4843N915k7731
$$ 56783 176164 -171060 190054 220818 171917 -15186 -91478 93402 78559 84474 56743
15835E6743b35596J08389p1412M7967b5915B09489G714a56501A39139a81045f7221
$$ 56743 -235596 -127207 -198619 -150652 -25915 209489 7714 -156501 139139 -181045 -67221
15823c6764E7237K37031h2217L0783A15383m9731B540a31588e6655A3509a2676
$$ -36764 57237 294268 -82217 -51434 115383 65652 2540 -131588 -56655 13509 -12676
15811E3908J27037O8285N0489a09245M2519j40628N9672J2903A0486b41487m0797
$$ 53908 180945 249230 299719 -109245 -66726 -207354 -147682 -134779 10486 -241487 -282284
15800b82284O4127A41946P1161F6676a48357B02958a46915M3681M1914F6994O9043
$$ -282284 -218157 141946 213107 66676 -148357 202958 -146915 -103234 -61320 66994 136037
15789A36037g9564L7790C84645c2624j53614A81814b0030F0735a48457A34546
$$ 136037 -79564 -41774 384645 -32624 -186238 181814 -20030 60735 -148457 134546
15778A2308h3259A2342a07991B74766F0620a9868A83415J48891F0673K6906K60576
$$ 12308 -83259 12342 -107991 274766 60620 -19868 183415 332306 60673 87579 348155
15767C48155b61564f8971B5624h1034I2523c3332E1413L32373c68615E0165l353
$$ 348155 -261564 -68971 25624 -81034 92523 -33332 51413 383786 -368615 50165 46812
15756D6812J219L4933P6988P5000a50022D6339a60373A46148H1J58240f3542o3897
$$ 46812 48031 82964 159952 234952 -150022 46339 -160373 146148 81 158321 -63542 -127439
15744a27439e6140B02297b3006j27064j44307C3787h9786q0190i540j91022A23992
$$ -127439 -56140 202297 -23006 -150070 -294377 33787 -89786 -169976 -9540 -200562 123992
15732C1774e2355B5601a48968k1010q9839C34632I8567a53170k26241F4671d2425
$$ 31774 -52355 25601 -148968 -169978 -259817 334632 98567 -153170 -379411 64671 -42425
15720i0209B4627L9469a8979B78236C2974K7852j7887L2874a88723C7476J59516
$$ -90209 24627 64096 -18979 278236 32974 60826 42939 75813 -188723 37476 196992
15709A96992a72989J9660A27581h471A07916a1465A18081J22620a1488j10416
$$ 196992 -172989 -153329 127581 -8471 107916 -11465 118081 240701 -11488 -121904
15699a21904e6701A58307a71939j57685C423a30132j68514a40940n321f5628l7185
$$ -121904 -56701 158307 -171939 -329624 3423 -130132 -298646 -140940 -146261 -65628 -102813
15688a02813L4757J7948p0944c3265k22708m8386D2551M7089a79325H1556e7929
$$ -102813 -68056 -50108 -121052 -33265 -255973 -304359 42551 89640 -179325 81556 -57929
15676c44433B0387J30448b41316C9269d0420A19963B0202a79146n8465J9367A80529
$$ -344433 20387 150835 -241316 39269 -40420 119963 20202 -179146 -237611 -218244 180529
15664C04522c3405I8213c61073B30944B3124J38064b60565A42195J26987f4509
$$ 304522 -33405 98213 -361073 230944 23124 161188 -260565 142195 269182 -64509
15653b85637q1481B8027a35367f7156j2201C3768M8715J03479b0331k3137k83110
$$ -285637 -367118 28027 -135367 -67156 -79357 33768 82483 185962 -20331 -43468 -326578
15642c26578C9111b47072M1382I967J25929d6314j37761N7812k30303a29320l28254
$$ -326578 39111 -247072 -205690 9967 135896 -46314 -184075 -126263 -356566 -129320 -457574
15631d57574C68995A16978A3097d4208H8591e9957k48812a3467A72930h8959C61373
$$ -457574 368995 116978 13097 -44208 88591 -59957 -308769 -13467 172930 -88959 361373
15619f4662q2426C81508b03194a9841A38830D2036L5261C2984a60632A93815a05212
$$ -64662 -147088 381508 -203194 -19841 138830 42036 77297 32984 -160632 193815 -105212
15607B41625M5167b99360J32718q6689E4237J51525a89058O2816J8766c8671I2770
$$ 241625 286792 -299360 -166642 -253331 54237 205762 -189058 -126242 -107476 -38671 92770
15595G3919P0994e7370E2165P5330n8934O8721J74116j41174b46492H071a62950
$$ 73919 144913 -57370 52165 127495 68561 137282 311398 170224 -246492 8071 -162950
15583A02059k0441b04993r547f0675B38862I4620a31678D7189N8367a6310I550
$$ 102059 81618 -204993 -214540 -60675 238862 94620 -131678 47189 105556 -16310 9550
15571A24566C491g5414k03877h9988q8116b9270J2426j0328m7103h32k1521A51106
$$ 124566 3491 -75414 -279291 -89988 -178104 -29270 -16844 -27172 -74275 -832 -22353 151106
15558a15138d0914j99513H2496b52676a8311B45766I0078K04716C0502c4802B4041
$$ -115138 -40914 -240427 82496 -252676 -18311 245766 90078 294794 30502 -34802 24041
15546a04034B83823f1035A07996b44640K4344A77404N4906G6889J35014f5389
$$ -104034 283823 -61035 107996 -244640 -220296 177404 232310 76889 211903 -65389
15535e9160H5525J09093d4613k44337H2233f6095I7216m0106R3410e7469A1308
$$ -59160 85525 194618 -44613 -288950 82233 -66095 97216 57110 150520 -57469 11308
15523A43547C8896L43207d106l7909c054A01092l790a49619J2728D79701g0866
$$ 143547 38896 382103 -4106 -42015 -3054 101092 97302 -149619 -136891 479701 -70866
15511b34296e4137j72956A09547J34916n4789g4653B878K68053a06976e1655j93109
$$ -234296 -54137 -227093 109547 244463 189674 -74653 2878 270931 -106976 -51655 -244764
15500b44764a04230j55437g3970C294P3562A3240Q5724b12091D3973Q5262f5200
$$ -244764 -104230 -259667 -73970 3294 76856 13240 98964 -212091 43973 129235 -65200
15488h8864F6120h8984B95240f0584l418B18084J58099n0865j26172F1114k7667
$$ -88864 66120 -88984 295240 -60584 -64002 218084 376183 325318 199146 61114 33447
15477C3447J8658J58256n9613J42948r7629a7235l38012H6980C4055Q5813D1113
$$ 33447 52105 210361 150748 293696 196067 -17235 -355247 86980 34055 119868 41113
15465D5724e4791A9452e9760H4843b8586k9938C517J65558e9490p7367E124K3513
$$ 45724 -54791 19452 -59760 84843 -28586 -58524 3517 169075 -59490 -136857 5124 28637
15453B8637b04890e3643a3376C9763M5100b54572C08287A16018A8736N4096L34933
$$ 28637 -204890 -53643 -13376 39763 84863 -254572 308287 116018 18736 72832 407765
15442D07765j97296K27382j71001a6774j61052B69669a170j36625H2273a56783
$$ 407765 210469 437851 266850 -16774 -177826 269669 -1170 -137795 82273 -156783
15431b3204I8239b55047E0219J83307l8987a28797D2673J39741q6775L7009a5726
$$ -23204 98239 -255047 50219 233526 194539 -128797 42673 182414 95639 132648 -15726
15419h6082K0939A61110E2285k5715J7006J21850e2977A09831d0231k5317l52503
$$ -86082 -65143 161110 52285 26570 43576 165426 -52977 109831 -40231 -65548 -418051
15408d18051A93728a64661N0748p4493A3273a20096J8632B58011A14940n2800
$$ -418051 193728 -164661 -113913 -188406 13273 -120096 -101464 258011 114940 62140
15398F2140K0228O0586q960e1244n1995q3319A8765P6759a69543M8981e9473j146
$$ 62140 82368 142954 133994 -51244 -103239 -186558 18765 95524 -169543 -120562 -59473 -60619
15386f0619j67964n6724B7580L1084a51025K7714a248n2849B51297K9880a46987
$$ -60619 -228583 -285307 27580 58664 -151025 -123311 -1248 -54097 251297 281177 -146987
15374a02380C4636J74410A0002f8477B88233b0604q5657k6891C83162j83067B34
$$ -102380 34636 209046 10002 -68477 288233 -20604 -106261 -133152 383162 200095 234
15362A61371a7426j36210H0593d3897q0018C09254O4078f0876k016k59714C96726
$$ 161371 -17426 -153636 80593 -43897 -123915 309254 373332 -60876 -62892 -322606 396726
15350a792B24828g5597H7334J74335a50509A51816j3822a8885B02382G2175K58184
$$ -1792 224828 -75597 87334 261669 -150509 151816 137994 -18885 202382 72175 330359
15339C30359A22708K8344i4601D30656h4067L7952k0209A18878a33248A36022
$$ 330359 122708 151052 -94601 430656 -84067 -46115 -66324 118878 -133248 136022
15328B7760K27079K291A21134f9893j9069H7742J79630b64423D1913J81064m5519
$$ 27760 254839 257130 121134 -69893 -88962 87742 267372 -264423 41913 222977 177458
15317A77458i8037A17993j7667k2340a3048I3479K3150a33014i177k9218r7434
$$ 177458 -98037 117993 100326 77986 -13048 93479 116629 -133014 -9177 -38395 -135829
15306a35829b188A92797A2669K30981k1766A1255J67518d2715p1035c7431C5563
$$ -135829 -2188 192797 12669 243650 221884 11255 178773 -42715 -113750 -37431 35563
15294a37470A17457a24922e3486d144B46098j18331K38030I397a46255B00641
$$ -137470 117457 -124922 -53486 -4144 246098 127767 365797 9397 -146255 200641
15283c1630D8972K01941f4087b7985k9229E6262h9263p7419B37945E3007K35154
$$ -31630 48972 250913 -64087 -27985 -57214 56262 -89263 -166682 237945 53007 288161
15272B88161b4530B41958a22911d4436A28150L0029C7211A1966J34826b3771j953
$$ 288161 -24530 241958 -122911 -44436 128150 158179 37211 11966 146792 -23771 -25724
15261b5724B57312b6118n3801j42734A17632B3695J38435C4479L32719B7162J44566
$$ -25724 257312 -26118 -79919 -222653 117632 23695 162130 34479 367198 27162 171728
15250A71728P1155o2918J22037L2478J38395J71908O36358J531060o09077p0037
$$ 171728 242883 179965 302002 334480 472875 644783 1281141 2812201 2203124 2133087
15240B133087N42081A015219l50945j53688L163a1501A27402Q2862D6900J86725
$$ 2133087 2675168 1015219 664274 510586 513749 -11501 127402 210264 46900 233625
15230B33625a591A72253a63119n0530A66757E0477a7570j77458B07846a89556
$$ 233625 -1591 172253 -163119 -213649 166757 50477 -17570 -195028 207846 -189556
15219B5306P5390f884C1110A995a65286m5549N4658j32231C29013F2618Q7387
$$ 25306 100696 -6884 31110 1995 -165286 -210835 -156177 -288408 329013 62618 150005
15208A50005P4824A9705O343L19017b63999A11707R4219q803b37597B570M9059
$$ 150005 224829 19705 26048 345065 -263999 111707 205926 197123 -237597 2570 51629
15197E1629d8912G0708J52042c36121C86458f9946C27627e6890j19883A9565a79009
$$ 51629 -48912 70708 222750 -336121 386458 -69946 327627 -56890 -176773 19565 -179009
15185B54441C4947K52158i8030I1870J27474a25594B03319a82791j75704J74667
$$ 254441 34947 287105 -98030 91870 219344 -125594 203319 -182791 -358495 -183828
15175a83828j3418G1450K26168b79094e6258A14242J54281B9180b6974A67835
$$ -183828 -197246 71450 297618 -279094 -56258 114242 268523 29180 -26974 167835
15164b09385A0398K4664f9506K9416n0680k55923E6234J92528B7040K12700J7604
$$ -209385 10398 35062 -69506 -40090 -90770 -346693 56234 248762 27040 239740 257344
15153B57344A09945j6047K8805a7613I838e4562A11292J0578J14482a87750g97
$$ 257344 109945 93898 122703 -17613 9838 -54562 111292 121870 236352 -187750 -797
15141E7008h1825c2354q94F4365j7246J7740J72928k6787C1913d3340D66148E1691
$$ 57008 -81825 -32354 -33248 64365 47119 64859 237787 211000 31913 -43340 466148 51691
15128A58930K78259b2325A97425a1252F9109g652E31210C0233J6672k1114M95195
$$ 158930 437189 -22325 197425 -11252 69109 -7652 531210 30233 46905 25791 520986
15117E20986j02870D5472a14373l2898B04251B9977M06740a05136B16350b89373
$$ 520986 418116 45472 -114373 -147271 204251 29977 436717 -105136 216350 -289373
15106B11508F2405N9669K21298b06617C4547K12910H877J64586j0962n4616a6588
$$ 211508 62405 122074 343372 -206617 34547 247457 8877 173463 162501 107885 -16588
15094C08540I0609L7455a57464E0415b3993D9531J02994K15277g18l76887B91015
$$ 308540 90609 128064 -157464 50415 -23993 49531 152525 367802 -718 -377605 291015
15082F703b51790A72142p9006d1281j33200D34141a34003j59933C01689c4080
$$ 6703 -251790 172142 93136 -41281 -174481 434141 -134003 -293936 301689 -34080
15071A19545J77936B1024K2459K83275j12279G6693c4181C43025j36601k0482
$$ 119545 297481 21024 43483 326758 214479 76693 -34181 343025 206424 185942
15061A85942J57062a2524I2880J46342p8520K77602k12183j06721Q0363J7281
$$ 185942 343004 -12524 92880 239222 160702 438304 226121 119400 199763 217044
15051B17044i2656B21447L3939J63429j19012C372b5365A37096K94856k14892
$$ 217044 -92656 221447 255386 418815 299803 3372 -25365 137096 431952 217060
15041B17060m5470K04484j82945l7752N0574O9650K71676j59610d4024A03035
$$ 217060 171590 376074 193129 155377 205951 275601 547277 387667 -44024 103035
15030C28619K41280k41324a2388D29228p2292j77912K25366A65989M2012j3822
$$ 328619 569899 328575 -12388 429228 356936 179024 404390 165989 208001 194179
15020A94179J09611I9979k5747K89952E5448N66702I7380K68746n5561k7363a57271
$$ 194179 303790 99979 74232 364184 55448 622150 97380 366126 310565 283202 -157271
15008A90431M2908K61394b0683B79053M8140J8294l8504J24114a58913B14286
$$ 190431 233339 494733 -20683 279053 327193 345487 306983 431097 -158913 214286
14997D1780J40065D0931J35058L36226R0968j77326m7820j10450O1599p2684e5204
$$ 41780 181845 40931 175989 512215 603183 425857 378037 267587 329186 256502 -55204
14985A54985M5911K14395A90078H5487a01692B73834k3797K90254k38154K77013
$$ 154985 200896 415291 190078 85487 -101692 273834 250037 540291 302137 579150
14975E79150j65791d5061C53939K133J68349j22980j92542O9543J10452p9233
$$ 579150 413359 -45061 353939 356072 524421 401441 208899 278442 388894 309661
14965C09661j21473E4643L34194p3392j25253H0435J45605R3586R4123r6521A29124
$$ 309661 188188 54643 388837 315445 190192 80435 226040 319626 413749 317228 129124
14953F8959K44038L5919J17599k28537L4089L97A07825J19687J8705L10695B77594
$$ 68959 312997 348916 466515 237978 272067 272464 107825 227512 246217 556912 277594
14941B22645p5960n944K10478o4587j14831L55916k41256M87249C74568A27605
$$ 222645 146685 140741 351219 286632 171801 527717 286461 773710 374568 127605
14930G40022B16619M94474A59745L38966k26624N71890j46006L2403P9916C10555
$$ 740022 216619 711093 159745 498711 272087 843977 697971 730374 810290 310555
14919F18398k55373L14768J42808J37827l61031J58560k73070j93830K32702j1959
$$ 618398 363025 677793 820601 958428 597397 755957 482887 289057 521759 509800
14909E09800j99055A6040L08289K21979j37332A78351M4879J05235j04615K06757
$$ 509800 310745 16040 324329 546308 408976 178351 223230 328465 223850 430607
14899D30607D3492L49569B8735K73329Q3702A76314G2249J61329K98615o9252
$$ 430607 43492 393061 28735 302064 385766 176314 72249 233578 532193 462941
14889D62941A40187M77564j38478R8203r6117j88131J61300j99405J34399j76217
$$ 462941 140187 617751 479273 577476 481359 293228 454528 255123 389522 213305
14879B13305D7302M25280J8397j57195p0926J07879k4955A56255N43776H316O2948
$$ 213305 47302 472582 490979 333784 262858 370737 345782 156255 700031 8316 71264
14868G1264M51212R9918m5371k59952l0226L4885K42343J63581B81843q7838L00086
$$ 71264 522476 622394 577023 317071 286845 321730 564073 727654 281843 194005 494091
14857D94091j8793A70928J47920R0949L00111B21992M44714k49695j56391J07044
$$ 494091 475298 170928 318848 409797 709908 221992 666706 417011 260620 367664
14847C67664J51999p5988N8421m4959j43689J90467K84707l52364K2718B20247
$$ 367664 519663 443675 502096 457137 313448 503915 788622 436258 458976 220247
14836G55618j58199l7723O5298j58732B27516L39280j81618P3444j12982J4726
$$ 755618 597419 559696 624994 466262 227516 566796 385178 458622 345640 360366
14826C60366H9517K11825j07490N01225j15344k85118L78636l14026J84182M8458
$$ 360366 89517 301342 193852 695077 579733 294615 673251 359225 543407 591865
14816E91865k16899K76535j25629B01358L45088j65084J05559j18290K41455m5300
$$ 591865 374966 651501 525872 201358 546446 381362 486921 368631 610086 564786
14806E64786J9124r9892B11095N42119j98424K31421N5998m03272J6368J25725
$$ 564786 583910 484018 211095 753214 554790 786211 842209 438937 455305 581030
14796E81030P9480B40966M32975A56785L06098K32384k68711J2280J22243r3563
$$ 581030 660510 240966 673941 156785 462883 695267 426556 438836 561079 467516
14786D67516J19491o2213b2777D30467M4634N4669k22012J25547J4607O2705o09
$$ 467516 587007 524794 -22777 430467 475101 529770 307758 433305 447912 510617 510008
14775E10008k29181j5045O03599k07343l9376J45641j21940L5847j90888P6806
$$ 510008 280827 265782 869381 662038 622662 768303 646363 682210 491322 568128
14765E68128J49210j06390j18098k0391P8837A44573K46549J05340j76808J91121
$$ 568128 717338 610948 492850 472459 551296 144573 391122 496462 319654 510775
14755E10775J27380n236j7514k24680J6785J4383q3471J01082O0786O9277R274
$$ 510775 638155 632919 615405 390725 407510 421893 338422 439504 500290 569567 578841
14744E78841O3821J34418J5037j20598O5651C38492L37867P8102J22059j72047
$$ 578841 642662 777080 792117 671519 737170 338492 676359 754461 876520 704473
14734G04473N8523r4881M6515J63453k16786J17048j08974j10350N7269K96507
$$ 704473 762996 668115 714630 878083 661297 778345 669371 559021 616290 912797
14724I12797R3460D19018M72022j18285J93946k58533J96313r7097k17879L86735
$$ 912797 1006257 419018 891040 772755 966701 708168 904481 807384 589505 976240
14714I76240k94584J99019j60976J5207N76111n73801l08230K36107P8669j3561
$$ 976240 681656 880675 719699 734906 1311017 737216 428986 665093 743762 730201
14704G30201K1758l3785m017K62332L0247L2889q4343j16633J58440J1262k45366
$$ 730201 751959 718174 714157 976489 1006736 1039625 955282 838649 997089 1008351 762985
14693G62985K65184O5549j03385J2446P9364j74009q3682K44251j86556M3178
$$ 762985 1028169 1093718 990333 1002779 1082143 908134 824452 1068703 882147 925325
14683I25325j10091r7788K62441j78615j8219K693K77518j21378L0074o6118L75028
$$ 925325 815234 717446 979887 801272 783053 785746 1063264 941886 971960 905842 1280870
14672A280870l88302m4239m5646R5298Q4467j92025L32295j42657j84770O9398
$$ 1280870 892568 848329 802683 897981 982448 790423 1122718 980061 795291 864689
14662H64689J07840j34746J66501L24754k48610k64296J29927N8585J06514N5865
$$ 864689 972529 837783 1004284 1329038 1080428 816132 946059 1004644 1111158 1167023
14652A167023L32560o06112N33755m63653L8556N53699l92640M7008N0672r6691
$$ 1167023 1499583 893471 1427226 963573 1002129 1555828 1163188 1210196 1260868 1164177
14642A164177j05210j06948O0423J69877k09588N70038m94676j741j04009L61287
$$ 1164177 1058967 952019 1012442 1182319 972731 1542769 1048093 1046352 942343 1303630
14632A303630q4096l3857R754k13056L74548m10227M03819j03499O9622K949k73878
$$ 1303630 1219534 1185677 1195431 982375 1356923 946696 1350515 1247016 1316638 1319587 1045709
14621A045709L3293K27875J38150k87924P0659J88371J13756R8379j17036k81653
$$ 1045709 1079002 1306877 1445027 1157103 1227762 1416133 1529889 1628268 1511232 1229579
14611A229579J24296n5275Q5090J83468k8381j65790j79856l0319N2890M73540
$$ 1229579 1353875 1298600 1383690 1567158 1538777 1372987 1193131 1162812 1215702 1689242
14601A689242l03624J65045Q0526j84108J50292K71546l21858J55230j75468J602
$$ 1689242 1385618 1550663 1631189 1447081 1597373 1868919 1547061 1702291 1526823 1528425
14591A528425K38786n15056J9074K68190n3735L26264j9110o6022K85076k71491
$$ 1528425 1767211 1252155 1271229 1539419 1485684 1811948 1792838 1726816 2011892 1740401
14581A740401J73119J99972j41197J03858l78940M12625j81108k93369M81219
$$ 1740401 1913520 2113492 1972295 2076153 1697213 2109838 1928730 1635361 2116580
14572B116580l37635M96868l46783J75412K59257l87088L35009K40293k95398
$$ 2116580 1778945 2275813 1929030 2104442 2363699 1976611 2311620 2551913 2256515
14563B256515J85110J15618k6412K47789m8911J54100K1073L83743K46775J15040
$$ 2256515 2441625 2557243 2530831 2778620 2729709 2883809 2904882 3288625 3535400 3650440
14553C650440l6234N47442P94893R36795K600740L393202O931084J1618248J770427
$$ 3650440 3614206 4161648 4956541 5893336 8494076 11887278 18818362 30436610 32207037
14544C2207037j5767897G900578l680888q53227O79900R48273K047230l103587
$$ 32207037 16439140 7900578 4219690 3366463 4046363 4994636 7041866 3938279
14536C938279j710274j45303q4680k3701K28490K9062k452p0558o7458j32240
$$ 3938279 2228005 2082702 1998022 1974321 2202811 2231873 2229421 2158863 2091405 1959165
14526A959165K23594K52367l61663J17131J91734R1739j17945m9181R3000o622
$$ 1959165 2182759 2435126 2073463 2190594 2382328 2474067 2356122 2306941 2399941 2393319
14516B393319Q4779K41595m50487K45679K86771l48339J23417Q2985N52239q14865
$$ 2393319 2478098 2719693 2269206 2514885 2801656 2453317 2576734 2659719 3211958 2397093
14506B397093L18838J0768P6366K77663j26923o3862j56816L10746P9126J91931
$$ 2397093 2715931 2726699 2803065 3080728 2953805 2889943 2733127 3043873 3122999 3314930
14496C314930m48643M74391j42525J93518l96264L15370J52655n8142k58824j52000
$$ 3314930 2866287 3340678 3198153 3391671 2995407 3310777 3463432 3405290 3146466 2994466
14486B994466N70117k6887M12064l89606J43815j09212k73614K56068N4535K25139
$$ 2994466 3564583 3537696 3949760 3560154 3703969 3594757 3321143 3577211 3631746 3856885
14476C856885k9057j02251K48953j91003J01980J21216R1673l73063M10121q9891
$$ 3856885 3827828 3725577 3974530 3783527 3885507 4006723 4098396 3725333 4135454 4045563
14466D045563L66001N6604k31523M6652N70802r9024k13050N35992l70566R0029
$$ 4045563 4411564 4468168 4236645 4283297 4854099 4755075 4542025 5078017 4707451 4797480
14456D797480q9417J13846J26703P4447j35053k7697L10462M6384K43837j10532
$$ 4797480 4708063 4821909 4948612 5023059 4888006 4860309 5170771 5217155 5460992 5350460
14446E350460r336P6590K86808l03802K08854l1945Q6565K68534J62247n6885
$$ 5350460 5341124 5417714 5704522 5400720 5609574 5577629 5664194 5932728 6094975 6038090
14436F038090n1342J50966k10342N23217J37600j48742K40632k63195M90530L3639
$$ 6038090 5986748 6137714 5927372 6450589 6588189 6439447 6680079 6416884 6907414 6941053
14426F941053j03866K46877J72771m39235L70218J80489K26369J60608l0598M1264
$$ 6941053 6837187 7084064 7256835 6817600 7187818 7368307 7594676 7755284 7724686 7765950
14416G765950N72610l46011P0819M68441L5938k52786R5802K54056M44372q1655
$$ 7765950 8338560 7992549 8063368 8531809 8567747 8314961 8410763 8664819 9109191 9027536
14406I027536j33308M49937K76101j61321J09190O02478J32354l96580L86207
$$ 9027536 8894228 9344165 9620266 9458945 9568135 10170613 10302967 9906387 10292594
14397A0292594K50867J12743J82204M12098r0218L69777J84655r0600L68434M53405
$$ 10292594 10543461 10656204 10838408 11250506 11160288 11530065 11714720 11624120 11992554 12445959
14387A2445959n6454K64514N06181L6908M87751j53520K76151N88156L4224K51821
$$ 12445959 12389505 12654019 13160200 13197108 13684859 13531339 13807490 14395646 14429870 14681691
14377A4681691J99971J57779L0912M40093N40648N75723J30263K91569M20583
$$ 14681691 14881662 15039441 15070353 15510446 16051094 16626817 16757080 17048649 17469232
14368A7469232K98592N73760j53940N89290L35171J20945Q51284M85764K03281
$$ 17469232 17767824 18341584 18187644 18776934 19112105 19233050 20084334 20570098 20773379
14359B0773379N28736L02560O19560M39623L43588O41168O43885O52100O62016
$$ 20773379 21302115 21604675 22224235 22663858 23007446 23648614 24292499 24944599 25606615
14350B5606615N77447N35021M92774Q84100R48885P91242K19062J063954N84430
$$ 25606615 26184062 26719083 27211857 28095957 29044842 29836084 30055146 31119100 31703530
14341C1703530P37623J110233R38373N93082J364105R78790J088875R71837J326379
$$ 31703530 32441153 33551386 34489759 35082841 36446946 37425736 38514611 39486448 40812827
14332D0812827J176815J455388J180962J417108J501887J501419J668860J799598
$$ 40812827 41989642 43445030 44625992 46043100 47544987 49046406 50715266 52514864
14324E2514864J716869J885421J605911J869836J848644K002868K355625K185815
$$ 52514864 54231733 56117154 57723065 59592901 61441545 63444413 65800038 67985853
14316F7985853K508934K696160K559486K826910K923262L708148L241850L240838
$$ 67985853 70494787 73190947 75750433 78577343 81500605 85208753 88450603 91691441
14308I1691441L581459L899348M310170M337432M493775N224000N150754N343329
$$ 91691441 95272900 99172248 103482418 107819850 112313625 117537625 122688379 128031708
14300A28031708N694113N769454O289924O889648P364665P657091P969872Q253898
$$ 128031708 133725821 139495275 145785199 152674847 160039512 167696603 175666475 183920373
14292A83920373Q744128R596411J0247926J0490584J0979070J1558310J2035412
$$ 183920373 192664501 202260912 212508838 222999422 233978492 245536802 257572214
14285B57572214J2721789J2812493J3250393J3999766J3770364J3792306J3784424
$$ 257572214 270294003 283106496 296356889 310356655 324127019 337919325 351703749
14278C51703749J3832642J3094831J2448029J1619502R474642P137910L061680
$$ 351703749 365536391 378631222 391079251 402698753 412173395 419311305 422372985
14271D22372985K127333K090495K401563k612048m130499m877261q215931j1750377
$$ 422372985 424500318 426590813 428992376 426380328 422249829 417372568 409156637 397406260
14263C97406260j3651825j4932990j5346661j5706401j6101007j5583220j5664942
$$ 397406260 383754435 368821445 353474784 337768383 321667376 306084156 290419214
14256B90419214j4649596j3964252j4045786j3106778j2905076j1699668j1232324
$$ 290419214 275769618 261805366 247759580 234652802 221747726 210048058 198815734
14249A98815734r160543q409958r518263r252360q042447p564963p357443o721176
$$ 198815734 189655191 181245233 171726970 162474610 154432163 146867200 139509757 132788581
14241A32788581o289870n896995o073229m683251n100492m370132m372514m421850
$$ 132788581 126498711 120601716 114528487 109845236 104744744 100374612 96002098 91580248
14233I1580248l652470l813147k658433l582532l151377k996866k822273k886519
$$ 91580248 87927778 84114631 81456198 77873666 74722289 71725423 68903150 66016631
14225F6016631k099780k324698k347660k434277j806243j441654j917488k064258
$$ 66016631 63916851 61592153 59244493 56810216 55003973 53562319 51644831 49580573
14217D9580573j336048j965626j361383r77711j299581j458712j658883q17385
$$ 49580573 48244525 46278899 44917516 43939805 42640224 41181512 39522629 38705244
14209C8705244j639368p37772n13644j294087r63866r73037j170221n24611q33655
$$ 38705244 37065876 36328104 35814460 34520373 33556507 32583470 31413249 30888638 30054983
14200C0054983n44154p55308j010702o29876o83700o87486o89938m98193o55518
$$ 30054983 29510829 28755521 27744819 27114943 26431243 25743757 25053819 24555626 23900108
14191B3900108p87190l27805m85089m69771o97578l41675n94101j95874p30165
$$ 23900108 23112918 22785113 22300024 21830253 21132675 20791000 20196899 20001025 19270860
14182A9270860k37708m75698m78723k26299m30370j93174l22974n70047j2850
$$ 19270860 19033152 18557454 18078731 17852432 17422062 17228888 16905914 16335867 16323017
14173A6323017o86530k71872k68557k86346m04177J0464l28868m31119k81272
$$ 16323017 15636487 15364615 15096058 14809712 14405535 14415999 14087131 13656012 13374740
14164A3374740j73021j57328l42126L13202o00792m48478l8795j37324l13405
$$ 13374740 13201719 13044391 12702265 13015467 12414675 11966197 11927402 11790078 11476673
14155A1476673m0303k31738p1718m30263r9883k28843l44027l87186J47682m5449
$$ 11476673 11436370 11204632 11132914 10702651 10602768 10373925 10029898 9642712 9790394 9744945
14145I744945N3169l71414k3341Q0536m06675l01780j67235J74778j31816j80581
$$ 9744945 9798114 9426700 9403359 9483895 9077220 8775440 8608205 8782983 8651167 8470586
14135H470586l38480m9541k15905j06823J30240j78856o3950m10832K97041o1585
$$ 8470586 8132106 8082565 7866660 7759837 7890077 7711221 7647271 7236439 7533480 7471895
14125G471895l33381k68813M40425m54081R9685m22107J60972m70450J59155j90666
$$ 7471895 7138514 6869701 7310126 6856045 6955730 6533623 6694595 6224145 6383300 6192634
14115F192634j31465L48065l03151j32005j92850J21951J95351j31202n91693
$$ 6192634 6061169 6409234 6106083 5974078 5781228 5903179 6098530 5967328 5375635
14106E375635N41752l38669N9903k70698N0953j79745j85894J25742j04980M728
$$ 5375635 5917387 5578718 5638621 5367923 5418876 5239131 5053237 5178979 5073999 5078727
14096E078727k02549J77597q2944k41965m4258k6599M7503J5490j65602j07417
$$ 5078727 4876178 5053775 4970831 4728866 4684608 4658009 4705512 4721002 4555400 4447983
14086D447983K3808N5692m20944M16140l59910M29854k47336p1192q5796j26772
$$ 4447983 4471791 4527483 4106539 4522679 4162769 4592623 4345287 4274095 4188299 4061527
14076D061527l36938J9616K25423m3369j06470K37859k74211J32202m50497K01029
$$ 4061527 3724589 3744205 3969628 3926259 3819789 4057648 3783437 3915639 3465142 3666171
14066C666171N3525l16244q2104P567L36655J24014k99574l70364J83005k2468
$$ 3666171 3719696 3403452 3321348 3328915 3665570 3789584 3490010 3119646 3302651 3280183
14056C280183n5537J13497j55309L79425n87717L20371l24735L37511J50121k64173
$$ 3280183 3224646 3338143 3182834 3562259 2974542 3294913 2970178 3307689 3457810 3193637
14046C193637j8493l12205N350M530j47623j09845K60319k90833N86235n67332
$$ 3193637 3175144 2862939 2868289 2872819 2725196 2615351 2875670 2584837 3171072 2603740
14036B603740r1250K64600j08259j54675K29552J05648R756j46383j47047N184
$$ 2603740 2512490 2777090 2668831 2514156 2743708 2849356 2859112 2712729 2565682 2570866
14026B570866O3391p1896j7771r3847K80359r4485k75093r3404o872k7314q6276
$$ 2570866 2634257 2562361 2544590 2450743 2731102 2636617 2361524 2268120 2261248 2233934 2147658
14015B147658L43233k88346J34327j72395J76288r0979J50880k04405J93068k13205
$$ 2147658 2490891 2202545 2336872 2164477 2340765 2249786 2400666 2196261 2389329 2176124
14005B176124l00892L58944j11407n3453m2820K78183p4987k82712r4079N68879
$$ 2176124 1875232 2234176 2122769 2069316 2026496 2304679 2229692 1946980 1852901 2421780
13995B421780j43963M7206L84199r2816K03509K52443J272562K993928N244823
$$ 2421780 2277817 2325023 2709222 2616406 2819915 3072358 4344920 7338848 12583671
13986A2583671J1317715J1104322j2056922j0774861m615063k125380j152008
$$ 12583671 23901386 35005708 22948786 12173925 7558862 5433482 4281474
13979D281474o59487j54715n65357j81271O7778m04883j6870M6260k9437l30182
$$ 4281474 3621987 3467272 2901915 2720644 2788422 2383539 2366669 2412929 2383492 2053310
13969B053310m6650J59693j2752n62702L59304j5718j9983l7665K9479K9236J45417
$$ 2053310 2006660 2166353 2153601 1590899 1950203 1934485 1914502 1876837 1906316 1935552 2080969
13958B080969m29440J0990K78532r4654j35673k02729J03423L51956l29114k76774
$$ 2080969 1651529 1662519 1941051 1846397 1710724 1507995 1611418 1963374 1634260 1357486
13948A357486J68981R8578K3144l29893K62311o682k87413M25923m72454L63218
$$ 1357486 1526467 1625045 1648189 1318296 1580607 1573925 1286512 1712435 1239981 1603199
13938A603199k95571L71553k24980J43149l4461j66435K15385N9807k01761R860
$$ 1603199 1307628 1679181 1454201 1597350 1562889 1396454 1611839 1671646 1469885 1479745
13928A479745J96506l24164j912j2599j32139Q129J83151J71035l8268j48103
$$ 1479745 1676251 1352087 1350175 1337576 1205437 1213566 1396717 1567752 1529484 1381381
13918A381381q3429j59233K53611k17932P8125j27316J45163M77376m41841j01025
$$ 1381381 1297952 1138719 1392330 1174398 1252523 1125207 1270370 1747746 1305905 1204880
13908A204880J19566k1245o2833J82849j75211L18631o19552K08788p1370L71110
$$ 1204880 1324446 1303201 1240368 1423217 1248006 1566637 947085 1155873 1084503 1455613
13898A455613m59036j216R3023j30810L5493P7523l32912O52156l02712J3158
$$ 1455613 996577 995361 1088384 957574 993067 1070590 737678 1389834 1087122 1100280
13888A100280j10021M8702J52668k29487J74352j90749K85010r751n8249k41676
$$ 1100280 990259 1038961 1191629 962142 1136494 945745 1230755 1221004 1162755 921079
13878I21079O5567j49191J41687J25110J84413k92156J34011j14823o1795N8564
$$ 921079 986646 837455 979142 1104252 1288665 996509 1130520 1015697 953902 1012466
13868A012466O8268k01111q1628J89306J27490r4394k81849K67735o033j19471
$$ 1012466 1080734 879623 797995 987301 1114791 1020397 738548 1006283 1000250 880779
13858H80779o2909K84929k47305o9989j76240L69168O5403j47431K60420o7517
$$ 880779 817870 1102799 855494 785505 609265 978433 1043836 896405 1156825 1089308
13848A089308l29146K10743K34374q2773j1193j88754o9856R785L25123m63083
$$ 1089308 760162 970905 1205279 1122506 1111313 922559 852703 862488 1187611 724528
13838G24528Q3004Q8563k50540K67619k53367L19674j60265j39229K458K52683
$$ 724528 807532 896095 645555 913174 659807 979481 819216 679987 682445 935128
13828I35128j92051J27174R2175j25152o9167p0950J95652J35182k99309J59106
$$ 935128 743077 870251 962426 837274 768107 697157 892809 1027991 728682 887788
13818H87788J40352m81934J26408L45532R5897l31391Q4617p4537o1464j83761
$$ 887788 1028140 546206 672614 1018146 1114043 782652 867269 792732 731268 547507
13808E47507L0424J38717j54344M18986l40576m4299r7486L35951P0376m35324
$$ 547507 577931 716648 562304 981290 640714 596415 498929 834880 905256 469932
13798D69932N15093m30007P8249L34544D72690J34681J82871L37362A69395L88191
$$ 469932 985025 555018 633267 967811 472690 607371 790242 1127604 169395 557586
13788E57586L90286l63859L8669M1659k55597R4139J44289J96074j12229k09395
$$ 557586 947872 584013 622682 664341 408744 502883 647172 843246 731017 521622
13778E21622P2185Q7329k1940k429j77856J97202l9646o2128j01966J47710l545
$$ 521622 593807 681136 659196 656767 478911 676113 636467 574339 472373 620083 616538
13767F16538q6043n5724K4873J84533j77766j30372L04281J99557m8207j22845
$$ 616538 530495 474771 499644 684177 506411 376039 680320 879877 831670 708825
13757G08825l2999p9916J58944j88028B13477K01372r5496J32660K35007j84450
$$ 708825 675826 595910 754854 566826 213477 414849 319353 452013 687020 502570
13747E02570o4239J42644O8105R9595j9424j75359j10602J79268M4389k8032J43988
$$ 502570 438331 580975 649080 748675 729251 553892 443290 622558 666947 638915 782903
13736G82903k35513j41085L65975C06125M14975l08343J02455j04908O1959A62450
$$ 782903 547390 406305 772280 306125 721100 412757 515212 410304 472263 162450
13725F39294K4329J35647C96827J0018N47279j97085q3045k3246j72473j94243
$$ 639294 663623 799270 396827 406845 954124 757039 673994 650748 478275 284032
13715B84032J42501J94953j89840K34543j53263j2729j3786N6579n6638j33528
$$ 284032 426533 621486 431646 666189 512926 500197 486411 542990 486352 352824
13705C52824j44468O57043l3145l66014J34293j5104j62813k1187J37859M2837
$$ 352824 208356 865399 832254 466240 600533 585429 422616 401429 539288 582125
13695E82125N8316j9300k44408J02809m3307R3360M9727j18288K5746A70760L58464
$$ 582125 640441 621141 376733 479542 436235 529595 579322 461034 486780 170760 529224
13684E29224j68257L84899B96986I6271K89946J38854j68393M9956L7053J73231
$$ 529224 360967 745866 296986 96271 386217 525071 356678 406634 443687 616918
13674F16918A73660K55087j2137M1343P1514j07243p2174j03076j1609Q2240K30747
$$ 616918 173660 428747 416610 457953 529467 422224 350050 246974 235365 317605 548352
13663E48352k37659j8553K07603J26636a27648E90729A68833K23745J81646j78455
$$ 548352 310693 292140 499743 626379 -127648 590729 168833 392578 574224 395769
13653C95769p0126J40283j66197M1847N8578o2118m3671j13877R3022K2180N9248
$$ 395769 325643 465926 299729 341576 400154 338036 294365 180488 273510 295690 354938
13642C54938R5895q8694p8580J69727j48479J58481j54238p4253K15074C1016
$$ 354938 450833 362139 283559 453286 304807 463288 309050 234797 449871 31016
13631C10204Q8512J37540k4739p9077l2177j09085n7525R5147A27282R3519L06697
$$ 310204 398716 536256 511517 432440 400263 291178 233653 328800 127282 220801 527498
13620E27498D7111M34413A48754L31141J41265p2202j19175J6840j72337J03187
$$ 527498 47111 481524 148754 479895 621160 548958 429783 446623 274286 377473
13610C77473K88570H5418K15407A23567J70886o500O7824K63670l6129B86829
$$ 377473 666043 85418 300825 123567 294453 287953 355777 619447 583318 286829
13599B41635m1004N6958A1681R4157L96375A78225J1079J5926J11209l4983q5901
$$ 241635 200631 257589 11681 105838 502213 178225 189304 205230 316439 281456 195555
13588A95555Q9600J46320n5202L3615o2744J56599k04884l1686o2839K347l7420
$$ 195555 285155 431475 376273 409888 347144 503743 298859 267173 204334 206681 169261
13577A69261J77000J36030j19968B5204J91139J79596N5131j56628j5708K6727
$$ 169261 346261 482291 362323 25204 216343 395939 451070 294442 278734 305461
13567C05461r7283J11535j6820M109j29564J73185A53919M5124J37678L9827A01589
$$ 305461 208178 319713 302893 307002 177438 350623 153919 199043 336721 376548 101589
13555C85771o3052m390r9636J25908j21683H136N80790j81487L03294B30121E9354
$$ 385771 322719 318329 218693 344601 222918 8136 588926 407439 710733 230121 59354
13543B12151r2891O5184J2157p4564L89279A77967P6470A06255K67066A31517
$$ 212151 119260 184444 196601 122037 511316 177967 254437 106255 373321 131517
13532B17943L14409A07096K20470P7260a05460A50523R7293R1780j33676j9194
$$ 217943 532352 107096 327566 404826 -105460 150523 247816 339596 205920 186726
13522A86726J89837A65342K98098A06859Q5782a3340D86551n6976j26377j01028
$$ 186726 376563 165342 463440 106859 192641 -13340 486551 429575 303198 202170
13512B02170Q8018L42496k74077j55221k5448a02053B17051A0310J07449J52743
$$ 202170 290188 632684 358607 203386 177938 -102053 217051 10310 117759 270502
13502B70502J79700j68156j9250e2515E66730A84465L24424a50895D24450A66995
$$ 270502 450202 282046 262796 -52515 566730 184465 508889 -150895 424450 166995
13491A35359H351L36885d1055a3789A91832J05018a0547D79583A08954K99898
$$ 135359 8351 345236 -41055 -13789 191832 296850 -10547 479583 108954 408852
13481D08852J7542A39919K29059A32027K78791D548L00392R8914A86869a25491
$$ 408852 426394 139919 368978 132027 410818 4548 304940 403854 186869 -125491
13470A4776N04811D1221K90749r4893a221A84027Q2469Q3252j28408P6972A26070
$$ 14776 519587 41221 331970 237077 -1221 184027 266496 349748 221340 298312 126070
13458E6024a7864A96561K05641H9509J58487N0769E0579Q0826L3715G6001J82146
$$ 56024 -17864 196561 402202 89509 247996 298765 50579 131405 165120 76001 258147
13447B58147c1611B77800C6063b03633F1718M66560A46150L07270a4354B31533
$$ 258147 -31611 277800 36063 -203633 61718 528278 146150 453420 -14354 231533
13436C18741E3402K77603I6049M3168R714F5554a40010A85598q4089J69472J02353
$$ 318741 53402 331005 96049 139217 148931 65554 -140010 185598 101509 270981 373334
13425C73334A83141g2661A69592j825k704g1176B61188M6268j28657Q9948m6107
$$ 373334 183141 -72661 169592 167767 165063 -71176 261188 307456 178799 268747 222640
13414B22640J55920C1481f7663D41904r8901m3156Q9001C7773K96113j39267n2169
$$ 222640 378560 31481 -67663 441904 343003 299847 388848 37773 333886 194619 142450
13403A42450a80456B63897k8307J13970M6514A22745J32392Q1215b2850C57943
$$ 142450 -180456 263897 235590 349560 396074 122745 255137 336352 -22850 357943
13392d5862B24735K7008A3511K90985K756O2815A37000J20867F7123L18024F4335
$$ -45862 224735 251743 13511 304496 307252 370067 137000 257867 67123 385147 64335
13380A33050R3480E7285K20669D9746a38628N1706A35363O8853F0259L67129B6965
$$ 133050 226530 57285 277954 49746 -138628 -86922 135363 204216 60259 427388 26965
13368A25367K50078d9840A88037h9069A05048M48708A73641C7175J05569J4964
$$ 125367 375445 -49840 188037 -89069 105048 553756 173641 37175 142744 157708
13358A57708F2254O8246L78234E4336B3553K0855K00635l9939K54172j34674K7286
$$ 157708 62254 130500 508734 54336 23553 44408 245043 205104 459276 324602 351888
13347C51888a67781C64916E0938J07795N2601N6008a27902B98728m5370J877K0911
$$ 351888 -167781 364916 50938 158733 211334 267342 -127902 298728 253358 255235 276146
13336B76146m6499I0737J01405J39817p6431q4339L6807E4592J84291N6953i9296
$$ 276146 229647 90737 192142 331959 255528 171189 207996 54592 238883 295836 -99296
13324B77332K9069H0589B8043J91256j3573K25066I5778R4446A3539c62512B71801
$$ 277332 306401 80589 28043 219299 205726 430792 95778 190224 13539 -362512 271801
13312A89680G7178L20717F1578B3968a2626C20527F6981K92810d0250j22693c8195
$$ 189680 77178 397895 61578 23968 -12626 320527 66981 359791 -40250 -162943 -38195
13300I1765h3030H2400a64658a2522A42927p711J02729J580a41131C19081j45036
$$ 91765 -83030 82400 -164658 -12522 142927 135216 237945 239525 -141131 319081 174045
13289A74045b29671A57126c4078F0653K51008A54157N7917J27137a00479d9099
$$ 174045 -229671 157126 -34078 60653 311661 154157 212074 339211 -100479 -49099
13278d4363J6454B4463J17293e4359A90887j3437k7009M58356d1201A61397J10519
$$ -44363 -27909 24463 141756 -54359 190887 177450 150441 608797 -41201 161397 271916
13267B71916I4845m5310P8551J30200A16915A4943R5476j8141K02074j10005a33386
$$ 271916 94845 49535 128086 258286 116915 14943 110419 92278 294352 184347 -133386
13255C96012A08878M9900P7636B5185L88419a30871B81614n0162M405I2160J8627
$$ 396012 108878 158778 236414 25185 413604 -130871 281614 231452 235857 92160 110787
13244A10787c7576E4530Q1849m0780a60741M7765b3944C41267o8496a1316k07165
$$ 110787 -37576 54530 136379 95599 -160741 -112976 -23944 341267 272771 -11316 -218481
13233b18481C56086j40764i0015A3323J12263n3247L9416J11992m8424G5455B2039
$$ -218481 356086 215322 -90015 13323 125586 72339 111755 223747 175323 75455 22039
13221A48411o9722O8372e1270B27993b59992C88141H9586B1758R9238e2061B24985
$$ 148411 78689 147061 -51270 227993 -259992 388141 89586 21758 120996 -52061 224985
13209a12934A29725J03449k6457r1787K09472B4884N7044c6738C15049d3819B9350
$$ -112934 129725 233174 206717 114930 324402 24884 81928 -36738 315049 -43819 29350
13197A38078N4558E0232B1736j677O4612O0754F5409J11849i8789D0524L22962
$$ 138078 192636 50232 21736 20059 84671 145425 65409 177258 -98789 40524 363486
13186C63486B2269a4415E3940a3634n0737k14580A64097n2752G377K63322h8963
$$ 363486 22269 -14415 53940 -13634 -64371 -278951 164097 111345 7377 270699 -88963
13174A67853Q7430J60698A52570E686b3672I3631a39849B94447C7248d6450k528
$$ 167853 255283 415981 152570 5686 -23672 93631 -139849 294447 37248 -46450 -48978
13163d8978A9517J16441i636B29053L9446a18673gA65134k0384N4730o6509k2105
$$ -48978 19517 135958 -9636 229053 268499 -118673 -7 165134 144750 199480 132971 110866
13151A10866M2250A3124a41734F8896k9405d9746B72524e5850E4097k3162K10958
$$ 110866 153116 13124 -141734 68896 39491 -49746 272524 -55850 54097 30935 241893
13140B41893c08976A76649h094A58565b0666j48136O3094A98542M2185L6656C8454
$$ 241893 -308976 176649 -8094 158565 -20666 -168802 -105708 198542 240727 277383 38454
13128A13496l7481R6875A7846K1534M2337K5346J41045a09274A19221J42715e2040
$$ 113496 76015 172890 17846 39380 81717 107063 248108 -109274 119221 261936 -52040
13116B45323k3780o8391J76317f4351C1956i1305c6355C9497a30147A10961i1836
$$ 245323 221543 153152 329469 -64351 31956 -91305 -36355 39497 -130147 110961 -91836
13104A54359J40719b4220A03758c8681A57648K59303A11569K23421A45263k8937
$$ 154359 295078 -24220 103758 -38681 157648 416951 111569 334990 145263 116326
13094A16326m1128i7614C34751a60876l22I3889b59737A92075n2824Q2336b54298
$$ 116326 75198 -97614 334751 -160876 -161198 93889 -259737 192075 139251 221587 -254298
13082B2045b21631B94813a10982b3810B5453c24167H1819J08593J7743J86088
$$ 22045 -221631 294813 -110982 -23810 25453 -324167 81819 190412 208155 394243
13072C94243j67688l3369K9834r8824m547N525a30717j10164D4386a2912o3328
$$ 394243 226555 193186 223020 124196 119649 125174 -130717 -240881 44386 -12912 -76240
13061g6240j6963B13756K3901O1701n2382I7849J62949J19544j73675b45958B67595
$$ -76240 -93203 213756 237657 299358 246976 97849 260798 380342 206667 -245958 267595
13049E1333a45654N58O4719b8055k70062B06462e1790C91076C0902A4295M7885
$$ 51333 -145654 -145096 -80377 -28055 -298117 206462 -51790 391076 30902 14295 62180
13038F2180c56960b2177l3832B339a58187b2414m7019A00523J90190I2241c0136
$$ 62180 -356960 -22177 -56009 2339 -158187 -22414 -69433 100523 290713 92241 -30136
13026c8948I655L39853b28235G8436O4087b7450a0420K430m90m1104A21487D4486
$$ -38948 9655 349508 -228235 78436 142523 -27450 -10420 -7990 -8480 -49584 121487 44486
13013d9002j44391B68525a56040A14479c0384D0135J27671a5079j88406a0076
$$ -49002 -193393 268525 -156040 114479 -30384 40135 167806 -15079 -203485 -10076
13002D21151j9834A85572a83415J6508j47625A96069L0681e0377j60598n1281
$$ 421151 401317 185572 -183415 -166907 -314532 196069 226750 -50377 -210975 -262256
12992b62256B58677D7732J3961L28170j08109G1919C2703a18757m2858E2923J02223
$$ -262256 258677 47732 61693 389863 281754 71919 32703 -118757 -161615 52923 155146
12981A55146A650J47190b01896B50855a58723A77153H358e5409j00605B59835
$$ 155146 1650 148840 -201896 250855 -158723 177153 8358 -55409 -156014 259835
12970H9776d1632E0596a2276l6475A04547d9847B35734a70394A38046B6850i78
$$ 89776 -41632 50596 -12276 -48751 104547 -49847 235734 -170394 138046 26850 -978
12958a174n8505D2880N1227e2768k20040B04502q8379e4700C6058K2226L82465
$$ -1174 -59679 42880 94107 -52768 -272808 204502 116123 -54700 36058 58284 440749
12947D40749A9056L9325B3907a23790a6230r1757B18512a7567p6339B82528E1401
$$ 440749 19056 58381 23907 -123790 -16230 -107987 218512 -17567 -93906 282528 51401
12935G5375a19576H2839J1793b42482K8351P6606a3564j25537C8838K13511J6718
$$ 75375 -119576 82839 94632 -242482 -214131 -137525 -13564 -139101 38838 252349 269067
12924B69067G8006n509a62518M2497B4317J74899Q7088a15615j4929M2381A38035
$$ 269067 78006 72497 -162518 -120021 24317 199216 286304 -115615 -130544 -88163 138035
12912B65264i3940k09795c239j675G1857a35386j12789J03530I7877a989l24352
$$ 265264 -93940 -303735 -3239 -4914 71857 -135386 -248175 -144645 97877 -1989 -326341
12901c26341B1940K09277c13360C02799b90467a2617o089j91447A69560n3008
$$ -326341 21940 231217 -313360 302799 -290467 -12617 -18706 -210153 169560 116552
12891A16552L24714c3982n6623G5324a12049M2852a8173j7855j40270A75311p8268
$$ 116552 441266 -33982 -90605 75324 -112049 -69197 -18173 -36028 -176298 175311 97043
12880I7043B786d0987B42150c26429J16121g7796a9809k83858h7510o7319G3105
$$ 97043 2786 -40987 242150 -326429 -210308 -77796 -19809 -303667 -87510 -154829 73105
12868H2257H250K85503E9829b49044a21062d9279j50062e5391D9848N3831J47897
$$ 82257 8250 293753 59829 -249044 -121062 -49279 -199341 -55391 49848 103679 251576
12857B51576o4066B2494j855b45057B53379b40456H9016a96557i3452j52555B28414
$$ 251576 187510 22494 20639 -245057 253379 -240456 89016 -196557 -93452 -246007 228414
12845B36756g0043C74866F6105j1480L45592A62255a26492J5055l0012M3456A16406
$$ 236756 -70043 374866 66105 54625 400217 162255 -126492 -111437 -141449 -97993 116406
12833a43670B82574c77621J83957N5525A13629a54941C15614A53763M0671g0233
$$ -143670 282574 -377621 -193664 -138139 113629 -154941 315614 153763 194434 -70233
12822A39332B7207J41363m9454g9962r0121M8957j83299b442l8017A18476m2747
$$ 139332 27207 168570 119116 -79962 -170083 -121126 -304425 -2442 -40459 118476 75729
12811G5729K68576A23723E3988J95327A187K33324a36910r7574G9449J26339a89887
$$ 75729 344305 123723 53988 249315 1187 234511 -136910 -234484 79449 205788 -189887
12799e3617E224a02652A60539G9166K17117c26270D4992c13797A13957a31959
$$ -53617 5224 -102652 160539 79166 296283 -326270 44992 -313797 113957 -131959
12788E4687J48026a64923f0337D7495f9464o3038k3943c1224A02673a82420r042
$$ 54687 202713 -164923 -60337 47495 -69464 -132502 -156445 -31224 102673 -182420 -191462
12777a91462h3175B94199b02070P3753C6296c0553p0634A15838a06405A77157
$$ -191462 -83175 294199 -202070 -128317 36296 -30553 -101187 115838 -106405 177157
12766A22127Q7411p9200J686e5344c440l0126j28259H2382D377H10K4979K6295
$$ 122127 209538 130338 132024 -55344 -3440 -33566 -161825 82382 4377 810 25789 52084
12754E2084L6068J80379j23039J5588O5741n9931m7372J1100h9088B33780R8047
$$ 52084 88152 268531 145492 161080 226821 166890 119518 130618 -89088 233780 331827
12743C31827j58965H4490L13144B2791N8440H951b12260e6559m62343a3820A32316
$$ 331827 172862 84490 397634 22791 81231 8951 -212260 -56559 -518902 -13820 132316
12731h6957k2729C754K61903C6610h2086L1915j16387N1643A40245a82220C9539
$$ -86957 -109686 3754 265657 36610 -82086 -50171 -166558 -114915 140245 -182220 39539
12719f9565G8280O3977a9242f965C01187f8208J9375l6710c8650j44668B48364
$$ -69565 78280 142257 -19242 -6965 301187 -68208 -48833 -85543 -38650 -183318 248364
12707A37996c29638D88493b5763A04802k7007a34266D9087a98583c7679B958J84193
$$ 137996 -329638 488493 -25763 104802 77795 -134266 49087 -198583 -37679 2958 187151
12696A87151b46551E3761H321a68311j5298B38259C9197J49496E8228b79070B91146
$$ 187151 -246551 53761 8321 -168311 -183609 238259 39197 188693 58228 -279070 291146
12684a42153C10404g5427C34649P8576j31328c5471n2027l4631A06807J73107
$$ -142153 310404 -75427 334649 413225 281897 -35471 -87498 -122129 106807 279914
12674B79914a79060d0549o8558H1623a58525l070g8560C09186A15230g4885j89259
$$ 279914 -179060 -40549 -109107 81623 -158525 -161595 -78560 309186 115230 -74885 -264144
12663b64144h1580d2B02410J91783m9205D257Q0109b55780b6643I08a95136F3834
$$ -264144 -81580 -42 202410 394193 344988 4257 84366 -255780 -26643 908 -195136 63834
12650A01256B4957a66011A0459a0100j28100e7322C69008A54157A0768a4509k75916
$$ 101256 24957 -166011 10459 -10100 -138200 -57322 369008 154157 10768 -14509 -290425
12639b90425B91780F893a18124b7799F7915J99329i424A26422e638C68752F3417
$$ -290425 291780 6893 -118124 -27799 67915 267244 -9424 126422 -5638 368752 63417
12627d9441A3180c1211A77723a61835B23383b07591c4206j07449I9199j9996M7631
$$ -49441 13180 -31211 177723 -161835 223383 -207591 -34206 -141655 99199 79203 126834
12616A26834c5160J5845A09442b30657C17228a90568H1836i3654A739J12927Q2924
$$ 126834 -35160 -19315 109442 -230657 317228 -190568 81836 -93654 1739 114666 197590
12605A97590c7l1387A22328a36027b6958k16011a0305b004j47740B60456c92201
$$ 197590 -37 -31424 122328 -136027 -26958 -242969 -10305 -2004 -149744 260456 -392201
12593A45480a60695P7091C33226j31469e9951q5509l8297B02100j973j1708K2465
$$ 145480 -160695 -83604 333226 201757 -59951 -145460 -183757 202100 200127 188419 210884
12582B10884d5775A04584J82051P2714a83910A50105g2511B41041b6833r8953
$$ 210884 -45775 104584 286635 359349 -183910 150105 -72511 241041 -26833 -125786
12572a25786j60903A79702a69097g7115B12120A01334J1299l602P28e0808k88039
$$ -125786 -286689 179702 -169097 -77115 212120 101334 112633 109031 109759 -50808 -338847
12561c38847H2739a2144j29244A60733J89997a45781B33061F0329L3381R851d0125
$$ -338847 82739 -12144 -141388 160733 350730 -145781 233061 60329 93710 103561 -40125
12549b19109C8047f4122j59101A86524b0970I7257b26037Q692B8236O999j3659
$$ -219109 38047 -64122 -223223 186524 -20970 97257 -226037 -217345 28236 35235 21576
12538B1576b82879a07911K8005j03213A0565J44797d7571I8462a23300I4289J16213
$$ 21576 -282879 -107911 -79906 -183119 10565 155362 -47571 98462 -123300 94289 210502
12527B10502L0178a29327A21434B8888b5142D69881G1996a28839K5103G3299J80556
$$ 210502 240680 -129327 121434 28888 -25142 469881 71996 -128839 -103736 73299 253855
12516B53855a10483D3151P5290J93818a94725A73137O3289D5962b25157c6444
$$ 253855 -110483 43151 118441 312259 -194725 173137 236426 45962 -225157 -36444
12505h0850A03591a21769B39438B8722a09378C1909J38396a41926j49511D9650
$$ -80850 103591 -121769 239438 28722 -109378 31909 170305 -141926 -291437 49650
12494a5713b634C4760N3885j0443c77016I2665m2469f1684B0818K1742K01189
$$ -15713 -2634 34760 88645 78202 -377016 92665 50196 -61684 20818 42560 243749
12483B43749B0581J51272a7472Q529D006a17848B19897c51769B58498a98065J6075
$$ 243749 20581 171853 -17472 -8943 4006 -117848 219897 -351769 258498 -198065 -181990
12472a81990C14978H2445B2795c56092e6260M610B61851c8728j49101M8307A66220
$$ -181990 314978 82445 22795 -356092 -56260 -51650 261851 -38728 -187829 -139522 166220
12460c34520E8197J66774b14055A10039J73143f1411A29668J00806G8202c2365
$$ -334520 58197 224971 -214055 110039 283182 -61411 129668 230474 78202 -32365
12449G7551L8610a35901K8113C630J53392E513b06239C4245R596K50514j33848
$$ 77551 116161 -135901 -107788 3630 157022 5513 -206239 34245 43841 294355 160507
12438A60507j2065f879m778r9350j822A00620a1340a044B1503f1216b3535A81194
$$ 160507 148442 -6879 -11657 -111007 -112829 100620 -11340 -1044 21503 -61216 -23535 181194
12425G3634L497K97510b6189m6937A63517b37032B05417e2097C82293f2789G2778
$$ 73634 77131 374641 -26189 -73126 163517 -237032 205417 -52097 382293 -62789 72778
12413A75391a58159A57642a46072D3591b05230E2080a7551j87690J5381k7136
$$ 175391 -158159 157642 -146072 43591 -205230 52080 -17551 -205241 -189860 -216996
12403b16996g346j1171j8953C2218b98394A02555h1417j45760B01742f2093J8953
$$ -216996 -7346 -18517 -37470 32218 -298394 102555 -81417 -227177 201742 -62093 -43140
12392d3140e499B34750k6693a80317E7532J96933g1037G0849a49923b9155A94914
$$ -43140 -5499 234750 208057 -180317 57532 254465 -71037 70849 -149923 -29155 194914
12380b2328j1549B51619C8460F0c0587j48612A00106j3200J79676B3183a10131
$$ -22328 -33877 251619 38460 60 -30587 -179199 100106 86906 266582 23183 -110131
12368A94795b01492p4627F0023a74540C054a23222j26978b3402A68407a35816
$$ 194795 -201492 -276119 60023 -174540 3054 -123222 -250200 -23402 168407 -135816
12357B05405B4761K8035b28241H5850P3846O752p9757K09184J1714A32181b85023
$$ 205405 24761 52796 -228241 85850 159696 166448 86691 295875 307589 132181 -285023
12345a32188C8580b14967j1669A28814B8876J39098F687N402h17o5365B84020
$$ -132188 38580 -214967 -226636 128814 28876 167974 6687 12089 -817 -66182 284020
12333b22465J04980I4284P7565Q3503J51269c1435D2806B220g6426B66726p102
$$ -222465 -117485 94284 171849 255352 406621 -31435 42806 2220 -76426 266726 259624
12322B59624G5718L0341N1833i5500E2876f2410o3814L5923B2791L7903J65190
$$ 259624 75718 106059 157892 -95500 52876 -62410 -126224 -90301 22791 60694 225884
12311B25884c0778k71199Q3850m883f5704b1388A19329b8498Q185A20844b8296
$$ 225884 -30778 -301977 -218127 -223010 -65704 -21388 119329 -28498 -20313 120844 -28296
12299e8920K2725D5749L3479K4101b200C00038d73007e6778A02779k231C3298
$$ -58920 -36195 45749 79228 103329 -2200 300038 -473007 -56778 102779 100548 33298
12287E3962J47814c7358B79629A2381R5707J16945a70321A53691b3212F6846B7083
$$ 53962 201776 -37358 279629 12381 108088 225033 -170321 153691 -23212 66846 27083
12275A63158i8873A28631c3241A1357R5976b24185A9603i2106B04035K1396a17538
$$ 163158 -98873 128631 -33241 11357 107333 -224185 19603 -92106 204035 225431 -117538
12263D7173a42096f5569a1972k7884k39720f0545A86399I2407K91581a51710C92228
$$ 47173 -142096 -65569 -11972 -39856 -279576 -60545 186399 92407 383988 -151710 392228
12251a47015L0839H3751c9331k2387B1713J82025H6094B2229J86533a04356A60792
$$ -147015 -116176 83751 -39331 -61718 21713 203738 86094 22229 208762 -104356 160792
12239a08524g631j82161B81509B3340A0334J75891j1428c02873B07790a42968
$$ -108524 -7631 -189792 281509 23340 10334 186225 174797 -302873 207790 -142968
12228f0161A56336j9440J56775A28156J26832B2807K75708j23520b2606D1784
$$ -60161 156336 136896 293671 128156 254988 22807 298515 174995 -22606 41784
12217B55741d91931e6772B39505H5908h7791j67637F8721L95258H7343a17337
$$ 255741 -491931 -56772 239505 85908 -87791 -255428 68721 463979 87343 -117337
12206D8167d4775j06624C4849a30535A51914K08678j36892E8264b63236g3618
$$ 48167 -44775 -151399 34849 -130535 151914 360592 223700 58264 -263236 -73618
12195f1607G5077J4755R5375n4650J87648G0026g0006B62283C8727J32478J5881
$$ -61607 75077 89832 185207 130557 318205 70026 -70006 262283 38727 171205 187086
12184A87086G1780d22114D18726a7966A45004J34313J94635I944c0068B1017J79708
$$ 187086 71780 -422114 418726 -17966 145004 279317 473952 9944 -30068 21017 200725
12173B00725l1529J19193r1962D2059J64056j2020M1963b58792E2308O7139K35495
$$ 200725 169196 288389 196427 42059 206115 194095 236058 -258792 52308 119447 354942
12162C54942A64769R2523D850K45964e8383B75405D8769a80014B17114Q8342C6160
$$ 354942 164769 257292 4850 250814 -58383 275405 48769 -180014 217114 305456 36160
12150h0858K0993k5945A16740Q6044c94033A33939J67093A11538a32550B9419
$$ -80858 -59865 -85810 116740 202784 -394033 133939 301032 111538 -132550 29419
12139e1290C55468A07985C5234A3252a01908B92907j33417a67289H9593c09277
$$ -51290 355468 107985 35234 13252 -101908 292907 159490 -167289 89593 -309277
12128a30536A27565h4874A50461E186a25441A1224J24888L4691c55727A38106
$$ -130536 127565 -84874 150461 5186 -125441 11224 136112 170803 -355727 138106
12117b36275C58193A00949b8941n0299B07960H9448a21966A16008a2846m4474
$$ -236275 358193 100949 -28941 -79240 207960 89448 -121966 116008 -12846 -57320
12107e7320A79288e1567A50441E0524a40550A64336M0039M6316E3161A8393b20414
$$ -57320 179288 -51567 150441 50524 -140550 164336 204375 250691 53161 18393 -220414
12095H9632j972a65493F149P1161O4022a2100C4804J26577e6513h186F2226O1109
$$ 89632 87660 -165493 6149 77310 141332 -12100 34804 161381 -56513 -8186 62226 123335
12083A23335N7161A8449b33574A01711b63944C65849C1251K14711F0157O7089
$$ 123335 180496 18449 -233574 101711 -263944 365849 31251 245962 60157 127246
12073A27246i8196H2398d9806k08328N8085f1655k04879d3753C78955j62008K4533
$$ 127246 -98196 82398 -49806 -258134 -200049 -61655 -266534 -43753 378955 216947 241480
12062B41480a23723B26765K52221k9165a96024Q3157A60839a67632E296d290l3980
$$ 241480 -123723 226765 478986 449821 -196024 -112867 160839 -167632 5296 -4290 -38270
12051c8270A78744J07754C4098d14471A66750H1069l0080b08864i1128j4605a8661
$$ -38270 178744 286498 34098 -414471 166750 81069 50989 -208864 -91128 -105733 -18661
12039a5310A66730c4892B89896h1338m1915A43727N475b0806D30613B2025b54908
$$ -15310 166730 -34892 289896 -81338 -123253 143727 149202 -20806 430613 22025 -254908
12027A08281A5301R6592a17708K592L9820f306B44641b06218B36528E2339a31050
$$ 108281 15301 111893 -117708 -115116 -75296 -6306 244641 -206218 236528 52339 -131050
12015f5178C76588a47583K4190F6381B9130R5593b18375f4514j162n2751p9708
$$ -65178 376588 -147583 -123393 66381 29130 124723 -218375 -64514 -65676 -118427 -198135
12004a98135R5027n8946A5799J01930c62532B82936A39483B0683a25935A02005
$$ -198135 -103108 -162054 15799 117729 -362532 282936 139483 20683 -125935 102005
11993F170b09547f2768A02487c29895J36428h2837B47989A10696b70076A26965
$$ 6170 -209547 -62768 102487 -329895 -193467 -82837 247989 110696 -270076 126965
11982a03190K175G613a75682l2440E01998h3286B71465b8717m3890j66000h8928
$$ -103190 -101015 7613 -175682 -208122 501998 -83286 271465 -28717 -72607 -238607 -88928
11970A69045J945A3198a22443l5912A07863a18259A90016k6571e2289E9912j9541
$$ 169045 170990 13198 -122443 -158355 107863 -118259 190016 163445 -52289 59912 40371
11959D0371a64077F4929b30332m5853A6846N5815a65076B45831I8365a99723A67811
$$ 40371 -164077 64929 -230332 -276185 16846 72661 -165076 245831 98365 -199723 167811
11947a80529B96121A14082C8924k511N0083J25225I8979K09758c86147K2967f8899
$$ -180529 296121 114082 38924 36413 86496 211721 98979 308737 -386147 -363180 -68899
11935I970J18851b30159l9533e9478j58325i9902A42136g5501A11975a68997A29437
$$ 9970 128821 -230159 -269692 -59478 -217803 -99902 142136 -75501 111975 -168997 129437
11923A48578a77434F7723i2312B1077J49287F9422J26760d8371A9784c56236J76153
$$ 148578 -177434 67723 -92312 21077 170364 69422 196182 -48371 19784 -356236 -180083
11912a80083b1286m10165A72209C5245K06627J41648a07578d5909l4611C65511
$$ -180083 -21286 -431451 172209 35245 241872 383520 -107578 -45909 -80520 365511
11901a4688j92058G5178R471b3521m3699F2030a3511q3095p823c8355l210A20655
$$ -14688 -206746 75178 84649 -23521 -67220 62030 -13511 -96606 -104429 -38355 -41565 120655
11888c68982a42778f0741k41910j41686a39413j3119K631b1102B80146a8355H9993
$$ -368982 -142778 -60741 -302651 -444337 -139413 -152532 -149901 -21102 280146 -18355 89993
11876c91330B49003j00830b7898j41541G5472a55965D1366a70562A54515i0503
$$ -391330 249003 148173 -27898 -169439 75472 -155965 41366 -170562 154515 -90503
11865B1612R8597j3370P3416a36569A53429e9944k46795D17015e3637C78132b01676
$$ 21612 120209 106839 180255 -136569 153429 -59944 -306739 417015 -53637 378132 -201676
11853c5327k08614D6953K21539A26552a36401c7593F0523e9459j66421J02249
$$ -35327 -243941 46953 268492 126552 -136401 -37593 60523 -59459 -225880 -123631
11843a23631A8102p76b81951C5324d5994m14277A21896a27581e4793k46012B14869
$$ -123631 18102 17326 -281951 35324 -45994 -460271 121896 -127581 -54793 -300805 214869
11831H2447a6795r4874J7343j8031L5584j31048N4429f4908D9316a08723j06912
$$ 82447 -16795 -111669 -94326 -112357 -76773 -207821 -153392 -64908 49316 -108723 -215635
11820b15635c6768a3347l46545a38618O1229F6521b87955g0206i416l8156j42034
$$ -215635 -36768 -13347 -359892 -138618 -77389 66521 -287955 -70206 -9416 -47572 -189606
11809a89606p0406j0241J10352E1418d3294A03537a9040A59298a54741G5975B6392
$$ -189606 -260012 -270253 -159901 51418 -43294 103537 -19040 159298 -154741 75975 26392
11797B818L9019L3159a6473D44631a65276P165I9261O5708a95918l370A17655
$$ 2818 41837 74996 -16473 444631 -165276 -158111 99261 164969 -195918 -199288 117655
11785d3472p4252M8556C47043B1094a45770k04874f5310A82052a3691m8551j44021
$$ -43472 -117724 -69168 347043 21094 -145770 -350644 -65310 182052 -13691 -62242 -206263
11774b06263c8393A33088i3079C2301a4144j56579h5041k45506a19914L9G724
$$ -206263 -38393 133088 -93079 32301 -14144 -170723 -85041 -330547 -119914 -119875 7724
11762A57147b44123A47272l3051J9694j3515b15442E4383M2105K10949g430j99448
$$ 157147 -244123 147272 114221 133915 120400 -215442 54383 96488 307437 -7430 -206878
11751b06878I8468A8245R9200a88532h417E3833d9462l406A68551g0861a4992
$$ -206878 98468 18245 117445 -188532 -8417 53833 -49462 -52868 168551 -70861 -14992
11739C79699d01298D0410K48J43725a06471A55367a06241A2104J88747b25676
$$ 379699 -401298 40410 40658 184383 -106471 155367 -106241 12104 200851 -225676
11728d372r8793e220k5795C36376G0095A3447J11671c3057p2428e0955j39544
$$ -4372 -103165 -5220 -31015 336376 70095 13447 125118 -33057 -105485 -50955 -190499
11717a90499Q6218J0109a3858n0528j80054a2164A11024K04442a62355O5282i351
$$ -190499 -104281 -94172 -13858 -64386 -244440 -12164 111024 315466 -162355 -97073 -9351
11705b51404C0003a72415k36909a83366P3460G1242a88933e8245q4520a186B63122
$$ -251404 30003 -172415 -409324 -183366 -109906 71242 -188933 -58245 -142765 -1186 263122
11693a99848D3030h1252k96937a22395G9051b23097j33874p809g5168j56042B01240
$$ -199848 43030 -81252 -378189 -122395 79051 -223097 -356971 -364780 -75168 -231210 201240
11681E05022A79368H3739J29363B493K64820D4567Q2544f7854B8028a07830j4098
$$ 505022 179368 83739 213102 2493 267313 44567 127111 -67854 28028 -107830 -121928
11670a21928j5651O1427J6186j85351P3030M1004q1253R6648H9127g358G3540
$$ -121928 -137579 -76152 -59966 -245317 -172287 -131283 -212536 -115888 89127 -7358 73540
11658h8184K5901B2592R7971E2990j1999c6537A34563a26926c1995D2938c88038
$$ -88184 -62283 22592 120563 52990 40991 -36537 134563 -126926 -31995 42938 -388038
11646c41359E2391a93541B37236a11537k42672J22821C87166j02188e8296G8405
$$ -341359 52391 -193541 237236 -111537 -354209 -231388 387166 284978 -58296 78405
11635A30693b19612G089J64652f0037A16153J40528c20381J49342D7266P7009
$$ 130693 -219612 7089 171741 -60037 116153 256681 -320381 -171039 47266 124275
11625A24275k8677a76865e8168B46065o111b15186K7053G5875f7239J0999B09596
$$ 124275 95598 -176865 -58168 246065 239954 -215186 -188133 75875 -67239 -56240 209596
11613i487A96561e8981H1834a85717B66785a27395A6996a66668E5479N1368j2526
$$ -9487 196561 -58981 81834 -185717 266785 -127395 16996 -166668 55479 106847 94321
11602I4321L81a81055a2209B67656A15618K2647C1527K39146j08021k3847c49222
$$ 94321 94702 -181055 -12209 267656 115618 138265 31527 270673 162652 138805 -349222
11590B1622k372E84a1382A44421o0566a9155C84639a65888J7317R243I3388J25415
$$ 21622 19250 584 -11382 144421 83855 -19155 384639 -165888 -148571 -139328 93388 218803
11578B18803C8084K2915K91215A41875C0826g0270p4903G4098C1904a78048l4533
$$ 218803 38084 60999 352214 141875 30826 -70270 -145173 74098 31904 -178048 -212581
11567b12581J6058O352p661L8435D1999L18957b4179l1322m0238C2854a26111
$$ -212581 -196523 -190171 -197832 -159397 41999 360956 -24179 -55501 -95739 32854 -126111
11555b48424q9485J16841D0138b45209B9289O7917J17054a86387c9711C2314K54467
$$ -248424 -337909 -221068 40138 -245209 29289 97206 214260 -186387 -39711 32314 286781
11544B86781F0952J47818q5519i8971L2351k8560c8873A61383c18389a17531E7879
$$ 286781 60952 208770 123251 -98971 -66620 -95180 -38873 161383 -318389 -117531 57879
11532H9477K82834a20861R086K1969D0496c02948J23399g5054L30r8346L7301
$$ 89477 372311 -120861 -111775 -89806 40496 -302948 -179549 -75054 -74724 -173070 -135769
11521a35769A18264b06112p1075A67862f5380D6166k253n59i8621r7083B83260
$$ -135769 118264 -206112 -277187 167862 -65380 46166 43913 43354 -98621 -195704 283260
11509c8981A76090a48200C450J74770n5457a17578r6589P0453j33104M7103j76959
$$ -38981 176090 -148200 3450 178220 122763 -117578 -214167 -143714 -276818 -229715 -406674
11498d06674i1117j43341A04529J1032p528j0253a24948A35257r774a2448d305
$$ -406674 -91117 -234458 104529 115561 108033 97780 -124948 135257 125483 -12448 -4305
11486I9764P5260B7010M9142O2472b38463K1168h6650I4560A049g9685A86763
$$ 99764 175024 27010 76152 138624 -238463 -217295 -86650 94560 1049 -79685 186763
11474A97933i6924B55654h3073C07084b31771A66699a76675e6183n0431D911b0892
$$ 197933 -96924 255654 -83073 307084 -231771 166699 -176675 -56183 -106614 4911 -20892
11462a66294j4905B36501B1679J37198M5592G2936g6249A60433h4215j19576c5800
$$ -166294 -181199 236501 21679 158877 204469 72936 -76249 160433 -84215 -203791 -35800
11450f4605A01826D9904o142a96399d6203B06317a02437j07678A24170a49443
$$ -64605 101826 49904 43762 -196399 -46203 206317 -102437 -210115 124170 -149443
11439A5541J24049E003L2282f0255k80267a50983I2771h5061J1252F3144M6500
$$ 15541 139590 5003 37285 -60255 -340522 -150983 92771 -85061 -73809 63144 109644
11428A09644f060B44512E2456h478B3559M6473B583a65124G9688a55990f939A99446
$$ 109644 -6060 244512 52456 -8478 23559 70032 2583 -165124 79688 -155990 -6939 199446
11415d0305j64437g7679L5785J8666j17671O8886K8424p4749N8410a145j20016
$$ -40305 -204742 -77679 -41894 -23228 -140899 -72013 -43589 -118338 -59928 -1145 -121161
11404a21161b4271D2543J40126A3441N2787a8535A787J18505a08020d2577j38576
$$ -121161 -24271 42543 182669 13441 66228 -18535 1787 120292 -108020 -42577 -181153
11393a81153A64357B7171O4380b61548O5372p0513A46271C0853K68813b04434
$$ -181153 164357 27171 91551 -261548 -196176 -266689 146271 30853 299666 -204434
11382a35340f783l37340J28518H7933P7861e2509j01819C01860C7566J0248c26426
$$ -135340 -6783 -344123 -215605 87933 165794 -52509 -154328 301860 37566 47814 -326426
11370B07822I3731J60137j16671H531i2462D3256b08341I9047L1345a69909B1396
$$ 207822 93731 253868 137197 8531 -92462 43256 -208341 99047 130392 -169909 21396
11358c15953C15157A19072C600J24152C3494A1687P0037c58077c5311a5243D02095
$$ -315953 315157 119072 3600 127752 33494 11687 81724 -358077 -35311 -15243 402095
11346A58398J05642a20746A84466G9050a6736A84259C9469a35311m8322f1327
$$ 158398 264040 -120746 184466 79050 -16736 184259 39469 -135311 -183633 -61327
11335A5395c2010j77036Q2886k11298A52539F5182b97368a17578G6894d6352k5435
$$ 15395 -32010 -209046 -126160 -337458 152539 65182 -297368 -117578 76894 -46352 -71787
11324g1787c147p9285C26844B402a45284N750M8450D696c92468R6157F9074J60271
$$ -71787 -3147 -82432 326844 2402 -145284 -139534 -91084 4696 -392468 -296311 69074 229345
11312B29345e9769a5449A28508D2259a04326E0410a51660c2857A56460E7139J4772
$$ 229345 -59769 -15449 128508 42259 -104326 50410 -151660 -32857 156460 57139 71911
11301G1911b57790h7267E1862f7272p6334A66961A6768c8595H0928f0008n234
$$ 71911 -257790 -87267 51862 -67272 -143606 166961 16768 -38595 80928 -60008 -65242
11290f5242p8138k83335J83577A78703b71185F3689a12126C61033A26895i2003
$$ -65242 -143380 -426715 -243138 178703 -271185 63689 -112126 361033 126895 -92003
11279A1650f2252A7099O4474J85880A24i5913D2181K23327f6007K0016K1183B69615
$$ 11650 -62252 17099 81573 267453 124 -95913 42181 265508 -66007 -45991 -24808 269615
11266a99246Q6042l6175m4501E7281P1777a43747f2430l3401A82805i9756H9954
$$ -199246 -113204 -149379 -193880 57281 129058 -143747 -62430 -95831 182805 -99756 89954
11254A96300E175J49153E6439J37700g9804j6117E255R693a92297Q6661l23318
$$ 196300 5175 154328 56439 194139 -79804 -95921 5255 14948 -192297 -105636 -428954
11243d28954b9962j63763B136K60466a19121A08920B0474a77554C7022b23394
$$ -428954 -29962 -193725 2136 262602 -119121 108920 20474 -177554 37022 -223394
11232b60438J22767j62564B21268e02894a17248C9642a04305A74052m0538a19212
$$ -260438 -137671 -300235 221268 -502894 -117248 39642 -104305 174052 133514 -119212
11221c96485A25285l1429c9704p9200A0340a97086e600A20626b4702a1896j34106
$$ -396485 125285 93856 -39704 -118904 10340 -197086 -5600 120626 -24702 -11896 -146002
11210a46002d0792k9640A06381b16960G0172a316E3343J26775h4017j08346A9299
$$ -146002 -40792 -70432 106381 -216960 70172 -1316 53343 180118 -84017 -192363 19299
11198h8562B0658J2393a31701H4790a6358j14969d4569q8073k0276J3247A28181
$$ -88562 20658 33051 -131701 84790 -16358 -131327 -44569 -132642 -152918 -139671 128181
11186a144j57164k337F1882c11797i7885J0127A21776b73313C4548a50597P372
$$ -1144 -158308 -160645 61882 -311797 -97885 -87758 121776 -273313 34548 -150597 -143225
11175a43225m1271j33924B74045p0819D2656a09408A20446a63788D8779K3149
$$ -143225 -184496 -318420 274045 203226 42656 -109408 120446 -163788 48779 71928
11165G1928a66349c1611D5388K5316b87568B35340E6979e8495j90804N6930h8382
$$ 71928 -166349 -31611 45388 70704 -287568 235340 56979 -58495 -249299 -192369 -88382
11153g9072j19201B36527h227C534O5516a68555B7685c8505F7992f1429n6400
$$ -79072 -198273 236527 -8227 3534 69050 -168555 27685 -38505 67992 -61429 -117829
11142a17829D2128d6143j75330r1253E0514a24665j15009Q3055j3180M8905C21827
$$ -117829 42128 -46143 -221473 -312726 50514 -124665 -239674 -156619 -169799 -120894 321827
11130i0012B37701j18134b01497P0438m4575P3105B19214a03392A09819f1791
$$ -90012 237701 119567 -201497 -131059 -175634 -102529 219214 -103392 109819 -61791
11119b10j48155A1778J84420a30766j10506C22864e8928j33841A9943a15180p3318
$$ -210 -148365 11778 196198 -130766 -241272 322864 -58928 -192769 19943 -115180 -188498
11108a88498A23698f0905C02208a79150E7742Q4429m0799a41560G9947K1650J86641
$$ -188498 123698 -60905 302208 -179150 57742 142171 101372 -141560 79947 101597 288238
11097B88238d4092D3614c4736A12357e3057E38496a83918k24539C63240i7518
$$ 288238 -44092 43614 -34736 112357 -53057 538496 -183918 -408457 363240 -97518
11086A90346h6703D4184J08973A8920K12602a09905B27998a01962E8922A7487
$$ 190346 -86703 44184 153157 18920 231522 -109905 227998 -101962 58922 17487
11075C25495a6786C35006j48201J74784A22269Q8763H244K12681a50638D4877
$$ 325495 -16786 335006 186805 361589 122269 211032 8244 220925 -150638 44877
11064c5617A19313J06863K44578j82086m9116o0490A3571K03177k2498J02309
$$ -35617 119313 226176 470754 288668 239552 179062 13571 216748 194250 296559
11054B96559K0025P5385i6777G3635B913Q9103L47609A27054J61368j1033E8311
$$ 296559 316584 391969 -96777 73635 2913 92016 439625 127054 288422 277389 58311
11042D60571o7295O899l8351l2503F7554O36191k38613a79699C39723q4622P1581
$$ 460571 393276 400175 361824 329321 67554 703745 465132 -179699 339723 255101 326682
11031C26682I1769b55918C98213G6696J88236O6084J11258L528l5118j24135J58968
$$ 326682 91769 -255918 398213 76696 264932 331016 442274 445802 410684 286549 445517
11020D45517B6502K37602M8138N8378o7114l9247K6501R6789J0961m9228J3521
$$ 445517 26502 264104 312242 370620 303506 264259 290760 387549 398510 349282 362803
11009C62803j24440j4783L69711A43602J6626K83027k10364p2919J98039j58740
$$ 362803 238363 223580 593291 143602 160228 443255 232891 159972 358011 199271
10999A99271K45981k2422J02686J15622B28140q3404a51240B07080K20834j67285
$$ 199271 445252 422830 525516 641138 228140 144736 -151240 207080 427914 260629
10989B60629j12152P1456M3422L43318k46632j27456J67738j41112A24886K99230
$$ 260629 148477 219933 263355 606673 360041 232585 400323 259211 124886 424116
10979D24116K43776j62523O1414M7466Q6268P6446o5457K44701K3421M20925k89483
$$ 424116 667892 505369 566783 614249 700517 776963 711506 956207 979628 1400553 1111070
10968A111070k07702K87510N471k01388K83347j28915k89364k22643M9324k02007
$$ 1111070 903368 1190878 1196349 994961 1278308 1149393 860029 637386 686710 484703
10958D84703J14374r4306R3390L9417m2245j53985j39998M55570j46505A68536
$$ 484703 599077 504771 598161 637578 595333 441348 301350 756920 610415 168536
10947C9254J39258M70586A95187q0447E3648r70K3234J2959J22178a12563A67719
$$ 39254 178512 649098 195187 114740 53648 52678 75912 88871 211049 -112563 167719
10935C96396a3024j7461a0630A65875c8183k1677l8636F6902j4588a81589d2984
$$ 396396 -13024 -30485 -10630 165875 -38183 -59860 -98496 66902 52314 -181589 -42984
10923f1661r0513A08713m9630b24089d236B8422Q057b22439C15215A27411M0749
$$ -61661 -152174 108713 59083 -224089 -4236 28422 36479 -222439 315215 127411 168160
10912A68160A2722O8274J48807b8902A96742b67187c3103B2133b3279j43612I5026
$$ 168160 12722 80996 229803 -28902 196742 -267187 -33103 22133 -23279 -166891 95026
10900A49056a44493B3643b02021A97977b93295a10807p7959L140j7764A20634
$$ 149056 -144493 23643 -202021 197977 -293295 -110807 -188766 -185626 -203390 120634
10889a13513j41231D09619a02279j32074a03878a1603m246k5310k79436A75799
$$ -113513 -254744 409619 -102279 -234353 -103878 -11603 -15849 -41159 -320595 175799
10878d7988j1144B5202Q5703a54321n0081B24178a30647E6844R8688b04078L233
$$ -47988 -59132 25202 110905 -154321 -204402 224178 -130647 56844 155532 -204078 -200845
10867b00845F3695N7053b240r5847I7685J8655m3858C1246b0809j21719c839p9852
$$ -200845 63695 120748 -2240 -98087 97685 116340 72482 31246 -20809 -142528 -3839 -83691
10855h3691k05745d6565F3749a22228d9641A52399A48a13320m345n4155c6313
$$ -83691 -289436 -46565 63749 -122228 -49641 152399 148 -113320 -117665 -171820 -36313
10843a37195J7930j2962p2958n2528F4100b90278A2041h9343A0150M9496a04879
$$ -137195 -119265 -132227 -205185 -257713 64100 -290278 12041 -89343 10150 59646 -104879
10831I8661b40165I1662a38344l01813B01639p8269a56567E003J66449f5654A83155
$$ 98661 -240165 91662 -138344 -440157 201639 123370 -156567 5003 171452 -65654 183155
10819c84340C2497c7766l34908A35178E981J35950B2781J06673b77193b531I5686
$$ -384340 32497 -37766 -372674 135178 5981 141931 22781 129454 -277193 -2531 95686
10807E4276c35947A11965b28700N1626C03004a71464A33806n9148D228N141P898
$$ 54276 -335947 111965 -228700 -177074 303004 -171464 133806 74658 4228 9369 17267
10796A7267l755h4490M952G6043a33035r2310C47920a99607K3602A57014e7330
$$ 17267 13512 -84490 -79538 76043 -133035 -225345 347920 -199607 -176005 157014 -57330
10784c8701G3275a732m1679B51920A03881c70494F7702a79543f9516j45786N0849
$$ -38701 73275 -1732 -43411 251920 103881 -370494 67702 -179543 -69516 -215302 -164453
10773a64453g3023r9956B86598m4617h8830c4973F3814L2748B60b85498a36762
$$ -164453 -73023 -172979 286598 241981 -88830 -34973 63814 96562 260 -285498 -136762
10761b76245h8234B8667N419a42155B40062a62308A17860i5A9838b97001B09261
$$ -276245 -88234 28667 34086 -142155 240062 -162308 117860 -95 19838 -297001 209261
10749c88807A5316N1734b28200g6142j74266B08735I1830d92968B8320a3453j68403
$$ -388807 15316 67050 -228200 -76142 -250408 208735 91830 -492968 28320 -13453 -181856
10738a81856C16927b14493C5017a33797J3955b743A18333b8908n8895a5930k28869
$$ -181856 316927 -214493 35017 -133797 -119842 -2743 118333 -28908 -87803 -15930 -244799
10727b44799J8664C014b36759J01652A993a33910b0562q8846G0011M7329b03520
$$ -244799 -226135 3014 -236759 -135107 1993 -133910 -20562 -109408 70011 117340 -203520
10715a97208p1879H5918a54644A03535O0297b3071j21055l55258A76364b36892
$$ -197208 -269087 85918 -154644 103535 163832 -23071 -144126 -499384 176364 -236892
10704a52781b5959B40285I2531f6860k79155B28749c27932A84913b10562B55499
$$ -152781 -25959 240285 92531 -66860 -346015 228749 -327932 184913 -210562 255499
10693D2361b35088j6346g3864q5162A49593c01362h1489b6370j97674a1125k8525
$$ 42361 -235088 -251434 -73864 -159026 149593 -301362 -81489 -26370 -224044 -11125 -39650
10682c9650B19144q1861h602j25834j61015G198J05595a86481m3587R6448O4747
$$ -39650 219144 137283 -8602 -134436 -295451 7198 112793 -186481 -230068 -133620 -68873
10671f8873c2119j16027j90000n6784c2761K126P135F8246a47281r8007A55998
$$ -68873 -32119 -148146 -338146 -394930 -32761 -30635 -23500 68246 -147281 -245288 155998
10659B118J38134e7032p0141A72241b54911J17642G6872L9016a73134F4439h1481
$$ 2118 140252 -57032 -127173 172241 -254911 -137269 76872 115888 -173134 64439 -81481
10647c62837B04761H2625h4867E7244J01059F5795P0817e1631j23980g6178B03881
$$ -362837 204761 82625 -84867 57244 158303 65795 136612 -51631 -175611 -76178 203881
10635b53141B377g2131k88584A4884a65977F4159a11177A60214J4617a86147k8028
$$ -253141 2377 -72131 -360715 14884 -165977 64159 -111177 160214 174831 -186147 -214175
10624b14175Q1501B05113d9176A06745M3269D9592j9509K25135a2189r0100l83890
$$ -214175 -132674 205113 -49176 106745 150014 49592 30083 255218 -12189 -102289 -486179
10613d86179g9304B33186K4718b07885d2160O695l2823b5462A1599J0906a06439
$$ -486179 -79304 233186 257904 -207885 -42160 -35465 -68288 -25462 11599 22505 -106439
10601a80258a4971k36061c0885j7070j09942p5233A3528h1379j8559F7267b8472
$$ -180258 -14971 -251032 -30885 -47955 -157897 -233130 13528 -81379 -99938 67267 -28472
10589B77496d2066j20662P1980j649l9538P902k11471n6998a91449B04083A01384
$$ 277496 -42066 -162728 -90748 -92397 -131935 -124033 -335504 -392502 -191449 204083 101384
10577b21790l3885g210A5384b03282G269c92279J79527l3602A69614F9715c264
$$ -221790 -255675 -7210 15384 -203282 7269 -392279 -212752 -246354 169614 69715 -3264
10565B8399b4566A12784j7A6712c54520A5425a86781c0882j22867J9421b8665
$$ 28399 -24566 112784 112767 16712 -354520 15425 -186781 -30882 -153749 -134328 -28665
10553i2216q3865B42100b13533a01703p8359Q729A44245h1426b9551o3426A1738
$$ -92216 -176081 242100 -213533 -101703 -180062 -171333 144245 -81426 -29551 -92977 11738
10541a00591B02748p0238M4790h6955G5492J05797G710K4258a77576m0347a2153
$$ -100591 202748 132510 177300 -86955 75492 181289 7710 31968 -177576 -217923 -12153
10529A10305a69676D0072J61665a90156O0116A677a5854k3918k70928a46026A90360
$$ 110305 -169676 40072 201737 -190156 -130040 1677 -15854 -39772 -310700 -146026 190360
10517a24454E387M9388R1025a6404m106j38973A23370h1002F668a9673j87446
$$ -124454 5387 54775 145800 -16404 -20510 -159483 123370 -81002 6668 -19673 -207119
10506b07119B6360a27027I0256i9461k6884b1478A65067Q812A5976M5399J56708
$$ -207119 26360 -127027 90256 -99461 -126345 -21478 165067 173879 15976 61375 218083
10495B18083k2538G5921J69767B328b26954c2616j66885D9992L2518B5858c28787
$$ 218083 195545 75921 245688 2328 -226954 -32616 -199501 49992 82510 25858 -328787
10483c7031l47433B9631b0356j96994b7237k09958M9452N9283p2791B39340b17085
$$ -37031 -384464 29631 -20356 -217350 -27237 -237195 -187743 -128460 -201251 239340 -217085
10471I9464a77471A19430b84237B57228A08807a62918H1993a41563B37345a57737
$$ 99464 -177471 119430 -284237 257228 108807 -162918 81993 -141563 237345 -157737
10460a2401A00500b33749A05436Q6063n7719c43093A25790L4031n1287a36881
$$ -12401 100500 -233749 105436 191499 133780 -343093 125790 159821 108534 -136881
10449A05797a22550F743c84124a87337j3404d9686J7948H1817M4541J4656b89425
$$ 105797 -122550 6743 -384124 -187337 -200741 -49686 -31738 81817 126358 141014 -289425
10437D7137a9807l5084B44746b78356A17640J3627C2394b49783j14826a42359
$$ 47137 -19807 -54891 244746 -278356 117640 131267 32394 -249783 -364609 -142359
10426c080B7167a63395I5312k9123b67748a17222j66562m9781A9870e9025J6552
$$ -3080 27167 -163395 95312 66189 -267748 -117222 -283784 -333565 19870 -59025 -42473
10415d2473J5526j17194f9500a5371a738j61525D857b24934J0719a0115j37098
$$ -42473 -26947 -144141 -69500 -15371 -1738 -163263 4857 -224934 -214215 -10115 -147213
10404a47213a7779H3744A8935J80606n0680a46550p8707B48195j15210c33813
$$ -147213 -17779 83744 18935 199541 148861 -146550 -225257 248195 132985 -333813
10393b31611c5264j29723A05408a03363d7933A97110a80578L2845a418B1377a65354
$$ -231611 -35264 -164987 105408 -103363 -47933 197110 -180578 -147733 -1418 21377 -165354
10381a04552M3523l5835j31884A01253j2401Q9221P6137n2629K68330j18029d093
$$ -104552 -61029 -96864 -228748 101253 88852 178073 254210 201581 469911 351882 -4093
10369a05051B01470f6128C6529O3973J40866P4131N1379b9666B31766i6524J1987
$$ -105051 201470 -66128 36529 100502 241368 315499 366878 -29666 231766 -96524 -84537
10358h4537C46110f7616B8825h2989A68507B8230a06140A94116j6542g9704b7384
$$ -84537 346110 -67616 28825 -82989 168507 28230 -106140 194116 177574 -79704 -27384
10346A96292r525a68704C74333h135p6731B19801Q2200A13481b9781B16231l7829
$$ 196292 186767 -168704 374333 -8135 -84866 219801 302001 113481 -29781 216231 178402
10335A78402a9128F2376d3093j53064B14413a71453c3911A03412H165a09009J2708
$$ 178402 -19128 62376 -43093 -196157 214413 -171453 -33911 103412 8165 -109009 -96301
10324i6301c0128B23685a11473c1544I5008c0167B71246a38777I3492c25641j11613
$$ -96301 -30128 223685 -111473 -31544 95008 -30167 271246 -138777 93492 -325641 -437254
10313d37254c5295C65932i500k01948G4378c2421n8974C1179a10056c0507C47633
$$ -437254 -35295 365932 -9500 -211448 74378 -32421 -91395 31179 -110056 -30507 347633
10301a8645D6089d3019D9379c01437b5238j23446p8891r5618a42873N2435F2934
$$ -18645 46089 -43019 49379 -301437 -25238 -148684 -227575 -323193 -142873 -90438 62934
10289b43829g2468A92410b5145m2379A8448f0768k7121j28567A9608J34185b20589
$$ -243829 -72468 192410 -25145 -67524 18448 -60768 -87889 -216456 19608 153793 -220589
10277D6854d7222K277n0007B03849D9506K0660b39755A50340a19176a5691B12413
$$ 46854 -47222 -44945 -94952 203849 49506 70166 -239755 150340 -119176 -15691 212413
10265c51473g661l2974j78252m205E2893a17076e0072B93206g2129A36362a73209
$$ -351473 -7661 -40635 -218887 -223092 52893 -117076 -50072 293206 -72129 136362 -173209
10253A2036J33127f9209A72272J02627J78051B743b2381B3635P0144J89813I1650
$$ 12036 145163 -69209 172272 274899 452950 2743 -22381 23635 93779 283592 91650
10241A77221q1715a91300n4220F9677b484j25203C09147a98398G5678b67979i5363
$$ 177221 95506 -191300 -245520 69677 -2484 -127687 309147 -198398 75678 -267979 -95363
10229A72810h7071D12026b1100o0415r4071c5188B01726j0542a07422B65246o8356
$$ 172810 -87071 412026 -21100 -81515 -175586 -35188 201726 191184 -107422 265246 196890
10218A96890a55113H4276a2473j08164r2072L9097H975b01692L304j2020g9535
$$ 196890 -155113 84276 -12473 -120637 -212709 -173612 8975 -201692 -198388 -210408 -79535
10206A46826K8020c15825J34827L2018B8429P6967g4136A06089c06075B17638
$$ 146826 174846 -315825 -180998 -148980 28429 105396 -74136 106089 -306075 217638
10195f6473p9350c7891A43626a57089k23289F8219j0939k6999K9501b35l6r6186
$$ -66473 -145823 -37891 143626 -157089 -380378 68219 57280 30281 59782 -235 -271 -96457
10183i6457J9705c5851B54475a72709j40390H1122k2663e8255k3080c0702j59988
$$ -96457 -76752 -35851 254475 -172709 -313099 81122 58459 -58255 -81335 -30702 -190690
10172a90690N2046j7301H9703b19269r808d0817k3462l58498e9962C11591e9301
$$ -190690 -138644 -155945 89703 -219269 -229077 -40817 -64279 -422777 -59962 311591 -59301
10160B50416C8063a55253J8492a9641m54180a05375A53405b12031B78960d6873
$$ 250416 38063 -155253 -136761 -19641 -473821 -105375 153405 -212031 278960 -46873
10149D5917c54791A0307g2598A99315B94a67899G51P8566a96612E2077N2608l0497
$$ 45917 -354791 10307 -72598 199315 294 -167899 751 79317 -196612 52077 104685 74188
10137G4188c9606B71960a06306F0701b0167A77729a01456E2810a57872m4825C9769
$$ 74188 -39606 271960 -106306 60701 -20167 177729 -101456 52810 -157872 -202697 39769
10125A87256e5550j51078Q7194A21894Q732a19656k26780A38051m815i6041A70762
$$ 187256 -55550 -206628 -119434 121894 130626 -119656 -346436 138051 133236 -96041 170762
10113E5328Q2658F5800J3783a77686D4044b5615m1132r7079P0268A93294b32143
$$ 55328 137986 65800 79583 -177686 44044 -25615 -66747 -163826 -93558 193294 -232143
10101e8331k06701p7782i6640E1550i8231A29318c78458B49837M7042c07535f1577
$$ -58331 -265032 -342814 -96640 51550 -98231 129318 -378458 249837 296879 -307535 -61577
10089e6682m1214L2307B02849c7336B7958e9143p9754a1247r891k35996h5616
$$ -56682 -97896 -65589 202849 -37336 27958 -59143 -138897 -11247 -21138 -257134 -85616
10077B92697g5459F2714b20896G7896b21633c7232A37059c0480k70964h8485A10553
$$ 292697 -75459 62714 -220896 77896 -221633 -37232 137059 -30480 -301444 -88485 110553
10065b10678A25382a44348B33398c07139q7604J46777B0967a81026f2586j25443
$$ -210678 125382 -144348 233398 -307139 -394743 -247966 20967 -181026 -62586 -188029
10055a88029c8524l01235J54942b8637J2351k21095p1899K6043m3569C5558L2715
$$ -188029 -38524 -339759 -184817 -28637 -16286 -237381 -309280 -283237 -326806 35558 68273
10044F8273b2070A0282a54230B8812K5070d10041a05364A53821F8516a68685g7957
$$ 68273 -22070 10282 -154230 28812 53882 -410041 -105364 153821 68516 -168685 -77957
10032f8826A4466b39074B24529C1088c3245h01A6092J45592b80752a10270H0126
$$ -68826 14466 -239074 224529 31088 -33245 -801 16092 161684 -280752 -110270 80126
10020F4234K66868a99531j42002A32070C5150a12542A22119a93662M893l3280
$$ 64234 331102 -199531 -341533 132070 35150 -112542 122119 -193662 -188769 -222049
10010b22049A4672b9639j33003o4351e817l79108a73214I6277D1653d0940C980
$$ -222049 14672 -29639 -162642 -226993 -5817 -384925 -173214 96277 41653 -40940 3980
9998b69405A16771K23347G7980I327b51620R5624C037K01204m7655i1747H5955
$$ -269405 116771 340118 77980 9327 -251620 -155996 3037 204241 156586 -91747 85955
9986A01424a91526C6614l617f5647q6411H8137J03512B8958R0257b45831f2106
$$ 101424 -191526 36614 32997 -65647 -152058 88137 191649 28958 119215 -245831 -62106
9974I6725c04908B474J56219C268c08807H9526b2258o3193b7010k46171e3206
$$ 96725 -304908 2474 158693 3268 -308807 89526 -22258 -85451 -27010 -273181 -53206
9962B08072n0491c5455l48140a04282B85622b26298o3286n4439j7746A43575o4741
$$ 208072 157581 -35455 -383595 -104282 285622 -226298 -289584 -344023 -361769 143575 78834
9951G8834b36310A46638B8418a44961A4878a58555n7613F2787a20825j10469F5067
$$ 78834 -236310 146638 28418 -144961 14878 -158555 -216168 62787 -120825 -231294 65067
9939F5998b52254H5522b0218E0233N5832c45306H6684b71566F5297B2276b10958
$$ 65998 -252254 85522 -20218 50233 106065 -345306 86684 -271566 65297 22276 -210958
9927a63771A22777B4668a6039G2149J75695b2237k11777c4559k46206A49526a66097
$$ -163771 122777 24668 -16039 72149 247844 -22237 -234014 -34559 -280765 149526 -166097
9915c56438N8113J16596d7347A1924c80255G1323a99004a2102k82689B02499i2821
$$ -356438 -298325 -181729 -47347 11924 -380255 71323 -199004 -12102 -294791 202499 -92821
9903b00076d3022k20467a15074A94924l3524a74812K1700j6641k55280A55782
$$ -200076 -43022 -263489 -115074 194924 161400 -174812 -153112 -169753 -425033 155782
9892A30573a36637k0106A64181l0407a50045A07297F841a47592j55825h9191l7311
$$ 130573 -136637 -156743 164181 133774 -150045 107297 6841 -147592 -303417 -89191 -126502
9881a26502E6937K55758B5479L10747a50220a2706I6997a1719D93485a02306N064
$$ -126502 56937 312695 25479 336226 -150220 -12706 96997 -11719 493485 -102306 -97242
9870i7242p8943J6367D55104b4208A479O2224i726k25361R6771M4436k503d2284
$$ -97242 -176185 -159818 455104 -24208 1479 63703 -9726 -235087 -138316 -93880 -96383 -42284
9857C20217G3453a03547J4865A90366a98542B4134J59282b21723f7130q7454B26978
$$ 320217 73453 -103547 -88682 190366 -198542 24134 183416 -221723 -67130 -154584 226978
9845d48680J71181R3549C7612g9449j78171a6465B74860f9906j21482c6540o1550
$$ -448680 -277499 -183950 37612 -79449 -257620 -16465 274860 -69906 -191388 -36540 -98090
9834i8090j74886P4631A51014D1249R5718c92689J36175B0903c65573G3399a17381
$$ -98090 -272976 -198345 151014 41249 136967 -392689 -256514 20903 -365573 73399 -117381
9822g1398j91422A61362L1083R7129b17007M1045Q0695A86587f6875i846k0587
$$ -71398 -262820 161362 192445 289574 -217007 -175962 -95267 186587 -66875 -9846 -30433
9811c0433A03717a98730c4111k23860P417J22949C8225P0924O1800d9125B07793
$$ -30433 103717 -198730 -34111 -257971 -250554 -127605 38225 109149 170949 -49125 207793
9799c8517m5260A2543a83356G9476g2477l55875a14248A1139a27217A09928q717
$$ -38517 -83777 12543 -183356 79476 -72477 -428352 -114248 11139 -127217 109928 101211
9788A01211j1352M1517j5398j0693g2183m2536k45113b2123C651f7593D1782a89939
$$ 101211 89859 131376 115978 105285 -72183 -114719 -359832 -22123 3651 -67593 41782 -189939
9775i4075B05267a49311G0715J2822b56486C8545a58269B28530c86187a29227
$$ -94075 205267 -149311 70715 83537 -256486 38545 -158269 228530 -386187 -129227
9764A06891J44063b635k3446m21580D4260O7415K15141b42003A53454a21646F0417
$$ 106891 250954 -2635 -26081 -447661 44260 111675 326816 -242003 153454 -121646 60417
9752c3529j68913a243j90880j60277A87677b40491a9652A98027b0091E9825b907
$$ -33529 -202442 -1243 -192123 -352400 187677 -240491 -19652 198027 -20091 59825 -2907
9740a14640b5029K093k3933k3435J0683j26825G8988J6033M7138I237g626A10114
$$ -114640 -25029 -22936 -46869 -70304 -59621 -186446 78988 95021 142159 9237 -7626 110114
9727f4805k27682i1016a6468A739J4649a74234F1113b91615j09876A03867r217
$$ -64805 -292487 -91016 -16468 1739 16388 -174234 61113 -291615 -401491 103867 94650
9716I4650c19153D1041c1352A83578A4077a40296B62325j08459p3316d0940q7703
$$ 94650 -319153 41041 -31352 183578 14077 -140296 262325 153866 80550 -40940 -128643
9705a28643r8955B98222c10168g0152b3606A42904P1656E3325J00917b55644R1839
$$ -128643 -227598 298222 -310168 -70152 -23606 142904 214560 53325 154242 -255644 -163805
9694a63805G7048b46465A4062b5828A65511i1045q4169L4159N8003B1999J88113
$$ -163805 77048 -246465 14062 -25828 165511 -91045 -175214 -141055 -83052 21999 210112
9683B10112b93943c6638j12469b4068B7928a96453J8827b9654k21342K590A11518
$$ 210112 -293943 -36638 -149107 -24068 27928 -196453 -177626 -29654 -250996 -248406 111518
9671E3078P5929b5756k5558l2475k11615a03540A97456b6430A8817J30824a84340
$$ 53078 129007 -25756 -51314 -83789 -295404 -103540 197456 -26430 18817 149641 -184340
9659h5219A15889c44125Q0488D4362a17834D27377c68588f8634A04463a86795
$$ -85219 115889 -344125 -263637 44362 -117834 427377 -368588 -68634 104463 -186795
9648a46123p0658j90013F5018A5786J19992B2417O4810B9459g086m69801i1730
$$ -146123 -216781 -406794 65018 15786 135778 22417 87227 29459 -7086 -476887 -91730
9636c28279D8902d1556E2166J817b14075J06792L1955A19973J16792a5900j36187
$$ -328279 48902 -41556 52166 53983 -214075 -107283 -75328 119973 236765 -15900 -152087
9625a52087b3654P278k46593d9372K1248j09902B9708J48323D3297K5682M686
$$ -152087 -23654 -16376 -262969 -49372 -28124 -138026 29708 178031 43297 68979 73665
9614G3665f3941k17353a02452B5349a39007N3849l4648c493l14863j25303E9444
$$ 73665 -63941 -281294 -102452 25349 -139007 -85158 -119806 -3493 -318356 -443659 59444
9602C16332C372a43244A84602b93782a08551C5557a23112j20597N1420c1054a2371
$$ 316332 3372 -143244 184602 -293782 -108551 35557 -123112 -243709 -192289 -31054 -12371
9590e9815F1030K9443a52731f0431k67953A87355n5754K19541q3211a04071L1288
$$ -59815 61030 90473 -152731 -60431 -328384 187355 131601 351142 267931 -104071 -72783
9579g2783I8209a4123k07239g561A45820F0103A1634b09986j58648f7929p2321
$$ -72783 98209 -14123 -221362 -7561 145820 60103 11634 -209986 -368634 -67929 -140250
9568a40250C5864a15318A73992a69611N3414A04002b8655H985A262b51742Q6758
$$ -140250 35864 -115318 173992 -169611 -116197 104002 -28655 8985 1262 -251742 -164984
9557a64984l65721E0755g4796A65076d6075C3158L722b44545F3504c040A57606
$$ -164984 -530705 50755 -74796 165076 -46075 33158 36880 -244545 63504 -3040 157606
9545e1643k9341B14920c11391a21662D7578i9895a9939n5488B13848q5690k554
$$ -51643 -80984 214920 -311391 -121662 47578 -99895 -19939 -75427 213848 128158 125604
9534A25604h857n7660K5381q1819N7586k8522k3343A12359h4038r5940A66718
$$ 125604 -8857 -66517 -41136 -122955 -65369 -93891 -117234 112359 -84038 -179978 166718
9522C3902a03271P469A26757b00934g9258I746b42924m3939A41536b53937j3963
$$ 33902 -103271 -95802 126757 -200934 -79258 9746 -242924 -286863 141536 -253937 -267900
9511b67900a31653c2126j6496l88915f6049P24a5732k88565G2941A8299b04011
$$ -267900 -131653 -32126 -48622 -437537 -66049 -65325 -15732 -304297 72941 18299 -204011
9499a59465e7595J1904b730D20855a6484g754B12383C8990J93182d7573G9254
$$ -159465 -57595 -45691 -2730 420855 -16484 -7754 212383 38990 232172 -47573 79254
9487i8497K7952j03814P5728A23678J84713a46847E8878R9366a32083k12903A54297
$$ -98497 -70545 -174359 -98631 123678 308391 -146847 58878 158244 -132083 -344986 154297
9475c13634J55470A45085E1482b54642b2508j2632o5866j62425j1929I0381a34331
$$ -313634 -158164 145085 51482 -254642 -22508 -35140 -101006 -263431 -275360 90381 -134331
9463b19124H2731c66619a20536C6823b46715R8975j12086J06135B9624g9534E4068
$$ -219124 82731 -366619 -120536 36823 -246715 -147740 -259826 -153691 29624 -79534 54068
9451B79401G2769a99526d6583a4863B97230a45503A21512K36407b36353c1946
$$ 279401 72769 -199526 -46583 -14863 297230 -145503 121512 357919 -236353 -31946
9440c6236o3062j7985J1470A01898d3445n0712A42052d2761m3313E9629k8064
$$ -36236 -99298 -117283 -105813 101898 -43445 -94157 142052 -42761 -86074 59629 31565
9429C1565a85675j68030H5678Q4942b70704B8817r14J94185f3340L828H3110b69986
$$ 31565 -185675 -353705 85678 170620 -270704 28817 27903 222088 -63340 -59512 83110 -269986
9416A65651a56576O0821A78265Q7215D8043A5733J7934b40915A2273K9007i1249
$$ 165651 -156576 -95755 178265 265480 48043 15733 33667 -240915 12273 41280 -91249
9404a24653N456B249c47600E215a10320I5709b20026A98702A7125b4920E3612
$$ -124653 -119197 2249 -347600 5215 -110320 95709 -220026 198702 17125 -24920 53612
9392a01436c3536k68106N2697L6130m2065A42806n2652O7963J63074h538l51037
$$ -101436 -33536 -301642 -248945 -212815 -254880 142806 90154 158117 321191 -8538 -359575
9381c59575d9090l3825F1309B7827a84534l3576m4959c0208l2940B0496a37960
$$ -359575 -49090 -82915 61309 27827 -184534 -218110 -263069 -30208 -63148 20496 -137960
9369c75475a52597N9909d5701F0244b610A56413a92758A54721a09066k82706D4523
$$ -375475 -152597 -92688 -45701 60244 -2610 156413 -192758 154721 -109066 -391772 44523
9357a03913o5365I3757A7102a15179b910j04014k38905R4798M999a01784B7857
$$ -103913 -169278 93757 17102 -115179 -2910 -106924 -345829 -251031 -246032 -101784 27857
9345a0081k33398K5786J0713j7708A3396J39762F3025a01079j95697J33391g9851
$$ -10081 -243479 -217693 -206980 -224688 13396 153158 63025 -101079 -296776 -163385 -79851
9333a75908A7126J12340p934c73730B45976f6148p4548a6158O55j68315F8372
$$ -175908 17126 129466 121532 -373730 245976 -66148 -140696 -16158 -15503 -183818 68372
9321B02439G3639C6121a71364O3789j88176c4218j23698a8564k77550c4012j43959
$$ 202439 73639 36121 -171364 -107575 -295751 -34218 -157916 -18564 -296114 -34012 -177971
9310a77971g1918r613l18991f5770m6074j47461c7325E8082N7663b6702A61713
$$ -177971 -71918 -81531 -400522 -65770 -111844 -259305 -37325 58082 115745 -26702 161713
9298b88521d4170A42851b95471A97352b457k31044A54284c51421F102N4446O2311
$$ -288521 -44170 142851 -295471 197352 -2457 -233501 154284 -351421 6102 60548 122859
9287A22859e8612q7487J2558c1816j88265G3257b63804a8654k71804g4476A73902
$$ 122859 -58612 -146099 -133541 -31816 -220081 73257 -263804 -18654 -290458 -74476 173902
9275b6968l6176k7817L848D04562c4307A13719a55834n0719h3274A49149e8794
$$ -26968 -63144 -90961 -87113 404562 -34307 113719 -155834 -206553 -83274 149149 -58794
9263F4219Q2470e2995m2633A55265d17451I6308P6006b69579A53904h505l4577
$$ 64219 146689 -52995 -95628 155265 -417451 96308 172314 -269579 153904 -8505 -43082
9252d3082A97890b02699F7688b73521o8674A31496K50696G9428K3735b0264j35943
$$ -43082 197890 -202699 67688 -273521 -342195 131496 382192 79428 103163 -20264 -156207
9241a56207n7705J05059j21221h4256j5349q283c286n5447j80668c7076a7857
$$ -156207 -213912 -108853 -230074 -84256 -99605 -107888 -3286 -58733 -239401 -37076 -17857
9229h779k63164R6267B44865a5872B29202I6800b60625B29843a22769c7712l19331
$$ -8779 -271943 -175676 244865 -15872 229202 96800 -260625 229843 -122769 -37712 -357043
9218c57043E3922A7473a64837P3742j08306d018H8039R4240g5811j70199C3723
$$ -357043 53922 17473 -164837 -91095 -199401 -4018 88039 182279 -75811 -246010 33723
9206c95207f1919B23271b51292A02219b72763K4175a00032j65854A78056B2095
$$ -395207 -61919 223271 -251292 102219 -272763 -248588 -100032 -265886 178056 22095
9195I8228b81278J23114f4790k0313C17617g9963Q146B16522g7222A8275h8374
$$ 98228 -281278 -158164 -64790 -85103 317617 -79963 -71817 216522 -77222 18275 -88374
9183a98611f8800A43499a15985A98657P6811a96696R3708H542K9293a76800G0743
$$ -198611 -68800 143499 -115985 198657 275468 -196696 -102988 8542 37835 -176800 70743
9171A36836a10929A3484J52475j0299o5604k4629K2217c06275c1412H6834l4810
$$ 136836 -110929 13484 165959 155660 90056 65427 87644 -306275 -31412 86834 52024
9160E2024a64248c5330C8827R6628b42573O4600B93368a17636L1002K0804l68467
$$ 52024 -164248 -35330 38827 135455 -242573 -177973 293368 -117636 -86634 -65830 -434297
9149d34297B37056C194K32675F469K177L1026R698R4989b34814A15114b46379
$$ -434297 237056 3194 235869 6469 8646 39672 49370 144359 -234814 115114 -246379
9137b84346j28218b1896j41659H6114N7801c24291B04387K833A2298a71647O7092
$$ -284346 -412564 -21896 -163555 86114 143915 -324291 204387 207220 12298 -171647 -104555
9126a04555j42904j80144B17608b28693j3500g5460k14598B78461g0330j24137
$$ -104555 -247459 -427603 217608 -228693 -242193 -75460 -290058 278461 -70330 -194467
9116a94467C49090a98500A66749d7347k65250G4676P950a66503L0158j36804a07389
$$ -194467 349090 -198500 166749 -47347 -312597 74676 82626 -166503 -136345 -273149 -107389
9104c83803B59412B8157d423m17079a19533B51817a34354j4396F151f9841j21760
$$ -383803 259412 28157 -4423 -421502 -119533 251817 -134354 -148750 6151 -69841 -191601
9093a91601c2956m15255b1387k3128q023A59044R7923g5979L0717A58234c29438
$$ -191601 -32956 -448211 -21387 -44515 -52538 159044 256967 -75979 -45262 158234 -329438
9081a8315p2434G9170e2792A01306f4060L0397I9285A1128Q84L2385a35359k2075
$$ -18315 -90749 79170 -52792 101306 -64060 -33663 99285 11128 12012 44397 -135359 -157434
9069a57434l4350f3379i323C1077h2093A8834L5652K35191b26274J078P3824a7318
$$ -157434 -191784 -63379 -9323 31077 -82093 18834 54486 289677 -226274 -225196 -151372 -17318
9056A41888a49017j61215a04844d2194p5282f256A2333K14918a65962K0991b2506
$$ 141888 -149017 -310232 -104844 -42194 -117476 -6256 12333 227251 -165962 -144971 -22506
9044I5510b68053i715D7574a44010e9415A79604p5101L08827b782H871J76737
$$ 95510 -268053 -9715 47574 -144010 -59415 179604 104503 413330 -2782 8871 185608
9033A85608q3804h6014K836n9574j17977H6558J98510g4764I1171b09492G9668
$$ 185608 101804 -86014 -83178 -142752 -260729 86558 285068 -74764 91171 -209492 79668
9021H0765B6250e2986j61803d5004J265j01535L0237p4294A16798C5393J0012
$$ 80765 26250 -52986 -214789 -45004 -43739 -145274 -115037 -189331 116798 35393 45405
9010D5405h2223E4679b60039C2210b10644d0710k68241J01442C61885C8J20936
$$ 45405 -82223 54679 -260039 32210 -210644 -40710 -308951 -207509 361885 38 120974
8999A20974d8318i757B3793c4456C89605c20057J33507j8918O8602A2958N6958
$$ 120974 -48318 -9757 23793 -34456 389605 -320057 -186550 -205468 -136866 12958 69916
8988F9916a29929A97790g6035j48333i5978K4862H9804O3572b09203A72399K7702
$$ 69916 -129929 197790 -76035 -224368 -95978 -71116 89804 153376 -209203 172399 200101
8977B00101d23596a44443E42J71299L1731c4664A62500K4453g4416b3111C3988
$$ 200101 -423596 -144443 542 171841 203572 -34664 162500 186953 -74416 -23111 33988
8965A20775k7832i6446c6976m13854b6880C08515a32501j07708Q3861H6607a37413
$$ 120775 92943 -96446 -36976 -450830 -26880 308515 -132501 -240209 -156348 86607 -137413
8953F2018O8551c06355C4971J11674F6787a75197G5418d6095A93412d25054B6621
$$ 62018 130569 -306355 34971 146645 66787 -175197 75418 -46095 193412 -425054 26621
8941d9722H1050a12266j61547A27401a30117E1044J20607B012f3271r5775A51213
$$ -49722 81050 -112266 -273813 127401 -130117 51044 171651 2012 -63271 -159046 151213
8929I7155O897b11624E08155E1922J51533f9311q1144A01116J59767N13558J699634
$$ 97155 104052 -211624 508155 51922 203455 -69311 -150455 101116 260883 774441 2474075
8918B474075P40566A212054C03547O2256A2062J98925o4332a01776K475m48995
$$ 2474075 3214641 1212054 303547 365803 12062 210987 146655 -101776 -99301 -548296
8908e48296H3090h7582B4670J91835a39568F9802Q9655J34169j35460n0787q991
$$ -548296 83090 -87582 24670 216505 -139568 69802 159457 293626 158166 107379 98388
8897I8388b35360A04294a62333k49770g2860n3466B1170q287Q241b03909i609
$$ 98388 -235360 104294 -162333 -412103 -72860 -126326 21170 12883 21124 -203909 -9609
8885f858A55103c51791A5728K4943L4766a16892r6111e9352F0604J70911c0424
$$ -6858 155103 -351791 15728 40671 75437 -116892 -213003 -59352 60604 231515 -30424
8873b11458B1275a07314I132K6324B44a16175k05779B3274h9222A19803a96019
$$ -211458 21275 -107314 9132 35456 244 -116175 -321954 23274 -89222 119803 -196019
8861H2013j5875K7535L6593a98182j05995A30579A946d36602a43510e6752A08885
$$ 82013 66138 93673 130266 -198182 -304177 130579 1946 -436602 -143510 -56752 108885
8849a90956N2950G5580k5136f4413j46649k408j28175e3845a5580B8823K9141
$$ -190956 -138006 75580 50444 -64413 -211062 -213470 -341645 -53845 -15580 28823 57964
8838E7964b38267D81f0035n318A01616K1513A7684a89068n9288i0465A25691b39198
$$ 57964 -238267 481 -60035 -65353 101616 123129 17684 -189068 -248356 -90465 125691 -239198
8825A26650A1473a39805l0103Q4129J8935A05096R319c23151B56881B1262h7149
$$ 126650 11473 -139805 -169908 -85779 -66844 105096 114415 -323151 256881 21262 -87149
$$ [...]
##END NTUPLES=NMR SPECTRUM
##END=
