##TITLE=NES1039_872015048_9242671_qEZkBcLU37
##JCAMPDX= 6.0         $$ Bruker NMR JCAMP-DX V2.0
##DATA TYPE= NMR SPECTRUM
##DATA CLASS= NTUPLES
##ORIGIN= BRUKER
##OWNER= Administrator
$$ 1.72 TOPSPIN		Version 2.1
$$ 2015-08-24 21:57:51.905 -0700  Administrator@X
$$ Compression mode = diff/dup
##.OBSERVE FREQUENCY= 400.02188249412
##.OBSERVE NUCLEUS= ^1H
##.ACQUISITION MODE= SIMULTANEOUS (DQD)
##.ACQUISITION SCHEME= undefined
##.AVERAGES= 64
##.DIGITISER RES= 22
##SPECTROMETER/DATA SYSTEM= spect
##.PULSE SEQUENCE= noesygpps1d.comp
##.SOLVENT NAME= COFFEE_meoh
##.SHIFT REFERENCE= INTERNAL, COFFEE_meoh, 1, 14.96281
##AUDIT TRAIL= $$ (NUMBER, WHEN, WHO, WHERE, PROCESS, VERSION, WHAT)
$$ ##TITLE= Audit trail, TOPSPIN		Version 2.1
$$ ##JCAMPDX= 5.01
$$ ##ORIGIN= Bruker BioSpin GmbH
$$ ##OWNER= Administrator
$$ $$ E:\/data/COFFEE/nmr/NES1039_872015048_9242671_qEZkBcLU37/32/pdata/1/auditp.txt
$$ ##AUDIT TRAIL=  $$ (NUMBER, WHEN, WHO, WHERE, PROCESS, VERSION, WHAT)
(   1,<2015-08-24 21:57:46.655 -0700>,<Administrator>,<X>,<go>,<TOPSPIN 2.1>,
      <created by zg
	started at 2015-08-24 21:46:16.889 -0700,
	POWCHK enabled, PULCHK disabled,
       configuration hash MD5:
       21 0F 79 D6 B3 7B B4 F6 88 20 88 DB 03 48 BD 9F
       data hash MD5: 64K
       42 1C 1B 55 60 A1 BB B7 D4 11 BA 80 BB 32 2A CB>)
(   2,<2015-08-24 21:57:49.811 -0700>,<Administrator>,<X>,<proc1d>,<TOPSPIN 2.1>,
      <Start of raw data processing
       efp LB = 0.3 FT_mod = 6 PKNL = 1 PHC0 = 0 PHC1 = 0 SI = 128K 
       data hash MD5: 128K
       B9 D5 DC 67 CF 25 F0 9A 14 D6 D8 77 B6 3E 7C 57>)
(   3,<2015-08-24 21:57:50.686 -0700>,<Administrator>,<X>,<proc1d>,<TOPSPIN 2.1>,
      <pk PHC0 = -84.96826 PHC1 = 0 
       data hash MD5: 128K
       9A 77 F6 1B AC C5 22 CC 8F 18 62 DA F6 6F C1 2A>)
(   4,<2015-08-24 21:57:51.076 -0700>,<Administrator>,<X>,<proc1d>,<TOPSPIN 2.1>,
      <abs ABSG = 1 
       data hash MD5: 128K
       5B 72 02 5D E7 C2 F1 B9 6B D8 CC C8 43 C0 6F E5>)
(   5,<2015-08-24 21:57:51.186 -0700>,<Administrator>,<X>,<proc1d>,<TOPSPIN 2.1>,
      <abs ABSG = 2 
       data hash MD5: 128K
       8E 5E F2 34 4C 42 A5 3F 5A 39 56 F2 74 CF F4 86>)
(   6,<2015-08-24 21:57:51.280 -0700>,<Administrator>,<X>,<proc1d>,<TOPSPIN 2.1>,
      <abs ABSG = 3 
       data hash MD5: 128K
       D1 99 3A 9E 94 E1 C2 0A 74 23 57 E6 E4 E4 09 30>)
(   7,<2015-08-24 21:57:51.373 -0700>,<Administrator>,<X>,<proc1d>,<TOPSPIN 2.1>,
      <abs ABSG = 4 
       data hash MD5: 128K
       1A B8 64 A3 36 1C 4B 3D 99 E9 D7 7C B8 81 5E 24>)
(   8,<2015-08-24 21:57:51.483 -0700>,<Administrator>,<X>,<proc1d>,<TOPSPIN 2.1>,
      <abs ABSG = 5 
       data hash MD5: 128K
       3B AA 12 43 6C 63 F2 FE B3 D9 B4 98 F9 33 9C 9B>)
$$ ##END=
$$ 
$$ $$ hash MD5
$$ $$ 19 14 50 8A 2B 08 9C 77 AB AA CD 09 5B 6B 43 97
##$RELAX= 
##$RELAX= 
##$RELAX= 
##$RELAX= 
##$RELAX= 
##$RELAX= 
##$RELAX= 
##$RELAX= 
$$ Bruker specific parameters
$$ --------------------------
##$DU= <E:\>
##$EXPNO= 32
$$ [...]
##$TP07= 0
##$TPNAME0= <>
##$TPNAME1= <>
##$TPNAME2= <>
##$TPNAME3= <>
##$TPNAME4= <>
##$TPNAME5= <>
##$TPNAME6= <>
##$TPNAME7= <>
##$TPOAL= (0..7)
0.5 0.5 0.5 0.5 0.5 0.5 0.5 0.5
##$TPOFFS= (0..7)
0 0 0 0 0 0 0 0
##$TUNHIN= 0
##$TUNHOUT= 0
##$TUNXOUT= 0
##$USERA1= <user>
##$USERA2= <user>
##$USERA3= <user>
##$USERA4= <user>
##$USERA5= <user>
##$V9= 5
##$VALIST= <valist>
##$VCLIST= <CCCCCCCCCCCCCCC>
##$VD= 0
##$VDLIST= <DDDDDDDDDDDDDDD>
##$VPLIST= <PPPPPPPPPPPPPPP>
##$VTLIST= <TTTTTTTTTTTTTTT>
##$WBST= 2048
##$WBSW= 25
##$XGAIN= (0..3)
0 0 0 0
##$XL= 0
##$YL= 0
##$YMAX_a= 6341521
##$YMIN_a= -12392910
##$ZGOPTNS= <>
##$ZL1= 120
##$ZL2= 120
##$ZL3= 120
##$ZL4= 120
##$ABSF1= 14.96281
##$ABSF2= -5.595372
##$ABSG= 5
##$ABSL= 3
##$ALPHA= 0
##$AQORDER= 0
##$ASSFAC= 0
##$ASSFACI= 0
##$ASSFACX= 0
##$ASSWID= 0
##$AUNMP= <proc_prof1d_extract.lims>
##$AXLEFT= 0
##$AXNAME= <>
##$AXNUC= <1H>
##$AXRIGHT= 0
##$AXTYPE= 0
##$AXUNIT= <>
##$AZFE= 0.1
##$AZFW= 0.1
##$BCFW= 0
##$BC_mod= 0
##$BYTORDP= 0
##$COROFFS= 0
##$CY= 15
##$DATMOD= 1
##$DC= 0
##$DFILT= <>
##$DTYPP= 0
##$F1P= 0
##$F2P= 0
##$FCOR= 0.5
##$FTSIZE= 131072
##$FT_mod= 6
##$GAMMA= 0
##$GB= 0
##$INTBC= 1
##$INTSCL= 1
##$ISEN= 128
##$LB= 0.3
##$LEV0= 0
##$LPBIN= 0
##$MAXI= 10000
##$MC2= 0
##$MEAN= 0
##$ME_mod= 0
##$MI= 0
##$NCOEF= 0
##$NC_proc= -2
##$NLEV= 6
##$NOISF1= 0
##$NOISF2= 0
##$NSP= 0
##$NTH_PI= 0
##$NZP= 0
##$OFFSET= 14.96281
##$PC= 1
##$PHC0= -84.96826
##$PHC1= 0
##$PH_mod= 1
##$PKNL= yes
##$PPARMOD= 0
##$PPDIAG= 0
##$PPIPTYP= 0
##$PPMPNUM= 2147483647
##$PPRESOL= 1
##$PSCAL= 4
##$PSIGN= 0
##$PYNMP= <proc.py>
##$REVERSE= no
##$SF= 400.020008912263
##$SI= 131072
##$SIGF1= 0
##$SIGF2= 0
##$SINO= 400
##$SIOLD= 131072
##$SPECTYP= <>
##$SREGLST= <1H.CDCl3>
##$SSB= 0
##$STSI= 131072
##$STSR= 0
##$SW_p= 8223.68421052631
##$SYMM= 0
##$S_DEV= 0
##$TDeff= 65536
##$TDoff= 0
##$TI= <>
##$TILT= no
##$TM1= 0
##$TM2= 0
##$TOPLEV= 0
##$USERP1= <user>
##$USERP2= <user>
##$USERP3= <user>
##$USERP4= <user>
##$USERP5= <user>
##$WDW= 1
##$XDIM= 131072
##$YMAX_p= 333613978
##$YMIN_p= -10962
##$CURPLOT= <Network HP LaserJet P1505>
##$CURPRIN= <$Network HP LaserJet P1505>
##$DFORMAT= <normdp>
##$LAYOUT= <+/1D_H.xwp>
##$LFORMAT= <normlp>
##$PFORMAT= <normpl>
##$SURQMSG= 1
$$ End of Bruker specific parameters
$$ ---------------------------------
##NTUPLES= NMR SPECTRUM
##VAR_NAME=  FREQUENCY,     SPECTRUM/REAL,   SPECTRUM/IMAG
##SYMBOL=    X,             R,               I
##VAR_TYPE=  INDEPENDENT,   DEPENDENT,       DEPENDENT
##VAR_FORM=  AFFN,          ASDF,            ASDF
##VAR_DIM=   131072,        131072,          131072
##UNITS=     HZ,            ARBITRARY UNITS, ARBITRARY UNITS
##FACTOR=    0.0627417313425164, 1,          1
##FIRST=     8223.62146879497, 2914,         -36121
##LAST=      0,             3469,            -36219
##MIN=       0,             -10962,          0
##MAX=       8223.62146879497, 333613978,    0
$$ Real data points
##PAGE= N=1
##DATA TABLE= (X++(R..R)), XYDATA
$$ [...]
61065G89481P663Q176P486O088N702O698P512P287P090P631P918P358P200Q521
$$ 789481 797144 805320 812806 818894 824596 831294 838806 846093 853183 860814 868732 876090 883290 891811
61051H91811J0381J1326J1306J0926J0269R552R574J0432J1130J1281J1836J3282
$$ 891811 902192 913518 924824 935750 946019 955571 965145 975577 986707 997988 1009824 1023106
61039A023106J4783J5884J7406J9729K1874K3204K4344K5611K6359K6746K8091
$$ 1023106 1037889 1053773 1071179 1090908 1112782 1135986 1160330 1185941 1212300 1239046 1267137
61028A267137L0564L2610L3759L5606L8843M1670M2742M3294M4777M6672M8408
$$ 1267137 1297701 1330311 1364070 1399676 1438519 1480189 1522931 1566225 1611002 1657674 1706082
61017A706082N1038N5114N9116O2031O5274P0108P5473Q0396Q6098R3465J00827
$$ 1706082 1757120 1812234 1871350 1933381 1998655 2068763 2144236 2224632 2310730 2404195 2505022
61006B505022J06708J12352J19037J25602J31366J38836J50486J65470J82594
$$ 2505022 2611730 2724082 2843119 2968721 3100087 3238923 3389409 3554879 3737473
60997C737473K03468K29125K56532K82738L09898L42238L81381M29377M92756
$$ 3737473 3940941 4170066 4426598 4709336 5019234 5361472 5742853 6172230 6664986
60988F664986N77322O81764Q02435R40999J100738J280523J483101J725234K026065
$$ 6664986 7242308 7924072 8726507 9667506 10768244 12048767 13531868 15257102 17283167
60979A7283167K387632K801032L260990L731153M071895M045224L467819K397554
$$ 17283167 19670799 22471831 25732821 29463974 33535869 37581093 41048912 43446466
60971D3446466J149753J00887n29866p22634n50394j12589M12226P28324N42926
$$ 43446466 44596219 44697106 44167240 43444606 42894212 42781623 43193849 43922173 44465099
60962D4465099k25090j364178k511383l375885l848212l958031l790340l445000
$$ 44465099 44240009 42875831 40364448 36988563 33140351 29182320 25391980 21946980
60954B1946980l023112k603387k222694j886864j595450j348809j140599r59372
$$ 21946980 18923868 16320481 14097787 12210923 10615473 9266664 8126065 7166693
60946G166693p99742o64393n54995m67729l97841l42533k98546k61842k30641
$$ 7166693 6366951 5702558 5147563 4679834 4281993 3939460 3640914 3379072 3148431
60937C148431k04999j83325j62785j43069j26027j11743r8508q6563p8174p3747
$$ 3148431 2943432 2760107 2597322 2454253 2328226 2216483 2117975 2031412 1953238 1879491
60927A879491p1247o9622o9398o9639o7844o3582n9181n5998n2914m9155m5687
$$ 1879491 1808244 1738622 1669224 1599585 1531741 1468159 1408978 1352980 1300066 1250911 1205224
60916A205224m2932l9801l6117l3419l2257l1047k8705k6268k4792k3661k2234
$$ 1205224 1162292 1122491 1086374 1052955 1020698 989651 960946 934678 909886 886225 863991
60905H63991k1180k0983k0809k0015j9247j8945j8330j6915j5559j4918j4246
$$ 863991 842811 821828 801019 781004 761757 742812 724482 707567 692008 677090 662844
60894F62844j2810j1178j0046r051p803o834o511o092m988l902l522l176j952
$$ 662844 650034 638856 628810 619759 611956 605122 598611 592519 587531 583629 580107 576931 574979
60881E74979l90K51j71p17r00j088j611k276k646k396j572p82p09j232j543j352
$$ 574979 574589 574840 574669 573952 573052 571964 570353 568077 565431 563035 561463 560681 559972 558740 557197 555845
60865E55845j213j421j372n48N75J181J093P10M85Q08J773K752K814J919J053
$$ 555845 554632 553211 551839 551291 551866 553047 554140 554850 555335 556143 557916 560668 563482 565401 566454
60850E66454Q44Q20L45m68j250k011k831l546m251n408p012q278q573q080p160
$$ 566454 567298 568118 568463 567995 566745 564734 561903 558357 554106 548698 541686 533408 524835 516755 509595
60835E09595n908m724m443n201n955n912n708o265p178p215o096m758m058l968
$$ 509595 503687 498963 494520 489319 483364 477452 471744 465479 458301 451086 444990 440232 436174 432206
60821D32206m031l885l340k526j938j894k010j571m27Q23J488J431J102J109J665
$$ 432206 428175 424290 420950 418424 416486 414592 412582 411011 410584 411407 412895 414326 415428 416537 418202
60806D18202K423K969L311L614L664L190K625K726L436L913L832L778M008L864
$$ 418202 420625 423594 426905 430519 434183 437373 439998 442724 446160 450073 453905 457683 461691 465555
60792D65555K956J993J734J832J570J051Q02P23L35l19q41j231j701k055k046
$$ 465555 468511 470504 472238 474070 475640 476691 477493 478216 478551 478232 477391 476160 474459 472404 470358
60777D70358k011k384k845k841k706l326m744o019o453o229n716n046m462m367
$$ 470358 468347 465963 463118 460277 457571 454245 449501 443482 437029 430800 425084 420038 415576 411209
60763D11209m651m645l927k730j427k10O10N81j96r24r17k65M79R60J098R57P74
$$ 411209 406558 401913 397986 395256 393829 393619 394229 394810 394614 393690 392773 392508 392987 393947 395045 396002 396776
60746C96776Q22J037J013N18k37q94j201r56j12Q74J290J024Q15J350K434L378
$$ 396776 397598 398635 399648 400166 399929 399035 397834 396878 396766 397640 398930 399954 400769 402119 404553 407931
60730D07931L891M161M228L809K767J453L74l28r52j795k660k960k423j643j589
$$ 407931 411822 415983 420211 424020 426787 428240 428614 428286 427334 425539 422879 419919 417496 415853 414264
60715D14264k503l556l825l287k615k222j980j773j780k011j978j236j30M10j08
$$ 414264 411761 408205 404380 401093 398478 396256 394276 392503 390723 388712 386734 385498 385368 385778 385670
60700C85670j179j872j727r42N2R01J337J295J098J185J493J503J027N90P04J066
$$ 385670 384491 382619 380892 379950 380002 380903 382240 383535 384633 385818 387311 388814 389841 390431 391135 392201
60684C92201R83M35J23M36Q95Q50L33q1LN12J118J521J636J701K008K427K389
$$ 392201 393184 393619 393742 394178 395073 395923 396256 396175 396178 396690 397808 399329 400965 402666 404674 407101 409490
60667D09490J691R97J119J964K723L102L690M822N708N348L999K990L052L519
$$ 409490 411181 412178 413297 415261 417984 421086 424776 429598 435306 440654 444653 447643 450695 454214
60653D54214L430K790K213J777R94j78j076j276j236j620k426l209l759m101m072
$$ 454214 457644 460434 462647 464424 465418 465240 464164 462888 461652 460032 457606 454397 450638 446537 442465
60638D42465l508k781k509k698k743k426k330k881l557l535k813k168k134k558
$$ 442465 438957 436176 433667 430969 428226 425800 423470 420589 417032 413497 410684 408516 406382 403824
60624D03824l036l286l096k418j656j439j913k606l068l320l493l461l031k230
$$ 403824 400788 397502 394406 391988 390332 388893 386980 384374 381306 377986 374493 371032 368001 365771
60610C65771j171M9J059J247N41j16L83K084M035N461O264O514O146N439N142
$$ 365771 364600 364649 365708 366955 367496 367380 367763 369847 373882 379343 385607 392121 398267 403706 408848
60595D08848N569N917N067K940N89r79j664j892j911j750j591j701k040k214j953
$$ 408848 414417 420334 425401 428341 428930 427951 426287 424395 422484 420734 419143 417442 415402 413188 411235
60580D11235j434r55m81K64J291K178K508K317K027K079K684L723M788N459N711
$$ 411235 409801 408846 408365 408629 409920 412098 414606 416923 418950 421029 423713 427436 432224 437683 443394
60565D43394N859O009N809N074M331M317M997N599N685N652N994O541O791O786
$$ 443394 449253 455262 461071 466145 470476 474793 479790 485389 491074 496726 502720 509261 516052 522838
60551E22838P194Q569J0744J2959J4606J5814J7361J9865K3130K6495K9815L3693
$$ 522838 530032 538601 549345 562304 576910 592724 610085 629950 653080 679575 709390 743083
60539G43083L8685M4681N1337N8752O7253P6670Q6272R5436J03993J11636J17112
$$ 743083 781768 826449 877786 936538 1003791 1080461 1166733 1262169 1366162 1477798 1594910
60528A594910J18216J12769R9836Q0071N5018K6402l650l2065n5457p1891q1725
$$ 1594910 1713126 1825895 1925731 2005802 2060820 2087222 2083572 2051507 1996050 1924159 1842434
60517A842434q6428q7000q3920p8223p1612o5299n9268n2952m6232l9438l2655
$$ 1842434 1756006 1669006 1585086 1506863 1435251 1369952 1310684 1257732 1211500 1172062 1139407
60506A139407k5448j7421q766j23Q129J6242K4685L3499M2365N1254O0687P1118
$$ 1139407 1113959 1096538 1087772 1087649 1095778 1112020 1136705 1170204 1212569 1263823 1324510 1395628
60494A395628Q2249R3121J02449J08601J09592J03849R1179P2811N0607K6680
$$ 1395628 1477877 1570998 1673447 1782048 1891640 1995489 2086668 2159479 2210086 2236766
60484B236766L685j5279k7644l2323k9609k0483o226J1627L1582N2711P4663R6933
$$ 2236766 2240451 2225172 2197528 2165205 2135596 2115113 2108887 2120514 2152096 2204807 2279470 2376403
60472B376403J18019J35217J45196J44882J32230J06802P0030K4914k4700p4667
$$ 2376403 2494422 2629639 2774835 2919717 3051947 3158749 3228779 3253693 3228993 3154326
60462C154326j20589j58077j83939j97542k00804j96561j87034j73725j58116
$$ 3154326 3033737 2875660 2691721 2494179 2293375 2096814 1909780 1736055 1577939
60453A577939j41774j25881j11038r7524q5397p4379o4097n4578m6319l9714l4557
$$ 1577939 1436165 1310284 1199246 1101722 1016325 941946 877849 823271 776952 737238 702681
60442G02681l0234k6302k2764j9761j7151j4568j1995r995r067q846q433p533
$$ 702681 672447 646145 623381 603620 586469 571901 559906 549911 540844 531998 523565 516032
60430E16032o765o618o697o416n897n613n561n458n493o082o928p158o447n345
$$ 516032 509267 502649 495952 489536 483639 478026 472465 467007 461514 455432 448504 441346 434899 429554
60416D29554m256k918j187L15R00O87L54L48Q10J846L301M521M915M696M554M656
$$ 429554 425298 422380 421193 421508 422408 423095 423449 423797 424607 426453 429754 434275 439190 443886 448440 453096
60400D53096M585M189L943M217M735N018M998M828M372L405K118J054N20M11N44
$$ 453096 457681 461870 465813 470030 474765 479783 484781 489609 493981 497386 499504 500558 501078 501489 502033
60385E02033P73P99L39l56o09k25J53j15q19j396j818k410l019l170k930k847
$$ 502033 502806 503605 503944 503588 502979 502754 502907 502792 501973 500577 498759 496349 493330 490160 487230 484383
60369D84383k920k509j536q88j204j957k354k464k719k888k471j780j657k197
$$ 484383 481463 478954 477418 476530 475326 473369 471015 468551 465832 462944 460473 458693 457036 454839
60355D54839k563k105r95K48J238J656J400R26Q14R46P10l6q30j509k376l258
$$ 454839 452276 450171 449176 449424 450662 452318 453718 454644 455458 456404 457114 457078 456248 454739 452363 449105
60339D49105l343k411j425j283j605j495q86l30J38R16J783J943J273P25J106
$$ 449105 445762 443351 441926 440643 439038 437543 436657 436327 436465 437381 439164 441107 442380 443105 444211
60324D44211K052K655K656K525K607K725K640K488K595L043L654M215M601M697
$$ 444211 446263 448918 451574 454099 456706 459431 462071 464559 467154 470197 473851 478066 482667 487364
60310D87364M403L804L169K649K095J306L60l69m85K24J717L715N894Q180J0576
$$ 487364 491767 495571 498740 501389 503484 504790 505150 504781 504296 504520 506237 509952 515846 524026 534602
60295E34602J2554J3002J1302Q280N472L391J109k247o156r244j0761j0974j0413
$$ 534602 547156 560158 571460 579740 585212 588603 589712 587465 581309 572065 561304 550330 539917
60282E39917r249p522n550l761k304r71M40J775K612K731K461K410K915L763M457
$$ 539917 530668 523146 517596 513835 511531 510560 511000 512775 515387 518118 520579 522989 525904 529667 534124
60267E34124M641M393M163M338M872N456O069O993Q112Q704Q446Q156Q841J0120
$$ 534124 538765 543158 547321 551659 556531 561987 568056 575049 583161 591865 600311 608467 617308 627428
60253F27428J0552R617Q440Q168Q422Q098P172O828P909R938J1795J2899J3511
$$ 627428 637980 647597 656037 664205 672627 680725 687897 694725 702634 712572 724367 737266 750777
60240G50777J4246J5526J7448J9908K2762K5838K8979L2183L5516L8778M1440
$$ 750777 765023 780549 797997 817905 840667 866505 895484 927667 963183 1001961 1043401
60229A043401M3224M4525M5814M6781M6689M5561M4234M3047M1198L7939L3714
$$ 1043401 1086625 1131150 1176964 1223745 1270434 1315995 1360229 1403276 1444474 1482413 1516127
60218A516127K9513K5538K1228J6394J1560P236L438Ql010n477p269q293q544
$$ 1516127 1545640 1571178 1592406 1608800 1620360 1627596 1631034 1631042 1628032 1622555 1615286 1606993 1598449
60205A598449q129p062n229k801m24J436L111N265Q016J1057J4489J8731K3570
$$ 1598449 1590320 1583258 1578029 1575228 1574804 1576240 1579351 1584616 1592632 1603689 1618178 1636909 1660479
60192A660479K8011L1419L4189L6882L9217M0430M0254L8946L6550L2794K7796
$$ 1660479 1688490 1719909 1754098 1790980 1830197 1870627 1910881 1949827 1986377 2019171 2046967
60181B046967K2261J6742J1009M500k794j0214j7134k3493k9463l4835l8899m0998
$$ 2046967 2069228 2085970 2096979 2101479 2098685 2088471 2071337 2047844 2018381 1983546 1944647 1903649
60169A903649m1113l9895l8164l6363l4295l1387k7242k1963j5998r727l362K839
$$ 1903649 1862536 1822641 1784477 1748114 1713819 1682432 1655190 1633227 1617229 1607502 1604140 1606979
60157A606979Q549J3650J8337K2715K6398K8692K9199K8166K6228K3849K1081
$$ 1606979 1615528 1629178 1647515 1670230 1696628 1725320 1754519 1782685 1808913 1832762 1853843
60146A853843J7759J3819R381M684J84l269m744m060k065K90L051O954J2003J6910
$$ 1853843 1871602 1885421 1894802 1899486 1899670 1896401 1891657 1887597 1885532 1885822 1888873 1895827 1907830 1924740
60132A924740K0244K1799K2518K3294K4207K4895K5419K6614K9571L4645M1146
$$ 1924740 1944984 1966783 1989301 2012595 2036802 2061697 2087116 2113730 2143301 2177946 2219092
60121B219092M8162N5524O3518P1843P9584Q6307R2376R7704J01049J01271R8816
$$ 2219092 2267254 2322778 2386296 2458139 2537723 2624030 2716406 2814110 2915159 3016430 3115246
60110C115246R5015R0205Q3413P3903O2198M9373L6049K2251P861p031k1789l5257
$$ 3115246 3210261 3300466 3383879 3457782 3519980 3569353 3605402 3627653 3635514 3628483 3606694 3571437
60098C571437m6618n6306o5336p3603p9640q2415q2567q1258p8499p3503o6270
$$ 3571437 3524819 3468513 3403177 3329574 3249934 3167519 3084952 3003694 2925195 2851692 2785422
60087B785422n7888m9310m0703l2130k4046j6866j0614n350j402J232L323N796
$$ 2785422 2727534 2678224 2637521 2605391 2581345 2564479 2553865 2548515 2547113 2548345 2551668 2557464
60075B557464Q896J2211J5199J7317J7969J6920J4641J1732Q027K841l855j1071
$$ 2557464 2566360 2578571 2593770 2611087 2629056 2645976 2660617 2672349 2680376 2683217 2679362 2668291
60063B668291j7829k4138l0560l7163m3290m8249n1946n4846n7571o0372o2781
$$ 2668291 2650462 2626324 2595764 2558601 2515311 2467062 2415116 2360270 2302699 2242327 2179546
60052B179546o3800o2746n9852n5907n1391m6189m0077l3149k5740j8151j0578
$$ 2179546 2115746 2053000 1993148 1937241 1885850 1839661 1799584 1766435 1740695 1722544 1711966
60041A711966l092M314J1647J8801K5623L2019L7886M3016M7170N0152N1676N1228
$$ 1711966 1708874 1713188 1724835 1743636 1769259 1801278 1839164 1882180 1929350 1979502 2031178 2082406
60029B082406M8446M3530L7084K9508K0854J1337J712p101j4744k1603k8268l4738
$$ 2082406 2130852 2174382 2211466 2240974 2261828 2273165 2274877 2267776 2253032 2231429 2203161 2168423
60017B168423m0220m3799m5304m5318m4278m1997l8269l3578k8653k3601j7961
$$ 2168423 2128203 2084404 2039100 1993782 1949504 1907507 1869238 1835660 1807007 1783406 1765445
60006A765445j1555m757K038Q649J4847K0459K5807L1436L7255M2566M7214N1932
$$ 1765445 1753890 1749133 1751171 1759820 1774667 1795126 1820933 1852369 1889624 1932190 1979404 2031336
59994B031336N7071O1653O4360O5041O4474O2921N9799N4727M8102M0346L1378
$$ 2031336 2088407 2150060 2214420 2279461 2343935 2406856 2466655 2521382 2569484 2609830 2641208
59983B641208K1272J0957J582o731j4941k3724l2453l9733m4695m7481m8651m8557
$$ 2641208 2662480 2673437 2675019 2668288 2653347 2629623 2597170 2557437 2512742 2465261 2416610 2368053
59971B368053m7352m5131m1812l7161l1270k4847j8679j2926p193j198N041J1440
$$ 2368053 2320701 2275570 2233758 2196597 2165327 2140480 2121801 2108875 2101682 2100484 2105525 2116965
59959B116965J7911K4147K9781L4658L8707M1598M3036M3301M2950M1996L9927
$$ 2116965 2134876 2159023 2188804 2223462 2262169 2303767 2346803 2390104 2433054 2475050 2514977
59948B514977L6580L2412K7731K2337J6220J0006M348o64n135q860j1566j3216
$$ 2514977 2551557 2583969 2611700 2634037 2650257 2660263 2664611 2663947 2658812 2649952 2638386 2625170
59936B625170j3656j2408r286m871J16N653J2228K0064K9078L9249N0505O2355
$$ 2625170 2611514 2599106 2589820 2584949 2585065 2590718 2602946 2623010 2652088 2691337 2741842 2804197
59924B804197P4118Q5462R6288J06242J14799J21743J27020J30080J29753J24937
$$ 2804197 2878315 2963777 3060065 3166307 3281106 3402849 3529869 3659949 3789702 3914639
59914C914639J15221J00859Q2489O0864L6763J1059j4980l9668o1417p9305r3015
$$ 3914639 4029860 4130719 4213208 4274072 4310835 4321894 4306914 4267246 4205829 4126524 4033509
59903D033509j02441j07595j08808j06709j01939r5041q6600p7278o7609n7719
$$ 4033509 3931068 3823473 3714665 3607956 3506017 3410976 3324376 3247098 3179489 3121770
59893C121770m7273l5907k3888j2159j485Q272J7721K7012L5942M4728N3845O3021
$$ 3121770 3074497 3038590 3014702 3002543 3001058 3009330 3027051 3054063 3090005 3134733 3188578 3251599
59881C251599P1230P7831Q2820Q5581Q4441P8171O7137N2185L3285J0394j4807
$$ 3251599 3322829 3400660 3483480 3569061 3653502 3731673 3798810 3850995 3884280 3894674 3879867
59870C879867l9184o0133p6600q8541r6372j00877j02684j01817r8342r3292q8048
$$ 3879867 3840683 3780550 3703950 3615409 3519037 3418160 3315476 3213659 3115317 3022025 2933977
59859B933977q2902p7068p0188o2881n5732m8626m1378l4176k7075j9788j2361
$$ 2933977 2851075 2774007 2703819 2640938 2585206 2536580 2495202 2461026 2433951 2414163 2401802
59848B401802n424O69O410J2338J8195K3321K7543L1204L4576L7600L9977M1129
$$ 2401802 2396378 2397047 2403457 2415795 2433990 2457311 2484854 2516058 2550634 2588234 2628211 2669340
59836B669340M0262L6714L0324K1400J0672o09j0874j8825k3839k5941k5815k4984
$$ 2669340 2709602 2746316 2776640 2798040 2808712 2808103 2797229 2778404 2754565 2728624 2702809 2677825
59824B677825k5419k8374l3602l9729m5242m8998n0257m8780m5002m0009l5223
$$ 2677825 2652406 2624032 2590430 2550701 2505459 2456461 2406204 2357424 2312422 2272413 2237190
59813B237190l1967l0931l1782l3332l4348l4265l3209l1586k9794k8181k6946
$$ 2237190 2205223 2174292 2142510 2109178 2074830 2040565 2007356 1975770 1945976 1917795 1890849
59802A890849k5883k4387k1943j8696j5352j2329r205n262m53M643R835J5717
$$ 1890849 1864966 1840579 1818636 1799940 1784588 1772259 1763054 1757792 1757339 1761982 1771817 1787534
59790A787534K2871L1127L9961M9151N8686O8447P8453Q9003R9979J10217J18097
$$ 1787534 1810405 1841532 1881493 1930644 1989330 2057777 2136230 2225233 2325212 2435429 2553526
59779B553526J22466J22282J15639J00188P5084M2280N869k9515n9886q2641r6976
$$ 2553526 2675992 2798274 2913913 3014101 3089185 3131465 3137334 3107819 3047933 2965292 2868316
59768B868316j03671j04243j00192r2752q2924p1507n9357m7545l7068k8258k0741
$$ 2868316 2764645 2660402 2560210 2467458 2384534 2313027 2253670 2206125 2169057 2140799 2120058
59757B120058j4034q064l111O12L327N701Q411J1587J4840J7903K1049K4723K9091
$$ 2120058 2106024 2097960 2094849 2095461 2098788 2104489 2112900 2124487 2139327 2157230 2178279 2203002 2232093
59744B232093L4121L9781M5877N2009N8050O4379P1344P8782Q6390R4312J02945
$$ 2232093 2266214 2305995 2351872 2403881 2461931 2526310 2597654 2676436 2762826 2857138 2960083
59733B960083J12425J22636J33390J44369J55272J66259J77664J88769J97565
$$ 2960083 3072508 3195144 3328534 3472903 3628175 3794434 3972098 4160867 4358432
59724D358432K02393K03254K00826J94928J85113J72287J58434J44798J31586
$$ 4358432 4560825 4764079 4964905 5159833 5344946 5517233 5675667 5820465 5952051
59715E952051J19559J10656J06482J06871J10339J15284J20464J24867J27694
$$ 5952051 6071610 6182266 6288748 6395619 6505958 6621242 6741706 6866573 6994267
59706F994267J28272J25948J20347J11686J00514Q7258P2290N6183L9458K2518
$$ 6994267 7122539 7248487 7368834 7480520 7581034 7668292 7740582 7796765 7836223 7858741
59696G858741O326p387j7370k3862k7502k7782k3667j5388m252R232K5678M5223
$$ 7858741 7865067 7857680 7840310 7816448 7788946 7761164 7737497 7722109 7717857 7727089 7752767 7797990
59684G797990O6900Q9842J13905J38736J63296J86665K08298K27248K42064K51830
$$ 7797990 7864890 7954732 8068637 8207373 8370669 8557334 8765632 8992880 9234944 9486774
59674I486774K56100K53518K41660K18846J85184J41562Q8915K9269l3576r5492
$$ 9486774 9742874 9996392 10238052 10456898 10642082 10783644 10872559 10901828 10868252 10772760
59664A0772760j53565k05761k49933k84021l06766l17856l18133l10092k97295
$$ 10772760 10619195 10413434 10163501 9879480 9572714 9254858 8936725 8626633 8329338
59655H329338k82771k68721k57932k53949k58599k70111k84548k98283l08524
$$ 8329338 8046567 7777846 7519914 7265965 7007366 6737255 6452707 6154424 5845900
59646E845900l12784l09681l00040k86124k69816k52120k33772k15306j96843
$$ 5845900 5533116 5223435 4923395 4637271 4367455 4115335 3881563 3666257 3469414
59637C469414j78682j61767j46852j33515j20872j08765r7535q6978p6577o6527
$$ 3469414 3290732 3128965 2982113 2848598 2727726 2618961 2521426 2434448 2357871 2291344
59627B291344n7580m9962m3238l7178l2095k8248k5459k3269k1102j8598j6134
$$ 2291344 2233764 2183802 2140564 2103386 2071291 2043043 2017584 1994315 1973213 1954615 1938481
59616A938481j4636j4459j4792j4741j4533j5046j6539j8521k0516k2291k3571
$$ 1938481 1923845 1909386 1894594 1879853 1865320 1850274 1833735 1815214 1794698 1772407 1748836
59605A748836k4216k4472k4528k4131k3090k1821k0795j9856j8680j7514j6816
$$ 1748836 1724620 1700148 1675620 1651489 1628399 1606578 1585783 1565927 1547247 1529733 1512917
59594A512917j6462j5944j5047j3742j1866r489p258n659m294k589p45P87K391
$$ 1512917 1496455 1480511 1465464 1451722 1439856 1430367 1423109 1417450 1413156 1410567 1409822 1410609 1413000
59581A413000M829P928J0557J1967J2383J2419J2541J3064J4101J5467J7069J9208
$$ 1413000 1417829 1425757 1436314 1448281 1460664 1473083 1485624 1498688 1512789 1528256 1545325 1564533
59569A564533K2030K5030K7661L0108L2812L5639L8184M0613M3413M6590M9791
$$ 1564533 1586563 1611593 1639254 1669362 1702174 1737813 1775997 1816610 1860023 1906613 1956404
59558A956404N3000N6405N9873O3273O7063P1684P6618Q0788Q3745Q5713Q6720
$$ 1956404 2009404 2065809 2125682 2188955 2256018 2327702 2404320 2485108 2568853 2654566 2741286
59547B741286Q6659Q5911Q4848Q2543P6862O6288N1302L4076J7339L191p868j6960
$$ 2741286 2827945 2913856 2998704 3081247 3158109 3224397 3275699 3309775 3327114 3330305 3322437 3305477
59535C305477k5461l3615m0890m7109n2514n6947n9916o1338o1385n9726n5799
$$ 3305477 3280016 3246401 3205511 3158402 3105888 3048941 2989025 2927687 2866302 2806576 2750777
59524B750777m9802m2557l4397k4948j4110k486R294K1086L3030M5367N8315P1548
$$ 2750777 2700975 2658418 2624021 2599073 2584963 2582477 2591771 2612857 2645887 2691254 2749569 2821117
59512B821117Q3873R3989J01227J04986J03992R7241Q5379P0079N2097L1062P140
$$ 2821117 2904990 2998979 3100206 3205192 3309184 3406425 3491804 3561883 3613980 3645042 3652182
59501C652182j8214m3285o6799q7415j03652j14847j21448j24116j23226j19346
$$ 3652182 3633968 3590683 3523884 3436469 3332817 3217970 3096522 2972406 2849180 2729834
59491B729834j13279j05440r5904q5276p4593o4190n3599m2748l2282k2386j2293
$$ 2729834 2616555 2511115 2415211 2329935 2255342 2191152 2137553 2094805 2062523 2040137 2027844
59480B027844j613Q827J8048K6153L3847M1237M7719N2733N6211N8490N9942O0307
$$ 2027844 2026231 2035058 2053106 2079259 2113106 2154343 2202062 2254795 2311006 2369496 2429438 2489745
59468B489745N8467N3445M5649L6409K6244J4520R95j3331k7310m0640n3131o3877
$$ 2489745 2548212 2601657 2647306 2683715 2709959 2724479 2725474 2712143 2684833 2644193 2591062 2527185
59456B527185p2009p7771q2097q5375q7210q7144q5136q1566p7176p2780o8678
$$ 2527185 2455176 2377405 2295308 2209933 2122723 2035579 1950443 1868877 1791701 1718921 1650243
59445A650243o4501n9854n4899n0072m5525m1044l6444l1850k7706k4353k1480
$$ 1650243 1585742 1525888 1470989 1420917 1375392 1334348 1297904 1266054 1238348 1213995 1192515
59434A192515j8275j4431j0695p850n576l058l59J790L408N327P782J0113J2111
$$ 1192515 1174240 1159809 1149114 1141264 1135688 1132630 1132271 1134061 1137469 1142796 1150578 1160691 1172802
59421A172802J4417J6906J7877J5785J1170O061J959p76k046j506R85M973R640
$$ 1172802 1187219 1204125 1222002 1237787 1248957 1255018 1256977 1256201 1254155 1252649 1253634 1258607 1268247
59408A268247J4131J7683J9547J9032J5956J1320P168N208N624P671J0946J5313
$$ 1268247 1282378 1300061 1319608 1338640 1354596 1365916 1373084 1378292 1383916 1391587 1402533 1417846
59396A417846J9959K3719K6554K9655L3785L8471M3057M7565N2061N6138N9646
$$ 1417846 1437805 1461524 1488078 1517733 1551518 1589989 1633046 1680611 1732672 1788810 1848456
59385A848456O3206O7387P1929P6229P9987Q3113Q5763Q8940R4146J01816J10797
$$ 1848456 1911662 1979049 2050978 2127207 2207194 2290307 2376070 2465010 2559156 2660972 2771769
59374B771769J20027J30053J42049J55969J70538J84675J97952K09788K18991
$$ 2771769 2891796 3021849 3163898 3319867 3490405 3675080 3873032 4082820 4301811
59365D301811K24334K25177K21604K14203K03691J90606J75424J58936J42032
$$ 4301811 4526145 4751322 4972926 5187129 5390820 5581426 5756850 5915786 6057818
59356F057818J25093J07911R0270P1997N2546L1180P825j7024m3401p2084j03206
$$ 6057818 6182911 6290822 6381092 6453089 6505635 6536815 6544640 6527616 6484215 6412131 6308925
59345F308925j35308j66204j94245k18317k37193k49650k55158k54240k48227
$$ 6308925 6173617 6007413 5813168 5594851 5357658 5108008 4852850 4598610 4350383
59336D350383k38588k26080k10775j93386j76093j60980j47855j34970j21884
$$ 4350383 4111795 3885715 3674940 3481554 3305461 3144481 2996626 2861656 2739772
59327B739772j10155j00791r2724q4578p6478o9034o1788n4059m6457m0192l5382
$$ 2739772 2629617 2528826 2436102 2351524 2275046 2206012 2144224 2090165 2043708 2003516 1968134
59316A968134l1184k7159k3491k0275j7488j5346j3839j2355j0455q562p179o047
$$ 1968134 1936950 1909791 1886300 1866025 1848537 1833191 1819352 1806997 1796542 1787980 1780801 1774754
59304A774754m925m449n201o437o925o622o399o514o476o202o084n902m775k350
$$ 1774754 1769829 1765380 1760179 1753742 1746817 1740195 1733796 1727282 1720806 1714604 1708520 1702618 1697843 1695493
59290A695493P52L867O967J0348J4196J8516K3062K7418L1488L5579L9720M3349
$$ 1695493 1696245 1700112 1707079 1717427 1731623 1750139 1773201 1800619 1832107 1867686 1907406 1950755
59278A950755M6094M8228M9843N0214M8619M4848L8022K6154Q483j2183l1141
$$ 1950755 1996849 2045077 2094920 2145134 2193753 2238601 2276623 2302777 2311260 2299077 2267936
59267B267936m5651n5949o2869o6427o6998o6044o4714o2869o0209n7371n5071
$$ 2267936 2222285 2166336 2103467 2037040 1970042 1903998 1839284 1776415 1716206 1658835 1603764
59256A603764n2876m9717m5216m0001l4948l0528k6637k2834j8949j5427j2734
$$ 1603764 1550888 1501171 1455955 1415954 1381006 1350478 1323841 1301007 1282058 1266631 1253897
59245A253897j0457p659m149p64J821L939O327R184J2195J5062J7738K0327K3018
$$ 1253897 1243440 1235781 1231632 1230868 1232689 1236628 1242955 1252139 1264334 1279396 1297134 1317461 1340479
59232A340479K5899K8843L1771L4967L8811M3276M8074N3185N8787O4820P1191
$$ 1340479 1366378 1395221 1426992 1461959 1500770 1544046 1592120 1645305 1704092 1768912 1840103
59221A840103P8348Q6977R6963J07252J16959J26132J35132J43667J50821J55736
$$ 1840103 1918451 2005428 2102391 2209643 2326602 2452734 2587866 2731533 2882354 3038090
59211C038090J57912J56840J51611J41121J24873J03580P8651N0978K0752j1287
$$ 3038090 3196002 3352842 3504453 3645574 3770447 3874027 3952678 4003656 4024408 4013121
59201D013121m2986p1929r7016j18226j35046j46246j51352j51496j48375j42948
$$ 4013121 3970135 3898206 3801190 3682964 3547918 3401672 3250320 3098824 2950449 2807501
59191B807501j35502j26441j16434j06001r5349q4637p4177o4322n5192m6608
$$ 2807501 2671999 2545558 2429124 2323123 2227774 2143137 2068960 2004638 1949446 1902838
59181A902838l8327l0431k3266j6965j1356o542l227k021k637m192o273r192j3229
$$ 1902838 1864511 1834080 1810814 1793849 1782493 1775951 1772724 1770703 1768066 1763874 1757601 1748409 1735180
59168A735180j7911k2161k5014k6175k6059k5239k3920k2033j9788j7617j5516
$$ 1735180 1717269 1695108 1670094 1643919 1617860 1592621 1568701 1546668 1526880 1509263 1493747
59157A493747j2934r698o577m516l714l767m365n320o261o893p355p956q743r624
$$ 1493747 1480813 1471115 1464538 1460022 1456308 1452541 1448176 1442856 1436595 1429702 1422347 1414391 1405648 1396024
59143A396024j0601j1498j1816j1324j0554j0232j0424j0601j0285r378q167p321
$$ 1396024 1385423 1373925 1362109 1350785 1340231 1329999 1319575 1308974 1298689 1289311 1281144 1273823
59131A273823p318p658p157n520l813k913k206o32J725M011N959P852R513J0466
$$ 1273823 1266505 1258847 1251690 1246170 1242357 1239444 1237238 1236606 1238331 1242342 1248301 1256153 1265666 1276132
59117A276132J0823J1069J1223J1099J1041J1346J1241R683P041M810L631K747
$$ 1276132 1286955 1298024 1309247 1320346 1331387 1342733 1353974 1363657 1370698 1375508 1379139 1381886
59105A381886J574O26M80Q91J391K117L528N838Q917J2328J5367J7647J9646K2076
$$ 1381886 1383460 1384086 1384566 1385457 1386848 1388965 1392493 1398331 1407248 1419576 1434943 1452590 1472236 1494312
59091A494312K4787K6985K8438K9576L0403L0243K8818K6609K3827J9771J3683
$$ 1494312 1519099 1546084 1574522 1604098 1634501 1664744 1693562 1720171 1743998 1763769 1777452
59080A777452N721l215j2109k0070k6624l1967l6543m0242m2607m3787m4535m5024
$$ 1777452 1783173 1779958 1767849 1747779 1721155 1689188 1652645 1612403 1569796 1526009 1481474 1436450
59068A436450m4449m2182l8684l4955l1573k8616k6024k3664k1452j9604j8457
$$ 1436450 1392001 1349819 1311135 1276180 1244607 1215991 1189967 1166303 1144851 1125247 1106790
59057A106790j7831j7026j5625j3884j2165j0435q517o405m160j876J74J722K908
$$ 1106790 1088959 1071933 1056308 1042424 1030259 1019824 1011307 1004902 1000742 998866 999040 1000762 1003670
59044A003670M014M771M461K865O22j560l604n713p715r090r476q990q144p398
$$ 1003670 1007684 1012455 1016916 1019781 1020403 1018843 1015239 1009526 1001811 992721 983245 974255 966111 958713
59030I58713o674n425l448j415k04R7J84O79J702L053M334N112N416N926P182
$$ 958713 952039 946614 943166 941751 941547 941644 941828 942507 944209 947262 951596 956708 962124 968050 975232
59015I75232Q787R886J0268J0481J1107J2370J4205J6193J7732J8806K0171K2213
$$ 975232 984019 993905 1004173 1014654 1025761 1038131 1052336 1068529 1086261 1105067 1125238 1147451
59003A147451K4168K5222K5816K6807K7737K7181K4625K0818J6336J0976M765
$$ 1147451 1171619 1196841 1222657 1249464 1277201 1304382 1329007 1349825 1366161 1377137 1381902
58992A381902j552p286j2239j6163j8678j9870k0265k0056j9064j7440j5682j3909
$$ 1381902 1380350 1373064 1360825 1344662 1325984 1306114 1285849 1265793 1246729 1229289 1213607 1199698
58980A199698j1959j0079q664p405n636l545j992j154l09R14K126L109M185N470
$$ 1199698 1187739 1177660 1168996 1161591 1155955 1152410 1150418 1149264 1148955 1149869 1151995 1155104 1159289 1164759
58966A164759O701P895R172J0052R941R353R391J0002J0018R055Q012P414O774
$$ 1164759 1171460 1179355 1188527 1198579 1208520 1217873 1227264 1237266 1247284 1256339 1264351 1271765 1278539
58953A278539N981N832O522P051O911P079Q385J0091J1061J1387J1871J2709J3638
$$ 1278539 1284520 1290352 1296874 1303925 1310836 1317915 1326300 1336391 1347452 1358839 1370710 1383419 1397057
58940A397057J4699J5997J7306J8688K0807K3919K7253L0179L3325L7552M2393
$$ 1397057 1411756 1427753 1445059 1463747 1484554 1508473 1535726 1565905 1599230 1636782 1679175
58929A679175M6310M8222M8008M5856M2054L7376L3072L0277K9460L0228L1667
$$ 1679175 1725485 1773707 1821715 1867571 1909625 1947001 1980073 2010350 2039810 2070038 2101705
58918B101705L3227L5371L8966M4150N0367N7348O5162P3397Q1259Q8695R6473
$$ 2101705 2134932 2170303 2209269 2253419 2303786 2361134 2426296 2499693 2580952 2669647 2766120
58907B766120J04855J13170J20928J28386J35766J42883J49912J57433J65268
$$ 2766120 2870975 2984145 3105073 3233459 3369225 3512108 3662020 3819453 3984721
58898C984721J72194J77177J79961J80189J77187J71159J63321J54130J42410
$$ 3984721 4156915 4334092 4514053 4694242 4871429 5042588 5205909 5360039 5502449
58889E502449J26991J08212Q7051O3775L8357J1452j5930m3048o9140r3222j14748
$$ 5502449 5629440 5737652 5824703 5888478 5926835 5938287 5922357 5879309 5810169 5716947 5602199
58878E602199j33769j49946j62354j70797j76377j80080j81740j81033j78484
$$ 5602199 5468430 5318484 5156130 4985333 4808956 4628876 4447136 4266103 4087619
58869D087619j74716j69700j63500j56834j50055j42589j34176j25701j17903
$$ 4087619 3912903 3743203 3579703 3422869 3272814 3130225 2996049 2870348 2752445
58860B752445j10300j02335r4651q8102q2300p6307p0010o3828n7747n1682m6137
$$ 2752445 2642145 2539810 2445159 2357057 2274757 2198450 2128440 2064612 2006865 1955183 1909046
58849A909046m1493l7231l2783k8551k5120k2190j9141j6002j2981r791o341l378
$$ 1909046 1867553 1830322 1797539 1768988 1743868 1721678 1702537 1686535 1673554 1663763 1657422 1654044
58837A654044j393L81K865N793Q478J1179J4506J8111K1206K3845K6616K9584
$$ 1654044 1652651 1653032 1655897 1661690 1670168 1681347 1695853 1713964 1735170 1759015 1785631 1815215
58825A815215L2576L5964M0006M3902M6615M8219M9413N0311N0772N1461N3345
$$ 1815215 1847791 1883755 1923761 1967663 2014278 2062497 2111910 2162221 2212993 2264454 2317799
58814B317799N6443O0131O4212O8808P3665P8785Q5149R3623J03475J13122J22076
$$ 2317799 2374242 2434373 2498585 2567393 2641058 2719843 2804992 2898615 3002090 3115212 3237288
58803C237288J30983J40159J49186J57730J65579J72009J76094J77531J76363
$$ 3237288 3368271 3508430 3657616 3815346 3980925 4152934 4329028 4506559 4682922
58794D682922J72137J64201J52348J36360J15519Q9689O0438K9949p50l1356o0620
$$ 4682922 4855059 5019260 5171608 5307968 5423487 5513176 5573614 5603563 5602813 5571457 5510837
58783E510837q6631j08596j26988j41881j52497j58687j61865j64027j66436j69282
$$ 5510837 5424206 5315610 5188622 5046741 4894244 4735557 4573692 4409665 4243229 4073947
58773D073947j71918j73226j72200j68350j61594j52282j41529j30824j20784
$$ 4073947 3902029 3728803 3556603 3388253 3226659 3074377 2932848 2802024 2681240
58764B681240j10998j01411r2877q5698p8788p1241o3726n7198n1267m5063l8865
$$ 2681240 2570242 2468831 2375954 2290256 2211468 2140227 2076501 2019303 1968036 1922973 1884108
58753A884108l3437k8555k3571j8786j4809j1114o779k223J301L535N203O523
$$ 1884108 1850671 1822116 1798545 1779759 1764950 1753836 1747057 1744834 1746135 1749670 1754873 1761396
58741A761396P138P249P441P630P492P520Q411R762J0688J1232J1730J1297Q552
$$ 1761396 1768534 1775783 1783224 1790854 1798346 1805866 1814277 1824039 1834727 1845959 1857689 1868986 1877538
58728A877538L624k240q692j6253k4307l1057l5671l8992m1889m4296m6060m7391
$$ 1877538 1881162 1878922 1870230 1853977 1829670 1798613 1762942 1723950 1682061 1637765 1591705 1544314
58716A544314m8155m7863m6540m4635m2113l8666l4634l0596k6239k0912j5098
$$ 1544314 1496159 1448296 1401756 1357121 1315008 1276342 1241708 1211112 1184873 1163961 1148863
58705A148863j0036o023k445O52K435K633J663n15m257q990j3502j7423k0987
$$ 1148863 1138827 1132804 1130359 1131011 1133446 1136079 1137742 1137227 1132970 1123980 1110478 1093055 1072068
58692A072068k3517k3769k1916j9509j7295j4580j0999p278l879l68L363O611
$$ 1072068 1048551 1024782 1002866 983357 966062 951482 940483 933205 929326 928958 932321 938932
58680I38932R114J1623J4719J8033K0962K3236K4523K4432K3048K0658J7143J2666
$$ 938932 948046 959669 974388 992421 1013383 1036619 1061142 1085574 1108622 1129280 1146423 1159089
58668A159089Q701O928P055O968N021R65n042j2641k0385k6308k9813l1739l2489
$$ 1159089 1167790 1174718 1181773 1188741 1193762 1194727 1189685 1177044 1156659 1130351 1100538 1068799 1036310
58655A036310l1535k8968k5952k3231k0504j7593j4920j2493r771o812m360k564
$$ 1036310 1004775 975807 949855 926624 906120 888527 873607 861114 851343 844531 840171 837607
58643H37607q72O97J529J824K515L599M046L713L740M649N506N504N002M504L937
$$ 837607 836735 837432 838961 840785 843300 846899 850945 854658 858398 863047 868553 874057 879059 883563 887500
58628H87500L518M006N462O914P785Q585R877J1511J3260J5108J6712J7622J8233
$$ 887500 891018 895024 900486 907400 915185 923770 933647 945158 958418 973526 990238 1007860 1026093
58615A026093J9388K1003K2318K3530K5680K8857L1936L4349L6712L9441M2261
$$ 1026093 1045481 1066484 1088802 1112332 1138012 1166869 1198805 1233154 1269866 1309307 1351568
58604A351568M5256M8949N2909N5785N7025N7355N7259N6252N3775M9501M2842
$$ 1351568 1396824 1445773 1498682 1554467 1611492 1668847 1726106 1782358 1836133 1885634 1928476
58593A928476L3663K3449J4064N352m234j4644k3804l0336l4663l7195l7591l6269
$$ 1928476 1962139 1985588 1999652 2005004 2000770 1986126 1962322 1931986 1897323 1860128 1822537 1786268
58581A786268l4496l2357k8634k3362j8500j5292j2973j0793r365r076r019q518
$$ 1786268 1751772 1719415 1690781 1667419 1648919 1633627 1620654 1609861 1600496 1591420 1582401 1573883
58569A573883p986p535o430m678l408k988k583k196l145n851r197j2799j7615
$$ 1573883 1565897 1558362 1551932 1547254 1543846 1540858 1538275 1536079 1532934 1527083 1517886 1505087 1487472
58556A487472k3423k8078l0415l1696l3017l3661l3294l3321l4309l4412l2219
$$ 1487472 1464049 1435971 1405556 1373860 1340843 1307182 1273888 1240567 1206258 1171846 1139627
58545A139627k9106k6841k4828k1838j8659j6686j5452j3710j1732j0437r435
$$ 1139627 1110521 1083680 1058852 1037014 1018355 1001669 986217 972507 960775 950338 940903
58534I40903p985o796o800p167o483n063m216l900l037j571m59r0j25m33q52n62
$$ 940903 932918 926122 919322 912155 905672 900609 896393 892493 889456 887885 887426 887336 887211 886778 885926 885364
58518H85364R13K681L578L785M262N197O042O500O649O696P235Q893J1097J2332
$$ 885364 886277 888958 892536 896321 900583 905780 911822 918322 924971 931667 938902 947795 958892 971224
58504I71224J2154J1811J2151J2334J1458J0006Q748P576O472O204O958P609P363
$$ 971224 983378 995189 1007340 1019674 1031132 1041138 1049886 1057462 1063934 1070138 1077096 1084705 1092068
58491A092068O845O638O197N153M178L542K398N44p87j032j463l065m918n974
$$ 1092068 1098913 1105551 1111748 1116901 1121079 1124621 1127019 1127563 1126776 1125744 1124281 1121216 1116298 1110324
58477A110324o702p667q318q396q797r585r187p042n077m775m819l593k022j714
$$ 1110324 1103622 1095955 1087637 1079241 1070444 1060859 1051672 1044630 1039553 1034778 1029959 1026366 1024344 1022630
58463A022630k029j391j40K58k23m96l16q3L64J164J742K068L243N444O950O709
$$ 1022630 1020601 1019210 1019070 1019328 1019105 1018609 1018293 1018210 1018574 1019738 1021480 1023548 1026791 1032235 1039185 1045894
58447A045894O114O592P253O781N727M961L775J722L73Q84J712J168M26J291K802
$$ 1045894 1052008 1058600 1065853 1072634 1078361 1083322 1087097 1088819 1089192 1090076 1091788 1092956 1093382 1094673 1097475
58432A097475K956K190K158K432J602N28J258L402M637M314L789L711L654L948
$$ 1097475 1100431 1102621 1104779 1107211 1108813 1109341 1110599 1114001 1118638 1122952 1126741 1130452 1134106 1138054
58418A138054N283O806P070O529O833Q067Q841Q702Q398Q199P933Q089Q976R541
$$ 1138054 1143337 1150143 1157213 1163742 1170575 1178642 1187483 1196185 1204583 1212782 1220715 1228804 1237780 1247321
58404A247321Q833P764P547P504O516N438N764O826O797N622M748M709N086N997
$$ 1247321 1256154 1263918 1271465 1278969 1285485 1290923 1296687 1303513 1310310 1315932 1320680 1325389 1330475 1336472
58390A336472P479Q342P732O849P058P560P005O056N983O120N254M261M686N911
$$ 1336472 1343951 1352293 1360025 1366874 1373932 1381492 1388497 1394553 1400536 1406656 1411910 1416171 1420857 1426768
58376A426768O391O490P412Q460Q241P530Q139R807J0914J1364J2106J2740J2274
$$ 1426768 1433159 1439649 1447061 1455521 1463762 1471292 1479431 1489238 1500152 1511516 1523622 1536362 1548636
58363A548636J1375J1347J1807J1760J1751J2538J3047J2158J1008J0928J0858
$$ 1548636 1560011 1571358 1583165 1594925 1606676 1619214 1632261 1644419 1655427 1666355 1677213
58352A677213R639Q821J0045J1612J1246J0337J1560J4005J4844J4386J5103J6810
$$ 1677213 1686852 1695673 1705718 1717330 1728576 1738913 1750473 1764478 1779322 1793708 1808811 1825621
58340A825621J7135J6102J5910J6804J7176J7208J8397J9947J9722J8341J8418
$$ 1825621 1842756 1858858 1874768 1891572 1908748 1925956 1944353 1964300 1984022 2002363 2020781
58329B020781K0098K1284K1806K3409K5874K7132K7087K7616K8931K9499K9306
$$ 2020781 2040879 2062163 2083969 2107378 2133252 2160384 2187471 2215087 2244018 2273517 2302823
58318B302823K9682L0292K9661K8211K7380K6558K4361K1974K1520K2131K1511
$$ 2302823 2332505 2362797 2392458 2420669 2448049 2474607 2498968 2520942 2542462 2564593 2586104
58307B586104K0314K0972K3209K4743K5494K6984K8708K9240K9686L1848L4349
$$ 2586104 2606418 2627390 2650599 2675342 2700836 2727820 2756528 2785768 2815454 2847302 2881651
58296B881651L4956L5102L7357M0190M0472L9514M1003M4373M6144M6559M8819
$$ 2881651 2916607 2951709 2989066 3029256 3069728 3109242 3150245 3194618 3240762 3287321 3336140
58285C336140N2563N4469N4737N6681O0221O1998O1806O2714O4959O5837O5592
$$ 3336140 3388703 3443172 3497909 3554590 3614811 3676809 3738615 3801329 3866288 3932125 3997717
58274C997717O7224P0379P1431O9772O8183O7179O4982O2680O3238O5706O6691
$$ 3997717 4064941 4135320 4206751 4276523 4344706 4411885 4476867 4539547 4602785 4668491 4735182
58263D735182O7005P0323P5896P9594Q1548Q5586R1537R5597R8050J02940J10162
$$ 4735182 4802187 4872510 4948406 5028000 5109548 5195134 5286671 5382268 5480318 5583258 5693420
58252E693420J15559J18895J24006J31122J36906J41875J49747J59602J67061
$$ 5693420 5808979 5927874 6051880 6183002 6319908 6461783 6611530 6771132 6938193
58243F938193J72941J82041J93719K02727K09204K18478K31040K42469K53152
$$ 6938193 7111134 7293175 7486894 7689621 7898825 8117303 8348343 8590812 8843964
58234H843964K67931K85980L01411L14338L30879L51937L72623L92940M17808
$$ 8843964 9111895 9397875 9699286 10013624 10344503 10696440 11069063 11462003 11879811
58225A1879811M46468M73410M99947N32931N72133O11381O51844P00956P58577
$$ 11879811 12326279 12799689 13299636 13832567 14404700 15016081 15667925 16368881 17127458
58216A7127458Q18296Q82046R58738J048869J146022J253017J380029J527643
$$ 17127458 17945754 18827800 19786538 20835407 21981429 23234446 24614475 26142118
58208B6142118J689443J870660K085876K339837K630976K972390L387759L888867
$$ 26142118 27831561 29702221 31788097 34127934 36758910 39731300 43119059 47007926
58200D7007926M480493N183676O026664P015880Q144839R427668J0894026J2562477
$$ 47007926 51488419 56672095 62698759 69714639 77859478 87287146 98181172 110743649
58192A10743649J4457222J6631694J9113041K1817282K4539422K6928300K8298429
$$ 110743649 125200871 141832565 160945606 182762888 207302310 234230610 262529039
58185B62529039K7500777K3327325J5414891M841946o277685j5882829k2776664
$$ 262529039 290029816 313357141 328772032 333613978 327336293 311453464 288676800
58178B88676800k6694818k7970956k7246374k5268785k2688722j9934536j7246064
$$ 288676800 261981982 234011026 206764652 181495867 158807145 138872609 121626545
58171A21626545j4758596j2524747j0525336q726735p117537n681781m384571
$$ 121626545 106867949 94343202 83817866 75091131 67973594 62291813 57907242
58164E7907242l203969k130548j122229j15048R11367J942854K990060L998275
$$ 57907242 54703273 52572725 51450496 51335448 52246815 54189669 57179729 61178004
58156F1178004M640156M361679K830066L36909k348042m521533n893705o498662
$$ 61178004 65818160 70179839 73009905 73346814 70998772 66477239 60583534 54084872
58148E4084872o476386o007831n317443m597462l932192l333564k814181k387267
$$ 54084872 47608486 41600655 36283212 31685750 27753558 24419994 21605813 19218546
58140A9218546k034854j727154j458925j236708j049928q83409p41753o35252
$$ 19218546 17183692 15456538 13997613 12760905 11710977 10827568 10085815 9450563
58132I450563n55655m87871m32164l94670l68627l43456l20936l05625k90369
$$ 9450563 8894908 8407037 7974873 7580203 7211576 6868120 6547184 6241559 5951190
58123E951190k67014k41102k21287k03973j82066j59278j42435j28478j11894
$$ 5951190 5684176 5443074 5221787 5017814 4835748 4676470 4534035 4405557 4293663
58114D293663r6933r0524r0392r0900r3236r9452j03890j00801r3880q8942q3880
$$ 4293663 4196730 4106206 4015814 3924914 3831678 3732226 3628336 3527535 3433655 3344713 3260833
58103C260833p4803o5262o0195n6940n1077m5188m3435m3219m0407l7435l8321
$$ 3260833 3186030 3120768 3060573 3003633 2952556 2907368 2863933 2820714 2780307 2742872 2704551
58092B704551m0735m0616l9666m1073m2653m1130l8531l7810l6870l3282l0015
$$ 2704551 2663816 2623200 2583534 2542461 2499808 2458678 2420147 2382337 2345467 2312185 2282170
58081B282170l0206l1024k8916k6138k5885k5793k2673j9042j8568j9339j7949
$$ 2282170 2251964 2220940 2192024 2165886 2140001 2114208 2091535 2072493 2053925 2034586 2016637
58070B016637j6130j7009j8595j7320j4513j3473j3428j2076j0732j1427j2157
$$ 2016637 2000507 1983498 1964903 1947583 1933070 1919597 1906169 1894093 1883361 1871934 1859777
58059A859777j0390q117q272r368q763p884r005j0129q443n714n090n437m099
$$ 1859777 1849387 1841270 1832998 1823630 1814867 1806983 1797978 1787849 1779406 1773692 1768602 1763165 1759066
58046A759066k285k539l568k831j644k615m380m039k508k495l229k212k49K0j056
$$ 1759066 1756781 1754242 1750674 1747843 1746199 1743584 1739204 1735165 1732657 1730162 1726933 1724721 1724472 1724492 1723436
58031A723436j310j087k098l529l431k405k106j832l08J096P19J74J649L721L783
$$ 1723436 1722126 1721039 1718941 1715412 1711981 1709576 1707470 1705638 1705330 1706426 1707145 1707319 1708968 1712689 1716472
58016A716472K705L061M574N350N828P512R382R513Q838R572J1341J2492J3656
$$ 1716472 1719177 1722238 1726812 1732162 1737990 1745502 1754884 1764397 1773235 1782807 1794148 1806640 1820296
58003A820296J6334J9426K0784K0885K1505K2256K1885K1389K2323K3537K3074
$$ 1820296 1836630 1856056 1876840 1897725 1919230 1941486 1963371 1984760 2007083 2030620 2053694
57992B053694K1814K1707K1944K0487J7995J6534J5646J3387J0117P805O604N412
$$ 2053694 2075508 2097215 2119159 2139646 2157641 2174175 2189821 2203208 2213325 2221130 2227734 2233146
57980B233146M727N660P248P964Q635J0676J2687J2110R014M986k53p666j5598
$$ 2233146 2237873 2243533 2250781 2258745 2267380 2278056 2290743 2302853 2311867 2316853 2316600 2308934 2293336
57967B293336k1325k4880k8023l0431l0426k8443k6318k4016k0457j6582j4143
$$ 2293336 2272011 2247131 2219108 2188677 2158251 2129808 2103490 2079474 2059017 2042435 2028292
57956B028292j2362r328n771l903l252j323K067M748O157P839J0277J2462J4445
$$ 2028292 2015930 2006602 2000831 1996928 1993676 1992353 1994420 1999168 2005325 2013164 2023441 2035903 2050348
57943B050348J7204K0188K1965K2971K4679K6535K6809K5937K5855K6376K5525
$$ 2050348 2067552 2087740 2109705 2132676 2157355 2183890 2210699 2236636 2262491 2288867 2314392
57932B314392K3176K1102J9539J6918J2984R043N010o68p908j4675k0027k4787
$$ 2314392 2337568 2358670 2378209 2395127 2408111 2417154 2422164 2421496 2413588 2398913 2378886 2354099
57920B354099k9001l1488l2123l2057l1481k9504k6340k3217k0273j6840j3611
$$ 2354099 2325098 2293610 2261487 2229430 2197949 2168445 2142105 2118888 2098615 2081775 2068164
57909B068164j1940j1181r403o586m533l663k560p54P52J843L550N715O897O875
$$ 2068164 2056224 2045043 2035640 2029054 2024521 2020858 2018298 2017544 2018296 2020139 2023689 2029404 2036301 2043176
57895B043176O982P729Q323Q614R250R908R541Q414P760P522O645N349M751M579
$$ 2043176 2050158 2057887 2066210 2074824 2084074 2093982 2103523 2111937 2119697 2127219 2133864 2139213 2143964 2148543
57881B148543L669K435K271K782K327J204J438L364N214O228P404Q981R991J0619
$$ 2148543 2152212 2154647 2156918 2159700 2162027 2163231 2164669 2168033 2173247 2179475 2186879 2195860 2205851 2216470
57867B216470J2212J4556J5850J5845J6258J7584J8274J7755J7446J7905J7603
$$ 2216470 2228682 2243238 2259088 2274933 2291191 2308775 2327049 2344804 2362250 2380155 2397758
57856B397758J5582J3038J1116R320P036M720K694N94j323k128k065k515l670
$$ 2397758 2413340 2426378 2437494 2446814 2453850 2458570 2461264 2461858 2460535 2458407 2456342 2453827 2450157
57843B450157m177l483k515j635r3J994L355L854M864O811Q501R531J1062J3375
$$ 2450157 2445980 2442497 2439982 2438347 2438254 2440248 2443603 2447457 2452321 2459132 2467633 2477164 2488226 2501601
57829B501601J4942J4832J4064J3599J2990J1894J1054J0812J0387R407Q481P635
$$ 2501601 2516543 2531375 2545439 2559038 2572028 2583922 2594976 2605788 2616175 2625582 2634063 2641698
57817B641698O092M233L708M869O084O397O888Q456J0306J1654J3043J4896J6594
$$ 2641698 2647790 2652023 2655731 2660600 2666684 2673081 2679969 2688425 2698731 2710385 2723428 2738324 2754918
57804B754918J8034K0279K3578K6546K8391L0226L2818L4662L3690K9742K4103
$$ 2754918 2772952 2793231 2816809 2843355 2871746 2901972 2934790 2969452 3003142 3032884 3056987
57793C056987J7799J1438N676Q93k912n392o008n191m092k983j284P58K097K847
$$ 3056987 3074786 3086224 3091900 3092793 3089881 3084489 3078481 3073290 3069198 3066215 3064931 3065689 3067786 3070633
57779C070633M211O080O710N412L549K193P53j193k696l143l326l866m166l889
$$ 3070633 3074844 3080924 3087634 3093046 3096595 3098788 3099541 3098348 3095652 3092509 3089183 3085317 3081151 3077262
57765C077262l749l922l377j714M6J309K794M711N956O091O317P379Q424Q916
$$ 3077262 3073513 3069591 3066214 3064500 3064546 3065855 3068649 3073360 3079316 3085407 3091724 3099103 3107527 3116443
57751C116443R811J1564J2958J3204J3337J4157J4720J4352J4249J5425J6797
$$ 3116443 3126254 3137818 3150776 3163980 3177317 3191474 3206194 3220546 3234795 3250220 3267017
57740C267017J7059J6774J6833J6375J4287J1493R785R389R403R605J0117J0272
$$ 3267017 3284076 3300850 3317683 3334058 3348345 3359838 3369623 3379012 3388415 3398020 3408137 3418409
57728C418409R625R253J0339J2259J3550J4030J4421J4724J4505J4149J4364J4971
$$ 3418409 3428034 3437287 3447626 3459885 3473435 3487465 3501886 3516610 3531115 3545264 3559628 3574599
57716C574599J5425J5896J6665J7198J7059J6952J7679J8797J9455J9844K0629
$$ 3574599 3590024 3605920 3622585 3639783 3656842 3673794 3691473 3710270 3729725 3749569 3770198
57705C770198K1670K2461K3140K3964K4539K4580K4689K5321K5950K6261K7131
$$ 3770198 3791868 3814329 3837469 3861433 3885972 3910552 3935241 3960562 3986512 4012773 4039904
57694D039904K9232L1662L3344L4862L7458M0967M4190M6808M9520N2736N6299
$$ 4039904 4069136 4100798 4134142 4169004 4206462 4247429 4291619 4338427 4387947 4440683 4496982
57683D496982O0237O4753O9814P5394Q1665Q8430R5030J01241J07313J12840J16960
$$ 4496982 4557219 4621972 4691786 4767180 4848845 4937275 5032305 5133546 5240859 5353699 5470659
57672E470659J20120J24009J28950J33141J35077J34083J26716J05610O5554J0352
$$ 5470659 5590779 5714788 5843738 5976879 6111956 6246039 6372755 6478365 6543919 6554271
57662F554271m8511r9546j36214j56506j61563j55206j42261j26106j08500r1201
$$ 6554271 6505760 6406214 6270000 6113494 5951931 5796725 5654464 5528358 5419858 5328657
57652E328657p6004o3336n2317m2336l3441k5542j8510j2720q217l865J300O372
$$ 5328657 5252653 5189317 5137000 5094664 5061223 5035681 5017171 5004451 4996234 4992369 4993669 5000041
57640E000041R724J1388J2864J4937J7217J9486K1925K4231K5983K7669L0032
$$ 5000041 5009765 5021153 5034017 5048954 5066171 5085657 5107582 5131813 5157796 5185465 5215497
57629E215497L2684L4767L6564L8941M1575M3386M4551M6385M9224N2074N4361
$$ 5215497 5248181 5282948 5319512 5358453 5400028 5443414 5487965 5534350 5583574 5635648 5690009
57618E690009N6515N8642O0079O0467N9993N8426N5162N0236M4120L6561K7035
$$ 5690009 5746524 5805166 5865245 5925712 5985705 6044131 6099293 6149529 6193649 6230210 6257245
57607F257245J6299O145k622j0491j7522k2736k5586k6696k6757k5838k4138k2221
$$ 6257245 6273544 6279689 6277067 6266576 6249054 6226318 6200732 6174036 6147279 6121441 6097303 6075082
57595F075082k0099j7177j3541j0322q305p014n578l696j428J173L785N861P260
$$ 6075082 6054983 6037806 6024265 6013943 6005638 5998624 5993046 5989350 5987922 5989095 5992880 5998741 6006001
57582F006001Q412R603J0665J1413J1907J2291J2770J3686J5092J6480J7438J8256
$$ 6006001 6014413 6024016 6034681 6046094 6058001 6070292 6083062 6096748 6111840 6128320 6145758 6164014
57570F164014J9312K0244K0516K0443K0802K1692K2587K3278K3875K4195K3986
$$ 6164014 6183326 6203570 6224086 6244529 6265331 6287023 6309610 6332888 6356763 6380958 6404944
57559F404944K3569K3481K3686K3923K4416K5381K6343K6840K7376K8660L0252
$$ 6404944 6428513 6451994 6475680 6499603 6524019 6549400 6575743 6602583 6629959 6658619 6688871
57548F688871L1194L1538L2110L3013L3544L3428L3056L2714L2634L3404L5226
$$ 6688871 6720065 6751603 6783713 6816726 6850270 6883698 6916754 6949468 6982102 7015506 7050732
57537G050732L7060L7794L7996L9171M1629M4322M6629M8802N0859N2493N4050
$$ 7050732 7087792 7125586 7163582 7202753 7244382 7288704 7335333 7384135 7434994 7487487 7541537
57526G541537N6174N8508O0121O1155O2482O3766O3491O1158N7848N4258M9736
$$ 7541537 7597711 7656219 7716340 7777495 7839977 7903743 7967234 8028392 8086240 8140498 8190234
57515H190234M3693L6554K8885K0838J3031O624J974j683m811o935p818q012p792
$$ 8190234 8233927 8270481 8299366 8320204 8333235 8339859 8341833 8340150 8335339 8328404 8320586 8312574 8304782
57502H304782o663m502k090j4J984M181O376Q561J1034J3561J5515J7117J9239
$$ 8304782 8298119 8293617 8291527 8291513 8293497 8297678 8304054 8312615 8323649 8337210 8352725 8369842 8389081
57489H389081K1733K3360K3905K4802K6964K9402L0937L1946L3330L4913L6044
$$ 8389081 8410814 8434174 8458079 8482881 8509845 8539247 8570184 8602130 8635460 8670373 8706417
57478H706417L6813L7571L8009L7877L7985L9340M1701M3953M5560M6842M8218
$$ 8706417 8743230 8780801 8818810 8856687 8894672 8934012 8975713 9019666 9065226 9112068 9160286
57467I160286M9918N2129N4756N7272N9287O0929O2279O2900O2356O0703N8076
$$ 9160286 9210204 9262333 9317089 9374361 9433648 9494577 9556856 9619756 9682112 9742815 9800891
57456I800891N4322M9478M4002L8020L1002K2760J4285O991J551k080m047m669
$$ 9800891 9855213 9904691 9948693 9986713 10017715 10040475 10054760 10061751 10063302 10061222 10057175 10052506
57444A0052506m616m337l526j703R30L683O148Q347J0350J2202J4061J6011J7878
$$ 10052506 10047890 10043553 10040027 10038324 10039254 10042937 10049085 10057432 10067782 10079984 10094045 10110056 10127934
57431A0127934J9430K0670K1817K3093K4563K5922K6655K6705K6807K7582K8601
$$ 10127934 10147364 10168034 10189851 10212944 10237507 10263429 10290084 10316789 10343596 10371178 10399779
57420A0399779K8971K8752K8866K9675L0509L0783L0716L0717L0837L1060L1419
$$ 10399779 10428750 10457502 10486368 10516043 10546552 10577335 10608051 10638768 10669605 10700665 10732084
57409A0732084L1649L1522L1601L2678L4268L4714L3297L1297L0421L0959L2043
$$ 10732084 10763733 10795255 10826856 10859534 10893802 10928516 10961813 10993110 11023531 11054490 11086533
57398A1086533L2907L3236L2970L2412L2175L2494L2995L3369L3760L4171L4188
$$ 11086533 11119440 11152676 11185646 11218058 11250233 11282727 11315722 11349091 11382851 11417022 11451210
57387A1451210L3637L2975L2664L2710L2989L3378L3416L2622L1374L0644L0604
$$ 11451210 11484847 11517822 11550486 11583196 11616185 11649563 11682979 11715601 11746975 11777619 11808223
57376A1808223L0380K9505K8598K8198K7975K7636K7555K7723K7253K5711K4141
$$ 11808223 11838603 11868108 11896706 11924904 11952879 11980515 12008070 12035793 12063046 12088757 12112898
57365A2112898K3718K4107K4170K3688K3326K3351K3469K3682K4399K5626K6887
$$ 12112898 12136616 12160723 12184893 12208581 12231907 12255258 12278727 12302409 12326808 12352434 12379321
57354A2379321K7904K8881L0053L1305L2226L2381L1736L0913L0668L1078L1634
$$ 12379321 12407225 12436106 12466159 12497464 12529690 12562071 12593807 12624720 12655388 12686466 12718100
57343A2718100L2152L2929L3945L4658L4910L5185L5696L5984L5787L5498L5400
$$ 12718100 12750252 12783181 12817126 12851784 12886694 12921879 12957575 12993559 13029346 13064844 13100244
57332A3100244L5242L5014L5208L5866L6229L5922L5631L5940L6414L6430L6134
$$ 13100244 13135486 13170500 13205708 13241574 13277803 13313725 13349356 13385296 13421710 13458140 13494274
57321A3494274L5893L5636L5430L5792L6777L7603L8019L9008M1216M3674M5181
$$ 13494274 13530167 13565803 13601233 13637025 13673802 13711405 13749424 13788432 13829648 13873322 13918503
57310A3918503M6071M7334M8799M9616M9847N0172N0399M9838M8830M8355M8208
$$ 13918503 13964574 14011908 14060707 14110323 14160170 14210342 14260741 14310579 14359409 14407764 14455972
57299A4455972M7062M4625M2347M1533M1793M1858M1001L9168L6401L2742K8416
$$ 14455972 14503034 14547659 14590006 14631539 14673332 14715190 14756191 14795359 14831760 14864502 14892918
57288A4892918K3684J8692J3555Q414L510o48l422m731n351o113o967p212o451
$$ 14892918 14916602 14935294 14948849 14957263 14960773 14960125 14956703 14951972 14946621 14940508 14933541 14926329 14919878
57275A4919878m907l042j338j63N05J087J764K183K121K025K405L092L622L985
$$ 14919878 14914971 14911929 14910591 14910428 14910933 14912020 14913784 14915967 14918088 14920113 14922518 14925610 14929232 14933217
57261A4933217M432M999N776P317J0029J3437J6556J8797K0036K0248J9626J8673
$$ 14933217 14937649 14942648 14948424 14955741 14965770 14979207 14995763 15014560 15034596 15054844 15074470 15093143
57249A5093143J7512J5523J2313Q653N646L349R64j817m550o920r026j0864j2162
$$ 15093143 15110655 15126178 15138491 15147144 15152790 15156139 15157103 15155286 15150736 15143816 15134790 15123926 15111764
57236A5111764j2777j2748j2085j0975j0005r571r307q672p892p700q267r060
$$ 15111764 15098987 15086239 15074154 15063179 15053174 15043603 15034296 15025624 15017732 15010032 15001765 14992705
57224A4992705r579r743r636r414r297r174q471o793m391j379L037R837J8918
$$ 14992705 14983126 14973383 14963747 14954333 14945036 14935862 14927391 14920598 14916207 14914828 14917865 14927702 14946620
57211A4946620K9209L9714M9317N5455N4131M2357K1119m015k5606l8600m2883
$$ 14946620 14975829 15015543 15064860 15120315 15174446 15216803 15237922 15233907 15208301 15169701 15126818
57200A5126818m1960l9387l6836l4913l4275l5110l6583l7804l8803l9970m1187
$$ 15126818 15084858 15045471 15008635 14973722 14939447 14904337 14867754 14829950 14791147 14751177 14709990
57189A4709990m2308m3701m5529m7150m8099m8933n0138n1064n1060n0898n1705
$$ 14709990 14667682 14623981 14578452 14531302 14483203 14434270 14384132 14333068 14282008 14231110 14179405
57178A4179405n3105n3876n4054n4831n6534n8171n8993n9207n9040n8339n7248
$$ 14179405 14126300 14072424 14018370 13963539 13907005 13848834 13789841 13730634 13671594 13613255 13556007
57167A3556007n6134n4789n2771n0557m9319m9396n0079n0957n2494n5124n8879
$$ 13556007 13499873 13445084 13392313 13341756 13292437 13243041 13192962 13142005 13089511 13034387 12975508
57156A2975508o4014p0994p9629q9103r8942j09112j19126j28117j35801j42380
$$ 12975508 12911494 12840500 12760871 12671768 12572826 12463714 12344588 12216471 12080670 11938290
57146A1938290j47378j49739j49163j46341j41743j35390j27889j20505j13822
$$ 11938290 11790912 11641173 11492010 11345669 11203926 11068536 10940647 10820142 10706320
57137A0706320j07550j01899r7810r5254r2638q8780q4573q1792q1082q1886q3765
$$ 10706320 10598770 10496871 10399061 10303807 10211169 10122389 10037816 9956024 9874942 9793056 9709291
57126I709291q6888r1467r7211j03166j07871j10085j09608j07126j03362r8855
$$ 9709291 9622403 9530936 9433725 9330559 9222688 9112603 9002995 8895869 8792507 8693652
57116H693652r4339r0424q6937q3432q0334p8506p7498p5306p0132o1404m8922
$$ 8693652 8599313 8508889 8421952 8338520 8258186 8179680 8102182 8026876 7956744 7895340 7846418
57105G846418l2282j1729J1620L7206O5969R9326J38222J83759K37752L01624
$$ 7846418 7814136 7802407 7814027 7851233 7917202 8016528 8154750 8338509 8576261 8877885
57095H877885L75293M57679N47661O43789P43804Q45229R45871J042967J132218
$$ 8877885 9253178 9710857 10258518 10902307 11646111 12491340 13437211 14480178 15612396
57086A5612396J208201J265032J296380J296855J266372J213572J151774J087053
$$ 15612396 16820597 18085629 19382009 20678864 21945236 23158808 24310582 25397635
57078B5397635J007629Q85606O93183M22453R3405k55737n86761q73933j105234
$$ 25397635 26405264 27290870 27984053 28406506 28499911 28244174 27657413 26783480 25678246
57069B5678246j278114j396404j468736j505966j517826j510784j487482j447304
$$ 25678246 24400132 23003728 21534992 20029026 18511200 17000416 15512934 14065630
57061A4065630j388365j310409j216366j111336j000763q89721p82909o84067
$$ 14065630 12677265 11366856 10150490 9039154 8038391 7148670 6365761 5681694
57053E681694n95235n16892m48592l89428l38433k94917k58176k26962j99898
$$ 5681694 5086459 4569567 4120975 3731547 3393114 3098197 2840021 2613059 2413161
57044B413161j76437j56640j39911j24893j10941r8709q8796q0678p3541o7227
$$ 2413161 2236724 2080084 1940173 1815280 1704339 1605630 1516834 1436156 1362615 1295388
57034A295388o1726n6482n1040m5748m1141l7128l3377k9959k7016k4333k1702
$$ 1295388 1233662 1177180 1126140 1080392 1039251 1002123 968746 938787 911771 887438 865736
57023H65736j9188j6648j3733j0780q749p732o458l953o46K914P293J3059J9484
$$ 865736 846548 829900 816167 805387 796638 788906 782448 778495 777849 780763 788056 801115 820599
57010H20599K5692L2331M0754N1229O3274P7091R3195J11349J31420J53960J76708
$$ 820599 846291 878622 919376 970605 1033879 1110970 1204165 1315514 1446934 1600894 1777602
56999A777602J90176J80277J38543O9931r999q4700j43403j81438j98187j96254
$$ 1777602 1967778 2148055 2286598 2356529 2346530 2261830 2118427 1936989 1738802 1542548
56989A542548j81123j59394j36344j14730r5410p8496o3925n1482m0974l2547
$$ 1542548 1361425 1202031 1065687 950957 855547 777051 713126 661644 620670 588123
56979E88123k6526k2816k0679j9313j8413j7961j7749j7380j6598j5315j3522
$$ 588123 561597 538781 518102 498789 480376 462415 444666 427286 410688 395373 381851
56968C81851j1368r226p316n462l429j384K91J607L110N328Q104J0521J1535J0766
$$ 381851 370483 361257 353941 348479 345050 343666 343957 345564 348674 354002 362106 372627 384162 394928
56954C94928Q599N412J116m167r327j2861j4291j4322j3657j2378j0590q781p128
$$ 394928 403527 408939 410055 405888 396561 383700 369409 355087 341430 329052 318462 309681 302553
56941C02553n163k605Q0K386M430O421Q032Q990R874J1645J4443J7163J8091J5871
$$ 302553 297390 294785 294865 297251 301681 308102 316134 325124 334998 346643 361086 378249 396340 412211
56927D12211J0376K975m353j0429j5149j8533k0316k0593j9963j8690j6513j3743
$$ 412211 422587 425562 421209 410780 395631 377098 356782 336189 316226 297536 281023 267280
56915B67280j1575j0665j0179q976p019m978l222j913j416j669j856j485j234
$$ 267280 255705 245040 234861 225885 218866 213888 210666 208753 207337 205668 203812 202327 201093
56902B01093j767k423k088q17M88J553K769M107N146N971O967P903Q288Q510R473
$$ 201093 199326 196903 194815 193998 194486 196039 198808 202915 208061 214032 220999 228902 237190 245700 255173
56887B55173J1182J2618J3103J2735J1474Q848M894N29l300o209q038q645q172
$$ 255173 266355 278973 292076 304811 316285 325133 330027 330556 327256 321047 313009 304364 296192
56874B96192p018n350l207r48J022K984N608Q924J2247J5211J8117K1207K4285
$$ 296192 289174 283824 280617 279669 280691 283675 289283 298207 310454 325665 343782 364989 389274
56861C89274K7219L0044L2228L2438K9441K2961J3661K829p701j5937k0697k2215
$$ 389274 416493 446537 478765 511203 540644 563605 577266 580095 572394 556457 535760 513545
56849E13545k1639k0011j7632j4257r819m878j84M186Q772J3768J8689K3375K8538
$$ 513545 491906 471895 454263 440006 430187 425309 425125 429311 438083 451851 470540 493915 522453
56836E22453L4745M1308M6920N0666N1613M7890L7625K1083J211j8049l3572m3693
$$ 522453 557198 598506 645426 696092 747705 795595 833220 854303 855514 837465 803893 760200
56824G60200m8273m8460m5819m1330l5436k8753k2067j5771r862m440M31N189
$$ 760200 711927 663467 617648 576318 540882 512129 490062 474291 464429 459989 460420 465609
56812D65609J0456J6296K2270K8064L3377L7269L8275L5169K7375J5032n44j6729
$$ 465609 476065 492361 514631 542695 576072 613341 651616 686785 714160 729192 728648 711919
56800G11919l0775m1197m7649n0032m8665m4945m0579l6050l0723k4484j8279
$$ 711919 681144 639947 592298 542266 493601 448656 408077 372027 341304 316820 298541
56789B98541j2933q376m192j64L959Q414J2912J6782J9726K1659K1799J8802J2225
$$ 298541 285608 277232 273040 272876 276835 285249 298161 314943 334669 356328 378127 396929 409154
56776D09154L247o263j4787k1268k5095k6504k6394k5454k3724k1194j8343j5857
$$ 409154 412401 406138 391351 370083 344988 318484 292090 266636 242912 221718 203375 187518
56764A87518j4104j2946j1771r929p447n210l934l299k630k030k030k424k372
$$ 187518 173414 160468 148697 138768 131321 126111 122177 118878 116248 114218 112188 109764 107392
56751A07392j673r91q35j049j357j592j457p96q6Q7l3J88N59K55p47j450j226
$$ 107392 105719 104728 103893 102844 101487 99895 98438 97642 97556 97643 97610 97798 98357 98612 97865 96415 95189
56734I5189n33o5L6m2j00J10N99Q65N10n5k39k42n43q34n55j54m36r88p40O0J47
$$ 95189 94656 94591 94627 94585 94485 94595 95194 96059 96569 96514 96275 96033 95490 94656 94101 93947 93511 92523 91783 91843 91990
56713I1990n02m66O80J546J167L77J62K08O1K91J330K370K550K342K643L341L773
$$ 91990 91488 91022 91702 93248 94415 94792 94954 95162 95223 95514 96844 99214 101764 104106 106749 110090 113863
56696A13863L866L823L393K367J235M92n9o11o07L37J482J805J362J003J072J220
$$ 113863 117729 121552 124945 127312 128547 129039 128980 128369 127762 128099 129581 131386 132748 133751 134823 136043
56680A36043J141Q67N51M38P88J419J749J532J147Q87N86J53k33o81j513k404
$$ 136043 137184 138051 138602 139040 139828 141247 142996 144528 145675 146562 147148 147301 147068 146387 144874 142470
56664A42470k487j709j113j284j496j017k98j74o79j318j730j594p04L08K45j015
$$ 142470 139983 138274 137161 135877 134381 133364 133066 132892 132213 130895 129165 127571 126867 127175 127420 126405
56648A26405k119k068j429j023n65M39J437J585R91K76l66q15n24O15J662J828
$$ 126405 124286 122218 120789 119766 119201 119640 121077 122662 123653 123929 123563 122748 122224 122839 124501 126329
56632A26329J540J476J403R39N43O74Q03M05P5M48P93J00j144j673j357j024p71
$$ 126329 127869 129345 130748 131687 132230 132904 133707 134112 134187 134635 135428 135528 134384 132711 131354 130330 129559
56615A29559k9R93J386R93N98O81J090J727K530K908K338J355R47J131J133P68
$$ 129559 129530 130523 131909 132902 133500 134181 135271 136998 139528 142436 144774 146129 147076 148207 149340 150108
56599A50108N50N92M85K61M02Q67J020O21J08p9J79Q66J661J879J269N59M93P35
$$ 150108 150658 151250 151735 151996 152398 153265 154285 154906 155014 154935 155114 155980 157641 159520 160789 161348 161841 162576
56581A62576N97K75M73J219K081L043M026M158K804R81L53J070J870K128K343
$$ 162576 163173 163448 163921 165140 167221 170264 174290 178448 181252 182233 182586 183656 185526 187654 189997
56566A89997K765K960K913L186L833M274M401M677N056M941M271L528K737J649
$$ 189997 192762 195722 198635 201821 205654 209928 214329 219006 224062 229003 233274 236802 239539 241188
56552B41188Q40J237K422K965K591K510L147L272K105P71O15J275J564J306J110
$$ 241188 242028 243265 245687 248652 251243 253753 256900 260172 262277 263048 263663 264938 266502 267808 268918
56537B68918R84M15n77j440j911k114k011j547j130j318k061k757l056l170l363
$$ 268918 269902 270317 269740 268300 266389 264275 262264 260717 259587 258269 256208 253451 250395 247225 243862
56522B43862l571l641l644l768m012m226m390m606m710m263l316k842l649n022
$$ 243862 240291 236650 233006 229238 225226 221000 216610 212004 207294 203031 199715 196873 193224 188202
56508A88202n392m441l508l515l657k857j481n86k97j12j35p65j550j610r84m26
$$ 188202 182810 178369 174861 171346 167689 164832 163351 162765 162468 162356 162221 161456 159906 158296 157312 156886
56492A56886j07M34J149J400R91L68j46m84m01K24Q39Q16L80J57J38J2j5L01M08
$$ 156886 156779 157213 158362 159762 160753 161121 160975 160491 160090 160314 161153 161969 162349 162506 162644 162656 162641 162942 163350
56473A63350j25m10N79K039K197J007J81M99Q85O12O51J919L578M134L332K176
$$ 163350 163225 162815 163394 165433 167630 168637 168818 169317 170202 170814 171465 173384 176962 181096 184428 186604
56457A86604J653J970K540K411J255J1j03P69J366J188J059J620K344K505K224
$$ 186604 188257 190227 192767 195178 196433 196444 196341 197110 198476 199664 200723 202343 204687 207192 209416
56442B09416K103K390K962L599M091M435M895N437N527M938M368M386M428L742
$$ 209416 211519 213909 216871 220470 224561 228996 233891 239328 244855 249793 254161 258547 262975 266717
56428B66717K806K508K557K060J185O70K01r67k082j674k39M6j461l033l447l531
$$ 266717 269523 272031 274588 276648 277833 278503 278704 277737 275655 273981 273742 273788 272327 269294 265847 262316
56412B62316m055m186l180j918j422j285p47j68k03n44n92n32p44r78r19q58j061
$$ 262316 258261 254075 250895 248977 247555 246270 245523 245355 245152 244608 244016 243484 242740 241762 240843 239985 238924
56395B38924j231j153j104j124q69n18p97j664k106j779j510j677j449m28M07
$$ 238924 237693 236540 235436 234312 233443 232925 232128 230464 228358 226579 225069 223392 221943 221515 221922
56380B21922L03o4mj59j175k129j742l16P45Q64N78M18M46O34Q91J003R82J091
$$ 221922 222225 222161 222157 221998 220823 218694 216952 216636 217381 218245 218823 219241 219687 220321 221212 222215 223197 224288
56362B24288J257J085P09P81J363J753J710J781K100K056J578J423J695J486O65
$$ 224288 225545 226630 227339 228120 229483 231236 232946 234727 236827 238883 240461 241884 243579 245065 245730
56347B45730N54J874L353L496K534J573R61O00Q26J721K486K608K767L572M272
$$ 245730 246284 248158 251511 255007 257541 259114 260075 260675 261501 263222 265708 268316 271083 274655 278927
56332B78927L885K825K188K149K152K126K470L167L786M055L924L523L417M097
$$ 278927 282812 285637 287825 289974 292126 294252 296722 299889 303675 307730 311654 315177 318594 322691
56318C22691N067N275M806M847N749O400O135N673N601N388M755M391M468M002
$$ 322691 327758 333033 337839 342686 348435 354835 360970 366643 372244 377632 382387 386778 391246 395248
56304C95248K779K201K999L786L339K662L101L840L218J451J47n7L37J079K087
$$ 395248 398027 400228 403227 407013 410352 413014 416115 419955 423173 424624 424771 424714 425051 426130 428217
56289D28217K577J803L60n41n13J29J151K084K114J347J142K140L132K989K441
$$ 428217 430794 432597 432957 432416 431903 432032 433183 435267 437381 438728 439870 442010 445142 448131 450572
56274D50572K658L463M268N464P269Q603Q788R056J0635J2614J3564J4010J5265
$$ 450572 453230 456693 460961 466425 473694 482297 491085 500141 510776 523390 536954 550964 566229
56261E66229J6974J7995J8764K0534K2994K4797K5856K7060K8320K8744K8311
$$ 566229 583203 601198 619962 640496 663490 688287 714143 741203 769523 798267 826578
56250H26578K7547K6229K4152K2360K1690K0934J8498J5114J2786J1734J0639
$$ 826578 854125 880354 904506 926866 948556 969490 987988 1003102 1015888 1027622 1038261
56239A038261R215Q186P149M901J749p77k388m192o502q520j0096j1798j3403
$$ 1038261 1047476 1055662 1062811 1067712 1069461 1068684 1066296 1062104 1055602 1047082 1036986 1025188 1011785
56226A011785j4222j4734j5974j7519j8096j7952j8587k0155k1177k0856j9849
$$ 1011785 997563 982829 966855 949336 931240 913288 894701 874546 853369 832513 812664
56215H12664j8736j7492j6393j5706j4661j2402r700p952o927n409l602k772k836
$$ 812664 793928 776436 760043 744337 729676 717274 707574 699622 692695 687286 683684 680912 678076
56202F78076k474j477q24n78J36J184J560J474K099L344L945L791L976M607M670
$$ 678076 675602 674125 673301 672723 672859 674043 675603 677077 679176 682520 686465 690256 694232 698839 703509
56187G03509M178M238M918N088M518M156M291M403M733N942P359P652P149P315
$$ 703509 707687 711925 716843 721931 726449 730605 734896 739299 744032 749974 757333 764985 772134 779449
56173G79449Q124Q331Q107Q907J0679J1831J2062J2738J4144J4925J4603J4315
$$ 779449 787573 795904 804011 812918 823597 835428 847490 860228 874372 889297 903900 918215
56161I18215J4664J5080J5580J6868J8511J9302J9547K0642K2458K3666K4637
$$ 918215 932879 947959 963539 980407 998918 1018220 1037767 1058409 1080867 1104533 1129170
56150A129170K7107L1004L4544L7791M2843N0046N7235O3673P1522Q2383R5349
$$ 1129170 1156277 1187281 1221825 1259616 1302459 1352505 1409740 1473413 1544935 1627318 1722667
56139A722667J09733J26786J47225J69526J91821K12909K29977K37999K33329
$$ 1722667 1832400 1959186 2106411 2275937 2467758 2680667 2910644 3148643 3381972
56130C381972K16498J90832J60549J30918J07361R2284Q3843P8267P1660N9800
$$ 3381972 3598470 3789302 3949851 4080769 4188130 4280414 4364257 4442524 4514184 4573984
56120D573984L9741J3213j3752l5808n1348o0925o6099p0980q1533j01036j27626
$$ 4573984 4613725 4626938 4613186 4577378 4526030 4465105 4399006 4328026 4246493 4145457 4017831
56109D017831j56973j84936k07041k18743k18382k08198j91320j69856j46301
$$ 4017831 3860858 3675922 3468881 3250138 3031756 2823558 2632238 2462382 2316081
56100B316081j23879j03975q5684o8907n5418m5790l8141l1200k5984k3109k1043
$$ 2316081 2192202 2088227 2002543 1933636 1878218 1832428 1794287 1763087 1737103 1713994 1692951
56089A692951j8513j6129j4319j2120r313p181n971m135j197J264K574M090O282
$$ 1692951 1674438 1658309 1643990 1631870 1622557 1615376 1609405 1605270 1604073 1605337 1607911 1612001 1618283
56076A618283P677P967R094J1819J4150J4700J4704J5318J5827J5971J6992J8995
$$ 1618283 1625960 1633927 1643021 1654840 1668990 1683690 1698394 1713712 1729539 1745510 1762502 1781497
56064A781497K0221K0326K1255K3642K5548K6093K6896K8547K9277K8661K8868
$$ 1781497 1801718 1822044 1843299 1866941 1892489 1918582 1945478 1974025 2003302 2031963 2060831
56053B060831L0692L2140L2541L3992L6896L8393L7371L6777L8520M0339M0319
$$ 2060831 2091523 2123663 2156204 2190196 2227092 2265485 2302856 2339633 2378153 2418492 2458811
56042B458811M0305M2016M3786M4091M4416M5821M6512M5806M6422M9944N3794
$$ 2458811 2499116 2541132 2584918 2629009 2673425 2719246 2765758 2811564 2857986 2907930 2961724
56031B961724N5751N7510O0776O3957O5818O8349P2775P6756P8701Q0796Q4660
$$ 2961724 3017475 3074985 3135761 3199718 3265536 3333885 3406660 3483416 3562117 3642913 3727573
56020C727573Q8162Q9710R1308R4344R6860R8120J00943J06292J10752J12837
$$ 3727573 3815735 3905445 3996753 4091097 4187957 4286077 4387020 4493312 4604064 4716901
56010D716901J16321J23532J30919J35416J39578J46051J52748J58041J64910
$$ 4716901 4833222 4956754 5087673 5223089 5362667 5508718 5661466 5819507 5984417
56001E984417J75079J84953J92223K00525K12528K24756K34475K45211K59877
$$ 5984417 6159496 6344449 6536672 6737197 6949725 7174481 7408956 7654167 7914044
55992G914044K75225K88815L04424L24521L44652L61785L80616M04969M30900
$$ 7914044 8189269 8478084 8782508 9107029 9451681 9813466 10194082 10599051 11029951
55983A1029951M55331M83136N17993N55034N90710O30806O80129P33884P88613
$$ 11029951 11485282 11968418 12486411 13041445 13632155 14262961 14943090 15676974 16465587
55974A6465587Q51532R28980J016266J109599J216784J344637J488024J644168
$$ 16465587 17317119 18246099 19262365 20371964 21588748 22933385 24421409 26065577
55966B6065577J825130K042733K295283K584481K930545L354059L859405M454617
$$ 26065577 27890707 29933440 32228723 34813204 37743749 41097808 44957213 49411830
55958D9411830N168703O027024P028350Q169791R473243J0963719J2652081J4570748
$$ 49411830 54580533 60607557 67635907 75805698 85278941 96242660 108894741 123465489
55950A23465489J6785259J9315530K2064645K4832697K7259442K8580604K7532095
$$ 123465489 140250748 159566278 181630923 206463620 233723062 262303666 289835761
55943B89835761K2882301J4409206L411516p854838j7335662k3939323k7518089
$$ 289835761 312718062 327127268 330538784 322683946 305348284 281408961 253890872
55936B53890872k8485544k7522607k5392235k2748013k0007959j7387949j5002569
$$ 253890872 225405328 197882721 172490486 149742473 129734514 112346565 97343996
55929I7343996j2902354j1072039r468525q069471o867816n842175m964061m220964
$$ 97343996 84441642 73369603 63901078 55831607 48963791 43121616 38157555 33936591
55921C3936591l606273l097503k666765k302717k002657j753125j536955j350494
$$ 33936591 30330318 27232815 24566050 22263333 20260676 18507551 16970596 15620102
55913A5620102j196380j067089r51423q49529p66275o96491o30993n70772n21634
$$ 15620102 14423722 13356633 12405210 11555681 10789406 10092915 9461922 8891150 8369516
55904H369516m80432m39554l99801l66652l38528l10219k83462k63018k46321
$$ 8369516 7889084 7449530 7049729 6683077 6344549 6034330 5750868 5487850 5241529
55895E241529k27494k07896j92714j80682j66738j51474j38833j27541j13729
$$ 5241529 5014035 4806139 4613425 4432743 4266005 4114531 3975698 3848157 3734428
55886C734428r9014q7560p7864o5545n1601m0042l0138j8878q621m695p499j4046
$$ 3734428 3635414 3547854 3469990 3404445 3352844 3312802 3282664 3263786 3255165 3250470 3242971 3228925
55874C228925k4873m2026o2122p8738r0339r9530j06186j07846j05369j01816
$$ 3228925 3204052 3162026 3099904 3021166 2930827 2831297 2725111 2617265 2511896 2410080
55864B410080r6980q8813p8751o9965o1841n1860m1387l4114l0387k8502k9854
$$ 2410080 2313100 2224287 2145536 2075571 2013730 1961870 1920483 1886369 1855982 1827480 1797626
55853A797626l6808m6767n4194n7709n9889o1092n9041n3888m8397m3365l7503
$$ 1797626 1760818 1714051 1659857 1602148 1542259 1481167 1422126 1368238 1319841 1276476 1238973
55842A238973l1310k6542k2555j7502j2393r619q477o557m556n138p921j0112
$$ 1238973 1207663 1181121 1158566 1141064 1128671 1119052 1110575 1104018 1099462 1094324 1086403 1076291
55830A076291j1467j4010j7523j9777k0771k2354k4076k3815k2124k1720k2818
$$ 1076291 1064824 1050814 1033291 1013514 992743 970389 946313 922498 900374 878654 855836
55819H55836k3097k2024k1209k0714j9040j6695j5716j5703j4182j0968q432p371
$$ 855836 832739 810715 789506 768792 749752 733057 717341 701638 687456 676488 668056 660685
55807F60685o209m385k992k008k74J749K423K026K127K248N73k288l903m193n267
$$ 660685 654476 650091 647099 645091 644817 646566 648989 651015 653142 655390 655963 653675 649772 645579 640312
55792F40312p204p773o689o408q047r979j1116j2288j3647j3792j2341j0600r114
$$ 640312 633108 625335 618646 612238 604191 594212 583096 570808 557161 543369 531028 520428 511314
55779E11314p123m865l682l448k661j430j618l599n664p028q734j1015j2467j2527
$$ 511314 504191 499326 495644 492196 489535 488105 486487 482888 477224 470196 461462 450447 437980 425453
55765D25453j2281j2209j1493j0024q830q142p232o342o447o946o175m441l961
$$ 425453 413172 400963 389470 379446 370616 362474 355242 348900 342453 335507 329332 324891 320930
55752C20930n368o825p009o568o062n041l705l200l518l306k237j568j812k034
$$ 320930 315562 308737 301728 295160 289098 284057 280352 277152 273634 270328 268091 266523 264711 262677
55738B62677j818j919k459k550k032j669j456o62L02K32o94j228j464k540m066
$$ 262677 260859 258940 256481 253931 251899 250230 248774 248112 248414 248646 247952 246724 245260 242720 238654
55723B38654m402l590l301l713l276j892j414k367l022k477j837j552m56J517
$$ 238654 234252 230662 227361 223648 220372 218480 217066 214699 211677 209200 207363 205811 205355 206872
55709B06872K480J712J049J790K693K452J878K008K197J648J018R96R96N41L86
$$ 206872 209352 211064 212113 213903 216596 219048 220926 222934 225131 226779 227797 228793 229789 230330 230716
55694B30716R75J466J384J675K916M109M327M001L601K677J220K39n8r28k880
$$ 230716 231691 233157 234541 236216 239132 243241 247568 251569 255170 257847 259067 259306 259248 258320 255440
55679B55440m574n114n538o699p458o628n167m710n152n301m948m703m644m463
$$ 255440 250866 245752 240214 233515 226057 219429 214262 209552 204400 199099 194151 189448 184804 180341
55665A80341m276m169l580k123k81J431L122M694N387M960M394M583N210N532
$$ 180341 176065 171896 168316 166193 165912 167343 170465 175159 180546 185506 189900 194483 199693 205225
55651B05225N329M600L321J982J259P69n68k575l709l421k986l289l492k830k069
$$ 205225 210554 215154 218475 220457 221716 222485 221917 219342 215633 212212 209226 205937 202445 199615 197546
55636A97546j951j700m40J095J626J175O47L25k30j382l304n829p943q356p187
$$ 197546 195595 193895 193455 194550 196176 197351 197998 198323 198093 196711 193407 187578 179635 171279 164092
55621A64092o003n695n551m957m567m921n295m971m408m153l745k745j792j566
$$ 164092 158089 152394 146843 141886 137319 132398 127103 122132 117724 113571 109826 107081 105289 103723
55607A03723j683j543j377j484j460j040p73j037j271j006o44n26k40L55N34j6
$$ 103723 102040 100497 99120 97636 96176 95136 94363 93326 92055 91049 90405 89879 89639 89994 90528 90512
55591I0512m40r2M59N48N20P92Q93L84k49m42l91l10P6O34O34R2J37J189K158
$$ 90512 90072 89980 90439 90987 91507 92299 93192 93576 93327 92885 92494 92184 92260 92894 93528 93620 93757 94946 97104
55572I7104K189J807J523Q45k94p55q3M10k44r84o92l30j224k561k649j701j345
$$ 97104 99293 101100 102623 103468 103174 102419 102336 102746 102502 101518 100826 100496 99272 96711 94062 92361 91016
55555I1016j974k508k367j956j460p72l36p10j419j524j052p50o99l61K36M84
$$ 91016 89042 86534 84167 82211 80751 79979 79643 78933 77514 75990 74938 74188 73489 73128 73364 73848
55539G3848K07k03n04o55n24j80j10m95q04n99j00N03J423K368K392J425P81J266
$$ 73848 74055 73852 73348 72693 72169 71989 71879 71384 70580 69981 69881 70384 71807 74175 76567 77992 78773 80039
55521H0039J932J779J404J795K566K867K935L370L764L619L662M700N884N690
$$ 80039 81971 83750 85154 86949 89515 92382 95317 98687 102451 106070 109732 114432 120316 126006
55507A26006M078K201O12q21j827k136k433l524m952n761n997o145n836m646l444
$$ 126006 130084 132285 132897 132076 130249 128113 125680 122156 117204 111443 105446 99301 93465 88819 85375
55492H5375l327l785l547k717k347k447k180j674j757k156j805q16l65o72q31
$$ 85375 82048 78263 74716 71999 69652 67205 65025 63351 61594 59438 57633 56817 56452 55780 54949
55477E4949o40q02j330j396r62q69j134q32O4M11j96p30m55J04L97O49R63Q12
$$ 54949 54309 53507 52177 50781 49819 48950 47816 46984 47048 47459 47263 46533 46078 46182 46579 47228 48191 49003
55459D9003O3n75o55n95p43p91n24k56k09k10k23m05n31k10K66K19k56m03r2N1
$$ 49003 49066 48491 47836 47241 46498 45707 45183 44927 44718 44508 44285 43880 43349 43139 43405 43624 43368 42965 42873 42924
55439D2924j52k24p2j53m05k00M50P62N32M95R79J307R53L15r0l12m76m15j90
$$ 42924 42772 42548 42476 42323 41918 41718 42168 42930 43462 43957 44936 46243 47196 47511 47421 47109 46633 46218 46028
55420D6028j73l46k63J09K96K35L60O62O22K63K46O22N73k28j042j259j215j259
$$ 46028 45855 45509 45246 45355 45651 45886 46246 46908 47530 47793 48039 48661 49234 49006 47964 46705 45490 44231
55402D4231j030k75M59N76K90O7j54n62q44n63Q8M57J74n23j041q59l6P15P16
$$ 44231 43201 42926 43385 43961 44251 44318 44164 43602 42758 42195 42283 42740 42914 42391 41350 40491 40455 41170 41886
55383D1886P4o05j034j284j229o62J47O76Q91J121J311J090N03r3o55j263j467
$$ 41886 41960 41355 40321 39037 37808 37146 37293 37969 38860 39981 41292 42382 42885 42792 42137 40874 39407
55366C9407q39Lk4q59j351j010n00l10m5N16Q10M78O3J24M17M32J60j49l59k89
$$ 39407 38568 38571 38547 37688 36337 35327 34827 34517 34472 34988 35798 36276 36339 36463 36880 37312 37472 37323 36964 36675
55346C6675K07P83P77J69k74j5O90J374J817J733P98p02j818j876j065k9O54N75
$$ 36675 36882 37665 38442 38611 38337 38322 39012 40386 42203 43936 44734 44032 42214 40338 39273 39244 39898 40473
55328D0473k11j032j316j331j568j654q56N46J433J386R76N35p9n17o7R77J405
$$ 40473 40262 39230 37914 36583 35015 33361 32505 33051 34484 35870 36846 37381 37302 36785 36718 37695 39100
55311C9100Q89M73P73J047N90j29m28m17l61j14J38l22j452k012j207J37Q73J006
$$ 39100 39989 40462 41235 42282 42872 42743 42315 41898 41537 41423 41561 41239 39787 37775 36568 36705 37578 38584
55293C8584J013O75k62r98n40P69J534R89l83j612k015j488n37J73O01J222K023
$$ 38584 39597 40272 40010 39012 38472 39241 40775 41764 41381 39769 37754 36266 35729 35902 36503 37725 39748
55276C9748K360K067J780J712J110l89j807k063j353m98K84J028J255N65m30p95
$$ 39748 42108 44175 45955 47667 48777 48388 46581 44518 43165 42667 42951 43979 45234 45799 45369 44574
55260D4574m64J2M15O91M37n47j572j797j328q26m82j70q8l07k08O38J481J344
$$ 44574 44110 44122 44537 45228 45665 45118 43546 41749 40421 39595 39113 38943 38855 38548 38340 38978 40459 41803
55242D1803N90L62P37O76k70j389k046k399k612k374j557n87J79Q12J343J507
$$ 41803 42393 42755 43492 44168 43898 42509 40463 38064 35452 33078 31521 30934 31113 31925 33268 34775
55226C4775J226Q05M57J21j23j1L94O14M74L70O16Q90O68k1o34p60m87j60O8L05
$$ 34775 36001 36806 37263 37384 37261 37250 37644 38258 38732 39102 39718 40608 41276 41255 40621 39861 39374 39214 39282 39587
55206C9587N56N31O9l84k03M75P88L27k89l88k06l42o36m16M60J323J517R81J57
$$ 39587 40143 40674 40743 40359 40156 40631 41419 41746 41457 41069 40863 40521 39885 39469 39929 41252 42769 43750 43907
55187D3907l14lP98J120L53r31j629j419r11o58o00n33m47k75K04R54J439J110
$$ 43907 43593 43590 44388 45508 45861 44930 43301 41882 40971 40313 39713 39180 38733 38458 38662 39616 41055 42165
55169D2165Oj153j527q34L78J233J387J270J344J446J135M47j16k61j96k29l28
$$ 42165 42171 41018 39491 38657 39035 40268 41655 42925 44269 45715 46850 47297 47181 46920 46724 46495 46167
55152D6167k06L05R22J037K94q81j550j224l13M64Q57R90Q66L93k04l82R1P07
$$ 46167 45961 46266 47188 48225 48519 47638 46088 44864 44551 45015 45872 46862 47728 48121 47917 47535 47626 48333
55134D8333O40l61j545j904j302o35o24q75n48L40R73R35O65O15O93O96P18Q41
$$ 48333 48973 48612 47067 45163 43861 43226 42602 41727 41179 41519 42492 43427 44092 44707 45400 46096 46814 47655
55116D7655R68J163J693K432K749K282J376N27j83p94j089q21p0Q19J399J285
$$ 47655 48623 49786 51479 53911 56660 58942 60318 60845 60662 59868 58779 57958 57888 58707 60106 61391
55100F1391N35k09m98q51j948l244l393k187q90l29R7R93J715J486P82N62Q01
$$ 61391 61926 61717 61219 60368 58420 55176 51783 49596 48706 48377 48474 49467 51182 52668 53450 54012 54813
55083E4813P97M18R8o6l57q10j239j624j895j727j077n09l90l07J68O51N79J46
$$ 54813 55610 56028 56126 56060 55703 54893 53654 52030 50135 48408 47331 46822 46432 46125 46293 46944 47523 47669
55065D7669j24k25l40k05M08R93R67O05N31P01O66M49L14J07l26n11n7M62M24
$$ 47669 47545 47320 46980 46775 47183 48176 49143 49748 50279 50980 51646 52095 52409 52516 52190 51679 51622 52084 52508
55046E2508L50J038J834J292m80j624r71N51J437J456J390J690K069K048J495
$$ 52508 52858 53896 55730 57022 56542 54918 53947 54498 55935 57391 58781 60471 62540 64588 66083
55031F6083Q16P00J412K368K771K552K227K062J887J588J189O57J19M5O04J180
$$ 66083 66899 67599 69011 71379 74150 76702 78929 80991 82878 84466 85655 86312 86431 86476 87080 88260
55015H8260J174R18R97J097N82k10l88q6l37j333k073j998j723j788j844j597
$$ 88260 89434 90352 91349 92446 93028 92818 92430 92344 92007 90674 88601 86603 84880 83092 81248 79651
54999G9651j488j815k075j844j486j347r92r5N98J11j259k185j878p82K33P51
$$ 79651 78163 76348 74273 72429 70943 69596 68604 68509 69107 69218 67959 65774 63896 63114 63347 64098
54983F4098Q09N60J51k20l24kO46J218J267P74K79M45J457K774L523L309K660
$$ 64098 64907 65467 65618 65398 65074 65072 65718 66936 68203 68977 69256 69701 71158 73932 77455 80764 83424
54966H3424K460K945L576L961M423N364O615P763Q695R417R849J0192J1023J2436
$$ 83424 85884 88829 92405 96366 100789 106153 112768 120531 129226 138643 148492 158684 169707 182143
54952A82143J3634J3899J3397J2362J0215O473J956k040n341q563j1475j3102
$$ 182143 195777 209676 223073 235435 245650 252123 254079 252039 246698 238135 226660 213558
54940B13558j3345j3216j3289j3052j2005j0419q753p254o263n982n827m920l355
$$ 213558 200213 186997 173708 160656 148651 138232 129479 122225 115962 109980 104153 99233 95878
54927I5878k000j114k22N98O21qp2R38K127K774L461M832O418P506Q239R071R886
$$ 95878 93878 92764 92542 93140 93761 93753 93681 94619 96746 99520 102981 107813 114231 121737 129976 139047 148933
54910A48933J0504J1212J1963J1840J0182P542M718J550k351o280q992j0229j0764
$$ 148933 159437 170649 182612 194452 204634 212176 216894 218444 216093 209813 200821 190592 179828
54897A79828j1173j1377j1171j0397q895o902n348m945n240n203m508l593k705
$$ 179828 168655 157278 146107 135710 126815 119913 114565 109620 104380 99177 94669 91076 88371
54884H8371j752r51p46j015j010l21O22J174J146P53K69j01k52k45k54l35l98
$$ 88371 86619 85668 84922 83907 82897 82576 83198 84372 85518 86271 86540 86439 86187 85942 85688 85353 84955
54867H4955l78m17q01j627k515k823k409j905j892k059j744j080q06j001r35l36
$$ 84955 84577 84160 83359 81732 79217 76394 73985 72080 70188 68129 66385 65305 64499 63498 62563 62227
54851F2227R0j66o34p55p69j069j342j128p07o70r49j017p16k82K05P40J030P92
$$ 62227 62317 62151 61517 60762 59993 58924 57582 56454 55747 55077 54128 53111 52395 52113 52318 53058 54088 54880
54833E4880L05N0N4N2R7M39R18J098Q99O25M76M36N82R96J468J664J578J477J516
$$ 54880 55185 55235 55289 55341 55438 55877 56795 57893 58792 59417 59893 60329 60911 61907 63375 65039 66617 68094 69610
54814F9610J697K049K524K839K809K682K886L589M765O424Q368R941J0539J0398
$$ 69610 71307 73356 75880 78719 81528 84210 87096 90685 95450 101874 110242 120183 130722 141120
54800A41120J0483J1481J3085J4245J4090J2638J0639Q590O075K486j725n230
$$ 141120 151603 163084 176169 190414 204504 217142 227781 236371 242446 244932 243207 237977
54788B37977p374q805j0219j1183j0860r311p402n761m507l675l217k766k027
$$ 237977 230603 221798 211579 200396 189536 180225 172823 167062 162555 158880 155663 152897 150870
54775A50870j256q01l93N29J889L038L710M316N324O845Q884J1449J4139J6193
$$ 150870 149614 148813 148420 148949 150838 153876 157586 161902 167226 174071 182955 194404 208543 224736
54761B24736J7188J7446J7479J7198J5930J3287R873O837M602K372q30m826q623
$$ 224736 241924 259370 276849 294047 309977 323264 333137 339974 344576 346948 346118 341292 332669
54748C32669j1854j4984j8029k0071k0522k0037j9445j8558j6789j4377j2140
$$ 332669 320815 305831 287802 267731 247209 227172 207727 189169 172380 158003 145863
54737A45863j0395q980p922p186o179m529l106l094m101m409l327k108k092k889
$$ 145863 135468 126488 118566 111380 105201 100672 97566 94472 90371 85962 82635 80527 78435 75546
54723G5546l138k345j148k33L01N87P05P00N43Q1o46j138q76p0M09P4n09m02M72
$$ 75546 72408 70063 68915 68682 68983 69570 70275 70975 71518 71599 70953 69815 68939 68869 69278 69352 68843 68441 68913
54704F8913J266J367J088R66R01N71K29M03R04J091J000J291J907J848P54k80
$$ 68913 70179 71546 72634 73600 74501 75072 75301 75704 76608 77699 78699 79990 81897 83745 84499 84219
54688H4219j62P40J371J552J799K106J990J570J545K113K666K699K346J999J919
$$ 84219 84057 84797 86168 87720 89519 91625 93615 95185 96730 98843 101509 104208 106554 108553 110472
54673A10472K248K859L257L113K823L017L644M136M307M525M996N550O111O795
$$ 110472 112720 115579 118836 121949 124772 127789 131433 135569 139876 144401 149397 154947 161058 167853
54659A67853P524Q136Q934J0520J2923J5484J7745J9945K2397K4766K6296K6360
$$ 167853 175377 183513 192447 202967 215890 231374 249119 269064 291461 316227 342523 368883
54647C68883K4637K0934J5236P904j40p691j3916j8847k2872k5684k6366k4865
$$ 368883 393520 414454 429690 437594 437454 429763 415847 397000 374128 348444 322078 297213
54635B97213k2631k1099k0030j8217j5472j2898j1286j0261r191q013o883n726
$$ 297213 274582 253483 233453 215236 199764 186866 175580 165319 156128 148115 141232 135506
54623A35506m566l740l419l306l079k764k502k316k225k262k263k007j642j571
$$ 135506 130940 127200 123781 120475 117396 114632 112130 109814 107589 105327 103064 101057 99415 97844
54609I7844j832k036j980j938k136k345k193j629q82k02K19K90L5m37r40j152
$$ 97844 96012 93976 91996 90058 87922 85577 83384 81755 80873 80671 80890 81180 81215 80778 79838 78686
54593G8686q16j71J68K6k3M29Q50N29l12q73r50r32r13o14j52L5rJ59M90N31M83
$$ 78686 77870 77699 77867 77893 77870 78299 79149 79678 79366 78493 77543 76611 75698 75084 74932 74967 74958 75117 75607 76138 76621
54572G6621J075K172K537J520J19l28K03P01N89K27K46Q47J702K238K151J775
$$ 76621 77696 79868 82405 83925 84044 83716 83919 84620 85209 85436 85682 86529 88231 90469 92620 94395
54556I4395J617J599J228N54L31R37J817K354K774L651M985O290P330Q289R290
$$ 94395 96012 97611 98839 99393 99724 100661 102478 104832 107606 111257 116242 122532 129862 138151 147441
54541A47441J0190J0826J1289J1849J2523J2656J1224P986M101R86j284l793p020
$$ 147441 157631 168457 179746 191595 204118 216774 227998 235984 240085 241071 239787 235994 228974
54528B28974j0092j2018j2816j3035j2818j2026j0740r171p415n749m687m347
$$ 228974 218882 206864 194048 181013 168195 156169 145429 136258 128843 123094 118407 114060
54516A14060m140l521k706k207k027j763j304r25p59n49L0R30J583J332K08p94
$$ 114060 109920 106399 103693 101486 99459 97696 96392 95467 94708 94159 94189 95119 96702 98034 98242 97448
54500I7448o85L29J116J070O44L63O7n06j056j147q30m37j47n3k43m57k00N29
$$ 97448 96763 97092 98208 99278 99922 100285 100352 99846 98790 97643 96813 96376 96229 96176 95933 95476 95276 95805
54482I5805J113J239J363J793J973J225k26j533k210k261j801j052m45j73PJ92
$$ 95805 96918 98157 99520 101313 103286 104511 104285 102752 100542 98281 96480 95428 94983 94810 94817 95009
54466I5009Oo54j127r28o71j182k096k287j511o78m60n11k68K01M72L53l7m34
$$ 95009 95015 94361 93234 92306 91635 90453 88357 86070 84559 83881 83421 82910 82642 82843 83315 83668 83631 83197
54448H3197n35j89L33O46P05P11N66j1q22j152o46J11K47l89j140j354r72l27
$$ 83197 82662 82473 82806 83452 84157 84868 85434 85423 84601 83449 82803 82914 83161 82772 81632 80278 79306 78979
54430G8979L87J145J700J594P67j39m90m56o08q87o22L69J441K047K331K509K349
$$ 78979 79366 80511 82211 83805 84572 84433 83943 83487 82879 81992 81370 81739 83180 85227 87558 90067 92416
54413I2416J797J438J722K220K250J881J682J771J750J387P83M0p80j466j862
$$ 92416 94213 95651 97373 99593 101843 103724 105406 107177 108927 110314 111097 111137 110357 108891 107029
54398A07029k100k225k007j499j316j765k150j670o46p5k12m73n82q38j258j376
$$ 107029 104929 102704 100697 99198 97882 96117 93967 92297 91651 91576 91364 90891 90309 89471 88213 86837
54382H6837j058p25n92l92o0M9j80l73l66m81q51j039p42k58K6J41J59p4m53m28
$$ 86837 85779 85054 84462 84070 84010 84059 83879 83506 83140 82659 81808 80769 80027 79769 79795 79936 80095 80021 79568 79140
54362G9140K28Q91R36O60P92J397J934K189K398K527K187J428R58J161J444J095
$$ 79140 79368 80259 81195 81855 82647 84044 85978 88167 90565 93092 95279 96707 97665 98826 100270 101365
54346A01365L68J38M95M97n10j874k517k378k319k649k617j714o83o33j496k169
$$ 101365 101733 101871 102366 102863 102353 100479 97962 95584 93265 90616 87999 86285 85602 84969 83473 81304
54330H1304k022j550j383j434j304j054j103j565k115k359k148j566q88m59m08
$$ 81304 79282 77732 76349 74915 73611 72557 71454 69889 67774 65415 63267 61701 60813 60354 59946
54315E9946n09m91m15o00j097j527j480r68l18J83M07K45l12r44j145p90l31j73
$$ 59946 59437 58946 58531 57931 56834 55307 53827 52859 52541 52724 53131 53376 53064 52120 50975 50185 49854 49681
54297D9681k04j43j38m64q14n18M82J448J792J688J508J184N20k72p72q41n61
$$ 49681 49477 49334 49196 48732 47918 47400 47882 49330 51122 52810 54318 55502 56022 55750 54978 54137 53576
54280E3576J8O81R56O06L7k21j85k36m38n31m00j63J48N34Q25Q17O31N23M52K18
$$ 53576 53594 54275 55231 55837 55874 55653 55468 55232 54794 54263 53863 53700 53848 54382 55207 56024 56655 57178 57630 57848
54260E7848p4j06J11K70K52K37K82K09jo5J95N81P68O65M31K45J50Jl65q54j128
$$ 57848 57774 57668 57779 58049 58301 58538 58820 59029 59028 58963 59158 59739 60507 61172 61603 61848 61998 61999 61634 60780 59652
54239E9652j021p73o65o10l88r9m0j98j87K53Q95J204P96j61r88j089n72l7K44
$$ 59652 58631 57858 57193 56583 56195 56096 56056 55858 55671 55924 56819 58023 58819 58658 57670 56581 56009 55972 56216
54220E6216M43M77j46j376k264k087j310p64m01K40Q04N03m35p87k7R95J331J104
$$ 56216 56659 57136 56990 55614 53350 51263 49953 49189 48788 49028 49832 50335 49900 49113 49086 50081 51412 52516
54202E2516R66J093J201J061O29l3o31p92n26j68J34M99P84N99J0m12m92p47j414
$$ 52516 53482 54575 55776 56837 57466 57433 56802 56010 55484 55316 55450 55949 56733 57332 57342 56930 56438 55691 54277
54183E4277j838j445o95m06m91k34M04N71k10j280j661j159l46K09L21L7m45p04
$$ 54277 52439 50994 50299 49893 49402 49168 49572 50143 49933 48653 46992 45833 45487 45696 46017 46054 45609 44905
54165D4905l40N34J299J455J115O55J13o22j202j011o6P56P88L57J40J31j46o66
$$ 44905 44565 45099 46398 47853 48968 49623 49736 49114 47912 46901 46835 47591 48379 48736 48876 49007 48861 48195
54147D8195p67k6J189K086K061J057l30j188j117o26m03m17j93K84N49M74L81
$$ 48195 47428 47402 48591 50677 52738 53795 53465 52277 51160 50534 50131 49714 49521 49805 50354 50828 51209
54130E1209L64J36l25n78l98j27r7j91j98j39m5K06N37N43L0o30r13o80j19N27
$$ 51209 51573 51709 51384 50806 50408 50281 50184 49993 49795 49656 49611 49817 50354 50897 50927 50297 49384 48704 48585 49112
54110D9112R57Q36J46o42r42n98L8M79N32M37M75N08Q9p44j220p77J39P02Q06
$$ 49112 50069 50905 51051 50409 49467 48869 48907 49386 49918 50355 50830 51338 51427 50683 49463 48686 48825 49527 50333
54091E0333R06J027P94K56r9k09m74q37p27p8M17L79K61M58O33L89r4n25r35j274
$$ 50333 51239 52266 53060 53316 53217 53008 52534 51697 50970 50892 51309 51688 51949 52407 53040 53429 53335 52810 51875 50601
54071E0601j165n65n0nj33j65l54p22o48J38Q48Q12O94J489K754L027J906N95
$$ 50601 49436 48871 48821 48816 48683 48518 48164 47442 46794 46932 47780 48592 49286 50775 53529 56556 58462 59057
54053E9057K09N05N81J80k25k25Q3L32L46L26N54R66J199J143J124J412J881K354
$$ 59057 59266 59771 60352 60532 60307 60082 60165 60497 60843 61169 61723 62689 63888 65031 66155 67567 69448 71802
54035G1802K859L299L286K717K120K016K219K225J965J726J658J787K208K750
$$ 71802 74661 77960 81246 83963 86083 88099 90318 92543 94508 96234 97892 99679 101887 104637
54021A04637K817K097J213J015J461J786J587J123O80K41k07n96r63j276j230
$$ 104637 107454 109551 110764 111779 113240 115026 116613 117736 118416 118657 118450 117854 116891 115615 114385
54006A14385o84j91m17j179j731j892k210k885l345l088k358j610r24k38J95P7
$$ 114385 113701 113510 113093 111914 110183 108291 106081 103196 99851 96763 94405 92795 91871 91633 91828 91905
53990I1905m60r62j177j244j438j799j949j470n03J71j6p27j184j132r20p64n12
$$ 91905 91445 90483 89306 88062 86624 84825 82876 81406 80903 81074 81058 80331 79147 78015 77095 76331 75819
53973G5819j18K04L30K68j19r44j734j703p11M84J154J297J257J183J126J204
$$ 75819 75701 75905 76235 76503 76384 75440 73706 72003 71292 71776 72930 74227 75484 76667 77793 78997
53957G8997J334J208Q15O18Q63J138J011P70R91J616J994J817J521J666K267K871
$$ 78997 80331 81539 82354 82972 83835 84973 85984 86754 87745 89361 91355 93172 94693 96359 98626 101497
53941A01497L122L086L146L556M157M627M980N635O721P593P426O182M655L457
$$ 101497 104619 107705 110851 114407 118564 123191 128171 133806 140527 148120 155546 161728 166383 169840
53927A69840K397J078l05j218j670k133k645k584j734r43j069j700j684p82J06
$$ 169840 172237 173315 173010 171792 170122 167989 165344 162760 161026 160083 159014 157314 155630 154848 154954
53912A54954M22O56J265J815J835J797K406L394L912L728L236K553J570P14O41
$$ 154954 155376 156032 157297 159112 160947 162744 165150 168544 172456 176184 179420 181973 183543 184257 184898
53897A84898J040P58n92k005k460k112j698j461j341j579k364l211l405k975k638
$$ 184898 185938 186696 186104 184099 181639 179527 177829 176368 175027 173448 171084 167873 164468 161493 158855
53882A58855k847l342l653l598l257k762k267j863j540j281j204j355j484j214
$$ 158855 156008 152666 149013 145415 142158 139396 137129 135266 133726 132445 131241 129886 128402 127188
53868A27188m80L36P24M30m18j378k000k103j851j563j498j774k261k594k560
$$ 127188 126708 127044 127768 128198 127780 126402 124402 122299 120448 118885 117387 115613 113352 110758 108198
53853A08198k424k581k797k316r68K60K71p52j603j556j084r95j424j886j927
$$ 108198 105774 103193 100396 98080 97112 97372 97643 96891 95288 93732 92648 91653 90229 88343 86416
53838H6416j381l25Q21J335Q04l76j324j554j254p50j11N59Q99O86K70K06N14
$$ 86416 85035 84710 85531 86866 87670 87294 85970 84416 83162 82412 82301 82860 83759 84445 84715 84921 85435
53821H5435O77L95rq5J27K53J50L1P4J69J27l5r8J15N26Q52Q42M57j27n93n17
$$ 85435 86112 86507 86498 86413 86540 86793 86943 86974 87048 87217 87344 87309 87211 87326 87852 88704 89546 90003 89876 89283 88766
53800H8766M58K197L854M422L714K607K091K268K473K177J553J100J067J281J390
$$ 88766 89224 91421 95275 99697 103411 106018 108109 110377 112850 115027 116580 117680 118747 120028 121418
53785A21418J182P24K81J11K67N72P43N81J25l92q01j131j430j539j300r05q12
$$ 121418 122600 123324 123605 123716 123983 124555 125298 125879 126004 125612 124811 123680 122250 120711 119411 118506 117694
53768A17694j253j992k566k656k243j624j217j125j042p93p17j101j526j434j142
$$ 117694 116441 114449 111883 109227 106984 105360 104143 103018 101976 101183 100466 99365 97839 96405 95263
53753I5263j433k138k148j161l94q36j748j774q82k16l84q94j117q91k92M67R01
$$ 95263 93830 91692 89544 88383 87989 87153 85405 83631 82749 82533 82149 81255 80138 79247 78955 79422 80323
53736H0323P00K30rj90p31j332j296o74k10j11J07N83Q63Q20Q57R52N68j87l38
$$ 80323 81023 81253 81244 81054 80323 78991 77695 77021 76811 76700 76807 77390 78253 79073 79930 80882 81450 81263 80925
53717H0925M43J115P12k86q50q97j000j211j112p00l47k9N47J200J380J009N94
$$ 80925 81368 82483 83195 82909 82059 81162 80162 78951 77839 77139 76792 76763 77310 78510 79890 80899 81493
53700H1493N33P63J030J051N67k91q86q32o39q99j109k13J634K871K388Q53k77
$$ 81493 82026 82789 83819 84870 85437 85146 84260 83428 82789 81890 80781 80568 82202 85073 87461 88314 88037
53683H8037m18K9N93J094J357J252R35O70M44J65L7L23P82Q93O30M59N13L71j13
$$ 88037 87619 87648 88241 89335 90692 91944 92879 93549 93993 94158 94195 94518 95300 96193 96823 97282 97795 98166 98053
53664I8053l57Q7P04O37o9n74m30k5K12L53N05M58J72O9L42M31k54j350j905j535
$$ 98053 97696 97783 98487 99124 99055 98481 98051 98026 98238 98591 99096 99554 99726 99795 100137 100568 100314 98964 97059 95524
53644I5524o79J50Q10J231J272R92P03O13O75P88Q00M16m35j192j172n23j18l28
$$ 95524 94845 94995 95805 97036 98308 99300 100003 100616 101291 102079 102879 103295 102860 101668 100496 99973 99855 99527
53626I9527m56K16J355J968J593O64j55n66o19m61k27RK30M98R70J736K540K826
$$ 99527 99071 99287 100642 102610 104203 104867 104712 104146 103527 103066 102839 102848 103078 103576 104546 106282 108822 111648
53608A11648K345J593J265J351J199N29j06o6O43J501K048K112J878J938K752
$$ 111648 113993 115586 116851 118202 119401 119930 119824 119758 120401 121902 123950 126062 127940 129878 132630
53593A32630L818L791K065k03j183l47J172K104K283K236K121J595N19n58q79
$$ 132630 136448 140239 142304 142101 140918 140571 141743 143847 146130 148366 150487 152082 152601 152043 151164
53578A51164k70O68J155R01J85n52r76r03m33k3q9m60n24l3N35O29K75j14l95
$$ 151164 150894 151562 152717 153618 153803 153251 152275 151372 150939 150916 150827 150367 149843 149810 150345 150974 151249 151135 150740
53559A50740p29j099j151o57N1L12j33p93r47n28j80l76p37n99O3O86R84J176
$$ 150740 150011 148912 147761 147104 147155 147467 147334 146541 145594 145066 144886 144510 143773 143174 143237 143923 144907 146083
53541A46083J376J264O34j50n09k53L70R85J354J498J622J789J796J575J500J877
$$ 146083 147459 148723 149357 149207 148698 148445 148815 149800 151154 152652 154274 156063 157859 159434 160934 162811
53525A62811K312K174J612J396J726J945J692J513J952K746L437M159N148N985
$$ 162811 165123 167297 168909 170305 172031 173976 175668 177181 179133 181879 185316 189475 194623 200608
53511B00608O050N489N024N018N277N649O182O713O875O661O548O957P851Q977
$$ 200608 206658 212147 217171 222189 227466 233115 239297 246010 252885 259546 266094 273051 280902 289879
53497B89879J0169J1302J2068J2109J1406J0526J0290J1003J2140J2886J2905
$$ 289879 300048 311350 323418 335527 346933 357459 367749 378752 390892 403778 416683
53486D16683J2298J1224J0010R383R871J0902J1344J0928J0458J0414J0319R844
$$ 416683 428981 440205 450215 459598 469469 480371 491715 502643 513101 523515 533834 543678
53474E43678R517R776J0125J0008R721R695R506Q618P527P118P225O938O158N699
$$ 543678 553195 562971 573096 583104 592825 602520 612026 620644 628171 635289 642514 649452 655610 661309
53460F61309N887O051N599M660L451J898J54j163j700j812k037k522l214m113
$$ 661309 667196 673247 678846 683506 686957 688855 689009 687846 686146 684334 682297 679775 676561 672448
53446F72448n142o088o950p963r151j0166j0713j0860j0805j0647j0496j0507
$$ 672448 667306 661218 654268 646305 637154 626988 616275 605415 594610 583963 573467 562960
53434E62960j0630j0575j0129r373q601q173q330q860r119q707q048p870q173
$$ 562960 552330 541755 531626 522253 513652 505479 497149 488289 479170 470463 462415 454545 446372
53421D46372q154p184n470l642k077q25L9L34M2l64q1J284L132M446N019N599
$$ 446372 438218 431034 425564 421922 419845 419020 419059 419393 419435 419071 418990 420274 423406 427852 432871 438470
53405D38470O684P808Q463Q979R812J0593J0824J1008J2011J3590J4688J5104
$$ 438470 445154 452962 461425 470404 480216 490809 501633 512641 524652 538242 552930 568034
53393E68034J5662J6596J7051J6650J6428J7438J9242K0606K1173K1650K2653
$$ 568034 583696 600292 617343 633993 650421 667859 687101 707707 728880 750530 773183
53382G73183K4062K5407K6411K7006K7152K6765K5839K4691K3967K4141K4994
$$ 773183 797245 822652 849063 876069 903221 929986 955825 980516 1004483 1028624 1053618
53371A053618K5818K6010K5282K3630K1525J9870J9042J8232J6461J4076J2318
$$ 1053618 1079436 1105446 1130728 1154358 1175883 1195753 1214795 1233027 1249488 1263564 1275882
53360A275882J1433J0341Q378O252M765L561J878k89k499m671o890q974j0985
$$ 1275882 1287315 1297656 1306034 1312286 1317051 1320612 1322490 1322201 1319702 1315031 1308141 1299167 1288182
53347A288182j3590j7109k0687k3241k4851k6311k7688k8316k8093k7715k7546
$$ 1288182 1274592 1257483 1236796 1213555 1188704 1162393 1134705 1106389 1078296 1050581 1023035
53336A023035k7196k6469k5867k5739k5668k5179k4518k4122k3803k3063k2045
$$ 1023035 995839 969370 943503 917764 892096 866917 842399 818277 794474 771411 749366
53325G49366k1485k1679k2036k1865k1194k0457j9727j8697j7318j5956j4714
$$ 749366 727881 706202 684166 662301 641107 620650 600923 582226 564908 548952 534238
53314E34238j3178j1124r108p838p247o685n946n434n307n063m274l182k218j371
$$ 534238 521060 509936 500828 492990 485743 479058 473112 467678 462371 457308 453034 449852 447634 446263
53300D46263m66K66M64L46O65J805L226M055M075L900M160M747N078N066N378
$$ 446263 445797 446063 446527 446873 447538 449343 452569 456624 460699 464599 468759 473506 478584 483650 489028
53285D89028O571Q353R904J0745J0917J0719J0611J1077J2045J2736J2619J2261
$$ 489028 495599 503952 513856 524601 535518 546237 556848 567925 579970 592706 605325 617586
53273F17586J2510J3140J3170J2392J1524J0825R652P763O061N386N370N054M059
$$ 617586 630096 643236 656406 668798 680322 691147 700799 708562 714623 720009 725379 730433 734492
53260G34492K607J023k29o51m40n54j527k793l769m874o698q784j0141j0678j1126
$$ 734492 737099 738122 737893 737242 736802 736248 734721 731928 728159 723285 716587 707803 697662 686984 675858
53245F75858j1887j2805j3872j5200j6365j6717j6420j6406j7074j7719j7489
$$ 675858 663971 651166 637294 622094 605729 589012 572592 556186 539112 521393 503904
53234E03904j6343j4889j3695j2939j2442j1950j1547j1655j2330j2921j2790
$$ 503904 487561 472672 458977 446038 433596 421646 410099 398444 386114 373193 360403
53223C60403j2168j1701j1459j1052j0491j0138r934r458q815q581q704q357p156
$$ 360403 348235 336534 325075 314023 303532 293394 283460 274002 265187 256606 247902 239545 232389
53210B32389n780m986m690m437m204m169m179l987l706l555l398l044k701k764
$$ 232389 226609 221623 216933 212496 208292 204123 199944 195957 192251 188696 185298 182254 179553 176789
53196A76789l250l802m162m313m299m177m039l824l282k343j347p12m80m83p23
$$ 176789 173539 169737 165575 161262 156963 152786 148747 144923 141641 139298 137951 137239 136759 136276 135553
53181A35553j255j820k006j736j315j029r82j301k048k821k840j789m15J16n85
$$ 135553 134298 132478 130472 128736 127421 126392 125410 124109 122061 119240 116400 114611 114196 114312 113727
53166A13727j781k423k123j258m32n1k53q78j482j628j319r36p26n10r6K73J60
$$ 113727 111946 109523 107400 106142 105710 105659 105406 104528 103046 101418 100099 99163 98437 97927 97831 98104 98264
53149I8264m54j077j265j041o97l55M8M76O85N02O7k80l88m14n12n55l64j02j53
$$ 98264 97810 96733 95468 94427 93730 93375 93423 93899 94584 95086 95153 94873 94485 94071 93559 93004 92640 92538 92385
53130I2385n44p95n13N1K68j30p65j047p03N3P52J048R52P23N51L83Q0m10r89
$$ 92385 91841 91046 90533 90584 90852 90722 89957 88910 88207 88260 89012 90060 91012 91735 92286 92669 92749 92339 91350
53111I1350j377j156j43J175J877J539P19K51K62K02k73q96j243j185p70n6O40
$$ 91350 89973 88817 88674 89849 91726 93265 93984 94235 94497 94699 94426 93530 92287 91102 90332 90276 90916
53094I0916O07n71k234l035k376j115m58m45j86N84R80L66n02m05O85J683J879
$$ 90916 91523 90952 88718 85683 83307 82192 81734 81289 81103 81687 82667 83033 82531 82126 82811 84494 86373
53077H6373J560J187P73K68j28k98l01JQ89K111K811K547J763J116P66P23J188
$$ 86373 87933 89120 89893 90161 90033 89735 89434 89435 90324 92435 95246 97793 99556 100672 101438 102161 103349
53060A03349K049K591K328J710J428J337P23n37j732k154j797j219j073j566k168
$$ 103349 105398 107989 110317 112027 113455 114792 115515 114978 113246 111092 109295 108076 107003 105437 103269
53045A03269k101j382r50j398k083k080j508j212j388j469j236j194j662k199
$$ 103269 101168 99786 98836 97438 95355 93275 91767 90555 89167 87698 86462 85268 83606 81407
53031H1407k244j813j336j118j074q62k54M65O52Q6o17p77n18m34o69q49p96o22
$$ 81407 79163 77350 76014 74896 73822 72960 72706 73171 73823 73909 73292 72515 71997 71563 70894 70045 69249 68627
53013F8627k34N88J593K140J947J347O99K1p11j361j748j677r93L6N91J85m95
$$ 68627 68393 68981 70574 72714 74661 76008 76707 76728 76017 74656 72908 71231 70238 70274 70865 71050 70555
52996G0555l47N56R80K26r15j287p98k66k89o81r09p17l45j94k72j61K63M35j19
$$ 70555 70208 70764 71744 71970 71055 69768 68970 68704 68415 67734 66825 66108 65763 65569 65297 65136 65399 65834 65715
52977F5715r49j228r10o31n70k67M03R27J035J077J210J014L33j30K85J179J498
$$ 65715 64766 63538 62628 61997 61427 61160 61563 62490 63525 64602 65812 66826 67159 67029 67314 68493 69991
52960F9991P76m22j151j016m84l13n39l31O91J516Q75p97j672q81N22J251J322
$$ 69991 70767 70345 69194 68178 67694 67381 66842 66511 67202 68718 69593 68796 67124 66243 66765 68016 69338
52943F9338J305J126N04k03n32p72j394j972j668n35N08R26J039J231J400J341
$$ 69338 70643 71769 72273 72070 71538 70766 69372 67400 65732 65197 65705 66631 67670 68901 70301 71642
52927G1642J129Q99O24K30k02m50k15O13J657K248K138J802J765J861J574Q70
$$ 71642 72771 73670 74294 74524 74322 73872 73657 74270 75927 78175 80313 82115 83880 85741 87315 88185
52911H8185L20M00R40J330J104L61l41n77n19n88q07q50p05p32j014j201j177
$$ 88185 88505 88905 89845 91175 92279 92640 92299 91722 91203 90615 89808 88958 88253 87521 86507 85306 84129
52894H4129j301j692j920j692j342j154q95m05j28m17q15p29l58k85m39k90J79
$$ 84129 82828 81136 79216 77524 76182 75028 74133 73728 73600 73183 72368 71639 71281 70996 70557 70267 70446
52877G0446L92R4l68o47p33o65l80O5M48O23N68L50K62O48J316J473P46j61l40
$$ 70446 70838 70932 70564 69917 69184 68519 68139 68204 68652 69275 69843 70193 70455 71103 72419 73892 74638 74477 74137
52858G4137R9M03M23O36J087J167O26l5l94o38r34r32l59L35M64Q2j20J44K39
$$ 74137 74236 74639 75062 75698 76785 77952 78578 78543 78149 77511 76577 75645 75286 75621 76085 76167 76047 76191 76430
52839G6430n65j967k749k190r76k98k93j04N84R37L04p66j400j623j909k102j759
$$ 76430 75865 73898 71149 68959 67983 67685 67392 67288 67872 68809 69113 68347 66947 65324 63415 61313 59554
52822E9554j142q41o98j24O19N77l45j096j026o73o44o41j71N24R27J004R63P49
$$ 59554 58412 57571 56873 56749 57368 57945 57600 56504 55478 54805 54161 53520 53349 53873 54800 55804 56767 57516
52804E7516L72K99Q49J569J756J391J005Q93J037J536K395L068K893K043J393
$$ 57516 57888 58187 59036 60605 62361 63752 64757 65650 66687 68223 70618 73686 76579 78622 80015
52789H0015J263R87O6q74q62K7P07M76k31o33o12o15q51j083j075q93p13o57p47
$$ 80015 81278 82265 82331 81457 80595 80622 81329 81805 81574 80941 80329 79714 78863 77780 76705 75812 75099 74442 73695
52770G3695q18n36J68P64O14j97r47j214j178j003n30J26L43k03r69j336j468
$$ 73695 72877 72341 72509 73273 73887 73690 72743 71529 70351 69348 68818 68944 69287 69084 68115 66779 65311
52753F5311j835k175j746m28J003J739J642J124O88N53M79Q4m19k04J071K529
$$ 65311 63476 61301 59555 59127 60130 61869 63511 64635 65323 65876 66355 66439 66020 65816 66887 69416
52737F9416K947K148R73J50k02j92k1q3n68j084j211j243j636j983j443j45Q04
$$ 69416 72363 74511 75484 75634 75432 75240 75219 75136 74568 73484 72273 71030 69394 67411 65968 65823 66627
52720F6627Q30M78L02O5n07r83q65l95j91m28p67q22m46J85N67L10l22o54m38
$$ 66627 67457 67935 68237 68302 67795 66812 65947 65552 65361 64933 64166 63344 62898 63083 63650 63960 63638 62984 62546
52701F2546%L59N88N07j27j017j458j223o72M7J065J917J657K96p91n68L59P94
$$ 62546 62546 62905 63493 64000 63873 62856 61398 60175 59503 59550 60615 62532 64189 64485 63694 63126 63485 64279
52683F4279N44J50l02j089j927k058j213J56J413K087J968J375J019J113J037
$$ 64279 64823 64973 64671 63582 61655 59597 58384 58540 59953 62040 64008 65383 66402 67515 68552
52668F8552L98j95r6K32m8o97q19m27m13r61j178n25M05R61J308J739J901J412
$$ 68552 68950 68755 68659 68891 68843 68146 67327 66900 66487 65526 64348 63823 64228 65189 66497 68236 70137 71549
52650G1549O92M73Q47J361J804K357L113L910M549M825M433L246J636K14q15j688
$$ 71549 72241 72714 73561 74922 76726 79083 82196 86106 90655 95480 99913 103159 104795 105009 104194 102506
52634A02506k486k869k629k242k430l193l647l047j705o45n04j021j540j589j024
$$ 102506 100020 97151 94522 92280 89850 86657 83010 79963 78258 77613 77109 76088 74548 72959 71935
52619G1935o2O95O75Nn73o07m16m26n03l14l9j83q74j753k366k332j383K27J526
$$ 71935 71873 72568 73243 73248 72675 72068 71652 71226 70723 70409 70370 70187 69313 67560 65194 62862 61479 61706 63232
52600F3232J564M69o93j026n52J09L49J1m34k47O99J546J486R28R28J568J748
$$ 63232 64796 65265 64572 63546 62994 63103 63452 63463 63029 62782 63481 65027 66513 67441 68369 69937 71685
52583G1685P82o11j339j250r54p89o26l74j20J05L00L62L55O20J294J906J850
$$ 71685 72467 71856 70517 69267 68313 67524 66898 66524 66404 66509 66809 67171 67526 68146 69440 71346 73196
52566G3196J167M34jk37l69l27j78r7j2L15P77R24O69N23P87J006N70l79j158
$$ 73196 74363 74797 74796 74559 74190 73863 73685 73588 73576 73891 74668 75592 76261 76784 77571 78577 79147 78768 77610
52547G7610j442j468j440j255q52m17n9L08O18N83J40l07m10l28m00o37p77o63
$$ 77610 76168 74700 73260 72005 71153 70736 70677 70985 71603 72186 72326 72019 71609 71281 70881 70244 69467 68804
52529F8804k49N03J338J609R07l01j147j366j343j224o89K48Q09L60p01j371j233
$$ 68804 68555 69058 70396 72005 72912 72611 71464 70098 68755 67531 66842 67090 67899 68259 67558 66187 64954
52512F4954p76n68n06p6P96J441J164J85m61j83L77K51m98q77l69M75R54J013
$$ 64954 64178 63610 63104 63028 63824 65265 66429 66614 66153 65970 66347 66598 66100 65223 64854 65329 66283 67296
52494F7296R04O67L77L49O44P70L54k04l12r9j30m20l66L25J166J522J315Q92
$$ 67296 68200 68867 69244 69593 70237 71007 71361 71157 70845 70746 70616 70196 69830 70155 71321 72843 74158 75050
52476G5050M76n8q55j626j695o81Q40J707J385N09O5K99P00P26K49m87j027j003
$$ 75050 75526 75468 74613 72987 71292 70611 71451 73158 74543 75052 75117 75416 76116 76842 77091 76604 75577 74574
52458G4574n30j33q7p7K42P32J081J288J445J358Q66K44j10k07k53j94R1M17N97
$$ 74574 74044 73911 73824 73747 73989 74721 75802 77090 78535 79893 80759 81003 80893 80686 80433 80239 80330 80747 81344
52439H1344Q04J135J165M99m87j114j316j403j242n19L53N36L3l17j44J4j88k80
$$ 81344 82148 83283 84448 84947 84460 83346 82030 80627 79385 78866 79219 79755 79788 79471 79327 79341 79153 78873
52421G8873J61P58R70Q35P22P90J068J554J929J628N84n41j116j212j169j045
$$ 78873 79034 79792 80762 81597 82319 83109 84177 85731 87660 89288 89872 89331 88215 87003 85834 84789
52405H4789p26k64K90R44J486J529J063N36J73k42o60m98M08J190R22k20j256
$$ 84789 84063 83799 84089 85033 86519 88048 89111 89647 89820 89578 88918 88420 88828 90018 90940 90720 89464
52388H9464j597j348p90q5N99J169J617J775J294K66n77o98m92o59j224j643j599
$$ 89464 87867 86519 85729 85644 86243 87412 89029 90804 92098 92364 91787 91089 90597 89938 88714 87071 85472
52371H5472j122k44Q60J575J404O83K18K43L87M57O56R78J118J046J086J275J205
$$ 85472 84350 84106 84966 86541 87945 88628 88846 89089 89476 89933 90589 91567 92685 93731 94817 96092 97297
52354I7297P47L58M32P23P55N03L16L51L18j36q55j102k91J163K072J857J329
$$ 97297 98044 98402 98834 99557 100312 100815 101131 101482 101800 101664 100809 99707 99416 100579 102651 104508 105837
52337A05837J615K625L247K822J732N89l38q03n09K32N14n6p51o81O6P91J145
$$ 105837 107452 110077 113324 116146 117878 118467 118129 117326 116817 117049 117563 117507 116756 116075 116141 116932 118077
52320A18077J244J099O36J19LL31P52J125J622K200K436K100J572J442J874K550
$$ 118077 119321 120420 121056 121175 121178 121509 122261 123386 125008 127208 129644 131744 133316 134758 136632 139182
52304A39182L058L187K931K458K037J875K019K448L136L913M313L907K875J963
$$ 139182 142240 145427 148358 150816 152853 154728 156747 159195 162331 166244 170557 174464 177339 179302
52290A79302J683J731J458Q24M17N58R23J148J369J735J892J477Q23N72P07O08
$$ 179302 180985 182716 184174 184998 185415 185973 186896 188044 189413 191148 193040 194517 195340 195912 196619 197227
52274A97227J01k67j22J68J97K04N78J114J306J153J152J481J729J473R02O00
$$ 197227 197328 197061 196939 197107 197304 197508 198086 199200 200506 201659 202811 204292 206021 207494 208396 208996
52258B08996R17J616K166K331K369K555K627K135J314J121J989L050L171K474
$$ 208996 209913 211529 213695 216026 218395 220950 223577 225712 227026 228147 230136 233186 236357 238831
52244B38831K174K870L793L905L172K285J633J141Q92J200J993K609K527K031
$$ 238831 241005 243875 247668 251573 254745 257030 258663 259804 260696 261896 263889 266498 269025 271056
52230B71056J814K135K601K767K616K377K170K048K207K818L642M114L902L271
$$ 271056 272870 275005 277606 280373 282989 285366 287536 289584 291791 294609 298251 302365 306267 309538
52216C09538K740K538K562K731L118L724M324M644M601M302L878L394K883K477
$$ 309538 312278 314816 317378 320109 323227 326951 331275 335919 340520 344822 348700 352094 354977 357454
52202C57454K423K968M021M940M916L780K406K030L045M617N545N312M209K714
$$ 357454 359877 362845 366866 371806 376722 380502 382908 384938 387983 392600 398145 403457 407666 410380
52188D10380J179k9n88o13o30r27j242j309j340j570j701j374r20r96j531j781
$$ 410380 411559 411530 410942 410329 409699 408772 407530 406221 404881 403311 401610 400236 399316 398320 396789 395008
52172C95008j471j153j149j032n68m46j268k389k624j900j263j375j783j845j554
$$ 395008 393537 392384 391235 390203 389635 389189 387921 385532 382908 381008 379745 378370 376587 374742 373188
52157C73188j211r36q53j227k011k643k602j928j042l68k81r43j875k202j666
$$ 373188 371977 371041 370188 368961 366950 364307 361705 359777 358735 358367 358086 357143 355268 353066 351400
52142C51400j062j243k043k610k502j934j234n70j60j79m84q24j233j864k474
$$ 351400 350338 349095 347052 344442 341940 340006 338772 338202 338042 337863 337379 336555 335322 333458 330984
52127C30984k550j955j104n18m78r50j545j635j011l01k76q73j440j759k137k567
$$ 330984 328434 326479 325375 324857 324379 323429 321884 320249 319238 318937 318661 317788 316348 314589 312452 309885
52111C09885k575k066j527j122m28N56J022N50pL51J345J935J890J889K308K770
$$ 309885 307310 305244 303717 302595 302167 302723 303745 304295 304288 304639 305984 307919 309809 311698 314006 316776
52095C16776L000L251L714M154M345M406M452M350L984L463K893K253J614J195
$$ 316776 319776 323027 326741 330895 335240 339646 344098 348448 352432 355895 358788 361041 362655 363850
52081C63850J150J473K063K618K642J938J098R29J429J865J866J795J868J648
$$ 363850 365000 366473 368536 371154 373796 375734 376832 377761 379190 381055 382921 384716 386584 388232
52067C88232Q47N4O9Q33J568J793J693J633J728J890J965J801J438J176J252J484
$$ 388232 389079 389133 389202 390035 391603 393396 395089 396722 398450 400340 402305 404106 405544 406720 407972 409456
52051D09456J414P86k14j090j317p46J39N40J44n90j071j235j379j631j952k338
$$ 409456 410870 411656 411442 410352 409035 408289 408428 408968 409112 408522 407451 406216 404837 403206 401254 398916
52035C98916k687k718k444k459l200m130m303l654l086l193l560l573l241k844
$$ 398916 396229 393511 391067 388608 385408 381278 376975 373321 370235 367042 363482 359909 356668 353824
52021C53824k305j429m75O9J26nj34k77l73l13k69n57j124j532j571j580j905
$$ 353824 351519 350090 349615 349684 349810 349805 349671 349394 349021 348708 348439 347882 346758 345226 343655 342075 340170
52004C40170k271k025r92J04K49q49k453l545l869m009m496n097n242m876m480
$$ 340170 337899 335874 334882 334986 335235 334386 331933 328388 324519 320510 316014 310917 305675 300799 296319
51989B96319m360m346m243m167m188m093l710l239k915k660k379k414l232m743
$$ 296319 291959 287613 283370 279203 275015 270922 267212 263973 261058 258398 256019 253605 250373 245630
51975B45630o390p753q677q939q416p571p125p056o600n512m608m507m558l796
$$ 245630 239240 231487 222810 213871 205455 197884 190759 183703 177103 171591 166983 162476 157918 154122
51961A54122k495j863k321l000l001k344j572j053r66j291j543j105q9O37N80
$$ 154122 151627 149764 147443 144443 141442 139098 137526 136473 135507 134216 132673 131568 131479 132116 132696
51946A32696J57j88o82j495j939j252J36R30M92n75j321j386j018p26r01j406
$$ 132696 132853 132665 131983 130488 128549 127297 127433 128363 128855 128280 126959 125573 124555 123829 122928 121522
51930A21522j575j017k96k52q06j115r23r11j447j827j325l72Pm02q97r40o99
$$ 121522 119947 118930 118634 118382 117576 116461 115538 114627 113180 111353 110028 109656 109663 109261 108364 107424 106725
51913A06725m86k75N0M01O68R02J156J321J265R65M63j34n22m02J05M83M77M27
$$ 106725 106239 105964 106014 106415 107083 107985 109141 110462 111727 112692 113155 113021 112499 112097 112202 112685 113162 113589
51895A13589O77R25O45J2j84L60J013J118Q25O08M36O8j67L59J507K371K457K242
$$ 113589 114266 115191 115836 115848 115664 116024 117037 118155 118980 119588 120024 120092 119925 120284 121791 124162 126619 128861
51877A28861K308K570K773L045L517L861L901M240N548P546R394J0861J2300J3661
$$ 128861 131169 133739 136512 139557 143074 146935 150836 155076 160624 168170 177564 188425 200725 214386
51863B14386J4528J5262J7061K0462K4567K8229L1218L3475L3825L0435K2498
$$ 214386 228914 244176 261237 281699 306266 334495 365713 399188 433013 463448 485946
51852D85946J0939k351j5323k5996l2867l5632l5262l3128l0141k6743k3328k0326
$$ 485946 496885 494534 479211 453215 420348 384716 349454 316326 286185 259442 236114 215788
51840B15788j7963j6064j4170j1902r311o905n218m380m030l638k899k016j549
$$ 215788 197825 181761 167591 155689 146378 139473 134255 129875 125845 122207 119308 117292 115743
51827A15743j756k070j687p78m96j400k460k317j166l86n68q44m14K88M73K11
$$ 115743 113987 111917 110230 109452 108956 107556 105096 102779 101613 101227 100659 99815 99401 99689 100162 100373
51811A00373J29L78N87N24K07l90j140j509j129m32j89m54o57n70n02n51l79P3
$$ 100373 100502 100880 101467 101991 102198 101808 100668 99159 98030 97598 97409 96955 96298 95728 95226 94675 94296 94369
51793I4369L31N9n71j330k115k458j753l96P4j118k590k298j91J675J627J12j266
$$ 94369 94700 94759 94188 92858 90743 88285 86532 86136 86210 85092 82502 80204 80013 81688 83315 83427 82161
51776H2161j582j059k94L77R41J473J873J826J283P36O76Q72P37L62M55J097J410
$$ 82161 80579 79520 79226 79603 80544 82017 83890 85716 86999 87735 88411 89283 90020 90382 90837 91934 93344
51759I3344Q25o3m54n25q32j069m11R73J783J169k12j054q42q7M70M91O5n30j013
$$ 93344 94169 94106 93652 93127 92295 91226 90815 91788 93571 94740 94528 93474 92632 92545 93015 93506 93571 93041 92028
51740I2028j224j157r50q08q17q00m94l0R4l20p83p74n08n47q13o58P1O88O47
$$ 92028 90804 89647 88697 87889 87072 86272 85778 85748 85842 85522 84739 83965 83457 82910 82097 81439 81510 82198 82845
51721H2845K91K40N25P28O78M99J65l81q31p15p4M91N85M33L57K53j29o16p62
$$ 82845 83136 83376 83901 84629 85307 85806 85971 85590 84759 84044 83970 84461 85046 85479 85836 86089 85960 85344 84582
51702H4582n06l01m52p01o46l70k86m64m78l9N56Q04N90K17m1j09L9L97Q13J059
$$ 84582 84076 83775 83323 82622 81976 81606 81320 80856 80378 80339 80895 81699 82289 82506 82465 82356 82395 82792 83605 84664
51682H4664J024P10O7q58j699j979j579p86J49J160J973K093J415O03M39R56J545
$$ 84664 85688 86398 86465 85607 83908 81929 80350 79564 79713 80873 82846 84939 86354 86957 87396 88352 89897
51665H9897J823J920J963J779J277P99O53O17L20j1L59J627K943L269K533J608
$$ 89897 91720 93640 95603 97382 98659 99458 100111 100728 101048 101037 101396 103023 105966 109235 111768 113376
51649A13376J267J467J621J290M96l16o31m01k43p96j869k565k354j659j199j210
$$ 113376 114643 116110 117731 119021 119517 119201 118570 118169 117926 117130 115261 112696 110342 108683 107484 106274
51633A06274j494j811j896j470o96k67n95j217j424j185q71m64K26Q02O45k6l32
$$ 106274 104780 102969 101073 99603 98907 98640 98045 96828 95404 94219 93348 92884 93110 93912 94557 94531 94199
51616I4199j15j96r50j524j100j31L67K58J86L42K37l66r56r30l40K82N59N62
$$ 94199 94084 93888 92938 91414 90314 90183 90550 90808 90994 91336 91573 91207 90251 89321 88981 89263 89822 90384
51598I0384O14Q16Q41L46m07o52n0Q50J284J205J075J073R89P84O91P24N79J61
$$ 90384 90998 91814 92655 93001 92594 91942 91892 92742 94026 95231 96306 97379 98368 99152 99843 100567 101146 101307
51580A01307j97k72l45p83j374j430n56P83J599J256L0j141j439o82O99J995K578
$$ 101307 101110 100838 100493 99710 98336 96906 96350 97133 98732 99988 100018 98877 97438 96756 97455 99450 102028
51563A02028K261J494R72R42J124J314J724K463L041K891K128J390R70N77Pm95
$$ 102028 104289 105783 106755 107697 108821 110135 111859 114322 117363 120254 122382 123772 124742 125319 125326 124831
51547A24831o68o05n30m27k22r0l46j064j985k665k614j557J54J490J571O35j33
$$ 124831 124163 123558 123028 122601 122379 122289 121943 120879 118894 116229 113615 112058 112212 113702 115273 115908 115775
51530A15775J1M66J32j025j850j524o01k08o18j220j553j736j858j696j228r35
$$ 115775 115786 116252 116384 115359 113509 111985 111384 111176 110558 109338 107785 106049 104191 102495 101267 100332
51514A00332j218j896k431k435j822q86l56q28j879k243j316lM37o8o18p30o91
$$ 100332 99114 97218 94787 92352 90530 89644 89288 88460 86581 84338 83022 83019 83456 83388 82770 82040 81349
51497H1349p13n67j78J29J55P9K3j22k67l3O34J208J251R73Q44R69J120J164J080
$$ 81349 80636 80069 79891 80020 80175 80254 80277 80155 79888 79855 80489 81697 82948 83921 84765 85734 86854 88018 89098
51478H9098P80K32l29o26o68o54o53n40j95M41J364K392L118L212K751K095J485
$$ 89098 89878 90110 89781 89155 88487 87833 87180 86640 86445 86886 88250 90642 93760 96972 99723 101818 103303
51461A03303R83P41J043J906K828L179K833K246J879J750J605J346R82L05j001
$$ 103303 104286 105027 106070 107976 110804 113983 116816 119062 120941 122691 124296 125642 126624 126929 125928
51446A25928k755m127m389l683k835k459k450k265j516l77M35K38p95j618j374
$$ 125928 123173 119046 114657 110974 108139 105680 103230 100965 99449 99072 99507 99745 98950 97332 95958
51431I5958l55M61O64O82Q51R08O62M96P20Q22Q6j164j662p48O64J129L83m50
$$ 95958 95603 96064 96728 97410 98261 99169 99831 100327 101047 101869 101955 100791 99129 98381 99045 100174 100557 100107
51413A00107m12J52K32m42j213j574j758k057k188j828j367j458j938j986j321
$$ 100107 99695 99847 100079 99637 98424 96850 95092 93035 90847 89019 87652 86194 84256 82270 80949
51398H0949n99l94m07j36K05R3l07k56M18Q73K93j065k084j965r03K85R44R95
$$ 80949 80350 79956 79549 79413 79618 79711 79404 79148 79566 80439 80732 79667 77583 75618 74715 75000 75944 76939
51380G6939Q04P37Q60R55Q06M42O2k25m41n43l78Q2O27J034J300J445J293P10
$$ 76939 77743 78480 79340 80295 81101 81543 81605 81380 80939 80396 80018 80100 80727 81761 83061 84506 85799 86509
51362H6509rl64k77j84l92o96p01k99L45R88J363J347J141J017Q26K18n50p05
$$ 86509 86500 86136 85859 85675 85283 84587 83886 83587 83932 84920 86283 87630 88771 89788 90614 90832 90282 89577
51344H9577j15K62l00j215j472j175j175j496j248j73P36O23q5l87m7L74M34K48
$$ 89577 89462 89724 89424 88209 86737 85562 84387 82891 81643 81470 82206 82829 82744 82357 82310 82684 83118 83366
51326H3366R9Q2R7ok73n62o77n98m23j68K44Q03J410J925K057J469K61r07j535
$$ 83366 83465 83547 83644 83638 83365 82803 82126 81528 81105 80937 81181 81984 83394 85319 87376 88845 89106 88199 86664
51307H6664j878k313k551k197j722j888k365k005o61M46N40L41O57J034O91pj36
$$ 86664 84786 82473 79922 77725 76003 74115 71750 69745 69084 69530 70070 70411 71068 72102 72793 72786 72650
51290G2650K66L73mj84K43R56J601K198K703K864K725K652K749K669K223J736
$$ 72650 72916 73289 73285 73101 73344 74300 75901 78099 80802 83666 86391 89043 91792 94461 96684 98420
51274I8420J605J797J954J810J318N91k07r95j787k498k879k818k546k280j904
$$ 98420 100025 101822 103776 105586 106904 107495 107288 106293 104506 102008 99129 96311 93765 91485 89581
51259H9581j238n09j47k55n46q02j018j143r53l20N72J275J329O37k88p08m46
$$ 89581 88343 87834 87687 87432 86886 86084 85066 83923 82970 82650 83222 84497 85826 86463 86175 85467 85021
51242H5021p5j13l44k62J72O37J087J655K141K101J481P50L11J37Rk21o00r94
$$ 85021 84946 84833 84489 84227 84399 85036 86123 87778 89919 92020 93501 94251 94562 94699 94708 94487 93887 92893
51224I2893j081o93j00L31N86Q20R03O39K73K76O62R72R70Q55P82O11K38k52p54
$$ 92893 91812 91119 91019 91350 91936 92756 93659 94298 94571 94847 95509 96481 97451 98306 99088 99699 99937 99685 98931
51205I8931j156j138m52N47J126R90N02N4l78r11j421j714j668j239n75j08j01
$$ 98931 97775 96637 96185 96732 97858 98848 99350 99404 99026 98115 96694 94980 93312 92073 91498 91390 91289
51188I1289k02Q2N00L63k89n94j44L83K73k36m99l75j13J87M59M29J01K1N01R48
$$ 91289 91087 91169 91669 92032 91743 91149 91005 91388 91661 91425 90926 90551 90438 90625 91084 91513 91614 91635 92136 93084
51168I3084O08l19r61r37n62n5O07J142J034M25J80P39J406J248K95n32n43O7
$$ 93084 93692 93373 92412 91475 90913 90858 91465 92607 93641 94066 94246 94985 96391 97639 97934 97402 96859 96926
51150I6926O18O79M02K71O17J304J891J985J476N66k53m82j00K71P8l90k95N85
$$ 96926 97544 98223 98625 98896 99513 100817 102708 104693 106169 106735 106482 106000 105900 106171 106249 105859 105564 106149
51132A06149J460J470P09n3l50l42l01k50r8J78N51Q82Q76M56J55O43J721K293
$$ 106149 107609 109079 109788 109735 109385 109043 108742 108492 108394 108572 109123 110005 110881 111337 111492 112135 113856 116149
51114A16149J672M31m58r11j499k296k720k527k105j723j216o64n43q81r62m19
$$ 116149 117821 118252 117794 116883 115384 113088 110368 107841 105736 104013 102797 102133 101590 100709 99747 99328
51098I9328Q7o8m33k65J64Q7l22j53P45J517J652J518J402J032M37K45O45R00
$$ 99328 99415 99347 98914 98649 98813 98900 98578 98425 99170 100687 102339 103857 105259 106291 106728 106973 107618 108518
51080A08518N73L76J004J841J770Q41J00L3J54N7n4k9j44n15p80p28o90r59j242
$$ 108518 109091 109467 110471 112312 114082 114923 115023 115056 115210 115267 115213 115184 115040 114525 113745 113017 112327 111368 110126
51061A10126j050l44N01J160J434J127K65p13j295j440j408j173m26P24J536J493
$$ 110126 109076 108732 109233 110393 111827 112954 113219 112506 111211 109771 108363 107190 106764 107488 109024 110517
51045A10517J014Q04P69K26p68j156l31R05J422J311J481K058K164J355L24n9
$$ 110517 111531 112335 113104 113330 112562 111406 111075 111980 113402 114713 116194 118252 120416 121771 122095 122036
51029A22036K80R63J720K239K092J330O65N43N43J91j25K24J028J441J136N25
$$ 122036 122316 123279 124999 127238 129330 130660 131325 131868 132411 132602 132477 132701 133729 135170 136306 136831
51013A36831M2k16k42j12j34m11m13L88J538K004J553J020J125J721K431L195
$$ 136831 136873 136657 136415 136303 136169 135758 135345 135733 137271 139275 140828 141848 142973 144694 147125 150320
50997A50320L929M243M010L689L684L877M114M558N139N251M702M368N047O020
$$ 150320 154249 158492 162502 166191 169875 173752 177866 182424 187563 192814 197516 201884 206931 212951
50983B12951N800M208K640K082J877J034j39n26J61J179K006K893M024M944N196
$$ 212951 218751 222959 225599 227681 229558 230592 230453 229927 230088 231267 233273 236166 240190 245134 250330
50968B50330N044N126N674O439P157P702P946P880P797Q067Q738R536J0218J0714
$$ 250330 255374 260500 266174 272613 279770 287472 295418 303298 311095 319162 327900 337436 347654 358368
50954C58368J1052J1422J2093J2943J3255J2537J1410J1046J1580J1813J0659
$$ 358368 369420 380842 392935 405878 419133 431670 443080 454126 465706 477519 488178
50943D88178Q281N470K590k67k747m618o412q834j1661j3930j5231j6114j7088
$$ 488178 496459 501929 504519 504252 501505 496887 490475 481641 469980 456050 440819 424705 407617
50930D07617j7882j7965j7300j6214j4990j3846j3015j2457j1690j0264q367o677
$$ 407617 389735 371770 354470 338256 323266 309420 296405 283948 272258 261994 253627 246950
50918B46950n694n367n315n205m860m239l453k785k456k306j865r76j66j7j98
$$ 246950 241256 235889 230574 225369 220509 216270 212817 210032 207576 205270 203405 202429 202263 202246 202048
50903B02048K63J534K428J867M59j85N25J595J987J784J534J215N41j46q1R51
$$ 202048 202311 203845 206273 208140 208599 208414 208939 210534 212521 214305 215839 217054 217595 217449 217368 218319
50887B18319K296L231L644L833L928L802L469L312L813N034O561P906Q875R465
$$ 218319 220615 223846 227490 231323 235251 239053 242522 245834 249647 254681 261242 269148 278023 287488
50873B87488R730R951J0689J2223J3995J5093J5230J4909J4629J4385J3984J3338
$$ 287488 297218 307169 317858 330081 344076 359169 374399 389308 403937 418322 432306 445644
50861D45644J2236J0340P762N331L866L501L903M813N984O981P598Q294R605J1285
$$ 445644 457880 468220 475982 481313 485179 488680 492583 497396 503380 510361 517959 526253 535858 547143
50847E47143J2553J3190J3753J4565J5172J5226J5389J6651J8982K1270K2700
$$ 547143 559696 572886 586639 601204 616376 631602 646991 663642 682624 703894 726594
50836G26594K3648K4957K6759K8447K9613L0466L1161L1165K9576K5973K0778
$$ 726594 750242 775199 801958 830405 860018 890484 921645 952810 982386 1008359 1029137
50825A029137J4876R077L756j240o351j1755j7066k1695k5397k8312l0541l2006
$$ 1029137 1044013 1053090 1056846 1055606 1049255 1037500 1020434 998739 973342 945030 914489 882483
50813H82483l2738l2964l2744l1800k9930k7452k5068k3220k1759k0147j7992
$$ 882483 849745 816781 784037 752237 722307 694855 669787 646567 624808 604661 586669
50802E86669j5310j2361r340o315l502j282K42J523L137N032O492O870O198N080
$$ 586669 571359 558998 549658 543343 539841 538559 538801 540324 543461 548493 554985 561855 568053 573133
50788E73133M139L574L096K343J422Q54P83N16p51k899m959o207o687o708o409
$$ 573133 577272 580846 583942 586285 587707 588561 589344 589860 589109 586210 581251 575044 568357 561649 555240
50773E55240n956n609n333m793l913k979j997m17K088N037P735J0062J2177J3823
$$ 555240 549284 543675 538342 533549 529636 526657 524660 524243 526331 531368 539103 549165 561342 575165
50759E75165J4500J4162J3120J1402Q719N138J347j853m048n189n527n533n660
$$ 575165 589665 603827 616947 628349 637068 642206 643553 641700 637652 632463 626936 621403 615743
50746F15743o001o367o654o815o608n717m223k643j323o4J482L222M606N239N382
$$ 615743 609742 603375 596721 589906 583298 577581 573358 570715 569392 569328 570810 574032 578638 583877 589259
50731E89259N744O730P959Q668Q593Q226Q169Q531R076R620J0006J0025R760R783
$$ 589259 595003 601733 609692 618360 626953 635179 643348 651879 660955 670575 680581 690606 700366 710149
50717G10149J0635J2199J3959J5674J7329J8562J8742J7731J6011J3979J1520
$$ 710149 720784 732983 746942 762616 779945 798507 817249 834980 850991 864970 876490
50706H76490Q517N331K456L6j990l538m507n065n506n930o322o912q091r969j2188
$$ 876490 885007 890338 892794 892830 890840 887302 882795 877730 872224 866294 859972 853060 844969 835000 822812
50691H22812j4244j5774j6524j6269j4961j2850j0281p326l838J41M168P773J0962
$$ 822812 808568 792794 776270 760001 745040 732190 721909 714583 710745 710886 715054 722827 733789
50678G33789J4062J7087J9541K1012K1721K2217K2698K2823K2196K0865J9312
$$ 733789 747851 764938 784479 805491 827212 849429 872127 894950 917146 938011 957323
50667I57323J8060J7244J6550J5674J4773J4235J3967J3306J1897J0318R458R533
$$ 957323 975383 992627 1009177 1024851 1039624 1053859 1067826 1081132 1093029 1103347 1112805 1122338
50655A122338J0187J1330J3241J5755J8028J9425K0257K1212K2246K2475K1106
$$ 1122338 1132525 1143855 1157096 1172851 1190879 1210304 1230561 1251773 1274019 1296494 1317600
50644A317600J8272J4823J1453Q199M713Q84l032o759j0184j3168j5531j7430
$$ 1317600 1335872 1350695 1362148 1370347 1375060 1375944 1372912 1366153 1355969 1342801 1327270 1309840
50632A309840j9380k1547k3300k3902k3472k2773k2154k1207j9616j7730j6186
$$ 1309840 1290460 1268913 1245613 1221711 1198239 1175466 1153312 1132105 1112489 1094759 1078573
50621A078573j5271j4850j4537j3762j2058r558o969m819k907p35J709L747M527
$$ 1078573 1063302 1048452 1033915 1020153 1008095 998537 991568 986749 983842 983107 984816 988563 993090
50608I93090L626J294j775n050q508j2249j5906j8846k0944k2654k4113k4688
$$ 993090 996716 998010 996235 991185 982677 970428 954522 935676 914732 892078 867965 843277
50596H43277k3806k1908k0042j8713j7532j5939j3802j1262q450n600l159j478
$$ 843277 819471 797563 777521 758808 741276 725337 711535 700273 691823 686223 683064 681586
50584F81586l64P40K049L065L186K527J786J210K28j567l529m565m470m001l720
$$ 681586 681222 681962 684011 687076 690262 692789 694575 695785 696013 694446 690917 686352 681882 677881 674161
50569F74161l367k474r58J061L503O117Q492J0540J2638J5043J7565J9978K2272
$$ 674161 670794 668320 667362 668423 671926 678043 686535 697075 709713 724756 742321 762299 784571
50556G84571K4239K5360K5506K5299K5284K5216K4641K3893K3867K4994K6926
$$ 784571 808810 834170 859676 884975 910259 935475 960116 984009 1007876 1032870 1059796
50545A059796K9102L1180L3030L4743L6565L8513M0260M1753M3638M6552N0216
$$ 1059796 1088898 1120078 1153108 1187851 1224416 1262929 1303189 1344942 1388580 1435132 1485348
50534A485348N3687N6444N8660O0536O1869O2301O1608N9728N6778N2912M7894
$$ 1485348 1539035 1595479 1654139 1714675 1776544 1838845 1900453 1960181 2016959 2069871 2117765
50523B117765M1032L1982K1348J0090j346j2830k3865l3893m3014n1558n9035
$$ 2117765 2158797 2190779 2212127 2222217 2220871 2208041 2184176 2150283 2107269 2055711 1996676
50512A996676o4465o7687o9466p0126o9096o6080o1664n6362m9921m2226l4048
$$ 1996676 1932211 1864524 1795058 1724932 1655836 1589756 1528092 1471730 1421809 1379583 1345535
50501A345535k6239j8807j1495m618J397O851J2206J6978K0027K0743J9280J5782
$$ 1345535 1319296 1300489 1288994 1284376 1285773 1292624 1304830 1321808 1341835 1362578 1381858 1397640
50489A397640J0223L050m817j2792k0813k8631l5457m0559m3788m5351m5655m5445
$$ 1397640 1407863 1410913 1406096 1393304 1372491 1343860 1308403 1267844 1224056 1178705 1133050 1087605
50477A087605m5507m5817m5359m3344m0347l7697l5892l4133l1548k8345k5418
$$ 1087605 1042098 996281 950922 907578 867231 829534 793642 759509 727961 699616 674198
50466F74198k3130k1020j8661j6268j4312j2785j1245r386p363n641m601m132
$$ 674198 651068 630048 611387 595119 580807 568022 556777 547391 540028 534387 529786 525654
50454E25654l467j838N16K406L224L837N229O840P390P083P561R455J1353J1787
$$ 525654 522187 520349 520865 523271 526495 530332 535561 542401 549791 556874 564435 573890 585243 597030
50440E97030J0982R903Q765P545O989P753R218J0467J1840J4193J7041J8973J9807
$$ 597030 608012 617915 626680 634225 641214 648967 658185 668652 680492 694685 711726 730699 750506
50427G50506K0771K2538K4535K6433K8765L1585L3904L5203L6300L7908L9459
$$ 750506 771277 793815 818350 844783 873548 905133 939037 974240 1010540 1048448 1087907
50416A087907M0206M0467M0702M0359L8751L6401L4215L1800K7917K2382J6268
$$ 1087907 1128113 1168580 1209282 1249641 1288392 1324793 1359008 1390808 1418725 1441107 1457375
50405A457375J0249L865l386j1200j8963k6319l2998l8638m3111m6505m8691m9365
$$ 1457375 1467624 1471489 1468103 1456903 1437940 1411621 1378623 1339985 1296874 1250369 1201678 1152313
50393A152313m8657m7157m5204m2586l9076l4855l0278k5630k1228j7257j3490
$$ 1152313 1103656 1056499 1011295 968709 929633 894778 864500 838870 817642 800385 786895
50382G86895r533n474j785J371M289O967Q845R452Q928P605N547K725p32m663
$$ 786895 777362 771888 770103 771474 775763 782730 791575 801027 809955 817560 823107 825832 825100 820437
50368H20437q864j2737j5412j6639j7165j7884j8902j9745k0151k0256k0245k0191
$$ 820437 811573 798836 783424 766785 749620 731736 712834 693089 672938 652682 632437 612246
50356F12246k0117j9901j9250j8029j6452j4790j3145j1660j0611r943r078p640
$$ 612246 592129 572228 552978 534949 518497 503707 490562 478902 468291 458348 449270 441630
50344D41630o076n097m681m133l020j594l38M04M03l59j432k110k048j507r26
$$ 441630 435554 430457 425776 421643 418623 417029 416691 417095 417498 417139 415707 413597 411549 410042 409116
50329D09116n43l89l27r7M06Q77R03N67M69J065K233L472M333M710M922N470O432
$$ 409116 408573 408184 407857 407760 408166 409043 409946 410513 410982 412047 414280 417752 422085 426795 431717 437187 443619
50312D43619P188P157O673O677P481Q462R041R463J0218J1173J1653J1089R193
$$ 443619 450807 457964 464637 471314 478795 487257 496298 505761 515979 527152 538805 549894 559087
50299E59087N885J523k898o300q292r199r417r066q241p253o481o094n946n672
$$ 559087 564972 566495 563597 557297 549005 539806 530389 521323 513082 505829 499348 493254 487308 481636
50285D81636n004m103l445l253l225k990k647k601k960l332l231k483j357m10
$$ 481636 476632 472529 469084 465831 462606 459616 456969 454368 451408 448076 444845 442362 441005 440595
50271D40595r0k42k41K51Q97J318J766K640L617L918L459K971K822K417J187l78
$$ 440595 440505 440263 440022 440273 441170 442488 444254 446894 450511 454429 457888 460859 463681 466098 467285 466907
50255D66907j240j088n57l90q08j614k471l043l142k805k111j084L1O75N58J26
$$ 466907 465667 464579 464022 463632 462824 461210 458739 455696 452554 449749 447638 446554 446585 447260 447818 447944
50239D47944P8N12J000J349J685J872J519P50K92M60O49L19j22OM98N43k6m98
$$ 447944 448022 448534 449534 450883 452568 454440 455959 456709 457001 457461 458110 458429 458307 458313 458811 459354 459328 458830
50221D58830k80N22J576K744L775M212L950L499L357L505L739M157M886N742O606
$$ 458830 458550 459072 460648 463392 467167 471379 475329 478828 482185 485690 489429 493586 498472 504214 510820
50206E10820P818R723J2009J4050J5778J7660J9863K1965K3607K4870K5834K6234
$$ 510820 518638 528361 540370 554420 570198 587858 607721 629686 653293 678163 703997 730231
50194G30231K5781K4501K2517J9823J6571J3286J0472Q117N877L548J171j305
$$ 730231 756012 780513 803030 822853 839424 852710 863182 871299 877176 880724 881895 880590
50182H80590m132p605j1889j6799k1593k5167k6840k6970k6561k6221k5680k4312
$$ 880590 876458 868853 856964 840165 818572 793405 766565 739595 713034 686813 661133 636821
50170F36821k1971j9227j6835j4990j3186j0951q657p244p024p178o683n489m297
$$ 636821 614850 595623 578788 563798 550612 539661 531004 523760 516736 509558 502875 497386 493089
50157D93089l520k926k292j707j242p87m89p97j819k960l551l604l632l917m288
$$ 493089 489569 486643 484351 482644 481402 480615 480126 479329 477510 474550 470999 467395 463763 459846 455558
50142D55558m545m767n091n388n281m527l424k629k490k581k267j627j370j730
$$ 455558 451013 446246 441155 435767 430486 425959 422535 419906 417416 414835 412568 410941 409571 407841
50128D07841j950j252M7R11Q64N13P38J704K789L221K834K268K414L516M899N698
$$ 407841 405891 404639 404686 405597 406461 406974 407712 409416 412205 415426 418260 420528 422942 426458 431357 437055
50112D37055N717N396N208N347N818O438O899P139P514Q180Q569Q022O910O448
$$ 437055 442772 448168 453376 458723 464541 470979 477878 485017 492531 500711 509280 517302 524212 530660
50098E30660P242Q614R544R778R708R725J0120J1231J3130J5425J7728K0177K3067
$$ 530660 537902 546516 556060 565838 575546 585271 595391 606622 619752 635177 652905 673082 696149
50085F96149K6222K9211L2064L5328L9259M3183M5794M6064M4022M0773L7608
$$ 696149 722371 751582 783646 818974 858233 901416 947210 993274 1037296 1078069 1115677
50074A115677L4934L2278K9372K6712K4753K3005K0484J6661J1459M701l534j2175
$$ 1115677 1150611 1182889 1212261 1238973 1263726 1286731 1307215 1323876 1335335 1340036 1336502 1324327
50062A324327j9721k5761l1161l6540m1293m4429m5705m5445m3919m1479l8896
$$ 1324327 1304606 1278845 1247684 1211144 1169851 1125422 1079717 1034272 990353 948874 909978
50051I09978l6787l4922l2567k9460k6010k2781k0069j7851j5744j3304j0658
$$ 909978 873191 838269 805702 776242 750232 727451 707382 689531 673787 660483 649825
50040F49825q532p275o208m623l019k542l276m003l764k882k217k081k294k696
$$ 649825 641293 634018 627810 623187 620168 617626 614350 610347 606583 603701 601484 599403 597109 594413
50026E94413l119l271l134l127l508l921m000m060m656n651o268o124n682n540
$$ 594413 591294 588023 584889 581762 578254 574333 570333 566273 561617 555966 549698 543574 537892 532352
50012E32352n740n924n937n920n958n775n020l720k423j729j685j756j456p89
$$ 532352 526612 520688 514751 508831 502873 497098 492078 488358 485935 484206 482521 480765 479309 478520
49998D78520j21K30J00m94j242j621j387r06p38r66j196j150r86j011j337j838
$$ 478520 478399 478629 478729 478235 476993 475372 473985 473079 472341 471375 470179 469029 468043 467032 465695 463857
49982D63857k301k545k564k533k540k393j833q88J19R74J738K614L799N461P604
$$ 463857 461556 459011 456447 453914 451374 448981 447148 446260 446379 447353 449091 451705 455504 460965 468569
49967D68569R942J2079J3861J5466J7184J9232K1603K3794K4908K4459K3039K1738
$$ 468569 478511 490590 504451 519917 537101 556333 577936 601730 626638 651097 674136 695874
49955F95874K0818J9534J7357J4781J2555J0674Q659O495M537K675J79l527q371
$$ 695874 716692 736226 753583 768364 780919 791593 800252 806747 811284 813959 814138 810611 802240
49942H02240j3876j9485k4513k8251l0434l1332l1341l0674k9443k7737k5480
$$ 802240 788364 768879 744366 716115 685681 654349 623008 592334 562891 535154 509674
49931E09674k2587j9440j6827j5140j3887j2366j0559r041q072p236o026m509
$$ 509674 487087 467647 450820 435680 421793 409427 398868 389827 381755 374519 368493 363984
49919C63984l261k765k950l280l318l135l064l086k747j889j071r47j384j627
$$ 363984 360723 357958 355008 351728 348410 345275 342211 339125 336378 334489 333418 332471 331087 329460
49905C29460j276o43j94l9q1k42m17n26p04j120j444j021J78J245J410J028R92
$$ 329460 328184 327541 327347 327308 327227 326985 326568 326042 325338 324218 322774 321753 321931 323176 324586 325614 326606
49888C26606J428J619J090J77n30p47m84J03O22P58P13Q65R19J57j181j600j85
$$ 326606 328034 329653 330743 330920 330390 329643 329159 329262 329884 330642 331355 332220 333139 333296 332115 330515 330330
49871C30330J875K539J403l3n12l28k35j14M72J193J321R48R27J620K425K674
$$ 330330 332205 334744 336147 336114 335602 335274 335039 334925 335397 336590 337911 338859 339786 341406 343831 346505
49855C46505K351J801J275J038J353J962K104J494R06J152J851J922J190O24Q51
$$ 346505 348856 350657 351932 352970 354323 356285 358389 359883 360789 361941 363792 365714 366904 367528 368379
49840C68379J271J074M56J97M51P01P03P80J136J472J465J187R22Q70J090J530
$$ 368379 369650 370724 371180 371377 371828 372529 373232 374012 375148 376620 378085 379272 380194 381064 382154 383684
49824C83684J951K139K214K421K685K727K609K708L049L173K881K506K182J409
$$ 383684 385635 387774 389988 392409 395094 397821 400430 403138 406187 409360 412241 414747 416929 418338
49810D18338r9j637k194j677q80l85j19J49M41O88P05J11j152k341k617k242k317
$$ 418338 418239 416602 414408 412731 411851 411466 411347 411496 411937 412625 413330 413441 412289 409948 407331 405089 402772
49793D02772l183l835l284j815m55K07K08k44p70q30l70j27o56j370j300n38n3
$$ 402772 399589 395754 392470 390655 390200 390407 390615 390371 389601 388771 388401 388274 387618 386248 384948 384410 384357
49776C84357j68j74L85J020J208J243J575J948J818J309J053J300J714J956K049
$$ 384357 384189 384015 384400 385420 386628 387871 389446 391394 393212 394521 395574 396874 398588 400544 402593
49761D02593K213K657L398L957L585K203Q26M88J000J364J283J298J609J659J229
$$ 402593 404806 407463 410861 414818 418403 420606 421432 421920 422920 424284 425567 426865 428474 430133 431362
49746D31362Q52P24J44j163k078j503j72J47r29k015j997j328r77j213j829k631
$$ 431362 432214 432938 433082 431919 429841 428338 428166 428313 427384 425369 423372 422044 421067 419854 418025 415394
49730D15394l134k596j085K03M03R8K13M19k66j696k613k433j914j815j869j527
$$ 415394 412260 409664 408579 408782 409185 409283 409496 409915 409649 407953 405340 402907 400993 399178 397309 395782
49714C95782r09n30n19o79q74j078j212j229j115p28n4L92k2r89j334m91O85J103
$$ 395782 394873 394343 393824 393145 392271 391193 389981 388752 387637 386909 386855 387247 387225 386236 384902 384411 385096 386199
49696C86199Q41P46J030J133P74L76M46J081K146L365M226M261L546K556J548
$$ 386199 387040 387786 388816 389949 390723 391099 391545 392626 394772 398137 402363 406624 410170 412726 414274
49681D14274N51j24L9R84J941K227J936J604J565J807K112K175J902J638J752
$$ 414274 414825 414701 414740 415724 417665 419892 421828 423432 424997 426804 428916 431091 432993 434631 436383
49666D36383J965J576N71j70p8K98J85j91r1M23N46O1k15M02J540K432K926L385
$$ 436383 438348 439924 440495 440325 440247 440545 440730 440539 440448 440871 441417 441478 441263 441665 443205 445637 448563 451948
49648D51948L851L886L169J855L22j126k307l114l557l701l571l180k622k013
$$ 451948 455799 459685 462854 464709 465031 463905 461598 458484 454927 451226 447655 444475 441853 439840
49634D39840j358o97k53k66o14q54p44m67k49j0L54O54P53J066K137L660M465
$$ 439840 438482 437785 437532 437266 436652 435798 435054 434587 434338 434328 434682 435336 436089 437155 439292 442952 447417
49617D47417L865K656K237K965L878M133M077M611N822O829O899O303N901O152
$$ 447417 451282 453938 456175 459140 463018 467151 471228 475839 481661 488490 495389 501692 507593 513745
49603E13745O778P298P547P663P770P916Q119Q324Q315P932P333O901O843P138
$$ 513745 520523 527821 535368 543031 550801 558717 566836 575160 583475 591407 598740 605641 612484 619622
49589F19622P781Q787R868J0519J0653J0749J1087J1171J0421R181Q452Q690R367
$$ 619622 627403 636190 646058 656577 667230 677979 689066 700237 710658 719839 728291 736981 746348
49576G46348R788R771R473R047Q702Q579Q362P526O295N768O526P602P473N886
$$ 746348 756136 765907 775380 784427 793129 801708 810070 817596 823891 829659 836185 843787 851260 857146
49562H57146L939K554J649Q74L69L12L84J28m29r62j407j861k171k097j838j926
$$ 857146 861085 863639 865288 866162 866531 866843 867227 867355 866926 865964 864557 862696 860525 858428 856590 854664
49546H54664k482k986k967k619k450k524k426j947j437j377j776k190k173j484
$$ 854664 852182 849196 846229 843610 841160 838636 836210 834263 832826 831449 829673 827483 825310 823826
49532H23826m3J931L755M761N110N739P117Q433Q593P770P258P704Q296Q001O988
$$ 823826 823783 825714 829469 834230 839340 845079 852196 860629 869222 876992 884250 891954 900250 908251 915239
49517I15239O153N680M889L387J636K68o35j271j736k252l364n322p473q780q990
$$ 915239 921392 927072 931961 935348 936984 937252 936617 935346 933610 931358 927994 922672 915199 906419 897429
49502H97429q909r414j0469j1276j1241j0545r856r640r857j0246j0681j1100
$$ 897429 888520 879106 868637 857361 846120 835575 825719 816079 806222 795976 785295 774195
49490G74195j1225j0670r452q185p454p228p059o690o198n659n165n037n537o240
$$ 774195 762970 752300 742848 734663 727209 719981 712922 706232 700034 694375 689210 684173 678636 672396
49476F72396o250n293m145l604l504l290l105l471m108l977k768j558j462k172
$$ 672396 666146 660853 656708 653104 649600 646310 643205 639734 635626 631649 628881 627323 625861 623689
49462F23689k518k077j506j401j550j529j368j271j087n55R9K91j22n37k76O34
$$ 623689 621171 619094 617588 616187 614637 613108 611740 610469 609382 608827 608926 609217 609095 608558 608282 608916
49446F08916J509J751J436J145J418K353L652M855N534N466M698L506K225J051
$$ 608916 610425 612176 613612 614757 616175 618528 622180 627035 632569 638035 642733 646239 648464 649515
49432F49515L0q48j554j979k014j679j196q40o14k07O36J705K481K661K413K155
$$ 649515 649545 648697 647143 645164 643150 641471 640275 639435 638821 638614 639250 640955 643436 646097 648510 650665
49416F50665K186K561L166L769M113M113L954M021M677N984P476Q300P897O665
$$ 650665 652851 655412 658578 662347 666460 670573 674527 678548 683225 689209 696685 704985 712882 719547
49402G19547N665N563N985O145N797N289M887M540M278M319M610M669M185L469
$$ 719547 725212 730775 736760 742905 748702 753991 758878 763418 767696 772015 776625 781294 785479 788948
49388G88948L069L074L151L127L179L468L841M048M080M214M736N631O515O979
$$ 788948 792017 795091 798242 801369 804548 808016 811857 815905 819985 824199 828935 834566 841081 848060
49374H48060P023P076P444P912Q080P942P926Q321Q941R391R494R446R635J0279
$$ 848060 855083 862159 869603 877515 885595 893537 901463 909784 918725 928116 937610 947056 956691 966970
$$ [...]
##END NTUPLES=NMR SPECTRUM
##END=
