##TITLE=NES1040_872015035_9242566_UfO24fU4PF
##JCAMPDX= 6.0         $$ Bruker NMR JCAMP-DX V2.0
##DATA TYPE= NMR SPECTRUM
##DATA CLASS= NTUPLES
##ORIGIN= BRUKER
##OWNER= Administrator
$$ 1.72 TOPSPIN		Version 2.1
$$ 2015-06-23 17:10:07.623 -0700  Administrator@X
$$ Compression mode = diff/dup
##.OBSERVE FREQUENCY= 400.02188249412
##.OBSERVE NUCLEUS= ^1H
##.ACQUISITION MODE= SIMULTANEOUS (DQD)
##.ACQUISITION SCHEME= undefined
##.AVERAGES= 8
##.DIGITISER RES= 22
##SPECTROMETER/DATA SYSTEM= spect
##.PULSE SEQUENCE= zg30
##.SOLVENT NAME= COFFEE_meoh
##.SHIFT REFERENCE= INTERNAL, COFFEE_meoh, 1, 14.98509
##AUDIT TRAIL= $$ (NUMBER, WHEN, WHO, WHERE, PROCESS, VERSION, WHAT)
$$ ##TITLE= Audit trail, TOPSPIN		Version 2.1
$$ ##JCAMPDX= 5.01
$$ ##ORIGIN= Bruker BioSpin GmbH
$$ ##OWNER= Administrator
$$ $$ E:\/data/COFFEE/nmr/NES1040_872015035_9242566_UfO24fU4PF/20/pdata/1/auditp.txt
$$ ##AUDIT TRAIL=  $$ (NUMBER, WHEN, WHO, WHERE, PROCESS, VERSION, WHAT)
(   1,<2015-06-23 17:10:00.483 -0700>,<Administrator>,<X>,<go>,<TOPSPIN 2.1>,
      <created by zg
	started at 2015-06-23 17:08:54.608 -0700,
	POWCHK enabled, PULCHK disabled,
       configuration hash MD5:
       21 0F 79 D6 B3 7B B4 F6 88 20 88 DB 03 48 BD 9F
       data hash MD5: 64K
       A1 D5 9F 34 1E 38 03 BE EF 60 B3 23 75 3E F9 63>)
(   2,<2015-06-23 17:10:03.654 -0700>,<Administrator>,<X>,<proc1d>,<TOPSPIN 2.1>,
      <Start of raw data processing
       efp LB = 0 FT_mod = 6 PKNL = 1 PHC0 = 0 PHC1 = 0 SI = 32K 
       data hash MD5: 32K
       3D FC 48 80 12 D0 EB 7B 05 6E 7A 32 76 CD 15 01>)
(   3,<2015-06-23 17:10:03.936 -0700>,<Administrator>,<X>,<proc1d>,<TOPSPIN 2.1>,
      <pk PHC0 = 92.12585 PHC1 = 0 
       data hash MD5: 32K
       99 76 60 4B 93 DE 06 D9 A0 75 A0 58 66 07 AE B6>)
(   4,<2015-06-23 17:10:04.045 -0700>,<Administrator>,<X>,<proc1d>,<TOPSPIN 2.1>,
      <abs ABSG = 1 
       data hash MD5: 32K
       59 2D 7A 2F 67 6C 7E 83 CE 44 C9 54 BD 3B 62 10>)
(   5,<2015-06-23 17:10:04.108 -0700>,<Administrator>,<X>,<proc1d>,<TOPSPIN 2.1>,
      <abs ABSG = 2 
       data hash MD5: 32K
       DD AC 94 85 23 93 27 BC 67 D4 D6 C5 89 C8 A8 DB>)
(   6,<2015-06-23 17:10:04.186 -0700>,<Administrator>,<X>,<proc1d>,<TOPSPIN 2.1>,
      <abs ABSG = 3 
       data hash MD5: 32K
       D3 90 B9 35 96 3F 41 A3 84 61 00 C9 DD DB 8A 60>)
(   7,<2015-06-23 17:10:04.248 -0700>,<Administrator>,<X>,<proc1d>,<TOPSPIN 2.1>,
      <abs ABSG = 4 
       data hash MD5: 32K
       A1 C4 69 10 DC AC 57 86 F7 AA 38 99 20 0E EC 1C>)
(   8,<2015-06-23 17:10:04.311 -0700>,<Administrator>,<X>,<proc1d>,<TOPSPIN 2.1>,
      <abs ABSG = 5 
       data hash MD5: 32K
       52 91 06 67 37 89 A4 60 B5 A1 3E 89 62 E5 EC 3B>)
$$ ##END=
$$ 
$$ $$ hash MD5
$$ $$ 2A 5C 30 B3 E9 7D E5 12 DB 25 51 98 56 DF 9F C1
##$RELAX= 
##$RELAX= 
##$RELAX= 
##$RELAX= 
##$RELAX= 
##$RELAX= 
##$RELAX= 
$$ Bruker specific parameters
$$ --------------------------
##$DU= <E:\>
##$EXPNO= 20
##$NAME= <NES1040_872015035_9242566_UfO24fU4PF>
$$ [...]
##$TP= (0..7)
150 150 150 150 150 150 150 150
##$TP07= 0
##$TPNAME0= <>
##$TPNAME1= <>
##$TPNAME2= <>
##$TPNAME3= <>
##$TPNAME4= <>
##$TPNAME5= <>
##$TPNAME6= <>
##$TPNAME7= <>
##$TPOAL= (0..7)
0.5 0.5 0.5 0.5 0.5 0.5 0.5 0.5
##$TPOFFS= (0..7)
0 0 0 0 0 0 0 0
##$TUNHIN= 0
##$TUNHOUT= 0
##$TUNXOUT= 0
##$USERA1= <user>
##$USERA2= <user>
##$USERA3= <user>
##$USERA4= <user>
##$USERA5= <user>
##$V9= 5
##$VALIST= <valist>
##$VCLIST= <CCCCCCCCCCCCCCC>
##$VD= 0
##$VDLIST= <DDDDDDDDDDDDDDD>
##$VPLIST= <PPPPPPPPPPPPPPP>
##$VTLIST= <TTTTTTTTTTTTTTT>
##$WBST= 2048
##$WBSW= 25
##$XGAIN= (0..3)
0 0 0 0
##$XL= 0
##$YL= 0
##$YMAX_a= 601442
##$YMIN_a= -502749
##$ZGOPTNS= <>
##$ZL1= 120
##$ZL2= 120
##$ZL3= 120
##$ZL4= 120
##$ABSF1= 14.98509
##$ABSF2= -5.573092
##$ABSG= 5
##$ABSL= 3
##$ALPHA= 0
##$AQORDER= 0
##$ASSFAC= 0
##$ASSFACI= 0
##$ASSFACX= 0
##$ASSWID= 0
##$AUNMP= <proc_prof1d_extract_pilot.lims>
##$AXLEFT= 0
##$AXNAME= <>
##$AXNUC= <1H>
##$AXRIGHT= 0
##$AXTYPE= 0
##$AXUNIT= <>
##$AZFE= 0.1
##$AZFW= 0.1
##$BCFW= 0
##$BC_mod= 0
##$BYTORDP= 0
##$COROFFS= 0
##$CY= 15
##$DATMOD= 1
##$DC= 0
##$DFILT= <>
##$DTYPP= 0
##$F1P= 0
##$F2P= 0
##$FCOR= 0.5
##$FTSIZE= 32768
##$FT_mod= 6
##$GAMMA= 0
##$GB= 0
##$INTBC= 1
##$INTSCL= 1
##$ISEN= 128
##$LB= 0
##$LEV0= 0
##$LPBIN= 0
##$MAXI= 10000
##$MC2= 0
##$MEAN= 0
##$ME_mod= 0
##$MI= 0
##$NCOEF= 0
##$NC_proc= -8
##$NLEV= 6
##$NOISF1= 0
##$NOISF2= 0
##$NSP= 0
##$NTH_PI= 0
##$NZP= 0
##$OFFSET= 14.98509
##$PC= 1
##$PHC0= 92.12585
##$PHC1= 0
##$PH_mod= 1
##$PKNL= yes
##$PPARMOD= 0
##$PPDIAG= 0
##$PPIPTYP= 0
##$PPMPNUM= 2147483647
##$PPRESOL= 1
##$PSCAL= 4
##$PSIGN= 0
##$PYNMP= <proc.py>
##$REVERSE= no
##$SF= 400.02
##$SI= 32768
##$SIGF1= 0
##$SIGF2= 0
##$SINO= 400
##$SIOLD= 32768
##$SPECTYP= <>
##$SREGLST= <1H.CDCl3>
##$SSB= 0
##$STSI= 32768
##$STSR= 0
##$SW_p= 8223.68421052631
##$SYMM= 0
##$S_DEV= 0
##$TDeff= 65536
##$TDoff= 0
##$TI= <>
##$TILT= no
##$TM1= 0
##$TM2= 0
##$TOPLEV= 0
##$USERP1= <user>
##$USERP2= <user>
##$USERP3= <user>
##$USERP4= <user>
##$USERP5= <user>
##$WDW= 1
##$XDIM= 32768
##$YMAX_p= 442624322
##$YMIN_p= -660515
##$CURPLOT= <Network HP LaserJet P1505>
##$CURPRIN= <$Network HP LaserJet P1505>
##$DFORMAT= <normdp>
##$LAYOUT= <+/1D_H.xwp>
##$LFORMAT= <normlp>
##$PFORMAT= <normpl>
##$SURQMSG= 1
$$ End of Bruker specific parameters
$$ ---------------------------------
##NTUPLES= NMR SPECTRUM
##VAR_NAME=  FREQUENCY,     SPECTRUM/REAL,   SPECTRUM/IMAG
##SYMBOL=    X,             R,               I
##VAR_TYPE=  INDEPENDENT,   DEPENDENT,       DEPENDENT
##VAR_FORM=  AFFN,          ASDF,            ASDF
##VAR_DIM=   32768,         32768,           32768
##UNITS=     HZ,            ARBITRARY UNITS, ARBITRARY UNITS
##FACTOR=    0.250966925370066, 1,           1
##FIRST=     8223.43324360094, -155012,      43826
##LAST=      0,             6758,            -79739
##MIN=       0,             -660515,         0
##MAX=       8223.43324360094, 442624322,    0
$$ Real data points
##PAGE= N=1
##DATA TABLE= (X++(R..R)), XYDATA
$$ [...]
$$ plain form
19482 -312645 8110 -59189 -63736 -151447 -335192 -114542 -14857 -113266 -301068 -303051 -290328
19471 -290328 64359 -43666 252963 -151721 -205551 54903 -299101 116160 -83163 -212271
19461 -212271 -67229 200395 -218133 -43913 -109947 -52380 -1159 -181202 -4205 236434 -158298
19449 5455 87708 -76708 -85822 -111420 -4759 -150718 -235127 255724 -54820 381555 192757
19438 192757 48497 19375 50943 112838 -167231 -181245 46594 -210828 78005 -29634 3939
19426 67426 286308 -38525 53722 159993 -9559 118250 -28930 -147047 -208221 -95368 -547
19414 -7450 -290977 -312228 191255 -96355 114866 45771 68039 186013 265313 -23427 55495
19402 221877 -318668 -66244 144743 -51301 -77545 152572 159053 378829 134519 -15235 -42695
$$ packed form
19482c12645H110e9189m547q7711j83745a14542a4857r8409j87802j983J2723
19471b90328F4359d3666B52963a51721n3830E4903b99101A16160h3163j29108
19461b12271f7229B00395b18133d3913o6034e2380a159j80043d205B36434a58298
19449E455Q2253g6708r114k5598d759j45959q4409B55724e4820C81555j88798
19438A92757D8497A9375L1568O1895a67231j4014D6594b10828G8005b9634C939
19426F7426K18882c8525E3722J06271i559A18250b8930j18117o1174i5368e47
19414g450k83527k1251A91255i6355A14866D5771K2268J17974P9300b3427E5495
19402B21877c18668f6244A44743e1301k6244A52572O481K19776A34519a5235k7460
$$ plain form
19391 -42695 62732 128572 6663 -39493 -53232 -187489 -178583 -11795 -75612 -100959 -268245 -261840
19379 -261840 123560 -123068 197646 -256354 -265917 -178112 -376241 48521 -258416 -281091
19369 -281091 43822 264000 -33610 -5453 -8202 46345 -447524 -117980 65129 142302 180819
19358 180819 -162169 23310 -47943 -91107 -266951 154601 -234291 -170236 197382 390690
19348 390690 85383 -224006 146363 -308630 -300811 -63931 128898 55594 -209286 122384
19337 -21039 -43530 11157 76453 -134694 168153 -50867 -338783 -94604 38119 206113 -18509
19325 -155334 -298205 -84269 -112053 78579 169973 -351235 -66691 -263170 -209829 -273725 84986
19313 -306828 19974 -114766 -84370 -388012 67986 76019 -163502 58532 -37055 -217755 65486
$$ packed form
19391d2695F2732O5840F663c9493j3739j34257Q906a1795o3817k5347j67286O405
19379b61840A23560a23068A97646b56354r563Q7805j98129D8521b58416k2675
19369b81091D3822K20178c3610e453k749D6345d47524a17980F5129P7173L8517
19358A80819a62169B3310d7943m3164j75844A54601b34291O4055A97382J93308
19348C90690H5383b24006A46363c08630P819f3931A28898E5594b09286A22384
19337b1039k2491A1157O5296a34694A68153e0867k87916i4604C8119J67994a8509
19325a55334j42871h4269k7784G8579R1394c51235f6691j96479N3341o3896H4986
19313c06828A9974a14766L0396l03642F7986Q033a63502E8532c7055j80700F5486
$$ plain form
19301 -128962 -10446 -54489 -83558 -150534 347761 -222465 -212279 10339 110482 -274201 -40543
19289 -190692 -32725 222687 -184408 -342130 -123794 -52716 -382661 88145 -238017 -133773
19279 -133773 37879 -276420 -193613 129342 -412355 76625 77322 -445039 91431 -140400 -8624
19267 -124355 187350 -101883 -69912 141580 -64337 188129 14545 23971 -249332 -212187 310733
19255 242466 -326883 -393784 -28643 109113 -248004 -50400 -84110 107518 206602 -145352
19244 -346372 -137448 111962 405854 -157030 323616 -259557 -42725 -19594 -20195 -347422
19234 -347422 -296103 -3032 -271397 -104998 111271 -145191 -48945 -95085 -190241 -229962 -289121
19223 -289121 -183378 -134133 -219983 198314 134267 -31626 163769 21244 -136504 -172885 -349360
$$ packed form
19301a28962a0446m4043k9069o6976C47761b22465J0186A0339J00143b74201d0543
19289a90692c2725B22687a84408j57722a23794e2716l29945H8145b38017J04244
19279a33773C7879b76420Q2807A29342d12355G6625O97d45039I1431a40400h624
19267a24355A87350a01883L1971A41580f4337A88129A4545R426b49332L7145C10733
19255B42466c26883o6901b8643A09113b48004e0400l3710A07518R9084a45352
19244c46372a37448A11962K93892a57030C23616b59557d2725a9594o01l27227
19234c47422N1319c032k68365a04998A11271a45191d8945m6140r5156l9721n9159
19223b89121J05743M9245q5850A98314o4047c1626A63769B1244a36504l6381j76475
$$ plain form
19212 -349360 -15198 -11338 -164943 19819 -94612 171581 52634 176024 88306 -330283 24535
19200 -215261 104827 79704 -184148 -5589 229922 -160595 -367637 77735 97299 -254067
19189 -92546 54114 -85559 -182821 -141825 -317534 -91316 -334784 472612 92135 -159875 -188196
19178 -188196 -53652 -63276 155634 -188108 34008 -179338 166504 -71656 59128 33043 -104442
19166 -203621 -147930 -194905 97923 98976 -27389 -266033 143576 182414 -459509 22232 191072
19155 191072 -219855 -121400 -968 -48160 66100 -112815 166867 -293945 46023 24170 -170650
19143 -51187 -27217 -129066 68861 -232184 -6393 140444 -66436 -24511 -306211 -298690 -398622
19132 -398622 -355909 190559 39156 -26306 -30459 -406785 -98283 15469 114830 155007 -161786
$$ packed form
19212c49360a5198L860j53605A9819i4612A71581E2634J23390q7718c30283B4535
19200b15261A04827k5123a84148e589B29922a60595k07042G7735J9564b54067
19189i2546E4114h5559r7262M0996j75709i1316k43468D72612I2135a59875k8321
19178a88196e3652r624A55634a88108C4008a79338A66504g1656E9128k6085a04442
19166b03621N5691m6975I7923J053b7389k38644A43576L8838d59509B2232J68840
19155A91072b19855R8455i68m7192F6100a12815A66867b93945D6023k1853a70650
19143e1187K3970j01849F8861b32184f393A40444f6436b4511k81700P521r9932
19132c98622M2713A90559C9156b6306m153l76326i8283A5469R9361M0177a61786
$$ plain form
19120 124970 114366 77183 -14997 -116910 995 -34746 30183 -274362 -238970 -253948 66069
19108 -30028 51022 -153869 -46733 245698 -45728 -125634 -301672 -150528 -160359 -36353 -168998
19097 -168998 4398 -125057 -58646 -176411 -163706 -7649 96207 -198550 261018 -217549 -7341
19085 -17795 -187991 145171 -395997 -97943 24820 -318494 345726 225764 -24781 -17950 29990
19073 -156738 -97184 -159310 -27602 -150226 -74311 55504 107053 -316888 -94082 -66413 210184
19061 -186506 202573 403408 -158308 -285522 148408 -2559 161729 -199077 -171356 -65338
19050 153425 236077 21483 185784 -94503 -298796 2756 -400989 116414 -251592 114853
19039 -88422 -30239 -59813 -106815 -170762 -204349 -286961 -138738 -46673 -242818 -169378 91214
$$ packed form
19120A24970j0604l7183a4997j01913I95c4746C0183b74362L5392j4978F6069
19108c0028E1022a53869d6733B45698d5728p9906j76038a50528r831c6353j32645
19097a68998D398a25057e8646j17765J2705g649I6207a98550B61018b17549g341
19085a7795j70196A45171c95997i7943B4820c18494C45726j19962b4781O831B9990
19073a56738N9554o2126b7602j22624g4311E5504N1549c16888i4082K7669B10184
19061a86506B02573K00835a58308j27214A48408b559A61729a99077K7721f5338
19050A53425Q2652B1483J64301i4503k04293B756d00989A16414b51592A14853
19039h8422c0239k9574m7002o3947l3587q2612a38738d6673j96145P3440I1214
$$ plain form
19027 124069 5104 205753 142505 -93144 165228 27033 -64615 -220211 136776 -82119 -207807
19016 -207807 -18523 -262897 233466 -378278 129038 8658 -210074 310586 301238 182318
19006 182318 172484 -53256 -46507 182111 11492 -138493 -94344 -329661 158261 138336 -57991
18994 -271399 -19814 -291928 -111921 -20916 -171532 -190955 171197 43934 158977 -14732
18983 36983 -275162 179305 -200411 -2113 -41193 -408772 -165873 219059 -42762 -314198
18973 -314198 -111787 -174902 -149680 112283 67521 -1237 147043 64888 -78570 -251494 -61783
18961 336481 49240 -175561 193246 -128038 -162582 -138016 149817 63148 -222929 -102575
18950 113983 75967 -215294 112930 21631 -152410 -270928 75817 -28322 107149 193657
$$ packed form
19027A24069E104K00649o3248i3144A65228B7033f4615j55596A36776h2119j25688
19016b07807a8523k44374B33466c78278A29038H658b10074C10586r348j18920
19006A82318r834e3256O749A82111A1492a38493M4149k35317A58261j9925e7991
18994b71399a9814k72114a11921b0916j50616j9423A71197D3934J15043a4732
18983C6983b75162A79305b00411b113l9080l67579a65873B19059d2762k71436
18973c14198a11787o3115K5222A12283m4762a237A47043F4888g8570j72924f1783
18961C36481D9240a75561A93246a28038l4544K4566A49817F3148b22929a02575
18950A13983l8016b15294A12930B1631a52410j18518G5817b8322A07149Q6508
$$ plain form
18940 193657 -20090 90817 -190412 -281008 -268161 -507360 307105 -191114 -13918 -268277
18930 -268277 -11323 -108563 -262297 -272756 -105108 189993 112093 298100 -269912 54280
18919 258823 5177 9697 -166227 41561 -166102 102533 -49114 -62441 187020 -38620 127164
18907 -105529 -19931 -359342 -171936 420197 -49704 3049 107676 190421 77746 -156650 -203494
18896 -203494 137542 68383 63169 119410 -90331 -115686 288977 -95617 -1368 -158093 -248393
18885 -248393 74877 153223 -42304 -7086 93468 -31358 -337810 -113833 -34776 82250 -60526
18873 65320 657 77654 -60184 7809 138852 367313 -240748 -44637 -260274 44645 -464282
18861 -20259 195060 162334 -93067 -273963 -55462 -137875 -296655 -202903 -28477 -108989 -147857
$$ packed form
18940A93657b0090I0817a90412r0596J2847k39199C07105a91114a3918k54359
18930b68277a1323r7240j53734j0459a05108A89993p7900J86007b69912E4280
18919B58823E177M520a66227D1561a66102A02533d9114j3327A87020c8620A27164
18907a05529a9931l39411a71936D20197d9704C049J04627Q2745G7746a56650m6844
18896b03494A37542F8383n214N6241i0331k5355B88977i5617a368j56725r0300
18885b48393G4877P8346d2304g086I3468c1358l06452a13833c4776H2250f0526
18873F5320F57P6997f0184G809J31043K28461b40748d4637k15637D4645d64282
18861b0259A95060l2726i3067j80896e5462q2413j58780R3752b8477q0512l8868
$$ plain form
18850 -147857 180212 -114771 286392 66488 -110174 72006 -365427 -144213 -124436 22288
18839 224999 26787 42594 149049 184757 130733 -45387 61271 44730 -34167 -151843 -35926
18827 -211101 1531 75712 -53634 -175646 -86797 156798 29634 134451 -54943 55120 64357
18816 64357 -244104 82104 -150693 42664 290433 -239845 93658 153586 126789 -117734 136405
18804 75339 -109259 89280 -348285 -88058 -23250 -171805 -132220 -100086 -346858 -254664 -55388
18792 86921 100929 68742 -100703 -327623 -61235 -90114 79133 -222225 -267979 -92754 -258692
18781 -258692 -189259 -23060 -257451 -102724 -278235 43103 -11843 -230404 -145175 -588870
18771 -588870 -250965 237277 -163701 33754 -251624 -71870 29012 -158590 34635 -45900
$$ packed form
18850a47857A80212a14771B86392F6488a10174G2006c65427a44213J9777B2288
18839B24999B6787J5807J06455L5708n4024d5387F1271j6541c4167j17676c5926
18827b11101A531P4181e3634j22012h6797A56798B9634J04817e4943E5120R237
18816F4357b44104H2104a50693D2664K47769b39845I3658N9928k6797a17734A36405
18804G5339a09259H9280c48285h8058b3250j48555L9585L2134k46772R2194e5388
18792H6921J4008l2187a00703k26920f1235k8879G9133b22225m5754i2754j65938
18781b58692O9433b3060k34391a02724j75511D3103a1843k18561Q5229m43695
18771e88870b50965B37277a63701C3754b51624g1870B9012a58590C4635d5900
$$ plain form
18760 -154514 66595 -191295 -184841 -43919 -340334 5683 372937 68241 -367025 -536193 -80493
18748 123910 -52942 57083 70165 -166365 68006 241044 81682 -140253 -136414 924 44419
18737 44419 -82874 -98560 6722 242025 -68236 59245 -53039 49739 195963 -131968 262734
18725 -76988 257306 55809 -193216 -174562 31496 83622 -25627 184016 -57993 -436290 -78691
18713 -197916 68369 -222083 -19054 -145819 341503 79527 -32012 -295025 -214448 -6667 -160334
18702 -160334 -496989 -107687 -265116 43327 186704 150767 273983 91785 -21701 76936
18691 160096 63152 54452 85801 -132313 292701 112020 -129370 -52246 50548 -414832 62749
18679 -151024 -129147 210928 -236595 -259933 -14267 -98754 161563 -71649 -101962 65131 1700
$$ packed form
18760a54514F6595a91295O454d3919k96415E683L67254F8241c67025j69168h0493
18748A23910e2942E7083J3082a66365F8006J73038H1682a40253L839I24M3495
18737D4419h2874j5686F722K35303f8236E9245e3039D9739J46224a31968B62734
18725g6988B57306E5809a93216J8654C1496N2126b5627A84016e7993l78297g8691
18713a97916F8369b22083a9054j26765C41503G9527c2012k63013Q0577f667j53667
18702a60334l36655a07687j57429D3327J43377l5937J23216I1785b1701G6936
18691A60096F3152q700L1349a32313B92701A12020a29370e2246E0548d14832F2749
18679a51024K1877B10928b36595k3338a4267q4487A61563g1649l0313F5131A700
$$ plain form
18667 96863 78971 -99290 146335 -2389 -192056 46542 -107359 69948 -18611 -104276 -166973
18656 -166973 292955 -43957 -249814 -177720 348828 37026 297881 34889 116545 17432 106887
18645 106887 -163036 -71763 -113812 -176518 85219 93756 -197290 -81144 -102187 -13633 -124538
18634 -124538 -291395 -8339 286968 -104799 251084 290584 -21878 -328356 -266115 174093
18623 -118224 -5517 273287 9687 -76048 -130614 -420813 73016 -51788 -146301 -263074 -24274
18611 -344634 37880 240095 149326 141728 -199280 125697 149404 -364768 -38318 70011 13916
18599 -126117 141222 -92791 -398929 9066 -68456 136213 38810 -213513 195793 -50084 298050
18587 60308 258720 -222554 -224154 -254521 -195515 167644 -118172 -32126 -140674 -66350 -12738
$$ packed form
18667I6863j7892i9290A46335b389j89667D6542a07359F9948a8611q5665o2697
18656a66973B92955d3957k05857P2094C48828C7026K60855C4889Q1656A7432Q9455
18645A06887a63036g1763m2049o2706H5219Q537a97290h1144k1043a3633j10905
18634a24538j66857h339B86968a04799B51084L9500b1878l06478O2241A74093
18623a18224e517B73287I687g6048n4566k90199G3016e1788r4513j16773b4274
18611c44634C7880K02215r0769p598a99280A25697K3707c64768c8318G0011A3916
18599a26117A41222i2791l06138I066f8456A36213C8810b13513A95793e0084B98050
18587F0308J98412b22554j600l0367N9006A67644a18172c2126j08548f6350a2738
$$ plain form
18575 -153478 -1655 -104533 -18326 62404 -118109 32226 -70225 -54481 81328 -112206 -166384
18564 -166384 -61682 -163273 229774 58819 38790 -6196 -88407 -304626 -209623 -322906 259196
18552 93176 -300478 -297720 -75330 -384482 -324229 -181615 48511 111886 61797 -24633 209372
18540 -260056 35618 -100128 5706 -237797 -219242 72433 -24304 6887 -256774 -308770 -21122
18528 -242553 592101 -7149 -562056 120226 -93744 224411 -33507 76483 -60644 -31602 -160368
18517 -160368 56910 -112828 -6144 -75788 -97791 -268731 137496 -13392 52918 -119604 241022
18505 171586 -176947 50109 -298205 -144644 97143 26055 56716 -92783 266391 253809 7932
18493 -111736 -5945 -16651 -93005 -30449 261631 -367534 112171 135151 -163567 -231793 -103324
$$ packed form
18575a53478a655j02878a8326F2404a18109C2226g0225J5744H1328a12206n4178
18564a66384f1682j01591B29774E8819k0029f196q2211k16219R5003j13283B59196
18552I3176c00478K758g5330l09152O0253J42614D8511O3375n0089b4633B09372
18540b60056C5618a00128E706b37797J8555G2433b4304F887b56774n1996b1122
18528b42553E92101g149n54907A20226i3744B24411c3507G6483f0644K9042j28766
18517a60368E6910a12828f144o9644k2003j70940A37496a3392E2918a19604B41022
18505A71586a76947E0109b98205a44644I7143B6055L0661i2783B66391j2582G932
18493a11736e945j0706p6354c0449B61631c67534A12171K2980a63567o8226a03324
$$ plain form
18481 -73236 -312705 32896 53845 47548 273453 -162720 93568 -183998 165560 -16450 -26031
18470 -26031 -194188 -205115 -164247 -95351 482885 -71204 -91467 -27200 -64374 151618 -40360
18458 126114 -55467 125956 -151486 -166688 -165955 136793 52180 108376 -163007 -221657 -204762
18447 -204762 -156282 -62906 -109195 -205835 -164248 127778 -34281 -519700 -234535 -146745 96767
18435 29898 3452 -253045 210447 -49198 116404 93268 28912 154247 331810 -101100 133795
18423 -185533 260243 241822 76253 -58378 -141360 -43955 -218848 54674 79898 144526 -26366
18411 -192479 -19540 -59578 -34810 173189 55169 33939 152123 33156 -51158 110511 168584
18400 168584 -54210 -246977 3260 -183526 190411 -103291 -328253 93729 -44616 161459
$$ packed form
18481g3236k39469C2896K0949o297K25905a62720I3568a83998A65560a6450r581
18470b6031j68157j0927M0868O8896D82885g1204k0263b7200l7174A51618d0360
18458A26114e5467A25956a51486j5202P33A36793E2180N6196a63007n8650J6895
18447b04762M8480f2906m6289r6640M1587A27778c4281m85419b34535Q7790I6767
18435B9898C452b53045B10447d9198A16404k3136B8912J25335J77563a01100A33795
18423a85533B60243j8421G6253e8378q2982d3955j74893E4674K5224O4628b6366
18411a92479a9540m0038K4768A73189E5169k1230J18184C3156e1158A10511N8073
18400A68584e4210j92767C260a83526A90411a03291k24962I3729d4616A61459
$$ plain form
18389 -86754 254518 -25998 479419 1031 191452 10115 -325935 -29649 37761 47349 -235294
18377 -353806 191443 -119057 -202153 369770 -139077 -79356 17901 57998 175915 -312457
18366 -33558 54792 72971 -46862 -252502 109832 -76028 -191884 20982 310013 58791 -299747
18354 139328 28715 286583 94501 136600 -210297 116159 -50580 168593 -36318 62943 208124
18343 208124 101012 -278875 187108 -18458 174910 39559 38632 -178632 40993 275948 -169696
18331 -196814 -43514 135955 -242222 -170958 100990 152874 275218 -171705 -45506 -215794
18321 -215794 -25219 -3111 -16333 -221227 -160560 -249950 -12018 -109614 -187325 -164367 -84102
18310 -84102 -77965 52216 30765 63666 109423 169040 73999 -10576 -101735 -187201 132773 -186408
$$ packed form
18389h6754B54518b5998D79419A031J90421A0115c25935b9649C7761R588b35294
18377c53806A91443a19057q3096C69770a39077N9721A7901M0097J17917c12457
18366c3558E4792J8179d6862k05640A09832g6028j15856B0982K89031E8791b99747
18354A39328B8715K57868I4501M2099b10297A16159e0580A68593c6318F2943J45181
18343B08124A01012b78875A87108a8458A74910C9559r27a78632D0993K34955a69696
18331a96814d3514A35955b42222P1264A00990N1884J22344a71705d5506j70288
18321b15794b5219c111j3222k04894O0667q9390a2018r7596p7711K2958Q0265
18310h4102O137E2216k1451L2901M5757N9617G3999a0576r1159q5466A32773a86408
$$ plain form
18297 68146 -64649 -184746 356035 -274769 317598 -102523 83619 -247049 -281743 -6925 86774
18285 -79178 61406 -48060 -35678 191897 -214587 -300797 340985 21785 -113601 -151187 -324205
18274 -324205 -395263 -182645 -115208 -60675 102663 250202 -52189 -153822 -332869 178111
18263 -134738 31936 -10954 -43110 162755 -205512 -321648 139934 -184890 -309437 -103195
18252 121741 198073 -22016 -22558 81295 -306120 186796 85827 105125 -191771 146836 -241197
18240 332846 -26611 115130 91785 -13139 -118150 206823 -27033 -369 -76695 13044 -118878
18228 38636 -33275 207838 -96044 221474 40673 337283 -69714 -45295 -22532 337666 -108058
18216 -226484 -135734 50996 52757 -18718 -23513 229658 -163278 102682 -127512 -244952 -396
$$ packed form
18297F8146f4649j20097C56035b74769C17598a02523H3619b47049l4694f925H6774
18285g9178F1406d8060J2382A91897b14587q6210C40985B1785a13601l7586j73018
18274c24205p1058a82645O7437N4533A02663J47539e2189j01633j79047A78111
18263a34738C1936a0954l2156A62755b05512j16136A39934a84890j24547a03195
18252A21741P6332b2016n42H1295c06120A86796H5827J9298a91771A46836b41197
18240C32846b6611A15130k3345a3139j05011B06823b7033c69p6326A3044a18878
18228C8636c3275B07838i6044B21474D0673K96610f9714K4419b2532C37666a08058
18216b26484R0750E0996J761a8718m795B29658a63278A02682a27512j17440c96
$$ plain form
18204 196343 -147756 161474 138284 21477 -183662 101800 196178 139959 -83032 -100695 -400596
18193 -400596 2766 200709 38995 -152910 93415 -190532 59297 166916 -53694 28263 -421253
18181 -107276 180382 -235559 2531 -190223 -148384 119283 90030 42271 -36338 102584 327860
18170 327860 267352 -364795 120700 -166526 -161287 -71751 312313 -267994 25986 122434 24336
18158 215860 121101 -160364 -69310 -324132 62957 -104042 66955 -103995 91307 -15589 236885
18146 -188918 -498718 -15979 241668 -23501 -194033 -401869 -152793 208115 -157801 -314936
18136 -314936 -34601 27202 -92576 -119628 -217074 184999 -7912 148616 -332280 12014 -345491
18124 -74391 181387 -140805 64967 -111185 -209979 -204029 -353146 -51358 23159 240996 -25498
$$ packed form
18204A96343a47756A61474k3190B1477a83662A01800R4378n6219h3032j7663k99901
18193d00596B766J97943C8995a52910I3415a90532E9297J07619e3694B8263d21253
18181a07276A80382b35559B531a90223M1839A19283k9253D2271c6338A02584K25276
18170C27860o0508c64795A20700a66526N239g1751C12313b67994B5986R6448B4336
18158B15860r4759a60364f9310k54822F2957a04042F6955a03995I1307a5589B36885
18146a88918l09800a5979B41668b3501j70532k07836a52793B08115a57801j57135
18136c14936c4601B7202i2576k7052r7446A84999g912A48616c32280A2014c45491
18124g4391A81387a40805F4967a11185r8794N950j49117e1358B3159K17837b5498
$$ plain form
18112 164241 78692 -141564 -95329 166129 276541 197953 40430 264207 317745 -43773 -1681
18100 -111404 -266536 -175719 -96043 -119200 116804 -30936 56483 137004 -6891 -118888 157055
18088 87484 -66773 -27199 -11555 105781 31068 -21542 -371888 -10228 127292 78377 510476
18077 510476 -132549 263353 207337 -122934 -200969 -165822 -57353 -93547 -12612 -270908 -131614
18065 139575 118599 185927 -125338 132130 -119390 -187053 -22232 -865 -278382 82940 -130175
18053 65194 75644 135275 -529749 -51615 214664 -155234 -106586 -400666 -134855 158360
18042 -49850 232435 -131438 -185635 -87065 -185023 -103334 224972 171742 -106324 61763 318579
18031 318579 -23472 36172 137457 159846 51589 -26898 -314245 191357 -331808 -163585
$$ packed form
18112A64241G8692a41564M6235A66129J10412p8588D0430K23777N3538d3773a681
18100a11404j55132R0817P9676k3157A16804c0936E6483Q0521f891j11997A57055
18088H7484f6773b7199a1555A05781C1068b1542l50346a0228A27292m8915M32099
18077E10476a32549B63353n6016a22934p8035L5147e7353l6194a2612k58296a31614
18065A39575k0976O7328a25338A32130a19390o7663b2232h65k77517H2940a30175
18053F5194J0450N9631e29749e1615B14664a55234M8648k94080a34855A58360
18042d9850B32435a31438n4197h7065r7958Q1689B24972n3230a06324F1763K56816
18031C18579b3472C6172J01285K2389E1589b6898k87347A91357c31808a63585
$$ plain form
18020 177941 -243048 -19432 -87678 -42201 -474939 -69958 79297 11340 174893 102192 91584
18009 91584 -158254 314177 -58229 13284 -14637 88352 -145895 267513 269794 -225604 184162
17997 -157247 108630 159673 17070 -187116 206348 183205 197208 3279 -42446 -116707 -234841
17986 -234841 18052 -412059 -95477 -227639 -15531 -186771 44007 88530 -121935 91456 -13058
17974 106825 145576 -213860 187982 -74790 -149821 -131349 50342 -116424 34011 -238003 8569
17962 -233962 -49197 51027 -181062 285316 -46395 -68502 46745 32515 49867 -167541 -99730
17951 -99730 25731 -12678 73589 -87110 -163685 -297358 261017 -177789 -133268 9451 296161
17940 296161 133114 186694 180892 326519 119794 255657 -122165 66668 275264 -66322
$$ packed form
18020A77941b43048a9432o8246d2201m32738f9958G9297A1340J63553p2701j0608
18009I1584a58254C14177e8229A3284a4637H8352a45895B67513K281b25604A84162
17997a57247A08630N1043A7070a87116B06348k3143J4003C279d2446p4261j18134
17986b34841A8052d12059i5477j32162a5531j71240D4007M4523a21935I1456a3058
17974A06825L8751b13860A87982g4790p5031J8472E0342a16424C4011b38003H569
17962b33962d9197E1027a81062B85316d6395k2107D6745j4230J7352a67541O7811
17951i9730B5731a2678G3589h7110p6575j33673B61017a77789M4521I451K86710
17940B96161A33114N3580n802J45627A19794J35863a22165F6668K08596f6322
$$ plain form
17929 183734 -44628 -175254 354638 74885 -36294 -99004 274600 414864 -145718 -204747
17919 -204747 195137 -100136 227594 39390 69440 -80948 154317 345700 84628 5542 -52293
17907 -346475 185916 -206104 -29620 203313 -120951 -115022 270164 252293 2942 -108254 162017
17895 109983 -139284 -172380 121925 278008 -61925 -36021 317623 240493 136754 64963
17884 261743 -20185 -37067 260824 114548 84706 331208 121677 -277054 -29640 133994
17873 -30042 -154701 245270 -188658 -272384 -153099 -128005 169304 -6695 -3836 47061 -42119
17861 32837 276126 -87419 -258981 105470 42305 154677 363417 -213587 394558 -197085
17850 -17091 222988 108780 487316 -280252 -175794 234113 -15629 21889 -145509 266137
$$ packed form
17929A83734d4628j30626C54638G4885c6294o2710B74600J40264a45718n9029
17919b04747A95137a00136B27594C9390L0050h0948A54317J91383H4628E542e2293
17907c46475A85916b06104b9620B03313a20951N929B70164j7871B942a08254A62017
17895A09983a39284l3096A21925J56083f1925K5904C17623p7130j03739F4963
17884B61743b0185j6882B60824A14548k9842K46502A21677b77054b9640A33994
17873c0042j24659B45270a88658q3726J19285K5094A69304f695K859D7061d2119
17861C2837K43289h7419j71562A05470D2305J12372K08740b13587C94558a97085
17850a7091B22988A08780L78536b80252J04458B34113a5629B1889a45509B66137
$$ plain form
17839 390985 193270 -54875 -41159 170644 228156 32062 151569 -131550 -132260 -193182 116785
17827 179108 -63250 141043 58962 -2959 244584 -109529 -195657 -110478 228562 165976 105547
17816 105547 198404 283176 -1875 -31666 -117979 -148303 84127 85686 -81051 179188 135895 80255
17804 80255 308562 -171627 -153347 -113426 -13480 -122710 167248 -219841 -36379 43940 79196
17793 79196 -109387 -73950 118830 -64330 50115 -129194 87081 244967 156966 -9274 502874
17781 -2581 31035 190281 -62339 59151 -657 -205984 19144 179931 -133309 120490 123617
17770 123617 -47565 15772 34390 4902 79595 -68802 15838 88120 158510 -42488 125452
17758 -26557 119625 -32408 61778 -268722 363247 56107 365181 40609 58054 103781 374841
$$ packed form
17839C90985A93270e4875J3716A70644N7512C2062J19507a31550p10o0922A16785
17827A79108f3250A41043E8962b959B44584a09529q6128Q5179B28562o2586o0429
17816A05547R2857Q4772a875k9791q6313l0324H4127J559h1051A79188m3293n5640
17804H0255K28307a71627J8280L9921a3480j09230A67248b19841c6379D3940L5256
17793G9196a09387L5437A18830f4330E0115a29194H7081J57886q8001i274E02874
17781b581C1035J59246f2339E9151f57k05327A9144J60787a33309A20490L127
17770A23617d7565A5772J8618D902P4693f8802A5838P2282P0390d2488A25452
17758b6557A19625c2408F1778b68722C63247E6107L09074D0609J7445M5727K71060
$$ plain form
17747 374841 137221 106872 161177 -186310 -59760 47738 -226712 164964 -15956 25472 255716
17736 255716 315851 140641 23833 18869 -212561 20142 164544 -87089 -98933 -395853 -112338
17724 -164412 343669 -48460 190745 69465 -19303 117243 500516 45564 -49077 326548
17713 -319442 -30774 400170 136496 -244227 -99291 14391 22943 -351023 290208 508783
17703 508783 63602 74393 -8724 -164836 71305 -185564 406910 245467 -32795 7371 54031
17692 54031 -29122 189433 195355 -1179 134473 58884 164096 158515 284724 104192 186475
17681 186475 233138 -142503 -118706 28577 95639 -194914 -20230 224336 191935 -248710 -74204
17669 420052 11188 31963 38812 284560 134675 148618 -53962 103359 -87335 315066 105539
$$ packed form
17747C74841A37221l0349N4305a86310e9760D7738b26712A64964a5956B5472K30244
17736B55716O0135A40641B3833m964b12561B0142J44402h7089j1844k96920a12338
17724a64412C43669d8460A90745F9465a9303A17243L83273D5564d9077C26548
17713c19442c0774D00170A36496b44227i9291A4391Q552c51023B90208K18575
17703E08783F3602J0791h724j56112G1305a85564D06910j61443c2795G371M6660
17692E4031b9122A89433N922a179A34473E8884J05212n581J26209A04192Q2283
17681A86475M6663a42503K3797B8577O7062a94914b0230B24336l2401b48710g4204
17669D20052A1188K0775O849K45748A34675J3943e3962A03359h7335C15066A05539
$$ plain form
17657 -6341 -284153 -182898 90261 191537 -165804 -113448 328519 159273 137753 232056 72213
17645 -71438 445098 215578 58422 -301477 144225 -256421 -293595 396784 320087 -9371 167882
17633 376447 -36041 103233 116163 88908 162684 381662 161965 310245 405296 96086 -33704
17621 211767 -256506 -14693 174257 97219 139545 -37508 259476 223046 253777 -217513 106035
17609 141534 171858 158798 -9771 343866 319341 -47683 17390 19723 106224 279498 21194
17597 -190941 110933 -38098 130078 92292 71212 42947 200115 165174 253321 368031 -21727
17585 128386 17949 -122677 92504 23649 154558 -78943 -111011 -104958 166546 246856 341989
17574 341989 -24638 10035 440559 -26068 82579 167193 301202 91125 97173 42502 -205113
$$ packed form
17657f341k77812J01255I0261J01276a65804N2356C28519A59273k1520R4303G2213
17645g1438D45098B15578E8422c01477A44225b56421l7174C96784p6697i371A67882
17633C76447c6041A03233J2930k7255P3776K18978A61965J48280R5051I6086c3704
17621B11767b56506a4693A74257p7038M2326c7508B59476l6430L0731b17513A06035
17609A41534L0324j3060i771C43866k4525d7683A7390K333Q6501J73274B1194
17597a90941A10933c8098A30078l7786k1080k8265J57168l4941Q8147J14710b1727
17585A28386A7949a22677I2504B3649J30909g8943l2068O053A66546Q0310R5133
17574C41989b4638A0035M30524b6068H2579Q4614J34009I1125O048D2502b05113
$$ plain form
17562 334271 29438 -65858 125428 232642 159378 273066 34928 90321 17962 -235439 201264
17550 197332 -25043 137389 57195 11786 76744 50958 -257656 220138 45007 -4117 13849
17538 -281958 -143359 314182 224728 316077 -49071 113054 190453 154245 8779 190216 706649
17527 706649 505046 253228 105350 272463 330037 298942 346698 493207 668935 240081
17516 349726 411520 84140 190006 -112124 225773 336475 456027 293068 780752 776265
17506 776265 579395 803079 742381 63291 450470 90142 185988 244658 115850 35404 56532
17495 56532 213945 122019 -18288 76221 454838 377125 283531 408917 136492 269835 199678
17484 199678 287508 455361 366144 226954 123220 -11848 295693 96272 58938 180613
$$ packed form
17562C34271B9438f5858A25428J07214p3264J13688C4928N5393A7962b35439B01264
17550A97332b5043A37389E7195A1786O4958k5786b57656B20138D5007d117A3849
17538b81958J38599C14182q9454R1349d9071A13054P7399l6208H779J81437N16433
17527G06649k01603k51818A05350J67113N7574l1095M7756J46509J75728B40081
17516C49726O1794H4140J05866a12124B25773J10702J19552j62959M87684m487
17506G76265j96870K23684o0698F3291L87179I0142R5846N8670A15850C5404K1128
17495E6532J57413r1926a8288G6221L78617p7713r3594J25386A36492J33343p0157
17484A99678Q7830J67853q9217j39190j03734a1848B95693I6272l7334J21675
$$ plain form
17474 180613 -17849 14967 104076 590787 110764 -166246 302960 347715 332711 286387 239125
17463 239125 -15579 191417 152235 66228 337037 112175 218783 246585 270678 85351 60810
17452 60810 81211 63521 371425 66402 264024 333554 294697 126294 314991 507870 264559
17441 264559 101948 487372 322222 247852 603087 4562 472052 337048 -7483 201073
17430 341023 102166 183760 266805 368036 270663 -63079 206957 148907 203628 325625 577049
17419 577049 455390 471489 536698 251993 182675 400147 -16268 417192 282891 58471
17408 442952 152134 148927 253216 246014 98569 93455 11572 126894 -79299 -22194 11772
17396 377382 342552 -75852 327022 195661 92867 193100 258604 114437 259029 477163
$$ packed form
17474A80613a7849A4967Q9109M86711A10764a66246C02960M4755j5004m6324m7262
17463B39125a5579A91417l9182F6228K70809A12175J06608K7802K4093H5351k4541
17452F0810K0401j7690L07904F6402J97622O9530l8857A26294J88697J92879k43311
17441B64559A01948L85424j65150p4370L55235D562M67490j35004g483B01073
17430C41023A02166Q1594Q3045J01231r7373f3079B06957n8050N4721J21997K51424
17419E77049j21659J6099O5209B51993o9318K17472a6268D17192j34301E8471
17408D42952A52134l207J04289p202I8569n114A1572J15322g9299b2194A1772
17396C77382l4830g5852C27022j31361I2867J00233O5504A14437J44592K18134
$$ plain form
17386 477163 -48988 278096 85717 347866 55760 73526 69322 343505 204778 181788 427903
17375 427903 163121 142520 161857 184881 108503 368427 264588 349486 150918 386239
17365 386239 419991 106227 210448 295031 289318 144910 589310 -147551 218993 46316
17354 474464 60064 233090 215500 86095 34834 422183 555537 -54338 270171 14415 143807
17343 143807 -53848 -2632 299633 175773 285354 111629 198102 155507 352700 413538 220925
17332 220925 378998 200931 413070 414030 506427 199226 179382 -121177 336049 230161
17322 230161 196660 16791 126850 -83819 110783 228184 -120438 304801 291950 88126
17311 8077 297246 319530 439546 242601 296576 297931 342797 -8531 362587 517842 409132
$$ packed form
17386D77163d8988B78096H5717K62149E5760J7766m204K74183j38727k2990K46115
17375D27903A63121k0601J9337K3024p6378K59924j03839Q4898A50918K35321
17365C86239L3752A06227J04221Q4583n713j44408M44400a47551B18993D6316
17354D74464F0064J73026j7590H6095C4834L87349J33354e4338B70171A4415J29392
17343A43807e3848b632B99633j23860J09581A11629Q6473m2595J97193O0838j92613
17332B20925J58073j78067K12139R60R2397A99226j9844a21177C36049j05888
17322B30161l3501A6791J10059h3819A10783J17401a20438C04801j2851H8126
17311H077K89169K2284J20016j96945N3975J355M4866h531C62587J55255j08710
$$ plain form
17300 409132 131669 155875 -62241 466899 369241 100080 176222 397879 297658 410312
17290 410312 395523 118108 62316 357132 480897 278924 427897 526738 8138 156336
17280 156336 450382 160116 500646 -99730 47907 205325 438813 784141 399849 302901
17270 302901 288282 361607 693433 322284 363016 184028 389907 200616 401507 82173
17259 42132 303553 306055 -28698 300726 280568 461399 355616 579419 491632 350812 247410
17248 247410 257050 282503 570595 409461 582921 178565 228352 470057 150706 333889
17238 333889 333629 590804 307834 285988 213952 580128 224713 476804 246666 282056 312316
17227 312316 217624 473187 196042 197305 68193 219701 826747 289723 367758 299628 17985
$$ packed form
17300D09132A31669K4206f2241D66899r7658A00080P6142K21657j00221J12654
17290D10312j4789A18108n5792K94816J23765k01973J48973R8841H138J48198
17280A56336K94046A60116L40530i9730D7907J57418K33488L45328l84292r6948
17270C02901j4619P3325L31826C22284M0732j78988K05879j89291K00891H2173
17259D2132K61421K502b8698C00726k0158J80831j05783K23803q7787j40820j03402
17248B47410R640K5453K88092j61134J73460A78565M9787K41705A50706J83183
17238C33889k60K57175k82970k1846p2036L66176B24713K52091k30138L5390L0260
17227C12316r4692K55563A96042J263F8193J51508O07046B89723P8035o8130A7985
$$ plain form
17215 316042 472710 239904 226144 -144788 467230 222188 76817 364961 427112 420624
17205 420624 227593 115760 689486 491611 478060 163109 405803 317121 149376 543319
17195 543319 358925 449736 71872 6740 513344 93818 471763 521418 699925 479745 349988
17184 349988 507554 512272 399306 270636 287176 550194 332668 301678 443585 723970
17174 723970 433498 419884 642393 387780 326393 227128 419349 561715 343936 277878
17164 277878 196681 248880 515545 391429 594197 456004 575326 582870 278461 453596
17154 453596 382809 758856 475054 275175 418020 547447 226371 725112 469795 490204
17144 490204 304702 390816 626019 600372 488329 211962 329139 584023 527152 430168
$$ packed form
17215C16042J56668k32806j3760a44788D67230B22188G6817K88144O2151o488
17205D20624j93031j11833N73726j97875j3551A63109K42694q8682A49376L93943
17195E43319j84394R0811G1872F740N06604I3818L77945M9655J78507k20180j29757
17184C49988J57566M718j12966j28670J6540K63018k17526l0990J41907K80385
17174G23970k90472j3614K22509k54613o1387r9265J92221J42366k17779o6058
17164B77878q1197N2199K66665j24116K02768j38193J19322P544B78461J75135
17154D53596p0787L76047k83802j99879J42845J29427B26371M98741k55317K0409
17144D90204j85502Q6114K35203k5647j12043B11962J17177K54884n6871r6984
$$ plain form
17134 430168 427989 545197 662598 244598 720699 797080 358199 721885 641649 807978
17124 807978 529776 572794 538109 826140 644843 397100 674910 514176 593750 453072
17114 453072 822088 559447 438135 563407 331796 429058 724071 503136 343493 536313
17104 536313 683308 595564 633146 469054 484502 639263 477756 665187 535808 797103
17094 797103 591834 941479 673246 829250 936839 738645 920429 915500 719544 898196
17084 898196 522385 636843 753107 676408 791828 777104 997360 931006 1024558 974624
17074 974624 746425 539519 950484 654485 671936 807178 789462 719730 927510 914118
17064 914118 896696 693054 809056 718042 1087979 721818 1000250 908201 952238 1010689
$$ packed form
17134D30168k179J17208J17401B44598M76101P6381C58199L63686q0236J66329
17124H07978k78202M3018l4685K88031j81297k47743K77810j60734P9574j40678
17114D53072L69016k62641j21312J25272k31611R7262K95013k20935j59643J92820
17104E36313J46995q7744L7582j64092J5448J54761j61507J87431j29379K61295
17094G97103k05269L49645k68233J56004J07589j98194J81784m929j95956J78652
17084H98196l75811J14458J16264p6699J15420j4724K20256o6354R3552m9934
17074I74624k28199k06906M10965k95999J7451J35242j7716o9732K07780j3392
17064I14118j7422k03642J16002r1014L69937l66161K78432r2049M4037N8451
$$ plain form
17054 1010689 798692 968573 1062231 750950 833553 971387 806679 846472 994542 789955
17044 789955 764776 964339 1232948 1160909 800325 1149795 1131674 1076384 1152294 1169940 1009474
17033 1009474 857830 1051617 922386 1043264 930338 955580 1065661 931762 1274396 1016131
17023 1016131 1060372 1126497 1015712 1341197 1012731 1319156 1256271 933102 918699 968640
17013 968640 1161580 1119749 1273798 1133091 1416535 1232626 1356739 1120680 1429504 1428347
17003 1428347 1279759 1412589 1037946 1280357 1173630 1337685 1199886 1196008 1358872 1103506
16993 1103506 1756251 1265297 1313160 1233050 1312386 1493287 1309150 1627731 1287638 1854391
16983 1854391 1612599 1436091 1246015 1310978 1253259 1318853 1481281 1496059 1380620 1863205
$$ packed form
17054A010689k11997J69881R3658l11281Q2603J37834j64708L9793J48070k04587
17044G89955k5179J99563K68609p2039l60584L49470j8121n5290P5910J7646j60466
17033A009474j51644J93787j29231J20878j12926K5242J10081j33899L42634k58265
17023A016131M4241O6125j10785L25485l28466L06425o2885l23169j4403M9941
17013I68640J92940m1831J54049j40707K83444j83909J24113k36059L08824j157
17003A428347j48588J32830l74643K42411j06727J64055j37799l878J62864k55366
16993A103506O52745m90954M7863q0110P9336J80901j84137L18581l40093N66753
16983A854391k41792j76508j90076O4963n7719O5594J62428J4778j15439M82585
$$ plain form
16973 1863205 1569450 1448618 1435016 1806152 1808596 1434712 1605292 1499461 1851436 1817660
16963 1817660 1535946 1793218 1547321 1779531 1881363 1483158 2012853 2262363 1883952
16954 1883952 1867737 1743621 1815866 1753475 1744689 1899351 1942333 1817733 2034677 1840582
16944 1840582 2112155 2101419 2264182 1969985 2070885 2244942 2511721 2461354 2252374 2403333
16934 2403333 2388867 2357013 2423973 2372183 2183430 2370421 2493141 2268735 2723420 2422003
16924 2422003 2643497 2808491 2881493 2658714 2947733 2602919 3029636 2486591 2715178 2534537
16914 2534537 3199820 2846284 2830346 2639094 3064929 3165689 2917986 3204923 3031330 3025651
16904 3025651 3242501 3358434 3481675 3139706 3497088 3316026 3549242 3497730 3622019 3503978
$$ packed form
16973A863205k93755j20832j3602L71136K444l73884J70580j05831L51975l3776
16963A817660k81714K57272k45897K32210J01832l98205N29695K49510l78411
16954A883952j6215j24116P2245o2391q786J54662M2982j24600K16944j94095
16944A840582K71573j0736J62763k94197J00900J74057K66779n0367k08980J50959
16934B403333j4466l1854O6960n1790j88753J86991J22720k24406M54685l01417
16924B422003K21494J64994P3002k22779K89019l44814M26717n43045K28587j80641
16914B534537O65283l53536j5938j91252M25835J00760k47703K86937j73593n679
16904C025651K16850J15933J23241l41969L57382j81062K33216n1512J24289j18041
$$ plain form
16894 3503978 3600785 3674064 3862701 3897405 3805716 3958843 4256854 3927751 4020978 4416050
16884 4416050 4277627 4484436 4141166 4484367 4331477 4492624 4588308 4725286 4573528 4655309
16874 4655309 4943432 4821527 5028613 5279127 4932747 5283898 5355947 5352295 5589991 5324003
16864 5324003 5688254 5993715 5367559 6023795 5533293 5942875 5983626 6036016 6510905 6414095
16854 6414095 6439756 6790883 6768402 6855241 7292358 6950260 7344578 7177455 7253997 7585327
16844 7585327 7825579 7555182 7891982 8168502 8337407 8186290 8407075 8742640 8715551 9098440
16834 9098440 9043733 9215324 9477157 9717831 9906145 10215441 10273762 10274483 10643036 10887628
16824 10887628 10682460 11252132 11296252 11762535 11999614 12193861 12436177 12800472 12860884 13229369
$$ packed form
16894C503978R6807P3279J88637L4704r1689J53127K98011l29103R3227L95072
16884D416050j38423K06809l43270L43201j52890J61147R5684J36978j51758Q1781
16874D655309K88123j21905K07086K50514l46380L51151P2049l652K37696k65988
16864E324003L64251L05461o26156O56236m90502M09582M0751N2390M74889r6810
16854F414095K5661L51127k2481Q6839M37117l42098L94318j67123P6542L31330
16844G585327K40252k70397L36800K76520J68905j51117K20785L35565k7089L82889
16834I098440n4707J71591K61833K40674J88314L09296N8321P21L68553K44592
16824A0887628k05168N69672M4120M66283K37079J94247K42316L64295O0412L68485
$$ plain form
16814 13229369 13637351 13667979 14301483 14348915 14734582 15413689 15705907 15688785 16086376 16778439
16804 16778439 16989192 17288095 17721398 17859380 18619788 18897263 19515605 19849627 20260420
16795 20260420 20896047 21819208 21670807 22648017 22908405 23840024 24656970 24992650 25865390
16786 25865390 26488522 26974245 28095511 28590986 29642275 30088345 30980902 32111171 32895152
16777 32895152 33823876 35247933 35724447 36759945 37831149 38940775 39822753 41084799
16769 41084799 42559830 43559234 44708686 46012981 47336775 48703303 50332922 51520345
16761 51520345 53177974 54320385 56246030 57839609 59068349 60613209 62540862 64063551
16753 64063551 65767925 67301444 68669944 70456889 72002546 73846836 75153836 76501903
$$ packed form
16814A3229369M07982L0628O33504M7432L85667O79107K92218j7122L97591O92063
16804A6778439K10753K98903M33303J37982P60408K77475O18342L34022M10793
16795B0260420O35627R23161j48401R77210K60388R31619Q16946L35680Q72740
16786B5865390O23132M85723J121266M95475J051289M46070Q92557J130269P83981
16777C2895152R28724J424057M76514J035498J071204J109626Q81978J262046
16769D1084799J475031R99404J149452J304295J323794J366528J629619J187423
16761E1520345J657629J142411J925645J593579J228740J544860J927653J522689
16753F4063551J704374J533519J368500J786945J545657J844290J307000J348067
$$ plain form
16745 76501903 77989498 79833051 80800011 82213701 83440151 84248703 85386079 86541094
16737 86541094 87157134 87679187 88769127 88980979 89302786 89208013 89601976 89068346 88878434
16728 88878434 88818489 88073495 87552051 86884542 85868998 85110012 84211363 82891463 82067151
16719 82067151 80637206 79181711 77821035 76319031 74958327 73554166 71904389 69962643
16711 69962643 68624241 67234155 65709219 63743545 62461809 61090792 59485221 58080229
16703 58080229 56809612 55185158 53706628 52426539 50943160 49968575 48315169 47082801
16695 47082801 45925107 44830528 43615783 42381185 41355352 40236919 39014679 38238100
16687 38238100 37320514 36414800 35305490 34593782 33444844 32805710 32039405 31001902 30471432
$$ packed form
16745G6501903J487595J843553R66960J413690J226450Q08552J137376J155015
16737H6541094O16040N22053J089940K11852L21807r4773L93963n33630j89912
16728H8878434n9945p44994n21444o67509j015544p58986q98649j319900q24312
16719H2067151j429945j455495j360676j502004j360704j404161j649777j941746
16711F9962643j338402j390086j524936j965674j281736j371017j605571j404992
16703E8080229j270617j624454j478530j280089j483379r74585j653406j232368
16695D7082801j157694j094579j214745j234598j025833j118433j222240p76579
16687C8238100r17586r05714j109310p11708j148938o39134p66305j037503n30470
$$ plain form
16678 30471432 29671898 29321966 28173028 27527800 27255314 26105855 25635359 24922790 24353467
16669 24353467 23929000 23089459 22760355 22140408 22023572 21394086 20649268 20383440 20184859
16660 20184859 19376151 18917865 18687933 18478103 17978302 17831499 17293780 16690687 16819945
16651 16819945 16380450 16041084 15772067 15474148 15320798 14723650 14445214 14387441 14138876
16642 14138876 13833706 13500043 13117821 12977473 12549217 12470018 12543554 12181233 11975910 11841966
16632 11841966 11540478 11518145 11208131 10957786 10915525 10471059 10586729 10444402 10099454 9858168
16622 9858168 9837213 9650363 9451929 9367142 9203404 9103727 9056113 9013904 8779466 8534548
16612 8534548 8572000 8181223 8047704 8438887 8055011 7787755 7745696 7365648 7482826 7594679
$$ packed form
16678C0471432p99534l49932j148938o45228k72486j149459m70496p12569n69323
16669B4353467m24467q39541l29104o19947j16836o29486p44818k65828j98581
16660B0184859q08708m58286k29932k09830m99801j46803n37719o03093J29258
16651A6819945m39495l39366k69017k97919j53350n97148k78436n7773k48565
16642A4138876l05170l33663l82222j40348m28256p9199P3536l62321k05323j33944
16632A1841966l01488k2333l10014k50345m2261m44466J15670j42327l44948k41286
16622I858168k0955j86850j98434q4787j63738r9677m7614m2209k34438k44918
16612H534548L7452l90777j33519L91183l83876k67256m2059l80048J17178J11853
$$ plain form
16602 7594679 7397438 7337030 7404348 7132418 7078971 7081705 6993701 6809168 6880363 6560439 6407445
16591 6407445 6648918 6210391 6203606 6348959 6387995 6313230 6015588 6006435 5483803 6392089
16581 6392089 5630065 5792938 5896550 5809669 5790016 5318720 5498671 5523285 5235970 5133839
16571 5133839 5349567 5307026 4993556 4970743 4692499 4940061 4801404 4514907 4578741 4684772
16561 4684772 4764380 4655571 4209533 4733636 4447895 4404730 4453471 4401699 4367149 4528263
16551 4528263 4225228 4305638 4210812 4186173 4185395 3832094 4034071 4017946 3888495 3928953 3857813
16540 3857813 3939627 3874474 3430023 3591502 3454475 3700813 3531286 3638943 3621786 3567957
16530 3567957 3559900 3593068 3558278 3580482 3304238 3590739 3216872 3521116 3640417 3148864
$$ packed form
16602G594679j97241o0408O7318k71930n3447K734q8004j84533P1195l19924j52994
16591F407445K41473m38527o785J45353L9036p4765k97642r153n22632R08286
16581F392089p62024J62873J03612q6881j9653m71296J79951K4614k87315j02131
16571E133839K15728m2541l13470k2813k78244K47562j38657k86497O3834J06031
16561D684772P9608j08809m46038N24103k85741m3165M8741n1772l4550J61114
16551D528263l03035Q0410r4826k4639p78l53301K01977j6125j29451M0458p1140
16540C857813Q1814o5153m44451J61479j37027K46338j69527J07657j7157n3829
16530C567957q057L3168l4790K2204k76244K86501l73867L04244J19301m91553
$$ plain form
16520 3148864 3050537 3317766 3238825 3538533 3209273 3200004 3122195 2914394 3109301 3039233
16510 3039233 3122167 3098773 2962699 2935773 2974907 2894976 2971550 2775409 2883102 2771077
16500 2771077 2829713 2680639 2770956 2402193 2607388 2750230 2471966 2751916 2582393 2226502
16490 2226502 2591508 2629656 2832960 2597677 2466369 2831218 2542276 2364787 2277049 2292624
16480 2292624 2303718 2541212 2125820 2437845 2119352 2504154 2462276 2309783 2324774 2412303
16470 2412303 2290089 2205580 2592170 2095138 2420425 2437959 2107605 2336174 2240740 2067332
16460 2067332 2526659 2226413 1836862 2092448 2033416 1822267 1793368 2082592 2059033 1851579
16450 1851579 2040777 2057129 2101996 1761795 2065444 1898631 1973274 1935741 1706879 1708881
$$ packed form
16520C148864r8327K67229p8941K99708l29260r269p7809k07801J94907p0068
16510C039233Q2934k3394j36074k6926L9134p9931P6574j96141J07693j12025
16500B771077N8636j49074R0317l68763K05195J42842k78264K79950j69523l55891
16490B226502L65006L8148K03304k35283j31308L64849k88942j77489q7738J5575
16480B292624J1094K37494m15392L12025l18493L84802m1878j52493J4991Q7529
16470B412303j22214q4509L86590m97032L25287J7534l30354K28569r5434j73408
16460B067332M59327l00246l89551K55586n9032k11149k8899K89224k3559k07454
16450A851579J89198J6352M4867l40201L03649j66813P4643l7533k28862K002
$$ plain form
16440 1708881 2007596 1824236 2237715 1964245 1599785 1787590 1872016 1539984 2087642 1792324
16430 1792324 1910028 1749531 1977811 2035005 1788765 1881402 1562589 1662671 1707391 2046812
16420 2046812 1399312 2125795 1686005 1750277 1554988 2023087 1491546 1253597 1605346 1675386
16410 1675386 1564443 1559290 1458912 1542376 1762076 1843200 1914365 1074359 1793691 1713810
16400 1713810 1577149 1820902 1783019 1400644 1769458 1267363 1420094 1683412 1545737 1465321
16390 1465321 1533032 1581906 1480283 1478671 1669129 1518303 1450800 1612460 1801812 1461889
16380 1461889 1337843 1310932 1416750 1483472 1289335 1394995 1425880 1386404 1349163 1424047
16370 1424047 1341335 1399657 1195036 1198474 1267617 1360372 1383350 1047680 1241285 1282699 1080973
$$ packed form
16440A708881K98715j83360M13479k73470l64460J87805Q4426l32032N47658k95318
16430A792324J17704j60497K28280N7194k46240R2637l18813J00082M4720L39421
16420B046812o47500P26483m39790O4272j95289M68099n31541k37949L51749P0040
16410A675386j10943n153j00378Q3464K19700Q1124P1165q40006P19332p9881
16400A713810j36661K43753l7883l82375L68814n02095J52731K63318j37675q0416
16390A465321O7711M8874j01623j612J90458j50826o7503J61660J89352l39923
16380A461889j24046k6911J05818O6722j94137J05660L0885l9476l7241P4884
16370A424047q2712N8322k04621L438O9143R2755K2978l35670J93605M1414k01726
$$ plain form
16359 1080973 1166005 1085288 1392671 1299928 1394527 1447232 1281957 1147899 1439197 1215293
16349 1215293 1273281 1356815 1229181 1354541 1005862 1039211 1255570 1160130 1197049 1270949
16339 1270949 1156207 1212628 1543797 1236079 795749 1227558 1047448 1137185 1303466 1174905
16329 1174905 1150146 1150757 1246776 979234 1080146 1095101 971716 1001192 974355 1187816 930526
16318 930526 1264253 1025963 1265521 945090 842252 974770 925593 1153829 964324 699815
16308 699815 1019937 1161858 1014889 1269918 703195 916915 895280 1004243 827640 1099143
16298 1099143 1117587 828912 907071 999353 1208374 951400 1132272 930755 954765 965941
16288 965941 866515 846160 1114644 721239 1173251 863285 1054358 719082 841930 987257
$$ packed form
16359A080973Q5032q0717L07383r2743R4599N2705j65275j34058K91298k23904
16349A215293N7988Q3534j27634J25360l48679L3349K16359r5440L6919P3900
16339A270949j14742N6421L31169l07718m40330M31809j80110Q9737J66281j28561
16329A174905k4759O11R6019k67542J00912J4955j23385K9476k6837K13461k57290
16318I30526L33727k38290K39558l20431j02838J32518m9177K28236j89505k64509
16308F99815L20122J41921j46969K55029n66723K13720k1635J08963j76603K71503
16298A099143J8444k88675P8159R2282K09021k56974J80872k01517K4010J1176
16288I65941r9426k0355K68484l93405M52012l09966J91073l35276J22848J45327
$$ plain form
16278 987257 1007020 867072 1080619 1042607 923897 848254 675769 993749 711822 1006775
16268 1006775 742975 913602 769800 874676 782984 795501 701950 739540 552184 736779
16258 736779 455502 857952 842144 734037 476769 549633 859160 626859 898502 780487
16248 780487 927788 889261 602435 633504 786400 617963 796944 1087201 686045 822873
16238 822873 849699 754856 462009 867720 748568 768307 482002 801064 843525 747530
16228 747530 772037 683708 500583 309031 529828 458896 752463 693885 588433 658035
16218 658035 320599 826682 577911 608402 753580 787414 551793 560535 770685 546626
16208 546626 435147 720545 785899 663937 496984 629347 616444 780608 546650 718329
$$ packed form
16278I87257J9763j39948K13547l8012j18710p5643j72485L17980k81927K94953
16268A006775k63800J70627j43802J04876r1692J2517r3551L7590j87356J84595
16258G36779k81277M02450j5808j08107k57268P2864L09527k32301K71643j18015
16248G80487J47301l8527k86826L1069J52896j68437J78981K90257m01156J36828
16238H22873K6826r4843k92847M05711j19152J9739k86305L19062M2461r5995
16228G47530K4507q8329j83125j91552K20797p0932K93567n8578j05452O9602
16218F58035C20599N06083k48771L0491J45178L3834k35621Q742K10150k24059
16208E46626j11479K85398O5354j21962j66953J32363j2903J64164k33958J71679
$$ plain form
16198 718329 852949 694109 717854 584941 710239 364275 557918 603112 645386 446233
16188 446233 578969 484862 751133 182524 356398 557489 446050 725846 294150 192019
16178 192019 540868 728180 547872 804621 541326 757311 259440 353009 489393 618913
16168 618913 534758 444741 637502 261598 506792 702175 231587 432434 236048 327607
16158 327607 609954 360469 553284 401297 430492 443630 509737 636370 384170 557798
16148 557798 471786 545522 121914 177002 270898 276920 452890 566280 593162 212818 29458
16136 210277 655444 412564 616041 647679 227296 574469 139221 395269 172939 277782
16126 277782 309529 527605 150073 335763 522099 440460 194567 134869 303142 409134
$$ packed form
16198G18329J34620j58840K3745j32913J25298l45964J93643M5194M2274j99153
16188D46233J32736r4107K66271A82524J73874K01091j11439K79796B94150j02131
16178A92019L48849J87312j80308K56749k63295K15985B59440R3569J36384J29520
16168F18913q4155r0017J92761B61598K45194J95383B31587K00847j96386R1559
16158C27607K82347k49485J92815j51987K9195J3138O6107J26633k52200J73628
16148E57798q6012P3736A21914N5088R3896O022J75970J13390K6882B12818B9458
16136B10277M45167k42880K03477L1638B27296L47173A39221K56048A72939J04843
16126B77782L1747K18076A50073J85690J86336q1639A94567n9698J68273J05992
$$ plain form
16116 409134 216657 91559 -97459 347329 471982 330792 360095 90716 577355 552076
16106 552076 343973 413774 170624 294854 503670 403197 640337 511936 260327 73265
16095 469120 74323 679047 -158482 477147 132381 70251 102570 338957 576802 234888
16084 398714 346432 236071 172788 232450 25446 302681 676077 667562 135473 473765 711454
16073 711454 446720 396056 439341 353994 152178 581896 464473 243430 139652 214360
16063 214360 245181 424638 458498 327963 164803 165213 272404 110416 463996 244393
16053 244393 286211 401614 291213 229377 155085 350500 174328 150348 344943 214493
16043 214493 483598 235484 537006 -77857 188596 163662 140285 567508 442502 238778
$$ packed form
16116D09134j92477I1559i7459C47329J24653j41190K9303I0716M86639k5279
16106E52076k08103O9801A70624J24230K08816j00473K37140j28401k51609G3265
16095D69120G4323O04724a58482D77147A32381o2130L2319K36387K37845B34888
16084C98714n2282j10361o3283N9662B5446K77235L73396q515A35473L38292K37689
16073G11454k64734n0664M3285q5347A52178M29718j17423k21043j03778P4708
16063B14360L0821J79457L3860j30535j63160M10J07191A10416L53580k19603
16053B44393M1818J15403j10401o1836p4292J95415A74328k3980J94595j30450
16043B14493K69105B35484L01522g7857A88596k4934k3377M27223j25006k03724
$$ plain form
16033 238778 196270 340265 231936 451199 393997 304787 219712 200382 313415 463176
16023 463176 69937 268449 310873 126070 56190 -260909 279012 573909 257879 64623
16012 534668 387358 258375 159080 278464 -72250 43383 239092 -19551 249578 173013
16002 173013 217476 191006 165321 250448 163324 190202 73984 31671 210828 -57957 47302
15990 534681 392293 541445 498784 1147673 532820 864512 311232 483929 -162355 221614
15979 224401 85282 370930 142090 154999 -111662 70044 257703 130764 272710 110163
15968 313620 33089 28915 98051 -4627 176954 332752 248210 227529 66216 47606 -122454
15956 120054 18603 -69472 -42734 332718 465462 -14932 -137694 275440 28295 168245
$$ packed form
16033B38778m2508J43995j08329K19263n7202q9210q5075j9330J13033J49761
16023D63176F9937J98512M2424A26070E6190b60909B79012K94897B57879F4623
16012E34668j47310j28983r9295J19384g2250D3383J95709a9551B49578p6565
16002A73013M4463k6470k5685Q5127q7124K6878G3984C1671J79157e7957D7302
15990E34681j42388J49152m2661O48889E32820L31692C11232J72697a62355B21614
15979B24401H5282K85648A42090J2909a11662G0044J87659j26939J41946A10163
15968C13620C3089m174O9136d627A76954J55798q4542k0681F6216j8610a22454
15956A20054A8603f9472K6738C32718J32744a4932j22762B75440B8295J39950
$$ plain form
15946 168245 -571388 249684 -64031 276878 53523 111232 215875 89089 -1452 175658 93273
15935 93273 3211 87935 192844 485895 -61088 109815 72394 167271 -79148 -136371 -127177
15924 -127177 119980 153682 37529 208568 -57495 7384 -81820 -14290 158607 238835 331836
15913 331836 131283 -25381 51787 -2727 153454 345434 121700 20738 -108057 -27147 90003
15901 -207526 -109297 -47110 109841 78584 359900 -30420 170579 -107193 115656 -186114
15890 -236865 -223905 -307117 192575 210189 167756 220229 -26326 135712 -92546 25492 112683
15879 112683 -93159 48634 137589 201198 85350 140806 -122809 -46243 156408 138385 257796
15868 257796 310062 251960 3503 70613 40803 38504 193789 133632 167314 427142 352221
$$ packed form
15946A68245e71388B49684f4031B76878E3523N7709J04643H9089a452A75658q2385
15935I3273C211Q4724J04909K93051f1088A09815l7421R4877g9148n7223R194
15924a27177A19980L3702C7529J71039e7495G384h1820a4290A58607Q0228R3001
15913C31836A31283b5381E1787b727A53454J91980A21700B0738a08057b7147I0003
15901b07526R8229d7110A09841l1257K81316c0420A70579a07193A15656a86114
15890b36865J2960q3212A92575J7614m2433N2473b6326A35712i2546B5492Q7191
15879A12683i3159D8634Q8955O3609H5350N5456a22809d6243A56408j8023J19411
15868B57796N2266n8102C503O7110k9810k299J55285o0157L3682K59828p4921
$$ plain form
15857 352221 -264139 88723 61952 -31207 -246312 -19457 137392 44501 -61029 -237270 17325
15845 155340 -24853 -188396 390673 224978 -104523 15909 -200288 53371 -271952 35329
15834 -86591 -15934 137944 101466 -260310 69693 -120225 -51237 -13279 28858 272960 -131213
15822 -285873 -399510 63758 98227 129258 -283781 -3835 -113299 183019 1091 123403 -20155
15810 163874 -300455 -54672 -10171 -98191 -22336 25196 286139 108604 203522 13674 -262244
15798 9046 300226 -398254 131646 108186 387152 314253 -375430 -200188 100845 289691
15788 289691 30500 143169 225754 -264508 27814 50748 378480 89423 188446 -167466 333094
15776 -21707 -194631 -104179 -149545 -102955 70004 325889 276024 -48444 56899 50101 15337
$$ packed form
15857C52221b64139H8723k6771c1207k15105a9457A37392D4501f1029j76241A7325
15845A55340b4853j63543C90673j65695a04523A5909b00288E3371b71952C5329
15834h6591a5934A37944l6478b60310F9693a20225e1237a3279B8858K44102a31213
15822b85873j13637F3758L4469L1031b83781c835j09464A83019A091J22312b0155
15810A63874c00455e4672a0171q8020b2336B5196K60943A08604R4918A3674b62244
15798I046K91180c98254A31646k3460K78966p2899c75430J75242A00845J88846
15788B89691C0500J12669Q2585b64508B7814K2934L27732H9423R9023a67466C33094
15776b1707j72924R0452m5366M6590G0004K55885m9865d8444E6899o798A5337
$$ plain form
15764 53500 174554 -76316 -24277 -174235 -15556 34720 280650 115636 2056 26732 -99827
15752 233818 88987 164126 -257927 -32896 -351104 -7477 49995 291322 229362 125985 263773
15741 263773 92338 26069 99533 104004 216812 -170889 55510 -140085 -81197 -199169 160907
15729 -132971 -52692 62857 31842 168741 -174968 48381 -56005 367325 -233837 -35443 291760
15717 256027 -256318 -605046 13073 -198279 -314152 -234342 44297 125340 314484 -266086
15706 82129 -125727 -30431 -236586 271060 -95564 -11883 -77399 -67440 -478822 157916 221026
15695 221026 -785 -114772 285022 -120304 -51922 44399 92552 179403 174685 -100868 317350
15683 62851 10165 61792 -108162 -82839 194200 -54299 107829 -173040 -71588 104343 -69778
$$ packed form
15764E3500J21054g6316b4277j49958a5556C4720K45930A15636B056K4676i9827
15752B33818H8987P5139b57927c2896l18208g477D9995K41327o1960j03377J37788
15741B63773I2338B6069P3464M471J12808a70889E5510a40085N8888j17972A60907
15729a32971e2692F2857l1015J36899a74968D8381e6005C67325b33837c5443B91760
15717B56027b56318l48728A3073a98279j15873P9810D4297Q1043J89144b66086
15706H2129a25727c0431k06155B71060i5564a1883o5516R959m11382A57916O3110
15695B21026g85j13987B85022a20304e1922D4399M8153Q6851m718a00868C17350
15683F2851A0165N1627a08162K5323A94200e4299A07829a73040g1588A04343f9778
$$ plain form
15671 -36804 2181 86765 187166 127163 108689 -263863 -88502 78588 -263355 -135070 11694
15659 62819 -164875 -83208 33845 111333 -96805 217910 218084 -129232 249852 -185087 39070
15647 326975 -176941 -32814 -21343 -305204 -29207 -130835 132534 -91087 279840 -361378
15636 42948 -91979 -98364 32666 -42281 76191 167620 27172 140929 -214533 131562 161239
15625 161239 -129231 112977 -294185 12189 -15753 -227337 107635 149981 229824 3319 -128333
15613 181 -347058 -247590 71705 15295 286187 6821 100386 -236077 -41579 -255893 -193790
15602 -193790 -336265 -189347 -192182 -93512 86084 -36466 5467 10960 133633 436663 -10676
15590 122531 7879 282733 26338 182673 69211 -48984 19608 110588 155133 -212157 145634
$$ packed form
15671c6804B181Q4584J00401o0003j8474b63863h8502G8588b63355J28285A1694
15659F2819a64875Q1667C3845P7488i6805B17910J74a29232B49852a85087C9070
15647C26975a76941c2814J1471k83861b9207j01628A32534i1087B79840c61378
15636D2948i1979o385C2666d2281G6191R1429B7172J13757b14533A31562K9677
15625A61239a29231A12977b94185A2189a5753k11584A07635M2346P9843C319a28333
15613A81c47058R9468G1705A5295K70892F821R3565b36077d1579k14314O2103
15602a93790j42475J46918k835i3512H6084c6466E467N493J22673L03030a0676
15590A22531G879K74854B6338J56335F9211d8984A9608R0980M4545b12157A45634
$$ plain form
15578 92319 4826 44849 -95154 -94214 165360 -111549 -110708 173669 -68299 94118 181080 -164615
15565 -241149 107505 132625 -165093 -227679 263350 58057 -141915 91408 -108800 419211
15554 77859 231750 11556 -192562 143595 -25110 285137 -61859 246641 -173265 198214
15543 -146698 -192774 -146044 -31520 37066 161938 158851 -161756 81734 77909 303115 -99387
15531 100987 61246 -213905 450059 36589 256751 -97175 16765 491575 2704 -237228 43486
15519 -241840 183158 112039 25771 248207 -94619 218207 135366 184251 139089 13147 -228959
15507 -39988 83437 -164534 -52980 84808 53921 -89680 152848 337746 121966 -241600 -223043
15496 -223043 -70961 -69115 -65949 -171587 -128212 -228373 -33606 -99763 359104 187341 121925
$$ packed form
15578I2319D826M0023i5154R40A65360a11549Q41A73669f8299I4118Q6962a64615
15565b41149A07505K5120a65093o2586B63350E8057a41915I1408a08800D19211
15554G7859J53891A1556a92562A43595b5110B85137f1859B46641a73265A98214
15543a46698m6076M6730c1520C7066J24872l087a61756H1734l825K25206i9387
15531A00987l9741b13905D50059C6589K20162i7175A6765M74810B704b37228D3486
15519b41840A83158p1119B5771K22436i4619B18207q2841M8885m5162A3147b28959
15507c9988H3437a64534e2980H4808l0887h9680A52848J84898A21966b41600J8557
15496b23043g0961J846L166j05638M3375j00161c3606o6157C59104j71763o5416
$$ plain form
15485 121925 68721 27296 -7671 -123606 -210637 744 166371 -240404 103745 141986 199784
15474 199784 -100796 62267 286568 245331 113019 -74303 -40647 210041 190559 -57973 -233311
15463 -233311 7011 -192662 -366465 -53343 -51236 88594 -95211 95477 -193709 145698 19709
15451 -277119 297022 142114 366282 19855 206504 294180 444177 503323 798645 269113
15440 347383 232272 128692 109448 188212 -44341 203223 -202417 -22996 -181911 -360012
15430 -360012 59668 78373 610 151688 -187065 157090 104094 80949 43212 152177 152787
15419 152787 -77125 163178 20852 237509 -90546 -43084 259699 -172265 222173 141169
15409 141169 -337358 78616 79472 -63646 31768 7112 11491 -333046 -353027 204970 -39283 316395
$$ packed form
15485A21925n3204B7296g671j15935q7031G44J65627b40404A03745L8241N7798
15474A99784a00796F2267K24301m1237A13019g4303L3656B10041j9482e7973j75338
15463b33311G011a92662j73803e3343K107H8594i5211I5477a93709A45698A9709
15451b77119B97022A42114K24168A9855J86649Q7676J49997N9146K95322B69113
15440C47383j15111j03580j9244P8764d4341B03223b02417b2996j58915j78101
15430c60012E9668J8705F10J51078a87065A57090n2996k3145l7737J08965O10
15419A52787g7125A63178B0852K16657i0546d3084B59699a72265B22173q1004
15409A41169c37358G8616Q56f3646C1768G112M379c33046j9981B04970c9283C16395
$$ plain form
15396 133 -21836 -145550 126156 -12309 -104728 59002 -104503 151139 137665 122456 93594
15385 93594 -406238 115421 231025 -234311 -28524 366838 439011 172926 -21337 -28533 -69244
15374 -69244 26314 273873 190368 467376 195784 134110 37953 346742 117391 147751 200478
15363 200478 265539 60014 184718 -47454 145484 485169 38694 340389 321076 506654
15353 506654 -64825 184180 194881 -249164 -333129 14962 243809 370953 -56477 334043
15342 -118868 284975 -2039 329884 102642 -10397 221809 276799 -219175 123112 49784
15331 100397 259281 282700 -49271 43329 213581 117242 333697 117226 158622 -57179 91599
15319 359267 -242874 75001 75350 324884 378837 185573 208738 362450 226010 280224 133373
$$ packed form
15396A33b1836j23714A26156a2309r2419E9002a04503A51139j3474j5209k8862
15385I3594d06238A15421J15604b34311b8524C66838P2173A72926b1337p196m0711
15374f9244B6314K47559q3505K77008A95784o1674C7953L08789A17391L0360N2727
15363B00478O5061F0014J24704d7454A45484L39685C8694L01695j9313J85578
15353E06654f4825A84180J0701b49164q3965A4962K28847J27144e6477C34043
15342a18868B84975b039C29884A02642a0397B21809N4990b19175A23112D9784
15331A00397J58884K3419d9271D3329J70252r6339K16455A17226M1396e7179I1599
15319C59267b42874G5001L49K49534N3953A85573K3165J53712j36440N4214A33373
$$ plain form
15307 205832 349809 224910 -34821 -12831 133145 -57657 8346 -210484 -346151 184349
15296 168418 -54885 235868 106515 -11120 69691 107033 -118360 -200987 50677 195230 -18747
15284 251891 66343 -175126 106741 -71677 81249 181163 76689 281509 143167 48782 -175739
15272 -268835 -64205 121197 184871 -255417 -71637 97760 -41187 98011 282863 167057 -38243
15260 -391211 106963 -47812 16056 34878 -372430 168823 -60937 178344 39327 347230
15250 347230 528370 521424 1452522 1696807 1649032 1821890 1294823 722778 179195 230149
15240 230149 224924 273347 212001 -250330 49337 305304 70916 2261 59389 207440 98493
15228 206701 162737 -12728 276447 35080 241600 -10959 4955 259868 -38003 33007 337839
$$ packed form
15307B05832J43977j24899c4821a2831A33145e7657H346b10484j35667A84349
15296A68418e4885B35868A06515a1120F9691L7342a18360q2627E0677J44553a8747
15284B51891F6343a75126A06741g1677H1249R9914G6689K04820j38342D8782a75739
15272b68835f4205A21197O3674b55417g1637I7760d1187I8011J84852j15806c8243
15260c91211A06963d7812A6056J8822c72430A68823f0937A78344C9327L07903
15250C47230J81140o946R31098K44285m7775J72858n27067n72045A79195N0954
15240B30149n225M8423o1346b50330D9337K55967G0916B261N7128J48051I8493
15228B06701m3964a2728B76447C5080K06520a0959D955K54913c8003C3007L04832
$$ plain form
15217 337839 -142602 28566 398803 -80273 -110360 20586 -330964 124738 -335943 280842
15206 293317 -39250 -20636 74619 169326 -132613 120011 237697 228416 -40036 305221 -282020
15194 20876 212298 4808 18444 52071 72034 -229879 460650 -21756 -224306 122759 354097
15183 354097 -201465 50831 -178111 114580 -104032 -15227 -91903 -125911 -190541 -23714 -13761
15172 -13761 -168035 224966 -109672 -97150 49388 77833 88085 -420622 220320 78239 224142
15161 224142 166130 179041 24715 209287 241444 -2625 6037 160210 126627 320957 60839
15149 -133115 44085 -8723 378651 -127685 85268 245135 264561 13102 165734 -22489 289162
15137 378091 94955 -36882 11081 415642 16402 294705 52452 372145 155574 -257375
$$ packed form
15217C37839a42602B8566L70237h0273l0087B0586c30964A24738c35943B80842
15206B93317c9250J8614G4619R4707a32613A20011J17686r281d0036C05221b82020
15194B0876J91422D808J3636L3627J9963b29879D60650b1756k02550A22759K31338
15183C54097b01465E0831a78111A14580a04032a5227p6676l4008o4630b3714R953
15172a3761j54274B24966a09672J2522D9388K8445J0252d20622B20320G8239J45903
15161B24142n8012J2911B4715J84572L2157b625F037J54173l3583J94330F0839
15149a33115D4085h723C78651a27685H5268J59867J9426A3102J52632b2489B89162
15137C78091I4955c6882A1081M04561A6402K78303E2452L19693A55574b57375
$$ plain form
15126 220299 97506 267947 -142738 -178316 156191 6916 278167 233171 330184 66731 75069
15115 75069 30989 371389 135109 -7734 285114 66824 251953 238562 213801 -58323 257570
15103 99790 348834 475 330697 139964 159363 111489 246491 -235526 -131639 -24637 119562
15091 230195 194630 -36881 63652 585871 395720 233823 -69993 39701 182619 157654 307438
15080 307438 -28863 76697 138445 472360 116576 97480 100527 198015 177247 -89179 330671
15068 -151754 23901 492464 355109 -53763 448106 213459 -107601 218521 144006 -367653
15057 211094 134999 -182736 379607 420036 193919 187907 216020 218611 -18781 341137 77378
15045 245992 135281 454955 269988 307192 383669 -109304 554336 284547 435005 127464
$$ packed form
15126B20299I7506J70441a42738l5578A56191F916K71251m4996R7013F6731Q338
15115G5069C0989L40400A35109g734B85114F6824J85129j3391k4761e8323B57570
15103I9790K49044D75L30222A39964J9399m7874J35002b35526J03887b4637A19562
15091B30195l5565c6881F3652N22219j90151j61897f9993C9701J42918k4965J49784
15080C07438b8863G6697O1748L33915A16576j9096L047R7488k0768h9179C30671
15068a51754B3901M68563j37355e3763D48106B13459a07601B18521p4515c67653
15057B11094p6095a82736C79607M0429A93919o012K8113K591a8781C41137G7378
15045B45992j10711L19674j84967L7204P6477a09304E54336k69789J50458A27464
$$ plain form
15034 490989 207755 370524 79080 143268 450913 148311 154501 294497 480627 235679
15023 550919 146770 100949 49111 612255 158108 185441 -76189 286766 628426 156956
15012 279290 556003 540470 23503 438590 267234 98669 -13763 420384 207046 7452 205763
15001 205763 606839 493876 150250 577517 530440 465861 273612 214510 93745 355866
14991 355866 495386 219042 216132 47281 254684 211415 110528 229198 434233 277845
14981 277845 124522 293370 189127 353330 786904 584537 307336 357210 322648 366184
14971 366184 324339 300765 317385 653631 376149 414089 358831 424538 152848 585149 338761
14960 338761 492020 548143 315667 223947 537533 -184510 492254 241266 364237 34993
$$ packed form
15034D90989B07755J62769G9080O4188L07645A48311O190J39996J86130B35679
15023E50919A46770m5821D9111N63144A58108K7333g6189B86766L41660A56956
15012B79290K76713j5533B3503M15087j71356I8669a3763D20384B07046G452J98311
15001B05763M01076j12963A50250M27267m7077o4579j92249n9102I3745K62121
14991C55866J39520B19042k910D7281K07403m3269j00887J18670K05035j56388
14981B77845A24522J68848j04243J64203M33574k02367k77201M9874l4562M3536
14971C66184m1845k3574J6620L36246k77482L7940n5258O5707A52848M32301k46388
14960C38761J53259N6123k32476r1720L13586a84510D92254B41266J22971C4993
$$ plain form
14949 641955 295355 545854 14515 49714 739868 478206 409432 568112 234700 345292
14939 345292 194541 264429 453491 731392 517352 307775 390155 564954 377809 611227
14929 611227 662846 707908 770209 789135 580171 1170870 822141 780328 484371 599081
14919 599081 1040178 1296983 937216 1127156 902190 902172 755600 598623 584732 541754 477385
14908 477385 454654 620739 795031 686001 350692 198409 430630 137730 24319 395150
14898 395150 423051 481529 341649 489369 388659 427668 287093 421839 95267 575054
14888 575054 299442 352000 437005 485630 478632 308411 270939 651496 74099 319635 346584
14877 346584 511770 340485 706739 569408 475938 304637 601945 494419 754170 350247
$$ packed form
14949F41955B95355K50499A4515L5199O90154k61662o8774J58680B34700J10592
14939C45292j50751O9888J89062K77901k14040k09577Q2380J74799j87145K33418
14929F11227N1619M5062O2301J8926k08964N90699l48729m1813k95957J14710
14919E99081M41097K56805l59767J89940k24966j8j46572j56977j3891m2978o4369
14908D77385k2731J66085J74292j09030l35309j52283K32221A37730B4319L70831
14898C95150K7901N8478j39880J47720j00710L9009j40575J34746I5267M79787
14888E75054k75612N2558Q5005M8625o998j70221l7472L80557G4099K45536K6949
14877C46584J65186j71285L66254j37331r3470j71301K97308j07526K59751C50247
$$ plain form
14866 570060 548276 610360 333067 661727 355261 295927 437508 666201 408971 588722
14856 588722 178127 432190 459371 435150 802357 283027 -3089 291069 589292 461266
14846 461266 472264 667277 531698 670663 465048 880851 892526 685718 885708 729816
14836 729816 816961 998647 620883 534397 317542 536985 866883 678631 30731 451754
14826 451754 309087 439323 434542 246738 675784 166419 309545 696466 191637 678695
14816 678695 238194 359871 460379 460752 198156 156197 139290 586740 670796 462495 253328
14805 253328 817677 454578 504644 994036 944485 629444 217420 716048 185887 722910
14795 722910 714367 516318 715851 797578 734889 564538 450904 297431 620856 611907 458071
$$ packed form
14866E70060k1784O2084k77293L28660l06466n9334J41581K28693k57230J79751
14856E88722A78127K54063K7181k4221L67207B83027c089B91069K98223j28026
14846D61266J0998J95013j35579J38965k05615M15803J1675k06808J99990j55892
14836G29816Q7145J81686l77764q6486k16855K19443L29898j88252C0731M21023
14826D51754j42667J30236m781j87804M29046A66419J43126L86921A91637M87058
14816F78695B38194J21677J00508L73A98156m1959j6907M47450Q4056k08301k09167
14805B53328N64349l63099N0066M89392m9551l15041B17420M98628A85887N37023
14795G22910q543j98049J99533Q1727o2689j70351j13634j53473L23425q949j53836
$$ plain form
14784 458071 788063 675140 436321 239592 591730 582753 637904 297438 506185 460779
14774 460779 525263 601764 671368 403222 665045 965278 605855 717760 611536 570845
14764 570845 229160 668683 607321 388627 654619 624147 506790 611085 672477 600940
14754 600940 408215 617836 1178566 648698 630722 661267 1165972 596732 841010 429509
14744 429509 680875 633357 871563 854659 1001623 416859 863930 564509 662663 466228
14734 466228 670531 911230 479841 869391 865238 790785 627510 680426 1029819 1077079
14724 1077079 1040486 1195268 758907 843494 944261 1055945 1144336 981581 1253630 754752
14714 754752 1088129 885802 849234 1047250 1059422 856191 780860 899245 761124 802900
$$ packed form
14784D58071L29992j12923k38819j96729L52138q977N5151B97438K08747m5406
14774D60779O4484P6501O9604k68146K61823L00233l59423J11905j06224m0691
14764E70845B29160M39523o1362k18694K65992l0472j17357J04295O1392p1537
14754F00940j92725K09621N60730n29868j7976L0545N04705n69240K44278m11501
14744D29509K51366m7518K38206j6904J46964D16859M47071k99421R8154j96435
14734D66228K04303K40699m31389L89550m153p4453j63275N2916L49393M7260
14724A077079l6593J54782m36361Q4587J00767J11684Q8391j62755K72049m98878
14714G54752L33377k02327l6568J98016J2172k03231p5331J18385j38121M1776
$$ plain form
14704 802900 909057 960140 771646 764110 997851 1259015 894462 1227391 1184859 1184089 1154152
14693 1154152 897977 1280282 697578 1160295 1102491 1218361 826889 965571 1036096 1166854
14683 1166854 896601 1045289 857711 689665 945061 555432 848319 902650 803870 1036665
14673 1036665 1079635 1096106 1033009 789976 876148 1091914 893398 876706 1306137 891888
14663 891888 943440 860705 1384247 766773 944270 1153670 923500 781917 663246 870669
14653 870669 983109 1074143 1161447 1306849 1069199 790456 1252940 1024844 1100458 892412
14643 892412 1077301 1178558 876995 1118128 1321031 887186 1112256 1291409 846071 983071
14633 983071 1109640 814674 1086952 1170087 1235493 1387514 1212263 1054566 1058082 1376128
$$ packed form
14704H02900J06157N1083j88494p536K33741K61164l64553L32929m2532p70k9937
14693A154152k56175L82305n82704M62717n7804J15870l91472J38682P0525J30758
14683A166854k70253J48688j87578j68046K55396l89629K92887N4331r8780K32795
14673A036665M2970J6471o3097k43033Q6172K15766j98516j6692M29431m14249
14663H91888N1552q2735N23542o17474J77497K09400k30170j41583j18671K07423
14653H70669J12440R1034Q7304J45402k37650k78743M62484k28096P5614k08046
14643H92412J84889J01257l01563K41133K02903m33845K25070J79153m45338J37000
14633I83071J26569k94966K72278Q3135O5406J52021j75251j57697L516L18046
$$ plain form
14623 1376128 1426616 1289145 1263939 1288171 980324 1354170 1310806 1550935 1411847 1367209
14613 1367209 967870 1339988 1550944 1477589 1266245 1634613 796969 1315407 1033947 1366543
14603 1366543 1506903 1403342 1203365 1223423 1544708 1228307 1734346 1255858 1492242 1814834
14593 1814834 1514492 1672910 1656916 1761202 1661024 1566027 1243324 1536676 2121187 1808826
14583 1808826 1606257 1697106 1776274 1615950 1738623 1669964 1981023 1797189 1810745 1921086
14573 1921086 1882045 2077515 1856064 1710014 1937403 2076225 2054261 2190124 2237902 2209660
14563 2209660 2337356 2238952 2108271 2223176 2104545 2841208 2698722 2653502 2999552 3174112
14553 3174112 3421659 3982041 3934395 5627439 7426884 11757632 19076404 32154740 35615927
$$ packed form
14623A376128N0488j37471k5206K4232l07847L73846m3364K40129j39088m4638
14613A367209l99339L72118K10956p3355k11344L68368G96969N18438k81460L32596
14603A366543J40360j03561j99977K0058L21285l16401N06039m78488K36384L22592
14593A814834l00342J58418j5994J04286j00178r4997l22703K93352N84511l12361
14583A808826k02569R0849P9168j60324J22673o8659L11059j83834J3556J10341
14573A921086l9041J95470k21451j46050K27389J38822k1964J35863M7778k8242
14563B209660J27696r8404j30681J14905j18631P36663j42486m5220L46050J74560
14553C174112K47547N60382m7646J693044J799445M330748P318772J3078336L461187
$$ plain form
14544 35615927 21848760 12871750 6533412 3670169 2852728 2350845 2093320 1917113
14536 1917113 1844667 2173700 2010976 1780021 1973423 1995618 2213005 1809314 1918783 2111533
14526 2111533 2262793 1976633 1992154 2473586 2082526 2292097 1845718 2190796 2505866 2272283
14516 2272283 2457979 2372530 2611711 2388992 2645271 2429399 2323189 2616645 2650408 2898883
14506 2898883 2608795 2590105 2930140 2618915 2655971 2632573 2674811 3005292 2899702 2932708
14496 2932708 2988281 2659056 3270656 2995753 3024546 3155777 2946095 3253208 3509346 3482758
14486 3482758 3346440 3318128 3133857 3580219 3315975 3713631 3534502 3500456 3547796 3531905
14476 3531905 3510100 3424777 3636877 3665731 3573652 4122209 3689242 4029023 4200310 3963036
$$ packed form
14544C5615927j3767167q977010o338338k863243q17441n01883k57525j76207
14536A917113p2446L29033j62724k30955J93402K2195K17387m03691J09469J92750
14526B111533J51260k86160J5521M81432l91060K09571m46379L45078L15070k33583
14516B272283J85696q5449K39181k22719K56279k15872j06210K93456L3763K48475
14506B898883k90088j8690L40035l11225L7056k3398M2238L30481j05590L3006
14496B932708N5573l29225O11600k74903K8793J31231k09682L07113K56138k6588
14486C482758j36318k8312j84271M46362k64244L97656j79129l4046M7340j5891
14476C531905k1805q5323K12100K8854r2079N48557m32967L39781J71287k37274
$$ plain form
14466 3963036 3922251 4053072 3862573 4400714 3996367 4243387 4138656 4330778 4180327 4170770
14456 4170770 4479041 4445725 4701520 4378045 4613898 4581876 5082979 4673805 4811629 5128997
14446 5128997 4829582 4732506 5151536 4935067 4805591 5248846 4944046 5274811 5202546 5527115
14436 5527115 5615209 5513476 5928183 5922040 5961345 5839389 6009107 6098618 6118417 6232771
14426 6232771 6205995 6097033 6720018 6592850 6671830 7002844 6837065 6889855 6988434 7146916
14416 7146916 7614214 7833893 7679989 7588981 7867482 7886026 8112942 8128055 8160393 8213337
14406 8213337 8468665 8678322 9117823 9073329 9314224 9162545 9491720 9593554 9556590 9895435
14396 9895435 9929065 9785669 9757367 10560724 10222719 10842929 11057726 11028742 11043594 11341326
$$ packed form
14466C963036m0785J30821j90499N38141m04347K47020j04731J92122j50451r557
14456D170770L08271l3316K55795l23475K35853l2022N01103m09174J37824L17368
14446E128997k99415r7076M19030k16469j29476M43255l04800L30765p2265L24569
14436E527115Q8094j01733M14707o143L9305j21956J69718Q9511J9799J14354
14426F232771k6776j08962O22985j27168P8980L31014j65779N2790R8579J58482
14416G146916M67298K19679j53904r1008K78501J8544K26916J5113L2338N2944
14406H213337K55328K09657M39501m4494K40895j51679L29175J01834l6964L38845
14396I895435L3630j43396k8302Q03357l38005O20210K14797k8984J4852K97732
$$ plain form
14386 11341326 11470211 11768116 12001825 12227865 12778122 12738266 13124917 13464298 13509128 14156672
14376 14156672 14055443 14200154 14160399 15003518 15395772 15625144 15942262 16140202 16393446
14367 16393446 16567703 17256777 17232465 17763011 18225995 18160964 18744667 19201801 19939497 20024900
14357 20024900 20553610 20965572 21566990 21835068 22447638 23201324 23339894 24011177 24535165
14348 24535165 25323773 25521582 26539888 27216301 28111790 28999310 29588450 30541398 31054228
14339 31054228 32313102 32959898 33676437 34575384 35737204 36516496 37850936 39008401 39959450
14330 39959450 41381646 42762505 44158641 45687599 47352687 48729156 50132424 51887828
14322 51887828 53552223 55580907 57313927 59592272 61618867 63800407 66350192 68954360
$$ packed form
14386A1341326J28885K97905K33709K26040N50257l9856L86651L39381M4830O47544
14376A4156672j01229J44711l9755Q43119L92254K29372L17118J97940K53244
14367A6393446J74257O89074k4312N30546M62984o5031N83703M57134P37696Q5403
14357B0024900N28710M11962O01418K68078O12570P53686J38570O71283N23988
14348B4535165P88608J97809J018306O76413Q95489Q87520N89140R52948N12830
14339C1054228J258874O46796P16539Q98947J161820P79292J334440J157465R51049
14330C9959450J422196J380859J396136J528958J665088J376469J403268J755404
14322E1887828J664395K028684J733020K278345K026595K181540K549785K604168
$$ plain form
14314 68954360 71466950 74298957 77313983 80659179 83629961 87395377 91333269 94772565
14306 94772565 99253390 103629657 108218984 113523797 119156401 124596523 130807211 137155661
14298 137155661 144225409 151502771 159461951 167497012 176483893 185796705 195642846 205751020
14290 205751020 216564841 227996127 240421378 252888542 266173330 280023533 294669300
14283 294669300 309507491 324233927 339684048 354850889 370143364 385125652 399065042
14276 399065042 411964206 423678668 433132401 438686910 440590602 440881661 441512836 442624322
14268 442624322 439388130 435083499 431341618 424292332 413448230 401089036 387862365
14261 387862365 374077186 359383306 343787150 328159328 312789873 297501290 282722609
$$ packed form
14314F8954360K512590K832007L015026L345196K970782L765416L937892L439296
14306I4772565M480825M376267M589327N304813N632604N440122O210688O348450
14298A37155661P069748P277362P959180Q035061Q986881R312812R846141J0108174
14290B05751020J0813821J1431286J2425251J2467164J3284788J3850203J4645767
14283B94669300J4838191J4726436J5450121J5166841J5292475J4982288J3939390
14276C99065042J2899164J1714462R453733N554509J903692K91059O31175J111486
14268D42624322l236192m304631l741881p049286j0844102j2359194j3226671
14261C87862365j3785179j4693880j5596156j5627822j5369455j5288583j4778681
$$ plain form
14254 282722609 268498362 256028805 242569621 230137483 218152778 206752017 196084926
14247 196084926 186067550 176817449 167756639 159540483 151944287 144753558 137510103 130848842
14239 130848842 124799540 119027932 113869627 108670711 103844384 99506173 95065907 91154035
14231 91154035 87774211 84155996 80474964 77181071 74240462 71404048 68558097 66148115
14223 66148115 63366692 61337978 59404893 57185736 55085537 53385629 51212916 49750381
14215 49750381 48396863 46735598 45432354 43771147 42595954 41112420 40023597 38970422
14207 38970422 37822471 36879754 35735067 34566501 33553498 32660185 32032975 31102424 30328498
14198 30328498 29297277 28868217 27830899 27315944 26717530 26302835 25410730 24932343 23900901
$$ packed form
14254B82722609j4224247j2469557j3459184j2432138j1984705j1400761j0667091
14247A96084926j0017376r250101r060810q216156p596196p190729p243455o661261
14239A30848842o049302n771608n158305n198916m826327m338211m440266l911872
14231I1154035l379824l618215l681032l293893k940609k836414k845951k409982
14223F6148115k781423k028714j933085k219157k100199j699908k172713j462535
14215D9750381j353518j661265j303244j661207j175193j483534j088823j053175
14207C8970422j147951r42717j144687j168566j013003q93313o27210r30551p73926
14198C0328498j031221m29060j037318n14955n98414m14695q92105m78387j031442
$$ plain form
14189 23900901 23408619 23018574 22150742 21824501 21340813 20923126 20039881 19882434 19469397
14180 19469397 19131222 18819314 18069415 18016565 17676807 17244444 16585625 16595786 16042844 15884101
14170 15884101 15622086 15233442 14735339 14592476 14333951 14036324 13746220 13868295 13427754
14161 13427754 12696218 12997923 12726435 12576109 12339282 12100628 11678207 11199468 11522405
14152 11522405 11107427 10837527 10769102 10674100 10445996 10145639 9707921 9931473 9837638 9641452
14142 9641452 9434452 9687743 9062869 9007001 8669836 8712300 8952374 8542528 8845253 8174706
14132 8174706 8300662 8298891 7750834 8040690 7904048 7457157 7271038 7456108 7489680 7436115
14122 7436115 7043972 7067087 6827658 6980922 6601523 6782196 6387183 6413950 6251780 6417798
$$ packed form
14189B3900901m92282l90045q67832l26241m83688m17687q83245j57447m13037
14180A9469397l38175l11908p49899n2850l39758m32363o58819J0161n52942j58743
14170A5884101k62015l88644m98103j42863k58525k97627k90104J22075m40541
14161A3427754p31536L01705k71488j50326k36827k38654m22421m78739L22937
14152A1522405m14978k69900o8425r5002k28104l00357m37718K23552r3835j96186
14142I641452k07000K53291o24874n5868l37165M2464K40074m09846L02725o70547
14132H174706J25956j771n48057K89856j36642m46891j86119J85070L3572n3565
14122G436115l92143K3115k39429J53264l79399J80673l95013K6767j62170J66018
$$ plain form
14112 6417798 6077329 6083053 6046478 6166893 6146035 5695735 5771585 5632762 5520387 5801028
14102 5801028 5480046 5730273 5411391 4986968 5307907 4818013 5445169 5203359 5175529 4883526
14092 4883526 4896921 5097098 5059545 4716369 4644586 4530065 4525101 4742237 4333780 4142766
14082 4142766 4602765 4307078 4427049 4516227 4029532 4370808 4154189 4238367 4051727 3905440
14072 3905440 3889490 3476911 3678337 3687706 3835202 3823993 3766139 2994336 3518859 3487454
14062 3487454 3234241 3799457 3657181 3389470 3460737 3811324 3558794 3317644 3322572 3131868
14052 3131868 3234925 3049272 3138452 3378142 3176224 3009921 2676512 2919251 2982369 2795818
14042 2795818 2733469 3202701 2821192 2510120 2853243 2591045 2606899 2899637 2548531 2879996
$$ packed form
14112F417798l40469N724l6575J20415k0858m50300P5850j38823j12375K80641
14102E801028l20982K50227l18882m24423L20939m89894O27156k41810k7830k92003
14092D883526J3395K00177l7553l43176p1783j14521m964K17136m08457j91014
14082D142766M59999k95687J19971Q9178m86695L41276k16619Q4178j86640j46287
14072C905440j5950m12579K01426R369J47496j1209n7854p71803N24523l1405
14062C487454k53213N65216j42276k67711P1267L50587k52530k41150M928j90704
14052C131868J03057j85653Q9180K39690k01918j66303l33409K42739O3118j86551
14042B795818o2349M69232l81509l11072L43123k62198J5854K92738l51106L31465
$$ plain form
14032 2879996 2743546 2676531 2867373 2771183 2492477 2837562 2750620 2415279 2437073 2424742
14022 2424742 2398580 2353499 2175775 2606420 2395950 2130656 2474266 2356021 2465685 2112193
14012 2112193 2055966 1949577 2227271 1915049 2073470 1873153 2165350 2239228 2169302 2000242
14002 2000242 2203147 1830694 1958886 2138466 2353011 1947729 2014948 2043119 2036043 2095568
13992 2095568 2051084 2200422 2775022 3469167 6095914 12034577 23740652 36102306 26995772
13983 26995772 15255927 9472344 6388720 4885138 4085672 3453845 2935019 2851508 2472705
13974 2472705 2401374 2372060 2416678 2293166 2280366 2144901 2274484 1984169 2019541 2017511 2017395
13963 2017395 1704533 2137472 1897300 1682706 2276695 1956763 1728252 1535772 1740846
$$ packed form
14032B879996j36450o7015J90842r6190k78706L45085q6942l35341K1794j2331
14022B424742k6162m5081j77724M30645k10470k65294L43610j18245J09664l53492
14012B112193n6227j06389K77694l12222J58421k00317K92197P3878o9926j69060
14002B000242K02905l72453J28192J79580K14545m05282O7219K8171p076N9525
13992B095568m4484J49338N74600O94145K626747N938663J1706075J2361654r106534
13983B6995772j1739845n783583l083624j503582p99466o31827n18826q3511l78803
13974B472705p1331k9314M4618j23512j2800j35465J29583k90315L5372k030j16
13963B017395l12862M32939k40172k14594N93989l19932k28511j92480K05074
$$ plain form
13954 1740846 2002222 1779741 1807610 1517002 1716111 1925403 1502439 1685347 1582454 1737623
13944 1737623 1859125 1465139 1344501 1612670 1687564 1520062 1278737 1409488 1340160 1590332
13934 1590332 1468563 1300726 1462204 975742 1488911 1098222 1576462 1306808 1256959 1586705
13924 1586705 1283881 1493950 1421734 1469270 1337589 1321341 1372335 1777627 1358187 1321294
13914 1321294 1111155 1509355 1142047 1015670 1635073 1475999 1407022 1145849 1169743 1204429
13904 1204429 860341 1111651 1125794 1122265 1318252 1362912 1165931 1021201 1353067 803161
13894 803161 1057167 1084839 1149774 1190551 978514 1454690 1182479 1152345 819368 1048222
13884 1048222 786881 873032 890659 1064235 852647 939021 1298978 753261 854002 706785
$$ packed form
13954A740846K61376k22481K7869k90608J99109K09292m22964J82908j02893J55169
13944A737623J21502l93986j20638K68169P4894j67502k41325J30751o9328K50172
13934A590332j21769j67837J61478m86462N13169l90689M78240k69654m9849L29746
13924A586705l02824K10069p2216M7536j31681j6248N0994M05292m19440l6893
13914A321294k10139L98200l67308j26377O19403j59074o8977k61173K3894L4686
13904A204429l44088K51310J4143l529J95987M4660j96981j44730L31866n49906
13894H03161K54006K7672O4935M0777k12037M76176k72211l0134l32977K28854
13884A048222k61341Q6151J7627J73576k11588Q6374L59957n45717J00741j47217
$$ plain form
13874 706785 807610 985306 868815 688481 1037728 851109 975500 859162 883162 887812
13864 887812 893402 838118 585184 955025 849156 974663 916275 769590 1250527 853695
13854 853695 860076 890950 638714 972570 791741 1118397 785285 821228 999983 637851
13844 637851 674730 786312 680796 956200 720126 928176 828873 651517 417630 534315
13834 534315 700496 528852 972693 583257 963940 1290583 814976 756198 810666 511804
13824 511804 705173 969005 579038 672855 352823 920373 569508 913799 832143 493236
13814 493236 456061 784260 803263 821885 560282 739768 490384 572716 829529 909197
13804 909197 597976 730968 777851 772160 910488 360458 737752 890820 763252 581545
$$ packed form
13874G06785J00825J77696j16491j80334L49247j86619J24391j16338K4000M650
13864H87812N590n5284k52934L69841j05869J25507n8388j46685M80937l96832
13854H53695O381L0874k52236L33856j80829L26656l33112L5943J78755l62132
13844F37851L6879J11582j05516K75404k36074K08050r9303j77356k33887J16685
13834E34315J66181j71644M43841l89436L80683L26643m75607n8778N4468k98862
13824E11804J93369K63832l89967R3817l20032N67550l50865L44291q1656l38907
13814D93236l7175L28199J9003J8622k61603J79486k49384Q2332K56813P9668
13804I09197l11221J32992M6883n691J38328C60458L77294J53068j27568j81707
$$ plain form
13794 581545 712713 721198 701737 886598 426256 872983 516976 582840 469379 486504
13784 486504 611049 522445 604704 371126 500900 457851 693902 714511 697429 506659
13774 506659 490910 697289 782185 538860 153709 648416 824232 433932 381188 805919
13764 805919 400483 989401 277288 477029 761635 668209 536122 355407 354147 392992
13754 392992 610956 472926 616030 593844 448412 114060 560747 510465 317915 327876
13744 327876 433929 703063 633061 218539 567175 279084 396385 483720 624458 553338
13734 553338 865075 467974 343424 768379 739227 229495 434429 663990 148518 381918
13724 381918 345240 520443 401651 516443 225932 718964 411286 188242 530256 336754
$$ packed form
13794E81545J31168Q485j9461J84861D26256M46727l56007O5864j13461J7125
13784D86504J24545q8604Q2259k33578J29774m3049K36051K0609j7082j90770
13774E06659j5749K06379Q4896k43325A53709M94707J75816l90300n2744M24731
13764H05919D00483N88918B77288J99741K84606r3426j32087j80715j260L8845
13754C92992K17964j38030J43104k2186j45432A14060M46687n0282j92550R961
13744C27876J06053K69134p0002B18539L48636B79084J17301Q7335J40738p1120
13734E53338L11737l97101j24550M24955k9152B29495K04934K29561A48518K33400
13724C81918l6678J75203j18792J14792B25932M93032l07678A88242L42014j93502
$$ plain form
13714 336754 14722 644802 434057 136777 427213 318217 693967 741210 455720 477249
13704 477249 493497 683359 642295 310113 389409 790136 470255 503742 559090 247035
13693 458432 763228 553887 610503 274648 328317 389500 532495 313284 248065 411003
13683 411003 647951 439520 490801 278746 321057 482848 383372 615270 579053 337204
13673 337204 103803 455788 419865 164591 284573 379481 557436 255473 268784 665916
13663 665916 477690 316101 49495 341391 316215 495213 213843 270077 90935 375365
13653 375365 257988 558020 268261 489125 401246 504505 279178 333759 278489 21086
13642 443469 43909 344815 494716 58408 341662 315924 417312 189978 381002 239375
$$ packed form
13714C36754A4722O30080k10745A36777K90436j08996L75750M7243k85490K1529
13704D77249J6248J89862m1064C10113P9296M00727l19881L3487N5348B47035
13693D58432L04796k09341N6616B74648N3669O1183J42995k19211o5219J62938
13683D11003K36948k08431N1281k12055M2311J61791r9476K31898l6217k41849
13673C37204A03803L51985l5923A64591J19982R4908J77955B55473J3311L97132
13663F65916j88226j61589D9495K91896k5176J78998B13843N6234I0935K84430
13653C75365j17377L00032B68261K20864q7879J03259k25327N4581n5270B1086
13642D43469D3909L00906J49901E8408K83254k5738J01388A89978J91024j41627
$$ plain form
13632 239375 454087 228949 383233 564737 451872 228157 460326 445449 433910 107501
13621 545230 504990 343348 456333 38476 286595 312370 88627 490145 510520 599426 402634
13610 402634 419295 297546 251746 415674 501652 432713 302583 576053 221517 122604
13600 122604 446588 443144 132251 379322 158529 366208 -62454 514541 190736 38025
13589 328314 405882 177259 219436 363835 373895 360634 275442 566292 320498 332676 413858
13578 413858 103492 90588 389031 300977 161658 401589 380787 291899 222829 350445
13568 350445 509870 251516 402518 422127 296963 337806 -5719 489927 287555 556267
13558 556267 158159 266626 394749 114898 404065 310511 248154 505559 425626 334757
$$ packed form
13632B39375K14712k25138J54284J81504j12865k23715K32169j4877j1539A07501
13621E45230m0240j61642J12985C8476K48119K5775H8627M01518K0375Q8906j96792
13610D02634J6661j21749m5800J63928Q5978o8939j30130K73470B21517r8913
13600A22604L23984l444A32251K47071A58529K07679f2454E14541A90736C8025
13589C28314P7568A77259M2177J44399J0060j3261q5192K90850k45794J2178Q1182
13578D13858A03492j2904K98443q8054j39319K39931k0802q8888o9070J27616
13568C50445J59425B51516J51002J9609j25164M0843e719D89927k02372K68712
13558E56267A58159J08467J28123A14898K89167r3554o2357K57405p9933r0869
$$ plain form
13548 334757 287352 77772 281570 205124 257990 118576 108793 29662 282951 365833 327886
13537 327886 -13923 33687 284644 268574 136464 207060 471726 107164 78868 368715
13527 368715 298474 370165 52655 191835 186958 370786 201847 39075 26077 104335 455324
13516 455324 -111406 128515 137549 341724 44693 299797 19137 293556 284941 175949 315695
13505 315695 161694 299188 -262790 322057 54137 -158500 244434 459732 68377 79591
13495 79591 262731 -168400 296991 271615 249993 132447 24029 214449 33830 255680
13485 255680 127150 537159 -73993 251786 121307 106219 81441 232249 245204 129427
13475 129427 343397 -127881 141981 188691 357502 -148201 60492 4936 288962 78027
$$ packed form
13548C34757m7405G7772K03798p6446N2866A18576r783B9662K53289Q2882l7947
13537C27886a3923C3687K50957j6070j32110P0596K64666A07164k8296K89847
13527C68715p0241P1691E2655J39180m877J83828j68939C9075j2998P8258L50989
13516D55324a11406A28515R034K04175D4693K55104A9137K74419q615j08992J39746
13505C15695j54001J37494b62790C22057E4137a58500B44434K15298F8377J1214
13495G9591J83140a68400B96991k5376k1622j17546B4029J90420C3830K21850
13485B55680A27150M10009g3993B51786A21307j5088k4778J50808J2955j15777
13475A29427K13970a27881A41981M6710J68811a48201F0492D936K84026G8027
$$ plain form
13464 392246 454102 484255 -17290 64523 -52352 289156 61488 76251 -82321 265976 41296
13452 227904 13429 200156 210124 225748 193149 116587 113342 -124876 267772 -195611 311246
13440 -3155 128997 13623 446284 -199291 -7534 -37658 525926 318459 173098 81563 318553
13429 318553 120802 11777 -18624 332971 197781 30794 200528 257196 299228 123748
13418 186521 290730 252832 114255 267519 111870 95300 166116 237771 37791 133394 322366
13407 322366 154169 92872 87755 126808 120228 243857 7109 -267389 268879 26127 320835
13396 320835 63747 47733 175881 -112785 271452 78168 290750 238435 -105848 154440
13385 -120851 308460 307130 -83242 369689 143875 -15822 86440 171322 249752 283501 -74032
$$ packed form
13464C92246O1856L0153a7290F4523e2352B89156F1488J4763h2321B65976D1296
13452B27904A3429J86727R968J5624l2599p6562l245a24876B67772a95611C11246
13440c155A28997A3623M32661a99291g534l0124E25926k07467j45361H1563K36990
13429C18553A20802A1777a8624C32971j35190C0794J69734N6668M2032A23748
13418A86521J04209l7898A14255J53264A11870j6570P0816P1655C7791R5603J88972
13407C22366A54169o1297n117L9053o580J23629G109b67389B68879B6127K94708
13396C20835F3747j6014J28148a12785B71452G8168K12582n2315a05848A54440
13385a20851C08460j330h3242C69689A43875a5822H6440Q4882P8430L3749g4032
$$ plain form
13373 434911 196517 -143692 -194180 560727 157608 209452 376078 484244 316189 -39269
13362 263553 170170 310374 -20080 169670 18891 292581 398388 177812 140801 412253
13352 412253 -115051 -140255 50976 -9964 124635 234493 388457 156796 363747 277097
13342 277097 46160 256806 289642 255467 51662 498281 168219 273199 397300 112531
13331 -97238 32245 111944 341811 56850 209212 57960 102395 -109228 93182 -76870 -59913
13320 -59913 117959 117616 7219 249351 65871 -1481 197831 203428 -63017 99594 120915 338456
13308 338456 109764 219624 -137217 64648 -102654 15567 114607 -60609 557562 482534
13298 482534 336498 266425 -257415 -83689 256365 235883 156816 219309 162725 170689 285308
$$ packed form
13373D34911A96517a43692n0488E60727A57608N1844J66626J08166j68055c9269
13362B63553r3383J40204b0080A69670A8891K73690J05807A77812l7011K71452
13352D12253a15051k5204E0976i964A24635J09858J53964A56796K06951q6650
13342B77097D6160K10646L2836l4175E1662M46619A68219J04980J24101A12531
13331i7238C2245P9699K29867E6850J52362E7960M4435a09228I3182g6870J6957
13320e9913A17959l43G219K42132F5871a481A97831N597f3017I9594K1321K17541
13308C38456A09764J09860a37217F4648a02654A5567R9040f0609E57562p5028
13298D82534j46036p0073b57415h3689B56365k0482p9067O2493n6584P964J14619
$$ plain form
13287 285308 -302146 -187562 -186878 37607 105957 87515 126740 152361 45628 -6931 -35716 -140515
13275 -140515 312780 62082 -6300 -12047 165302 -18324 -62669 -168817 112817 228568 1835
13263 -73893 -132402 990 -68906 68604 89332 -105578 80845 229493 -55708 -120211 -41241 -21418
13251 -21418 59726 71760 248106 143905 -289489 42019 -157457 -112627 26198 -66121 -89964
13240 -89964 259544 -106079 -19747 34361 -186194 226962 269284 -135396 -99488 52911 322354
13229 322354 -88106 77900 162799 -9903 2481 -171112 140155 -108106 -72525 -16806 -167716
13218 -167716 281162 310672 -120535 -89544 69029 -13938 -51008 240511 365426 -130655
13207 -150100 -106067 -16987 255920 -31100 -11821 395102 66276 -33074 381349 138699 -315
$$ packed form
13287B85308c02146J14584O84C7607O8350j8442L9225K5621D5628f931k8785j04799
13275a40515C12780F2082f300n747A65302a8324m4345j06148A12817J15751A835
13263g3893n8509I90f8906F8604K0728a05578H0845J48648e5708o4503d1241J9823
13251b1418E9726J2034J76346j04201b89489D2019a57457M4830B6198f6121k3843
13240h9964B59544a06079a9747C4361a86194B26962M2322a35396L5908E2911K69443
13229C22354h8106G7900Q4899i903B481a71112A40155a08106L5581a6806j50910
13218a67716B81162K9510a20535L0991F9029a3938l7070B40511J24915a30655
13207a50100M4033a6987B55920c1100a1821C95102F6276c3074C81349A38699c15
$$ plain form
13195 37401 104220 -78089 -152889 -18063 -23106 292321 122276 -164025 923 296658 -215188
13183 48189 43952 41405 68900 158975 26610 -461944 -127870 192363 52001 84738 342041
13172 342041 37929 -175239 35811 278754 -43319 139627 130353 -105554 -89226 224731 197427
13161 197427 -222442 185613 115225 538618 -52957 59861 102635 22590 30240 -72952 121737
13149 45130 237860 -90552 -136582 -306508 305722 -25256 111001 196056 116355 -75930 -140207
13138 -140207 190546 72722 -41880 188845 21018 131010 9216 -84880 -21774 -373763 -133967
13126 31302 92573 62728 -20587 -22001 228286 188030 56971 -41784 -97794 113865 -38910
13114 114147 33623 150835 97352 257559 8295 -67920 253323 212583 179421 217448 -283557
$$ packed form
13195C7401O6819g8089p4800a8063n043B92321A22276a64025I23K95735b15188
13183D8189m237k547K7495R0075B6610d61944a27870A92363E2001L2737K57303
13172C42041C7929a75239C5811K42943d3319A39627r274a05554J6328B24731k7304
13161A97427b22442A85613p0388M23393e2957E9861M2774B2590P650g2952A21737
13149D5130J92730i0552m6030j69926C05722b5256A11001Q5055p9701g5930o4277
13138a40207A90546G2722d1880A88845B1018J09992I216h4880b1774l51989a33967
13126C1302O1271k9845b0587j414B28286m0256E6971d1784n6010A13865c8910
13114A14147C3623J17212n3483J60207H295f7920B53323m0740l3162L8027b83557
$$ plain form
13102 97413 -32770 89834 57313 -44911 181920 -170296 -153787 -182391 333420 180692 222459
13091 222459 22056 256475 264920 427245 48936 -116932 29787 134094 67257 39479 -229383
13079 -31426 -347006 -230855 108823 41493 185594 86741 -14627 410827 108735 197824
13069 197824 -43 71182 -133896 -254945 220707 -71071 59627 -83391 -53451 453083 128429
13057 39649 -139278 41366 66188 50158 310025 -36415 148452 249713 181540 221756 235883
13046 235883 105596 89296 34233 -92599 209471 -64706 215458 -292367 43718 161922
13036 161922 -208431 -118952 -59374 -36141 -269231 -168521 143770 239187 31201 183233
13026 183233 210690 -21042 46647 -272067 112406 72157 277744 -102701 14642 91556 -282196
$$ packed form
13102I7413c2770H9834l2521d4911A81920a70296J6509k8604C33420j52728M1767
13091B22459B2056K34419Q445J62325D8936a16932B9787J04307o6837k7778b29383
13079c1426l15580J16151A08823D1493J44101H6741a4627D10827A08735Q9089
13069A97824d3G1182a33896j21049B20707g1071E9627h3391K9940D53083A28429
13057C9649a39278D1366K4822j6030K59867c6415A48452J01261o8173M0216J4127
13046B35883A05596j6300C4233i2599B09471f4706B15458b92367D3718J18204
13036A61922b08431Q9479e9374K3233k33090J00710A43770R5417C1201J52032
13026A83233K7457b1042D6647b72067A12406m0249K05587a02701A4642P6914b82196
$$ plain form
13014 207228 129288 70499 66957 -28954 231415 201115 77580 427498 46405 3266 127474
13003 127474 4376 -50638 89068 615342 98461 -61980 -98773 138554 -225639 18419 27274
12992 27274 183217 18678 71230 -253696 288257 -293841 186273 78582 214366 148426
12982 148426 15698 -252843 -153388 -159114 216965 107084 -283913 -56205 -27226 -61047 203089
12970 173834 -28292 137313 -185041 195564 55384 161749 155647 35248 252437 26683 144772
12959 144772 282163 2109 -258243 -55212 6644 38113 23829 -37865 -36679 47623 -277450
12947 -332443 73865 323552 38735 -141144 -77172 -245019 10733 31730 56347 140734 63291
12935 -103728 163578 23632 148142 273250 79431 186552 34131 190432 -212254 141209
$$ packed form
13014B07228p7940n8789l542b8954B31415l0300G7580L49918D6405C266J24208
13003A27474D376e0638H9068N26274I8461f1980l6793A38554b25639A8419Q855
12992B7274J55943A8678N2552b53696B88257b93841A86273G8582J35784o5940
12982A48426A5698b52843R9455n726B16965A07084b83913e6205b7226l3821B03089
12970A73834b8292A37313a85041A95564E5384J06365o102C5248K17189B6683J18089
12959A44772J37391B109b58243e5212F644L1469j4284c7865J186D7623b77450
12947c32443G3865K49687C8735a41144O3972j67847A0733K0997K4617Q4387F3291
12935a03728A63578B3632J24510J25108G9431J07121C4131J56301b12254A41209
$$ plain form
12924 15451 -28631 -17531 69777 -204251 340928 140784 -19129 249605 258492 225911 -206089
12912 -45673 -246698 -290752 168291 76580 -166061 -138183 30542 167128 -74398 304459 -40954
12900 -47071 213816 -289843 5934 -191161 -20157 97786 154850 -292699 288500 -65586 153363
12888 -146550 125421 138835 -359504 253884 -35977 101231 126530 246329 -85986 -246481
12878 -246481 -161590 59303 -29166 -429348 93035 -13610 -105616 -321146 -44023 -116704 214808
12866 102912 -4468 -140649 -231651 305311 179058 -213997 12547 26921 -66261 116769 -52188
12854 -144320 -231211 36721 -15390 42523 -173864 -279442 45750 178493 -85052 84844 -42185
12842 -75644 -5779 57335 -160930 -147978 247434 -11828 -232662 234158 -37172 -40987 -125696
$$ packed form
12924A5451b8631J1100F9777b04251C40928A40784a9129B49605Q887l2581b06089
12912d5673k01025m4054A68291G6580a66061K7878C0542J36586g4398C04459d0954
12900d7071B13816b89843E934a91161b0157I7786N7064b92699B88500f5586A53363
12888a46550A25421J3414c59504B53884c5977A01231K5299J19799h5986j60495
12878b46481Q4891E9303b9166m00182I3035a3610r2006k15530d4023p2681B14808
12866A02912d468j36181r1002C05311j26253b13997A2547J4374f6261A16769e2188
12854a44320q6891C6721a5390D2523a73864j05578D5750J32743h5052H4844d2185
12842g5644e779E7335a60930J2952B47434a1828k20834B34158c7172l815q4709
$$ plain form
12831 -125696 319004 174331 267859 -10187 -78150 -78231 251611 -33949 -251744 -249859 -84113
12819 57817 -120957 -162838 213937 -46057 55238 -193885 -236647 -32785 77809 -127005 160407
12807 238541 255037 65174 -264740 149224 198763 219234 -96245 -279433 151722 -52675 41341
12795 -235414 358744 8887 14341 -38249 280451 -145820 -13631 -159502 179984 73004 8756
12783 154485 77202 20241 -99107 46715 22339 -315814 2141 -85830 41760 10491 125709
12772 125709 -49546 52669 174122 -258612 111414 -196826 65851 -64776 -93108 -132775 -1974
12760 -364088 -129463 153069 101445 -208040 19124 253819 -22265 -224912 13832 86296
12750 86296 -117240 -311612 430472 -229580 260174 -250707 130369 213618 246253 -115267
$$ packed form
12831a25696C19004j44673R3528a0187o7963q1B51611c3949k17795J885h4113
12819E7817a20957m1881B13937d6057E5238a93885m2762c2785G7809a27005A60407
12807B38541J6496F5174b64740A49224M9539K0471i6245j83188A51722e2675D1341
12795b35414C58744H887N454c8249B80451a45820a3631j45871A79984G3004H756
12783A54485G7202B0241i9107D6715B2339c15814B141h5830D1760A0491J15218
12772A25709d9546E2669J21453b58612A11414a96826F5851f4776k8332l9667a974
12760c64088a29463A53069n1624b08040A9124K34695b2265k02647A3832P2464
12750H6296a17240j94372D30472b29580B60174b50707A30369Q3249L2635a15267
$$ plain form
12739 138842 -3028 -200475 34256 343672 -206695 -300650 292354 -26023 42659 -71636 -22815
12727 -31386 -78708 -55695 -225760 118425 -213463 -80213 69894 -70864 -431940 49929 35989
12716 35989 -88635 211325 -243467 -221546 147942 277545 377223 352710 115209 6297 27977
12705 27977 -56793 337925 -312684 -196979 -33261 85701 115167 -21093 230421 208842 -5560
12693 -188530 -178174 -93960 -3057 -38670 216579 -56844 -156283 177305 177189 -40358 31583 107769
12681 107769 165969 167638 -84348 155693 54770 434277 2971 96854 278224 268974 -15070
12669 110577 134856 97447 92238 -43867 124118 -60461 221549 215805 -37326 179277 209944
12658 209944 36551 -85003 79315 27893 7756 291102 -300898 98027 -7581 -42159 -55224
$$ packed form
12739A38842c028j97447C4256L09416b06695r3955B92354b6023D2659g1636b2815
12727c1386m7322K3013j70065A18425b13463h0213F9894g0864l61076D9929j3940
12716C5989h8635B11325b43467K1921A47942J29603R9678k4513A15209F297K1680
12705B7977e6793C37925c12684J15705c3261H5701K9466b1093B30421k1579e560
12693a88530J0356Q4214c057l5613B16579e6844r9439A77305j16d0358C1583P6186
12681A07769N8200J669h4348A55693E4770L79507B971R3883J81370r250a5070
12669A10577K4279l7409n209d3867A24118f0461B21549n744c7326A79277L0667
12658B09944C6551h5003G9315B7893G756K83346c00898I8027g581l4578j3065
$$ plain form
12647 -55224 60731 208887 10474 -156748 132265 -140207 42970 165695 -96840 -258867
12637 -258867 249061 370586 33843 -58447 206829 78184 -250752 237223 -14718 129641
12626 195761 -120915 -85842 171356 102002 156756 36050 -169973 2703 89988 161453 -103798
12614 107562 441953 -341535 -97201 -13767 -40401 -20152 65745 -41702 -20921 -2224 6015
12602 -114050 -77581 47220 -24669 114564 109774 -74541 97994 126549 -47787 -42560 95278 -181719
12589 -518648 -46873 -96147 186348 56549 -144855 -98167 -56750 -102007 -103407 127961 -365872
12577 126357 -142531 329043 132217 -128964 -34165 71289 -444650 -22586 -129850 -46175
12566 -248980 -49044 -428741 -51550 -224946 -169261 -135992 -76438 30979 25329 -274062 -13407
$$ packed form
12647e5224F0731J48156A0474a56748A32265a40207D2970J22725i6840j62027
12637b58867B49061J21525C3843e8447B06829G8184b50752B37223a4718A29641
12626A95761a20915L5073A71356o9354N4754C6050a69973B703Q7285P1465a03798
12614A07562L34391c41535i7201a3767k6634b0152F5745d1702K0781b224F015
12602a14050L6469D7220b4669A14564m790g4541I7994K8555d7787N227I5278a81719
12589e18648d6873m9274A86348E6549a44855M6688M1417m5257j400A27961c65872
12577A26357a42531C29043A32217a28964c4165G1289d44650b2586j07264d6175
12566b48980d9044l79697e1550j73396N5685L3269N9554C0979n650b74062a3407
$$ plain form
12554 -307778 -59107 -39462 -189486 -249142 61487 -187051 168088 -98075 6655 -23037 -63441
12543 -63441 -65438 -43247 -35597 -66622 68612 239266 21238 99743 70890 222585 472559
12532 472559 69087 -61792 10354 174946 -25804 -38559 -182299 61627 -39541 -210493 -25370
12520 -105005 64485 152604 277441 -156798 101520 119454 -18589 -172466 -141356 31912 34924
12509 34924 12587 -44359 -147315 -40114 210150 339943 -185251 -25737 -126827 75015 305657
12498 305657 136031 -202413 227442 -122577 -50878 -103567 -145720 189993 -197354 -100085
12488 -100085 168212 -196862 102570 -166395 -101502 119264 119964 -155644 -298008 -146212
12477 42340 -90641 -481183 -160648 283988 34348 -15240 -243488 -19465 213377 69398 292943
$$ packed form
12554c07778e9107J9645j50024n9656F1487a87051A68088i8075F655b3037m0404
12543f3441j997K2191P650l1025F8612J70654B1238P8505k8853J51695K49974
12532D72559F9087f1792A0354J64592b5804j2755j43740F1627c9541j70952b5370
12520a05005F4485Q8119J24837a56798A01520J7934a8589j53877L1110C1912L012
12509C4924A2587d4359j02956d0114B10150J29793a85251b5737j01090G5015K30642
12498C05657A36031b02413B27442a22577e0878n2689m2153A89993a97354R7269
12488a00085A68212a96862A02570a66395O4893A19264P00a55644j42364a46212
12477D2340i0641l90542a60648B83988C4348a5240k28248a9465B13377F9398K23545
$$ plain form
12466 292943 -79837 -379178 139970 109510 -407314 -195186 37367 -100801 380083 -38769
12455 18346 187658 -217225 -177066 62352 24729 -43916 -88349 -201735 125338 176536 9036
12443 -130691 -292964 21110 50045 -89932 104736 -23735 143460 -52690 -158188 -174997 18419
12431 -240541 82043 -180953 -25800 191364 21864 83276 203011 188987 -231040 86744 24449
12419 42254 43970 363921 -154982 -294759 4837 -38982 -359317 140206 126155 -300094 -132916
12407 81929 -149383 454374 35024 181609 37973 120475 50471 -43266 -138118 -387343 -131649
12395 181031 164606 43293 -84798 193162 13881 385542 -52575 -14484 280111 -52136 3004
12383 64207 259977 136190 -155678 322882 -43802 -40148 -70200 -161304 -410792 -145061 -2262
$$ packed form
12466B92943g9837k99341A39970l0460d07314a95186C7367a00801C80083c8769
12455A8346J69312b17225M0159F2352B4729d3916m4433j13386A25338N1198I036
12443a30691j62273B1110K8935h9932A04736b3735A43460e2690j05498j6809A8419
12431b40541H2043a80953b5800A91364B1864O1412J19735j4024b31040H6744B4449
12419D2254J716L19951a54982j39777D837c8982l20335A40206j4051c00094a32916
12407H1929a49383D54374C5024J46585C7973Q2502E0471d3266r4852k49225a31649
12395A81031j6425D3293h4798A93162A3881L71661e2575a4484B80111e2136C004
12383F4207J95770j23787a55678C22882d3802L654l0052r1104k49488a45061b262
$$ plain form
12371 -278286 -206789 444168 399 -207885 65433 -223144 -236155 145885 -355771 -297026 76174
12359 9468 -168996 -208268 168117 -204525 202752 -107624 257987 -5268 -77330 6109 236080
12348 236080 103844 64387 127183 -15016 108696 123315 82834 -169785 69149 278192 150325
12337 150325 231123 -292108 -28731 -39105 225711 -242870 91545 -61868 -83214 -327955 297301
12325 72274 -95673 -33957 -117437 62312 -262 54570 163558 -275701 -195057 -178688 49340 115857
12313 115857 -204517 -235813 274953 10030 216982 -78045 -187715 202326 135797 -84659
12302 -15166 172756 -261098 -482062 -20934 151752 154130 120330 45273 -64077 151375 -208225
12290 173821 -153253 -59984 -145915 228237 193127 143511 70866 -83780 142904 -36633 -35668
$$ packed form
12371b78286P1497D44168C99b07885F5433b23144j3011A45885c55771N8745G6174
12359I468a68996l9272A68117b04525B02752a07624B57987e268p2062F109K29971
12348B36080A03844l9457O2796a5016A08696J4619m0481a69785F9149K09043j27867
12337A50325Q0798b92108b8731j0374B25711b42870I1545f1868k1346k44741B97301
12325G2274i5673c3957q3480F2312b62E4570J08988b75701Q0644J6369D9340O6517
12313A15857b04517l1296B74953A0030K06952g8045j09670B02326o6529h4659
12302a5166A72756b61098k20964b0934A51752K378l3800D5273f4077A51375b08225
12290A73821a53253e9984q5931B28237l5110m9616G0866h3780A42904c6633R65
$$ plain form
12279 -35668 -119682 140339 81497 225694 90909 273469 118545 -253919 226932 -26734
12268 -261849 -11001 -92097 -155753 129367 314720 108657 51862 459516 176375 -75944
12257 22681 -74546 65618 94736 130743 -39090 -106045 159151 172384 108458 -102082 119924
12245 -167926 111067 -20086 3843 173530 340096 107576 54074 143612 364336 -40043 38974
12233 -173460 65158 -12013 313252 57762 17288 284699 25305 27253 -132399 76434 24429
12221 495301 233519 -85540 118329 107772 345851 -110974 458109 228591 25950 195356
12211 195356 117730 -63683 125773 198652 -95299 -285762 304500 -50175 6448 201878 -84141
12199 201240 152831 153448 38552 39598 568384 -55166 382646 -12660 202211 -107326 -169464
$$ packed form
12279c5668q4014A40339n8842J44197I0909J82560A18545b53919B26932b6734
12268b61849a1001q1096o3656A29367J85353A08657E1862M07654A76375g5944
12257B2681g4546F5618K9118L6007c9090o6955A59151J3233o3926a02082A19924
12245a67926A11067b0086C843J69687J66566A07576n3502Q9538K20724d0043C8974
12233a73460F5158a2013C13252E7762A7288K67411B5305J948a32399G6434B4429
12221D95301B33519h5540A18329j0557K38079a10974D58109B28591B5950J69406
12211A95356p7626f3683A25773P2879i5299j90463C04500e0175F448J95430h4141
12199B01240m8409O17C8552J046N28786e5166C82646a2660B02211a07326o2138
$$ plain form
12188 -169464 32670 179833 429374 -86119 -60855 158711 -28223 278194 120961 117294 132048
12177 132048 216944 326283 146612 298865 280775 143771 -110179 347904 94892 -93150
12166 -268962 69258 -14233 -92158 36287 61009 203899 221818 216933 -284073 8894 -72778
12154 144684 196014 -281823 141992 -10785 -160957 16809 170592 -204515 106538 -168050
12143 221729 -38166 123871 -138820 -297233 42448 -25321 119071 162583 -256087 -217041
12133 -217041 133696 -141638 141603 72919 145770 -20468 -122138 -55876 58119 -147384
12122 528337 -262023 21952 -375160 -190522 52517 670604 24279 -52009 -123769 34899 -541506
12110 -286383 67312 91478 -104900 -256220 107073 -29825 -189534 -153704 15281 -173888
$$ packed form
12188a69464C2670J47163K49541h6119K5264A58711b8223B78194A20961l667J4754
12177A32048Q4896J09339A46612J52253j8090j37004a10179C47904I4892i3150
12166b68962F9258a4233p7925C6287K4722J42890J7919m885b84073H894g2778
12154A44684N1330b81823A41992a0785j50172A6809J53783b04515A06538a68050
12143B21729c8166A23871a38820j58413D2448b5321A19071M3512b56087L9046
12133b17041A33696a41638A41603o8684P2851b0468j01670e5876E8119a47384
12122E28337b62023B1952c75160J84638E2517O18087B4279e2009p1760C4899e41506
12110b86383F7312K4166a04900j51320A07073b9825j59709L5830A5281a73888
$$ plain form
12099 -76442 -63700 52086 13332 208508 139459 -65330 -54429 26810 76412 128897 98678
12088 98678 -66461 -301941 -63811 -216729 -86483 -83255 -12800 124934 382353 -54689 47195
12076 -182025 28649 180321 66401 -135524 -56430 152960 -15408 211528 74219 16420 179740
12065 179740 92511 232197 224844 238882 579359 101149 470599 275764 87269 220162
12055 220162 105153 17628 235162 -184552 267651 -221539 -196764 -189941 -24107 8108 105369
12044 105369 -167947 88049 -294774 -65678 -153252 154786 -84264 74700 -13761 167422 -56232
12032 7798 6531 -95767 171510 -183445 -43492 177856 -85506 -42572 229755 -110115 -18327
12020 157368 -17454 172441 29376 124999 -14953 64358 -81439 -2011 -304023 264527 -49337
$$ packed form
12099g6442J2742E2086A3332J95176o9049f5330J0901B6810M9602N2485l0219
12088I8678f6461k35480f3811j52918h6483L228a2800A24934K57419e4689D7195
12076a82025B8649J51672F6401a35524e6430A52960a5408B11528G4219A6420J63320
12065A79740q7229J39686p353J4038L40477A01149L69450j94835H7269J32893
12055B20162A05153A7628K17534a84552B67651b21539K4775O823b4107H108R7261
12044A05369a67947H8049b94774f5678q7574A54786h4264G4700a3761A67422e6232
12032G798j267i5767A71510a83445d3492A77856h5506d2572B29755a10115a8327
12020A57368a7454A72441B9376R5623a4953F4358h1439b011l02012B64527d9337
$$ plain form
12008 224384 8737 118549 47698 84860 -54778 208153 136127 195449 24496 86810 95118
11997 95118 105690 -245942 -37074 108670 -139963 349858 -329389 16627 -48342 -258517
11987 -258517 -8728 -266782 43317 -216566 139502 -170352 -174980 23989 -3415 -179971 160443
11975 215179 107970 243890 -21011 -209006 -351131 167942 64985 -21307 168267 18305
11964 -234807 135573 138312 254189 221711 209184 -88703 -219850 17317 -145463 143206 -75854
11952 -36025 -336790 38503 -55662 281999 -2979 185212 24566 182771 22912 259830 -416036
11940 111692 -201975 28857 -120626 71748 133316 -165991 -352923 -204127 -3443 -26393 189921
11928 -36755 -392729 60695 -221198 -149688 -17850 70810 199798 -12895 -328576 127532 -42940
$$ packed form
12008B24384H737J09812D7698L7162e4778B08153p2026N9322B4496O2314Q308
11997I5118J0572b45942c7074A08670a39963C49858c29389A6627d8342k10175
11987b58517h728k58054D3317b16566A39502a70352m628B3989c415j76556A60443
11975B15179j07209J35920b1011j87995j42125A67942F4985b1307A68267A8305
11964b34807A35573K739J15877l2478j2527h8703j31147A7317a45463A43206g5854
11952c6025l00765C8503e5662B81999b979A85212B4566J58205B2912K36918d16036
11940A11692b01975B8857a20626G1748O1568a65991j86932J48796c443k2950A89921
11928c6755l55974F0695b21198P1510a7850G0810J28988a2895l15681A27532d2940
$$ plain form
11916 -162950 36566 -92938 -43586 47817 272729 -118135 144774 -142353 -68086 -193204
11906 -193204 -237390 181793 23961 -31050 -58054 144892 252205 -17502 -50105 132724 49526
11894 79775 83727 -54397 126642 -84385 -87404 -135184 86614 -328000 -127079 -267652 -217909
11883 -217909 -87180 78125 -79696 80926 9335 -68325 -412255 235560 -189341 286897 168977
11872 168977 -180399 56671 -9607 -164285 -98553 -237555 -33331 38374 191752 184367 -48057
11860 263280 -369928 -223056 -644 -342459 59855 -109460 -120321 -201158 123304 -49802 -76315
11849 -76315 131898 -117839 130857 194117 57318 -186631 -65403 101575 -181657 -57643
11838 -274395 9764 -122574 -173391 -248864 35405 -77125 192159 -108676 -18727 -316224 -24357
$$ packed form
11916a62950C6566i2938d3586D7817K24912a18135A44774a42353f8086j25118
11906a93204m4186A81793B3961c1050k7004A44892J07313a7502l2603A32724D9526
11894G9775L952e4397A26642h4385l019m7780H6614c28000a27079j40573M9743
11883b17909h7180G8125g9696H0926I335f8325l43930B35560a89341B86897j17920
11872A68977a80399E6671i607j54678O5732j39002c3331C8374J53378p385d8057
11860B63280c69928J46872f44l41815E9855a09460j0861q0837A23304d9802k6513
11849g6315A31898a17839A30857O3260E7318a86631f5403A01575a81657e7643
11838b74395I764a22574n0817p5473C5405g7125A92159a08676a8727k97497b4357
$$ plain form
11826 249033 -141910 153052 -139516 -25203 -331673 179176 -302900 307710 -216772 -71576
11815 7339 31398 121034 -276855 -114460 -137708 -82515 171915 64494 -268423 -294722 -175544
11804 -175544 -162755 25122 -209443 5529 -36566 176674 -176731 199610 -265077 -229293 13941
11792 -22531 27350 -52081 117655 -184192 183950 137447 -174183 -6302 -72545 -128445 -304539
11781 -304539 217759 62424 -79647 61665 2934 -175476 -68181 -133639 320668 -418275 7135
11769 203159 394610 -67507 336710 -90068 107065 -86680 -199271 72239 83997 161987 30970
11757 -425849 9035 -248552 19328 24308 17991 -181465 -305527 -52053 -179139 -206212 -19397
11745 -74499 -125621 122036 87346 -533789 1946 36170 40583 -170771 47096 -82030 -299122
$$ packed form
11826B49033a41910A53052a39516b5203l06470A79176c02900C07710b16772g1576
11815G339K4059Q9636b76855a14460k3248N5193A71915F4494b68423k6299J19178
11804a75544J2789B5122b09443E529c6566A76674a76731A99610b65077L5784A3941
11792b2531B7350e2081A17655a84192A83950m6503a74183f302o6243n5900j76094
11781c04539B17759F2424g9647F1665B934a75476f8181o5458C20668d18275G135
11769B03159J91451f7507C36710i0068A07065h6680j12591G2239J1758P7990C0970
11757d25849I035b48552A9328M980o317a81465j24062e2053j27086k7073a9397
11745g4499n1122A22036l4690e33789A946L4224M413a70771D7096h2030k17092
$$ plain form
11734 -299122 34037 82293 -178103 -236130 -18500 54155 239631 -112224 199483 -19539 210977
11722 -247001 -252898 124093 31843 184138 -352873 -198455 54382 55158 -23596 168864 -90748
11710 -117792 -278362 -103125 -120328 -215255 224950 -29087 173853 147428 433219 -174527
11699 23195 119760 98111 6601 -243696 -210471 -90269 -251519 279376 -141560 63446 232028
11688 232028 3262 219520 29898 142755 -408235 -14127 104458 -125970 -50306 -245050
11678 -245050 73137 -15352 -125585 202536 109389 145442 -50281 22011 -176624 -121921 -32419
11666 135214 -220342 -454096 -73263 269784 -198652 -483788 108329 47665 225470 -206452
11655 -136547 132340 -113601 41253 -117406 148011 114061 -27915 -364538 1818 -90045 -157491
$$ packed form
11734b99122C4037M8256a78103n8027a8500E4155J85476a12224A99483a9539B10977
11722b47001n897A24093C1843J52295c52873J54418E4382P76b3596A68864i0748
11710a17792j60570a03125j7203r4927B24950b9087A73853k6425K85791a74527
11699B3195R6565k1649F601b43696L3225i0269j61250B79376a41560F3446J68582
11688B32028C262K16258B9898J12857d08235a4127A04458a25970e0306j94744
11678b45050G3137a5352j10233B02536r3147L6053e0281B2011a76624N4703c2419
11666A35214b20342k33754g3263B69784a98652k85136A08329D7665J77805b06452
11655a36547A32340a13601D1253a17406A48011l3950b7915l36623A818i0045o7446
$$ plain form
11644 -157491 -167201 -51987 -169860 126961 -171762 -237935 -163031 84371 91737 293238 -61567
11632 137677 64795 -149309 -34174 56383 -301576 82076 -58977 30346 91066 278952 -288247
11620 55339 156664 94682 71626 -154139 -5456 -22101 197463 -131726 -58988 12011 -137114
11608 31812 -179703 -86631 -85265 -118588 -25630 251470 -290002 -180644 75436 72424 63456
11597 63456 314303 124217 362102 222343 74719 70629 -112034 -31605 -104914 -565879 -9275
11585 181118 268130 133076 116257 -119464 274697 -202356 18864 -103867 27987 -147140
11574 267200 -36656 80674 139363 96637 -125909 134703 233919 -189190 101577 84916 153021
11563 153021 154872 100593 55321 125825 90757 215407 87590 253053 -157412 249750 -141331
$$ packed form
11644a57491r710e1987j17873A26961a71762o6173P4904H4371P366K01501f1567
11632A37677F4795a49309c4174E6383c01576H2076e8977C0346O0720J87886b88247
11620E5339J01325o1982k3056a54139e456j6645A97463a31726e8988A2011a37114
11608C1812a79703h6631J366l3323b5630B51470b90002J09358G5436l012q968
11597F3456K50847A24217K37885j39759G4719m090a12034c1605p3309m60965i275
11585A81118Q7012A33076j6819a19464B74697b02356A8864a03867B7987a47140
11574B67200c6656H0674N8689m2726a25909A34703R9216a89190A01577j6661O8105
11563A53021J851n4279m5272P0504l5068J24650H7590J65463a57412B49750a41331
$$ plain form
11551 -152334 -25804 25714 194743 195356 33615 -27460 197927 26103 -180173 -157291 -109346
11540 -109346 411278 33107 52371 73475 -163288 -133785 44326 57269 100550 -272448 -313338
11529 -313338 -179823 261675 217056 61161 -197714 123657 -205771 -116384 -328020 -93701
11518 122062 -210560 -87668 162893 -111394 -66906 -342549 277445 15127 79234 138718
11508 138718 77769 -94787 -132642 70296 -44057 52728 131436 -135291 -169138 -107944 213800
11496 33364 -164426 -327271 -100198 26393 -74273 -261665 -66669 147449 -5225 452067 -205178
11484 28622 -96829 315456 -98549 79099 314761 238981 139486 -92866 125597 142678 106381
11473 106381 135978 -123576 -73368 -12297 221371 18365 20791 64296 37587 36529 -267 152937
$$ packed form
11551a52334b5804B5714J69029O13C3615b7460A97927B6103a80173K2882M7945
11540a09346D11278C3107J9264K1104a63288K9503D4326J2943M3281b72448m0890
11529c13338J33515B61675m4619F1161a97714A23657b05771Q9387k11636i3701
11518A22062b10560h7668A62893a11394M4488k75643B77445A5127O4107N9484
11508A38718o0949i4787l7855G0296d4057E2728P8708a35291l3847O1194B13800
11496C3364a64426j62845a00198B6393g4273j87392f6669A47449e225D52067b05178
11484B8622i6829C15456i8549G9099K35662p5780r9495i2866A25597J7081l6297
11473A06381K9597a23576N0208a2297B21371A8365K426M3505k6709j058b67A52937
$$ plain form
11460 367409 18577 65259 -139851 -74451 -80054 -278226 -69003 -29042 -173556 122942 200149
11449 200149 -127814 138406 37836 -3753 -417062 -168638 -33639 1031 -137030 -8447 46258
11437 -33640 179891 125568 242640 -52691 -48583 -22414 270614 128426 -146981 -177999 -95937
11426 -95937 11013 -17213 206392 258158 -243969 -681 43053 29317 -83561 165697 -145298
11414 69953 -258636 -8615 -137018 63311 -32421 -151651 33983 -86390 -60781 94865 289297
11403 289297 -41685 325805 66293 -4541 -156171 -82042 134811 -115620 -217872 -158876 -92755
11392 -92755 -191990 207783 -84461 166473 -63570 -121425 -191178 172996 2800 -20708 -32900
11381 -32900 -192252 -173199 41276 239681 15958 277124 411707 71533 -36569 39750 -270120
$$ packed form
11460C67409A8577M6682a39851O5400n603j98172f9003b9042j44514A22942P7207
11449B00149a27814A38406C7836c753m13309a68638c3639A031a37030h447D6258
11437c3640A79891n4323J17072e2691M108b2414B70614A28426a46981l1018Q2062
11426i5937A1013a7213B06392N1766b43969f81D3053j3736h3561A65697a45298
11414F9953b58636h615j28403F3311c2421j19230C3983h6390K5609I4865J94432
11403B89297d1685C25805F6293d541j51630P4129A34811a15620j02252N8996O6121
11392i2755r9235B07783h4461A66473f3570n7855o9753A72996B800b0708j2192
11381c2900j59352J9053D1276J98405A5958K61166J34583G1533c6569C9750b70120
$$ plain form
11369 12841 32229 -113837 -220344 -130612 3647 305206 115768 -210424 -247061 -114540 36546
11357 -257449 -412765 246248 365 46559 52594 -212187 -144018 28420 -32433 -42691 249685
11345 -73481 -43074 219655 -129772 1990 -129106 -30228 -132180 -307987 -208523 -107150 81697
11333 -16738 287403 -80905 -111265 93449 -20633 -197037 167251 -132691 -160760 143087 -108318
11321 -16119 212271 -178879 -47658 323715 41430 -187689 -76902 201360 -216456 27171
11310 -66872 39913 141315 -65108 -140426 196261 -232788 -329657 74227 -297718 -244904 -16130
11298 -88351 182807 24590 -37693 -59492 171494 210448 -23834 11518 188482 222747 104539
11286 -96085 -21402 -221044 -386113 -349816 -5951 -61439 -330007 -36586 -77492 -201690 -100768
$$ packed form
11369A2841J9388a13837j06507Q9732C647L01559A15768b10424l6637a14540C6546
11357b57449j55316B46248C65M6194O035b12187O8169B8420c2433j0258B49685
11345g3481L0407B19655a29772A990a29106c0228j01952j75807R9464J01373H1697
11333a6738B87403h0905l0360I3449b0633j76404A67251a32691k8069A43087a08318
11321a6119B12271a78879d7658C23715D1430a87689g6902B01360b16456B7171
11310f6872C9913J01402f5108p5318A96261b32788r6869G4227b97718N2814a6130
11298h8351A82807B4590c7693k1799A71494L8954b3834A1518J76964L4265A04539
11286i6085b1402j99642j65069L6297e951n5488k68568c6586m0906j24198a00768
$$ plain form
11274 -306485 -47173 -99868 74039 -82572 -240242 67533 -205181 -111728 -57235 -202385 127279
11262 -222677 -263057 -367955 83910 172772 -16667 -72000 -295145 -122044 -103943 25881 -194186
11250 -1585 -138065 513006 40763 -393523 -147708 -64639 -126397 167428 -156281 -294453
11240 -294453 -1363 -147115 -167554 66269 58800 158210 174173 86254 -36829 -160950 108351
11228 56005 -99193 -188086 79367 -371305 256784 -308652 -196489 31251 290703 -29758 -39833
11217 -39833 -385665 15035 131165 -173684 -10122 -72443 150784 -96491 -438841 109967
11206 9367 36438 185042 -34144 -61576 22117 -132340 -392832 -82372 -202921 -1586 149360
11194 -76319 -156306 -29503 215353 55739 -134333 -34657 -312076 -282121 52612 105091 -189308
$$ packed form
11274c06485d7173n2695G4039h2572j57670F7533b05181R3453N4493j45150A27279
11262b22677m0380j04898H3910Q8862a6667n5333k23145a22044J8101B5881a94186
11250a585j36480E13006D0763c93523a47708f4639o1758A67428a56281j38172
11240b94453a363j45752k0439F6269p469R9410J5963H6254c6829j24121A08351
11228E6005i9193q8893G9367c71305B56784c08652J12163C1251K59452b9758j0075
11217c9833l45832A5035J16130a73684a0122o2321A50784i6491l42350A09967
11206I367K7071J48604c4144k7432B2117a32340k60492h2372j20549a586A49360
11194g6319p9987b9503B15353E5739a34333c4657k77419K9955E2612N2479a89308
$$ plain form
11182 96571 12226 -107982 -263135 3798 -226179 -143325 -190034 -108467 -200950 10495 -18318
11170 -39479 -65729 176782 406651 -126506 78429 476192 262789 924 -23776 100577 -245288
11158 -37382 51012 -171458 -229267 -220229 81991 -3802 -183158 -179023 -112001 -65458 105032 189632
11146 189632 -190420 120646 -180597 -60648 111174 -273838 -97237 -102928 54135 220132
11136 220132 -93035 124496 7499 268241 -56418 -43039 130465 -13581 -225255 -284278 358762
11124 274351 -53280 294099 401039 -20510 -83724 138530 -171269 147543 -65953 -151292
11114 -151292 160617 -34682 321350 -75993 210209 95495 179709 -380073 -30331 77335 73595
11103 73595 -155878 127920 -158475 -33730 -38271 -33101 157788 -27960 363859 60462 108018
$$ packed form
11182I6571A2226a07982j55153C798b26179Q2854m6709Q1567r2483A0495a8318
11170c9479k6250A76782K29869a26506G8429L97763k13403I24b3776A00577b45288
11158c7382E1012a71458n7809R038H1991c802j79356M135O7022M6543A05032Q4600
11146A89632a90420A20646a80597f0648A11174b73838i7237n691E4135J65997
11136B20132i3035A24496G499K60742e6418J3379A30465a3581k11674n9023C58762
11124B74351e3280B94099J06940b0510o3214A38530a71269A47543f5953q5339
11114a51292A60617c4682C21350g5993B10209I5495Q4214c80073c0331G7335l740
11103G3595a55878A27920a58475c3730m541N170A57788b7960C63859F0462M7556
$$ plain form
11092 108018 179270 -28372 30357 94931 175654 67862 259132 62770 41010 60501 -37321
11080 41856 173820 362388 305756 98939 132972 293472 -50375 -67949 -157712 146789 127646
11069 127646 392057 87415 252095 83382 302656 158201 68793 156306 457813 9908 -17403
11057 157233 356888 114018 212816 349548 189542 275828 221528 400001 143904 493642
11047 493642 577151 571837 433883 571869 583326 311640 548103 409281 232527 200926
11037 200926 176781 338127 147496 37945 216531 494716 508762 557707 425011 492625
11027 492625 198485 308383 293065 378851 110425 389032 145586 400243 505907 142053
11016 447647 283382 351419 545521 211338 530516 337873 285122 257142 191605 380008
$$ packed form
11092A08018P1252b8372C0357O4574Q0723F7862J91270F2770k1760J9491c7321
11080D1856J31964J88568n6632I8939L4033J60500e0375j7574q9763A46789j9143
11069A27646K64411H7415J64680H3382K19274j44455F8793Q7513L01507I908a7403
11057A57233J99655A14018R8798J36732j60006Q6286n4300J78473A43904L49738
11047D93642Q3509n314j37954J37986J1457k71686K36463j38822j76754l1601
11037B00926k4145J61346A47496C7945J78586K78185J4046M8945j32696O7614
11027D92625A98485J09898j5318Q5786A10425K78607A45586K54657J05664A42053
11016D47647j64265O8037J94102B11338L19178j92643n2751k7980o5537J88403
$$ plain form
11006 380008 -30270 188609 537447 379789 554708 437241 536091 215456 292603 323910
10996 323910 296429 470173 244104 584563 301873 466852 180696 348973 373733 707704
10986 707704 672473 414931 329912 634767 49457 441410 776180 496007 496042 770977 832246
10975 832246 759012 705158 1015411 756810 1130934 1029449 1507582 1355783 1660207 1614340
10965 1614340 1599671 1430222 1541346 1425811 1352264 907853 783033 1088018 1185214 1102091
10955 1102091 898030 1172643 1144863 1330764 1468332 1146624 1188504 1084296 1013788 827471
10945 827471 663434 692813 750699 269981 487725 340854 230268 159515 9217 319558
10935 319558 52904 31947 221112 167507 29344 116905 286222 -27235 155485 36587 -67837
$$ packed form
11006C80008c0270A88609L48838j57658J74919j17467R8850B15456P7147L1307
10996C23910k7481J73744k26069L40459k82690J64979A80696J68277K4760L33971
10986G07704l5231k57542q5019L04855D9457L91953L34770k80173L5K74935O1269
10975H32246p3234n3854L10253k58601L74124j01485M78133j51799L04424m5867
10965A614340j4669j69449J11124j15535p3547m44411j24820L04985R7196q3123
10955A102091k04061K74613k7780J85901J37568l21708M1880j04208p0508j86317
10945H27471j64037K9379N7886B69981K17744j46871j10586p0753I217L10341
10935C19558E2904k0957J89165n3605B9344Q7561J69317b7235A55485C6587f7837
$$ plain form
10923 234483 71864 -22746 100193 188692 -7101 85565 -45690 -110591 90442 -24637 -8518 218216
10910 70264 -168124 154496 66920 -84715 112536 25659 -306691 -188885 210542 66198
10899 16768 -61831 -148163 -77911 -59099 -242874 -67744 71138 59735 28673 55444 -277659
10887 87529 13056 206205 -148044 -28133 -273068 -93598 -42795 222255 -142057 -57435 -207804
10876 -207804 336302 146546 -68986 230851 -51147 -100860 -34749 6737 -168527 -214770 -94754
10864 189975 -228591 267883 -308085 -240407 -64751 -219206 -139346 -248313 -346704 304517
10853 26704 103932 202175 15040 -111092 139299 264699 30772 -176411 42355 -341030 8755
10841 -304434 -161060 -254417 -258036 -253613 195373 112690 -118820 -42338 -92213 130134 -76556
$$ packed form
10923B34483G1864b2746A00193Q8499g101H5565d5690o4901I0442b4637h518B18216
10910G0264a68124A54496F6920h4715A12536B5659c06691J17806B10542F6198
10899A6768f1831q6332P0252J8812j83775f7744G1138j1403B8673K6771b77659
10887H7529A3056J93149a48044b8133k44935i3598d2795B22255a42057e7435j50369
10876b07804C36302A46546f8986B30851e1147m9713c4749F737a68527m6243i4754
10864A89975b28591B67883c08085O7678f4751j54455P9860j08967r8391C04517
10853B6704P7228R8243A5040a11092A39299J25400C0772a76411D2355c41030H755
10841c04434J43374r3357l619M423A95373q2683a18820d2338m9875A30134g6556
$$ plain form
10829 -99745 203831 -253181 38902 -22314 -282801 154924 -138026 -150595 -205125 -201647 -43471
10817 31555 -136249 1799 -190790 17182 -15893 -86598 261181 -40599 -30127 -240234 -175116
10806 -175116 13927 -331482 -34595 -147031 16875 246152 103925 239290 91271 -230006
10795 30575 6006 27543 -35943 -48161 76725 -120896 -194558 -107896 -47049 -232663 -79051
10783 30525 -301976 -91593 -267427 -57289 -160979 13767 -32894 -92946 85807 -354099 193319
10771 -69497 -180517 -107884 -50443 198003 -254643 -33451 171120 48888 107833 45806 -288481
10759 109687 -212146 -262366 -205850 -379857 -69657 -199315 225180 140739 -158565 -166898 -90532
10748 -90532 177122 -61971 -141121 92882 -95670 -294312 -133795 32164 -179062 24638 -165029
$$ packed form
10829i9745B03831b53181C8902b2314k60487A54924a38026j2569n4530L478d3471
10817C1555a36249A799a90790A7182a5893p0705B61181d0599J0472k10107O5118
10806a75116A3927c31482c4595j12436A6875K29277A03925J35365I1271b30006
10795C0575F006K1537c5943j2218G6725a20896p3662Q6662d7049j85614g9051
10783C0525c01976i1593j75834e7289j03690A3767c2894o0052H5807c54099A93319
10771f9497j11020P2633e0443A98003b54643c3451A71120D8888N8945D5806b88481
10759A09687b12146n0220N6516j74007f9657j29658B25180q4441a58565q333P6366
10748i0532A77122f1971p9150I2882i5670j98642a33795C2164a79062B4638a65029
$$ plain form
10736 -60146 -248413 6179 41739 168297 -13685 -215676 -75228 184401 -47634 -61369 -216249
10725 -216249 -456310 170346 -4989 69159 -58274 -100771 -18136 -48635 -2566 -169073 70495
10713 -2035 -3753 -126462 69145 66007 -218752 335550 -27036 -211540 28284 -110696 -256674
10702 -256674 -343646 -181251 -34802 30151 -185243 -238254 155748 -93263 28351 -352133 -79123
10690 -59439 -103706 -203370 -97987 240791 298827 -312465 185337 55435 280043 -71339 34373
10678 -50951 228086 40778 79463 -93692 133508 -9015 8403 92194 346845 -284006 -37124
10666 100850 -152616 42292 -27084 231016 -57421 -238903 180071 165881 58206 -59993 -343582
10655 -343582 108910 145927 238275 -269160 169215 119303 55055 244722 231667 152857 81085
$$ packed form
10736f0146j88267F179L5560J26558a3685k01991g5228A84401d7634j3735j54880
10725b16249k40061A70346d989F9159e8274m2497a8136l0499b566j66507G0495
10713b035j718j22709F9145l138b18752C35550b7036j84504B8284a10696j45978
10702b56674q6972J62395c4802C0151a85243n3011A55748i3263B8351c52133g9123
10690e9439m4267r9664i7987B40791N8036c12465A85337E5435K24608g1339C4373
10678e0951B28086D0778L8685i3692A33508i015H403Q3791K54651b84006c7124
10666A00850a52616D2292b7084B31016e7421j81482A80071j4190E8206e9993k83589
10655c43582A08910L7017R2348b69160A69215m9912E5055J89667j3055p8810p1772
$$ plain form
10644 81085 -85841 -419258 18310 -197087 195705 -115846 -140847 -291388 -53802 255571
10633 -17621 -141006 14296 -9354 -77604 241059 -238642 -310868 321660 84137 171256 -140671
10621 27872 156443 -3212 -517585 50583 184391 22608 -222630 128809 -81599 -19128 -380235
10610 -380235 41334 -222260 -18818 -90130 -186392 -9704 12270 47710 -104218 91859 140844
10599 140844 -174580 20781 76503 -34527 -328069 -312869 -77715 296595 -74256 -170782 -71004
10587 -94980 -99982 116551 -148908 -182015 -540248 -35938 -110606 -58025 -101504 19369 -39770
10575 90913 86625 -118282 -282282 -284826 -429060 243189 -249373 26889 91843 -28798 70894
10563 63956 -85647 -205083 -214573 -111957 262079 409440 -122375 -241415 63938 -117461
$$ packed form
10644H1085h5841l33417A8310a97087A95705a15846k5001j50541e3802B55571
10633a7621j23385A4296i354o8250B41059b38642p2226C21660H4137Q7119a40671
10621B7872J28571c212n14373E0583J33808B2608b22630A28809h1599a9128l61107
10610c80235D1334b22260a8818p1312r6262i704A2270L5440a04218I1859M8985
10599A40844a74580B0781N5722c4527k93542J5200g7715B96595g4256r6526g1004
10587i4980n002A16551a48908l3107l58233c5938p4668N2581m3479A9369c9770
10575I0913m288a18282j64000k544j44234B43189b49373B6889O4954b8798G0894
10563F3956h5647j19436r490J02616B62079J47361a22375j19040F3938a17461
$$ plain form
10552 -140368 -206454 -259446 51458 -115491 -75200 -171876 -94903 131890 156712 1939 27461
10541 27461 92765 -153175 -164292 74722 -69564 -211916 117253 -18669 -253277 -159864 -208922
10530 -208922 -27047 -294181 2446 -156107 -287694 -29069 105809 -21648 1174 -32176 -154729
10519 -154729 -117715 42327 274018 -168721 -34295 267018 304052 -130186 29111 105654 -97932
10507 167286 242565 -82190 86341 63077 -232222 -31849 64587 -103147 -141721 297121 -337178
10495 -131061 -19261 -126701 8328 153635 -160236 318888 -445426 -239955 662498 46178
10484 -362138 -265953 231460 233949 3560 258800 34062 17445 255423 -253188 10082 644296
10473 644296 400065 171331 164481 109913 47757 -74234 -15845 -90475 61549 -95408 -330838
$$ packed form
10552a40368o6086n2992E1458a15491M0291r6676P6973A31890K4822A939K5522
10541B7461O5304a53175j1117G4722f9564j42352A17253a8669k34608R3413m9058
10530b08922b7047k67134B446a56107j31587b9069A05809b1648A174c2176j22553
10519a54729L7014D2327K31691a68721c4295B67018L7034a30186B9111P6543i7932
10507A67286P5279h2190H6341k3264b32222c1849F4587a03147l8574B97121c37178
10495a31061a9261j07440H328J45307a60236C18888d45426K05471F62498D6178
10484c62138R6185B31460K489C560K55240C4062j6617K37978b53188A0082O34214
10473F44296k44231A71331o850n4568D7757g4234a5845p4630F1549i5408k35430
$$ plain form
10462 -330838 -101480 -33831 165548 -87801 -34101 -104692 43283 -132121 187736 -207365
10451 -145814 -77224 32580 -208010 -105553 218096 128863 -199399 -217477 -108312 -87728
10441 -87728 133148 273421 14986 -168184 -174149 216041 5156 -282844 -427937 235816 -76970
10429 -221210 -66600 -407420 91635 -336934 -6524 -340220 -220408 89943 17489 -233727 -48092
10417 -72375 157588 108748 -286548 228647 32973 -329532 133821 -32986 -370727 -298168
10407 -298168 12360 -41593 -519305 -267927 -18247 -426805 -32348 -191544 27175 -244881
10396 117649 -139573 -222511 -233409 -296817 35856 -54836 33582 354686 -57536 398808 82901
10384 115477 14154 -364802 -111324 -271866 -7671 -23739 -218953 -240918 -38740 28551 -61265
$$ packed form
10462c30838a01480c3831A65548h7801c4101p0591D3283a32121A87736b07365
10451a45814O8590C2580b08010J02457B18096q9233a99399j8078a08312K0584
10441h7728A33148J40273A4986a68184n965B16041E156b82844j45093B35816g6970
10429b21210f6600l40820I1635c36934f524l33696J19812H9943A7489b33727d8092
10417g2375A57588m8840b86548B28647C2973c29532A33821c2986l37741P2559
10407b98168A2360d1593m77712K51378a8247m08558c2348j59196B7175b44881
10396A17649a39573q2938j0898o3408C5856e4836C3582L21104e7536C98808H2901
10384A15477A4154c64802a11324j60542g671j6068j95214k1965c8740B8551f1265
$$ plain form
10372 -88982 12454 222018 -55594 168265 351985 267268 142973 314964 390479 214999
10362 214999 371143 20082 334633 449970 -138559 2988 190202 42886 -37408 208053
10351 106187 -167970 -61814 268666 274425 58941 161026 252974 62211 -59868 57797 -66814
10339 371127 236761 70298 -193529 38736 19309 168928 -189617 221061 71070 112290
10329 112290 257866 -151090 151203 320779 119899 -212467 -209581 41035 176370 -38284
10318 354506 23242 60455 474806 -104918 319088 86376 -108045 251523 176660 -143608
10307 -175452 23576 251701 -123383 140043 -129774 -67468 295250 -151065 -41446 110453
10296 130557 113440 -131837 90000 56068 155195 -72550 24084 115399 9585 213448 32840
$$ packed form
10372h8982A2454K09564e5594A68265J83720q4717j24295J71991P5515j75480
10362B14999J56144B0082L14551J15337a38559B988J87214D2886c7408B08053
10351A06187a67970f1814B68666N759E8941J02085R1948F2211e9868E7797f6814
10339C71127j34366G0298a93529C8736A9309J49619a89617B21061G1070M1220
10329A12290J45576a51090A51203J69576A19899b12467K886D1035J35335c8284
10318C54506B3242L7213M14351a04918C19088H6376a08045B51523p4863a43608
10307a75452B3576K28125a23383A40043a29774O2306B95250a51065d1446A10453
10296A30557j7117a31837I0000l3932R9127g2550B4084R1315I585K03863C2840
$$ plain form
10284 -42545 -355634 79937 -67447 115021 107273 -81823 176878 217940 17265 108109 -339642
10272 -184256 8490 56811 87517 44296 -6451 -117013 270198 147469 -116708 -90551 106870
10260 14901 -154038 271149 -132882 102247 314946 64159 -67125 147296 304847 197391
10250 197391 103583 135117 77826 104803 228989 -202967 -132422 -204991 36081 223508 -37252
10238 -11849 -33604 187331 -181486 20561 494704 -205248 -124523 83798 -342497 -120437
10227 -386816 333817 -165312 -51916 96547 -13307 158576 -76997 46903 -104038 113346
10216 -562304 -71313 -66352 -277254 -19700 -155891 -26507 -117190 -170784 -114338 257779 -218299
10204 192498 -212293 5231 -169340 -85451 -131539 -114983 -266764 62090 35916 183081 -60325
$$ packed form
10284d2545l13089G9937f7447A15021p748h1823A76878M1062A7265R0844c39642
10272a84256H490M8321L0706m3221f451j10562B70198j22729a16708K6157A06870
10260A4901a54038B71149a32882A02247K12699F4159f7125A47296J57551j07456
10250A97391r3808L1534n7291K6977J24186b02967P0545p2569C6081J87427c7252
10238a1849k1755A87331a81486B0561M74143b05248Q0725H3798c42497a20437
10227c86816C33817a65312e1916I6547a3307A58576g6997D6903a04038A13346
10216e62304g1313M961k10902a9700j36191b6507r0683n3594N6446B57779b18299
10204A92498b12293E231a69340Q3889m6088J6556j51781F2090k6174J47165f0325
$$ plain form
10192 -145739 -82191 155027 127326 64256 -66189 -192103 -29051 105320 22835 -78208 -227561
10181 -227561 -119084 75876 47164 -240981 -283733 256701 -210511 -61638 -181939 -110796
10171 -110796 -249529 139215 -155389 -81474 -333663 -59728 206987 -133575 -93496 139830
10160 -243506 354273 -41557 201025 226498 726 25976 -32678 -246037 -160338 64950 -141399
10148 71914 -74105 -215464 96800 -49484 23201 -122646 -179104 -35840 -314086 -103039 -313246
10137 -313246 -216521 -51246 -87902 -98725 169866 -165231 68134 127894 -96047 25338 7373
10125 168219 226590 -323756 191772 24980 47027 14440 -237967 -74772 -251914 -498265
10115 -498265 149674 -264694 -111744 71579 -411144 22383 290610 30784 67687 134646
$$ packed form
10192a45739O3548A55027k7701o3070f6189j25914b9051A05320B2835g8208j49353
10181b27561J08477G5876k8712b40981m2752B56701b10511f1638j20301P1143
10171a10796j38733A39215a55389P3915k52189e9728B06987a33575M0079A39830
10160b43506C54273d1557B01025K5473G26K5250c2678k13359Q5699F4950a41399
10148G1914g4105j41359I6800d9484B3201a22646n6458c5840k78246a03039k10207
10137c13246R6725e1246l6656j0823A69866a65231F8134N9760i6047B5338G373
10125A68219N8371c23756A91772B4980K2047A4440b37967g4772j77142k46351
10115d98265A49674b64694a11744G1579d11144B2383K68227C0784L6903O6959
$$ plain form
10105 134646 66046 -158484 -154889 -157025 -112876 -137515 -179955 194826 -38785 -56087 278871
10093 53557 -275168 102205 158186 105787 -267385 27293 -42818 -172437 -28446 27189 -257865
10081 -376086 -140172 -492690 -118834 188555 -202839 -11486 145360 -105463 -329705 23049
10070 -522062 -103140 -68449 -386781 183925 87175 -218146 15675 -116182 117813 -27399
10059 173801 99245 -237333 -174081 164506 32626 239892 -78631 27820 8229 -281501 104293
10047 323036 63197 -228664 53035 -120691 -240159 -66364 -485158 -228473 -309335 -146799
10036 -193799 -193716 -294598 79214 -286586 112682 21346 -11461 95175 -228860 -328354 -30316
10024 -15194 -147908 -146828 -100867 -12857 -84353 -111942 121487 -59572 811 55357 -140824 -156116
$$ packed form
10105A34646F6046a58484L595k136M4149k4639m2440A94826c8785j7302B78871
10093E3557b75168A02205N5981n2399b67385B7293d2818j29619b8446B7189b57865
10081c76086a40172l52518a18834A88555b02839a1486A45360a05463k24242B3049
10070e22062a03140L4691l18332A83925H7175b18146A5675a16182A17813b7399
10059A73801p4556b37333O3252A64506C2626K07266g8631B7820H229b81501A04293
10047C23036F3197b28664E3035a20691j19468f6364m18794b28473q0862a46799
10036a93799Q3j00882G9214b86586A12682B1346a1461I5175b28860r9494c0316
10024a5194j32714J080M5961a2857p1496k7589A21487e9572H11N4546a40824j5292
$$ plain form
10012 -156116 -346734 85856 -13592 16687 -210043 -248594 -83456 -69737 -9970 41609 -115802
10000 137106 -67866 204286 -27158 -86130 47377 -32710 314170 -153550 -405051 -75373 -247648
9989 -247648 -261600 61696 -283116 94149 138751 -362968 -168769 -179906 -63352 -90737 -158425
9978 -158425 86154 -125683 -262011 141041 238058 280164 102803 -128950 36116 -47979 112047
9966 -490283 65550 -117537 92660 53560 -143599 -153832 -122015 6014 48933 -226352 -33236
9954 -430820 -245434 121240 -130150 19994 -69027 -66191 136178 73439 -172294 229474 -432242
9942 -159619 -45923 218351 153676 270598 -274643 -141228 -149752 -33716 59607 -131311 -43903
9930 -272201 -65649 150263 181118 -88053 -153002 -41032 14161 -270301 177471 -204500 -126095
$$ packed form
10012a56116j90618H5856a3592A6687b10043l8551h3456J3719i970D1609a15802
10000A37106f7866B04286b7158n8972D7377c2710C14170a53550k51501g5373j72275
9989b47648j3952F1696b83116I4149M4602c62968a68769j1137f3352k7385o7688
9978a58425H6154a25683j36328A41041R7017M2106A02803a28950C6116d7979A12047
9966d90283F5550a17537I2660l9100a43599j0233L1817F014M2919b26352c3236
9954d30820J85386A21240a30150A9994f9027K836A36178o2739a72294B29474d32242
9942a59619d5923B18351o4675J16922b74643J33415q524c3716E9607a31311d3903
9930b72201f5649A50263L0855h8053o4949d1032A4161b70301A77471b04500P8405
$$ plain form
9919 -126095 -148211 4760 -33644 -93999 -7940 -338533 -21862 348207 28047 68688 -249273
9907 -352779 -34923 -232619 104006 143882 -186264 164582 63366 154786 -63971 113734 13536
9895 -31673 51534 196479 -138719 -131636 -173495 -217268 -74670 285097 21258 25072 23937 108155
9883 108155 -264739 -36306 -204786 144673 18685 -3440 -385050 -103457 -26959 4650 83116
9872 83116 118676 -275205 77033 -92527 -551769 -3476 -78136 -15309 -61272 -102682 20868 7610
9859 115058 -105932 95078 -334255 -134407 -247489 62810 -561603 158775 113325 -493542
9848 -192148 8193 -133242 -329784 -174211 -175958 -181064 -264942 -288325 -205877 58666 -5036 -86560
9836 -86560 223337 -159155 -190365 79780 -132344 54886 281553 165123 -182566 226725
$$ packed form
9919a26095k2116D760c3644o0355g940l30593b1862C48207B8047M0641b49273
9907c52779c4923j97696A04006L9876a86264A64582F3366R1420f3971A13734A3536
9895c1673E1534J44945a38719P083m1859m3773g4670B85097B1258L814j135Q4218
9883A08155b64739c6306j68480A44673A8685c440l81610a03457b6959D650P8466
9872H3116L5560b75205G7033i2527m59242c476p4660a5309m5963m1410B0868G610
9859A15058a05932I5078c34255a34407j13082F2810e61603A58775m5450d93542
9848a92148H193a33242j96542J55573j747n106q3878k3383Q2448E8666e036q1524
9836h6560B23337a59155l1210G9780a32344E4886K26667j16430a82566B26725
$$ plain form
9825 -49190 -86889 -252741 131765 -99834 -304114 -89446 -187608 -36174 -32840 -191912 -245911
9814 -245911 327451 47735 -43854 -251113 54823 -59471 -79453 -424424 2272 -312225 -274249
9803 -274249 -143134 89736 -328263 -266406 -180373 -117408 -28087 -310521 56733 -118821 -129833
9792 -129833 88506 -4332 -119061 57400 -156402 -276424 -26494 -230917 -98285 7705 -341098
9780 -159662 148565 91297 -293967 6433 181095 -335615 -151081 105222 300050 195399
9770 195399 -233392 88947 -177167 241976 96602 129811 -39426 12435 -95277 -325844 -75259
9758 139416 -8810 216066 -359345 66994 -120695 29677 95788 -52048 -81316 -326821 39855
9746 159168 196298 -19289 71187 -32745 55999 -16745 130699 70086 73309 29157 -79613 79912
$$ packed form
9825d9190l7699j65852A31765i9834k04280h9446r8162c6174L334j59072n3999
9814b45911C27451D7735d3854k07259E4823e9471j9982l44971B272c12225L7976
9803b74249J31115H9736c28263O1857Q6033O2965b8087k82434E6733a18821j1012
9792a29833H8506d332j14729E7400a56402j20022b6494k04423i8285G705c41098
9780a59662A48565n7268b93967F433J74662c35615a51081A05222J94828j04651
9770A95399b33392H8947a77167B41976I6602L3209c9426A2435i5277k30567g5259
9758A39416h810B16066c59345F6994a20695B9677O6111e2048k9268k45505C9855
9746A59168L7130a9289G1187c2745E5999a6745A30699o0613L223B9157g9613G9912
$$ plain form
9733 151585 180289 -121458 -94924 -60446 -103456 101546 -123183 -350492 -153230 -10301 172480
9721 47380 58243 -250765 82854 -128001 -158326 -6578 -153068 -103465 -88610 -344751 47923
9709 -37025 -196184 25412 5293 -466443 227125 2257 -74467 -200507 378721 93314 56603
9698 56603 -146911 -34255 97164 177679 -204515 -114206 -242001 -250236 -18029 -63087 144284
9686 252562 -36232 17293 271128 -283394 -51147 -65175 -212743 213446 -211524 43503 219499
9675 219499 76454 168025 165922 -158476 6535 78749 -154813 -468990 -225958 3943 -76135
9663 -376892 -165886 -56877 -67507 81396 -208043 -42884 -452203 153395 -200181 -179097 -308010
9652 -308010 40945 -184114 245226 50402 87845 231267 96520 -58900 -311777 -43431 199015
$$ packed form
9733A51585K8704a21458K6534L4478m3010A01546a23183k27309a53230a0301A72480
9721D7380J0863b50765H2854a28001l0325f578j46490M9603J4855k56141D7923
9709c7025j59159B5412E293d66443B27125B257g4467j26040C78721I3314l6711
9698E6603a46911c4255I7164Q0515b04515R0309j27795q235a8029m5058A44284
9686B52562c6232A7293K53835b83394e1147j4028j47568B13446b11524D3503J75996
9675B19499G6454R1571k103a58476F535P2214a54813l14177b25958C943g6135
9663c76892a65886e6877j0630H1396b08043d2884m09319A53395b00181K1084j28913
9652c08010D0945a84114B45226E0402L7443J43422I6520e8900k52877d3431A99015
$$ plain form
9640 -260476 904 -105645 -300042 -190709 -41173 245819 -177703 62457 -256421 76813 -17301
9628 -79339 -37918 -116773 -83326 179542 33295 -220088 141209 -98563 -171089 -386641 -408979
9617 -408979 -23320 138908 339195 -190522 170823 -39943 181221 -67177 -202652 -249037
9607 -249037 -28579 78427 -228996 56994 -265673 116315 -270381 -60677 -292908 -113151
9596 15083 16821 -239004 93448 58753 40448 -262512 110242 -232414 -260073 -167378 68007
9584 -88687 -378360 -254759 -194640 82262 -27170 -429469 -80253 -514043 -128866 47279 -40110
9572 -255684 -216675 51651 -22677 -38491 53503 47153 -28808 4783 -187759 53753 144037 -274312
9559 -72834 495 -275542 92490 -155581 -92580 -160434 -39572 688 -359395 54324 -24331 240336
$$ packed form
9640b60476I04a05645j94397J09333d1173B45819a77703F2457b56421G6813a7301
9628g9339c7918p8855L3447A79542C3295b20088A41209i8563p2526k15552k2338
9617d08979b3320A38908K00287a90522A70823c9943A81221f7177j35475m6385
9607b49037b8579G8427b28996E6994b65673A16315b70381f0677k32231a13151
9596A5083J738b39004I3448l4695j8305b62512A10242b32414k7659R2695F8007
9584h8687k89673J23601O0119H2262b7170m02299h0253m33790a28866D7279d0110
9572b55684L9009E1651b2677j5814E3503o350b8808D783a87759E3753R0284b74312
9559g2834D95b75542I2490a55581O3001o7854c9572F88c59395E4324b4331B40336
$$ plain form
9546 270211 -328129 -1608 -171781 296012 24296 153330 -98290 84119 -78434 -39236 -168097
9535 -168097 -77508 -225530 -99220 -321978 -48866 -327148 42016 -223958 132187 -9349 -70952
9524 -70952 -30227 14250 -44842 -66939 161979 92794 201771 -107314 69232 66169 130708
9513 130708 -6400 -238824 58716 -75759 55509 -154277 -26022 -250742 167325 -36951 -4204
9501 -131827 -237247 240026 -11129 -42991 -114890 -54307 182599 53797 -397669 -98862 -15358
9489 5093 -91800 -252529 -201777 -145917 -151777 -164744 370691 -185281 71231 -302305 153607
9477 -181454 -23735 -265942 -67612 262776 -120274 -250996 143482 1478 -340268 31568 295131
9466 295131 -290287 -75476 -61127 -165415 -16085 -252433 -336746 -97324 59483 -44294 -159593
$$ packed form
9546B70211c28129a608j70173B96012B4296J29034i8290H4119g8434L9198j28861
9535a68097g7508j48022i9220k22758d8866k78282D2016b23958A32187i349o1603
9524g0952c0227A4250d4842k2097A61979o9185J08977a07314F9232l063O4539
9513A30708f400k32424E8716g5759E5509a54277b6022k24720A67325c6951d204
9501a31827j05420B40026a1129l1862p1899e4307A82599E3797c97669i8862a5358
9489E093i1800j60729N0752N5860n860j2967C70691a85281G1231c02305A53607
9477a81454b3735k42207f7612B62776a20274j30722A43482A478c40268C1568K63563
9466B95131b90287g5476J4349j04288a6085k36348q4313i7324E9483d4294j15299
$$ plain form
9455 -159593 -495664 -247120 82003 -153698 21820 -303082 -146098 -93191 -5919 30157 61380
9444 61380 -252737 -36445 233341 -106250 22405 18673 -188872 123471 -98023 -183930 -119433
9433 -119433 -49848 -192770 45797 -242879 -244840 21124 -314746 -248992 -19028 -104924 231932
9421 -211921 90460 142456 -155466 -274563 22638 66069 -167401 259424 46958 -81555 -151540
9410 -151540 217731 -220797 -390038 70622 -305434 -304020 -1907 114447 -60638 27051 128686
9399 128686 137135 -88921 -56447 -276685 -12872 -36456 11283 23703 -106349 -1827 -292322
9388 -292322 -92281 -29827 214152 -319566 -194000 -187848 -110723 -134515 -169301 -156285 14734
9376 -16293 17405 113166 -136464 53291 -182786 69896 33047 -94077 166331 332036 14368
$$ packed form
9455a59593l36071b47120H2003a53698B1820c03082a46098N2907e919C0157L1223
9444F1380b52737c6445B33341a06250B2405l732a88872A23471i8023q5907O4497
9433a19433d9848j42922D5797b42879j961B1124c14746O5754a9028q5896B31932
9421b11921I0460N1996a55466j19097B2638M3431a67401B59424D6958h1555o9985
9410a51540B17731b20797j69241G0622c05434J414a907A14447f0638B7051J01635
9399A28686Q449h8921L2474k20238a2872k3584A1283J2420a06349a827k90495
9388b92322i2281b9827B14152c19566J25566O152P7125k3792l4786J3016A4734
9376a6293A7405R5761a36464E3291a82786F9896C3047i4077A66331J65705A4368
$$ plain form
9364 -215199 -151315 -274718 -364838 44802 150487 150253 93234 -38680 -201933 157229 -41908
9352 -97283 334740 242312 -140020 -27471 -275950 76800 -9555 -95819 -350296 -32871 -253243
9341 -253243 -340889 -153415 97765 -335575 72378 -116207 152992 -185308 37922 -292989
9330 220771 -44009 144538 -159698 -51268 226333 -27812 -73247 -8109 365690 141947 -61243
9318 -216275 95500 -46579 -33554 2157 -47020 -31148 -85346 190988 147245 -187151 -231993
9307 -231993 58699 -234061 -15568 -58006 33766 -175970 -186583 -255223 167696 79077 47998
9296 47998 201357 -28208 10241 -189962 -336017 -162765 -170195 -170758 -347580 161506 -75763
9284 -83679 117524 -504470 -26520 -187520 -174848 -58434 246604 -136531 167096 23249 92492
$$ packed form
9364b15199O3884j23403r0120D4802J05685k34n7019c8680j63253A57229d1908
9352i7283C34740r2428a40020b7471k48479G6800i555q6264k54477c2871k20372
9341b53243q7646a53415I7765c35575G2378a16207A52992a85308C7922b92989
9330B20771d4009A44538a59698e1268B26333b7812m5435h109C65690A41947f1243
9318b16275I5500d6579J3025B157d7020J5872n4198A90988m3743a87151m4842
9307b31993E8699b34061a5568m2438C3766a75970j0613o8640A67696G9077l1079
9296D7998J53359b8208A0241a89962j46055a62765p430n63j76822A61506g5763
9284h3679A17524e04470b6520j61000J2672e8434B46604a36531A67096B3249O9243
$$ plain form
9273 92492 96434 -172556 -202972 -27557 -33146 97403 13022 9501 -145485 -64083 -184236 219628
9260 -178129 59490 -67956 -287110 26733 -66764 -184055 -6952 -229412 -21484 79156 -14807
9248 -330371 -196440 -263655 70911 -3936 -45736 -59907 -25149 -156254 50141 -320685 109530
9236 57949 -141749 -125663 86212 146182 -40079 -51357 96039 154927 -122268 -381563 -82973
9224 -118981 -76694 6855 176649 -194654 -77128 -32669 -160494 176534 -322246 -41402 -89151
9213 -89151 -198784 173972 -143615 -393424 30093 121895 -83970 -236879 309073 -71476 -300637
9202 -300637 -432853 -13608 345 -46377 -69081 -282139 -40232 -123659 -12663 20580 14401 -80821
9189 -31148 153990 23758 -7764 -3829 -16771 -123033 -86396 53759 -264944 -175001 183346
$$ packed form
9273I2492L942a72556l0416b7557n589I7403A3022l521a45485f4083j20153B19628
9260a78129E9490f7956k19154B6733f6764j17291f952k22460b1484G9156a4807
9248c30371J33931o7215G0911c936m1800j4171b5149j31105E0141c20685A09530
9236E7949a41749J6086H6212N9970d0079j1278I6039N8888a22268k59295h2973
9224a18981M2287F855J69794a94654g7128c2669j27825A76534c22246d1402m7749
9213h9151j09633A73972a43615k49809C0093R1802h3970j52909C09073g1476k29161
9202c00637j32216a3608C45d6377k2704k13058d0232q3427a2663B0580o179h0821
9189c1148A53990B3758g764c829j2942j06262L6637E3759b64944Q9943A83346
$$ plain form
9177 200295 66893 26276 -63129 -22611 -117239 -51394 -276288 -121045 -235994 295109 -51816
9165 85377 -224302 210495 -93279 107458 -144645 -406309 -509323 -71128 -111298 -276315
9155 -276315 -355206 8188 139037 39806 -197629 146100 -36213 151303 134533 121428 -405468
9143 192004 14106 -181019 -10207 -206172 34059 -42456 -209721 -108029 -319980 -41937 67590
9131 -76866 -338815 72188 -109433 -194421 56038 -94861 159131 115519 131974 -159438 -46703
9119 63734 69276 224912 61990 -94119 -168733 -135969 214876 53839 -371295 -27697 -331154
9108 -331154 -5710 -7060 -205406 -302815 -211740 -222543 -37376 -194729 -49957 -90835 -92167 1851
9095 -129896 -35387 -196630 -110731 251544 -105399 -72260 -143348 33145 -85743 -266723 54997
$$ packed form
9177B00295F6893B6276f3129b2611r4628e1394k24894a21045j14949B95109e1816
9165H5377b24302B10495i3279A07458a44645k61664j03014g1128m0170j65017
9155b76315p8891H188J30849C9806a97629A46100c6213A51303j6770j3105d05468
9143A92004A4106a81019a0207j95965C4059d2456j67265J01692k11951d1937F7590
9131g6866k61949G2188a09433q4988E6038i4861A59131m3612J6455a59438d6703
9119F3734N542J55636F1990i4119p4614L2764B14876E3839c71295b7697l03457
9108c31154e710j350j98346r7409R1075j0803c7376j57353d9957m0878j332A851
9095a29896c5387j61243Q5899B51544a05399L3139p1088C3145h5743j80980E4997
$$ plain form
9083 -147705 -120462 202699 -76796 -156566 -172476 19901 193696 -109117 -32470 91595 -224063
9071 22717 48838 -100010 93590 -217620 38500 -60987 -105171 -87920 -274247 44622 121563
9060 121563 -22656 117394 236050 -42955 9299 -307022 -27204 58952 36639 71783 -167004
9048 -103235 104394 -244668 -9359 100563 36815 -75772 80052 30503 -39242 -11834 -112830
9037 -112830 14646 -36415 -106726 101265 -105207 -285487 -113875 -122670 -203062 103253 -48346
9025 -27352 -241847 151226 -20073 70759 -263443 203449 -134877 -54716 -238215 -152725 -373870
9014 -373870 -263607 135748 -63568 -38333 122555 40764 13434 -77047 36560 57905 -106166
9002 -126 -235956 -284334 -247033 -327243 -7967 -138737 -51340 -246431 -385144 -210709 -11089
$$ packed form
9083a47705K7243B02699g6796p9770j5910A9901J73795a09117c2470I1595b24063
9071B2717K6121a00010I3590b17620C8500f0987m4184J7251j86327D4622P6941
9060A21563b2656A17394J18656d2955I299c07022b7204E8952k2313L5144a67004
9048a03235A04394b44668i359A00563C6815g5772H0052C0503c9242a1834j00996
9037a12830A4646c6415p0311A01265a05207j80280a13875q795q0392A03253d8346
9025b7352k14495A51226b0073G0759b63443B03449a34877e4716j83499Q5490k21145
9014c73870J10263A35748f3568K5235A22555D0764A3434g7047C6560K1345a06166
9002a26k35830m8378L7301q0210g967j30770e1340j95091j38713J74435a1089
$$ plain form
8990 -325723 -13375 392743 -136792 -193021 -74736 -148816 -184534 107736 -5825 -10728 -171705
8979 -171705 69066 -138915 -16606 -124673 -325480 56977 102202 9969 -226115 -109230 267641
8967 -149021 419269 -285346 28940 -268904 -219202 110014 -227064 -66381 117979 -265808
8956 320994 -25210 -67856 -170178 -138530 -131217 -17129 314905 -134564 -54818 -298291 75394
8944 -82759 -135831 -58385 5472 -229633 107265 59726 -43956 -196725 -145278 288187 60097
8932 112510 306266 -272161 126009 88347 47337 -38270 211356 93380 -121656 105264
8921 275200 -96716 248399 529214 1490280 552361 333567 66535 -8071 166984 -64515 128111
8909 -94141 -65738 -7062 24224 -64254 110042 123302 -13059 -135464 -319158 69200 62217 -16913
$$ packed form
8990c25723a3375C92743a36792n6229g4736p4080l5718A07736e825m903j60977
8979a71705F9066a38915a6606j08067k00807E6977M5225I969b26115a09230B67641
8967a49021D19269b85346B8940b68904M9702A10014b27064f6381A17979b65808
8956C20994b5210m2646j02322L1648P313a7129C14905a34564e4818k43473G5394
8944h2759n3072e8385E472b29633A07265m7539d3956j52769N1447B88187F0097
8932A12510J93756b72161A26009l7662m1010c8270B11356I3380a21656A05264
8921B75200i6716B48399K80815R61066E52361k18794F6535h071A66984f4515A28111
8909i4141K8403g062B4224f4254A10042J3260a3059j22405j83694F9200o983a6913
$$ plain form
8896 19839 -43190 -117483 92326 -110896 46912 38072 -80658 -406510 -150963 -172078 16813
8884 196209 -333106 -5197 -202477 223010 -399473 -222398 -292034 59216 191182 77516 98122
8873 98122 -46699 -159086 -261861 -59139 -430423 -252669 132174 -202272 212571 -20658
8862 -53831 -253589 -358183 -60638 -58898 2158 -44714 -192369 -28344 -137588 158609 -47530
8850 274912 66074 -76668 -22098 -81678 44595 -88148 98022 -155502 -105880 -193364 761 -107189
$$ packed form
8896A9839d3190p4293I2326a10896D6912q840h0658l25852a50963k1115A6813
8884A96209c33106e197j97280B23010c99473J77075o9636E9216J31966G7516K0606
8873I8122d6699j12387j02775e9139l71284J77754A32174b02272B12571b0658
8862e3831j99758j04594f0638J740B158d4714j47655b8344j09244A58609d7530
8850B74912F6074g6668b2098n9580D4595h8148I8022a55502M9622q7484G61a07189
$$ [...]
##END NTUPLES=NMR SPECTRUM
##END=
