##TITLE=NES1040_872015035_9242566_UfO24fU4PF
##JCAMPDX= 6.0         $$ Bruker NMR JCAMP-DX V2.0
##DATA TYPE= NMR SPECTRUM
##DATA CLASS= NTUPLES
##ORIGIN= BRUKER
##OWNER= Administrator
$$ 1.72 TOPSPIN		Version 2.1
$$ 2015-06-23 17:23:11.389 -0700  Administrator@X
$$ Compression mode = diff/dup
##.OBSERVE FREQUENCY= 400.02188249412
##.OBSERVE NUCLEUS= ^1H
##.ACQUISITION MODE= SIMULTANEOUS (DQD)
##.ACQUISITION SCHEME= undefined
##.AVERAGES= 64
##.DIGITISER RES= 22
##SPECTROMETER/DATA SYSTEM= spect
##.PULSE SEQUENCE= noesygpps1d.comp
##.SOLVENT NAME= COFFEE_meoh
##.SHIFT REFERENCE= INTERNAL, COFFEE_meoh, 1, 14.96311
##AUDIT TRAIL= $$ (NUMBER, WHEN, WHO, WHERE, PROCESS, VERSION, WHAT)
$$ ##TITLE= Audit trail, TOPSPIN		Version 2.1
$$ ##JCAMPDX= 5.01
$$ ##ORIGIN= Bruker BioSpin GmbH
$$ ##OWNER= Administrator
$$ $$ E:\/data/COFFEE/nmr/NES1040_872015035_9242566_UfO24fU4PF/22/pdata/1/auditp.txt
$$ ##AUDIT TRAIL=  $$ (NUMBER, WHEN, WHO, WHERE, PROCESS, VERSION, WHAT)
(   1,<2015-06-23 17:23:06.014 -0700>,<Administrator>,<X>,<go>,<TOPSPIN 2.1>,
      <created by zg
	started at 2015-06-23 17:11:35.295 -0700,
	POWCHK enabled, PULCHK disabled,
       configuration hash MD5:
       21 0F 79 D6 B3 7B B4 F6 88 20 88 DB 03 48 BD 9F
       data hash MD5: 64K
       98 51 56 A5 61 BE 12 38 C6 FB CD EB 29 10 77 0A>)
(   2,<2015-06-23 17:23:09.108 -0700>,<Administrator>,<X>,<proc1d>,<TOPSPIN 2.1>,
      <Start of raw data processing
       efp LB = 0.3 FT_mod = 6 PKNL = 1 PHC0 = 0 PHC1 = 0 SI = 128K 
       data hash MD5: 128K
       4F 02 FA 78 23 03 4D 1C D1 27 04 F5 F0 07 94 B8>)
(   3,<2015-06-23 17:23:09.951 -0700>,<Administrator>,<X>,<proc1d>,<TOPSPIN 2.1>,
      <pk PHC0 = -85.23193 PHC1 = 0 
       data hash MD5: 128K
       AE 61 D7 B0 18 FC 03 BD 1A B4 1A 22 84 C6 06 72>)
(   4,<2015-06-23 17:23:10.326 -0700>,<Administrator>,<X>,<proc1d>,<TOPSPIN 2.1>,
      <abs ABSG = 1 
       data hash MD5: 128K
       FE 17 51 E2 DE 2A F6 6E 30 64 AD A8 BB E5 E2 F8>)
(   5,<2015-06-23 17:23:10.420 -0700>,<Administrator>,<X>,<proc1d>,<TOPSPIN 2.1>,
      <abs ABSG = 2 
       data hash MD5: 128K
       01 61 43 A7 EE 0A 38 84 9A E9 1D 82 7B 9C 09 DC>)
(   6,<2015-06-23 17:23:10.592 -0700>,<Administrator>,<X>,<proc1d>,<TOPSPIN 2.1>,
      <abs ABSG = 3 
       data hash MD5: 128K
       CB 9D 2C 4F 1F D0 CE 70 2C E5 A2 20 26 E6 AC 9A>)
(   7,<2015-06-23 17:23:10.858 -0700>,<Administrator>,<X>,<proc1d>,<TOPSPIN 2.1>,
      <abs ABSG = 4 
       data hash MD5: 128K
       15 93 27 EB D8 32 3A 72 FE BA 84 F2 0F A6 24 35>)
(   8,<2015-06-23 17:23:10.936 -0700>,<Administrator>,<X>,<proc1d>,<TOPSPIN 2.1>,
      <abs ABSG = 5 
       data hash MD5: 128K
       9B DF C3 6C E7 FA 41 F8 4A 7C D5 3F CB F9 E4 95>)
$$ ##END=
$$ 
$$ $$ hash MD5
$$ $$ 5E E6 C7 A4 6B 4A 2A 02 8E 5C 6C 31 48 3F 30 2D
##$RELAX= 
##$RELAX= 
##$RELAX= 
##$RELAX= 
##$RELAX= 
##$RELAX= 
##$RELAX= 
##$RELAX= 
$$ Bruker specific parameters
$$ --------------------------
##$DU= <E:\>
##$EXPNO= 22
$$ [...]
##$TP07= 0
##$TPNAME0= <>
##$TPNAME1= <>
##$TPNAME2= <>
##$TPNAME3= <>
##$TPNAME4= <>
##$TPNAME5= <>
##$TPNAME6= <>
##$TPNAME7= <>
##$TPOAL= (0..7)
0.5 0.5 0.5 0.5 0.5 0.5 0.5 0.5
##$TPOFFS= (0..7)
0 0 0 0 0 0 0 0
##$TUNHIN= 0
##$TUNHOUT= 0
##$TUNXOUT= 0
##$USERA1= <user>
##$USERA2= <user>
##$USERA3= <user>
##$USERA4= <user>
##$USERA5= <user>
##$V9= 5
##$VALIST= <valist>
##$VCLIST= <CCCCCCCCCCCCCCC>
##$VD= 0
##$VDLIST= <DDDDDDDDDDDDDDD>
##$VPLIST= <PPPPPPPPPPPPPPP>
##$VTLIST= <TTTTTTTTTTTTTTT>
##$WBST= 2048
##$WBSW= 25
##$XGAIN= (0..3)
0 0 0 0
##$XL= 0
##$YL= 0
##$YMAX_a= 6038237
##$YMIN_a= -12065351
##$ZGOPTNS= <>
##$ZL1= 120
##$ZL2= 120
##$ZL3= 120
##$ZL4= 120
##$ABSF1= 14.96311
##$ABSF2= -5.595072
##$ABSG= 5
##$ABSL= 3
##$ALPHA= 0
##$AQORDER= 0
##$ASSFAC= 0
##$ASSFACI= 0
##$ASSFACX= 0
##$ASSWID= 0
##$AUNMP= <proc_prof1d_extract.lims>
##$AXLEFT= 0
##$AXNAME= <>
##$AXNUC= <1H>
##$AXRIGHT= 0
##$AXTYPE= 0
##$AXUNIT= <>
##$AZFE= 0.1
##$AZFW= 0.1
##$BCFW= 0
##$BC_mod= 0
##$BYTORDP= 0
##$COROFFS= 0
##$CY= 15
##$DATMOD= 1
##$DC= 0
##$DFILT= <>
##$DTYPP= 0
##$F1P= 0
##$F2P= 0
##$FCOR= 0.5
##$FTSIZE= 131072
##$FT_mod= 6
##$GAMMA= 0
##$GB= 0
##$INTBC= 1
##$INTSCL= 1
##$ISEN= 128
##$LB= 0.3
##$LEV0= 0
##$LPBIN= 0
##$MAXI= 10000
##$MC2= 0
##$MEAN= 0
##$ME_mod= 0
##$MI= 0
##$NCOEF= 0
##$NC_proc= -2
##$NLEV= 6
##$NOISF1= 0
##$NOISF2= 0
##$NSP= 0
##$NTH_PI= 0
##$NZP= 0
##$OFFSET= 14.96311
##$PC= 1
##$PHC0= -85.23193
##$PHC1= 0
##$PH_mod= 1
##$PKNL= yes
##$PPARMOD= 0
##$PPDIAG= 0
##$PPIPTYP= 0
##$PPMPNUM= 2147483647
##$PPRESOL= 1
##$PSCAL= 4
##$PSIGN= 0
##$PYNMP= <proc.py>
##$REVERSE= no
##$SF= 400.020008794132
##$SI= 131072
##$SIGF1= 0
##$SIGF2= 0
##$SINO= 400
##$SIOLD= 131072
##$SPECTYP= <>
##$SREGLST= <1H.CDCl3>
##$SSB= 0
##$STSI= 131072
##$STSR= 0
##$SW_p= 8223.68421052631
##$SYMM= 0
##$S_DEV= 0
##$TDeff= 65536
##$TDoff= 0
##$TI= <>
##$TILT= no
##$TM1= 0
##$TM2= 0
##$TOPLEV= 0
##$USERP1= <user>
##$USERP2= <user>
##$USERP3= <user>
##$USERP4= <user>
##$USERP5= <user>
##$WDW= 1
##$XDIM= 131072
##$YMAX_p= 373084909
##$YMIN_p= -10734
##$CURPLOT= <Network HP LaserJet P1505>
##$CURPRIN= <$Network HP LaserJet P1505>
##$DFORMAT= <normdp>
##$LAYOUT= <+/1D_H.xwp>
##$LFORMAT= <normlp>
##$PFORMAT= <normpl>
##$SURQMSG= 1
$$ End of Bruker specific parameters
$$ ---------------------------------
##NTUPLES= NMR SPECTRUM
##VAR_NAME=  FREQUENCY,     SPECTRUM/REAL,   SPECTRUM/IMAG
##SYMBOL=    X,             R,               I
##VAR_TYPE=  INDEPENDENT,   DEPENDENT,       DEPENDENT
##VAR_FORM=  AFFN,          ASDF,            ASDF
##VAR_DIM=   131072,        131072,          131072
##UNITS=     HZ,            ARBITRARY UNITS, ARBITRARY UNITS
##FACTOR=    0.0627417313425164, 1,          1
##FIRST=     8223.62146879497, -1275,        -42760
##LAST=      0,             823,             -43214
##MIN=       0,             -10734,          0
##MAX=       8223.62146879497, 373084909,    0
$$ Real data points
##PAGE= N=1
##DATA TABLE= (X++(R..R)), XYDATA
$$ [...]
63439D00320J8880J9106J8608J7146J4454J0865P142L828J163n99j415j928k953
63426E04617m341n004m404l351k903l082l300l619m673o508q379r792j0983j2080
63412D22198j2563j2050j1074j0477j0249r672q462p215o515o151n492m359l128
63399C14791k135j281l00Q70K078L240M454N873P512R202J0642J1570J1953J2037
63385C90506J2075J2106J2026J1901J1949J2182J2204J1564J0136Q142N878L660
63373E14329J783L26r83k414l758m439m217l520k992k809k615k138j681j902l089
63358D79881m792o314p448q518r701j0645j0977j0843j0679j0609j0375r712q550
63345C60718p030n590m858n055n643n890n679n356m956m190l195k641k889l528
$$ y = [400320, 419200, 438306, 456914, 474060, 488514, 499379, 506521, 510349, 511512, 510913, 509498, 507570, 504617, 500276, 495272, 490868, 487517, 484614, 481532, 478232, 474613, 469940, 463432, 455053, 445261, 434278, 422198, 409635, 397585, 386511, 376034, 365785, 356113, 347651, 340436, 333921, 327770, 322278, 317919, 314791, 312656, 311375, 311075, 311945, 314023, 317263, 321717, 327590, 335102, 344304, 354946, 366516, 378469, 390506, 402581, 414687, 426713, 438614, 450563, 462745, 474949, 486513, 496649, 504791, 510669, 514329, 516112, 516438, 515455, 513041, 509283, 504844, 500627, 497107, 494115, 491306, 488691, 486553, 484872, 482970, 479881, 475089, 468775, 461327, 452809, 443108, 432463, 421486, 410643, 399964, 389355, 378980, 369268, 360718, 353688, 348098, 343240, 338185, 332542, 326652, 320973, 315617, 310661, 306471, 303276, 300635, 297746, 294218]
63331B94218l951l980l719l194k459j688r08M3J069J660J548J217J425K350L497
63316B87128M279M422M002L356K843K449J793O40p77k119l305m300m904n051n045
63301B85411n126n047m486l640l017k773k639k387j993j483r84p90r92j183r52
63286B47919m90l50o48j065j437j871k232k156j657j154q22l80K60P38Q31Q76
63270B36362J243J789K158K261K158J801J282J046J415K115K666K970L199L252
63256B65717K906K361K147K463L089L943N122O289O606N728M445L908M405N347
63242C24476O237P160Q369R801J1128J2010J2288J2218J2471J3524J5049J6228
63230D60959J6764J7103J7619J8082J8233J8309J8588J8807J8647J8378J8512
$$ y = [294218, 290267, 286287, 282568, 279374, 276915, 275227, 274319, 274362, 275431, 277091, 278639, 279856, 281281, 283631, 287128, 291407, 295829, 299831, 303187, 306030, 308479, 310272, 310912, 310135, 308016, 304711, 300411, 295507, 290456, 285411, 280285, 275238, 270752, 267112, 264095, 261322, 258683, 256296, 254303, 252820, 251836, 251046, 250054, 248871, 247919, 247429, 247079, 246431, 245366, 243929, 242058, 239826, 237670, 236013, 234859, 234037, 233657, 233917, 234655, 235486, 236362, 237605, 239394, 241552, 243813, 245971, 247772, 249054, 250100, 251515, 253630, 256296, 259266, 262465, 265717, 268623, 270984, 273131, 275594, 278683, 282626, 287748, 294037, 300643, 306371, 310816, 314724, 319129, 324476, 330713, 337873, 346242, 356043, 367171, 379181, 391469, 403687, 416158, 429682, 444731, 460959, 477723, 494826, 512445, 530527, 548760, 567069, 585657, 604464, 623111, 641489, 660001]
63219F60001J9003J9425J9749K0281K0958K1368K1451K1400K0876J9072J5830
63208H79414J1901P872L503j411o285j0349j3571j6369j8882k0958k2464k3090
63196G69311k2289k0058j7398j5330j3737j1788r256o693m394k019P04L542O195
63183F56790Q708J1205J3506J5210J6091J6421J7013J8549K0665K2022K1712K0318
63171H58210J9089J8509J8294J8409J9088J9907J9802J8328J6180J4150J2176
63160A052142R675O330K233k278o612j0256j3343j6476j9724k2286k3508k3759
63148I32138k3816k3700k2730k0569j7731j4982j2668j0732r168q115p597p353
63136G52977p136p008p146p369p272o939o946p415p611p016o267o231o535n992
$$ y = [660001, 679004, 698429, 718178, 738459, 759417, 780785, 802236, 823636, 844512, 863584, 879414, 891315, 899187, 902690, 901279, 894994, 884645, 871074, 854705, 835823, 814865, 792401, 769311, 747022, 726964, 709566, 694236, 680499, 668711, 659455, 652762, 648368, 646349, 647053, 650595, 656790, 665498, 676703, 690209, 705419, 721510, 737931, 754944, 773493, 794158, 816180, 837892, 858210, 877299, 895808, 914102, 932511, 951599, 971506, 991308, 1009636, 1025816, 1039966, 1052142, 1061817, 1068147, 1070380, 1068102, 1061490, 1051234, 1037891, 1021415, 1001691, 979405, 955897, 932138, 908322, 884622, 861892, 841323, 823592, 808610, 795942, 785210, 776042, 767927, 760330, 752977, 745841, 738833, 731687, 724318, 717046, 710107, 703161, 695746, 688135, 681119, 674852, 668621, 662086, 656094]
63122F56094m407k900k334k311k042j334l36Q73J921K089J258L29K03P31J219
63107F49053J433J544J516J206Q31P64J042J440J768J768J135J02m16J33J146
63092F64465J651J588J581J771J686J170P08P23J163J826K503K813K519K118K457
63077F90742L572M452M335L662L419L846M298M246L932M025M857O128P276Q063
63063G56853Q689R488J0580J1900J3327J4679J5823J6928J8408K0416K2587K4527
63051I44205K6255K7915K9380L0597L1936L3657L5187L5702L5349L5117L5354
63040A300654L5169L3747L1615K9979K9303K9142K9120K9325K9768L0043K9726
63029A637591K8688K6869K4049K0054J4945Q861J919n545j2988k0128k7168l4195
$$ y = [656094, 651687, 648787, 646453, 644142, 642100, 640766, 640430, 641303, 643224, 645313, 646571, 646900, 647103, 647834, 649053, 650486, 652030, 653546, 654752, 655583, 656347, 657389, 658829, 660597, 662365, 663500, 663602, 663186, 663319, 664465, 666116, 667704, 669285, 671056, 672742, 673912, 674620, 675343, 676506, 678332, 680835, 683648, 686167, 688285, 690742, 694314, 698766, 703101, 706763, 710182, 714028, 718326, 722572, 726504, 730529, 735386, 741514, 748790, 756853, 765542, 775030, 785610, 797510, 810837, 825516, 841339, 858267, 876675, 897091, 919678, 944205, 970460, 998375, 1027755, 1058352, 1090288, 1123945, 1159132, 1194834, 1230183, 1265300, 1300654, 1335823, 1369570, 1401185, 1431164, 1460467, 1489609, 1518729, 1548054, 1577822, 1607865, 1637591, 1666279, 1693148, 1717197, 1737251, 1752196, 1761057, 1762976, 1757431, 1744443, 1724315, 1697147, 1662952]
63017A662952m0556m5240m7925m9088m9108m7760m4923m1256l7617l4087l0085
63006A195307k5333k0178j4982r745m414Q18N732J0216J4151J7438K0332K3313
62994A212655K6483K9342L1310L2311L2679L2868L3219L3696L3733L2786L1116
62983A562198K9536K8247K6386K3083J8419J2973O923J03p416j5337k3452l1503
62971A630160l8988m5553n1346n6519o0613o2923o3344o2373o0492n8028n5386
62960A014595n2823n0052m6633m2675l8716l4989l1374k7950k5044k2716k0729
62949F20894j9001j7588j6236j4587j2924j1988j1899j1808j0919r414q041p237
62937D69252o871o517n778m659l810l980n006n793n571m799m446m742n120n135
$$ y = [1662952, 1622396, 1577156, 1529231, 1480143, 1431035, 1383275, 1338352, 1297096, 1259479, 1225392, 1195307, 1169974, 1149796, 1134814, 1125069, 1120655, 1121473, 1127205, 1137421, 1151572, 1169010, 1189342, 1212655, 1239138, 1268480, 1299790, 1332101, 1364780, 1397648, 1430867, 1464563, 1498296, 1531082, 1562198, 1591734, 1619981, 1646367, 1669450, 1687869, 1700842, 1707765, 1707868, 1700452, 1685115, 1661663, 1630160, 1591172, 1545619, 1494273, 1437754, 1377141, 1314218, 1250874, 1188501, 1128009, 1069981, 1014595, 961772, 911720, 865087, 822412, 783696, 748707, 717333, 689383, 664339, 641623, 620894, 601893, 584305, 568069, 553482, 540558, 528570, 516671, 504863, 493944, 484530, 476489, 469252, 462381, 455864, 450086, 445427, 441617, 437637, 432631, 426838, 421267, 416468, 412022, 407280, 402160, 397025]
62923C97025m944m861m892m829m558m143l664l136k645k406k511k584k011p97
62909C49044O7l93j870k951k701j599q30r53j598k089k091j736j368j143r00m90
62893C26399j52k66p65j170j215j102j011q25m92k97m40o61o10l61j86K6O47J599
62875C19118K156J707N40l58l40K52O12M79K69K35Np43j590j845j462r69o63m87
62857C16916n24r74j553j681j357j255j693k174k214k009j918j840j604j422j401
62842B93297j084j17R56J211N40k53m55n9N38R81J080R04P43Q12J030J264J531
62825C02919J698J369N28p4K77J241J868J891J861K054K113J911J975K591L192
62810C27414L223L055L383M016M115L527L186L890N310O507P106P540Q324R489
$$ y = [397025, 392081, 387220, 382328, 377499, 372941, 368798, 365134, 361998, 359353, 356947, 354436, 351852, 349841, 349044, 349111, 348718, 346848, 343897, 341196, 339597, 338767, 337814, 336216, 334127, 332036, 330300, 328932, 327789, 326889, 326399, 326247, 325981, 325216, 324046, 322831, 321729, 320718, 319893, 319401, 319104, 318664, 318003, 317393, 317032, 316846, 316872, 317519, 319118, 321274, 322981, 323521, 323163, 322823, 323075, 323687, 324166, 324435, 324670, 324675, 323932, 322342, 320497, 319035, 318066, 317403, 316916, 316392, 315418, 313865, 312184, 310827, 309572, 307879, 305705, 303491, 301482, 299564, 297724, 296120, 294698, 293297, 292213, 292096, 293052, 294263, 294803, 294550, 294095, 294036, 294574, 295555, 296635, 297539, 298282, 299094, 300124, 301388, 302919, 304617, 305986, 306514, 306440, 306717, 307958, 309826, 311717, 313578, 315632, 317745, 319656, 321631, 324222, 327414, 330637, 333692, 337075, 341091, 345206, 348733, 351919, 355809, 361119, 367626, 374732, 382272, 390596, 400085]
62796D00085J0731J1861J2965J4327J6244J8816K1738K4413K6447K8048K9944
62785F15619L2828L6860M1512M5902M9363N1864N3926N6122N8591O0864O2027
62774A165478O1227N8300N3951M8938M3089L5538K6089J5771N675m203j4339k4358
62762A471156l3219m0517m6683n1811n5262n6780n7175n7326n7097n5888n3785
62751I05613n1404m8898m5847m2094l8158l4673l1845k9528k7457k5329k2922
62740E07458k0320j7897j5974j4542j3279j1847j0217q722p686o963o114n031
62728C68866m109l645l357k763j769o07N91J906L364M880O393P858R177J0282
62714C97067J1196J1982J2795J4065J6267J9290K2341K4843K7174L0153L3943
$$ y = [400085, 410816, 422677, 435642, 449969, 466213, 485029, 506767, 531180, 557627, 585675, 615619, 648447, 685307, 726819, 772721, 822084, 873948, 927874, 983996, 1042587, 1103451, 1165478, 1226705, 1285005, 1338956, 1387894, 1430983, 1466521, 1492610, 1508381, 1514056, 1509853, 1495514, 1471156, 1437937, 1397420, 1350737, 1298926, 1243664, 1186884, 1129709, 1072383, 1015286, 959398, 905613, 854209, 805311, 759464, 717370, 679212, 644539, 612694, 583166, 555709, 530380, 507458, 487138, 469241, 453267, 438725, 425446, 413599, 403382, 394660, 386974, 380011, 373897, 368866, 364757, 361112, 357755, 354992, 353223, 352616, 353207, 355113, 358477, 363357, 369750, 377608, 386785, 397067, 408263, 420245, 433040, 447105, 463372, 482662, 505003, 529846, 557020, 587173, 621116]
62703F21116L7945M1693M5357M9273N3371N7319O0943O4125O6403O6999O5483
62692A230027O2233N7917N2570M5574L6635K6405J5745M853o372j7430k7462l6298
62680A444397m4411n1740n7471o1101o2947o3279o1893n9035n5872n3301n0914
62669H22433m7909m4385m0983l7800l4508l1109k7785k4412k1106j8779j8115
62658D75542j8284j7744j6154j4515j3505j2793j2000j1224j0397r132p549o362
62646C25883n855n603n386n496n808n571m598l771l736l925l548k826k424k230
62632B65106j679r04o94j300k046k179j611p36M9N04N07L7p52j386j175J67J973
62615B53881L095L097K647K659L420M659N971O961P441P803Q790J0602J2607J4226
$$ y = [621116, 659061, 700754, 746111, 795384, 848755, 906074, 967017, 1031142, 1097545, 1164544, 1230027, 1292260, 1350177, 1402747, 1448321, 1484956, 1511361, 1527106, 1531959, 1525587, 1508157, 1480695, 1444397, 1399986, 1348246, 1290775, 1229674, 1166727, 1103448, 1041555, 982520, 926648, 873347, 822433, 774524, 730139, 689156, 651356, 616848, 585739, 557954, 533542, 512436, 493657, 475542, 457258, 439514, 423360, 408845, 395340, 382547, 370547, 359323, 348926, 339794, 332245, 325883, 320028, 314425, 309039, 303543, 297735, 292164, 287566, 283795, 280059, 276134, 272586, 269760, 267336, 265106, 263427, 262523, 261829, 260529, 258483, 256304, 254693, 253957, 254006, 254510, 255017, 255054, 254302, 252916, 251741, 251908, 253881, 256976, 260073, 262720, 265379, 268799, 273458, 279429, 286390, 293831, 301634, 310424, 321026, 333633, 347859]
62601C47859J5592J7075J8624K0090K1740K3914K6431K8797L0741L2162L2749
62590F15774L2190L0586K8334K5675K2561J8748J3840P707J091m730r223j3110
62578G69443j7098k0761k3280k4787k5969k6738k6330k4756k3122k2233k1620
62567E12749k0402j8540j6783j5706j5180j4653j3672j2200j0537q997p758o987
62555C51334o802o909o662n876n237n398n914n724m578l310k716k707k679k189
62541B84633j083M31J688K026J570J204J604K646L878N015N832O151O345P363
62527C29303R707J2705J5221J6930J8433K0262K2339K4412K6551K9000L1737L4440
62515E91040L6812L8800M0437M1587M1948M1306L9619L6844L2798K7427K0977
$$ y = [347859, 363451, 380526, 399150, 419240, 440980, 464894, 491325, 520122, 550863, 583025, 615774, 647964, 678550, 706884, 732559, 755120, 773868, 787708, 795415, 796506, 791776, 782553, 769443, 752345, 731584, 708304, 683517, 657548, 630810, 604480, 579724, 556602, 534369, 512749, 492347, 473807, 457024, 441318, 426138, 411485, 397813, 385613, 375076, 366079, 358321, 351334, 344532, 337623, 330961, 325085, 319848, 314450, 308536, 302812, 298234, 294924, 292208, 289501, 286822, 284633, 283550, 283981, 285669, 287695, 289265, 290469, 292073, 294719, 298597, 303612, 309444, 315595, 321940, 329303, 339010, 351715, 366936, 383866, 402299, 422561, 444900, 469312, 495863, 524863, 556600, 591040, 627852, 666652, 707089, 748676, 790624, 831930, 871549, 908393, 941191, 968618, 989595]
62504I89595J3811O155j676q993j5145k0194k4768k9147l2856l5353l6691l7293
62492G67445l7328l6659l5282l3409l1149k8375k5096k1777j9075j7190j5643
62481D66462j3910j2143j0956j0442r876q703p362o566o106n062l257j670j115
62468C69294j173q88j03N06N66N65J167K349L471M112M569N459O946Q517R549
62453D14906R751R073P561N645M124L239K086k93l352n460o011o231p400r138
62439D18500j0150j0052r586r324r056q390p270n847m352l228k858k976k760j713
62425C30938j76J125J827K102K401L080M119N078N515N546N780O583P596Q130
62411C89644P961P557P506P893Q260Q140P469O477N336M169L269L010L364L806
$$ y = [989595, 1003406, 1009561, 1007885, 998892, 983747, 963553, 938785, 909638, 876782, 841429, 804738, 767445, 730117, 693458, 658176, 624767, 593618, 565243, 540147, 518370, 499295, 482105, 466462, 452552, 440409, 429453, 419011, 409135, 400432, 393070, 386504, 380398, 375336, 372079, 370409, 369294, 368121, 367233, 367130, 367636, 368202, 368767, 369934, 372283, 375754, 379866, 384435, 389894, 396840, 405357, 414906, 424657, 433730, 441291, 446936, 451060, 454299, 456385, 456092, 452740, 447280, 441269, 435038, 427638, 418500, 408350, 398298, 388712, 379388, 370332, 361942, 354672, 348825, 344473, 341245, 338387, 335411, 332651, 330938, 330762, 331887, 333714, 335816, 338217, 341297, 345416, 350494, 356009, 361555, 367335, 373918, 381514, 389644, 397605, 405162, 412668, 420561, 428821, 436961, 444430, 450907, 456243, 460412, 463681, 466691, 470055, 473861]
62397D73861L782L180K202J060j0p22r55q60n39K05J556L292M951O293P298P955
62381E12549Q372Q985J0268J2230J4492J6788J9140K1547K3914K6212K8419L0290
62369G33206L1545L2265L2691L2648L1604K9445K6665K3617K0010J5534J0589
62358A019819N916J729k264o059r208j1625j4018j7098k0524k3166k4431k4916
62346H74155k5549k6374k6518k5297k2991k0519j8647j7499j6593j5287j3443
62335F45438j1715j0824j0556r924q469o885o038n889n760n290m508l381j940
62322E54259o32O8L12N78R44J226J632K458L307L390K724K128K002J938J697J608
62306E79639J701J439Q02P15J715K990L479L170K671K152J583J350J667J878J374
$$ y = [473861, 477643, 480823, 483025, 484085, 484075, 483353, 482398, 481538, 480999, 481204, 482760, 486052, 491003, 497296, 504594, 512549, 520921, 529906, 540174, 552404, 566896, 583684, 602824, 624371, 648285, 674497, 702916, 733206, 764751, 797016, 829707, 862355, 893959, 923404, 950069, 973686, 993696, 1009230, 1019819, 1025735, 1027464, 1025200, 1019141, 1009933, 998308, 984290, 967192, 946668, 923502, 899071, 874155, 848606, 822232, 795714, 770417, 747426, 726907, 708260, 690761, 674168, 658881, 645438, 633723, 622899, 612343, 602419, 593950, 587065, 581027, 575138, 569378, 564088, 559580, 556199, 554259, 553627, 553695, 554007, 554585, 555529, 556755, 558387, 560845, 564152, 567542, 570266, 572394, 574396, 576334, 578031, 579639, 581340, 582779, 583581, 584296, 586011, 589001, 592480, 595650, 598321, 600473, 602056, 603406, 605073, 606951, 608325]
62291F08325P71J091K113K700K593K662L304L927M242M899O320P916R078J0130
62277F70071J1652J3466J5000J6196J7521J9319K1595K4096K6368K8102K9584
62266H92970L1247L2662L2696L1045K8695K6377K3477J9297J4590J0604P167L132
62254A153959j576n678q482j0819j3643j6775j9588k1923k3663k4139k2948k0845
62242I63880j8990j7592j6008j4000j2059j0546r280q052o922n801m372k682j285
62229H36291n30j51J02jn39q56l38M74L94p86j967k199j781j521j603j682j594
62212H21713j335p30K58J121J419J616K584M324N891O678P031P458Q001Q659R671
62197H84359J0875J1509J1313J1272J2411J4208J5111J4526J3519J3310J3873
$$ y = [608325, 609096, 610187, 612300, 615000, 617593, 620255, 623559, 627486, 631728, 636627, 642947, 650863, 659941, 670071, 681723, 695189, 710189, 726385, 743906, 763225, 784820, 808916, 835284, 863386, 892970, 924217, 956879, 989575, 1020620, 1049315, 1075692, 1099169, 1118466, 1133056, 1143660, 1150827, 1153959, 1152383, 1146705, 1138223, 1127404, 1113761, 1096986, 1077398, 1055475, 1031812, 1007673, 984725, 963880, 944890, 927298, 911290, 897290, 885231, 874685, 865405, 857353, 850431, 844630, 840258, 837576, 836291, 835761, 835610, 835712, 835711, 835172, 834316, 833978, 834452, 834846, 834060, 832093, 829894, 828113, 826592, 824989, 823307, 821713, 820378, 819648, 819906, 821027, 822446, 824062, 826646, 830970, 836861, 843539, 850570, 858028, 866029, 874688, 884359, 895234, 906743, 918056, 929328, 941739, 955947, 971058, 985584, 999103, 1012413, 1026286]
62186A026286J4294J4080J3607J3542J4190J5414J6973J8763K0725K2548K3772
62175A214194K4246K4230K3860K2739K0450J7236J3822J0679P822N237L027J133
62163A388675o68k441m112n796p675r529j0871j1677j2494j3589j4397j4159j2869
62150A268398j1221r841q812p906p031o400o299o668p056p193p390q040q809q871
62136A156861q005o905o233n913n699n779o300o713o232m848l343k331j670q26
62122A086064N17K182L637M472M939N806P362Q808R027P756N599L061K44k530
62108A146944m467n041m578l834l221k806k924m294p344j1435j4932j6344j5566
62095A050158j3853j2471j1593j0616r222p640o030m201k091n9J450K349K892
$$ y = [1026286, 1040580, 1054660, 1068267, 1081809, 1095999, 1111413, 1128386, 1147149, 1167874, 1190422, 1214194, 1238440, 1262670, 1286530, 1309269, 1329719, 1346955, 1360777, 1371456, 1379278, 1384515, 1387542, 1388675, 1388007, 1385566, 1381454, 1375658, 1367983, 1358454, 1347583, 1335906, 1323412, 1309823, 1295426, 1281267, 1268398, 1257177, 1247336, 1238524, 1230618, 1223587, 1217187, 1210888, 1204220, 1197164, 1189971, 1182581, 1174541, 1165732, 1156861, 1148856, 1141951, 1135718, 1129805, 1124106, 1118327, 1112027, 1105314, 1099082, 1094234, 1090891, 1088560, 1086890, 1086064, 1086581, 1088763, 1092400, 1096872, 1101811, 1107617, 1114979, 1123787, 1132814, 1140570, 1146169, 1149230, 1149474, 1146944, 1142477, 1137436, 1132858, 1129024, 1125803, 1122997, 1120073, 1115779, 1108435, 1097000, 1082068, 1065724, 1050158, 1036305, 1023834, 1012241, 1001625, 992403, 984763, 978733, 974532, 972441, 972382, 973832, 976181, 979073]
62082I79073L461M371N634O845P615Q053Q547R098R285Q815P715N957L496P60
62068A068725j517l220m958o995q702r572j0105j1065j2354j3432j4461j6066
62056I56278j8139j9764k0424k0535k0566k0351j9537j8193j6704j5449j4743
62045G51873j4581j4304j3105j1192r802r717j0243j0207r473q800q528q188p379
62032F16354o388n764n697o018o461o759o700o242n538m824m389m467m950n313
62018E36844n078m312l416k565j711j068j083j791k549k676k131j361p61m56m30
62003E05456n93p57q42j005j475k237l026l601l937m155m299m245l794k954k072
61988D66464j615j705j967j894j282l54N63J336K086K897L592L886L785L679L970
$$ y = [979073, 982534, 986905, 992539, 999384, 1006999, 1015052, 1023599, 1032697, 1041982, 1050797, 1058512, 1064469, 1067965, 1068725, 1067208, 1063988, 1059030, 1052035, 1043333, 1033761, 1023656, 1012591, 1000237, 986805, 972344, 956278, 938139, 918375, 897951, 877416, 856850, 836499, 816962, 798769, 782065, 766616, 751873, 737292, 722988, 709883, 698691, 688889, 679172, 668929, 658722, 649249, 640449, 631921, 623733, 616354, 609966, 604202, 598505, 592487, 586026, 579267, 572567, 566325, 560787, 555963, 551574, 547107, 542157, 536844, 531766, 527454, 524038, 521473, 519762, 518694, 517611, 515820, 513271, 510595, 508464, 507103, 506342, 505886, 505456, 504863, 504106, 503264, 502259, 500784, 498547, 495521, 491920, 487983, 483828, 479529, 475284, 471490, 468536, 466464, 464849, 463144, 461177, 459283, 458001, 457647, 458210, 459546, 461632, 464529, 468121, 472007, 475792, 479471, 483441]
61973D83441M708N695O732P598Q057Q109Q064Q118Q080P842P836Q478R380R718
61959E91856R406R240R824J0949J2172J3317J4266J4930J5745J7410J9727K1460
61947G60302K1936K2094K3156K4924K6331K7205K8326K9988L1692L3264L5161
61936A064379L7374L9118M0114M1308M3677M6991N0441N4023N8569O4591P1751
61925A612336P9515Q7881R7318J08204J20381J33334J46752J60762J75407J90078
61915B911968K03938K16626K27953K36931K41888K41736K36277K24950K06046
61906D948313J77988J40935R6649M7372m325n5110j01611j41794j75114k01245
61896D732058k19500k29759k33270k31992k27325k19772k09572j97326j84022
$$ y = [483441, 488149, 493844, 500576, 508174, 516231, 524340, 532404, 540522, 548602, 556444, 564280, 572758, 582138, 591856, 601262, 610502, 620326, 631275, 643447, 656764, 671030, 685960, 701705, 719115, 738842, 760302, 782238, 804332, 827488, 852412, 878743, 905948, 934274, 964262, 995954, 1029218, 1064379, 1101753, 1140871, 1180985, 1222293, 1265970, 1312961, 1363402, 1417425, 1475994, 1540585, 1612336, 1691851, 1779732, 1877050, 1985254, 2105635, 2238969, 2385721, 2546483, 2721890, 2911968, 3115906, 3332532, 3560485, 3797416, 4039304, 4281040, 4517317, 4742267, 4948313, 5126301, 5267236, 5363885, 5411257, 5406932, 5351822, 5250211, 5108417, 4933303, 4732058, 4512558, 4282799, 4049529, 3817537, 3590212, 3370440, 3160868, 2963542, 2779520]
61887B779520j70659j57806j45478j33405j21524j10077r9418q9741q1002p3001
61877A597409o5636n9110n3713m9250m4982m0368l5680l1482k7772k4052k0163
61866A145201j6538j3495j0816q229n875m004k425o92J317L281M932O328P568
61853A106553Q446Q672Q447Q419Q901R272Q648P078N670N350N967O859P739Q516
61839A214537Q753Q069O896O047N549M657L155J782J092P02J42l00k58j69n45
61824A260109p47L68K649M549N172N514P059R845J2705J4994J7175J9792K2735
61811A381919K5821K9354L3630L8266M2614M6678N1073N6115O1454O6743P2254
61800A905921P8613Q6221R5157J05358J16567J28329J40550J53950J69529J87477
$$ y = [2779520, 2608861, 2451055, 2305577, 2172172, 2050648, 1940571, 1841153, 1751412, 1670410, 1597409, 1531773, 1472663, 1418950, 1369700, 1324718, 1284350, 1248670, 1217188, 1189416, 1165364, 1145201, 1128663, 1115168, 1104352, 1096123, 1090248, 1086244, 1083819, 1083127, 1084444, 1087725, 1092657, 1098985, 1106553, 1114999, 1123671, 1132118, 1140537, 1149438, 1158710, 1167358, 1174436, 1180106, 1185456, 1191423, 1198282, 1206021, 1214537, 1223290, 1231359, 1238255, 1244302, 1249851, 1254508, 1257663, 1259445, 1260537, 1261239, 1261381, 1261081, 1260823, 1260654, 1260109, 1259362, 1259730, 1262379, 1266928, 1272100, 1277614, 1284673, 1294518, 1307223, 1322217, 1339392, 1359184, 1381919, 1407740, 1437094, 1470724, 1508990, 1551604, 1598282, 1649355, 1705470, 1766924, 1833667, 1905921, 1984534, 2070755, 2165912, 2271270, 2387837, 2516166, 2656716, 2810666, 2980195, 3167672]
61790C167672K07011K27436K48903K71805K95801L19933L43512L66319L87715
61781E836107M05912M18289M22223M15555L96657L64465L18478K58738J86241
61772I022665J03773J6088p1309j53788k28086k91650l42331l79002m02023m12836
61762F861501m13349m05771l92402l75021l54622l31989l08333k84978k62684
61753C732352k41602k21662k02706j84558j67418j51924j38388j26251j14788
61744B183055j04074r4608q6336p8783p2002o6440o1928n7701n3503m9800m6687
61733A411193m3576m0245l7203l4674l2152k9526k7549k6462k5158k2722k0013
61722A071913j8501j8094j7398j5867j4447j4004j4202j4175j3614j2855j2438
$$ y = [3167672, 3374683, 3602119, 3851022, 4122827, 4418628, 4738561, 5082073, 5448392, 5836107, 6242019, 6660308, 7082531, 7498086, 7894743, 8259208, 8577686, 8836424, 9022665, 9126438, 9142526, 9071217, 8917429, 8689343, 8397693, 8055362, 7676360, 7274337, 6861501, 6448152, 6042381, 5649979, 5274958, 4920336, 4588347, 4280014, 3995036, 3732352, 3490750, 3269088, 3066382, 2881824, 2714406, 2562482, 2424094, 2297843, 2183055, 2078981, 1984373, 1898037, 1819254, 1747252, 1680812, 1618884, 1561183, 1507680, 1457880, 1411193, 1367617, 1327372, 1290169, 1255495, 1223343, 1193817, 1166268, 1139806, 1114648, 1091926, 1071913, 1053412, 1035318, 1017920, 1002053, 987606, 973602, 959400, 945225, 931611, 918756, 906318]
61711I06318j2627j3052j2898j1912j0885j0657j0959j0985j0719j0747j0978
61700G79899j0592r300p728o417n341m507m157m064l493k154o13M80Q82M30r81
61685G22344k893m554n917p572r450j0667j1011j1513j2863j4133j3962j2298
61673F05511j0163q195o367m737l565k805k145j513j049p42n74q20j802l441n325
61658E52268o974p902p817p095o577o544o397n694m893m526m275l601k768k389
61644D74816k331j994j434j328j815k297k405k457k712k883k597j919j164n43
61630D46937j50kj0p4k15l97m04j58M1j04l91m42k87k57m38o46q16r84j042r02
61610D39259p81q89j040r74q30q30p57l04K59M40L93O75J255J539J421J512K128
$$ y = [906318, 893691, 880639, 867741, 855829, 844944, 834287, 823328, 812343, 801624, 790877, 779899, 769307, 760007, 752279, 745862, 740521, 736014, 731857, 727793, 724300, 722146, 721533, 722013, 722895, 723325, 722344, 719451, 714897, 708980, 701408, 691958, 681291, 670280, 658767, 645904, 631771, 617809, 605511, 595348, 587153, 580786, 576049, 572484, 569679, 567534, 566021, 564972, 564230, 563656, 562836, 561034, 557593, 552268, 545294, 537392, 529575, 522480, 515903, 509359, 502962, 497268, 492375, 487849, 483574, 479973, 477205, 474816, 472485, 470491, 469057, 467729, 465914, 463617, 461212, 458755, 456043, 453160, 450563, 448644, 447480, 446937, 446787, 446785, 446775, 446701, 446486, 446089, 445685, 445527, 445568, 445464, 445073, 444631, 444344, 444087, 443649, 443003, 442187, 441203, 440161, 439259, 438478, 437589, 436549, 435575, 434745, 433915, 433158, 432854, 433113, 433553, 433946, 434621, 435876, 437415, 438836, 440348, 442476]
61593D42476K811L139L426M184N354O363O704O256N421N039N803P518R288J0472
61579E24254J1197J1903J2860J4153J5720J7271J8645K0227K2496K5060K6858
61568G20644K7523K7806K8261K8194K6613K3708K0609J7844J4839J1052P003L781
61556I57877J847O74m66j623k287k177j564p54L02J574K474K400J653J207J554
61541I62691K150K146J295m4j375k434l292m148m900n079m487l669l276l164k713
61526I29701j787o93P12K907N636P968R684J1703J4690J8171K1558K5153K9330
61513A074733L3467L6782L9745M3623M8722N4065N8903O3651O9148P5580Q2526
61502A680945Q9614R6701J03503J09357J13516J15769J16599J16416J14754J10664
$$ y = [442476, 445287, 448426, 451852, 456036, 461390, 467753, 474457, 480713, 486134, 491173, 496976, 504494, 513782, 524254, 535451, 547354, 560214, 574367, 590087, 607358, 626003, 646230, 668726, 693786, 720644, 748167, 775973, 804234, 832428, 859041, 882749, 903358, 921202, 936041, 947093, 954096, 957877, 959724, 960398, 959932, 958309, 956022, 953845, 952281, 951527, 951829, 953403, 955877, 958277, 959930, 961137, 962691, 964841, 966987, 968282, 968238, 966863, 964429, 961137, 956989, 952089, 947010, 942523, 938854, 935578, 932414, 929701, 927914, 927221, 927933, 930840, 936476, 944444, 954128, 965831, 980521, 998692, 1020250, 1045403, 1074733, 1108200, 1144982, 1184727, 1228350, 1277072, 1331137, 1390040, 1453691, 1522839, 1598419, 1680945, 1770559, 1867260, 1970763, 2080120, 2193636, 2309405, 2426004, 2542420, 2657174, 2767838]
61492B767838J03911R5194Q5026P3126N9476M5195L1698J9388P974k312j0765
61481C275749j7257k2280k5923k7768k8113k8473l0314l3838l8433m3840n0281
61470B929229n7606o4839p0697p4339p5663p5019p2734o8876o3461n6772m9382
61459B199841m1877l4690k8058k1999j6286j0682n160M2M603Q355J1568J4920
61447B080577J8959K3406K7492L1085L5018L9936M5365N0419N4833N8420N9898
61436B525408N7465N0760M1354L1003K0344R713L21o390j0224j2227j3333j3645
61424B680549j2968j1382r051n989k251J866N978R751J2686J3925J2447P514r38
61411B702137j2033k3988l4653m2445m6904m8431m7646m5134m1629l7931l4402
$$ y = [2767838, 2871749, 2966943, 3051969, 3125095, 3184571, 3229766, 3261464, 3280852, 3288826, 3286514, 3275749, 3258492, 3236212, 3210289, 3182521, 3154408, 3125935, 3095621, 3061783, 3023350, 2979510, 2929229, 2871623, 2806784, 2736087, 2661748, 2586085, 2511066, 2438332, 2369456, 2305995, 2249223, 2199841, 2157964, 2123274, 2095216, 2073217, 2056931, 2046249, 2041089, 2041131, 2045734, 2054089, 2065657, 2080577, 2099536, 2122942, 2150434, 2181519, 2216537, 2256473, 2301838, 2352257, 2407090, 2465510, 2525408, 2582873, 2633633, 2674987, 2705990, 2726334, 2736047, 2736368, 2729978, 2719754, 2707527, 2694194, 2680549, 2667581, 2656199, 2647148, 2641159, 2638908, 2640774, 2646752, 2656503, 2669189, 2683114, 2695561, 2703075, 2702137, 2690104, 2666116, 2631463, 2589018, 2542114, 2493683, 2446037, 2400903, 2359274, 2321343, 2286941]
61400B286941l0839k7092k3601k0951j9043j7154j4824j2197r380o033j969K325
61388B106183O365J0551J5780K2302K9536L7050M4998N3456O1974P0152P8120
61377B536467Q6019R3402R9755J05269J10367J14526J16321J14769J10103J02879
61367C589877R2898P9592O3096M4358K4300L588j6698l5005n0475o3735p5908
61356C655888q7006r5990j02314j06720j10217j12872j14007j13213j10715j06901
61346B595933j02098r6695r1054q5149p8642p1522o4405n7925n2023m6070l9656
61335A810694l3034k6736k0930j5351r802m451M58N034R660J4468J9055K2758
61323A771823K5089K5886K5287K3606K1240J8561J5950J3837J2526J1935J1671
$$ y = [2286941, 2256102, 2229010, 2205409, 2184458, 2165415, 2148261, 2133437, 2121240, 2111860, 2105827, 2103858, 2106183, 2112548, 2123099, 2138879, 2161181, 2190717, 2227767, 2272765, 2326221, 2388195, 2458347, 2536467, 2622486, 2715888, 2815643, 2920912, 3031279, 3145805, 3262126, 3376895, 3486998, 3589877, 3682775, 3762367, 3825463, 3869821, 3894121, 3897709, 3881011, 3846006, 3795531, 3731796, 3655888, 3568882, 3472892, 3370578, 3263858, 3153641, 3040769, 2926762, 2813549, 2702834, 2595933, 2493835, 2397140, 2306086, 2220937, 2142295, 2070773, 2006368, 1948443, 1896420, 1850350, 1810694, 1777660, 1750924, 1729994, 1714643, 1704841, 1700390, 1700848, 1705882, 1715542, 1730010, 1749065, 1771823, 1796912, 1822798, 1848085, 1871691, 1892931, 1911492, 1927442, 1941279, 1953805, 1965740, 1977411]
61312A977411J1425J1216J1192J1339J1466J1456J1461J1763J2385J2886J2840
61301B106840J2439J2290J2375J1766R802P144M943L280J284j304l757n739p964
61288B163399j0942j3889j5651j6116j5929j5288j3888j1720r215o690m366k797
61276B026908k628l894o091q781j1607j3941j5279j5971j6853j8065j8842j8578
61264A876378j7471j5971j4240j2296j0149p527l997K92M467P945J1145J4880
61252A833456J9365K4353K9901L6436M4093N2458O1064O9703P8076Q5433R0814
61241B425152R3545R3117Q8601P8717O2998M2787K0651j194k1498l9209n3039
61230B790628o2310o7680p0381p1005o9455o5654n9642n1317m0899k9545j8836
$$ y = [1977411, 1988836, 2000052, 2011244, 2022583, 2034049, 2045505, 2056966, 2068729, 2081114, 2094000, 2106840, 2119279, 2131569, 2143944, 2155710, 2165512, 2172656, 2177599, 2180879, 2182163, 2180859, 2177102, 2171363, 2163399, 2152457, 2138568, 2122917, 2106801, 2090872, 2075584, 2061696, 2049976, 2040761, 2034071, 2029705, 2026908, 2024280, 2020386, 2014295, 2005514, 1993907, 1979966, 1964687, 1948716, 1931863, 1913798, 1894956, 1876378, 1858907, 1842936, 1828696, 1816400, 1806251, 1798724, 1794727, 1795019, 1799486, 1807431, 1818576, 1833456, 1852821, 1877174, 1907075, 1943511, 1987604, 2040062, 2101126, 2170829, 2248905, 2334338, 2425152, 2518697, 2611814, 2700415, 2779132, 2842130, 2884917, 2905568, 2904374, 2882876, 2843667, 2790628, 2728318, 2660638, 2590257, 2519252, 2449797, 2384143, 2324501, 2273184, 2232285, 2202740, 2183904]
61219B183904r730k699J281R10l969j1835k0770k9668l7915m4672m9053n0807
61207A924977n0330m8149m4717m0461l5821l1319k7551k4865k3010k1488k0324
61196A556942k0041k0728k1653k2001k1713k1305k1113k0984k0533j9529j8173
61185A329169j6970j6242j5814j5419j5123j4972j4509j3327j1910j1124j0848
61174A172911j0024q280o557n683n149m052k620k089l367o426j0773j5753k0478
61161A071660k3967k5634k5627k4707k3836k3521k3499k3188k2464k1635k0827
61150H12755j9874j8791j7766j6615j4959j3095j1872j1509j1238j0490r603q941
61138F48002q082o546m675l113j893o30P24J974L125M290N468O731Q198R594J0419
$$ y = [2183904, 2174174, 2171475, 2172756, 2173666, 2169697, 2157862, 2137092, 2107424, 2069509, 2024837, 1975784, 1924977, 1874647, 1826498, 1781781, 1741320, 1705499, 1674180, 1646629, 1621764, 1598754, 1577266, 1556942, 1536901, 1516173, 1494520, 1472519, 1450806, 1429501, 1408388, 1387404, 1366871, 1347342, 1329169, 1312199, 1295957, 1280143, 1264724, 1249601, 1234629, 1220120, 1206793, 1194883, 1183759, 1172911, 1162887, 1154607, 1148050, 1142367, 1137218, 1133166, 1130546, 1128457, 1125090, 1118664, 1107891, 1092138, 1071660, 1047693, 1022059, 996432, 971725, 947889, 924368, 900869, 877681, 855217, 833582, 812755, 792881, 774090, 756324, 739709, 724750, 711655, 699783, 688274, 677036, 666546, 656943, 648002, 639920, 633374, 628699, 625586, 623693, 623063, 623787, 625761, 628886, 633176, 638644, 645375, 653573, 663167, 673586]
61123F73586J0764J1133J1184R744O767M039K929K508J143r32k120j926j296q35
61109G26688k80L16L84K6N1M93L09j034k715l721m066m348m838n408n898o207
61093F89752o381o612o852o673o001n617o109o735o308m978l930l489k836j696
61079F15535r31j055j362j100m54K10J085K335L534M320M900N466N859O225P135
61064F51702Q534R393R015Q039P457P327P120O767O611O609O312N475M371L613
61050G48345L754M735N707N936N878O620Q297R984J1182J2427J4096J5819J7455
61037H70235J9561K2286K4812K6650K8552L1366L4847L8341M1875M5779M9964
61026A234268N4222N8542O2471O5078O6245O7219O9269P2779P8266Q6914R9063
$$ y = [673586, 684350, 695483, 706667, 716411, 723178, 727217, 730146, 732654, 733797, 732865, 730745, 728819, 727523, 726688, 726408, 726724, 727108, 727134, 727185, 727678, 727987, 726953, 724238, 720517, 716451, 712103, 707265, 701857, 695959, 689752, 683371, 676759, 669907, 663234, 657233, 651616, 645507, 638772, 632464, 627486, 623556, 620067, 617231, 615535, 614604, 613549, 612187, 611087, 610633, 610843, 611928, 614263, 617797, 622117, 627017, 632483, 638342, 644567, 651702, 660236, 669629, 678644, 686683, 694140, 701467, 708587, 715354, 721965, 728574, 734886, 740361, 744732, 748345, 752099, 756834, 762541, 768477, 774355, 780975, 789272, 799256, 810438, 822865, 836961, 852780, 870235, 889796, 912082, 936894, 963544, 992096, 1023462, 1058309, 1096650, 1138525, 1184304, 1234268, 1288490, 1347032, 1409503, 1474581, 1540826, 1608045, 1677314, 1750093, 1828359, 1915273, 2014336]
61015B014336J13260J27932J42996J59169J77285J99788K31228K75240L31883
61006C773117L99462M77457N66132O65854P80389R19474J094463J313058J582396
60997A1571802J911729K294700K675401K937197K945441K623297K003222J218994
60989C0181783M54205j15984l72838k93078L0311M09227O30402N41974J08689
60980C1574691n86603j382114k094057k576877k770500k710320k490280k205430
60972A4758510j916077j648578j412121j208190j032229q77463p40490o21615
60964E301747n20905m36748l67709l12927k70391k36869k09794j87754j69355
60955B589295j53179j38798j26301j14894j03439r2291q2979p5983p0369o5728
$$ y = [2014336, 2127596, 2255528, 2398524, 2557693, 2734978, 2934766, 3165994, 3441234, 3773117, 4172579, 4650036, 5216168, 5882022, 6662411, 7581885, 8676348, 9989406, 11571802, 13483531, 15778231, 18453632, 21390829, 24336270, 26959567, 28962789, 30181783, 30635988, 30520004, 30147166, 29854088, 29884399, 30293626, 30924028, 31466002, 31574691, 30988088, 29605974, 27511917, 24935040, 22164540, 19454220, 16963940, 14758510, 12842433, 11193855, 9781734, 8573544, 7541315, 6663852, 5923362, 5301747, 4780842, 4344094, 3976385, 3663458, 3393067, 3156198, 2946404, 2758650, 2589295, 2436116, 2297318, 2171017, 2056123, 1952684, 1860393, 1777414, 1701431, 1631062, 1565334]
60945A565334o2724o1171n9139n4934m8969m2816l7370l2692k8921k6203k4122
60934A086273k2033j9879j8147j7080j6387j5666j4740j3588j2217j0802r767
60923I15967r530j0052j0756j1110j1175j1337j1561j1477j1154j1080j1166j0615
60911G84954r280q214q146q187p204n833n781p325q854r022q158p215o462n783
60897F79490n345n294n354n192m874m551m085l306k315j328n05jJ79M31J120J896
60881F40966K012J447J051J309J655J263N2j428k622l217l214k987k847k468j307
60866F29665L76J688K423L319M655N593N478M831M275L383J573n45j840k179k165
60851F60530j764n57Q06P44j323m304p007r354j1644j3499j4314j4073j3123j1606
$$ y = [1565334, 1502610, 1441439, 1382300, 1327366, 1278397, 1235581, 1198211, 1165519, 1136598, 1110395, 1086273, 1064240, 1044361, 1026214, 1009134, 992747, 977081, 962341, 948753, 936536, 925734, 915967, 906437, 896385, 885629, 874519, 863344, 852007, 840446, 828969, 817815, 806735, 795569, 784954, 775674, 767460, 759314, 751127, 743923, 738090, 732309, 724984, 716130, 707108, 698950, 691735, 685273, 679490, 674145, 668851, 663497, 658305, 653431, 648880, 644795, 641489, 639174, 637846, 637341, 637340, 637519, 637950, 639070, 640966, 642978, 644425, 645476, 646785, 648440, 649703, 649755, 648327, 645705, 642488, 639274, 636287, 633440, 630972, 629665, 630041, 631729, 634152, 637471, 642126, 647719, 653197, 658028, 662303, 665686, 667259, 666714, 664874, 662695, 660530, 658766, 658209, 659015, 659759, 658436, 654132, 647125, 637771, 626127, 612628, 598314, 584241, 571118, 559512]
60837E59512r681p898o697n793m618l172j965j262q53n39m00n74j022j533j727
60822E11778j235j43Q57J166R95J008J283J229O07O1K59R58J385J303J111J089
60806E23711J104J123J366J757J703Q82o6j74N99J181N22j283l097l727k864j287
60790E21450k33m00j446k533l206l577l755l518k703j668j120j548k812m099m361
60775D84471l157j265j02k79r43q98p1N54L34k85n64m76n13p97q62k99P24J732
60757D77304K432K747K635K145J620J492J780J970J568O38l92j221j867k411k877
60742D87563l288l597l540k895j953j372j396j496j130n82o45j529k571l131l315
60727D55123l584l996m255m279m233m068l516k660k068k118k585l073l549m038
$$ y = [559512, 549831, 541933, 535236, 529443, 524825, 521653, 519688, 518426, 517573, 517034, 516634, 516060, 515038, 513505, 511778, 510543, 510400, 511257, 512423, 513418, 514426, 515709, 516938, 517545, 517606, 517865, 518823, 520208, 521511, 522622, 523711, 524815, 525938, 527304, 529061, 530764, 531646, 531580, 531406, 532005, 533186, 533708, 532425, 529328, 525601, 522737, 521450, 521217, 520817, 519371, 516838, 513632, 510055, 506300, 502782, 500079, 498411, 497291, 495743, 492931, 488832, 484471, 481314, 480049, 479947, 479668, 478725, 477827, 477756, 478310, 478644, 478359, 477795, 477319, 476806, 476009, 475147, 474848, 475572, 477304, 479736, 482483, 485118, 487263, 488883, 490375, 492155, 494125, 495693, 496331, 495939, 494718, 492851, 490440, 487563, 484275, 480678, 477138, 474243, 472290, 470918, 469522, 468026, 466896, 466314, 465669, 464140, 461569, 458438, 455123, 451539, 447543, 443288, 439009, 434776, 430708, 427192, 424532, 422464, 420346, 417761, 414688, 411139, 407101]
60713D07101m191l690k858k326k182j993j602j251r56m09L02O39N14N98J299K055
60697C91050K129J592R90N75M65R89K187L360L851L970M300M569M073L102K765
60682D29967L415M166M161L486K661K052K002K672L489L515K636J739J421J322
60668D68704R75N35K49Rj61R0P33J209J383J802K548K850K438K227K715K723J032
60651D92061j564l225l550l662m116m364m289m630n503n827m867l319k215j626
60637D39304j155r89j588k721l578l665l191k672k497k667k769k393j716j416
60623D06287j840k596l142l370l429l251k653j710p02J44P01Q87P20L70M5j33
60607C86328q7J70N29Q92J286J689J880J759J636J815K011J640P28l0j82n0j89
$$ y = [407101, 402910, 399220, 396362, 394036, 391854, 389861, 388259, 387008, 386052, 385643, 385945, 386584, 387098, 387696, 388995, 391050, 393179, 394771, 395761, 396336, 396801, 397790, 399977, 403337, 407188, 411158, 415458, 420027, 424100, 427202, 429967, 433382, 437548, 441709, 445195, 447856, 449908, 451910, 454582, 458071, 461586, 464222, 465961, 467382, 468704, 469679, 470214, 470463, 470472, 470311, 470401, 471134, 472343, 473726, 475528, 478076, 480926, 483364, 485591, 488306, 491029, 492061, 490497, 487272, 483722, 480060, 475944, 471580, 467291, 462661, 457158, 451331, 446464, 443145, 440930, 439304, 438149, 437160, 435572, 432851, 429273, 425608, 422417, 419745, 417248, 414581, 411812, 409419, 407703, 406287, 404447, 401851, 398709, 395339, 391910, 388659, 386006, 384296, 383594, 383738, 384439, 385326, 386046, 386416, 386461, 386328, 386241, 386411, 386940, 387832, 389118, 390807, 392687, 394446, 396082, 397897, 399908, 401548, 402276, 402246, 402064, 402014, 401825]
60590D01825o97j245j441j055k21M60M84J16J02O00J008J014J123J752K459K595
60574D08879K300K175K342K438K317K161K006J745J528J558J567J062J61l94j99
60559D31646L04N60O46R74J564K088K459K957L684M379M859N430O548Q249J0178
60544D86525J2174J4460J7213K0225K3266K6553L0523L5224M0215M5099M9774
60533H01251N4093N7466N8957N7679N2995M4651L2917J8654L123j2238k5968l6836
60521A106744m4176m8009m8817m7190m3764l9259l4440k9785k5241k0457j5431
60510G10175j0782p137m265j254K450O621J1013J5896K1393K6844L1543L5870
60498H38367M0890M6806N2319N5539N5114N0646M2735L2662K1533R693k560j3848
$$ y = [401825, 401128, 399883, 398442, 397387, 397166, 397626, 398110, 398226, 398328, 398928, 399936, 400950, 402073, 403825, 406284, 408879, 411179, 413354, 415696, 418134, 420451, 422612, 424618, 426363, 427891, 429449, 431016, 432078, 432239, 431845, 431646, 431950, 432510, 433156, 434130, 435694, 437782, 440241, 443198, 446882, 451261, 456120, 461550, 468098, 476347, 486525, 498699, 513159, 530372, 550597, 573863, 600416, 630939, 666163, 706378, 751477, 801251, 855344, 912810, 971767, 1029446, 1082441, 1127092, 1160009, 1178663, 1181786, 1169548, 1143580, 1106744, 1062568, 1014559, 965742, 918552, 874788, 835529, 801089, 771304, 746063, 725606, 710175, 699393, 692256, 687991, 686737, 689187, 695808, 706821, 722717, 744110, 770954, 802497, 838367, 879257, 926063, 978382, 1033921, 1089035, 1139681, 1182416, 1215078, 1236611, 1246304, 1243744, 1229896]
60486A229896k2128k6301k6698k3979j8412j0514j457P857J7560K8143L9379N0332
60474A243678N9900O6963P0454O9737O4490N4069L7755J6218p843l1195n1813
60463A592413o8760q1194q8482r0922q9481q4968p8162p0363o2856n5923m9188
60452G72114m2897l7871l4176l0705k6505k1850j7704j4600j2354j0468q506o392
60440E08086m518l285k571j902j186p95q60r46o28qM97N54j8j187k504l273l249
60423D82207k945l030l485l629k858j271N09J958L004L754M088L838L402L632
60409D89174M859O416P511Q192Q983R876J0386J0483J0840J2018J3870J5728J6852
60396F25188J6826J6000J5389J5520J5497J3990J1098Q342O672N496M072K828
$$ y = [1229896, 1207768, 1181467, 1154769, 1130790, 1112378, 1101864, 1100407, 1108264, 1125824, 1153967, 1193346, 1243678, 1303578, 1370541, 1440995, 1510732, 1575222, 1629291, 1667046, 1683264, 1675421, 1644226, 1592413, 1523653, 1442459, 1353977, 1263055, 1173574, 1088606, 1010444, 940081, 877225, 821302, 772114, 729217, 691346, 657170, 626465, 599960, 578110, 560406, 545806, 533452, 522984, 514478, 508086, 503568, 500283, 497712, 495810, 494624, 493829, 492969, 492023, 491395, 491387, 491884, 492438, 492420, 491233, 488729, 485456, 482207, 479262, 476232, 472747, 469118, 466260, 464989, 465498, 467456, 470460, 474214, 478302, 482140, 485542, 489174, 494033, 500449, 507960, 516152, 525135, 535011, 545397, 555880, 566720, 578738, 592608, 608336, 625188, 642014, 658014, 673403, 688923, 704420, 718410, 729508, 737850, 744522, 750018, 754090, 756918]
60384G56918K500K710K436J520P61O49Q40R20Q85O86K6j104k208k906l380l850
60368G57403m031l574k764k220j955j437o00k83j090k309k611j713p21o65j313
60353G30117j786j767j549j256p31j37n7p88j998l196m236n179o072o960p792
60338F86613q166p579o181m896m453m553m428l987l888m467n160n199m586m052
60324F15018m179m834n481n747n652n417n238n070m616l698k761k649l479m103
60310E52094l260j229M18P68N75R91K105L271M262N333O539P814R399J1360J2783
60295F13223J2384R962O576L204n3l336o392q815j0324j0580r355p189n241m092
60281E79972l232k040p32J55O88J358K262L013L329L359L514M187N518P173Q576
$$ y = [756918, 759418, 762128, 764564, 766084, 766845, 767494, 768334, 769254, 770139, 770825, 770851, 769747, 767539, 764633, 761253, 757403, 753372, 749798, 747034, 744814, 742859, 741422, 740822, 740539, 739449, 737140, 734529, 732816, 732095, 731430, 730117, 728331, 726564, 725015, 723759, 723028, 722891, 722834, 722046, 720048, 716852, 712616, 707437, 701365, 694405, 686613, 678447, 670868, 664687, 659791, 655338, 650785, 646357, 642370, 638482, 634015, 628855, 623656, 619070, 615018, 610839, 606005, 600524, 594777, 589125, 583708, 578470, 573400, 568784, 565086, 562325, 559676, 556197, 552094, 548834, 547605, 548023, 548791, 549366, 550357, 552462, 555733, 559995, 565328, 571867, 579681, 589080, 600440, 613223, 625607, 635569, 642145, 645349, 645296, 641960, 635568, 626753, 616429, 605849, 596494, 589305, 584064, 579972, 576740, 574700, 573968, 574123, 574811, 576169, 578431, 581444, 584773, 588132, 591646, 595833, 601351, 608524, 617100]
60266F17100R404R668R429Q982R253J1119J3987J5969J6046J5380J5629J6636
60254G68602J6837J5522J3540J1894J0767J0090R995J0368J0793J1321J2505J4279
60242I16513J5704J6443J7678K0571K4411K7412K9262L1610L5693M0580M4477
60231A220354M7082M9694N3315N7593O1711O5450O8990P2264P5079P7393P9033
60220A927958P9364P7852P4755P0809O6267O0780N4140M6602L8435K9840K1400
60209B548202J3959P673J787m260r928j4263j7070j8798j9645j9409j8101j5997
60197B434150j3026q757l118L379J0288J7650K5451L3237M0660M8069N5881O3457
60185B707321O9265P2343P3076P2184O9429O3985N5900M6451L6822K6975J6192
$$ y = [617100, 626504, 636172, 645601, 654583, 663836, 674955, 688942, 704911, 720957, 736337, 751966, 768602, 785439, 800961, 814501, 826395, 837162, 847252, 857247, 867615, 878408, 889729, 902234, 916513, 932217, 948660, 966338, 986909, 1011320, 1038732, 1067994, 1099604, 1135297, 1175877, 1220354, 1267436, 1317130, 1370445, 1428038, 1489749, 1555199, 1624189, 1696453, 1771532, 1848925, 1927958, 2007322, 2085174, 2159929, 2230738, 2297005, 2357785, 2411925, 2458527, 2496962, 2526802, 2548202, 2562161, 2569834, 2571621, 2567361, 2557433, 2543170, 2526100, 2507302, 2487657, 2468248, 2450147, 2434150, 2421124, 2412367, 2409249, 2412628, 2422916, 2440566, 2466017, 2499254, 2539914, 2587983, 2643864, 2707321, 2776586, 2848929, 2922005, 2994189, 3063618, 3127603, 3183503, 3229954, 3266776, 3293751, 3309943]
60174C309943M277q255k0925l3602m6148n8096o8661p6855q1797q3383q2488q0034
60162B673976p6000o9893o2009n3403m4570l5011k4541j4220n344J981Q652J5225
60150B314843K1232K5693K7835K7501K5206K1670J7120J1287M230l222j0143j6207
60138B467045k1352k5228k7493k8325k8055k6498k3234j8418j2770o825n93O181
60126B254435J3792K2516L2341M2910N4040O6025P9031R2505J05800J19024J32639
60115C015058J46341J59147J70459J80250J88190J93373J95059J93046J87207
60106D628130J77389J64000J47794J28858J06646Q1458N4981K8699K454k4489
60096E495920n1540p6876r9207j18465j34736j47496j56227j61076j62524j60734
$$ y = [3309943, 3314220, 3305965, 3285040, 3251438, 3205290, 3147194, 3078533, 3001678, 2919881, 2836498, 2754010, 2673976, 2597976, 2528083, 2466074, 2412671, 2368101, 2333090, 2308549, 2294329, 2288985, 2290966, 2299618, 2314843, 2336075, 2361768, 2389603, 2417104, 2442310, 2463980, 2481100, 2492387, 2496617, 2493395, 2483252, 2467045, 2445693, 2420465, 2392972, 2364647, 2336592, 2310094, 2286860, 2268442, 2255672, 2248847, 2248254, 2254435, 2268227, 2290743, 2323084, 2365994, 2420034, 2486059, 2565090, 2657595, 2763395, 2882419, 3015058, 3161399, 3320546, 3491005, 3671255, 3859445, 4052818, 4247877, 4440923, 4628130, 4805519, 4969519, 5117313, 5246171, 5352817, 5434275, 5489256, 5517955, 5520409, 5495920, 5444380, 5367504, 5268297, 5149832, 5015096, 4867600, 4711373, 4550297, 4387773, 4227039]
60086D227039j55694j47678j37279j25120j11710r7428q2433o6754n0655l4833
60076C217455k0000o268O778J9329L0779M0009M6223M9462N0284M9088M5745L9888
60064C568772L1530K1366J0394p29j1942k3344l4645m5251n4829o3460p1091p7253
60052C249518q1555q4286q6012q6712q5742q2720p8005p2074o4924n6406m6857
60041B424225l6926k6886j6526n737N208J5981K6519L6860M6889N6303O4634P1254
60029B661798P5660P7855P8134P6365P1932O4714N5698M6009L5650K3859J0623
60018C278297k926j5787k8007l9970n1397o1541o9898p6224q0213q1674q0778
60007B689882p7656p2084o4143n4861m5531l6552k7529j8232q695J394J2402K3787
$$ y = [4227039, 4071345, 3923667, 3786388, 3661268, 3549558, 3452130, 3369697, 3302943, 3252288, 3217455, 3197455, 3191187, 3197965, 3217294, 3248073, 3288082, 3334305, 3383767, 3434051, 3483139, 3528884, 3568772, 3600302, 3621668, 3632062, 3631333, 3619391, 3596047, 3561402, 3516151, 3461322, 3397862, 3326771, 3249518, 3167963, 3083677, 2997665, 2910953, 2825211, 2742491, 2664486, 2592412, 2527488, 2471082, 2424225, 2387299, 2360413, 2343887, 2338150, 2343358, 2359339, 2385858, 2422718, 2469607, 2525910, 2590544, 2661798, 2737458, 2815313, 2893447, 2969812, 3041744, 3106458, 3162156, 3208165, 3243815, 3267674, 3278297, 3275371, 3259584, 3231577, 3191607, 3140210, 3078669, 3008771, 2932547, 2852334, 2770660, 2689882, 2612226, 2540142, 2475999, 2421138, 2375607, 2339055, 2311526, 2293294, 2284599, 2285993, 2298395, 2322182]
59995B322182L4327M3628N2604O2228P2489Q2853R2879J01888J08783J12763J13800
59984C200424J11970J06920R8482Q7258P4062N9308M3377K6991J0519o457k4178
59973C788676m1743n7766p1553q2830r0911r5134r5838r3851q9196q1386p0976
59962B917492n9662m8622l7634k6146j4347k784Q417J9413L0245M0838N0954N9862
59950B938026O6550P0662P2866P3999P4116P2591O8917O3228N6268M8977M1807
59939C648007L4427K6434J8250J0860M637q46n617q566q420n047O91Q168J7586
59926C740564K9458M3831O0061P7166R4351J11338J28148J44703J60610J75200
59916D765430J87412J95859J99279J96954J88458J73253J51086J22693Q9568N3103
$$ y = [2322182, 2356509, 2400137, 2452741, 2514969, 2587458, 2670311, 2763190, 2865078, 2973861, 3086624, 3200424, 3312394, 3419314, 3517796, 3605054, 3679116, 3738424, 3781801, 3808792, 3819311, 3812854, 3788676, 3746933, 3689167, 3617614, 3534784, 3443873, 3348739, 3252901, 3159050, 3069854, 2988468, 2917492, 2857830, 2809208, 2771574, 2745428, 2731081, 2728297, 2736714, 2756127, 2786372, 2827210, 2878164, 2938026, 3004576, 3075238, 3148104, 3222103, 3296219, 3368810, 3437727, 3500955, 3557223, 3606200, 3648007, 3682434, 3708868, 3727118, 3737978, 3742615, 3741769, 3736152, 3727586, 3719166, 3714119, 3714810, 3722978, 3740564, 3770022, 3813853, 3873914, 3951080, 4045431, 4156769, 4284917, 4429620, 4590230, 4765430, 4952842, 5148701, 5347980, 5544934, 5733392, 5906645, 6057731, 6180424, 6269992, 6323095]
59906F323095J4542k4180o0416r2069j18376j39232j54240j62906j65326j62250
59896E258642j54707j43846j30802j16278j00410q3272o5248m6691k7625q143
59886D381620J1253L0139M8840O8020Q7583J06232J22131J33780J40390J41673
59876E271661J37311J26660J09209Q5566N7822K8583l11k8034n4004p7345r7260
59865E559858j13579j26686j36894j44129j48217j49251j47446j42815j35412
59856D315429j25802j14808j02564q8467p2500n6013m0448k5711j0698M715J9235
59845C702368L1756M2349N1376N8577O3646O6933O8876O9175O7131O2389N4718
59834D339294M3540K8427J0034r938k9663m7621o2432p2900p8589q0201p9436
$$ y = [6323095, 6337637, 6313457, 6253041, 6160972, 6042596, 5903364, 5749124, 5586218, 5420892, 5258642, 5103935, 4960089, 4829287, 4713009, 4612599, 4529327, 4464079, 4417388, 4389763, 4381620, 4392873, 4423012, 4471852, 4539872, 4627455, 4733687, 4855818, 4989598, 5129988, 5271661, 5408972, 5535632, 5644841, 5730407, 5788229, 5816812, 5816501, 5788467, 5734463, 5657118, 5559858, 5446279, 5319593, 5182699, 5038570, 4890353, 4741102, 4593656, 4450841, 4315429, 4189627, 4074819, 3972255, 3883788, 3811288, 3755275, 3714827, 3689116, 3678418, 3683133, 3702368, 3734124, 3776473, 3827849, 3886426, 3950072, 4017005, 4085881, 4155056, 4222187, 4284576, 4339294, 4382834, 4411261, 4421295, 4411357, 4381694, 4334073, 4271641, 4198741, 4120152, 4039951, 3960515]
59823C960515p8310p8143p8781p9046p8181p6580p4928p3104p0369o6360o1350
59812C145363n5817n0329m5655m2337m0123l8362l6955l6399l6747l7059l6242
59801B689338l4089l1182k7924k4000j8795j2133m376M199J3796K4702L6680M9222
59789B665438O2458P7315R4417J13237J32617J51848J70668J88188K02040K08554
59779D066780K03662J84209J49383J01465M5295j3079o7567j12920j45784j65511
59769D245933j73736j72868j65030j52222j36741j20712j05136q9935p5011o0947
59759B993595m8357l7008k6153j5708o431J209P787J4166K0537K6734L3073M0092
59747C003536M7588N4733O1227O7744P5146Q3835R3908J05286J17469J29798J42298
$$ y = [3960515, 3882205, 3804062, 3725281, 3646235, 3568054, 3491474, 3416546, 3343442, 3273073, 3206713, 3145363, 3089546, 3039217, 2993562, 2951225, 2911102, 2872740, 2835785, 2799386, 2762639, 2725580, 2689338, 2655249, 2624067, 2596143, 2572143, 2553348, 2541215, 2536839, 2541038, 2554834, 2579536, 2616216, 2665438, 2727896, 2805211, 2899628, 3012865, 3145482, 3297330, 3467998, 3656186, 3858226, 4066780, 4270442, 4454651, 4604034, 4705499, 4750794, 4737715, 4670148, 4557228, 4411444, 4245933, 4072197, 3899329, 3734299, 3582077, 3445336, 3324624, 3219488, 3129553, 3054542, 2993595, 2945238, 2908230, 2882077, 2866369, 2859938, 2861147, 2868934, 2883100, 2903637, 2930371, 2963444, 3003536, 3051124, 3105857, 3167084, 3234828, 3309974, 3393809, 3487717, 3593003, 3710472, 3840270, 3982568]
59736C982568J55759J70730J86962K04079K22180K41257K60495K78716K95222
59727E997968L09683L21335L28722L30268L25126L13595K96838K76154K52705
59718H752394K28274K05771J88093J76344J69870J67892J70030J75099J80773
59709A0414540J85080J87334J87008J82753J73552J59946J43176J23834J02384
59700A1859607Q0164N8609L8011J8349R09j2320k0602k4349k3227j5921k119J6741
59688A1973852L9271O5543R5963J29759J65405K01936K39018K76003L11559L44044
59678A3842353L71777L93061M06162M09212M00126L77016L38877K85752K18440
59669A7042776J38637M9586m3925j36478k22996k99232l62194m10473m43771m62133
$$ y = [3982568, 4138327, 4309057, 4496019, 4700098, 4922278, 5163535, 5424030, 5702746, 5997968, 6307651, 6628986, 6957708, 7287976, 7613102, 7926697, 8223535, 8499689, 8752394, 8980668, 9186439, 9374532, 9550876, 9720746, 9888638, 10058668, 10233767, 10414540, 10599620, 10786954, 10973962, 11156715, 11330267, 11490213, 11633389, 11757223, 11859607, 11939771, 11998380, 12036391, 12054740, 12055649, 12043329, 12022727, 11998378, 11975151, 11959230, 11957111, 11973852, 12013123, 12078666, 12174629, 12304388, 12469793, 12671729, 12910747, 13186750, 13498309, 13842353, 14214130, 14607191, 15013353, 15422565, 15822691, 16199707, 16538584, 16824336, 17042776, 17181413, 17230999, 17187074, 17050596, 16827600, 16528368, 16166174, 15755701, 15311930, 14849797]
59659A4849797m66112m57873m41621m22818m07212m00154m05196m22115m46465
59650A0980231m71823m92795n06165n10183n03999m88107m64794m37403m08765
59641F696197l80147l51629l23408k96386k71405k48353k26458k05331j85245
59632D207835j66549j49303j33470j18939j05358r2429q0361o9585o0094n1568
59622C180179m4226l8835l5673l3975l2691l1399l0261k9596k9636l0425l1656
59611B811806l2963l4373l6070l7780l8928l9486m0001m0560m0406l8983l6665
59600B395591l4084l1319k8271k5336k3041k1371k0047j9131j8706j8205j6809
59589B139271j4409j1649q944o094k861O01M026P317J0328J2820J4844J6868J9245
$$ y = [14849797, 14383685, 13925812, 13484191, 13061373, 12654161, 12254007, 11848811, 11426696, 10980231, 10508408, 10015613, 9509448, 8999265, 8495266, 8007159, 7542365, 7104962, 6696197, 6316050, 5964421, 5641013, 5344627, 5073222, 4824869, 4598411, 4393080, 4207835, 4041286, 3891983, 3758513, 3639574, 3534216, 3441787, 3361426, 3291841, 3231747, 3180179, 3135953, 3097118, 3061445, 3027470, 2994779, 2963380, 2933119, 2903523, 2873887, 2843462, 2811806, 2778843, 2744470, 2708400, 2670620, 2631692, 2592206, 2552205, 2511645, 2471239, 2432256, 2395591, 2361507, 2330188, 2301917, 2276581, 2253540, 2232169, 2212122, 2192991, 2174285, 2156080, 2139271, 2124862, 2113213, 2104269, 2098175, 2095314, 2095915, 2099941, 2107258, 2117586, 2130406, 2145250, 2162118, 2181363]
59576B181363K1787K4120K6298K8636L1205L3881L6955M1132M6564N2303N7246
59565B581490O1461O5973P1296P6844Q1997Q7016R2365R7796J02779J07445J12289
59554C538751J17074J20965J23639J25548J26900J27160J25651J21898J15099
59545D642685J04092Q8554O9612M8878K7383N986j3835l0704m4775n7512o9811
59534D770553q0989q9770r5676r8975r9720r7621r2793q6029p7943o8177n5938
59523C826922m1200k4941q067R471K8234M8332O9206R0076J10164J28554J44315
59512D381066J56759J65238J68698J65762J55371J37299J12146Q1229M6384R521
59502E579473k7775o4150r8132j28138j52750j70847j81799j85870j84283j78411
$$ y = [2181363, 2203150, 2227270, 2253568, 2282204, 2313409, 2347290, 2384245, 2425377, 2471941, 2524244, 2581490, 2642951, 2708924, 2780220, 2857064, 2939061, 3026077, 3118442, 3216238, 3319017, 3426462, 3538751, 3655825, 3776790, 3900429, 4025977, 4152877, 4280037, 4405688, 4527586, 4642685, 4746777, 4835331, 4904943, 4953821, 4981204, 4987190, 4973355, 4942651, 4897876, 4840364, 4770553, 4689564, 4599794, 4504118, 4405143, 4305423, 4207802, 4115009, 4028980, 3951037, 3882860, 3826922, 3785722, 3760781, 3752714, 3762185, 3790419, 3838751, 3907957, 3998033, 4108197, 4236751, 4381066, 4537825, 4703063, 4871761, 5037523, 5192894, 5330193, 5442339, 5523568, 5569952, 5579473, 5551698, 5487548, 5389416, 5261278, 5108528, 4937681, 4755882, 4570012, 4385729, 4207318]
59492D207318j69044j56760j42510j27213j10941r3302p4632n6170l8878k2764
59482C215104p409P423K1877L6010M9397O1206P0864P8337Q3607Q6321Q6030Q2309
59470C871076P4676O3015M8245L1855J4552m015k3997m4453o4005q1712r6976
59459C788261j09297j18637j25475j30038j32022j31417j29006j25477j20673
59450B666219j14444j07633j01374r5734q9864q3323p6438o9522o2592n5883m9929
59439A759483m4874m0254l5697l1342k7340k3352j8962j4359j0182o725l571j82
59427A502643L438O924J0323J4135J8332K1624K2260J9505J4141P752J968j855
59415A641190l060j996N72M415R635J5525K0474K3256K3804K2444J9336J5258
$$ y = [4207318, 4038274, 3881514, 3739004, 3611791, 3500850, 3407548, 3332916, 3276746, 3237868, 3215104, 3207695, 3215118, 3236995, 3273005, 3322402, 3383608, 3454472, 3532809, 3616416, 3702737, 3788767, 3871076, 3945752, 4008767, 4057012, 4088867, 4103419, 4099404, 4075407, 4030954, 3966949, 3885237, 3788261, 3678964, 3560327, 3434852, 3304814, 3172792, 3041375, 2912369, 2786892, 2666219, 2551775, 2444142, 2342768, 2247034, 2157170, 2073847, 1997409, 1927887, 1865295, 1809412, 1759483, 1714609, 1674355, 1638658, 1607316, 1579976, 1556624, 1537662, 1523303, 1513121, 1506396, 1502825, 1502643, 1506081, 1513005, 1523328, 1537463, 1555795, 1577419, 1599679, 1619184, 1633325, 1641077, 1643045, 1641190, 1638130, 1636134, 1636706, 1641121, 1650756, 1666281, 1686755, 1710011, 1733815, 1756259, 1775595, 1790853]
59403A790853J2178J1924J4541J8627K3162K8200L3919L9849M5429N0716N6183
59392B125581O2078O8347P4988Q2096Q9428R6341J02405J07981J13652J19243
59382C042140J23849J27213J30484J35192J41959J50739J61864J75950J93022
59373D382412K12489K33842K56519K79199L00070L17781L31347L39361L40484
59364F993504L34850L23879L08608K89241K66492K41848K16107J88916J60416
59355I323861J31842J03550P3672L9892J751l9760q3863j29989j76765k22290
59345I021901k65047l03561l35706l59438l73953l79355l75867l64376l47238
59336E917360l27283l06168k84543k63264k43331k25033k08287j93531j81068
$$ y = [1790853, 1803031, 1814955, 1829496, 1848123, 1871285, 1899485, 1933404, 1973253, 2018682, 2069398, 2125581, 2187659, 2256006, 2330994, 2413090, 2502518, 2598859, 2701264, 2809245, 2922897, 3042140, 3165989, 3293202, 3423686, 3558878, 3700837, 3851576, 4013440, 4189390, 4382412, 4594901, 4828743, 5085262, 5364461, 5664531, 5982312, 6313659, 6653020, 6993504, 7328354, 7652233, 7960841, 8250082, 8516574, 8758422, 8974529, 9163445, 9323861, 9455703, 9559253, 9632925, 9672817, 9674568, 9634808, 9550945, 9420956, 9244191, 9021901, 8756854, 8453293, 8117587, 7758149, 7384196, 7004841, 6628974, 6264598, 5917360, 5590077, 5283909, 4999366, 4736102, 4492771, 4267738, 4059451, 3865920, 3684852]
59327C684852j69835j58193j45945j34438j24556j15802j07485r9632r2331q5108
59317B451527p7557o9942o2903n6851n1800m7292m2609l7496l2525k8266k4328
59306A919958j9878j4847r847n103k66M821J0016J5448K1411K7738L3858L9309
59294B022618M3475M5193M3623L9484L4663L0765K8693K9087L1975L6201M0306
59283B426083M3967M7393M9685M9230M5759M0547L4363K6663J7181O809l693j4534
59271B769453k5728l6215m4953n1924n7467o1456o3864o5184o5636o4776o2574
59260B169676n9975n7676n5149n1754m7986m4703m1687l8027l3536k8909k4705
59249A685569k0852j7014j2928q631m607j370J378M566Q432J2074J4809J7229
$$ y = [3684852, 3515017, 3356824, 3210879, 3076441, 2951885, 2836083, 2728598, 2628966, 2536635, 2451527, 2373970, 2304028, 2241125, 2184274, 2132474, 2085182, 2042573, 2005077, 1972552, 1944286, 1919958, 1900080, 1885233, 1875386, 1870283, 1870017, 1874838, 1884854, 1900302, 1921713, 1949451, 1983309, 2022618, 2066093, 2111286, 2154909, 2194393, 2229056, 2259821, 2288514, 2317601, 2349576, 2385777, 2426083, 2470050, 2517443, 2567128, 2616358, 2662117, 2702664, 2737027, 2763690, 2780871, 2787680, 2783987, 2769453, 2743725, 2707510, 2662557, 2610633, 2553166, 2491710, 2427846, 2362662, 2297026, 2232250, 2169676, 2109701, 2052025, 1996876, 1945122, 1897136, 1852433, 1810746, 1772719, 1739183, 1710274, 1685569, 1664717, 1647703, 1634775, 1626144, 1621537, 1620167, 1621545, 1626111, 1634543, 1646617, 1661426, 1678655]
59237A678655K0269K3927K7629L1285L5190L9328M3596M8312N3782N9756O5983
59226B127712P2922Q1200R0753J01167J12491J24895J37973J51287J65251J80430
59216C346081J96045K10109K20977K27920K30120K26173K14909J96000J69616
59207E237950J36192R6924N3811Q801l6707q1241j22623j58423j86861k07103
59197D740720k19136k23739k22306k16176k06155j92939j77743j62056j46735
59188B973735j31676j16597j01779q7806p4805o2429n0578l9663l0056k1660j4340
59177B242346q377m073j224M69O89j192n224j0856j7699k5573l3769m1110m7093
59164B047314n2216n6784o0053o1075n9927n7540n4656n1511m8167m4615m0734
$$ y = [1678655, 1698924, 1722851, 1750480, 1781765, 1816955, 1856283, 1899879, 1948191, 2001973, 2061729, 2127712, 2200634, 2281834, 2372587, 2473754, 2586245, 2711140, 2849113, 3000400, 3165651, 3346081, 3542126, 3752235, 3973212, 4201132, 4431252, 4657425, 4872334, 5068334, 5237950, 5374142, 5471066, 5524877, 5533678, 5496971, 5415730, 5293107, 5134684, 4947823, 4740720, 4521584, 4297845, 4075539, 3859363, 3653208, 3460269, 3282526, 3120470, 2973735, 2842059, 2725462, 2623683, 2535877, 2461072, 2398643, 2348065, 2308402, 2278346, 2256686, 2242346, 2233969, 2229896, 2228672, 2229141, 2229830, 2228638, 2223414, 2212558, 2194859, 2169286, 2135517, 2094407, 2047314, 1995098, 1938314, 1878261, 1817186, 1757259, 1699719, 1645063, 1593552, 1545385, 1500770, 1460036]
59153A460036l6581l2634k9312k6478k3743k1017j8359j5554j2375r113o319m035
59141A224516j802N52K640M151N311O432P466Q249Q960R829J0535J0351R105P631
59127A313926O869O769O516N827N371N743O590P218P631Q352R512J0744J1893
59114A412961J3210J4823J6479J7814J8477J8168J7050J6026J5965J6658J7115
59103A594746J6845J6268J5954J6182J7162J8902K0836K2403K4053K6834L0814
59092A820999L4940L8528M1856M5005M7304M8490M9231M9786M9139M6329M1733
59081B313340L6108K9301K0935J1574J999q045j9042l0064l9332m6232n1573n5823
59069B163146n8514n9564n9865o0007n9349n7094n3653n0279m7752m5843m3905
$$ y = [1460036, 1423455, 1390821, 1361509, 1335031, 1311288, 1290271, 1271912, 1256358, 1243983, 1234870, 1228551, 1224516, 1222714, 1223266, 1225906, 1230057, 1235368, 1241800, 1249266, 1257515, 1266475, 1276304, 1286839, 1297190, 1306295, 1313926, 1320795, 1327564, 1334080, 1339907, 1345278, 1351021, 1357611, 1364829, 1372460, 1380812, 1390324, 1401068, 1412961, 1426171, 1440994, 1457473, 1475287, 1493764, 1511932, 1528982, 1545008, 1560973, 1577631, 1594746, 1611591, 1627859, 1643813, 1659995, 1677157, 1696059, 1716895, 1739298, 1763351, 1790185, 1820999, 1855939, 1894467, 1936323, 1981328, 2028632, 2077122, 2126353, 2176139, 2225278, 2271607, 2313340, 2349448, 2378749, 2399684, 2411258, 2413257, 2405212, 2386170, 2356106, 2316774, 2270542, 2218969, 2163146, 2104632, 2045068, 1985203, 1925196, 1865847, 1808753, 1755100, 1704821, 1657069, 1611226, 1567321]
59058A567321m1563l8937l6438l4306l2322l0156k7841k5734k3961k2235k0252
59047A233576j8043j5913j4226j3204j2792j2718j2772j2901j2926j2464j1343
59036A084274r837q284o707n148l950l228k353n32K096M479N786O128O117O192
59022A075033O444O820P263P812Q637R915J1626J3531J5269J6533J7345J8206
59010A214434J9713K1930K4440K7071L0156L3847L7600M0723M3195M5550M8142
58999A586801N0730N2537N2553N0094M5392L9340L2491K4661J5778O517k347j0672
58987A943875j8390k4697k8651l0385l1006l1326l1354l1016l0613l0369l0092
58976A625976k9551k8818k8020k6994k5376k2959j9812j6225j2528q959n640k661
$$ y = [1567321, 1525758, 1486821, 1450383, 1416077, 1383755, 1353599, 1325758, 1300024, 1276063, 1253828, 1233576, 1215533, 1199620, 1185394, 1172190, 1159398, 1146680, 1133908, 1121007, 1108081, 1095617, 1084274, 1074437, 1066153, 1059446, 1054298, 1050348, 1047120, 1044767, 1044235, 1046331, 1050810, 1056596, 1062724, 1068841, 1075033, 1081477, 1088297, 1095560, 1103372, 1112009, 1121924, 1133550, 1147081, 1162350, 1178883, 1196228, 1214434, 1234147, 1256077, 1280517, 1307588, 1337744, 1371591, 1409191, 1449914, 1493109, 1538659, 1586801, 1637531, 1690068, 1742621, 1792715, 1838107, 1877447, 1909938, 1934599, 1950377, 1956894, 1954547, 1943875, 1925485, 1900788, 1872137, 1841752, 1810746, 1779420, 1748066, 1717050, 1686437, 1656068, 1625976, 1596425, 1567607, 1539587, 1512593, 1487217, 1464258, 1444446, 1428221, 1415693, 1406734, 1401094, 1398433]
58964A398433J2K651N456Q087R895J0715J0971J0860J0018Q428P007O679P197
58951A496409P612P678Q076R277J0900J2401J3902J5993J8893K2052K4741K7020
58939A674954K9975L4582M0467M6253N1250N6185O1883O7809P2381P4366P3485
58928B283590O9983O4203N6652M8154L9980L3657L0180K9330L0272L2871L7685
58917B756557M4537N2115N9534O7379P6464Q6387R6236J06045J16585J28102J40265
58906C730206J52912J65971J78940J91348K03456K15567K26873K35878K41750
58897E542901K44484K44149K40988K36048K30588K24866K18281K10429K00948
58888G593682J88614J71912J50610J25685R7673O6335L2138l291l8633p3652j07931
$$ y = [1398433, 1398445, 1401096, 1406552, 1414639, 1424534, 1435249, 1446220, 1457080, 1467098, 1475526, 1482533, 1489212, 1496409, 1504021, 1511699, 1519775, 1529052, 1539952, 1552353, 1566255, 1582248, 1601141, 1623193, 1647934, 1674954, 1704929, 1739511, 1779978, 1826231, 1877481, 1933666, 1995549, 2063358, 2135739, 2210105, 2283590, 2353573, 2417776, 2474428, 2522582, 2562562, 2596219, 2626399, 2655729, 2686001, 2718872, 2756557, 2801094, 2853209, 2912743, 2980122, 3056586, 3142973, 3239209, 3345254, 3461839, 3589941, 3730206, 3883118, 4049089, 4228029, 4419377, 4622833, 4838400, 5065273, 5301151, 5542901, 5787385, 6031534, 6272522, 6508570, 6739158, 6964024, 7182305, 7392734, 7593682, 7782296, 7954208, 8104818, 8230503, 8328176, 8394511, 8426649, 8423358, 8384725, 8311073, 8203142]
58877H203142j39969j68312j92705k13401k30074k42311k50537k55576k57537
58868F252720k56086k51595k45313k38242k30401k21351k10994j99715j87972
58859D211051j76088j64391j53251j42740j32491j22236j12410j03715r6044q8468
58849B919217q0556p3002o6428o0305n3752m6952m0808l5592l0778k6052k1571
58838B383421j7303j2986q775n097j752K039O524J1041J4934J8272K1539K5155
58826B437012K9402L4303L9374M3954M7803N1058N3787N6055N8242O0761O3569
58815B975320O6562P0217P5208Q1564Q8933R7391J07228J18121J29490J41568
58805C951602J55101J69921J84792J98799K12003K24565K36097K46052K53944
$$ y = [8203142, 8063173, 7894861, 7702156, 7488755, 7258681, 7016370, 6765833, 6510257, 6252720, 5996634, 5745039, 5499726, 5261484, 5031083, 4809732, 4598738, 4399023, 4211051, 4034963, 3870572, 3717321, 3574581, 3442090, 3319854, 3207444, 3103729, 3007685, 2919217, 2838661, 2765659, 2699231, 2638926, 2585174, 2538222, 2497414, 2461822, 2431044, 2404992, 2383421, 2366118, 2353132, 2344357, 2339260, 2337508, 2339547, 2346071, 2357112, 2372046, 2390318, 2411857, 2437012, 2466414, 2500717, 2540091, 2584045, 2631848, 2682906, 2736693, 2792748, 2850990, 2911751, 2975320, 3041882, 3112099, 3187307, 3268871, 3357804, 3455195, 3562423, 3680544, 3810034, 3951602, 4106703, 4276624, 4461416, 4660215, 4872218, 5096783, 5332880, 5578932, 5832876]
58796E832876K58985K60323K57728K51233K40072K22996J99900J72116J40745
58787G836974J05763O7322K6941j3292n2008q8384j21358j49950j74162j94976
58777G242870k13479k30149k44686k56271k64161k68123k68240k64510k57117
58768D976134k46874k34818k21493k07174j92584j78596j65405j52821j41199
58759C235170j31118j22219j13419j04322r5449q6994p8557p0228o2825n6611
58749B313428n0849m5039l9568l4659k9732k4384j9236j5096j1965r246o329k639
58737B024686K121P400J2083J5579J7816J8081J4971Q016j505j1780k1659l0359
58725B055450l7103m1689m4612m6290m6876m7076m7875m9080m9311m7974m6024
$$ y = [5832876, 6091861, 6352184, 6609912, 6861145, 7101217, 7324213, 7524113, 7696229, 7836974, 7942737, 8010059, 8037000, 8023708, 7971700, 7883316, 7761958, 7612008, 7437846, 7242870, 7029391, 6799242, 6554556, 6298285, 6034124, 5766001, 5497761, 5233251, 4976134, 4729260, 4494442, 4272949, 4065775, 3873191, 3694595, 3529190, 3376369, 3235170, 3104052, 2981833, 2868414, 2764092, 2668643, 2581649, 2503092, 2432864, 2370039, 2313428, 2262579, 2217540, 2177972, 2143313, 2113581, 2089197, 2069961, 2054865, 2042900, 2033654, 2027325, 2024686, 2026807, 2034207, 2046290, 2061869, 2079685, 2097766, 2112737, 2120753, 2119248, 2107468, 2085809, 2055450, 2018347, 1976658, 1932046, 1885756, 1838880, 1791804, 1743929, 1694849, 1645538, 1597564, 1551540]
58714A551540m4151m1573l7504l2548k7588k2378j6407j0152m389R54O027R903
58702A331734J1366J0261P009J438o713j6507k6111l4083l9687m2501m2691m1184
58690A112331l8705l5074l0159k4813k0011j5750j1700q241n751l643j313O42
58678I17813J414J564K224L253L632L469L990N623P543R284J1336J3784J5486
58665A000415J5052J1855N862k465j1761k0047k5952k9297l0427k9645k7496k4827
58653H31267k2276j9961j7774j5548j3002j0075p260n110l505j907k98Q55J528
58640G16934K308L544M863N734O076O124O080O015N877N580N226N156N571O312
58626G91400P268Q657J0566J2465J3666J4099J4313J4911J6264J8499K1265K3833
$$ y = [1551540, 1507389, 1465816, 1428312, 1395764, 1368176, 1345798, 1329391, 1319239, 1314850, 1315804, 1321831, 1331734, 1343100, 1353361, 1360370, 1361808, 1355095, 1338588, 1312477, 1278394, 1238707, 1196206, 1153515, 1112331, 1073626, 1038552, 1008393, 983580, 963569, 947819, 936119, 927878, 922127, 918484, 917171, 917813, 919227, 920791, 923015, 926268, 929900, 933369, 937359, 942982, 950525, 959809, 971145, 984929, 1000415, 1015467, 1027322, 1033184, 1030719, 1018958, 998911, 972959, 943662, 913235, 883590, 856094, 831267, 808991, 789030, 771256, 755708, 742706, 732631, 725371, 720261, 716756, 714849, 714551, 715406, 716934, 719242, 722786, 727649, 733383, 739459, 745583, 751663, 757678, 763555, 769135, 774361, 779517, 785088, 791400, 798668, 807325, 817891, 830356, 844022, 858121, 872434, 887345, 903609, 922108, 943373, 967206]
58614I67206K5765K7388K9314L1760L4617L7857M1477M5324M9364N3764N8428
58603A402264O2820O6552O9801P2845P5543P7472P8082P6579P2296O5494N7095
58592B176843M7291L5342K1163O204p955k0938l2751m2593m9576n4061n7015n8587
58580A963367n8303n6390n3747n0820m7453m3750m0251l7246l4580l2038k9377
58569A479412k6328k3037k0232j8437j7542j7555j8968k1650k4233k5574k6177
58558A239679k7060k7882k7470k5797k4110k3222k2916k2970k3632k4840k5919
58547I63861k6269k5762k4522k2860k1282j9991j8622j6990j5659j5057j4618
58536G42229j3674j2634j2294j2396j2005j0969r938r143q253p240o353n363l880
$$ y = [967206, 992971, 1020359, 1049673, 1081433, 1116050, 1153907, 1195384, 1240708, 1290072, 1343836, 1402264, 1465084, 1531636, 1601437, 1674282, 1749825, 1827297, 1905379, 1981958, 2054254, 2119748, 2176843, 2224134, 2259476, 2280639, 2286843, 2278888, 2257950, 2225199, 2182606, 2133030, 2078969, 2021954, 1963367, 1905064, 1848674, 1794927, 1744107, 1696654, 1652904, 1612653, 1575407, 1540827, 1508789, 1479412, 1453084, 1430047, 1409815, 1391378, 1373836, 1356281, 1337313, 1315663, 1291430, 1265856, 1239679, 1212619, 1184737, 1157267, 1131470, 1107360, 1084138, 1061222, 1038252, 1014620, 989780, 963861, 937592, 911830, 887308, 864448, 843166, 823175, 804553, 787563, 771904, 756847, 742229, 728555, 715921, 703627, 691231, 679226, 668257, 658319, 649176, 640923, 633683, 627330, 621967, 618087]
58523F18087k278j343j019n83J28O10P47R43J261J455J841L108N105O784P551
58508F42397P920Q637R836J1188J2331J3004J3158J2903J2145J0597Q421O249
58496G68786M208J689j320l649m572n039o213p605p996p468p037o895o531o231
58482G04127o757p719p862o993o224o171o329o289o275o310n999n368m994n081
58468F15756n326n614o023o283o063n561n036m138k698j487j140r23J00J294J349
58453E68207M56r7m0j29l59KP03O52j79p59q60j214j690j202L17J534J731J611
58435E68684J746J774J482J276J211Q83N55R68J902K282J876J495J433J257J190
58420E90014K010L392M008L597L287L624L930L869L987M287L992L110K585K549
$$ y = [618087, 615809, 614466, 613447, 612864, 612992, 613602, 614349, 615292, 616553, 618008, 619849, 622957, 628062, 634846, 642397, 650317, 658954, 668790, 679978, 692309, 705313, 718471, 731374, 743519, 754116, 762537, 768786, 772994, 774683, 773363, 769714, 765142, 760103, 753890, 746285, 738289, 730821, 723784, 716889, 710358, 704127, 697370, 689651, 681789, 674796, 668572, 662401, 656072, 649783, 643508, 637198, 631199, 625831, 620837, 615756, 610430, 604816, 598793, 592510, 586447, 580886, 575850, 571712, 569014, 567527, 566387, 565464, 565564, 566858, 568207, 568663, 568566, 568526, 568397, 568038, 568040, 568743, 569395, 569216, 568457, 567597, 566383, 564693, 563491, 563808, 565342, 567073, 568684, 570430, 572204, 573686, 574962, 576173, 577056, 577611, 578579, 580481, 582763, 584639, 586134, 587567, 588824, 590014, 592024, 595416, 599424, 603021, 606308, 609932, 613862, 617731, 621718, 626005, 629997, 633107, 635692, 638241]
58406F38241K088J119P01J063J129N33L59J178K069K175J750J166M30J02Q92K093
58390F57088K162J253J136K340L511M160N614Q392J1034J2560J3826J5316J5854
58377G54246J4865J3642J2962J1555Q671O014N254N446M923M086M187M762M513
58364H55126L705L588M234M715M847N123N444N357N052M883M547L828L450M054
58350I17953N041N495N559N868O312O403O273O425O942P561Q081Q307Q257Q508
58336A012985R497J0500J0526J0144J0878J2660J3812J3773J3884J4908J5908
58325A149475J6303J7030J8622K0105K0779K1309K2065K2293K1871K1907K2578
58314A374337K2289K0162J7354J4881J2202R099O785N786M951L901M140O190P985
$$ y = [638241, 640329, 641448, 642149, 643212, 644341, 644874, 645233, 646411, 648480, 650655, 652405, 653571, 654001, 654103, 654995, 657088, 659250, 660503, 661639, 663979, 667490, 671650, 677264, 685656, 696690, 709250, 723076, 738392, 754246, 769111, 782753, 795715, 807270, 815941, 821955, 827209, 832655, 837578, 841664, 845851, 850613, 855126, 858831, 862419, 866653, 871368, 876215, 881338, 886782, 892139, 897191, 902074, 906621, 910449, 913899, 917953, 922994, 928489, 934048, 939916, 946228, 952631, 958904, 965329, 972271, 979832, 987913, 996220, 1004477, 1012985, 1022482, 1032982, 1043508, 1053652, 1064530, 1077190, 1091002, 1104775, 1118659, 1133567, 1149475, 1165778, 1182808, 1201430, 1221535, 1242314, 1263623, 1285688, 1307981, 1329852, 1351759, 1374337, 1396626, 1416788, 1434142, 1449023, 1461225, 1470324, 1477109, 1482895, 1487846, 1491747, 1495887, 1502077, 1510062]
58301A510062Q042P962R730J2594J4750J6280J8190K0143K1328K2233K3560K4727
58289A709601K5188K5840K7422K8971K9536K9933L1079L2162L2121L1498L1267
58278B034618L1289L1305L1864L2961L3529L3544L4582L7024L8945L9196L9259
58267B418116M0516M2152M3424M5399M8554N1321N2951N5198N9171O3140O5512
58256B985454O7346O9868P2309P4364P7773Q3128Q8112R1319R4747J00138J06118
58245C910676J11401J17320J24431J30317J33863J38030J45176J53408J60860
58236E125482J69602J81390J93646K03825K14052K27179K41960K56479K72531
58227G086146K92077L13123L33729L56240L83060M12243M42016M75222N14481
$$ y = [1510062, 1518104, 1526066, 1535796, 1548390, 1563140, 1579420, 1597610, 1617753, 1639081, 1661314, 1684874, 1709601, 1734789, 1760629, 1788051, 1817022, 1846558, 1876491, 1907570, 1939732, 1971853, 2003351, 2034618, 2065907, 2097212, 2129076, 2162037, 2195566, 2229110, 2263692, 2300716, 2339661, 2378857, 2418116, 2458632, 2500784, 2544208, 2589607, 2638161, 2689482, 2742433, 2797631, 2856802, 2919942, 2985454, 3052800, 3122668, 3194977, 3269341, 3347114, 3430242, 3518354, 3609673, 3704420, 3804558, 3910676, 4022077, 4139397, 4263828, 4394145, 4528008, 4666038, 4811214, 4964622, 5125482, 5295084, 5476474, 5670120, 5873945, 6087997, 6315176, 6557136, 6813615, 7086146, 7378223, 7691346, 8025075, 8381315, 8764375, 9176618, 9618634, 10093856, 10608337]
58218A0608337N57699O03504O55991P18472P88093Q62785R47896J049283J166019
58209A7958079J297318J450499J634351J851501K106418K414791K796073L263621
58201C4772651L830644M515835N330610O269617P328384Q524758R894201J1478555
58193I1945255J3334751J5536042J8136661K1136293K4470379K7950925L1100284
58186B43610590L3025803L2588196K8888135K1771355J2023888J176942q963171
58179C64121738j6902046k1949522k4352178k4964723k4699245k4135266k3454775
58172B03663983k2582693k1366533j9727842j7745224j5619282j3551191j1655763
58165H1415455r972927q515131p278184o233433n343893m587003l949646l412091
$$ y = [10608337, 11166036, 11769540, 12425531, 13144003, 13932096, 14794881, 15742777, 16792060, 17958079, 19255397, 20705896, 22340247, 24191748, 26298166, 28712957, 31509030, 34772651, 38603295, 43119130, 48449740, 54719357, 62047741, 70572499, 80466700, 91945255, 105280006, 120816048, 138952709, 160089002, 184559381, 212510306, 243610590, 276636393, 309224589, 338112724, 359884079, 371907967, 373084909, 364121738, 347219692, 325270170, 300917992, 275953269, 251254024, 227118758, 203663983, 181081290, 159714757, 139986915, 122241691, 106622409, 93071218, 81415455, 71442528, 62927397, 55649213, 49415780, 44071887, 39484884, 35535238, 32123147]
58157C2123147k952759k561608k235101j963437j733971j541501j384389j255094
58149A6495287j143761j046772r63318q88046q15119p45434o82315o24043n67506
58140I018973n14979m69997m30205l91164l53926l22270k95635k71353k50931
58131E718513k37531k29482k22245k14744k08203k00973j90319j77634j66522
58122C870860j57060j46800j35997j27028j19804j12308j04674r8645r3918q8792
58112B685834q3391p8859p4611o9667o5234o2650o0251n5757n0268m6448m4146
58101A994552m1275l7789l5281l3754l1999l0350k9998l0527l0844l1499l3341
58090A627895l5143l5347l4847l5225l5626l4325l2120l1062l0927l0046k8621
$$ y = [32123147, 29170388, 26608780, 24373679, 22410242, 20676271, 19134770, 17750381, 16495287, 15351526, 14304754, 13341436, 12453390, 11638271, 10892837, 10210522, 9586479, 9018973, 8503994, 8033997, 7603792, 7212628, 6858702, 6536432, 6240797, 5969444, 5718513, 5480982, 5251500, 5029255, 4814511, 4606308, 4405335, 4215016, 4037382, 3870860, 3713800, 3567000, 3431003, 3303975, 3184171, 3071863, 2967189, 2868544, 2774626, 2685834, 2602443, 2523584, 2448973, 2379306, 2314072, 2251422, 2191171, 2135414, 2085146, 2038698, 1994552, 1953277, 1915488, 1880207, 1846453, 1814454, 1784104, 1754106, 1723579, 1692735, 1661236, 1627895, 1592752, 1557405, 1522558, 1487333, 1451707, 1417382, 1385262, 1354200, 1323273, 1293227, 1264606]
58079A264606k8123k8240k7461k6040k5380k5184k4050k2344k1664k1895k1528
58068I92697k0463j9872j9661j8671j7068j6059j5465j4047j2031j0957j1130
58057H17273j1379j1212j1204j1380j1163j0802j1002j1409j1132j0403j0023
58046F96164r674q539p140o747p294p581p089o136m861l648l650n213o583n990
58032F06019m167k944k415j677j276k372m117m482l400k675k929l023k424j833
58018E66285j369k69J359K439K803L412M609N815O958Q494J0101J1012J1526J2610
58004F45785J4192J5629J7436K0551K4118K6209K6865K8181L1145L4447L6960
57993I21518L9274M2086M4858M6905M8291M8832M7597M4248L9835L5598L1843
$$ y = [1264606, 1236483, 1208243, 1180782, 1154742, 1129362, 1104178, 1080128, 1057784, 1036120, 1014225, 992697, 972234, 952362, 932701, 914030, 896962, 880903, 865438, 851391, 839360, 828403, 817273, 805894, 794682, 783478, 772098, 760935, 750133, 739131, 727722, 716590, 706187, 696164, 686490, 677951, 670811, 664064, 656770, 649189, 642100, 635964, 631103, 627455, 623805, 618592, 612009, 606019, 601852, 598908, 596493, 594816, 593540, 591168, 587051, 582569, 579169, 576494, 573565, 570542, 568118, 566285, 564916, 564647, 566006, 568445, 571248, 574660, 579269, 585084, 592042, 600536, 610637, 621649, 633175, 645785, 659977, 675606, 693042, 713593, 737711, 763920, 790785, 818966, 850111, 884558, 921518, 960792, 1002878, 1047736, 1094641, 1142932, 1191764, 1239361, 1283609, 1323444, 1359042, 1390885]
57982A390885K8426K5482K3262K1931K1657K2200K2393K0840J7084J1310L343
57971A608813p009j8883l0790m1921n1890n9579o3644o4110o2212n8786n3984
57960A096005m8284m2479l6672l0632k4905k0349j6729j3162r775p516o410n440
57948H33652m165l024k174j389r95j487k190j827l65J137K428M258O706Q991J1069
57933H50625J3800J7298K0641K3464K6219K8597K9239K7442K3746J8526J1407
57922A091004K529p041j6446k5282l2617l7318l9642m0930m1435m0167l7179l4049
57910G41427l1560k8744k5084k1753j9624j7816j5502j3588j3155j3537j3483
57899E27581j3103j3203j3596j3537j3132j2881j2372j0848q728p293o945o821
$$ y = [1390885, 1419311, 1444793, 1468055, 1489986, 1511643, 1533843, 1556236, 1577076, 1594160, 1605470, 1608813, 1601804, 1582921, 1552131, 1510210, 1458320, 1398741, 1335097, 1270987, 1208775, 1149989, 1096005, 1047721, 1005242, 968570, 937938, 913033, 892684, 875955, 862793, 853018, 845502, 839092, 833652, 829487, 826463, 824289, 822900, 821905, 820418, 818228, 816401, 816036, 817173, 819601, 823859, 830565, 839556, 850625, 864425, 881723, 902364, 925828, 952047, 980644, 1009883, 1037325, 1061071, 1079597, 1091004, 1093533, 1086492, 1070046, 1044764, 1012147, 974829, 935187, 894257, 852822, 812655, 775476, 741427, 709867, 681123, 656039, 634286, 614662, 596846, 581344, 567756, 554601, 541064, 527581, 514478, 501275, 487679, 474142, 461010, 448129, 435757, 424909, 416181, 408888, 401943, 395122]
57887C95122o080m692l011j283K98J699L144M838O581P977Q882R372R527R393
57873D41767R020Q452P840P457P228O443M568K184M50l50r52j893l013m224n775
57858D79202p487q647r011r036q897q114o590n076m185l616k828j779n89Q06K237
57843D06390L151L337L254L310L310K905K094R87k67j199j311q61p03j160j720
57828D21517j951j966j767r74M09J764K734L708N163P080R197J1192J2636J3519
57814D82261J4753J7095J9563K0126J8261J5602J3799J3078J3312J5077J8652
57803F61579K3131K7494L1719L5950L9370M0836L9833L6173K9474J9876Q578l114
57791I90899j4634k5393l4049l9617m2634m4345m5173m4902m3740m2127l9922
$$ y = [395122, 389042, 384350, 381339, 380056, 380354, 382053, 385197, 390035, 396616, 404593, 413475, 422847, 432374, 441767, 450787, 459239, 467079, 474536, 481764, 488207, 492775, 494959, 495409, 495059, 494107, 492214, 489201, 484977, 479202, 471715, 463068, 454057, 445021, 436124, 428010, 421420, 416344, 412159, 408543, 405715, 403936, 403347, 404153, 406390, 409541, 412878, 416132, 419442, 422752, 425657, 427751, 428738, 428471, 427272, 425961, 425100, 424397, 423237, 421517, 419566, 417600, 415833, 414859, 415268, 417032, 419766, 423474, 428637, 435717, 444914, 456106, 468742, 482261, 497014, 514109, 533672, 553798, 572059, 587661, 601460, 614538, 627850, 642927, 661579, 684710, 712204, 743923, 779873, 819243, 860079, 899912, 936085, 965559, 985435, 994013, 990899, 976265, 950872, 916823, 877206, 834572, 790227, 745054, 700152, 656412, 614285, 574363]
57780E74363l6798l3194k9927k7106k4224k1224j8616j6607j4855j3021j1050
57769C27741q983p064n825n534n663n414m619l671k791j883j000l99j39%J84L84
57753B75324N81Q96J522K563L793M719N192N804P153Q829R783R755R535R684R768
57738C64901R168P862O035L672J047j097k337l051l656l980l789l309k766j964
57724C66736p78N31J829L280M574M837L868K763K629L311M013M520N088N719O263
57709D19183O886P724Q544R211J0074J1403J2955J4490J6137J7782J8940J9692
57697E73021K0945K3152K5655K7955L0707L4544L8853M2797M6757N1508N6655
57686I72549O1239O5474P0583P7026Q3933R0165R5034R8262J00039J00926J00956
$$ y = [574363, 537565, 504371, 474444, 447338, 423114, 401890, 383274, 366667, 351812, 338791, 327741, 318758, 311694, 305869, 300335, 294672, 289258, 284639, 280968, 278177, 276294, 275294, 274895, 274756, 274756, 274940, 275324, 275905, 276801, 278323, 280886, 284679, 289398, 294590, 300394, 307547, 316376, 326159, 335914, 345449, 355133, 364901, 374069, 381931, 387966, 391638, 392685, 391588, 389251, 386200, 382544, 378564, 374775, 371466, 368700, 366736, 365958, 366489, 368318, 371598, 376172, 381009, 384877, 387640, 390269, 393580, 397593, 402113, 407201, 412920, 419183, 426069, 433793, 442337, 451548, 461622, 473025, 485980, 500470, 516607, 534389, 553329, 573021, 593966, 617118, 642773, 670728, 701435, 735979, 774832, 817629, 864386, 915894, 972549, 1033788, 1099262, 1169845, 1246871, 1330804, 1420969, 1516003, 1614265, 1714304, 1815230, 1916186]
57675A916186R9354R5985R2304Q9855Q8649Q8347R0120R4848R9226R5493P6271
57664B926638L9333j1545o8389j21323j61528j84463j90909j84922j71215j54019
57654A717658j36622j20613j05871r1870p8746o6953n6570m7439l9514l2673k6597
57643I14190k1159j6513j2555q731m630m61L359O644R441J1970J4801J8551K3150
57630I38057K7763L1737L5297L9041M3147M7322N1302N5028N8389O1088O2824
57619A450995O3525O3275O1894N8684N2953M4766L4838K3572J0859k916j6423
57608A846022k8542l9360m9275n7696o3578o6955o8888o9957o9812o8182o5425
57597A198352o1900n7757n3555n0205m7852m5571m2589l9216l6170l3521l0802
$$ y = [1916186, 2015540, 2111525, 2203829, 2293684, 2382333, 2470680, 2560800, 2655648, 2754874, 2850367, 2926638, 2965971, 2954426, 2886037, 2764714, 2603186, 2418723, 2227814, 2042892, 1871677, 1717658, 1581036, 1460423, 1354552, 1262682, 1183936, 1116983, 1060413, 1012974, 973460, 940787, 914190, 893031, 876518, 863963, 855232, 850602, 850141, 853500, 860144, 869585, 881555, 896356, 914907, 938057, 965820, 997557, 1032854, 1071895, 1115042, 1162364, 1213666, 1268694, 1327083, 1388171, 1450995, 1514520, 1577795, 1639689, 1698373, 1751326, 1796092, 1830930, 1854502, 1865361, 1862445, 1846022, 1817480, 1778120, 1728845, 1671149, 1607571, 1540616, 1471728, 1401771, 1331959, 1263777, 1198352, 1136452, 1078695, 1025140, 974935, 927083, 881512, 838923, 799707, 763537, 730016, 699214]
57586F99214k7830k4881k2311k0284j8770j7541j6340j5091j3869j2632j1291
57575D98374r939q791p850o939n996n128m429l956l702l394k565j161J67P95Q40
57560D36326P86P97R01J375K326L268L776M158M733N041M704M537N539P145P978
57545D93390Q150R183J1515J3780J5145J6607J9102K1801K3571K4961K7284L0502
57533G14991L3497L5969L8700M2050M5412M8246N0640N2609N3693N3501N2138
57522A221446M9783M6314M1471L5110K7120J7467O551m707j5249k4421l2163l8705
57510A330017m4084m7933m9971n0568n0519n0118m8943m6654m3624m0485l7409
57499H19709l4248l1093k8246k5686k2984j9883j6681j3925j1741r638p064m152
$$ y = [699214, 671384, 646503, 624192, 603908, 585138, 567597, 551257, 536166, 522297, 509665, 498374, 488435, 479644, 471794, 464855, 458859, 453731, 449302, 445346, 441644, 438250, 435685, 434524, 434691, 435486, 436326, 437112, 437909, 438810, 440185, 442511, 445779, 449555, 453713, 458446, 463487, 468191, 472728, 478267, 485412, 493390, 501540, 510723, 522238, 536018, 551163, 567770, 586872, 608673, 632244, 657205, 684489, 714991, 748488, 784457, 823157, 865207, 910619, 958865, 1009505, 1062114, 1115807, 1169308, 1221446, 1271229, 1317543, 1359014, 1394124, 1421244, 1438711, 1445262, 1440555, 1425306, 1400885, 1368722, 1330017, 1285933, 1238000, 1188029, 1137461, 1086942, 1036824, 987881, 941227, 897603, 857118, 819709, 785461, 754368, 726122, 700436, 677452, 657569, 640888, 626963, 615222, 605584, 598520, 594368]
57487E94368j737m17J63R04K300M248O524R018J1528J3853J6054J8174J9882K0982
57473G15844K2260K5008K9452L4337L8372M1406M3946M6194M8038M9367M9827
57462A144051M8650M5380M0450L4602K7979K0237J1220J095r847k0963l1081l9217
57450A272556m5390n0254n3981n6060n6302n5386n4142n2594n0180m6849m3455
57439G07963m0827l8706l6207l3227l0673k8950k6958k3577j9568j6931j6336
57428C96003j6403j5675j4227j2879j1895j1196j0911j0896j0352q778o852n565
57416B60374m966m532m295m581n011m792l949l277l111k973k548k148j995j826
57402B10370j439j091j021j160j437j965k629k991k808k320j773j114l47K12L24
$$ y = [594368, 592631, 592214, 592377, 593281, 595581, 599829, 606353, 615371, 626899, 640752, 656806, 674980, 694862, 715844, 738104, 763112, 792564, 826901, 865273, 906679, 950625, 996819, 1044857, 1094224, 1144051, 1192701, 1238081, 1278531, 1313133, 1341112, 1361349, 1372569, 1373664, 1363817, 1342854, 1311773, 1272556, 1227166, 1176912, 1122931, 1066871, 1010569, 955183, 901041, 848447, 798267, 751418, 707963, 667136, 628430, 592223, 558996, 528323, 499373, 472415, 448838, 429270, 412339, 396003, 379600, 363925, 349698, 336819, 324924, 313728, 302817, 291921, 281569, 272791, 265939, 260374, 255408, 250876, 246581, 242000, 236989, 232197, 228248, 224971, 221860, 218887, 216339, 214191, 212196, 210370, 208931, 207840, 206819, 205659, 204222, 202257, 199628, 196637, 193829, 191509, 189736, 188622, 188275, 188487, 188811]
57387A88811K12K36M15N03L83J72P7K68P52J251J318P41k21j051j407j333j149
57370A89978j151j302j292r34m11QL25O61Q43N73o5n61n44j46K57M18K89j22p50
57351A86074j472k098k392k170j579j115j133j362j173l39P52J613K079K164J873
57336A79722J355R80J003J300J650K115K869L749M304M351M211M234M315M137
57322B20295L781L765M344N052N233M869M624N008N831O553O954P260P754Q459
57308B99782R117R445R434R398R675J0193J0556J0592J0547J0634J0563R799Q212
57295D27947O245M442K909J281q51l524o367q994j1227j2944j3889j3950j3539
57282C57539j3284j3323j3221j2629j1664j0530r179p592o061m881l990l214k633
$$ y = [188811, 189023, 189259, 189674, 190177, 190560, 190732, 190809, 191077, 191829, 193080, 194398, 195139, 194918, 193867, 192460, 191127, 189978, 188827, 187525, 186233, 185299, 184888, 184896, 185221, 185882, 186725, 187298, 187233, 186672, 186128, 185982, 186239, 186657, 186946, 186824, 186074, 184602, 182504, 180112, 177942, 176363, 175248, 174115, 172753, 171580, 171241, 171993, 173606, 175685, 177849, 179722, 181077, 182057, 183060, 184360, 186010, 188125, 190994, 194743, 199047, 203398, 207609, 211843, 216158, 220295, 224076, 227841, 232185, 237237, 242470, 247339, 251963, 256971, 262802, 269355, 276309, 283569, 291323, 299782, 308899, 318344, 327778, 337176, 346851, 357044, 367600, 378192, 388739, 399373, 409936, 419735, 427947, 434192, 438634, 441543, 442824, 441973, 438449, 432082, 423088, 411861, 398917, 385028, 371078, 357539, 344255, 330932, 317711, 305082, 293418, 282888, 273709, 266117, 260056, 255175, 251185, 247971, 245338]
57269B45338k417k453k437k219j898j657j644j856j981j587o82J56L92R9k62l52
57253B24540j21L11O64O63M64N94J259J965K169K016K040K399K798L005L028K933
57237B50727K791K702K624K377K036J988K349K767L096L826N232O659P291P290
57223C03755P356P598P699P925Q930J0579J1943J2563J2817J2990J2979J3111
57211D30245J4075J5626J6454J5948J5155J5255J6009J6549J6994J8047J9498
57200F09855K0328K0210J9935K0252K1087K2011K2756K3115K3035K2982K3610
57189H49176K4869K5988K6573K7097K7978K8762K8756K8155K7871K8381K9269
57178A152875K9947L0331L0535L0325K9321K7676K6097K5028K4159K3009K1824
$$ y = [245338, 242921, 240468, 238031, 235812, 233914, 232257, 230613, 228757, 226776, 225189, 224507, 224663, 225055, 225154, 224892, 224540, 224419, 224730, 225394, 226057, 226521, 227115, 228374, 230339, 232508, 234524, 236564, 238963, 241761, 244766, 247794, 250727, 253518, 256220, 258844, 261221, 263257, 265245, 267594, 270361, 273457, 277283, 282515, 289174, 296465, 303755, 311111, 318709, 326408, 334333, 343263, 353842, 365785, 378348, 391165, 404155, 417134, 430245, 444320, 459946, 476400, 492348, 507503, 522758, 538767, 555316, 572310, 590357, 609855, 630183, 650393, 670328, 690580, 711667, 733678, 756434, 779549, 802584, 825566, 849176, 874045, 900033, 926606, 953703, 981681, 1010443, 1039199, 1067354, 1095225, 1123606, 1152875, 1182822, 1213153, 1243688, 1274013, 1303334, 1331010, 1357107, 1382135, 1406294, 1429303, 1451127]
57167A451127K1390K1883K2410K1998K0785J9853J9957K0785K1483K1571K1268
57156A684510K1108K1395K1890K2016K1427K0376J9429J8874J8639J8594J8643
57145A906901J8515J7899J6957J6308J6284J6510J6505J6361J6396J6477J6307
57134B091420J6224J6939J8395J9660K0253K0890K2349K4177K5298K5533K5633
57123B326771K5997K6321K6646K7795L0362L3964L7975M2408M7554N3251N9200
57112B738244O5653P3138Q1644R0761J00501J11435J24144J39082J57037J79094
57102C860733K06074K38569K77754L25872L85631M59130N46881O47179P56220
57093G704043Q69383R82830J094001J201057J302371J396049J478351J542068
$$ y = [1451127, 1472517, 1494400, 1516810, 1538808, 1559593, 1579446, 1599403, 1620188, 1641671, 1663242, 1684510, 1705618, 1727013, 1748903, 1770919, 1792346, 1812722, 1832151, 1851025, 1869664, 1888258, 1906901, 1925416, 1943315, 1960272, 1976580, 1992864, 2009374, 2025879, 2042240, 2058636, 2075113, 2091420, 2107644, 2124583, 2142978, 2162638, 2182891, 2203781, 2226130, 2250307, 2275605, 2301138, 2326771, 2352768, 2379089, 2405735, 2433530, 2463892, 2497856, 2535831, 2578239, 2625793, 2679044, 2738244, 2803897, 2877035, 2958679, 3049440, 3149941, 3261376, 3385520, 3524602, 3681639, 3860733, 4066807, 4305376, 4583130, 4909002, 5294633, 5753763, 6300644, 6947823, 7704043, 8573426, 9556256, 10650257, 11851314, 13153685, 14549734, 16028085, 17570153]
57085A7570153J577768J578404J543261J477096J385258J269149J125019R45938
57077B8472046P25569M62504J63301j57471m80166p84095j051029j267822j428097
57068B4654740j532621j588006j604103j590784j555219j500995j429430j341825
57060A2511757j240661j129506j012752q95564p83308o80077n87684n06257m35567
57051E240381l75475l25314k83586k48634k19394j95349j75996j60762j49227
57042C106644j40955j34984j29832j24348j18334j12086j05514r8118q9771q1070
57032A971632p2671o4628n6642m8646m0755l2758k4153j4790m991N196J6540K9950
57020A663284M5014N9178O8114O6919N1818K2311j7216n8207r1420j11110j16952
$$ y = [17570153, 19147921, 20726325, 22269586, 23746682, 25131940, 26401089, 27526108, 28472046, 29197615, 29660119, 29823420, 29665949, 29185783, 28401688, 27350659, 26082837, 24654740, 23122119, 21534113, 19930010, 18339226, 16784007, 15283012, 13853582, 12511757, 11271096, 10141590, 9128838, 8233274, 7449966, 6769889, 6182205, 5675948, 5240381, 4864906, 4539592, 4256006, 4007372, 3787978, 3592629, 3416633, 3255871, 3106644, 2965689, 2830705, 2700873, 2576525, 2458191, 2346105, 2240591, 2142473, 2052702, 1971632, 1898961, 1834333, 1777691, 1729045, 1688290, 1655532, 1631379, 1616589, 1611598, 1616794, 1633334, 1663284, 1708298, 1767476, 1835590, 1902509, 1954327, 1976638, 1959422, 1901215, 1809795, 1698685, 1581733]
57009A581733j12767j03658r3656q4760p7206p0417o3904n7546n1434m5746m0719
56998G79920l6405l2479k8614k5026k2219k0170j8259j6203j4372j2880j1019
56987E42274q274n294l102j645m0J834K872K044o47m528q830j2601j4906j5629
56973D73528j5660j5768j5689j4736j2901j0896r340q336p669o977n834l989j579
56960C44154J078L743O240Q312R593R614P885M334l08m918q856j2060j4366j5390
56946C39055j5198j4396j3217j1269q517n835l884k260l02J814L727N952R204
56933B84874J3021J6174J8208J9475J9712J7861J3532P561Q75o080j2517j7079
56921C75617j9203j9911k0387k0519j9544j7573j5544j3940j2451j0793r104p566
$$ y = [1581733, 1468966, 1365308, 1271652, 1186892, 1109686, 1039269, 975365, 917819, 866385, 820639, 779920, 743515, 711036, 682422, 657396, 635177, 615007, 596748, 580545, 566173, 553293, 542274, 534000, 528706, 525604, 523959, 523919, 525753, 528625, 530669, 530022, 525494, 516664, 504063, 489157, 473528, 457868, 442100, 426411, 411675, 398774, 387878, 378538, 370202, 362533, 355556, 349722, 345733, 344154, 345232, 348975, 355215, 363527, 373120, 382734, 390619, 394953, 394645, 389727, 380871, 368811, 354445, 339055, 323857, 309461, 296244, 284975, 276458, 270623, 266739, 264479, 264177, 265991, 269718, 275670, 284874, 297895, 314069, 332277, 351752, 371464, 389325, 402857, 410418, 411293, 405213, 392696, 375617, 356414, 336503, 316116, 295597, 276053, 258480, 242936, 228996, 216545, 205752, 196648, 189082]
56909A89082o229n284n029n412n888n828m949l460j980j052n72J16J298K383K670
56894A49866K348K336L311N245P700J0035J1583J2143J2339J2887J3518J3115
56882B56426J0993P588L769M7l339n989p435p531o526m873l109j608k83J333L466
56867B42929N792P895R927J2502J5983K0093K4203K7747L0183L0774K8792K4116
56855D80936J7381R426Q40p626j4545j8511j9501j8897j7788j5913j2711q627
56843C74464m514l41M442R524J4038J8225K3505L0386L7500M3240M7162M8890
56831F46521M6789L9187K6566J1323m263j8721l0401l7599m0158l9811l8245l5542
56819E25646l1152k5493j9761j4533r402l878J942P659J3058J8296K3669K9146
$$ y = [189082, 182853, 177569, 172540, 167128, 161240, 155412, 150463, 147003, 145023, 143971, 143399, 143515, 144813, 147196, 149866, 152214, 154550, 157861, 163106, 170806, 180841, 192424, 204567, 216906, 229793, 243311, 256426, 267419, 275007, 278776, 278823, 275484, 269495, 262060, 254529, 248003, 243130, 240021, 238413, 238130, 239463, 242929, 248721, 256616, 266543, 279045, 295028, 315121, 339324, 367071, 397254, 428028, 456820, 480936, 498317, 507743, 508583, 500957, 486412, 467901, 448400, 429503, 411715, 395802, 383091, 374464, 369950, 369609, 374051, 383575, 397613, 415838, 439343, 469729, 507229, 550469, 597631, 646521, 693310, 732497, 759063, 770386, 766123, 747402, 717001, 679402, 639244, 599433, 561188, 525646, 494494, 469001, 449240, 434707, 425305, 421427, 423369, 431028, 444086, 462382, 486051, 515197]
56807E15197L3875L6360L5248K9971K0753Q546m834j7111k6634l2975l6366l7029
56795E25001l5430l2582k9372k5798k1483j6730j2334q487m625n03L312O329Q995
56782C56293J2240J6251J9927K1435J9446J4067O601j614r846j7283k2465k4365
56770C90687k3777k2615k1759k0562j8574j6477j4878j3346j1477r949r434r261
56758A98578q311o734n579m991m071k502j070l88j11K06M07K85O9qn5o2J89M77
56740A66329J28q56j394p19M32P22q6j057j444j374j268j220j030m80M58J392
56724A58533J683J092J15o10r40j024q15k45L70O70Q11J215J858K296K307K040
56708A69356J722J634K138L206M099M204M034M616N936O791O396N238M169L340
$$ y = [515197, 549072, 585432, 620680, 650651, 671404, 679950, 675116, 658005, 631371, 598396, 562030, 525001, 489571, 456989, 427617, 401819, 380336, 363606, 351272, 342785, 338160, 337657, 340969, 347298, 356293, 368533, 384784, 404711, 426146, 445592, 459659, 466260, 464646, 454800, 437517, 415052, 390687, 366910, 344295, 322536, 301974, 283400, 266923, 252045, 238699, 227222, 217273, 207839, 198578, 190267, 183533, 177954, 172963, 168892, 166390, 165320, 164932, 164821, 165027, 165434, 165719, 165788, 165780, 165725, 165663, 165852, 166329, 166457, 165601, 164207, 163488, 163920, 164642, 164556, 163499, 162055, 160681, 159413, 158193, 157163, 156683, 157141, 158533, 160216, 161308, 161423, 160813, 159873, 158849, 158034, 157789, 158159, 158829, 159640, 160855, 162713, 165009, 167316, 169356, 171078, 172712, 174850, 178056, 182155, 186359, 190393, 195009, 200945, 207736, 214132, 219370, 223539, 226879]
56694B26879K503J668R97M47l0l56o06r58j132m78R53K077K102J585J543K062
56678B39256K479K510K348J964J259O87Q03J238J069K40l97n69j075k375l729
56663B45708m329m468m743m844m142l008k464k674k773k294j777j751j939j904
56649B02598j786j896k092k115k076k079j702o04N97Q36O5o04l63M28J100J665
56633A91972K352K761K303J221L44p8n51j288j772j658j357j369j574j672j810
56618A87824k138k197j428j78O10O54N90Q85J191J130J090J674K746L449L156
56603A99058J989N64l98l59O73J932K479K123J565J428J502J190N11J07L13O99
56587B15376P60O58Q61J296J392R24L06l8j85l29l22Q9P57J283J489J476J380
$$ y = [226879, 229382, 231050, 232047, 232494, 232464, 232108, 231502, 230544, 229412, 228934, 229887, 231964, 234066, 235651, 237194, 239256, 241735, 244245, 246593, 248557, 249816, 250503, 251306, 252544, 253613, 253853, 253456, 252887, 251812, 249437, 245708, 241379, 236911, 232168, 227324, 223182, 220174, 217710, 215036, 212263, 209969, 208192, 206441, 204502, 202598, 200812, 198916, 196824, 194709, 192633, 190554, 188852, 188248, 188845, 189681, 189746, 189142, 188779, 189207, 190307, 191972, 194324, 197085, 199388, 200609, 200953, 200875, 200324, 199036, 197264, 195606, 194249, 192880, 191306, 189634, 187824, 185686, 183489, 182061, 181883, 182493, 183147, 183737, 184622, 185813, 186943, 188033, 189707, 192453, 195902, 199058, 201047, 201611, 201213, 200854, 201527, 203459, 205938, 208061, 209626, 211054, 212556, 213746, 214257, 214364, 214677, 215376, 216136, 216794, 217655, 218951, 220343, 221267, 221573, 221535, 221350, 221021, 220699, 220788, 221545, 222828, 224317, 225793, 227173]
56570B27173J399J867K835L642L458K318J223R83J316J374Q04Mn32p67r98j459
56554B44640k129k866l534l966l904l228k320j911k328l037l275k968k699k781
56540B03694k919k824k698k787k874k556j793q63j7N35N25m1n96n16J15N14J06
56523A85005q36j509j340m43M93O65k36j695k750k798k070j357j292j796k163
56508A65878j755p75k19p74j931k435j705m51K46J31k01l05l63o74r68o53L88
56491A53434J439J635Q89L6j7P75J569J537P25kJ09R09J535J458J135J482K688
56474A71336L859L959K897J462L02n67j306j735j614j096n67j05M66J007R84K37
56458A79519n79o53k5M76L11r1N9R06J732J735Q51k13o98n39l23n23r33j009o37
$$ y = [227173, 228572, 230439, 233274, 236916, 240374, 242692, 243915, 244898, 246214, 247588, 248392, 248396, 247864, 247097, 246099, 244640, 242511, 239645, 236111, 232145, 228241, 225013, 222693, 220782, 218454, 215417, 212142, 209174, 206475, 203694, 200775, 197951, 195253, 192466, 189592, 187036, 185243, 184380, 184363, 184898, 185423, 185382, 184786, 184270, 184385, 184899, 185005, 184169, 182660, 181320, 180877, 181370, 182035, 181799, 180104, 177354, 174556, 172486, 171129, 169837, 168041, 165878, 164123, 163348, 163129, 162355, 160424, 157989, 156284, 155833, 156079, 156210, 156009, 155704, 155341, 154667, 153699, 153046, 153434, 154873, 156508, 157397, 157433, 157416, 158191, 159760, 161297, 162022, 162020, 162129, 163038, 164573, 166031, 167166, 168648, 171336, 175195, 179154, 182051, 183513, 183815, 183248, 181942, 180207, 178593, 177497, 176930, 176825, 177291, 178298, 179282, 179519, 178940, 178287, 178262, 178738, 179049, 178958, 179017, 179923, 181655, 183390, 184241, 184028, 183330, 182791, 182468, 181945, 181012, 180003, 179366]
56439A79366k68k29l45l41l51o92j284j577j086J28J439K042J610O33PR7M21M31
56421A80001K91N53J229J694J483Q31K98K16N94J294K010K317J938J076L62L58
56405A96545J005J577J381N55p1nL87N61N89Q56J235J202N85k57j010j563j723
56388B01849j344q07p58j211j426r28j29L08K62L7r9O3O99J610K137J832J008
56371B03103M22N26J184J858J979J455Q90R84J567J850J680J796K471K738J784
56356B26287L75%R09K009K452K384K136J733J367J463J954K204J976J806K055
56341B51110K265J948J426J287J471J576J760K585M025N269N599N005L935K855
56327B92116K217K314K961L606L973M311M781N005M592L895L731M348N121N316
$$ y = [179366, 179098, 178869, 178524, 178183, 177832, 177140, 175856, 174279, 173193, 173321, 174760, 176802, 178412, 179045, 179052, 179149, 179570, 180001, 180292, 180845, 182074, 183768, 185251, 186082, 186380, 186596, 187190, 188484, 190494, 192811, 194749, 195825, 196187, 196545, 197550, 199127, 200508, 201063, 200992, 200987, 201374, 201935, 202524, 203380, 204615, 205817, 206402, 206145, 205135, 203572, 201849, 200505, 199698, 198940, 197729, 196303, 195375, 195246, 195554, 195816, 195853, 195754, 195817, 196516, 198126, 200263, 202095, 203103, 203525, 204051, 205235, 207093, 209072, 210527, 211417, 212401, 213968, 215818, 217498, 219294, 221765, 224503, 226287, 226662, 226662, 227571, 229580, 232032, 234416, 236552, 238285, 239652, 241115, 243069, 245273, 247249, 249055, 251110, 253375, 255323, 256749, 258036, 259507, 261083, 262843, 265428, 269453, 274722, 280321, 285326, 289261, 292116, 294333, 296647, 299608, 303214, 307187, 311498, 316279, 321284, 325876, 329771, 333502, 337850, 342971, 348287]
56313C48287M768L685K237O67n04q35m60L9K27J00j23j90Q9P23J468K095K673
56296C64946L378M174M930N731O716P687Q289Q548Q851R316R678R901J0408J1463
56282D74016J2695J3619J4360J5438J7082J9061K1246K3859K7087L0687L4219
56271G03369L7634M1409M6001N1325N6990O2952O9492P6557Q3558R0081R6292
56260A415660J02251J07263J10530J12107J12555J11802J09133J04098R6815Q7308
56250B469522P5449O1637M6852L1882J7090K988r714k0855l0955m0383m9014n6800
56238B497699o3936p0276p5317p9066q2130q4808q6811q8109q9027q9217q7652
56227A601350q4258q0487p7495p4636p0687o5737o0905n6681n2581m8142m3449
$$ y = [348287, 353055, 356740, 358977, 359644, 359140, 358305, 357845, 357884, 358111, 358211, 358088, 357898, 357987, 358710, 360178, 362273, 364946, 368324, 372498, 377428, 383159, 389875, 397562, 405851, 414399, 423250, 432566, 442244, 452145, 462553, 474016, 486711, 500330, 514690, 530128, 547210, 566271, 587517, 611376, 638463, 669150, 703369, 741003, 782412, 828413, 879738, 936728, 999680, 1069172, 1145729, 1229287, 1319368, 1415660, 1517911, 1625174, 1735704, 1847811, 1960366, 2072168, 2181301, 2285399, 2382214, 2469522, 2544971, 2606608, 2653460, 2685342, 2702432, 2705420, 2695706, 2674851, 2643896, 2603513, 2554499, 2497699, 2433763, 2363487, 2288170, 2209104, 2126974, 2042166, 1955355, 1867246, 1778219, 1689002, 1601350, 1517092, 1436605, 1359110, 1284474, 1213787, 1148050, 1087145, 1030464, 977883, 929741, 886292]
56216H86292l8880l4943l2024k9850k7620k5018k2508k0259j7764j5007j2969
56205F09450j2062j1174r342p375o520o299n319l560k291j997j950j715j594j499
56191E36753p94N03J531J818J745J691J740K200L346M610N116N094N687P235Q859
56176E87134R906J0689J1532J2198J2626J3210J3876J3832J2754J1473J0980J1325
56164G31535J1883J2231J2457J3097J4883J8149K2402K6931L1754L7488M4495
56153I77305N2827O2791P4796Q8744J04228J20948J38045J53188J63329J66383
56143B102584J61766J50040J33266J15262R9931Q8923Q1497P5964P0087O0880
56133C140200M6211K7051O845j1346k5957l5920m1064m3987m9399o0559p7305
$$ y = [886292, 847412, 812469, 780445, 750595, 722975, 697957, 675449, 655190, 637426, 622419, 609450, 597388, 586214, 576872, 569497, 562977, 556678, 551359, 547799, 545508, 543511, 541561, 539846, 538252, 536753, 535959, 536462, 537993, 539811, 541556, 543247, 544987, 547187, 550533, 555143, 560259, 565353, 571040, 578275, 587134, 597040, 607729, 619261, 631459, 644085, 657295, 671171, 685003, 697757, 709230, 720210, 731535, 743418, 755649, 768106, 781203, 796086, 814235, 836637, 863568, 895322, 932810, 977305, 1030132, 1092923, 1167719, 1256463, 1360691, 1481639, 1619684, 1772872, 1936201, 2102584, 2264350, 2414390, 2547656, 2662918, 2762849, 2851772, 2933269, 3009233, 3079320, 3140200, 3186411, 3213462, 3220307, 3208961, 3183004, 3147084, 3106020, 3062033, 3012634, 2952075, 2874770]
56122B874770r7583j19019j38443j52065j57675j55807j48177j36214j21565j06325
56112A541897r1695p7516o3894n2019m2566l4692k7447k0993j5560j0639o171
56101A098705l216k305k304j990j668k095k867l146l124l562m500n433o105o350
56087A050040n799m514l211k250j220lQ82J475K653M562O083O679P346Q754R915
56072A081392R897R533J0101J1370J2341J2915J3546J4119J4404J4808J5585J6112
56060A236123J6005J5989J6618J7214J7152J7148J8009J9189J9787K0071K0660
56049A433965K1263K1415K1632K2551K3780K4741K5656K6631K6814K5733K4422
56038A698603K3958K3910K3474K3111K3728K5240K7175K9693L2877L6144L9404
$$ y = [2874770, 2777187, 2658168, 2519725, 2367660, 2209985, 2054178, 1906001, 1769787, 1648222, 1541897, 1450202, 1372686, 1308792, 1256773, 1214207, 1179515, 1152068, 1131075, 1115515, 1104876, 1098705, 1095489, 1093184, 1090880, 1088890, 1087222, 1085127, 1082260, 1079114, 1075990, 1072428, 1067928, 1062495, 1056390, 1050040, 1044241, 1039727, 1036516, 1034266, 1033046, 1033043, 1033925, 1035400, 1038053, 1042615, 1048698, 1055377, 1062723, 1071477, 1081392, 1091289, 1100822, 1110923, 1122293, 1134634, 1147549, 1161095, 1175214, 1189618, 1204426, 1220011, 1236123, 1252128, 1268117, 1284735, 1301949, 1319101, 1336249, 1354258, 1373447, 1393234, 1413305, 1433965, 1455228, 1476643, 1498275, 1520826, 1544606, 1569347, 1595003, 1621634, 1648448, 1674181, 1698603, 1722561, 1746471, 1769945, 1793056, 1816784, 1842024, 1869199, 1898892, 1931769, 1967913, 2007317]
56027B007317M3497M8305N2080N3941N5458N8169O1140O2760O3424O4497O5994
56016B636582O7254O8641P0673P2677P4174P6278P9924Q4026Q7291R0458R4778
56005C502756R9741J04351J09198J15154J21424J26960J32439J38834J45588J52308
55995D748753J60390J70825J82209J93197K04876K18332K32183K45248K59402
55986F615415K76701K96049L15823L37426L62736L90409M18444M48314M82807
55977I944124N22014N65285O14688O72511P37805Q09654Q91282R86628J096011
55968A6840002J220009J364524J537033J741645J983935K277332K639021L083518
55960C2687019L625993M285297N074154N991132P032485Q209708R550136J1090998
$$ y = [2007317, 2050814, 2099119, 2151199, 2205140, 2260598, 2318767, 2379907, 2442667, 2506091, 2570588, 2636582, 2703836, 2772477, 2843150, 2915827, 2990001, 3066279, 3146203, 3230229, 3317520, 3407978, 3502756, 3602497, 3706848, 3816046, 3931200, 4052624, 4179584, 4312023, 4450857, 4596445, 4748753, 4909143, 5079968, 5262177, 5455374, 5660250, 5878582, 6110765, 6356013, 6615415, 6892116, 7188165, 7503988, 7841414, 8204150, 8594559, 9013003, 9461317, 9944124, 10466138, 11031423, 11646111, 12318622, 13056427, 13866081, 14757363, 15743991, 16840002, 18060011, 19424535, 20961568, 22703213, 24687148, 26964480, 29603501, 32687019, 36313012, 40598309, 45672463, 51663595, 58696080, 66905788, 76455924, 87546922]
55952H7546922J2885079J5000316J7492698K0376517K3606175K7005210L0097595
55945B34010512L1979922L1480868K7651971K0298820J0190799j152802j1937334
55938C42522756k0617457k6312309k8964811k9166486k7764663k5512768k2930744
55931A61253518k0329161j7869590j5612243j3565000j1725428j0092039q656542
55924F3403515p405526o328896n416423m648910m002195l457861l002940k622525
55916B6518239k300802k027374j796028j599195j429352j283413j159861j053592
55908A3868622r58604q73454p98785p31785o68411o09011n56429n10107m67025
55899G695011m26945l91866l61318l32913l06648k84261k65035k46388k28064
$$ y = [87546922, 100432001, 115432317, 132925015, 153301532, 176907707, 203912917, 234010512, 265990434, 297471302, 325123273, 345422093, 355612892, 354460090, 342522756, 321905299, 295592990, 266628179, 237461693, 209697030, 184184262, 161253518, 140924357, 123054767, 107442524, 93877524, 82152096, 72060057, 63403515, 55997989, 49669093, 44252670, 39603760, 35601565, 32143704, 29140764, 26518239, 24217437, 22190063, 20394035, 18794840, 17365488, 16082075, 14922214, 13868622, 12910018, 12036564, 11237779, 10505994, 9837583, 9228572, 8672143, 8162036, 7695011, 7268066, 6876200, 6514882, 6181969, 5875321, 5591060, 5326025, 5079637, 4851573]
55890D851573k11961j98252j85247j72581j61189j50656j39828j29416j20910
55881C381533j13504j05219r6391q8885q2534p5704o9085o5561o6283o9647p4039
55870B474681p8705q2050q2151p9363p5944p2783o8752o3354n7705n2604m7869
55859A713401m3838m1445m0403l9157l7054l4912l3377l2292l1693l1805l1912
55848A315513l0890k8943k7378k6550k5447k3310k0365j7013j3622j1032r933
55837A081030r845r745r549r782j0268j0444j0529j1118j2040j2909j4121j5899
55825I44781j7037j6386j5005j4867j5888j6247j5547j5425j6760j8285j8553
55814G64781j7695j6559j5398j4035j2446j0670q838p311o193m948l271j890j548
$$ y = [4851573, 4639612, 4441360, 4256113, 4083532, 3922343, 3771687, 3631859, 3502443, 3381533, 3268029, 3162810, 3066419, 2977534, 2895000, 2819296, 2750211, 2684650, 2618367, 2548720, 2474681, 2395976, 2313926, 2231775, 2152412, 2076468, 2003685, 1934933, 1871579, 1813874, 1761270, 1713401, 1669563, 1628118, 1587715, 1548558, 1511504, 1476592, 1443215, 1410923, 1379230, 1347425, 1315513, 1284623, 1255680, 1228302, 1201752, 1176305, 1152995, 1132630, 1115617, 1101995, 1090963, 1081030, 1071185, 1061440, 1051891, 1042109, 1031841, 1021397, 1010868, 999750, 987710, 974801, 960680, 944781, 927744, 911358, 896353, 881486, 865598, 849351, 833804, 818379, 801619, 783334, 764781, 747086, 730527, 715129, 701094, 688648, 677978, 669140, 661829, 655636, 650688, 647417, 645527, 643979]
55801F43979j746j613j457k101l246l931m185m653n008m495l752m296o264q291
55787E88941r614j0540j0884r823p524n175l076m39K598M470M336L056J471q13
55773E46984m139p700j0561j2719j4421j5486j5947j6383j7015j7329j7015j6464
55761C81805j5903j5033j3803j2652j1642j0361q885p826p192o348n327m835m693
55748B57305l690j645q2q4p22o40j3J37l30p92r79r84p97n95r47j834k180j208
55730B39920L01R72N70j25o21r88j202j197j334j969k633k443j280N5Q10Q59M24
55713B30119p0L0J141K781L912M117M086M704N998P251P915Q065P972P590O750
55698C02361N620M586L689K698J782J552K067K495K279K076K710L650L483J747
$$ y = [643979, 642233, 640620, 639163, 637062, 633816, 629885, 625700, 621047, 616039, 611544, 607792, 603496, 597232, 588941, 579327, 568787, 557903, 548080, 540556, 535381, 532305, 531866, 534464, 538934, 543270, 546326, 547797, 546984, 542845, 535145, 524584, 511865, 497444, 481958, 466011, 449628, 432613, 415284, 398269, 381805, 365902, 350869, 337066, 324414, 312772, 302411, 293526, 285700, 278508, 272160, 266833, 261998, 257305, 253615, 251970, 251888, 251804, 251082, 250442, 250429, 250566, 250236, 249444, 248465, 247481, 246684, 246089, 245142, 243308, 241128, 239920, 240221, 241193, 241763, 241638, 241017, 240029, 238827, 237630, 236296, 234327, 231694, 229251, 227971, 228026, 228836, 229695, 230119, 230049, 230079, 231220, 234001, 237913, 242030, 246116, 250820, 256818, 264069, 271984, 280049, 288021, 295611, 302361, 307981, 312567, 316256, 318954, 320736, 322288, 324355, 326850, 329129, 331205, 333915, 337565, 341048, 342795]
55684C42795o22k647m120n046n307n164n344o090o813o929o562o190o109o430
55670B69422p008p198o285m413k498j101J0J061J944K911M652P168R353J0382
55656B78400J0858J1830J3166J3764J3017J1327R173O510L231k56l159m935n662
55643C57264n834n788n382m399l096k014j247l57Q50J825J790M99j626l917n946
55628C22622p737r535j1261j2468j3055j3699j4890j5897j5399j3278j0928r637
55616A74838r314r067q390p425o540n975n628m994l775k535k189k731l145k813
55602A00317k242k080k098j787j291j133j314j390j223j142j349j613j581j165
55588G8909o39m30p40j290j553j236l73Q51K069K753K714K577L068L901M069L353
$$ y = [342795, 342173, 339526, 335406, 330360, 325053, 319889, 314545, 308455, 301642, 294713, 288151, 281961, 275852, 269422, 262414, 255216, 248931, 244518, 242020, 240919, 240929, 241990, 243934, 246845, 251497, 258665, 268018, 278400, 289258, 301088, 314254, 328018, 341035, 352362, 361535, 368045, 371276, 371020, 367861, 362926, 357264, 351430, 345642, 340260, 335861, 332765, 330751, 329504, 329147, 329997, 331822, 333612, 334111, 332485, 328568, 322622, 314885, 305350, 294089, 281621, 268566, 254867, 239977, 224080, 208681, 195403, 184475, 174838, 165524, 156457, 148067, 140642, 134102, 128127, 122499, 117505, 113730, 111195, 109006, 106275, 103130, 100317, 98075, 95995, 93897, 92110, 90819, 89686, 88372, 86982, 85759, 84617, 83268, 81655, 80074, 78909, 78270, 77840, 77100, 75810, 74257, 73021, 72648, 73499, 75568, 78321, 81035, 83612, 86680, 90581, 94650, 98003]
55572I8003K762L140M035M435M109L615L386L327L187K824K326K038K365L230
55558A42782L887L576K265O45n45j093j397k008l019l943m417m718n266n811n763
55543A15175n113m429m025l771l684l857l753k540m26J176J297N37J11M09J031
55528H8138J589J889J768J372J295J987L225M502N576O365O771O945P336Q152
55514A46910R142J0141J1206J1939J1371R164O290L899J907n46l642o615q764
55501B02402j0017j0602j0777j0861j1063j1227j1077j0608r957r075p911o736
55489H2491n899n371m889m354l793l133k411j977k079k375k281j724j154r52j114
55474C8985j508k007k380k388k013j442q15k10J83J02m66j097j176n04L13L16
$$ y = [98003, 100765, 103905, 107940, 112375, 116484, 120099, 123485, 126812, 129999, 132823, 135149, 137187, 139552, 142782, 146669, 150245, 152510, 153155, 152610, 151517, 150120, 148112, 145093, 141150, 136733, 132015, 126749, 120938, 115175, 110062, 105633, 101608, 97837, 94153, 90296, 86543, 84003, 83577, 84753, 86050, 86587, 86698, 87107, 88138, 89727, 91616, 93384, 94756, 96051, 98038, 101263, 105765, 111341, 117706, 124477, 131422, 138758, 146910, 156052, 166193, 177399, 189338, 200709, 209873, 216163, 220062, 221969, 221423, 217781, 211166, 202402, 192385, 181783, 171006, 160145, 149082, 137855, 126778, 116170, 106213, 97138, 89227, 82491, 76592, 71221, 66332, 61978, 58185, 55052, 52641, 50664, 48585, 46210, 43929, 42205, 41051, 40099, 38985, 37477, 35470, 33090, 30702, 28689, 27247, 26432, 26222, 26405, 26507, 26041, 24944, 23768, 23264, 23577, 23893]
55458B3893o75j635j424k10P73P94L63K30L79L91K27J60K38K45N5k59n26n44k73
55439B2202Lm5l26n03n08m77j77P18J779J973J024j08n07l72m58r55j501j808
55421A9954j771j397r34p18n62R5J179J750J214J96l69l80k49q9J16Q6k95n15
55403A7311j48L85M34P4k05m67j065j726j714q63J68P38Q11Q06J139J775K006
55386A9459J108n37j485r49J82N44j3p11j127j349j245o35K7Q3k97l49R7M70M20
55367A3693J54k08q22j572j915j490m82O12J254J091L23l15l54j58k83o62r18
55350G948j051j169r32j1J152J787J666R89r7j143j163J76J589J597O23L12R82
55333A3255J232K21j063j341o43J86O24N91J69k88l73k58m49q04o30N5L35j41
$$ y = [23893, 23218, 21583, 20159, 19949, 20722, 21516, 21879, 22109, 22488, 22879, 23106, 23266, 23504, 23749, 23804, 23545, 23019, 22475, 22202, 22205, 22160, 21834, 21331, 20823, 20346, 20169, 20887, 22666, 24639, 25663, 25555, 25048, 24676, 24218, 23263, 21762, 19954, 18183, 16786, 15852, 15134, 14572, 14667, 15846, 17596, 18810, 19006, 18637, 18257, 18008, 17919, 18035, 18121, 17826, 17311, 17163, 17548, 17982, 18056, 17851, 17384, 16319, 14593, 12879, 12016, 12184, 12922, 13733, 14539, 15678, 17453, 19459, 20567, 20030, 18545, 17596, 17778, 18322, 18309, 17598, 16471, 15122, 13877, 13242, 13269, 13352, 13055, 12706, 12803, 13273, 13693, 13847, 13639, 12817, 11245, 9330, 7840, 7358, 7970, 9224, 10315, 10638, 10323, 9969, 9811, 9528, 8866, 7948, 6897, 5728, 4796, 4785, 5937, 7724, 9390, 10379, 10282, 9139, 7976, 8152, 9741, 11338, 11961, 12273, 13255, 14487, 14708, 13645, 12304, 11661, 11847, 12471, 13062, 13231, 12943, 12570, 12312, 11863, 11059, 10429, 10484, 10819, 10678]
55315A0678n05o9N63N50J59K52Q71J278J071N98L44M18O51P47M63j46p63j132
55297A6028j170p65N1O96L85q35j861j707n87N07R75R84J003J257J528J328L99
55280A8216q47j606j434n56M48J014P85j7n39j64O29Q08K37j56K94J151J588J318
55262B1169N06n37j326j387q85n46o99q63n72m0L02M51O07P13O37M74L46J28l31
55243A8147r63j557j811j347j15J174J548Q12l60j316j816j613n67O81J045M06
55227A2348j73J2M07L35R4K18M93M85M57Q21J177Q22p8o88o52l42j41j23k62l79
55207A4831l1R22J813J825J027K34j11k83o11r35q56k10O89J133N94n76j315j026
55189A7114k69R4j9p6J83N49P82P59M35Mj62o3j11l11j4R55J659J315N39L76O15
$$ y = [10678, 10173, 10104, 10667, 11217, 11376, 11628, 12499, 13777, 14848, 15446, 15790, 16208, 16859, 17606, 18069, 17923, 17160, 16028, 14858, 14093, 14144, 14840, 15225, 14390, 12529, 10822, 10235, 10742, 11717, 12701, 13704, 14961, 16489, 17817, 18216, 17369, 15763, 14329, 13773, 14221, 15235, 16020, 16003, 15464, 15300, 15929, 16737, 16974, 16818, 17112, 18263, 19851, 21169, 21675, 21138, 19812, 18425, 17540, 16994, 16295, 15432, 14860, 14820, 15122, 15573, 16180, 16893, 17530, 18004, 18350, 18478, 18147, 17184, 15627, 13816, 12469, 12354, 13528, 15076, 15888, 15528, 14212, 12396, 10783, 10216, 10897, 11942, 12348, 12175, 12187, 12594, 12929, 13023, 13241, 13734, 14219, 14676, 15497, 16674, 17496, 17418, 16730, 16078, 15736, 15595, 15472, 15210, 14831, 14800, 15722, 17535, 19360, 20387, 20621, 20510, 20227, 19616, 18681, 17825, 17615, 18304, 19437, 20031, 19455, 18140, 17114, 16845, 16939, 16920, 16844, 17027, 17576, 18358, 19117, 19552, 19556, 19394, 19331, 19220, 18909, 18895, 19850, 21509, 22824, 23363, 23739, 24354]
55168B4354K74o03r49m37J19K39L67O10K31r64j794j261j04J54p33j612j581q97
55150A5413k34J16J68j6k83l81k55j23j59k12j0M52Q47Q16L40k09l79l3N58R83
55130A7399J080J006J035J233J360J195Q80Q56J297J883K104J725Q57j43p25n26
55114C2516M6k0j150k402k459j261j0L67Q9k34m99p57o76K4Q38Q62q3j172j525
55095B2494j035k01N18R19Q93M42j43m04j69K25L44K13K84Q02J424J610J258O95
55077C0169J79l16p19o98j49M36M97K61N71J605K376J852L15r86j352j194j057
55060C1790q48l56J00J48N1L16Q40J025O74J42l11p97j305j510j246p67m03k13
55042B7330q9J04N12J135J671J807J607J309R37N66O88J598K558K454J348M83
$$ y = [24354, 24628, 24025, 23076, 22639, 22758, 22997, 23364, 23974, 24205, 23241, 21447, 20186, 20082, 20236, 19503, 17891, 16310, 15413, 15179, 15295, 15463, 15447, 15164, 14783, 14528, 14405, 14246, 14034, 14024, 14476, 15323, 16139, 16479, 16270, 15891, 15858, 16416, 17399, 18479, 19485, 20520, 21753, 23113, 24308, 25188, 26044, 27341, 29224, 31328, 33053, 33910, 33767, 33042, 32516, 32562, 32542, 31392, 28990, 26531, 25270, 25260, 25627, 25716, 25482, 24983, 24226, 23550, 23574, 24412, 25274, 25191, 24019, 22494, 21459, 21258, 21776, 22695, 23588, 24030, 23887, 23483, 23314, 23539, 23883, 24096, 24380, 25182, 26606, 28216, 29474, 30169, 30348, 30032, 29313, 28615, 28466, 28902, 29399, 29660, 30231, 31836, 34212, 36064, 36379, 35393, 34041, 32847, 31790, 30942, 30586, 30686, 30834, 30885, 31201, 32041, 33066, 33740, 33882, 33571, 32774, 31469, 29959, 28713, 27946, 27543, 27330, 27241, 27345, 27857, 28992, 30663, 32470, 34077, 35386, 36323, 36889, 37577, 39175, 41733, 44187, 45535, 46018]
55026D6018M94O36J67m83n67j88J21L07M67J89q13j880k119j674j354j295r14
55009C7112p9O50R50J025R17L75m11p70n41l21m36l54L54J162J288P98L92K68
54991D2379m0p59j319j058j41N32L81j76k49M47J310J610J231N70Q0Q6O95J569
54973D7148K065J980J855K275L054L662M099M780N660O216O369O743P797R216
54959A12919J0473J1539J2684J3828J4443J3943J2023Q787M722M24l732p533j0614
54946A93906j2457j2903j2388j1552j0724r837q765p586o621o170o141o022n391
54933G7349m351l253k180j038k5M77M96N21Q86J496K238L170M151M747M919N379
54917I4982O832R017J0965J2066J2481J2521J2073J0784Q555N597K154j609n413
$$ y = [46018, 46512, 47148, 47315, 46832, 46265, 46077, 46198, 46505, 46972, 47161, 46348, 44468, 42349, 40675, 39321, 38026, 37112, 37033, 37683, 38633, 39658, 40575, 40950, 40539, 39769, 39228, 38907, 38471, 38117, 38471, 39633, 40921, 41719, 42111, 42379, 42339, 41580, 40261, 39203, 39062, 39594, 39975, 39799, 39550, 39997, 41307, 42917, 44148, 44718, 44798, 44884, 45579, 47148, 49213, 51193, 53048, 55323, 58377, 62039, 66138, 70918, 76578, 82794, 89163, 95906, 103703, 112919, 123392, 134931, 147615, 161443, 175886, 189829, 201852, 210639, 215361, 215785, 212053, 204520, 193906, 181449, 168546, 156158, 144606, 133882, 124045, 115280, 107694, 101073, 94903, 88762, 82740, 77349, 72998, 69745, 67565, 66527, 66502, 66979, 67475, 67996, 68882, 70378, 72616, 75786, 79937, 84684, 89603, 94982, 101814, 110831, 121796, 133862, 146343, 158864, 170937, 181721, 190276, 195873, 198027, 196418, 191005]
54904A91005q715j0964j2030j2310j2254j1908j1051r739q410p373o476n505m679
54891F9591m367m415m194l375k294j336m24N34J091P63m5l43Q9L71j21p92p81
54874D9952l06k53q08j305j332j127q81n09k34o02j598k384k365j908j661j637
54858C1042j413p60K48J363K109K007J187L51j00m27q17r28n73j43P0L34O87M56
54840C4693o98j856j881r26q3J77K34L78M72M95N77O29N58O55J111J410J039M77
54822C7461O04J355J928K076K148K040J390P86J386L056M248M210M086N045O573
54807G8392P544Q057R021J0454J1432J1525J1256J1090J0767R823Q173N860K727
54794A96121j233n267q106r100q975r021r575r800r142q175p501o597m777k729
$$ y = [191005, 182290, 171326, 159296, 146986, 134732, 122824, 111773, 102034, 93624, 86251, 79775, 74270, 69591, 65224, 60809, 56615, 53240, 50946, 49610, 49186, 49720, 50811, 51574, 51529, 51186, 51275, 51646, 51525, 50733, 49952, 49646, 49393, 48585, 47280, 45948, 44821, 43940, 43431, 43197, 42595, 40997, 38613, 36248, 34340, 32679, 31042, 29629, 28869, 29117, 30480, 32589, 34596, 35783, 36134, 36034, 35607, 34790, 33862, 33289, 33146, 33216, 33550, 34237, 34693, 33995, 32139, 30258, 29332, 29249, 29426, 29660, 30038, 30510, 31005, 31582, 32211, 32769, 33424, 34535, 35945, 36984, 37461, 38065, 39420, 41348, 43424, 45572, 47612, 49002, 49788, 51174, 54230, 58478, 62688, 66774, 71819, 78392, 85936, 93993, 103014, 113468, 124900, 136425, 147681, 158771, 169538, 179361, 187534, 193394, 196121, 194888, 189621, 181515, 172415, 163440, 154419, 144844, 135044, 125902, 117727, 110226, 103629, 98852, 96123]
54780I6123j804k008j994j131j84L53J083K299L111K938K766L740N361O316O508
54765A23477P005Q240R499J0198J0548J0811J0770J0236R381Q270O526L745L7
54752B28743l989p593j0242j1847j2704j3162j3394j3474j3360j2705j1166r103
54740I6004p554p078p004o228m508k527j032l98p17j671k484k571k172j831j527
54725D6702r21k72k74r13j347j146r01j171j504j118j20P06J014J148J267J023
54709D2173L15k31l0N94Q52N78L30M91Q20R73Q73M91j79p06m59M22R35O25L56
54690D9223R74J903J921R60M6k73k61OP64J579J546P82N50J404K288K102J139
54673F6653L05k00n74n56J68J174J748J799J640J346R38Q34J428K522L728N030
$$ y = [96123, 94319, 92311, 90317, 89186, 89002, 89355, 90438, 92737, 95848, 98786, 101552, 105292, 110653, 116969, 123477, 130482, 138722, 148221, 158419, 168967, 179778, 190548, 200784, 210165, 218435, 224961, 228706, 228743, 224754, 217161, 206919, 195072, 182368, 169206, 155812, 142338, 128978, 116273, 105107, 96004, 88450, 81372, 74368, 68140, 63632, 61105, 60073, 59675, 58958, 57287, 54803, 52232, 50060, 48229, 46702, 45781, 45509, 45235, 44322, 42975, 41829, 40928, 39757, 38253, 37135, 37015, 37721, 38735, 39883, 41150, 42173, 42488, 42257, 42227, 42821, 43673, 44251, 44581, 45072, 45892, 46865, 47738, 48229, 48050, 47344, 46885, 47307, 48242, 48867, 49223, 50197, 52100, 54021, 54981, 55027, 54754, 54493, 54499, 55263, 56842, 58388, 59170, 59720, 61124, 63412, 65514, 66653, 66958, 66758, 66184, 65628, 65796, 66970, 68718, 70517, 72157, 73503, 74441, 75275, 76703, 79225, 82953, 87983]
54657H7983O368P254P442P547Q150Q780Q577P617O578N361L115k64l571n538o056
54642A49343o036o410p370q247q146p015n792n246n068m620m016l754l623k924
54628G1076j710q25p06q84q58p56q90j206j404j224n25N22J288J133J19j059j774
54611F0317j821j300n94k65n09q31p47n01o09r74j132j118j308j512j160l40J86
54594D5782J47J19N15R64R53N03l5l92l99j37j45r28k059k437j644m51K38L31
54576D0925K16L3k62n25n79m68l11p2K99P45J096J102N13m59j018n50M91J057
54558D2233P76J83j95k73P9J082K377L081K848K306K155K388K686K971L221L323
54542G1241L406L781M265M102K981J524M64j64o64j113j574k322l350m117m243
$$ y = [87983, 94351, 101605, 109047, 116594, 124744, 133524, 142101, 149718, 156296, 161657, 164772, 164508, 160937, 155399, 149343, 143307, 136897, 129527, 121280, 113134, 106119, 100327, 95081, 90013, 85393, 81377, 77623, 74000, 71076, 69366, 68541, 67835, 66951, 66093, 65337, 64447, 63241, 61837, 60613, 60088, 60610, 61898, 63031, 63150, 62091, 60317, 58496, 57196, 56602, 56337, 55828, 54997, 54250, 53749, 53140, 52166, 51034, 49916, 48608, 47096, 45936, 45596, 45782, 45929, 46048, 46563, 47527, 48480, 48983, 48948, 48556, 48157, 48020, 47875, 46947, 44888, 42451, 40807, 40356, 40594, 40925, 41141, 41174, 40912, 40387, 39808, 39340, 39029, 38957, 39256, 40001, 41097, 42199, 42712, 42253, 41235, 40685, 41176, 42233, 43009, 43192, 42997, 42724, 42803, 43885, 46262, 49343, 52191, 54497, 56652, 59040, 61726, 64697, 67918, 71241, 74647, 78428, 82693, 86795, 89776, 91300, 91764, 91600, 90936, 89823, 88249, 85927, 82577, 78460, 74217]
54527G4217m045l902l550k625j420n89l51n43j092j837k184j632n42J86J26m01
54511D9816r52j303j264o87K28J001J367J465J478J336Q84J86m29p07p57r07j129
54494D9626q86J37J345J792J374Q78P91O98J65m99p49n83l18j4L90O46M23k15
54476E5001q96j328j358r55m22k69o07q84n67K60J101J516J164k3j367j727q00
54459D7839L31N15r0n48n62n47o01l41K87Q18R70R19P79L94k26p02o87j97M91
54440D8842R95R24K28o00r31o83l01j71k59k91J6P35J510J738J223M93J57K22
54422E3847L32L87N00N97N44M65N85Q56J131J455J888K242K398K503K544K134
54406G4408J206M14K59L81K64J38K26j12j360k432j812K7R18j22j722k285j931
$$ y = [74217, 70172, 66270, 62720, 60095, 58675, 58086, 57735, 57192, 56100, 54263, 52079, 50447, 49905, 50091, 50217, 49816, 48864, 47561, 46297, 45610, 45838, 46839, 48206, 49671, 51149, 52485, 53369, 53555, 53126, 52419, 51662, 50755, 49626, 48740, 48877, 50222, 52014, 53388, 54266, 55057, 55755, 55920, 55421, 54672, 54089, 53771, 53757, 54147, 54793, 55216, 55001, 54105, 52777, 51419, 50464, 50042, 49773, 49166, 48282, 47715, 47975, 49076, 50592, 51756, 51733, 50366, 48639, 47839, 48170, 48685, 48595, 48047, 47485, 46938, 46337, 45996, 46283, 47101, 48071, 48990, 49769, 50163, 49937, 49235, 48548, 48351, 48842, 49837, 50761, 50989, 50389, 49458, 48775, 48474, 48303, 48044, 47753, 47769, 48504, 50014, 51752, 52975, 53468, 53625, 53847, 54179, 54566, 55066, 55663, 56207, 56672, 57257, 58113, 59244, 60699, 62587, 64829, 67227, 69730, 72274, 74408, 75614, 76028, 76287, 76668, 76932, 77070, 77296, 77184, 75824, 73392, 71580, 71607, 72525, 72403, 70681, 68396, 66465]
54389F6465j605j558j508j442j328p97J07N19p6q95q99k46J30l1k16j45o5j32
54371E6278k44l60m25k13K57M72J73j1N37J272J138J94m07p6N45P98R67J568K373
54352F4836K707K343J625R53N13K77J04j53m77p94j187j758k254k251j711j051
54336F1722o20m42n39r99j601j843j556j156j019r49n69P1N25M34k09j104j756
54319D8390j845j595j532j691j482o06L35N58J30j53J67P80J090Q22J94k71j88
54302D3103J81J20o00j298j269p88o00p48o21l1N31P73R37J153J216J189J475
54285D4723J967J909J069L07L50O80L92l88q16o81n36o10n38j57J83K87L86N90
54267D9117O92O75Q79J415J868J838J339N64l47j093j279r09m66l24m26o51j001
$$ y = [66465, 64860, 63302, 61794, 60352, 59024, 58227, 58334, 58853, 58777, 57882, 56983, 56737, 56867, 56836, 56620, 56475, 56410, 56278, 56034, 55674, 55249, 55036, 55293, 55765, 55938, 55927, 56464, 57736, 58874, 59068, 58661, 58585, 59130, 59928, 60895, 62463, 64836, 67543, 69886, 71511, 72464, 72977, 73254, 73358, 73205, 72728, 71934, 70747, 68989, 66735, 64484, 62773, 61722, 61102, 60660, 60121, 59122, 57521, 55678, 54122, 52966, 51947, 50998, 50429, 50500, 51025, 51459, 51250, 50146, 48390, 46545, 44950, 43418, 41727, 40245, 39639, 39974, 40532, 40662, 40509, 40676, 41456, 42546, 43368, 43562, 43291, 43103, 43284, 43404, 42804, 41506, 40237, 39449, 38849, 38101, 37480, 37449, 37980, 38753, 39690, 40843, 42059, 43248, 44723, 46690, 48599, 49668, 49975, 50325, 51005, 51397, 51009, 50193, 49512, 48976, 48366, 47828, 47671, 47854, 48141, 48527, 49117, 49809, 50484, 51363, 52778, 54646, 56484, 57823, 58387, 58040, 56947, 55668, 54759, 54293, 53969, 53543, 52892, 51891]
54250E1891j208p88K00R72R74N97M78N13J27p58j569j785j411q18m31m43n91m21
54232D5529L3J67k88o79k58P29J357J186N99N2l74o75p72p32p07o24k58K69N40
54213D5094M56M00O80J121J364J251Q47L16p1r2K40P04J046R62J85j023j706j142
54195E0632J37Q74N65j79p78j350j963k075j355m12m5j57j12J39P7l91p47o95
54177D2165n52o25p83q35q68r17p35k19K59L23J53K08N39P81P44N99M98L65J59
54158D1259J8k4j84n40p33l94K86P11O19L43K63K82M8m95r36p90l7P72J005O64
54138D2137M06O50Q76K82r82j813j595r31o41n82j32N50O15k08j136j344q86l63
54120C4903j34j46j73O6P63J698K204J777O79k47l95Q7N28M25j29o23p16n17k93
$$ y = [51891, 50683, 49895, 50095, 51067, 52041, 52638, 53116, 53629, 53756, 52998, 51429, 49644, 48233, 47415, 46984, 46541, 45950, 45529, 45562, 45729, 45441, 44762, 44504, 45233, 46590, 47776, 48375, 48427, 48053, 47378, 46606, 45874, 45167, 44543, 44285, 44554, 45094, 45550, 45950, 46630, 47751, 49115, 50366, 51213, 51529, 51458, 51366, 51606, 52310, 53356, 54318, 54503, 53480, 51774, 50632, 50769, 51643, 52208, 52029, 51251, 49901, 47938, 45863, 44508, 44096, 44051, 43894, 43782, 43921, 43998, 43607, 42860, 42165, 41613, 40988, 40205, 39370, 38502, 37585, 36850, 36631, 36890, 37213, 37366, 37574, 38113, 38894, 39638, 40237, 40735, 41100, 41259, 41277, 41253, 41069, 40529, 39796, 39402, 39688, 40399, 41018, 41361, 41624, 41906, 41954, 41459, 40523, 39733, 39696, 40468, 41473, 42137, 42543, 43193, 44069, 44351, 43369, 41556, 39961, 39030, 38389, 37807, 37675, 38225, 38840, 38632, 37496, 36152, 35266, 34903, 34769, 34623, 34450, 34516, 35279, 36977, 39181, 40958, 41637, 41390, 40995, 41082, 41610, 42035, 41906, 41283, 40567, 40050, 39757]
54101C9757j34j8l1j97k56R1P30J261J474J381R07L3p51p06K15J093J049K12n72
54082D5538p71n33k13Q1M10P00P04L05j43n7O22J165R43L95N16J364J870J322
54064E4218L12k01j30N6K82P37J113Q80J92k32j01K25N20R41J369J269N90Q2L26
54045F2448R37J250J314J589K079K367K405K511K705K631K258K064K327K725K940
54030I4550L149L587L994L948L577L336L289L102K723K512K556K394J702Q45L65
54015A35629K57J23j69m67p85j296j919k400k787l342l912l888l085k210k076
54000A07673k658l251l393l168k805k351j849j434j197j062r14p39o13o13p08
53985H0918p18n15k93m56j039j503j338p44l79n73j047j348j226o87J9M67M77
$$ y = [39757, 39623, 39605, 39574, 39377, 39121, 39212, 39942, 41203, 42677, 44058, 44965, 44998, 44247, 43541, 43756, 44849, 45898, 46110, 45538, 44767, 44234, 44021, 44102, 44512, 45212, 45916, 46221, 46078, 46021, 46643, 47808, 48751, 49146, 49662, 51026, 52896, 54218, 54530, 54329, 54199, 54255, 54537, 55274, 56387, 57267, 57459, 57227, 57126, 57351, 57871, 58812, 60181, 61450, 62040, 62122, 62448, 63385, 64635, 65949, 67538, 69617, 71984, 74389, 76900, 79605, 82236, 84494, 86558, 88885, 91610, 94550, 97699, 101286, 105280, 109228, 112805, 116141, 119430, 122532, 125255, 127767, 130323, 132717, 134419, 135264, 135629, 135886, 136009, 135840, 135373, 134588, 133292, 131373, 128973, 126186, 122844, 118932, 115044, 111959, 109749, 107673, 105015, 101764, 98371, 95203, 92398, 90047, 88198, 86764, 85567, 84505, 83591, 82852, 82239, 81626, 80918, 80200, 79685, 79392, 78936, 77897, 76394, 75056, 74312, 73933, 73360, 72313, 70965, 69739, 69052, 69071, 69538, 70015]
53968G0015L79M79M11l62j440j664o92M24P33O26R14J296R18N5r8P07J360J211
53950G5272J086J805K754K938K710L186M347N002M649M205M544N301N641N517
53936A28957N479N630N477M667L486K553K166J972J299K5j030r59QP04N14J9k
53919A60965M22R21J555K440L157L271L153L497M154M320L817L436L790M496M728
53904B08122M118K828J216k95j324j803j960j961j826j651j636j720j649j488
53890A98971j730k713m146n396o046o082n775n520n493n407m887m097l588l469
53876A34622l166k313j382j081j399j729j721j624j780k159k518k724k857l013
53862A05156l128l011k592k089j801j819k015k263k446k364j882j183n18J29Q21
$$ y = [70015, 70394, 70873, 71284, 70922, 69482, 67818, 67126, 67550, 68283, 68909, 69823, 71119, 72037, 72092, 71994, 72701, 74061, 75272, 76358, 78163, 80917, 83855, 86565, 89751, 94098, 99100, 103749, 107954, 112498, 117799, 123440, 128957, 134436, 140066, 145543, 150210, 153696, 156249, 158415, 160387, 161686, 161711, 160681, 159722, 159730, 160434, 160948, 160967, 160965, 161387, 162308, 163863, 166303, 169460, 172731, 175884, 179381, 183535, 187855, 191672, 195108, 198898, 203394, 208122, 212240, 215068, 216284, 215989, 214665, 212862, 210902, 208941, 207115, 205464, 203828, 202108, 200459, 198971, 197241, 194528, 190382, 184986, 178940, 172858, 167083, 161563, 156070, 150663, 145776, 141679, 138091, 134622, 131456, 129143, 127761, 126680, 125281, 123552, 121831, 120207, 118427, 116268, 113750, 111026, 108169, 105156, 102028, 99017, 96425, 94336, 92535, 90716, 88701, 86438, 83992, 81628, 79746, 78563, 78045, 78174, 78995]
53847G8995J177O98l27q79m35K99L30m44j348j861j881j431o49nJ23K0K78Q19
53829G3479R02K35m47l38L74Q51Q00P48J024J124M54o42j158p09M5L83M10N88
53811G8123R31J160J363J883K632L080K934K350J588R70J067K177L617M270L970
53796A12115L558L446L100K285J794K148K513J897Q03N23J190J671J315O92M27
53781A39477K85k20j014j705k136k364k436k460k581k766k833k802k842k869k587
53766A08147k047j717j828k041j971j745j761k187k819l289l233k508j425n80
53752G8996k80l11l82n46r98j619j967j725j040l54N6L56Q42J384J389N47n88
53735G3760j102p59j86j8k23m06m69o12q69q99m36K33N23K87O6K93N98L41k51
$$ y = [78995, 80172, 80870, 80543, 79664, 79229, 79528, 79858, 79414, 78066, 76205, 74324, 72893, 72244, 72239, 72362, 72382, 72660, 73479, 74381, 74616, 74169, 73831, 74205, 75056, 75856, 76604, 77628, 78752, 79206, 78564, 77406, 76697, 76742, 77125, 77535, 78123, 79054, 80214, 81577, 83460, 86092, 89172, 92106, 94456, 96044, 97014, 98081, 100258, 103875, 108145, 112115, 115673, 119119, 122219, 124504, 126298, 128446, 130959, 132856, 133659, 134182, 135372, 137043, 138358, 139050, 139477, 139762, 139542, 138528, 136823, 134687, 132323, 129887, 127427, 124846, 122080, 119247, 116445, 113603, 110734, 108147, 106100, 104383, 102555, 100514, 98543, 96798, 95037, 92850, 90031, 86742, 83509, 81001, 79576, 78996, 78716, 78405, 78023, 77477, 76479, 74860, 72893, 71168, 70128, 69774, 69830, 70186, 71028, 72412, 73801, 74348, 73760, 72658, 71899, 71713, 71695, 71472, 71066, 70597, 69985, 69116, 68217, 67781, 68014, 68537, 68824, 68890, 69183, 69781, 70122, 69871]
53716F9871k68M43Q16P9j068j503j281j210j230m82J030K034J678N93j17k10l4
53699F9141L33R79J641J957K018K119K259K326K435K650K563J854R61O08P97Q88
53683I5529O53N24P09P73M77L18P64J363J342P79N03Q00J012O44K03M36J177J596
53665A09602J356Q52L97r3n11m21J70N19R9o55j047j097j193j170n19O46J533
53648A08468J614J059K42n83j101j060p12n61o28m25K13Q37J020Q47N61K50K8
53631A10069P7K90L41J95J23J11j54n48m58K91J019J181J100J278J516J323Q09
53614A18563M88M92N24L95J39j35j23N91J851K728K582K012K014K497K500J754
53598A38872J084J088J294J073P05R54J956L018L481L261K685K027J367P68M51
$$ y = [69871, 69603, 70046, 70862, 70941, 69873, 68370, 67089, 65879, 64649, 64167, 65197, 67231, 68909, 69502, 69385, 69175, 69141, 69474, 70453, 72094, 74051, 76069, 78188, 80447, 82773, 85208, 87858, 90421, 92275, 93236, 93844, 94641, 95529, 96182, 96706, 97415, 98188, 98665, 98983, 99747, 101110, 102452, 103231, 103734, 104534, 105546, 106190, 106393, 106829, 108006, 109602, 110958, 111810, 112207, 112114, 111603, 111182, 111352, 111871, 111970, 111315, 110268, 109171, 107978, 106808, 106289, 106935, 108468, 110082, 111141, 111383, 110800, 109699, 108639, 107927, 107366, 106738, 106313, 106526, 107363, 108383, 109230, 109791, 110041, 110069, 110146, 110436, 110777, 110972, 111095, 111206, 111052, 110504, 110046, 110337, 111356, 112537, 113637, 114915, 116431, 117754, 118563, 119051, 119543, 120067, 120462, 120601, 120466, 120343, 120934, 122785, 125513, 128095, 130107, 132121, 134618, 137118, 138872, 139956, 141044, 142338, 143411, 144116, 145070, 147026, 150044, 153525, 156786, 159471, 161498, 162865, 163633, 164084]
53583A64084P27J683K950L844L768K638J092J47K86Q25O15m23j074m97M80M67
53567A81612m99j073o19j7j78p03o79j06K47K1m56q66j188j263q13K5O65Q00P01
53548A75611O29L89j31m61j32M72M58l32j043q96j35M86O32N09L18P8j06j12p8
53529A76156k28m33l05K65J021J720K254K397J945J199Q80J268J911K376K848
53514A95274L649M526M915M709M384M449M999N730O198O202O036O200O759P290
53500B71320P571P937Q645R426R966J0459J1163J1740J1710J1338J1482J2501
53488C95258J3848J4767J4951J4568J4054J3991J4703J5904J6867J7031J6283
53477E62225J4892J3503J2937J3436J4232J4365J3858J3514J3656J3750J3402
$$ y = [164084, 164811, 166494, 169444, 173288, 177056, 179694, 180786, 180933, 181219, 182044, 182659, 182236, 181162, 180665, 181145, 181612, 181113, 180040, 179421, 179404, 179226, 178523, 177844, 177738, 177985, 178006, 177550, 176684, 175496, 174233, 173420, 173445, 174110, 174910, 175611, 176240, 176629, 176498, 176037, 175905, 176377, 176835, 176503, 175460, 174564, 174429, 174915, 175547, 176056, 176374, 176452, 176346, 176234, 176156, 175928, 175495, 175190, 175455, 176476, 178196, 180450, 182847, 184792, 185991, 186871, 188139, 190050, 192426, 195274, 198923, 203449, 208364, 213073, 217457, 221906, 226905, 232635, 238833, 245035, 251071, 257271, 264030, 271320, 278891, 286828, 295473, 304899, 314865, 325324, 336487, 348227, 359937, 371275, 382757, 395258, 409106, 423873, 438824, 453392, 467446, 481437, 496140, 512044, 528911, 545942, 562225, 577117, 590620, 603557, 616993, 631225, 645590, 659448, 672962, 686618, 700368, 713770]
53466G13770J2981J2909J2969J2701J2118J1564J1228J1116J1242J1479J1438
53455H45515J0818R676Q208O581N157M453M442M184K684%k903n244o947q123q715
53440H69786q770q708q936r412r764r766r552r422r608j0163j0902j1516j1796
53427G41471j1817j1830j1992j2232j2316j1978j1043r536p780o240n139m324
53415F25244l551k809k135j365l73M47M54l26r66o49M68J675K710L813M987N877
53399F33501O430P125Q327R763J0883J1502J1868J2304J2975J3870J4849J5798
53387G69195J6826J8120J9603K0956K2053K3182K4600K6093K7202K7804K8235
53376A023869K8836K9553L0146L0633L1310L2300L3294L3921L4165L4144L3588
$$ y = [713770, 726751, 739660, 752629, 765330, 777448, 789012, 800240, 811356, 822598, 834077, 845515, 856333, 866009, 874217, 880798, 885955, 890408, 894850, 899034, 901718, 901718, 898815, 893571, 886624, 878501, 869786, 861016, 852308, 843372, 833960, 824196, 814430, 804878, 795456, 785848, 775685, 764783, 753267, 741471, 729654, 717824, 705832, 693600, 681284, 669306, 658263, 648727, 640947, 634707, 629568, 625244, 621693, 618884, 616749, 615384, 615011, 615458, 615912, 615586, 614620, 613971, 614439, 616114, 618824, 622637, 627624, 633501, 639931, 647056, 655383, 665146, 676029, 687531, 699399, 711703, 724678, 738548, 753397, 769195, 786021, 804141, 823744, 844700, 866753, 889935, 914535, 940628, 967830, 995634, 1023869, 1052705, 1082258, 1112404, 1143037, 1174347, 1206647, 1239941, 1273862, 1308027, 1342171, 1375759]
53365A375759L2076K9890K8111K7430K7240K6434K4822K3207K2161K1332K0031
53354A658493J8008J5485J2802J0242P880N457K619p01m292q076j2084j6117j9828
53341A669888k3190k6412k9289l1104l1429l0699k9770k9114k8653k8047k7052
53330A355129k5823k4985k5024k5557k5665k5077k4562k4855k5677k6199k6090
53319A075615k5599k4917k3912k2412k0427j8135j5911j4168j2959j1954j0928
53308H74293j0115r787r877j0261j0958j1759j2006j1366j0450j0081j0187j0046
53296G47400r459q905q495p605n872l969k843k533k178j068N70J942K546K653
53282G02184K948L769M813N647O286P148Q445R913J1078J1673J1775J1718J1864
$$ y = [1375759, 1407835, 1437725, 1465836, 1493266, 1520506, 1546940, 1571762, 1594969, 1617130, 1638462, 1658493, 1676501, 1691986, 1704788, 1715030, 1722910, 1728367, 1730986, 1730285, 1725993, 1717917, 1705833, 1689716, 1669888, 1646698, 1620286, 1590997, 1559893, 1528464, 1497765, 1467995, 1438881, 1410228, 1382181, 1355129, 1329306, 1304321, 1279297, 1253740, 1228075, 1202998, 1178436, 1153581, 1127904, 1101705, 1075615, 1050016, 1025099, 1001187, 978775, 958348, 940213, 924302, 910134, 897175, 885221, 874293, 864178, 854391, 844514, 834253, 823295, 811536, 799530, 788164, 777714, 767633, 757446, 747400, 737941, 729036, 720541, 712936, 707064, 703095, 700252, 697719, 695541, 694473, 695043, 696985, 699531, 702184, 705132, 708901, 713714, 719361, 725647, 732795, 741240, 751153, 762231, 773904, 785679, 797397, 809261]
53269H09261J2314J2818J3065J2992J2764J2541J2375J2201J1777J0810R358P961
53257I50237P159O906O667N854M151J604j224l435m552n085n952p498r340j1146
53243I34346j2969j4821j6377j7266j7503j7402j7285j7272j7183j6703j5839
53232G53726j5095j4859j4798j4244j3173j2302j2156j2481j2806j3056j3376
53221F05380j3697j3879j4024j4319j4701j4865j4536j3603j2168j0595r291q295
53209D51407p293o172n260m815m593m237l878l976m687n746o928q245r667j0897
53195C65013j1549j1413j0540r212p873o941o624o861p409p891p906p309o403
53182B57082n692n386n256n006m733m873n659o723p356p213o639o181n910n460
$$ y = [809261, 821575, 834393, 847458, 860450, 873214, 885755, 898130, 910331, 922108, 932918, 942276, 950237, 957396, 964302, 970969, 976823, 980974, 982578, 981354, 977919, 973367, 968282, 962330, 954832, 945492, 934346, 921377, 906556, 890179, 872913, 855410, 838008, 820723, 803451, 786268, 769565, 753726, 738631, 723772, 708974, 694730, 681557, 669255, 657099, 644618, 631812, 618756, 605380, 591683, 577804, 563780, 549461, 534760, 519895, 505359, 491756, 479588, 468993, 459702, 451407, 444114, 437942, 432682, 427867, 423274, 419037, 415159, 411183, 406496, 400750, 393822, 385577, 375910, 365013, 353464, 342051, 331511, 322299, 314426, 307485, 300861, 294000, 286591, 278700, 270794, 263485, 257082, 251390, 246004, 240748, 235742, 231009, 226136, 220477, 213754, 206398, 199185, 192546, 186365, 180455, 174995]
53168A74995m663l862l429l274l036k588k112j768j498j189q46n76n56r94j858
53153A42746k625k531j329K84J165P73m05j479k028k213k158j720r21k96l65r45
53137A25953j365j343j234j336j394j014l10K30L89L81M07L91K34R3J60L10J70
53120A20722m28j178j576j382p67j51N7k97q96j022k18J047J750J458P49K47k33
53103A17882j077j828j608n28K14j37r90j376j212j070j204j383j401j223q30
53088A02229m09m61j102j568j048N9N70K31J58J174K443K503J233Nj00N51R38
53071A07406P95O62Q93J145J040P63P42R63J100J138J400J839J871J195L23p5
53055A23200n8j57m69n60k44J03P8k65o16p24m73j3J48m20j424k047j944j587
$$ y = [174995, 170332, 166470, 163041, 159767, 156731, 154143, 152031, 150263, 148765, 147576, 146730, 146154, 145598, 144604, 142746, 140121, 137590, 136261, 136545, 137710, 138483, 138078, 136599, 134571, 132358, 130200, 128480, 127559, 127263, 126898, 125953, 124588, 123245, 122011, 120675, 119281, 118267, 117957, 118187, 118576, 118957, 119364, 119755, 119989, 120082, 120242, 120552, 120722, 120294, 119116, 117540, 116158, 115391, 115240, 115297, 115000, 114104, 113082, 112864, 113911, 115661, 117119, 117868, 118115, 117882, 116805, 114977, 113369, 112841, 113055, 112918, 111928, 110552, 109340, 108270, 107066, 105683, 104282, 103059, 102229, 101820, 101359, 100257, 98689, 97641, 97700, 98270, 98501, 98659, 99833, 102276, 104779, 106012, 106017, 105917, 106468, 107406, 108201, 108863, 109756, 110901, 111941, 112704, 113446, 114409, 115509, 116647, 118047, 119886, 121757, 122952, 123275, 123200, 123142, 122985, 122516, 121956, 121712, 121815, 121893, 121628, 121012, 120288, 119815, 119802, 119950, 119530, 118106, 116059, 114115, 112528]
53037A12528j437j297q39k56O0K05M95P73N88K3k29K26R58J296J087P45P29J084
53019A16739J407J222N94K15N52J107R34k7p65n01L82J008J177J255J311J025
53003A27635M33Q7L22P80R69R45J156J663J865J096n10j899j987p32Q15J607J569
52986A35814J314J245J293J400J673J951J743Q84p1l83Q7Q82J457J484Q39k67
52970A51345j225j404o90M93J623K329K374J789J084R34J496K208K367J785Q15
52955A67323n2m77m17j35l3k69n89n93j22N80J042Q53Qr36j287q35j2O49R34P79
52935A66411J27p76j232p38K82Q84P67N48P66J156J199R64R05J080J155J084J207
52918A75789J483J353N34l78o64m43l96o48o77l05j65p51j532j593r12m36q62
$$ y = [112528, 111091, 109794, 108955, 108699, 108759, 108964, 109459, 110232, 110820, 110843, 110614, 110840, 111798, 113094, 114181, 114926, 115655, 116739, 118146, 119368, 119962, 120177, 120729, 121836, 122770, 122743, 121978, 121477, 121859, 122867, 124044, 125299, 126610, 127635, 128068, 128155, 128477, 129257, 130226, 131171, 132327, 133990, 135855, 136951, 136441, 134542, 132555, 131823, 132638, 134245, 135814, 137128, 138373, 139666, 141066, 142739, 144690, 146433, 147317, 147246, 146863, 146950, 147832, 149289, 150773, 151612, 151345, 150120, 148716, 148026, 148519, 150142, 152471, 154845, 156634, 157718, 158652, 160148, 162356, 164723, 166508, 167323, 167271, 166794, 166377, 166242, 166209, 165940, 165351, 164758, 164636, 165216, 166258, 167111, 167119, 166183, 164896, 164061, 164049, 164698, 165632, 166411, 166538, 165762, 164530, 163792, 164074, 164958, 165725, 166273, 167039, 168195, 169394, 170358, 171263, 172343, 173498, 174582, 175789, 177272, 178625, 179159, 178781, 178117, 177674, 177278, 176630, 175953, 175648, 175483, 174732, 173200, 171607, 170695, 170259, 169397]
52901A69397j796k341k166j696j453j437j243o28J42N44L35k51q34j215j337j182
52885A52839r28r47j341j653j415q34m70l39O5P80J063M21n59r19m03N91J699
52868A47650K674L029K379J135J97j70n97j582k746l428l577l616l704l656l432
52853A30556l258l091k469j134L30Q97K50p25r25l33N0m00j156j382j095r51j251
52836A13913j760k227k437j985p39M47M29o81j531j382j035j335j760j385n66
52821I5966m68j257j825j316K0J458K429K463J489L54K65J289K212K096J301O46
52805A07122L46L34P46J479J890J660J431J800K228J870J098J031J747K062J210
52790A28054j67j026j073o29p1K10o8n28l20P40J695J609P51Q9j2J7j75m60n98
$$ y = [169397, 167601, 165260, 163094, 161398, 159945, 158508, 157265, 156637, 156779, 157323, 157658, 157407, 156573, 155358, 154021, 152839, 151911, 150964, 149623, 147970, 146555, 145721, 145251, 144912, 144977, 145757, 146820, 147241, 146682, 145763, 145360, 145951, 147650, 150324, 153353, 155732, 156867, 157064, 156894, 156297, 154715, 151969, 148541, 144964, 141348, 137644, 133988, 130556, 127298, 124207, 121738, 120604, 120934, 121831, 122081, 121356, 120431, 120098, 120148, 119748, 118592, 117210, 116115, 115164, 113913, 112153, 109926, 107489, 105504, 104765, 105212, 105641, 104960, 103429, 102047, 101012, 99677, 97917, 96532, 95966, 95498, 94241, 92416, 91100, 91120, 92578, 95007, 97470, 98959, 99313, 99578, 100867, 103079, 105175, 106476, 107122, 107468, 107802, 108548, 110027, 111917, 113577, 115008, 116808, 119036, 120906, 122004, 123035, 124782, 126844, 128054, 127887, 126861, 125788, 125159, 125088, 125298, 125230, 124702, 124382, 125122, 126817, 128426, 129177, 129266, 129254, 129271, 129096, 128636, 128038]
52771A28038n55m10l08m57r00j358j546j514j418j157o38j94k55o67q03l50L04
52754A15812O20M73J86K10P58J465J547O48n84j124p73k23k3m6o1j84m69n82k96
52735A17354M1n9n41r07p78j10R48K090K977L512L846L963L576K708J971J937
52719A42528K479L090L517L644L152J914N64n0L3Pm47o90k00N73Q12L97j41m77
52701A60705q14j313j658j328k71Q36J166O09p8j40L23O94P70R15J300J545J289
52684A64550O81J02k15j36L93J028J122M15o74j671k528l202l300k761k333k661
52668A48810l197k885j735q93j037j621j923j998k146k206j914j488j188p52J65
52653A23992J215J734J661J523J574J595J592J971K763L231K666J280q5q61j032
$$ y = [128038, 127483, 127073, 126765, 126308, 125408, 124050, 122504, 120990, 119572, 118415, 117777, 117583, 117328, 116661, 115858, 115508, 115812, 116432, 116905, 117091, 117301, 118059, 119524, 121071, 121719, 121135, 120011, 119238, 119015, 118992, 118946, 118885, 118701, 118232, 117650, 117354, 117395, 117336, 116795, 115888, 115110, 115000, 115948, 118038, 121015, 124527, 128373, 132336, 135912, 138620, 140591, 142528, 145007, 148097, 151614, 155258, 158410, 160324, 160888, 160838, 160871, 160878, 160431, 159741, 159541, 160114, 160926, 161323, 161182, 160705, 159891, 158578, 156920, 155592, 155321, 156157, 157323, 157932, 157854, 157714, 158037, 158731, 159501, 160416, 161716, 163261, 164550, 165231, 165333, 165118, 164982, 165375, 166403, 167525, 167940, 167266, 165595, 163067, 159865, 156565, 153804, 151471, 148810, 145613, 142728, 140993, 140100, 139063, 137442, 135519, 133521, 131375, 129169, 127255, 125767, 124579, 123827, 123992, 125207, 126941, 128602, 130125, 131699, 133294, 134886, 136857, 139620, 142851, 145517, 146797, 146712, 145851, 144819]
52638A44819p40j04N29N99r8j021j345p85J32O57N36J14j45p8J08O1m37j216j821
52619A39765j980j909j971k068j747r86l86l50n06l61j15k34n00k43M47O62M2
52602A27560n55k64N35Q23M43K16O69J382J643J233M79q9o1M82P78Q7j297k197
52584A31867j927j093o93q85j083r43p12o52p06p61q70j044j142j062q86o88m30
52567A16290j31J0k17p70j364j636j455j046p99p61n28J42Q17Q62L30j23k12k99
52549A09110n30m27K26O79J64q25j036j74P59Q83M36P5j26l99o08m43n2J44O4
52530A07920r6l40q29j380j612j511j377j190o06K52O61K42m03m64J3L33J82j03
52512I9692k22k85m15l80O5P08R77N25m31j293j575j269q22o84q76r91o15K01
$$ y = [144819, 144079, 143975, 144504, 145103, 145005, 143984, 142639, 141854, 141986, 142643, 143179, 143293, 143148, 143070, 143178, 143239, 142802, 141586, 139765, 137785, 135876, 133905, 131837, 130090, 129104, 128718, 128368, 127862, 127501, 127386, 127152, 126652, 126409, 126856, 127518, 127560, 127005, 126741, 127276, 128099, 128542, 128758, 129427, 130809, 132452, 133685, 134164, 134075, 134014, 134496, 135274, 135361, 134064, 131867, 129940, 128847, 128154, 127269, 126186, 125243, 124531, 123879, 123173, 122412, 121542, 120498, 119356, 118294, 117408, 116720, 116290, 116159, 116169, 115952, 115182, 113818, 112182, 110727, 109681, 108882, 108121, 107593, 107735, 108552, 109414, 109744, 109621, 109409, 109110, 108580, 108153, 108379, 109058, 109222, 108397, 107361, 107187, 107946, 108829, 109265, 109340, 109214, 108815, 108207, 107764, 107712, 107856, 107920, 107824, 107484, 106655, 105275, 103663, 102152, 100775, 99585, 98979, 99231, 99892, 100134, 99731, 99267, 99280, 99613, 99795, 99692, 99470, 99185, 98770, 98390, 98455, 99163, 100140, 100665, 100234, 98941, 97366, 96097, 95275, 94591, 93715, 92724, 92109, 92310]
52494I2310Q83Q12Np58p17l0M18K27L4M87J144J032J69l39J13P27M14o64j373
52475I4894j103l68Q5R2qR7N21J128J491J163K11p05j026q58o58n48k80J99M81
52456I4808J58o29j257j226o60j47q6k57q0O44J419J541Q10k74j000j003n01q0
52438I2180j18l78k61L92J021J088Q59R96J462J465N94m86q16k47N70J016R15
52421A00252L92k41n76n22m67p48j013o73J67P36N53j09p47j035p43J61J076J155
52403I7618L94k80l02k00n56r45o91r7K9k82k50L25P75O98M75M78N33N14P20J292
52383A00248J827J961J767J289L10r87j728j322l79O5j32k62P0N47P81Q07Q55
52366A05717J044J379J683J642J193Q40J123J837K216J917J372J052Q97O57M10
$$ y = [92310, 93193, 94005, 94010, 93252, 92535, 92505, 92923, 93150, 93184, 93671, 94815, 95847, 96016, 95677, 95790, 96517, 96931, 96267, 94894, 93791, 93423, 93508, 93600, 93592, 93689, 94210, 95338, 96829, 97992, 98203, 97498, 96472, 95614, 94956, 94408, 94128, 94327, 94808, 94966, 94337, 93080, 91854, 91194, 91047, 90961, 90704, 90624, 91268, 92687, 94228, 95038, 94764, 93764, 92761, 92260, 92180, 92062, 91684, 91423, 91815, 92836, 93924, 94783, 95779, 97241, 98706, 99300, 98814, 97998, 97751, 98321, 99337, 100252, 100644, 100403, 99827, 99305, 98838, 98090, 97077, 96404, 96571, 97307, 97860, 97751, 97004, 95969, 95226, 95387, 96463, 97618, 98012, 97732, 97430, 97230, 96674, 95729, 95038, 94941, 94970, 94688, 94438, 94763, 95538, 96236, 96711, 97189, 97722, 98236, 98956, 100248, 102075, 104036, 105803, 107092, 107402, 106415, 104687, 103365, 102986, 103051, 102919, 102657, 102727, 103274, 104055, 104862, 105717, 106761, 108140, 109823, 111465, 112658, 113498, 114621, 116458, 118674, 120591, 121963, 123015, 123912, 124569, 124979]
52351A24979L87N56O84P24Q20J019J134J022P82O75Q54J231J542J528J158O76
52335A39771M06L69K73MK6Q75K179K773K106J093R19J478J868K034K733L839M123
52318A66869L233K586L335M655N164N119N702O722O852N941N385N869O334N846
52304B39612N048M965N455N831O130O732P380P607P737Q482R672J0339R965R024
52290C43979Q282Q134Q607R483J0280J0610J0529J0371J0300J0353J0607J0973
52278D62508J1011J0418R623R349R680R955R612Q761P870P252O886O552O120N800
52264E81397N906O276O253N533M696M407M440M023K989J967J455J241Q63K27l57
52249F31316m58Q9R22J380J352J559K541L674L964L538L553M535N775O530P008
$$ y = [124979, 125366, 125922, 126606, 127330, 128150, 129169, 130303, 131325, 132107, 132782, 133636, 134867, 136409, 137937, 139095, 139771, 140177, 140546, 140819, 140823, 140849, 141724, 143903, 146676, 148782, 149875, 150794, 152272, 154140, 156174, 158907, 162746, 166869, 170102, 172688, 176023, 180678, 185842, 190961, 196663, 203385, 210237, 216178, 221563, 227432, 233766, 239612, 244660, 249625, 255080, 260911, 267041, 273773, 281153, 288760, 296497, 304979, 314651, 324990, 334955, 343979, 352261, 360395, 369002, 378485, 388765, 399375, 409904, 420275, 430575, 440928, 451535, 462508, 473519, 483937, 493560, 502909, 512589, 522544, 532156, 540917, 548787, 556039, 562925, 569477, 575597, 581397, 587303, 593579, 599832, 605365, 610061, 614468, 618908, 622931, 625920, 627887, 629342, 630583, 631446, 631673, 631316, 630858, 630947, 631869, 633249, 634601, 636160, 638701, 642375, 646339, 649877, 653430, 657965, 663740, 670270, 677278]
52234F77278P707Q501R033R437J0073J0811J1153J0927J0397R851R419R203R179
52221H02969R079Q657Q043P588P449P462P396P077O393N342M105K914J864R10
52207H87248j1r06j767k687l902n500p024p667p205o467o399o894p090o735o447
52192H10547o606o758o469o024n815n653n190m592m203l940l571l339l607m099
52178G40681m072l265k209j654j919k759l558l839l771l946m406m337l194j761
52164F95991j419k540m117m946m593l436k276j881k369k986k990k618k633l070
52150F54117l191k725k355k699l474m013m061l729l160k611k462k704k802k443
52136F11688k070k192k510k302j565j142j622k541k958k609k151k370l317m351
$$ y = [677278, 684985, 693486, 702519, 711956, 722029, 732840, 743993, 754920, 765317, 775168, 784587, 793790, 802969, 812048, 820705, 828748, 836336, 843785, 851247, 858643, 865720, 872113, 877455, 881560, 884474, 886338, 887248, 887237, 886331, 884564, 881877, 877975, 872475, 865451, 857784, 850579, 844112, 837713, 830819, 823729, 816994, 810547, 803941, 797183, 790714, 784690, 778875, 773222, 768032, 763440, 759237, 755297, 751726, 748387, 744780, 740681, 736609, 733344, 731135, 729481, 727562, 724803, 721245, 717406, 713635, 709689, 705283, 700946, 697752, 695991, 694572, 692032, 687915, 682969, 678376, 674940, 672664, 670783, 668414, 665428, 662438, 659820, 657187, 654117, 650926, 648201, 645846, 643147, 639673, 635660, 631599, 627870, 624710, 622099, 619637, 616933, 614131, 611688, 609618, 607426, 604916, 602614, 601049, 599907, 598285, 595744, 592786, 590177, 588026, 585656, 582339, 577988]
52122E77988m803m498l706k859k302k088j873j280m55J07L21O74J327J708J501
52107E59762J485K561M235N117M809M423N035O483P990R072R577R560R568J0404
52093F50081J2091J3673J4441J4730J5084J5315J5055J4589J4411J4447J4428
52082H08345J4614J5283J5910J5680J4687J3805J3494J3403J3082J2326J0921
52071I61550Q855O756N357M473L230J416j69r40j293j837k504k907l094l413l952
52056I71528m602n364o195o720o514n683m873m723n311o123o496o194n596n175
52042H91959m917m430l553k592j914j609j537j465j149m96K90R59J498J971K268
52027H75283K357K522K902K993K259J109N86J034J770K206K456K636K294J092
$$ y = [577988, 573185, 568687, 564981, 562122, 559820, 557732, 555859, 554579, 554124, 554231, 554552, 555226, 556553, 558261, 559762, 561247, 563808, 568043, 573160, 577969, 582392, 587427, 593910, 601900, 610972, 620549, 630109, 639677, 650081, 662172, 675845, 690286, 705016, 720100, 735415, 750470, 765059, 779470, 793917, 808345, 822959, 838242, 854152, 869832, 884519, 898324, 911818, 925221, 938303, 950629, 961550, 970405, 977161, 982518, 986991, 990221, 991637, 991468, 990528, 989235, 987398, 984894, 981987, 978893, 975480, 971528, 966926, 961562, 955367, 948647, 942133, 936450, 931577, 926854, 921543, 915420, 908924, 902730, 897134, 891959, 887042, 882612, 879059, 876467, 874553, 872944, 871407, 869942, 868793, 868297, 868587, 869546, 871044, 873015, 875283, 877640, 880162, 883064, 886057, 888316, 889425, 890011, 891045, 892815, 895021, 897477, 900113, 902407, 903499]
52013I03499n46k028l336m736o119p173p905q549r216r962j0950j2172j3307j4135
51999G93365j4797j5462j6087j6746j7643j8513j8724j8322j8229j8781j8936
51988F01125j7841j6451j6386j7656j8854j9341j9824k0618k0829j9783j8190
51977C95352j7064j6407j5625j4636j3839j3343j2877j2188j1108r588q032p157
$$ y = [903499, 902953, 900925, 897589, 892853, 886734, 879561, 871656, 863107, 853891, 843929, 832979, 820807, 807500, 793365, 778568, 763106, 747019, 730273, 712630, 694117, 675393, 657071, 638842, 620061, 601125, 583284, 566833, 550447, 532791, 513937, 494596, 474772, 454154, 433325, 413542, 395352, 378288, 361881, 346256, 331620, 317781, 304438, 291561, 279373, 268265, 258677, 250645, 243488]
$$ [...]
##END NTUPLES=NMR SPECTRUM
##END=
