##TITLE=NES1040_872015035_9242566_UfO24fU4PF
##JCAMPDX= 6.0         $$ Bruker NMR JCAMP-DX V2.0
##DATA TYPE= NMR SPECTRUM
##DATA CLASS= NTUPLES
##ORIGIN= BRUKER
##OWNER= Administrator
$$ 1.72 TOPSPIN		Version 2.1
$$ 2015-07-01 23:55:06.649 -0700  Administrator@X
$$ Compression mode = diff/dup
##.OBSERVE FREQUENCY= 400.02188249412
##.OBSERVE NUCLEUS= ^1H
##.ACQUISITION MODE= SIMULTANEOUS (DQD)
##.ACQUISITION SCHEME= undefined
##.AVERAGES= 8
##.DIGITISER RES= 22
##SPECTROMETER/DATA SYSTEM= spect
##.PULSE SEQUENCE= zg30
##.SOLVENT NAME= COFFEE_meoh
##.SHIFT REFERENCE= INTERNAL, COFFEE_meoh, 1, 14.98509
##AUDIT TRAIL= $$ (NUMBER, WHEN, WHO, WHERE, PROCESS, VERSION, WHAT)
$$ ##TITLE= Audit trail, TOPSPIN		Version 2.1
$$ ##JCAMPDX= 5.01
$$ ##ORIGIN= Bruker BioSpin GmbH
$$ ##OWNER= Administrator
$$ $$ E:\/data/COFFEE/nmr/NES1040_872015035_9242566_UfO24fU4PF/10/pdata/1/auditp.txt
$$ ##AUDIT TRAIL=  $$ (NUMBER, WHEN, WHO, WHERE, PROCESS, VERSION, WHAT)
(   1,<2015-07-01 23:54:59.461 -0700>,<Administrator>,<X>,<go>,<TOPSPIN 2.1>,
      <created by zg
	started at 2015-07-01 23:53:53.586 -0700,
	POWCHK enabled, PULCHK disabled,
       configuration hash MD5:
       21 0F 79 D6 B3 7B B4 F6 88 20 88 DB 03 48 BD 9F
       data hash MD5: 64K
       18 93 96 A5 E9 8B 80 E9 4B 93 7E 6F BD C3 EE 2B>)
(   2,<2015-07-01 23:55:02.586 -0700>,<Administrator>,<X>,<proc1d>,<TOPSPIN 2.1>,
      <Start of raw data processing
       efp LB = 0 FT_mod = 6 PKNL = 1 PHC0 = 0 PHC1 = 0 SI = 32K 
       data hash MD5: 32K
       FD 0E 7C 78 07 82 FF 20 F0 21 AC E0 35 C0 50 DC>)
(   3,<2015-07-01 23:55:02.867 -0700>,<Administrator>,<X>,<proc1d>,<TOPSPIN 2.1>,
      <pk PHC0 = 93.5321 PHC1 = 0 
       data hash MD5: 32K
       24 14 76 72 FD A2 EF 4C 9C 01 E1 2F CB 44 D9 A0>)
(   4,<2015-07-01 23:55:02.992 -0700>,<Administrator>,<X>,<proc1d>,<TOPSPIN 2.1>,
      <abs ABSG = 1 
       data hash MD5: 32K
       FB 38 57 3B F3 A2 4E 01 0D 4F 79 1E 96 E9 8C 13>)
(   5,<2015-07-01 23:55:03.055 -0700>,<Administrator>,<X>,<proc1d>,<TOPSPIN 2.1>,
      <abs ABSG = 2 
       data hash MD5: 32K
       52 5D 48 04 40 2F 01 B1 A8 0A 5D 19 7F 56 C6 2F>)
(   6,<2015-07-01 23:55:03.102 -0700>,<Administrator>,<X>,<proc1d>,<TOPSPIN 2.1>,
      <abs ABSG = 3 
       data hash MD5: 32K
       43 92 E5 DB 21 7A 21 C7 2E 82 27 87 CE C7 04 D3>)
(   7,<2015-07-01 23:55:03.164 -0700>,<Administrator>,<X>,<proc1d>,<TOPSPIN 2.1>,
      <abs ABSG = 4 
       data hash MD5: 32K
       FF EA A8 FF A1 FE 70 28 07 EA F3 91 BF CB 71 2A>)
(   8,<2015-07-01 23:55:03.227 -0700>,<Administrator>,<X>,<proc1d>,<TOPSPIN 2.1>,
      <abs ABSG = 5 
       data hash MD5: 32K
       D0 3C D4 19 B4 2F 19 B9 D9 81 D0 D0 64 5B 42 ED>)
$$ ##END=
$$ 
$$ $$ hash MD5
$$ $$ 0D 75 68 6C A6 9F EC 04 BF 9C 5B 63 2B 5D 81 61
##$RELAX= 
##$RELAX= 
##$RELAX= 
##$RELAX= 
##$RELAX= 
##$RELAX= 
##$RELAX= 
$$ Bruker specific parameters
$$ --------------------------
##$DU= <E:\>
##$EXPNO= 10
##$NAME= <NES1040_872015035_9242566_UfO24fU4PF>
$$ [...]
150 150 150 150 150 150 150 150
##$TP07= 0
##$TPNAME0= <>
##$TPNAME1= <>
##$TPNAME2= <>
##$TPNAME3= <>
##$TPNAME4= <>
##$TPNAME5= <>
##$TPNAME6= <>
##$TPNAME7= <>
##$TPOAL= (0..7)
0.5 0.5 0.5 0.5 0.5 0.5 0.5 0.5
##$TPOFFS= (0..7)
0 0 0 0 0 0 0 0
##$TUNHIN= 0
##$TUNHOUT= 0
##$TUNXOUT= 0
##$USERA1= <user>
##$USERA2= <user>
##$USERA3= <user>
##$USERA4= <user>
##$USERA5= <user>
##$V9= 5
##$VALIST= <valist>
##$VCLIST= <CCCCCCCCCCCCCCC>
##$VD= 0
##$VDLIST= <DDDDDDDDDDDDDDD>
##$VPLIST= <PPPPPPPPPPPPPPP>
##$VTLIST= <TTTTTTTTTTTTTTT>
##$WBST= 2048
##$WBSW= 25
##$XGAIN= (0..3)
0 0 0 0
##$XL= 0
##$YL= 0
##$YMAX_a= 624459
##$YMIN_a= -520415
##$ZGOPTNS= <>
##$ZL1= 120
##$ZL2= 120
##$ZL3= 120
##$ZL4= 120
##$ABSF1= 14.98509
##$ABSF2= -5.573092
##$ABSG= 5
##$ABSL= 3
##$ALPHA= 0
##$AQORDER= 0
##$ASSFAC= 0
##$ASSFACI= 0
##$ASSFACX= 0
##$ASSWID= 0
##$AUNMP= <proc_prof1d_extract_pilot.lims>
##$AXLEFT= 0
##$AXNAME= <>
##$AXNUC= <1H>
##$AXRIGHT= 0
##$AXTYPE= 0
##$AXUNIT= <>
##$AZFE= 0.1
##$AZFW= 0.1
##$BCFW= 0
##$BC_mod= 0
##$BYTORDP= 0
##$COROFFS= 0
##$CY= 15
##$DATMOD= 1
##$DC= 0
##$DFILT= <>
##$DTYPP= 0
##$F1P= 0
##$F2P= 0
##$FCOR= 0.5
##$FTSIZE= 32768
##$FT_mod= 6
##$GAMMA= 0
##$GB= 0
##$INTBC= 1
##$INTSCL= 1
##$ISEN= 128
##$LB= 0
##$LEV0= 0
##$LPBIN= 0
##$MAXI= 10000
##$MC2= 0
##$MEAN= 0
##$ME_mod= 0
##$MI= 0
##$NCOEF= 0
##$NC_proc= -8
##$NLEV= 6
##$NOISF1= 0
##$NOISF2= 0
##$NSP= 0
##$NTH_PI= 0
##$NZP= 0
##$OFFSET= 14.98509
##$PC= 1
##$PHC0= 93.5321
##$PHC1= 0
##$PH_mod= 1
##$PKNL= yes
##$PPARMOD= 0
##$PPDIAG= 0
##$PPIPTYP= 0
##$PPMPNUM= 2147483647
##$PPRESOL= 1
##$PSCAL= 4
##$PSIGN= 0
##$PYNMP= <proc.py>
##$REVERSE= no
##$SF= 400.02
##$SI= 32768
##$SIGF1= 0
##$SIGF2= 0
##$SINO= 400
##$SIOLD= 32768
##$SPECTYP= <>
##$SREGLST= <1H.CDCl3>
##$SSB= 0
##$STSI= 32768
##$STSR= 0
##$SW_p= 8223.68421052631
##$SYMM= 0
##$S_DEV= 0
##$TDeff= 65536
##$TDoff= 0
##$TI= <>
##$TILT= no
##$TM1= 0
##$TM2= 0
##$TOPLEV= 0
##$USERP1= <user>
##$USERP2= <user>
##$USERP3= <user>
##$USERP4= <user>
##$USERP5= <user>
##$WDW= 1
##$XDIM= 32768
##$YMAX_p= 450363224
##$YMIN_p= -796658
##$CURPLOT= <Network HP LaserJet P1505>
##$CURPRIN= <$Network HP LaserJet P1505>
##$DFORMAT= <normdp>
##$LAYOUT= <+/1D_H.xwp>
##$LFORMAT= <normlp>
##$PFORMAT= <normpl>
##$SURQMSG= 1
$$ End of Bruker specific parameters
$$ ---------------------------------
##NTUPLES= NMR SPECTRUM
##VAR_NAME=  FREQUENCY,     SPECTRUM/REAL,   SPECTRUM/IMAG
##SYMBOL=    X,             R,               I
##VAR_TYPE=  INDEPENDENT,   DEPENDENT,       DEPENDENT
##VAR_FORM=  AFFN,          ASDF,            ASDF
##VAR_DIM=   32768,         32768,           32768
##UNITS=     HZ,            ARBITRARY UNITS, ARBITRARY UNITS
##FACTOR=    0.250966925370066, 1,           1
##FIRST=     8223.43324360094, -192922,      -172919
##LAST=      0,             37793,           -69992
##MIN=       0,             -796658,         0
##MAX=       8223.43324360094, 450363224,    0
$$ Real data points
##PAGE= N=1
##DATA TABLE= (X++(R..R)), XYDATA
$$ [...]
$$ plain form
19474 20859 -745971 -35470 140969 131925 99712 -175258 -47786 -326745 195672 -210560 9569
19462 -173225 73187 -327754 -177338 -93740 -149755 -79662 63502 -29326 -82748 -95148 19004
19450 -27026 -132368 53836 -280151 58156 -153360 -315196 -381559 205611 -143716 -406917
19440 -406917 102372 25076 -45591 -312011 -564918 -122858 -36553 -67592 -106824 -9846 -44431
19429 -44431 -215485 -231328 -81586 170607 39382 -569469 63810 -158014 -106735 -45987 31194
19417 161439 -84186 -302562 -128214 -173461 175967 272355 -187599 -60585 -253294 -117466
19406 -22016 -41884 -228830 186822 113258 162617 -275974 -75243 -27490 -101673 -297710 -190928
19395 -190928 -178794 151882 -59044 -74416 -237096 -171084 -342226 233835 69344 11757 -439209
$$ packed form
19474B0859g45971c5470A40969r044l2213a75258d7786k78959A95672b10560I569
19462a73225G3187c27754J50416Q3598n6015P0093F3502b9326n3422j2400A9004
19450b7026j05342E3836b80151E8156a53360j61836o6363B05611a43716k63201
19440d06917A02372B5076d5591k66420k52907a22858c6553l1039l9232i846l4585
19429d4431j71054j5843h1586A70607C9382e69469F3810a58014N1279d5987C1194
19417A61439h4186k18376a28214m5247A75967R6388a87599f0585j92709a17466
19406b2016j9868j86946A86822p3564M9359b75974g5243b7490p4183j96037J06782
19395a90928J2134A51882e9044j5372j62680O6012j71142B33835F9344A1757d39209
$$ plain form
19383 -273817 -81113 99294 -220233 -22295 -118427 -164266 119434 84857 -278693 -108696 -191165
19372 -191165 -150673 234072 -224846 -381839 272962 -132113 -320911 -395622 69077 -237733
19361 -196341 -70549 -172676 -27774 -123852 -32261 138665 -255450 -124392 121692 -249980
19350 130165 -54352 23469 64431 1276 -394402 -186587 -206208 -42103 122670 -28623 114758
19338 18154 250570 -141259 282347 -115232 -8944 -371121 -62119 -145163 -107809 136174 -39405
19326 148018 -82777 -34397 236472 102969 -121058 70362 -10003 28643 -216037 -224872 -46949
19314 -80050 258297 -127831 -6533 275396 -66371 142282 59347 -132646 121748 28803 -111429
19302 25289 23615 32893 -43945 -12446 -146037 -102653 -47628 -106315 -316683 -209668 -74100
$$ packed form
19383b73817h1113I9294b20233b2295r6132m5839A19434l4577b78693a08696q2469
19372a91165M0492B34072b24846j56993B72962a32113j88798p4711F9077b37733
19361a96341g0549j02127b7774r6078c2261A38665b55450a24392A21692b49980
19350A30165e4352B3469M0962A276c94402a86587j9621d2103A22670b8623A14758
19338A8154K32416a41259B82347a15232h944l62177f2119q3044L7354A36174c9405
19326A48018h2777c4397B36472A02969a21058G0362a0003B8643b16037q835d6949
19314h0050B58297a27831f533B75396f6371A42282E9347a32646A21748B8803a11429
19302B5289j674R278d3945a2446j33591M3384d7628n8687k10368J07015g4100
$$ plain form
19290 230747 -18897 -166494 -235609 -59237 -347549 53740 -123480 -146578 -383127 128025
19279 151476 56547 77152 -143088 -217278 -109822 180703 -290767 187595 -263736 10557
19268 269124 -72841 -98080 -55948 -88683 -104746 483494 -227735 -104676 -148744 143804 278567
19257 278567 29716 41178 99723 -150354 -79851 -573204 38413 161300 -124971 -258279
19247 -258279 -231574 -52210 -242856 -180544 -87931 -172038 -319165 109826 -4984 -43385 -216353
19236 -216353 -184373 8744 -279599 4973 1472 216336 426132 188701 -97203 139542 34868
19224 243879 -402909 -260535 -110001 -331933 27350 -142380 -9238 38693 -139042 -149331
19214 -149331 282998 -277516 -124887 28302 -52715 -353236 42045 -28485 -15702 -20193 -55820
$$ packed form
19290B30747a8897j47597o9115e9237k88312E3740a23480k3098k36549A28025
19279A51476E6547K0605a43088p4190J07456A80703b90767A87595b63736A0557
19268B69124g2841k5239M2132l2735j6063D83494b27735a04676m4068A43804J34763
19257B78567B9716J1462N8545a50354P0503m93353C8413J22887a24971j33308
19247b58279K6705e2210j90646O2312h7931q4107j47127A09826d984l8401j72968
19236b16353L1980H744b79599D973A472K14864K09796A88701i7203A39542C4868
19224B43879d02909J42374a10001k21932B7350a42380i238C8693a39042j0289
19214a49331B82998b77516a24887B8302e2715l00521D2045b8485J2783m491l5627
$$ plain form
19203 -55820 -278037 -103079 -170716 341116 -12708 -362940 -100245 -69349 -2131 -389679 243208
19191 -75598 -55273 -54185 54187 349933 -78312 88265 116333 -304846 165329 -240674 -86614
19179 -249379 -135972 -88205 -31604 -210416 -188873 220668 -78048 -50222 665 -114970 216553
19167 102496 -88157 -118281 37185 -120048 108314 51197 -87695 243763 124765 132683 -104674
19155 38327 -108240 146548 56091 -15401 -361265 -170151 -241762 24057 45457 -309411 -283453
19144 -283453 -408281 -15097 -200218 15039 -124200 -254686 -27857 -90051 -13966 -180105
19134 -180105 -13566 -55018 -127976 -213693 -105532 -22853 -89621 -262700 -111949 -201905 -85239
19122 -7694 132789 -201345 -289783 63080 -84957 -3169 -290794 -93359 1098 143034 42831
$$ packed form
19203e5820k22217a03079o7637C41116a2708l50232a00245L0896b131l87548B43208
19191g5598K0325J088E4187K95746g8312H8265K8068c04846A65329b40674h6614
19179b49379J13407M7767c1604j78812K1543B20668g8048K7826F65a14970B16553
19167A02496h8157l0124C7185a20048A08314E1197h7695B43763j18998P918a04674
19155C8327a08240A46548E6091a5401l45864a70151p1611B4057K1400c09411K5958
19144b83453j24828a5097j85121A5039a24200j30486b7857o2194a3966j66139
19134a80105a3566m1452p2958q5717a05532b2853o6768j73079a11949q9956h5239
19122g694A32789b01345q8438F3080h4957c169k87625i3359A098J41936D2831
$$ plain form
19110 -13458 329262 -137436 181967 -58170 -138961 8339 203416 82923 -43500 272607 67865
19098 153744 -149568 144295 -87160 126948 -22129 -130189 582101 65872 -62243 -79932
19088 -79932 -17794 -4545 -332730 -175441 166373 -55855 -136622 -52547 -41911 -320722 119082
19076 202155 -59086 -200537 -34362 92302 -281298 61991 20685 -94901 -29939 -35711 -169127
19065 -169127 -78003 -2574 -71520 -51144 -296196 -129489 -434631 269640 204016 -147446 41892
19053 -284029 16579 -168034 -131623 -111053 -337213 23023 -51645 -161739 -187175 -354791 -158238
19041 -135662 109827 -311709 -633787 -192861 -23592 -114041 139883 -82816 60798 -130874
19030 -290091 -34799 161766 117936 -129722 138459 149769 221226 -167193 43517 392259
$$ packed form
19110a3458C29262a37436A81967e8170q0791H339J95077H2923d3500B72607F7865
19098A53744a49568A44295h7160A26948b2129j08060E82101F5872f2243j7689
19088g9932a7794d545l28185J57289A66373e5855q0767e2547J0636k78811A19082
19076B02155e9086j41451c4362I2302b81298F1991B0685i4901b9939n772j33416
19065a69127g8003b574o8946K0376k45052a29489l05142B69640o5624a47446D1892
19053b84029A6579a68034L6411K0570k26160B3023e1645j10094k5436j67616a58238
19041a35662A09827c11709l22078a92861b3592r0449A39883h2816F0798a30874
19030b90091c4799A61766m3830a29722A38459J1310P1457a67193D3517L48742
$$ plain form
19020 392259 -77709 -55738 -244446 -177442 54145 -69296 85947 328849 -345004 62431 -109383
19008 147960 -33902 6027 77130 89413 -245629 -111483 -92973 -181376 -87476 41093 -124833
18996 -103664 -233238 68486 192881 124000 -293536 -182813 -77539 -7335 235910 -82356 -173792
18985 -173792 137759 -187114 -152066 -266001 -430128 -123999 12198 -541 -57812 36603 -61920
18973 104678 367214 157014 -378711 230141 -96870 332297 250522 206366 -11663 -56436
18963 -56436 -116891 -84372 -826 -41044 -78124 9018 -19465 -173765 -186983 -11703 -109118 -26493
18950 100764 -168973 169939 -9317 230165 65763 -796658 -102162 95499 82037 -59440 -182750
18939 -182750 -284495 -194725 -31957 132384 -51212 192982 13555 -319334 198909 129517
$$ packed form
19020C92259g7709K1971j88708O7004E4145f9296H5947K42902c45004F2431a09383
19008A47960c3902F027P1103J2283b45629a11483J8510q8403h7476D1093a24833
18996a03664j29574F8486J24395o8881b93536J10723g7539g335B35910h2356r1436
18985a73792A37759a87114L5048j13935j64127a23999A2198e41n7271C6603f1920
18973A04678K62536A57014c78711B30141i6870C32297q1775m4156a1663m4773
18963e6436o0455L2519h26m0218l7080I018a9465j54300j3218a1703r7415b6493
18950A00764a68973A69939i317B30165F5763g96658a02162I5499j3462e9440j23310
18939a82750j01745Q9770c1957A32384e1212A92982A3555c19334A98909o9392
$$ plain form
18929 129517 -195450 -296869 229455 -59568 -277373 180929 -192709 -5166 60903 146570
18919 146570 -93767 6746 -31351 -67247 30525 -121087 -3329 329271 -69876 -101498 -97862 -247773
18907 -247773 194922 117931 -245198 291313 387056 3580 -197341 16910 138886 -498983
18896 7667 84200 -38223 -55861 -98275 -17052 -460631 -235536 143899 -237766 -26559 86126
18884 -103027 -148938 -318953 -157521 27122 -181305 325 -160699 -199420 72706 53164 -64996
18872 76527 -236287 -208305 -14015 -435269 -143188 291293 -98780 318567 180114 -302190
18861 -207147 -60705 84178 159696 -110901 255317 226320 -131381 -26942 -186679 -134216 -136958
18850 -136958 278009 122350 -161408 -142737 143615 -24334 -172245 -25840 -135039 73572
$$ packed form
18929A29517a95450j01419B29455e9568k17805A80929a92709e166F0903Q5667
18919A46570i3767F746c1351l5896C0525a21087c329C29271f9876l1622L636j49911
18907b47773A94922p6991b45198B91313R5743C580a97341A6910J21976d98983
18896G667P6533c8223j7638m2414a7052m43579K25095A43899b37766b6559H6126
18884a03027m5911j70015a57521B7122a81305C25a60699l8721G2706j9542f4996
18872G6527b36287K7982a4015m21254a43188B91293i8780C18567j38453c02190
18861b07147f0705H4178P5518a10901B55317k8997a31381b6942j59737N2463k742
18850a36958B78009A22350a61408J8671A43615b4334j47911b5840j09199G3572
$$ plain form
18839 -342960 33422 -113991 78831 -53306 102724 -286821 116386 110185 60399 -269243 -236000
18828 -236000 312898 127275 -49080 -34977 281374 -186957 48244 -379018 83538 254782
18818 254782 -195780 -3310 -166225 -100728 165979 -265940 -179210 83871 38329 126465 -210751
18806 38451 195398 160268 -137464 120240 -7090 -2801 60789 61144 -29055 -244604 -328933 -236864
18794 -236864 -272077 11468 -124472 206363 -114057 11117 -32343 -131846 317146 -23076 -183569
18783 -183569 301100 857 129761 343350 -83621 71309 -122616 -149623 -16176 -188428 -244842
18772 -244842 -11413 -235500 63099 -266136 -119792 -255647 173806 117348 -287016 22969
18761 46958 165272 180021 124441 219675 217420 -273832 -38343 -23563 5632 146652 -113892
$$ packed form
18839c42960C3422a13991G8831e3306A02724b86821A16386o201m9786b69243L3243
18828b36000C12898A27275d9080J4103B81374a86957D8244c79018H3538J71244
18818B54782a95780c310j62915O5497A65979b65940Q6730H3871C8329Q8136b10751
18806C8451J56947l5130a37464A20240g090b801F0789L55b9055k15549q4329R2069
18794b36864l5213A1468a24472B06363a14057A1117c2343r9503C17146b3076j60493
18783a83569C01100H57J28904K13589h3621G1309a22616k7007a6176j72252n6414
18772b44842a1413k24087F3099b66136a19792j35855A73806n6458b87016B2969
18761D6958J18314J4749n5580R5234k255b73832c8343J4780E632J41020a13892
$$ plain form
18749 -17633 -50758 -268771 -131957 -322222 -1651 -218333 25684 20258 -9461 -237132 121479
18737 -60055 120139 106759 133629 -30296 38645 204378 68008 77577 -88206 -116166 -42922
18725 79588 65479 21378 -100565 -59698 274035 -168862 -86438 16038 -70976 -205522 -220943
18714 -220943 -447673 -294461 446999 145797 -150119 -16515 91167 201891 213885 -26074
18703 -186043 -438212 -431343 35935 -102574 -139937 -80300 -175394 -168662 -202371 -38485 -92150
18692 -92150 -327304 -283438 -10812 67237 18041 -123963 119623 -284986 234526 197727 -207512
18680 -113354 -64681 141107 -229441 87245 -102628 -98622 216812 16033 -177509 251793
18669 148019 -217167 233725 -227566 -151145 -265037 -198023 1355 -87569 -38692 -185235 -44338
$$ packed form
18749a7633l3125k18013a31957j90265a651k16682B5684n426i461k27671A21479
18737f0055A20139j3380K6870c0296C8645J65733F8008R569h8206k7960d2922
18725G9588j4109B1378a00565M0867B74035a68862Q2424A6038g0976j34546j5421
18714b20943k26730J53212D46999A45797a50119a6515I1167J10724J1994b6074
18703a86043k52169O869C5935a02574l7363N9637r5094O732l3709c8485n3665
18692i2150k35154M3866a0812F7237A8041a23963A19623b84986B34526l6799b07512
18680a13354M8673A41107b29441H7245a02628M006B16812A6033a77509B51793
18669A48019b17167B33725b27566P6421j13892O7014A355h7569c8692j46543d4338
$$ plain form
18657 -79356 -125488 -73237 -200887 -173899 47594 -334433 -191683 129315 -43270 -123057 173614
18645 -76416 82634 -53909 -174352 -242438 -175504 -268950 103616 57904 -70864 -66071 255287
18633 -59465 -11358 170128 -105106 45169 125912 110642 -49783 -35252 -280753 -85277 -213323
18622 -213323 154317 -9760 -1668 -79163 -158234 -182624 106617 -150890 -25906 -91028 389258
18610 -325843 65869 -100268 -149894 -365406 255383 -96296 113936 -25404 283267 7696 -71456
18598 30313 -231025 -68245 -146072 -57346 20864 -368816 105676 -138286 -72708 127932 -393734
18586 114486 142854 -33641 -54904 48518 63992 106875 -247556 -232200 -12472 -41420 284097
18574 -362402 -144501 -153073 84311 -278244 18470 8028 129603 -150497 116867 -42175 -84310
$$ packed form
18657g9356m6132N2251j27650K6988D7594c34433J42750A29315d3270p9787A73614
18645g6416H2634e3909j20443o8086O6934r3446A03616m5712g0864M793B55287
18633e9465a1358A70128a05106D5169Q0743j5270d9783J4531k45501h5277j28046
18622b13323A54317i760a668p7495p9071k4390A06617a50890b5906o5122C89258
18610c25843F5869a00268m9626k15512B55383i6296A13936b5404B83267G696g1456
18598C0313b31025f8245p7827e7346B0864c68816A05676a38286O5578A27932c93734
18586A14486K8368c3641k1263D8518J5474M2883b47556J5356a2472k8948B84097
18574c62402a44501q572H4311b78244A8470H028J21575a50497A16867d2175m2135
$$ plain form
18563 -84310 -207518 -52625 -67011 -103073 -110843 -235960 -29736 -151050 -189697 -257249 -66917
18551 -389602 -4297 -71233 33085 -243444 -97182 -447996 174064 71367 438348 -385643 168596
18539 -53903 -39185 -86561 24731 28043 -107934 -263764 -419215 -19000 48262 -161421 5269
18527 -96822 206370 -113695 -262856 -33217 -353415 -35386 -353271 -98603 -187956 111200
18516 -241713 -102617 112918 -107721 -680 -446473 66273 -15409 62657 47384 -255937 -200712
18505 -200712 103788 178471 139299 89190 -314641 79729 -205275 -119065 -51590 110758 9117
18493 66342 -18819 -32374 -72678 -242972 247295 -254367 -72036 -31734 -85846 -222336 -142927
18482 -142927 -177610 144527 112290 -146777 -122346 -2283 -221774 -259400 261859 12278 126358
$$ packed form
18563h4310j23208e2625j4386l6062p770j25117b9736j21314l8647o7552f6917
18551c89602d297o6936C3085b43444i7182l50814A74064G1367L66981c85643A68596
18539e3903J4718m7376B4731L312a07934j55830j55451a9000D8262a61421E269
18527i6822B06370a13695j49161c3217l20198c5386l17885i8603q9353A11200
18516b41713a02617A12918a07721f80m45793F6273a5409F2657j5273b55937N5225
18505b00712A03788P4683l9172n0109c14641G9729b05275Q6210e1590A10758I117
18493F6342a8819j3555m0304j70294B47295b54367g2036c1734n4112j36490P9409
18482a42927l4683A44527l2237a46777K4431b283k19491l7626B61859A2278J14080
$$ plain form
18471 126358 33136 -120097 -262032 217151 190217 -267556 -68708 113852 -271081 -53826
18460 31421 -197305 -309435 2709 104119 -283700 232338 -37332 -179163 -169631 163737 263743
18449 263743 332962 94128 -192303 97237 -86638 -128878 -135365 -57876 832 80818 -30849 139389
18436 -90675 56627 -102132 -136393 -426050 -184604 -147640 32507 60045 -11878 315625 -127720
18424 -47834 -280209 -101225 -71926 243471 -44910 131532 137717 140263 32742 -314066 -51448
18412 155955 155899 -9614 117032 -87488 136383 -444211 178158 158417 53157 116227 160844
18401 160844 147251 88212 -109944 -126488 186719 178164 148453 -65950 204676 50516 -232877
18389 90706 96756 -127137 -169777 -305808 -88195 -54934 -158773 194933 70772 352393 -247117
$$ packed form
18471A26358C3136a20097j41935B17151k6934b67556f8708A13852b71081e3826
18460C1421a97305j12130B709J01410b83700B32338c7332j41831R532A63737J00006
18449B63743O9219I4128a92303I7237h6638m2240o487e7876H32P9986c0849A39389
18436i0675E6627a02132l4261k89657a84604L6964C2507K7538a1878C15625a27720
18424d7834k32375a01225K9299B43471d4910A31532O185K546C2742c14066e1448
18412A55955n6i614A17032h7488A36383d44211A78158j9741E3157O3070M4617
18401A60844j3593n9039a09944j6544A86719q555k9711f5950B04676E0516b32877
18389I0706O050a27137m2640j36031h8195L3261j03839A94933G0772K81621b47117
$$ plain form
18377 -112926 -39687 120967 111590 9697 35332 -274403 -78434 228409 -80293 64726 -386143
18365 141708 -89830 -68064 84084 194710 -94677 314526 -54412 330125 -42905 45655 73599
18354 73599 -52210 -143352 119683 160620 -83848 -154722 -9471 168114 -165345 -148409 -194408
18343 -194408 -51463 -209262 -349661 171884 -131060 95384 -266110 -39408 -155908 -366185
18333 -366185 137162 27041 22435 273205 -209114 -45124 -271502 -370727 -162648 -52522 -33639
18322 -33639 -191668 20187 262947 184599 -174959 -94912 -156439 164060 145471 -196516 69757
18310 25063 -19016 -185918 90753 57360 -67208 -218999 60981 5944 76458 32872 -14292
18298 64254 43545 33719 -38451 21722 115899 -33051 208966 30131 15593 -110925 -253316
$$ packed form
18377a12926c9687A20967r377I697K5635b74403g8434B28409h0293F4726c86143
18365A41708h9830K1766H4084J10626i4677C14526e4412C30125d2905D5655K7944
18354G3599e2210r1142A19683M0937h3848p0874i471A68114a65345J6936m5999
18343a94408e1463j57799j40399A71884a31060I5384b66110c9408j16500k10277
18333c66185A37162B7041m606K50770b09114d5124k26378r9225a62648e2522J8883
18322c3639j58029B0187K42760p8348a74959Q0047o1527A64060j8589a96516F9757
18310B5063a9016j66902I0753l3393f7208j51791F0981E944P0514C2872a4292
18298F4254k0709r826c8451B1722R4177c3051B08966C0131j4538a10925j42391
$$ plain form
18287 -253316 100163 -141902 355131 -287029 -194450 9750 -232457 -122367 168336 -122045
18276 6509 -301308 -135710 -1746 188077 -15390 -1208 185981 -191628 -229685 -232631 266201
18264 86215 -176814 270068 124775 -20084 -357935 -18434 95679 -191361 354448 -295417
18253 10689 238401 -40619 -66370 -150471 97600 -140084 70165 89270 28890 287732 43974
18241 -15510 32504 -78766 3419 -303166 86263 320678 49466 -84229 225985 195348 -104773
18229 27270 59088 -265529 -7533 -8870 -369521 -16558 192342 -60993 125082 159646 -278637
18217 -105334 -280394 -161085 -197331 80415 143754 -126713 -246372 -111852 -16134 -284795
18207 -284795 141800 -333263 -118963 237607 -96587 -123384 -157703 -110769 -380885 -283761
$$ packed form
18287b53316A00163a41902C55131b87029R2579I750b32457J10090A68336a22045
18276F509c01308a35710a746A88077a5390a208A85981a91628l8057k946B66201
18264H6215a76814B70068A24775b0084l37851a8434I5679a91361C54448b95417
18253A0689K27712d0619k5751q4101I7600a40084G0165J9105B8890K58842D3974
18241a5510C2504g8766C419c03166H6263K34415D9466h4229B25985l0637a04773
18229B7270L1818b65529g533j337l60651a6558A92342f0993A25082L4564b78637
18217a05334j75060J19309l6246H0415O3339a26713j19659a11852a6134k68661
18207b84795A41800c33263a18963B37607i6587k6797l4319M6934k70116R7124
$$ plain form
18197 -283761 220957 -73508 81276 175079 259279 -293434 148686 -135764 -227629 -165147 -23574
18185 22944 15732 205862 -232259 -106844 -194705 -301124 -7977 196321 -26672 -14323 188846
18173 -91216 236255 -172783 -111833 240608 -30325 -177984 -120128 104013 -108206 116880
18162 -174231 -60552 54539 -138412 -593 -5194 -3381 -223332 118955 26531 104920 136177 207307
18150 207307 125505 -150400 -81145 -112419 -52287 -79635 32182 184059 26308 28449 128708
18139 128708 255504 -117189 30908 190487 -166003 420172 -239057 91998 -191952 -190490
18129 -190490 -284788 -11893 105401 -74458 65578 64785 197211 -209588 188968 -25149 152632
18117 -35988 -81256 -250527 366881 -345512 -124439 -219103 13832 96585 -299144 -353796 234667
$$ packed form
18197b83761B20957g3508H1276R3803Q4200b93434A48686a35764r1865O2482b3574
18185B2944p212J90130b32259a06844q7861j06419g977A96321b6672J2349A88846
18173i1216B36255a72783O0950B40608c0325j47659N7856A04013a08206A16880
18162a74231f0552E4539a38412e93m601J813k19951A18955B6531P8389L1257P1130
18150B07307q1802a50400O9255l1274e2287k7348C2182J51877B6308K141J00259
18139A28708J26796a17189C0908J59579a66003D20172b39057I1998a91952J462
18129a90490r4298a1893A05401g4458F5578p93J32426b09588A88968b5149A52632
18117c5988m5268j69271C66881c45512a24439r4664A3832Q2753b99144n4652B34667
$$ plain form
18105 -120043 -44602 106995 134762 420239 14126 -255810 -262430 246561 -143204 145320
18094 -53488 -130364 -228573 94401 -193749 35821 -116356 -209064 -134339 133346 -165825 -94241
18083 -94241 124093 -181771 -230337 -274623 -29152 -203305 170661 76557 -129221 38573 169186
18072 169186 347932 -144911 -53827 -46864 143740 356187 422491 -31724 -75454 -354031 231165
18060 18715 -181215 66790 63846 -62336 70664 -393529 -118861 145705 395110 -36112 -4704
18048 138382 47291 -31130 137166 -158010 183441 11011 -139928 77212 -153562 148617
18037 -137353 -2237 82997 30193 370201 -224335 19353 138933 335554 11701 86037 15800
18025 74436 -19594 -169640 120646 -153495 22758 -46530 -459409 76531 113233 156052 171096
$$ packed form
18105a20043d4602A06995K7767K85477A4126b55810o620B46561a43204A45320
18094e3488p6876r8209I4401a93749C5821a16356r2708P4725A33346a65825P1584
18083i4241A24093a81771m8566m4286b9152j74153A70661G6557a29221C8573J30613
18072A69186J78746a44911e3827O963A43740K12447O6304c1724m3730k78577B31165
18060A8715a81215F6790k944f2336G0664c93529a18861A45705K49405c6112d704
18048A38382D7291c1130A37166a58010A83441A1011a39928G7212a53562A48617
18037a37353b237H2997C0193L40008b24335A9353J19580J96621A1701P4336A5800
18025G4436a9594j50046A20646a53495B2758d6530m12879G6531L6702M2819J5044
$$ plain form
18014 171096 5277 104780 -155061 -42261 149744 -134644 118884 -38044 -215901 160839
18003 251195 -52851 -171603 -212251 60508 283459 143708 245336 -5206 197181 -14513 9489
17991 -126114 99135 -174060 351608 -418036 -199547 -77757 35156 129235 71544 -352318
17980 -150725 -31661 16355 32885 207609 43594 -169486 286313 307048 54707 -303313 199352
17968 156836 75350 -68458 -75288 354043 -83158 -171142 275838 70157 184600 250900 -269901
17956 -152078 -4431 -173226 -25227 -152681 -42640 2849 -290243 -39975 -209400 336661 -43500
17944 59744 -29264 129790 -30599 -11803 -34315 49486 116675 -153909 135013 12531 136531
17933 136531 360614 195817 68927 -66098 -133724 -78631 -327269 -2123 -184541 82594 -140961
$$ packed form
18014A71096E277R9503a55061d2261A49744a34644A18884c8044j77857A60839
18003B51195e2851j18752m0648F0508K22951j39751J01628e206A97181a4513I489
17991a26114I9135a74060C51608d18036a99547g7757C5156R4079n7691c52318
17980a50725c1661A6355J6530J74724D3594a69486B86313K0735E4707c03313A99352
17968A56836G5350f8458o830C54043h3158q7984B75838G0157J14443O6300b69901
17956a52078d431j68795b5227j27454d2640B849b90243c9975j69425C36661d3500
17944E9744b9264A29790c0599a1803k2512D9486O7189a53909A35013A2531J24000
17933A36531K24083j64797F8927f6098o7626N5093k48638b123j82418H2594a40961
$$ plain form
17921 70753 126171 222438 81320 -85584 264649 -317873 -66015 83751 -40027 54674 -100284
17909 27308 20155 186861 -250014 100801 -115432 -181187 223014 146295 656742 -92495 190419
17897 352596 347346 -44525 193649 56737 -91658 -76001 62921 60686 185761 -40160 -163584
17886 -163584 -159593 29127 15558 385765 218029 -126169 420 -153572 171824 146649 13361
17874 -19864 -56887 63125 87239 244133 -122575 47251 -88587 37446 162611 378014 267563
17863 267563 -153314 -282984 -17345 64076 204511 89369 103842 89743 165370 -38528 -26781
17852 -26781 85077 52527 -192826 101323 262896 37826 -130202 198432 -52594 -109094 6014
17840 -112311 117714 -56822 -22271 -242574 -208244 40470 -5210 221410 40677 -146602 260489
$$ packed form
17921G0753N5418R6267H1320h5584B64649c17873f6015H3751d0027E4674a00284
17909B7308p153J66706b50014A00801a15432o5755B23014p6719N10447i2495A90419
17897C52596n250d4525A93649E6737i1658J5657F2921k235J25075d0160j23424
17886a63584L991B9127j3569L70207j67736a26169D20a53572A71824k5175A3361
17874a9864l7023F3125K4114J56894a22575D7251h8587C7446J25165K15403j10451
17863B67563a53314j29670a7345F4076J40435H9369J4473j4099P5627c8528J1747
17852b6781H5077l2550a92826A01323J61573C7826a30202A98432e2594n6500F014
17840a12311A17714e6822b2271k20303L4330D0470e210B21410D0677a46602B60489
$$ plain form
17828 -156099 58754 231547 215587 251006 225493 252476 -196030 -153802 -52376 177246 285609
17817 285609 -56794 163148 296075 195720 -79233 -92475 101039 4061 50686 218668 -99577
17805 -72011 128730 -36450 -261300 -73284 35950 482682 16198 175872 -132062 -310654
17795 -310654 -274843 -106972 -66473 109142 71759 -160229 336483 135342 230245 -333317
17784 -258878 -213012 -134985 -72233 -58807 -156825 -246406 -38152 -99803 -235602 -240653 -146449
17773 -146449 -476633 -181062 201132 119129 -64741 38371 1877 -52580 249016 -7711 312389
17761 25477 229683 -180416 105460 180421 222798 49890 -193091 316995 -62910 -312434
17751 -312434 155078 161539 180728 -7790 -142910 20556 66948 -16550 -155621 49911 138869
$$ packed form
17828a56099E8754J72793j5960L5419k5513K6983a96030M2228e2376A77246J08363
17817B85609e6794A63148J32927j00355g9233j3242A01039D061M6625J67982i9577
17805g2011A28730c6450k24850g3284C5950M46732A6198J59674a32062j78592
17795c10654L5811a06972M0499A09142l7383a60229C36483A35342R4903c33317
17784b58878M5866P8027O2752J3426r8018q9581c8152o1651j35799n051R4204
17773a46449l30184a81062B01132q2003f4741C8371A877e2580B49016g711C12389
17761B5477K04206a80416A05460P4961M2377D9890a93091C16995f2910k49524
17751c12434A55078O461J9189g790j35120B0556M6392a6550j39071D9911Q8958
$$ plain form
17740 138869 -8818 234192 150962 34268 -33063 -121294 67226 -19047 223181 -271254 270451
17728 105450 -88303 205357 -110636 22112 4124 -205120 155955 -162195 -14341 171620
17717 -108648 158526 110438 243001 -163364 -14603 58767 172383 -24047 29101 276419
17707 276419 -157213 179764 337945 -101039 111206 8112 146311 303035 -71837 119729
17696 -55243 -32282 40860 262296 226005 -203700 -19054 -59493 225766 -62438 222848 516
17684 173401 163553 190119 -180378 319560 -159070 29329 -30660 -27660 94637 279815 106703
17672 5384 132011 155155 251041 -89404 44498 95730 72291 31098 268574 92078 -98546
17660 190390 57038 298605 131001 -19844 82575 59067 58652 -39237 66128 167675 73047
$$ packed form
17740A38869h818B34192q3230C4268c3063q8231F7226a9047B23181b71254B70451
17728A05450h8303B05357a10636B2112D124b05120A55955a62195a4341A71620
17717a08648A58526m8088J32563a63364a4603E8767J13616b4047B9101K47318
17707B76419a57213A79764J58181a01039A11206H112J38199J56724g1837A19729
17696e5243K2961D0860K21436l6291b03700a9054m0439B25766f2438B22848E16
17684A73401r848K6566a80378C19560a59070B9329c0660L000I4637J85178A06703
17672E384J26627K3144R5886h9404D4498N1232k3439C1098K37476I2078i8546
17660A90390E7038K41567A31001a9844H2575k3508m15c9237F6128J01547G3047
$$ plain form
17648 291948 203760 24286 308970 220980 253910 466719 157523 191912 -431155 -72341 223986
17636 246591 -181022 20465 -106030 65220 -75366 -117862 410317 123180 232243 28662
17625 437131 101153 241809 -59235 71225 168356 119866 180482 106618 84452 -147112 124305
17613 151872 129811 403876 118803 22614 14489 90446 105285 140897 118603 79020 -192766
17601 36709 -37302 379116 60974 161482 -291443 157627 61804 -37081 -117244 41657 241630
17590 241630 178636 228910 396722 -142463 163485 23338 224886 164495 269167 136658
17580 136658 -54982 108765 91137 445296 90473 242498 69489 239107 245269 123062 305740
17569 305740 -71484 233444 220100 200242 86560 74756 36511 -88879 -70178 78444 316337
$$ packed form
17648B91948q8188B4286K84684q7990L2930K12809A57523L4389d31155g2341B23986
17636B46591a81022B0465a06030F5220g5366m2496D10317A23180J09063B8662
17625D37131A01153J40656e9235G1225R7131m8490O0616p3864k2166a47112A24305
17613A51872k2061K74065A18803B2614q125P5957J4839L5612k2294l9583a92766
17601C6709c7302C79116F0974J00508b91443A57627F1804c7081q0163D1657J99973
17590B41630o2994N0274J67812a42463A63485B3338K01548o0391J04672j32509
17580A36658e4982A08765j7628L54159I0473J52025F9489J69618O162j22207J82678
17569C05740g1484B33444j3344j9858H6560j1804C6511h8879J8701G8444K37893
$$ plain form
17558 316337 93245 137873 -91129 72713 482089 -99517 98801 111499 76960 202357 170562
17547 170562 181959 244515 -78282 108706 242655 140874 388001 168511 260975 200224
17537 200224 289818 167984 72228 481338 40417 -280490 127380 -35044 -331795 -63881
17526 108002 233956 240365 367336 433241 613959 622622 797807 558844 468601 246827 131130
17515 131130 -120232 103428 322847 169418 221793 397654 177552 492292 523596 786806
17505 786806 621512 517078 192765 384186 61095 257394 173251 292179 471049 114122
17494 100203 31586 131035 147696 350414 564133 241282 67458 -193749 -140449 207349
17483 341972 333567 47479 279249 202816 -70166 -32110 85599 239018 47825 69912 287222
$$ packed form
17558C16337I3245M4628i1129G2713M09376i9517I8801J2698l4539J25397l1795
17547A70562J1397O2556g8282A08706J33949j01781K47127A68511R2464o0751
17537B00224Q9594j21834G2228M09110D0417b80490A27380c5044k96751f3881
17526A08002J25954O409J26971O5905J80718Q663J75185k38963r0243k21774j15697
17515A31130a20232A03428K19419j53429N2375J75861A77552L14740L1304K63210
17505G86806j65294j04434A92765J91421F1095J96299q4143J18928J78870A14122
17494A00203C1586R9449J6661K02718K13719B41282F7458a93749N3300B07349
17483C41972q405D7479K31770p6433g0166c2110H5599J53419D7825K2087K17310
$$ plain form
17472 287222 371396 263651 449309 221553 120083 126124 75780 173417 109836 382306 27669
17460 196424 234319 108607 195128 130232 345729 119509 31688 148203 -29308 -18727 336161
17448 45359 335909 50010 247027 261572 535376 285108 234697 515684 180576 74020
17437 -94334 259868 216026 190721 199295 341951 76387 278706 253652 88860 122866 -81603
17425 238974 148882 467424 244183 214145 162634 398437 189557 70819 216551 322349
17415 322349 346006 303970 296562 137202 356332 139862 -53184 -13197 333804 223468 149250
17404 149250 130152 444942 509997 360361 307513 251662 -104432 221688 197697 143727 136018
17393 136018 217541 -188285 84203 347241 387676 388163 20650 384355 333888 190898 75790
$$ packed form
17472B87222Q4174j07745J85658B21553j01470O041n0344R7637o3581K72470B7669
17460A96424L7895A08607Q6521o4896K15497A19509C1688J16515b9308J0581C36161
17448D5359K90550E0010J97017J4545K73804k50268n0411K80987A80576G4020
17437i4334B59868m3842k5305Q574J42656G6387K02319k5054H8860L4006h1603
17425B38974r0092L18542k23241l0038n1511K35803A89557G0819J45732J05798
17415C22349K3657m2036p408A37202K19130A39862e3184a3197C33804j10336p4218
17404A49250j9098L14790O5055j49636n2848n5851a04432B21688k3991n3970p709
17393A36018Q1523a88285H4203K63038M0435M87B0650L63705n0467j42990G5790
$$ plain form
17381 94231 -60205 11865 150610 -53681 290993 523083 170433 54545 159199 202916 72954
17369 144441 414637 199441 346076 273099 -71333 540199 108382 -110612 213799 158510
17359 158510 303909 55794 319656 14432 26325 207609 968 155436 56837 473394 351145
17348 351145 506541 120545 128712 150869 515956 224658 343204 300209 104144 215073
17338 215073 59519 -94949 214796 -7118 43993 331688 400051 110333 247372 333569 388878
17327 388878 174033 248012 155239 448397 338748 -106201 237074 165178 396399 437763
17317 437763 129824 516618 228533 356870 352046 371918 -127665 137158 419359 -10610
17306 -57840 265345 268372 -195215 435333 459980 384888 287807 -2363 9443 122804 240606
$$ packed form
17381I4231f0205A1865J38745e3681B90993K32090A70433E4545J04654M3717G2954
17369A44441K70196A99441J46635p2977g1333E40199A08382a10612B13799n5289
17359A58510J45399E5794K63862A4432J1893J81284I68J54468E6837M16557j22249
17348C51145J55396A20545Q167K2157L65087B24658J18546m2995A04144J10929
17338B15073E9519i4949B14796g118D3993K87695O8363A10333J37039Q6197N5309
17327C88878A74033P3979r2773K93158j09649a06201B37074p1896K31221M1364
17317D37763A29824L86794B28533J28337m824J9872a27665A37158K82201a0610
17306e7840B65345L027a95215D35333K4647p5092r7081b363I443J13361J17802
$$ plain form
17295 240606 176475 320807 234724 192009 198205 179341 211303 44835 366727 77241 235273
17284 235273 271333 289833 164614 529571 176842 89553 483471 66777 505748 426326
17274 426326 394998 342124 319323 240518 387481 110649 478501 227225 234797 66114 364536
17263 364536 -63561 138582 639373 137540 336873 134646 128579 538723 345064 91950
17252 162348 464404 769405 193836 184727 116306 430232 453295 353245 170324 340542
17242 340542 -45426 349041 350889 -117366 522577 -8776 498459 398539 439517 637527 185357
17230 338712 308136 89545 296873 527727 136360 184022 364524 176215 388819 306173
17220 306173 333227 413517 415536 562601 166628 432553 223472 336545 403001 262173
$$ packed form
17295B40606o4131J44332q6083m2715O196j8864L1962D4835L21892G7241J58032
17284B35273L6060J8500j25219L64957A76842q7289L93918F6777M38971p9422
17274D26326l1328n2874k2801p8805J46963A10649L67852B27225P572F6114K98422
17263C64536f3561A38582N00791A37540J99333A34646o067M10144j93659I1950
17252A62348L02056L05001A93836r109o8421L13926K3063j00050A70324J70218
17242C40542d5426C49041J848a17366E22577h776D98459r9920M0978J98010A85357
17230C38712l0576H9545K07328K30854A36360M7662J80502A76215K12604q2646
17220C06173K7054Q0290K019J47065A66628K65925k09081J13073O6456j40828
$$ plain form
17210 262173 270381 205880 148155 873636 242461 271727 497503 304617 548110 452134 165515
17198 438961 278806 477603 298245 273094 137329 296735 414677 421620 495421 601284
17188 601284 318522 311889 487790 -75428 383209 328310 330655 631558 557785 658188 493695
17177 493695 473942 261175 369309 258931 361273 342251 350158 676166 668368 462020 518836
17166 518836 656658 621507 476369 402234 238186 661488 568928 516535 465657 262944
17156 262944 643019 353810 250363 683430 530522 377484 625821 -8940 357558 554418
17146 554418 285321 821822 787168 609804 833824 582965 499547 597291 661086 601346
17136 601346 340406 420910 487248 446885 304995 670161 507144 633138 607189 506716
$$ packed form
17210B62173Q208o4501n7725P25481B42461K9266K25776j92886K43493r5976A65515
17198D38961j60155J98797j79358k5151j35765J59406J17942O943P3801J05863
17188F01284k82762o633J75901g5428C83209n4899K345L00903p3773J00403j64493
17177D93695j9753k12767J08134j10378J02342j9022P907L26008p798k06348N6816
17166E18836J37822l5151j45138p4135j64048M23302r2560n2393n0878k02713
17156B62944L80075k89209j03447M33067j52908j53038K48337h940C57558J96860
17146E54418k69097N36501l4654j77364K24020k50859q3418R7744O3795n9740
17136F01346k60940Q0504O6338m0363j41890L65166j63017J25994k5949j00473
$$ plain form
17126 506716 945508 737698 334613 846858 567194 644969 297564 498500 589243 527162
17116 527162 334656 393708 189603 640420 522456 398531 501372 340870 379989 719420
17106 719420 668036 320850 430801 410490 707744 839243 483158 589560 438939 519078
17096 519078 576473 432953 352559 733555 161923 636591 983127 836636 447747 669808
17086 669808 945940 626136 559033 764379 585716 649388 686955 572517 591539 526049
17076 526049 630857 824763 660869 548226 663008 646168 787146 662649 796797 572184
17066 572184 723581 639646 762840 841960 633943 923496 1099357 1104767 895092 661799
17056 661799 705743 1027603 1011180 971979 883095 554564 792205 1063336 687733 891691
$$ packed form
17126E06716M38792k07810C34613N12245k79664P7775B97564K00936R0743o2081
17116E27162j92506N9052A89603M50817j17964j23925J02841j60502L9119L39431
17106G19420n1384C20850J09951k0311K97254J31499l56085J06402j50621Q0139
17096E19078N7395j43520q0394L80996A61923M74668L46536j46491l88889K22061
17086F69808K76132l19804o7103K05346j78663O3672L7567j14438J9022o5490
17076E26049J04808J93906j63894j12643J14782j6840J40978j24497J34148k24613
17066E72184J51397q3935J23194P9120k08017K89553J75861N410k09675k33293
17056F61799M3944L21860j6423l9201q8884l28531K37641K71131l75603K03958
$$ plain form
17046 891691 849439 949643 995477 840878 782561 719119 942114 1362618 1199472 617770
17036 617770 1177264 872588 1055077 899729 1065683 948326 1023993 1030071 972705 1132581
17026 1132581 979103 1414414 936030 972752 824774 1203656 930690 1228862 1569472 1086798
17016 1086798 1276680 1342671 1297395 1053248 1192705 954960 715106 1268038 1417210 1217942
17006 1217942 1189179 1111810 1295795 1159483 1157493 1406616 1194071 860381 1446481 1147470
16996 1147470 1463747 1242509 1528923 1537038 952921 1074695 1313554 1375471 1251720 1641382
16986 1641382 1380872 1499461 1808613 1466301 1454198 1829456 1438963 1594801 1539668 1727353
16976 1727353 1575109 1643164 1405585 1639431 1552598 1659852 1746997 1426020 1733084 1503949
$$ packed form
17046H91691m2252J00204M5834j54599n8317o3442K22995M20504j63146n81702
17036F17770N59494l04676J82489j55348J65954j17357P5667O078n7366J59876
17026A132581j53478M35311m78384L6722j47978L78882k72966K98172L40610m82674
17016A086798J89882O5991m5276k44147J39457k37745k39854N52932J49172j99268
17006A217942k8763p7369J83985j36312j990K49123k12545l33690N86100k99011
16996A147470L16277k21238K86414Q115n84117J21774K38859O1917j23751L89662
16986A641382k60510J18589L09152l42312j2103L75258l90493J55838n5133J87685
16976A727353j52244O8055k37579K33846q6833J07254Q7145l20977L07064k29135
$$ plain form
16966 1503949 1571252 1608602 1853717 1791362 1843858 1625033 1721561 2024847 1964537 2045672 1752457
16955 1752457 1707008 1776473 1963733 2011113 1908425 2060280 1856598 1962568 2371570 2107201
16945 2107201 2070921 2041185 2396475 2278185 1871937 2384284 1868018 2251709 2495251 1992287
16935 1992287 2386804 2540470 2102994 2198329 2562157 2333043 2113523 2451524 2341402 2434082
16925 2434082 2783612 2818552 2873749 2527934 2576639 2623420 2752493 2560361 2769659 2904605
16915 2904605 2887159 2726136 3125257 3091122 2807939 3154075 2917574 3048833 3221395 3159973
16905 3159973 3457815 3420755 3355734 3452449 3572226 3396221 3030955 3725206 3500267 3599518
16895 3599518 3523286 3731954 3880356 3847170 3847290 3661854 4018265 3775806 3943497 3986111
$$ packed form
16966A503949O7303L7350K45115o2355N2496k18825R6528L03286o0310Q1135k93215
16955A752457m5449O9465J87260M7380j02688J51855k03682J05970M09002k64369
16945B107201l6280k9736L55290j18290m06248N12347n16266L83691K43542n02964
16935A992287L94517J53666m37476R5335L63828k29114k19520L38001j10122R2680
16925B434082L49530L4940N5197l45815M8705M6781J29073j92132K09298J34946
16915B904605j7446j61023L99121l4135k83183L46136k36501J31259J72562o1422
16905C159973K97842l7060o5021R6715J19777j76005l65266O94251k24939R9251
16895C599518p6232K08668J48402l3186J20j85436L56411k42459J67691M2614
$$ plain form
16885 3986111 3967739 4106441 4225155 4243405 4482208 4337879 4380796 4518709 4864990 4746561
16875 4746561 4727477 4776345 4670447 5035350 4838400 5029397 4915807 5086018 5498170 5233710
16865 5233710 5252463 5301796 5779362 6094714 5820814 5888281 5914818 5915273 6272792 6455656 6303932
16854 6303932 6622105 6575315 6747344 6620987 6883025 7328223 7214313 7627578 7311492 7551129
16844 7551129 7451562 7871864 8095263 8156643 8268314 8240440 8487712 8561931 9078468 8734287
16834 8734287 8923638 9002372 9423028 9236172 9800540 9578468 10305636 10017656 10544471 10961158
16824 10961158 11131438 11028974 11393921 11545772 11490702 11759610 12042517 12417928 12648205
16815 12648205 13000358 13005992 13854979 13581907 13855018 14561637 14496379 14933749 15385593 15825745
$$ packed form
16885C986111j8372J38702J18714J8250K38803j44329M2917J37913L46281j18429
16875D746561j9084M8868j05898L64903j96950J90997j13590J70211M12152k64460
16865E233710J8753M9333M77566L15352k73900O7467K6537M55L57519J82864j51724
16854F303932L18173m6790J72029j26357K62038M45198j13910M13265l16086K39637
16844G551129r9567M20302K23399O1380J11671k7874K47272P4219N16537l44181
16834H734287J89351P8734M20656j86856N64368k22072P27168k87980N26815M16687
16824A0961158J70280j02464L64947J51851n5070K68908K82907L75411K30277
16815A2648205L52153N634Q48987k73072K73111P06619o5258M37370M51844M40152
$$ plain form
16805 15825745 16211011 16385114 16852022 17006695 17614174 17931018 18316522 18891947 18999483
16796 18999483 19543090 20184429 20541519 20844773 21771732 22121431 22800509 23485573 23569055
16787 23569055 24240250 24833659 25623935 26470604 26720207 27664601 28408484 29481245 29967820
16778 29967820 30693947 31647945 32524027 33184850 34326565 35311955 36056897 36949850 38435849
16769 38435849 39232726 40181677 41253015 42591866 43910158 45094301 46161480 47618364
16761 47618364 49052090 50166258 51202586 53078183 54424517 56022536 57226069 58739069
16753 58739069 60436829 61752850 63340210 64925353 66569938 68021191 69576244 70960006
16745 70960006 72691296 74437208 76086413 77407610 78691630 80210990 81608136 82323974
$$ packed form
16805A5825745L85266J74103M66908J54673O07479L16844L85504N75425J07536
16796A8999483N43607O41339L57090L03254R26959L49699O79078O85064Q3482
16787B3569055O71195N93409P90276Q46669K49603R44394P43883J072761M86575
16778B9967820P26127R53998Q76082O60823J141715R85390P44942Q92953J485999
16769C8435849P96877R48951J071338J338851J318292J184143J067179J456884
16761D7618364J433726J114168J036328J875597J346334J598019J203533J513000
16753E8739069J697760J316021J587360J585143J644585J451253J555053J383762
16745G0960006J731290J745912J649205J321197J284020J519360J397146P15838
$$ plain form
16737 82323974 83692233 84541846 85473936 86797127 87090490 88454053 88934195 88990283 89606591
16728 89606591 89337545 89610008 89531386 89323418 89345091 88789050 88210806 87485809 86841969 85793800
16718 85793800 84950828 84057012 82689292 81654900 80431703 79225958 77330366 76190616
16710 76190616 74863332 73304420 71904399 70392899 68844439 67342888 65594048 64371995
16702 64371995 63367497 61406758 59857234 58140625 56760247 55403397 54068040 52915587
16694 52915587 51441430 50100289 49321137 47595490 46548176 45481370 44386221 43216223
16686 43216223 41817786 40908026 39993324 39091728 37497298 36672845 35980947 35242728 34574678
16677 34574678 33617412 32675052 31843186 31271034 30504371 29692451 29381990 28089284 27435621
$$ packed form
16737H2323974J368259Q49613R32090J323191K93363J363563M80142N6088O16308
16728H9606591k69046K72463p8622k07968K1673n56041n78244p24997o43840j048169
16718H5793800q42972q93816j367720j034392j223197j205745j895592j139750
16710G6190616j327284j558912j400021j511500j548460j501551j748840j222053
16702F4371995j004498j960739j549524j716609j380378j356850j335357j152453
16694E2915587j474157j341141p79152j725647j047314j066806j095149j169998
16686D3216223j398437r09760r14702r01596j594430q24453o91898p38219o68050
16677C4574678r57266r42360q31866n72152p66663q11920l10461j292706o53663
$$ plain form
16668 27435621 27234338 26335668 25867553 25220433 24587874 23600482 23812454 23064167 22787018
16659 22787018 21905086 21421686 21257588 20633714 20272729 19575121 19327515 19339510 19005297
16650 19005297 18326141 18010058 17993443 17421880 16949020 16604847 16170085 15800536 15876290 15552212
16640 15552212 15205195 15125580 14657740 14371668 14091821 13693559 13430812 13266552 12987031
16631 12987031 13090936 12537143 12831489 12212739 12272778 11939307 11934768 11455841 11486148 11095943
16621 11095943 11231459 11274884 10294202 10591139 10466369 10459518 10331830 9896999 9637795 9875054
16611 9875054 9531700 9473296 9019252 9577219 8630820 8753352 8586256 8785958 8557996 8424842
16601 8424842 8551859 8316254 7998021 8088595 7996448 7750781 7826027 7486378 7513631 7562179
$$ packed form
16668B7435621k01283q98670m68115o47120o32559r87392K11972p48287k77149
16659B2787018q81932m83400j64098o23874l60985o97608k47606J1995l34213
16650A9005297o79156l16083j6615n71563m72860l44173m34762l69549P5754l24078
16640A5552212l47017p9615m67840k86072k79847l98262k62747j64260k79521
16631A2987031J03905n53793K94346o18750O0039l33471m539m78927L0307l90205
16621A1095943J35516M3425r80682K96937j24770o851j27688m34831k59204K37259
16611I875054l43354n8404m54044N57967r46399J22532j67096J99702k27962j33154
16601H424842J27017k35605l18233R0574r2147k45667P5246l39649K7253M8548
$$ plain form
16591 7562179 7248763 7134529 7266892 6980809 7200359 6875217 6849288 6512352 6598466 6740911
16581 6740911 6425159 6571376 6285162 5981679 6121666 6295308 6131909 6014261 5848762
16572 5848762 5883161 5615524 5493226 5526865 5342975 5622037 5422948 5249921 5243480 5442485
16562 5442485 5021123 5527846 5262369 5532282 4981540 5048396 4758940 5251778 5044147 4845707
16552 4845707 4719732 4789333 4616430 4623174 4737471 4401782 4576259 4468360 4025017 4276085
16542 4276085 4301326 4308375 4193580 4248424 4374974 4092538 4252690 4024638 4096816 4119516
16532 4119516 4068034 4109511 3866475 4128025 3934349 3584458 3825752 3751550 3731410 3519531
16522 3519531 3604375 3636458 3756076 3615266 3601112 3441576 3274355 3199672 3377620 3232410
$$ packed form
16591G562179l13416j14234J32363k86083K19550l25142k5929l36936Q6114J42445
16581F740911l15752J46217k86214l03483J39987J73642j63399j17648j65499
16572E848762L4399k67637j22298L3639j83890K79062j99089j73027o441J99005
16562E442485m21362N06723k65477K69913n50742O6856k89456M92838k07631j98440
16552D845707j25975O9601j72903O744J14297l35689J74477j07899m43343K51068
16542D276085K5241P049j14795N4844J26550k82436J60152k28052P2178K2700
16532D119516n1482M1477k43036K61550j93676l49891K41294p4202k0140k11879
16522C519531Q4844L2083J19618j40810j4154j59536j67221p4683J77948j45210
$$ plain form
16512 3232410 3757904 3378059 3089190 3545568 3191629 3127378 2972701 3118727 3330264 3081701
16502 3081701 3076261 3048466 2937779 3012963 2899942 2909784 2968866 2995185 3171195 2949764 3334668
16491 3334668 2856361 2886195 2888237 2926763 2954919 2686502 2764593 2970603 2792441 2779048 2744813
16480 2744813 2517069 2230506 2704332 2560880 2695556 2461916 2840973 2555430 2635606 2551119
16470 2551119 2480290 2787550 2586075 2211583 2662478 2330445 2267201 2661272 1931538 2479518
16460 2479518 2275906 2647606 2301134 2117116 2108426 2440676 2283788 2182363 2192377 1973748
16450 1973748 2094348 1890252 2146550 2441394 2404028 2049550 2174225 1914513 2248840 1962706
16440 1962706 2030932 2092927 2017198 2193754 2000286 1791007 1672098 2231169 2159630 1851866
$$ packed form
16512C232410N25494l79845k88869M56378l53939o4251j54677J46026K11537k48563
16502C081701n440k7795j10687P5184j13021R842N9082K6319J76010k21431L84904
16491C334668m78307K9834K042L8526K8156k68417P8091K06010j78162j3393l4235
16480B744813k27744k86563M73826j43452J34676k33640L79057k85543Q0176q4487
16470B551119p0829L07260k01475l74492M50895l32033o3244L94071p29734N47980
16460B479518k03612L71700l46472j84018q690L32250j56888j01425J0014k18629
16450A973748J20600k04096K56298K94844l7366l54478J24675k59712L34327k86134
16440A962706O8226O1995p5729J76556j93468k09279j18909N59071p1539l07764
$$ plain form
16430 1851866 2091182 1756605 1907320 1815601 1896945 1984740 2182431 1781859 1961378 1829246
16420 1829246 1555701 1568365 1756074 1917391 1801446 1633523 1416718 2047817 1967711 1724664
16410 1724664 1846474 1673551 1811895 1753856 2015408 1740284 1724980 1692335 1582070 1880863
16400 1880863 1826229 1922661 1757581 1999130 1538057 1498068 1681912 1629253 1336003 1685316
16390 1685316 1689125 1809837 1899374 1686468 1690821 1467401 1554175 1596489 1600730 1710858 1353087
16379 1353087 1473255 1292882 1679336 1298594 1459884 1768621 1175343 1124345 1632648 1290463
16369 1290463 1625322 1605001 1637294 1596186 1544605 1411449 1355773 1426261 1723906 1289962
16359 1289962 1266633 1471537 1471006 1283738 1342558 1234846 1031824 1188485 1547449 1299777
$$ packed form
16430A851866K39316l34577J50715r1719Q1344Q7795J97691m00572J79519j32132
16420A829246k73545J2664J87709J61317j15945j67923k16805O31099q0106k43047
16410A724664J21810j72923J38344n8039K61552k75124j5304l2645j10265K98793
16400A880863n4634R6432j65080K41549m61073l9989J83844n2659k93250L49313
16390A685316L809J20712Q9537k12906M353k23420Q6774M2314M241J10128l57771
16379A353087J20168j80373L86454l80742J61290L08737n93278n0998N08303l42185
16369A290463L34859k0321L2293m1108n1581j33156n5676P0488K97645m33944
16359A289962k3329K04904n31j87268N8820j07712k03022J56661L58964k47672
$$ plain form
16349 1299777 1102926 1312753 1316063 1381784 1421156 1478147 1498356 969714 1021722 1477212 1190982
16338 1190982 1270294 1106505 1447404 1098660 1081434 1418597 1297594 1314890 1413118 1319782
16328 1319782 1181521 1124628 867470 956182 1112933 1096152 1465729 1209044 1274192 1020046
16318 1020046 1076486 1169742 1273069 941012 980664 1518509 1235147 969626 1357901 1057637
16308 1057637 1337273 1157876 796195 1042146 923421 940820 1042456 971482 984073 1015374
16298 1015374 1004665 1212960 865750 958596 1061000 1204434 833563 1291644 776103 820241
16288 820241 950694 905877 807433 963858 812009 1034964 1141079 1214194 920968 1111585
16278 1111585 898441 759392 918482 1290384 811423 1059041 1354679 1240636 856978
$$ packed form
16349A299777j96851K09827L310O5721L9372N6991K0209n28642N2008M55490k86230
16338A190982P9312j63789L40899l48744j7226L37163j21003J7296R8228r3336
16328A319782j38261n6893k57158Q8712J56751j6781L69577k56685O5148k54146
16318A020046N6440R3256J03327l32057L9652N37845k83362k65521L88275l00264
16308A057637K79636j79397l61681K45951j18725J7399J01636p0974J2591L1301
16298A015374j0709K08295l47210R2846J02404J43434l70871M58081n15541M4138
16288H20241J30453m4817r8444J56425j51849K22955J06115P3115k93226J90617
16278A111585k13144j39049J59090L71902m78961K47618K95638j14043l83658
$$ plain form
16269 856978 1047117 1175640 867965 585399 1070386 663165 711670 796007 750405 989389
16259 989389 833217 693668 839027 918907 836724 949625 725175 693214 1294766 977805
16249 977805 648229 805954 507147 819393 1185034 753571 1142875 786554 735837 689153
16239 689153 869367 867057 753031 405603 997734 520807 968363 780282 936466 851532
16229 851532 677884 967925 870545 813946 675256 599961 929690 685765 724096 786426
16219 786426 514543 683029 831094 851776 606497 886116 749004 626133 500195 668369
16209 668369 724942 546811 778050 910569 463759 517157 935660 732869 526866 680566
16199 680566 617755 702103 407330 858876 871197 783559 635979 623687 266578 691858
$$ packed form
16269H56978J90139J28523l07675k82566M84987m07221M8505Q4337m5602K38984
16259I89389j56172j39549J45359P9880q2183J12901k24450l1961O01552l16961
16249I77805l29576J57725k98807L12246L65641m31463L89304l56321n0717m6684
16239F89153J80214k310j14026l47428N92131m76927M47556j88081J56184q4934
16229H51532j73648K90041r7380n6599j38690p5295L29729k43925L8331O2330
16219G86426k71883J68486J48065K0682k45279K79619j37112j22871j25938J68174
16209F68369N6573j78131K31239J32519m46810N3398M18503k02791k06003J53700
16199F80566o2811Q4348k94773M51546J2321q7638j47580j2292B66578M25280
$$ plain form
16189 691858 575852 445288 413971 895636 437567 596672 491771 665358 498365 626892
16179 626892 604800 726831 659154 682461 773876 193456 841233 490636 579336 244631
16168 682267 389762 415515 415288 628313 134304 324602 546769 395901 724653 502366
16158 502366 448620 538214 520179 581965 545580 221561 779866 392926 319431 326622 269986
16147 269986 169981 578697 394847 205646 303077 335788 443925 372820 512182 192467
16136 459704 469159 410732 442426 485027 224663 307672 720991 275364 407650 82415 516248
16125 516248 265305 464030 265521 225339 355095 659057 301601 283697 604136 332583
16115 332583 99029 493974 640415 218648 449142 287953 445658 600401 137383 66235
$$ packed form
16189F91858j16006j30564l1317M81665D37567J59105j04901J73587j66993J28527
16179F26892k2092J22031o7677K3307R1415A93456O47777l50597Q8700B44631
16168F82267k92505K5753k27K13025A34304J90298K22167j50868L28752k22287
16158E02366n3746Q9594j8035O1786l6385B21561N58305l86940p3495P191n6636
16147B69986j00005M08716j83850j89201R7431L2711J08137p1105J39362A92467
16136D59704R455n8427L1694M2601B24663Q3009M13319B75364J32286H2415M33833
16125E16248k50943J98725j98509m0182J29756L03962C01601j7904L20439k71553
16115C32583I9029L94945J46441B18648K30494j61189J57705J54743A37383F6235
$$ plain form
16104 590880 125304 485937 -142732 39121 -179919 262852 404845 509200 28967 380522
16094 380522 514516 389174 165500 358663 312892 294385 411581 582864 66154 167399
16084 167399 280277 615030 97721 442693 342296 159430 76730 272046 388239 358453
16074 358453 194308 437895 312298 326941 535891 279489 278451 336700 16615 149673
16064 149673 177401 568159 334437 207782 222249 83902 145715 392068 371226 190383
16054 190383 439467 327367 156056 528702 9729 214475 169985 276056 18974 265428
16044 265428 454951 169143 -86467 785027 534067 86891 143622 96825 87949 197896 130764
16033 130764 376111 293374 -275027 341244 359724 263642 -4312 426721 318693 703890
$$ packed form
16104E90880A25304L60633a42732C9121a79919B62852J41993J04355B8967L51555
16094C80522J33994j25342A65500J93163m5771j8507J17196J71283F6154J01245
16084A67399J12878L34753I7721L44972j00397A59430G6730J95316J16193k9786
16074C58453j64145K43587j25597J4643K08950k56402j038N8249A6615J33058
16064A49673K7728L90758k33722j26655J4467H3902O1813K46353k0842j80843
16054A90383K49084j12100A56056L72646I729K04746m4490J06071A8974K46454
16044B65428J89523A69143h6467G85027k50960H6891N6731m6797q876J09947o7132
16033A30764K45347q2737b75027C41244J8480r6082d312D26721j08028L85197
$$ plain form
16023 703890 29056 365730 111603 253579 -59399 393663 92635 297518 129361 189632
16013 189632 263822 513120 28434 284701 296868 139872 234108 292290 166405 131752 165800
16002 165800 -86324 228210 277957 -31460 247024 366140 220207 99905 266541 173292
15992 173292 91299 464661 440755 724321 845560 958155 865259 727323 698150 623051
15982 623051 392117 43754 196586 103233 308056 137776 57136 70851 303081 46619
15971 -104939 14101 52278 176147 129016 86780 147972 -253436 324488 8066 299923 222047
15960 222047 348826 -49963 -95314 89588 17641 56024 -57599 83445 166384 -260010 -13845
15948 238138 339720 -234685 332352 280464 323169 -3605 250691 248290 -24366 291258 139343
$$ packed form
16023G03890B9056L36674A11603J41976e9399C93663I2635K04883A29361O0271
16013A89632P4190K49298B8434K56267J2167A39872R4236N8182j25885l4653L4048
16002A65800h6324B28210M9747c1460B47024J19116j45933I9905J66636r3249
15992A73292q1993L73362k3906K83566J21239J12595r2896j37936k9173p5099
15982F23051k30934D3754J52832r3353K04823A37776E7136J3715K32230D6619
15971a04939A4101L8177J23869m7131m2236O1192b53436C24488H066K91857p7876
15960B22047J26779d9963m5351H9588A7641L8383e7599H3445Q2939b60010a3845
15948B38138J01582b34685C32352n1888M2705c605B50691k401b4366B91258A39343
$$ plain form
15936 26412 101287 -189853 167861 533183 464759 -140557 50687 5665 146498 86306 -35104
15924 198838 243453 430951 212210 -174882 72521 27957 -29267 -127398 -125418 57865 167148
15913 167148 418566 -303175 229062 79615 149653 135734 -33335 94734 89570 -151784 200611
15901 17513 -69181 -73101 181374 124380 -33953 228132 6271 141947 -16843 -40340 -41727 -283053
15889 -283053 -106805 115532 -76384 -302372 -1556 243020 114897 8861 154783 140259 -95916
15877 -96422 126108 -58424 -73982 242785 -31410 -349195 -173929 36363 -158035 -103279 43922
15865 -194159 -130194 87483 18213 280685 122757 -96332 99268 72151 -121300 -23026 -21984
15854 -21984 141368 350321 -16710 -132329 -107072 -127984 151141 346 61916 310839 329899
$$ packed form
15936B6412P4875a89853A67861L65322o8424a40557E0687E665J40833o0192c5104
15924A98838M4615J87498B12210a74882G2521B7957b9267r8131J980E7865J09283
15913A67148K51418c03175B29062G9615P0038j3919c3335I4734n164a51784B00611
15901A7513f9181l920A81374n6994c3953B28132F271J35676a6843k3497j387k41326
15889b83053a06805A15532g6384k25988a556B43020A14897H861J45922j4524i5916
15877i6422A26108e8424j5558B42785c1410l17785a73929C6363a58035N4756D3922
15865a94159O3965H7483A8213K62472A22757i6332I9268k7117a21300b3026J042
15854b1984A41368K08953a6710j15619K5257k0912A51141C46O1570K48923J9060
$$ plain form
15843 329899 -181003 198852 21040 79525 227725 118039 -42847 -50425 206148 56956 33147
15832 33147 272985 -10090 44163 62130 -82292 19511 -75187 -219035 73196 341530 60912
15820 236255 -315067 187158 -178059 -147247 -332689 103582 138442 157757 172814 79532
15809 155420 178283 119107 289437 325639 -180013 176164 -82158 152788 -122655 55115
15798 -222648 441658 -225866 15053 104115 217228 21532 207556 -57789 2717 25350 -6856
15786 14531 -93790 50500 123276 -196408 23645 -82790 -46902 235863 -291518 -86440 11651
15774 -183411 47213 196571 103225 -9263 -98056 155053 165459 69320 -41029 19928 188692
15763 188692 125246 -127227 157232 -33706 187317 -143718 311769 -333653 232126 -70345
$$ packed form
15843C29899a81003A98852B1040N8485J48200j09686d2847p578B06148E6956k3809
15832C3147K39838a0090D4163J7967h2292A9511g5187j43848G3196K68334F0912
15820B36255c15067A87158a78059L0812j85442A03582L4860J9315J5057G9532
15809A55420K2863n9176J70330L6202a80013A76164h2158A52788a22655E5115
15798b22648D41658b25866A5053Q9062J13113B1532J86024e7789B717K2633f856
15786A4531i3790E0500P2776a96408B3645h2790L5888B35863b91518h6440A1651
15774a83411D7213J49358r3346i263q8793A55053J0406F9320d1029A9928J68764
15763A88692o3446a27227A57232c3706A87317a43718C11769c33653B32126g0345
$$ plain form
15752 -32278 69719 8388 -28957 69911 20345 293565 -375141 -7593 -137270 233601 -7129
15740 143502 -108789 79895 -23584 -273123 238314 308735 -64550 107607 125527 -254360
15729 -37946 -76554 97504 324493 -61386 111171 -181972 99702 84586 -289666 -213811 -204706
15718 -204706 -39414 130180 47519 -221477 280132 356330 -311814 250970 279336 183417
15708 183417 83695 -119980 66986 -166790 318744 287976 -179560 -165970 81135 34756 -204984
15696 -210962 50315 44677 -147626 342299 220804 346690 -131395 27136 -221610 -132629
15686 -132629 -203071 87844 39851 42727 -109475 123737 118557 -199156 -9997 -213325 -103229
15674 -220733 -79478 -151550 118274 165128 296385 -42904 95843 280941 -35373 -260323 76657
$$ packed form
15752c2278F9719H388b8957F9911B0345K73220c75141g593j29677B33601g129
15740A43502a08789G9895b3584k49539B38314P0421f4550A07607J7920b54360
15729c7946l8608I7504K26989f1386A11171a81972I9702j5116b89666P5855R105
15718b04706c9414A30180D7519b21477B80132P6198c11814B50970K8366r5919
15708A83417H3695a19980F6986a66790C18744l0768a79560J3590H1135C4756b04984
15696b10962E0315n638a47626C42299j21495J25886a31395B7136b21610Q8981
15686a32629p0442H7844C9851K876a09475A23737n180a99156i997k03328a03229
15674b20733g9478p2072A18274M6854J31257d2904I5843J85098c5373k24950G6657
$$ plain form
15662 122559 -152107 87137 157378 -127558 237299 -7196 -93704 208390 -73286 -99090 252603
15650 123874 169107 149331 -341982 -201134 -144579 -65179 -153995 304257 12415 5132 -172907
15638 -118191 -13713 -215953 -177575 247531 219502 206389 172462 769 186556 209643 30157
15626 91639 241405 -104448 -110889 -116446 59655 40566 -43936 146555 166368 -86683 38007
15614 -36463 -42647 352522 82106 -23849 -81177 -30070 147788 102697 -66935 -108291 76791
15602 62489 26507 -145239 -149221 -244266 97637 301976 -126311 -64245 -118473 -91338 -247201
15591 -247201 105866 -172122 -29674 219914 -102467 141862 -40205 -125974 10400 -82925
15580 154110 128283 292956 -179913 -201588 61111 -115198 -238400 150540 140533 108756
$$ packed form
15662A22559a52107H7137P0241a27558B37299g196q6508B08390g3286k5804B52603
15650A23874M5233j9776c41982J40848N6555f5179q8816C04257A2415E132a72907
15638a18191a3713k02240L8378B47531k8029j3113l3927G69J85787K3087C0157
15626I1639J49766a04448o441n557E9655j9089d3936A46555J9813h6683C8007
15614c6463o184C52522H2106b3849n7328c0070A47788m5091f6935m1356G6791
15602F2489B6507a45239l982r5045I7637K04339a26311O2066n4228K7135j55863
15591b47201A05866a72122b9674B19914a02467A41862d0205q5769A0400h2925
15580A54110k5827J64673a79913k1675F1111a15198j23202A50540j0007l1777
$$ plain form
15570 108756 -132553 -63011 79057 48174 354398 359918 228785 189256 -27550 -44912 -349677
15559 -349677 81388 371297 22525 232329 -118261 148844 28918 78213 107629 -195418
15548 -69432 -26466 6661 -32089 -243811 -309965 197722 159868 134180 -44678 -43907 210834 -46420
15535 -271023 -200631 -20868 -47315 180273 62055 -57104 -21747 120748 83612 74839 37075
15523 53494 339796 128426 -129455 -27169 191708 -100545 27744 -54501 -1610 25054 -56672
15511 8188 62896 -88549 70369 138814 174276 -194482 96651 -870 230649 64918 -146579 26875
15498 -45899 21510 -24551 -9526 -53283 -137575 -282828 -309700 -97166 -75300 103916 -327837
15486 268001 423349 33698 114461 180657 87097 37810 259545 -126579 68971 102843 457678
$$ packed form
15570A08756a32553f3011G9057l0883L06224N520j31133l9529b7550j7362l04765
15559c49677H1388K89909B2525K09804a18261A48844B8918M9295K9416a95418
15548f9432b6466F661c2089k11722o6154A97722l7854k5688d4678P71B10834d6420
15535b71023P0392b0868k6447A80273F2055e7104b1747A20748l7136q773C7075
15523E3494K86302A28426a29455b7169A91708a00545B7744e4501a610B5054e6672
15511H188N4708h8549G0369O8445L5462a94482I6651h70B30649F4918a46579B6875
15498d5899B1510b4551i526m3757q4292j45253k6872i7166K1866A03916c27837
15486B68001J55348C3698Q0763O6196H7097C7810K21735a26579F8971L3872L54835
$$ plain form
15475 457678 338975 284242 232829 338458 47536 201271 -421872 -87104 120535 -38772
15464 115863 62067 -277382 -211581 -169433 -86122 147983 89215 -126401 300387 135328
15453 -328513 107624 -106210 80094 179104 175539 351747 -296842 145158 446612 448026 662821
15442 662821 302592 96105 291388 3993 25997 -51938 -23765 -3370 64178 -3517 63442 150442
15430 150442 251538 95069 173495 -50808 82869 86217 130737 -141966 -177992 55761 130401
15419 130401 -94758 91339 78853 -183425 -29816 -3335 -183241 57247 -14979 24347 26457
15408 26457 97214 -122595 -38239 222395 -47585 86551 301793 23623 -418362 158976 -152915
15396 42574 -269257 -73665 -32662 137865 230017 171808 -60064 164447 48728 160580 -137727
$$ packed form
15475D57678j18703n4733n1413J05629D7536J53735d21872h7104A20535c8772
15464A15863n3796b77382O5801M2148Q3311A47983n8768a26401C00387A35328
15453c28513A07624a06210H0094R9010l565J76208b96842A45158L01454J414K14795
15442F62821C02592I6105J95283C993K2004e1938b3765c370F4178c517F3442Q7000
15430A50442J01096I5069P8426e0808H2869L348M4520a41966l6026E5761P4640
15419A30401i4758I1339j2486a83425b9816c335j79906E7247a4979B4347K110
15408B6457P0757a22595c8239B22395d7585H6551K15242B3623d18362A58976a52915
15396D2574b69257g3665c2662A37865R2152n8209f0064A64447D8728J11852a37727
$$ plain form
15384 -182374 -144269 144343 19617 -135535 248726 -64769 158183 55040 86829 26194 402466
15373 402466 -12732 -81730 130447 48327 70072 -49149 30839 136431 -107332 243325 -140089
15361 -507711 74985 175029 -105461 229843 44728 219691 35919 422868 -14248 8064 208207
15350 208207 92422 272995 58053 67213 106297 254425 410015 352056 96784 379444 120503
15338 93215 68588 87799 77423 -61577 64004 -18030 -2925 129010 189584 -47283 166583
15326 312560 21804 147406 193076 80980 417355 228436 20322 -124421 373695 -7000 39683
15314 -6645 9506 128144 -100079 6608 -26981 530250 182841 199780 40823 107892 26415
15302 58968 199587 270827 36994 -422819 155407 164397 230613 127744 134640 336537 -136944
$$ packed form
15384a82374L8105A44343A9617a35535B48726f4769A58183E5040L1789B6194L76272
15373D02466a2732o8998A30447D8327K1745d9149C0839J05592a07332B43325a40089
15361e07711G4985J00044a05461B29843D4728J74963C5919L86949a4248H064K00143
15350B08207I2422J80573E8053R160L9084J48128J55590n7959I6784K82660A20503
15338I3215k4627J9211j0376f1577F4004a8030b925A29010O0574d7283A66583
15326C12560B1804J25602M5670H0980L36375j88919B0322a24421C73695g000C9683
15314f645I506J18638a00079F608b6981E30250A82841J6939D0823O7069B6415
15302E8968J40619P1240C6994d22819A55407Q990O6216j02869O896K01897a36944
$$ plain form
15290 31281 12105 101431 -21672 19059 217572 286223 -233094 559858 38281 -27999 -13951
15278 -8266 206359 404632 -85154 -154699 -102566 123335 -33143 -43060 -52040 175712 85696
15266 -23520 -38867 15298 -85618 -6518 -260979 94754 94316 124035 53618 39829 161452 75856
15253 294035 -100856 367423 575465 328918 790593 1582113 2016005 1389232 2403738
15244 2403738 938304 261923 296560 163898 -328876 -35380 -177598 -120329 -39475 34952
15233 268886 7700 459958 466303 2036 1179 128584 287122 -226283 -51289 60020 39911 -106873
15220 -125989 -134423 -51813 -10281 -249922 -462159 -42767 150248 -24494 210084 182804 -134456
15208 -124177 100652 34332 417619 114600 -216618 225313 -33476 -99097 293881 87991
$$ packed form
15290C1281A2105Q9326b1672A9059J98513O8651b33094E59858C8281b7999a3951
15278h266B06359J98273h5154o9545N2133A23335c3143r917q980A75712H5696
15266b3520j5347A5298h5618f518k54461I4754m38K9719E3618j3789J21623G5856
15253B94035a00856C67423K08042k46547M61675P91520M33892o26773J014506
15244B403738I38304B61923L4637j32662c28876c5380j42218N7269c9475C4952
15233B68886G700M52258O345B036q57J27405J58538b26283e1289F0020k0109a06873
15220a25989q434e1813a0281k39641k12237d2767A50248b4494B10084k7280a34456
15208a24177A00652C4332L83287A14600b16618B25313c3476o5621B93881H7991
$$ plain form
15197 -178491 -47784 182774 287750 262333 -140433 -255928 -16075 302833 101995 5691
15186 -5238 311210 -1579 232341 114178 -5692 280995 154775 25235 278987 -184381 -218039
15175 -218039 -560 -226599 336392 -146653 13553 180850 314576 56329 -61335 240813 -146559
15163 44770 201872 -37864 103408 486208 -57109 248913 -3646 255842 -123832 106027
15152 -22277 -1705 101572 184392 361846 172689 431508 45823 -72438 227015 106331 -158929
15140 -92037 -17165 -137331 234520 252540 -104924 -364805 -15170 107070 174073 64896 145978
15129 145978 137957 275632 110225 312116 150126 -203686 265069 77858 179647 -72749
15118 142364 72591 287008 169182 -150799 183364 -50135 -130463 175479 175351 78147 -34908
$$ packed form
15197a78491d7784A82774J04976k5417a40433j15495a6075C02833A01995E691
15186e238C11210a579B32341A14178e692B80995j26220B5235K53752a84381l3658
15175b18039e60k26039C36392a46653A3553J67297J33726E6329f1335B40813a46559
15163D4770J57102c7864A03408L82800e7109B48913c646B55842a23832A06027
15152b2277a705A01572Q2820J77454A72689K58819D5823g2438B27015A06331a58929
15140i2037a7165j20166B34520J8020a04924k59881a5170A07070O7003F4896Q1082
15129A45978q021J37675A10225K01891A50126b03686B65069G7858J01789g2749
15118A42364o9773K14417j17826a50799A83364e0135q0328A75479j28G8147c4908
$$ plain form
15106 -91342 257704 210196 465967 299262 82637 -139753 52908 254514 166636 542817
15096 542817 380113 106199 -16427 18484 166118 206855 -79116 214015 332365 485803
15086 485803 54707 205035 -134435 27579 441503 115791 -6852 278036 -25197 -153818
15076 -153818 218315 153313 -16976 248101 -68183 273683 64300 174218 -192569 350319
15065 -24425 127108 -257136 57151 -296780 394480 42182 255672 -35977 344503 158695
15054 411513 165079 -50909 208337 300087 -58427 -95222 454878 285686 23768 -75356 306096
15042 103485 350201 117042 53566 942023 80078 -29235 103515 366009 357147 416798 322729
15031 322729 287275 143111 118771 141050 380434 -157211 490202 539859 94357 24411 261796
$$ packed form
15106i1342B57704m7508K55771j66705H2637a39753E2908K01606q7878L76181
15096E42817j62704A06199a6427A8484J47634M0737g9116B14015J18350J53438
15086D85803E4707J50328a34435B7579M13924A15791f852B78036b5197j28621
15076a53818B18315o5002a6976B48101f8183B73683F4300J09918a92569C50319
15065b4425A27108b57136E7151b96780C94480D2182K13490c5977C44503A58695
15054D11513A65079e0909B08337R1750e8427l6795D54878j69192B3768g5356C06096
15042A03485K46716A17042E3566Q88457H0078b9235A03515K62494q862N9651r4069
15031C22729l5454A43111k4340K2279K39384a57211D90202M9657I4357B4411K37385
$$ plain form
15020 261796 486625 397272 322682 143846 314865 259268 303406 387823 301386 531984 208325
15008 210239 225266 470392 283069 401156 277692 315863 252966 273733 333404 184775
14998 184775 212037 296252 449638 270889 253342 485153 440765 229987 232145 228456 415219
14987 415219 580632 647199 203846 357154 273314 733672 287740 570960 439022 198742
14976 693409 714634 546889 316241 346516 767832 567121 234144 524696 460541 411863
14966 411863 419773 283287 145775 322997 431446 480644 269422 278944 548110 176264
14955 143055 442762 358739 -76865 374575 420577 330317 610055 121259 404495 754672
14945 754672 341638 601219 495933 255986 265068 139976 451168 259684 179302 406464
$$ packed form
15020B61796K24829q9353p4590A43846J71019n5597M4138Q4417q6437K30598B08325
15008B10239J5027K45126j87323J18087j23464L8171o2897K0767N9671j48629
14998A84775K7262Q4215J53386j78749j7547K31811m4388k10778K158l689J86763
14987D15219J65413O6567B03846J53308q3840M60358B87740K83220j31938A98742
14976F93409K1225j67745k30648L0275M21316k00711B34144K90552o4155m8678
14966D11863P910j36486j37512J77222J08449M9198k11222R522K69166A76264
14955A43055K99707q4023g6865C74575M6002r0260K79738A21259K83236L50177
14945G54672C41638K59581j05286k39947R082j25092L11192j91484q0382K27162
$$ plain form
14935 406464 111451 632688 335734 449446 428426 531718 869247 784053 918752 743627
14925 743627 1145550 790944 842037 916780 907710 943323 1301678 1012456 1303092 1058211
14915 1058211 1040373 392651 665575 390540 331369 264460 110530 578483 505518 524443
14905 524443 354833 375181 622075 565166 295861 584212 367551 460673 413642 452019
14895 452019 456627 328089 83317 -40914 829197 499075 416250 573827 779678 626585
14885 626585 481983 54255 517914 631629 484149 53832 357293 313698 312778 471372 453276
14874 453276 435336 551163 572538 452963 357913 496110 407490 603545 447785 483846
14864 483846 548424 544477 634348 412634 342288 376230 -46284 320695 324776 189923 725052
$$ packed form
14935D06464A11451N21237k96954J13712k1020J03292L37529q5194J34699j75125
14925G43627M01923l54606N1093P4743r070L5613L58355k89222K90636k44881
14915A058211j7838C92651K72924k75035n9171o6909A10530M67953p2965J8925
14905E24443j69610K0348K46894n6909k69305K88351k16661R3122m7031L8377
14895D52019M608j28538H3317d0914H29197l30122q2825J57577K05851j53093
14885F26585j44602E4255M63659J13715j47480E3832L03461m3595r20J58594j8096
14874D53276j7940J15827K1375j19575r5050J38197q8620J96055j55760L6061
14864D83846O4578l947Q9871k21714p0346L3942d6284C20695M081j34853N35129
$$ plain form
14853 725052 309001 490585 498300 52403 -128894 290761 621718 361780 393842 485566
14843 485566 452082 761154 653673 569829 1024218 862482 899393 663640 523547 506254
14833 506254 568003 850408 449477 612575 484566 449800 484281 442793 442554 565351 748678
14822 748678 546991 717858 468538 713904 677025 493298 463833 524189 193504 322611
14812 322611 147534 405455 653112 514469 547050 664770 576420 456133 456068 616853 776140
14801 776140 614027 539420 444098 704219 392904 129311 506790 876161 779743 435894
14791 435894 522660 823615 684509 144957 431033 396474 396976 731284 680392 787242 345765
14779 457964 526059 588275 425913 426001 590300 291681 692877 577945 427226 567124 748455
$$ packed form
14853G25052C09001J81584P715E2403a28894B90761L30957k59938L2062R1724
14843D85566l3484L09072j07481q3844M54389j61736L6911k35753j40093j7293
14833E06254O1749K82405m00931J63098j28009l4766L4481m1488k39J22797J83327
14822G48678k01687J70867k49320K45366l6879j83727k9465O0356A93504J29107
14812C22611A47534K57921K47657j38643L2581J17720q8350j20287o5J60785J59287
14801G76140j62113p4607r5322K60121l11315A29311L77479L69371r6418l43849
14791D35894Q6766L00955j39106A44957K86076l4559N02L34308n0892J06850C45765
14779D57964O8095O2216j62362Q8J64299B91681M01196j14932j50719J39898J81331
$$ plain form
14768 748455 532141 575425 612571 746951 617497 669516 407069 991212 428907 577013
14758 577013 658148 421180 775735 272246 709718 702741 659089 757733 244137 759957
14748 759957 570466 572968 800692 875131 542360 607973 932320 605785 757669 744612
14738 744612 433624 549902 1116107 538187 936149 985555 933631 619838 528209 897072
14728 897072 835642 1102153 970679 1114004 578040 1002702 1048411 1042270 1083962 1284994
14718 1284994 1200124 1038938 804823 886846 1093198 654511 939480 562897 609462 833792
14708 833792 782147 513039 880533 781982 974513 1162092 1200929 715813 1062138 1038093
14698 1038093 1153147 1238790 1003706 956299 1072927 1119826 1126996 853684 836373 959039
$$ packed form
14768G48455k16314M3284L7146J34380j29454N2019k62447N84143D28907J48106
14758E77013Q1135k36968L54555B72246M37472o977m3652R8644B44137N15820
14748G59957j89491K502K27724P4439l32771O5613L24347l26535J51884j3057
14738G44612l10988J16278N66205E38187L97962M9406n1924l13793r1629L68863
14728H97072o1430K66511j31474J43325n35964M24662M5709o141M1692K01032
14718A284994q4870j61186k34115Q2023K06352m38687K84969l76583M6565K24330
14708H33792n1645k69108L67494r8551J92531J87579L8837m85116L46325k4045
14698A038093J15054Q5643k35084m7407J16628M6899P170k73312j7311J22666
$$ plain form
14688 959039 868561 518140 896151 1065632 876540 878818 875801 710436 1213585 944696
14678 944696 896749 1126237 990329 996770 891560 1047053 788624 1128252 750492 743999
14668 743999 819048 781737 908043 830623 1030366 931579 1005065 863743 628891 906327
14658 906327 809544 811362 1169240 883123 1050559 1232666 1058096 1103934 1303158 1336902
14648 1336902 939252 841899 1391292 1103129 974010 1045291 1250271 1172217 1111655 1290585
14638 1290585 1080633 1237257 996988 1181016 1194079 1027586 845810 1149128 1079943 1090594
14628 1090594 1349887 1061755 919589 1133775 1384354 860801 1247597 1425105 1050784
14619 1050784 1381841 1469140 1317010 1322588 1060859 1457811 1355821 1716244 1378771 1547796
$$ packed form
14688I59039r0478l50421L78011J69481j89092K278l017j65365N03149k68889
14678I44696m7947K29488j35908O441j05210J55493k58429L39628l77760o493
14668G43999P5049l7311J26306p7420J99743r8787P3486j41322k34852K77436
14658I06327r6783J818L57878k86117J67436J82107j74570M5838J99224L3744
14648A336902l97650r7353N49393k88163j29119P1281K04980p8054o0562J78930
14638A290585k09952J56624k40269J84028J3063j66493j81776L03318o9185J0651
14628A090594K59293k88132j42166K14186K50579n23553L86796J77508l74321
14619A050784L31057Q7299j52130N578k61729L96952j01990L60423l37473J69025
$$ plain form
14609 1547796 1425775 1602850 1300495 1305203 1304451 1496820 1452441 1647275 1708271 1807380 1605909
14598 1605909 1239415 1502943 1349327 1388584 1845400 1309653 1528806 1688733 1701677 1489585
14588 1489585 1600772 1490724 1840214 1676664 1878221 1458910 1745079 1412427 1762876
14579 1762876 2033276 1755763 1728299 1638656 1805422 1913640 2051422 2047551 2081573 1880808
14569 1880808 2192229 2306244 2092048 1966507 2278323 2360077 2343845 2273421 2125728 2253186
14559 2253186 2472783 2354788 2626969 2819237 3324827 3464326 3821095 4080448 4881023
14550 4881023 5468852 7564099 11057045 19568898 36761453 39540084 19453428 11667288
14542 11667288 4939287 3269299 2369595 2210671 1601838 1532401 1586679 1682892 1976358
$$ packed form
14609A547796j22021J77075l02355M708p52J92369m4379J94834O0996R9109k01471
14598A605909l66494K63528j53616L9257M56816n35747K19153J59927J2944k12092
14588A489585J11187j10048L49490j63550K01557m19311K86169l32652L50449
14579A762876K70400k77513k7464q9643J66766J08218J37782l871L4022k00765
14569A880808L11421J14015k14196j25541L11816Q1754j6232p0424j47693J27458
14559B253186K19597j17995K72181J92268N05590J39499L56769K59353Q00575
14550D881023N87829K095247L492946Q511853J7192555K778631A9453428p786140
14542A1667288D939287j669988q99704j58924o08833o9437N4278R6213K93466
$$ plain form
14533 1976358 1822125 2037068 1791071 1799336 1684235 2082693 2118711 2032303 2073420 2047367
14523 2047367 2269975 2473139 2049695 2280194 2571915 2206804 2612104 2398237 2563497
14514 2563497 2539275 2258978 2803644 2444476 2707206 2478079 2514206 2647081 2741985 2824947
14504 2824947 3038034 2702559 2996460 2934669 3059067 2892897 3048765 2842674 2981614 3094367
14494 3094367 3154949 3380306 3238459 3149142 3408366 3234936 3032621 3463402 3167768 3474314
14484 3474314 3248326 3370535 3543947 3361097 3459290 3586729 3729764 3678389 3480094 3162516
14474 3162516 3855237 3647381 3793882 3761355 4041285 4077305 4239019 3996622 4078464 4058339
14464 4058339 4125809 4438823 4328302 4498188 4476527 4315921 4414169 4801480 4618560 4527877
$$ packed form
14533A976358j54233K14943k45997Q265j15101L98458L6018q6408M1117k6053
14523B047367K22608K03164m23444K30499K91721l65111M05300k13867J65260
14514B563497k4222k80297N44666l59168K62730k29127L6127J32875R4904Q2962
14504B824947K13087l35475K93901o1791J24398j66170J55868k06091J38940J12753
14494C094367O0582K25357j41847q9317K59224j73430k02315M30781k95634L06546
14484C474314k25988J22209J73412j82850R8193J27439J43035n1375j98295l17578
14474C162516O92721k07856J46501l2527K79930L6020J61714k42397Q1842k0125
14464D058339O7470L13014j10521J69886k1661j60606R8248L87311j82920r0683
$$ plain form
14454 4527877 4825340 5033443 4744548 4914366 5013664 4898453 5641218 5324859 5066816 5332577
14444 5332577 5448042 5353218 5339720 5297255 5706248 5880828 5777018 6086390 5762038 6412401
14434 6412401 5909924 6136121 6462301 6394435 6606563 6582370 6630883 7014680 6652591 6835516
14424 6835516 6987231 7194010 7104201 7543024 7252062 7637458 8043926 7857465 7974563 8233595
14414 8233595 8153435 8083032 8102098 8758228 8530901 8928558 8680056 8855566 9110785 9202096
14404 9202096 9383945 9589631 9743924 9697553 9968150 10029763 10258621 10336025 10259344 10523214
14394 10523214 10969560 10810019 11069274 11530186 11696455 12049982 11920253 12372933 12190169
14385 12190169 12850509 12789527 13224688 13412216 13762021 13744315 14128236 14277037 14461920 14809970
$$ packed form
14454D527877K97463K08103k88895J69818R9298j15211P42765l16359k58043K65761
14444E332577J15465r4824j3498m2465M08993J74580j03810L09372l24352O50363
14434F412401n02477K26197L26180o7866K12128k4193M8513L83797l62089J82925
14424F835516J51715K06779q9809M38823k90962L85396M06468j86461J17098K59032
14414H233595q0160p0403J9066O56130k27327L97657k48502J75510K55219R1311
14404I202096J81849K05686J54293m6371K70597O1613K28858P7404p6681K63870
14394A0523214M46346j59541K59255M60912J66269L53527j29729M52680j82764
14385A2190169O60340o0982M35161J87528L49805j7706L83921J48801J84883L48050
$$ plain form
14375 14809970 15352695 15435200 15763505 16182357 16175483 16639736 17164944 17444364 17813436 18241534
14365 18241534 18741029 18728712 19462430 19395274 20247906 20640295 20881528 21434625 22114220 22513448
14355 22513448 23150021 23631109 24095688 24666656 25102290 25908948 26072971 27277384 28079560
14346 28079560 28457975 29354499 30043153 30943090 31908174 32490689 33345838 34189675 35283525
14337 35283525 36428281 37112603 38039897 39348783 40546368 41757703 43238611 44759258
14329 44759258 46009256 47573806 48905080 50341533 52135674 54253901 55531517 57441804
14321 57441804 59589112 61529822 63729741 65937576 68399990 70911395 73531015 76504701
14313 76504701 79489497 82746243 86145855 89513459 93166688 97123202 101243810 105769072
$$ packed form
14375A4809970N42725Q2505L28305M18852o874M64253N25208K79420L69072M28098
14365A8241534M99495j2317P33718o7156Q52632L92389K41233N53097O79595L99228
14355B2513448O36573M81088M64579N70968M35634Q06658J64023J204413Q02176
14346B8079560L78415Q96524O88654Q99937R65084N82515Q55149Q43837J093850
14337C5283525J144756O84322R27294J308886J197585J211335J480908J520647
14329D4759258J249998J564550J331274J436453J794141K118227J277616J910287
14321E7441804K147308J940710K199919K207835K462414K511405K619620K973686
14313G6504701K984796L256746L399612L367604L653229L956514M120608M525262
$$ plain form
14305 105769072 110464864 115267113 120598217 126218515 132350944 138559779 144618150 152066862
14297 152066862 159303700 166909717 174925693 183346914 192503088 202438670 212591329 223013187
14289 223013187 234197827 245946079 258273761 271256779 284184877 298470658 312363569
14282 312363569 326890414 341524081 356398262 370885724 384760694 398737449 411883986
14275 411883986 423751475 434253895 442181660 446335285 448720531 450363224 449847906 447656595
14267 447656595 444331852 438873578 430965985 420224793 407898693 394289219 379671688
14260 379671688 364497223 348767648 333216802 317904967 302256155 287177143 272933647
14253 272933647 260558100 247489546 235102446 222849296 211706647 200804389 190497967
$$ packed form
14305A05769072M695792M802249N331104N620298O132429O208835O058371P448712
14297A52066862P236838P606017Q015976Q421221R156174R935582J0152659J0421858
14289B23013187J1184640J1748252J2327682J2983018J2928098J4285781J3892911
14282C12363569J4526845J4633667J4874181J4487462J3874970J3976755J3146537
14275D11883986J1867489J0502420P927765M153625K385246J642693n15318k191311
14267D47656595l324743n458274p907593j0741192j2326100j3609474j4617531
14260C79671688j5174465j5729575j5550846j5311835j5648812j5079012j4243496
14253B72933647j2375547j3068554j2387100j2253150j1142649j0902258j0306422
$$ plain form
14246 190497967 180961103 172304735 164218756 156195090 148774047 141725204 134908668 128903902
14238 128903902 123153837 118159514 112508827 107657915 102766423 98785872 94839148 91396709
14230 91396709 87606161 83723947 80557965 77383803 74589464 71691403 69042552 66005326
14222 66005326 64146453 61751270 59637212 57611578 55645092 53744406 52137107 50107224
14214 50107224 48924297 47574751 46094442 44597226 42940654 41659144 40822817 40071174
14206 40071174 38715342 37791858 36420975 35620433 34297329 33692146 32533435 32003101 31044160
14197 31044160 30204956 29052812 28759589 28099678 27526128 26737177 26138730 25254540 24793464
14188 24793464 24077780 23325210 23261173 22490986 21970545 21577119 20793520 20320750 20385545 19474082
$$ packed form
14246A90497967r536864q656368q085979q023666p421043p048843o816536o004766
14238A28903902n750065m994323n650687m850912m891492l980551l946724l442439
14230I1396709l790548l882214l165982l174162k794339k898061k648851l037226
14222F6005326j858873k395183k114058k025634j966486j900686j607299k029883
14214E0107224j182927j349546j480309j497216j656572j281510q36327p51643
14206D0071174j355832r23484j370883q00542j323104o05183j158711n30334r58941
14197C1044160q39204j152144k93223o59911n73550p88951n98447q84190m61076
14188B4793464p15684p52570o4037p70187n20441l93426p83599m72770O4795r11463
$$ plain form
14178 19474082 18985325 18734017 18633320 18186084 17773632 17673150 16906860 16762365 16234870
14169 16234870 15961122 15808179 15376208 15154381 14925303 14752108 14378296 14378171 13816198 13637783
14159 13637783 13162317 13084313 12863215 12875960 12395908 12203130 12139428 12169095 11686940 11530276
14149 11530276 11291571 10919913 11038055 10738791 10708332 10282966 10183270 10082541 10243265 9673069
14139 9673069 9773468 9576688 9413575 9204307 9252967 9061262 8899831 8674249 8790521 8641928
14129 8641928 8251685 8218586 8107079 7999517 7870365 8053224 7641129 7323235 7430312 7398537
14119 7398537 7382867 7306489 7029298 7223810 6837381 6949959 6767180 6365504 6718675 6339264
14109 6339264 6727837 6513788 6310751 6308317 5986185 6176132 6171812 5873659 5642308 5761313
$$ packed form
14178A9474082m88757k51308j00697m47236m12452j00482p66290j44495n27495
14169A6234870k73748j52943m31971k21827k29078j73195l73812j25n61973j78415
14159A3637783m75466p8004k21098J2745m80052j92778o3702K9667m82155j56664
14149A1530276k38705l71658J18142k99264l0459m25366r9696j00729J60724n70196
14139I673069J00399j96780j63113k09268M8660j91705j61431k25582J16272j48593
14129H641928l90243l3099j11507j07562j29152J82859m12095l17894J07077l1775
14119G398537j5670p6378k77191J94512l86429J12578j82779m01676L53171l79411
14109F339264L88573k14049k03037k434l22132J89947m320k98153k31351J19005
$$ plain form
14099 5761313 5520966 5463077 5694760 5625311 5510395 5348359 5016504 5299915 4960759 5252103
14089 5252103 5025272 4964791 5187838 4680276 4681206 4942152 4979300 4687627 4672398 4948791
14079 4948791 4393213 4267852 4452203 4623738 3989557 4150506 4392829 4556896 4349654
14070 4349654 4027042 3728577 4348649 3965975 4010809 4222423 3900966 4163839 4247910 3715705
14060 3715705 3918750 4047424 3819514 3813332 3852172 3532997 3392867 3445327 3276285 3375921
14050 3375921 3397770 3438894 3302544 3155060 3366125 3189688 3456612 3339324 3282532 3179085
14040 3179085 3120639 3302309 3120059 3022662 3274285 3413722 3119632 2985550 2995627 3221575
14030 3221575 3125875 2901685 2756146 2838892 2588388 2972250 2869614 2726802 2313602 2389201
$$ packed form
14099E761313k40347n7889K31683o9449j14916j62036l31855K83411l39156K91344
14089E252103k26831o0481K23047n07562R30K60946L7148k91673j5229K76393
14079D948791n55578j25361J84351J71535o34181J60949K42323J64067k07242
14070D349654l22612k98465O20072l82674M4834K11614l21457K62873Q4071n32205
14060C715705K03045J28674k27910o182L8840l19175j40130N2460j69042R9636
14050C375921K1849M1124j36350j47484K11065j76437K66924j17288n6792j03447
14040C179085n8446J81670j82250r7397K51623J39437k94090j34082J0077K25948
14030C221575r5700k24190j45539Q2746k50504L83862j02636j42812m13200P5599
$$ plain form
14020 2389201 2642814 2418774 2623822 2394435 2660058 2266130 2381258 2297779 2479576 2339985
14010 2339985 2706435 2291538 2769507 2442883 2283947 2402532 2181412 2337123 2319567 2055930
14000 2055930 2301933 1922427 2337616 1849027 2053238 2015791 1920961 2431266 2607889 2383824
13990 2383824 2862018 3453149 6009068 11714925 25606000 43607480 26615148 13988402
13982 13988402 8241239 6002265 4607231 4110126 3599307 3470127 3206972 2776079 2848653
13973 2848653 2543934 2653244 2677191 2530064 2423355 2116329 2619488 2362857 2094835 1889818
13963 1889818 2211407 2246217 2164475 2185721 2097299 1909646 2090746 1989458 1806299 1901252
13953 1901252 1783314 1807264 1809893 2054237 2103422 1642317 2107885 1804529 1760880 1960385
$$ packed form
14020B389201K53613k24040K05048k29387K65623l93928J15128q3479J81797j39591
14010B339985L66450m14897M77969l26624j58936J18585k21120J55711j7556k63637
14000B055930K46003l79506M15189m88589K04211l7447r4830N10305J76623k24065
13990B383824M78194N91131K555919N705857J3891075J8001480j6992332j2626746
13982A3988402n747163k238974j395034m97105n10819j29180k63155m30893P2574
13973B848653l04719J09310K3947j47127j06709l07026N03159k56631k68022k05017
13963A889818L21589L4810q1742K1246q8422j87653J81100j01288j83159R4953
13953A901252j17938K3950K629K44344M9185m61105M65568l03356m3649J99505
$$ plain form
13943 1960385 1733799 1625150 1629723 1321944 1585357 1585051 1542379 1605015 1576119 1648932 1764661
13932 1764661 1257386 1129199 1375463 1895002 1592002 1180083 1724038 1522574 1495853 1436135
13922 1436135 1395874 1402967 1369631 1104559 1197825 1644417 1693830 1725604 1444929 1680858 1332180
13911 1332180 1156473 1532960 1554066 1209606 1103209 1373698 1223657 1112307 1425765 1349669
13901 1349669 1303979 1185907 1373372 1206923 1323060 1196515 1321995 1100362 1348239 1075371
13891 1075371 1220011 1165572 1342888 1118159 1254242 1360174 1237015 1076256 1163801 1638073
13881 1638073 949253 1461814 1337321 961645 1079793 970020 1072669 1102543 748821 1154774
13871 1154774 894665 1502400 1196737 1035952 1114017 812942 789002 1036486 894578 1097571
$$ packed form
13943A960385k26586j08649M573l07779K63413l06m2672O2636k8896P2813J15729
13932A764661n07275j28187K46264N19539l03000m11919N43955k01464k6721n9718
13922A436135m0261P093l3336k65072R3266M46592M9413L1774k80675K35929l48678
13911A332180j75707L76487K1106l44460j06397K70489j50041j11350L13458p6096
13901A349669m5690j18072J87465j66449J16137j26545J25480k21633K47877k72868
13891A075371J44640n4439J77316k24729J36083J05932j23159j60759Q7545M74272
13881A638073o88820N12561j24493l75676J18148j09773J02649K9874l53722M05953
13871A154774k60109O07735l05663j60785P8065l01075k3940K47484j41908K02993
$$ plain form
13861 1097571 1241667 1129539 716715 1019943 900027 681079 1339744 1004565 839151
13852 839151 860245 1114013 967259 1175912 941569 884619 844329 1025497 1089107 817689
13842 817689 843822 990729 620516 868751 866386 944605 1103090 904168 1165799 882551
13832 882551 944465 1158799 944941 868345 792746 780195 933029 890779 905285 945416 969055
13821 969055 867124 904995 1104068 1041304 759082 693504 1133413 891752 823546 420936
13811 420936 686250 827472 722248 1046111 587916 817263 937988 598110 632739 388593
13801 388593 460461 814180 634401 579183 665114 745895 831242 681338 876850 681146
13791 681146 825087 879209 700416 1023896 807648 801130 871415 738983 668368 821382
$$ packed form
13861A097571J44096j12128m12824L03228j19916k18948O58665l35179j65414
13852H39151K1094K53768j46754K08653k34343n6950m0290J81168O3610k71418
13842H17689K6133J46907l70213K48235k365P8219J58485j98922K61631k83248
13832H82551O1914K14334k13858p6596p5599j2551J52834m2250J4506M0131K3639
13821I69055j01931L7871J99073o2764k82222o5578M39909k41661o8206m02610
13811D20936K65314J41222j05224L23863m58195K29347J20725l39878L4629k44146
13801C88593P1868L53719j79779n5218Q5931Q0781Q5347j49904J95512j95704
13791F81146J43941N4122j78793L23480k16248o518P0285j32432p0615J53014
$$ plain form
13781 821382 630000 495338 579526 773032 844979 544680 753598 732272 618498 501369
13771 501369 736183 827232 794057 376166 583448 617954 845345 805725 706555 455252
13761 455252 447889 772710 642223 494568 798882 600132 286619 590210 524941 673313
13751 673313 797278 447111 434618 773383 430966 631667 486594 827002 742199 215472
13740 882290 665597 728172 538930 436952 521943 264402 611258 642995 801730 610479
13730 610479 437325 563279 700091 151378 752639 794482 522329 463463 456850 710247
13720 710247 666816 631279 415053 489171 374405 696937 370058 380305 500471 707960
13710 707960 542302 437853 407023 306849 606072 511792 498766 863784 345466 384227
$$ packed form
13781H21382j91382j34662Q4188J93506P1947l00299K08918k1326j13774j17129
13771E01369K34814R1049l3175C76166K07282L4506K27391l9620r9170k51303
13761D55252p363L24821j30487j47655L04314j98750B86619L03591o5269J48372
13751F73313J23965l50167j2493L38765l42417K00701j45073L40408q4803B15472
13740H82290k16693O2575j89242j01978Q4991k57541L46856L1737J58735j91251
13730F10479j73154J25954J36812A51378O01261M1843k72153n8866o613K53397
13720G10247m3431l5537k16226P4118j14766L22532l26879J0247J20166K07489
13710G07960j65658j04449l0830j00174K99223r4280j3026L65018C45466L8761
$$ plain form
13700 384227 378410 389806 519561 405441 529572 417014 584377 507768 455049 398951 408855
13689 408855 357560 640662 808537 536665 463686 546745 498637 387960 301364 677658
13679 677658 785808 699798 617844 410531 224181 440844 439437 290705 438937 464579
13669 464579 590452 670660 136028 353610 391781 426236 196606 343814 538643 301940
13659 301940 584889 610904 178414 296405 372515 413353 318445 355112 256017 561667 745338
13648 745338 323651 414865 392657 506013 456123 572319 97857 369395 163257 315205
13638 315205 216913 635788 342656 430235 317908 462442 612539 174089 516849 293524
13628 293524 729258 573153 105379 482028 197180 286725 581995 387772 319273 299450
$$ packed form
13700C84227n817J1396J29755j14120J24131j12558J67363p6609n2719n6098R904
13689D08855n1295K83102J67875k71872p2979Q3059m8108j10677q6596L76294
13679F77658J08150q6010q1954k07313j86350K16663j407j48732J48232K5642
13669D64579J25873Q0208A36028K17582L8171L4455A96606J47208J94829k36703
13659C01940K82949K6015A78414J17991P6110M0838r4908L6667r9095L05650J83671
13648G45338C23651R1214k2208J13356m9890J16196I7857K71538A63257J51948
13638C15205r8292M18875k93132Q7579j12327J44534J50097A74089L42760k23325
13628B93524M35734j56105A05379L76649A97180Q9545K95270j94223o8499j9823
$$ plain form
13618 299450 383692 374193 729245 295884 387058 822337 433687 546966 365326 492070
13608 492070 361055 338077 394984 400880 -161651 333795 553436 82967 306155 373370 352424
13597 352424 516952 188839 423792 345286 347971 285270 266793 339250 188222 234927 99435
13585 325654 521773 636182 365525 315532 74457 361590 101266 247068 374739 414388
13575 414388 127004 -8392 342210 346383 65182 310136 70973 451077 351049 392628 570354
13564 570354 200152 415631 120309 351644 -15263 445477 258637 251754 291362 234190
13554 234190 277673 167692 353600 176363 404114 75374 266915 187766 214476 135180
13544 135180 489479 323929 387038 285676 275278 442346 182723 159889 542476 127495
$$ packed form
13618B99450Q4242r499L55052B95884R1174M35279l88650J13279j81640J26744
13608D92070j31015k2978N6907N896a61651C33795K19641H2967K23188O7215k0946
13597C52424J64528A88839K34953p8506K685o2701j8477P2457j51028M6705I9435
13585C25654J96119J14409k70657m9993G4457K87133A01266J45802J27671L9649
13575D14388A27004h392C42210M173F5182K44954G0973L80104j00028M1579J77726
13564E70354B00152K15479A20309K31335a5263D45477j86840o883L9608n7172
13554B34190M3483j09981J85908A76363K27751G5374J91541p9149K6710p9296
13544A35180L54299j65550O3109j01362j0398J67068A82723k2834L82587A27495
$$ plain form
13533 364711 469043 433210 -75059 95760 189033 327773 168482 116802 489645 -144749
13522 536509 -9283 343262 597780 373447 247260 -3201 249158 132361 400188 146712
13511 471226 365039 234955 257846 411419 189811 178244 -15991 -205174 665692 -101574
13500 568655 184100 219647 310013 198448 -64913 371286 436202 213164 70080 266245
13490 266245 223756 -51682 245755 235356 191519 -56767 99234 106044 406656 -200091 351927
13478 228234 -239879 53609 318226 495553 239940 72706 -125557 301456 232046 317317
13468 317317 148617 -152209 308372 221182 125171 298772 407149 276214 216848 283538
13458 283538 288788 -105844 153778 169767 297527 215338 177257 423140 295178 111628
$$ packed form
13533C64711J04332l5833g5059I5760R3273J38740j59291n1680L72843a44749
13522E36509i283C43262K54518k24333j26187c201B49158j16797K67827A46712
13511D71226j06187j30084K2891J53573A89811j1567a5991j89183F65692a01574
13500E68655A84100L5547R0366j11565f4913C71286O4916B13164G0080J96165
13490B66245m2489e1682B45755j0399m3837e6767I9234O810L00612b00091C51927
13478B28234b39879E3609K64617J77327B39940G2706a25557C01456o9410Q5271
13468C17317A48617a52209C08372q7190r6011J73601J08377j30935n9366O6690
13458B83538N250a05844A53778J5989J27760q2189l8081K45883j27962A11628
$$ plain form
13447 132945 19761 144865 77934 137509 202725 267076 122125 191642 283447 366088 300264
13436 300264 30790 482485 -213002 -129588 262958 376973 153390 43998 113880 171303
13426 171303 104555 -51872 325685 135082 283013 110875 53517 167277 450227 -137865
13415 251662 138404 406552 116565 58137 336644 72750 162199 7971 22433 314969 62628
13403 191753 144339 111579 -217771 127526 155083 250757 365707 83369 182235 4378 -94984
13391 231468 54483 192554 224212 152769 477188 176497 192757 493466 145366 160632
13381 160632 -101268 3216 376745 253230 214839 69429 289520 108876 -6834 -5121 185365
13369 190879 283789 50978 344499 29746 62493 -61432 273324 128059 216055 192470 185500
$$ packed form
13447A32945A9761J25104o6931N9575O5216O4351A22125O9517R1805Q2641o5824
13436C00264C0790M51695b13002Q3414B62958J14015A53390D3998O9882N7423
13426A71303o6748e1872C25685A35082J47931A10875E3517J13760K82950a37865
13415B51662j13258K68148A16565E8137K78507G2750Q9449G971J4462K92536F2628
13403A91753m7414l2760b17771A27526K7557R5674J14950H3369R8866D378i4984
13391B31468E4483J38071L1658p1443L24419A76497J6260L00709A45366J5266
13381A60632a01268C216L73529j23515l8391F9429K20091A08876f834J713A85365
13369A90879R2910E0978K93521B9746L2747f1432B73324A28059Q7996k3585o970
$$ plain form
13358 185500 196964 230205 371884 37309 -142909 418966 135879 182351 513475 230832
13347 86966 390548 189172 239084 89916 269635 387991 204435 83578 21562 191019
13337 191019 175574 146487 579413 5233 122156 173525 277050 94801 100305 137807 127905
13326 127905 372731 187473 227176 198639 45385 463866 -75927 286021 288790 152149 200559
13315 200559 385281 168632 349144 44519 209878 416621 229578 493955 358491 233497
13305 233497 230968 294852 -71827 81931 121493 24806 348533 202303 688 160482 180290
13294 180290 149069 279127 -51215 56090 178994 -38611 208983 -121997 120743 175189
13284 175189 79687 36069 243561 -119337 82473 414807 46854 -16176 14805 -58850 -148860
$$ packed form
13358A85500J1464L3241J41679C7309a42909D18966A35879M6472L31124B30832
13347H6966L03582A89172M9912H9916J79719J18356j83556H3578B1562J69457
13337A91019j5445k9087M32926E233J16923N1369J03525I4801N504L7502r902
13326A27905K44826j85258L9703k8537D5385M18481g5927B86021K769j36641M8410
13315B00559J84722A68632J80512D4519J65359K06743j87043K64377j35464j24994
13305B33497k529O3884g1827H1931L9562B4806L23727j46230F88J59794J9808
13294A80290l1221J30058e1215E6090J22904c8611B08983a21997A20743N4446
13284A75189G9687C6069K07492a19337H2473L32334D6854a6176A4805e8850r0010
$$ plain form
13273 -148860 -56355 53083 -33823 -61499 32858 -19865 136901 131800 300840 44684 -116139
13261 202021 33874 217230 561679 248061 18992 279234 118039 207245 -14848 -100291
13251 -100291 71488 334716 46156 320083 -138668 268326 -112530 357836 336519 -228106
13240 141613 294243 251920 36494 -44027 99697 159392 -155648 441673 77343 221297 -79510
13228 54805 158545 -150033 256591 -6016 96892 112315 -57598 254332 278868 152729 20650
13216 -69490 224980 181693 -15605 45867 65476 71219 -293561 100518 167675 80845 216491
13205 216491 186528 218652 122141 -188064 -61375 -16585 79313 249873 96847 323745 128458
13193 157047 171404 60034 23735 -178437 -49856 -50248 -219161 -127577 185198 118130 75765
$$ packed form
13273a48860e6355E3083c3823k7676C2858a9865A36901n101J69040D4684a16139
13261B02021C3874J83356L44449B48061A8992K60242A18039Q9206a4848q5443
13251a00291G1488K63228D6156K73927a38668B68326a12530C57836k1317b28106
13240A41613J52630m2323C6494d4027I9697N9695a55648D41673G7343J43954g9510
13228E4805J03740a50033B56591f016I6892J5423e7598B54332K4536j26139B0650
13216f9490B24980m3287a5605D5867J9609N743b93561A00518O7157H0845J35646
13205B16491k9963L2124r6511a88064f1375a6585G9313J70560I6847K26898A28458
13193A57047J4357F0034B3735a78437d9856l92j68913R1584A85198o7068m2365
$$ plain form
13182 75765 114452 143216 360882 3620 5657 114621 56068 -31139 265767 176090 143581
13171 143581 156627 -18653 115530 189300 162135 -170180 112406 149997 45129 186582 314784
13160 314784 78098 192829 216660 373739 161008 27707 315410 271705 192836 156690 123393
13149 123393 97939 74514 -53908 -55362 334993 206303 3262 -7590 -252554 66092 -56474
13137 -87621 8153 85410 98973 -8588 163640 -24267 123034 -118336 66473 146632 -122151
13125 194937 -351922 97967 2189 324939 52894 226907 -43410 37217 32364 -59578 229655
13113 -289858 134209 -4076 -213145 91875 -152336 -148125 174920 136647 -224402 -8245 -450782
13102 -450782 142815 19155 -73409 353944 24572 -8409 -136205 294610 109284 65221 212947
$$ packed form
13182G5765L8687K8764K17666C620K037J08964E6068c1139B65767q9677l2509
13171A43581J3046a8653A15530P3770k7165a70180A12406L7591D5129J41453J28202
13160C14784G8098J14731K3831J57079A61008B7707K87703m3705p8869l6146l3297
13149A23393k5454k3425e3908j454C34993j28690C262g590k44964F6092e6474
13137h7621H153P7257J3563h588A63640b4267A23034a18336F6473Q0159a22151
13125A94937c51922I7967B189L22750E2894J74013d3410C7217m853e9578B29655
13113b89858A34209d076k09069I1875a52336M211A74920l8273b24402h245m42537
13102d50782A42815A9155g3409C53944B4572h409j27796B94610A09284m4063J47726
$$ plain form
13091 212947 70344 -160280 278534 90798 -49454 -241719 34592 305840 -41276 172891
13080 205549 -55456 -230857 -38881 -26679 -118897 84686 -21156 130043 -100201 72932 -82139
13068 -326684 330843 -101986 142177 197227 206544 -364277 142303 -76097 -184846 179715
13057 147868 -103725 38071 226929 107493 -124653 66377 65721 225263 270510 205722 -781
13045 268730 -113962 -39761 -102914 -177865 -308478 -244520 189791 56558 -249272 -30270 425262
13033 -279506 258742 375616 -299487 -32180 379847 73986 204382 -133322 -99172 20200
13022 273895 749054 54591 -168298 166931 -86021 109345 25122 -59778 379032 146814
13011 426415 19933 -44570 4147 72019 171310 160351 -37701 112977 195643 183304 140622
$$ packed form
13091B12947G0344a60280B78534I0798d9454j92265C4592K71248d1276A72891
13080B05549e5456j75401c8881J2202r2218H4686b1156A30043a00201G2932h2139
13068c26684C30843a01986A42177N5050R317c64277A42303g6097j08749A79715
13057A47868a03725C8071J88858A07493a24653F6377o56J59542M5247o4788g81
13045B68730a13962c9761o3153p4951j30613O3958A89791E6558b49272c0270D25262
13033b79506B58742J16874b99487c2180C79847G3986J30396a33322L4150B0200
13022B73895M75159E4591a68298A66931h6021A09345B5122e9778C79032A46814
13011D26415A9933d4570D147O7872R9291j0959c7701A12977Q2666j2339m2682
$$ plain form
13000 140622 146596 -38343 -5728 48092 -357809 -30463 -37751 233741 62116 76618 14941 -204007
12987 -79111 183556 -69087 184732 -53533 209710 84322 64324 -101012 -122128 -144357 -31094
12975 277523 -141890 160382 -171732 48182 142679 -31358 136902 -51146 3161 223716 138218
12964 138218 -351724 183484 54982 -106879 -233032 31009 -33866 -66343 -34900 73033 158972
12953 158972 265678 68853 -89006 222912 -224807 16489 -137587 186922 236619 -575 -60824
12942 -60824 21568 -20598 -202098 -1748 242909 -92578 319404 160330 -168660 -483610 73515
12930 -266517 104909 -147750 -150820 58952 -93447 86801 177385 -28411 151525 -206562 454060
12918 -101785 -118312 244097 -267671 -23025 7421 107892 -1408 144368 29870 -345713 73166
$$ packed form
13000A40622N974c8343e728D8092c57809c0463p288B33741F2116J4502A4941b04007
12987g9111A83556f9087A84732e3533B09710H4322j9998a01012k1116k2229c1094
12975B77523a41890A60382a71732D8182R4497c1358A36902e1146C161K20555q5498
12964A38218c51724A83484E4982a06879j26153C1009c3866l2477L1443G3033Q5939
12953A58972J06706F8853h9006B22912b24807A6489a37587A86922M9697e75o0249
12942f0824B1568b0598j81500a748B42909i2578C19404j59074a68660l14950G3515
12930b66517A04909a47750l070E8952i3447H6801R0584b8411A51525b06562D54060
12918a01785j6527B44097b67671b3025G421J00471a408A44368B9870c45713G3166
$$ plain form
12906 46501 -68370 177081 71884 69714 -97380 -200992 93965 -213157 76402 -44162 -128847
12895 -128847 386906 -150031 -7705 89072 -174983 -162756 -55042 -35416 -229573 115369 43691
12883 -167068 203435 -78090 202232 -53081 -172570 111797 -59050 -10823 31895 4867 343418
12872 343418 -143569 -4865 215320 112663 -234883 186262 -73686 211617 -61128 2220 26259
12861 26259 155658 -116645 -18655 -253323 43027 -10240 -112178 140055 -248778 -44411
12850 122179 -26467 -98549 -82299 -110519 -188241 285854 -37301 -209004 422002 142454 -90915
12838 194591 -247048 -22590 -43761 66283 121113 51735 92568 -100489 -85018 23147 44843
12827 44843 30045 -82888 -317705 -180119 -122995 -237885 -295124 273374 46627 -414539 280231
$$ packed form
12906D6501f8370A77081G1884k170i7380j03612I3965b13157G6402d4162q4685
12895a28847C86906a50031g705H9072a74983J2227e5042J9626j94157A15369D3691
12883a67068B03435g8090B02232e3081j19489A11797e9050a0823C1895D867L38551
12872C43418a43569d865B15320j02657b34883A86262g3686B11617f1128B220K4039
12861B6259J29399a16645a8655k34668D3027a0240j01938A40055b48778d4411
12850A22179b6467p2082J6250k8220p7722B85854c7301j71703D22002A42454i0915
12838A94591b47048b2590k1171F6283N4830E1735M0833a00489J5471B3147K1696
12827D4843j4798h2888k34817J37586N7124j14890n7239B73374D6627d14539B80231
$$ plain form
12815 266411 5965 -19551 -120099 -133241 -184311 -3182 192539 40371 95715 182580 -237681
12803 200983 158752 17107 -93547 49181 174590 166167 146465 262144 106528 -18162 219006
12791 -176088 144177 -74655 -257476 134353 71732 -225566 104447 22446 -75915 95688
12780 26743 49622 210987 24909 18301 99902 -5551 -25485 104101 313563 -119656 -201806
12769 -201806 59234 -234348 172096 -258276 128962 95174 139217 309791 -39213 -446154
12759 -446154 212642 3826 307132 127651 22841 -370176 -252187 -237261 -61866 221352
12748 -2792 -112149 47965 -230854 25109 -372166 289274 42816 -388579 318048 -151392
12737 324669 107883 -46475 -289489 113389 -252118 96645 -254078 42386 42306 3327 61549
$$ packed form
12815B66411E965a9551j00548j3142n1070c182A92539D0371N5344Q6865b37681
12803B00983m2231A7107i3547D9181J25409q423j9702J15679A06528a8162B19006
12791a76088A44177g4655j82821A34353o2621b25566A04447B2446g5915I5688
12780B6743K2879J61365B4909o608Q1601e551j9934A04101K09462a19656q2150
12769b01806E9234b34348A72096b58276A28962l3788M4043J70574c9213m06941
12759d46154B12642C826L03306A27651B2841c70176J17989J4926f1866B21352
12748b792j09357D7965b30854B5109c72166B89274D2816c88579C18048a51392
12737C24669A07883d6475k43014A13389b52118I6645b54078D2386q0C327N8222
$$ plain form
12726 61549 -62984 -237439 98898 -156230 271599 -91352 88841 -21955 -168498 -52754 -232824
12715 -232824 71346 103619 493987 34264 -160867 -28397 70131 288146 507646 -36757 85816
12703 92617 -7754 -126703 -31221 -90321 49160 102895 -57936 7294 80365 -296048 236640
12691 -199175 213085 28829 -203952 -118512 -48922 -64547 5461 247289 12907 377683 -96787
12679 178433 -202121 152192 234220 178149 100384 165883 323720 -132425 -72242 221313
12668 -128761 33063 -188081 -57345 -295826 167407 -152225 226 -58029 76247 -110796 -110830
12657 -110830 357729 -159986 70005 132140 -20681 -39504 205259 -49633 86736 77162 212434
12646 212434 670 -5152 9862 419076 89937 220674 14419 310698 -18326 357565 -196552
$$ packed form
12726F1549f2984j74455I8898a56230B71599i1352H8841b1955j46543e2754j80070
12715b32824G1346L2273L90368C4264a60867b8397G0131K18015K19500c6757H5816
12703I2617g754j18949c1221n9100D9160N3735e7936G294P3071b96048B36640
12691a99175B13085B8829b03952Q5440d8922j5625E461K41828A2907L64776i6787
12679A78433b02121A52192Q2028n6071p7765O5499J57837a32425O0183B21313
12668a28761C3063a88081e7345k38481A67407a52225B26e8029G6247a10796l4
12657a10830C57729a59986G0005O2135b0681j8823B05259d9633H6736r574J35272
12646B12434F70e152I862M09214H9937J30737A4419K96279a8326C57565a96552
$$ plain form
12634 95838 91015 150822 53351 -31091 -168439 416140 29713 195550 -44214 -178127 -76113
12622 -110384 101819 160562 48801 22491 -96815 245340 204498 1336 257411 76549 230143
12611 230143 138403 -137234 -84939 -31424 184382 -76021 148142 31977 180244 -31102 -282946
12600 -282946 -239294 -131676 -23416 -125737 -66389 -12582 299866 274240 159312 -9118 44249
12588 140821 -159501 191903 -152250 -30646 210010 55230 323028 225309 58520 -10182
12577 -19370 74420 243694 -3965 47580 181398 6964 -285223 -196476 -315788 253176 -29502
12565 327422 288314 73661 -13684 158869 -82550 -271750 -362447 162302 -257949 -84671 -87592
12554 -87592 -81347 198251 -277017 -235502 28328 134670 -355363 -60444 325177 -267751 42870
$$ packed form
12634I5838m823N9807E3351c1091j37348D16140B9713J65837d4214j33913g6113
12622a10384A01819N8743D8801B2491i6815B45340m0842A336K56075G6549J53594
12611B30143r1740a37234N2295c1424A84382g6021A48142C1977J48267c1102k51844
12600b82946M3652J07618b3416j02321N9348a2582B99866k5626j14928i118D4249
12588A40821a59501A91903a52250c0646B10010E5230K67798r7719E8520a0182
12577a9370G4420J69274c965D7580J33818F964b85223Q8747j19312B53176b9502
12565C27422l9108G3661a3684A58869h2550j89200r0697A62302b57949h4671k921
12554h7592O245A98251b77017M1515B8328J06342c55363f0444C25177b67751D2870
$$ plain form
12542 278664 -251187 56183 -61526 -121142 -97947 155966 -11203 12855 209776 -136293 91714
12530 -299867 -366297 327357 -174547 -29379 -143854 -190736 279702 99762 -50574 236981
12519 -33720 -120802 233470 -39627 70492 219233 -372096 -149147 44779 246534 99993 -153492
12507 197271 461420 143944 183854 213592 222589 32841 241138 106082 -205587 -234152 -7014
12495 27573 237028 -184408 -1156 -165824 57310 -46921 221731 -217095 -88482 66936 -242410
12483 121867 -272760 128761 53160 339608 -182450 -158197 19196 -259863 57600 -192737
12472 -114642 43277 325437 207349 -193695 -193351 20415 -58216 145672 -182851 -37358 -164396
12461 -164396 -280170 152448 189884 -100011 228749 -126599 -11003 157384 98805 111244
$$ packed form
12542B78664b51187E6183f1526n9616K3195A55966a1203A2855J96921a36293I1714
12530b99867o6430C27357a74547b9379j14475m6882B79702I9762e0574B36981
12519c3720q7082B33470c9627G0492J48741c72096a49147D4779K01755I9993a53492
12507A97271K64149A43944L9910K9738Q997C2841K08297A06082b05587k8565g014
12495B7573K09455a84408a156j64668E7310d6921B21731b17095h8482F6936b42410
12483A21867b72760A28761E3160K86448a82450K4253A9196b59863E7600a92737
12472a14642D3277K82160j18088a93695L44B0415e8216A45672a82851c7358j27038
12461a64396j15774A52448L7436a00011B28749a26599a1003A57384n8579J2439
$$ plain form
12451 111244 -252992 8217 -44907 -223324 -137222 59298 -55193 -224818 28515 207628 262855
12440 262855 146780 -143117 -228700 67709 -155675 -73718 58517 99782 41898 100303 207077
12429 207077 -36374 -262278 -214532 -36163 9777 -324390 169734 95386 -117193 -58697 921
12417 80087 111845 290989 -272097 192397 56512 -112986 19847 -20265 -52124 -354904 -156390
12405 130565 -80175 -134114 210068 -106551 -386397 42271 -312 -11767 -304964 -103516 81238
12393 -57054 -292293 -39210 128317 -321230 57590 13610 -190234 -188818 -171356 -47902 28739
12381 288692 -102575 -137942 74788 -181573 316395 -76867 467087 65767 -15693 -226756
12371 -226756 45666 -147992 192549 -227849 -206257 56648 337389 -109008 240351 -15340
$$ packed form
12451A11244b52992H217d4907j78417Q6102E9298e5193j69625B8515J79113N5227
12440B62855j16075a43117q5583F7709a55675g3718E8517M1265D1898N8405J06774
12429B07077c6374k25904M7746c6163I777c24390A69734p4348a17193N8496I21
12417H0087L1758J79144b72097A92397E6512a12986A9847b0265l1859l02780a56390
12405A30565h0175n3939B10068a06551k79846D2271c12j1455k93197a03516H1238
12393e7054k35239c9210A28317c21230E7590A3610a90234J416J7462d7902B8739
12381B88692a02575l5367G4788a81573C16395g6867D67087F5767a5693k11063
12371b26756D5666a47992A92549b27849K1592E6648K80741a09008B40351a5340
$$ plain form
12360 -86491 -30420 -21602 -127507 79409 155946 237841 -85815 -76940 7526 147413 -215637 -52836
12347 196548 -177940 -117149 -206981 302498 -153241 -59931 -94176 55495 -77979 -172259 270007
12335 -128757 -239540 144761 159735 290746 221277 132713 -173442 -239966 118355 -4340 193039
12323 -122665 473796 -95137 118414 385062 144147 51055 -209504 -143461 -109130 -101406 236729
12311 76026 -142243 -62771 -416412 74077 158600 78545 -298529 -113162 -139989 -6476 390847
12299 -167367 332872 59683 -30044 -76066 30531 287240 -125098 -315805 39844 9842 -108983
12287 191820 174193 -84270 58775 -239420 65800 -11634 59939 -63575 252031 -179821 -121902
12276 -121902 228382 76012 -35964 69829 208355 -217703 139303 -153697 91212 61618
$$ packed form
12360h6491c0420Q818j05905G9409P6537Q1895h5815Q875G526J39887b15637e2836
12347A96548a77940O0791q9832C02498a53241e9931l4245E5495g7979r4280B70007
12335a28757j10783A44761J4974J31011o9469q8564a73442o6524A18355d340A93039
12323a22665D73796i5137A18414K66648A44147E1055b09504O6043L4331P724B36729
12311G6026a42243f2771l53641G4077Q4523G8545b98529a13162k6827f476C90847
12299a67367C32872E9683c0044m6022C0531K56709a25098j90707C9844I842a08983
12287A91820j7627h4270E8775b39420F5800a1634E9939f3575B52031a79821N7919
12276a21902B28382G6012c5964F9829J38526b17703A39303a53697I1212k9594
$$ plain form
12266 61618 207052 16243 219793 -149691 -130483 -124016 106545 -304742 -89367 64945 -68738
12254 -162596 -29905 15194 108751 33238 315442 -22201 303884 311885 -238899 62261 -148065
12242 -225108 28344 7228 288164 -4384 282435 -34791 -95217 169788 65822 286839 -192406
12230 -100510 -99629 163770 -148760 378953 240888 376038 -79043 258389 128521 224670
12220 224670 307081 40416 273113 185396 15695 365941 174914 142666 -86210 13873 -15725
12208 300347 239675 140184 43611 88635 190771 238229 310979 269563 -34602 296258 191568
12197 191568 193047 -93154 -105183 -173121 253767 108118 -144040 273304 305200 194944 168943
12186 168943 181275 269198 -50759 -108423 178507 45107 39358 425056 -42036 4144 170985
$$ packed form
12266F1618J45434A6243K03550a49691J9208O467A06545c04742h9367F4945f8738
12254a62596b9905A5194R3557C3238K82204b2201C03884Q001b38899F2261a48065
12242b25108B8344G228K80936d384B82435c4791o0426A69788F5822K21017a92406
12230a00510Q81A63770a48760C78953j38065J35150g9043B58389A28521R6149
12220B24670Q2411D0416K32697q7717A5695L50246A74914l2248h6210A3873a5725
12208C00347o0672r9491D3611M5024J02136M7458P2750m1416c4602B96258j04690
12197A91568J479i3154j2029o7938B53767A08118a44040B73304L1896j10256k6001
12186A68943J2332Q7923e0759n7664A78507D5107n749L85698d2036D144J66841
$$ plain form
12175 170985 102008 -169439 322131 226622 -34261 115728 66315 -29661 151660 195762 -135527
12163 -152498 44925 182264 117623 274888 305984 119026 -25273 153690 -130497 124280
12152 -132961 521643 132484 69479 219242 94125 344770 -131186 85055 146549 179738
12142 179738 -43718 233998 103201 147605 -102996 -49698 -12674 160083 190068 -154342
12131 184526 98164 36335 -264368 -7781 -72439 15969 -109779 100235 62759 47686 -87603
12119 -208211 -31843 -6066 997 61657 -131668 5532 139440 149722 163795 -183202 -189831 -76312
12106 -73819 75418 67609 -1305 212145 -93015 -193796 222932 -179687 161198 -145963 -2665
12094 34093 164558 -33551 116331 -7340 -158604 -58907 -115701 -313477 126385 -56636 265391
$$ packed form
12175A70985o8977a69439C22131r5509c4261A15728m9413b9661A51660M4102a35527
12163a52498D4925J37339o4641J57265L1096A19026b5273A53690a30497A24280
12152a32961E21643A32484o3005J49763I4125K50645a31186H5055O1494L3189
12142A79738d3718B33998A03201M4404a02996d9698a2674A60083K9985a54342
12131A84526q6362C6335b64368g781o4658A5969a09779A00235l7476j5073h7603
12119b08211c1843f066I97O0660a31668E532J33908J0282J4073a83202o629g6312
12106g3819G5418p809a305B12145i3015j00781B22932a79687A61198a45963b665
12094C4093J30465c3551A16331g340j51264e8907n6794j97776A26385e6636B65391
$$ plain form
12082 -79038 -26675 170626 202862 134311 207606 24707 127991 -228699 133203 -108265 71646
12070 164185 -228180 -434882 -27665 -73619 206275 98345 536650 110918 805626 427494
12060 427494 192537 122943 -21179 81868 124174 182090 -273945 152879 -208697 339314
12049 -190477 -143426 -50373 62334 38841 -181223 202717 -12152 134813 -43212 -301303 90838
12037 65480 -336824 299948 187271 123623 361999 -38515 -132153 -335282 77717 20180 42982
12026 42982 -104635 59016 38545 -18890 133818 -172928 -52791 -126164 -79020 -83598 -46099
12015 -46099 30925 -59849 -139751 148269 53730 249687 -8322 62790 -41957 170711 -28171
12003 340885 234096 -7156 269914 -23726 -146890 -159352 162731 30845 -107213 -256375
$$ packed form
12082g9038b6675A70626L2236o8551P3295B4707J03284b28699A33203a08265G1646
12070A64185b28180k06702b7665m5954B06275I8345M38305A10918O94708l78132
12060D27494A92537o9594b1179H1868M2306N7916b73945A52879b08697C39314
12049a90477M7051e0373F2334k3493a81223B02717a2152A34813d3212k58091I0838
12037F5480c36824B99948j12677o3648K38376c8515r3638k03129G7717B0180K2802
12026D2982a04635E9016k0471a8890A33818a72928e2791p3373M7144m578L7499
12015d6099C0925e9849p9902A48269E3730J95957h322F2790d1957A70711b8171
12003C40885j06789g156B69914b3726j23164j2462A62731C0845a07213j49162
$$ plain form
11993 -256375 -56494 88283 -71993 231027 -121286 255298 -9514 -199839 10150 -985 18233
11981 -223357 173690 34307 35160 5212 114833 19035 -42073 -66212 24291 -91928 -137825 251074
11968 -50032 -38438 -256972 -12581 210936 -56101 134143 -43331 266124 71774 -21835 -34007
11957 -34007 -192496 -26119 -128310 -116741 30937 -115575 -65800 -245614 -89323 -243707 -6310
11945 229630 425601 37844 -173673 109148 -152233 -73252 -2867 120042 -99222 -83329 15200
11933 -34027 -216433 72029 -179396 101309 246757 -75232 -356961 168909 -314741 289868
11922 -24453 -19875 -97760 -85700 -343370 70471 -202662 -85841 -388093 -271201 71088 -207757
11910 -120496 555822 -78109 -144079 162065 47837 -47025 -326117 -122719 71788 193171
$$ packed form
11993b56375e6494H8283g1993B31027a21286B55298i514j90325A0150i85A8233
11981b23357A73690C4307Q53E212J09621A9035d2073k4139B4291i1928m5897B51074
11968e0032J1594k18534a2581B10936e6101A34143d3331B66124G1774b1835j2172
11957c4007j58489b6119j02191J1569C0937a15575M9775j79814h9323j54384f310
11945B29630J95971C7844a73673A09148a52233g3252b867A20042i9222J5893A5200
11933c4027j82406G2029a79396A01309J45448g5232k81729A68909c14741B89868
11922b4453M578p7885J2060k57670G0471b02662h5841l02252J16892G1088b07757
11910a20496E55822g8109o5970A62065D7837d7025k79092a22719G1788J21383
$$ plain form
11900 193171 -165417 -221238 -5837 -25965 -283834 -23964 40764 -51242 80093 46526 110524
11889 110524 -87947 -63730 -74782 -40512 -64167 40244 -177386 -90620 86377 -164020 -102902
11878 -102902 91410 -96412 -269119 -50535 -207803 -75873 -27529 -65807 -84603 176724 -143608
11866 46321 -258512 43251 93412 -283046 -194644 -173970 13490 150912 78902 -166562 -184726
11855 -184726 130236 -232905 41255 49252 -89701 246388 180238 -215677 297239 -19017 61713
11843 -327593 -16422 -235118 -61785 -150804 -9307 30837 185876 2029 23629 44823 -32311
11831 -298113 110713 327549 167528 39144 -165365 155448 -75264 172449 -169644 -348081
11821 -348081 -113851 -267663 3615 -252427 -195623 -235996 -83752 167516 -46311 -531735 -17404
$$ packed form
11900A93171a65417n5821e837k0128k57869b3964D0764e1242H0093l3567O3998
11889A10524h7947K4217j1052L4270k3655D0244a77386Q6766H6377a64020O1118
11878a02902I1410i6412j72707e0535j57268g5873b7529l8278j8796A76724a43608
11866D6321b58512D3251N0161b83046Q8402K0674A3490J37422p2010a66562j8164
11855a84726A30236b32905D1255P997h9701B46388o6150b15677B97239a9017F1713
11843c27593a6422k18696f1785q9019i307C0837J55039B029K1600K1194c2311
11831b98113A10713K16836j60021C9144a65365A55448g5264A72449a69644j78437
11821c48081a13851j53812C615b52427N6804m0373h3752A67516d6311m85424a7404
$$ plain form
11809 -119174 -327758 -57264 -92352 -3039 234968 -165925 137949 50165 125664 -29932 -28460
11798 -28460 166274 -178918 -197027 -269400 371858 197624 -101047 -10873 -19724 -81282 250159
11786 -43695 39168 -34852 245243 -124979 131499 -27168 126690 -32708 -231364 -82025 -166470
11775 -166470 -196589 10109 -23807 -137786 63332 297930 -222711 -61940 -304135 -55073 -105081
11764 -105081 50972 -40470 -163282 48860 247756 -56877 -174456 -6260 -338101 -4255 5260
11752 108724 -193047 28943 269776 22792 -299057 -372826 -123383 271232 262552 -103919
11741 -338490 -227583 -18579 -127279 177246 -121207 323701 21771 -562061 -11529 -63262
11731 -63262 -244725 148762 -375299 375058 72854 180852 141130 77797 167432 53329 -156831
$$ packed form
11809a19174k08584e7264l5088c039B34968a65925A37949E0165P5499b9932J472
11798b8460A66274a78918j8109p2373C71858j74234a01047a0873q851o1558B50159
11786d3695C9168c4852B45243a24979A31499b7168A26690c2708j98656h2025q4445
11775a66470l0119A0109b3807j13979F3332K34598b22711f1940k42195e5073n0008
11764a05081E0972d0470j22812D8860J98896e6877j17579f260l31841d255E260
11752A08724a93047B8943K40833B2792b99057p3769a23383B71232q680a03919
11741c38490J10907a8579j08700A77246a21207C23701B1771e62061a1529n1733
11731f3262j81463A48762c75299C75058G2854J07998l9722o3333Q9635E3329a56831
$$ plain form
11719 232434 99205 189761 107650 -36921 -78377 206990 -69438 128273 140026 -342507 49133
11707 -49205 -322625 243740 19428 -249704 -139339 29372 -72476 -155191 49635 -145032 175633
11695 -4131 208459 389166 35733 -358232 -128363 195617 -17612 97179 -149891 186795
11684 -66532 212611 -137902 -43818 252772 212375 -105364 5327 257951 264666 -69989 -293272
11673 -293272 -36864 179438 -51324 -89352 -278654 63164 29392 -115408 137491 -52464 -17403
11661 195714 200576 24659 162471 34383 -61987 18124 206090 -84667 159658 -96656 136358
11649 -126054 186896 157062 -89129 545189 21904 -47279 -165277 120496 -59529 -69064 -337935
11638 -337935 -89396 106778 -110978 -74727 31384 157207 119413 24099 224225 -247517
$$ packed form
11719B32434I9205R0556q2111c6921m1456B06990f9438A28273J1753c42507D9133
11707d9205k73420B43740A9428b49704J10365B9372g2476q2715D9635a45032A75633
11695d131B08459J80707C5733c58232a28363A95617a7612I7179a49891A86795
11684f6532B12611a37902d3818B52772m0397a05364E327K52624O715f9989k23283
11673b93272c6864A79438e1324l8028j89302F3164B9392a15408A37491e2464a7403
11661A95714M862B4659J37812C4383f1987A8124J87966h4667A59658i6656A36358
11649a26054A86896k9834h9129E45189B1904d7279j17998A20496e9529r535k68871
11638c37935h9396A06778a10978L6251C1384J25823l7794B4099K00126b47517
$$ plain form
11627 81878 -350221 -50511 -301165 104274 53306 212072 -35473 -143104 -29711 97091 -319531
11615 -165164 194951 233180 50461 -101173 -253266 165508 -252200 18339 -46531 15011
11604 77282 -129199 -202354 -107703 -74971 -416270 71810 -119229 -110358 50184 184388 19566
11592 348659 198641 -261604 153421 5613 23304 -269709 -16434 64646 196527 189979 108129
11581 108129 125555 -155480 -49844 75015 174266 103783 -75527 200444 -8670 260709 140717
11570 140717 25688 2748 -122180 -477329 -150101 49791 -159406 -104562 -182557 155430 240272
11559 240272 126681 -8838 66677 154287 -48290 1933 6394 292697 -199588 -130969 -91011
11548 -91011 -201563 190676 -100101 115328 -192438 120550 127034 -293841 -26120 14426
$$ packed form
11627H1878c50221e0511k50654A04274n0968J58766c5473j07631b9711I7091c19531
11615a65164A94951L8229E0461a01173j52093A65508b52200A8339d6531A5011
11604G7282a29199p3155R4651L2732l41299G1810a19229Q871E0184J34204A9566
11592C48659j50018b61604A53421E613J7691b69709a6434F4646J31881o548q1850
11581A08129J7426a55480d9844G5015R9251p0483g5527B00444h670B60709j19992
11570A40717B5688B748a22180l55149a50101D9791a59406N4844p7995A55430Q4842
11559B40272j13591h838F6677Q7610d8290A933M461K86303a99588O8619L9958
11548i1011j10552A90676a00101A15328a92438A20550O484b93841b6120A4426
$$ plain form
11537 -74475 263467 431435 210405 -125207 180279 -43798 16898 26416 -215812 -76400 -19819
11525 -156589 252295 93471 66684 27891 -178075 371363 -54370 -94731 106170 -144034
11514 63220 57381 41768 139638 39764 226983 104540 57382 32457 37896 -26640 330933
11502 222947 -166735 -6733 -34604 317605 217831 147196 127180 -7146 -123695 29110 300289
11491 300289 35 250512 -90871 406385 1316 -20482 260282 442631 -31901 143449 53466
11479 21094 73077 -39630 -14697 203915 18888 -551485 216753 -93095 -45349 -15330 -157918
11468 -157918 110266 -102867 93000 133878 -81014 114929 199875 444108 -42041 -60992 233820
11456 205852 -146846 97963 106816 25629 311867 249039 -163186 -202716 -197919 203199 428169
$$ packed form
11537g4475B63467J67968B10405a25207A80279d3798A6898R518b15812g6400a9819
11525a56589B52295I3471k6787B7891a78075C71363e4370m0361A06170a44034
11514F3220n839j5613R7870C9764J87219A04540m7158k4925N439b6640C30933
11502B22947a66735f733k7871C17605r9774p0635k0016g146j16549B9110K71179
11491C00289C5K50477i0871D06385A316b0482B60282J82349c1901A43449E3466
11479B1094N1983c9630a4697B03915A8888e51485B16753i3095d5349a5330j42588
11468a57918A10266a02867I3000M0878h1014A14929Q4946K44233d2041j8951B33820
11456B05852a46846I7963Q853B5629K86238o2828a63186l9530M797B03199K24970
$$ plain form
11445 428169 -98803 -157389 124607 15180 148472 107632 301238 -2573 -123682 -47960 -8810
11433 12063 -192927 -129011 -193620 -167778 -100997 237231 170520 30168 95873 -221356 -218013
11422 -218013 -205196 18513 -194718 -44577 -305283 250519 119136 78493 -212292 59464
11411 -302767 133398 88870 -131801 32256 -336142 -184258 120232 -178504 18279 325662
11401 325662 -80975 -75933 145170 -81805 -146123 -66010 83138 -37063 119315 -381654 -134055
11389 135406 115759 -97550 38338 -36890 -13338 -33686 -108310 45520 -6134 -74388 -34570 251117
11376 118707 -224761 141161 122309 126036 95247 -204243 17319 167167 184679 -194406 -51925
11364 -119944 -344028 -42712 46436 -283247 33909 -321836 -101616 -443884 -13325 208619
$$ packed form
11445D28169i8803n8586A24607A5180J33292m0840J93606b573j21109d7960h810
11433A2063a92927O3916o4609K5842O6781B37231o6711C0168O5705b21356L343
11422b18013J2817A8513a94718d4577k60706B50519A19136m0643b12292E9464
11411c02767A33398m4528a31801C2256c36142J51884A20232a78504A8279L07383
11401C25662h0975N042A45170h1805o4318f6010H3138c7063A19315c81654a34055
11389A35406j9647i7550C8338c6890a3338k0348p4624D5520f134o8254c4570B51117
11376A18707b24761A41161j8852L727l0789b04243A7319J49848J7512a94406e1925
11364a19944k24084d2712D6436b83247C3909c21836a01616l42268a3325B08619
$$ plain form
11353 -212061 -47628 -11631 110052 36441 -189473 49705 -190898 -143669 410900 -80798 94677
11341 -93581 -180793 -189933 -172148 -143296 76228 15801 -9581 152702 -417139 -322916 -90318 -58876
11329 -58876 199389 -37374 505116 39164 -177690 -96210 -79751 -7243 107668 -143764 19469
11317 -109174 73478 8850 -194735 25560 91233 -87542 154916 -74965 -216250 -99028 -223424
11306 -223424 325176 -315500 6760 -16373 98070 -64698 -212622 -384244 -93783 116249 354389
11295 354389 102010 -176421 213464 -93417 213232 -64860 106721 -3777 104078 -272812
11284 88101 94185 -602628 141452 -250888 62338 11931 -192078 208213 214367 94865 22268
11272 -115931 155245 -205208 -157885 218306 -332146 -247472 -100423 168089 -14396 -276426
$$ packed form
11353b12061d7628a1631A10052C6441a89473D9705a90898M7229D10900h0798I4677
11341i3581q7212r140J7785K8852G6228A5801i581A52702d17139R4223i0318L1442
11329e8876A99389c7374E05116C9164a77690Q1480J6459g243A07668a43764A9469
11317a09174G3478H850a94735B5560O5673h7542A54916g4965j41285i9028j24396
11306b23424C25176c15500F760a6373I8070f4698j47924j71622i3783A16249K38140
11295C54389A02010a76421B13464i3417B13232f4860A06721c777A04078b72812
11284H8101O084f02628A41452b50888F2338A1931a92078B08213O154I4865B2268
11272a15931A55245b05208M7323B18306c32146Q4674a00423A68089a4396k62030
$$ plain form
11262 -276426 190223 10982 -303739 -2837 -49861 -189628 440249 -210714 -56127 -195745
11252 -195745 -95670 -193067 2296 83656 -156490 46362 -140553 -169150 -62964 139262 -223056
11240 -2900 -239221 210069 37858 -154072 -40079 321454 -159731 -91842 -303650 -229155 56724
11228 -44265 125577 108038 -368535 -200969 -207164 126409 -322967 -418273 -191955 -52367 26723
11216 -25854 -269498 -501239 -117229 87113 -504984 -341877 1168 -28015 -191650 32240 -139846
11204 -251932 268036 -32633 177838 -228610 -171081 -68050 -225322 -205534 148849 -136187
11193 -7856 114607 -13205 -137299 -325832 46445 -186995 277559 -108515 -90975 -186768 -120829
11182 -120829 -279086 132979 223146 333224 -17693 52229 27014 22915 -18385 -349185 93039
$$ packed form
11262b76426A90223A0982c03739b837m7024j39767D40249b10714e6127j39618
11252a95745i5670r7397B296Q1360a56490D6362a40553k8597f2964A39262b23056
11240b900k36321B10069C7858a54072d0079C21454a59731O7889k11808P4495E6724
11228d4265A25577j7539c68535J67566o195A26409c22967r5306a91955e2367B6723
11216b5854k43644k31741a17229H7113e04984J63107A168b8015j63635C2240a39846
11204b51932B68036c2633A77838b28610N7529f8050j57272J9788A48849a36187
11193g856A14607a3205j24094j88533D6445a86995B77559a08515J7540r5793O5939
11182a20829j58257A32979R0167J10078a7693E2229k5215m099a8385l30800I3039
$$ plain form
11170 477121 1750 54280 -190113 177886 -560718 -145160 -18746 -384937 -29402 -151268
11160 -151268 26762 -112797 -128656 -2337 -3444 -33128 -264861 55158 -167118 -181514 -176621
11149 -176621 84005 -121243 -151366 -12503 8914 172917 -29759 -15737 -97738 -159263 265904
11137 21319 210109 -104788 -66243 -146072 -173485 55597 -113149 248632 -38133 -20352 84506
11125 90780 297771 241613 153968 133477 93467 -238099 11260 -295533 -3213 96724 -28848
11113 39980 -331372 -104787 270308 11728 241414 -52288 214784 -25992 402793 130903
11102 175472 113747 -19821 15175 151176 -190195 15205 -77286 -223426 223703 -13878 10323
11090 261283 -172581 214907 102394 238209 168183 230927 216084 261338 -59516 207435
$$ packed form
11170D77121A750N2530a90113A77886e60718a45160a8746l66191b9402j21866
11160a51268B6762a12797j5859b337j107k9684k31733E5158a67118j4396M893
11149a76621H4005a21243l0123a2503H914J64003b9759J4022q2001o1525B65904
11137B1319J88790a04788L8545p9829k7413E5597a13149B48632c8133J7781H4506
11125I0780K06991n6158q7645k0491m0010b38099A1260b95533c213I6724b8848
11113C9980c31372a04787B70308A1728K29686e2288B14784b5992D02793A30903
11102A75472o1725a9821A5175J36001a90195A5205g7286j46140B23703a3878A0323
11090B61283a72581B14907A02394J35815p0026O2744j4843M5254e9516B07435
$$ plain form
11079 573622 -45970 120939 326819 644347 423703 342602 -84116 -237938 289787 37577
11068 74930 24828 276911 -1159 217215 399919 297986 406504 -60704 241538 415126
11058 415126 51580 243333 235057 278951 399571 756705 181318 408143 602889 156371
11047 406869 -2055 361070 406189 431926 452213 163710 448397 261834 853634 424540
11036 265556 427960 510388 437371 390234 620582 688489 531600 559468 306539 437362
11026 437362 653921 332677 399509 445812 325040 530218 265337 394879 463958 285250
11016 285250 405926 200191 609967 321676 135267 230217 46389 402071 217118 215148
11006 215148 143683 318015 406381 526784 653253 294721 492002 144101 261978 208862
$$ packed form
11079E73622d5970A20939K05880L17528k20644q1101h4116j53822B89787C7577
11068G4930B4828K52083a159B17215J82704j01933J08518f0704B41538J73588
11058D15126E1580J91753q276M3894J20620L57134A81318K26825J94746A56371
11047D06869b055C61070M5119K5737K0287A63710K84687j86563N91800D24540
11036B65556J62404Q2428p3017m7137K30348O7907j56889K7868k52929J30823
11026D37362K16559l21244O6832M6303j20772K05178k64881J29542O9079j78708
11016B85250J20676B00191M09776k88291A35267R4950D6389L55682j84953j970
11006B15148p1465J74332Q8366J20403J26469B94721J97281A44101J17877n3116
$$ plain form
10996 208862 552110 207121 565900 526977 587254 114106 602774 415064 394784 53534
10985 643205 539770 49340 550119 452576 437760 647474 338413 546004 619152 801724
10975 801724 563855 705533 818758 1010109 1003866 1239201 1407136 1494118 1362762 1518349
10965 1518349 1348861 1513484 1588782 1930381 1079935 1226208 960864 801453 1339444 1174501
10955 1174501 1072113 1054943 1059562 1193910 1134200 970448 979103 1221640 470120 622917
10945 622917 801575 528296 229066 507282 426694 353743 208390 225733 541026 381214
10935 381214 -43960 -131238 97094 381731 63850 46962 20378 -102367 194072 167782 310273
10924 310273 212523 460382 -129084 -56003 -27202 -114467 -95467 -2022 -143442 -198723 -234183
$$ packed form
10996B08862L43248B07121L58779l8923O0277A14106M88668j87710k0280E3534
10985F43205j03435D9340N00779r7543j4816K09714l09061K07591P3148J82572
10975H01724k37869J41678J13225J91351o243K35335J67935Q6982j31356J55587
10965A518349j69488J64623P5298L41599q50446J46273k65344j59411N37991j64943
10955A174501j02388j7170M619J34348n9710j63752Q655K42537D70120J52797
10945F22917J78658k73279B29066K78216q0588p2951j45353J7343L15293j59812
10935C81214d3960q7278I7094K84637F3850j6888B0378a02367A94072k6290J42491
10924C10273r7750K47859a29084e6003b7202q7265J9000b022j41420n5281l5460
$$ plain form
10913 -234183 217619 -302572 -75970 -76472 -270839 185968 -167909 -162928 -233761 -51897 -60006
10902 -60006 -238623 226131 313678 -76538 14781 -451107 -377710 -166984 106418 238992
10892 238992 21368 1818 -131392 -124511 -43558 -116921 -14909 -251728 98393 -140419 -161177
10881 -161177 12905 85793 -173018 36521 -166912 -264580 109817 105320 -214160 -132711 77381
10869 390646 -123335 -10530 -119572 -78263 15833 -216530 -157143 20876 -129776 -103650 -33394
10857 -130654 101434 -187152 -84467 220725 292880 -156889 -99707 -9176 -21800 100416 -159484
10845 -125886 38499 34258 94497 413433 142059 232973 -228374 116927 -283966 -278723 173373
10833 85761 71645 35185 -203220 -5251 -175190 72771 71730 62607 -448951 -136534 236654
$$ packed form
10913b34183B17619c02572g5970n02j94367A85968a67909M981p0833e1897q109
10902f0006j78617B26131Q7547g6538A4781d51107P3397a66984A06418J32574
10892B38992B1368A818a31392O881d3558p3363a4909k36819I8393a40419k0758
10881a61177A2905P2888a73018C6521a66912r7668A09817m497b14160Q1449G7381
10869C90646a23335a0530j09042M1309A5833b16530N9387B0876a29776K6126c3394
10857a30654A01434a87152h4467B20725P2155a56889N7182i176j2624A00416a59484
10845a25886C8499m241O0239L18936A42059R0914b28374A16927b83966N243A73373
10833H5761j4116C5185b03220e251j69939G2771j041r123d48951a36534B36654
$$ plain form
10821 150381 156561 48093 124597 -90793 -283497 -163858 -11638 -145187 193907 -61854 -38812
10810 -38812 -40119 -369876 19027 -19115 333250 -196369 -129498 -41296 -69835 -32283 -8122
10798 97586 -38812 -366724 -161511 -46186 -382325 -126167 221447 -118917 -83596 -90511 -493652
10787 -493652 -25001 288871 -43736 -118037 71984 -249876 -170620 155539 -22564 -105820 61048
10775 8863 -61324 289527 -30673 -511819 -118416 10116 -320152 -414620 -88740 149531 -74305
10763 21338 -128230 116429 -19344 120026 -5075 -177395 -254991 -162607 -122991 -56587 -104191
10752 -104191 107600 -251268 -17841 139239 121994 -18089 118302 184500 42111 83253 -127999
10740 103831 -264624 -78087 192617 316265 213914 -194130 -263281 49964 111419 -442278
$$ packed form
10821A50381O180D8093P6504i0793j92704J19639a1638j33549A93907f1854K3042
10810c8812j307l29757A9027a9115C33250a96369O6871d1296k8539c2283h122
10798I7586c8812l27912a61511d6186l36139a26167B21447a18917L5321o915m03141
10787d93652b5001B88871d3736p4301G1984b49876P9256A55539b2564q3256F1048
10775H863f1324B89527c0673m81146a18416A0116c20152r4468h8740A49531g4305
10763B1338a28230A16429a9344A20026e075j72320p7596R2384L9616e6587m7604
10752a04191A07600b51268a7841A39239j7245a8089A18302O6198D2111M1142a27999
10740A03831b64624g8087A92617J23648j02351a94130o9151D9964O1455d42278
$$ plain form
10729 21370 -182403 -94290 -465823 -386522 -159612 -293751 -180772 -282309 96912 5884 123281
10718 123281 -174313 56507 22458 -140823 117541 -253537 -147684 -256758 -90306 -96309
10708 -96309 -143340 -27908 133663 -89347 30221 -131766 -302644 90318 -146999 -374087 10083
10696 365987 114051 34532 -150957 -59640 233868 14183 -73940 -86715 -128954 61732 -187255
10684 65908 -211926 -77896 41407 -107396 22355 -59124 -60046 75391 -22599 -103380 144279
10672 148968 -129242 -144969 -94324 -43463 -96973 83288 149823 44474 -80098 -48757 -32380
10661 -32380 -168835 -108727 -204820 -424317 170281 -175880 -181519 -29096 -137839 85822 -229776
10649 600842 -207610 99246 -217799 -70550 385752 -126811 126299 233957 -68110 -101952
$$ packed form
10729B1370a82403Q8113l71533P9301a59612j34139J12979j01537I6912E884J17397
10718A23281a74313E6507B2458a40823A17541b53537J05853j09074i0306o003
10708i6309m7031b7908A33663h9347C0221a31766j70878I0318a46999k27088A0083
10696C65987A14051C4532a50957e9640B33868A4183g3940j2775m2239F1732a87255
10684F5908b11926g7896D1407a07396B2355e9124r22G5391b2599q0781A44279
10672A48968a29242j5727N0645d3463n3510H3288O6535D4474h0098L1341J6377
10661c2380j36455O0108r6093k19497A70281a75880n639b9096j08743H5822b29776
10649F00842b07610I9246b17799g0550C85752a26811A26299J07658f8110l3842
$$ plain form
10639 -101952 280255 66287 -291950 -127605 117148 24951 134525 76826 1103 -24643 -10961
10627 -176514 -21393 -153182 56949 -55974 174567 -163235 -19878 12784 14580 -140297 -12235
10615 -199103 325692 192938 -435977 -36354 -124881 -157922 117653 -378594 -63904 -465896
10605 -465896 -159244 281177 68852 70355 -88165 37309 156198 82525 -65311 10852 -113557
10593 -240730 301525 -44891 -217752 -253640 -99686 -299848 -53392 72193 -123829 -847 332519
10581 -436111 125122 -152887 -103119 -200333 -128186 -82121 55723 -286131 22923 25453 -268978
10569 179835 -189522 -78186 -133749 57671 -40182 -191515 -275614 -67878 -83798 -126419 -40777
10557 -29956 122915 -267384 89088 -579197 -199078 66236 226567 -333322 -71639 7943 -36659
$$ packed form
10639a01952B80255F6287b91950a27605A17148B4951J09574n7699A103b4643a0961
10627a76514b1393j31789E6949e5974A74567a63235a9878A2784J796a40297a2235
10615a99103C25692j32754d35977c6354q8527l3041A17653c78594f3904m01992
10605d65896a59244B81177F8852J503h8165C7309J18889p3673f5311A0852a13557
10593b40730C01525d4891j72861l5888i9686k00162e3392G2193a23829h47C32519
10581d36111A25122a52887M9768r7214P2147M6065E5723b86131B2923K530b68978
10569A79835a89522g8186n5563E7671d0182j51333q4099f7878j5920m2621d0777
10557b9956A22915b67384H9088e79197a99078F6236J60331c33322g1639G943c6659
$$ plain form
10545 -309493 -239977 75110 352908 -99440 68604 79576 -202229 92589 234551 -29513 69997
10533 -271066 166011 -261719 -176882 -68710 -231633 74560 -149179 -119705 80665 12398 21204
10522 21204 116023 -46054 -177399 56584 127042 308826 72479 -170054 125682 139796 -122950
10510 134921 50358 194561 -138471 -147899 -107005 -210463 -241160 -79948 -283096 245410 259699
10499 259699 233993 -293275 -254290 5100 -72138 -184019 100080 288161 -30896 71215 -128089
10487 -180047 -155613 -57333 -28233 -131687 -177399 -125897 -130509 178017 54667 149876 -45425
10475 186489 289229 41453 40557 207665 240353 594565 -121442 90929 71196 6306 254595
10464 254595 38512 -65238 -228511 102014 -46600 89588 324157 -91703 168143 -390649
$$ packed form
10545c09493O9516G5110K77798i9440F8604J0972b02229I2589J41962b9513F9997
10533b71066A66011b61719Q4837f8710j62923G4560a49179K9474H0665A2398Q806
10522B1204R4819d6054j31345E6584P0458J81784G2479a70054A25682J4114a22950
10510A34921E0358J44203a38471r428M0894j03458l0697g9948k03148B45410J4289
10499B59699k5706b93275L8985E100g2138j11881A00080J88081c0896G1215a28089
10487a80047K4434e7333b8233j03454m5712N1502m612A78017E4667R5209d5425
10475A86489J02740D1453q96J67108L2688L54212a21442I0929j9733F306K48289
10464B54595C8512f5238j63273A02014d6600H9588K34569i1703A68143c90649
$$ plain form
10453 -89477 -61139 4115 -318183 117128 -279045 128715 67370 -110280 149617 -261578
10442 -151619 -322819 -280614 24768 51593 -60238 -113033 -130473 -113506 22974 132865 -50750
10430 -257856 207453 -46012 228109 70905 -16520 242631 -343663 -55188 -134893 242387
10419 -147206 -42191 117453 -131690 -348 -214867 76646 184634 -35722 29192 142887 -120242
10407 151633 -34590 -87930 55248 -234009 -302362 -172808 232887 116746 -375232 -36639
10396 -78120 -66648 192388 125325 -140084 18229 -119685 124985 249862 -4409 227326 -98050
10384 -240242 206677 92014 127491 36279 -154531 -85062 35343 100024 -174635 -123340 403809
10372 84294 -61627 70279 54577 237095 91971 -84110 242683 290527 -204210 265647 239702
$$ packed form
10453h9477K8338D115c18183A17128b79045A28715o1345a10280A49617b61578
10442a51619j71200M2205B4768K6825f0238n2795j7440J6967B2974J09891e0750
10430b57856B07453d6012B28109G0905a6520B42631c43663e5188p9705B42387
10419a47206d2191A17453a31690c48k14519G6646J07988c5722B9192J13695a20242
10407A51633c4590n3340E5248b34009o8353J29554B32887j16141c75232c6639
10396g8120J1472A92388o7063a40084A8229a19685A24985J24877d409B27326i8050
10384b40242B06677I2014L5477C6279a54531O9469C5343O4681a74635N1295D03809
10372H4294f1627G0279j5702J82518I1971h4110B42683M7844b04210B65647k5945
$$ plain form
10361 239702 117642 737393 649149 19011 281144 216904 -52459 155147 83078 -87865 -10962
10349 -148475 344782 60997 355300 473989 234639 212035 281228 -5670 169436 101956 560331
10338 560331 200933 34741 175388 304716 266254 -164731 191021 63247 103374 -270466
10327 -130126 149604 82819 175898 183585 85701 264558 34861 253652 145930 123833 161091
10316 161091 89499 94651 22509 -213296 -84314 151853 -196508 -45189 -121101 -164325 -179709
10305 -179709 -194178 255873 28597 -130431 -33465 -171240 185402 77972 -244938 103663
10294 -75480 -33298 -122828 -195557 -188955 -328791 -388260 327816 -273951 99788 -282669 -115839
10282 -316 -76013 -295877 3279 -156327 -100676 -88547 36553 197994 134966 430913 -67646
$$ packed form
10361B39702A17642O19751q8244A9011K62133o4240e2459A55147p2069h7865a0962
10349a48475C44782F0997K94303J18689B34639k2604O9193e670A69436o7480M58375
10338E60331B00933C4741J40647J29328l8462a64731A91021F3247M0127b70466
10327a30126A49604o6785R3079P687H5701J78857C4861K18791j07722k2097L7258
10316A61091p1592N152B2509b13296h4314A51853a96508d5189p5912m3224j5384
10305a79709j4469B55873B8597a30431c3465j37775A85402G7972b44938A03663
10294g5480c3298q9530p2729O602j39836n9469C27816b73951I9788b82669a15839
10282c16p5697k19864C279a56327N5651J2129C6553J61441o3028K95947f7646
$$ plain form
10270 -55091 -69757 77610 -177574 41610 102106 -91595 -216667 188053 79367 5648 19760
10259 19760 122065 78183 38529 173301 -38343 289568 264779 161373 135005 -10347 311131
10247 145749 60911 -74000 90392 88272 -83592 176507 -199469 -30194 219887 68952 -277484
10235 65970 345440 -63735 194845 -351668 110361 -261386 -102326 -143092 100363 -192394
10224 -134009 124699 -103591 -289625 12803 -168169 -87607 288608 217984 302052 -276843
10213 224758 -43672 143984 -254878 -63862 -101755 93781 -107402 -18327 -18401 -248596 254727
10201 -100329 -361197 -176825 -211955 -240178 -69277 55679 -235458 122865 48938 -255154
10190 124115 -76869 -189659 -77327 -221372 15914 -6269 -115848 -273843 -198679 65248 -404972
$$ packed form
10270e5091j4666G7610a77574D1610O0496i1595j25072A88053G9367E648J4112
10259A9760J02305m3882C8529J34772c8343B89568k4789j03406k6368a0347C11131
10247A45749F0911g4000I0392k120h3592A76507a99469c0194B19887F8952b77484
10235F5970K79470f3735A94845c51668A10361b61386a02326m0766A00363a92394
10224a34009A24699a03591j86034A2803a68169Q0562B88608p0624Q4068b76843
10213B24758d3672A43984b54878f3862l7893I3781a07402a8327p4k30195B54727
10201a00329k60868a76825l5130k8223f9277E5679b35458A22865D8938b55154
10190A24115g6869j12790g7327j44045A5914f269j09579j57995P5164F5248d04972
$$ plain form
10178 37017 201776 32631 83026 155958 -127189 -12717 -396340 38138 144245 -106677 -376658
10167 -376658 -192298 -81109 48617 -299761 58079 126703 -409298 -282929 1947 7387 -159436
10155 37097 -308380 -282194 -75821 11847 -163960 -74486 21282 40672 -72264 -567163 55873
10143 -278460 -9341 -50840 -94905 12148 -3602 -26773 13435 175734 -69061 -9226 -321714 -143861
10130 -204408 195758 -115728 -166483 131374 89770 -52305 -315940 140844 -83597 -249161
10120 -249161 50228 245515 -219512 69486 325836 -258237 187210 46531 -199050 61343
10109 -173609 99533 15741 -256184 56364 -223334 -77061 -95796 77442 -9094 -175170 -6487
10097 -87289 -134891 -301098 171344 -73656 275936 -201781 -163915 -144165 -178252 140180 -187085
$$ packed form
10178C7017J64759C2631N0395P2932a27189a2717l83623C8138J06107a06677k69981
10167c76658J84360h1109D8617b99761E8079O8624d09298J26369A947N440a59436
10155C7097c08380K6186g5821A1847a63960g4486B1282J9390g2264m94899E5873
10143b78460i341m1499m4065A2148c602k3171A3435J62299f9061i226l12488a43861
10130b04408A95758a15728n0755A31374m1604e2305k63635A40844h3597j65564
10120b49161E0228J95287b19512F9486K56350b58237A87210D6531a99050F1343
10109a73609I9533A5741b56184E6364b23334g7061j8735G7442i094j66076f487
10097h7289m7602j66207A71344g3656B75936b01781L7866J9750l4087A40180a87085
$$ plain form
10085 -13967 -237669 -61656 77444 65873 -271678 -233918 251276 54658 178728 -16600 136082
10073 -89163 -104278 -12006 -42663 -117885 -181878 -76391 -57097 -78071 -36058 -47113 -344052
10062 -344052 90883 -52302 -19596 -49468 66961 136104 4991 40778 -267539 226842 -144326
10050 -42794 -240706 -305860 236332 1789 -283418 29502 210148 -199282 -99854 52641 -142992
10038 -163298 91274 -142929 -189078 99875 47809 -62495 -51618 30214 3514 61158 -372549
10026 -106413 67594 -4358 -217342 -400556 -117350 -259285 -194773 -222680 -52792 -94481 -51503
10015 -51503 -411218 -282347 119046 -210410 -166858 70884 -160466 14611 306857 374823
10005 374823 -185164 -285968 15029 295576 -12709 -141109 -216358 -299988 -33926 -62894 128148
$$ packed form
10085a3967k23702f1656G7444j1571b71678L7760B51276E4658J24070a6600A36082
10073h9163j5115a2006l0657p5222o3993g6391J9294k0974c6058j1055k96939
10062c44052I0883e2302a9596k9872F6961O9143D991L5787b67539B26842a44326
10050d2794j97912o5154B36332A789b83418B9502J80646a99282R9428E2641a42992
10038a63298I1274a42929m6149I9875D7809f2495J0877C0214C514N7644c72549
10026a06413F7594d358k12984j83214a17350j41935O4512k7907e2792m1689M2978
10015e1503l59715J28871A19046b10410M3552G0884a60466A4611K92246O7966
10005C74823a85164j00804A5029K80547a2709j28400p5249q3630c3926k8968A28148
$$ plain form
9993 272933 -139143 -13632 -119701 -237894 23016 11116 237816 20492 -402490 218382
9982 143245 -350727 65297 -78429 -250647 335559 112021 137012 -115051 -52163 -34832 -70568
9971 -70568 -49868 -218832 136239 -73469 -156182 -165925 -93707 -92749 -145917 -245599 -303354 -175867
9959 -175867 -320489 71758 6492 41014 5 -210 -73028 301529 73695 -111749 -10942 -184497
9947 -184497 -31482 -272910 43728 32245 120123 3907 131601 -54053 509869 -157115 -37407
9935 22932 127253 244139 -52752 -83544 -246354 47781 -109263 20611 -40132 66466 -20231
9923 -195100 -103915 -52851 -66093 103136 70380 -92382 121949 -110572 -225224 104917 -27614
9911 -411956 114848 156274 160015 21507 -184409 -2981 3129 12758 -163315 -305039 -158147
$$ packed form
9993B72933a39143a3632j06069j18193B3016A1116K26700B0492d02490B18382
9982A43245c50727F5297g8429j72218C35559A12021K4991a15051e2163J7331l5736
9971g0568K0700j68964A36239g3469q2713r743P2218R58n3168r9682n7755J27487
9959a75867j44622G1758F492L4522Eb10p2818C01529G3695a11749a0942j73555
9947a84497c1482k41428D3728j1483Q7878C907J27694e4053E09869a57115c7407
9935B2932J04321J16886e2752l0792j62810D7781a09263B0611d0132F6466b0231
9923a95100R1185N1064j3242A03136l2756i2382A21949a10572j14652A04917b7614
9911d11956A14848M1426L741B1507a84409b981C129R629a63315j41724J46892
$$ plain form
9900 -158147 -192696 127661 -246731 -132571 18297 -5952 190884 8110 -113048 -91793 -154231
9889 -154231 217610 -195183 -123433 -292185 -84563 65704 -124980 64393 34124 14256 -410290
9877 37718 -103999 -113404 -157629 -19150 -28467 -194594 -356619 -58564 -98325 92556 -244017
9865 -406628 132125 -262556 -203607 -86159 -146574 -185845 50705 105153 300378 150067 47299
9853 -203852 57768 22407 -56859 38486 -311811 34032 -123821 -190416 -278040 -115287 -89147
9842 -89147 15660 168230 17837 61515 122434 -103368 -124690 -78674 -335535 157300 -163163
9830 -249299 -93875 -272381 -89197 -5357 -135396 -45931 -38036 -98217 -275713 214309 133557
9819 133557 -23031 -124792 -58953 -142654 106311 90527 -59652 59342 -329231 -69357 125531
$$ packed form
9900a58147l4549A27661b46731J14160A8297e952A90884H110a13048K1255o2438
9889a54231B17610a95183P1750j68752h4563F5704a24980F4393l0269A4256d10290
9877C7718a03999r405m4225a9150r317j66127j62025e8564l9761I2556b44017
9865d06628A32125b62556N8949h6159o0415l9271E0705N4448J95225A50067D7299
9853b03852E7768B2407e6859C8486c11811C4032a23821o6595q7624a15287K6140
9842h9147A5660J52570A7837M3678O0919a03368k1322M6016k56861A57300a63163
9830b49299i3875j78506h9197e357j30039d5931P895o0181j77496B14309q0752
9819A33557b3031j01761e8953q3701A06311j5784e9652E9342c29231f9357A25531
$$ plain form
9807 -222505 -71014 190518 -271144 -297779 -59788 -305293 -284363 -82846 -291876 -33863 16723
9795 -262513 -129667 -81124 -127294 -54997 -109538 -164971 -97989 -136894 -590399 -136761 -122358
9784 -122358 -55920 -148101 139613 260259 -108043 -75122 -43261 -168550 19573 -206337 164294
9772 -375977 -42639 132906 100258 172218 -104479 -213357 -255912 -398995 67759 295723 87475
9760 -5533 90355 76258 162132 -183961 -128861 -283580 -360212 90135 73264 -157294 92034
9748 -167547 -66258 -149324 -83445 128306 23740 25904 106297 12095 -54698 -257742 126600
9736 -119180 -37606 -82455 -227883 66576 -178231 139162 -46895 -93506 68717 71661 -173629
9724 9504 21724 178303 -133460 -143421 -368324 -95725 -40611 55604 -443918 16569 -380555
$$ packed form
9807b22505g1014A90518b71144k6635e9788k45505K0930h2846k09030c3863A6723
9795b62513a29667M8543m6170e4997n4541n5433O6982l8905m53505a36761J4403
9784a22358e5920r2181A39613J20646a08043L2921L1861j25289A9573b06337A64294
9772c75977d2639A32906l2648P1960a04479j08878m2555j43083F7759K27964H7475
9760e533I0355j4097Q5874a83961N5100j54719p6632I0135j6871a57294I2034
9748a67547f6258q3066O5879A28306B3740K164Q0393A2095e4698k03044A26600
9736a19180c7606m4849j45428F6576a78231A39162d6895m6611F8717K944a73629
9724I504J2220J56579a33460r961k24903i5725d0611E5604d43918A6569c80555
$$ plain form
9712 -137247 -228633 206789 317015 14713 -46739 29846 208633 242134 74636 -27026 319744
9700 -41756 -49022 -111789 -203979 -163725 -162581 147745 85839 78540 -192021 -71268 -167740 -23442
9687 49455 1063 232192 -196957 378 264374 -531294 -26254 459646 -341871 73685 -132936
9675 40402 52900 -218523 -208504 363032 56672 -74401 -214642 -181180 -380744 205073 142335
9664 142335 -14762 163309 -92597 -336277 -73596 177368 182627 -246044 -199391 103744 -317425
9652 -43384 -52800 113457 -64152 8509 146438 19511 -201123 63025 35314 -256366 -90524
9640 -7015 -20311 -78286 -217804 -256292 9297 -235327 -52654 4036 -438763 -165105 -152245 69588
9627 -150899 -27921 68486 -8292 -54412 -304136 131294 -111356 -270351 1887 -217265 -145499
$$ packed form
9712a37247r1386B06789J10226A4713d6739B9846J78787L3501G4636b7026C19744
9700d1756p266o2767r2190M0254J144A47745o1906p299a92021g1268r6472b3442
9687D9455A063K31129a96957C78K63996e31294b6254D59646c41871G3685a32936
9675D0402J2498b18523J0019C63032E6672g4401j40241L3462j99564B05073o2738
9664A42335a4762A63309i2597k43680g3596A77368N259b46044M6653A03744c17425
9652d3384r416A13457f4152H509J37929A9511b01123F3025k7711b56366i0524
9640g015j3296n7975j39518l8488I297b35327e2654D036d38763a65105J2860F9588
9627a50899b7921F8486h292m6120k49724A31294a11356j58995A887b17265P1766
$$ plain form
9616 -145499 12067 73976 -376469 -68922 -40703 -131538 -229732 -158225 -87523 228907 -432075
9604 -399133 -508313 214181 -17644 -274607 -241480 -163023 266776 -11613 31918 56441 -46423
9592 -216892 2336 -173662 77073 95598 -55810 70789 157552 -209187 213840 -267746 98288
9580 -135868 41864 111145 84684 182609 -320974 -50001 -140580 16014 -213013 -407292 113238
9568 122978 -83494 14704 -280654 218293 399485 -48207 -78047 -154406 -197541 110560 -157740
9556 129895 -285878 73795 -96998 -167987 275124 -490205 -244925 -148313 33075 -193286 -215182
9545 -215182 57222 15471 -127281 40930 -172644 -270396 -91677 -266095 107879 222940 -100029
9533 13559 -35390 -150738 -136710 59533 342348 -76460 217195 -56322 30439 175621 149643
$$ packed form
9616a45499A2067O1909c76469f8922K8219r0835r8194P1507P0702B28907d32075
9604c99133j09180B14181a7644k56963L3127P8457B66776a1613C1918K4523d6423
9592b16892B336a73662G7073J8525e5810G0789Q6763b09187B13840b67746I8288
9580a35868D1864O9281k6461R7925c20974e0001r0579A6014b13013j94279A13238
9568A22978h3494A4704b80654B18293J81192d8207k9840p6359m3135A10560a57740
9556A29895b85878G3795i6998p0989B75124d90205b44925R6612C3075a93286k1896
9545b15182E7222A5471a27281D0930a72644r7752i1677j74418A07879J15061a00029
9533A3559c5390j15348J4028E9533K82815g6460B17195e6322C0439J45182k5978
$$ plain form
9522 149643 174055 -21520 -5674 -219640 -148133 -216102 157699 -109898 -112675 133890 9685
9510 -82782 -135381 -142349 -39734 -204930 155909 -538250 -74458 -93812 -57801 163619 -353182
9498 9989 -200584 24549 63629 -33992 -133343 -42467 -103373 -224001 -133297 -166049 88816 -300559
9485 -76137 -286583 40425 -37645 323122 -212081 36280 -33843 -16483 73978 -219455 115300
9473 -155407 -349853 -44862 -225586 -85488 -166973 -64896 -306759 -66012 -51002 204517 -292367
9461 -356745 -90416 84860 227408 -117767 -118145 -44461 -137664 -16927 -256243 -331512 -40758
9449 -271656 19863 -67635 -246127 -194996 -135622 225122 21321 -180545 -150885 37353 21151
9438 21151 126156 -54114 72217 -273202 10213 75669 33410 -126509 -100207 -22669 -333534
$$ packed form
9522A49643K4412b1520e674k13966P1507o7969A57699a09898k777A33890I685
9510h2782n2599o968c9734j65196A55909e38250g4458j9354L6011A63619c53182
9498I989b00584B4549L9080c3992r9351d2467o0906j20628R0704l2752H8816c00559
9485g6137k10446D0425c7645C23122b12081C6280c3843a6483G3978b19455A15300
9473a55407j94446d4862j80724h5488q1485f4896k41863f6012J5010B04517b92367
9461c56745i0416H4860J42548a17767l78d4461r3203a6927k39316p5269d0758
9449b71656A9863f7635j78492N1131N9374B25122B1321a80545K9660C7353j6202
9438B1151J05005e4114G2217b73202A0213O5456C3410a26509K6302b2669l10865
$$ plain form
9427 -333534 -609132 -151071 -175700 -192852 -414 180674 11012 14457 -82717 32592 32715 79522
9415 79522 -47880 60301 76135 6333 9273 -114367 -29995 174792 221658 18569 2568 -278432
9402 -171553 -91355 86028 -162290 -21350 -177443 -36899 209738 -144981 126091 -213427
9391 -267478 95441 277111 -26654 -322527 160564 -161849 244758 177907 15896 -197519
9380 162730 102071 61719 -113333 -318493 -38287 187752 188338 -88654 4143 47729 11348 -205216
9367 -355757 294679 -102357 178173 -239802 103117 29177 -173338 -133040 210868 -304429
9356 83357 -285705 -77917 -308291 -108822 278128 -225760 -124987 -312573 44267 58788
9346 58788 4824 -147677 -88064 39989 -29021 157215 138645 -25545 -22158 -78277 198563 572652
$$ packed form
9427c33534k75598a51071k4629j7152d14A80674A1012L445h2717C2592J23M6807
9415G9522d7880F0301J5834F333K940a14367b9995A74792M6866A8569B568b78432
9402a71553Q0198H6028a62290b1350j56093c6899B09738a44981A26091b13427
9391b67478I5441J81670b6654k95873A60564a61849B44758o6851A5896a97519
9380A62730o0659m0352a13333k05160c8287A87752N86h8654D143M3586A1348b05216
9367c55757B94679a02357A78173b39802A03117B9177a73338M0298B10868c04429
9356H3357b85705g7917k30374a08822B78128b25760J00773j87586D4267J4521
9346E8788D824a47677N9613C9989b9021A57215j8570b5545L387n6119A98563L74089
$$ plain form
9334 572652 -190904 35577 -151638 -361213 -197218 39327 36810 -30546 -110029 -260908 -180658
9323 -180658 -84592 -126426 -11095 -31876 -259230 -305350 70968 281657 -201259 131126 118797
9312 118797 58747 -47699 38747 -153263 -114317 -669 -281984 -159498 -32225 -100381 -131721
9301 -131721 78489 43502 -22109 -299445 178992 19764 253678 109583 75178 -205782 -143471
9290 -143471 -185932 -68249 108142 -118130 -118293 -3830 778 20719 -244569 -42954 -227182 84652
9277 -202217 -279815 234210 -3878 103810 -94102 -109987 -100482 1818 119153 12942 7812 14768
9265 14768 104406 -1201 125737 51072 -125628 157585 -150554 -106274 -45707 249510 142767
9254 142767 331564 -137941 42426 78823 -30756 109447 9144 -22521 48640 -34531 61035
$$ packed form
9334E72652a90904C5577a51638k09575J63995C9327k517c0546p9483j50879Q0250
9323a80658h4592m1834a1095k0781k27354m6120G0968K10689b01259A31126j2329
9312A18797E8747d7699C8747a53263L8946f69k81315J22486c2225o8156l1340
9301a31721G8489l4987b2109k77336A78992A9764K33914A09583l4405b05782O2311
9290a43471m2461f8249A08142a18130j63c830G78J9941b44569d2954j84228H4652
9277b02217p7598B34210c878A03810i4102j5885R505A818J17335A2942n130O956
9265A4768Q9638a201A25737E1072a25628A57585a50554M4280d5707B49510j06743
9254A42767J88797a37941D2426L6397c0756A09447I144b2521D8640c4531F1035
$$ plain form
9242 -304136 319824 98013 -47874 69685 -428501 -103084 35683 91823 -380574 -205298 -296297
9231 -296297 -1289 131203 -290617 76326 18214 -245842 -228856 19827 279599 142415 237942
9220 237942 2536 -87545 279763 201148 9015 -230663 -143204 -366248 -110554 472171 -350437
9208 10312 -150268 -37881 -158861 -146352 -32556 -15760 301505 27284 -6638 -153174 -33353
9196 -337641 51504 53296 236615 168290 -67840 153614 45556 -65827 24713 -82997 82670
9184 -118905 -409468 -182059 88809 -261902 -395770 -50040 -288909 10188 -141996 -210484
9174 -210484 -205019 -18691 -141369 -28195 -431739 -178948 -225210 -195200 38027 63815 -846 -64352
9162 -64352 88453 -342260 -92017 -64898 -124128 -123217 -275084 -269496 128076 -20926 105783 -181851
$$ packed form
9242c04136C19824I8013d7874F9685d28501a03084C5683N6140c80574J75276r0999
9231b96297a289A31203b90617G6326A8214b45842J6986A9827K59772j37184R5527
9220B37942B536h7545B79763p8615I015b30663Q7459k23044a10554D72171c50437
9208A0312a50268c7881j20980J2509c2556a5760C01505B7284f638j46536c3353
9196c37641E1504J792J83319o8325f7840A53614D5556f5827B4713h2997H2670
9184a18905k90563a82059H8809b61902j33868e0040k38869A0188a41996o8488
9174b10484N465a8691j22678b8195m03544a78948m6262L0010C8027K5788h46o3506
9162f4352H8453c42260i2017K7119n9230R11j51867N588A28076b0926A05783a81851
$$ plain form
9149 -356508 -501515 -262376 -40942 -93341 174711 -84030 -55617 169673 108729 69648 -81321
9137 -102542 31916 16704 -123746 13819 33893 102063 165133 18110 -288668 210812 -36869
9125 -160995 -110794 232293 -30085 -86233 163078 -116348 230810 91927 161354 -48573 -1900
9113 -204655 159731 -10883 -13044 -14039 73892 106160 -173015 318368 -361359 -196824 79680
9101 302482 -401518 221468 -38575 -192488 -318900 -9653 76753 8705 125331 -152632 -207260
9090 -207260 -44804 -78604 -125648 -200897 -329876 -7528 -171037 115613 -125267 178695 1211
9078 -189177 -7921 265819 -93150 -184343 -164417 169411 -368506 -36338 39697 -26300 98001
9066 -226940 -101550 106283 -184690 173207 65649 -260256 -5461 -164481 75589 -97895 -213150
$$ packed form
9149c56508j45007K39139d0942n2399A74711h4030K8413A69673o0944l9081h1321
9137a02542C1916j5212a23746A3819K0074O8170O3070A8110b88668B10812c6869
9125a60995N0201B32293c0085n6148A63078a16348B30810I1927O9427d8573a900
9113b04655A59731a0883k161r95G3892L2268a73015C18368c61359J64535G9680
9101C02482d01518B21468c8575j53913j26412i653G6753H705J16626a52632n4628
9090b07260d4804l3800m7044p5249j28979g528j63509A15613a25267A78695A211
9078a89177g921B65819i3150r1193J9926A69411c68506c6338C9697b6300I8001
9066b26940a01550A06283a84690A73207F5649b60256e461j59020G5589i7895j15255
$$ plain form
9055 -213150 163873 -258634 -227521 -66488 94774 224415 -19637 -21413 -89079 -124524 -141370
9044 -141370 -455328 53954 57247 27890 -72554 -76223 -515980 167589 -10768 -47443 -215135
9033 -215135 27252 63037 -196342 -260444 -124455 -117249 -165161 25464 50287 -136646 107548
9021 -76009 -170669 -117318 -86653 -34616 121342 -60549 67821 -274500 -190752 -325434 -373285
9010 -373285 -162621 -173078 89413 -514225 41504 244408 157386 -128491 -60085 -141516 102986
8998 73784 150580 34186 -173872 212191 -41023 -8941 -36368 78543 -106767 -39145 140693
8986 16317 21546 -7200 -92835 -33531 -25365 243255 108220 -140914 -3526 -107238 -34407 -341791
8974 -341791 152069 -109198 -196364 -222224 -122995 -281428 69835 -43183 -39656 -183745 -238273
$$ packed form
9055b13150A63873b58634L1113f6488I4774J29641a9637j776o7666l5445j6846
9044a41370l13958E3954L293B7890g2554l669m39757A67589a0768l6675j67692
9033b15135B7252L5785a96342o4102a24455P206m7912B5464K4823a36646A07548
9021g6009r4660N3351L0665c4616A21342f0549F7821b74500Q3748j34682m7851
9010c73285a62621j0457H9413e14225D1504K02904q7022a28491f0085q1431A02986
8998G3784P6796C4186a73872B12191d1023h941k7427G8543a06767c9145A40693
8986A6317N229g200q5635c3531Q166B43255A08220a40914c526j03712c4407l07384
8974c41791A52069a09198q7166k5860R9229j58433F9835d3183L527j44089n4528
$$ plain form
8963 -238273 -153162 298617 123126 50392 -88464 332331 13688 -300983 188839 20320 -66640
8951 58790 -246350 88582 -322496 208169 -59197 196233 -61031 -130659 -334642 55534 355441
8940 355441 148961 -350978 -57499 -249870 -10842 425579 48282 -284944 112465 -33200
8929 -56753 -4708 58762 -151789 -97731 170129 1262 -354271 308558 -128030 166247 445885
8918 445885 1158803 529460 95093 -351853 -142244 -228806 -300069 -79842 -109118 160280 -125976
8906 401844 106312 -5667 216818 62925 159974 -184943 114410 244230 -307673 159540
8895 100040 -71955 -61864 -214701 123040 -57448 -240493 203750 253352 34312 61622 235092
8884 235092 30817 -131730 -290592 72093 190123 -206330 -136114 -334209 64202 208879
$$ packed form
8963b38273Q5111B98617A23126E0392h8464C32331A3688c00983A88839B0320f6640
8951E8790b46350H8582c22496B08169e9197A96233f1031o9628k03983E5534K99907
8940C55441A48961c50978e7499j92371a0842D25579D8282b84944A12465c3200
8929e6753d708E8762a51789N4058A70129A262c54271C08558a28030A66247K79638
8918D45885P12918E29460I5093c51853a42244q6562p1263g9842k9276A60280a25976
8906D01844A06312e667B16818F2925R7049a84943A14410J29820c07673A59540
8895A00040g1955J0091j52837A23040e7448j83045B03750M9602C4312K7310J73470
8884B35092C0817a31730j58862G2093J18030b06330P0216j98095F4202J44677
$$ plain form
8874 208879 -322745 151137 -223844 198767 22069 -195309 -94146 -107611 -29159 18141 -43025
8862 -153804 -119585 124605 -140991 236544 -5143 14095 -229028 79444 293026 130875 181297
8851 181297 -59126 241562 166990 -195125 -67290 195827 -217779 173064 -89531 76383 163809
$$ packed form
8874B08879c22745A51137b23844A98767B2069a95309i4146j3465b9159A8141d3025
8862a53804L4219A24605a40991B36544e143A4095b29028G9444K13582A30875N0422
8851A81297e9126B41562p4572a95125f7290A95827b17779A73064h9531G6383Q7426
$$ [...]
##END NTUPLES=NMR SPECTRUM
##END=
