##TITLE=NES1040_872015035_9242566_UfO24fU4PF
##JCAMPDX= 6.0         $$ Bruker NMR JCAMP-DX V2.0
##DATA TYPE= NMR SPECTRUM
##DATA CLASS= NTUPLES
##ORIGIN= BRUKER
##OWNER= Administrator
$$ 1.72 TOPSPIN		Version 2.1
$$ 2015-07-02 00:08:09.945 -0700  Administrator@X
$$ Compression mode = diff/dup
##.OBSERVE FREQUENCY= 400.02188249412
##.OBSERVE NUCLEUS= ^1H
##.ACQUISITION MODE= SIMULTANEOUS (DQD)
##.ACQUISITION SCHEME= undefined
##.AVERAGES= 64
##.DIGITISER RES= 22
##SPECTROMETER/DATA SYSTEM= spect
##.PULSE SEQUENCE= noesygpps1d.comp
##.SOLVENT NAME= COFFEE_meoh
##.SHIFT REFERENCE= INTERNAL, COFFEE_meoh, 1, 14.96315
##AUDIT TRAIL= $$ (NUMBER, WHEN, WHO, WHERE, PROCESS, VERSION, WHAT)
$$ ##TITLE= Audit trail, TOPSPIN		Version 2.1
$$ ##JCAMPDX= 5.01
$$ ##ORIGIN= Bruker BioSpin GmbH
$$ ##OWNER= Administrator
$$ $$ E:\/data/COFFEE/nmr/NES1040_872015035_9242566_UfO24fU4PF/12/pdata/1/auditp.txt
$$ ##AUDIT TRAIL=  $$ (NUMBER, WHEN, WHO, WHERE, PROCESS, VERSION, WHAT)
(   1,<2015-07-02 00:08:04.649 -0700>,<Administrator>,<X>,<go>,<TOPSPIN 2.1>,
      <created by zg
	started at 2015-07-01 23:56:35.024 -0700,
	POWCHK enabled, PULCHK disabled,
       configuration hash MD5:
       21 0F 79 D6 B3 7B B4 F6 88 20 88 DB 03 48 BD 9F
       data hash MD5: 64K
       7E 7D C3 DD AD A3 75 44 C4 C3 33 89 99 23 E4 75>)
(   2,<2015-07-02 00:08:07.836 -0700>,<Administrator>,<X>,<proc1d>,<TOPSPIN 2.1>,
      <Start of raw data processing
       efp LB = 0.3 FT_mod = 6 PKNL = 1 PHC0 = 0 PHC1 = 0 SI = 128K 
       data hash MD5: 128K
       7C 8D 27 FD 6E 9C 9D F4 5A 06 80 6C CD D4 A8 70>)
(   3,<2015-07-02 00:08:08.727 -0700>,<Administrator>,<X>,<proc1d>,<TOPSPIN 2.1>,
      <pk PHC0 = -83.18298 PHC1 = 0 
       data hash MD5: 128K
       0E 0E F8 4A E7 DE 63 52 93 92 5A 06 9D 87 2F 9E>)
(   4,<2015-07-02 00:08:09.133 -0700>,<Administrator>,<X>,<proc1d>,<TOPSPIN 2.1>,
      <abs ABSG = 1 
       data hash MD5: 128K
       FF 7A 28 BB FC 69 8C 3D F7 63 F0 9F AE 48 AC D6>)
(   5,<2015-07-02 00:08:09.227 -0700>,<Administrator>,<X>,<proc1d>,<TOPSPIN 2.1>,
      <abs ABSG = 2 
       data hash MD5: 128K
       74 52 75 2F 40 F8 D2 3A D4 EA C7 67 A3 58 3F 9C>)
(   6,<2015-07-02 00:08:09.320 -0700>,<Administrator>,<X>,<proc1d>,<TOPSPIN 2.1>,
      <abs ABSG = 3 
       data hash MD5: 128K
       24 86 15 17 0B 1E 4C 7F 90 48 3B 94 65 ED D4 43>)
(   7,<2015-07-02 00:08:09.399 -0700>,<Administrator>,<X>,<proc1d>,<TOPSPIN 2.1>,
      <abs ABSG = 4 
       data hash MD5: 128K
       65 C6 A2 48 F2 BD A5 DC 6B 46 ED 59 A6 C4 D6 1F>)
(   8,<2015-07-02 00:08:09.524 -0700>,<Administrator>,<X>,<proc1d>,<TOPSPIN 2.1>,
      <abs ABSG = 5 
       data hash MD5: 128K
       1F A7 9D D9 E7 8E 1A 27 0A C0 84 C7 8B A0 C2 84>)
$$ ##END=
$$ 
$$ $$ hash MD5
$$ $$ DF EA A4 24 39 16 2D 89 8A F7 04 78 1F DE B1 BD
##$RELAX= 
##$RELAX= 
##$RELAX= 
##$RELAX= 
##$RELAX= 
##$RELAX= 
##$RELAX= 
##$RELAX= 
$$ Bruker specific parameters
$$ --------------------------
##$DU= <E:\>
##$EXPNO= 12
$$ [...]
##$TP07= 0
##$TPNAME0= <>
##$TPNAME1= <>
##$TPNAME2= <>
##$TPNAME3= <>
##$TPNAME4= <>
##$TPNAME5= <>
##$TPNAME6= <>
##$TPNAME7= <>
##$TPOAL= (0..7)
0.5 0.5 0.5 0.5 0.5 0.5 0.5 0.5
##$TPOFFS= (0..7)
0 0 0 0 0 0 0 0
##$TUNHIN= 0
##$TUNHOUT= 0
##$TUNXOUT= 0
##$USERA1= <user>
##$USERA2= <user>
##$USERA3= <user>
##$USERA4= <user>
##$USERA5= <user>
##$V9= 5
##$VALIST= <valist>
##$VCLIST= <CCCCCCCCCCCCCCC>
##$VD= 0
##$VDLIST= <DDDDDDDDDDDDDDD>
##$VPLIST= <PPPPPPPPPPPPPPP>
##$VTLIST= <TTTTTTTTTTTTTTT>
##$WBST= 2048
##$WBSW= 25
##$XGAIN= (0..3)
0 0 0 0
##$XL= 0
##$YL= 0
##$YMAX_a= 6601366
##$YMIN_a= -13251647
##$ZGOPTNS= <>
##$ZL1= 120
##$ZL2= 120
##$ZL3= 120
##$ZL4= 120
##$ABSF1= 14.96315
##$ABSF2= -5.595032
##$ABSG= 5
##$ABSL= 3
##$ALPHA= 0
##$AQORDER= 0
##$ASSFAC= 0
##$ASSFACI= 0
##$ASSFACX= 0
##$ASSWID= 0
##$AUNMP= <proc_prof1d_extract.lims>
##$AXLEFT= 0
##$AXNAME= <>
##$AXNUC= <1H>
##$AXRIGHT= 0
##$AXTYPE= 0
##$AXUNIT= <>
##$AZFE= 0.1
##$AZFW= 0.1
##$BCFW= 0
##$BC_mod= 0
##$BYTORDP= 0
##$COROFFS= 0
##$CY= 15
##$DATMOD= 1
##$DC= 0
##$DFILT= <>
##$DTYPP= 0
##$F1P= 0
##$F2P= 0
##$FCOR= 0.5
##$FTSIZE= 131072
##$FT_mod= 6
##$GAMMA= 0
##$GB= 0
##$INTBC= 1
##$INTSCL= 1
##$ISEN= 128
##$LB= 0.3
##$LEV0= 0
##$LPBIN= 0
##$MAXI= 10000
##$MC2= 0
##$MEAN= 0
##$ME_mod= 0
##$MI= 0
##$NCOEF= 0
##$NC_proc= -2
##$NLEV= 6
##$NOISF1= 0
##$NOISF2= 0
##$NSP= 0
##$NTH_PI= 0
##$NZP= 0
##$OFFSET= 14.96315
##$PC= 1
##$PHC0= -83.18298
##$PHC1= 0
##$PH_mod= 1
##$PKNL= yes
##$PPARMOD= 0
##$PPDIAG= 0
##$PPIPTYP= 0
##$PPMPNUM= 2147483647
##$PPRESOL= 1
##$PSCAL= 4
##$PSIGN= 0
##$PYNMP= <proc.py>
##$REVERSE= no
##$SF= 400.020008775506
##$SI= 131072
##$SIGF1= 0
##$SIGF2= 0
##$SINO= 400
##$SIOLD= 131072
##$SPECTYP= <>
##$SREGLST= <1H.CDCl3>
##$SSB= 0
##$STSI= 131072
##$STSR= 0
##$SW_p= 8223.68421052631
##$SYMM= 0
##$S_DEV= 0
##$TDeff= 65536
##$TDoff= 0
##$TI= <>
##$TILT= no
##$TM1= 0
##$TM2= 0
##$TOPLEV= 0
##$USERP1= <user>
##$USERP2= <user>
##$USERP3= <user>
##$USERP4= <user>
##$USERP5= <user>
##$WDW= 1
##$XDIM= 131072
##$YMAX_p= 419379422
##$YMIN_p= -12242
##$CURPLOT= <Network HP LaserJet P1505>
##$CURPRIN= <$Network HP LaserJet P1505>
##$DFORMAT= <normdp>
##$LAYOUT= <+/1D_H.xwp>
##$LFORMAT= <normlp>
##$PFORMAT= <normpl>
##$SURQMSG= 1
$$ End of Bruker specific parameters
$$ ---------------------------------
##NTUPLES= NMR SPECTRUM
##VAR_NAME=  FREQUENCY,     SPECTRUM/REAL,   SPECTRUM/IMAG
##SYMBOL=    X,             R,               I
##VAR_TYPE=  INDEPENDENT,   DEPENDENT,       DEPENDENT
##VAR_FORM=  AFFN,          ASDF,            ASDF
##VAR_DIM=   131072,        131072,          131072
##UNITS=     HZ,            ARBITRARY UNITS, ARBITRARY UNITS
##FACTOR=    0.0627417313425164, 1,          1
##FIRST=     8223.62146879497, -1315,        -41351
##LAST=      0,             176,             -41912
##MIN=       0,             -12242,          0
##MAX=       8223.62146879497, 419379422,    0
$$ Real data points
##PAGE= N=1
##DATA TABLE= (X++(R..R)), XYDATA
$$ [...]
67425 153166 153870 154807 155795 156355 156249 155707 155195 155090 155491 156222 157064 157988 159077 160140 160652 160312 159567 159290
67407 159290 159909 161025 161927 162282 162216 161918 161443 160902 160628 160974 161988 163388 164882 166366 167794 168986 169718
67390 169718 169938 169740 169218 168535 168120 168503 169783 171377 172465 172672 172308 172015 172235 172931 173766 174573 175581
67373 175581 177003 178491 179341 179356 179197 179618 180552 181248 181187 180606 180230 180713 182248 184375 186217 187176 187459 187714
67355 187714 188211 188662 188790 188711 188684 188803 189112 189752 190801 192115 193468 194713 195714 196351 196680 196968 197426 198078
67337 198078 198941 200072 201307 202185 202394 202189 202166 202668 203566 204511 205284 205999 207057 208785 211005 213140 214774
67320 214774 215895 216550 216677 216524 216758 217696 218704 218928 218473 218308 219051 220402 221780 222926 223793 224502 225616
67303 225616 227853 231062 233992 235540 235863 235782 235553 234940 234246 234350 235584 237291 238805 240263 242044 243893
67287 243893 245212 245981 246836 248208 249820 251075 251595 251289 250277 249057 248458 249072 250697 252598 254318 255981
67271 255981 257762 259339 260176 260262 260311 261175 263187 266097 269401 272543 274990 276432 276985 277069 277017 276932 276918 277324
67253 277324 278572 280775 283579 286323 288313 289106 288744 287830 287246 287675 289267 291692 294395 296850 298693
67238 298693 299857 300596 301309 302214 303209 304108 304972 306051 307398 308774 310101 311815 314424 317729 320833 323089
67222 323089 324766 326593 328875 331348 333762 336190 338716 341167 343337 345302 347331 349503 351504 352805
67208 352805 353161 353023 353337 354675 356622 358302 359518 361005 363436 366533 369407 371453 372636 373219 373661
67193 373661 374610 376484 378985 381431 383625 386035 389033 392330 395375 397941 400041 401579 402579 403653
67179 403653 405703 408899 412228 414431 415359 416181 418171 421492 425311 428869 432087 435151 438008 440566 443045
67164 443045 445709 448368 450560 452288 454231 457094 460979 465422 469797 473605 476635 479092 481417 483852
67150 483852 486257 488411 490370 492474 495088 498364 502040 505488 508229 510516 513205 516844 521035 524858
67136 524858 527828 530361 533398 537566 542587 547479 551502 554934 558698 563315 568466 573476 577763 580879
67122 580879 582802 584443 587193 591511 596402 600731 604555 608623 613104 617577 621933 626388 630687 634186
67108 634186 636861 639522 642795 646517 650353 654451 659177 664589 670422 676212 681398 685806 690189 695651
67094 695651 702254 708747 714100 718750 723821 729591 735381 740677 745658 750729 756086 761815 767877 773930
67080 773930 779495 784445 789153 794121 799645 805716 812041 818220 824098 829876 835700 841386 846846 852540
67066 852540 859021 866160 873342 880394 887726 895414 902805 909414 915847 923298 932235 941919 951202 959484
67052 959484 966910 973934 980913 987999 995214 1002459 1009489 1016057 1022252 1028600 1035683 1043655 1052296 1061441
67038 1061441 1071052 1080836 1090097 1098268 1105523 1112688 1120552 1129388 1139002 1149054 1159305 1169636 1179930
67025 1179930 1189942 1199399 1208291 1217017 1226132 1235921 1246262 1256869 1267584 1278418 1289397 1300402
67013 1300402 1311177 1321466 1331187 1340470 1349552 1358634 1367829 1377233 1386979 1397221 1408056 1419442 1431138
67000 1431138 1442745 1453902 1464621 1475406 1486884 1499162 1511627 1523539 1534814 1546043 1557723
66989 1557723 1569659 1581244 1592138 1602500 1612669 1622910 1633501 1644809 1657030 1669808 1682304
66978 1682304 1693843 1704610 1715612 1727729 1740816 1753835 1765897 1776933 1787358 1797491 1807567
66967 1807567 1817981 1829014 1840390 1851510 1862156 1872594 1883042 1893500 1904178 1915491 1927316
66956 1927316 1938780 1949251 1959215 1969641 1980731 1991900 2002758 2013399 2023677 2033020 2041360 2049627
66944 2049627 2058818 2068971 2079475 2089993 2100462 2110469 2119411 2127335 2135042 2143175 2151712 2160427 2169305
66931 2169305 2178132 2186118 2192441 2197055 2200744 2204552 2209266 2215112 2221558 2227666 2232994 2237956 2242998 2247730
66917 2247730 2251392 2254000 2256377 2259096 2262011 2264894 2267920 2271186 2274260 2276575 2277971 2278565 2278461 2277880 2277237
66902 2277237 2276713 2275951 2274580 2272788 2270995 2269154 2266893 2264252 2261782 2259800 2257908 2255378 2251761 2247048
66888 2247048 2241549 2235766 2230246 2225301 2220815 2216300 2211225 2205470 2199515 2193929 2188539 2182450 2175180 2167404
66874 2167404 2160141 2153495 2146752 2139514 2131977 2124153 2115695 2106719 2097969 2089737 2081326 2072147 2062737 2053919
66860 2053919 2045367 2035893 2024993 2013364 2001940 1991113 1980915 1971196 1961400 1950831 1939493 1928183
66848 1928183 1917468 1907004 1896152 1884798 1873157 1861222 1848914 1836445 1823989 1811274 1798092
66837 1798092 1785103 1773448 1763441 1754115 1744220 1733330 1721874 1710509 1699654 1689333 1679185 1668701
66825 1668701 1657552 1645561 1632535 1618547 1604493 1591830 1581344 1572331 1563258 1553091 1541865 1530270
66813 1530270 1518995 1508302 1497885 1487202 1476131 1465157 1454770 1444874 1435011 1424915 1414497 1403568
66801 1403568 1392013 1380213 1368871 1358433 1348907 1340053 1331366 1322104 1311928 1301508 1291882 1283182
66789 1283182 1274577 1265532 1256409 1247498 1238234 1227987 1217175 1206877 1197537 1188651 1179682 1170759 1162405
66776 1162405 1154915 1148088 1141318 1133999 1126016 1117827 1109864 1102010 1093909 1085566 1077278 1069075 1060695 1052141
66762 1052141 1043886 1036393 1029661 1023283 1016678 1009262 1000818 991891 983542 976426 970247 964243 958024 951687
66748 951687 945269 938468 931056 923345 916013 909497 903698 898294 893065 887785 882024 875479 868483 861807
66734 861807 855811 850014 843727 836900 830240 824622 820433 817178 813635 808763 802714 796676 791464 786664
66720 786664 781485 775981 770880 766462 762271 757777 752728 746951 740528 734229 729056 725128 721537 717442
66706 717442 712784 707787 702464 696962 691771 687154 682790 678384 674163 670288 666306 661816 657285 653431
66692 653431 650045 646230 641775 637486 633991 630968 627836 624557 621244 617501 612779 607193 601435 595935
66678 595935 590644 585697 581755 579300 577870 576342 573966 570829 567311 563449 559112 554584 550599 547668
66664 547668 545596 543767 541733 539368 536636 533558 530405 527554 524904 521682 517229 511995 507408 504542
66650 504542 503097 501891 500102 497722 494979 491886 488486 485085 481967 479062 476138 473122 470058 467053
66636 467053 464470 462808 461996 461109 459270 456683 454249 452318 450433 448275 446132 444247 442297 439920 437291
66621 437291 434769 432347 429830 427311 425073 423154 421388 419734 418217 416605 414471 411615 408314 405182
66607 405182 402867 401663 401210 400641 399238 396999 394503 392334 390608 388972 387050 385034 383651 383196 382786
66592 382786 381187 378438 375884 374304 372835 370368 367236 364582 362547 360268 357555 355375 354367 353900
66578 353900 353103 352066 351376 351024 350468 349465 348238 346965 345588 344100 342598 341151 339846 338856 338129 337130
66562 337130 335276 332557 329438 326258 323197 320767 319711 320115 321007 321197 320307 318779 317121 315568 314283
66547 314283 313378 312620 311486 309746 307702 305703 303640 301237 298709 296756 295845 295697 295608 295101 294133 292814
66531 292814 291187 289328 287553 286245 285377 284379 282729 280713 279237 278701 278374 277192 275009 272666 270909
66516 270909 269663 268384 266699 264641 262597 261103 260287 259484 257886 255727 254225 254065 254530 254594 254277 254206
66500 254206 254315 253895 252741 251334 249865 248045 246072 244804 244516 244265 243192 241783 241012 240723 239899 238413
66484 238413 237467 237970 239264 239993 239708 239080 238821 238946 239001 238569 237492 235927 234265 232806 231530 230300 229219
66467 229219 228534 228291 228341 228600 228923 228745 227401 225048 222807 221619 221253 220811 219941 219067 218587 218402 218249 218003
66449 218003 217537 216669 215492 214424 213754 213315 212728 211810 210681 209638 208956 208683 208585 208477 208430 208476 208312 207752
66431 207752 207267 207487 208201 208501 207962 207000 205951 204594 202948 201704 201343 201463 201576 201912 202693 203191 202459
66414 202459 200724 199110 198152 197392 196391 195206 193892 192305 190602 189193 188045 186699 185142 183967 183406
66399 183406 182967 182408 182347 183321 184752 185512 185251 184598 184144 183832 183369 182799 182442 182456 182655 182738 182605 182389 182227
66380 182227 182119 182045 182000 181857 181453 180912 180540 180125 178852 176451 174017 172949 173195 173331 172355 170658 169173
66363 169173 168334 168104 168271 168381 168016 167431 167304 167589 167346 166114 164668 163876 163573 163269 163266 164088 165218 165527
66345 165527 164857 164233 164383 164854 164870 164333 163605 162771 161579 159917 158068 156496 155495 155020 154890 155143 156004
66328 156004 157335 158359 158246 156906 155026 153457 152711 152809 153261 153354 152826 152176 152080 152642 153450 154122 154432 154148
66310 154148 153229 152112 151369 151154 151274 151632 152099 152162 151328 149898 148738 148183 147708 146859 145967 145668 146121 147005
66292 147005 147942 148619 148822 148633 148348 147997 147208 145830 144437 143833 144171 144864 145270 145204 144812 144254 143645 143140
66274 143140 142899 142949 143132 143245 143212 143069 142763 142161 141275 140325 139413 138359 137073 135907 135270 135002 134518 133568
66256 133568 132427 131341 130252 129261 128911 129668 131293 133029 134281 134985 135451 136011 136705 137182 137044 136359 135662
66239 135662 135390 135519 135837 136235 136539 136362 135494 134278 133344 132986 133024 133111 133017 132718 132445 132543 133075 133684 133994 133971
66219 133971 133623 132607 130664 128369 126888 126756 127297 127496 127154 126825 126873 127064 127090 127030 127095 127189 127045 126703 126523
66200 126523 126640 126651 126056 124945 124047 124058 124987 126159 126822 126710 126147 125627 125321 125024 124624 124466 125073 126526
66182 126526 128288 129691 130490 130944 131511 132502 133889 135331 136467 137223 137778 138274 138746 139280 139957 140564 140642
66165 140642 140023 139079 138259 137569 136774 135910 135238 134826 134551 134435 134540 134432 133261 130705 127583 125184 124073
66148 124073 123811 123793 124018 124873 126358 127770 128238 127450 125778 123782 121782 119964 118640 118110 118279 118642 118734
66131 118734 118475 118088 117814 117752 117803 117713 117343 116953 117003 117560 118111 118121 117601 116901 116135 115096 113719 112320 111346
66112 111346 111029 111257 111688 112030 112425 113413 115247 117291 118478 118453 117863 117435 117073 116129 114291 111907 109624
66095 109624 107962 107085 106687 106200 105397 104699 104666 105253 105912 106333 106712 107239 107696 107779 107570 107460 107722 108323 109033
66076 109033 109525 109443 108581 107150 105823 105383 106101 107382 108194 108061 107607 107880 109159 110666 111561 111919 112429
66059 112429 113280 113747 113097 111675 110734 111057 112050 112472 111893 110951 110202 109361 108092 107023 107262 108958 110990
66042 110990 112213 112474 112275 111927 111444 110924 110645 110804 111336 111904 111995 111242 109822 108339 107201 106322 105605 105392
66024 105392 106086 107431 108538 108708 108091 107455 107398 107882 108571 109525 111292 114153 117541 120542 122823 124679
66008 124679 126318 127687 128985 130612 132322 133072 132214 130433 129049 128759 129443 130697 131945 132417 131815 130935
65992 130935 130895 131738 132387 132033 130962 129871 128991 128169 127331 126428 125201 123394 121082 118586 116153 113885
65976 113885 111835 109990 108248 106613 105376 104917 105284 106040 106679 107141 107754 108550 108871 108018 106269 104817
65960 104817 104528 105104 105654 105688 105256 104564 103911 103705 104058 104514 104702 105026 106115 107694 108630 108192 106702 104913
65942 104913 103352 102425 102529 103647 105179 106494 107450 108112 108291 107686 106350 104770 103522 102948 103008 103348 103583
65925 103583 103599 103516 103481 103609 103979 104377 104159 102810 100665 98727 97699 97508 97749 98166 98612 98959 99293 99850
65907 99850 100586 101086 101056 100621 100030 99347 98628 98079 97822 97709 97561 97442 97605 98278 99532 101132 102566 103456
65889 103456 103898 104136 104094 103686 103373 103679 104143 103655 102088 100776 100801 101490 101265 99548 97122 94980 93502
65872 93502 92695 92555 93015 93860 94711 95020 94309 92717 91033 89931 89374 88990 88686 88534 88436 88356 88604 89336 90073
65853 90073 90255 90128 90410 91132 91423 90577 88853 87144 86217 86333 87175 88015 88279 88084 87986 88197 88351 88107 87640
65834 87640 87342 87297 87253 87126 87357 88646 91208 94362 97101 99036 100452 101402 101392 100316 99175 99166 100350 101860
65816 101860 103272 105021 107432 109995 111856 112585 112305 111520 110916 110863 110867 109930 107741 105259 103856 104020 105110
65799 105110 106157 106664 106673 106360 105754 104877 104023 103583 103528 103331 102574 101425 100279 99280 98500 98279 98829 99637 99829
65780 99829 99102 97925 96849 96082 95672 95552 95381 94844 94207 94066 94474 94789 94547 93969 93467 93113 92782 92361
65762 92361 91624 90422 89188 88737 89317 90317 91195 92091 93137 93773 93389 92261 91263 90800 90564 90151 89416
65745 89416 88360 87155 86214 85794 85613 85220 84634 84225 84083 83962 83834 83951 84346 84688 84772 84742 84698 84430 83716
65726 83716 82631 81426 80355 79726 79864 80789 82080 83228 84017 84509 84820 85019 85093 84958 84628 84381 84510 84872
65708 84872 84933 84377 83386 82208 80844 79490 78830 79318 80388 81037 81236 81976 83695 85355 85704 84917 84180
65691 84180 83928 83435 82246 81062 80708 80946 81023 80979 81550 82907 84258 84826 84637 84086 83283 82239 81321 80996
65673 80996 81223 81478 81427 81306 81546 82152 82613 82415 81607 80807 80594 80931 81231 80966 80156 79337 79197 80143 81973
65654 81973 83926 85228 85691 85682 85551 85292 84837 84418 84437 85019 85822 86239 85787 84452 82733 81261 80324 79799
65636 79799 79491 79400 79646 80264 81109 81811 81858 81025 79765 78885 78735 78919 78978 79001 79323 79879 80287 80414 80451 80423 80067
65615 80067 79320 78574 78175 77915 77368 76618 76289 76742 77543 77958 77769 77310 76796 75982 74654 73103 71860 71150
65597 71150 70856 70856 71071 71301 71351 71314 71412 71605 71719 71961 72817 74227 75344 75438 74783 74246 74227 74388 74322 74036 73751
65576 73751 73574 73539 73743 74292 75196 76424 77945 79617 81088 81935 81948 81305 80432 79643 78974 78446 78368 79123 80531
65557 80531 81703 81799 80849 79649 78858 78422 77903 77184 76706 77027 78168 79440 80046 79904 79720 80100 80782 80996
65539 80996 80505 79847 79519 79344 78935 78418 78251 78495 78768 78896 79068 79252 78979 78079 77172 76998 77543 78304 79126
65520 79126 80130 81001 81132 80525 79862 79520 79183 78658 78294 78169 77648 76389 75172 74972 75709 76670 77676 78842
65502 78842 79616 79265 78257 77945 78655 79201 78620 77362 76305 75623 75252 75546 76557 77359 77058 76091 75653 76122
65484 76122 76907 77582 78269 78926 79163 78932 78734 78886 79098 79016 78779 78817 79389 80406 81453 81915 81412 80157 78678
65465 78678 77228 75786 74555 73990 74234 74950 75784 76582 77052 76771 75881 75319 75821 76936 77544 77263 76818 76932
65447 76932 77401 77582 77436 77614 78574 80070 81562 82772 83616 83940 83650 82927 81969 80668 78910 77092 75861
65430 75861 75331 75072 74987 75670 77510 79875 81595 82035 81355 79967 78209 76415 74860 73620 72749 72494 73012
65413 73012 73937 74594 74685 74502 74465 74741 75340 76255 77340 78276 78843 79156 79541 80163 80861 81359 81688 82312 83736
65394 83736 85955 88438 90629 92324 93584 94597 95698 97257 99377 101898 104701 107685 110446 112524
65380 112524 114155 116296 119576 123689 128161 133130 138833 144873 150691 156393 162265 167760 171807 174130
65366 174130 175438 176308 176614 176151 175031 173191 170245 166212 161823 157722 153756 149405 144541 139444 134417
65351 134417 129698 125526 122002 119030 116464 114110 111643 108933 106475 104960 104313 103704 102675 101652 101049
65336 101049 100517 99544 98298 97245 96378 95464 94736 94628 94950 95012 94570 94059 93782 93461 92786 92025 91769 92296
65318 92296 93386 94607 95623 96331 96834 97244 97509 97493 97253 97065 97078 96990 96218 94502 92323 90546 89520 88665
65300 88665 87173 85008 82909 81380 80157 78810 77510 76817 76914 77393 77733 77730 77527 77482 77939 78894 79859 80260
65282 80260 80040 79706 79778 80248 80553 80026 78471 76444 74896 74395 74694 75114 75267 75304 75620 76475 77821 79258
65264 79258 80100 79780 78350 76554 75265 74797 74778 74656 74211 73587 73000 72602 72580 73055 73754 74108 73941 73853 74539
65245 74539 75880 77012 77288 76770 75874 74969 74347 74098 73869 73137 71927 70905 70619 70982 71661 72488 73218 73363
65227 73363 72700 71659 70806 70230 69821 69767 70230 70801 70927 70774 71047 71893 72582 72463 71792 71342 71560 72306 73168
65208 73168 73765 73942 73924 74198 75088 76462 77914 79190 80398 81825 83546 85158 85991 85672 84480 83140
65192 83140 82366 82561 83613 84767 85052 84271 83461 83917 85817 88166 90025 91217 91791 91458 90000 87837
65176 87837 85702 83928 82420 81139 80171 79363 78323 76940 75620 74824 74534 74350 74022 73672 73531 73591 73602
65159 73602 73313 72705 72055 71773 72078 72759 73360 73723 74279 75552 77422 79066 79738 79417 78661 78036 77798 77891
65141 77891 78000 77772 77210 76730 76626 76618 76178 75212 74102 73128 72238 71425 70967 71066 71549 72151 72860 73700 74310 74154
65121 74154 73253 72453 72724 74225 76165 77562 78013 77766 77274 76887 76873 77480 78856 81028 83928 87277 90488
65104 90488 93069 95279 98061 102006 106625 110956 114703 118329 122160 125900 129124 131714 133671 134911
65090 134911 135540 135958 136353 136334 135417 133665 131517 129164 126510 123660 120900 118165 114988 111277 107782 105435
65074 105435 104332 103617 102259 99759 96243 92230 88362 85146 82817 81411 80819 80643 80222 79211 78064
65059 78064 77545 77674 77605 76728 75463 74562 74035 73292 72119 70924 70045 69396 68933 68897 69334 69802 69876 69678 69596
65040 69596 69738 69946 70138 70271 70099 69375 68269 67370 67190 67829 69025 70357 71438 72123 72546 72866 73034 72955
65022 72955 72796 72937 73584 74533 75320 75567 75241 74674 74211 73818 73147 72051 70833 69886 69316 69100 69350 70157
65004 70157 71282 72306 72991 73336 73421 73492 74016 75293 77068 78835 80457 82108 83691 84800 85353 85832 86700
64987 86700 87885 89046 90039 90821 91152 90772 89849 88944 88446 88195 87685 86542 84743 82519 80225 78319 77240
64970 77240 77047 77251 77233 76867 76468 76148 75614 74767 74082 74028 74411 74701 74757 74752 74639 74305 74150 74836 76313 77697
64950 77697 78290 78178 77671 76768 75599 74839 75084 76060 76957 77391 77670 78215 79128 80236 81213 81681 81489 80856
64932 80856 80068 79143 78115 77447 77702 78788 79940 80549 80681 80610 80244 79345 78123 77186 76821 76582 75775 74240
64914 74240 72478 71059 70069 69243 68433 67752 67343 67249 67452 67784 67867 67494 67146 67695 69315 71027 71683 71145
64896 71145 70143 69163 68041 66606 65185 64272 64071 64539 65579 66898 67931 68230 67921 67584 67634 67927 67997
64879 67997 67676 67420 67848 68923 69819 69895 69559 69725 70465 70845 70214 69059 68149 67450 66489 65460 65165 65887
64861 65887 66975 67630 67571 66878 65755 64660 64143 64297 64802 65685 67467 70166 72687 73732 73046 71362 69528
64844 69528 68180 67827 68482 69353 69563 69107 68616 68404 68427 68908 70028 71069 70976 70003 69692 70746 71986 72160
64826 72160 71764 71990 72664 72607 71734 71331 72092 73125 73428 73368 73951 75204 76073 75707 74256 72462 70953 70025
64808 70025 69773 70126 70760 71139 70825 69851 68733 68056 68101 68855 70148 71596 72636 72873 72372 71488 70582 69992
64790 69992 69957 70289 70388 69970 69512 69555 69814 69539 68635 67812 67631 67965 68471 68963 69188 68787 67831 66948 66633 66706
64770 66706 66708 66548 66526 66937 67757 68551 68672 67863 66752 66356 67032 68207 69169 69661 69629 68983 67935 67099 66923
64751 66923 67291 67875 68525 69101 69442 69758 70508 71538 71858 70850 69262 68378 68540 69136 69750 70531 71479 72195
64733 72195 72525 72900 73698 74683 75327 75437 75184 74715 74007 73110 72352 72143 72548 73138 73411 73240 72677 71510 69557
64714 69557 67443 66394 66897 68053 68708 68753 68792 69013 69166 69384 70112 71222 71961 71947 71564 71155 70430 69039
64696 69039 67241 65655 64654 64313 64692 65795 67413 69221 70992 72570 73791 74538 74799 74623 74157 73697
64680 73697 73471 73285 72666 71434 69934 68622 67651 67014 66814 67130 67653 67751 67007 65695 64590 64179 64114 63720
64662 63720 63094 63241 64831 67169 68930 69634 69791 69763 69304 68406 67803 68180 69317 70464 71261 71925 72815 74140
64644 74140 75852 77527 78590 78941 79087 79357 79364 78644 77476 76600 76368 76714 77724 79524 81703 83563 85115
64627 85115 87109 89786 92200 93222 92781 91692 90586 89586 88786 88408 88405 88395 88192 88125 88616 89602 90527 90844
64609 90844 90523 90169 90619 92181 94207 95607 95908 95606 95399 95296 94742 93462 91848 90518 89793 89728 90382
64592 90382 91719 93258 94134 93815 92798 92325 93224 95078 96768 97734 98385 99296 100443 101496 102462 103555
64576 103555 104603 105102 104873 104309 103923 103980 104578 105703 107092 108371 109433 110383 111064 111081 110440 109749 109504 109557
64558 109557 109572 109614 109903 110328 110618 110780 110931 110917 110563 110101 109864 109649 108908 107566 106122 104905 103742 102491
64540 102491 101457 100989 100978 100968 100531 99413 97597 95409 93373 91761 90439 89214 88111 87193 86321 85310
64524 85310 84171 83096 82321 82084 82524 83463 84401 84868 84752 84268 83780 83601 83729 83747 83239 82389 81828 81807 81848
64505 81848 81469 80883 80579 80486 80008 78841 77306 75905 75006 75001 76229 78355 80176 80573 79608 78355 77642 77362
64487 77362 77019 76530 76185 76128 76321 76862 77876 79042 79689 79570 79245 79443 80255 81181 81768 81966 82003 82223 82972
64468 82972 84331 85927 87217 87968 88368 88787 89610 91173 93539 96333 99004 101231 102923 103983 104381 104391
64452 104391 104444 104730 105209 105896 106758 107414 107418 106887 106375 105993 105219 103854 102620 102353 102948 103674 104298 105281 106911
64433 106911 108854 110765 112848 115432 118305 120849 122821 124625 126745 129131 131292 132862 133948 134986
64419 134986 136429 138526 141203 144065 146612 148574 150036 151261 152434 153528 154258 154203 153159 151441 149661
64404 149661 148179 146909 145563 143732 140806 136407 131154 126514 123484 121770 120589 119748 119436 119434 119337 119324
64388 119324 119855 120685 120991 120543 120004 119883 119905 119650 119181 118670 117989 117020 115942 114901 113809 112758 112205 112434
64370 112434 113244 114407 115981 117923 119917 121912 124278 126966 129095 129982 130166 130800 132339 134416 136617
64355 136617 138646 139984 140270 140094 140705 142784 145989 149748 153899 158340 162589 166126 169006 171931 175754
64340 175754 180874 186920 193082 198969 205100 212334 220980 230812 241875 254833 270417 288881 310084
64327 310084 333826 359948 388275 418542 450239 482463 513970 543265 568510 587567 598541
64316 598541 600446 593304 577858 555484 528161 497996 466555 434829 403688 373993 346248 320551
64304 320551 297086 276364 258812 244314 232244 221817 212419 203887 196571 190888 186722 183441 180567
64291 180567 178211 176698 175967 175541 174964 174080 172902 171425 169709 168067 166891 166086 164869 162495 159186
64276 159186 155936 153331 151076 148872 147119 146189 145466 143894 141376 138917 137331 136392 135417 134155 132927
64261 132927 132220 132344 133157 134052 134471 134454 134395 134378 134247 134290 135198 137178 139633 141995 144358 146922 149297 150903
64243 150903 151833 152891 154790 157552 160656 163577 166202 168769 171326 173380 174393 174533 174538 174835 175294 175873
64227 175873 176841 178109 179020 179259 179388 179943 180574 180834 181378 183463 187391 192328 197723 204063 211924 221032
64211 221032 230746 240978 252122 264429 278041 293503 311757 333496 358759 387146 418104 450924
64199 450924 484730 518631 551695 582516 608887 628254 638717 639600 631160 614097 589619 559775
64187 559775 527150 493928 461271 429636 399439 371315 345858 323298 303394 285598 269445
64176 269445 254879 242065 230846 220615 210877 201786 193938 187718 183007 179418 176517 173841 170964
64163 170964 167745 164463 161600 159463 158041 157222 157042 157540 158375 158877 158703 158282 158276 158679 158872 158576 158280 158537
64145 158537 159246 159945 160516 161220 162194 163258 164121 164582 164627 164549 164757 165230 165367 164739 163782 163332 163524 163663 163235
64126 163235 162596 162454 163055 164115 165339 166629 167877 168847 169439 169987 171105 173095 175564 177886 180113 183144
64110 183144 187705 193354 198892 203703 208299 213507 219534 226032 232783 239971 247925 256851 266779 277539
64096 277539 288652 299381 309026 317296 324448 331016 337388 343709 350248 357686 366783 377713 389904
64083 389904 402601 415469 428643 442288 456147 469370 480714 489093 493990 495329 492976 486617
64071 486617 476260 462685 447232 431196 415494 400704 387128 374709 363121 352185 342211 333870
64059 333870 327643 323416 320591 318542 317026 316294 316904 319243 323019 327226 330954 334316 338360 343842 350250
64044 350250 356163 360409 362682 363277 362642 361180 359117 356475 353382 350352 347922 345919 343494 340153 336568
64029 336568 334056 333336 333960 334928 335692 336532 338086 340621 343818 347304 351246 356175 362236 368879 375493
64014 375493 382180 389723 398773 409156 420006 430628 441286 453014 466455 480980 495272 508812
64002 508812 522434 537293 553689 571193 589571 609148 630408 653658 679004 706305 735221
63991 735221 765631 798006 833040 870943 911427 954310 999696 1047555 1097771 1150855 1208166
63980 1208166 1271042 1340126 1416005 1500227 1595193 1703252 1826483 1967457 2129675 2317216
63970 2317216 2534393 2786070 3077961 3416201 3806383 4252556 4756284 5315994 5927262
63961 5927262 6584157 7280619 8010774 8768159 9544376 10327429 11100293 11841027 12525346
63952 12525346 13130633 13639149 14039250 14324937 14494339 14547428 14483837 14302328 14002467 13587283
63942 13587283 13065249 12450941 11764289 11028206 10264940 9492889 8725657 7973318 7244226
63933 7244226 6546133 5886595 5272802 4710704 4203801 3752618 3355298 3008529 2707977
63924 2707977 2448424 2224239 2030122 1861599 1715047 1587530 1476576 1379909 1295285 1220556
63914 1220556 1153820 1093466 1038261 987487 940851 898079 858609 821790 787189 754539 723518
63903 723518 693854 665552 638669 612878 587534 562275 537295 513015 489744 467751 447356
63892 447356 428747 411880 396650 382943 370473 358853 347978 338047 329075 320740 312895 305821
63880 305821 299587 293530 286896 279771 272863 266600 261026 256424 253280 251460 250076 248430 246594 244825
63866 244825 242970 240857 238882 237738 237730 238698 240323 242203 243838 244965 245807 246685 247486 247706 246930 245081
63850 245081 242373 239176 235685 231590 226391 220277 214284 209229 204886 200604 196240 191928 187418 182538
63836 182538 178033 174924 172967 170719 167334 163472 160075 157103 154045 150995 148497 146708 145349 144225
63822 144225 143260 142205 140819 139199 137534 135715 133621 131593 130124 129175 128237 127066 125904 124981 124217
63807 124217 123471 122776 122217 121881 121950 122532 123342 123776 123429 122370 120938 119508 118448 117963 117815 117384 116209
63790 116209 114428 112663 111515 111103 110939 110315 109036 107695 107038 107083 107151 106763 106154 105761 105531 105044 104222 103598
63772 103598 103790 104798 105937 106538 106693 107103 108137 109283 109839 109940 110417 111607 112833 113315 113195 113272 113928
63755 113928 114742 115073 114685 113817 112934 112470 112505 112604 112235 111464 111022 111537 112887 114502 116106 117838 119788 121830
63737 121830 123975 126559 129877 133843 138157 142521 146525 149652 151820 153704 156028 158555 160327 160962
63723 160962 161168 161727 162504 162985 163366 164506 166750 169311 170871 170584 168528 165490 162415 159783 157376 154729
63707 154729 151754 148802 146178 143833 141567 139341 137329 135742 134586 133548 132280 130894 129934 129663 129618
63692 129618 129189 128380 127566 126762 125767 124938 125109 126570 128783 131329 134540 138771 143573 148113 152058 155549
63676 155549 158574 160926 162640 163941 164734 164529 162931 160023 156331 152653 149767 147947 146782 145687 144494
63661 144494 143337 142206 141042 140142 139999 140749 142228 144526 147942 152251 156569 160195 163254 166240 169317
63646 169317 172413 175759 179951 185478 192298 199765 206958 213432 219836 227516 237261 248680 260963 273850
63632 273850 287441 301388 314911 327498 339048 349223 357149 361967 363496 362290 359354 355828 352612
63619 352612 350089 348249 347034 346314 345696 344782 343657 342621 341289 338482 333324 326098 317713 308699 299184
63604 299184 289565 280654 273195 267546 263772 261613 260403 259416 258403 257580 257169 257255 257989 259504 261569 263695
63588 263695 265634 267441 269067 270316 271371 272888 275310 278402 281701 285173 289167 294012 299975 307424
63574 307424 316662 327624 339866 352728 365384 376984 386898 394666 399641 401113 399103 394667 389025
63561 389025 382688 375843 369175 363638 359609 357075 356486 358434 362168 365329 365852 363664 360000 355575 350178
63546 350178 343763 336955 330293 323653 316756 309780 303118 296810 290594 284350 278181 272141 266136 260032
63532 260032 253651 246767 239437 232273 226013 220693 215615 210317 205216 200954 197399 193876 190288 187417
63518 187417 185880 185252 184571 183405 182070 181026 180465 180385 180644 180862 180594 179714 178477 177237 176280 175895 176296
63501 176296 177465 179248 181620 184591 187851 190881 193505 196022 198667 201277 203717 206350 209676 213670
63487 213670 217765 221379 224135 225718 225989 225375 224791 224918 225709 226631 227184 227055 226132 224714 223571 223477 224625
63470 224625 226679 229253 232074 234748 236838 238335 239784 241691 244052 246599 249298 252362 256006 260405
63456 260405 265665 271503 277258 282692 288585 295949 304716 313847 322853 332481 343664 356447 370472
63443 370472 385962 403517 423122 443922 464931 485443 504732 521724 535150 543959 547773 547174
63431 547174 543404 537633 530723 523753 518158 514755 512938 511463 509807 508168 506338 503404 498578 491623
63417 491623 482369 470599 456717 441988 427711 414498 402454 391510 381327 371376 361540 352332
63405 352332 344338 337800 332864 329656 327833 326668 326061 326972 330263 335516 341522 347670 354314 362044 371211
63390 371211 381949 393981 406459 418576 430361 442384 454734 466844 478355 489559 500826
63379 500826 512092 523101 533571 542741 549201 551758 550469 546507 540997 534332 526703 518945 512443
63366 512443 508102 505666 504246 503344 503016 503061 502503 500132 495314 488111 478953 468472 457367 445980 434163
63351 434163 421910 409917 399139 389844 381561 373899 366955 360879 355443 350218 344892 339313 333480
63338 333480 327607 321992 316773 312031 308103 305365 303594 301903 299588 296861 294553 293258 292912 293038 293207
63323 293207 293366 293888 295271 297765 301333 305857 311123 316552 321307 324836 327171 328587 329180 328872 327542
63308 327542 324951 320788 315120 308706 302581 297355 293052 289495 286542 283922 281165 277891 274111 270178
63294 270178 266498 263312 260676 258575 257066 256274 256235 256713 257249 257427 257122 256552 256136 256266 257082 258336 259474
63277 259474 259965 259689 258990 258268 257580 256769 255997 255936 257216 259757 262788 265507 267701 269760 272167 274919
63261 274919 277470 279408 281226 284077 288483 293551 297888 301133 304111 307544 311262 314862 318544 322866
63247 322866 328035 333948 340727 348678 357770 367567 377749 388375 399575 411340 423731 436981 451130
63234 451130 465776 480427 495103 510412 527036 545211 564618 584607 604513 623855 642374
63223 642374 660004 676968 693865 711413 729930 749230 769178 790168 812666 836316 859952
63212 859952 882606 904053 924005 941100 953243 958934 957957 950887 938515 921873 902265 880792
63200 880792 857930 833866 809122 784693 761697 741070 723407 708787 696807 687140 680119 676608
63188 676608 677115 681120 687399 695100 704481 716449 731293 748037 765299 782640 800685 819927 839976
63175 839976 860217 880665 901648 922931 943770 963797 983399 1003216 1023521 1044037 1063964
63164 1063964 1082230 1098105 1111591 1122849 1131246 1135421 1134393 1128210 1117408 1102333 1083248 1060796
63152 1060796 1035920 1009512 982408 955554 929840 905807 883754 864082 847271 833450 822166
63141 822166 812755 804888 798636 793915 789997 785734 780278 773456 765463 756527 747067 737859 729631 722539
63127 722539 716357 711024 706634 702987 699632 696450 693826 692159 691566 692112 693881 696625 699684 702495 704886
63112 704886 706726 707666 707572 706928 706437 706328 706291 706019 705573 705288 705503 706304 707409 708373 709002 709500 710199 711257
63094 711257 712635 714153 715589 716952 718608 720802 723141 725024 726624 728810 731880 735009 737361 739208
63080 739208 741406 744177 747098 749990 753127 756638 760322 764122 768310 773120 778548 784579 791268 798603
63066 798603 806534 815088 824235 833805 843856 854916 867430 881131 895481 910631 927412 946462
63054 946462 967881 991729 1018168 1046974 1077503 1109359 1142631 1177352 1213283 1250373 1288752
63043 1288752 1327873 1366222 1402381 1435986 1467331 1496634 1524338 1551628 1579728 1608751 1637952
63032 1637952 1667063 1696618 1726705 1756003 1782424 1804389 1821126 1832037 1836193 1832485 1820038 1798465
63020 1798465 1767950 1729346 1684209 1634581 1582437 1529182 1475758 1423212 1372947 1326322 1284187
63009 1284187 1246941 1214834 1188053 1166743 1151179 1141699 1138130 1139567 1145129 1154802 1169090 1187959
62997 1187959 1210685 1236745 1266118 1298433 1332435 1366772 1400978 1435264 1469592 1503473 1536482
62986 1536482 1568485 1599450 1629428 1658616 1686870 1712970 1734844 1750780 1760176 1762911 1758287 1744972
62974 1744972 1721945 1689270 1647962 1599320 1544437 1484248 1419897 1352934 1285049 1217693 1152028
62963 1152028 1089172 1030206 975857 926264 881080 839683 801370 765700 732825 703240 677048
62952 677048 653681 632550 613680 597308 583047 569940 557406 545678 535155 525615 516364 506976
62940 506976 497665 488981 481269 474385 467842 461320 455088 449743 445394 441362 436880 431933 427083 422542
62926 422542 417848 412550 406874 401461 396673 392476 388829 385820 383374 381205 379193 377550 376362 375179
62912 375179 373392 370981 368615 366916 365857 364946 363811 362469 361156 360062 359186 358378 357510 356585 355615 354461
62896 354461 352985 351330 349807 348518 347360 346442 346079 346168 346005 345079 343742 342642 341753 340538 338922 337499
62880 337499 336730 336555 336918 338092 340105 342279 343737 344148 343759 343007 342428 342599 343645 344883 345389 344976 344351
62863 344351 344271 344799 345398 345531 345047 344117 342953 341625 340128 338551 337056 335662 334193 332539 330916 329762
62847 329762 329423 329888 330761 331470 331706 331664 331738 332038 332466 333197 334624 336633 338368 339014 338544 337400 335767 333616
62829 333616 331288 329505 328786 329155 330384 332218 334381 336713 339290 342095 344627 346256 347067 347970 349824
62814 349824 352705 356127 359677 363213 366703 370158 373640 377156 380673 384385 388838 394554 401532 409290
62800 409290 417392 425795 434655 444010 453874 464664 477267 492462 510322 530422 552654 577532
62788 577532 605575 636741 670754 707795 748468 793187 842005 894974 952226 1013488 1077793
62777 1077793 1143811 1210246 1275811 1339086 1398524 1452468 1499135 1536887 1564723 1582235 1588992
62766 1588992 1584250 1567609 1539759 1502319 1457049 1405408 1348674 1288128 1225094 1161076 1097769
62755 1097769 1036592 978151 922387 869333 819472 773275 730691 691286 654769 621169 590634
62744 590634 563200 538678 516557 496204 477424 460801 447095 436176 426829 417830 409019 401088
62732 401088 394570 389356 385138 381808 379312 377438 376065 375464 376133 378336 381927 386492 391554 396804 402364
62717 402364 408867 417086 427419 439711 453530 468571 484900 502973 523449 546926 573823 604360
62705 604360 638502 675976 716664 761089 810262 864828 924497 988374 1055590 1125308 1196363
62694 1196363 1267250 1336376 1401935 1461584 1512693 1553143 1581766 1598035 1601664 1592661 1571545 1539254
62682 1539254 1496920 1445871 1387808 1324793 1258902 1191814 1124759 1058925 995748 936506 881537
62671 881537 830256 782168 737556 696864 659747 625336 593365 564523 539532 518206 499508
62660 499508 482208 465551 449638 435220 422724 411475 400290 388889 378145 368826 360738 353415
62648 353415 346940 341442 336290 330613 324435 318532 313234 308159 303272 299412 297281 296393 295541 294031 291980
62633 291980 289660 287140 284628 282581 281208 280179 279138 278262 277997 278367 278940 279478 280228 281448 282941 284347
62617 284347 285684 287336 289636 292674 296455 300950 306051 311665 317828 324537 331625 339073 347448 357676
62603 357676 370272 385055 401687 420255 441184 464749 490821 518991 548920 580591 614180
62592 614180 649455 685324 720141 752426 781132 805397 824467 837896 845477 846950 842149 831536
62580 831536 816143 796891 774356 749322 723019 696441 669784 642872 615810 588984 562845
62569 562845 538137 515908 496693 479921 464595 450305 437017 424303 411634 399387 388606
62558 388606 379556 371265 362890 354803 347844 341985 336411 330645 324998 320043 316134 313378 311555 310044
62544 310044 308207 306037 304150 303112 303037 303876 305741 308741 312738 317512 322979 329055 335466 342001 348896
62529 348896 356705 365829 376431 388813 403550 421060 441242 463717 488333 515282 544838 577160
62517 577160 612297 650211 690799 733913 779237 825944 872533 917144 958093 994100 1024185
62506 1024185 1047548 1063514 1071502 1071142 1062566 1046423 1023429 994081 959103 919966 878546 836285
62494 836285 794053 752696 713154 675901 640835 608036 578215 552097 529687 510485 494053
62483 494053 479924 467227 455067 443383 433006 424653 418096 412482 407267 402642 399042 396455 394401
62470 394401 392570 391214 390697 390887 391373 392199 393897 396703 400260 404304 409187 415311 422439 429945 437501
62455 437501 445103 452696 460187 467570 474508 479982 482976 483462 482166 479370 474549 467296 458047 447694
62441 447694 436952 426377 416516 407634 399536 391964 384991 378739 373020 367633 362901 359531 357884 357615
62427 357615 358063 358852 360073 362057 365088 369288 374649 381042 388133 395405 402490 409521 417035 425439 434604
62412 434604 443992 453025 461354 468936 476063 483214 490722 498506 506111 512987 518739 523257 526702 529363
62398 529363 531410 532737 533036 532088 530068 527656 525793 525212 526068 527972 530322 532729 535327 538823 544125
62383 544125 551784 561745 573704 587519 603235 620838 640267 661663 685409 711812 740802 771941
62371 771941 804690 838691 873791 909722 945657 980211 1011963 1039942 1063556 1082246 1095430
62360 1095430 1102773 1104447 1101226 1094342 1084974 1073555 1059616 1042469 1021952 998383 972110 943538
62348 943538 913547 883433 854329 826842 801228 777581 755819 735806 717639 701643 687912
62337 687912 676029 665307 655232 645639 636609 628224 620372 612908 606070 600523 596737 594516 593493
62324 593493 593828 595823 598912 601721 603430 604582 606278 608954 612208 615394 617989 619717 620736 621531 622307
62309 622307 622688 622343 621665 621449 622117 623693 626341 630252 634977 639422 642846 645596 648605 652391 656695
62294 656695 660906 664608 667768 670630 673437 676220 678855 681330 683933 687134 691310 696560 702777 709928
62280 709928 718297 728321 740219 753956 769695 787982 809121 832557 857352 883382 911622 943032
62268 943032 977418 1013548 1050037 1085775 1119699 1150650 1177570 1199694 1216621 1228475 1235914 1239641
62256 1239641 1239833 1236252 1228814 1217713 1203025 1184744 1163476 1140560 1117107 1093279 1068974 1044887
62244 1044887 1022223 1001482 982277 964504 949019 936836 928037 921858 917475 914350 912101 910472
62232 910472 909459 909188 909709 910971 912841 915011 917084 918887 920453 921562 921658 920497 918604 916747 915186
62217 915186 913714 912176 910584 909040 907948 908028 909531 911654 913423 915111 918141 923455 930544 938286 946191
62202 946191 954538 963763 974057 985345 997303 1009603 1022320 1035938 1050801 1066719 1083147 1099500
62190 1099500 1115222 1129891 1143504 1156492 1169319 1182301 1195935 1211063 1228417 1248068 1269455
62179 1269455 1291892 1315004 1338833 1363569 1388917 1413691 1436232 1455270 1470273 1481127 1487999
62168 1487999 1491568 1492899 1492802 1491485 1488878 1484860 1479069 1470990 1460493 1447947 1433666 1417780 1400943
62155 1400943 1384592 1369916 1356897 1344871 1333695 1323799 1315297 1307687 1300384 1293073 1285575 1277869 1270225
62142 1270225 1262846 1255321 1246867 1237216 1226955 1216904 1207482 1198734 1190599 1182963 1175646 1168560 1161811
62129 1161811 1155663 1150436 1146343 1143258 1140758 1138601 1137058 1136596 1137417 1139583 1143369 1149089 1156659 1165728
62115 1165728 1176050 1187092 1197179 1203778 1205146 1201528 1194579 1186132 1177858 1171542 1168596 1168848 1170114
62102 1170114 1169285 1163927 1153131 1137470 1118600 1098749 1079933 1063280 1048953 1036733 1026552 1018420
62090 1018420 1012148 1007438 1004228 1002681 1002759 1004048 1006184 1009312 1013971 1020493 1028587 1037482 1046511 1055573
62076 1055573 1064999 1074865 1084556 1093128 1099908 1104448 1106109 1104284 1099177 1091878 1083442 1074234 1064283 1053649
62062 1053649 1042024 1028462 1012118 993100 972129 949733 926347 902990 881005 860972 842319
62051 842319 824148 806080 788312 771382 755991 742561 730723 719585 708690 698378 689062 680549
62039 680549 672400 664593 657429 650914 644614 638077 631174 624021 616779 609597 602617 595949 589603 583439
62025 583439 577202 570729 564137 557761 551941 546905 542774 539515 536954 534933 533446 532492 531887 531403 531011
62010 531011 530778 530585 530196 529584 528968 528496 528155 527948 527879 527686 526825 524856 521711 517627 513027 508470 504386
61993 504386 500770 497324 493993 491100 488924 487405 486430 486126 486680 488083 490205 492957 496192 499629 503109
61978 503109 506895 511483 517152 523756 530960 538527 546369 554400 562445 570394 578406 586806 595650 604591
61964 604591 613350 622149 631471 641544 652380 664110 676796 690015 703275 716976 732379 750269
61952 750269 770060 790617 811568 833372 856400 880543 905695 932086 959981 989406 1020336
61941 1020336 1052920 1087288 1123203 1160128 1197736 1236350 1276740 1319455 1364464 1411691 1461763
61930 1461763 1515957 1575367 1640538 1712042 1791067 1879100 1977276 2086413 2207611 2342489 2492745
61919 2492745 2659607 2843701 3045272 3264522 3501731 3756770 4028199 4312661 4604939
61910 4604939 4898218 5183999 5451999 5690648 5888137 6033662 6118781 6138678 6092758 5984294
61900 5984294 5819824 5608801 5362866 5094086 4813017 4528085 4246199 3973069 3712689
61891 3712689 3467069 3237008 3023114 2826022 2646000 2482744 2335486 2203008 2083628
61882 2083628 1975569 1877528 1788849 1709097 1637594 1573479 1516079 1464971 1419627 1379227 1343058
61871 1343058 1310989 1283251 1259686 1239533 1222080 1207196 1194970 1185149 1177400 1172027 1169862 1171303
61859 1171303 1175794 1182335 1190191 1199017 1208738 1219543 1231598 1244389 1256614 1267131 1275871 1283529 1290587
61846 1290587 1297156 1303565 1310369 1317637 1324843 1331775 1338985 1346824 1354425 1360381 1364344 1367351 1370409 1373302
61832 1373302 1375086 1375338 1374506 1373234 1371785 1370197 1368683 1367733 1367961 1369915 1373917 1379983 1387964 1397842 1409890
61817 1409890 1424532 1442092 1462693 1486342 1513037 1542863 1576102 1613271 1654889 1701101 1751564
61806 1751564 1805839 1863904 1926234 1993524 2066609 2146618 2234879 2332415 2439737 2557314 2686114
61795 2686114 2827525 2983057 3154508 3344226 3554687 3787745 4044695 4327131 4637338
61786 4637338 4977571 5349099 5751886 6184702 6645068 7128950 7630030 8138435 8639714
61777 8639714 9115375 9544944 9907942 10185099 10359976 10421611 10366687 10199642 9931362 9577801
61767 9577801 9158262 8692792 8199787 7695238 7192907 6703825 6235529 5792644 5378343
61758 5378343 4994667 4641722 4317835 4021179 3750719 3505409 3283324 3082170 2900070
61749 2900070 2735264 2585598 2448960 2323973 2209754 2105344 2009886 1923036 1844444 1772930
61739 1772930 1706836 1645234 1588236 1536034 1488151 1443788 1402442 1363904 1327954 1294396 1263211
61728 1263211 1234376 1207558 1182263 1158342 1136186 1116246 1098373 1081735 1065443 1049165 1033096
61717 1033096 1017529 1002622 988464 974963 961600 947608 932685 917430 902902 889713 877621
61706 877621 865907 854079 842258 830946 820471 810800 801923 794144 787720 782391 777660 773463 770161
61693 770161 767902 766472 765776 765875 766345 766131 764294 760524 754714 746695 736821 726183 715527 704326 691701
61678 691701 678035 664859 653155 642559 632458 623121 615416 609876 606444 604706 603954 603330 602340 601103
61664 601103 599708 597505 593534 587641 580724 573676 566512 558820 550711 542821 535515 528644 522235 516847
61650 516847 512900 509979 507241 504283 501189 497959 494444 490825 487591 484947 482659 480607 478961 477673
61636 477673 476314 474701 473279 472538 472359 472243 471886 471216 470169 468822 467558 466825 466863 467754 469409 471239
61620 471239 472268 471992 470883 469712 468661 467464 466036 464477 462728 460798 459141 458285 458205 458526 459198 460409
61604 460409 461986 463550 465242 467615 470685 473651 475863 477629 479844 483152 487622 492830 498061 502752
61590 502752 507047 511723 517422 524127 531493 539370 547820 556829 566273 576192 586972 599210 613315
61577 613315 629163 646289 664600 684734 707464 732851 760248 789002 818877 849880 881990
61566 881990 914894 947515 977840 1003703 1023968 1038755 1048663 1054239 1056155 1055330 1052640 1048883 1045115
61553 1045115 1042494 1041471 1041473 1041743 1042254 1043593 1046167 1049816 1054056 1058447 1062744 1066760 1070038 1071747 1071194
61538 1071194 1068511 1064575 1060142 1055306 1049858 1043849 1037608 1031467 1025740 1020837 1017205 1015193 1015019 1016770
61524 1016770 1020392 1025857 1033373 1043318 1056020 1071792 1091069 1114279 1141530 1172706 1207763 1246686
61512 1246686 1289295 1335531 1385891 1441120 1501568 1567511 1640185 1721681 1813361 1914854 2025041
61501 2025041 2143496 2270352 2404944 2545149 2687960 2830272 2969151 3101739 3225129
61492 3225129 3336293 3432383 3511309 3572075 3614553 3639202 3647169 3640391 3621451 3593476 3560118
61481 3560118 3524990 3490565 3457673 3426209 3395925 3366199 3335420 3301160 3260985 3212912 3155587
61470 3155587 3088742 3013579 2932292 2847247 2760922 2676406 2597140 2525703 2463035 2408910 2362858
61459 2362858 2324527 2293566 2269536 2251933 2240182 2233736 2232234 2235403 2242702 2253284 2266579 2282871
61447 2282871 2303119 2328157 2358234 2393341 2433809 2480419 2534028 2595147 2663561 2737732 2814180
61436 2814180 2887618 2952215 3003136 3037438 3054396 3055659 3044911 3026576 3004246 2980168 2955833
61425 2955833 2932456 2910868 2891526 2875104 2862868 2856277 2856356 2863580 2877937 2898611 2923267 2947500
61413 2947500 2965074 2969425 2956202 2925234 2880133 2825964 2767331 2708132 2651843 2600938 2556143
61402 2556143 2516735 2481691 2450432 2422839 2398938 2378583 2361209 2346024 2332675 2321625 2313742
61391 2313742 2309726 2310099 2315485 2326642 2344308 2369168 2401760 2442374 2491356 2549650 2618528 2698419
61379 2698419 2788441 2887446 2995143 3111653 3236264 3367223 3502494 3639982 3776874 3909243
61369 3909243 4032414 4141469 4231623 4298872 4340842 4357089 4348674 4317588 4266299 4197304 4112882
61358 4112882 4015317 3907191 3791104 3669062 3542391 3412301 3280421 3148844 3019826 2895287
61348 2895287 2776342 2663288 2556185 2455423 2361723 2275835 2198358 2129585 2069272 2016806
61338 2016806 1971820 1934350 1904205 1880541 1862425 1849517 1841877 1839546 1842710 1851820 1866894 1887037
61326 1887037 1911283 1939532 1971709 2006092 2039409 2068878 2093603 2113972 2130490 2143533 2153641
61315 2153641 2161591 2168390 2175225 2183005 2191906 2201808 2213137 2226610 2241998 2257906 2273204 2288154
61303 2288154 2303686 2319962 2336110 2351036 2364020 2374701 2382992 2389019 2392869 2394293 2392725 2387619
61291 2387619 2378768 2366453 2351231 2333487 2313381 2291542 2269661 2249849 2233360 2220322 2210641 2204463
61279 2204463 2201408 2199856 2197554 2192858 2185254 2174998 2162553 2148193 2131845 2113390 2093241 2072560
61267 2072560 2052764 2034799 2018773 2004060 1989972 1976651 1965320 1957320 1952974 1951768 1953525 1958808
61255 1958808 1968187 1981809 1999984 2023702 2054311 2093079 2141160 2199316 2267329 2344187 2429338
61244 2429338 2523307 2626569 2737901 2853904 2969311 3077067 3168597 3235361 3271214 3274000
61234 3274000 3245690 3191447 3117989 3031689 2937485 2839269 2740910 2646455 2559395 2482054 2415842
61223 2415842 2362024 2322214 2297950 2289452 2294591 2309166 2328062 2345878 2356838 2355417 2338200 2305213
61211 2305213 2259200 2203801 2142612 2079292 2017489 1960117 1908765 1863734 1824462 1790060 1759748
61200 1759748 1732851 1708396 1685005 1661507 1637548 1613391 1589222 1564886 1540265 1515684 1491832
61189 1491832 1469230 1447739 1426779 1406181 1386600 1368661 1351917 1335260 1318395 1302255 1287803
61178 1287803 1275085 1263741 1253787 1245493 1238970 1234292 1231532 1230296 1229658 1228872 1227553 1224733 1218418 1206761
61164 1206761 1189316 1166710 1139761 1109640 1078268 1047466 1017846 989316 962383 937965 916017
61153 916017 895285 874699 854379 835114 817386 801085 785734 770835 756351 742872 731041
61142 731041 720903 712107 704529 698286 693348 689634 687254 686243 686317 687408 690129 695061 701813 709500
61128 709500 717937 727655 738925 751489 765027 778944 791774 801850 808762 813356 816180 816857 815239
61115 815239 812277 809244 806791 805142 804533 804893 805588 805963 805856 805336 804340 802834 800872 798256 794547 789715
61099 789715 784387 779224 774371 769664 764878 759599 753370 746321 739248 732818 727019 721609 716644 712255
61085 712255 708298 704586 701272 698730 697231 696832 697399 698615 700176 702057 704408 707275 710699 714991 720626
61070 720626 727878 736713 746720 756942 766322 774910 784100 794929 806610 817613 827622 837207 845995
61057 845995 852742 857308 861129 865428 870241 875459 881461 888194 894985 901929 910339 921106 933672 947281
61043 947281 962224 979125 997938 1018381 1040498 1064182 1089093 1115658 1145132 1178043 1213685
61032 1213685 1251837 1293740 1340483 1391646 1446610 1506087 1571057 1640947 1713857 1787883 1861574
61021 1861574 1934433 2008215 2086856 2174087 2271978 2382283 2507423 2648761 2805334 2975645
61011 2975645 3159620 3358518 3575948 3821326 4110375 4460457 4887774 5410539 6050577
61002 6050577 6829078 7767274 8898968 10279987 11981358 14082379 16676444 19847073
60994 19847073 23557120 27499014 31076261 33631579 34800367 34707351 33853511 32830337
60986 32830337 32113887 32016860 32665648 33901641 35215576 35894902 35366543 33486755 30555591
60977 30555591 27086022 23545319 20233926 17295788 14770705 12637658 10848879 9355417
60969 9355417 8115535 7090721 6244679 5547698 4976615 4509301 4122832 3797415 3518594
60960 3518594 3275169 3058144 2862164 2684890 2523841 2375683 2238674 2113361 2000476
60951 2000476 1900175 1813199 1739911 1677395 1619841 1562901 1506197 1451248 1399085 1350594 1307009
60940 1307009 1268623 1234239 1202747 1174031 1147772 1122808 1098487 1075371 1053951 1033924 1015386
60929 1015386 999311 986027 974399 963302 952690 942515 931928 920488 908989 898034 886830
60918 886830 874420 861169 848076 835467 823326 812025 801704 791722 781715 772473 764679 757529
60906 757529 749706 741193 733002 725589 718632 712008 705895 700141 694484 689166 684453 679826 674653 669522
60892 669522 665911 664451 664324 664440 664472 664643 665215 666417 668386 670941 673685 676383 678946 681108 682396 682350
60876 682350 680573 676828 671436 665402 659778 655042 651307 648813 647743 647825 648610 650061 652547 656392 661768
60861 661768 668779 677197 686167 694468 700979 704842 705632 703790 700656 697697 695788 695272 696035 696977 695862
60846 695862 690547 680459 666647 650699 634040 617895 603155 590155 578931 569592 562159 556217
60834 556217 551210 546980 543679 541306 539700 538848 538814 539472 540629 542185 543862 545100 545676 546181 547312 548876
60818 548876 550026 550380 550363 550495 550882 551520 552594 554303 556542 558859 560680 561712 562322 563258 564787 566336
60802 566336 567223 567405 567193 566666 565783 564785 563949 563209 562454 561877 561491 560580 558270 554481 549836 544857 539804
60785 539804 535083 531062 527582 524243 521043 518180 515440 512475 509511 507024 504867 502532 500237 498786
60771 498786 498222 497545 496098 494456 493572 493726 494731 496501 498863 501232 503001 504060 504684 505215 506085 507815
60755 507815 510603 514085 517680 520983 523713 525550 526157 525186 522376 517975 512976 508451 504574 500800 496948
60740 496948 493559 491091 489379 488085 487103 486249 485079 483381 481423 479433 477197 474414 471061 467189 462793
60725 462793 458094 453548 449299 445047 440705 436696 433359 430480 427743 425163 422766 420345 417922 415985
60711 415985 414747 413591 411812 409659 408158 408074 409416 411661 414004 415648 416435 417100 418470 420455 422173
60696 422173 422978 423078 423258 424293 426525 429622 432865 435902 439140 443141 447828 452529 456643 459972 462578
60681 462578 464722 466799 469038 471291 473358 475400 477752 480458 483242 485846 488179 490209 491916 493218
60667 493218 493894 493865 493727 494509 496545 498913 500500 501358 502481 504541 507433 510824 514364 517255 518446 517613
60651 517613 515508 513047 510420 507341 503728 499697 495179 490043 484601 479559 475332 471614 467807 463766
60637 463766 459938 456736 453999 451218 448168 445047 442037 439076 436171 433595 431489 429459 426865 423529
60623 423529 419991 417092 415337 414520 413881 412783 411372 410317 409864 409468 408597 407551 407044 407252 407703 408086
60607 408086 408659 409834 411708 414087 416687 419209 421426 423314 425021 426717 428488 430246 431603 432068 431667
60592 431667 431148 431201 431603 431590 430977 430436 430563 431234 432085 433179 434796 436828 438806 440406 441646 442604 443303
60575 443303 443921 444821 446217 447971 449891 452095 454798 457742 460185 461710 462812 464282 466045 467109 466865
60560 466865 466011 465795 466567 467583 468189 468687 469866 472103 475261 479232 484086 489655 495440 501360 508417
60545 508417 518128 531097 546560 563671 582953 606016 633977 666777 704117 746456 794755 849677
60533 849677 911349 979365 1052140 1126050 1195624 1254909 1298899 1324151 1328860 1313028 1278810 1230524
60521 1230524 1173759 1113758 1054176 997148 944204 896704 855466 820520 791465 767838 749141
60510 749141 734965 725370 720762 721148 725879 734365 746710 763476 785329 813233 848407 891524 942277
60497 942277 1000073 1064392 1133492 1203060 1267104 1320363 1359376 1381728 1385701 1371413 1341823 1302131
60485 1302131 1258312 1215936 1179354 1151124 1132186 1122944 1124207 1137154 1162735 1201328 1252840 1316900
60473 1316900 1392696 1478190 1569060 1658480 1738309 1800779 1839433 1849567 1829071 1779270 1704566
60462 1704566 1611145 1506050 1396675 1289644 1189304 1097488 1014813 941674 877924 822426
60452 822426 773699 730834 693514 661512 634546 612322 594307 579587 567314 557195 549329 543698
60440 543698 540008 537874 536919 536788 537226 538092 539221 540394 541398 541960 541648 540128 537525 534206 530235 525447
60424 525447 520101 514938 510454 506615 503509 501710 501614 502886 504997 507930 511855 516457 521189 525992 531254
60409 531254 537201 543868 551565 560752 571396 582966 595187 608352 622723 638007 653698 669694
60397 669694 686353 704041 722697 741555 759180 774052 785473 793946 800494 805713 809608 812230
60385 812230 814094 815812 817561 819144 820407 821263 821398 820442 818595 816679 815212 813746 811523 808511 805309
60370 805309 802198 798957 795679 793038 791503 790809 790554 790781 791504 792013 791310 789153 786222 783317 780817 778911
60354 778911 777834 777612 777807 777837 777580 777490 777953 778559 778230 776249 772905 768802 763695 756692 747783 738535 730767
60337 730767 724876 719962 715258 710838 707012 703735 700760 697860 694636 690468 684996 678491 671540 664534
60323 664534 657654 651128 645153 639593 634143 628890 624399 620940 617873 614254 610095 606545 604582 603947
60309 603947 603730 603609 603925 604729 605595 606530 608447 612406 618839 627798 639391 653416 668808 683959 697506
60294 697506 708523 716167 719625 718443 712733 703162 690995 677957 665642 655019 646533 640444 636818
60281 636818 635373 635621 636984 638689 640001 640976 642591 645603 649617 653893 658709 665040 673039 681844 691060
60266 691060 701465 713787 727598 741972 756654 772004 788328 805890 825067 845637 866179
60255 866179 885055 901915 917527 932169 945101 955904 965570 975714 987141 999661 1013050 1027665
60243 1027665 1044252 1063529 1085958 1111651 1140499 1172488 1207811 1246630 1288987 1335108 1385464
60232 1385464 1440223 1498984 1561463 1628224 1700194 1777509 1859300 1944458 2031963 2120443 2208190
60221 2208190 2293909 2376883 2456094 2529764 2596226 2654770 2705226 2747187 2780196 2804238 2819489
60210 2819489 2826005 2824373 2816239 2803286 2785912 2763911 2738393 2711920 2686460 2662329 2639680 2620150
60198 2620150 2606202 2599347 2599783 2607512 2623091 2647432 2681419 2725681 2780272 2844464 2917055 2996733
60186 2996733 3081874 3170099 3258280 3342994 3421045 3490020 3548588 3595982 3631024 3652092 3658310
60175 3658310 3650148 3628269 3592276 3541408 3476255 3399053 3312427 3218742 3120875 3022700 2928128
60164 2928128 2839842 2759160 2686742 2623204 2569369 2526321 2495063 2475914 2468406 2471861 2485782 2509331
60152 2509331 2540579 2576595 2614279 2650967 2684361 2712431 2733794 2748091 2755522 2755755 2747593 2730180
60140 2730180 2704529 2673376 2639373 2603771 2567096 2530589 2496511 2467287 2444854 2430642 2425501
60129 2425501 2429507 2442285 2463761 2494423 2534961 2586144 2649126 2725349 2815854 2920951 3040815
60118 3040815 3176101 3327586 3495260 3677885 3873226 4078485 4290585 4506286 4722114
60109 4722114 4934227 5138473 5330631 5506503 5661947 5793309 5898054 5974813 6022653 6040589
60099 6040589 6028058 5985644 5915024 5818347 5697951 5556638 5397906 5225887 5045223 4860811
60089 4860811 4677221 4498180 4326667 4165405 4016880 3882875 3764436 3662498 3578216 3512386
60079 3512386 3464817 3434710 3421524 3425079 3444759 3478992 3525657 3582733 3648249 3719607 3793086
60068 3793086 3864171 3928601 3983365 4026677 4057015 4072545 4071877 4055143 4023705 3978836 3921269 3852060
60056 3852060 3772994 3685668 3590918 3489861 3384972 3279275 3174766 3072568 2974447 2883207
60046 2883207 2801348 2730093 2669914 2621281 2584545 2559705 2546751 2545950 2557637 2582161 2620101 2671784
60034 2671784 2736204 2810910 2893301 2981440 3073274 3165829 3255904 3341059 3419260 3487994 3544680
60023 3544680 3587804 3616897 3631475 3630704 3614144 3582125 3535276 3474313 3400586 3316496 3225145 3129768
60011 3129768 3033482 2939090 2848886 2764790 2688623 2621939 2565594 2519889 2485259 2462425 2451723
60000 2451723 2452660 2464501 2487168 2521394 2568020 2627358 2699220 2783325 2879433 2986911 3104231
59989 3104231 3229115 3359119 3491741 3623764 3750843 3868203 3971885 4059319 4128963 4179770
59979 4179770 4211043 4222540 4214483 4187294 4141207 4076350 3993642 3895817 3787332 3673115 3557591
59968 3557591 3444727 3338260 3241312 3155989 3083642 3025151 2980690 2949656 2931378 2925768 2932965
59957 2932965 2952794 2985037 3029774 3086717 3154317 3230148 3312057 3398355 3487014 3575362 3660703
59946 3660703 3740785 3813701 3877931 3932695 3977893 4013641 4040034 4057233 4065372 4064551 4055474 4040031
59934 4040031 4020840 4000355 3980861 3965113 3956214 3956891 3969506 3996727 4041282 4104802 4187603 4289946
59922 4289946 4412954 4557925 4725149 4913594 5121140 5344569 5579464 5820389 6061030
59913 6061030 6294127 6511580 6704883 6865514 6985499 7058642 7081892 7055597 6982772 6868640
59903 6868640 6720544 6547131 6356856 6157350 5955919 5759527 5573696 5401938 5246649
59894 5246649 5110015 4993605 4897790 4822406 4767902 4735371 4725677 4739051 4775381 4834482 4916131
59883 4916131 5020100 5145901 5291867 5454102 5626261 5800198 5966943 6117698 6244865
59874 6244865 6342859 6408467 6440679 6439996 6407570 6344940 6254604 6140391 6006570 5856625 5693399
59863 5693399 5520338 5341867 5162428 4985791 4815408 4654628 4506122 4371666 4252896
59854 4252896 4151728 4069649 4007105 3964016 3940350 3935679 3948635 3977499 4021178 4079137 4150424
59843 4150424 4232953 4323397 4417580 4511436 4601976 4687000 4763578 4827374 4873978 4900563 4905866
59832 4905866 4889216 4850564 4791545 4715977 4629146 4536592 4442879 4350713 4260949 4173481 4087893
59821 4087893 4003320 3918581 3833299 3748715 3666980 3589892 3518607 3453864 3395638 3342823 3294003
59810 3294003 3248372 3205396 3163937 3122608 3080878 3039063 2997343 2955646 2914670 2876203 2842202
59799 2842202 2814091 2793085 2780523 2777562 2784969 2803481 2834145 2878331 2937926 3015614 3114427 3236745
59787 3236745 3383991 3557207 3757147 3983013 4230712 4491587 4751756 4992286 5191261
59778 5191261 5328006 5388084 5367008 5271311 5116505 4922457 4708220 4488894 4275318 4075129
59768 4075129 3893483 3733211 3595002 3477909 3380179 3300173 3236826 3189178 3155609 3133877
59758 3133877 3121948 3118510 3122723 3133957 3151981 3176945 3208894 3247460 3292253 3343220 3400461 3464036
59746 3464036 3534387 3612709 3700500 3798734 3907806 4028205 4160958 4307369 4468713 4646260
59736 4646260 4841399 5055499 5289758 5545258 5822858 6122642 6443311 6782195 7135691
59727 7135691 7499239 7866597 8229387 8577976 8903394 9199029 9461437 9690603 9889986
59718 9889986 10066059 10227126 10381835 10538009 10701994 10878332 11069542 11275821 11494785
59709 11494785 11721834 11951312 12177623 12395278 12598351 12780839 12938062 13067459 13167885
59700 13167885 13238656 13279884 13293622 13284225 13257477 13219536 13176563 13134950 13101576 13083665 13088111
59689 13088111 13120725 13186183 13288619 13431993 13619734 13854183 14136447 14466336 14841995 15259608
59679 15259608 15713492 16196021 16696908 17202450 17695584 18156782 18565310 18900716 19144583
59670 19144583 19282251 19304275 19207724 18996952 18683117 18282391 17814055 17299185 16759326 16214513
59660 16214513 15681182 15170570 14687296 14228057 13781592 13331076 12858662 12350825 11802956
59651 11802956 11221227 10620172 10017115 9427188 8861465 8327170 7828004 7364707 6936548
59642 6936548 6542655 6181881 5852182 5551101 5276736 5027552 4801578 4596677 4411494
59633 4411494 4245281 4096823 3964380 3846764 3743699 3654902 3579414 3515854 3462596 3417525
59623 3417525 3378299 3343170 3311037 3280665 3250593 3220145 3189849 3160452 3131892 3103383 3073839
59612 3073839 3041944 3006535 2967560 2926187 2883445 2839166 2792848 2745232 2698322 2653942 2612834
59601 2612834 2575078 2540697 2509556 2481059 2454355 2428793 2404071 2380123 2357152 2335859 2317415
59590 2317415 2302862 2292477 2285815 2282433 2282269 2285219 2290721 2298258 2308124 2321185 2337696 2356696 2376806
59577 2376806 2397515 2419580 2444288 2472461 2504144 2539191 2578083 2621986 2671952 2728233 2790427
59566 2790427 2858085 2931011 3009207 3092828 3182045 3276812 3377013 3483048 3595914 3716335
59556 3716335 3843965 3977770 4116843 4260363 4407002 4555035 4703141 4850631 4996522
59547 4996522 5138135 5270086 5384526 5473402 5531909 5560401 5562872 5543757 5506279 5452873 5385642
59536 5385642 5305999 5214745 5113090 5003373 4888675 4772188 4657053 4546354 4443030 4349973
59526 4349973 4270105 4205941 4159159 4131132 4123817 4139510 4179735 4244969 4335452 4451399 4592045
59515 4592045 4754967 4936488 5132029 5335627 5539490 5734418 5910565 6058162 6168695
59506 6168695 6236249 6257732 6231841 6158621 6040488 5883109 5694540 5483516 5258564 5027978
59496 5027978 4799534 4579758 4373457 4183735 4012282 3859804 3726592 3612913 3519103 3445498
59486 3445498 3392147 3358334 3342561 3343434 3360492 3393746 3442493 3505207 3580474 3667315 3764320 3869052
59474 3869052 3978432 4089021 4196663 4296555 4384244 4456217 4509313 4540249 4546361 4526570 4481281
59463 4481281 4411695 4319671 4207974 4080145 3940138 3792060 3639791 3486448 3334383 3185792
59453 3185792 3042895 2907265 2779377 2659173 2546695 2441946 2344633 2254572 2172040 2097239
59443 2097239 2029644 1968322 1912727 1862886 1818973 1781052 1748979 1722186 1699709 1680812 1665569
59432 1665569 1654577 1648166 1646152 1648181 1653989 1663296 1675842 1691777 1711813 1736332 1763640 1789139
59420 1789139 1807147 1814585 1813159 1807776 1803063 1801508 1804128 1811690 1825175 1845687 1873727 1907599 1942590
59407 1942590 1972994 1995759 2011956 2024918 2038007 2054123 2075687 2103816 2138106 2177981 2223793
59396 2223793 2276067 2334475 2398454 2468367 2545197 2629457 2721125 2820342 2927399 3042177 3164203
59385 3164203 3292990 3427789 3567242 3710036 3855980 4006211 4162733 4328352 4506842
59376 4506842 4702570 4919777 5162161 5432365 5730994 6056115 6404019 6770113 7148602
59367 7148602 7531795 7910750 8277055 8624086 8947215 9243733 9512708 9754448 9969689
59358 9969689 10159007 10322335 10458440 10564813 10638070 10674051 10667397 10611822 10501634 10333238
59348 10333238 10105499 9819824 9480912 9097217 8679966 8241532 7794405 7350395 6919294
59339 6919294 6508025 6121275 5762475 5433539 5134061 4861667 4613245 4385539 4175127
59330 4175127 3978859 3794601 3621279 3458430 3306091 3164695 3034344 2914287 2803579
59321 2803579 2701919 2609204 2524595 2446902 2375763 2311683 2254847 2204556 2159813 2119830 2084000
59310 2084000 2052083 2024546 2002132 1984974 1972614 1964896 1962205 1964668 1971751 1983058 1999204 2021607
59298 2021607 2051527 2089498 2135534 2189386 2249901 2313680 2374875 2427686 2469996 2504475 2536048
59287 2536048 2568834 2605527 2648133 2697683 2753326 2812691 2873183 2932431 2987900 3036985 3077355
59276 3077355 3106560 3121714 3120681 3103657 3072778 3030193 2977297 2915652 2847486 2774914 2699438
59265 2699438 2622513 2545888 2471037 2398771 2329677 2264418 2203318 2146112 2092399 2042140 1995712
59254 1995712 1953803 1917200 1886242 1860469 1839203 1822378 1810358 1803095 1800090 1801107 1806328 1815737
59242 1815737 1828865 1845196 1864360 1886065 1910408 1938162 1970099 2006043 2045297 2088031 2135477
59231 2135477 2188594 2247283 2311282 2381330 2459143 2546644 2645461 2756840 2881911 3022204 3179777
59220 3179777 3356343 3552305 3767057 3999967 4250131 4514684 4787707 5060813 5324438
59211 5324438 5568683 5783867 5961106 6092697 6172345 6195703 6161070 6069665 5925627 5736077
59201 5736077 5510727 5260409 4995476 4725268 4458127 4200816 3957884 3732167 3525756
59192 3525756 3339866 3174108 3026894 2896733 2782617 2683459 2598166 2526234 2467384 2420493
59182 2420493 2383746 2355968 2336920 2326155 2322473 2324691 2331917 2342558 2353735 2362156 2365150 2360718
59170 2360718 2347336 2324142 2290896 2247641 2194944 2134541 2069059 2000920 1931985 1864099 1798971
59159 1798971 1737365 1679262 1625074 1575844 1532061 1493257 1459031 1429449 1404010 1381364 1360749
59148 1360749 1342896 1328705 1317899 1309763 1304507 1302915 1305038 1310127 1317551 1327008 1337970 1349628 1361429
59135 1361429 1373299 1385356 1397689 1410167 1422275 1433342 1443133 1451930 1459958 1467157 1473664 1479998
59123 1479998 1486511 1493171 1500087 1507734 1516392 1525958 1536634 1549219 1564303 1581658 1600760 1621343
59111 1621343 1642959 1664533 1685035 1704400 1723479 1743301 1764533 1787134 1810191 1832554 1854005
59100 1854005 1875543 1898378 1923207 1950644 1981581 2016576 2055393 2097660 2143549 2193333 2246706
59089 2246706 2302916 2361112 2419974 2477388 2531057 2579268 2620731 2653945 2677123 2688530 2686724
59078 2686724 2670871 2641236 2599232 2546873 2486366 2420051 2350008 2277595 2203889 2130630 2059909
59067 2059909 1992757 1928926 1868373 1811966 1760177 1712012 1666072 1622060 1580514 1541694 1505503
59056 1505503 1472058 1441522 1413697 1388334 1365453 1344846 1325773 1307821 1291528 1277422 1264851
59045 1264851 1252526 1239896 1227245 1214743 1202196 1189595 1177242 1165452 1154695 1145805 1139424 1135320
59033 1135320 1132798 1131703 1132509 1135528 1140470 1146718 1153679 1160983 1168643 1176883 1185635 1194490 1203316 1212476
59019 1212476 1222204 1232309 1242910 1254919 1269249 1285959 1304616 1325026 1347061 1370306 1394645
59008 1394645 1420937 1450503 1484113 1521993 1564507 1612232 1665413 1723748 1786453 1852180 1919115
58997 1919115 1985461 2049404 2108325 2158720 2197710 2224400 2239296 2242823 2235042 2216507 2188754 2154071
58985 2154071 2115101 2074250 2032924 1991535 1950489 1910595 1872143 1834433 1796999 1760738 1726953
58974 1726953 1695837 1666871 1640377 1617593 1599361 1585704 1576681 1572686 1573686 1578855 1587160 1597785
58962 1597785 1609935 1622745 1635561 1647948 1659430 1669547 1678171 1685510 1691957 1698192 1705160 1713568
58950 1713568 1723558 1735135 1748599 1764257 1782084 1802060 1824503 1849789 1878200 1910407 1947537
58939 1947537 1990258 2038406 2092137 2152850 2222116 2299906 2384430 2473104 2562703 2648878 2726728
58928 2726728 2792467 2844561 2883852 2913335 2937576 2961456 2988932 3022717 3064434 3114615 3173022
58917 3173022 3239543 3314533 3398226 3490695 3593007 3707566 3836408 3979610 4136136 4305655
58907 4305655 4488772 4686164 4898481 5126489 5370081 5627284 5894905 6169686 6447998
58898 6447998 6725309 6997514 7262786 7521144 7772595 8016653 8252962 8480439 8695437
58889 8695437 8891875 9063408 9204645 9310642 9376848 9400217 9379664 9315393 9208768 9062883
58879 9062883 8882098 8670610 8432266 8171857 7895438 7608814 7316353 7021529 6727757
58870 6727757 6438174 6155037 5879837 5613792 5358175 5114459 4884023 4667402 4464144
58861 4464144 4273797 4096584 3932482 3780243 3638368 3506705 3386019 3276191 3175929
58852 3175929 3084167 3000675 2925300 2857663 2797647 2745156 2699326 2658906 2623529 2593690 2569450
58841 2569450 2550148 2535361 2525092 2518894 2515903 2515999 2520018 2528580 2541591 2558979 2580903 2607078 2636936
58828 2636936 2670725 2709492 2753731 2802926 2856581 2914676 2976789 3041763 3108654 3177243 3247481
58817 3247481 3319446 3394182 3473677 3559602 3652847 3754381 3865610 3987707 4121699 4269493
58807 4269493 4433544 4614915 4812716 5026061 5255516 5501828 5764135 6040174 6327441
58798 6327441 6623139 6923366 7223153 7516971 7798749 8061787 8299288 8504968 8673178
58789 8673178 8799019 8878717 8909794 8891163 8823856 8711730 8560602 8376446 8164818 7931532
58779 7931532 7682275 7420867 7148724 6866558 6576018 6279628 5980474 5682752 5391745
58770 5391745 5112277 4847334 4598429 4366451 4151574 3952942 3769295 3599784 3443916
58761 3443916 3300983 3169821 3048927 2936930 2833428 2739191 2654907 2579818 2512344 2451751
58751 2451751 2398147 2350964 2308823 2271243 2239152 2213243 2192884 2177187 2166015 2159272 2156320 2156967
58739 2156967 2162318 2173768 2191558 2214681 2241289 2268433 2291874 2306964 2309822 2298081 2271603 2233010
58727 2233010 2186683 2136558 2084954 2033126 1981779 1930799 1879587 1828106 1776816 1725520 1673598
58716 1673598 1621796 1572533 1527837 1488157 1453753 1425963 1406148 1394432 1390387 1393989 1404937 1421734
58704 1421734 1442082 1463186 1480968 1490200 1486821 1469745 1439984 1399195 1350066 1296816 1243554 1192435
58692 1192435 1144428 1101139 1064508 1035045 1011744 993745 980986 973229 969342 967765 967126 966445 965213
58679 965213 963358 960981 958350 956107 954934 954869 955770 958646 965504 977396 993607 1013312 1036777 1063604
58665 1063604 1090434 1111552 1121736 1118304 1101453 1073908 1039925 1003486 967083 932130 899795
58654 899795 870882 845561 823883 806093 792014 780893 772396 767031 764986 765398 767435 771258 777030
58641 777030 783791 790272 796254 802259 808464 814735 821122 827524 833423 838753 844418 851199 858757 866543
58627 866543 875044 885195 897123 910364 924842 940840 958519 978180 1000378 1025028 1051091 1077972
58615 1077972 1106533 1137940 1172306 1209375 1249665 1293792 1341474 1392549 1448354 1510710 1579817
58604 1579817 1654345 1733288 1816494 1903543 1993211 2083986 2174155 2261286 2342283 2413906 2472951
58593 2472951 2516574 2543209 2552788 2545563 2521499 2481545 2428617 2366292 2297194 2223580 2148550 2075235
58581 2075235 2005198 1938848 1876929 1820398 1769276 1722984 1681584 1645498 1614154 1586056 1560106
58570 1560106 1535883 1512842 1490240 1467718 1445008 1421241 1395406 1367379 1337791 1307208 1276180
58559 1276180 1245617 1216245 1188030 1161001 1136130 1114451 1095561 1077764 1059347 1039078 1016219
58548 1016219 991052 964943 939034 913451 888492 865546 845619 827833 810770 794590 780359
58537 780359 767910 755990 744103 732691 721819 711216 701394 693182 686239 679450 672682 666811 662115
58524 662115 658055 654640 652580 651929 651840 651907 652718 654935 658789 664444 671912 680572 689692 699356 710118
58509 710118 721984 734611 748128 762670 777402 791076 803345 814438 823836 830407 833741 834273
58497 834273 832315 827949 821688 814256 805964 797144 788734 781394 774540 767337 760104 753603 747551 741156
58483 741156 734537 728197 721645 714114 706236 699353 693440 687281 680529 673980 667928 661826 655574 649660
58469 649660 643971 637826 631236 624899 619085 613714 609342 606693 605379 604378 603590 603597 604210 604644 604906 605597
58453 605597 606575 607224 607743 608650 609313 608566 606605 604784 603760 603326 603729 605404 607621 609157 610147 611675
58437 611675 613791 615667 617460 620062 623116 625208 626129 627146 628925 630899 632715 634600 636340 637680
58423 637680 639686 643849 649699 655113 659072 662425 665988 669771 674082 679453 685325 690526 695071 699786
58409 699786 704395 707984 711131 715378 720568 725003 728277 731631 735389 738433 740515 742767 745460 747552
58395 747552 748834 750282 751856 752291 751496 750825 750473 749032 746290 744015 743147 742566 741567 741318 742942 746217
58379 746217 751062 758190 767377 777089 786669 796992 808302 819466 830048 840939 852203 862591
58367 862591 872024 882280 894255 906709 918613 930480 942341 952761 961054 968423 975764 982425
58355 982425 988185 994297 1001408 1008479 1014969 1022063 1030501 1039104 1046648 1053479 1060279 1067086 1074422 1083508
58341 1083508 1094375 1105608 1116644 1128396 1141019 1153377 1165401 1178550 1193064 1207304 1220812
58330 1220812 1235457 1252476 1270922 1290171 1311355 1334940 1359442 1383984 1409765 1437571 1466125
58319 1466125 1494168 1521795 1548427 1571965 1591454 1608345 1623777 1636900 1647093 1655422 1662677 1668425
58307 1668425 1673233 1679305 1687691 1697372 1708059 1721140 1736845 1753586 1771275 1792014 1816156 1841090
58295 1841090 1865504 1891371 1919969 1949507 1978713 2009237 2042253 2076022 2109234 2143529 2180327
58284 2180327 2218323 2256524 2296652 2340128 2385767 2432805 2482948 2536899 2592085 2646402 2701043
58273 2701043 2757057 2812340 2864846 2915684 2966380 3016147 3064540 3113729 3165449 3218709 3272955
58262 3272955 3330306 3392282 3457626 3525677 3598247 3675882 3756154 3838097 3924254 4015920 4110872
58251 4110872 4208525 4312445 4424588 4541866 4661860 4787091 4920038 5058844 5201787 5351109
58241 5351109 5508581 5672337 5842031 6021846 6214235 6416198 6626065 6848162 7086139
58232 7086139 7337713 7601127 7880651 8180157 8497422 8830647 9184515 9563843 9967614
58223 9967614 10395569 10854345 11350515 11884010 12455069 13070967 13739081 14460578 15238338
58214 15238338 16083899 17009538 18021648 19129688 20353084 21711487 23218245 24892844
58206 24892844 26770167 28888942 31283738 34000603 37110255 40696350 44846641 49672409
58198 49672409 55327637 62000992 69909023 79315044 90541672 103958859 119992638 139167271
58190 139167271 162102345 189414681 221556254 258523928 299259868 340876815 378452580
58183 378452580 406146420 419379422 416741064 400377285 374778464 344873915 314420978
58176 314420978 285248341 257500426 230610860 204314721 179024603 155505231 134371173
58169 134371173 115875729 99984263 86493757 75106979 65505167 57409883 50586594
58162 50586594 44818935 39914060 35724725 32140170 29060375 26396649 24085866 22080816
58154 22080816 20329668 18780294 17398095 16162900 15052308 14041703 13115915 12267467
58146 12267467 11486669 10764504 10100816 9498241 8951117 8449722 7991149 7576389 7200629
58137 7200629 6855999 6540635 6256157 5999028 5762154 5541548 5333688 5130146 4923345
58128 4923345 4715205 4512874 4318708 4131304 3952900 3787759 3635376 3492381 3359161
58119 3359161 3237904 3126191 3019202 2916631 2821288 2732572 2647361 2565767 2490114 2419551
58109 2419551 2351190 2285226 2223683 2165556 2108350 2053048 2002410 1955675 1909913 1865426 1824901
58098 1824901 1788323 1753433 1720174 1690003 1661679 1632234 1601490 1571571 1542775 1513859 1485337
58087 1485337 1458552 1432392 1404770 1376403 1349365 1323045 1295384 1266980 1239970 1213814 1186232
58076 1186232 1157573 1130281 1104667 1079002 1053315 1029368 1007293 985756 965089 946875 930790
58065 930790 915133 899978 886629 874465 861625 848357 836541 826336 816367 806619 797906 789040
58053 789040 777957 765331 753753 743538 732692 720972 710620 702823 696444 690524 685201 679876
58041 679876 673274 665721 658957 653447 648222 643307 639842 637716 635525 633017 631205 629926 627655 623974
58027 623974 620049 616512 612928 609444 606925 605411 604430 604691 607371 611829 616165 620018 624712 630800 637669
58012 637669 645537 655492 667378 679885 693018 708389 726762 747244 769298 793678 821012 851129
58000 851129 884071 920227 959326 1000722 1044719 1092092 1142495 1194817 1248748 1304208 1359490
57989 1359490 1411924 1460312 1504909 1545180 1579661 1608217 1632642 1654803 1675797 1696792 1718740
57978 1718740 1740853 1760685 1775627 1782834 1778194 1757689 1720319 1668385 1605044 1533156 1456178 1378012
57966 1378012 1301517 1228557 1161352 1102037 1050953 1007064 969991 939976 916166 896999 882191
57955 882191 872259 866145 861557 857892 856525 857846 860162 862091 863869 865572 866135 865160 863979 863905 864863
57940 864863 866585 869799 875419 883830 895649 912024 933495 959600 989940 1024365 1061634 1099077
57928 1099077 1134017 1164394 1187722 1200817 1201241 1188243 1162297 1125015 1079624 1030100 979344 929020
57916 929020 880837 836325 795424 757135 721893 691542 666612 645436 626535 610142 596703
57905 596703 585547 575855 567370 559323 550189 539431 528128 517005 505286 492441 479647 468287
57893 468287 458129 448178 438418 429637 422279 416437 412268 409565 407601 406177 406175 408449 412820 418777 426414
57878 426414 435968 447057 458934 470986 482612 493260 502908 511808 519585 525505 529804 533542 536686
57865 536686 537547 534858 529370 522616 515069 506414 496830 487028 477487 468445 460285 453339 447567 442796
57851 442796 438886 435553 432656 430825 431050 433394 436842 440674 445112 450264 455364 459545 462718 465189
57837 465189 467075 468411 469193 469057 467650 465549 463933 463058 461963 460087 458247 457587 458420 460582 464034
57822 464034 468556 473644 479391 486859 497051 510036 525537 543824 565528 590876 619159 648428
57810 648428 675807 699148 718837 737560 758315 783290 814132 851714 895123 941918 989648
57799 989648 1035991 1077321 1108760 1126586 1129785 1118975 1095259 1060735 1018686 972005 922130 870158
57787 870158 817946 767260 718824 673077 630942 592927 558311 526288 497193 471690 449453
57776 449453 429620 411992 396860 384135 373460 364695 357586 351456 345913 341258 337532 333847 329564
57763 329564 325515 323154 322832 323670 324734 325646 326460 327603 329606 332418 335477 338898 343801 350817 359039
57748 359039 367309 375800 385420 396277 407771 419681 431999 443981 454448 462908 469435 473587 474479
57735 474479 472108 467878 463552 460078 457427 455146 453040 451593 451556 452912 454600 455679 456436 458009 461252
57720 461252 466336 472987 480561 488199 495505 502904 510988 519790 529037 538775 549325 560949 573909
57707 573909 588568 605025 622966 642133 662572 684148 706326 728870 752365 777679 805321
57696 805321 835646 869261 906825 948796 995642 1047909 1105850 1169481 1239100 1315184 1397614
57685 1397614 1485738 1579317 1678508 1782490 1888976 1995494 2100305 2201698 2297480 2385980
57675 2385980 2466849 2540512 2607999 2672245 2738741 2813923 2902812 3006729 3119281 3221835 3285259
57664 3285259 3281640 3198488 3043895 2840126 2613171 2385239 2171288 1978556 1808814 1661651
57654 1661651 1536012 1429880 1340471 1265441 1203294 1152498 1111160 1077724 1051177 1030444 1014497
57643 1014497 1003240 997325 996684 999991 1005993 1014684 1026801 1042749 1062559 1086470 1114987 1148471
57631 1148471 1186965 1230329 1278393 1331039 1388249 1450035 1516334 1586867 1660888 1736994 1813493
57620 1813493 1888980 1962033 2030146 2089607 2136968 2170333 2188925 2192055 2179209 2150722 2107727
57609 2107727 2051795 1985223 1911214 1832848 1752006 1669888 1588267 1509329 1434431 1363864 1297815
57598 1297815 1236763 1180839 1129540 1082322 1039006 999491 963542 930941 901453 874596 849854
57587 849854 827115 806525 787986 771118 755647 741467 728432 716496 705898 696807 688928 681886
57575 681886 675874 671439 668676 666990 665568 663764 661266 658387 656162 655679 657195 660026 663199 666106
57561 666106 668761 671692 675418 679951 685101 691161 698663 707317 715993 724144 732564 742227 753084 764655
57547 764655 777145 791242 807283 825232 844992 866095 887775 910104 934583 962831 995201
57536 995201 1031332 1071335 1115510 1163550 1215115 1270648 1330482 1393496 1457791 1522305 1586685
57525 1586685 1649844 1709803 1764619 1812349 1850463 1876649 1890166 1891278 1879735 1855255 1819449
57514 1819449 1775623 1726402 1672845 1616028 1557988 1500578 1444692 1391189 1341379 1295951 1254379
57503 1254379 1216024 1180995 1149478 1121162 1095926 1074249 1056388 1041803 1029847 1020304 1012907 1007188
57491 1007188 1003284 1002022 1003678 1007405 1012500 1019422 1028935 1040872 1054488 1069488 1086054 1104351 1124640
57478 1124640 1147493 1173325 1202049 1233689 1268951 1308637 1352742 1400573 1451548 1505493 1562346
57467 1562346 1621791 1682968 1744285 1803719 1859369 1909456 1951845 1984200 2004808 2012928 2008261 1990692
57455 1990692 1960818 1920344 1871740 1817708 1760740 1702563 1643881 1585211 1527856 1473424 1422502
57444 1422502 1374700 1330045 1289332 1252921 1220195 1190643 1164513 1141880 1121887 1103606 1087002
57433 1087002 1072500 1060141 1049640 1040702 1032861 1025591 1019013 1013850 1010274 1007508 1005032 1003448 1003462 1004680
57419 1004680 1006152 1007579 1009261 1011291 1013478 1015731 1017960 1019963 1021929 1024680 1028863 1034244 1040254 1046760
57405 1046760 1053862 1061437 1069440 1078197 1087718 1097157 1105603 1113163 1120728 1129001 1138203 1148304 1158938
57392 1158938 1169457 1179643 1190007 1200892 1211796 1222218 1232653 1243965 1256147 1268494 1280721
57381 1280721 1293034 1305274 1316804 1327250 1336794 1345823 1354850 1364572 1375372 1386798 1398042 1408820
57369 1408820 1419339 1429757 1440320 1451728 1464567 1478444 1492383 1505976 1519493 1532969 1546010
57358 1546010 1558567 1571259 1584701 1598977 1613756 1628469 1642475 1655640 1668738 1682731 1697655
57347 1697655 1712764 1727722 1743064 1759444 1777017 1795537 1814496 1833162 1851155 1869056 1887785
57336 1887785 1907334 1926794 1945731 1964718 1984240 2003966 2023564 2043519 2064435 2086119 2108032
57325 2108032 2130327 2153643 2178013 2202653 2226924 2250962 2275238 2299906 2324793 2349780 2375029
57314 2375029 2400927 2427901 2456156 2485544 2515780 2546811 2578805 2611750 2645220 2678714 2712181
57303 2712181 2746017 2780534 2815573 2850607 2885059 2918399 2950176 2980187 3008506 3035103 3059493
57292 3059493 3080991 3099240 3114282 3126257 3135402 3142283 3147636 3151974 3155727 3159748 3165128 3172347 3181049
57279 3181049 3190823 3201665 3213510 3225963 3238965 3253267 3269691 3288226 3308289 3329485 3351545
57268 3351545 3373914 3396096 3418306 3441145 3464661 3488343 3511997 3535985 3560463 3584990 3609180
57257 3609180 3633311 3657992 3683450 3709417 3735532 3761579 3787439 3813030 3838355 3863573 3888959
57246 3888959 3914712 3940726 3966603 3991953 4016721 4041225 4065897 4090858 4115659 4139600 4162623
57235 4162623 4185779 4210387 4236746 4264108 4291859 4320083 4348787 4377261 4404740 4431228 4457256
57224 4457256 4483210 4509285 4535632 4561995 4587690 4612521 4637327 4662942 4688972 4714319 4738676
57213 4738676 4762683 4786775 4810787 4834717 4859000 4883721 4908214 4931786 4954379 4976341 4998044
57202 4998044 5019973 5042771 5066987 5093172 5122454 5156787 5198518 5249922 5312844 5387729 5472384
57191 5472384 5562105 5651652 5737287 5817082 5890066 5955834 6014808 6068098 6116632 6160456 6198935
57180 6198935 6231520 6258182 6279166 6294533 6304180 6308342 6307885 6303991 6297643 6289508 6280095 6269776 6258703
57167 6258703 6246865 6234235 6220791 6206522 6191486 6175727 6159149 6141766 6124226 6107711 6093098
57156 6093098 6080491 6069766 6061068 6054365 6048889 6043688 6038571 6033941 6029801 6025477 6020324 6014182 6007015
57143 6007015 5998491 5988033 5975046 5959079 5939999 5917978 5893132 5865340 5834713 5802128 5769046
57132 5769046 5736932 5707002 5680132 5656528 5635800 5617765 5602951 5591744 5583088 5574458 5563415 5549975
57120 5549975 5538764 5538644 5557476 5594430 5637823 5672984 5693322 5703290 5711566 5723811 5742337 5769662
57108 5769662 5809733 5866398 5942746 6042120 6168833 6327985 6525453 6768304 7065097 7426363
57098 7426363 7865381 8398273 9043004 9818650 10745778 11846391 13142122 14651775 16389662
57089 16389662 18364145 20575528 23014081 25658894 28476710 31420475 34428324 37421433
57081 37421433 40297795 42925941 45151782 46826651 47844842 48166681 47814614 46851736
57073 46851736 45360358 43429070 41146674 38599985 35874219 33053277 30216797 27434396
57065 27434396 24761079 22236530 19887350 17729806 15771845 14014325 12451876 11074007
57057 11074007 9866646 8813581 7897491 7101013 6408073 5804695 5278604 4818425 4413769
57048 4413769 4055955 3738236 3455199 3202241 2975500 2771849 2588745 2424221 2276823
57039 2276823 2145132 2027232 1920981 1824790 1737777 1659207 1588372 1525083 1469591 1421711 1380602
57028 1380602 1345892 1318436 1299584 1290371 1292078 1306842 1337174 1386257 1459776 1564320 1697897
57017 1697897 1839267 1950412 1995700 1962367 1864263 1728515 1580137 1435722 1304291 1189249
57007 1189249 1090095 1004879 931980 869840 816356 769668 728984 693848 663163 635726 611147
56996 611147 589479 570404 553535 538981 526698 515699 504878 494435 485651 479435 475866 474963
56984 474963 476981 481826 488790 496785 504212 508809 508567 503015 493095 479919 464411 448019 432622
56971 432622 419294 407882 398088 390252 384679 380932 378408 377110 377390 379363 383139 389274 398438 410749
56957 410749 425790 442888 460802 477171 488874 493291 489440 478311 462396 444632 427204 411070
56945 411070 396468 383562 372484 363148 355475 349755 346513 346107 348652 354258 363081 375253 390999
56932 390999 410682 434337 460937 488168 512815 531369 540753 539282 527493 507971 484133 458870
56920 458870 433968 410354 388590 369127 352268 337967 325747 314877 304702 294925 285714 277533
56908 277533 270707 265054 260027 255298 251106 247847 245427 243238 240837 238498 236985 236806 237791 239390 241308
56893 241308 243802 247467 252827 260138 269415 280497 293172 307362 323099 339982 356508 370100
56881 370100 378247 379923 376085 368812 359967 350628 341475 333311 326892 322444 319733 318696 319742 323337
56867 323337 329607 338502 350088 364566 382280 404004 430790 463034 499721 538698 577102 610913
56855 610913 634805 644165 638133 620216 595535 567883 539405 511899 487143 466230 449588 437724
56843 437724 431298 430422 434530 443194 456681 475648 500787 532965 573209 622010 678446 739640
56831 739640 800412 853360 890292 905071 896081 866487 822348 770320 716240 664596 618293 578569
56819 578569 545293 517825 495962 480134 470650 466983 468170 473987 485380 503620 529313 562313
56807 562313 602004 646829 693173 734986 765066 777572 770331 745548 708390 664557 618655 574138
56795 574138 533736 499122 470387 446532 426767 411083 399608 391992 387735 386799 389544 396281 407241
56782 407241 422731 442792 466457 491440 514457 531766 539846 536555 522314 500120 473957 446884
56770 446884 420340 394799 370583 348028 327226 308059 290544 274987 261700 250673 241647 234438
56758 234438 228901 224565 220625 216614 212922 210327 208977 208145 207024 205477 203867 202449 201248 200401 200212
56743 200212 200752 201573 202028 201887 201531 201520 201975 202511 202770 202769 202612 202101 201018 199684 198751 198394 198170 197837 197824
56724 197824 198547 199714 200788 201765 202959 204247 205150 205579 205927 206449 207129 208172 209928 212223 214404 216348
56708 216348 218764 222132 225989 229803 233999 239323 245511 251389 256218 260211 263638 266244 267862 268989
56694 268989 270227 271448 272049 271912 271663 271943 272764 273739 274726 275929 277484 279174 280701 282043 283346 284566
56678 284566 285465 285932 286070 285995 285807 285740 285998 286293 285965 284650 282516 279673 275889 271282 266741 263071 260012
56661 260012 256757 253233 250090 247514 244790 241195 236696 231649 226555 222292 219765 218768 217841 215873 213426
56646 213426 211824 211389 211356 211366 212100 214253 217523 220926 223709 225666 226954 227952 229089 230483 231761 232479
56630 232479 232638 232633 232671 232449 231450 229484 226875 224192 221833 219792 217716 215228 212402 209950 208716 208847
56614 208847 209630 210316 210908 211928 213682 216107 219089 222384 225315 227216 228225 229086 229998 230404 230214 230475
56598 230475 232194 234992 237626 239493 240920 242227 243259 243805 243846 243422 242768 242500 243025 243823 243979 243473 243256
56581 243256 243954 245232 246622 248146 249728 250757 250883 250752 251261 252457 253755 254933 256238 257698 259049
56566 259049 260355 262070 264380 266856 268842 269758 269081 266615 262985 259453 256861 254997 253107 250719 247786
56551 247786 244451 241073 238236 236241 234627 232555 229701 226433 223161 219871 216399 212766 209039 205180
56537 205180 201369 198231 196315 195417 194766 193932 193234 193245 194223 196072 198505 201020 202985 204009 204114 203489
56521 203489 202296 200837 199557 198545 197348 195602 193618 191919 190423 188622 186506 184677 183462 182441
56507 182441 181095 179502 178140 177258 176737 176291 175580 174367 172870 171797 171742 172581 173685 174688 175812 177466
56491 177466 179667 181952 183772 184981 185927 187091 188641 190422 192239 194042 195846 197688 199617 201539
56477 201539 203108 204045 204542 205111 205953 206811 207454 207944 208220 207825 206365 204090 201684 199570 197703 195957
56461 195957 194439 193343 192702 192410 192529 193487 195785 199265 202753 204778 204796 203510 201893 200244 198408 196613
56445 196613 195609 195962 197446 199213 200423 200723 200215 199090 197432 195443 193624 192391 191560 190596 189472
56430 189472 188834 189149 190048 190791 191070 191021 190771 190390 190126 190312 191067 192301 193863 195445 196624 197434 198665
56413 198665 201073 204333 207303 209372 211057 213090 215424 217476 219037 220455 221988 223348 223998 223725 222809
56398 222809 221704 220645 219595 218466 217350 216511 216190 216390 216828 217108 217063 216887 216832 216828 216588 216096 215752 215996
56380 215996 216957 218444 220003 220951 220821 220007 219614 220290 221540 222563 223483 225184 227970 230978 233118 234239
56364 234239 235154 236706 238972 241235 242668 243136 243417 244478 246553 249039 251263 253090 254725 256225 257440
56349 257440 258351 259239 260514 262431 264921 267580 269841 271329 272193 273015 274299 276038 277889 279827 282458
56334 282458 286509 292039 298256 304132 309158 313573 318035 323032 328506 333975 339032 343668 348087 352471
56320 352471 357037 362027 367324 372256 376117 378847 380853 382349 383261 383670 383859 383938 383925 384186 385222 386901
56304 386901 388458 389453 390263 391488 393414 396279 400383 405559 411081 416546 422397 429124 436392 443535 450552
56289 450552 458029 466324 475409 485388 496565 509002 522418 536675 552123 569494 589475 612218
56277 612218 637160 663622 691818 722981 758298 798032 841938 890172 943464 1002704 1068642
56266 1068642 1141741 1222086 1309737 1405260 1509360 1621672 1740383 1863319 1988781 2114956
56256 2114956 2239287 2359137 2472513 2577446 2671222 2751058 2815227 2862923 2893622 2907545
56246 2907545 2906301 2891949 2865539 2827443 2778808 2721535 2656803 2584710 2505561 2420545 2330852
56235 2330852 2237010 2139567 2039791 1939339 1839679 1742016 1647247 1555737 1467584 1383279 1303714
56224 1303714 1229525 1160827 1097564 1039534 986117 936630 891116 850138 813693 780913 751045
56213 751045 724105 700323 679515 661332 645658 632379 621058 611106 602133 594005 586785 580641
56201 580641 575576 571281 567451 564107 561355 559082 557296 556492 557051 558554 560319 562461 565641 569840 574246
56186 574246 578505 583274 589259 596423 604484 613650 624322 636390 649121 661685 673703 685484 697683
56173 697683 710476 723192 735031 745966 756580 767301 778228 789431 800911 812520 824563
56162 824563 838200 854563 873670 894970 918825 946771 980549 1021739 1072282 1134519 1210739
56151 1210739 1303400 1415614 1550292 1708242 1887182 2081735 2283112 2479099 2656532 2805846
56141 2805846 2924403 3016678 3092124 3161666 3233147 3307691 3379661 3439973 3479940 3494196 3483113
56130 3483113 3453554 3415881 3378382 3343341 3306682 3259596 3191079 3091916 2958822 2795592 2610844
56119 2610844 2415423 2220930 2037882 1873235 1729679 1607383 1505590 1422588 1355742 1302566
56109 1302566 1261252 1229963 1206627 1189824 1178879 1172711 1169498 1167826 1167169 1166891 1165851 1163389 1159727
56096 1159727 1154989 1148855 1141518 1133907 1126579 1119388 1112542 1106864 1102644 1099472 1097516 1097619 1099676 1102363
56082 1102363 1105130 1109127 1115374 1123208 1131398 1139677 1148460 1158084 1169041 1181886 1196232 1210825 1225179
56069 1225179 1240098 1256082 1272414 1288403 1304372 1320880 1338161 1356690 1376925 1398065 1418584
56058 1418584 1438471 1459288 1481522 1503805 1525514 1548074 1572574 1598046 1623442 1649488 1677078
56047 1677078 1705466 1733664 1762208 1792016 1822853 1854413 1887619 1923350 1961063 2000046 2040847
56036 2040847 2084042 2128806 2174041 2219810 2266480 2313744 2361672 2411338 2463195 2516274 2570167
56025 2570167 2626128 2684851 2744920 2805062 2866355 2930618 2998107 3068284 3141122 3216019 3291238
56014 3291238 3366377 3443884 3526352 3613806 3705377 3801839 3904471 4012897 4126030 4243835
56004 4243835 4366538 4493709 4625749 4764553 4911082 5064226 5223652 5391538 5569699
55995 5569699 5757408 5954201 6162362 6384291 6619807 6868410 7131790 7411628 7707369
55986 7707369 8018692 8347862 8697385 9068158 9462303 9884713 10339230 10826590 11348954
55977 11348954 11912805 12524474 13186887 13904173 14685339 15539886 16474572 17498948 18629698
55968 18629698 19885278 21281500 22837590 24582031 26548313 28771910 31298694 34192283
55960 34192283 37530014 41401965 45924404 51250896 57567356 65087841 74064282 84793587
55952 84793587 97616339 112933779 131241314 153121159 179160388 209803740 245063951
55945 245063951 283937193 323658643 359471522 385625863 397443061 393220126 374703316
55938 374703316 345973161 311701949 275847863 241150279 209186779 180656993 155703371
55931 155703371 134171370 115764239 100119886 86863990 75649769 66168549 58143538
55924 58143538 51332728 45536185 40589195 36349222 32695292 29532937 26787660 24393437
55916 24393437 22292365 20440028 18801984 17346225 16044530 14877536 13831228 12889975
55908 12889975 12038142 11265672 10566115 9930924 9350621 8819397 8333541 7887162 7474006
55899 7474006 7091573 6739013 6412764 6108418 5824901 5562553 5318752 5089528 4873927
55890 4873927 4672880 4485251 4308795 4143517 3990390 3848068 3714375 3589598 3474719
55881 3474719 3367776 3265674 3168671 3079709 3000239 2929645 2867217 2810821 2754363 2690469 2616080
55870 2616080 2533295 2445597 2356043 2268163 2185141 2107727 2035092 1967334 1905034 1847120 1791723
55859 1791723 1738808 1689799 1645038 1603684 1565557 1531081 1499924 1471557 1446460 1424864 1405121
55848 1405121 1385334 1365824 1348006 1331620 1315131 1298232 1281884 1266498 1251999 1238952 1227644
55837 1227644 1216656 1204242 1190472 1176277 1161302 1144685 1127087 1109882 1093063 1076016 1059506
55826 1059506 1044611 1030419 1015099 998718 982654 966720 949327 930304 911238 893035 875246
55815 875246 857888 841908 827720 815019 803996 795077 787627 780624 774416 769981 766689 762663 757246
55802 757246 751303 745158 738162 730425 723147 716983 711647 707251 704478 703237 702473 701240 698631 692935
55788 692935 682747 669183 655565 644731 637721 634730 635633 639481 644938 651341 658118 663387 664666
55775 664666 660962 652883 640882 624986 606118 586013 565686 545321 525579 507460 490862 474843
55763 474843 459417 445644 433882 423450 414062 406065 399178 392571 386342 381510 378319 376042 374444
55750 374444 373908 373962 373387 372101 371242 370958 369673 366194 361086 355367 349090 341925 334025 325752 317514 310258
55734 310258 305071 301881 299478 297070 294848 292900 290807 288547 286606 284878 282604 279665 276877 274712
55720 274712 272890 271394 270719 270854 271251 272048 274072 277339 280877 284444 289084 295451 302814 310309 318061
55705 318061 326471 335388 344535 353757 362458 369775 375727 381222 386600 391198 394658 397501 400032 401905
55691 401905 403202 404688 406454 407471 407033 405483 402972 398825 392869 386277 380178 374388 368175 361361
55677 361361 353975 345900 337607 330285 324338 318594 311793 304162 296869 290814 286661 285146 286392 289555
55663 289555 293980 300128 308763 319849 332869 347508 363286 379152 394131 407872 420010 429545
55651 429545 435414 437189 434953 429215 421290 412843 404516 395805 386688 378394 372080 367837 365649 366121
55637 366121 369264 373553 377217 379671 380768 379571 375023 367159 356535 343168 327198 310027 293487
55624 293487 278123 263271 248514 234075 220205 207268 196150 187430 180284 173291 166245 160185
55612 160185 155641 151860 147944 143896 140262 137390 135267 133662 132231 130805 129517 128377 126916 124730
55598 124730 122202 120112 118635 117229 115510 113739 112384 111600 111283 111355 111854 112774 113829 114489 114540 114532 115303
55581 115303 117035 119267 121844 125183 129415 134027 138747 144074 150451 157538 164898 172769 181353 189758
55567 189758 196492 200994 204049 206731 209294 211066 211155 209404 206720 204254 202190 199791 196633 193089 189405
55552 189405 185149 180036 174548 169135 163487 157238 150763 144603 138699 132945 127930 124297 121835 119992
55538 119992 118818 118507 118419 117618 116182 115000 114353 113683 112819 112480 113368 115466 118470 122258 126711 131604
55522 131604 136942 143024 150033 157892 166613 176390 187162 198404 209533 220347 230875 240844 249370
55509 249370 255206 257474 256222 252128 245615 236514 224640 210458 195126 180087 166544 154874 144444
55496 144444 134419 124760 115982 108077 100501 93319 87429 83263 80078 76996 73954 71180 68557 66130
55482 66130 64458 63691 62977 61581 59932 58776 57976 57011 56075 55680 55611 55235 54465 53506 52149 50292 48756
55465 48756 48461 49037 49353 49183 49233 49699 49939 49578 48827 47705 46051 44404 43724 43962 43920 42933 41814 41689
55447 41689 42600 43632 43863 42951 41312 39904 39334 39175 38732 38315 38851 40254 41230 41022 40393 40442 41294 42422
55429 42422 43513 44458 45093 45505 46079 46751 46755 45679 44319 43853 44404 44934 44421 42784 40808 39466 39198 39599
55411 39599 39844 39495 38737 37924 37260 37001 37462 38578 39725 40190 39661 38331 36841 36108 36671 38065 39223
55394 39223 39585 39433 39147 38705 38096 37643 37596 37808 38091 38506 39080 39608 39932 40063 39859 39108 38139 37810 38516
55375 38516 39629 40293 40300 39815 38775 37144 35371 33939 32657 31009 29066 27442 26390 25584 24902 24773
55359 24773 25439 26344 26686 26357 25916 25745 25629 25249 24703 24343 24370 24874 26037 27782 29334 29759 29196 28939
55341 28939 29843 31101 31208 29856 28185 27280 27169 27371 27722 28350 29324 30642 32201 33541 34016 33555 32944
55324 32944 32981 33580 34005 33872 33571 33713 34406 35156 35371 34922 34181 33531 32968 32303 31552 30864 30194 29366 28457
55305 28457 27776 27479 27498 27839 28622 29723 30717 31253 31301 31002 30541 30100 29657 28881 27598 26278 25616 25714 26174
55286 26174 26974 28499 30590 32277 32838 32534 31904 31026 30002 29550 30258 31523 32063 31465 30592 30441 31175
55269 31175 32312 33267 33556 32996 31975 31186 30882 30684 30298 30015 30210 30635 30640 29984 29039 28244 27693 27311 27112
55250 27112 27074 26950 26454 25607 24767 24311 24406 25069 26222 27603 28776 29451 29807 30286 30944 31194 30415 28819
55232 28819 27434 27092 27653 28384 28846 29061 29012 28591 28059 27954 28235 28138 27296 26480 26602 27381 27804 27652 27671 28289
55212 28289 29062 29595 30160 31015 31828 32170 32010 31393 30292 29164 28958 29959 31203 31657 31513 31643 32251 32824
55194 32824 33119 33412 33965 34859 36205 37870 39150 39339 38556 37534 36790 36483 36734 37376 37616 36748 35115
55177 35115 33702 32882 32357 32153 32767 34184 35560 36162 36044 35634 35231 35014 34960 34664 33792 32772 32372 32577
55159 32577 32592 32091 31642 31669 31807 31684 31623 32005 32464 32263 31135 29372 27440 25825 24955 24893 25342 26067 27016
55140 27016 27964 28514 28601 28527 28420 28176 28066 28636 29738 30439 30419 30781 32759 36049 39139 41071 42272 43748
55122 43748 45953 48417 50126 50340 49292 48019 47364 47286 47191 46551 45129 43072 41056 39942 39947 40495 41096
55105 41096 41890 43045 44153 44694 44680 44356 43667 42590 41646 41517 42338 43887 46094 48761 51046 52056 51930
55088 51930 51715 52126 52997 53959 54931 55712 55736 54751 53389 52576 52487 52479 51985 51128 50338 49728 49150 48741 49004 50126
55068 50126 51513 52304 52224 51621 50811 49822 48792 48151 48199 48760 49394 49708 49421 48437 47023 45640 44508 43532
55050 43532 42668 41940 41084 39650 37805 36611 37178 39698 43455 47509 51191 54356 57429 60853 64222
55035 64222 66284 66241 64750 63263 62557 62322 62017 61610 61376 61348 61252 60976 60862 61312 62065 62233 61321 59910 58869
55016 58869 58211 57397 56561 56445 57021 57112 55921 54142 52981 52707 52797 52936 53124 53154 52767 52199 51931 51968 51863
54997 51863 51347 50505 49422 48129 46899 46244 46593 48063 50327 52583 53977 54354 54310 54309 54201 53890 53915 54836
54979 54836 56451 58201 59981 62027 64335 66869 70034 74188 78817 82947 86367 89878 94350 100143
54965 100143 107461 116634 127805 140739 155140 170900 187953 206019 224350 241423 255074 263382
54953 263382 265540 261833 253145 240789 226347 211019 195152 178855 162870 148365 136039 125935
54941 125935 117913 111689 106546 101730 97256 93773 91521 89891 88080 85756 83077 80507 78692 78069
54927 78069 78518 79742 81889 85334 89929 95082 100688 107480 116336 127670 141506 157559 174920 192114
54913 192114 207664 220363 229000 232482 230572 224141 214479 202598 189332 175551 161833 148215
54901 148215 134690 121821 110517 101212 93518 86759 80695 75673 72165 70273 69662 69810 70135 70081 69490
54886 69490 68909 69028 69685 69907 69200 68262 67988 68349 68791 69198 69630 69486 67958 65307 62804 61228 60149
54869 60149 58819 57125 55364 53695 52108 50594 49156 47929 47304 47480 47995 48204 48213 48665 49566 50061 49575
54852 49575 48489 47414 46488 45687 45227 45159 45100 44767 44384 44142 43700 42707 41446 40493 39957 39490 38895 38418 38605
54833 38605 39938 42313 44710 45949 46033 46283 47708 49752 51176 51731 52312 53733 56083 59158 62755 66452
54817 66452 69774 72783 76052 79862 83891 87967 92688 98891 106712 115660 125590 137165 151146 167423
54803 167423 184871 201921 216986 228527 235322 237037 234366 228328 219536 208315 195312 181606
54791 181606 168232 155828 144703 134972 126605 119508 113539 108379 103671 99570 96916 96337 97289 98491
54777 98491 99310 100240 101986 104757 108667 114135 121354 129646 137978 146047 154522 164183 175149 187065
54763 187065 199811 213685 228719 243925 257508 267919 274434 276632 273868 265788 253159 237555
54751 237555 220312 202251 184335 167737 153034 139818 127423 115715 105008 95659 87985 82155
54739 82155 77867 74423 71338 68601 66190 63780 61196 58791 57021 55861 54944 54044 53176 52438 52018 52162
54723 52162 52821 53429 53384 52774 52416 53054 54495 55655 55632 54781 54404 55213 56410 56675 55726 54378 53422 53176
54705 53176 53928 55862 58371 60334 61388 62226 63299 63977 63491 62071 60610 59703 59504 60036 61076 62051
54689 62051 62563 62788 63055 63472 64312 66175 69170 72402 74891 76656 78304 79938 81202 82135 83138 84176
54673 84176 84745 84700 84510 84608 84998 85572 86388 87543 89193 91715 95479 100364 105805 111404 117280 123881 131694
54656 131694 141028 151655 162651 172807 181198 187260 190558 190843 188216 182994 175574 166669 157388 148604
54642 148604 140388 132391 124634 117452 110860 104504 98189 92065 86393 81630 78555 77634 78181 78737 78480
54627 78480 77826 77565 77893 78495 79027 79184 78676 77519 76186 75126 74273 73228 71849 70462 69449 68768 67959
54610 67959 66714 65377 64589 64371 63974 62916 61803 61552 62089 62480 62281 62015 62219 62745 63303 64005 64846 65201
54592 65201 64441 62827 61235 60173 59580 59408 59780 60473 60818 60399 59527 58729 58014 56976 55538 54299 54048
54575 54048 55089 57029 59069 60473 60942 60698 60139 59398 58360 57190 56539 56926 58051 59057 59458 59472 59468
54558 59468 59549 59804 60439 61345 61946 61949 61998 63094 65499 68691 72266 76273 80550 84411 87396 90001 93185
54541 93185 97254 101585 105414 108476 110718 111719 110817 107849 103506 98770 94147 89592 85036 80653 76616
54526 76616 72960 69812 67464 65982 64957 63939 62977 62521 62837 63736 64767 65434 65346 64462 63197 62018
54510 62018 60954 59769 58668 58380 59283 60730 61682 61887 61994 62444 62791 62466 61777 61536 61839 61937 61378 60676
54492 60676 60529 61024 62038 63752 66063 67967 68399 67546 66528 65906 65336 64663 64326 64470 64527 64126 63645 63453
54474 63453 63272 62756 62051 61315 60339 59169 58461 58594 58993 59028 59035 59673 60726 61441 61752 62276 63169 63805 63666
54455 63666 62948 62229 61982 62306 62773 62743 62258 62209 63083 63989 63800 62848 62471 63039 63594 63483 63204 63237 63134 62347
54435 62347 61235 60621 60850 61798 63258 64814 65757 65664 64902 64229 64184 65018 66745 68806 70118 69995 68899
54418 68899 67965 67966 69021 70981 73617 76506 79197 81583 83884 86229 88410 90059 90943 91111 90834 90382
54402 90382 89881 89373 88948 88633 88283 87759 87119 86352 85043 82743 79713 76894 75037 74196 74115 74626 75413 75848
54384 75848 75555 74903 74574 74718 74864 74635 74209 74033 74260 74559 74369 73294 71316 68809 66495 65238 65550
54367 65550 67046 68595 69328 69387 69502 69991 70500 70634 70438 70225 70272 70761 71715 72959 74338 75973 78050 80394
54349 80394 82505 83971 84613 84421 83704 83134 83063 82848 81462 78845 76034 73806 71865 69730 67772 66773
54333 66773 66722 66711 65938 64393 62603 61078 60092 59640 59403 58833 57504 55565 53847 53271 53932 54874 55029 54290
54315 54290 53404 53007 53170 53752 54632 55452 55652 55072 54201 53580 53250 52938 52536 52139 51821 51614 51536 51569 51708 52086
54295 52086 52858 53900 54848 55424 55561 55281 54750 54435 54751 55546 56272 56704 57076 57553 58040 58552 59244 59916 60077
54276 60077 59735 59579 60139 61162 62058 62470 62212 61271 60260 60274 61726 63721 65070 65563 65791 66140 66573 67073
54258 67073 67643 67988 67818 67414 67358 67700 67864 67470 66833 66522 66684 66905 66623 65688 64565 63855 63564 63099 62120
54239 62120 61082 60704 61186 62229 63457 64489 64887 64532 63904 63583 63555 63339 62657 61625 60494 59591 59387
54222 59387 60119 61391 62529 63360 64302 65620 66892 67313 66421 64583 62861 62239 62796 63822 64806 65898
54206 65898 67108 67643 66706 64733 63100 62651 63096 63855 64707 65370 65136 63567 61263 59456 58816 58851 58464
54189 58464 56976 54671 52431 50866 49876 49136 48762 49151 50223 51276 51716 51616 51348 50954 50195 49072 47959
54172 47959 47241 47042 47325 47998 48794 49243 49018 48322 47737 47619 47785 47885 47860 47889 48005 48068 48098 48324 48880 49630
54152 49630 50334 50804 50910 50692 50512 50873 51915 53247 54265 54524 53894 52659 51437 50686 50321 50118 50314
54135 50314 51283 52641 53381 53101 52427 51974 51535 50745 49887 49429 49222 48839 48383 48268 48415 48319 47851 47412 47317
54116 47317 47544 48033 48765 49498 49922 50109 50475 51197 51954 52217 51621 50203 48563 47620 47805 48590 49157 49418
54098 49418 49997 51304 53076 54743 55843 56095 55495 54429 53375 52433 51389 50205 49191 48740 49093 50222
54082 50222 51694 52822 53291 53510 54087 55180 56640 58405 60192 61121 60413 58440 56487 55414 55154 55485
54066 55485 56596 58638 61216 63622 65214 65528 64519 62898 61821 61997 63290 65153 67037 68412 68981
54051 68981 69046 69247 69811 70521 71467 73138 75475 77479 78341 78565 79453 81713 84973 88423 91524 94212 96813
54034 96813 99834 103568 107842 112156 116036 119290 122172 125312 129183 133603 137951 141882 145414 148332
54020 148332 150063 150437 150133 150019 150352 150875 151320 151463 151050 150163 149380 149058 148615 147070 144235 140866 137620
54003 137620 134352 130599 126273 121610 116772 111857 107180 103186 100048 97578 95617 94302 93769 93687 93379
53988 93379 92517 91470 90782 90441 89967 89177 88479 88242 88224 87916 87277 86710 86353 85817 84821 83828 83619 84336 85259
53969 85259 85665 85573 85434 85366 85062 84366 83525 82859 82550 82850 84073 86173 88564 90581 91915 92545 92658 92775
53951 92775 93538 95008 96596 98023 99956 103183 107530 112199 116963 122250 128134 133999 139429 144813 150773
53936 150773 157348 163960 169906 174731 178361 180998 182744 183380 182786 181418 179968 178620 177089 175429 174268
53921 174268 174141 175030 176651 178787 181182 183590 186156 189392 193571 198479 203913 209971 216595 223167 228859
53906 228859 233178 236016 237536 238205 238539 238479 237396 235096 232476 230652 229548 227936 225000 221372 218280
53891 218280 215888 212990 208486 202730 196978 191709 186184 179822 173313 167814 163552 159875 156363 153116
53877 153116 150129 147165 144296 141849 139762 137631 135436 133510 131718 129448 126594 123788 121420 119204
53863 119204 116978 115061 113344 110893 107175 103024 99715 97549 96034 94907 94164 93469 92365 90981 89837
53848 89837 89066 88416 87826 87471 87335 87277 87346 87523 87400 86667 85698 85063 84656 83989 83158 82746 82826 82852 82645 82694 83287
53827 83287 84057 84685 85407 86461 87583 88498 89411 90548 91579 92060 92150 92322 92524 92281 91668 91602 92860 95163
53809 95163 97556 99471 101059 102637 104265 106015 108277 111422 115304 119375 123250 126937 130598 134326
53795 134326 138131 141857 145144 147790 150134 152680 155285 157181 157983 158212 158531 158903 158922 158549 157956 156844
53779 156844 154625 151329 147780 144678 141879 138809 135287 131660 128327 125410 122857 120599 118497 116317
53765 116317 113977 111818 110392 109853 109642 108898 107072 104067 100093 95715 91848 89194 87614 86383 85100
53750 85100 84001 83363 83054 82867 82879 83252 83870 84358 84273 83348 81833 80505 79875 79425 78270 76613 75763 76399
53732 76399 77608 78141 77953 77860 78232 78812 79485 80349 81124 81182 80269 78787 77360 76472 76384 77008 77893 78661 79386
53713 79386 80278 81202 81830 82066 82031 81839 81684 81828 82156 82107 81508 81110 81808 83571 85670 87669 89601 91476
53695 91476 93305 95382 97829 99971 100933 100861 100833 101490 102387 102792 102520 101871 101290 101295 102221 103859 105666 107361
53677 107361 108915 110048 110425 110417 111027 112769 115076 117079 118547 119831 121209 122558 123477 123682 123435 123464 124121
53660 124121 124809 124764 124249 124273 125109 125887 125850 125308 124956 124882 124759 124563 124592 125039 125881 126964 127906 128212 127779 127078
53640 127078 126570 126150 125353 123923 122039 120262 119389 119939 121548 123159 124063 124485 125026 125828 126595 127055 127119
53623 127119 126836 126478 126437 126707 126750 126191 125423 125164 125546 126067 126428 127033 128509 130916 133527 135399 136134 136167
53605 136167 136319 137136 138674 140799 143447 146528 149754 152703 155058 156825 158284 159658 160810 161468 161832
53590 161832 162570 164040 165840 167479 169098 171038 173104 174915 176734 179182 182198 185048 187341 189264
53576 189264 190758 191381 191214 191026 191130 190880 189804 188556 188119 188622 189598 190842 192296 193430 193606 192973 192339
53559 192339 192178 192227 192064 191592 190945 190312 189906 189799 189775 189544 189060 188445 187744 187040 186666 187024 188197 189903 191724
53540 191724 193241 194076 194043 193251 192010 190750 189982 190005 190541 190930 190868 190684 190841 191475 192514 193770 194784 195147
53522 195147 195281 196313 198755 201820 204577 207269 210797 215319 220162 224900 229696 234601 239322 243806
53508 243806 248458 253561 259029 264858 271323 278482 285959 293459 301169 309413 318190 327277 336536 345965
53494 345965 355634 365835 377100 389864 404066 419121 434265 449001 463370 477789 492519 507364
53482 507364 522005 536488 551135 566095 581279 596703 612535 628759 645112 661438 677785
53471 677785 693974 709386 723465 736316 748624 761007 773631 786353 799018 811526 823716
53460 823716 835374 846423 857045 867546 878104 888738 899413 909965 919898 928474 935169 939948
53448 939948 943014 944446 944175 942156 938339 932611 924990 915920 906192 896560 887415 878736 870236 861548
53434 861548 852297 842087 830623 818076 805252 793039 781603 770381 758890 747179 735397 723360
53422 723360 710924 698548 687109 677216 668925 661998 656205 651446 647706 644850 642477 640236 638346
53409 638346 637441 637720 638628 639653 641049 643428 646959 651443 656895 663482 670989 678827 686618 694498 702971
53394 702971 712798 724751 738928 754309 769495 784023 798690 814653 832575 852524 874174 896971
53382 896971 920599 945425 972131 1000785 1030576 1060633 1090742 1121185 1152250 1184118 1216879
53371 1216879 1250383 1284267 1318343 1352733 1387390 1421700 1454869 1486565 1516941 1546092 1573838
53360 1573838 1600075 1625017 1648928 1671777 1693395 1713908 1733623 1752383 1769290 1783375 1794340
53349 1794340 1802302 1806922 1807346 1803079 1794375 1781517 1764273 1742483 1716848 1688629 1658815 1628003
53337 1628003 1596798 1565740 1534926 1504237 1473957 1444692 1416689 1389720 1363669 1338692 1314660
53326 1314660 1290816 1266275 1240576 1213733 1186026 1157877 1129670 1101644 1074181 1048099 1024233
53315 1024233 1002583 982304 962695 943899 926523 911009 897575 886360 877204 869433 862134 854593
53303 854593 846368 837142 826812 815655 804305 793526 783883 775392 767449 759398 751220 743437 736391
53290 736391 730075 724813 721524 720875 722405 724891 727424 729829 732304 735168 739005 744489 751808 760465
53276 760465 769821 779653 790037 800904 812032 823441 835496 848450 862032 875681 889113 902470
53264 902470 915906 929244 942076 954045 964975 974885 984063 992898 1001406 1008976 1014773 1018357 1019891
53251 1019891 1019897 1018915 1017137 1014141 1009132 1001702 992192 981105 968459 954076 938222 921404 903671
53238 903671 884730 864797 844756 825310 806508 788300 771008 754904 739764 725306 711752
53227 711752 699424 687958 676351 663767 649971 635079 619340 603261 587538 572543 557978
53216 557978 543330 528636 514657 502178 491208 481075 471310 462275 454804 449320 445430 442267 439043
53203 439043 435354 431172 426562 421330 415004 407323 398580 389242 379338 368603 357205 345944 335544
53190 335544 326090 317265 308859 300820 293056 285507 278335 271815 266024 260790 255947 251499 247450 243493
53176 243493 239002 233488 227116 220602 214536 208962 203726 198933 194718 190780 186607 182176 177991 174344
53162 174344 170930 167369 163842 160916 158915 157629 156602 155545 154548 153882 153584 153241 152363 150895 149246
53147 149246 147943 147375 147693 148544 148984 148081 145774 142938 140603 139299 139000 139236 139226 138389 136905 135428 134177
53130 134177 132755 130949 129199 127977 127153 126403 125886 126055 126917 127884 128300 127891 126836 125690 125138 125489 126370
53113 126370 127134 127543 127861 128227 128218 127231 125335 123465 122546 122439 122096 120877 119343 118433 118235 118089 117649 117136
53095 117136 116614 115763 114574 113601 113207 113088 112892 112826 113171 113607 113508 112749 111781 111095 110927 111383 112509 114209
53077 114209 116250 118272 119784 120402 120225 119741 119296 118981 119052 119953 121659 123502 124978 126281 127624 128522
53061 128522 128367 127434 126689 126724 127420 128558 130086 131663 132509 132083 130689 129145 127912 126737 125202 123513
53045 123513 122507 122740 123788 124768 125353 125756 125829 125015 123439 122319 122696 124229 125767 126701 127219 127650 128194
53028 128194 129028 130007 130472 130039 129428 129833 131463 133330 134466 134763 134587 134239 133988 134078 134416 134630 134651 134923
53010 134923 135890 137526 139488 141438 143085 144182 144668 144664 144283 143610 142856 142270 141862 141382 140644 139784 139263 139674
52992 139674 141312 143723 145898 147196 147862 148453 149119 149874 151095 153047 155064 156065 155949 155829 156719 158550
52976 158550 160647 162565 164157 165350 166271 167364 169024 171292 173953 176708 179159 180947 182060 182736 183014
52961 183014 182758 182223 182120 182849 183958 184639 184550 183976 183359 182880 182413 181840 181551 182431 184902 188011 190072 190400
52943 190400 189979 190152 191066 191842 191913 191727 192134 193373 194736 195194 194361 192799 191318 190202 189405 189170 189775
52926 189775 190761 191182 190808 190391 190448 190573 190377 190336 191006 192035 192776 193480 194913 196954 198540 199067 199031 199034 198845
52907 198845 197814 195721 192852 189620 186446 183752 181751 180353 179361 178550 177490 175735 173423 171309 169921
52892 169921 168994 168065 167286 167093 167308 167230 166670 166222 166260 166255 165551 164402 163648 163603 163869 164208 164923 166214 167744
52873 167744 169107 170302 171407 172227 172661 173056 173686 174138 173731 172372 170474 168171 165255 161914 158887 156617
52857 156617 154758 152833 150988 149791 149477 149641 149571 148721 147040 144953 142945 141149 139508 138197 137471 137074
52841 137074 136279 134719 132799 131079 129634 128258 126897 125482 123672 121194 118312 115602 113429 111923
52827 111923 111252 111451 112054 112322 111887 110937 109799 108663 107733 107319 107600 108447 109534 110533 111247 111732 112316 113330
52809 113330 114789 116399 117866 119066 120015 120889 122084 123923 126208 128275 129728 130947 132567 134550 136169
52794 136169 137039 137738 138976 140417 140972 140303 139381 139214 139618 139749 139351 138739 137881 136406 134543 133142 132597
52777 132597 132519 132793 134034 136397 138669 139473 138974 138554 138935 139439 139149 137998 136464 134786 132933 131077
52761 131077 129718 129360 130144 131649 133001 133364 132548 131164 130149 130097 130917 132055 133100 134189 135715 137598
52745 137598 139047 139224 138013 136067 134247 133104 132624 132245 131351 129976 128846 128544 128939 129717 131108 133534
52729 133534 136654 139387 141058 142076 143360 145397 148000 150683 153049 154957 156540 158089 159875 162014
52715 162014 164331 166338 167625 168423 169444 170873 171872 171620 170649 170467 171793 173787 175120 175274 174543 173339
52699 173339 171958 170697 169802 169458 170037 171974 175045 178031 179671 179863 179590 179741 180440 181490 182883 184592
52683 184592 186195 187103 187114 186589 186113 186075 186395 186506 185666 183536 180497 177280 174330 171618 168968 166283 163444
52666 163444 160289 156912 153778 151326 149567 148219 147055 145930 144726 143637 143310 144224 145943 147512 148605
52651 148605 149788 151520 153542 155527 157737 160447 163081 164550 164382 163063 161421 160102 159501 159635 159962
52636 159962 159746 158770 157499 156585 156385 156844 157468 157462 156317 154343 152372 150911 149839 148872 147951 147139 146476
52619 146476 146042 145888 145844 145642 145241 144783 144241 143487 142693 142302 142475 142913 143308 143666 144088 144533 144933 145284 145538
52600 145538 145632 145709 146097 146985 148342 149992 151435 151832 150753 148930 147540 146695 145423 143442 142013 142375
52584 142375 143962 144984 144408 142589 140237 137671 135135 133094 131899 131491 131539 131595 131167 130065 128698 127659
52568 127659 127048 126562 126226 126480 127400 128293 128402 127774 127163 127214 127841 128300 127799 126161 124006 122195 121191 120998
52550 120998 121464 122262 122753 122426 121591 121151 121472 121897 121615 120650 119643 119036 118883 119196 119934 120627 120568 119556
52532 119556 118163 117100 116530 116135 115650 115088 114526 113945 113365 113001 113108 113661 114292 114636 114664 114562 114375 113976
52514 113976 113388 112858 112419 111661 110250 108584 107482 107175 106997 106332 105462 105090 105256 105292 104892 104614 105019 105721
52496 105721 105766 104828 103577 102862 102902 103371 103921 104398 104718 104808 104648 104293 103869 103559 103466 103460 103290 102857 102299 101809
52476 101809 101610 102014 103128 104370 104715 103776 102387 101685 101838 102086 101953 101826 102188 102751 102637 101306 99162
52459 99162 97424 97351 99220 101863 103556 103599 102847 102481 102660 102754 102564 102570 102959 103093 102364 101139 100374 100503 101173
52440 101173 102002 103039 104334 105509 106143 106361 106653 107131 107337 106862 105896 105060 104812 105145 105667 105935 105808 105574
52422 105574 105609 105885 106014 105865 105852 106301 106791 106539 105399 104120 103489 103569 103922 104317 104903 105796 106741 107302 107290
52403 107290 106944 106671 106671 106864 107208 107886 109048 110464 111685 112472 112853 112857 112562 112401 113014 114510 116197 117265
52385 117265 117606 117688 117842 117948 117726 117090 116218 115417 114878 114467 113972 113634 114130 115752 117884 119670 120951 122042
52367 122042 122889 123163 123182 123909 125717 127782 129163 129986 131045 132627 134323 135784 137012 138008 138718 139407
52351 139407 140528 142025 143181 143457 143221 143352 144296 145724 147042 148047 149100 150739 153073 155573 157512
52336 157512 158641 159289 159808 160130 160000 159477 159018 159084 159737 160659 161559 162567 164185 166757 170114 173811 177598
52319 177598 181416 185118 188541 191892 195618 199817 204174 208665 213833 220034 226844 233684 240670 248184
52305 248184 255811 262528 268106 273522 279613 285973 291805 297479 304369 313114 322687 331526 339181 346464
52291 346464 354235 362524 370890 379245 387995 397515 407775 418521 429539 440564 451132 460835 469818
52278 469818 478791 488431 498834 509588 520194 530343 539976 549275 558526 567793 576726 584895 592281
52265 592281 599311 606361 613380 619976 625723 630350 633917 636911 639952 643220 646334 648952 651266 653604
52251 653604 655757 657170 657779 658180 658803 659418 659760 660291 661876 664837 668720 672978 677443 682094 686784 691457
52235 691457 696451 702313 709329 717331 725974 735121 744889 755332 766165 776983 787688 798459 809235
52222 809235 819640 829593 839580 849906 860042 869324 878016 886916 895954 904047 910490 915664 919971
52209 919971 922935 924013 923649 922752 921454 919102 915171 909520 902047 892968 883343 874477 866646 859056 851118
52194 851118 843095 835416 828106 821177 814856 809056 803158 796828 790614 785334 781215 777962 775201 772441
52180 772441 768991 764562 759716 755294 751563 748296 745379 742763 740003 736513 732349 728212 724617 721456
52166 721456 718402 715309 712083 708575 704785 700900 697046 693280 689882 687282 685524 684068 682328 680125
52152 680125 677489 674372 670858 667417 664578 662401 660515 658524 656140 653071 649250 645172 641535 638409
52138 638409 635161 631500 628213 626316 625602 624678 622574 619799 617448 615688 613683 610791 607199 603332 599260
52123 599260 594966 590764 587046 583826 580827 577849 574890 572153 570187 569632 570457 571731 572639 573519 575370
52108 575370 578449 582028 585547 589320 593831 598952 604278 609769 615614 621745 628081 635079 643473 653422
52094 653422 664311 675554 687284 700117 714380 729721 745344 760538 775087 789277 803596
52083 803596 818424 833898 849837 865743 881142 896131 911339 927070 942585 956612 968516
52072 968516 978670 987653 995499 1001875 1006664 1010129 1012666 1014566 1015873 1016311 1015471 1013238 1009934 1005977
52058 1005977 1001645 997338 993645 990668 987431 982617 976088 969233 963499 958905 954351 949045 943073 936707
52044 936707 929903 922827 916326 911288 907584 904156 900213 896026 892458 890023 888590 887676 886730 885340 883593
52029 883593 882262 882288 883959 886716 889794 892816 895762 898715 901827 905323 909274 913417 917363 920842 923699
52014 923699 925808 927145 927755 927423 925571 921720 915937 908558 899714 889449 878139 866279 853858 840432
52000 840432 825832 810345 794110 776894 758769 740488 722746 705418 687937 670133 652268
51989 652268 634435 616418 597957 578694 558032 535620 512003 488280 465089 442425 420487
51978 420487 400017 381522 364688 349006 334523 321450 309383 297583 286094 275928 267859 261373
51966 261373 255166 248583 242195 236848 232485 228191 223377 218519 214463 211263 208112 204405 200498 197234
51952 197234 194963 193231 191297 188868 186388 184562 183480 182304 180106 176998 174020 171848 170119 168282
51938 168282 166546 165454 164857 163954 162259 159946 157329 154564 151968 150031 148819 147774 146380 144745 143303
51923 143303 142268 141670 141601 142075 142803 143485 144166 144934 145450 145246 144490 143984 144235 144926 145499 145912 146481 147231 147785
51904 147785 147843 147476 146962 146584 146576 147013 147681 148229 148487 148502 148309 147924 147576 147652 148341 149538 151221 153553 156376
51885 156376 158995 160877 162426 164583 167710 171265 174634 177854 181412 185793 191467 198920 208265 218962
51871 218962 230382 242659 256743 273614 293679 316928 343261 372347 403199 434076 462687
51860 462687 486356 502183 507743 502248 487072 464871 438074 408411 377662 348127 321675 298553
51848 298553 277700 258346 240885 226127 214204 204509 196388 189458 183385 177792 172546 167936 164400
51835 164400 162000 160218 158343 156126 154026 152710 152416 152889 153772 154711 155226 154923 154019 153258 153089 153196 153031
51818 153031 152469 151702 150856 150118 149976 150743 151888 152336 151636 150511 150092 150843 152359 153979 155362 156532 157555
51801 157555 158297 158511 158133 157392 156539 155602 154539 153500 152738 152273 151871 151467 151448 152329 154070 155857 156757 156685
51783 156685 156542 157143 158214 158841 158832 158988 159831 160655 160405 159144 157949 157518 157521 157397 157147 157069 157172 157252 157319 157580
51763 157580 158030 158333 158182 157673 157279 157449 158258 159509 161087 162999 164970 166314 166526 165867 165107 164796 165011
51746 165011 165594 166205 166264 165403 164033 162990 162477 161839 160547 158966 157749 156936 156130 155340 155023 155302 155591
51729 155591 155179 153901 152127 150332 148866 147935 147537 147440 147446 147692 148511 149874 151181 151851 152039 152444 153329 154061
51711 154061 153816 152528 150903 149685 149189 149349 149838 150213 150257 150226 150507 151043 151308 150800 149269 146666 143358
51694 143358 140421 139130 139825 141576 143149 144035 144319 143990 142863 141078 139261 138079 137760 137982 138150 137846
51678 137846 137166 136626 136678 137312 138050 138311 137918 137483 138118 140354 143374 145666 146449 146072 145078 143599 141904
51661 141904 140817 140967 142023 143230 144396 145744 147068 147745 147565 146927 146127 145018 143524 142046 141134 141050
51645 141050 141723 142788 143594 143632 143153 143008 143682 144778 145647 146095 146176 145702 144502 142946 141713 141014 140505 139931
51627 139931 139430 139104 138766 138341 138160 138462 138852 138687 137961 137389 137562 138322 139128 139708 140167 140677 141353 142341 143739
51608 143739 145442 147217 148910 150411 151485 151909 151785 151524 151426 151458 151468 151454 151563 152011 152986 154437 155944 157084
51590 157084 158039 159502 161786 164311 166249 167405 168125 168579 168675 168607 168959 170039 171522 173013 174625 176661
51574 176661 178925 180836 182199 183447 184981 186649 188185 189889 192401 195775 199173 201642 202925 203361
51560 203361 203313 203055 202944 203204 203479 203094 201926 200693 200134 200116 199865 198920 197623 196699 196596 197234 198183 198971
51542 198971 199346 199362 199252 199135 198795 197761 195727 192989 190407 188779 188228 188233 188237 188055 187763 187369 186659 185282
51524 185282 182934 179651 175962 172676 170454 169520 169627 170107 170161 169422 168297 167493 167198 166960 166349 165431 164528
51507 164528 163879 163587 163614 163635 163182 162151 160958 160054 159491 159056 158542 157794 156782 155817 155346 155346 155206 154467 153380
51488 153380 152476 151913 151560 151412 151566 151952 152453 153080 153789 154369 154833 155646 157126 158907 160412 161648 162999
51471 162999 164469 165696 166692 167921 169584 171365 173030 174754 176625 178240 179027 178723 177343 174909 171479
51456 171479 167284 162719 158183 153951 150061 146410 143060 140238 137862 135324 132222 129128 127115 126501
51442 126501 126560 126583 126663 127212 128132 128811 128729 127864 126719 126092 126548 127856 129088 129442 128837 127725 126554 125578
51424 125578 124949 124780 125114 125817 126459 126478 125762 124883 124372 123903 122707 120740 118812 117421 116110 114303 112144
51407 112144 110077 108095 105990 104010 102667 102023 101651 101165 100397 99232 97757 96481 95924 95973 96044 95916 95993
51390 95993 96640 97662 98556 99053 99243 99376 99685 100255 100957 101557 101921 102077 102148 102347 102921 103976 105367 106915
51372 106915 108515 109882 110497 110276 110130 111175 113256 114861 114892 114048 113890 114869 115993 116412 116520 117087 117829
51355 117829 117520 115410 112034 108556 105728 103652 102176 101191 100628 100389 100269 99914 99083 98087 97725 98492 99986
51338 99986 101362 102205 102616 102663 102279 101759 101745 102447 103239 103366 102782 102023 101472 101135 100978 101163 101914 103355 105417
51319 105417 107690 109457 110144 109818 109077 108453 108022 107551 106775 105488 103615 101377 99307 97930 97350 97243
51303 97243 97268 97338 97397 97073 95907 94046 92417 91931 92623 93797 94870 95779 96731 97979 99802 102262 104916
51286 104916 107215 109277 111815 115087 118430 121160 123470 125995 128821 131387 133162 133928 133576 132154 130116
51271 130116 128042 126079 123989 121737 119589 117615 115550 113309 111291 109900 109012 108131 106928 105476 104074
51256 104074 103022 102459 102312 102394 102581 102850 103211 103770 104772 106371 108289 109970 111179 112286 113803 115786
51240 115786 117840 119631 121256 123106 125402 127892 129994 131310 131934 132149 131907 130882 129144 127481 126783
51225 126783 127138 127816 128152 128230 128602 129567 130948 132454 133946 135313 136370 137037 137390 137346 136496 134590 132042
51208 132042 129602 127546 125583 123601 122001 121072 120495 119808 119082 118754 118923 119237 119358 119197 118736 117934 116882
51191 116882 115819 115027 114744 115004 115374 115098 113921 112647 112464 113748 115859 118012 119873 121335 122244 122542
51175 122542 122277 121319 119467 117008 114753 113285 112469 111954 111755 111983 112367 112504 112382 112234 112036 111611 111161
51158 111161 111201 111889 112804 113553 114251 115252 116665 118325 120063 121792 123454 125053 126654 128214 129459 130115
51142 130115 130211 130066 129936 129781 129334 128323 126675 124693 123040 122344 122650 123350 123843 124248 125239 127155 129490
51125 129490 131498 133141 135127 137942 141077 143430 144402 144346 143962 143411 142268 140293 137989 136173 135113
51110 135113 134346 133396 132400 131834 131814 131993 132125 132407 133116 134110 134844 134851 134088 132850 131473 130161 129091 128599
51092 128599 129092 130626 132663 134461 135768 136981 138581 140586 142679 144645 146517 148329 149978 151308
51078 151308 152133 152154 151066 148914 146251 143815 142036 140855 140027 139496 139448 139966 140694 140939 140168 138475 136499
51061 136499 134947 134191 134217 134789 135605 136456 137310 138156 138760 138795 138345 138052 138527 139675 140927 141993 143030 144044
51043 144044 144627 144508 144044 143846 144226 145276 147128 149690 152353 154629 156917 159996 163683 166783 168674
51028 168674 170233 172596 175519 177793 179076 180409 182719 185518 187581 188538 189233 190613 192731 195015 197182
51013 197182 199529 202338 205360 208176 210962 214556 219583 225755 232273 238745 245414 252496 259777 267103
50999 267103 274993 284293 295261 307385 320249 334180 349745 366863 384869 403271 421911 440446
50987 440446 458443 476245 495040 515616 537673 560991 586629 615983 649053 684770 722887
50976 722887 764254 809040 855929 903623 952025 1001158 1049866 1096518 1140291 1180844 1217310
50965 1217310 1248731 1275119 1297062 1314534 1327167 1335455 1340615 1343222 1343121 1340933 1338593 1337932 1339452
50952 1339452 1342815 1347767 1354066 1361023 1367547 1372366 1374072 1371510 1364327 1352695 1336428 1315034 1288696
50939 1288696 1258278 1223958 1184802 1140347 1091875 1041365 989789 937312 884719 833598 785164
50928 785164 739732 697373 658403 623098 591459 563435 539016 517970 499754 483697 469140
50917 469140 455575 443023 432135 423545 417154 412282 408378 405252 402768 400740 399061 397634 396289
50904 396289 395160 394908 396050 398093 399864 400817 401567 403028 405464 408642 412479 417115 422489 428137 433568
50889 433568 438768 444263 450627 458008 466298 475587 486009 497090 507993 518831 531134 546249 563715
50876 563715 582135 601443 623232 648837 678190 710972 747805 789552 836137 886986 942254
50865 942254 1002861 1069563 1142676 1222581 1309673 1403688 1503655 1608677 1718396 1832510 1950162
50854 1950162 2069732 2188725 2303627 2410338 2505245 2586003 2651414 2700974 2734842 2754046
50844 2754046 2760333 2755770 2742581 2723339 2701115 2679309 2661226 2649608 2646269 2651896 2666010 2687079
50832 2687079 2712788 2740330 2766434 2787237 2798544 2796799 2780025 2747738 2700050 2637157 2559678
50821 2559678 2469006 2366992 2255516 2136688 2013209 1888056 1763859 1642917 1527704 1420671
50811 1420671 1323225 1235212 1155754 1084364 1021006 965423 916963 875063 839407 809482 784341
50800 784341 763143 745702 732228 722583 716065 711865 709469 708465 708247 708159 707884 707415 706552 704754 701659
50785 701659 697580 693159 688635 683697 678075 671904 665482 659023 652775 647014 641694 636377 630780 625185
50771 625185 620083 615731 612361 610471 610490 612368 615936 621387 628873 637827 647376 657363 668347 680590
50757 680590 693800 707986 723876 742155 762883 785950 811491 839518 869818 902712 939383
50746 939383 980922 1027473 1078779 1134988 1196213 1261670 1330039 1400365 1471829 1542836 1611232
50735 1611232 1675426 1734479 1786939 1830340 1862202 1881082 1886639 1879427 1861123 1834491 1802686 1768672
50723 1768672 1735295 1705305 1680822 1662932 1651989 1647998 1650472 1658245 1669777 1683469 1697487 1709475
50711 1709475 1716764 1716776 1707259 1686490 1653735 1609497 1555208 1492816 1424715 1353654 1282197 1212124
50699 1212124 1144442 1079867 1019174 963244 912917 868660 830226 796836 767918 743524 723777
50688 723777 708127 695543 685422 678019 673919 673360 676179 682171 691260 703278 717659 733368 749228
50675 749228 764424 778719 792172 804712 816089 826171 835095 843095 850264 856545 861902 866481 870627
50662 870627 874738 879008 883311 887436 891509 896183 902384 910898 922124 936050 952273 970162 989344
50649 989344 1010147 1033308 1058940 1085887 1112436 1137683 1161905 1185529 1208180 1228983 1247424
50638 1247424 1263442 1276849 1287212 1294358 1298543 1299958 1298463 1294048 1287244 1278692 1268438 1256085 1241704
50625 1241704 1226301 1211183 1197006 1183599 1170606 1158027 1146057 1134702 1123868 1113747 1104857
50614 1104857 1097608 1092015 1087843 1084837 1082783 1081555 1081143 1081267 1080827 1078052 1071450 1060421 1044834 1024463
50600 1024463 999365 970544 939626 907864 875838 844025 813190 784125 757406 733443 712431
50589 712431 694169 678335 665002 654629 647447 643176 641271 641073 641707 642360 642833 643420 644059 644103 643175
50574 643175 641873 641298 642167 644630 648612 653969 660529 668321 677687 688978 702310 717707 735178 754396
50560 754396 774546 794748 814506 833602 851884 869353 886140 902135 916963 930654 944016
50549 944016 957908 972438 987373 1003193 1021144 1042233 1066562 1093735 1123525 1156046 1191627
50538 1191627 1230764 1274039 1321884 1374408 1431412 1492516 1557143 1624354 1692687 1760357 1825866
50527 1825866 1888395 1947333 2001465 2048885 2087723 2116576 2134311 2140042 2133589 2115502 2086399 2046807
50515 2046807 1997970 1942214 1881912 1818416 1752491 1685403 1618998 1555047 1495154 1440932 1393425
50504 1393425 1352379 1316790 1286252 1261287 1242416 1229620 1222795 1222149 1227992 1240433 1259290 1283841
50492 1283841 1312633 1343855 1375708 1405884 1431001 1447464 1453097 1447440 1430571 1402498 1363872 1316434
50480 1316434 1262387 1203793 1142715 1081259 1021171 963863 910866 863424 821364 783235 748039
50469 748039 716137 688148 663865 642913 625625 612353 602485 595075 590000 587660 587874 589947 593630
50456 593630 599152 606432 615091 625176 637113 650868 665865 681755 698589 716108 733425 749597
50444 749597 764052 776498 786964 796015 804428 812490 820026 827105 834240 841877 850162 859266 869430
50431 869430 880659 892881 906434 921782 938686 956309 974363 993561 1014689 1037809 1062645
50420 1062645 1089162 1117290 1146580 1176624 1207455 1239073 1270861 1301843 1331302 1358755 1383570
50409 1383570 1404992 1422391 1435148 1442436 1443410 1437474 1424263 1403632 1375894 1341758 1301770 1256150
50397 1256150 1205585 1151935 1097715 1044897 994363 946274 900718 858240 819987 787107 759791
50386 759791 737258 718896 704902 695433 689829 687355 688316 693540 703034 716030 732169 751581 773564
50373 773564 796068 816838 834363 847414 854508 854564 847726 835029 817497 795953 771388 744937
50361 744937 717563 690014 662944 636750 611443 586941 563468 541535 521674 504346 489807
50350 489807 477832 467714 458786 450862 444148 439048 436163 435998 438176 441223 443654 445323 447324 450629
50336 450629 455206 460476 466201 472616 479843 487435 494606 500945 506878 513318 520818 529129 537489 545120
50322 545120 551493 556558 560876 565168 569489 573149 575684 577529 579377 581294 582992 584740 587377 591491
50308 591491 597096 604136 612854 623546 636140 649739 662089 669848 670367 663637 652173 638913 625671
50295 625671 613386 602758 593980 586411 579194 572002 564873 557774 550807 544476 539237 534963 531342 528478
50281 528478 526514 524853 522489 519170 515690 512878 510809 509157 507858 507108 507016 507535 508573 509910 511158
50266 511158 512016 512497 512856 513452 514763 517257 520928 525027 528568 531224 533629 536704 540764 545366 550002
50251 550002 554694 559816 565388 570803 575346 578819 581564 583992 586273 588392 590274 591780 592733 593012 592642
50236 592642 591751 590450 588649 585981 582123 577379 572801 569502 567826 567359 567593 568273 569160 569999 570980 572874
50220 572874 576358 581384 587556 594955 604100 615073 627210 639937 653554 668874 686341 705956
50208 705956 727874 752436 779439 807894 836872 866171 895674 924363 950643 973629 993506
50197 993506 1010488 1024079 1033743 1039838 1043418 1045295 1045673 1044392 1040888 1033938 1022038 1004314 980867
50184 980867 952269 919103 882197 842932 803003 763908 726695 692004 660195 631500 606130
50173 606130 584078 564883 547893 532849 519940 509143 499851 491406 483748 477148 471472 466134 460746
50160 460746 455446 450529 446075 442060 438492 435247 431953 428257 424104 419608 414803 409693 404439 399219
50146 399219 393936 388333 382464 376846 371973 367778 363703 359300 354690 350419 346919 344088 341430 338643
50132 338643 336088 334532 334401 335354 336686 337956 339089 340073 340926 342009 343987 347219 351322 355586 359802
50117 359802 364450 370033 376356 382605 388115 393043 398221 404365 411545 419477 428159 437831 448328 458857
50103 458857 468804 478571 489295 501762 515864 531112 547341 564890 584382 606491 631695 660034
50091 660034 691313 725726 764150 807471 855589 907216 960608 1014284 1067075 1117791 1165209
50080 1165209 1208447 1247285 1282234 1314351 1344850 1374435 1402624 1427584 1446705 1457552 1458546 1449103
50068 1449103 1429461 1400543 1363920 1321679 1276018 1228654 1180498 1131974 1083754 1037116 993508
50057 993508 953863 918479 887432 860810 838492 820013 804882 792880 783857 777338 772577 768936
50045 768936 766010 763434 760853 758192 755704 753554 751449 748813 745248 740604 734721 727450 719085 710455
50031 710455 702205 694046 685058 674839 664064 653794 644562 636413 629525 624198 620156 616395 612057
50018 612057 607340 603291 600777 599830 599871 600409 601462 603395 606475 610635 615631 621205 627018 632616 637747
50003 637747 642542 647100 651000 653620 654863 655095 654344 652085 647988 642380 635741 628280 620298 612373 604685
49988 604685 596622 587747 578788 570933 564367 558314 552503 547739 544785 543356 542609 542130 542132 543188 546264
49973 546264 552623 563070 577300 594399 613991 636597 662773 692158 723452 755086 785743 814381
49961 814381 840132 862421 881087 896230 908096 917404 925630 934268 943344 950834 953897 950580 940239
49948 940239 922889 898824 868775 833834 795199 754414 713711 675399 640620 609062 580051
49937 580051 553515 529758 508809 490389 474245 460132 447590 436078 425337 415502 406816 399205
49925 399205 392098 384833 377375 370450 364637 359570 354460 349267 344772 341473 338979 336650 334315 332141
49911 332141 330229 328554 326981 325199 323058 320995 319637 318843 317717 315780 313523 311501 309601 307700
49897 307700 306435 306640 308302 310560 312494 313521 313410 312397 311060 309691 308092 306274 304789 303857 302737
49882 302737 300669 298031 295834 294394 293348 292665 292678 293198 293542 293561 293802 294477 295070 295220 295300 295772 296524 297200
49864 297200 297755 298360 299172 300403 302260 304622 307114 309663 312591 315919 319028 321288 322727 323880 325231
49849 325231 327002 329114 331134 332529 333178 333423 333483 333147 332248 331098 330174 329588 329090 328421 327455 326184 324749
49832 324749 323389 322222 321237 320531 320356 320854 321893 323220 324576 325721 326639 327668 329059 330377 330828 330290
49816 330290 329513 329071 328629 327604 326184 325161 324895 324856 324219 322659 320567 318596 317057 315833 314859 314377
49800 314377 314407 314247 313130 311296 309793 309075 308501 307409 305937 304381 302463 299883 297089 294825 293235
49785 293235 292004 291108 290772 290895 291135 291454 292043 292786 293342 293619 293606 292921 291232 289132 287837 287792 288234 288420
49767 288420 288725 290054 292608 295721 298710 301293 303229 304026 303369 301641 299747 298359 297548 297209 297475 298314
49751 298314 298998 298681 297642 297190 297961 298943 298826 297809 297227 297672 298416 298633 298313 297811 297351 297314 298258 300157
49733 300157 302167 303610 304745 306171 307914 309584 310970 311923 312028 311092 309823 309342 310032 311360 312795
49718 312795 314308 315928 317436 318811 320467 322714 325235 327426 328988 329892 330046 329427 328459 327819 327832 328359
49702 328359 329247 330545 332185 333840 335353 337023 339197 341780 344455 347254 350593 354756 359597 364635
49688 364635 369158 372371 373861 374003 373582 373006 372283 371708 371897 372927 373991 374401 374525 375257 376866 378843
49672 378843 380554 381526 381353 380055 378516 377900 378556 379869 381164 382270 383274 384412 386282 389506 393942
49657 393942 398809 403885 410084 418581 429834 443625 459175 474515 486379 491820 490219 483390 473927
49644 473927 463877 454642 447152 441675 437834 435100 433129 431609 430130 428450 426730 425346 424524 424203
49630 424203 424201 424508 425441 427338 430000 432601 434432 435602 436816 438567 440826 443398 446142 448821 451179
49615 451179 453322 455788 459011 462836 466724 470250 473336 476132 478811 481468 484167 487086 490504 494477
49601 494477 498587 502269 505374 508243 511219 514386 517775 521501 525528 529621 533747 538282 543553 549336
49587 549336 555066 560453 565594 570526 575034 579045 583001 587586 593028 598779 604009 608492 612840 617781
49573 617781 623277 628622 633359 637780 642343 646956 651147 654766 658101 661325 664185 666415 668210 670079
49559 670079 672356 675000 677838 680822 684021 687466 691113 694949 698991 703081 706756 709531 711440 713095
49545 713095 715126 717657 720534 723872 727993 732710 737007 739773 740849 741233 742263 744607 747985 751685
49531 751685 755265 758876 763030 768141 774256 781078 788093 794670 800235 804536 807783 810442 812878 815175
49517 815175 817277 819218 821109 822871 824048 823995 822369 819406 815675 811599 807263 802574 797407 791560 784821
49502 784821 777238 769264 761463 754018 746646 739042 731438 724659 719543 716127 713386 709964 705324 700132
49488 700132 695443 691627 688206 684585 680612 676471 672385 668573 665172 662039 658788 655211 651499 647867
49474 647867 644201 640325 636432 632882 629696 626621 623634 620899 618244 615255 612066 609534 608217 607620
49460 607620 606896 605961 605307 604997 604542 603781 603261 603507 604414 605536 606611 607599 608544 609693 611521 614541 619339
49443 619339 626597 636320 646683 654410 657114 655132 650657 645447 640002 634546 629757 626263 624098 622917
49429 622917 622327 621910 621463 621431 622674 625524 629458 633831 638487 643471 648662 653989 659585 665357 670909
49414 670909 676277 682282 689596 697863 706309 714922 724278 734483 745060 755862 767263 779222 790920
49401 790920 801609 811326 820459 829106 837201 844819 851919 858184 863531 868475 873494 878294 882262 885502
49387 885502 888884 892983 897530 902024 906417 910877 915242 919164 922741 926589 931163 936229 941172 945690
49373 945690 950052 954720 959951 965789 972173 978880 985512 991786 997790 1003772 1009682 1015225 1020401 1025673
49359 1025673 1031424 1037499 1043546 1049650 1056295 1063709 1071590 1079596 1087867 1096829 1106549 1116489 1125958 1134693
49345 1134693 1142939 1151064 1159176 1167070 1174402 1180967 1187009 1193265 1200408 1208219 1215540 1221373 1225937 1230299
49331 1230299 1235007 1239502 1243003 1245534 1247747 1250038 1252261 1254263 1256277 1258647 1261365 1264041 1266300 1268161
49317 1268161 1270044 1272401 1275309 1278447 1281445 1284144 1286513 1288485 1290042 1291258 1292036 1291934 1290546 1288127
49303 1288127 1285593 1283782 1282800 1282136 1281258 1279980 1278381 1276593 1274708 1272759 1270734 1268668 1266789 1265456 1264823
49288 1264823 1264588 1264272 1263743 1263231 1262742 1261831 1260312 1258897 1258573 1259313 1260039 1259982 1259534 1259380 1259336 1258700 1257474 1256476
49270 1256476 1256127 1255744 1254329 1251695 1248517 1245495 1242782 1240193 1237644 1235152 1232258 1227522 1219042 1205915
49256 1205915 1189182 1171044 1153131 1135809 1119003 1102972 1087955 1073593 1059350 1045422 1032765
49245 1032765 1022212 1013798 1006866 1000507 993946 986893 979653 972700 966064 959380 952511 945777 939449 933449
49231 933449 927765 922778 918780 915441 912299 909732 908828 910098 912673 915044 916411 917141 918183 920295 923618
49216 923618 927599 931368 934397 936856 939272 942029 945320 949335 954105 959272 964414 969608 975307 981570
49202 981570 987747 993147 997828 1002585 1008244 1014998 1022307 1029423 1036177 1043226 1051287 1060144 1068675 1075872
49188 1075872 1081514 1085910 1089494 1092923 1097041 1102290 1108335 1114584 1120905 1127537 1134573 1141917 1149660 1158078
49174 1158078 1167321 1177372 1188312 1200330 1213557 1228083 1244027 1261282 1279309 1297594 1316356
49163 1316356 1336460 1358548 1382460 1407509 1433094 1459015 1485464 1512805 1541225 1570489 1600066
49152 1600066 1629400 1657985 1685318 1710996 1734817 1756627 1776184 1793346 1808280 1821299 1832658
49141 1832658 1842733 1852122 1861236 1869959 1878055 1885713 1893297 1900858 1908426 1916622 1926243 1937250 1948878
49128 1948878 1960981 1974705 1991621 2012575 2037356 2064605 2091706 2115781 2135956 2154618 2175526
49117 2175526 2200062 2225125 2244557 2252897 2248726 2235338 2218298 2201762 2186425 2170443 2151884 2130510
49105 2130510 2107941 2086605 2068268 2053178 2040632 2030352 2022896 2018636 2016911 2016633 2017316 2019024 2021615
49092 2021615 2024639 2027857 2031318 2034983 2038663 2042319 2045999 2049562 2052847 2056123 2059949 2064542 2069584 2074606
49078 2074606 2079282 2083360 2086698 2089415 2091673 2093260 2093656 2092612 2090418 2087631 2084702 2081843 2078851 2075022
49064 2075022 2069553 2062245 2053591 2044027 2033290 2020624 2005512 1988100 1969032 1948939 1927983 1905926
49052 1905926 1882724 1859012 1835852 1813986 1793510 1774176 1755794 1738331 1721911 1706833 1693450
49041 1693450 1681900 1672046 1663691 1656638 1650499 1644662 1638743 1633170 1629150 1627799 1629129 1631974 1635071 1638152
49027 1638152 1641805 1646513 1652261 1659049 1667140 1676483 1686402 1696267 1706158 1716407 1726849 1736994 1746694
49014 1746694 1756108 1765269 1774242 1783492 1793421 1803643 1813381 1822561 1831805 1841290 1850360 1858513 1866109 1873783
49000 1873783 1881628 1889295 1896398 1902570 1907518 1911388 1914754 1918023 1921246 1924657 1928836 1933976 1939445 1944565
48986 1944565 1949424 1954441 1959488 1963974 1967658 1970917 1974283 1978067 1982279 1986578 1990387 1993386 1995797 1997986
48972 1997986 2000048 2002007 2004115 2006545 2009051 2011385 2013882 2017160 2021379 2026251 2031728 2038142 2045667 2054151
48958 2054151 2063607 2074487 2087311 2102287 2119367 2138432 2159219 2181187 2203482 2225024 2244859
48947 2244859 2262732 2279178 2294814 2309686 2323701 2337437 2351915 2367522 2383722 2399969 2416297
48936 2416297 2432625 2447906 2460520 2469434 2474725 2477146 2477551 2476757 2475697 2475449 2476987 2480771 2486585 2493973
48922 2493973 2502949 2514098 2527885 2544043 2561880 2581112 2602154 2625536 2651223 2678655 2707372
48911 2707372 2737369 2768691 2800829 2832897 2864522 2896296 2929139 2963390 2998756 3034867 3071439
48900 3071439 3107956 3143775 3178768 3213520 3248566 3283585 3317580 3349775 3380208 3409477 3438050
48889 3438050 3465847 3492479 3517815 3542177 3565912 3588986 3611220 3632714 3653678 3673861 3692601
48878 3692601 3709604 3725351 3740561 3755455 3769692 3782739 3794110 3803433 3810550 3815526 3818487 3819541
48866 3819541 3818829 3816390 3811893 3804838 3795221 3783744 3771113 3757317 3741843 3724394 3705096 3684146
48854 3684146 3661602 3637521 3612003 3585080 3556790 3527465 3497783 3468402 3439527 3410794 3381673
48843 3381673 3352177 3323223 3296108 3271525 3249189 3228451 3208960 3190652 3173576 3158103 3145002
48832 3145002 3134774 3127044 3121069 3116838 3115216 3116939 3121858 3129281 3138692 3149952 3163110 3178232 3195237
48819 3195237 3213754 3233283 3253554 3274511 3295818 3316598 3335802 3352739 3367193 3379300 3389467
48808 3389467 3398287 3406316 3413959 3421542 3429307 3437271 3445308 3453482 3462022 3470817 3479263 3487034 3494879 3504205
48794 3504205 3515728 3528833 3542352 3555789 3569580 3584381 3600475 3617906 3636817 3657297 3678984
48783 3678984 3701222 3723752 3746949 3771206 3796308 3821755 3847534 3874100 3901560 3929207 3956003
48772 3956003 3981311 4005103 4027729 4049576 4070705 4090636 4108566 4123793 4135773 4144018 4148472 4150026
48760 4150026 4149959 4148525 4144557 4136836 4125429 4111207 4094498 4074831 4051764 4025402 3996170 3964684
48748 3964684 3931736 3897830 3862692 3825677 3786633 3745950 3703890 3660551 3616560 3573050 3530680
48737 3530680 3489232 3448483 3408986 3371587 3336585 3303727 3272764 3243659 3216519 3191646 3169447
48726 3169447 3150089 3133493 3119844 3109657 3103017 3099061 3096623 3095045 3094065 3093286 3092429 3091926 3092619 3094757
48712 3094757 3097625 3100182 3101835 3102748 3103754 3105802 3109092 3112841 3116281 3119690 3123948 3129269 3135038 3140853
48698 3140853 3146933 3153248 3158935 3163094 3165779 3167778 3169611 3171195 3172425 3173777 3176271 3180923 3188290 3198669
48684 3198669 3212894 3232804 3260512 3297129 3342321 3394772 3452331 3511424 3566861 3612756 3643681
48673 3643681 3655200 3644373 3610841 3557582 3490114 3414644 3336715 3260839 3190336 3126997 3071046
48662 3071046 3021792 2978487 2940685 2907919 2879230 2853232 2828783 2805501 2783446 2762457 2742086
48651 2742086 2722071 2702443 2683170 2664138 2645588 2628029 2611467 2595163 2578436 2561283 2544018
48640 2544018 2526827 2509983 2493869 2478273 2462246 2445279 2428055 2411289 2394437 2376656 2358611
48629 2358611 2341974 2327151 2312895 2298480 2284852 2272846 2261475 2249129 2235778 2222793 2210942
48618 2210942 2199699 2188558 2177953 2168573 2160439 2152985 2145638 2138098 2130455 2123264 2117211 2112434 2108337
48605 2108337 2104216 2099879 2095600 2091659 2088065 2084547 2080798 2076873 2073473 2071595 2071669 2073043 2074449 2075010 2074933
48590 2074933 2075314 2077242 2080881 2085344 2089546 2093154 2096605 2100239 2103695 2106271 2107658 2108139 2108169 2107925 2107220
48575 2107220 2105707 2103210 2099992 2096705 2093959 2091908 2090282 2088798 2087401 2086120 2084877 2083568 2082256 2081130
48561 2081130 2080188 2079096 2077491 2075409 2073359 2071913 2071269 2071148 2071032 2070359 2068606 2065428 2060976 2056016 2051517
48546 2051517 2047919 2044876 2041741 2038218 2034418 2030435 2026194 2021707 2017199 2012780 2008214 2003215 1997829 1992300
48532 1992300 1986707 1980983 1975170 1969349 1963394 1957135 1950756 1944643 1938749 1932564 1925891 1919225 1913014 1906839
$$ [...]
##END NTUPLES=NMR SPECTRUM
##END=
