##TITLE=NES1041_872015081_9242725_9DfBnm12dO
##JCAMPDX= 6.0         $$ Bruker NMR JCAMP-DX V2.0
##DATA TYPE= NMR SPECTRUM
##DATA CLASS= NTUPLES
##ORIGIN= BRUKER
##OWNER= Administrator
$$ 1.72 TOPSPIN		Version 2.1
$$ 2015-06-23 17:46:20.248 -0700  Administrator@X
$$ Compression mode = diff/dup
##.OBSERVE FREQUENCY= 400.02188249412
##.OBSERVE NUCLEUS= ^1H
##.ACQUISITION MODE= SIMULTANEOUS (DQD)
##.ACQUISITION SCHEME= undefined
##.AVERAGES= 8
##.DIGITISER RES= 22
##SPECTROMETER/DATA SYSTEM= spect
##.PULSE SEQUENCE= zg30
##.SOLVENT NAME= COFFEE_meoh
##.SHIFT REFERENCE= INTERNAL, COFFEE_meoh, 1, 14.98509
##AUDIT TRAIL= $$ (NUMBER, WHEN, WHO, WHERE, PROCESS, VERSION, WHAT)
$$ ##TITLE= Audit trail, TOPSPIN		Version 2.1
$$ ##JCAMPDX= 5.01
$$ ##ORIGIN= Bruker BioSpin GmbH
$$ ##OWNER= Administrator
$$ $$ E:\/data/COFFEE/nmr/NES1041_872015081_9242725_9DfBnm12dO/10/pdata/1/auditp.txt
$$ ##AUDIT TRAIL=  $$ (NUMBER, WHEN, WHO, WHERE, PROCESS, VERSION, WHAT)
(   1,<2015-06-23 17:46:13.248 -0700>,<Administrator>,<X>,<go>,<TOPSPIN 2.1>,
      <created by zg
	started at 2015-06-23 17:45:06.717 -0700,
	POWCHK enabled, PULCHK disabled,
       configuration hash MD5:
       21 0F 79 D6 B3 7B B4 F6 88 20 88 DB 03 48 BD 9F
       data hash MD5: 64K
       F7 F8 3A 25 3E 13 EF 80 CC 23 57 ED 49 A2 83 FC>)
(   2,<2015-06-23 17:46:16.358 -0700>,<Administrator>,<X>,<proc1d>,<TOPSPIN 2.1>,
      <Start of raw data processing
       efp LB = 0 FT_mod = 6 PKNL = 1 PHC0 = 0 PHC1 = 0 SI = 32K 
       data hash MD5: 32K
       45 28 27 EA 58 E5 3C E4 6F E2 7B 27 A9 2A 2F 9B>)
(   3,<2015-06-23 17:46:16.623 -0700>,<Administrator>,<X>,<proc1d>,<TOPSPIN 2.1>,
      <pk PHC0 = 92.005 PHC1 = 0 
       data hash MD5: 32K
       55 AA 26 1A 02 1A 45 F4 3C F0 CD DC B9 8F 0E 2A>)
(   4,<2015-06-23 17:46:16.733 -0700>,<Administrator>,<X>,<proc1d>,<TOPSPIN 2.1>,
      <abs ABSG = 1 
       data hash MD5: 32K
       00 66 5C E0 C6 44 6E AF A7 8A 2E 9C 23 89 FE 18>)
(   5,<2015-06-23 17:46:16.795 -0700>,<Administrator>,<X>,<proc1d>,<TOPSPIN 2.1>,
      <abs ABSG = 2 
       data hash MD5: 32K
       C1 21 9A B5 A0 0F AE 4C 69 BA 16 1A 25 75 9F 9A>)
(   6,<2015-06-23 17:46:16.858 -0700>,<Administrator>,<X>,<proc1d>,<TOPSPIN 2.1>,
      <abs ABSG = 3 
       data hash MD5: 32K
       E9 0A 33 27 6B DF 26 F2 6A 1B 01 19 43 59 BD 7C>)
(   7,<2015-06-23 17:46:16.920 -0700>,<Administrator>,<X>,<proc1d>,<TOPSPIN 2.1>,
      <abs ABSG = 4 
       data hash MD5: 32K
       6F F5 70 85 CC 2A 17 2C 07 A7 68 2A D2 16 99 B4>)
(   8,<2015-06-23 17:46:16.967 -0700>,<Administrator>,<X>,<proc1d>,<TOPSPIN 2.1>,
      <abs ABSG = 5 
       data hash MD5: 32K
       55 FF 35 9E 29 D0 AF CF 51 2C 47 9C C2 65 ED 21>)
$$ ##END=
$$ 
$$ $$ hash MD5
$$ $$ 30 A1 E1 EA 1A F8 48 90 8F 14 BC 8B F7 F1 DA 21
##$RELAX= 
##$RELAX= 
##$RELAX= 
##$RELAX= 
##$RELAX= 
##$RELAX= 
##$RELAX= 
$$ Bruker specific parameters
$$ --------------------------
##$DU= <E:\>
##$EXPNO= 10
##$NAME= <NES1041_872015081_9242725_9DfBnm12dO>
$$ [...]
##$TP= (0..7)
150 150 150 150 150 150 150 150
##$TP07= 0
##$TPNAME0= <>
##$TPNAME1= <>
##$TPNAME2= <>
##$TPNAME3= <>
##$TPNAME4= <>
##$TPNAME5= <>
##$TPNAME6= <>
##$TPNAME7= <>
##$TPOAL= (0..7)
0.5 0.5 0.5 0.5 0.5 0.5 0.5 0.5
##$TPOFFS= (0..7)
0 0 0 0 0 0 0 0
##$TUNHIN= 0
##$TUNHOUT= 0
##$TUNXOUT= 0
##$USERA1= <user>
##$USERA2= <user>
##$USERA3= <user>
##$USERA4= <user>
##$USERA5= <user>
##$V9= 5
##$VALIST= <valist>
##$VCLIST= <CCCCCCCCCCCCCCC>
##$VD= 0
##$VDLIST= <DDDDDDDDDDDDDDD>
##$VPLIST= <PPPPPPPPPPPPPPP>
##$VTLIST= <TTTTTTTTTTTTTTT>
##$WBST= 2048
##$WBSW= 25
##$XGAIN= (0..3)
0 0 0 0
##$XL= 0
##$YL= 0
##$YMAX_a= 638994
##$YMIN_a= -534996
##$ZGOPTNS= <>
##$ZL1= 120
##$ZL2= 120
##$ZL3= 120
##$ZL4= 120
##$ABSF1= 14.98509
##$ABSF2= -5.573092
##$ABSG= 5
##$ABSL= 3
##$ALPHA= 0
##$AQORDER= 0
##$ASSFAC= 0
##$ASSFACI= 0
##$ASSFACX= 0
##$ASSWID= 0
##$AUNMP= <proc_prof1d_extract_pilot.lims>
##$AXLEFT= 0
##$AXNAME= <>
##$AXNUC= <1H>
##$AXRIGHT= 0
##$AXTYPE= 0
##$AXUNIT= <>
##$AZFE= 0.1
##$AZFW= 0.1
##$BCFW= 0
##$BC_mod= 0
##$BYTORDP= 0
##$COROFFS= 0
##$CY= 15
##$DATMOD= 1
##$DC= 0
##$DFILT= <>
##$DTYPP= 0
##$F1P= 0
##$F2P= 0
##$FCOR= 0.5
##$FTSIZE= 32768
##$FT_mod= 6
##$GAMMA= 0
##$GB= 0
##$INTBC= 1
##$INTSCL= 1
##$ISEN= 128
##$LB= 0
##$LEV0= 0
##$LPBIN= 0
##$MAXI= 10000
##$MC2= 0
##$MEAN= 0
##$ME_mod= 0
##$MI= 0
##$NCOEF= 0
##$NC_proc= -8
##$NLEV= 6
##$NOISF1= 0
##$NOISF2= 0
##$NSP= 0
##$NTH_PI= 0
##$NZP= 0
##$OFFSET= 14.98509
##$PC= 1
##$PHC0= 92.005
##$PHC1= 0
##$PH_mod= 1
##$PKNL= yes
##$PPARMOD= 0
##$PPDIAG= 0
##$PPIPTYP= 0
##$PPMPNUM= 2147483647
##$PPRESOL= 1
##$PSCAL= 4
##$PSIGN= 0
##$PYNMP= <proc.py>
##$REVERSE= no
##$SF= 400.02
##$SI= 32768
##$SIGF1= 0
##$SIGF2= 0
##$SINO= 400
##$SIOLD= 32768
##$SPECTYP= <>
##$SREGLST= <1H.CDCl3>
##$SSB= 0
##$STSI= 32768
##$STSR= 0
##$SW_p= 8223.68421052631
##$SYMM= 0
##$S_DEV= 0
##$TDeff= 65536
##$TDoff= 0
##$TI= <>
##$TILT= no
##$TM1= 0
##$TM2= 0
##$TOPLEV= 0
##$USERP1= <user>
##$USERP2= <user>
##$USERP3= <user>
##$USERP4= <user>
##$USERP5= <user>
##$WDW= 1
##$XDIM= 32768
##$YMAX_p= 440697999
##$YMIN_p= -824123
##$CURPLOT= <Network HP LaserJet P1505>
##$CURPRIN= <$Network HP LaserJet P1505>
##$DFORMAT= <normdp>
##$LAYOUT= <+/1D_H.xwp>
##$LFORMAT= <normlp>
##$PFORMAT= <normpl>
##$SURQMSG= 1
$$ End of Bruker specific parameters
$$ ---------------------------------
##NTUPLES= NMR SPECTRUM
##VAR_NAME=  FREQUENCY,     SPECTRUM/REAL,   SPECTRUM/IMAG
##SYMBOL=    X,             R,               I
##VAR_TYPE=  INDEPENDENT,   DEPENDENT,       DEPENDENT
##VAR_FORM=  AFFN,          ASDF,            ASDF
##VAR_DIM=   32768,         32768,           32768
##UNITS=     HZ,            ARBITRARY UNITS, ARBITRARY UNITS
##FACTOR=    0.250966925370066, 1,           1
##FIRST=     8223.43324360094, 16051,        -54929
##LAST=      0,             -134274,         -361821
##MIN=       0,             -824123,         0
##MAX=       8223.43324360094, 440697999,    0
$$ Real data points
##PAGE= N=1
##DATA TABLE= (X++(R..R)), XYDATA
$$ [...]
19479a05917n4667a7847m0480D7384N629a01033j11286L2265j13373n1342c7970
19467B87244a37739A57490D478J54625a59059m3616d3208d034B21440a43529A91259
19455a17092k19465J53216B04437a57922e1779k70789a58500P0457j85720m0545
19445c14308B232d28331j35420E9628d06469a545q5645J1886l74392h4160A9717
19433B10090a38193M3203b9135E8334e26794A11946b8122I9206a63164J3533q0939
19422b30570B27067A1714h2958D021d5934B2558a07374D8215J03687c0538j20821
19411a51359F3735a05553p6543Q2073B13788o7103e0772j02902P2248O056l55534
19400d30904C18217A04981a06913r5148r2772g9729P499j83283P2990B17859b07297
$$ y = [-105917, -160584, -17847, -58327, 47384, 53013, -101033, -212319, -180054, -293427, -344769, -37970, 287244, -137739, 157490, 4478, 159103, -159059, -202675, -43208, -4034, 221440, -143529, 191259, -117092, -336557, -183341, 204437, -157922, -51779, -322568, -158500, -88043, -273763, -314308, 2232, -428331, -563751, 59628, -406469, -1545, -87190, -75304, -449696, -84160, 19717, 210090, -138193, -94990, -29135, 58334, -526794, 111946, -28122, 99206, -163164, -149631, -230570, 227067, 11714, -82958, 4021, -45934, 22558, -107374, 48215, 151902, -30538, -151359, 63735, -105553, -182096, -100023, 213788, 146685, -50772, -153674, -81426, -75370, -430904, 318217, 104981, -106913, -202061, -294833, -79729, -72230, -255513, -182523, 217859, -207297]
19388A56606p5268d19892a53037p6758f5800p6956l9220F9296a00762j26775B14005
19376a32844l7296C56299A1003b39477h941l34750B58487e218j0446j45974B9502
19364b98787o6427E3032k3754b3225I2359b19790O1926L2356J2075A9305c95456
19352a79787k8306D264a28582G89a73162b3548J0609j59661K2903f855G2735b8858
19339A93949G043a25368A03701g5865j4865B9426b28504G4024J27168R061a21851
19327i4286C942Q7134f7685H5220J70994E7775M37311d1414a6680k84325e1729
19315b10919A64944c28094A35156F3885O6509a71498A16529a90952N5325B5561
19304B0541c47241e2189G7635a11143a1188q4134j71581d489A91562i3118C1675
$$ y = [156606, 81338, -419892, -153037, -229795, -65800, -142756, -181976, 69296, -100762, -227537, 214005, -132844, -170140, 356299, 11003, -239477, -8941, -343691, 258487, -5218, -15664, -161638, 29502, -298787, -365214, 53032, 29278, -23225, 92359, -219790, -157864, -125508, -113433, 19305, -395456, -179787, -208093, 4264, -128582, 789, -173162, -23548, -12939, -172600, -149697, -6855, 72735, -28858, 193949, 7043, -125368, 103701, -75865, -90730, 29426, -228504, 74024, 201192, 210253, -121851, -94286, 3942, 91076, -67685, 85220, 256214, 57775, 495086, -41414, -16680, -301005, -51729, -210919, 164944, -328094, 135156, 63885, 130394, -171498, 116529, -190952, -135627, 25561, 20541, -347241, -52189, 77635, -111143, -11188, -95322, -266903, -4489, 191562, -93118, 31675]
19292a82968A44418J44189i5886E3132g3401j86988j32825B8234G525b2313C4905
19280b34186d7980n1304k9164B00009d6960B3942c71179a44855O9858B2803g3994
19268D1572J96508a59550i073A85316g5570J1189l8474C2121a4320G5640b50483
19256A26055l8118J97999b75845Q1728B8436M40407g8382o4571l1493Q1888M4991
19245d7567j54742k8373L820A34175c10552A48036l9427b62469i0252j69362P7163
19234a82451A40953f8636H3134j4617J0774k7396p284B2098J17671d02373D11610
19222c9636d849k7118N448j20305j01573N6927B37888b59051B9882a64279J548
19211a62731p6424i0067r0853b4712A32403d6984l08778a65400I1854M849i9963
$$ y = [-182968, 144418, 288607, -95886, 53132, -73401, -260389, -393214, 28234, 7525, -22313, 34905, -234186, -47980, -99284, -128448, 200009, -46960, 23942, -371179, -144855, -74997, 22803, -73994, 41572, 238080, -159550, -9073, 185316, -75570, -64381, -102855, 32121, -14320, 75640, -250483, 126055, 87937, 285936, -275845, -194117, 28436, 468843, -78382, -142953, -174446, -92558, -47567, -202309, -230682, -226862, 134175, -310552, 148036, 108609, -262469, -90252, -259614, -182451, 140953, -68636, 83134, 68517, 79291, 51895, 44611, 22098, 139769, -402373, 411610, -39636, -4849, -31967, -26519, -146824, -248397, -191470, 237888, -259051, 29882, -164279, -162731, -239155, -90067, -180920, -24712, 132403, -46984, -355762, -165400, 91854, 96703, -99963]
19199i8728a6423n032A36892P4143i3771j96207a35242l4809r549F7766j0738
19188E7028J67642p5499q270n9808f3194G0561b43578P2891G8124c84835O4239
19177c20596a46346K7796A88313b6446A42835h0542c7373m9947a185o8942c07
19165a02763j44858g8319A14189b33298B4041a33002b101B71614q2855n4337Q5937
19154B20359i7546k54274k8713J14542A07980c9778E62J72196a82399d342p4102
19143g8444l6093G3853a32707N3710b8632o8103C25411h9239j85398a18509b8238
19131a3656m531k2435k26367G2386b17480K5791F6111b35121C91765E5859a20352
19119b82507J9181I583J642b2522F6153a5073j34110C45160b00861N882O2567
$$ y = [-98728, -16423, -21455, 136892, 211035, -93771, -289978, -135242, -170051, -179600, 67766, 57028, 224670, 149171, 140901, 81093, -63194, 70561, -243578, -170687, 78124, -384835, -320596, -146346, -118550, 188313, -26446, 142835, -80542, -37373, -87320, -1185, -70127, -307, -102763, -247621, -78319, 114189, -233298, 24041, -133002, -2101, 271614, 188759, 134422, 220359, -97546, -351820, -380533, -265991, 107980, -39778, 562, 172758, -182399, -4342, -78444, -114537, 73853, -132707, -78997, -28632, -96735, 325411, -89239, -274637, -118509, -28238, -13656, -18187, -40622, -266989, 72386, -217480, -191689, 66111, -235121, 391765, 55859, -120352, -282507, -263326, 9583, 11225, -22522, 66153, -15073, -149183, 345160, -200861, -194979, -132412]
19108a32412A40686a19869k39976q2166a10125M3933k30382a18065j70103B02747
19097a79985I0192J32785b55304J9538m5628a06803B24457h1461k05345i7042
19086b76220J3957a02715g488k34245h4755A17253a57590A68774N2835J4730D9359
19074h4525k5325A92302a88385B58599c9318H6687j3507a09422o3471l0938f4347
19062a10462A14201a00848A59261g6704A80422b73479c5649n497j9928A04502
19051a23182p6613o5007R6106q3851I2327M925f6898o1353m4710J8873A54857
19039B28477g8344M989A8233G708a58852q1934C42509b3858k13093J13494B39205
19027A01311r703j5137M4960b26334C24324j05598a7564D6566J56248a21782b8408
$$ y = [-132412, 140686, -119869, -359845, -442011, -110125, -66192, -296574, -118065, -288168, 202747, -179985, 90192, 222977, -255304, -235766, -281394, -106803, 224457, -81461, -286806, -97042, -276220, -262263, -102715, -7488, -241733, -84755, 117253, -157590, 168774, 221609, 236339, 49359, -84525, -109850, 192302, -188385, 258599, -39318, 86687, 73180, -109422, -172893, -203831, -64347, -110462, 114201, -100848, 159261, -76704, 180422, -273479, -35649, -41146, -61074, 104502, -123182, -199795, -264802, -168696, -252547, 92327, 97252, -66898, -128251, -172961, -154088, 154857, 228477, -78344, -73355, 18233, 7708, -158852, -240786, 342509, -23858, -236951, -123457, 239205, 101311, 91608, 76471, 121431, -226334, 324324, 218726, -17564, 46566, 202814, -121782, -28408]
19015c70088H9997J7656a20993D6698K38201A3901b23163i9317D666K8129a25249
19003A18498a80343o985f6043A40152a03995J3014l1866d2613B04074b3495j07826
18992a31321l44436f2115j22306D18376d12858B12969b64047e6040A6383c0770
18981E5742j0118J09224a71567o0858M4945b4387j63320M5450A20440f1952k40806
18970c02758E754L96320F0645c5428G8709i6419M5101A56820e8482j42120g5908
18958a75096M1126B2870a67260G3883c15073H9575c72738a17730A6954f2160b1523
18946a47955G5641i4196J8673A26275o1815a10511h632j53548o1625C60138A44486
18934A4750O6489b65120h8705j01786M8690A60142a28065L1179I9501A7277R2119
$$ y = [-370088, 89997, 107653, -120993, 46698, 284899, 13901, -223163, -99317, 4666, 32795, -125249, 118498, -180343, -187328, -66043, 140152, -103995, -90981, -122847, -42613, 204074, -23495, -131321, -475757, -62115, -184421, 418376, -412858, 212969, -264047, -56040, 16383, -30770, 55742, 45624, 154848, -171567, -232425, -187480, -24387, -187707, -142257, 120440, -61952, -302758, 5754, 402074, 60645, -35428, 78709, -96419, -51318, 156820, -58482, -200602, -75908, -175096, -133970, 22870, -167260, 73883, -315073, 89575, -372738, -117730, 16954, -62160, -21523, -147955, 75641, -94196, -75523, 126275, 64460, -110511, -8632, -162180, -223805, 360138, 144486, 14750, 81239, -265120, -88705, -190491, -141801, 160142, -128065, -96886, 99501, 17277, 109396]
18923A09396r023c54447B686a11201J2415M3815I4928a43338b4685l06892f570
18911B01550b0396j98818Q7909I7967a18387A94256B8393M4757k887b72125d2363
18899A00281b4841B62472e5403L632j51620B32342h1119J7486C5538c10530I2362
18887a58374G8709a09857b1502l29824D1468A65K16928c98172B1364L5905f3745
18875a18228C3789b2102I485a62763k8065k03522B7853b84877n275O2396F5389
18863a02769I2577l6075O7510L7693a52015f2361j87462o0776J52496H1031k917
18852G8114K56421j59228b83201F5149j3926b04080G9528a47955l4795G3940d7039
18840e6026g708m19826A37J23922f8701j71604n63K2863K2342P0498A3635a35825
$$ y = [109396, 100373, -354447, 2686, -111201, -98786, -54971, 94928, -143338, -24685, -331577, -6570, 201550, -20396, -219214, -131305, 97967, -118387, 194256, 28393, 73150, 70263, -272125, -42363, 100281, -24841, 262472, -55403, -51771, -203391, 232342, -81119, -63633, 35538, -310530, 92362, -158374, 78709, -109857, -21502, -351326, 41468, 165, 217093, -398172, 21364, 57269, -63745, -118228, 33789, -22102, 9485, -162763, -190828, -394350, 27853, -284877, -290152, -227756, 65389, -102769, 92577, 56502, 124012, 161705, -152015, -62361, -249823, -310599, -158103, 81031, 78114, 334535, 175307, -283201, 65149, 51223, -204080, 79528, -147955, -182750, 73940, -47039, -56026, -7708, -427534, 137, 124059, -68701, -240305, -240868, -218005, -195663, -125165, 13635, -135825]
18827a10819A51033c6964J437A7635e4009k7987A90742E0361P6207d8208K873
18816d5335K1165G8968B006L78590j03616f4793D05793K0366d77750b06521R0041
18805a16480o3127a414B0444f1631A06516a17426G0513L1721d2422A34440b03397
18793d5517k41948C85767H0012j1027b59697E3404E34J29473D4768a25605B01360
18781f5164J438j18737A9323a16525k61305A0585O8510c9502F1818M12d4799k50127
18769b94926A6085f8216j50209f7958a5578A00465e736B16688P1888i1777j92579
18758b84356b347l57322D0240L68355a19617M9120J9636A76265b61041a14358
18747I080J08356O5942a66058a3785r6602q1307C2212a81483b8908o3450p9855
$$ y = [-110819, 151033, -36964, -35527, 17635, -54009, -81996, 190742, 50361, 126568, -48208, -45335, -24170, 78968, 2006, 380596, 276980, -64793, 405793, 426159, -477750, -206521, -116480, -179607, -1414, 20444, -61631, 106516, -117426, 70513, 102234, -42422, 134440, -203397, -45517, -287465, 385767, 80012, 68985, -259697, 53404, 534, 130007, 44768, -125605, 201360, -65164, -63726, -182463, 19323, -116525, -377830, 10585, 79095, -39502, 61818, 62230, -44799, -294926, 16085, -68216, -218425, -67958, -15578, 100465, -5736, 216688, 288576, -91777, -284356, -2347, -359669, 40240, 408595, -119617, -70497, -50861, 176265, -261041, -114358, 9080, 117436, 183378, -166058, -13785, -110387, -191694, 32212, -181483, -28908, -92358, -172213]
18736a72213B09059K6360a19790C71992c84840A97489i2010K7015l1849j68644
18726b65488p7397C7354a45356A03091C0898b31825G7921a13275N0674K4665l12848
18715c50784I0109a00441B72912a52560K6984j4671K2001P648C0070a71691A23243
18703a81186N9895M4355j67229A45193a78702G1651J94245j18723a76578D1976
18692a89169B71809b9789B25370I2827a81876k50965J48916L6622R200h2190C27177
18680c4714k65716B2453b20890A30841d24119B37883c2856k40560Q9050C8948
18669E176a01582q4043E559J33780j6895d46013J84578B40540q4304p7119j6164
18658F2953c5591F8748J34154l8488g6947m7706f0654j59191g1150k64096A08517
$$ y = [-172213, 209059, 235419, -119790, 371992, -384840, 197489, -92010, -64995, -96844, -265488, -342885, 37354, -145356, 103091, 30898, -231825, 77921, -113275, -62601, -37936, -350784, 90109, -100441, 272912, -152560, -125576, -140247, -118246, -110598, 30070, -171691, 123243, -181186, -121291, -76936, -244165, 145193, -178702, 71651, 265896, 147173, -176578, 41976, -189169, 271809, -29789, 225370, 92827, -181876, -432841, -283925, -247303, -238103, -82190, 327177, -34714, -300430, 22453, -220890, 130841, -424119, 237883, -32856, -273416, -184366, 38948, 5176, -101582, -185625, 5559, 139339, 122444, -446013, -261435, 240540, 156236, 79117, 62953, -35591, 68748, 202902, 164414, -76947, -124653, -60654, -219845, -71150, -335246, 108517]
18646c3740A54917b69669A56079a62951b9226j23200D6547a33188m9430I9163
18635a35622j71315g4196c3964K490j01532j4048j02277J1342J09925k2846K8795
18624a22115c9793I2000j4751Q257f139B01752b90F2721b90657a05166E8624b27438
18611B2114e3055J4412K483j71153b7886o5637n2422p3231C87643D6126d0999
18599G0181a15080h817j54421j30065A44598j2051c13410F7063M5029Q0142f088
18587C6511n10A6455O618c24724I6090k6506J7909N8933B2991C581J47057a71235
18574B25369P3947b63697A70188k1617J1295d15444I5287c16141e8169p4379j41977
18563b74525C4726b70200P1341j3566D2231R2772b1981j86008D3008e5439D37318
$$ y = [-33740, 154917, -269669, 156079, -162951, -29226, -152426, 46547, -133188, -182618, 99163, -135622, -306937, -74196, -33964, -31474, -133006, -147054, -249331, -237989, -128064, -150910, -122115, -39793, 92000, 77249, 85506, -6139, 201752, -290, 62721, -290657, -105166, 58624, -227438, 22114, -53055, -38643, -36160, -207313, -27886, -93523, -145945, -219176, 387643, 46126, -40999, 70181, -115080, -8817, -163238, -293303, 144598, 132547, -313410, 67063, 112092, 192234, -6088, 36511, 36001, 16455, 23073, -324724, 96090, 69584, 87493, 146426, 22991, 3581, 150638, -171235, 225369, 299316, -263697, 170188, 148571, 159866, -415444, 95287, -316141, -58169, -132548, -274525, 34726, -270200, -198859, -212425, 42231, 135003, -21981, -207989, 43008, -55439, 437318]
18551a27682A9826a68566O8334j45324i5060A38965a11534A56984b8179r4811
18541a22990m8809f4270D2492K8313l5191a345k28102A09883a61112A59487b9818
18529a08907A40102b98342A02898J35038e7956F6450a9136I255a50273D5980P539
18518E3519a6591j20432c6518J446l967A08443l341c1835o4519p3024l1085A34785
18505F3003J1677k7139a19693c5504j16429A01518P4331b06035c3113k83315B77664
18493a14323k88377a32467J9015k42463f9855G5465O3332J23710a77195K5617
18483a51578A66015a06131A59075b0444j94947a7226j14224a5568G1153M2108
18473A13261a46123B01753J4503c00426h3129i604m9271p9220A4412O0900c2700
$$ y = [-127682, 19826, -168566, -100232, -245556, -95060, 138965, -111534, 156984, -28179, -122990, -171799, -64270, 42492, 70805, 35614, -1345, -229447, 109883, -161112, 159487, -29818, -108907, 140102, -298342, 102898, 237936, -57956, 66450, -19136, 9255, -150273, 45980, 53519, -16591, -137023, -36518, -35072, -39039, 108443, 105102, -31835, -96354, -169378, -200463, 134785, 63003, 74680, 47541, -119693, -35504, -151933, 101518, 175849, -206035, -33113, -316428, 277664, -114323, -402700, -132467, -113452, -355915, -69855, 75465, 138797, 262507, -177195, -151578, 166015, -106131, 159075, -20444, -215391, -17226, -131450, -15568, 71153, 113261, -146123, 201753, 216256, -300426, -83129, -9604, -58875, -138095, 14412, 75312, -32700]
18461e9520A48370o4830b33813C6079a64891O3870b5773A3676c09712a2380q5874
18450i8254M1771R260j93596A27537d2086I7465f766j5158l11686O0550O7727
18439b05333J9693C5904a72865f6624m4808J951B53108L1699c0181k58244B317
18427c04317A0114P8755B4648K27710a7971K928l32955a11373e3382A35029b14871
18415B10897b17338P2325r5451h5261j65268A57246K3105b04990c8167k7351l33725
18404c99243i8879A50532d7147A9069J96577b8684l03821G3629k9856a51502H9610
18392i825A84520n4396J55573N2961j54212O4407c1957o7007l735H7053P9340
18381A66393b88947J17429E6127M8133a91186L3412K8038G5032d3251p0847I6839
$$ y = [-59520, 148370, 83540, -233813, 36079, -164891, -101021, -25773, 13676, -309712, -12380, -98254, -56483, -47223, -240819, 127537, -42086, 97465, -6766, -21924, -333610, -273060, -205333, -185640, 35904, -172865, -66624, -111432, -109481, 253108, 284807, -30181, -288425, 2317, -304317, 10114, 88869, 24648, 252358, -17971, -15043, -347998, -111373, -53382, 135029, -214871, 210897, -217338, -145013, -240464, -85261, -250529, 157246, 180351, -204990, -38167, -65518, -399243, -98879, 150532, -47147, 19069, 215646, -28684, -332505, 73629, 43773, -151502, 89610, -9825, 184520, 130124, 285697, 338658, 184446, 248853, -31957, -98964, -102699, 87053, 166393, -288947, -171518, 56127, 104260, -191186, -157774, -129736, 75032, -43251, -114098, 96839]
18369b4686n6801c7449A70512R694C4985e7693F4678a9200A49751g533k07059
18358b14592A52799b29943F0224Q6037K1199e5182l22582g6022k08029J07668
18348a76383g7277n9416c7205G9114k3585f7988B98516p0762D0677g8240C3073
18336E7649a69499k32979a73388l0472e3026j97771A04028M02363b11185f7471
18325a11229o9018n9537C0895P5066K29213F4157J70536b6428H091K25628i0762
18313b787C9779K74912A06015c0184l31422a9824j28199G5392J18252H756b54927
18301h2277D3045h8032j109r1106J9742q3288H153d67546d8389m9614A51416a70216
18288b99316h9602A96945a94947j2614L3084P2387j63798Q2168D8479a2941j48049
$$ y = [-24686, -81487, -37449, 170512, 180206, 34985, -57693, 64678, -19200, 149751, -7533, -214592, 152799, -229943, 60224, 146261, 167460, -55182, -377764, -76022, -284051, -176383, -77277, -136693, -37205, 79114, 55529, -67988, 298516, 227754, 40677, -78240, 33073, 57649, -169499, -402478, -173388, -203860, -53026, -250797, 104028, 506391, -211185, -67471, -111229, -180247, -239784, 30895, 105961, 335174, 64157, 234693, -26428, 8091, 233719, -90762, -2787, 39779, 314691, 106015, -30184, -361606, -19824, -148023, 75392, 193644, 8756, -254927, -82277, 43045, -88032, -89141, -180247, -160505, -243793, 8153, -467546, -48389, -98003, 151416, -170216, -299316, -89602, 196945, -194947, -207561, -174477, -102090, -265888, -183720, 48479, -12941, -160990]
18277a60990G6300h9182F2339O0174b76972A39866a41186f7938o3489B3982i657
18265A55714i8869k49721A21115f190C01090J85796e1353A33411D9354M4011g1756
18253E4564b15198H6331g1946A00789i8312A4075c10295g399k08201B48859o6629
18242A82230a87561l2059c0313r5392B0668h2364B2009R0298h5762m9646r8689
18231b34097K8578B09677f1221l7252q9320H5494a43594p4643A1241a52750B82525
18219C9105b42772I2273a10442B15044C0378J14517l6528l286e589j03090E7876
18207a17077j34931C5226N5736b31129H7513J31036A8336R4151O6319c21566B18833
18195B32692e8282C74481a17383A19923a33426j51245B55036I3346J61121L9703
$$ y = [-160990, 76300, -89182, 62339, 122513, -276972, 139866, -141186, -67938, -131427, 23982, -9657, 155714, -98869, -348590, 121115, -6190, 301090, 486886, -51353, 133411, 49354, 93365, -71756, 54564, -215198, 86331, -71946, 100789, -98312, 14075, -310295, -7399, -215600, 248859, 182230, -187561, -219620, -30313, -125705, 20668, -82364, 22009, 112307, -85762, -135408, -234097, -205519, 209677, -61221, -98473, -187793, 85494, -143594, -218237, 11241, -152750, 282525, 39105, -242772, 92273, -110442, 215044, 30378, 144895, 108367, 105081, -5589, -108679, 57876, -117077, -252008, 35226, 90962, -231129, 87513, 218549, 18336, 112487, 178806, -321566, 218833, 232692, -58282, 374481, -117383, 119923, -133426, -284671, 255036, 93346, 254467, 294170]
18185B94170a99002D06038F8339a28514A19939m3480J78973i2100D0129O9087
18175A09216a30584A62274n2355b01698A59758g7917n1244B3655L4307J86426
18165B44388b29604j2296f2022j25208e3903j34113p5753E3809b04116f006k1437
18154b7443j70990R0194A37197c00415J39563P7442A48922g2519D11331d4534
18143A24014l890a46590J1115A01020R7445r2061A7646L8045L23661c8175A57455
18131A77356b04765i7405j93436A50030b26669B49620A0923b67286i1173j70566
18121b61739L5115G7854a44346C00614f1255k3455E3919H784b08776a01508E7050
18109f3915j5203j20850e8215K9032L688j9017r3109j05611a04568m4579m82A26331
$$ y = [294170, -199002, 406038, 68339, -128514, 119939, 76459, 255432, -92100, 40129, 109216, -130584, 162274, 109919, -201698, 159758, -77917, -129161, 23655, 57962, 244388, -229604, -241900, -62022, -187230, -53903, -188016, -263769, 53809, -204116, -6006, -27443, -198433, -108239, 137197, -300415, -160852, -83410, 148922, -72519, 411331, -44534, 124014, 120124, -146590, -135475, 101020, 198465, 106404, 17646, 55691, 379352, -38175, 157455, 177356, -204765, -97405, -290841, 150030, -226669, 249620, 10923, -267286, -91173, -261739, -226624, 77854, -144346, 300614, -61255, -84710, 53919, 8784, -208776, -101508, 57050, -63915, -79118, -199968, -58215, -29183, -25495, -44512, -137621, -243232, -104568, -149147, -149629, 126331]
18096A79540E8697J25638q6554a070n8250A98002d2398D90974e1790A77076a22000
18084f9880A76182b12398k7333E7122a0513A10147B1915h9832m8000C2385J54467
18073A86852f6439G1111d0109J3185A08353j0495K89580a0o2701J2001D9039d55015
18060B27185e9138l39467g6442g061j81582B403O2378K1681b06134c4700A971
18048a39301e1297A31855l8397L1621e50093G2447a35810B17222N0224c11105
18037A5080b69918j03276D4758e191q4868C8395a53188B6151a39430j15111F6903
18025c6966k98000J48864b2528C48461A16356B1208O6262f3197A58247c69715
18014a84319A15530h5785A39641N2099E4824L8874A8313a89213A24095M1401b54448
$$ y = [179540, 58697, 184335, 97781, -1070, -59320, 198002, -42398, 490974, -51790, 177076, -122000, -69880, 176182, -212398, -239731, 57122, -10513, 110147, 21915, -89832, -137832, 32385, 186852, -66439, 71111, -40109, -26924, 108353, 97858, 387438, -10, -62711, -50710, 49039, -455015, 227185, -59138, -398605, -76442, -7061, -188643, 2403, 64781, 86462, -206134, -34700, 1971, -139301, -51297, 131855, 93458, 125079, -550093, 72447, -135810, 217222, 267446, -311105, 15080, -269918, -373194, 44758, -5191, -90059, 38395, -153188, 26151, -139430, -254541, 66903, -36966, -334966, -186102, -22528, 348461, 116356, 21208, 87470, -63197, 158247, -369715, -184319, 115530, -85785, 139641, 191740, 54824, 93698, 18313, -189213, 124095, 165496, -254448]
18002a57889C2157J84456b61066A70507b54456E1929g1286H0821O1387K63522
17992D05730d48799B3321d3991F622K68420b01555Q6443A79649k521J12116C9576
17980E3175j5079L5177J88790C7266j8032R8625a37956A60129p1732c48366A3688
17968e2900F861L4438A6437Q2371a06885H4122R0602B35J21011d26995A2827i8070
17955b68371a13887B77565k1989J59058j56033F6821a62093q2514E4427a08412
17944G0884a24937B5200a06743M2706j47145H7167K48727b63156I4516J64271
17934B58787C517a78879O1038A44526a78755l3651G5677K7844i3087q1147K1934
17923a52300D37937G6289A913L07596A50479A478R2012J21726O0532b62195i7477
$$ y = [-157889, 32157, 216613, -261066, 170507, -254456, 51929, -71286, 80821, 142208, 405730, -448799, 23321, -43991, 6622, 275042, -201555, -115112, 179649, 177128, 289244, 39576, 53175, 38096, 73273, 262063, 37266, 19234, 117859, -137956, 160129, 88397, -348366, 13688, -52900, 6861, 41299, 16437, 98808, -106885, 84122, 174724, 235, 121246, -426995, 12827, -98070, -268371, -113887, 277565, 255576, 414634, 258601, 66821, -162093, -244607, 54427, -108412, 70884, -124937, 25200, -106743, -64037, -211182, 87167, 335894, -263156, 94516, 258787, 3517, -178879, -117841, 144526, -178755, -212406, 75677, 103521, -93087, -174234, -152300, 437937, 76289, 1913, 309509, 150479, 1478, 93490, 215216, 275748, -262195, -97477]
17911c55538J50145N1526e0494F1629a69899j5440A21324b15596J04065M2163
17901f9368D6784a42632D13Q5552j9642C1849J18669R8068L816a70300C7327c05418
17888c99803A44549E0073L3531d5937j58187B59627p0103Q1416b37375H8648a89808
17876d4043D9395Q227Q6573o6402J40288a9432B53892a27744e0416A31511K6391
17865A57902P0505h313A90110p3754k257c18263A8043f528q781n4932j86960b9455
17852D8838J26292o5701C3041a99735I9905M53733a66425C21153B9674K5290M658
17841E9622b09506A98610q4554n5098J98716c23262d3942a3159B60162a96803
17830c33036A30056a11142B49149m6818e8084G3131K49825c36342a54608e1176
$$ y = [-355538, -205393, -153867, -50494, 61629, -169899, -185339, 121324, -215596, -111531, -69368, 46784, -142632, 413, 85965, 66323, 31849, 150518, 248586, 252402, -170300, 37327, -305418, -399803, 144549, 50073, 83604, -45937, -204124, 259627, 189524, 270940, -237375, 88648, -189808, -44043, 49395, 57622, 144195, 77793, 218081, -19432, 253892, -127744, -50416, 131511, 157902, 228407, -8313, 190110, 116356, 114099, -318263, 18043, -6528, -15309, -70241, -257201, -29455, 48838, 175130, 109429, 33041, -199735, 99905, 553638, -166425, 321153, 29674, 54964, 59622, -209506, 198610, 114056, 58958, 257674, -323262, -43942, -13159, 260162, -196803, -333036, 130056, -111142, 249149, 202331, -58084, 73131, 322956, -336342, -154608, -51176]
17819I1099d4217A9686L5403A0799J02181f8378D8545a51697m334E5681d3698
17807e4616A13101c67644J83351j05682a6776D1656J6792Q8250B7039c95942A51381
17795A75681K75899a56018A75895e7140F4941a74188C1105M19859A74013G6400
17784g2476D3778K10963d3254l1636E9702O7259A1140J79654j5760a54117C01119
17772B20100r1285e695A67855f4652k41857B52596b2336A61266b75109i7503A23889
17760A52557k1620O3336q6381a76916b6872J0995A75341g0872E5789J01739R7456
17749B54984D8422J44980m2166m5959a65310I7063a86589E7119J47141F4995L7548
17738A02543c7897a5169l5253A62613k0334a05224B07972L10109f437A45937J4324
$$ y = [91099, -44217, 19686, 55089, 10799, 112980, -68378, 48545, -151697, -156031, 55681, -43698, -54616, 113101, -367644, -184293, -289975, -16776, 41656, 58448, 146698, 27039, -395942, 151381, 175681, 451580, -156018, 175895, -57140, 64941, -174188, 31105, 450964, 174013, 76400, -72476, 43778, 254741, -43254, -74890, 59702, 126961, 11140, 190794, 175034, -154117, 301119, 220100, 128815, -5695, 167855, -64652, -306509, 252596, -22336, 161266, -275109, -97503, 123889, 152557, 130937, 194273, 107892, -176916, -26872, -15877, 175341, -70872, 55789, 157528, 254984, 48422, 193402, 151236, 105277, -165310, 97063, -186589, 57119, 204260, 64995, 102543, -37897, -15169, -50422, 162613, 142279, -105224, 207972, 518081, -6437, 145937, 160261]
17727A60261k6513R2892b07832g4289N509L3554J4399A70547E7061a38227A82578
17715g0767H5377a8322A10708C5570e644k83713I587P0659F647e6382A59383i9355
17702h2309A30399a28093A73143R1072p5433p8696e2935H5125f957A414J29664
17691A31078J3912K4407M5313I68a09146o6822B96721j30585C5573G716J15217
17680A22933J46832H1991L5833j8149J964K45950g6647c5521C39046j00273e5466
17668a90396F6647i6569c9101F3539B3498J48659K4503n3829J22465j31034A5817
17656D814J68831J28434A08119B710b5826C45986l5687m2081H1828M8256J20931
17645B51015L01919b01611H8621b05285B50096C5584J85517R7352C9021L5800
$$ y = [160261, 133748, 226640, -207832, -74289, -68780, -35226, -20827, 170547, 57061, -138227, 182578, -70767, 85377, -18322, 110708, 35570, -5644, -289357, 9587, 80246, 6647, -56382, 159383, -99355, -82309, 130399, -128093, 173143, 264215, 188782, 110086, -52935, 85125, -6957, 1414, 131078, 144990, 169397, 214710, 968, -109146, -175968, 296721, 166136, 35573, 7716, 122933, 269765, 81991, 117824, 99675, 101639, 347589, -76647, -35521, 339046, 238773, -55466, -190396, 66647, -96569, -39101, 63539, 23498, 172157, 196660, 142831, 265296, 134262, 15817, 4814, 173645, 302079, 108119, 2710, -25826, 345986, 310299, 268218, 81828, 130084, 251015, 552934, -201611, 88621, -205285, 250096, 35584, 221101, 318453, 39021, 74821]
17635G4821e6421A47758J11538A6565K39982j18411l2153B5240L5137M1735P0640
17624A72752f2213B5363b56807j34992A53496J47220A43194h4112m2583B18239
17613e2819K0156B43103H561L31526C1954a25186B35437q1630b25522A59609a09855
17601e4321j31420D3431a3037A09281A4714b88290H8237a56715b6271G3174j6193
17590E6981B4459L92944a08873d2326G5080B5724o879M02905k01429H8293K03743
17579B92036q1577r7940Q5178G5262K32886j18663N7732i7305B79314j4570j16701
17568A48043J53208A15402J9113a90836B5697a27487A70575C3182J55459H651
17557C67440I5735b18674B5574J71204e8004A01513P8884j6196K36072A87164
$$ y = [74821, -56421, 147758, 259296, 16565, 256547, 138136, 105983, 25240, 60377, 102112, 172752, -62213, 25363, -256807, -391799, 153496, 300716, 143194, -84112, -126695, 218239, -52819, -32663, 243103, 8561, 340087, 31954, -125186, 235437, 153807, -225522, 159609, -109855, -54321, -185741, 43431, -13037, 109281, 14714, -288290, 88237, -156715, -26271, 73174, 56981, 24459, 417403, -108873, -42326, 75080, 25724, 18845, 421750, 220321, 88293, 292036, 210459, 112519, 197697, 75262, 308148, 189485, 247217, -97305, 279314, 264744, 148043, 301251, 115402, 134515, -190836, 25697, -127487, 170575, 33182, 188641, 8651, 367440, 95735, -218674, 25574, 196778, -58004, 101513, 180397, 164201, 400273, 187164]
17546g414j85049E7786M0565J36901r6723J77737h3589K271A09116J28251J35
17535B37502o1729a0878n1287A57790f0307A98778k6066f0533E21171a21680A41825
17523C35175N1910K08949K07449k51514j45058r0146a46069B74652p3142m1710
17513A59800J88311R6343j09848L4021C9663M29298R5074A80391J91783M89190
17503H61364D00255p7014H6061d0905A75893l9896J20150j06246K11353J8405
17493C79659A57035R1530M4111h5187I0653J47631A6796R4733b31847A63690c7961
17481E05045B38921L38954k52046j08806a86071C61253A58870M7369J86346a00496
17470C45337o7625L6547N3115R3196B1064N7738C2296i8526A79034B8384b4635
$$ y = [-7414, -192463, 57786, 98351, 235252, 138529, 316266, -83589, -81318, 109116, 237367, 237502, 175773, -10878, -62165, 157790, -60307, 198778, 172712, -60533, 521171, -121680, 141825, 335175, 387085, 596034, 803483, 551969, 406911, 316765, -146069, 274652, 201510, 159800, 348111, 444454, 334606, 368627, 39663, 468961, 564035, 180391, 372174, 861364, 400255, 323241, 86061, -40905, 175893, 135997, 256147, 149901, 361254, 379659, 157035, 248565, 292676, -85187, 90653, 238284, 16796, 111529, -231847, 163690, -37961, 505045, 238921, 577875, 325829, 217023, -186071, 361253, 158870, 206239, 392585, -100496, 345337, 277712, 314259, 367374, 460570, 21064, 78802, 32296, -98526, 179034, 28384, -24635]
17458B08091J76596j81685h6337C29422a28556d909A31343J31008J14193A17026
17447C98148H7380L03772J26802A76439K02259J22066j3072A63923k9074K19950
17437C54799A07271Q0311B6125L38601J99791A7200L35172m8128A35583a51434
17426A75476p948O0116l1419J94748J4714j39332K5460D7081M55197A43428L859
17415A47287N5624K19497A45150M9718K03648P7920B0316K98865p2754c17541
17404B81920j26173J51079L5749J30193k20527J89225H0385a48723F2476L28646
17394C91122A25862c5724j51500D16382F2052J29522J37439R532J92212B49301
17383B15441K42460D1454k467J68728J12358k3498a50846E64960r949k28837J17858
$$ y = [208091, 384687, 203002, -86337, 329422, -128556, -4909, 131343, 262351, 376544, 117026, 398148, 87380, 391152, 517954, 176439, 378698, 500764, 487692, 163923, 134849, 354799, 107271, 187582, 26125, 364726, 564517, 17200, 352372, 304244, 135583, -151434, 175476, 167528, 227644, 196225, 390973, 405687, 266355, 291815, 47081, 502278, 143428, 147287, 202911, 422408, 145150, 194868, 398516, 476436, 20316, 319181, 246427, -317541, 281920, 155747, 306826, 342575, 472768, 252241, 441466, 80385, -148723, 62476, 391122, 125862, -35724, -187224, 416382, 62052, 191574, 329013, 338545, 530757, 249301, 215441, 457901, 41454, 38987, 207715, 320073, 296575, -150846, 564960, 555011, 326174, 444032]
17372D44032A73534E0647K63895m9013a0832C84718a26934A37704J54646n7001
17362B35349d7572B35025c3533A72237E737K35530J85493o9526J7499q6694Q7639
17351C75678j87301J29175F5087J92410D3517K58710L1031L13399j78672B01443
17340B22429r9966k0978C5531J96616a6696D62141j41942I786J93285G4518K54432
17329C28950j48070J01598g4899C42786J13343j74377c7130C5145J90811j938
17319B24018M36395k92322A71582p2544J15880K49830A69622L50091d7923f256
17308a85694B20247p7494K7628J72763O0990l6483K52575B97292k3131n274Q7740
17297C56627j21153k4160m4632L10940B37857A05493L84344A01015N4154O2951
$$ y = [444032, 173534, 50647, 314542, 265529, -10832, 384718, -126934, 137704, 292350, 235349, -47572, 235025, -33533, 172237, 5737, 241267, 426760, 357234, 374733, 288039, 375678, 188377, 317552, 65087, 257497, 43517, 302227, 333258, 646657, 467985, 201443, 222429, 122463, 101485, 35531, 232147, -16696, 462141, 320199, 9786, 203071, 74518, 328950, 180880, 282478, -74899, 342786, 456129, 281752, -37130, 35145, 225956, 224018, 660413, 368091, 171582, 99038, 214918, 464748, 169622, 519713, -47923, -6256, -185694, 220247, 142753, 170381, 343144, 404134, 367651, 620226, 297292, 274161, 268887, 356627, 235474, 211314, 166682, 477622, 237857, 105493, 489837, 101015, 155169, 218120]
17287B18120Q5780j40142M27861k22810I6544J34727K6330M2452M4785n2611G238
17275A99016K7266o5042J34114J33105g0409C37619b8428A85704l9982A2373K42763
17264B55136D9256L445L53094q0941j44602K31135f0357C04643J60021G7557Q6862
17253A64419K29133p1428j3667n4164A05438J5070K99773A26993L68245C3476
17242A37795R0489J3470J51657J02371B19242J14766P8478j45576b1965D21971
17231C13592j13915J91474j14917K75708j36959j8617j25051K9414J12175j19101
17221B93803j08918L53300B30728B9696J73507r3094j900L21847p9363K11437
17211E62130j23727J44805g6826C25186Q1584K46527B18843L02236k38776R0702
$$ y = [218120, 303900, 163758, 591619, 368809, 96544, 231271, 257601, 300053, 344838, 292227, 7238, 199016, 226282, 161240, 295354, 428459, -70409, 337619, -28428, 185704, 145722, 12373, 255136, 49256, 52701, 405795, 324854, 180252, 411387, -60357, 304643, 464664, 77557, 164419, 393552, 322124, 308457, 254293, 105438, 120508, 420281, 126993, 495238, 33476, 137795, 228284, 241754, 393411, 495782, 219242, 334008, 412486, 266910, -21965, 421971, 313592, 199677, 391151, 276234, 551942, 414983, 396366, 271315, 300729, 412904, 293803, 184885, 538185, 230728, 29696, 203203, 110109, 108209, 430056, 350693, 562130, 438403, 583208, -76826, 325186, 406770, 653297, 218843, 521079, 282303, 373005]
17201C73005J68272B48604M2444A23226L75553j06651Q340j08336I4566L56205
17191D50771k2520m279A82457M96710C01650A11999K21642J64772A43873L93217
17181E37090n8919j42497K93542j4571o6805A12660K92140A31105N71939C39390
17170E85188j00392L4550L1955k00383O7297j82750K10379j38669J75438j81166
17160C01447M61840B98806J67161N3006j9377L4053k51566L12478J17582j77465
17150E34678J18750j79489j25341p4471N21377C41478n7333K60891q482k50434
17140B86120N6036R2144R0125R7245k75305o757L21949F9468N77769k73668j36753
17129B36816J18110M07964k52391K67155k03759A29126K72072J62573k08473K7254
$$ y = [373005, 541277, 248604, 291048, 123226, 498779, 392128, 400468, 292132, 94566, 450771, 428251, 423972, 182457, 679167, 301650, 111999, 333641, 498413, 143873, 537090, 478171, 335674, 629216, 614645, 547840, 112660, 404800, 131105, 703044, 339390, 585188, 484796, 519346, 551301, 350918, 418215, 235465, 445844, 307175, 482613, 301447, 763287, 298806, 465967, 518973, 499596, 533649, 282083, 594561, 712143, 534678, 653428, 473939, 348598, 274127, 795504, 341478, 284145, 545036, 536554, 286120, 342156, 434300, 524425, 621670, 346365, 339608, 661557, 69468, 647237, 373569, 236816, 354926, 762890, 510499, 777654, 573895, 129126, 401198, 563771, 355298, 382552]
17119C82552J08484B30692M00506l5205K57172k79948Q514j03810J07668j09402
17109D76187k4541J04381K88992j78474k61877M31423p9874B34433N96129B40826
17098G53349j97075N31574l80426k090J92272l25478J25143Q8022C51711K83954
17088F35665k6325M5919j7594p177l8930N6775O054Q7743K99671k68811K94670
17077A067660j47927k49537k69974N40088j12086j60982K61280m30755M04529
17068I02296m1918j91859J81707j29090K14254r873j85748M1516l07990K79189
17058G52484m6732j09465P7843j55865L31515N59074l83952J01402k37400k22606
17048F66298n3514o0063L34656r3856J65843J17277r4892j41362K68098j95929
$$ y = [382552, 491036, 230692, 631198, 595993, 853165, 573217, 581731, 477921, 585589, 476187, 451646, 556027, 845019, 666545, 404668, 836091, 756217, 234433, 830562, 240826, 753349, 556274, 1087848, 707422, 705332, 897604, 572126, 697269, 785291, 351711, 635665, 609340, 655259, 637665, 630488, 591558, 648333, 654387, 742130, 1041801, 772990, 1067660, 919733, 670196, 400222, 940310, 828224, 667242, 928522, 497767, 902296, 860378, 668519, 850226, 721136, 935390, 925517, 739769, 781285, 473295, 752484, 705752, 596287, 674130, 518265, 849780, 1408854, 1024902, 1126304, 888904, 666298, 612784, 552721, 887377, 793521, 959364, 1076641, 981749, 840387, 1108485, 912556]
17038I12556J25913j54210j10825J87743j26512r1663L87530p0216j40160J32141
17028A052297m91573M76397k01877J45282K43667M03221o11646L8900l16476L44073
17018A082265j28939j00417L63391j30489j30924j08879j73119P46491j13971
17009A305409n00072M63757K50271m17554j88168K70524p0874j23062Q6597J11218
16999A188046l2116j03324O457J57050l09902O60119n85547K99288j3463j70082
16989A096526J89150j12352N23867k12744O4777k0795j37430Q4950j00477K20182
16979A595654l44283J44214J36205k23785K73272j89970O812K03781k20370J37939
16969A519469R4939J87225j43096J39478j10404p0719K7207L66608k26136l74892
$$ y = [912556, 1038469, 884259, 773434, 961177, 834665, 743002, 1130532, 1060316, 920156, 1052297, 560724, 1037121, 835244, 980526, 1224193, 1627414, 1015768, 1054668, 738192, 1082265, 953326, 852909, 1216300, 1085811, 954887, 846008, 672889, 1419380, 1305409, 805337, 1269094, 1519365, 1101811, 913643, 1184167, 1113293, 990231, 1076828, 1188046, 1155930, 1052606, 1059063, 1216113, 906211, 1566330, 980783, 1280071, 1266608, 1096526, 1285676, 1173324, 1697191, 1484447, 1549224, 1528429, 1390999, 1475949, 1375472, 1595654, 1251371, 1395585, 1531790, 1308005, 1581277, 1391307, 1398119, 1601900, 1381530, 1519469, 1614408, 1801633, 1658537, 1798015, 1687611, 1616892, 1644099, 2010707, 1784571, 1409679]
16959A409679Q9540M80143k41198m25621M78419m6634o3066O0598K61635j13137
16949A890358K5958r3092J41922J87931j35343j22893J31018j53122J46168l339
16939B015566Q0821j83749K05081N2804j92983K93984J60623j05073q7652l2655
16929B206767L46633n65856N82437k46938J12402J9337J38097j01445K31550l2879
16919B690105m19007O09771l0375o33819J94710K82595K84174k95486K22649p0422
16909B834895j31018L38210k5346k02775N14064P3309l22922Q2352L6541P6988
16899C274298M99665l73190k37062L95450K77614l56489L22514j2725q3775M8903
16889C755203r8289L84949N2317k11193M33716l44189J15415K92998k40498J09836
$$ y = [1409679, 1499219, 1979362, 1738164, 1312543, 1790962, 1744328, 1681262, 1741860, 2003495, 1890358, 1916316, 1823224, 1965146, 2153077, 2017734, 1894841, 2025859, 1872737, 2018905, 2015566, 2096387, 1912638, 2117719, 2170523, 1977540, 2271524, 2432147, 2327074, 2239422, 2206767, 2553400, 1987544, 2569981, 2323043, 2435445, 2454782, 2592879, 2491434, 2722984, 2690105, 2271098, 2880869, 2850494, 2216675, 2411385, 2693980, 2978154, 2682668, 2905317, 2834895, 2703877, 3042087, 3016741, 2813966, 3328030, 3401339, 3078417, 3160769, 3197310, 3274298, 3773963, 3400773, 3163711, 3559161, 3836775, 3480286, 3802800, 3790075, 3706300, 3755203, 3656914, 4041863, 4094180, 3882987, 4316703, 3972514, 4087929, 4380927, 4140429, 4250265]
16879D250265J11566Q805O547L82867m09764N37705j58856K39515J6878j64006
16869D821522J37185M8070m311J74142K9888K6327L02120o5590L7620O003Q6455
16858E599431Q4562K17601K21526L79152k30833m2403J35545r3197K62597K34774
16848F768755l26994R34654k16572j05818N98471n5955j5344L85157k36298N59492
16838H289548l76538N48837J13595O3430J1092N50268j90238M88876L17785j15430
16828I701225K76651L24622J42608O8483M06576j0535J83288M97263n3516M80388
16818A2017053K84824N6567O34558k05897M82374L49380N05310M51561K817L09026
16808A4887573L97738p3747P45803K91233L05997O97237P79245J36033M51864
$$ y = [4250265, 4361831, 4370636, 4377183, 4760050, 4350286, 4887991, 4729135, 4968650, 4985528, 4821522, 4958707, 5006777, 5002466, 5176608, 5206496, 5232823, 5534943, 5469353, 5506973, 5512976, 5599431, 5683993, 5901594, 6123120, 6502272, 6271439, 6229036, 6364581, 6271384, 6533981, 6768755, 6441761, 7376415, 7159843, 7054025, 7652496, 7596541, 7581197, 7966354, 7730056, 8289548, 7913010, 8461847, 8575442, 8638872, 8649964, 9200232, 9009994, 9498870, 9816655, 9701225, 9977876, 10302498, 10445106, 10513589, 10920165, 10909630, 11092918, 11590181, 11536665, 12017053, 12301877, 12358444, 12993002, 12787105, 13269479, 13618859, 14124169, 14575730, 14578547, 14887573, 15285311, 15211564, 15957367, 16248600, 16554597, 17251834, 18031079, 18167112, 18618976]
16799A8618976L64063M40090L34764P97981N80446N39674N81234N84665O44573
16790B3486466P6887R34913J034752N05751J064244L83184Q56305Q19093R55454
16781C0117049Q09908J052004N42473J314489R25349J430437Q10267J217821J240709
16772C9460506J001734J526367J286512J404085J309723J444519J792225J214892
16764E0440563K029994J361044J732681J466655J931554J977050J846841K041627
16756F4828009K036444J722570J861020K404976J953465K297218J906511J953301
16748H0963514K367364J992824K118920J737037J992908J621847K068789J363643
16740I6226846J411069J612829J245754J291432N75096Q85962M86731L38464J17377
$$ y = [18618976, 18983039, 19423129, 19757893, 20555874, 21136320, 21675994, 22257228, 22841893, 23486466, 23563353, 24498266, 25533018, 26038769, 27103013, 27486197, 28342502, 29161595, 30117049, 30926957, 31978961, 32521434, 33835923, 34761272, 36191709, 37001976, 38219797, 39460506, 40462240, 41988607, 43275119, 44679204, 45988927, 47433446, 49225671, 50440563, 52470557, 53831601, 55564282, 57030937, 58962491, 60939541, 62786382, 64828009, 66864453, 68587023, 70448043, 72853019, 74806484, 77103702, 79010213, 80963514, 83330878, 85323702, 87442622, 89179659, 91172567, 92794414, 94863203, 96226846, 97637915, 99250744, 100496498, 101787930, 102363026, 103248988, 103735719, 104074183, 104191560]
16731A04191560j78283J37841l10792q70057o25466p98520j339848q60486j818892
16722I7527057j381934j750884j625381j631025k091700j823887j603501k308565
16714H3310180k063065k192993j794744j832765k132359j968166k155500j888145
16706F7282443j848182k085796j552055k094513j510312j787721j542897j685419
16698E3175548j260339j640253j359247j776790j538768q41768j192181j492015
16690D2074187j421979j016707r65251j212364r09968r99728r10592j225679o81204
16681C2730715r11895p86708q04788p74724p46865q10477p30460r48473n73929
16672B5642396k61787q24663o69494k97326j005652k15443q18669j55861p48426
$$ y = [104191560, 104013277, 104151118, 103840326, 102970269, 102344803, 101546283, 100206435, 99345949, 97527057, 96145123, 94394239, 92768858, 91137833, 89046133, 87222246, 85618745, 83310180, 81247115, 79054122, 77259378, 75426613, 73294254, 71326088, 69170588, 67282443, 65434261, 63348465, 61796410, 59701897, 58191585, 56403864, 54860967, 53175548, 51915209, 50274956, 48915709, 47138919, 45600151, 44758383, 43566202, 42074187, 40652208, 39635501, 38670250, 37457886, 36547918, 35548190, 34637598, 33411919, 32730715, 31818820, 31032112, 30227324, 29452600, 28705735, 27895258, 27164798, 26216325, 25642396, 25380609, 24555946, 23886452, 23589126, 22583474, 22368031, 21549362, 21393501, 20645075]
16663B0645075l56722k57717n04245o03609j39536o91960l16211k29686q41987
16654A6703402K20693o22126o52054J81900m88875m00481k39667l53180r1619
16645A4257993j70661j55312o49247M2002p18097L98591l88629m03780k46639
16636A1966221j92921j0863m54395k55098J76132n28913J26374k31810j81118
16627A0413609k79520l40669j6174K51348m02084k18866k50197j89465p2985P9338
16617H974335k12266j51105J1014m8560l05550M9011k77340m24727R2460J83972
16607G891244m57677Q0435k17037j8603k09802j5114l4207j39604j90461k57651
16597F431523K33374k25149j54442K83185k25873k56685j84737L75620l89457
$$ y = [20645075, 20288353, 20030636, 19526391, 18922782, 18783246, 18091286, 17775075, 17545389, 16703402, 16924095, 16301969, 15649915, 15831815, 15342940, 14942459, 14702792, 14349612, 14257993, 14087332, 13932020, 13282773, 13324775, 12606678, 13005269, 12616640, 12212860, 11966221, 11773300, 11762437, 11308042, 11052944, 11229076, 10700163, 10826537, 10594727, 10413609, 10134089, 9793420, 9777246, 10028594, 9626510, 9407644, 9157447, 8967982, 8894997, 8974335, 8762069, 8610964, 8621978, 8573418, 8267868, 8316879, 8039539, 7614812, 7707272, 7891244, 7433567, 7514002, 7296965, 7278362, 7068560, 7053446, 7019239, 6879635, 6689174, 6431523, 6664897, 6439748, 6285306, 6568491, 6342618, 6085933, 5901196, 6276816, 5887359]
16588E887359K79754J5854l12130k62823j12825o2272J34103k77861j95722O0613
16578E154050J43774l90739L28412q3830k81601k12815O2542N7647J48515j45163
16568D780792r3694k04899J12405m0376o8630L7180J74097m02235K33169j63245
16558D364564L6672l52646M39168m33434R3230j14206n9559Q8064j59315k28617
16548C673921J32695k51076K35735j35111K90553j01147k22914K63426m91821
16539C394261P20066o75250J65195K09639m31530q581j59062q1062J31448J27066
16529C392190J9536M6196l73714j19822J24502j06716K19731j46744p6955m6336
16519B931868M8707l77520L62065K32648q2330j98687k53307L01253l24027j5446
$$ y = [5887359, 6167113, 6182967, 5870837, 5608014, 5495189, 5432917, 5567020, 5289159, 5093437, 5154050, 5297824, 4907085, 5235497, 5151667, 4870066, 4657251, 4719793, 4777440, 4925955, 4780792, 4687098, 4482199, 4594604, 4554228, 4485598, 4522778, 4696875, 4294640, 4527809, 4364564, 4401236, 4048590, 4487758, 4054324, 4147554, 4033348, 3973789, 4061853, 3902538, 3673921, 3806616, 3555540, 3791275, 3656164, 3946717, 3845570, 3622656, 3886082, 3394261, 4114327, 3439077, 3604272, 3813911, 3382381, 3373800, 3214738, 3133676, 3265124, 3392190, 3411726, 3457922, 3084208, 2964386, 3088888, 2982172, 3201903, 3055159, 2978204, 2931868, 2980575, 2603055, 2965120, 3197768, 3115438, 2916751, 2663444, 2964697, 2640670, 2625224]
16509B625224K04378m18571O74092j53270k95422m8339M8787j02393o9833L38785
16499B803438m42846M67147l54198Q9824p9273p8692L5429K49466m10243L06641
16489B586693O0698l97524J88156k33443J02873R9717k59494K74673m8086o831
16479B367432P4310j70524J16871O8791m05663J13928K11268k07181K04293k21092
16469B152433J3750j13875k63538L7977M80553l46564J24402n4155k7135l010
16459B000838Q8486o6595j75167L21098M2387m19875K58088k58120K68805R9472
16449B159417O4513k45279K33545k503k34387j58537J28786l535k39165K91069
16439A993924j86453L03114o12379K12431m9254K00369k9719l27744K14494l46169
$$ y = [2625224, 2829602, 2411031, 3085123, 2931853, 2636431, 2588092, 2636879, 2534486, 2464653, 2803438, 2360592, 2827739, 2473541, 2563365, 2484092, 2405400, 2440829, 2690295, 2280052, 2586693, 2647391, 2249867, 2438023, 2204580, 2307453, 2407170, 2147676, 2422349, 2374263, 2367432, 2441742, 2271218, 2388089, 2456880, 2051217, 2165145, 2376413, 2169232, 2373525, 2152433, 2166183, 2052308, 1788770, 1826747, 2307300, 1960736, 2085138, 2030983, 2003848, 2000838, 2089324, 2022729, 1847562, 2168660, 2211047, 1791172, 2049260, 1791140, 2059945, 2159417, 2223930, 1978651, 2212196, 2209693, 1975306, 1816769, 1945555, 1942020, 1702855, 1993924, 1807471, 2110585, 1498206, 1710637, 1661383, 1861752, 1832033, 1504289, 1718783, 1372614]
16429A372614N0764M00422l8747l94010K90086J5797O5067J47805k59992l20109
16419A329697K70527m9568l513k5496O061R6818M47049m96184J5859p4772N0647
16408A567125j64205J18315M3194J79848k0242k51199L17466j17271k03760J53466
16398A622737k80057k78607P10087m47844K7816M06433l38153k8934n2534L5810
16388A376754J40809J25689j74715K54649m83829K42413r1446J54691k63274J52392
16378A434133k03963j14392L63413k28173J18076j04622J60842P3981l17389J54119
16368A336025l696k37320J91403m4003P6822j19284K45946l57826L91394m17789
16358A061672l721j62504L24481J68810k96372N12221l29466j66428Q2341J40426
$$ y = [1372614, 1423378, 1823800, 1785053, 1391043, 1681129, 1696926, 1761993, 1909798, 1649806, 1329697, 1600224, 1550656, 1547143, 1521647, 1527708, 1624526, 2071575, 1575391, 1591250, 1516478, 1567125, 1402920, 1521235, 1564429, 1744277, 1724035, 1472836, 1790302, 1673031, 1469271, 1622737, 1342680, 1064073, 1774160, 1326316, 1354132, 1760565, 1422412, 1393478, 1340944, 1376754, 1517563, 1643252, 1468537, 1723186, 1239357, 1481770, 1390324, 1545015, 1281741, 1434133, 1230170, 1115778, 1479191, 1251018, 1369094, 1264472, 1425314, 1499295, 1181906, 1336025, 1332329, 1095009, 1286412, 1242409, 1319231, 1199947, 1445893, 1088067, 1479461, 1061672, 1057951, 895447, 1219928, 1388738, 1092366, 1604587, 1275121, 1108693, 1191034, 1331460]
16348A331460J64514n08369Q3253j6685j36001k32985M17301O1711k6239M5065
16338A183025q2770m8589k98851K45107L76225j4464r9519j35309l3038J1425
16328A103242k8405J44700K9078k24721K3233R4848j70858O2597k66521l20J85475
16317I52348J88215k01558o0943N70248k98347l54202J43917K4128L27126m69713
16307H21219J60581J74732k28551q7364Q0441j35953K15069L697J58444j9160
16297A143155r1581m1603k2954M5049L9232l17542K56047K2870m94567M66437
16287A004543r9487J25485j24660O5812k8684j76198Q9404O0203j46320L67007
16277A137105E24060K00532J26983M1704k74241J041j8685N49222q4514j68800
$$ y = [1331460, 1495974, 987605, 1070858, 1054173, 918172, 685187, 1102488, 1164199, 1137960, 1183025, 1100255, 1051666, 752815, 997922, 1374147, 1359683, 1260164, 1124855, 1091817, 1103242, 1074837, 1219537, 1248615, 1023894, 1047127, 1141975, 971117, 1033714, 767193, 766873, 952348, 1140563, 939005, 878062, 1448310, 1149963, 795761, 939678, 963806, 1290932, 821219, 981800, 1156532, 927981, 840617, 921058, 785105, 1000174, 1003871, 1162315, 1143155, 1051574, 1009971, 987017, 1032066, 1071298, 753756, 1009803, 1032673, 538106, 1004543, 905056, 1030541, 905881, 971693, 943009, 766811, 856215, 916418, 770098, 1137105, 524060, 724592, 851575, 893279, 619038, 620079, 601394, 1150616, 1066102, 897302]
16267H97302j25303l20635M05355P458J85406m16420j68480K09087P6279l4292
16257G15757N9562N3878K25895n07882K94383j72434K06696q2960K5445j95995
16247F22345n0756o8179K67849o8345L220j8927J8980j85422j11309K47237l4740
16236F21953J53265J13146j17251l81761J15520J27056K28838k40688K26688r0082
16226G56684J18466J70851k73013J10063k72732K47428l58026Q2085J23685J24708
16216H30199l42539J91460r5508Q0856C02837K44905N3576M5085O4245J779K01427
16205I13854k80157N5423k4490j52027K96129p7168o3690R3723j43268R5197j29169
16194E84357B86406M83229k22919J01667N1460j78084K09278P6583l67023K00483
$$ y = [897302, 771999, 451364, 856719, 864177, 1049583, 633163, 464683, 673770, 750049, 715757, 775319, 829197, 1055092, 547210, 841593, 669159, 875855, 792895, 818340, 622345, 571589, 503410, 771259, 702914, 706134, 687207, 706187, 520765, 409456, 656693, 621953, 775218, 888364, 771113, 389352, 504872, 631928, 860766, 620078, 846766, 756684, 875150, 1046001, 772988, 883051, 610319, 857747, 499721, 581806, 705491, 830199, 487660, 679120, 583612, 664468, 302837, 547742, 601318, 646403, 710648, 712427, 913854, 633697, 689120, 664630, 512603, 808732, 731564, 667874, 761597, 618329, 713526, 584357, 286406, 769635, 546716, 648383, 699843, 521759, 731037, 807620, 440597, 641080]
16184F41080J20488k56807p8030K64548R5593J10275l41119B62948N2711J91952
16174E07611j34266L5993K17580k80009C8658P6506M10292A70694N76398j39180
16164F07912k78o4550k01041L62616k59123B13851K57468A67622M11564A84554
16153D31088J34424j37158j93844M44293l11809P7517j15746K78580k36239K49593
16143F20699B32004n0882J5626L1345K50748J88887C28334J69706j56475J94680
16133E36245J05626B76316L24388B44168L29464B20500K58311r9590K00510B26156
16122B85496J33269j81583Q5719l7849A38970h1049B53407J5270L06582B86573
16111B96072G9708J43471J80528N3909a20691a0903C57989M9464A12465J30674
$$ y = [641080, 761568, 504761, 426731, 691279, 786872, 897147, 556028, 262948, 315659, 507611, 373345, 409338, 626918, 346909, 38658, 115164, 525456, 170694, 747092, 607912, 607634, 543084, 342043, 704659, 445536, 213851, 471319, 167622, 579186, 184554, 431088, 565512, 428354, 234510, 678803, 366994, 444511, 328765, 607345, 371106, 620699, 232004, 181122, 196748, 228093, 478841, 667728, 328334, 498040, 341565, 536245, 641871, 276316, 600704, 244168, 573632, 220500, 478811, 379221, 579731, 226156, 285496, 418765, 237182, 322901, 285052, 138970, -81049, 253407, 268677, 575259, 286573, 296072, 79708, 223179, 403707, 457616, -120691, -10903, 357989, 407453, 112465, 243139]
16101B43139j6818O219B7895B932K56683o914p7991K02228A68454K46831K90275
16090G05560C45455l4917r7571J30897j66306K1779R7414q4114Q8O657B8010J43601
16078A71611i1957A04826M1037K23112j00270K13047B01605p1281a09055C94195
16067C34140r5867J35151A73154J11101J39025F0938M02213j11220p000c2401
16056E11081k55373o2812J27637A44556J06523l3659k5038J81954E2408L24703
16046C77111A39466L69029j57553A21372a5836E49076H8576a14094N0798E90316
16035A81245G7699k0922J67035j3620K4045e7585C21838E9506J74928J18117J78403
16024E30954j11848J8265A4535a19360D42115a75010A29999L32922A56487Q9847
$$ y = [243139, 226321, 232540, 27895, 2932, 259615, 252701, 174710, 376938, 168454, 415285, 705560, 345455, 310538, 212967, 343864, 177558, 199337, 296751, 212637, 212725, 219382, 28010, 171611, -91957, 104826, 145863, 368975, 268705, 481752, 201605, 130324, -109055, 394195, 334140, 238273, 373424, 173154, 284255, 423280, 60938, 463151, 351931, 344931, -32401, 511081, 255708, 192896, 320533, 144556, 251079, 217420, 192382, 374336, 52408, 377111, 139466, 508495, 350942, 121372, -15836, 549076, 88576, -114094, -63296, 590316, 181245, 77699, 56777, 223812, 210192, 234237, -57585, 321838, 59506, 234434, 352551, 530954, 419106, 437371, 14535, -119360, 442115, -175010, 129999, 462921, 156487, 246334]
16014B46334A03321a26552B09027L97907c1061E151J91042f061p8150A72188J2785
16003A84973E4420K42285G3986M2011k7612B7445J37867M18789A3242b0595C87719
15991B806J20918N10987E2272M29214l3250N21571k29301C49077M07139l61124
15981C95092j137j12179F7283J09289J45555a71629N8470A73817J79764l2252
15971C21329A9324K71402A25702L4659O3405a45069E6136R9253J63129F5965a07710
15959B09786a14771p1002B36379f846j99323G2254J42293F5630O4910b33236f8375
15947C65248A21917b82598J057E2544J23431l4356J18153G6584N0037M1975b66228
15935I9513K6376m2429l9361a08792A35941K50640H5229l7234a57455A79979N7468
$$ y = [246334, 103321, -126552, 209027, 606934, -31061, 5151, 196193, -6061, -84211, 172188, 184973, 54420, 296705, 73986, 115997, 88385, 27445, 165312, 584101, 13242, -20595, 387719, 2806, 123724, 634711, 52272, 481486, 448236, 969807, 740506, 349077, 756216, 395092, 393955, 281776, 67283, 176572, 322127, -171629, -113159, 173817, 353581, 321329, 19324, 290726, 125702, 160361, 223766, -145069, 56136, 155389, 318518, 65965, -107710, 209786, -114771, -185773, 236379, -6846, -206169, 72254, 214547, 65630, 130540, -233236, -68375, 365248, 121917, -282598, -281541, 52544, 175975, 141619, 259772, 76584, 126621, 168596, -266228, 99513, 125889, 83460, 44099, -108792, 135941, 386581, 85229, 47995, -157455, 179979, 237447]
15924B37447b10180h4094C18904c2874k02410q1385A70859N2690a51l18062A62042
15912g6785A49426c6630j01521M7401j9214A54625a01198A22192J44075A08012
15901B67570a24132j36499C74526h5991A92637b42159G2448a07257o8015j04958
15891b80230A4066R6117e3329k7295k24748A81940E3533Q5394E5172R5473n2155
15880I8490L0001k1718m4646A9715N5893M2038E3857L24836F4282J645J43256
15869B09183Q685a22328A99138H0745D763c27658I5137N6013a00421a5285C0128
15857A9294J96041n8637A3898K5249J35277a05626B58004q7345j1403b2579p9153
15846a01732j58631C82212b8424A30209m339b6920C5991M0926c10784m4892g7684
$$ y = [237447, -210180, -84094, 318904, -32874, -235284, -316669, 170859, 223549, -151, -318213, 162042, -76785, 149426, -36630, -138151, -90750, -109964, 154625, -101198, 122192, 266267, 108012, 267570, -124132, -260631, 374526, -85991, 192637, -242159, 72448, -107257, -175272, -280230, 14066, 110183, -53329, -80624, -305372, 181940, 53533, 138927, 55172, 150645, 98490, 128491, 106773, 62127, 19715, 75608, 117646, 53857, 378693, 64282, 65927, 209183, 217868, -122328, 199138, 80745, 4763, -327658, 95137, 151150, -100421, -15285, 30128, 19294, 215335, 156698, 13898, 39147, 174424, -105626, 258004, 170659, 159256, -22579, -101732, -260363, 382212, -28424, 130209, 125870, -26920, 35991, 76917, -310784, -355676, -77684]
15834C37024j07076f8365A56611g8822j15793B44350b44523G6818b92770A77120
15823e0042J0002G2171c1317E9363d4878p397F9735J86259E3235a06990c127A94655
15810B11774a30869A3575c19944d1585j2410Q87B37668q6612b25918M7200f4139
15798f439B7350J56994o0738J87956F7802K162K27684a97637A46692d0344a3857
15786a61246B00139a05752C2671n604P609a43530B27495d3580o8451j21705A89661
15774I9440d24505A22823a87188H6669f3670G1167G493K63017g5238b423A30529
15762B3141f6628j36855c9867l2970l9760H1723J23456M7580J05900a05882A01722
15750E6082b08466C5025a54286N5000H4117a38184C68087h5730c252A8757L4367
$$ y = [337024, 229948, -68365, 156611, -78822, -194615, 244350, -244523, 76818, -292770, 177120, -50042, -40040, 72171, -31317, 59363, -44878, -52275, 69735, 255994, 53235, -106990, -3127, 194655, 211774, -130869, 13575, -319944, -41585, -53995, -53108, 237668, 151056, -225918, -178718, -64139, -6439, 27350, 184344, 123606, 311562, 67802, 69964, 297648, -197637, 146692, -40344, -13857, -161246, 200139, -105752, 32671, 27067, 34676, -143530, 227495, -43580, -112031, -233736, 189661, 99440, -424505, 122823, -187188, 86669, -63670, 71167, 7493, 270510, -75238, -2423, 130529, 23141, -66628, -203483, -39867, -72837, -112597, 81723, 205179, 252759, 358659, -105882, 101722, 56082, -208466, 35025, -154286, -99286, 84117, -138184, 368087, -85730, -3252, 18757, 53124]
15739E3124p466J04061N6953c24219F4818o425J1073h6697k44970A70006F2864
15727g0269F5627p048a07709B07807E2946c16005c7794n2924k92062C64607e1034
15715b05232A34371J1236a68992A70606I055h137D87O5980l0064j4705a34784
15703c4984A9419c44677a20058A90962a02579A99788d35443H0328B5518g6262
15692B18162b66258H088J01887h5944b8088C56545A8179K1333b10179d8829B7072
15680h2194F0364a32807m0897D2086b37428c6456n4127m9492b4157B92547c4653
15668A11738c2947C00793b22037l3485A24514C4909c4172l99927a20945M6944
15658g4001a6725C54531g2984j36573R6598k8647k60058B44327m5396a17760B71760
$$ y = [53124, 45658, 149719, 206672, -324219, 64818, 58393, 69466, -86697, -331667, 170006, 62864, -70269, 65627, 58579, -107709, 207807, 52946, -316005, -37794, -90718, -382780, 364607, -51034, -205232, 134371, 145607, -168992, 170606, 9055, -8137, 487, 66467, 36403, 21698, -134784, -34984, 19419, -344677, -120058, 190962, -102579, 199788, -435443, 80328, 25518, -76262, 218162, -266258, 8088, 109975, -85944, -28088, 356545, 18179, 39512, -210179, -48829, 27072, -82194, 60364, -132807, -173704, 42086, -237428, -36456, -90583, -140075, -24157, 292547, -34653, 111738, -32947, 300793, -222037, -255522, 124514, 34909, -34172, -434099, -120945, -74001, -16725, 354531, -72984, -209557, -112959, -141606, -401664, 244327, 198931, -117760, 271760]
15646A03059c8340C2630N5466A7368L02050c26304J38142e5734k73388B8346P9258
15635A07604P0216i8903d1870A8711K44269b59829J02325l3301F7439K05683b0794
15623d1043m6672m4275p0282A77799b85545A33389o2570Q0928N7258a17726A82628
15611b88586H9522A7700b9726j82602F8997h2628f306p8642c5831A98033o459
15600A91574g4538l5422k0792k2388j30248i173q5633A36a3926q9488c1597n8585
15588i0182j15157B15025J93908E1995J78437a39648F2787j5345d06171J38177
15578b67994d3803q6314O4271D6182a41583N3299A18297a13874F8894d3167j04425
15567a47592k13441a13707A31720f9899B87588j21641a9026A88061c0759p2784
$$ y = [103059, -38340, 32630, 88096, 17368, 319418, -326304, -188162, -55734, -329122, 28346, 107604, 177820, -98903, -41870, 18711, 262980, -259829, -157504, -190805, 67439, 273122, -20794, -41043, -87715, -131990, -202272, 177799, -285545, 133389, 70819, 151747, 209005, -117726, 182628, -288586, 89522, 17700, -29726, -212328, 68997, -82628, -6306, -84948, -35831, 198033, 191574, -74538, -109960, -130752, -153140, -283388, -9173, -94806, 136, -13926, -103414, -31597, -90182, -205339, 215025, 408933, 51995, 230432, -139648, 62787, 47442, -406171, -267994, -43803, -130117, -65846, 46182, -141583, -88284, 118297, -113874, 68894, -43167, -147592, -361033, -113707, 131720, -69899, 287588, 165947, -19026, 188061, -30759, -103543]
15557a03543r0843e690H1238M2526b9324n5371C08879I1697c0101l11222A11927
15545A21485l5257J9483E0987O2346M76251C1733b58982A11855b37649C8442c4696
15533B1270f9536j79525N9518Q5861j19633I0518K65220b47647a3341j79809A12999
15521h7945J237D23054C2709Q1200G378K57953a66669F5860P3291g8589B63560
15509B65581a91681c9174j33581A31263b55734B80678j11800e39661c8905j33216
15499a72121F2115e886j53127B07486C465K36953B2389a90460c2252n47225D6958
15487H7059D2240R9907M2954q7290P5287d1403n9505J9950c2791B13467I776P0076
15475G9852K52683o1290o2882q0278n3226c60186A93537a60708F5655f6220j57190
$$ y = [-103543, -194386, -5690, 81238, 123764, -29324, -84695, 308879, 91697, -30101, -341323, 111927, 121485, 86228, 105711, 50987, 113333, 589584, 31733, -258982, 111855, -237649, 38442, -34696, 21270, -69536, -249061, -189543, -103682, -223315, 90518, 355738, -247647, -13341, -193150, 112999, -87945, -86708, 423054, 32709, 113909, 7378, 265331, -166669, 65860, 139151, -78589, 263560, 265581, -191681, -39174, -172755, 131263, -255734, 280678, 168878, -539661, -38905, -172121, 62115, -5886, -159013, 207486, 3465, 240418, 22389, -190460, -32252, -579477, 46958, 87059, 42240, 142147, 185101, 97811, 173098, -41403, -100908, -80958, -32791, 213467, 9776, 79852, 332535, 271245, 208363, 128085, 74859, -360186, 193537, -160708, 65655, -66220, -223410]
15464b23410E5494c0624B78060A20713c62087H308J8069N12791a50486A17920
15453G015f2111k36270j39230a52698j16463B9543a11906A62064F3246K92213
15443C55459L66193j65185k47258K20038A83957A5593K67045p9816r2795J41880
15433B51907F052J16623J6926K19001j48756m1688J93987C1291f701A66354e456
15421E5411K61262I9822N5135Q4508b29369O7689d4403E951Q1341a43312A90446
15409B54713B3025e8559D63241a81379f0184k48701d9504A88778a93532f0665
15398B76735h1263q25j22086B08054D1396k0269a94152A3154J04699J91133g1656
15386A02100Q0564o223b76608b1383A85812F922Q3587B9657J6563J58835d2428
$$ y = [-223410, 55494, -30624, 278060, 120713, -362087, 8308, 26377, 539168, -150486, 117920, 7015, -62111, -298381, -437611, -152698, -269161, 29543, -111906, 162064, 63246, 355459, 721652, 556467, 309209, 529247, 183957, 15593, 282638, 202822, 110027, 251907, 6052, 122675, 139601, 358602, 209846, 168158, 362145, 31291, -6701, 166354, -5456, 55411, 316673, 99822, 154957, 239465, -229369, -161680, -44403, 5951, 87292, -143312, 190446, 254713, 23025, -58559, 463241, -181379, -60184, -308885, -49504, 188778, -193532, -60665, 276735, -81263, -82088, -204174, 208054, 41396, 21127, -194152, 13154, 117853, 308986, -71656, 102100, 182664, 176441, -276608, -21383, 185812, 6922, 90509, 29657, 46220, 205055, -42428]
15374b69169j49245g4870m3204B35130h8906B47052I5787K16190H6336P3556M929
15363A64821K00626a64681l3546M1306b26A66977a94238c2505m3716b2267A44698
15351a48935B98266b21335H1023j9079d8216G8577g0887A35644E1511K86392a78854
15339B68962l0663H0658O5401a7485G180a45483D3357J56103d5717m2744B87647
15327E58171a94639b3662A69900a3828F9856h518j16422B24116J38424L1830B820
15315a44357f1470A02528i3947F353O5126e6633B43042a11521A68775J0629p0910
15304A08494c37686g6444H7909J32114D1578J20669j0805l8147A839J50310a33707
15292A06983b37409a03566G6934B9512a38137B08992r9646P4130a16142F8542
$$ y = [-269169, -418414, -74870, -118074, 235130, -88906, 247052, 95787, 311977, 86336, 159892, 164821, 365447, -164681, -198227, -156921, -226, 166977, -194238, -32505, -76221, -22267, 144698, -148935, 298266, -221335, 81023, 61944, -48216, 78577, -70887, 135644, 51511, 337903, -178854, 268962, 238299, 80658, 146059, -17485, 7180, -145483, 43357, 199460, -45717, -88461, 287647, 558171, -194639, -23662, 169900, -13828, 69856, -8518, -124940, 224116, 362540, 394370, 2820, -144357, -61470, 102528, -93947, 6353, 71479, -56633, 243042, -111521, 168775, 179404, 108494, -337686, -76444, 87909, 220023, 41578, 162247, 151442, 113295, 1839, 152149, -133707, 106983, -237409, -103566, 76934, 29512, -138137, 208992, 109346, 183476, -116142, 68542]
15281B40764K2505C6875J85366b71203j06455a30561D7701a7152A91966j4731
15271A77235L7606N1025a22813B8481M4275O2408B3265J89832I3117b96990A25164
15259C33684b1036r1083A70427J9315f3046A35014E0439J79483J51869R7436N22305
15248A001532R76239q30568K24473o9101F10670k31582r0729a89703E9724i6107
15237a49188K7563k21184G5475K3268I926L51532q7996p0314b76216H7474e2971
15225B48357m1528a9044B09887a43735B7642L5459J43941K13295a8564A46995
15214a1580B23492J048c0576B15599m1927C2060m674K7605i245A38450K42422
15203C80872D316J69155q3369K21376j06019a8782A3878M3641J03672J1666a71019
$$ y = [240764, 263269, 36875, 222241, -271203, -377658, -130561, 47701, -17152, 191966, 177235, 214841, 265866, -122813, 28481, 72756, 135164, 23265, 213097, 93117, -296990, 125164, 333684, -21036, -112119, 170427, 189742, -63046, 135014, 50439, 229922, 381791, 479227, 1001532, 1977771, 1147203, 1371676, 1302575, 610670, 379088, 288359, -189703, 59724, -96107, -149188, -121625, -342809, 75475, 98743, 9926, 361458, 273462, 203148, -276216, 87474, -52971, 248357, 206829, -19044, 209887, -143735, 27642, 63101, 207042, 420337, -18564, 146995, -11580, 223492, 224540, -30576, 215599, 173672, 32060, 27386, 54991, -9245, 138450, 380872, 4316, 173471, 90102, 311478, 205459, -18782, 13878, 57519, 161191, 172857, -171019]
15191B35630b480C41755i574C71248a541p090B67951H9382N3134o4705d6952q3704
15179a30656B31570p6269p5648b04080f3007j63523A88846A3504N1601M42209
15169E07314h9662A72222h9972J0985B34229Q2865J1215j01115n033j00771n0994
15158G0396a37424A95140b3557A34979m8805J09181J43532m5693H9552M4566a24774
15146B93078A29082j6472c9018B66647D6992g6690Q827A29678M6899A418d0901
15134A51102L5714R60J3841r3099j4185P6215K89525a46673k26587h2361k2170
15123a04531C68855C2341O32906g9196I0440J71190a5419E8805P8131a06204B85202
15111C40277n9842G675K65140F5926B0307h9465B34431l161c2421B68691K2349
$$ y = [235630, -2480, 341755, -9574, 371248, -1541, -8631, 267951, 89382, 142516, 77811, -46952, -130656, 231570, 155301, 79653, -204080, -63007, -226530, 188846, 13504, 65105, 507314, -89662, 172222, -89972, -78987, 234229, 317094, 328309, 227194, 222161, 121390, 70396, -137424, 195140, -23557, 134979, 86174, 195355, 338887, 293194, 89552, 134118, -124774, 293078, 129082, 112610, -39018, 266647, 46992, -76690, -67863, 129678, 176577, 1418, -40901, 151102, 186816, 187776, 201617, 108518, 94333, 170548, 460073, -146673, -373260, -82361, -104531, 368855, 32341, 665247, -79196, 90440, 261630, -15419, 58805, 136936, -106204, 285202, 340277, 280435, 7675, 272815, 65926, 20307, -89465, 234431, 231270, -32421, 268691, 291040]
15100B91040E4340L49200j85279a02854d588G2824J07359l9245f8533A57066b20003
15088B29242p0133J71346R543H1847B948J41552O5672a87866c0007B61318M4410
15077C05728b1741H1473m0202M6404j9177K4585J84102G1470c8837B52251j7544
15066B34707a33565B65209E5825Q9176Q3073b2062n6121K8992B67245q9600L02310
15055D79955A08652J55989J20115j67800K01182l5252g470D07522J31182A45309
15044D26171k4820M9950B06939L9167K73481A84160m6972J2731m2859K08153i
15032B57550A24056P4592q2149K01444J0743j20802J99882C6774L25473J95298
15022E57545A62552A6327L01866A43831J81066a7848D96259A01989J10409O2725
$$ y = [291040, 54340, 403540, 218261, -102854, -4588, 72824, 180183, 140938, -68533, 157066, -220003, 229242, 159109, 330455, 339998, 81847, 2948, 144500, 210172, -187866, -30007, 261318, 305728, -21741, 81473, 41271, 87675, 68498, 93083, 277185, 71470, -38837, 252251, 234707, -133565, 265209, 55825, 145001, 228074, -22062, -78183, -49191, 267245, 177645, 479955, 108652, 264641, 384756, 216956, 418138, 382886, -7470, 407522, 538704, 145309, 426171, 401351, 451301, 206939, 246106, 519587, 184160, 137188, 149919, 107060, 315213, -9, 257550, 124056, 198648, 116499, 317943, 328686, 207884, 407766, 36774, 362247, 557545, 162552, 16327, 318193, 143831, 324897, -17848, 496259, 101989, 212398, 275123]
15012B75123J43174k7715f3114E88306E9883J25039R3894j19119b9913C97342
15001B59409q0046R9585L82433A66416K87863A64914K62981j61804o5423J81208
14991C81876n0733J5328J1870j50076p9508M16550B09675J32746J0401j57444
14981A95378M60049o8237j22045j05401M65465l57841J08751j18796j47786B4424
14970a87812E57980j02878K0475K2394K7086A89348N35993C31566K1586l7288
14960C15864j6854L8312j54148K74996L8854B39619J49366J24290K00658k51023
14950D62910j74630n3423m9784K98930A16279J95918q4070L04852k26793L90526
14940F96712l15858N9917r2554J20154L7385m0494j35073J9180j587k1929L99375
$$ y = [275123, 418297, 390582, -63114, 588306, 59883, 184922, 278816, 159697, -29913, 397342, 259409, 179363, 278948, 661381, 166416, 454279, 164914, 427895, 266091, 200668, 381876, 331143, 346471, 358341, 208265, 128757, 545307, 209675, 342421, 352822, 195378, 655427, 587190, 465145, 359744, 825209, 467368, 576119, 457323, 309537, 24424, -187812, 557980, 455102, 475577, 497971, 525057, 189348, 725341, 331566, 353152, 315864, 299010, 337322, 183174, 458170, 497024, 239619, 388985, 513275, 713933, 462910, 288280, 234857, 185073, 484003, 116279, 312197, 228127, 532979, 306186, 696712, 380854, 440771, 348217, 468371, 505756, 465262, 330189, 349369, 347782, 325853, 725228]
14929G25228k06139M9876J66084J43271l04398R8363J81207k66864Q5568J9572
14919F91768J82464Q4562k94980L03910J35990k12832C57056J7920m7503L33513
14909F60986C02189L8174J01693A89469L09950k22284L03989k257B69935K28479
14899D98414B27942K88121j27874q8281J36656j4165j34579o6527K91049j71580
14889C40762j37974K07379P2034j84754M4283J35261K68878k37827l457J23616
14879F28201k53619J46141n929K39889J7824k88095J23656k00646L7717K5694
14869D70833K84435B19050K71041Q2992K7316j3471O7573k8817k44764J20568
14859E01488j2358J98116l37676P038A40755K90681J38734J22412n6239l05277
$$ y = [725228, 519089, 568965, 735049, 878320, 573922, 672285, 853492, 586628, 672196, 691768, 874232, 958794, 663814, 967724, 1103714, 890882, 357056, 374976, 327473, 660986, 302189, 340363, 442056, 189469, 499419, 277135, 581124, 578867, 269935, 498414, 227942, 516063, 388189, 299908, 436564, 422399, 287820, 221293, 512342, 340762, 202788, 410167, 482201, 297447, 341730, 476991, 745869, 508042, 504585, 628201, 374582, 520723, 514794, 754683, 772507, 484412, 608068, 407422, 445139, 470833, 755268, 219050, 490091, 573083, 600399, 586928, 654501, 625684, 380920, 501488, 489130, 687246, 349570, 356608, 140755, 431436, 570170, 692582, 636343, 331066]
14849C31066K57900l3971J5948k11789J51058Q7094B68046L40591J03147j3823
14839F97961M37795m13091j45844K12359L8094l19721k23812J8975J36812J22157
14829E61685K6476j70070l4924J31343L1654B22436O9523K86978J00584A77527
14818D53305j9878J89069j93893j14391L00353q9704J0998J70080B59142j4913
14808B44229K61709J08642j28333j91311L40130k17520L64096k84256K34818j33457
14798E98747L8308L2920J63180j50618j97012o3739M01729C68450J44638J19323
14788F32411j08178K96488l79054N09759m43747K39199M6244l47499N5896K71180
14778G72699l61631L15867p9636j81020J90482J21300l12226J32995K54948j34623
$$ y = [331066, 588966, 554995, 570943, 359154, 510212, 597306, 268046, 608637, 711784, 697961, 1135756, 722665, 576821, 789180, 827274, 507553, 283741, 302716, 439528, 561685, 588161, 418091, 383167, 514510, 546164, 222436, 291959, 578937, 679521, 177527, 453305, 433427, 622496, 428603, 314212, 614565, 524861, 535859, 705939, 259142, 244229, 505938, 614580, 486247, 294936, 635066, 417546, 781642, 497386, 732204, 598747, 637055, 669975, 833155, 682537, 485525, 421786, 823515, 368450, 513088, 632411, 524233, 820721, 441667, 951426, 507679, 746878, 793122, 445623, 501519, 772699, 411068, 726935, 647299, 466279, 656761, 778061, 465835, 598830, 853778, 719155]
14768G19155p1051m5802j25296K02499J4117B81807K95552J14975j08975J6381
14758E99740R1582n1624n1970K36908l02840L03565j20603j08993J8222j08192
14748E05795L29106q0475q3595K29492k10831J98836n9777J39727m12058K62527
14738H18747j06849K10321N8458m75518J95518K28080j88816J52145k94302K43649
14728H41433j04984j0844O13K28135n9722K53069K11450k02353j83237J34440
14718A108000M03566m17746K63569m39830K41341l95292O1308P8329J26237l32448
14708F97034J73108j0205J27309j60764M0583j88522J10536N8433J33035L23045
14698A303592l95224N24299k45204j15141L24216l26979n5686o3853O6314N3626
$$ y = [719155, 648104, 602302, 477006, 679505, 693622, 281807, 577359, 692334, 583359, 599740, 691322, 639698, 587728, 824636, 521796, 825361, 704758, 595765, 613987, 505795, 834901, 754426, 670831, 900323, 689492, 888328, 828551, 968278, 556220, 818747, 711898, 922219, 980677, 505159, 700677, 928757, 739941, 892086, 597784, 841433, 736449, 725605, 726218, 954353, 894631, 1147700, 1359150, 1156797, 973560, 1108000, 1511566, 1093820, 1357389, 917559, 1158900, 763608, 824916, 903245, 1029482, 697034, 870142, 859937, 987246, 826482, 867065, 678543, 789079, 847512, 980547, 1303592, 908368, 1432667, 1187463, 1072322, 1396538, 1069559, 1013873, 950020, 1016334, 1069960]
14688A069960j6006J0630m00033K48222J46949J52272l55792N9888J67432J28583
14678A212105j97558Q5364k43921J75158L1110m0890m3712R6681o8937m0016R2827
14667A058211p6199r7465j18301K7964L63312k4418j73074J18313K5060R3183
14657A196586q5192J84298m70929K23839K41637k19486k05387M25240r5413O296
14647A201489p6938K02173j52647J03554o3416k32030L5824J82755K97116k86707
14637A211173j95778N23068l13450j30568J91345L804O4187k71798L36408m2299
14627A376092k96288L37497l50753L92796J33825m81913L32273N0910J1720m6905
14617A459254j78916Q0266J40341J33567l06134o4033M16243j38978P5193L0848
$$ y = [1069960, 1053954, 1064584, 664551, 912773, 1059722, 1211994, 856202, 916090, 1083522, 1212105, 1014547, 1099911, 855990, 1031148, 1062258, 1021368, 977656, 1074337, 1005400, 965384, 1058211, 982012, 884547, 766246, 794210, 1157522, 1133104, 960030, 1078343, 1103403, 1196586, 1111394, 1295692, 824763, 1048602, 1290239, 1070753, 865366, 1290606, 1195193, 1201489, 1124551, 1326724, 1174077, 1277631, 1214215, 982185, 1018009, 1200764, 1497880, 1211173, 1015395, 1538463, 1225013, 1094445, 1285790, 1289594, 1353781, 1081983, 1418391, 1376092, 1079804, 1417301, 1066548, 1459344, 1593169, 1111256, 1443529, 1494439, 1506159, 1459254, 1280338, 1360604, 1500945, 1634512, 1328378, 1264345, 1680588, 1541610, 1616803, 1647651]
14607A647651j47765k93651L16157m3810l38925L27933L40458l07357L37569j42840
14597A695420K02274l0533l15137L42486j26956j16301K37263k44689N7649q7385
14587A614091O3283P8156k2434K28781J51620l15058l6672O0263N5556O2248K12529
14576B152363j31136J7165J02257k48906K59112J26943M3557j14621L61810l80295
14566B188249J01026J00059o1021K06831K5610K5586P753J87863L02310k5143
14556C059123J3810q922M63345L46219N92816Q83777J052087K597614L865611
14547A2865480P595183J3225792K068684j3272739j0390772n666386k464311p41008
14539C219923o10775k37870n5872j33195k02519J33411K34433m28346k5417J86811
$$ y = [1647651, 1499886, 1206235, 1522392, 1478582, 1139657, 1467590, 1808048, 1500691, 1838260, 1695420, 1897694, 1867161, 1552024, 1894510, 1767554, 1651253, 1888516, 1643827, 1701476, 1614091, 1677374, 1755530, 1733096, 1961877, 2113497, 1798439, 1761767, 1822030, 1877586, 1939834, 2152363, 2021227, 2038392, 2140649, 1891743, 2150855, 2277798, 2321355, 2206734, 2568544, 2188249, 2289275, 2389334, 2328313, 2535144, 2560754, 2586340, 2594093, 2781956, 3084266, 3059123, 3072933, 3064011, 3527356, 3873575, 4466391, 5350168, 6402255, 8999869, 12865480, 20460663, 33686455, 35755139, 22482400, 12091628, 6425242, 3960931, 3219923, 2609148, 2371278, 2315406, 2182211, 1979692, 2113103, 2347536, 1919190, 1893773, 2080584]
14529B080584j17583J87411Q5820L20523j86739J66641j64525n3718N79785n02931
14519B395268J31292j96031M00971p8470l3641j8332m2694P1546J93526j91328
14509B632107L65997k575K06390L9011l54610L21950n72769N51101o1892L15356
14499C440066j25187k3863M47079l09591k80053L47062N3046K58531m84216N49700
14489C872574l06608J42595n4769J81422k26829L09049n8708n2883K66289j92890
14479C879242K07020l3789q5827M64883j17636o2419K03893j47830J74436k50528
14469D231445K46271j87991L42580j31079k0318J32298L03170j14622K65363l18487
14459D748630O20679l3228K6833j43625r1169L78785k89913N9805L2877K89255
$$ y = [2080584, 1963001, 2150412, 2236232, 2556755, 2370016, 2536657, 2372132, 2318414, 2898199, 2395268, 2526560, 2330529, 2731500, 2653030, 2619389, 2601057, 2558363, 2629909, 2823435, 2632107, 2998104, 2995529, 3201919, 3240930, 2886320, 3208270, 2635501, 3186602, 3124710, 3440066, 3314879, 3291016, 3738095, 3428504, 3148451, 3495513, 3548559, 3807090, 3322874, 3872574, 3565966, 3708561, 3653792, 3835214, 3608385, 3917434, 3858726, 3805843, 4072132, 3879242, 4086262, 4052473, 3966646, 4431529, 4313893, 4251474, 4455367, 4307537, 4481973, 4231445, 4477716, 4289725, 4632305, 4501226, 4480908, 4613206, 4916376, 4801754, 5067117, 4748630, 5369309, 5336081, 5362914, 5219289, 5128120, 5506905, 5216992, 5276797, 5309674, 5598929]
14449E598929K16504j55076J27235J58325M625k0422M10832n02286K76063K34633
14439F349362R5132j00350J46633n1123K41110j59194J11152j58362L05238K91593
14429G071191J22393P2942K85647j07938N7927K63218K18761j45629j04600J53506
14419G887418L74767k04931P11694j54215J65311P9062l04372J60605K47708K6779
14409H989826J89406L48214J60737n6853M02671J53657L8994P4273L32022J51593
14399A0784540k43242L66057K20650J21339J35240M45152J28352L6406M76306
14390A2470800O6732j15513L95425M06866K05061L13285J70614J89746L47401
14381A4450417L99437k33150M73836K54542O05215L43798j89071M64298N75530
$$ y = [5598929, 5815433, 5660357, 5787592, 5945917, 5950542, 5930120, 6340952, 5838666, 6114729, 6349362, 6444494, 6344144, 6490777, 6439654, 6680764, 6521570, 6632722, 6474360, 6779598, 7071191, 7193584, 7266526, 7552173, 7444235, 7502162, 7765380, 7984141, 7838512, 7733912, 7887418, 8262185, 8057254, 8768948, 8614733, 8780044, 8859106, 8554734, 8715339, 8963047, 8989826, 9179232, 9527446, 9688183, 9631330, 10034001, 10187658, 10226652, 10300925, 10632947, 10784540, 10541298, 10907355, 11128005, 11249344, 11384584, 11829736, 11958088, 11994494, 12470800, 12537532, 12422019, 12817444, 13224310, 13429371, 13742656, 13913270, 14103016, 14450417, 14849854, 14616704, 15090540, 15345082, 15950297, 16294095, 16105024, 16569322, 17144852]
14372A7144852K5115P28052j29673M87722M52875J17496Q48020N75848P1886M42252
14362B0764445N87513M05284L70492N86677M28140M50020O51837M10647O52200
14353B5307255N60068O80672M06205Q10857Q59338N12536Q15230N61211R59589
14344C1472961Q21148Q75168O64106R70918Q95654P65073J377615R07125J133370
14335C9883138R43529J512819J198892J106154J588525J451935J298289J441059
14327E0424340J785819J799795J607420J538140K494524K024487J989870J923637
14319F5588032K517058K273484K808827K712331K844236L301643K825953L485708
14311H8357272L305791L857003L949785M028305M273997M890435M799727N314735
$$ y = [17144852, 17169967, 17898019, 17768346, 18256068, 18708943, 18826439, 19674459, 20250307, 20322193, 20764445, 21351958, 21757242, 22127734, 22714411, 23142551, 23592571, 24244408, 24655055, 25307255, 25867323, 26547995, 26954200, 27765057, 28624395, 29136931, 29952161, 30513372, 31472961, 32294109, 33169277, 33833383, 34804301, 35699955, 36465028, 37842643, 38749768, 39883138, 40826667, 42339486, 43538378, 44644532, 46233057, 47684992, 48983281, 50424340, 52210159, 54009954, 55617374, 57155514, 59650038, 61674525, 63664395, 65588032, 68105090, 70378574, 73187401, 75899732, 78743968, 82045611, 84871564, 88357272, 91663063, 95520066, 99469851, 103498156, 107772153, 112662588, 117462315, 122777050]
14303A22777050N236404O092910O101426O580068O865995P224174P676831Q257616
14295A76812474Q970348Q692722R486373R809151J0236536J0760316J1511918
14288B46279838J2001117J2453188J2713671J3145743J3840810J3309899J4271457
14281C38015723J3805348J3916588J3493233J2914677J2221692J0891241R921518
14274D25180020P331457L166000J456781J857780J705961j184601m616319m293086
14266D30603993l987208n145962q350610j0510078j1506027j2934464j3805619
14259C64364025j4017211j4454085j4416351j4825887j3971469j2765165j3315651
14252B66598206j2636443j2452583j1898240j0744931j0730289r828927r675594
$$ y = [122777050, 128013454, 134106364, 140207790, 146787858, 153653853, 160878027, 168554858, 176812474, 185782822, 194475544, 203961917, 213771068, 224007604, 234767920, 246279838, 258280955, 270734143, 283447814, 296593557, 310434367, 323744266, 338015723, 351821071, 365737659, 379230892, 392145569, 404367261, 415258502, 425180020, 432511477, 435677477, 437134258, 438992038, 440697999, 439513398, 434897079, 430603993, 426616785, 421470823, 413120213, 402610135, 391104108, 378169644, 364364025, 350346814, 335892729, 321476378, 306650491, 292679022, 279913857, 266598206, 253961763, 241509180, 229610940, 218866009, 208135720, 198306793, 188631199]
14245A88631199q792000q224718p782976p642181p294315o509100o158691o163480
14237A30063738n159018n540108n106780m665758m552244m468497l680567l579213
14229I3311553l599122l780199l032436l416536k887271k620714k889257k471574
14221F8614444k022790k120958k527364k203055j552244k258633j630809j246878
14213E3051713j739331j596528j873601j225688j230441j461228j005084j177191
14205D1742621j193113j234809j268804r35144j052360r23186o61243m90345j436924
14196C2546693r12608p10507l60798j164257n50850q33921o92074p51359p06010
14187B5864309o15587k07118q05501l16984p37766l64610q44504l4707p06704
$$ y = [188631199, 179839199, 171614481, 163831505, 156189324, 148895009, 142385909, 136227218, 130063738, 124904720, 119364612, 114257832, 109592074, 105039830, 100571333, 96890766, 93311553, 89712431, 85932232, 82899796, 79483260, 76595989, 73975275, 71086018, 68614444, 66591654, 64470696, 61943332, 59740277, 58188033, 55929400, 54298591, 53051713, 51312382, 49715854, 47842253, 46616565, 45386124, 43924896, 42919812, 41742621, 40549508, 39314699, 38045895, 37110751, 36058391, 35135205, 34473962, 33983617, 32546693, 31634085, 30923578, 30562780, 29398523, 28847673, 28013752, 27321678, 26570319, 25864309, 25248722, 25041604, 24236103, 23919119, 23181353, 22816743, 21972239, 21937532, 21230828]
14178B1230828m05018m12136m08293m01804m37043k31491l22038n67530j57464
14169A7888011n34902o07475J3217n68234p9802l65051j89416k51908l92167J23444
14159A5035717l18435m38776l83223j48748j29113k90288R6443l90533k49833
14150A2783211m7194m86169j31623m06112K56542o85575K80811q5440l75091j88443
14140A0914917K704m56438Q4355k35127O7889n85304j04599l16070K16009l19886
14130I268450j03902k53313l6329J98995j46548m67669j55391k26798M04273r792
14120H471976n03123m42347N09165m38875k38586R116Q127n9557k63454J3959
14110G066401j22565k27657m8323J30120q0532j08686K29627o32456k06149L17944
$$ y = [21230828, 20825810, 20413674, 20005381, 19603577, 19166534, 18935043, 18613005, 18045475, 17888011, 17353109, 16745634, 16758851, 16190617, 16110815, 15745764, 15556348, 15304440, 14912273, 15035717, 14717282, 14278506, 13895283, 13746535, 13617422, 13327134, 13423577, 13033044, 12783211, 12736017, 12249848, 12118225, 11712113, 11968655, 11283080, 11563891, 11478451, 11103360, 10914917, 10917621, 10461183, 10545538, 10310411, 10378300, 9792996, 9688397, 9372327, 9588336, 9268450, 9164548, 8911235, 8874906, 9073901, 8927353, 8459684, 8304293, 8077495, 8481768, 8471976, 7968853, 7526506, 8035671, 7596796, 7358210, 7367326, 7375453, 7315896, 7052442, 7066401, 6943836, 6716179, 6667856, 6797976, 6717444, 6608758, 6838385, 6205929, 5999780, 6317724]
14100F317724k6284j26072l57520m5836K34388l14190j84226p5343M1071J78550
14090E642262j56907j32600n5224q9373J98340j59827j93357K2789K5185l53780
14080D747508J93605k54816J89874j87261O6209m06400L62883J60131n06215J61844
14070D527362j21299J18687l88258J94076k95298J44484L2002k13586Q3774K07703
14060D289647m1479l11100J99833j38690j76980r9041p14m8101L33917r5675k04286
14049C707331j93452q7835L24506l11851j02709r6293J44662L62783l44431r8667
14039C304044L3329J07290k05416N0740O5963o8828j38360m72710M11942J35506
14029C223500l24020j27190J33367K36964l13991K0474j55944O4726Q4508J21776
$$ y = [6317724, 6291440, 6165368, 5807848, 5762012, 5996400, 5682210, 5497984, 5422641, 5463712, 5642262, 5485355, 5352755, 5297531, 5208158, 5406498, 5246671, 5053314, 5076103, 5101288, 4747508, 4941113, 4686297, 4876171, 4688910, 4755119, 4348719, 4711602, 4871733, 4365518, 4527362, 4406063, 4524750, 4136492, 4330568, 4035270, 4179754, 4211756, 3998170, 4081944, 4289647, 4248168, 3937068, 4136901, 3998211, 3821231, 3722190, 3721476, 3673375, 4007292, 3911617, 3707331, 3513879, 3426044, 3750550, 3438699, 3335990, 3239697, 3384359, 3747142, 3402711, 3304044, 3337373, 3444663, 3239247, 3289987, 3355950, 3287122, 3148762, 2676052, 3087994, 3223500, 2899480, 2772290, 2905657, 3142621, 2828630, 2849104, 2693160, 2757886, 2842394, 2964170]
14019B964170l84367L6193P7573q4373k17860K28540r5611k45958K60929j61434
14009B377802N0605o7968L5803o20497L00685L62964l31349K33116k85283L44655
13999B400533L5726j67517K186J15170k40623J28945J00597K43260K99689L22655
13989C240621J338242L100784N706426J2009809J1737434j0742137r737340n880400
13981A0773439l498476j972878l86928r44415l07339l1515k66902j84002m60800
13972B720184l4102K78573p04660M44773o1861k19394k56245M91323k40637n9400
13962B358554k31420j86372K78331m1992N7686j06849j33467L77014k11700N5553
13952B215338L0297m61413j20073J58904K37015m3722J81591m25131J74157j29505
$$ y = [2964170, 2579803, 2615996, 2693569, 2609196, 2391336, 2619876, 2524265, 2278307, 2539236, 2377802, 2428407, 2360439, 2396242, 1775745, 2076430, 2439394, 2108045, 2341161, 2055878, 2400533, 2436259, 2268742, 2270928, 2386098, 2145475, 2274420, 2375017, 2618277, 2917966, 3240621, 4578863, 7679647, 13386073, 25395882, 37133316, 26391179, 16653839, 10773439, 7274963, 5302085, 4915157, 3970742, 3663403, 3631888, 3364986, 3180984, 2720184, 2686082, 2964655, 2259995, 2704768, 2642907, 2423513, 2167268, 2658591, 2417954, 2358554, 2127134, 1940762, 2219093, 2177101, 2234787, 2127938, 1994471, 2371485, 2159785, 2215338, 2245635, 1784222, 1664149, 1823053, 2060068, 2016346, 2197937, 1772806, 1946963, 1817458]
13942A817458n6473R687J76193l86273L39861m66282N55698j14804k44134J54322
13932A785253K00352m79441N4843K03935j07172Q1363j70816J22011l59650J39790
13922A470468J38484j09715O7856M1806j29180L1667J37532n7482j62823J31254
13912A559867r7195k02952J96505K2182Q9454l45942P7836Q346R8790k87830K99701
13901A418762J50364j48404M02533n27806n4375k19643K19171j0167p9251l5465
13891A115719J62720r4089N11688l59176M2440K92157k02794J11412m07936M1199
13881A213340j59388Q8761m6621K9261L15076k02717r2385j13372p8638n8799
13871H94518N56401l08580k96643L55063O4849N1475J2524K09439m47496k4116
$$ y = [1817458, 1760985, 1770672, 1946865, 1560592, 1900453, 1434171, 1989869, 1875065, 1630931, 1785253, 1985605, 1506164, 1561007, 1764942, 1657770, 1739133, 1568317, 1690328, 1330678, 1470468, 1608952, 1499237, 1567093, 1608899, 1479719, 1511386, 1648918, 1591436, 1428613, 1559867, 1462672, 1259720, 1456225, 1478407, 1567861, 1221919, 1299755, 1308101, 1406891, 1119061, 1418762, 1569126, 1420722, 1823255, 1295449, 1241074, 1021431, 1240602, 1230435, 1151184, 1115719, 1278439, 1184350, 1696038, 1336862, 1379302, 1671459, 1468665, 1580077, 1172141, 1213340, 1053952, 1142713, 1096092, 1125353, 1440429, 1237712, 1145327, 1031955, 953317, 894518, 1450919, 1142339, 845696, 1200759, 1265608, 1317083, 1329607, 1539046, 1091550, 1067434]
13861A067434l7274k14237K77397J25556J7108j23653r0763J00887o1791O7471
13851A128135M754K25988n02931O61707k84341k40482K8042J2241k235p5629J14118
13840A069367k50118L33590k19530K4922K38425j83209j66622J97300Q2151j48407
13830I77869L26244k31820R1765l51313N3858J60745m19254M72299k91517J31348
13820I20224k97364M43083j2399m2884m1066J27223K18369F13947J61856K40620
13810A016423n1932k61927K03224o9147l824r5025K16907C82640M03423k0206
13800G65857K37518j52858k14897J53107n6918l4842k56582K58058B45791M15989
13790F61780k77004J15944L38415Q5593l42443K27260r4103j90295K6655L17109
$$ y = [1067434, 1030160, 815923, 1093320, 1218876, 1235984, 1112331, 1021568, 1122455, 1060664, 1128135, 1132889, 1358877, 855946, 1517653, 1233312, 992830, 1020872, 1033113, 1030878, 955249, 1069367, 819249, 1152839, 933309, 958231, 1196656, 1013447, 846825, 1044125, 1126276, 977869, 1304113, 1072293, 1164058, 812745, 866603, 1027348, 608094, 1080393, 788876, 920224, 622860, 1065943, 1053544, 1010660, 969594, 1096817, 1315186, 613947, 775803, 1016423, 964491, 702564, 905788, 836641, 832817, 737792, 954699, 382640, 786063, 765857, 1003375, 850517, 635620, 788727, 731809, 696967, 440385, 698443, 245791, 661780, 384776, 500720, 839135, 924728, 582285, 809545, 715442, 525147, 551802, 868911]
13780H68911J18474l33686k7076j42474L76840j00079k29746K48589Q9492k11186
13770F58059q1776J05090l7909L34124D87567J03061j11979K65656k58498k11472
13760B74335M97540l48211K59859J01219q9625r6220L37249j43121j49232K09076
13750H52869n3636Q0447q259k71535A98802M88521j10153N3287J7839j52850j11568
13739C83878L40337k71262J81708j71979L00833C70400j9228L63201k18208j08507
13729C87658J68285j5512J37624J68334k64407K53104m13117K65639J86472m01440
13719D72640L49123p6754q5840P7113j35913j83835A03941O78101B64580K46403
13709E10983M05157l98316k27068L49749r2296M31085l60371B71213J19519j20021
$$ y = [868911, 987385, 653699, 626623, 484149, 860989, 760910, 531164, 779753, 869245, 658059, 576283, 681373, 643464, 977588, 487567, 590628, 478649, 744305, 485807, 274335, 771875, 423664, 683523, 784742, 695117, 598897, 936146, 793025, 643793, 852869, 799233, 879680, 871421, 599886, 198802, 687323, 577170, 630457, 648296, 495446, 383878, 724215, 452953, 634661, 462682, 763515, 370400, 351172, 714373, 496165, 387658, 555943, 540431, 678055, 846389, 581982, 835086, 421969, 687608, 874080, 472640, 821763, 745009, 659169, 736282, 600369, 416534, 103941, 782042, 264580, 510983, 916140, 517824, 290756, 640505, 548209, 979294, 618923, 271213, 390732, 270711]
13699B70711L95998q2175n0419R6993B89275M0677A59151M97235j96786p8253
13689C81347j12980M93234l16418J94310k46372L82646j24744q3294j95525K72477
13679F44681Q6709Q7990k02966k79053Q1042Q3289k23687J69682j8273J05136
13669E34550B52080J90671j51885M39K89812B73237K09551K45447C49999J4577
13659C64576K53801k09866P0544B02052J90992O2243p6625M8404J65002P4652
13649F66720j04463B08828L21985j91566J54555j5509j15130J42792j3741j26636
13639C65578P8550k05350J61745P6135B26197L10906B24836R7018L33360j96590
13629D58624J00623j18498J83244B63901L51154k17589o3617L30513A24335K61649
$$ y = [270711, 666709, 584534, 534115, 631108, 289275, 329952, 159151, 656386, 459600, 381347, 268367, 761601, 445183, 639493, 393121, 775767, 651023, 567729, 372204, 644681, 731390, 819380, 616414, 337361, 418403, 501692, 278005, 447687, 429414, 534550, 252080, 442751, 290866, 291305, 581117, 273237, 482788, 728235, 349999, 364576, 618377, 408511, 479055, 202052, 393044, 455287, 378662, 427066, 592068, 666720, 562257, 208828, 530813, 339247, 493802, 478293, 363163, 505955, 492214, 365578, 444128, 238778, 400523, 476658, 226197, 537103, 224836, 321854, 655214, 458624, 559247, 440749, 623993, 263901, 615055, 397466, 333849, 664362, 124335, 385984]
13619C85984R10A71486N97256k46161j81387K10308B71115j34385N15357A21952
13608B72167L55222A72143L23373k3720k11294M6385J06435n1266R3158A28220
13597D36788A85824L0369L6387R363Q9648O3095K5594A16286L59582J63930k30426
13586D09372m5580h7559C24180I3750L16660r4203R3131r4283O9227q9381Q6677
13575C81578j06690i702E47687j42361R125k00362m2860O9762J10750R060L8202
13564C99003A82558L89248B47095O1396R6552j88233K14829p1049q4375K03924
13554D80139j94043o6054J28873q4575J25718j22876L8669r1852K59009r5432
13544C77576m0137j22334p597L00238k1867k15722J32354j66253a20307A63950
$$ y = [385984, 386894, 171486, 768742, 522581, 341194, 551502, 271115, 136730, 652087, 121952, 272167, 627389, 172143, 495516, 471796, 260502, 306887, 413322, 362056, 455214, 128220, 436788, 185824, 216193, 252580, 261943, 351591, 414686, 440280, 116286, 475868, 639798, 409372, 363792, -87559, 324180, 93750, 410410, 316207, 409338, 315055, 384282, 294901, 381578, 274888, -9702, 547687, 405326, 414451, 214089, 171229, 240991, 351741, 360801, 399003, 182558, 571806, 247095, 308491, 405043, 216810, 431639, 360590, 276215, 480139, 286096, 220042, 348915, 264340, 390058, 267182, 305851, 213999, 473008, 377576, 337439, 215105, 207508, 507746, 485879, 270157, 402511, 236258, -120307, 163950]
13533C90020j35896N7063j4987Q6395o1463b32772B07822L4043L4474o3373P8476
13522B91442q4055M79875H6492C2574J59493J29579L4424c0564C81631q2002J13885
13511D13514j07541I7557N2080K5407J05594I3666J77070q158A07455J56368K66767
13500E30590k16901A45172k1561b7457D58174k04668J47728q3275c3009E15523
13489B11355E6198K37404j12889K73589A10318M99211d595D20432j47314K69074
13479E42192I3514K47081I8937P5812a2044p8821C09951N4786L10983k66980b8031
13467B49803p157m3834h9752B65861r6310B1936J72789d2211j563C53763P733
13456C61496A64792F9614K25694I9403h1277A6285P7801J85931p475d8174F35291
$$ y = [390020, 254124, 311187, 296200, 382595, 321132, -232772, 207822, 241865, 276339, 212966, 291442, 207387, 687262, 86492, 32574, 192067, 321646, 356070, -30564, 381631, 299629, 413514, 305973, 97557, 149637, 175044, 280638, 93666, 270736, 262578, 107455, 263823, 530590, 313689, 145172, 123611, -27457, 458174, 253506, 401234, 317959, -33009, 515523, 211355, 56198, 293602, 180713, 454302, 110318, 609529, -4595, 420432, 273118, 542192, 93514, 340595, 98937, 174749, -12044, -90865, 309951, 364737, 675720, 408740, -28031, 249803, 242646, 198812, -89752, 265861, 169551, 21936, 194725, -42211, -43774, 353763, 361496, 164792, 69614, 295308, 99403, -81277, 16285, 94086, 280017, 272542, -48174, 635291]
13444C57610A48229L8733Q42H4159J7468Q3764J66829L2293a25556B94450b28505
13432A5317M13580j45703F1004J93950j07223a29066f0549C4336L9149K08070
13422B81555q1131L9026c54170B12672J21146k8955J59788F1268R4820Q2697a74726
13410A21101k1670f8195D76242j39305a556B36985L2824a35489C65029k2505I9103
13398C52530b14437A28510d6097A43343L29209A68679R2045r3439M2742q3143
13388A26884n4057e105B53830q4304l0699M7074K62689j23580c3697A09964N3688
13377A63652J09995i1863B33582a45478A97958J4659J4503a80193B19534Q0881
13367C00415c8769H3892J50825n1532K91l6890o6818Q5056N047m58O0336J74210
$$ y = [357610, 148229, 186962, 187804, 84159, 101627, 185391, 352220, 384513, -125556, 294450, -228505, 15317, 428897, 283194, 61004, 254954, 147731, -129066, -60549, 34336, 73485, 281555, 200424, 239450, -354170, 212672, 333818, 304863, 464651, 61268, 156088, 238785, -174726, 121101, 99431, -68195, 476242, 336937, -1556, 236985, 269809, -135489, 365029, 342524, 99103, 352530, -214437, 128510, -46097, 143343, 472552, 168679, 260724, 167285, 210027, 126884, 72827, -5105, 253830, 169526, 138827, 185901, 448590, 325010, -33697, 109964, 163652, 273647, -91863, 233582, -145478, 197958, 212617, 227120, -180193, 219534, 300415, -38769, 83892, 234717, 183185, 183476, 146586, 79768, 164824, 169871, 169413, 229749, 403959]
13355D03959g9357A58694p410K22501f5191A37043K0969O8145L482o3729M30730
13344E96640k62445r4669L09487E5071c3796B92194j27187h046D5547O02094B41718
13332A04565M8336C3485J53279k3908J08592a7596A54726I254a18048G3667J95344
13321B69011a05449E13033j51493e8352A73693J65764j57919m2465J44187J09068
13311C92328J55142B09722j2679a4170A15466e0577A08253m6549a20963d8865
13300B37816C3710J21459F4173J51333N129m8347G1913M7676K6997J66258j19980
13289A92864k9316a9673A63090K55721j81445J8495a63997B43707j08827K31525
13279C66405R3637a39135A6379N1982P0708C9007K20949P3444A16515K91417A50818
$$ y = [403959, -79357, 158694, 151284, 373785, -65191, 137043, 158012, 226157, 229639, 165910, 596640, 334195, 239526, 549013, 55071, -33796, 292194, 165007, -8046, 45547, 647641, 241718, 104565, 152901, 33485, 186764, 162856, 271448, -17596, 154726, 9254, -118048, 73667, 269011, -105449, 513033, 361540, -58352, 173693, 339457, 181538, 139073, 283260, 392328, 547470, 209722, 197043, -14170, 115466, -50577, 108253, 61704, -120963, -48865, 237816, 33710, 155169, 64173, 215506, 220635, 172288, 71913, 119589, 146586, 312844, 192864, 163548, -19673, 163090, 418811, 237366, 255861, -163997, 243707, 134880, 366405, 460042, -139135, 16379, 68361, 139069, 39007, 259956, 333400, 116515, 407932, 150818]
13267f9952i955A31269L56971A20551g3810r6237J6036D2093a90742A53831h594
13255A58261d7441I5563M7248E0323j8393a60833B21136l094J98763A21969b68665
13243B2508Q7306K37585A28702J61562a07346D3182R3420A7783J39976G1543J08807
13232A80350l5253a06443F3441L0201G764P8801b12323B6288J58396A0149L18556
13221C28705I2392K4859K68362A89776c9666B58005K444r4092h8098I6694a06358
13209B07611j03516g2080H5372J98120I7649J18045J11516C8411K14819j15500
13199A37730J17402d4917A47695A1611K5384Q2854a82481A21586O4582r557e2568
13187A85935b1091j4233j15044E7638K68577B1517a16264A58719B5291J8535J07221
$$ y = [-69952, -9955, 131269, 488240, 120551, -73810, -170047, -154011, 42093, -190742, 153831, -8594, 158261, -47441, 95563, 142811, 50323, 31930, -160833, 221136, 218042, 416805, 121969, -268665, 22508, 109814, 347399, 128702, 290264, -107346, 43182, 136602, 17783, 157759, 71543, 180350, 145097, -106443, 63441, 93642, 7764, 86565, -212323, 26288, 184684, 10149, 328705, 92392, 117251, 385613, 189776, -39666, 258005, 260449, 166357, -88098, 96694, -106358, 207611, 104095, -72080, 85372, 283492, 97649, 215694, 327210, 38411, 253230, 137730, 255132, -44917, 147695, 11611, 36995, 119849, -182481, 121586, 186168, 176611, -52568, 185935, -21091, -35324, -150368, 57638, 326215, 21517, -116264, 158719, 25291, 43826, 151047]
13176A51047p2076q778O0393J13397A19038f8979A52783a2590D40750F8119J32831
13165B00950k496A4495a92638C08034L8505a24517E8163K26896a02502A7365J71112
13154A88477d0388C52377j40459l8216D325N469a48336C9679b38408B48550f9756
13142C19994A43697j1082k1896b15316a5094B76466A34716J62517j3284D641h1292
13130B09985a20126A41963a565D34432j97955a17108E0829P8259J09984R5228
13120C34300b4781G7200A0502K38781c3264B4695L7547C0200J63984J90355A49975
13108A31487N0175J3170r6348J18929k115n7024k8101C9425R8714K53901a36458
13096C25529b7585o6748B38400R7842G5540d0251j26778P2916O217D9229J12613
$$ y = [151047, 78971, 70193, 130586, 243983, 119038, -68979, 152783, -12590, 440750, 68119, 200950, 198454, 14495, -192638, 308034, 346539, -124517, 58163, 285059, -102502, 17365, 188477, -40388, 352377, 211918, 173702, 4325, 9794, -148336, 39679, -238408, 248550, -69756, 319994, 143697, 132615, 110719, -215316, -15094, 276466, 134716, 297233, 283949, 4641, -81292, 209985, -120126, 141963, -1565, 434432, 236477, -117108, 50829, 129088, 239072, 334300, -24781, 77200, 10502, 249283, -33264, 24695, 62242, 30200, 194184, 384539, 149975, 131487, 181662, 194832, 98484, 217413, 215298, 158274, 130173, 39425, 138139, 392040, -136458, 325529, -27585, -94333, 238400, 336242, 75540, -40251, -167029, -94113, -87896, 49229, 161842]
13085A61842a41075A3886e3885B22603r7806J5566c05139h9716A49596J40819
13075B90415D8334J80371A04481k2994f1375B73803F846K62546i7710F0021J09755
13064A69776c82326B47440b6161A60322o078a65644B88580j36691a77895A30964
13053A26446L01844A79562L9082a73847F6761K02755n8797c28649B75951K8441
13043C04392D3419L11092a5807H3735a5467B7131J23454e4875E5712M03714b98850
13031B04271p8121n5444F666K8393f9116A68807F1296B0640J31057B8421C191
13019b72238J0025a9892i899A39524J22264a47504K3420I034h723A66536E7910
13007f5482n4617d5851A36778J27331h8544O565A65906P2406M3664j02810b33529
$$ y = [161842, -141075, 13886, -53885, 222603, 124797, 140363, -305139, -89716, 149596, 290415, 48334, 228705, 104481, 81487, -61375, 273803, 6846, 269392, -97710, 60021, 169776, -382326, 247440, -26161, 160322, 154244, -165644, 288580, 151889, -177895, 130964, 126446, 428290, 179562, 218644, -173847, 66761, 269516, 210719, -328649, 275951, 304392, 43419, 354511, -15807, 83735, -15467, 27131, 150585, -54875, 55712, 459426, -298850, 204271, 126150, 70706, 6666, 35059, -69116, 168807, 61296, 20640, 151697, 28421, 3191, -272238, -262213, -19892, -9899, 139524, 261788, -147504, -124084, 9034, -8723, 166536, 57910, -65482, -120099, -45851, 136778, 264109, -88544, -81979, 165906, 238312, 281976, 179166, -233529]
12995a89011L5978g3571j81260a14095K5766k8722a3087I7252g8438B88037A3624
12983C57035D4003J40110c5041B44662c18960I3208b91974a6707H1270C5888A4665
12971d1733m74561a20339C02351a42692A44447D2972J443K47856k6482p0125J23514
12960C19178a32217B3611a94493B83222a22970B47568K057a71938b1649C31784
12949A46012c8428k0907A91056a65362E85702A19466g7586J9961m0082D7658L0949
12938G8607K839d2056A11136J28839F2100L7808C1904b6427I4135c2802A59493
12926a6579A55671p4601J00694a14702j34484E1410J19258f5895j11346b5279
12915B88690e8408A34926o5069a18986F6023e5491r9518A8543J62423A8020R0469
$$ y = [-189011, -153033, -73571, -254831, -114095, -88329, -117051, -13087, 97252, -78438, 288037, 13624, 357035, 44003, 184113, -35041, 244662, -318960, 93208, -291974, -16707, 81270, 35888, 14665, -41733, -516294, -120339, 302351, -142692, 144447, 42972, 44415, 292271, 265789, 195664, 319178, -132217, 23611, -194493, 283222, -122970, 247568, 249625, -171938, -21649, 331784, 146012, -38428, -59335, 191056, -165362, 585702, 119466, -77586, -57625, -97707, 47658, 78607, 81446, -42056, 111136, 239975, 62100, 99908, 31904, -26427, 94135, -32802, 159493, -16579, 155671, 81070, 181764, -114702, -249186, 51410, 170668, -65895, -177241, -25279, 288690, -58408, 134926, 69857, -118986, 66023, -55491, -155009, 18543, 180966, 18020, 108489]
12904A08489b24291j7272A83440b93870J33749d2128A61775a13396p5727A14132
12893b15920g8595C67059a43330l9830F4114M668J09504b01832B01464e0634q5815
12882a36449f7538k03983A13755a02497l382A27475o1974J35886e44682A40460
12871b76572R8440B1681J04451j4581a4291d029j17905J7644a1872D7538d0217
12859a15231B00430H0695G92a60641n2843B75316a87135A74453b30111r2742b9764
12847A16688K20735N1283b26272G9557J66543j01240J7702l7982m5769J0742J30089
12836B19642f1042c991B63379I7227K33178j33739D2555b0777m983n6661c1829
12824c27064c3110k96008B027K76922E9450b6821D7297K08426A2905R4846a11997
$$ y = [108489, -224291, -241563, 183440, -293870, -160121, -42128, 161775, -113396, -189123, 114132, -215920, -78595, 367059, -143330, -183160, 64114, 68782, 178286, -201832, 201464, -50634, -136449, -67538, -271521, 113755, -102497, -105879, 127475, 65501, 201387, -544682, 140460, -276572, -178132, 21681, 126132, 111551, -14291, -4029, -121934, -104290, -11872, 47538, -40217, -115231, 200430, 80695, 792, -160641, -213484, 275316, -187135, 174453, -230111, -322853, -29764, 116688, 337423, 388706, -226272, 79557, 246100, 144860, 162562, 124580, 78811, 89553, 219642, -61042, -3991, 263379, 97227, 330405, 196666, 42555, -20777, -25760, -82421, -31829, -327064, -33110, -329118, 2027, 278949, 59450, -26821, 47297, 255723, 12905, 107751, -111997]
12812B75479a46831J5335B53787N2862a60464c7502B42010F6656R6589d7789k9643
12801g7432A49298k8399b91531a40566A46611b65420J23087A44942a96505D4596
12790b32362F5726j7212J49660C1789h3730o837A59014n6600M1737K014G1449
12778A55149E6267a60846b4423D04468j08344a16738A71377k2151A7162a15328
12767e2934j42134c5369A22748J6749c08381a25987C4982b42822A11843K72087
12757C83930f7657r2056C06961F6433j1163c62196A6079M6451K07354a88255N4886
12746a33369A07274P4322B0438a092A41624a89901A55182Q4790n0155l2534a52863
12734A29592O1877c8229A6826a50407C2466i9236d1923C0751K67566a57538j19473
$$ y = [275479, -146831, -131496, 253787, 306649, -160464, -37502, 242010, 66656, 163245, -47789, -77432, 149298, 120899, -291531, -140566, 146611, -265420, -142333, 144942, -196505, 44596, -232362, 65726, 48514, 198174, 31789, -83730, -90567, 159014, 102414, 144151, 146165, 71449, 155149, 56267, -160846, -24423, 404468, 296124, -116738, 171377, 149226, 17162, -115328, -52934, -195068, -35369, 122748, 139497, -308381, -125987, 34982, -242822, 111843, 383930, -67657, -159713, 306961, 66433, 55270, -362196, 16079, 62530, 269884, -188255, -133369, 107274, 181596, 20438, -1092, 141624, -189901, 155182, 239972, 189817, 157283, -152863, 129592, 191469, -38229, 16826, -150407, 32466, -99236, -41923, 30751, 298317, -157538, -277011]
12723b77011B04464a30265G5445g0244D8612O2475L7083N2989p3853P6671b1930
12711a6205A42474J00672p2672P4887g2370A19167b38652B20093J09355D6560
12700h9425B02043L0837a26869D5041a4881A16869b6652A426M4012G238a28299
12688A06245e4931D5626N2266K77302f7741c3043C37912r5961o4035m7524c1004
12676e9249k3264M0070F3641a92222c790l6763j69970A1643N5869b45715B62865
12664B28007j00158A8922R7829f4634F9827a68556A59214g3916A60398m6249k4372
12653H9777J31851f2951C199a08123B92530L6652L0483j10082H4072h5714B15805
12641c49524c483j72311B06039c58326A28153b94502f7923A96517i7577B91048
$$ y = [-277011, 204464, -130265, 75445, -70244, 48612, 111087, 148170, 201159, 127306, 203977, -21930, -16205, 142474, 243146, 170474, 245361, -72370, 119167, -238652, 220093, 329448, 46560, -89425, 202043, 232880, -126869, 45041, -14881, 116869, -26652, 1426, 45438, 7238, -128299, 106245, -54931, 45626, 97892, 375194, -67741, -33043, 337912, 241951, 177916, 130392, -31004, -59249, -82513, -42443, 63641, -192222, -3790, -40553, -210523, 11643, 67512, -245715, 262865, 228007, 127849, 18922, 116751, -64634, 69827, -168556, 159214, -73916, 160398, 114149, 89777, 221628, -62951, 3199, -108123, 292530, 329182, 359665, 249583, 84072, -85714, 215805, -349524, -3483, -175794, 206039, -358326, 128153, -294502, -67923, 196517, -97577, 291048]
12630E1468K25448G112L46067A08139a81559C4491h678F6716a32202j09691A29455
12618C3944K55735b09340A25063i0381O967j20027A66725j8156a69801C14812
12607a76952a1388C1523P7449a57400A55182a01996I0813k8266L843N01649I4976
12595A20608l9224b1442k25696A41446c4755J1576H8036k9420c3921B09623r3655
12584A15968N8926J669d4523j9839B11675Q5835j41084m4882D9514f645I0780
12572A49120C9226a64071p2001e7086B4112c073A6016b67402k8301J08797N8527
12561a28379o8117B31652f7996B70535C2621a21704D8315L09381A14418g9135
12550E6915c01933A9689a70142A4414P4203c42235h7618a1199C36022b67756b2920
$$ y = [51468, 276916, 7112, 353179, 108139, -181559, 34491, -8678, 66716, -132202, -241893, 129455, 33944, 289679, -209340, 125063, -90381, -83414, -203441, 166725, 148569, -169801, 314812, -176952, -11388, 31523, 108972, -157400, 155182, -101996, 90813, 62547, 66390, 568039, 94976, 120608, 81384, -21442, -247138, 141446, -34755, -23179, 88036, 58616, -33921, 209623, 115968, 174894, 176563, -44523, -64362, 211675, 297510, 156426, 111544, 49514, -6645, 90780, 149120, 39226, -164071, -236072, -57086, 24112, -3073, 16016, -267402, -295703, -186906, -128379, -196496, 231652, -67996, 270535, 32621, -121704, 48315, 357696, 114418, -79135, 56915, -301933, 19689, -170142, 14414, 88617, -342235, -87618, -11199, 336022, -267756, -22920]
12538B87442n9876q0879a66810D7127H60b12254R5242p0991D813R9802d61744
12526c1989E51L06734h9144j1991A41462N144D0965N4230a13553B33416f9776
12514a37076c4624m9799k11186n6916C3308P4442b2544B65798a80139B65964b33625
12502a07832j54158h967j60622H6152R5501L44331j47427g4310A91717J10454
12492C02171e2430D3701a95923k19824a17949D1539f8921D8736a78594A373P1470
12481G2843J4050a21495B47394i5617A8642a78887h5120A3599J41029c34765A05932
12469A00832R5805J64513j79390K9151D7156f3808g486j83062b5343k25128B14819
12457C27427f4105E4935J50994F2632c77935m6199b00946P6659F6237N3288K86980
$$ y = [287442, 227566, 146687, -166810, 47127, 860, -212254, -117012, -188003, 4813, 104615, -461744, -31989, 551, 307285, -89144, -101135, 141462, 146606, 40965, 95195, -113553, 233416, -69776, -137076, -34624, -84423, -295609, -352525, 33308, 107750, -22544, 265798, -180139, 265964, -233625, -107832, -261990, -8967, -169589, 86152, 181653, 525984, 378557, -74310, 191717, 302171, -52430, 43701, -195923, -415747, -117949, 41539, -68921, 48736, -178594, 1373, 72843, 86893, -121495, 247394, -95617, 18642, -178887, -85120, 13599, 154628, -334765, 105932, 100832, 196637, 361150, 181760, 210911, 47156, -63808, -7486, -190548, -25343, -250471, 214819, 327427, -64105, 54935, 205929, 62632, -377935, -424134, -200946, -124287, 66237, 119525, 406505]
12446D06505g041E2641b07099h8187K0505p0044j45800C58480a36889J0729B08454
12434a23771r7488B2090b32619J12583B98884a02641d2442j7013b7513A47905
12423A52398E601J18690e2488l0183k878k4368A94628E2546g4076j06848f2996
12411G8482G254i3997A66973b85717H7582B3612A0958j915a32439E7446J55211
12400B12657E7727K8993a0889G9644b93727R4866k8840A34003N8204J54539D4303
12388a77296I5501J60590C9546M0920A268a8644A93338m8454b7736A72242a10780
12376b22526B91762f1843H0825K13576b33299K2554A80562d01092A25337a84752
12365D3975j0041c4446G20J01760b08969P6894G1621i662D616b50396a13553C6920
$$ y = [406505, -7041, 52641, -207099, -88187, -67682, -137726, -283526, 358480, -136889, -126160, 208454, -123771, -221259, 22090, -232619, -120036, 298884, -102641, -42442, -59455, -27513, 147905, 152398, 5601, 124291, -52488, -82671, -85549, -109917, 194628, 52546, -74076, -180924, -62996, 78482, 7254, -93997, 166973, -285717, 87582, 23612, 10958, 9043, -132439, 57446, 212657, 57727, 86720, -10889, 79644, -293727, -198861, -227701, 134003, 192207, 346746, 44303, -177296, 95501, 256091, 39546, 80466, 1268, -18644, 193338, 144884, -27736, 172242, -110780, -222526, 291762, -61843, 80825, 294401, -233299, -210745, 180562, -401092, 125337, -184752, 43975, 33934, -34446, 720, 102480, -208969, -132075, 71621, -9662, 4616, -250396, -113553, 36920]
12352B79953A2174a47320J2807O7014A6302J79803a52697I8103K0656b74838C49822
12340B1909b92860A90399a57356p8740L082m7241J17987A35473b96171A80131
12329a24573F0548L4225f5388G099b75499B3723e3824m8387m6192c194k02762
12318b05956j31923e6322B00452b97059A51168D865A025J94509a70783b8401l03761
12307c32162A6208a86889d3568j2491B96330A7059Q1837L6977b74413I190J34486
12296A43676R8737f5900J8744j29591C86233j41016q5796b89576A79190b06615
12285b4029A5622a28591A66969L1290p7445a89640B05801q9809B4690K07086J8605
12274B50381K6157a60556A24735B3954g0630l19658h8055B36636A01779m4697
$$ y = [279953, 12174, -147320, -134513, -67499, 16302, 196105, -152697, 98103, 118759, -274838, 349822, 21909, -292860, 190399, -157356, -236096, -233014, -280255, -162268, 135473, -296171, 180131, -124573, 60548, 94773, -65388, 7099, -275499, 23723, -53824, -102211, -148403, -3194, -205956, -337879, -56322, 200452, -297059, 151168, 4865, 1025, 195534, -170783, -28401, -332162, 16208, -186889, -43568, -56059, 296330, 17059, 98896, 135873, -274413, 9190, 143676, 242413, -65900, -47156, -176747, 386233, 245217, 159421, -289576, 179190, -206615, -24029, 15622, -128591, 166969, 198259, 120814, -189640, 205801, 115992, 24690, 231776, 250381, 276538, -160556, 124735, 23954, -70630, -390288, -88055, 236636, 101779, 57082]
12264E7082e0428F8378M4137a09170e4016C302K4630J09982o4243O8455O7636
12253B09762p6730J68141a38928A91550A7314a2928j3135m955B85054A832L55466
12242C57298C4603d3435k83619D1483K22692a43085A08707f2393A13259J36269
12232B49528b98781D04345A1703Q9014N3475n0262l4376L30476m7671b6165F2571
12220a68543b2411A57590J7243a01482c6984M121n3572k40596A18361c4124j74042
12209b08166A14734l6419M0876E1259a04563j14999G6710J96045j3842r5194P5898
12198B39617m2853K71427B1408b0151B87603A18530K96034m6888A19839K39661
12188C59500A28168J04947m5502L970n0181a96522A8376d7559k5622A37665b63359
$$ y = [57082, -50428, 68378, 112515, -109170, -54016, 3302, 27932, 137914, 73671, 142126, 209762, 133032, 301173, -138928, 191550, 17314, -12928, -26063, -31018, 285054, 1832, 357298, 34603, -43435, -327054, 41483, 264175, -143085, 108707, -62393, 113259, 249528, -298781, 404345, 11703, 100717, 154192, 103930, 69554, 400030, 352359, -26165, 62571, -168543, -22411, 157590, 174833, -101482, -36984, -32863, -86435, -327031, 118361, -34124, -208166, 114734, 78315, 119191, 51259, -104563, -219562, 76710, 272755, 258913, 163719, 239617, 196764, 468191, 21408, -20151, 287603, 118530, 414564, 367676, 119839, 359500, 128168, 233115, 187613, 191583, 141402, -196522, 18376, -47559, -73181, 137665, -263359]
12176A1842c9790A32793J34353d4858k28497A71515a09695D34332A36540m0387
12166I6153J54388C2059J73935B6077K50924A22064k7915J64730I6600f2044B4937
12154B1879f316I5028l4586M4170R4560g8828I7453A9473K74229a82819I7499
12142a4776C27641D2341a19398D13902H9721L1083j523c958C23540j34755f3959
12130I1847k2383o492N4244a06976c3255k44473H4920J28026D2881J18643J2816
12119A74340a57406F9109J6990J52907B9662h8643L6009A05340J30051e2262k25175
12108b77437R6444O7488J2044L7431B8783K6829c7588k709j84621I9620b48672
12096a41608B77295a75624F8858a45439E0654b1464o044r6246B30524a53625A25929
$$ y = [11842, -39790, 132793, 267146, -44858, -273355, 171515, -109695, 434332, 136540, 96153, 250541, 32059, 205994, 26077, 277001, 122064, 94149, 258879, 96600, -62044, 24937, 21879, -6316, 95028, 60442, 104612, 199172, -78828, 97453, 19473, 293702, -182819, 97499, -14776, 327641, 42341, -119398, 413902, 89721, 120804, 119281, -3958, 323540, 188785, -63959, 91847, 69464, 62972, 117216, -106976, -33255, -277728, 84920, 212946, 42881, 161524, 174340, -157406, 69109, 86099, 239006, 29662, -88643, -52634, 105340, 235391, -52262, -277437, -180993, -113505, -101461, -64030, 28783, 55612, -37588, -40297, -224918, 99620, -248672, -141608, 277295, -175624, 68858, -145439, 50654, -21464, -27508, -123754, 230524, -153625, 125929]
12084E5353b40998b7211l40878K4426h9690G2311P5251I893a18232L3061k18219
12073c03390g2466B4597a79705B41865n1222b6302j75953A18275a07443j09819
12063b17262F765L68554J17909o0404C3199i669k51996D5889c27577J23133h1665
12051d07506b02563I8235i9887J5880B7482J76174r2706K48568c433o7029A77202
12039b5907F7818K0837L5773O1112D5323K04276a31827L9757A26291B6051d2197
12027b12205A87940a90460g1022A19993h4509j43612h0846A0339K46755c7395
12016A61822L38749B49019B0791d5824H7744a24064A01672e6496r5261C0966b36652
12004a56227O1356A2978R8592b54985a20597j373I8684c30507a27379O3457q6584
$$ y = [55353, -240998, -27211, -368089, -343663, -89690, 72311, 147562, 9893, -118232, -85171, -303390, -72466, 24597, -179705, 241865, 190643, -26302, -202255, 118275, -107443, -217262, 6765, 375319, 493228, 432824, 33199, -9669, -261665, 45889, -327577, -204444, -81665, -407506, -202563, 98235, -99887, -84007, 27482, 203656, 110950, 359518, -3433, -70462, 177202, -25907, 67818, 88655, 124428, 185540, 45323, 249599, -131827, -92070, 126291, 26051, -42197, -212205, 187940, -190460, -71022, 119993, -84509, -228121, -80846, 10339, 257094, -37395, 161822, 500571, 249019, 20791, -45824, 87744, -124064, 101672, -56496, -151757, 30966, -236652, -156227, -94871, 12978, 111570, -254985, -120597, -121970, 98684, -330507, -127379, -63922, -150506]
11993a50506k6315A19581d8445E5094M1301h7458B52939B9310a53579A46268J63036
11982C09304f9236l34037G4933O9345n1226l663A1508a16266g67B72577a37962
11970a04438r6293Q9970L7450b2483j68791b3007k3492E2010K7876b34834g0791
11958E69i9412o2306A2734b4996j35597q8130M8150a9735j44743p8091J7594a06568
11945C1647J7829N2737R017l798a15403j3096C81449h8851B08332a1148G9405
11933A88200E0345b52578A22526m0872g1658l49742h135q7072l784A18515c1718
11921h5665L415k3421J2900n0451l66306a39812e9127H7474i9782F2754O3282
11910A26036a6386k27612l6439N4627g0145B01515h2210I4102k3003J04036c04668
$$ y = [-150506, -176821, 119581, -48445, 55094, 96395, -87458, 252939, 29310, -153579, 146268, 309304, -69236, -403273, 74933, 144278, 93052, 89389, 11508, -116266, -767, 272577, -137962, -104438, -200731, -110761, -73311, -22483, -191274, -23007, -46499, 52010, 79886, -234834, -70791, 569, -99412, -161718, 12734, -24996, -160593, -248723, -200573, -19735, -164478, -242569, -224975, -106568, 31647, 49476, 102213, 111230, 107432, -115403, -128499, 381449, -88851, 208332, -11148, 79405, 188200, 50345, -252578, 122526, 81654, -71658, -421400, -8135, -95207, -98991, 118515, -31718, -85665, -82250, -105671, -92771, -143222, -509528, -139812, -59127, 87474, -99782, 62754, 126036, -16386, -243998, -280437, -225810, -70145, 201515, -82210, 94102, 71099, 175135, -304668]
11898A62585b96969G206R5818D2290I331J56891g5053j85863G5534b04316N0788
11887a53528G984a77790A41338h7958b9531l7177q173H4572K03700q6727g5923
11875b80812D7893a10657A6862a89783d0769m4047e074B37473A0607K05044c02279
11863d8542B31405B0492a50341j32085A98169d3790B9271a40038j1286l06856
11853d58180k059F0361N8897n8285a78980d0398j5606p6252k40264B0112O1622
11842H1734a8716G3836b07026g6639f524o7900j72555D9674O6133b41442d2053
11830c56664A95370d5592j19348K6699j48993G8734O2854b39556F4868A002L2740
11819C3742a8357j05284G5516K5318j5654a69355m0805K5911c7039f898l2201
$$ y = [162585, -296969, 7206, 103024, 42290, 9331, 166222, -75053, -260916, 75534, -204316, -153528, 7984, -177790, 141338, -87958, -29531, -66708, -74881, 84572, 288272, 201545, -75923, -280812, 47893, -110657, 16862, -189783, -40769, -84816, -5074, 237473, 10607, 215651, -302279, -48542, 231405, 20492, -150341, -282426, 198169, -43790, 29271, -140038, -151324, -458180, -460239, 60361, 119258, 60973, -178980, -40398, -56004, -132256, -372520, 20112, 81734, -18716, 73836, -207026, -76639, -6524, -74424, -246979, 49674, 115807, -241442, -42053, -356664, 195370, -45592, -164940, -138241, -287234, 78734, 141588, -239556, 64868, 1002, 33742, -18357, -123641, 75516, 100834, 85180, -169355, -210160, -184249, -37039, -6898, -39099]
11808c9099k78346f5108M082F6181c66771E180a84182c0566n9124c6489A08712
11796E727J46130a63245C94209C3051O2333K76502c3271H5872C1773M070a31839
11784A03990R5526m2852a64908E2102a12159a4724r7081A23019b339B49138k065
11773B47073a07994K0522L3680k94073B00560h6919A09238L7882j9503D7730d6004
11761a00305E0147a11720j82023J31593B5212N8533b88632B47847a67825k4699
11751a92524I7889J49485O0051H9634d80154F4529f6124A90471b13416n5387B27904
11739B15534k4899c19018a2652C1733h1788A42307E2754b92167L7005F9412j5658
11728E3754a19112F8152c0108B87363N3944A24136n5231a05172A33421a17j79099
$$ y = [-39099, -317445, -65108, -61026, 66181, -366771, 5180, -184182, -30566, -89690, -36489, 108712, 5727, 151857, -163245, 394209, 33051, 95384, 371886, -33271, 85872, 31773, 35843, -131839, 103990, 199516, 156664, -164908, 52102, -112159, -14724, -111805, 123019, -2339, 249138, 247073, -107994, -87472, -53792, -347865, 200560, -86919, 109238, 147120, 127617, 47730, -46004, -100305, 50147, -111720, -293743, -162150, 25212, 83745, -288632, 247847, -167825, -192524, 97889, 247374, 307425, 89634, -480154, 64529, -66124, 190471, -213416, -268803, 227904, 215534, 190635, -319018, -12652, 31733, -81788, 142307, 52754, -292167, -255162, 69412, 53754, -119112, 68152, -30108, 287363, 341307, 124136, 68905, -105172, 133421, -117, -179216]
11717a79216M1339J3739M4891e96l7268m1325C3082b3053A52582c21838E2276
11705b21497I3264a27369L7071k04991A60b45983d9902a3303k06334b2039E4080
11693D7633A7277a75440O424P4198l5312A1520c0992D2487h9419B3077b14674
11681G6478g2926A70894i1111k52744A65984p8401J8586A0475b3974A86559H5670
11669I9209c15160H3184j8050d7340A57786g9105n4124j16465B85739D2378K44566
11658B86944c24531M9886f765p8637I6940a37076B42493C7266K38630P7286A00134
11646a33848A37679h160A0214K0939M0453i3753A82658e3814B47474f9088E7968
11634D9729a30521j3557A30906a60720o1369B8860M0167a10792C8890b536B23704
$$ y = [-179216, -137877, -124138, -79247, -596, -37864, -79189, 33082, -23053, 152582, -321838, 52276, -221497, 93264, -127369, -90298, -295289, 160, -245983, -49902, -13303, -219637, -22039, 54080, 47633, 17277, -175440, -169016, -94818, -130130, 11520, -30992, 42487, -89419, 23077, -214674, 76478, -72926, 170894, -91111, -343855, 165984, 87583, 106169, 10475, -23974, 186559, 85670, 99209, -315160, 83184, 65134, -47340, 157786, -79105, -133229, -249694, 285739, 42378, 286944, -324531, -274645, -6765, -85402, 96940, -137076, 242493, 37266, 275896, 353182, 100134, -133848, 137679, -8160, 10214, 31153, 71606, -93753, 182658, -53814, 247474, -69088, 57968, 49729, -130521, -144078, 130906, -160720, -222089, 28860, 69027, -110792, 38890, -2536, 223704]
11622A53551b58793A20332b14562A90212n4587b30841c0845K062o0414k18971
11612c08168G7463b67973a02858G4354J47416b1921j41406F50L13001b29980G8075
11600B41476l9183m3557K48813A79198J77290K0305j27958j00177b506I2168R5665
11589A87833p4791c1263e145l20058E0795N1692B5344g7478k7779A89501J69748
11578C59249f376E0958g7277B08700n4631J20110F0779j1854a194j96428M7083
11567a50539A38629A4535a00446j53572A22751d1713A36423a09937A2812a05074
11556A32249e3948A09909b0602g957m8344C12398B1973H528K42850H3218b20557
11544B5967b76478H6090K3726K228h4391A40509b0345j70121d5904q6077H5703
$$ y = [153551, -258793, 120332, -214562, 190212, 135625, -230841, -30845, -28783, -89197, -308168, 77463, -267973, -102858, 74354, 221770, -21921, -163327, 650, 313651, -229980, 78075, 241476, 202293, 158736, 407549, 179198, 356488, 376793, 248835, 148658, -2506, 92168, 187833, 113042, -31263, -5145, -325203, 50795, 102487, 25344, -77478, -105257, 189501, 359249, -6376, 50958, -77277, 208700, 154069, 274179, 60779, 48925, -1194, -197622, -150539, 138629, 14535, -100446, -254018, 122751, -41713, 136423, -109937, 12812, -105074, 132249, -53948, 109909, -20602, -7957, -56301, 312398, 21973, 8528, 251378, 83218, -220557, 25967, -276478, 86090, 109816, 112044, -84391, 140509, -20345, -190466, -45904, -131981, 85703]
11532B06102B8142a41295j45546B61128F6193a32041A24200a67484F7413L00490
11522C67903N3351A37611a50362A13571Q9636G1879b68774I1471d0081A3267R9394
11511A12661a25032K0530C1581J98750m244B7206K00018e787C4514d8739J0683
11500c8056m9409A08446a5254C2133i9267B62274J20126C6995J23114m9350m9421
11489F1338J4002J62797e5699J0469o4725d8101P890p0205j0241C55809C1326
11477B80502j25475p3568l3267J57011J78380a86682C45127j46791g759B32242
11466E8359a14298C36553j21955c1806A56049k3601b5387G2791b603j6199k44992
11455b63794j58120G0580j1949j4483J05350D6127K4290d967j29553F3108a02053
$$ y = [206102, 28142, -141295, -286841, 261128, 66193, -132041, 124200, -167484, 67413, 367903, 421254, 137611, -150362, 113571, 203207, 71879, -268774, 91471, -40081, 13267, 112661, -125032, -104502, 31581, 230331, 226087, 27206, 227224, -5787, 34514, -48739, -38056, -87465, 108446, -15254, 32133, -99267, 262274, 382400, 36995, 160109, 110759, 61338, 75340, 238137, -55699, -45230, -109955, -48101, -40211, -110416, -120657, 355809, 31326, 280502, 155027, 81459, 48192, 205203, 383583, -186682, 345127, 198336, -7759, 232242, 58359, -114298, 336553, 214598, -31806, 156049, 132448, -25387, 72791, -2603, -18802, -263794, -421914, 70580, 58631, 44148, 149498, 46127, 70417, -4967, -134520, 63108, -102053]
11443A69732A6961h9697A59584n4005O3123c29955A25124d478j59200B36478F9685
11431A75567J93852o3483F5463K283d2296A13684b62234F3172Q4000N1218F7976
11419A26814D744J38695P8744j02108f6450h809B04976h9821A16797a21660k29298
11408c50958b9467r503A01097K3002j0685j8357a86725p3418J26254Q830a7268
11396B88074a26120a8656A54140A0193i328A36731j5487J418a32691B0363c42608
11384b44928A17436b7575Q755j86105j20559c4458j28832A02969d5583L943k73699
11373c15339a21011C25186e9629l4617j15416N1029A12214e3590k46335A5156
11362E8466b30650A91564d6835j47213e5067k8780k0251A32640b59585P9394A23894
$$ y = [169732, 16961, -89697, 159584, 105579, 168702, -329955, 125124, -4478, -163678, 236478, 69685, 175567, 369419, 305936, 65463, 67746, -42296, 113684, -262234, 63172, 147172, 198390, 67976, 126814, 4744, 143439, 222183, 120075, -66450, -8809, 204976, -89821, 116797, -121660, -350958, -29467, -38970, 101097, 124099, 113414, 95057, -186725, -260143, -133889, -125059, -17268, 288074, -126120, -18656, 154140, 10193, -9328, 136731, 121244, 122662, -132691, 20363, -342608, -244928, 117436, -27575, -18820, -204925, -325484, -34458, -163290, 102969, -45583, -41640, -315339, -121011, 325186, -59629, -94246, -209662, -158633, 112214, -53590, -299925, 15156, 58466, -230650, 191564, -46835, -194048, -55067, -83847, -104098, 132640, -259585, -180191, 123894]
11350B7764E420J67730b79783i7738n805G4248d9488B86507c21080D33487e277
11338a21919j12719d9171B70191N5797c16635H5930J45576D0346b61501j15533
11328c77034a08775A55544F2420b52846D7780j6920a49940j34823F2527K24982
11318B87509B8466d73071A43956o281a25772A12300O2293i1340F5688a00168A99666
11306C6771f6587A47999J45862A36910D6060h0757H9122c26820A68614a44197
11295a54415f3537F3463g7326d412k1206E0982b57443E6720J1880J3879e8478
11283c95175a7284k45871j57622h5326F7104k3697K3378g5798K7863k34670E8357
11271B71088l7268c74656J06991j39089a71019O5685l6900B05344a47130C55142
$$ y = [27764, 5420, 173150, -279783, -97738, -103543, 74248, -49488, 286507, -321080, 433487, -5277, -121919, -234638, -49171, 270191, 325988, -316635, 85930, 231506, 40346, -261501, -377034, -108775, 155544, 62420, -252846, 47780, 30860, -149940, -284763, 62527, 287509, 28466, -473071, 143956, 137675, -125772, 112300, 174593, -91340, 65688, -100168, 199666, 36771, -66587, 147999, 293861, 136910, 46060, -80757, 89122, -326820, 168614, -144197, -154415, -63537, 63463, -77326, -4412, -25618, 50982, -257443, 56720, 68600, 82479, -58478, -395175, -17284, -263155, -420777, -85326, 67104, 43407, 66785, -75798, -47935, -282605, 58357, 271088, 233820, -374656, -267665, -406754, -171019, -105334, -142234, 205344, -147130, 355142]
11260F6678a03655a0449k00503A62459o0287c12969J42824P4148j22869a7269
11249E9051a87633d310k06511O7563c3632A4882a27958l1035j19792o2555N1826
11238b89514h6598C6820K11833f09387B2452a98599O9717f0400j29559A07965
11227H794L029M1934J16293p6024l0241A1022h1749D8918a84771C7173h642n123
11215a3765j93510A31865O1497c8120j48633h6980b3306M656j63615e6080b2504
11203c7433j1495k34460g6493E8250a5805j89743C2146J83389a94368D28913a45229
11191d0725G3857Q8853c51086f4777D9234i6662M6155G7702c58778i2726r3725
11180a86451o0749j2791J19073C0234e4036G5084a43650b6093q5912A8355c6434
$$ y = [66678, -103655, -10449, -210952, 162459, 102172, -312969, -170145, -95997, -218866, -17269, 59051, -187633, -4310, -210821, -143258, -33632, 14882, -127958, -158993, -278785, -341340, -289514, -86598, 36820, 248653, -609387, 22452, -198599, -128882, -60400, -189959, 107965, 8794, 11823, 53757, 170050, 94026, 63785, 11022, -81749, 48918, -184771, 37173, -8642, -13765, -207275, 131865, 193362, -38120, -186753, -86980, -23306, -18650, -182265, -56080, -22504, -37433, -48928, -283388, -76493, 58250, -15805, -205548, 32146, 215535, -194368, 428913, -145229, -40725, 73857, 162710, -351086, -64777, 49234, -96662, -50507, 77702, -358778, -92726, -186451, -247200, -259991, -140918, 30234, -54036, 75084, -143650, -26093, -112005, 18355, -36434]
11168b64684J29502o4440a6770B05106E1144J45290a28878J7856j34484A33211
11157a35920J7461N1006n1578B40328k4523B6288f6408A09229g3960J1919A97184
11145c4112q5682E6465K97720I5124e57034h4759j20125B4849a89303H1058a12819
11133G1136b79038a00246F0280c63966C7625O8520d5830J8439F9862J82546D6025
11121H8953M162b37170A38764J25105H0218K0038B9624a29041c4555j20889m4691
11110b00135C1579L5391K52060r9520g8501A58556J04828G2516L15454h2671Q292
11099g4379L7053k14667h1775K6458E2193J51061b2696C30973j13241k3588B6023
11087H9890J73540j26420K07999J91532B04699D7417J17398D2214K09017E2177
$$ y = [-264684, -135182, -199622, -16770, 205106, 51144, 196434, -128878, -111022, -245506, 133211, -135920, -118459, -67453, -119031, 240328, 215805, 26288, -66408, 109229, -73960, -62041, 197184, -34112, -119794, 56465, 354185, 95124, -557034, -84759, -204884, 24849, -189303, 81058, -112819, 71136, -279038, -100246, 60280, -363966, 37625, 106145, -45830, -27391, 69862, 252408, 46025, 88953, 93115, -237170, 138764, 263869, 80218, 100256, 29624, -129041, -34555, -155444, -200135, 31579, 66970, 319030, 219510, -78501, 158556, 263384, 72516, 387970, -82671, -74379, -37326, -251993, -81775, -55317, 52193, 203254, -22696, 330973, 217732, 194144, 26023, 89890, 263430, 137010, 345009, 536541, 204699, 47417, 164815, 42214, 251231, 52177]
11076A34114M5210P84H5085M0608P6993C6417K79551o8163J05325f3388C95236
11064B69056j10430C6123O3147K75515A39458K31344J39465A67482L89825F1949
11053B17300L92494B23435K56092B16226K41913K2440P0766j82129M50192B16974
11042D87102N8529j45598J85042p2347M3655j31537J19216q1003J78373l19534
11032C21898K24304k31698R8433p8134M8707K37032r8323j35255J34049k20898
11022C00115O1277o3469K62552m8622m3998A72402J4389J44131J23386L03898
11012G58206C57516J31175J18918B62573J20415J71512l4372Q6088o4821j37996
11002D03399l2684j33286Q3208o2713R7370J43750B32257O05171k81590A35261
$$ y = [134114, 179324, 180108, 85085, 125693, 202686, 36417, 315968, 247805, 353130, -63388, 395236, 269056, 158626, 36123, 99270, 374785, 139458, 370802, 510267, 167482, 557307, 61949, 217300, 609794, 223435, 479527, 216226, 458139, 480579, 551345, 369216, 819408, 216974, 487102, 545631, 400033, 585075, 512728, 556383, 424846, 544062, 463059, 641432, 321898, 546202, 314504, 412937, 334803, 383510, 620542, 522219, 386964, 521013, 300115, 361392, 297923, 560475, 511853, 467855, 172402, 186791, 330922, 454308, 758206, 357516, 488691, 607609, 262573, 382988, 554500, 520128, 606216, 541395, 403399, 370715, 237429, 320637, 257924, 355294, 499044, 232257, 837428, 555838, 135261]
10991A98130L42223j21146M35150l60309j26100l3293J46149j18919N06645k13322
10981F55208j4409q0016K96121j66176K06508j27124m5370L04023Q6106r453L84936
10970A490354k15477L97203k7440N72L70586o53856M32072l22701J4586k66281
10960A219618r1758k7139J18347M2967L7011k4883P2351j25657j72739J11513
10950A159631m4201N8585k32562j74604L5395k84144K25696k57596j4547k4073
10940D47580j57730b8289D16935i4343D93498A95866J86170j06360H3046C0508
10929c37086a14181D7768K07448A03657J65860b9516R529l01329f1892B76140
10918f0185k3107A05505K06389a77295B2652a63664C79877H138c7092o7210H8997
$$ y = [198130, 540353, 419207, 854357, 494048, 367948, 334655, 480804, 361885, 868530, 655208, 640799, 560783, 856904, 690728, 897236, 770112, 724742, 1028765, 1114871, 1105418, 1490354, 1274877, 1672080, 1644640, 1645212, 2015798, 1361942, 1794014, 1471313, 1485899, 1219618, 1127860, 1100721, 1219068, 1262035, 1299046, 1274163, 1346514, 1220857, 1048118, 1159631, 1115430, 1174015, 941453, 766849, 802244, 518100, 743796, 486200, 471653, 447580, 289850, -28289, 416935, -94343, 493498, 195866, 382036, 275676, 83046, 30508, -337086, -114181, 47768, 255216, 103657, 269517, -29516, -19987, -321316, -61892, 276140, -60185, -83292, 105505, 311894, -177295, 22652, -163664, 379877, 8138, -37092, -104302, 88997]
10906B00300J83787D8675c8054l9793A13375A1127b9370m3693r7076A8696J03518
10895A22214f359B3958J56851j5849a23301H6485f8502j08654B66250a15840A52388
10883a33168c80k11501B55968a93515N8726a1754q5905D2977e33898E2433c49259
10871D0461a82530a2208A55006Q0861C2731J33532a46455r0354L2137A57734g8300
10859A19172K48886a06340A06269l4791b8209k30948A10478b51832b6538j97960
10849b24498f3873A04809L88260a70175j00359Q6294h2604L7999A96049J02888
10839B98937b86169a00133B75272g448m4014B25930c4733j00420F3095J69286
10829B32381c03842A62202G4576e2849p4201E4782d1582B35906a82075c4484j21676
$$ y = [200300, 384087, 48675, -38054, -77847, 113375, 11127, -29370, -73063, -170139, 18696, 122214, -6359, 23958, 180809, 164960, -123301, 86485, -68502, -177156, 266250, -115840, 152388, -133168, -380, -211881, 255968, -193515, -134789, -11754, -97659, 42977, -533898, 52433, -349259, 40461, -182530, -12208, 155006, 235867, 32731, 166263, -146455, -236809, -204672, 157734, -78300, 119172, 368058, -106340, 106269, 71478, -28209, -259157, 110478, -251832, -26538, -224498, -63873, 104809, 493069, -170175, -270534, -184240, -82604, -44605, 196049, 298937, -286169, -100133, 275272, -7448, -51462, 225930, -34733, -135153, 63095, 232381, -303842, 162202, 74576, -52849, -127050, 54782, -41582, 235906, -182075, -34484, -156160]
10818a56160H5653c21083a7695k67998A20886k1475a48810D1300L27901g0224
10807B60391G0785g6617A7261R8291k6812a99487h3992F8325f9869j4668j02854
10796a87391A20226L6553o81K345b0980j96033M51A17056E0367c03024B35322
10784d53269J67684i5284K6779A95782d5745n5783k48214a45990l30570a75389
10773a45644A45438a91316G7914Q3909l3907h9077j03895N3347A13553K2475a7807
10761e2531j35681j14124G1233c1542j32961D5358e1829j07597j12797R6406q2005
10750b57822b3838j04977q585A52638A2126J62404J61400b07766e9117G905L8091
10739D5996i423l12200B8866J14367Q7786H5702A951J98115b950k49888l5747
$$ y = [-156160, 85653, -321083, -17695, -285693, 120886, 99411, -148810, 41300, 369201, -70224, 260391, 70785, -76617, 17261, 115552, 88740, -199487, -83992, 68325, -69869, -84537, -187391, 120226, 156779, 156098, 158443, -20980, -217013, -216562, 117056, 50367, -303024, 235322, -453269, -285585, -95284, -68505, 195782, -45745, -101528, -349742, -145990, -476560, -175389, -145644, 145438, -191316, 77914, 161823, 127916, -89077, -192972, -139625, 113553, 136028, -17807, -52531, -188212, -302336, 71233, -31542, -164503, 45358, -51829, -159426, -272223, -175817, -257822, -23838, -128815, -137400, 152638, 12126, 174530, 335930, -207766, -59117, 7905, 45996, -9423, -321623, 28866, 143233, 231019, 85702, 1951, 200066, -2950, -252838, -288585]
10728b88585i6008q8106A49802h2493c0842j17721B65897r7713b99511G2196L9744
10717A11940a02932E8291g0102A25729c75952a1096k23908A14960a69888B66634
10706b37549m429m5096A68250e0688A4431L177J45336j8436a84400C462J19064
10695A22526o1235a61141G5153i3265j14274A21245a70797a2894k27213J01137
10685a38970d1140k09099B58552D0124d0433R31j58028J622f128j74719G8681
10673A20298N1691d5212A76259L65983c6475A67484J94423a523F7960j6388c95909
10661a68134H5033a57184k6398o4385a08923A6070a02124A50094E876c07144I247
10649C0413b19465A1629J06032n2854c38803B77062a80782E9098f4116G1939b16539
$$ y = [-288585, -96008, -184114, 149802, -82493, -30842, -148563, 265897, 168184, -299511, 72196, 111940, -102932, 58291, -70102, 125729, -375952, -11096, -235004, 114960, -169888, 266634, -237549, -241978, -287074, 168250, -50688, 14431, 17608, 162944, 144508, -184400, 3462, 122526, 61291, -161141, 75153, -93265, -207539, 121245, -170797, -12894, -240107, -138970, -41140, -250239, 258552, 40124, -40433, -39502, -197530, -195908, -6128, -180847, 78681, 120298, 171989, -45212, 176259, 542242, -36475, 167484, 361907, -1523, 67960, 51572, -395909, -168134, 85033, -157184, -183582, -247967, -108923, 16070, -102124, 150094, 5876, -307144, 9247, 30413, -219465, 11629, 117661, 64807, -338803, 277062, -180782, 59098, -64116, 71939, -216539]
10637G2873c9446q9841j10984n3196q6810B15370a14873A54944j1295d53243B51295
10625a3212C99224A67119a55114O454p4273k0142N4619B8341E847f7758C8691
10613a84623F7434c27031k44606C34112A44263b2247G3261b13028H3588b49680
10602H9724f6482A16473B9905b18154A48931n2877c95155J40704O5975o6464I2835
10590a05020A8142A903K08615a54136K9539A3671O5115l858K05039b75119o1113
10579c36232C97151A85224F635b08509B8771O8399C3124a98750N1698k39894a34821
10567d8613a8494j25266A8887b68434G3359a64764I0199O5494R897a73918n0246
10556b24164B01546a00390A46628D8260p283b76573A0586a21218K4498c6504E146
$$ y = [72873, -39446, -129287, -240271, -293467, -380277, 215370, -114873, 154944, 143649, -453243, 251295, -13212, 399224, 167119, -155114, -148660, -222933, -243075, -188456, 28341, 5847, -67758, 38691, -184623, 67434, -327031, -571637, 334112, 144263, -22247, 73261, -213028, 83588, -249680, 89724, -66482, 116473, 29905, -218154, 148931, 96054, -395155, -254451, -188476, -254940, 92835, -105020, 18142, 1903, 210518, -154136, -124597, 13671, 78786, 74928, 279967, -275119, -336232, 397151, 185224, 6635, -208509, 28771, 97170, 33124, -198750, -147052, -386946, -134821, -48613, -18494, -143760, 18887, -268434, 73359, -164764, 90199, 155693, 165590, -173918, -224164, 201546, -100390, 146628, 48260, 40977, -276573, 10586, -121218, -96720, -36504, 5146]
10544e6024C3365R1220E8750K5416L7043j2421b15767P0526j00356A13807a17023
10532a83235P2045G4206a76495B9154a45680P0623r3280A25732E3949J07227B593
10520B10966c3377F2005J16517A5629M8244O0769c01700h2628d0212B20298E6160
10508D9909h5797A36604k8599c9655A87988q7799a12313A0978b56723B41056b01780
10496A95638c0154H8535J57758B9438J66699b72714L7680J11986E91d88k52735
10485b53223A70001b39868Q3543B62544a26732B84980E7220J37007B4141L9559
10475F3700J35441Q9824r8810H6296J2637D283L39856a36856B7371d0491C19779
10463A39641i2711B4896J05092k4005J6612E0933J13835N8591d1799C10971a40858
$$ y = [-56024, 33365, 124585, 58750, 84166, 121209, 108788, -215767, -145241, -245597, 113807, -117023, -183235, -111190, 74206, -176495, 29154, -145680, -75057, -168337, 125732, 53949, 161176, 2593, 210966, -33377, 62005, 178522, 15629, 63873, 124642, -301700, -82628, -40212, 220298, 56160, 49909, -85797, 136604, 108005, -39655, 187988, 100189, -112313, 10978, -256723, 241056, -201780, 195638, -30154, 88535, 246293, 29438, 196137, -272714, -235034, -123048, 591, -488, -253223, 170001, -239868, -156325, 262544, -126732, 284980, 57220, 194227, 24141, 63700, 199141, 288965, 190155, 86296, 98933, 4283, 344139, -136856, 27371, -40491, 319779, 139641, -92711, 24896, 129988, 105983, 122595, 50933, 164768, 223359, -41799, 310971, -140858]
10451e8017j84622C5704a7299A03846f5735j08871a5326A56249b43720L7608J00746
10440a05366J347B1141b11977m9357e6484M177B13253c25947J02240n9062P6076
10429b06693E5641A1595a40932o4308K2018F13a19627n9132K2255e1523k86684
10418c38207C5125j1451K9997g8900b1864A79453c67894A87912g2547F1808a47584
10406b37810B2326b9525j76812B46850n5233a95787K1829j07972D2051J67119
10396B09170G2156K6486R6328c13742R4831A19778J54586G8845L4867a42291A2954
10384a06198B24360f6850p8669L2901E8577k0307f4687C3899a62176C84276G6310
10372A28168O9724n6633J68685A26343J75953o2114D1077K37176E2877K00180
$$ y = [-58017, -242639, 35704, -17299, 103846, -65735, -174606, -15326, 156249, -243720, -206112, -105366, -104019, 21141, -211977, -261334, -56484, -52307, 213253, -325947, -223707, -282769, -206693, 55641, 11595, -140932, -205240, -183222, 613, -119627, -178759, -156504, -51523, -338207, 35125, 23674, 53671, -78900, -21864, 179453, -367894, 187912, -72547, 61808, -147584, -237810, 22326, -29525, -206337, 246850, 191617, -195787, -173958, -281930, 42051, 209170, 72156, 98642, 194970, -313742, -218911, 119778, 274364, 78845, 113712, -142291, 12954, -106198, 224360, -66850, -145519, -112618, 58577, 38270, -64687, 33899, -162176, 384276, 76310, 128168, 197892, 141259, 309944, 126343, 302296, 240182, 41077, 278253, 52877, 253057]
10362B53057A0411L02098r4977r3192M2256L08247A43290b46246R6267I6505b9800
10350A20674a11488B58169K18444k27463p0834B7507Q5718P6662J94774j08478
10340B76183r6708b83571G8806J48731G2248L19092A75307A4039Q3633B1877c1322
10328a25584f0741D15252F6714J61297j12692R4984a26565B2098K47534k6206
10318B43426k9204b60353A75952C8712c7696I5487J97404A07931J67936q9509
10308A86358I212J26635i8544B03164q2717N4716f8833k28445J42766p5353H084
10296a64992M991B34402i4344L5011A37081b40904J12493B63125r6182J75902
10286C42845q5740a91148A45475k4636a75876J9841E9632e3421j53184o7470G1910
$$ y = [253057, 10411, 312509, 217532, 124340, 166596, 474843, 143290, -246246, -149979, 96505, -29800, 120674, -111488, 258169, 476613, 249150, 178316, 27507, 113225, 189887, 384661, 276183, 179475, -283571, 78806, 227537, 72248, 391340, 175307, 14039, 97672, 21877, -31322, -125584, -60741, 415252, 66714, 228011, 115319, 210303, -126565, 22098, 269632, 243426, 214222, -260353, 175952, 38712, -37696, 95487, 292891, 107931, 275867, 186358, 9212, 135847, -98544, 203164, 120447, 175163, -68833, -297278, -154512, -229865, 8084, -164992, -160001, 234402, -94344, -59333, 137081, -240904, -128411, 263125, 166943, 342845, 257105, -191148, 145475, 120839, -175876, -156035, 59632, -53421, -206605, -274075, 71910]
10274c03838A9004H045b43412A32618a34670H2643J14850O2186J7728c8848n2756
10263i1604a5365A54610D3366a44713O3311K6722A40013o9848a0405H7925K17766
10252C05691n6551G1360j217J9450C0952M3518c75252B15239c06355A65609J1495
10241A77104a19522G5349b04098B2566K14389b08916Q5198l7903D0928K33041
10231B73969a65418j49341Q3283f2177F0150b30250A08996n2283L2719J6502K2992
10220A28926l8595L164b35029A73690A7058c19989B0132a5879k03921N8403H3081
10208b0175M446A13727c23290P3556a23814e2166j34394A29083b2259f140k93507
10197b99647A02499a81785F1664N5841b75335A73272a40372j12418f5005b5103
$$ y = [-303838, 19004, 8045, -243412, 132618, -134670, 82643, 197493, 259679, 277407, -38848, -91604, -15365, 154610, 43366, -144713, -81402, -54680, 140013, 70165, -10405, 87925, 305691, 249140, 71360, 70143, 89593, 30952, 74470, -375252, 215239, -306355, 165609, 177104, -119522, 75349, -204098, 22566, 236955, -208916, -123718, -161621, 40928, 273969, -165418, -314759, -231476, -62177, 60150, -230250, 108996, 56713, 89432, 105934, 128926, 90331, 93495, -235029, 173690, 17058, -319989, 20132, -15879, -219800, -161397, 83081, -20175, -15729, 113727, -323290, -249734, -123814, -52166, -186560, 129083, -22259, -6140, -299647, 102499, -181785, 61664, 117505, -275335, 173272, -140372, -252790, -65005, -25103]
10186f2420G2809N5736h749j95182g7189p5196g297B26878f0598O315B06494a24226
10173f6057A59778b3928m4799A55143J25907b00733g3322j88493C12303e1807
10162a17734e831k22842B36670a07538A1774R6419c19709E41411g5662k91391
10152c67053a19885H1664M74885A78939h2181l7013k3213A28632a83187b6707
10141A1475f598r1672k8682A35217E1195a92678C3211M8381a18718m40031D26940
10129e5514k78889a33727B1195M6230a60613C02662A34885D0711i2639B6493a76862
10117a95343B9428j3873P2607b15070l1067L8687P1484c6585B81431g8753F2614
10105A21862k5619c46010O1786Q2757h9657F4766h1850E0915e7199C3358c51819
$$ y = [-62420, 72809, 128545, -8749, -203931, -77189, -152385, -7297, 226878, -60598, -54283, 206494, -124226, -66057, 159778, -23928, -68727, 155143, 281050, -200733, -73322, -261815, 312303, -51807, -117734, -5831, -228673, 236670, -107538, 11774, 108193, -319709, 541411, -75662, -367053, -119885, 81664, 556549, 178939, -82181, -119194, -142407, 128632, -183187, -26707, 11475, -6598, -98270, -126952, 135217, 51195, -192678, 33211, 81592, -118718, -558749, 426940, -55514, -334403, -133727, 21195, 67425, -160613, 302662, 134885, 40711, -92639, 26493, -176862, -195343, 29428, 15555, 88162, -215070, -246137, -207450, -135966, -36585, 281431, -78753, 62614, 121862, 96243, -346010, -284224, -201467, -89657, 64766, -81850, 50915, -57199, 33358, -351819]
10093a54818j00149A77853e6136j45611A24626k5829a31873m5217j23462J24769
10083a75783A78569a80626o624B0574d39494D7939e2237k05280A09255b87236
10072G8057e0406A49132c75482A76924b30339n6943a39591D1229b60264A52518
10061D13816A32232b13999e3364m8449L501k05378i4366q3003A8660J89115e7431
10049b499H5232b70796E098P2067A1353c66004i4524j68247f7175C2210J20006
10038A52216o0447e3421Q880D2315a50074A02395d3913j91597N203B35788g2678
10026c25727A41042c05294J09429M989E4507K65638a49212f7855a7127k52104
10016b69231h6579C9866f0742A55504c43342G1612j3505J16066b98440h7258r2012
$$ y = [-154818, -254967, 177853, -56136, -201747, 124626, 98797, -131873, -177090, -300552, -175783, 178569, -180626, -187250, 20574, -439494, 47939, -52237, -257517, 109255, -287236, 78057, -50406, 149132, -375482, 176924, -230339, -287282, -139591, 41229, -260264, 152518, 413816, 132232, -213999, -53364, -101813, -98312, -303690, -94366, -177369, 18660, 207775, -57431, -2499, 85232, -270796, 5098, 77165, 11353, -366004, -94524, -262771, -67175, 32210, 152216, 91769, -53421, -44541, 42315, -150074, 102395, -43913, -235510, -230307, 235788, -72678, -325727, 141042, -305294, -195865, -190876, 54507, 320145, -149212, -67855, -17127, -269231, -86579, 39866, -60742, 155504, -343342, 71612, 58107, 174173, -298440, -87258, -179270]
10005a79270A48774a70821d97m57723D705b07366G6745a96621B6840i4557G5323
9993a1156j15894O036r0502g0380H485K1641a54422a4181C2424c85727h9849A37395
9980b89129g9193j79122D2010a0857j4869E08159D0594J5867O5565E0367a24025
9968b97942O6434H5718g6103F5611J1366d2129F3064e083R23A26999b26991j53548
9956c80539a67396g9803j03546m3966p7560e3694o598j24947j13076B5000a93968
9944g1188O226n4470j04739c6808A02342a56675A54344d1285j56699k02701a59608
9932A88771D0719b31003c3827n1717k05739a05721K6208j54799J11342b7522l7725
9921f5247a6070l21331D6608c62034g421B22133k8123b83418N9463J5901E0090
$$ y = [-179270, 148774, -170821, -497, -458220, 4705, -207366, 76745, -196621, 26840, -94557, 75323, -11156, -127050, -121014, -211516, -70380, 8485, 30126, -154422, -14181, 32424, -385727, -89849, 137395, -289129, -79193, -258315, 42010, -10857, -25726, 508159, 40594, 56461, 122026, 50367, -124025, -297942, -231508, 85718, -76103, 65611, 76977, -42129, 63064, -5083, -4160, 126999, -226991, -380539, -167396, -79803, -183349, -227315, -304875, -53694, -60292, -185239, -298315, 25000, -193968, -71188, -64962, -119432, -224171, -36808, 102342, -156675, 154344, -41285, -197984, -400685, -159608, 188771, 40719, -231003, -33827, -85544, -291283, -105721, -79513, -234312, -122970, -27522, -65247, -16070, -337401, 46608, -362034, -7421, 222133, 194010, -283418, -223955, -208054, 50090]
9909c79445A6751c1117D7661J41981C0965h0027c3736l68491Q2935R4610a4440
9897b7179A20792a55494o6200A03419A8979n186a63229g7860B7768b0226l7211
9886e7437C0451a97252A71384F6448K29187i624l06348E9840H626a23054j33678
9875b56732H4139L5678a49713f5743J6868j92372j73150B4548a94359n9734R0210
9864a63883b9466n3815A57428d39712G5427d9808E2142r715P9707d73708C1596
9852a46047j94398A41423a53111g419E8716e4068F0968L6643J9009a35843a8475
9840a14739o3264O6206l14585A4417g9534K8485B08828m5840A4754J99495B365
9828b51162d8214k4028J883F7438b41136m8467a552k67217C05164d7609m5909
$$ y = [-379445, 16751, -31117, 47661, 189642, 30965, -80027, -33736, -402227, -319292, -224682, -14440, -27179, 120792, -155494, -221694, 103419, 18979, 13793, -163229, -77860, 27768, -20226, -57437, 30451, -197252, 171384, 66448, 295635, -9624, -315972, 59840, 8626, -123054, -256732, 84139, 119817, -149713, -65743, -48875, -241247, -414397, 24548, -194359, -254093, -163883, -29466, -83281, 157428, -439712, 75427, -49808, 52142, 42427, 122134, -473708, 31596, -146047, -340445, 141423, -153111, -7419, 58716, -54068, 60968, 97611, 116620, -135843, -18475, -114739, -178003, -111797, -426382, 14417, -79534, -51049, 208828, 162988, 14754, 214249, 2365, -251162, -48214, -72242, -70359, 67438, -241136, -289603, -1552, -268769, 305164, -47609, -93518]
9817i3518j08524J8414i1151A07569n0851J03390j6570b29070G061c95935f6324
9805A47353c82961J40996B60200A02515c66721J7897a53389l72398J80278B64485
9794E3265f3343B31658D8964A689b02116e4111B73487G3150c517k76025d3255
9782c3492I675b01266A0225a73536P3259r0503J1464r0607e0141m1981k97438
9771c89560O9010a39171G1688M6924L1117F0774b56496g7290j12811d0521k30041
9760b70562I3739b20599l443j71863C6931a10856m0902A20416i6150k4450P737
9749a12863r7434o7783b8233k52245a8501j90212f29j7001I167b77385P6984A15986
9736C8266A2500a42242j51580J0884K1718d0500B50608g705r3314L6341j43910
$$ y = [-93518, -202042, -183628, -91151, 107569, 56718, 160108, 143538, -229070, 7061, -395935, -66324, 147353, -382961, -241965, 260200, 102515, -366721, -348824, -153389, -525787, -345509, 264485, 53265, -63343, 231658, 48964, 1689, -202116, -54111, 273487, 73150, -3517, -279542, -43255, -33492, 9675, -201266, 10225, -173536, -100277, -190780, -179316, -269923, -50141, -92122, -389560, -320550, -139171, 71688, 118612, 149729, 60774, -256496, -77290, -190101, -40521, -270562, 93739, -220599, -224042, -395905, 36931, -110856, -151758, 120416, -96150, -120600, -112863, -210297, -278080, -28233, -280478, -18501, -208713, -629, -17630, 9167, -277385, -200401, 115986, 38266, 12500, -142242, -293822, -282938, -261220, -40500, 250608, -7705, -101019, -64678, -208588]
9725b08588A03016d5916a7448l48314a11879B55415c10072F0593J166a53531o9516
9714b23047A52270I565a48552M6553L9310l3957q6889C08135d1250k6325o1007
9703a28582F804b5646A6359d3574A50366D9685Q8239l5342a34909I0173J12753
9692B02926c90620f0602j04447m0132A00322f9554q8248B7056K6557b59640B21377
9680d99l04396a22673F7137l0748K0193O701a0970k12905K5979l4109a8778A43989
9667c5731A12347f3117A1941P4087R2178e1257H232b83100A40771b6985k26611
9656b53596c5186q0109D3110b26532B09348k800h3836A28628a77416C7421b9991
9644A14934a98252C2088b80439A1811b52163N2571B80903j0786d877k26731J13212
$$ y = [-208588, 103016, -45916, -17448, -365762, -111879, 255415, -310072, 60593, 61759, -153531, -223047, 152270, 9565, -148552, -101999, -62689, -96646, -183535, 308135, -41250, -67575, -128582, 6804, -25646, 16359, -43574, 150366, 49685, 137924, 102582, -134909, 90173, 202926, -390620, -60602, -165049, -205181, 100322, -69554, -157802, 27056, 53613, -259640, 221377, -499, -304895, -122673, 67137, 36389, 56582, 63283, -10970, -223875, -197896, -232005, -18778, 143989, -35731, 112347, -63117, 11941, 86028, 178206, -51257, 8232, -283100, 140771, -26985, -253596, -35186, -115295, 43110, -226532, 209348, 206548, -83836, 128628, -177416, 37421, -29991, 114934, -198252, 32088, -280439, 11811, -252163, -199592, 280903, 270117, -4877, -231608, -118396]
9633a18396B39167g4414A52235b8619A2272d382B11376a23451G8768d17225K01592
9622b15633P2447A71580N0718d0405o074H6521j5135c1273k2909E9717a22173
9610A03008a21613A07904a66189f2430D22530b83630a02545a8695l8081G4758
9599A00998j8958c02210a18137p8390h5686L5727A6287J03927a01679r3178k11776
9588d06633A69341b67430a04900b0311k60549K0241N7213R4291n3489L8900A31707
9576D0192J80083c84789k6040H7377i3324k1611k1897A16399g4653k60928a57445
9564b27793B5552a64639c8649k96636c3366F3172Q9484d8438A13705b26557b7975
9552f4479D6843b96620L3386B87132d8483A69116a24589d473k04225k16875a25627
$$ y = [-118396, 239167, -74414, 152235, -28619, 12272, -4382, 211376, -123451, 78768, -417225, -215633, -143186, 171580, 222298, -40405, -46479, 86521, 71386, -31273, -54182, 59717, -122173, 103008, -121613, 107904, -166189, -62430, 422530, -283630, -102545, -18695, -56776, 74758, 100998, 82040, -302210, -118137, -196527, -85686, -49959, 16287, 120214, -101679, -194857, -406633, 169341, -267430, -104900, -20311, -280860, -260619, -203406, -109115, -162604, -123704, 131707, 40192, 220275, -384789, -410829, 87377, -93324, -114935, -136832, 116399, -74653, -335581, -157445, -227793, 25552, -164639, -38649, -335285, -33366, 63172, 152656, -48438, 113705, -226557, -27975, -64479, 46843, -296620, -263234, 287132, -48483, 169116, -124589, -4473, -208698, -425573, -125627]
9540g5219q160I0178h7956B13651f7546C8424c8766A50859b20737j2863A01996
9528B9486a35132k05720G5136C6682N1700J0028a15262j0705C6237b13034c06
9516a11497r2184N6548n0789N269D9930a87127E0071a46574I8127D7438K33152
9505B80590a97541P8893d7548j27051d1860n0897B59727j5677G5903L5309m4726
9494F6486b226j21877j0336I1848b38089k054m1898B1297c89412A12829D922M2107
9482D7029k2475R476b9590j38359e6369E7718b32493q8066A10229b73122d404
9470b23772H1741D265b89273b8998B0162e9968A08152b61477g4111I8740p730
9459I1010a38119J5315E8689L7804a02539A21019f6880A69657b68787J09130C0378
$$ y = [-75219, -83379, 90178, -87956, 213651, -67546, 38424, -38766, 150859, -220737, -233600, 101996, 29486, -135132, -340852, 75136, 36682, 88382, 98410, -115262, -125967, 36237, -213034, -306, -111497, -203681, -147133, -197922, -192653, 49930, -187127, 50071, -146574, 98127, 47438, 280590, -197541, -118648, -47548, -174599, -41860, -92757, 259727, 244050, 75903, 111212, 66486, -2226, -124103, -134439, 91848, -238089, -240143, -282041, 21297, -389412, 112829, 4922, 47029, 24554, 34030, -29590, -167949, -56369, 57718, -232493, -320559, 110229, -273122, -4404, -223772, 81741, 4265, -289273, -28998, 20162, -59968, 108152, -261477, -74111, 98740, 91010, -138119, -122804, 58689, 96493, -102539, 121019, -66880, 169657, -268787, -159657, 30378]
9447C25071a04785k54888N2183a17316c3270I3410a24712e0151j53770i4074M6472
9436d7602A11857J50425C3441b73096h4109j6571E4245a40805A83027a46535K1653
9425a24882K0260L6117C05392F6473a52158G9038c87237H261a04560e1472j12511
9414a63983f2259A22018c576o6756k24530H125K04219b23527J08764k4289A60079
9402c15669P3840a5351H104a83822j63021a69807C0165b04880a0041B9680a99867
9390a12620b6670A8107q369e6140j20618A1791e3726A45775b05083A27165c92941
9378a24236o1056A36194C8355b7984j8997H8341h1948b3948m9749A5539A012i585
9365B6912a66254A97958a04580B53334a40152C8336J5424d0376k05510l4798A6315
$$ y = [325071, -104785, -359673, -307490, -117316, -33270, 93410, -124712, -50151, -203921, -94074, -47602, 111857, 262282, 33441, -273096, -84109, -100680, 54245, -140805, 183027, -146535, -124882, -104622, -68505, 305392, 66473, -152158, 79038, -387237, 8261, -104560, -51472, -163983, -62259, 122018, -3576, -70332, -294862, 8125, 212344, -223527, -114763, -139052, 160079, -315669, -241829, -15351, 8104, -183822, -346843, -169807, 30165, -204880, -10041, 29680, -199867, -112620, -26670, 18107, 9738, -56140, -176758, 11791, -53726, 145775, -205083, 127165, -392941, -124236, -185292, 136194, 38355, -27984, -46981, 88341, -81948, -23948, -73697, 15539, 1012, -9585, 26912, -166254, 197958, -104580, 253334, -140152, 38336, 53760, -40376, -245886, -280684, 16315]
9353c01014L8127J03744O1874B16642A05033L8804a29533C5045a10765C9604L6144
9342G5748e0328A80460g07H002f4916A00882b45781j4865A33924f7265j46176
9331b13441h3828I5725b20928A00599e0116L492F9054i9242B37365b58344C37531
9319B6523a50190O4716I1700b60658J17932F827J02704i59l71349A9431a54348
9307a73448B51903F6977c7178g310l63834e3466A33652N2820R7525c28988B5438
9295B0938c1067A34999b42262J8925J8270j35161B27454H517a26709A70997a51959
9283c30823D6675a09374l0250m2639m9918J882d845j25745F1061K35147E6756
9271b33302f7300r5175l2774A3937c87317B39490Q2235b01730H8616D0672O3209
$$ y = [-301014, -262887, -159143, -97269, 216642, 105033, 143837, -129533, 35045, -110765, 39604, 75748, -50328, 180460, -707, 8002, -64916, 100882, -245781, -260646, 133924, -67265, -213441, -83828, 95725, -220928, 100599, -50116, -46624, 69054, -99242, 237365, -258344, 337531, 26523, -150190, -85474, 91700, -260658, -142726, 6827, 109531, -959, -372308, 19431, -154348, -173448, 251903, 66977, -37178, -7310, -371144, -53466, 133652, 186472, 283997, -328988, 25438, 20938, -31067, 134999, -242262, -223337, -205067, -340228, 227454, 8517, -126709, 170997, -151959, -330823, 46675, -109374, -139624, -182263, -232181, -230299, -4845, -130590, 61061, 296208, 56756, -233302, -67300, -162475, -195249, 13937, -387317, 239490, 321725, -201730, 88616, 40672, 103881]
9260A03881e0272H7819b61742G0688J23738E5790c95014C6487c32409h8765K4690
9249f4075a7165C2457f4235D2993a88755f5617j90031a3299l23374a0125A20315
9237B30920G9864B069b77644a01509A39546J54226e9792j39176b4234k55527C0307
9225b48046h2637j44592D2613b36652J00702f0485b5135F6234J29603D1962b30976
9213B71298a10731j6097O2923D6143A1513b2904k0340l2350m3456M8550o3303
9202a33803e4816j14167R969A12081f8631j97217g8947l0418d16j74523g4075
9190G4058i6092R898A43365A1684R8869c7741I013L67315A49149D6070a0681j44913
9178a55594C3949h703p78365B01311B3790c5949A98973H7891b02089h1265j29522
$$ y = [103881, -50272, 87819, -261742, 70688, 194426, 55790, -395014, 36487, -332409, -88765, -64075, -17165, 32457, -64235, 42993, -188755, -65617, -255648, -13299, -336673, -10125, 120315, 230920, 79864, 2069, -277644, -101509, 139546, 293772, -59792, -198968, -24234, -279761, 30307, -248046, -82637, -227229, 42613, -236652, -135950, -60485, -25135, 66234, 195837, 41962, -230976, 271298, -110731, -126828, -63905, 46143, 11513, -22904, -43244, -75594, -119050, -70500, -133803, -54816, -168983, -159014, 112081, -68631, -265848, -78947, -109365, -416, -174939, -74075, 74058, -96092, -86194, 143365, 11684, 110553, -37741, 9013, 376328, 149149, 46070, -10681, -155594, 33949, -8703, -787068, 201311, 23790, -35949, 198973, 87891, -202089, -81265, -210787]
9167b10787c7525l05395A31130c1628A03364P7241a89601k6852j0881L6516J7141
9156a73677A65878g5284a2100o1722B79538a54174A72693G760b92506J08996M7645
9145a35865B4878a37786C65601C151a56678l42332a13371C746J77430i9513I6810
9133A66386N0755d7957j75306K1790A26178j2029b8065I4951J20006j02744a99454
9121a10783c3732P372m3511b8721j09424A38365J9881b59372J22725j14065m8571
9110b99283h4468B33208j6618i6592E6858b23692q3319B02501J06614a91589d1625
9098B92916b29717O7061O9745j47658c5429F0169d2034k70597q9724a1755E808
9086A30459a1919k18722f5934E8376a73530F4505a91266a1460n9709A36162a42859
$$ y = [-210787, -37525, -342920, 131130, -31628, 103364, 180605, -189601, -216453, -227334, -190818, -173677, 165878, -75284, -12100, -73822, 279538, -154174, 172693, 7760, -292506, -183510, -135865, 24878, -137786, 365601, 3151, -156678, -499010, -113371, 3746, 181176, -99513, 96810, 166386, 217141, -47957, -223263, -201473, 126178, 114149, -28065, 94951, 214957, 112213, -199454, -110783, -33732, -26360, -69871, -28721, -138145, 138365, 158246, -259372, -136647, -250712, -299283, -84468, 233208, 216590, -96592, 56858, -223692, -307011, 202501, 309115, -191589, -41625, 292916, -229717, -162656, -92911, -240569, -35429, 60169, -42034, -312631, -402355, -11755, 5808, 130459, -11919, -230641, -65934, 58376, -173530, 64505, -191266, -11460, -71169, 136162, -142859]
9074b82334b3144A4024b79759O5720B28111C7115d738m7440C21134G9127a05523
9062a62179H5644a78340a4116H7249B5377a58572n2424Q8067L2896L3721j07152
9051a63464j79965j5607E60d5920k9552j80951i259j28366M2593b5864B35545
9039I166J69777n7850a00798C24713b53312c3520H6713a13605j4517k5368K9319
9028a24171L597B4246J65243b92353A94391c16171e0645A46074b9945B39516a06532
9016F4979c62083A96871a28401A55782c1169j20668A99004C9977i1617j57677
9006b49294l8264J39680a0679m6840j39360f2171E8777E28J22225f8663o5927
8995a34590B36418b5434l573r1026n1642A88028A4795J23882a46423A96044g1416
$$ y = [-282334, -23144, 14024, -279759, -214039, 228111, 37115, -4738, -52178, 321134, 79127, -105523, -162179, 85644, -178340, -14116, 87249, 25377, -158572, -210996, -122929, -90033, -56312, -163464, -343429, -359036, 560, -45920, -75472, -256423, -9259, -137625, -95032, -25864, 235545, 9166, 178943, 121093, -100798, 324713, -253312, -33520, 86713, -113605, -128122, -153490, -124171, -120574, 24246, 189489, -292353, 194391, -316171, -50645, 146074, -29945, 239516, -106532, 64979, -362083, 196871, -128401, 155782, -31169, -151837, 199004, 39977, -91617, -249294, -287558, -147878, -10679, -57519, -196879, -62171, 58777, 528, 122753, -68663, -134590, 236418, -25434, -29007, -120033, -171675, 188028, 14795, 138677, -146423, 196044, -71416]
8983a74645j00193D1999J95500i0140B3487J78821J32709b65779a05370k22371
8973c27741C10679c5442A62885a74115k03327a65972H7198J09502E0655M7294
8963I7949m5356a19649M6562j13785G1235L8986a51312C2146K77929a79040e3062
8951B24480a3640j94415A5158a06802k84381a16283c7872j4820q8048M7779J1486
8940h1475r4366L5889o853d6771A31914a49475d5684A11908J6145a09797d6839
8928C26715a03597L4511m6646D3200b74889B92130b86059d2808C43351Q14964
8918A158315k77246B41723A8173M0021f2468E799N3488B7148h6923j85935R9468
8907a73390n1378A1474d3070f018l2921k09094O0458c8787q7670m0327B75535
$$ y = [-174645, -274838, 41999, 237499, -90140, 23487, 202308, 335017, -265779, -105370, -327741, 310679, -35442, 162885, -174115, -377442, -165972, 87198, 196700, 50655, 97949, 52593, -119649, -73087, -186872, 71235, 110221, -151312, 32146, 310075, -179040, -53062, 224480, -13640, -208055, 15158, -106802, -391183, -116283, -37872, -52692, -140740, -92961, -81475, -175841, -139952, -146805, -46771, 131914, -149475, -45684, 111908, 128053, -109797, -46839, 326715, -103597, -69086, -115732, 43200, -274889, 292130, -286059, -42808, 343351, 1158315, 881069, 241723, 18173, 58194, -62468, 5799, 59287, 27148, -86923, -272858, -173390, -224768, 11474, -43070, -6018, -38939, -248033, -187575, -38787, -126457, -166784, 275535]
8895i4730I4040K9620a77365B23653c17147a36714J0446l3900M5171C2688b05979
8883b18754J2934H6392b35887E9687g3426o11B12069r0020a33658a5649G3185
8871A4867b86724F2153m314a2566C8990H635a20216E3758a20628c9460J2789E7447
8858a396H0898K56200c08674N3114J1036J19004B09149o6231b0129E0407L5177
$$ y = [-94730, 94040, 123660, -177365, 223653, -317147, -136714, -126268, -160168, -114997, 32688, -205979, -218754, -205820, 86392, -235887, 59687, -73426, -74037, 212069, 122049, -133658, -15649, 73185, 14867, -286724, 62153, 57839, -12566, 38990, 8635, -120216, 53758, -120628, -39460, -26671, 57447, -1396, 80898, 337098, -308674, -255560, -244524, -125520, 209149, 142918, -20129, 50407, 85584]
$$ [...]
##END NTUPLES=NMR SPECTRUM
##END=
