##TITLE=NES1041_872015081_9242725_9DfBnm12dO
##JCAMPDX= 6.0         $$ Bruker NMR JCAMP-DX V2.0
##DATA TYPE= NMR SPECTRUM
##DATA CLASS= NTUPLES
##ORIGIN= BRUKER
##OWNER= Administrator
$$ 1.72 TOPSPIN		Version 2.1
$$ 2015-06-23 17:59:24.108 -0700  Administrator@X
$$ Compression mode = diff/dup
##.OBSERVE FREQUENCY= 400.02188249412
##.OBSERVE NUCLEUS= ^1H
##.ACQUISITION MODE= SIMULTANEOUS (DQD)
##.ACQUISITION SCHEME= undefined
##.AVERAGES= 64
##.DIGITISER RES= 22
##SPECTROMETER/DATA SYSTEM= spect
##.PULSE SEQUENCE= noesygpps1d.comp
##.SOLVENT NAME= COFFEE_meoh
##.SHIFT REFERENCE= INTERNAL, COFFEE_meoh, 1, 14.96262
##AUDIT TRAIL= $$ (NUMBER, WHEN, WHO, WHERE, PROCESS, VERSION, WHAT)
$$ ##TITLE= Audit trail, TOPSPIN		Version 2.1
$$ ##JCAMPDX= 5.01
$$ ##ORIGIN= Bruker BioSpin GmbH
$$ ##OWNER= Administrator
$$ $$ E:\/data/COFFEE/nmr/NES1041_872015081_9242725_9DfBnm12dO/12/pdata/1/auditp.txt
$$ ##AUDIT TRAIL=  $$ (NUMBER, WHEN, WHO, WHERE, PROCESS, VERSION, WHAT)
(   1,<2015-06-23 17:59:18.873 -0700>,<Administrator>,<X>,<go>,<TOPSPIN 2.1>,
      <created by zg
	started at 2015-06-23 17:47:49.279 -0700,
	POWCHK enabled, PULCHK disabled,
       configuration hash MD5:
       21 0F 79 D6 B3 7B B4 F6 88 20 88 DB 03 48 BD 9F
       data hash MD5: 64K
       15 E0 37 EF F7 8F E6 70 2D 39 49 C9 CE 5B 86 04>)
(   2,<2015-06-23 17:59:22.076 -0700>,<Administrator>,<X>,<proc1d>,<TOPSPIN 2.1>,
      <Start of raw data processing
       efp LB = 0.3 FT_mod = 6 PKNL = 1 PHC0 = 0 PHC1 = 0 SI = 128K 
       data hash MD5: 128K
       22 90 5C 4A C3 16 DB 1E 55 FC 75 75 19 04 4C AC>)
(   3,<2015-06-23 17:59:22.951 -0700>,<Administrator>,<X>,<proc1d>,<TOPSPIN 2.1>,
      <pk PHC0 = -86.09436 PHC1 = 0 
       data hash MD5: 128K
       40 E9 56 FA 55 A6 27 39 9A 1D C4 C6 BB DD D3 7B>)
(   4,<2015-06-23 17:59:23.311 -0700>,<Administrator>,<X>,<proc1d>,<TOPSPIN 2.1>,
      <abs ABSG = 1 
       data hash MD5: 128K
       58 46 4E 9C 97 79 DF 6A 64 57 6D 78 9F E1 6C 40>)
(   5,<2015-06-23 17:59:23.404 -0700>,<Administrator>,<X>,<proc1d>,<TOPSPIN 2.1>,
      <abs ABSG = 2 
       data hash MD5: 128K
       58 BC 9D 12 D5 9A 88 63 FC 36 42 3E EC 4D 2B C4>)
(   6,<2015-06-23 17:59:23.498 -0700>,<Administrator>,<X>,<proc1d>,<TOPSPIN 2.1>,
      <abs ABSG = 3 
       data hash MD5: 128K
       5E 3F AB 7B A2 0F 87 34 A7 A6 37 6A 95 15 BD D7>)
(   7,<2015-06-23 17:59:23.576 -0700>,<Administrator>,<X>,<proc1d>,<TOPSPIN 2.1>,
      <abs ABSG = 4 
       data hash MD5: 128K
       FA 9E 5F CA 0B 8A B5 C2 EE AA 98 5B 0E 05 23 73>)
(   8,<2015-06-23 17:59:23.670 -0700>,<Administrator>,<X>,<proc1d>,<TOPSPIN 2.1>,
      <abs ABSG = 5 
       data hash MD5: 128K
       BA 46 73 39 11 4E F6 98 5E B7 D9 8B 8D 84 C8 ED>)
$$ ##END=
$$ 
$$ $$ hash MD5
$$ $$ 9F F8 CE AD EC BC D2 73 F6 52 4A 36 52 1F 5B 6F
##$RELAX= 
##$RELAX= 
##$RELAX= 
##$RELAX= 
##$RELAX= 
##$RELAX= 
##$RELAX= 
##$RELAX= 
$$ Bruker specific parameters
$$ --------------------------
##$DU= <E:\>
##$EXPNO= 12
$$ [...]
##$TP07= 0
##$TPNAME0= <>
##$TPNAME1= <>
##$TPNAME2= <>
##$TPNAME3= <>
##$TPNAME4= <>
##$TPNAME5= <>
##$TPNAME6= <>
##$TPNAME7= <>
##$TPOAL= (0..7)
0.5 0.5 0.5 0.5 0.5 0.5 0.5 0.5
##$TPOFFS= (0..7)
0 0 0 0 0 0 0 0
##$TUNHIN= 0
##$TUNHOUT= 0
##$TUNXOUT= 0
##$USERA1= <user>
##$USERA2= <user>
##$USERA3= <user>
##$USERA4= <user>
##$USERA5= <user>
##$V9= 5
##$VALIST= <valist>
##$VCLIST= <CCCCCCCCCCCCCCC>
##$VD= 0
##$VDLIST= <DDDDDDDDDDDDDDD>
##$VPLIST= <PPPPPPPPPPPPPPP>
##$VTLIST= <TTTTTTTTTTTTTTT>
##$WBST= 2048
##$WBSW= 25
##$XGAIN= (0..3)
0 0 0 0
##$XL= 0
##$YL= 0
##$YMAX_a= 6384087
##$YMIN_a= -12331838
##$ZGOPTNS= <>
##$ZL1= 120
##$ZL2= 120
##$ZL3= 120
##$ZL4= 120
##$ABSF1= 14.96262
##$ABSF2= -5.595562
##$ABSG= 5
##$ABSL= 3
##$ALPHA= 0
##$AQORDER= 0
##$ASSFAC= 0
##$ASSFACI= 0
##$ASSFACX= 0
##$ASSWID= 0
##$AUNMP= <proc_prof1d_extract.lims>
##$AXLEFT= 0
##$AXNAME= <>
##$AXNUC= <1H>
##$AXRIGHT= 0
##$AXTYPE= 0
##$AXUNIT= <>
##$AZFE= 0.1
##$AZFW= 0.1
##$BCFW= 0
##$BC_mod= 0
##$BYTORDP= 0
##$COROFFS= 0
##$CY= 15
##$DATMOD= 1
##$DC= 0
##$DFILT= <>
##$DTYPP= 0
##$F1P= 0
##$F2P= 0
##$FCOR= 0.5
##$FTSIZE= 131072
##$FT_mod= 6
##$GAMMA= 0
##$GB= 0
##$INTBC= 1
##$INTSCL= 1
##$ISEN= 128
##$LB= 0.3
##$LEV0= 0
##$LPBIN= 0
##$MAXI= 10000
##$MC2= 0
##$MEAN= 0
##$ME_mod= 0
##$MI= 0
##$NCOEF= 0
##$NC_proc= -2
##$NLEV= 6
##$NOISF1= 0
##$NOISF2= 0
##$NSP= 0
##$NTH_PI= 0
##$NZP= 0
##$OFFSET= 14.96262
##$PC= 1
##$PHC0= -86.09436
##$PHC1= 0
##$PH_mod= 1
##$PKNL= yes
##$PPARMOD= 0
##$PPDIAG= 0
##$PPIPTYP= 0
##$PPMPNUM= 2147483647
##$PPRESOL= 1
##$PSCAL= 4
##$PSIGN= 0
##$PYNMP= <proc.py>
##$REVERSE= no
##$SF= 400.020008987259
##$SI= 131072
##$SIGF1= 0
##$SIGF2= 0
##$SINO= 400
##$SIOLD= 131072
##$SPECTYP= <>
##$SREGLST= <1H.CDCl3>
##$SSB= 0
##$STSI= 131072
##$STSR= 0
##$SW_p= 8223.68421052631
##$SYMM= 0
##$S_DEV= 0
##$TDeff= 65536
##$TDoff= 0
##$TI= <>
##$TILT= no
##$TM1= 0
##$TM2= 0
##$TOPLEV= 0
##$USERP1= <user>
##$USERP2= <user>
##$USERP3= <user>
##$USERP4= <user>
##$USERP5= <user>
##$WDW= 1
##$XDIM= 131072
##$YMAX_p= 388403371
##$YMIN_p= -11538
##$CURPLOT= <Network HP LaserJet P1505>
##$CURPRIN= <$Network HP LaserJet P1505>
##$DFORMAT= <normdp>
##$LAYOUT= <+/1D_H.xwp>
##$LFORMAT= <normlp>
##$PFORMAT= <normpl>
##$SURQMSG= 1
$$ End of Bruker specific parameters
$$ ---------------------------------
##NTUPLES= NMR SPECTRUM
##VAR_NAME=  FREQUENCY,     SPECTRUM/REAL,   SPECTRUM/IMAG
##SYMBOL=    X,             R,               I
##VAR_TYPE=  INDEPENDENT,   DEPENDENT,       DEPENDENT
##VAR_FORM=  AFFN,          ASDF,            ASDF
##VAR_DIM=   131072,        131072,          131072
##UNITS=     HZ,            ARBITRARY UNITS, ARBITRARY UNITS
##FACTOR=    0.0627417313425164, 1,          1
##FIRST=     8223.62146879497, 162,          -44679
##LAST=      0,             2114,            -44904
##MIN=       0,             -11538,          0
##MAX=       8223.62146879497, 388403371,    0
$$ Real data points
##PAGE= N=1
##DATA TABLE= (X++(R..R)), XYDATA
$$ [...]
63449B64245Q734Q558Q092Q427R534J0747J1658J2180J2345J2638J4019J6879
63437C98056K0217K2518K3319K3277K2795K1450J8896J5619J2277Q843M933P89
63425E92989k617m488m945m736m465m163l592k829k393k753l886n476p420r773
63411E29453j2229j4056j4771j4640j4391j4479j4736j4583j3572j1870j0204
63400C79922r081q137o658m704l117k259j422P8J829L015L791N103P297R655J1379
63385C86691J2311J2582J2365J2191J2768J3937J4505J3705J2402J2104J3076
63374E28637J4119J4143J3137J1511R289O383L234N98j195k481l744n074o123
63361E82434o422n794m542l296k626k825l899n651p715r696j1350j2636j3532
$$ plain form
63449 264245 272979 281537 289629 298056 307590 318337 329995 342175 354520 367158 381177 398056
63437 398056 418273 440791 464110 487387 510182 531632 550528 566147 578424 587267 592200 592989
63425 592989 590372 585884 580939 576203 571738 567575 563983 561154 558761 556008 552122 546646 539226 529453
63411 529453 517224 503168 488397 473757 459366 444887 430151 415568 401996 390126 379922
63400 379922 370841 362704 356046 351342 348225 345966 344544 344622 346451 349466 353257 358360 365657 375312 386691
63385 386691 399002 411584 423949 436140 448908 462845 477350 491055 503457 515561 528637
63374 528637 542756 556899 570036 581547 590836 597219 600453 601051 599856 597375 593631 588557 582434
63361 582434 576012 570218 565676 562380 559754 556929 553030 547379 539664 529968 518618 505982 492450
63348D92450j3980j4051j4006j4040j3977j3403j2101j0309q495o992n924n358
63336C59814n360n731n976n735n217m939m978m841m177l269k606k188j689j124
63322C01984r04j231j763j995j626m89J485L959O084P055O781N896N031M211K943
63307C37421R64j208k676l127l203l667m482n038n092m987m997m958m694m361
63293B85895m167m068l929l701l311k740k239k116k103j489j15J164J457Q18p9
63278B59277q57j551k072k151j671p18N39J670J998J323L66K9L36O62P74J014
63262B58968J550K117K506K735K697K284J881K097K863L477L656L857M341M714
63248B99743M742M893N552O329O755P155Q078R289J0069J0305J0624J1450J2619
$$ plain form
63348 492450 478470 464419 450413 436373 422396 408993 396892 386583 378088 371096 365172 359814
63336 359814 354454 348723 342747 337012 331795 326856 321878 317037 312860 309591 306985 304797 303108 301984
63322 301984 301080 299849 298086 296091 294465 293976 295461 299420 305504 312559 319340 325236 330267 334478 337421
63307 337421 338385 337177 334501 331374 328171 324504 320022 314984 309892 304905 299908 294950 290256 285895
63293 285895 281728 277660 273731 270030 266719 263979 261740 259624 257521 256032 255917 257081 258538 259356 259277
63278 259277 258420 256869 254797 252646 250975 250257 250796 252466 254464 255787 256153 256182 256518 257180 257954 258968
63262 258968 260518 262635 265141 267876 270573 272857 274738 276835 279698 283175 286831 290688 295029 299743
63248 299743 304485 309378 314930 321259 328014 335169 343247 352536 362605 372910 383534 394984 407603
63235D07603J3858J5101J6271J7251J8125J9086K0064K0771K1040K0836K0047
63224F10053J8787J7725J7563J8117J8530J8458J8448J8950J9679K0247K0842
63213H17399K1734K2504K2375K1043J8713J5533J1475O635J193m791j0989j6429
63201I26395k0173k2428k4334k6380k7675k7136k4898k2081j9464j6940j4063
63190F80823j0648o896l337n09J660M051P389J1113J3816J5000J5731J7186J9166
63177G64545K0579K1022K1135K1470K1816K1787K1479K1126K0581J9594J8401
63166I93535J7514J6955J6110J4429J1963R038N701J758k764p513j2072j6152
63154A048502j9537k2157k4248k6133k7703k8343k7624k5845k3676k1388j8791
$$ plain form
63235 407603 421461 436562 452833 470084 488209 507295 527359 548130 569170 590006 610053
63224 610053 628840 646565 664128 682245 700775 719233 737681 756631 776310 796557 817399
63213 817399 839133 861637 884012 905055 923768 939301 950776 957411 958604 953813 942824 926395
63201 926395 906222 883794 859460 833080 805405 778269 753371 731290 711826 694886 680823
63190 680823 670175 663279 659942 659433 661093 665144 672533 683646 697462 712462 728193 745379 764545
63177 764545 785124 806146 827281 848751 870567 892354 913833 934959 955540 975134 993535
63166 993535 1011049 1028004 1044114 1058543 1070506 1079544 1085245 1087003 1084239 1076726 1064654 1048502
63154 1048502 1028965 1006808 982560 956427 928724 900381 872757 846912 823236 801848 783057
63143G83057j5800j2733j0056p999o455m962k979n27J462J882O45j259k895m164
63129G17217n345o465p431q277q875q784p832o545n572m946m365l867l702l703
63115F31508l410k737j979j345q90q06j121j216l45J307K742L411L607L548K894
63100F35168J649P03Q47J680K195K066J742J563J411J209J121J258J587K112K766
63085F59077L204L108K667K348K203J949J739K250L634M953N177M472L990M406
63071G05177N289O003O697P950R750J1275J1784J1368J0761J0716J1579J3200
63059H21549J5037J6523J7575J8637K0129K1997K3956K5890K7827K9753L1659
63048A070532L3587L5338L6460L6907L7359L8250L8818L7960L6019L4719L4999
$$ plain form
63143 783057 767257 754524 744468 736469 730014 725052 722073 721546 723008 724890 725535 724276 721381 717217
63129 717217 711872 705407 697976 689699 680824 672040 664208 657663 652091 647145 642780 638913 635211 631508
63115 631508 628098 625361 623382 622037 621147 620341 619220 618004 617659 618966 621708 625119 628726 632274 635168
63100 635168 636817 637520 638367 640047 642242 644308 646050 647613 649024 650233 651354 652612 654199 656311 659077
63085 659077 662281 665389 668056 670404 672607 674556 676295 678545 682179 687132 692309 696781 700771 705177
63071 705177 710466 716469 723166 731116 740866 752141 763925 775293 786054 796770 808349 821549
63059 821549 836586 853109 870684 889321 909450 931447 955403 981293 1009120 1038873 1070532
63048 1070532 1104119 1139457 1175917 1212824 1250183 1288433 1327251 1365211 1401230 1435949 1470948
63037A470948L5792L5523L4149L2941L2714L3137L3560L3626L2927L0744K6666
63026A832727K1058J4655P781K13q230j7172k5831l3617m0388m6005m9871n1406
63014A603914n0993m9925m9005m7612m4606l9857l4335k8843k3298j7378j1287
63003A206775n538l30M507R142J3573J7780K1797K5612K9114L2109L4364L5712
62991A424617L6170L5960L5344L4527L3686L2971L2366L1649L0553K8868K6317
62980A783028K2472J7051J0300K811n139j3794k3230l2677m0997m7779n3570n8868
62968A559608o3322o6210o7328o7035o5698o3507o0740n7670n4302n0568m6772
62957H96456m3384m0370l7175l3490k9675k6288k3535k1349j9601j8125j6703
$$ plain form
63037 1470948 1506740 1542263 1576412 1609353 1642067 1675204 1708764 1742390 1775317 1806061 1832727
63026 1832727 1853785 1868440 1876221 1876434 1868204 1851032 1825201 1791584 1751196 1705191 1655320 1603914
63014 1603914 1552921 1502996 1453991 1406379 1361773 1321916 1287581 1258738 1235440 1218062 1206775
63003 1206775 1201237 1200907 1205414 1214556 1228129 1245909 1267706 1293318 1322432 1354541 1388905 1424617
62991 1424617 1460787 1496747 1532091 1566618 1600304 1633275 1665641 1697290 1727843 1756711 1783028
62980 1783028 1805500 1822551 1832851 1835662 1830523 1816729 1793499 1760822 1719825 1672046 1618476 1559608
62968 1559608 1496286 1430076 1362748 1295713 1230015 1166508 1105768 1048098 993796 943228 896456
62957 896456 853072 812702 775527 742037 712362 686074 662539 641190 621589 603464 586761
62946E86761j5262j3868j2515j1156r958r193q818q493q078p689p270o614n882
62933D61965n534n545n352m850m747n481o402o635o253n837n360m402l265k872
62919C89430l423l992l792l161k919l170l300k963k551k582k908k847k094j256
62905C48472j190j862k263j585k38N59P3j222k168k029j166o18r44j610j721j138
62889C29350m50J1L77N43J21o62q66j56N70M41j45l36j86k88n31k22P03J581K000
62870C31855K086J883J285O03L34L61R1n20q76p74p73j314k110k693k951k944
62854C23543k688k354k217k262k252k200k289k278j742q93m98p50j025r39r01
62839B98255j229j459j042j69N48Q08O82M16M49J115J979K164J625J380J989K571
$$ plain form
62946 586761 571499 557631 545116 533960 524002 514809 505991 497498 489420 481731 474461 467847 461965
62933 461965 456431 450886 445534 440684 435937 430456 424054 417419 411166 405329 399969 395567 392302 389430
62919 389430 386007 382015 378223 375062 372143 368973 365673 362710 360159 357577 354669 351822 349728 348472
62905 348472 347282 345420 343157 341572 341334 341893 341966 340744 338576 336547 335381 334763 333819 332209 330488 329350
62889 329350 328900 328911 329288 329831 329952 329290 328424 328268 328838 329279 329134 328798 328612 328324 327793 327571 328274 329855 331855
62870 331855 333941 335824 337109 337712 338046 338407 338498 337978 337102 336328 335555 334241 332131 329438 326487 323543
62854 323543 320855 318501 316284 314022 311770 309570 307281 305003 303261 302368 301870 301120 300095 299156 298255
62839 298255 297026 295567 294525 294356 294904 295712 296394 296810 297259 298374 300353 302517 304142 305522 307511 310082
62823C10082K115J060O42J128J702J892K025K302K373K094J931K270K865L264
62809C37745L408L495L600L701L841M122M684N690P156Q721R904J0620J1187J1808
62795D29682J2449J3287J4825J7202J9772K1835K3562K5763K8767L2070L5147
62784F74361L8102M1309M4857M8687N2868N7270O1243O4186O6211O7633O7980
62773A284707O6308O2559N7657N1998M4744L5204K4062J2501Q15j1133k2688l2774
62761A573960m1184m8477n4670n9089o1584o2872o3509o3333o2174o0267n7812
62750I38989n4859n1730m8759m5537m1364l6666l2824l0283k7928k4862k1714
62739E22463j9418j7714j5785j3665j1924j0613r474q707q569q533p768o229m449
$$ plain form
62823 310082 312197 313257 313899 315027 316729 318621 320646 322948 325321 327415 329346 331616 334481 337745
62809 337745 341153 344648 348248 351949 355790 359912 364596 370286 377442 386163 396067 406687 417874 429682
62795 429682 442131 455418 470243 487445 507217 529052 552614 578377 607144 639214 674361
62784 674361 712463 753772 798629 847316 900184 957454 1018697 1082883 1149094 1216727 1284707
62773 1284707 1351015 1413574 1471231 1523229 1567973 1603177 1627239 1639740 1640555 1629422 1606734 1573960
62761 1573960 1532776 1484299 1429629 1370540 1308956 1246084 1182575 1119242 1057068 996801 938989
62750 938989 884130 832400 783641 738104 696740 660074 627250 596967 569039 544177 522463
62739 522463 503045 485331 469546 455881 443957 433344 423870 415163 406594 398061 390293 384064 379615
62726C79615k664r60J43K98L07J355L333N010N998P340R745J2272J3479J3348
62712D48619J3330J4733J7540K0792K3727K6434K9437L2886L6384L9702M3204
62701G46788M7285N1724N5994N9922O3550O6628O8772O9911P0035O8684O5306
62690A434599O0004N3267M5050L4839K2714R665l300j5787k7632l8439m7783n5433
62678A471764o1181o4906o6960o8016o8293o7372o4975o1509n7556n3295m8825
62667G88876m4716m1595l9269l6716l3223k9247k5909k3656k1805j9540j7115
62656D56085j5524j5027j4703j3699j2325j1362j0822j0098r067q179p581o923
62644C20775o120n548n353n138m601l972l574l390l289l253l203k955k550k263
$$ plain form
62726 379615 376951 375991 376134 376432 376739 378094 381427 386437 392435 399775 409520 421792 435271 448619
62712 448619 461949 476682 494222 515014 538741 565175 594612 627498 663882 703584 746788
62701 746788 794073 845797 901791 961713 1025263 1091891 1160663 1230574 1300609 1369293 1434599
62690 1434599 1494603 1547870 1592920 1627759 1650473 1660138 1656838 1641051 1613419 1574980 1527197 1471764
62678 1471764 1410583 1345677 1278717 1210701 1142408 1075036 1010061 948552 890996 837701 788876
62667 788876 744160 702565 663296 626580 593357 564110 538201 514545 492740 473200 456085
62656 456085 440561 425534 410831 397132 384807 373445 362623 352525 343458 335279 327698 320775
62644 320775 314655 309107 303754 298616 294015 290043 286469 283079 279790 276537 273334 270379 267829 265566
62630B65566k148j909j340n76J80P60Q64K84m95n18N01J669J957J428J077J652
62614B68952K970M297N042N141M933M778M832N290O521Q650J1126J3192J4726
62601C60450J6192J7799J9303K0690K2410K4668K7040K9131L1076L3040L4630
62590F36429L5255L4726L3144L0532K6914K2499J7410J1499M816j985q094j3238
62578H29907j7638k1412k4452k6768k8552k9861l0418k9895k8318k6245k4423
62567E41925k3143k1975k0399j8514j6807j5374j3870j2246j0842r676q327o796
62555C63956n780n673n947n993n969o159o140n327m003k992k572k425k445k777
62541B99754l093k733j632m75K72R01J755K621L096L225L490M341N902P879R689
$$ plain form
62630 265566 263418 261509 260169 259593 259773 260533 261397 261681 261186 260668 261169 262838 264795 266223 267300 268952
62614 268952 271922 276219 281261 286402 291335 296113 300945 306235 312756 321406 332532 345724 360450
62601 360450 376642 394441 413744 434434 456844 481512 508552 537683 568759 601799 636429
62590 636429 671684 706410 739554 770086 797000 819499 836909 848408 853224 851239 843145 829907
62578 829907 812269 790857 766405 739637 711085 681224 650806 620911 592593 566348 541925
62567 541925 518782 496807 476408 457894 441087 425713 411843 399597 388755 379079 370752 363956
62555 363956 358176 352503 346556 340563 334594 328435 322295 316968 312965 309973 307401 304976 302531 299754
62541 299754 296661 293928 292296 291821 292093 292994 294749 297370 300466 303691 307181 311522 317424 325303 334992
62526C34992J0924J1761J2714J4054J5749J7887K0725K4181K7650L0519L2692
62515E53848L4558L6640L9225M1996M4084M4790M4261M3060M1158L7835L2663
62504I94118K6077J8723J0835K549n621j3098j9762k5702l0684l4306l6587l7948
62492H48594l8562l8233l6993l5387l3958l2593l0786k8369k5743k3311k0980
62481E03679j8455j5849j3718j2429j1705j0932r718q077o292m854m243m470m864
62468C78073m643l699k511j468n65K33Q42J385K212L360M298M546M325M305M846
62453C95539N804O874P906Q826R575J0003R799Q599O417L813J416n89k383m034
62439D67565n494o866q280r481r999r831r577r662r800r454q563p522o584n704
$$ plain form
62526 334992 345916 357677 370391 384445 400194 418081 438806 462987 490637 521156 553848
62515 553848 588406 625046 664271 706267 750351 795141 839402 882462 923620 961455 994118
62504 994118 1020195 1038918 1049753 1052302 1046681 1033583 1013821 988119 957435 923129 886542 848594
62492 848594 810032 771799 734806 699419 665461 632868 602082 573713 547970 524659 503679
62481 503679 485224 469375 455657 443228 431523 420591 410873 402796 396504 391650 387407 382937 378073
62468 378073 373430 369731 367220 365752 365187 365420 366262 367647 369859 373219 377517 382063 386388 390693 395539
62453 395539 401343 408217 416123 424949 434524 444527 454326 462925 469342 473155 474571 473982 471599 467565
62439 467565 462071 455205 446925 437444 427445 417614 408037 398375 388575 379121 370558 363036 356452 350748
62425C50748m837m034l274k467j644r13k02P10J790K676L140L356L621L914L983
62410C56567L786L632L895M655N689O639P201P227O787O257O165O766P580P696
62396D40542O698N144L902L189K657K170J915J787J372P53O86J547K708L448L979
62381D82497M909O163P251Q333J0126J2701J5279J7364J9302K1450K3523K5177
62369F54075K6680K8466L0479L2390L4077L5412L5919L5169L3392L1185K8697
62358A005941K5495K1273J6317J1279O678K620j059m453p417j0017j2959j7037
62346A036661k1952k6231k8731k9716l0073k9942k8888k7049k5277k4136k3405
62335G41261k2628k1563k0031j7953j5740j4111j3256j2647j1781j0747r790q857
$$ plain form
62425 350748 345911 341877 338603 336136 334492 333579 333377 334087 335877 338553 341693 345049 348670 352584 356567
62410 356567 360353 363985 367880 372535 378224 384863 392064 399291 406078 412335 418500 425266 432846 440542
62396 440542 447240 452384 456286 459475 462132 464302 466217 468004 469376 470129 470815 472362 475070 478518 482497
62381 482497 487406 493569 500820 509153 519279 531980 547259 564623 583925 605375 628898 654075
62369 654075 680755 709221 739700 772090 806167 841579 877498 912667 946059 977244 1005941
62358 1005941 1031436 1052709 1069026 1080305 1086983 1089603 1088544 1084091 1076674 1066657 1053698 1036661
62346 1036661 1014709 988478 959747 930031 899958 870016 841128 814079 788802 764666 741261
62335 741261 718633 697070 677039 659086 643346 629235 615979 603332 591551 580804 571014 562157
62323E62157p879p052o486n790m531k885j482o97l81k26j02L0K75Q22J793L046
62307E30612M088M358L796L030K725K898K914K333J497J276K206L912N457O193
62293E77295O155N673M943M209L989M512N087M719L446K424K409K782K617K140
62279F32400K368L615N181O505P895R877J2345J4757J6826J8757K0908K3439K6177
62266H01050K8772L1072L3264L5409L6965L7107L5582L2919K9700K6029K1840
62255A149709J7362J3033R125N555J920k342p392j2576j6927k0148k2743k4997
62243A089579k6516k7006k6866k6490k5617k3908k1748j9712j7733j5545j3536
62232H44902j2168j0872q760o338n195n689o206n299l415j829q05J21Q31P89J92
$$ plain form
62323 562157 554278 547226 540740 534950 530419 527534 526052 525355 524974 524748 524646 524676 524951 525773 527566 530612
62307 530612 534700 539058 542854 545884 548609 551507 554421 556754 558251 559527 561733 565645 571102 577295
62293 577295 583450 589123 594066 598275 602264 606776 611863 616582 620028 622452 624861 627643 630260 632400
62279 632400 634768 638383 643564 650069 657964 667841 680186 694943 711769 730526 751434 774873 801050
62266 801050 829822 860894 894158 929567 966532 1003639 1039221 1072140 1101840 1127869 1149709
62255 1149709 1167071 1180104 1189229 1194784 1196704 1194362 1186970 1174394 1157467 1137319 1114576 1089579
62243 1089579 1063063 1036057 1009191 982701 957084 933176 911428 891716 873983 858438 844902
62232 844902 832734 821862 813102 806764 801569 795880 789674 784375 780960 779131 778326 778447 779278 780067 780259
62217G80259r7K56O94N81k01j366k433k947k924k867k920k446j043N42J307J387
62201G65782J679K341K821L205M305O243Q025Q908R258R712J0420J1449J2942
62188H57090J4384J4653J3472J1978J1291J1273J1376J1855J3176J4966J6639
62177A002153J8503K1172K4197K6507K7967K9367L0779L1107K9528K6466K2769
62166A290515J8854J5025J1834R428P074M062P48j890l603n206p554j0554j3351
62153A315382j5205j6049j6288j6234j5793j4715j2988j0925q933p292o132n473
62141A169355n260n374n619n771n770n829o144o481o353n668m875m320l820l073
62127A094998k125j111J09J603K969L777M332N445P459R750J1178J0765Q200M160
$$ plain form
62217 780259 780162 780418 781112 781693 781492 780126 777693 774746 771822 768955 766035 763589 762546 763088 764395 765782
62201 765782 767461 769802 772623 775828 780133 786376 794401 803309 812567 822279 832699 844148 857090
62188 857090 871474 886127 899599 911577 922868 934141 945517 957372 970548 985514 1002153
62177 1002153 1020656 1041828 1066025 1092532 1120499 1149866 1180645 1211752 1241280 1267746 1290515
62166 1290515 1309369 1324394 1336228 1345656 1352730 1356792 1357540 1355650 1352047 1346841 1339287 1328733 1315382
62153 1315382 1300177 1284128 1267840 1251606 1235813 1221098 1208110 1197185 1188252 1180960 1174828 1169355
62141 1169355 1164095 1158721 1153102 1147331 1141561 1135732 1129588 1123107 1116754 1111086 1106211 1101891 1098071 1094998
62127 1094998 1092873 1091762 1091871 1093474 1096443 1100220 1104552 1109997 1117456 1127206 1138384 1149149 1157349 1161509
62113A161509J12k625l673l394k228o64M28J41j721m565p607j0199j1820j2330
62099A101364j2212j1974j1417j0083q309p044o491n806m373k640j236n1J217
62086A020945K192K389K305L112N178P510Q901R230R385J0065J1030J1585J1605
62073A115432J1747J2556J3663J4214J3764J2382J0023O550K404j401m206o184
62061A200944p803r271j0773j2644j4939j7217j9112k0710k2159k3293k4027k4596
62049I94400k5011k4692k3198k0924j8639j6683j5077j4031j3624j3329j2588
62038G96604j1629j1080j0911j0524r787r206q990q727q138p506p112o889o866
62025F79239p290p949q079p376o574o483o897p069o804o462o159n719n315n324
$$ plain form
62113 1161509 1161621 1158996 1155323 1151929 1149701 1149037 1149465 1149606 1147885 1143320 1135713 1125514 1113694 1101364
62099 1101364 1089152 1077178 1065761 1055678 1047369 1040325 1033834 1028028 1023655 1021015 1019779 1019728 1020945
62086 1020945 1023137 1025526 1027831 1030943 1036121 1043631 1052532 1061762 1071147 1081212 1092242 1103827 1115432
62073 1115432 1127179 1139735 1153398 1167612 1181376 1193758 1203781 1210331 1212735 1211334 1207128 1200944
62061 1200944 1193141 1183870 1173097 1160453 1145514 1128297 1109185 1088475 1066316 1043023 1018996 994400
62049 994400 969389 944697 921499 900575 881936 865253 850176 836145 822521 809192 796604
62038 796604 784975 773895 762984 752460 742673 733467 724477 715750 707612 700106 692994 686105 679239
62025 679239 671949 664000 655921 648545 641971 635488 628591 621522 614718 608256 602097 596378 591063 585739
62011E85739n516n101l855k532j861j695j570j547j854k111j740j080j223k550
61997E51504m067m584m080l497l549m221n118n775n782n135m453m337m516m165
61983D88225l077j914j174n10N29J660K268K311K309K551K852K987L009L105L396
61968E08527L887M419M762M957N397O245P053P315P208P346P886Q427Q825R440
61954F01694J0461J1519J2247J2764J3251J3550J3619J4021J5345J7257J8743
61943G54471J9362J9758K0802K2562K4379K5700K6507K7072K7563K7999K8455
61932A024630K9139L0313L2091L4372L6928L9619M2535M5956N0105N4910O0071
61921A480669O5460P1377P8337Q6576R5896J05972J16592J27480J38154J48222
$$ plain form
62011 585739 580223 575122 571267 568735 566874 565179 563609 562062 560208 558097 556357 555277 554054 551504
61997 551504 547437 542853 538773 535276 531727 527506 522388 516613 510831 505696 501243 496906 492390 488225
61983 488225 485148 483234 482060 481550 482079 483739 486007 488318 490627 493178 496030 499017 502026 505131 508527
61968 508527 512414 516833 521595 526552 531949 538194 545247 552562 559770 567116 575002 583429 592254 601694
61954 601694 612155 623674 635921 648685 661936 675486 689105 703126 718471 735728 754471
61943 754471 773833 793591 814393 836955 861334 887034 913541 940613 968176 996175 1024630
61932 1024630 1053769 1084082 1116173 1150545 1187473 1227092 1269627 1315583 1365688 1420598 1480669
61921 1480669 1546129 1617506 1695843 1782419 1878315 1984287 2100879 2228359 2366513 2514735
61911B514735J57769J67142J76255J84294J90116J92800J91674J86029J75087
61902D135901J58281J35462J06885P3169L5421m560m4278q1022j12735j38655
61892D263869j59099j74472j84666j89530j89737j86682j81516j74509j65581
61883B658077j55131j44030j32984j22225j11863j02215r3638q6099p9148p2346
61873A558398o5712n9604n4174m9113m4094l9322l5249l1765k8138k3929j9572
61862A107726j5726j2500r645p209n342l727j811L69K307L934N770P882R426R624
61848A091078Q706P476O330N229M223L472K946K615K779L711N187O841Q821J1475
61834A170889J4414J6530J6971J5630J2708Q531L989L26k001l732n631p352q055
$$ plain form
61911 2514735 2672504 2839646 3015901 3200195 3390311 3583111 3774785 3960814 4135901
61902 4135901 4294182 4429644 4536529 4609698 4645119 4640559 4596281 4515259 4402524 4263869
61892 4263869 4104770 3930298 3745632 3556102 3366365 3179683 2998167 2823658 2658077
61883 2658077 2502946 2358916 2225932 2103707 1991844 1889629 1795991 1709892 1630744 1558398
61873 1558398 1492686 1433082 1378908 1329795 1285701 1246379 1211130 1179365 1151227 1127298 1107726
61862 1107726 1092000 1079500 1069855 1062646 1057304 1053577 1051766 1052135 1054442 1058376 1064146 1072028 1081454 1091078
61848 1091078 1099784 1107260 1113590 1118819 1123042 1126514 1129460 1132075 1134854 1138565 1143752 1150593 1159414 1170889
61834 1170889 1185303 1201833 1218804 1234434 1247142 1255673 1259662 1259988 1257987 1254255 1248624 1241272 1233217
61821A233217p644o726n552l905j999n71K42J472M176Q080J1891J4752J6971J9344
61807A283748K2275K5660K9315L3223L7366M1500M5264M8622N2144N6632O2324
61796A738073O8622P4879Q1276Q8658R7474J07242J17298J27761J39446J52829
61786B793558J67461J82566J97976K14214K31638K49829K67945K85473L02248
61777D892908L17672L30164L37575L38002L30135L12987K85651K47456J98501
61768G591051J40173P5210P007o1278j26863j86691k37423k76800l04884l23324
61758F296178l33527l36127l32107l23293l11226k96263k78558k59395k40654
61749C585028k23131k06260j89508j73336j58515j45183j32948j21576j11171
$$ plain form
61821 1233217 1225573 1218847 1213295 1209390 1207391 1206820 1207062 1208534 1212710 1220790 1232681 1247433 1264404 1283748
61807 1283748 1306023 1331683 1360998 1394221 1431587 1473087 1518351 1566973 1619117 1675749 1738073
61796 1738073 1806695 1881574 1962850 2051508 2148982 2256224 2373522 2501283 2640729 2793558
61786 2793558 2961019 3143585 3341561 3555775 3787413 4037242 4305187 4590660 4892908
61777 4892908 5210580 5540744 5878319 6216321 6546456 6859443 7145094 7392550 7591051
61768 7591051 7731224 7806434 7813441 7752163 7625300 7438609 7201186 6924386 6619502 6296178
61758 6296178 5962651 5626524 5294417 4971124 4659898 4363635 4085077 3825682 3585028
61749 3585028 3361897 3155637 2966129 2792793 2634278 2489095 2356147 2234571 2123400
61740B123400j01858r3589q6167p9303p2767o6619o1200n6698n2812m9020m5080
61729A358287m1220l7778l4784l1998k9310k7009k5459k4578k3817k2689k1154
61718A038491j9416j7703j6327j5610j5457j5303j4779j4168j3866j3720j3325
61707H68817j2695j2103j1509j0744j0091r998j0263j0194r587q877q297p622
61695G46837o899o618o811o708n762m386l243k450j885j634j558j030J79J190
61681F99222J015k15j703l335n544q088r950j0618j0627j0643j0745j0817j0918
61668F07034j0931j0387r081p421n857m328k608q18P46K054L222M094M286L601
61654E73606K235N65j137k892m931p244r236j0062r501q279p314o833o380n532
$$ plain form
61740 2123400 2021542 1927953 1841786 1762483 1689716 1623097 1561897 1505199 1452387 1403367 1358287
61729 1358287 1317067 1279289 1244505 1212507 1183197 1156188 1130729 1106151 1082334 1059645 1038491
61718 1038491 1019075 1001372 985045 969435 953978 938675 923896 909728 895862 882142 868817
61707 868817 856122 844019 832510 821766 811675 801677 791414 781220 771633 762756 754459 746837
61695 746837 739938 733320 726509 719801 714039 709653 706410 703960 702075 700441 698883 697853 698032 699222
61681 699222 700237 700022 698319 694984 689440 681352 671402 660784 650157 639514 628769 617952 607034
61668 607034 596103 585716 576635 569214 563357 559029 556421 555603 556349 558403 561625 565719 570005 573606
61654 573606 575841 576406 575269 572377 567446 560202 550966 540904 531403 523124 515810 508977 502597 497065
61640D97065m352l173k265j766j738k088k496k580k285j932j756j490p77J07L88
61625D68862j79q95j091j007j211j518j308p10o48j486k447k708k432k310k536
61610D46376k761k662k154j387q83j299k501l228k417o59L81M2n74j36J263K428
61594D29829K635K234J898J852K020K488L363M328M745M454M171M738O095P415
61580D82265Q189Q752R535J0351J0849J1270J2173J3556J4845J5802J6861J8367
61568F32815J9997K1195K1937K2641K3517K4233K4196K3025K0863J8293J5838
61557H68550J3423J0547P092L771J530N78K38k64r82j331q52J78J040J364J412
61542I06294J500J440R22J63l52o11j068j798k383k745l400m488n269n088m291
$$ plain form
61640 497065 492713 489540 487275 485509 483771 481683 479187 476607 474322 472390 470634 469144 468367 468474 468862
61625 468862 468683 467788 466697 465690 464479 462961 461653 460943 460295 458809 456362 453654 451222 448912 446376
61610 446376 443615 440953 438799 437412 436529 435230 432729 429501 427084 426425 426806 426848 426274 426138 427401 429829
61594 429829 432464 434698 436596 438448 440468 442956 446319 450647 455392 459846 464017 468755 474850 482265
61580 482265 490454 499206 508741 519092 529941 541211 553384 566940 581785 597587 614448 632815
61568 632815 652812 674007 695944 718585 742102 766335 790531 813556 834419 852712 868550
61557 868550 881973 892520 899612 903383 904913 905491 905729 905465 904483 903152 902300 902478 903518 904882 906294
61542 906294 907794 909234 910156 910319 909967 909356 908288 906490 904107 901362 897962 893474 888205 883117 878826
61527H78826l523k673j256N51K107L358M795O515Q183R919J2274J5201J7980K0456
61513I72713K3453K7516L2041L6212M0130M4399M9129N4058N9230O4878P0766
61502A474525P6276Q1031Q5084Q8609R1718R4441R6622R7985R8342R7431R4449
61491B476513Q8420P9285O8168N6230M3867L1280J9130Q005k039j0782j7431k1598
61479B819048k4041k5544k5784k4421k2715k2541k4104k6015k7717l0269l4464
61468B531433l9501m4187m8278n1958n4777n5909n4986n2223m8157m3550l8980
61457A998927l4173k8410k1800j5479j0154n316l49M408Q422J2058J6075K0445
61445A944654K4524K8120L1672L5489L9474M3492M7384N0393N1117M8271M1562
$$ plain form
61527 878826 875303 872630 871374 871925 874032 877390 882185 888700 896883 906802 919076 934277 952257 972713
61513 972713 996166 1023682 1055723 1091935 1132065 1176464 1225593 1279651 1338881 1403759 1474525
61502 1474525 1550801 1631832 1716916 1805525 1897243 1991684 2088306 2186291 2284633 2382064 2476513
61491 2476513 2564933 2644218 2712386 2768616 2812483 2843763 2862893 2870898 2868859 2858077 2840646 2819048
61479 2819048 2795007 2769463 2743679 2719258 2696543 2674002 2649898 2623883 2596166 2565897 2531433
61468 2531433 2491932 2447745 2399467 2347509 2292732 2236823 2181837 2129614 2081457 2037907 1998927
61457 1998927 1964754 1936344 1914544 1899065 1888911 1883595 1883246 1887654 1896076 1908134 1924209 1944654
61445 1944654 1969178 1997298 2028970 2064459 2103933 2147425 2194809 2245202 2296319 2344590 2386152
61434B386152L1936K1111J0754J981m553q476j0021j0226j0073r492p850n384
61422B385859l171j495P44M478R138J3423J6513J7758J5890R706n09j2839k4873
61409B430622l4641m0966m3802m4119m2996m0881l7989l4949l2384l0189k7824
61398B019882k5216k2773k0633j8481j6057j3405j0642p773m733j378K449O642
61386A887882J0946J5474K0733K6963L3821M0916M8154N5300O1871O7886P4008
61375B343954Q0417Q6189R0439R3429R5713R6734R5219R0730Q3880P5200O4624
61364C296528N2022L7640K1958N708j0133k4908l8661n1559o3259p3286q1644
61353C070406q8404r3111r5399r5870r5545r4687r2837q9847q6094q1863p7275
$$ plain form
61434 2386152 2418088 2439199 2449953 2451934 2447381 2438905 2428884 2418658 2408585 2399093 2391243 2385859
61422 2385859 2382688 2381193 2381937 2386415 2395553 2408976 2425489 2443247 2459137 2468843 2468334 2455495 2430622
61409 2430622 2395981 2355015 2311213 2267094 2224098 2183217 2145228 2110279 2077895 2047706 2019882
61398 2019882 1994666 1971893 1951260 1932779 1916722 1903317 1892675 1884902 1880169 1878791 1881240 1887882
61386 1887882 1898828 1914302 1935035 1961998 1995819 2036735 2084889 2140189 2202060 2269946 2343954
61375 2343954 2424371 2510560 2600999 2694428 2790141 2886875 2982094 3072824 3156704 3231904 3296528
61364 3296528 3348550 3386190 3408148 3413856 3403723 3378815 3340154 3288595 3225336 3152050 3070406
61353 3070406 2982002 2888891 2793492 2697622 2602077 2507390 2414553 2324706 2238612 2156749 2079474
61342B079474p2605o7981o2959n7165n1085m5493m0333l5031k9635k4692k0177
61331A572318j5545j0820o606k984O70M581Q253J1427J4583J8160K1869K4957
61319A640863K6684K6581K4865K2486K0207J7800J4807J1789R897R309R128Q774
61307A843190Q515Q614Q856R092R334R241Q412P240O584O483O118N014L389J320
61293A941402j305l898n480o090o757p840q641q956r623j0891j1525j0511q575
61280A841310p130o433n724m512k863q89J134K476K315L58l092p200j0695j2626
61266A786429j3319j3905j4697j4818j3668j1804r839p512m467j145J870M747
61254A687872P996J1711J5777K0327K5401L0726L6195M2086M8460N5038O1892
$$ plain form
61342 2079474 2006869 1938888 1875929 1818764 1767679 1722186 1681853 1646822 1617187 1592495 1572318
61331 1572318 1556773 1545953 1539347 1536363 1537033 1541614 1549867 1561294 1575877 1594037 1615906 1640863
61319 1640863 1667547 1694128 1718993 1741479 1761686 1779486 1794293 1806082 1815979 1825288 1834416 1843190
61307 1843190 1851705 1860319 1869175 1878267 1887601 1896842 1905254 1912494 1919078 1925561 1931679 1936693 1940082 1941402
61293 1941402 1940097 1936199 1930719 1924629 1917872 1910032 1901391 1892435 1882812 1871921 1860396 1849885 1841310
61280 1841310 1834180 1827747 1822023 1817511 1814648 1813759 1814893 1817369 1819684 1820042 1816950 1809750 1799055 1786429
61266 1786429 1773110 1759205 1744508 1729690 1716022 1704218 1694379 1686867 1682400 1681255 1683125 1687872
61254 1687872 1695868 1707579 1723356 1743683 1769084 1799810 1836005 1878091 1926551 1981589 2043481
61243B043481O9287P6373Q0879Q0705P5160O4414M8985L0492J1663n383k0185
61232B555871l2638m1885m7528n0796n3093n4158n3011n0011m6458m2518l7044
61221B046731k9480k0829j2880p389n844q782j5175k3196l1347l8283m2290m2386
61209A768850l9759l6833l4740l2863l0727k8905k7694k6217k3635k0363j7310
61198A449804j4570j1651q644o387n446n551o081o829q051r848j1804j3394j4593
61185A326955j5723j6750j7289j7319j7348j7572j7513j6801j5796j4927j4029
61174A145888j2860j1823j1411j1305j0755r615q322p023n442l650k354k284l714
61161A045330o563j0574j5150j9357k2285k3591k3773k3789k4098k4133k3102
$$ plain form
61243 2043481 2112768 2189141 2270020 2350725 2425885 2490299 2539284 2569776 2581439 2576056 2555871
61232 2555871 2523233 2481348 2433820 2383024 2329931 2275773 2222762 2172751 2126293 2083775 2046731
61221 2046731 2017251 1996422 1983542 1976153 1970309 1961527 1946352 1923156 1891809 1853526 1811236 1768850
61209 1768850 1729091 1692258 1657518 1624655 1593928 1565023 1537329 1511112 1487477 1467114 1449804
61198 1449804 1435234 1423583 1414939 1408552 1403106 1397555 1391474 1384645 1376594 1366746 1354942 1341548 1326955
61185 1326955 1311232 1294482 1277193 1259874 1242526 1224954 1207441 1190640 1174844 1159917 1145888
61174 1145888 1133028 1121205 1109794 1098489 1087734 1078119 1069797 1062774 1057332 1053682 1051328 1049044 1045330
61161 1045330 1038767 1028193 1013043 993686 971401 947810 924037 900248 876150 852017 828915
61150H28915k1210j9442j8206j6981j5462j4145j3342j2485j1097r735r224r354
61138F58232r104p980o493n490n315n503n147l821k179j146n59N47K340L912M871
61123F17165O069Q104J0194J1289J1438J1216J0623R339P495N384L078Q76o21
61110G11649j435k276l127k866j183M19N88K8R8O00M25l52p09n34o52j330k105
61093F97238k871l847m688m848m614m662m814m384l490k863k615k312k032k205
61079F46993k569k437j836j361j074n64R4N11Q31J455K126K339K390K968L927
61064F53793M534M676M872N224N354N283N465O075O880P591P826P307O642P095
61050G38617Q901J0647J1143J0909J0933J1173J1323J1867J3041J3952J4122J4692
$$ plain form
61150 828915 807705 788263 770057 753076 737614 723469 710127 697642 686545 676810 667586 658232
61138 658232 649128 641148 634655 629165 623850 618347 613200 609379 607200 606054 605495 606042 608382 612294 617165
61123 617165 623234 631338 641532 652821 664259 675475 686098 695437 702932 708316 711394 712270 711649
61110 711649 710214 707938 704811 701945 700762 701181 701769 701797 701895 702495 702920 702568 701859 701325 700673 699343 697238
61093 697238 694367 690520 685832 680984 676370 671708 666894 662510 659020 656157 653542 651230 649198 646993
61079 646993 644424 641987 640151 638790 637716 637152 637246 637757 638588 640043 642169 644508 646898 649866 653793
61064 653793 658327 663003 667875 673099 678453 683736 689201 695276 702156 709747 717573 724880 731522 738617
61050 738617 747518 758165 769308 780217 791150 802323 813646 825513 838554 852506 866628 881320
61038H81320J6683J9307K1503K3729K6627K9458L1789L5119M0616M6755N1427
61027A224333N4846N7937N9848O0001O0808O5032P1958P9629Q9107J02496J18389
61016B044384J33749J49087J67208J88488K12720K44084K87646L41671M00327
61007D169364M63339N35387O17408P09516Q22959R75645J173861J416941J724537
60998A2608957K122572K559456K847596K752426K190911J337638N07546o7703
60990B6859399l38086l46760j24175K78455O87406Q29888N19783j82131j012306
60981B7171473j702717k130895k313316k316491k201477k020100j815428j610944
60973A1060105j411413j218904j040690q82184p42587o20575n17633m33780l65651
$$ plain form
61038 881320 898003 917310 938813 962542 989169 1018627 1050416 1085535 1126151 1172906 1224333
61027 1224333 1279179 1337116 1396964 1456965 1517773 1582805 1654763 1734392 1823499 1925995 2044384
61016 2044384 2178133 2327220 2494428 2682916 2895636 3139720 3427366 3769037 4169364
61007 4169364 4632703 5168090 5785498 6495014 7317973 8293618 9467479 10884420 12608957
60998 12608957 14731529 17290985 20138581 22891007 25081918 26419556 26927102 26859399
60990 26859399 26521313 26174553 26050378 26328833 27016239 27846127 28365910 28183779 27171473
60981 27171473 25468756 23337861 21024545 18708054 16506577 14486477 12671049 11060105
60973 11060105 9648692 8429788 7389098 6506914 5764327 5143752 4626119 4192339 3826688
60964C826688l10614k68110k35745k08853j85180j65774j50283j35647j20571
60955B045911j06950r5586q4582p3513o5261o1711o0950o0456n9924n9297n7187
60944A260494n3172m9014m5805m2317l7682l3115k9428k5385k0249j5595j2852
60933H95880j1190r570q640q919r212q605q078q378q317p022n940o540p745p757
60919G79967o928o679o920o707o420p067q213q569q129p964q311q437p992p213
60905F74418o186n095m689n348o208o199n498m999n002n272n682n942n440m200
60891E98658l288l370l680l258k343j631j196j002j497k558k910j753l7J071J859
60876E73065K907L436K550J268J261K121J891K11j051n68P59J470J581K086L364
$$ plain form
60964 3826688 3516074 3247964 3012219 2803366 2618186 2452412 2302129 2166482 2045911
60955 2045911 1938961 1843375 1758793 1685280 1620019 1558308 1497358 1436902 1376978 1317681 1260494
60944 1260494 1207322 1158308 1112503 1070186 1032504 999389 969961 944576 924327 908732 895880
60933 895880 884690 875120 866480 857561 848349 839744 831666 823288 814971 807949 802009 795469 787724 779967
60919 779967 773039 766360 759440 752733 746313 739246 731033 722464 714335 706371 698060 689623 681631 674418
60905 674418 668232 663137 658448 653100 646892 640693 635195 630196 625194 619922 614240 608298 602858 598658
60891 598658 595370 592000 588320 585062 582719 581088 579892 578890 577393 574835 571925 570172 570135 571206 573065
60876 573065 575972 579408 581958 583226 584487 586608 588499 588710 587659 587091 587850 589320 590901 592987 596351
60861E96351M772N400M774L091J026p86k022k383j478N41K610L428K421j67l531
60846F14047o426p744p675p732q918j0426j0813r900q684p855p346o991o692o072
60832E00773m903l656k918k482j750r00p31j353j934j869j462j213j077p41k58
60817D73526lj31l46k12L03P67Q67Q66J118J307Q67O6j27N22J131J089R45J298
60799D83853J685J387O63K70J97j02n42l92N31J469J590Q44j00m66o7M31J70p95
60781D90626j523j514j408j925k766l206l178l082k917k405j637r95o32n56q69
60766D62013j410j581j117o22p28j117j019k95O17J372J734J402O14L79J198K049
60750D63489J688N19l0K75K12q91k207k792k767k642k428k042j859k189k650k605
$$ plain form
60861 596351 601123 606523 611297 614388 615414 614628 612606 610223 608745 609286 611896 615324 617745 617578 614047
60846 614047 607621 599877 592202 584470 575552 565126 554313 544413 535729 527874 520528 513537 506845 500773
60832 500773 495870 492214 489296 486814 485064 484164 483433 482080 480146 478277 476815 475602 474525 473784 473526
60817 473526 473523 473392 473046 472834 473137 473904 474771 475637 476755 478062 478929 478995 478868 479390 480521 481610 482555 483853
60799 483853 485538 486925 487588 487858 488055 487953 487411 487019 487550 489019 490609 491453 491353 490887 490820 491251 491421 490626
60781 490626 489103 487589 486181 484256 481490 478284 475106 472024 469107 466702 465065 464070 463438 462882 462013
60766 462013 460603 459022 457905 457283 456555 455438 454419 454124 454741 456113 457847 459249 459863 460242 461440 463489
60750 463489 465177 465696 465666 465941 466153 465262 463055 460263 457496 454854 452426 450384 448525 446336 443686 441081
60734D41081j920r76j62L01L60J59q3l13o24r72j277j686k386l082l211k776k504
60717D19929k894l609m022m037l973l917l630l047k512k409k736l101l104k625
60703C74313j830r74k76R7J20m6j52l8L23Q29J202J062M19o6L06J374K245K393
60685C81301K156K064K206K453K830L277L436L119K739K865L489M005L908L303
60671D23151K800K910L426L489K556J216N87R58J562J699J439J114Q61R79J919
60656D50666L418M316L838K654K051K334K583J768k23k556m070m221l548l045
60642D55965l098l400l806m470n072m832l693k648k370k344j918j416j481j919
60628D13498k050j719j262q91p30j029j801k518k747k600k242j604j026j289k372
$$ plain form
60734 441081 439161 438185 438023 438324 438684 438843 438760 438447 437823 436851 435574 433888 431502 428420 425209 422433 419929
60717 419929 417035 413426 409404 405367 401394 397477 393847 390800 388288 385879 383143 380042 376938 374313
60703 374313 372483 371509 371233 371330 371450 371404 371252 371214 371537 372366 373568 374630 375049 374983 375289 376663 378908 381301
60685 381301 383457 385521 387727 390180 393010 396287 399723 402842 405581 408446 411935 415940 419848 423151
60671 423151 425951 428861 432287 435776 438332 439548 440135 441093 442655 444354 445793 446907 447768 448747 450666
60656 450666 454084 458400 462238 464892 466943 469277 471860 473628 473405 470849 466779 462558 459010 455965
60642 455965 452867 449467 445661 441191 436119 431287 427594 424946 422576 420232 418314 416898 415417 413498
60628 413498 411448 409729 408467 407576 406846 405817 404016 401498 398751 396151 393909 392305 391279 389990 387618
60613C87618k998k239q48l5K04N32P96M51q4J40J007J455J060M20O0n6PK20K12
60594C87922k73p74p34m71o11r51q82n84o49q44n12J00K03l4K41R32J154R62J344
60575C85539K314K645J933J346J721K370K495K469K827L184L084K945L220L476
60561D21568L238K921L074L415L421L271L374L585L689M064N051O216P059P939
60547D81885R491J1538J3510J5489J8059K1295K4726K8101L1543L5114L8871M3122
60535G72744M7934N2441N5234N5208N1666M4006L2239J7721K622j1442k3769l3772
60523A062832m0673m4189m4899m3663m1119l7837l4413l1073k7497k3282j8465
60512F75722j3398q480m024j80L228O592J0050J3405J6632K0209K4695L0091L5868
$$ plain form
60613 387618 384620 382381 381533 381498 381702 382234 383030 383481 383397 383537 384544 385999 387059 387479 387539 387483 387490 387710 387922
60594 387922 387649 386875 386141 385670 385059 384108 383226 382642 381993 381149 380637 380737 380940 380906 381147 382079 383233 384195 385539
60575 385539 387853 390498 392431 393777 395498 397868 400363 402832 405659 408843 411927 414872 418092 421568
60561 421568 424806 427727 430801 434216 437637 440908 444282 447867 451556 455620 460671 466887 473946 481885
60547 481885 491376 502914 516424 531913 549972 571267 595993 624094 655637 690751 729622 772744
60535 772744 820678 873119 928353 983561 1035227 1079233 1111472 1129193 1131815 1120373 1096604 1062832
60523 1062832 1022159 977970 933071 889408 848289 810452 776039 744966 717469 694187 675722
60512 675722 662324 653844 649820 649640 652868 659460 669510 682915 699547 719756 744451 774542 810410
60499H10410M1525M6742N1041N3532N3200M9382M1961L1501J9376P519k381r546
60487A194262j3931j5602j4578j1073n484J940J1016K1238L1865M2438N2708O1796
60475A356595O7860O8950O4002N2948L6384J5631p197k9702m9853o6166p7727
60464A431725q4353q6597q5317q1443p6115p0430o4754n8699n2109m5506l9417
60453F86985l3845k8893k5141k2746k0828j8475j5846j3547j1490r273p208n899
60441D73794n111m051k632j426n87J86P35N65q4l51q2k0m63p44m12r0o30j986
60423D56611l341l863l191j656k14L07%l95l92J41J393L293M899N152M305L706
60407D66755M076M911N695O696Q275J0222J2145J3763J4602J4293J3394J3062
$$ plain form
60499 810410 851935 898677 949718 1003250 1056450 1105832 1147793 1179294 1198670 1206189 1203808 1194262
60487 1194262 1180331 1164729 1150151 1139078 1133594 1135534 1146550 1167788 1199653 1242091 1294799 1356595
60475 1356595 1424455 1493405 1557407 1610355 1646739 1662370 1655173 1625471 1575618 1509452 1431725
60464 1431725 1347372 1260775 1175458 1094015 1017900 947470 882716 824017 771908 726402 686985
60453 686985 653140 624247 599106 576360 555532 537057 521211 507664 496174 486901 479693 473794
60441 473794 468683 464632 462000 460574 459987 460173 460908 461473 461389 461038 460956 460936 460473 459729 459317 459227 458597 456611
60423 456611 453270 449407 446216 444560 444346 444653 444653 444258 443866 444007 445400 448693 453592 458744 463049 466755
60407 466755 470831 475742 481437 488133 496408 506630 518775 532538 547140 561433 574827 587889
60395E87889J3582J4064J3821J3218J2745J2179J1152R768Q242O636N251M525
60383G13072M190L421K145J246J110J024N63M50J199J935J502O4j359k310k974
60368G25278l406l541l549l463k885j721p34o12r62r63o02m81p75j099j142q50
60352F98493k48L69M36j80q46r91q34q54j138j782l225n493p628q582q255p190
60336F52052n823m690m476n059n211m280l399l894n188n685n242n136n793o171
60322E82005n601m775m422m242l777l370l561m150m472m222l535k621j599m43
60308E31215R51K441L454L628L496L973N251O837Q505J0392J2033J2356J0948
60295F15480Q636O259L575n2m365q224j0726j1811j1875j1281j0282r109p954
$$ plain form
60395 587889 601471 615535 629356 642574 655319 667498 678650 688418 696660 703296 708547 713072
60383 713072 717262 720683 722828 724074 725184 726208 726771 727221 728420 730355 731857 731921 730562 728252 725278
60368 725278 721872 718331 714782 711319 708434 706713 705979 705367 704405 703442 702840 702359 701584 700485 699343 698493
60352 698493 698245 698614 699050 698870 698024 697033 696199 695345 694207 692425 689200 683707 676079 667497 659242 652052
60336 652052 646229 641539 637063 632004 626793 622513 619114 615220 610032 604347 599105 593969 588176 582005
60322 582005 576404 571629 567207 562965 559188 555818 552257 548107 543635 539413 535878 533257 531658 531215
60308 531215 532166 534607 538061 541689 545185 549158 554409 561246 569751 580143 592176 604532 615480
60295 615480 624116 630375 633950 633898 629533 621309 610583 598772 586897 575616 565334 556225 548271
60282E48271o870n671m121k298p18J58M90Q97J730K703L308L463L641M406N781
60267E55170P076P516P072O422O111O076O154O528P293Q074Q579R132J0049J0784
60253F62036J0487R348Q610R056J0088J0570J0234R954J0718J2551J4404J5213
60241G93269J5068J5080J6004J7411J8538J9467K0868K2893K5125K7470L0345
60230A021538L3851L7510M1055M4851M9199N3759N8036O2016O5834O9100P1076
60219A607825P1545P1023P0070O8565O5887O1668N6190N0005M3411L6485K9495
60208B232169K2943J7065J1545N961L20m949r369j2615j4464j4908j4231j2805
60196B206662j0757p900m033P36N922J1055J6143K1605K7590L3655L9373M4897
$$ plain form
60282 548271 541401 535730 531609 529311 528593 528751 529241 530138 531868 534571 537879 541342 544983 549389 555170
60267 555170 562246 569762 576834 583256 589367 595443 601597 608125 615418 623492 632071 641203 651252 662036
60253 662036 672523 681871 690481 699537 709625 720195 730429 740383 751101 763652 778056 793269
60241 793269 808337 823417 839421 856832 875370 894837 915705 938598 963723 991193 1021538
60230 1021538 1055389 1092899 1133954 1178805 1228004 1281763 1339799 1401815 1467649 1536749 1607825
60219 1607825 1679370 1750393 1820463 1889028 1954915 2016583 2072773 2122778 2166189 2202674 2232169
60208 2232169 2255112 2272177 2283722 2289683 2290003 2285054 2275685 2263070 2248606 2233698 2219467 2206662
60196 2206662 2195905 2188005 2183972 2184708 2190630 2201685 2217828 2239433 2267023 2300678 2340051 2384948
60184B384948N0419N5436N9197O1684O3268O3490O1228N6222M9464M1762L2895
60173B980013K2633J1539J14j1904k4537l6695m7192n5935o3230o8646p1587p2421
60161B562152p1849o9659o5251n9008n1993m4483l6113k7262j8932j1148k847
60150B103607O264J4913K1747K6642L0023L1752L1366K8809K4406J8557J1918
60139B350004N365o77o548j2618j8531k3467k6879k8735k9221k8409k6015k1520
60127B132749j4839o785J548R848J8612K8224L8558M9508O1219P3538Q5858R7778
60115B575816J09502J21244J32717J43458J53285J62029J69053J73455J74560
60106C915119J72013J65592J55275J41504J25173J07071Q7296O5382M1279J6108
$$ plain form
60184 2384948 2435367 2490803 2550000 2611684 2674952 2738442 2799670 2855892 2905356 2947118 2980013
60173 2980013 3002646 3014185 3014299 3002395 2977858 2941163 2893971 2838036 2774806 2706160 2634573 2562152
60161 2562152 2490303 2420644 2355393 2296385 2244392 2199909 2163796 2136534 2117602 2106454 2103607
60150 2103607 2109871 2124784 2146531 2173173 2203196 2234948 2266314 2295123 2319529 2338086 2350004
60139 2350004 2355369 2354692 2348144 2335526 2316995 2293528 2266649 2237914 2208693 2180284 2154269 2132749
60127 2132749 2117910 2111125 2112673 2122521 2141133 2169357 2207915 2257423 2318642 2392180 2478038 2575816
60115 2575816 2685318 2806562 2939279 3082737 3236022 3398051 3567104 3740559 3915119
60106 3915119 4087132 4252724 4407999 4549503 4674676 4781747 4869043 4934425 4975704 4991812
60096D991812q572l2244n5499p8296r8990j15822j28669j38324j44685j46922
60086D043789j45339j41547j36497j29506j19761j07764r4724q1381o8065n5123
60076B964082m2539k9729j6515l863P027J5957K3380K9233L2944L4417L4077L2037
60064C080508K7941K1852J4561O760j436r857j7765k4606l0924l7737m5100n1894
60052B932303n7233o1466o5369o8846p1020p1400p0319o8197o4967o0429n4642
60041B218415m7764l9890l1328k2619j4062n462L380J2336K1289L0468M0060M9770
60029B214593N8938O6841P2760P6144P7086P6069P3067O7398N8864M8402L7155
60018B927317K5417J3069M68j1785k3551l4883m5362n4356o1595o6934o9917p0261
$$ plain form
60096 4991812 4983240 4950996 4895497 4817201 4718211 4602389 4473720 4335396 4190711 4043789
60086 4043789 3898450 3756903 3620406 3490900 3371139 3263375 3168651 3087270 3019205 2964082
60076 2964082 2921543 2891814 2875299 2871436 2878463 2894420 2917800 2947033 2979977 3014394 3048471 3080508
60064 3080508 3108449 3130301 3144862 3151622 3150186 3140329 3122564 3097958 3067034 3029297 2984197 2932303
60052 2932303 2875070 2813604 2748235 2679389 2608369 2536969 2466650 2398453 2333486 2273057 2218415
60041 2218415 2170651 2130761 2099433 2076814 2062752 2057290 2060670 2073006 2094295 2124763 2164823 2214593
60029 2214593 2273531 2340372 2413132 2489276 2566362 2642431 2715498 2782896 2841760 2890162 2927317
60018 2927317 2952734 2965803 2966271 2954486 2930935 2896052 2850690 2796334 2734739 2667805 2597888 2527627
60006B527627o8458o5262o0868n5164m8438m1106l3225k4894j6696q918q70Q071
59994B111799J7309K5823L3754M2031N0847N9678O8443P7326Q5626R2102R6352
59983B761090R8622R8348R4399Q6831P7052O6043N3707M0184K6283J2265k425
59972C412399j7662l2198m5144n6630o6422p3323p6738p7619p6906p4171o8743
59961B746843o1206n2681m3488l3537k3347j3566l999N867J5784K4990L3258M0954
59949B635872M8284N5107O1167O6068O9222P0195O8842O5139N9487N3201M7684
59938C300268M2800L7144L0286K3602J8255J3654Q915M794K880L611O348J0863
59926C503420J7539K6306L6549M7968O0663P4538Q9204J04190J18687J31474J41819
$$ plain form
60006 2527627 2459169 2393907 2333039 2277875 2229437 2188331 2155106 2130212 2113516 2104598 2103728 2111799
59994 2111799 2129108 2154931 2188685 2230716 2281563 2341241 2409684 2487010 2572636 2664738 2761090
59983 2761090 2859712 2958060 3052459 3139290 3216342 3282385 3336092 3376276 3402559 3414824 3412399
59972 3412399 3394737 3362539 3317395 3260765 3194343 3121020 3044282 2966663 2889757 2815586 2746843
59961 2746843 2685637 2632956 2589468 2555931 2532584 2519018 2515019 2520886 2536670 2561660 2594918 2635872
59949 2635872 2684156 2739263 2800430 2866498 2935720 3005915 3074757 3139896 3199383 3252584 3300268
59938 3300268 3343068 3380212 3410498 3434100 3452355 3466009 3474924 3479718 3482598 3486209 3492557 3503420
59926 3503420 3520959 3547265 3583814 3631782 3692445 3766983 3856187 3960377 4079064 4210538 4352357
59915D352357J49950J55930J58581J56262J48273J34636J15258R0459O1924L1919
59905E555549J681k8378n7178q2809j03984j20554j32541j39537j41361j38566
59895D612322j32136j23159j12754j01658q9839p6964o3164m8822l3950j8540
59885C811336l226J1267K5234L9616N4487O8752Q1492R2692J02470J10399J15757
59874D510276J17753J15207J06736R1681P0540M4485J5087j5400m4339o9848r1307
59863D850871j08544j21138j28859j32260j32287j29567j24497j17755j10194
59854C745770j02205r3504q3688p2814o1418m9995l8652k7417j6832p928j402
59843C189915L071O607J0383J5174K1256K8387L5944M3238M9468N3447N3996N0982
$$ plain form
59915 4352357 4502307 4658237 4816818 4973080 5121353 5255989 5371247 5461706 5523630 5555549
59905 5555549 5557230 5528852 5471674 5388865 5284881 5164327 5031786 4892249 4750888 4612322
59895 4612322 4480186 4357027 4244273 4142615 4052776 3975812 3912648 3863826 3829876 3811336
59885 3811336 3808110 3819377 3844611 3884227 3938714 4007466 4088958 4181650 4284120 4394519 4510276
59874 4510276 4628029 4743236 4849972 4941653 5012193 5056678 5071765 5056365 5012026 4942178 4850871
59863 4850871 4742327 4621189 4492330 4360070 4227783 4098216 3973719 3855964 3745770
59854 3745770 3643565 3550061 3466373 3393559 3332141 3282146 3243494 3216077 3199245 3191317 3189915
59843 3189915 3192986 3199593 3209976 3225150 3246406 3274793 3310737 3353975 3403443 3456890 3510886 3561868
59831C561868M5498L8499K9662J8297N017q317k0219l0424l9053m5818n0336n2764
59819C451910n3759n4041n4275n4989n6296n7707n8459n8078n6668n4719n2522
59808B840397m9840m6281m1982l7691l4078l1331k9435k8362k7758k7010k6026
59797B460603k5489k5677k5530k3591j9775j5385j1340p076j394O095J4734K3676
59785B349851L2756M2516N3556O5847P8840R2204J06197J21201J37120J53262
59775C233350J68258J79593J83520J76129J54922J19872P3832K2274k8165p1992
59765D211593j06325j30305j43906j47852j44135j35569j24445j11852r8044q3204
59755B985956o7999n3729m1732l2233k4139j6243q336q08O242J2954J9231K5071
$$ plain form
59831 3561868 3607366 3645865 3675527 3693824 3698841 3690524 3670305 3639881 3600828 3555010 3504674 3451910
59819 3451910 3398151 3344110 3289835 3234846 3178550 3120843 3062384 3004306 2947638 2892919 2840397
59808 2840397 2790557 2744276 2702294 2664603 2630525 2599194 2569759 2541397 2513639 2486629 2460603
59797 2460603 2435114 2409437 2383907 2360316 2340541 2325156 2313816 2306740 2305346 2311441 2326175 2349851
59785 2349851 2382607 2425123 2478679 2544526 2623366 2715570 2821767 2942968 3080088 3233350
59775 3233350 3401608 3581201 3764721 3940850 4095772 4215644 4289476 4311750 4283585 4211593
59765 4211593 4105268 3974963 3831057 3683205 3539070 3403501 3279056 3167204 3069160 2985956
59755 2985956 2917957 2864228 2822496 2790263 2766124 2749881 2741545 2740737 2746979 2759933 2779164 2804235
59743B804235L0958L7238M3482M9298N5384O2876P1759Q1038R0319J00233J11210
59732C538030J22871J34970J47931J62043J76928J92305K08574K25952K43594
59723E153198K60224K75304K88951L00748L09189L12345L08967K99026K83652
59714G791604K64624K43801K22833K03177J86129J72587J62778J56208J51918
59705I555659J48837J45987J42374J37002J29203J18944J06538R2206P6277N9611
59695A0712638M3222K7400J1918k685j4735k2704k6321k6009k1874j3770j832
59684A0665248J3718L2904N5648Q1367J09323J38848J68867J97879K25064K50718
59674A1939584K74841K95879L11640L20764L22292L14441K95141K63572K20196
$$ plain form
59743 2804235 2835193 2872431 2915913 2965211 3020595 3083471 3155230 3236268 3326587 3426820 3538030
59732 3538030 3660901 3795871 3943802 4105845 4282773 4475078 4683652 4909604 5153198
59723 5153198 5413422 5688726 5977677 6278425 6587614 6899959 7208926 7507952 7791604
59714 7791604 8056228 8300029 8522862 8726039 8912168 9084755 9247533 9403741 9555659
59705 9555659 9704496 9850483 9992857 10129859 10259062 10378006 10484544 10576750 10653027 10712638
59695 10712638 10755860 10783260 10795178 10792493 10777758 10755054 10728733 10702724 10680850 10667080 10665248
59684 10665248 10678966 10711870 10767518 10848885 10958208 11097056 11265923 11463802 11688866 11939584
59674 11939584 12214425 12510304 12821944 13142708 13465000 13779441 14074582 14338154 14558350
59665A4558350J65643J00912K8551m7632j24102j97720k64570l20312l62409l91041
59655A3145670m07463m12386m06449l91215l69221l43963l20506l05031l02314
59646I887122l13162l34229l59890l84233m02465m11904m12217m04603l90677
59637F473742l71996l50067l26310l01832k77294k53039k29492k07445j87576
59628C968691j69607j52433j35452j19323j04986r2462q1247p1235o2498n4637
59618B924811m7383m1463l7692l5477l3383l1143k9788k9708k9831k9182k8113
59607B551648k7534k7835k9008l0909l2887l3946l3787l3120l2566l1994l1116
59596B206946k9952k8319k5821k2858k0777k0263k0300j9444j7539j5470j3718
$$ plain form
59665 14558350 14723993 14824905 14853456 14805824 14681722 14484002 14219432 13899120 13536711 13145670
59655 13145670 12738207 12325821 11919372 11528157 11158936 10814973 10494467 10189436 9887122
59646 9887122 9573960 9239731 8879841 8495608 8093143 7681239 7269022 6864419 6473742
59637 6473742 6101746 5751679 5425369 5123537 4846243 4593204 4363712 4156267 3968691
59628 3968691 3799084 3646651 3511199 3391876 3286890 3194428 3113181 3041946 2979448 2924811
59618 2924811 2877428 2835965 2798273 2762796 2729413 2698270 2668482 2638774 2608943 2579761 2551648
59607 2551648 2524114 2496279 2467271 2436362 2403475 2369529 2335742 2302622 2270056 2238062 2206946
59596 2206946 2176994 2148675 2122854 2099996 2079219 2058956 2038656 2019212 2001673 1986203 1972485
59585A972485j1979r912p581n205k909o62J798M724P881J0635J2747J4711J7109
59572B003842J9961K2897K5569K7769K9621L1764L4834L8582M2095M5101M8337
59561B370372N2422N6977O1292O5252O9193P3355P7848Q2597Q7025R0478R3313
59550C180124R6761J01143J05027J07046J07872J09066J10053J07461R8110Q2244
59540D204907O3367M5177K9081J4458N84j2400k4180l4996m5187n4592o2969p0519
59528D052731p7225q2148q4284q3937q2213p9324p4441o7252n8458m8553l7243
59517C277653k4499j1118K326J6210L1020M6562O2462P8644R4754J09852J23202
59506C807068J34606J43390J47802J46145J38001J23916J04571Q0808N3761K4400
$$ plain form
59585 1972485 1960506 1950594 1943013 1937808 1934899 1934237 1936035 1940759 1948640 1959275 1972022 1986733 2003842
59572 2003842 2023803 2046700 2072269 2100038 2129659 2161423 2196257 2234839 2276934 2322035 2370372
59561 2370372 2422794 2479771 2541063 2606315 2675508 2748863 2826711 2909308 2996333 3086811 3180124
59550 3180124 3276885 3378028 3483055 3590101 3697973 3807039 3917092 4024553 4122663 4204907
59540 4204907 4268274 4313451 4342532 4356990 4357574 4345174 4320994 4285998 4240811 4186219 4123250 4052731
59528 4052731 3975506 3893358 3809074 3725137 3642924 3563600 3489159 3421907 3363449 3314896 3277653
59517 3277653 3253154 3242036 3244362 3260572 3291592 3338154 3400616 3479260 3574014 3683866 3807068
59506 3807068 3941674 4085064 4232866 4379011 4517012 4640928 4745499 4826307 4880068 4904468
59496D904468o535l7701o6952r2589j14077j31151j43035j49241j50334j47151
59486C865702j39991j29328j16510j02863q8716p4056n9395m5057l0445j5204
59476C064137n17J2033K2407L1790M0638M8305N4308N8640O0753N9543N4600M6580
59464C553217L6209K3732R542n545k0932l6439n1679o5881p8562q9722r9156j06109
59452C068675j10000j11092j10265j08319j05601j02048r7531r2331q7108q2232
59442B062148p7457p2490o7486o2610n7505n1897m6312m1516l7455l3515k9557
59431A484348k5891k2371j8472j4256j0383p008l596j4L248O368J0572J6219K1093
59418A439857K1850J7347R809K725j826l770l936l055j389J422O059J2232J7641
$$ plain form
59496 4904468 4897933 4860232 4793280 4700691 4586614 4455463 4312428 4163187 4012853 3865702
59486 3865702 3725711 3596383 3479873 3377010 3288294 3214238 3154843 3109786 3079341 3064137
59476 3064137 3063620 3075653 3098060 3129850 3170488 3218793 3273101 3331741 3392494 3452037 3506637 3553217
59464 3553217 3589426 3613158 3622700 3617155 3596223 3559784 3508105 3442224 3363662 3273940 3174784 3068675
59452 3068675 2958675 2847583 2737318 2628999 2523398 2421350 2323819 2231488 2144380 2062148
59442 2062148 1984691 1912201 1844715 1782105 1724600 1672703 1626391 1584875 1547420 1513905 1484348
59431 1484348 1458457 1436086 1417614 1403358 1392975 1385967 1382371 1382357 1385605 1391973 1402545 1418764 1439857
59418 1439857 1461707 1479054 1488863 1491588 1489762 1485992 1482056 1479001 1477612 1479034 1485093 1497325 1514966
59405A514966J9151J5720R723M717K297J786K400M421Q113J2845J7852K2990K8154
59392A665135L2698L6219L9399M3368M8451N4117N9786O5183P0210P5056Q0211
59381B269833Q5882R1461R6039R9310J01786J04344J07761J12475J18510J25909
59371C313310J35275J47377J62072J78286J95356K13661K33372K53267K71444
59362E103420K86680K98342L05484L06949L02317K92090K77052K57986K35777
59353G666097K11307J85226J58128J30654J02948P4365M4134J2134k1266n5774
59343H507953r1205j27314j63825k00116k34496k64491k88428l06120l17638l22291
59333F192029l19723l11232k98968k84214k67497k49765k32275k15443j98970
$$ plain form
59405 1514966 1534117 1549837 1559560 1564277 1566574 1568360 1570760 1575181 1583294 1596139 1613991 1636981 1665135
59392 1665135 1697833 1734052 1773451 1816819 1865270 1919387 1979173 2044356 2114566 2189622 2269833
59381 2269833 2355715 2447176 2543215 2642525 2744311 2848655 2956416 3068891 3187401 3313310
59371 3313310 3448585 3595962 3758034 3936320 4131676 4345337 4578709 4831976 5103420
59362 5103420 5390100 5688442 5993926 6300875 6603192 6895282 7172334 7430320 7666097
59353 7666097 7877404 8062630 8220758 8351412 8454360 8528725 8572859 8584993 8563727 8507953
59343 8507953 8416748 8289434 8125609 7925493 7690997 7426506 7138078 6831958 6514320 6192029
59333 6192029 5872306 5561074 5262106 4977892 4710395 4460630 4228355 4012912 3813942
59324C813942j83071j68556j55690j43863j32518j21616j11118j00866r1065q2220
59314B523359p4416o7275o0665n4813m9644m4677l9685l4943l0661k6645k2597
59303B017338j8422j4133r634m611J345P863J2862J3462Q840J685m028o465o347
59290A999755m740j877J980O116J0278J4955K0302K5579L0169L4287L8204M1372
59278B216380M2967M2874M1656L9652L6499L1466K4191J5228N821l045j1356j9661
59266B462672k8186l6627m4432n0912n5357n7666n8650n9168n9164n8161n6400
59255A897949n4663n3060n0786m7325m3249l9522l6484l3644l0257k6015k1422
59244A461522j7367j4113j0960p287l523n85J369L070N223P964J1023J3913J6246
$$ plain form
59324 3813942 3630871 3462315 3306625 3162762 3030244 2908628 2797510 2696644 2605579 2523359
59314 2523359 2448943 2381668 2321003 2266190 2216546 2171869 2132184 2097241 2066580 2039935 2017338
59303 2017338 1998916 1984783 1975149 1970538 1971883 1979746 1992608 2006070 2014910 2016595 2012567 2006102 1999755
59290 1999755 1995015 1993138 1995118 2001234 2011512 2026467 2046769 2072348 2102517 2136804 2175008 2216380
59278 2216380 2259347 2302221 2343877 2383529 2420028 2451494 2475685 2490913 2496734 2493689 2482333 2462672
59266 2462672 2434486 2397859 2353427 2302515 2247158 2189492 2130842 2071674 2012510 1954349 1897949
59255 1897949 1843286 1790226 1739440 1692115 1648866 1609344 1572860 1539216 1508959 1482944 1461522
59244 1461522 1444155 1430042 1419082 1411795 1408272 1407687 1409056 1412126 1417349 1425313 1436336 1450249 1466495
59231A466495J8329K1094K4869K8769L1945L4958L8969M4073M9480N5053O1434
59220A875468O8774P6486Q4436R3227J03127J13580J24125J34957J46369J58254
59210B978803J70290J81857J91652J98106K00333J98023J90461J76611J56270
59201D642406J30359R9799O4958K6554j3636n3334r0533j23505j50713j71208
59191D361147j84898j92349j94530j92570j87162j78337j66404j52854j39501
59182B772542j26738j13559r9435q5318p2487o1136n0577m0311l0581k2033j5058
59171B055309r334m206L13L296L961K479p44n781j2324j8879k4066k8310l2970
59158A928744l7975m1750m3385m3558m3175m2407m1300m0127l8717l6481l3460
$$ plain form
59231 1466495 1484824 1505918 1530787 1559556 1591501 1626459 1665428 1709501 1758981 1814034 1875468
59220 1875468 1944242 2020728 2105164 2198391 2301518 2415098 2539223 2674180 2820549 2978803
59210 2978803 3149093 3330950 3522602 3720708 3921041 4119064 4309525 4486136 4642406
59201 4642406 4772765 4872564 4937522 4964076 4950440 4897106 4806573 4683068 4532355 4361147
59191 4361147 4176249 3983900 3789370 3596800 3409638 3231301 3064897 2912043 2772542
59182 2772542 2645804 2532245 2432810 2347492 2275005 2213869 2163292 2122981 2092400 2070367 2055309
59171 2055309 2045975 2041769 2042082 2045378 2049339 2051818 2051074 2045293 2032969 2014090 1990024 1961714 1928744
59158 1928744 1890769 1849019 1805634 1762076 1718901 1676494 1635194 1595067 1556350 1519869 1486409
59147A486409l0497k8146k6269k4691k3254k1247j8013j4253j1459r835q091n545
59135A265109l051j404j79J227K562L449M084M579M668M565M997N889O163N481
59121A308139M985N526O402O756P035Q002R226R787R720R652R639R390R110R133
59107A422502R129Q638P996P903Q341Q730Q882R134R748J0662J1655J2465J3059
59094A548844J3961J5800J8390K0966K3438K6454K9969L2870L4554L5735L7053
59083A838034L7978L7899L7186L6175L4103L0163K4815J8922J2356M697l428j0994
59071B097906j8017k5074l1844l7417m1659m5048m7434m8260m7932m7575m7439
59060A660207m6739m5173m3362m1581l9257l6206l3345l1535l0443k9215k7714
$$ plain form
59147 1486409 1455912 1427766 1401497 1376806 1353552 1332305 1314292 1300039 1288580 1278745 1270654 1265109
59135 1265109 1262058 1260654 1260475 1261702 1264264 1267713 1271797 1276376 1281044 1285609 1290606 1296495 1302658 1308139
59121 1308139 1313124 1318650 1325052 1331808 1338843 1346845 1356071 1365858 1375578 1385230 1394869 1404259 1413369 1422502
59107 1422502 1431631 1440269 1448265 1456168 1464509 1473239 1482121 1491255 1501003 1511665 1523320 1535785 1548844
59094 1548844 1562805 1578605 1596995 1617961 1641399 1667853 1697822 1730692 1765246 1800981 1838034
59083 1838034 1876012 1913911 1951097 1987272 2021375 2051538 2076353 2095275 2107631 2112328 2108900 2097906
59071 2097906 2079889 2054815 2022971 1985554 1943895 1898847 1851413 1803153 1755221 1707646 1660207
59060 1660207 1613468 1568295 1524933 1483352 1444095 1407889 1374544 1343009 1312566 1283351 1255637
59049A255637k6450k5588k4668k3283k1559j9838j8139j6180j3905j1743j0138
59038A044146q996p956p048o686o882p050o732o085n437m725l753k613j598q42
59024I67743j99O73K093L906N377N931N866N834N864N666N628O507Q104R408J0129
59009A048530J0983J2179J3002J3309J4141J6094J8333K0112K2127K5179K8569
58998A242558L1077L2843L4990L7787M0427M2237M3030M2535M0505L7311L3496
58987A658796K8813K2617J5074P287K36n827j1053j5628j9634k2859k4957k6068
58975A606797k6856k7556k7617k6786k5832k5462k5131k3826k1517j8976j6486
58964A340752j3749j0777p945n275k514J34K145L430M377N123N449N280M806M196
$$ plain form
59049 1255637 1229187 1203599 1178931 1155648 1134089 1114251 1096112 1079932 1066027 1054284 1044146
59038 1044146 1035150 1027194 1020146 1013460 1006578 999528 992796 986711 981274 976549 972796 970183 968585 967743
59024 967743 967544 968217 970310 974216 979593 985524 991390 997224 1003088 1008754 1014382 1020889 1028993 1038401 1048530
59009 1048530 1059513 1071692 1084694 1098003 1112144 1128238 1146571 1166683 1188810 1213989 1242558
58998 1242558 1273635 1306478 1341468 1379255 1419682 1461919 1504949 1547484 1587989 1625300 1658796
58987 1658796 1687609 1710226 1725300 1732587 1732823 1726996 1715943 1700315 1680681 1657822 1632865 1606797
58975 1606797 1579941 1552385 1524768 1497982 1472150 1446688 1421557 1397731 1376214 1357238 1340752
58964 1340752 1327003 1316226 1308281 1303006 1300492 1300626 1302771 1306201 1310578 1315701 1321150 1326430 1331236 1335432
58950A335432L700L822M861O456Q053R575J1188J2746J4058J5391J7070J8849
58938A461201K0308K1685K3616K6177K8905L1685L4992L9163M3965M9022N4314
58927A835033O0013O5885P1014P4190P4762P2989O9354O3763N6090M7384L9758
58916B530235L4856L2963L3666L6604M1365M7439N4553O2544P0875P9072Q7589
58905C111761R7213J07559J17353J26366J35662J45637J55402J64668J74594J85740
58895D521955J96675K05705K12562K17115K17837K13258K04101J92414J79323
58886F360945J65000J49945J34741J18945J01637Q2629O2058L9532J4950j0568
58876G219814l5908o1384q7441j12656j34717j52941j68253j81080j90976j98067
$$ plain form
58950 1335432 1339132 1342954 1347815 1354271 1362324 1371899 1383087 1395833 1409891 1425282 1442352 1461201
58938 1461201 1481509 1503194 1526810 1552987 1581892 1613577 1648569 1687732 1731697 1780719 1835033
58927 1835033 1895046 1960931 2031945 2106135 2180897 2253886 2323240 2387003 2443093 2490477 2530235
58916 2530235 2565091 2598054 2631720 2668324 2709689 2757128 2811681 2874225 2945100 3024172 3111761
58905 3111761 3208974 3316533 3433886 3560252 3695914 3841551 3996953 4161621 4336215 4521955
58895 4521955 4718630 4924335 5136897 5354012 5571849 5785107 5989208 6181622 6360945
58886 6360945 6525945 6675890 6810631 6929576 7031213 7113842 7175900 7215432 7230382 7219814
58876 7219814 7183906 7122522 7035081 6922425 6787708 6634767 6466514 6285434 6094458 5896391
58866E896391k03046k05769k05441k02390j98115j93420j87842j81060j73583
58857D145725j65824j57612j48924j40151j31579j23371j15915j09214j02224
58848B950911r4012q5326p7766p1505o5246n8348n1612m5751m0441l5229l0217
58837B295458k5513k0950j6668j3124j0270p470m344r88K575O353R888J2781J5640
58824B243368J9492K4275K8828L2400L5276L7871M0219M2382M4527M6555M8383
58813B643576N0450N3208N6364N9573O3468O8944P5717Q2805R0213R8852J08807
58802C451977J19041J28925J38847J49138J59509J69714J79712J88931J96310
58793D882104K01390K04547K06018K05301K01564J93907J81503J64287J43335
$$ plain form
58866 5896391 5693345 5487576 5282135 5079745 4881630 4688210 4500368 4319308 4145725
58857 4145725 3979901 3822289 3673365 3533214 3401635 3278264 3162349 3053135 2950911
58848 2950911 2856899 2771573 2693807 2622302 2557056 2498708 2447096 2401345 2360904 2325675 2295458
58837 2295458 2269945 2248995 2232327 2219203 2208933 2201463 2197119 2196131 2198706 2205059 2214947 2227728 2243368
58824 2243368 2262860 2287135 2315963 2348363 2383639 2421510 2461729 2504111 2548638 2595193 2643576
58813 2643576 2694026 2747234 2803598 2863171 2926639 2995583 3071300 3154105 3244318 3343170 3451977
58802 3451977 3571018 3699943 3838790 3987928 4147437 4317151 4496863 4685794 4882104
58793 4882104 5083494 5288041 5494059 5699360 5900924 6094831 6276334 6440621 6583956
58784F583956J19769R3555O4383L3205J817k8828n8766q7827j15542j41866j66584
58773F297272j88166k04658k15713k22487k25668k25006k20863k14630k07356
58764D372725j99080j89728j79573j68799j57683j47141j37925j29497j20817
58755B942482j12019j03957r6515q8975q1693p5627p0310o4276n7560n1758m7372
58744B092420m3044l8038l3428l0069k7131k3613j9867j6682j4110j1912j0004
58733A824522p777m144J035O634J1708J6084J9136J9484J6551J1193M171m663
58721A913934j4984k5149l3548l9889m4480m7389m8974n0075n0949n0922m9602
58710A457973m7543m5201m2271l8561l4449l0015k4788j8794j2852p452k317K597
$$ plain form
58784 6583956 6703725 6797280 6861663 6894868 6896685 6867857 6809091 6721264 6605722 6463856 6297272
58773 6297272 6109106 5904448 5688735 5466248 5240580 5015574 4794711 4580081 4372725
58764 4372725 4173645 3983917 3804344 3635545 3477862 3330721 3192796 3063299 2942482
58755 2942482 2830463 2726506 2629991 2541016 2459323 2383696 2313386 2249110 2191550 2139792 2092420
58744 2092420 2049376 2011338 1977910 1947841 1920710 1897097 1877230 1860548 1846438 1834526 1824522
58733 1824522 1816745 1812601 1813636 1820270 1831978 1848062 1867198 1886682 1903233 1914426 1918597 1913934
58721 1913934 1898950 1873801 1840253 1800364 1755884 1708495 1659521 1609446 1558497 1507575 1457973
58710 1457973 1410430 1365229 1322958 1284397 1249948 1219933 1195145 1176351 1163499 1156047 1153730 1156327
58698A156327O836J0307J3042J3866J0918M082m543j3080k1222k8655l4012l6551
58686A077315l7304l7308l5974l2433k7491k2842j9091j5678j2116q362m550j136
58674H23030J181K390L571N697Q592J1346J3229J3850J3071J1062P943L437k406
58661I15993q365j2958j6036j8393k0095k0589k0234j9992j9627j8040j5470j3457
58649G12737j2250j0424p546n189m394m086l041j627n30O11K110L298L767M205
58635F77641M948N116M280L551L918M773N121N108N304N634N943O485P086P086
58621G51994O815P649R861J1963J3031J4084J6071J8157J9258J9822K0831K2355
58609I31891K4163K6462K9019L0930L2315L4614L8248M1656M3871M6185M9820
$$ plain form
58698 1156327 1163163 1173470 1186512 1200378 1211296 1215378 1210835 1197755 1176533 1147878 1113866 1077315
58686 1077315 1040011 1002703 966729 934296 906805 883963 864872 849194 837078 828716 824166 823030
58674 823030 824211 826601 830172 835869 844461 855807 869036 882886 895957 907019 914962 918399 915993
58661 915993 907628 894670 878634 860241 840146 819557 799323 779331 759704 741664 726194 712737
58649 712737 700487 690063 682517 677328 672934 668848 665807 664180 663650 664261 666371 669669 673436 677641
58635 677641 682589 687705 691985 695536 699454 704227 709348 714456 719760 725394 731337 737822 744908 751994
58621 751994 758809 766458 776319 788282 801313 815397 831468 849625 868883 888705 909536 931891
58609 931891 956054 982516 1011535 1042465 1074780 1109394 1147642 1189298 1233169 1279354 1329174
58598A329174N3745N6488N8462O0691O2609O2936O1528N8637N3590M5971L7033
58587A940864K8177J9070Q866j766j1544k0421k8803l5927m0773m3747m5806m6761
58575A721429m6040m4225m2245l9888l6750l3721l1814l0348k8095k5509k3957
58564A338837k3389k2535k0991j9439j8074j6512j5019j4365j4529j4781j4888
58553A144315j5237j6073j7454j9516k1985k4024k5330k6562k7923k8267k6709
58542H95235k4169k2226k1198k0380j9365j8132j6606j5027j4031j3576j2768
58531F97757j1347j0262j0072j0091r808r644r573q639o772n343m853l943j919
58518E95491k56j71o15k56L25K50K70J214K208K399K760M224N652N796N696O936
$$ plain form
58598 1329174 1382919 1439407 1497869 1558560 1621169 1684105 1745633 1804270 1857860 1903831 1940864
58587 1940864 1969041 1988111 1996977 1995211 1983667 1963246 1934443 1898516 1857743 1813996 1768190 1721429
58575 1721429 1675389 1631164 1588919 1549031 1512281 1478560 1446746 1416398 1388303 1362794 1338837
58564 1338837 1315448 1292913 1271922 1252483 1234409 1217897 1202878 1188513 1173984 1159203 1144315
58553 1144315 1129078 1113005 1095551 1076035 1054050 1030026 1004696 978134 950211 921944 895235
58542 895235 871066 848840 827642 807262 787897 769765 753159 738132 724101 710525 697757
58531 697757 686410 676148 666076 655985 646177 636533 626960 618321 611549 606206 601353 597410 595491
58518 595491 595235 595064 594449 594193 594518 594768 595038 596252 598460 600859 603619 607843 613495 619291 624987 631923
58502F31923Q936J0220J0982J2131J3050J2628J1437J0632R751P694M867K377
58490G46628K14j868l037k950l157m799o408o276n493o092p588q044p427p161
58476F76542p402p316p138p463p453o199m794m640m884m020k810k873l603l386
58462F02561k717l163m195m083l136k966l360k833j674j346j548q32M00N04l31
58447E71281m51K81P44J122K313L444K987J807K056L510M107L585L451L808L354
58432F07399K227J719J519L95q69m49R70J055j00k20R44J295L66N5J017J696J474
58415F20493J604K518L161L428M409N798N886M524L410L244L181L105L675M208
58401F72644L363J894J776K752K736J559J110J805K129J750J965K912L452L851
$$ plain form
58502 631923 640859 651079 662061 674192 687242 699870 711307 721939 731690 739384 744251 746628
58490 746628 746842 744974 741937 738987 735830 731031 724623 718347 712854 706762 699174 691130 683703 676542
58476 676542 669140 661824 654686 647223 639770 633571 628777 624137 619253 615233 612423 609550 605947 602561
58462 602561 599844 596681 592486 588403 585267 582301 578941 576108 574434 573088 571540 570708 571108 571612 571281
58447 571281 570830 571111 571855 572977 575290 578734 581721 583528 585584 589094 593201 596786 600237 604045 607399
58432 607399 609626 611345 612864 613259 612390 611941 612911 613966 613866 613646 614590 615885 616251 616306 617323 619019 620493
58415 620493 622097 624615 627776 631204 635613 641411 647297 651821 655231 658475 661656 664761 668436 672644
58401 672644 676007 677901 679677 682429 685165 686724 687834 689639 691768 693518 695483 698395 701847 705698
58387G05698N515Q151J0251J2212J5599J9549K1474K1243K1073K1280J9886J6576
58375H98507J3217J0287O538K556P33J183J429O52N35J440J559N84M71J804K927
58360I44422L271M071N287N395M729N314P011P524O615O460P456P646O685O382
58346A028268O885O487N573O417Q581R056P586P279R070J0323R853R697J0715
58333A135790J1090J0450J0900J2691J3323J2259J2115J3843J5282J5632J6802
58322A280177J9031J9905J9078J9230K1051K2003K1490K2224K4907K6520K5624
58311A521240K4465K4176K2831K0038J8381J8487J7581J4788J2907J3261J3740
58300A721895J3566J4780J7351J8278J7328J8068K1382K3637K3318K3517K5795
$$ plain form
58387 705698 711213 719364 729615 741827 757426 776975 798449 819692 840765 862045 881931 898507
58375 898507 911724 922011 928549 931105 931838 933021 934450 935102 935637 937077 938636 939220 939691 941495 944422
58360 944422 947693 951764 957051 962446 967175 972489 979500 987024 993639 1000099 1007555 1015201 1021886 1028268
58346 1028268 1035153 1041640 1047213 1053630 1062211 1071267 1078853 1086132 1095202 1105525 1115378 1125075 1135790
58333 1135790 1146880 1157330 1168230 1180921 1194244 1206503 1218618 1232461 1247743 1263375 1280177
58322 1280177 1299208 1319113 1338191 1357421 1378472 1400475 1421965 1444189 1469096 1495616 1521240
58311 1521240 1545705 1569881 1592712 1612750 1631131 1649618 1667199 1681987 1694894 1708155 1721895
58300 1721895 1735461 1750241 1767592 1785870 1803198 1821266 1842648 1866285 1889603 1913120 1938915
58289A938915K7437K7152K7561K9712L1089L1305L3548L8048M0613M0146M0985
58278B306511M5080M8648M9493N0761N4180N6566N6438N7185O0172O1648O0044
58267B906726N9213O0816O0945N8093N6949O0013O3041O3194O4125O8342P2171
58256C593628P3207P5225Q0768Q6254Q9366R3628J00863J06915J09790J14010
58246D523654J21987J29336J33733J39669J49369J58070J63724J71766J84685
58237E875993J96712K04796K14615K29558K44377K56275K71086K91594L11332
58228H096338L27321L46844L73826M01233M25236M53643M91311N31032N68508
58219A2015292O12061O67270P26934P87161Q57729R44963J040874J141741J260049
$$ plain form
58289 1938915 1966352 1993504 2021065 2050777 2081866 2113171 2146719 2184767 2225380 2265526 2306511
58278 2306511 2351591 2400239 2449732 2500493 2554673 2611239 2667677 2724862 2785034 2846682 2906726
58267 2906726 2965939 3026755 3087700 3145793 3202742 3262755 3325796 3388990 3453115 3521457 3593628
58256 3593628 3666835 3742060 3822828 3909082 3998448 4092076 4192939 4299854 4409644 4523654
58246 4523654 4645641 4774977 4908710 5048379 5197748 5355818 5519542 5691308 5875993
58237 5875993 6072705 6277501 6492116 6721674 6966051 7222326 7493412 7785006 8096338
58228 8096338 8423659 8770503 9144329 9545562 9970798 10424441 10915752 11446784 12015292
58219 12015292 12627353 13294623 14021557 14808718 15666447 16611410 17652284 18794025 20054074
58210B0054074J404893J569327J751694J969743K238011K552325K913585L344203
58202C7797855L862806M467194N161275N969941O904829P947738R096047J0393783
58194I1601468J1894089J3633581J5673186J8108308K0991301K4282167K7854591
58187B24038691L1341702L3802158L3729118K9841208K2126853J2029122J494519
58180C88403371q108259j6193041k2480438k6717156k8857863k9223228k8319131
58173B28504255k6581696k4336410k1864690j9385993j7012092j4790550j2771474
58166I1761350j0994652r451626q110544o958810n989378n170958m466871l865984
58158C6752527l367342k951552k593072k285322k030134j816018j627724j464399
$$ plain form
58210 20054074 21458967 23028294 24779988 26749731 28987742 31540067 34453652 37797855
58202 37797855 41660661 46127855 51289130 57259071 64163900 72111638 81207685 91601468
58194 91601468 103495557 117129138 132802324 150910632 171901933 196184100 224038691
58187 224038691 255380393 289182551 322911669 352752877 374879730 386908852 388403371
58180 388403371 380295112 364102071 341621633 314904477 286046614 256823386 228504255
58173 228504255 201922559 177586149 155721459 136335466 119323374 104532824 91761350
58166 91761350 80766698 71315072 63204528 56245718 50256340 45085382 40618511 36752527
58158 36752527 33385185 30433633 27840561 25555239 23525105 21709087 20081363 18616964
58150A8616964j328895j210910j098421r94489r06279q28360p52237o81676o23293
58141A0192404n71814n19144m69053m29163l96963l66610l41147l25148l12999
58132F460363k96749k78545k64091k50933k34310k17622k06105j96444j83123
58123D332441j69079j59906j53308j44115j34188j27857j22852j14954j06609
58114C099573j02058r8883r2922q6650q4184q2866p8206p2541p0420o9775o5993
58103B195075o0689n8210n7178n3555m8651m6349m5516m2584l8610l6708l5459
58092A671566l1770k7439k6114k6533k5225k3116k3148k4158k3426k2484k4162
58081A393991k6543k6099k4229k4587k6419k6555k5613k6178k7160k5845k3419
$$ plain form
58150 18616964 17288069 16077159 14978738 13984249 13077970 12249610 11497373 10815697 10192404
58141 10192404 9620590 9101446 8632393 8203230 7806267 7439657 7098510 6773362 6460363
58132 6460363 6163614 5885069 5620978 5370045 5135735 4918113 4712008 4515564 4332441
58123 4332441 4163362 4003456 3850148 3706033 3571845 3443988 3321136 3206182 3099573
58114 3099573 2997515 2898632 2805710 2719060 2634876 2552010 2473804 2401263 2330843 2261068 2195075
58103 2195075 2134386 2076176 2018998 1965443 1916792 1870443 1824927 1782343 1743733 1707025 1671566
58092 1671566 1639796 1612357 1586243 1559710 1534485 1511369 1488221 1464063 1440637 1418153 1393991
58081 1393991 1367448 1341349 1317120 1292533 1266114 1239559 1213946 1187768 1160608 1134763 1111344
58070A111344k2772k2944k1330j9123j8955j9381j7455j4655j4423j5759j5087
58059I09460j2846j2340j3525j3649j2852j3510j4987j4497j2442j1732j2489
58048G64591j2296j1034j0704j1035r925p761o944p557p598o950p163p961p783
58035F49880p086p390p906o722m552l710m336m883n261o118o443n314m484n679
58021E69996p008n871l638l330m370l952k215j490j648p10R18J239R33K314M785
58006E45953N643M930N108O521P413Q048J0364J3733J5381J5124J5571J7572J9418
57993F90779K0695K2939K6244K9050L1539L5508M0536M4107M5777M7592M9860
57982A084626N0228M7676M3980M0441L6422L1993K8776K7119K5246K2066J8219
$$ plain form
58070 1111344 1088572 1065628 1044298 1025175 1006220 986839 969384 954729 940306 924547 909460
58059 909460 896614 884274 870749 857100 844248 830738 815751 801254 788812 777080 764591
58048 764591 752295 741261 730557 719522 709597 701836 694892 687335 679737 672787 665624 657663 649880
58035 649880 642794 635404 627498 620776 616224 612514 608178 603295 598034 591916 585473 580159 575675 569996
58021 569996 562988 557117 553479 550149 545779 541827 539612 538122 536474 535764 536682 537921 538854 541168 545953
58006 545953 551596 556526 561634 568155 575568 583616 593980 607713 623094 638218 653789 671361 690779
57993 690779 711474 734413 760657 789707 821246 856754 897290 941397 987174 1034766 1084626
57982 1084626 1134854 1182530 1226510 1266951 1303373 1335366 1364142 1391261 1416507 1438573 1456792
57971A456792J3664O905k428j2566k1997l0844l9244m6361n1488n4434n4722n2193
57959A111084m8288m4833m1765l7858l3189k8850k4861k0592j6649j3954j1692
57948G88553q669n885m991n050l894k047j913l411l890k505j240j261j445j060
57934G41292q53p94M74L151N791P805J0108J2825J4882J6231J8051K0281K1303
57921H70547K0454J8483J5233R484J599o110j2290j7635k2677k6749k9573l1651
57909G89115l2605l1343k8363k5748k4425k3341k1667j9811j8029j6094j4478
57898E33211j3836j3338j1698r713r363j0459j0868j0098r824j0552j0660r429
57886D03373q274q096p829o580m949l490j884l44K89L65J289L094M343M745N596
$$ plain form
57971 1456792 1470456 1477361 1474933 1462367 1440370 1409526 1370282 1323921 1272433 1217999 1163277 1111084
57959 1111084 1062796 1017963 976198 938340 905151 876301 851440 830848 814199 800245 788553
57948 788553 779884 773999 769008 763958 760064 758017 756104 752693 748803 746298 745058 743797 742352 741292
57934 741292 740439 739645 740119 743270 749061 756866 766974 779799 794681 810912 828963 849244 870547
57921 870547 891001 909484 924717 934201 935800 929690 917400 899765 877088 850339 820766 789115
57909 789115 756510 725167 696804 671056 646631 623290 601623 581812 563783 547689 533211
57898 533211 519375 506037 494339 484626 475263 464804 453936 443838 434014 423462 412802 403373
57886 403373 395099 387003 379174 372594 367645 364155 362271 361927 362216 362581 363870 366964 371307 376052 381648
57871C81648P163Q138Q182Q470R100Q483O251M219L508L063J919O69l15j810l822
57856D44866m979m896n005o000o612o063n517n925o378n892m938m107l011j614
57842C73929q24p62k32J162K252K565L198M464M794L324J559R90Q92n2j560k620
57826C93079l076l069k281r06MK00Q49K614M644O374Q549J1399J3399J3138J1046
57811D55963Q368N849M234M361N745O755P123Q517J1759J5423J8323K1317K5256
57798E98993K9092L1614L3284L4672L4598L1595K5886J8454R573l14r631j7143
57786H20673k3236k8430l2061l3736l4640l5748l6150l4755l2343l0277k8431
57775D70866k6032k3460k1490j9725j7455j5163j3649j2470j0815r070q072p535
$$ plain form
57871 381648 388811 396949 405131 413601 422701 431184 437435 441654 445162 448225 450144 450813 450498 448688 444866
57856 444866 439887 434991 429986 423986 417374 411311 405794 399869 393491 387599 382661 378554 375543 373929
57842 373929 373105 372343 372111 373273 375525 378090 381288 385752 390546 393870 395429 396419 397311 397259 395699 393079
57826 393079 390003 386934 384653 383747 383751 383951 384800 387414 392058 398432 406981 418380 431779 444917 455963
57811 455963 464331 470180 474414 478775 484520 491275 498398 506915 518674 534097 552420 573737 598993
57798 598993 628085 659699 692983 727655 762253 793848 819734 838188 847761 847447 837816 820673
57786 820673 797437 769007 736946 703210 668570 632822 596672 561917 529574 499297 470866
57775 470866 444834 421374 399884 380159 362704 347541 333892 321422 310607 301537 293465 285930
57763B85930o661n578m855m240l214k118j528j239q49o13o74m04N03J278J395
57748B57133J593K476L297L355L360M056M728M488L992M349N352O253P230Q476
57734C20138Q906P508N210L645K767J383n30j780j805j093j58N48L10q78j555
57719C42616m75J423K156J340K97qK44P27J339J813K115K915M607O264O738O298
57703C80409O119O583P275Q018Q753Q940Q388Q181R454J1671J3427J4562J6178
57690E07958J8794K1802K4563K6928K8927L0893L3610L7455M1830M6265N1357
57679H70382N7665O4445P0727P6853Q3583R0585R7334J04706J13874J24298J34793
57668A889245J45872J58040J66975J63017J37700R0905L1619k7524p6545j11228
$$ plain form
57763 285930 279269 273691 268836 264596 261382 259264 257736 256497 255648 255035 254361 253957 254460 255738 257133
57748 257133 258726 261202 264499 267854 271214 275270 279998 284486 288478 292827 298179 304432 311662 320138
57734 320138 329044 336552 341762 345407 348174 349557 349027 347247 345442 344349 344191 344739 345049 344171 342616
57719 342616 342141 343564 345720 347060 347357 347349 347593 348320 349659 351472 353587 356502 361109 367373 374111 380409
57703 380409 386528 393111 400386 408404 417157 426097 434485 442666 452120 463791 477218 491780 507958
57690 507958 526752 548554 573117 600045 628972 659865 693475 730930 772760 819025 870382
57679 870382 928047 992492 1063219 1140072 1223655 1314240 1411574 1516280 1630154 1754452 1889245
57668 1889245 2035117 2193157 2360132 2523149 2660849 2751754 2783373 2755849 2679304 2568076
57658B568076j32469j43374j46808j44822j39141j31157j21700j11379j00885
57649A396341r0603q0525p0988o2824n6172n0011m3658l7746l2870k8265k3125
57638H19554j8269j4972j2838j0375p220m217j645J053L889O200P920R731J1909
57625G90720J4162J6505J9246K2186K4921K7681L0849L3906L6134L8079M0943
57614A095332M4600M7548M8881M9067M8702M7606M5345M1557L5774K7844J8587
57603A550843R110m23j0445k0588k9675l7033m2831m7232n0272n2403n4096n4974
57591A159981n4403n2756n1045m9463m7426m4861m2307l9878l7240l4572l2285
57580F73745k9986k6984k3728k1360j9885j8181j5941j4134j3281j2737j2011
$$ plain form
57658 2568076 2435607 2292233 2145425 2000603 1861462 1730305 1608605 1497226 1396341
57649 1396341 1305738 1225213 1154225 1091401 1035229 985218 941560 903814 870944 842679 819554
57638 819554 801285 786313 773475 763100 755880 751663 750018 751071 754960 761160 769080 778811 790720
57625 790720 804882 821387 840633 862819 887740 915421 946270 980176 1016310 1054389 1095332
57614 1095332 1139932 1187480 1236361 1285428 1334130 1381736 1427081 1468638 1504412 1532256 1550843
57603 1550843 1559953 1559530 1549085 1528497 1498822 1461789 1418958 1371726 1321454 1269051 1214955 1159981
57591 1159981 1105578 1052822 1001777 952314 904888 860027 817720 777842 740602 706030 673745
57580 673745 643759 616775 593047 571687 551802 533621 517680 503546 490265 477528 465517
57569D65517j1464j1177j0422q924p560p048o824n902m193k382j002j17L88O24
57555C89514N87J99l66n97k76K17O67J549L099M472M782M461M566N167N633O022
57539D29696O892Q052Q846R472J0647J2174J3271J4156J5772J7971J9561K0379
57527E86889K1748K4477K7799L0673L2930L4775L6391L8239M0612M2723M3401
57516I60657M2801M1998M0883L8101L3251K7499K1560J4819P050p25p878j5023
57504A204993k2349k8651l3068l6360l9319m1302m1529m0655l9716l8504l6432
57493H07108l4026l2177l0487k7866k4363k1133j8699j6507j4160j2097j0733
57482E64860r657q023n585l085j527q66J75K522N329P067P730Q807J0984J3295
$$ plain form
57569 465517 454053 442876 432454 423530 415970 408922 402098 396196 392003 389621 388619 388502 388890 389514
57555 389514 390101 390300 389934 389337 389061 389278 389945 391494 394593 399065 403847 408308 412874 418041 423674 429696
57539 429696 436588 444640 453486 462958 473605 485779 499050 513206 528978 546949 566510 586889
57527 586889 608637 633114 660913 691586 724516 759291 795682 833921 874533 917256 960657
57516 960657 1003458 1045456 1086339 1124440 1157691 1185190 1206750 1221569 1228619 1227894 1220016 1204993
57504 1204993 1182644 1153993 1120925 1084565 1045246 1003944 962415 921760 882044 843540 807108
57493 807108 773082 740905 710418 682552 658189 637056 618357 601850 587690 575593 564860
57482 564860 555203 547180 541595 538510 536983 536117 536292 538814 544143 551210 558940 567747 578731 592026
57468E92026J4892J6294J8219K0382K2310K4320K6725K9005L0644L2084L3906
57457H60807L5768L6933L7252L6830L5269L2112K7594K2274J6315R685K534n057
57445A148316j3145k1250k8283l3664l7786m0915m2546m2510m1758m1222m0646
57434G64591l9401l7649l5843l3840l1513k9467k8099k6627k4195k1412j9479
57423D37066j8289j6724j4557j2767j1859j1129r848q271p123o797p182p787p934
57410B96799p348o540o097n755m774l206k083k164l042l676l446k587j783j500
57396B42798j608j652j441j116p16j07N47P91N56L56N07P40Q12R32J141R80K91
57379B43811k28J13R96J554J458J016N60K76K89M39L21p3k50o7q2n47p41m7R69
$$ plain form
57468 592026 606918 623212 641431 661813 684123 708443 735168 764173 794817 826901 860807
57457 860807 896575 933508 970760 1007590 1042859 1074971 1102565 1124839 1141154 1150839 1153373 1148316
57445 1148316 1135171 1113921 1085638 1051974 1014188 973273 930727 888217 846459 805237 764591
57434 764591 725190 687541 651698 617858 586345 556878 528779 502152 477957 456545 437066
57423 437066 418777 402053 387496 374729 362870 351741 341893 333622 326499 319702 312520 304733 296799
57410 296799 289451 282911 276814 271059 266285 263079 260996 258832 255790 252114 248668 246081 244298 242798
57396 242798 241190 239538 238097 236981 236265 236158 236705 237496 238052 238408 238915 239655 240467 241399 242540 243520 243811
57379 243811 243583 243696 244692 246246 247704 248720 249280 249556 249845 250284 250605 250532 250282 250215 250133 249586 248845 248798 249767
57360B49767J406J351J505J833J720J176Q66R87J045Q23P61J159J647J714J351
57345B69111R92J057J622K315K595K340J974J897K068K328K684L044L131L038
57331C00196L296L997M360L743K594J919K174L174M576N865O427O253O158O671
57317C61403P226P103O622O589P061P500P752Q024Q250Q301Q556R421J0550J1318
57303D75676J1685J1902J1852J1574J1865J3194J4474J4283J2991J2361J3044
57292F14901J3900J3871J3109J2003J0429Q519O966N933M604K433O1j558k274
57279G02897k478k445k460k803l205k894j721n87l09o04p04l17M82J764L418M849
57263F92883N559N733N733N482M949M769N552O871P651P529P181P349Q116R216
$$ plain form
57360 249767 251173 252524 254029 255862 257582 258758 259624 260611 261656 262479 263240 264399 266046 267760 269111
57345 269111 270103 271160 272782 275097 277692 280032 282006 283903 285971 288299 290983 294027 297158 300196
57331 300196 303492 307489 311849 315592 318186 320105 322279 325453 330029 335894 342321 348574 354732 361403
57317 361403 368629 375732 382354 388943 396004 403504 411256 419280 427530 435831 444387 453808 464358 475676
57303 475676 487361 499263 511115 522689 534554 547748 562222 576505 589496 601857 614901
57292 614901 628801 642672 655781 667784 678213 686732 693698 699631 704235 706668 706729 705171 702897
57279 702897 700419 697974 695514 692711 689506 686612 684891 684304 683995 683391 682687 682370 682852 684616 688034 692883
57263 692883 698442 704175 709908 715390 720339 725108 730660 737531 745182 752711 759892 767241 775357 784573
57249G84573J0418J1433J1965J2087J2267J2731J3106J2987J2624J2674J3320
57238I20185J4103J4649J5185J5996J6725J6789J6334J6204J6792J7496J7619
57227A098077J7369J7459J8077J8754J9160J9561K0372K1629K2907K3610K3507
57216A320482K3056K3046K3681K4333K4425K4257K4492K5217K5949K6400K6699
57205A592037K7000K7413K8128K9171L0134L0665L1014L1605L2266L2564L2686
57194A924683L3180L3851L3870L3063L2276L2110L2101L1584L0693K9981K9563
57183B276955K9296K9456L0574L2696L5287L7728L9540M0151L8967L5938L1882
57172B658470K8020K5097K3011K1300J9857J8922J8427J7807J6734J5661J5192
$$ plain form
57249 784573 794991 806424 818389 830476 842743 855474 868580 881567 894191 906865 920185
57238 920185 934288 948937 964122 980118 996843 1013632 1029966 1046170 1062962 1080458 1098077
57227 1098077 1115446 1132905 1150982 1169736 1188896 1208457 1228829 1250458 1273365 1296975 1320482
57216 1320482 1343538 1366584 1390265 1414598 1439023 1463280 1487772 1512989 1538938 1565338 1592037
57205 1592037 1619037 1646450 1674578 1703749 1733883 1764548 1795562 1827167 1859433 1891997 1924683
57194 1924683 1957863 1991714 2025584 2058647 2090923 2123033 2155134 2186718 2217411 2247392 2276955
57183 2276955 2306251 2335707 2366281 2398977 2434264 2471992 2511532 2551683 2590650 2626588 2658470
57172 2658470 2686490 2711587 2734598 2755898 2775755 2794677 2813104 2830911 2847645 2863306 2878498
57161B878498J5169J4872J4028J3147J2844J3269J4126J4814J4672J3560J2246
57150C031245J1714J2045J2426J2262J1699J1010J0113Q950P773O696N457L893
57138C145283K260Q35m51j620k278k095j319l99O90K349M655P201R599J1810J3945
57123C190465J6007J7902J9548K0835K1666K2247K3303K5736K9846L5043M0718
57112C463316M7276N5833O6769P9112R1833J05363J21337J41136J65234J93841
57102D531050K27612K67686L15532L72642M39849N16738O01923O93688P90085
57093H756805Q88857R88099J086863J184321J278076J363658J435218J485508
57085A8467405J505055J482723J408463J276285J085981Q44658N68216K79830
$$ plain form
57161 2878498 2893667 2908539 2922567 2935714 2948558 2961827 2975953 2990767 3005439 3018999 3031245
57150 3031245 3042959 3055004 3067430 3079692 3091391 3102401 3112514 3121464 3129237 3135933 3141390 3145283
57138 3145283 3147543 3148378 3147927 3146307 3144029 3141934 3140615 3140216 3140906 3143255 3147910 3155111 3164710 3176520 3190465
57123 3190465 3206472 3224374 3243922 3264757 3286423 3308670 3331973 3357709 3387555 3422598 3463316
57112 3463316 3510592 3566425 3633194 3712306 3804139 3909502 4030839 4171975 4337209 4531050
57102 4531050 4758662 5026348 5341880 5714522 6154371 6671109 7273032 7966720 8756805
57093 8756805 9645662 10633761 11720624 12904945 14183021 15546679 16981897 18467405
57085 18467405 19972460 21455183 22863646 24139931 25225912 26070570 26638786 26918616
57077B6918616L647k43081m53722o30070p77509r01397j005686j092732j163317
57068B0654749j216838j251995j267861j264503j242695j203525j149021j082917
57060A0975394j009843r33209q54495p74899o96962o23665n56526m95423m40043
57051D590329l90519l46735l08002k73809k44109k18554j96153j76133j58629
57042B277686j43868j31165j19348j07968r7334q7592p8462o9875o2140n5185
57032A324749m8312m0904l2847k4241j5244n993M563J9640M1603O5788P9269O9899
57020A437970L7909l287l8517o1454p4115p9913q0386p6952p1853o6502o0851
57009H62049n4903m9388m4573l9888l5155l0988k7634k4502k1297j8576j6779
$$ plain form
57077 26918616 26922263 26679182 26225460 25595390 24817881 23916484 22910798 21818066 20654749
57068 20654749 19437911 18185916 16918055 15653552 14410857 13207332 12058311 10975394
57060 10975394 9965551 9032342 8177847 7402948 6705986 6082321 5525795 5030372 4590329
57051 4590329 4199810 3853075 3545073 3271264 3027155 2808601 2612448 2436315 2277686
57042 2277686 2133818 2002653 1883305 1775337 1678003 1590411 1511949 1442074 1379934 1324749
57032 1324749 1276437 1235533 1202686 1178445 1163201 1157208 1161771 1181411 1223014 1288802 1368071 1437970
57020 1437970 1475879 1472592 1434075 1372621 1298506 1218593 1138207 1061255 989402 922900 862049
57009 862049 807146 757758 713185 673297 638142 607154 579520 555018 533721 515145 498366
56998D98366j5675j5086j5219j5822j6020j5445j4749j4482j4276j3554j2231
56987C35807j0389q043n682m063l151k070o82j23j174l069m613n592o186o010
56973B74960m816l456k939l026k705j684m25Q47K188L309L941M624O115Q180R938
56958B95051J1284J2893J4719J5504J4080J0461N530K56m543q283j0779j2039
56946C44134j2005j0851r314q128p150n676l569j480J21J467K983M822P070R852
56932C12276J2982J5868J7889J8564J7385J3997Q710K475l695q998j2758j4698
56920C79997j5363j5654j5815j5366j4150j2797j1902j1294j0481r372q146o849
56908B32808n540m598m348m455m175l210k068j434j468j709j574q16L15J287J710
$$ plain form
56998 498366 482691 467605 452386 436564 420544 405099 390350 375868 361592 348038 335807
56987 335807 325418 317375 311693 307630 304479 302409 301727 301604 300430 297361 292748 287156 280970 274960
56973 274960 270144 266688 263749 260723 258018 256334 255909 256756 258944 262253 266194 270818 276933 285113 295051
56958 295051 306335 319228 333947 349451 363531 373992 379522 379778 375235 366952 356173 344134
56946 344134 332129 321278 311964 303836 296686 291010 287441 285961 286082 287549 290532 295354 302424 312276
56932 312276 325258 341126 359015 377579 394964 408961 417671 420146 416451 407453 394695 379997
56920 379997 364634 348980 333165 317799 303649 290852 278950 267656 257175 247803 239657 232808
56908 232808 227268 222670 218322 213867 209692 206482 204414 202980 201512 199803 198229 197413 197728 199015 200725
56893B00725J763K146L454N435P119P864Q126Q792R919J0557R907Q050N497K552
56879B91906m13k655l644l704l517l230k531j459n48j07J57Q22K324M831Q102
56864B86334J1533J4673J7689K0937K4201K6671K7606K6598K3296J7500R796J637
56852E08471n428j0573j3716j5108j5007j3595j1076p883m641j713J054L929O851
56839D21565R737J3042J7522K3387L0088L6783M2462M5562M4136L7068K5131J0739
56827G57222l352j5248k4299l0624l4393l5613l4585l2166k9202k5840k1766j7002
56815D53132j1978o946j798L428Q444J3260J8379K4027K9409L2985L3305K9529
56803F25176K1540J0190k495j3842k1835k6236k8309k9370k9628k8576k6176k3110
$$ plain form
56893 200725 202488 204634 208088 213523 220642 228506 236632 245424 255343 265900 275807 283857 289354 291906
56879 291906 291493 288838 285194 281490 277973 274743 272212 270753 270205 270098 270255 271077 273401 278232 286334
56864 286334 297867 312540 330229 351166 375367 402038 429644 456242 479538 497038 506834 508471
56852 508471 503043 492470 478754 463646 448639 435044 423968 416085 411444 409731 410785 414714 421565
56839 421565 431302 444344 461866 485253 515341 552124 594586 640148 684284 721352 746483 757222
56827 757222 753870 738622 714323 683699 649306 613693 579108 546942 517740 491900 470134 453132
56815 453132 441154 434208 432410 435838 444282 457542 475921 499948 529357 562342 595647 625176
56803 625176 646716 656906 654411 640569 618734 592498 564189 534819 505191 476615 450439 427329
56791D27329j9861j6259j2273q664o167m295j703K308P062J1324J4339J5952J6123
56778D25215J4580J1033N714m06o198j1221j5533j8740j9999j9362j8211j7652
56766C29220j7120j5517j3166j1419j0678j0039q958q019p717p609p121o369n634
56753A99854m854m085l767l932l750k549q65J50Q6l98l99M27J641K317J842O84
56737A82402mK42O24K25p55j378j260r35j033j552j996j952j507j095r44p54j93
56720A68135M56N86J30l49m64l23M5Q28J767J995J126k5l73K09J053J704K154
56703A78654K383K259J891J668J850K417L174L808M028L905L937M540N493O055
56689B26062N571L982K075J050J427K284K184R79K7M05J578K285K093J445P92
$$ plain form
56791 427329 407468 391209 378936 370272 364105 359810 358107 360415 367477 378801 393140 409092 425215
56778 425215 439795 450828 456542 456136 449938 438717 423184 404444 384445 365083 346872 329220
56766 329220 312100 296583 283417 271998 261320 251281 242323 234304 226587 218978 211857 205488 199854
56753 199854 195000 190915 187148 183216 179466 176917 176052 176202 176288 175890 175491 175918 177559 179876 181718 182402
56737 182402 182398 182640 183264 183489 182734 181356 180096 179161 178128 176576 174580 172628 171121 170026 169082 168328 168135
56720 168135 168591 169177 169307 168958 168494 168171 168216 169044 170811 172806 173932 173907 173534 173743 174796 176500 178654
56703 178654 181037 183296 185187 186855 188705 191122 194296 198104 202132 206037 209974 214514 220007 226062
56689 226062 231633 235615 237690 238740 240167 242451 244635 245614 245641 246046 247624 249909 252002 253447 254239
56674B54239L66M13Q66J113P73M32Q46J718K072J694J202P50k88j962l110k752
56658B58372j540j041j794k865l239l015k889l027k990k628k414k662k884k385
56644B22999j320o08p97j442j754j450q49l69j81j59n6J53K37J74M24J250J998
56627B18250J707M66n89p57n43p20j283j750j821j372m11N22N24n94j928k574
56611B07127k530k175j557p67k70j47K81J328K087J679P16M63R98J342J139R85
56595B10699J215J475J548J594J508J000M38N86J336J676J158O03Q67J681K165
56580B29549J920J178L97P2M75J268J643J093q5j159j516r39K11J151J445J553
56564B38256K170L195L920M096M006L626K654J435Q64J073J107M10l07k18K82
$$ plain form
56674 254239 254605 255018 255884 256997 257770 258202 259048 260766 262838 264532 265734 266484 266196 264234 261124 258372
56658 258372 256832 255791 253997 251132 247893 244878 241989 238962 235972 233344 230930 228268 225384 222999
56644 222999 221679 221071 220274 218832 217078 215628 214779 214410 214229 214070 214014 214167 214404 214578 215002 216252 218250
56627 218250 219957 220423 219834 219077 218534 217814 216531 214781 212960 211588 211177 211699 212223 211629 209701 207127
56611 207127 204597 202422 200865 200098 199828 199681 199962 201290 203377 205056 205772 206235 207233 208575 209714 210699
56595 210699 211914 213389 214937 216531 218039 219039 219477 220063 221399 223075 224233 224836 225703 227384 229549
56580 229549 231469 232647 233044 233116 233591 234859 236502 237595 237510 236351 234835 233896 234107 235258 236703 238256
56564 238256 240426 243621 247541 251637 255643 259269 261923 263358 264222 265295 266402 266812 266505 266287 266569
56549B66569J49r10k263l261l649l407k764k287k478l250m088m582m623m218l494
56534B21444k717k200k085k304k581k514j959j368j443k331l388l800l254k044
56520A87456q15k37n24j222j651j609j309q48j58N64Q85O68J58m44j021j287j001
56503A77605m96l93p40r85q50o49o68q11r54j059q67j22Q22J295J291J416J721
56486A75556J522O36j24j13L22O57J037J713K313K360J992J613J310J131J385
56471A93310K061K430J939J046O13P52Q69N50j25q48j226r28j44M62N29L76K87
56454B01953K8n04p84m15J61L45L02N23R06J020Q81P58N78J90q4P8L35K60J77
56435B06708O18J169Q77l05j432j921k077k139j812j017l65l03m62l18j0N8P1
$$ plain form
56549 266569 266718 265808 263545 260284 256635 253228 250464 248177 245699 242449 238361 233779 229156 224938 221444
56534 221444 218727 216527 214442 212138 209557 207043 205084 203716 202273 199942 196554 192754 189500 187456
56520 187456 186641 186404 185880 184658 183007 181398 180089 179241 179083 179647 180532 181200 181358 180914 179893 178606 177605
56503 177605 177109 176716 175976 174991 174141 173492 172824 172013 171059 170000 169133 169011 169833 171128 172419 173835 175556
56486 175556 177078 177714 177590 177477 177799 178456 179493 181206 183519 185879 187871 189484 190794 191925 193310
56471 193310 195371 197801 199740 200786 201399 202151 203020 203570 203445 202597 201371 200443 200299 200761 201290 201666 201953
56454 201953 201981 201477 200693 200278 200439 200784 201086 201609 202515 203535 204416 205174 205752 205942 205858 205936 206271 206531 206708
56435 206708 207326 208495 209372 209067 207635 205714 203637 201498 199686 198669 198304 198001 197539 197221 197211 197269 197340
56418A97340N96J537J937J068n57j668j610r07l26L8M83R38J153J348J872K344
56402B05586K024J133Q39J636K666L040K888K600J994J027M25P23J313J401J201
56387B30496J211R26m41k303l073k198p44J15K38M8j93l30j55L58R81J413J312
56370B27661M73o20q41K95J801K356J930J494J456J367J000P10O80P39R71J611
56354B43083K348K531K201K065K302K340J931J613J771K017J885J484J121Q66
56340B69558P80J116J824K381K330J788J270J231J875K973L896M177M056M089
56326C03344M323M342M025L704L546L363L083K931L023L237L561M113M787N245
56312C56627N353N297N324N589O090O436O043M908L860L558L689L596L253K931
$$ plain form
56418 197340 197936 199473 201410 202478 201921 200253 198643 197736 197410 197448 197931 198869 200022 201370 203242 205586
56402 205586 207610 208743 209582 211218 213884 216924 219812 222412 224406 225433 225858 226581 227894 229295 230496
56387 230496 231707 232633 232192 229889 226816 224618 223874 223989 224227 224275 224082 223752 223597 223955 224936 226349 227661
56370 227661 228134 227514 226673 226968 228769 231125 233055 234549 236005 237372 238372 239082 239762 240501 241472 243083
56354 243083 245431 247962 250163 252228 254530 256870 258801 260414 262185 264202 266087 267571 268692 269558
56340 269558 270338 271454 273278 275659 277989 279777 281047 282278 284153 287126 291022 295199 299255 303344
56326 303344 307667 312009 316034 319738 323284 326647 329730 332661 335684 338921 342482 346595 351382 356627
56312 356627 361980 367277 372601 378190 384280 390716 396759 401667 405527 409085 412774 416370 419623 422554
56298D22554K458J620Q64P60J112J484K094L252M340M525M168M362N305O331P342
56283D72571Q797J0402J1267J1528J2370J4174J5989J7264J8753K1079K3596K5419
56271F63209K6784K8697L1852L6256M1391M6470N1162N6129O2173O9010P5763
56260A188896Q2442Q9641R6858J02646J06703J10303J14099J16830J16899J14046
56250B239363J08778J01262R1572Q0062O6862N1854L5731K0015N460q534k2330
56239B770095l5011m5656n4583o2416o8973p4028p8243q2278q5607q7338q7653
56228B008309q7548q7492q7108q5895q3687q0735p7639p4822p1824o7811o2897
56217A140851n8185n4176n0151m5454m0439l5666l1192k7188k4188k2180k0425
$$ plain form
56298 422554 425012 426632 427496 428256 429368 430852 432946 436198 440538 445063 449231 453593 458898 465229 472571
56283 472571 481368 491770 503037 514565 526935 541109 557098 574362 593115 614194 637790 663209
56271 663209 689993 718690 750542 786798 828189 874659 925821 981950 1044123 1113133 1188896
56260 1188896 1271338 1360979 1457837 1560483 1667186 1777489 1891588 2008418 2125317 2239363
56250 2239363 2348141 2449403 2540975 2621037 2687899 2739753 2775484 2795499 2800959 2792425 2770095
56239 2770095 2735084 2689428 2634845 2572429 2503456 2429428 2351185 2268907 2183300 2095962 2008309
56228 2008309 1920761 1833269 1746161 1660266 1576579 1495844 1418205 1343383 1271559 1203748 1140851
56217 1140851 1082666 1028490 978339 932885 892446 856780 825588 798400 774212 752032 731607
56206G31607j8693j7513j6737j5147j2367r869r011r131q707p421o037n019m379
56193E91576m122l916l009j370r7J24Q6O67J373J390J096J356K077K686L297M286
56177E97500N327O020O810Q137R348R592R303R542J0445J1413J2386J3686J5050
56164G24559J5955J6618J7631J8931K0056K1174K2901K5345K8158L1220L4691
56153I77239L8724M3739N0487N9383P0346Q3586R9495J17115J33828J47204J56081
56142A977227J59194J54558J41885J24450J06955R2156Q0695P2661O7071O0554
56132C037406M9086L1693J1354p653k2293l1291l5065l5903l7438m3267n5598
56121B861031p4154r5809j16056j31649j41475j45071j42011j33353j21917j09794
$$ plain form
56206 731607 712914 695401 678664 663517 651150 641281 632270 623139 614432 607011 600974 595955 591576
56193 591576 587454 583538 580529 579159 579062 579186 579272 579939 581312 582702 583798 585154 587231 589917 593214 597500
56177 597500 602827 608847 615657 623794 633142 642734 652037 661579 672024 683437 695823 709509 724559
56164 724559 740514 757132 774763 793694 813750 834924 857825 883170 911328 942548 977239
56153 977239 1015963 1059702 1110189 1169572 1239918 1323504 1422999 1540114 1673942 1821146 1977227
56142 1977227 2136421 2290979 2432864 2557314 2664269 2756425 2837120 2909781 2976852 3037406
56132 3037406 3086492 3118185 3129539 3121886 3099593 3068302 3033237 2997334 2959896 2916629 2861031
56121 2861031 2786877 2691068 2575012 2443363 2301888 2156817 2014806 1881453 1759536 1649742
56111A649742r6897q3111p0149n9643n0824m2011l3281k5867j9834j4383r638
56100A144104o215l634r23J707L463M615N992P392Q033Q039Q041P923P357O723
56086A202617O271N250L328J767J671K210K142J910K434L169L330L767N500P570
56072A252936Q557R101J0568J2364J3018J2986J3792J5217J5945J6228J7361J9097
56060A417170K0076K0279K0707K1294K1458K1883K3358K4706K4445K3577K4078
56049A663031K5536K6179K6305K7669L0029L1497L1881L2725L4315L5543L6378
56038B001088L7760L9460M0695M2233M5173M8397N0047N0634N1811N3124N3122
56027B513544N2594N3369N4998N6080N7547O0958O4779O6521O7338P0183P4513
$$ plain form
56111 1649742 1552845 1469734 1399585 1339942 1289118 1247107 1213826 1187959 1168125 1153742 1144104
56100 1144104 1137889 1134255 1133332 1135039 1138502 1143117 1149109 1156501 1164534 1172573 1180614 1188537 1195894 1202617
56086 1202617 1208888 1214138 1217466 1219233 1220904 1223114 1225256 1227166 1229600 1232769 1236099 1239866 1245366 1252936
56072 1252936 1261493 1270594 1281162 1293526 1306544 1319530 1333322 1348539 1364484 1380712 1398073 1417170
56060 1417170 1437246 1457525 1478232 1499526 1520984 1542867 1566225 1590931 1615376 1638953 1663031
56049 1663031 1688567 1714746 1741051 1768720 1798749 1830246 1862127 1894852 1929167 1964710 2001088
56038 2001088 2038848 2078308 2119003 2161236 2206409 2254806 2304853 2355487 2407298 2460422 2513544
56027 2513544 2566138 2619507 2674505 2730585 2788132 2849090 2913869 2980390 3047728 3117911 3192424
56016C192424P7364P8838Q1636Q5862Q9164R1506R5016R9464J02861J06010J11445
56005D211590J18366J23783J28162J34529J42538J49221J55113J63602J74473
55996E501377J84396J93531K05173K18911K31052K42005K56137K73979K91770
55987G598331L09223L30163L54821L79307M03672M32669M67381N04072N42358
55978A1321997N86390O37004O91167P50110Q19140Q98797R85620J082254J196624
55969A8969103J330918J482733J657545J867884K119974K414988K764044L186798
55961C5793987L694215M288398M978692N777900O682088P677986Q775500J0013048
55953H7681814J1434045J3088775J5056185J7419592K0209465K3389501K6823182
$$ plain form
56016 3192424 3269788 3348626 3430262 3516124 3605288 3696794 3791810 3891274 3994135 4100145 4211590
56005 4211590 4329956 4453739 4581901 4716430 4858968 5008189 5163302 5326904 5501377
55996 5501377 5685773 5879304 6084477 6303388 6534440 6776445 7032582 7306561 7598331
55987 7598331 7907554 8237717 8592538 8971845 9375517 9808186 10275567 10779639 11321997
55978 11321997 11908387 12545391 13236558 13986668 14805808 15704605 16690225 17772479 18969103
55969 18969103 20300021 21782754 23440299 25308183 27428157 29843145 32607189 35793987
55961 35793987 39488202 43776600 48755292 54533192 61215280 68893266 77668766 87681814
55953 87681814 99115859 112204634 127260819 144680411 164889876 188279377 215102559
55946B15102559L0057292L2039190L1251832K6516843J7929959P039099l958864
55939C55977910j3288185k0111149k4379329k6460049k6871932k6133153k4660148
55932A94073965k2742767k0591884j8377265j6219634j4187126j2321714j0655010
55925G8978565r195808p927352o829620n891389n097458m422389l844767l354523
55917C2415259k941148k587777k281986k020470j798441j605227j434239j286670
55909A6459301j161381j050873r50744q63390p88901p21374o57670o01077n52847
55900I111044n08450m65560m27764l96763l68482l40285l14945k94137k74694
55891E719964k54667k36631k21898k07534j92086j78295j67274j55792j42178
$$ plain form
55946 215102559 245159851 277199041 308450873 334967716 352897675 359936774 355977910
55939 355977910 342689725 322578576 298199247 271739198 244867266 218734113 194073965
55932 194073965 171331198 150739314 132362049 116142415 101955289 89633575 78978565
55925 78978565 69782757 61855405 55025785 49134396 44036938 39614549 35769782 32415259
55917 32415259 29474111 26886334 24604348 22583878 20785437 19180210 17745971 16459301
55909 16459301 15297920 14247047 13296303 12432913 11644012 10922638 10264968 9663891 9111044
55900 9111044 8602594 8137034 7709270 7312507 6944025 6603740 6288795 5994658 5719964
55891 5719964 5465297 5228666 5006768 4799234 4607148 4428853 4261579 4105787 3963609
55882C963609j29291j19020j09599j01096r7697j01050j06538j09410j09920j09532
55872B870456j07014j01729r6347r2840q9470q4541p9448p5407p0961o5291o0371
55861A947037n7376n4515n0670m7508m5886m3878m0644l8378l8136l7476l4709
55850A457861l1777l0472k9418k7364k5821k5753k5200k3022k1517k2391k3338
55839A171788k1786j9033j7469j6526j4623j2660j2137j1911j0013p070n021m041
55827A019498l285l140m176n369n652n973p650j0191j2543j4959j7722j9657j9856
55814H89325j9412j9636k0010j9611j8964j8784j8375j6984j5263j3911j2403
55803F95972j0455q956q095o510l784j781j764k228j433j61J30m2M45Q04n50l595
$$ plain form
55882 3963609 3834318 3715298 3605699 3504603 3406906 3305856 3199318 3089908 2979988 2870456
55872 2870456 2763442 2661713 2565366 2472526 2383056 2298515 2219067 2143660 2072699 2007408 1947037
55861 1947037 1889661 1835146 1784476 1736968 1691082 1647204 1606560 1568182 1530046 1492570 1457861
55850 1457861 1426084 1395612 1366194 1338830 1313009 1287256 1262056 1239034 1217517 1195126 1171788
55839 1171788 1150002 1130969 1113500 1096974 1082351 1069691 1057554 1045643 1035630 1028560 1023539 1019498
55827 1019498 1016213 1013073 1008897 1003528 997876 991903 984253 974062 961519 946560 928838 909181 889325
55814 889325 869913 850277 830267 810656 791692 772908 754533 737549 722286 708375 695972
55803 695972 685517 676561 668466 661956 658172 656391 654627 652399 650966 650805 650935 650893 651338 652142 651592 647997
55787F47997p241j1008j4459j6372j6279j5592j5486j5051j3162j0681q932p435
55775D96299n077k310l32Q61J808K126J405M49m6j018l542o848r478j1348j3086
55760D49863j4377j4671j4626j5217j6150j6565j6471j6211j5492j4128j2704
55749B83251j1359r087n476j840O19K410M234N360M975L741K517R26j177k452
55735B76642j987j055j122j510j029m24j051k292k623k248k481l220l304k755
55721B49541k616k973l088l019l285l404k528j066q3M60J242J954J831J285J348
55706B35599J967K407K706L314L855L855L996M963N834N348M169L946M656M786
55692B91401L813K617J737R63N53J053K079K743L145L882M467L895K557J853K027
$$ plain form
55787 647997 640756 629748 615289 598917 582638 567046 551560 536509 523347 512666 503734 496299
55775 496299 491222 488912 488580 489441 491249 493375 494780 495229 495183 494165 490623 483775 474297 462949 449863
55760 449863 435486 420815 406189 390972 374822 358257 341786 325575 310083 295955 283251
55749 283251 271892 262805 257329 255489 256108 258518 262752 268112 273087 276828 279345 280271 279094 276642
55735 276642 274655 273600 272478 270968 269939 269515 268464 266172 263549 261301 258820 255600 252296 249541
55721 249541 246925 243952 240864 237845 234560 231156 228628 227562 227479 227939 229181 231135 232966 234251 235599
55706 235599 237566 239973 242679 245993 249848 253703 257699 262662 268496 273844 278013 281959 286615 291401
55692 291401 295214 297831 299568 300531 301084 302137 304216 306959 310104 313986 318453 322348 324905 326758 328785
55677C28785J980J199K93m49j512l070m684o132p378p939p464o726o780p366p358
55662B65399o500n416m246k715j240n10j17J003K876M564N729O838P944Q630R027
55647B91266R618J0131R844Q794P521N893L414M39k134m086n584o139n238l659
55633C20080k724k518k247j840j676j258J05J555J453k14k000l414n314p900j0173
55618B81915j1670j2908j3821j3511j1974j0498r914r806r765r904r809q594o497
55605A43244m928m480m323l922l836m211m094l029j988j837k084k052k061k525
55591I7874k751j881l88L17m42j975k996k712j399j36K69R8J13M38O43O60P62
55574H6494Q65O95N47R13J544J815J880K434L370L799L401K729K179J634J147
$$ plain form
55677 328785 330765 331964 332257 331808 330296 327226 322542 316410 309032 301093 293629 286903 280123 272757 265399
55662 265399 258899 253483 249237 246522 245282 244772 244655 245658 248534 253098 258827 265665 273609 282239 291266
55647 291266 300884 311015 320859 329653 337174 343067 346481 346920 344786 340700 335116 328977 323739 320080
55633 320080 317356 314838 312591 310751 309075 307817 307922 309477 310930 310716 308716 305302 299988 292088 281915
55618 281915 270245 257337 243516 230005 218031 207533 197619 187813 178048 168144 158335 149741 143244
55605 143244 138316 133836 129513 125591 121755 117544 113450 110421 108433 106596 104512 102460 100399 97874
55591 97874 95123 93242 92854 93171 92729 90754 87758 85046 83647 83511 83780 83878 83991 84429 85072 85732 86494
55574 86494 87359 88054 88601 89514 91058 92873 94753 97187 100557 104356 107757 110486 112665 114299 115446
55559A15446R91J048J089J461K446L261K951K051J913K539K597J578L50n60j627
55544A37534k926l672l668l748m287m561m144l659l620l679l539l452l384k833
55530H6362j910j371j266q10N9L84m2j49N44J087R25J038K190L428L624L296L573
55513A00962M227M232L645L591M615O120P339Q044Q386Q590Q726Q469P320N282
55499A89548K912O34j514l426m919o248p799r216r778r633r677r994r732q722
55485A02436p888p527o728n152l967m004m249l462k192j833k406k662j991r91
55471D7384l41j21j78m27p68j155j576j748j341p24p70j516j824j009K6N2p88
55454C3176j413j447j418j630j714j261l36O56J201R63Q6q50j361j305p28J04
$$ plain form
55559 115446 116437 117485 118574 120035 122481 125742 128693 130744 132657 135196 137793 139371 139721 139161 137534
55544 137534 134608 130936 127268 123520 119233 114672 110528 106869 103249 99570 96031 92579 89195 86362
55530 86362 84452 83081 81815 81005 81064 81448 81406 81257 81801 82888 83813 84851 87041 90469 94093 97389 100962
55513 100962 105189 109421 113066 116657 121272 127392 134731 142775 151161 159751 168477 176946 184266 189548
55499 189548 192460 193094 191580 188154 183235 176987 169188 159972 150194 140561 130884 120890 111158 102436
55485 102436 94548 87021 80293 75141 71174 67170 62921 59459 57267 55434 53028 50366 48375 47384
55471 47384 47043 46922 46744 46317 45549 44394 42818 41070 39729 39005 38235 36719 34895 33886 33912 33964 33176
55454 33176 31763 30316 28898 27268 25554 24293 23957 24613 25814 26777 26863 26013 24652 23347 22619 22723
55438B2723N83L89J33N39J046M09j164j845p03Q96J262N26j69n75j121j527j067
55421B0335P3Q40P44K88Nj32k12j1N87J171J021j01j404j609m13Q81Q71j33o51
55402B2150k02K48R9q6Q4L8m82o16J57R37P49R4L8M79M97j04o96r17q68n69rM97
55380B1518P00Q17J022R62M32l3J16N74P53O70O12M15j74q33j137j242j474j671
55362B2027j577j416j382j112l91J13l74j575k550k861k667k092j283p16o77o75
55346G92j39O54R81P91O59Q87J212J295R79L07l66n53k38O9J36K58N22N78M90
55327I314Q53J573J585M57o72o80k6J92p8j40J91P08J390J863J106j061k942k797
55309A0836j132K43P93J362K025J712J28j518k040j439l46P31J290J027L67J26
$$ plain form
55438 22723 23306 23695 23828 24367 25413 25822 24658 22813 22110 23006 24268 24794 24625 24050 22929 21402 20335
55421 20335 20408 21248 21992 22280 22285 22153 21941 21930 22517 23688 24709 24608 23204 21595 21182 22063 22934 22801 22150
55402 22150 21948 22196 22295 22209 22293 22331 21849 21233 21390 22327 23076 23170 23208 23687 24184 24080 23384 22467 21599 21030 21021 21518
55380 21518 22218 23035 24057 25019 25451 25418 25534 26108 26861 27531 28143 28558 28384 27551 26414 25172 23698 22027
55362 22027 20450 19034 17652 16540 16149 16262 15888 14313 11763 8902 6235 4143 2860 2144 1467 792
55346 792 653 1307 2288 3079 3738 4625 5837 7132 8111 8418 8052 7499 7261 7330 7466 7724 8246 8824 9314
55327 9314 10167 11740 13325 13782 13110 12430 12404 12596 12518 12378 12569 13277 14667 16530 17636 16575 13633 10836
55309 10836 9704 9947 10740 12102 14127 15839 15967 14449 12409 10970 10624 11355 12645 13672 14039 14165
55293A4165M60P99P54M39%m87p15m84j67j39p0N18J300J648J689J879J854Q76
55275B4319p11j600j191j44O36P42Q6r68j432o12P45J217N18l58p46q77r29o54
55257A8041k04j95o59q61m06K46N69M90M8o43j036o13J99M32m5n05o58q88j130
55238A2182o93M44J272J153O30M15M13L05K62N23Q77J035J053R93O98J18n20j051
55220B0109j420j414q93k98k57o94j005r74q31n46N7O12O26N21J121K056J977
55203A8747N93q14j225r88o37J0Q71R90j03j320j354l91M14N85N23N35N41N17
55185A7494N00L12j70o85r17q58o26k32K21N27P51J084J231O60l18n79K69J191
55167A9855J144M24q1k37m66p13n81j88r0l70n16j74L62M95p2r64j349p79J80
$$ plain form
55293 14165 14625 15424 16178 16617 16617 16130 15415 14931 14764 14625 14555 15073 16373 18021 19710 21589 23443 24319
55275 24319 23608 22008 20817 20673 21309 22051 22137 21169 19737 19125 19870 21087 21605 21247 20501 19624 18695 18041
55257 18041 17837 17642 16983 16122 15716 15962 16531 17021 17069 16426 15390 14777 14976 15408 15363 14858 14200 13312 12182
55238 12182 11489 11933 13205 14358 14988 15403 15816 16121 16383 16906 17783 18818 19871 20864 21562 21680 21160 20109
55220 20109 18689 17275 16382 16084 15827 15133 14128 13154 12323 11777 11834 12446 13072 13593 14714 16770 18747
55203 18747 19340 18526 17301 16313 15676 15686 16557 17547 17444 16124 14770 14379 14793 15378 15901 16436 16977 17494
55185 17494 17994 18306 18136 17451 16534 15676 15050 14818 15039 15566 16317 17401 18632 19292 18974 18395 18664 19855
55167 19855 20999 21423 21342 21105 20639 19926 19345 19157 19067 18697 18181 18007 18369 18864 18792 17828 16479 15700 15880
55148A5880N50K28m0O1Jm33n70l9L97K6n68l59N19J013P28K42M8K2j8m7j55n08
55126A6978q68p34p3N83Q41Q77J059J499K050K456K486K091J442O96j42r43j270
55109B9028q67j63N2m56j082j084l90L70N72K70Q2L87Q06P25K32M5N20J181J440
55090C1668J299J081Q26M04p6l22k46n8k3k85p70j110q97j82N00P40O52N26L75
55071C4102Q4k26k93j17Lj63n09o87m38R1M68L85m1n16r18j183j118o48j15O0
55051B8221n0l0J69J62k42p78j106j066o12R6N65L97j32l49PO56J358K029K380
55032C1675K093J397R13P88O64M40M28O16N50J36j09O5K74J79K8J10L37N75Q88
55013D2047J185J160Q08M55J57l24q13p64k29L8l11p57r07j039j275j115l75K64
$$ plain form
55148 15880 16430 16658 16618 16679 16680 16247 15677 15638 16035 16061 15493 15134 15653 16666 17394 17636 17684 17706 17688 17641 17486 16978
55126 16978 16110 15376 15303 15886 16727 17604 18663 20162 22212 24668 27154 29245 30687 31383 31241 30298 29028
55109 29028 28161 27998 28050 27594 26512 25428 25038 25408 25980 26250 26332 26719 27525 28250 28482 28527 29047 30228 31668
55090 31668 32967 34048 34874 35278 35202 34880 34634 34576 34553 34268 33498 32388 31491 31309 31809 32549 33201 33727 34102
55071 34102 34186 33960 33667 33550 33553 33390 32881 32194 31756 31847 32315 32700 32659 32143 31225 30042 28924 28276 28161 28221
55051 28221 28171 28141 28310 28472 28230 27452 26346 25280 24668 24764 25329 25726 25594 25245 25252 25908 27266 29295 31675
55032 31675 33768 35165 36078 36866 37530 37970 38398 39014 39564 39700 39591 39656 39930 40109 40137 40247 40584 41159 42047
55013 42047 43232 44392 45200 45655 45812 45488 44675 43911 43682 43720 43409 42652 41745 40706 39431 38316 37941 38205
54995C8205K42r8l28o65j220j342n93L71P31O78P74Q40M95J95O34J455J713J353
54977D3440J104J140Q98K20l58n28m60j63N15J227J351R87Q40J020Q98L99M09
54960E2939J431K697L273L348L692M423N083N651O642Q206R832J1063J1963J2614
54946A42857J2592J1331Q870N896L044M26k125m634o943q886j0333j1154j1300
54933A29641j0829r799q341o846n771n138m556l945l739l962l750k469q39m8r6
54918E9513P3Q66J562J617J468J762K671M127N918P340P684P375P687Q996J0279
54903A28938J0642J0319R615Q055N294K001j080m081p261j0022j1573j1956j1642
54890A17249j0742r393q191p424o524n120l876l380l119k560k370l162l869k991
$$ plain form
54995 38205 38447 38349 38021 37356 36136 34794 34201 34572 35303 35981 36755 37595 38090 38285 38919 40374 42087 43440
54977 43440 44544 45684 46582 46802 46444 45916 45456 45293 45808 47035 48386 49373 50213 51233 52131 52530 52939
54960 52939 54370 57067 60340 63688 67380 71803 76886 82537 89179 97385 107217 118280 130243 142857
54946 142857 155449 166780 175650 181546 184590 185016 182891 178257 171314 162428 152095 140941 129641
54933 129641 118812 109013 100672 93826 88055 82917 78361 74416 70677 66715 62965 60496 59657 59609 59513
54918 59513 59586 60452 62014 63631 65099 66861 69532 73659 79577 86917 94601 101976 109663 118659 128938
54903 128938 139580 149899 159514 167569 172863 174864 173784 169703 162442 152420 140847 128891 117249
54890 117249 106507 97114 88923 81499 74975 69855 65979 62599 59480 56920 54550 51388 47519 44528
54876D4528j048k0n08j152r67n49n25l54N29J567J849J332N68q3m37k63L57Q30
54858D5654O55n4q29j328j383r96n00l70p26j273j698j791j287j87Q26Q54j39
54841C5428j195j443r22k60K7j86o84j000p77k8R60J819K044J240j61q91k31R39
54823C4679J228N41n8j00j33m17k91O24J600J790J423J325J674J934J768J524
54807D9111J677K252K825L038K911K814L095L917N260O864Q201Q879R171R621
54793A19636J0132J0028R323Q960R264Q897O384K150j954m810o755q316r391r690
54779A43858r136p699n684m105l925m788n303m711l475k209r08M64J593K338K983
54764I9293L610L866L644L449L745M439N165N648N688N302M979N197N673N713
$$ plain form
54876 44528 43480 43460 42952 41800 40833 40284 39759 39405 39934 41501 43350 44682 45250 45167 44730 44467 44824 45654
54858 45654 46309 46255 45426 44098 42715 41719 41219 40849 40123 38850 37152 35361 34074 33887 34713 35567 35428
54841 35428 34233 32790 31868 31608 31635 31449 30765 29765 28988 28960 29920 31739 33783 35023 34862 33971 33740 34679
54823 34679 35907 36448 36390 36290 36157 35740 35449 36073 37673 39463 40886 42211 43885 45819 47587 49111
54807 49111 50788 53040 55865 58903 61814 64628 67723 71640 76900 83764 91965 100844 110015 119636
54793 119636 129768 139796 149119 158079 167343 176240 182624 184774 182820 178010 171255 162939 153548 143858
54779 143858 134722 127023 121339 117234 113309 108521 103218 98507 95032 92823 91915 92379 93972 96310 99293
54764 99293 102903 106769 110413 113862 117607 122046 127211 132859 138547 143849 148828 154025 159698 165411
54750A65411N356N287N599N467M394K814J067j301m594p974j0183j0872j0671
54737A49800j0254r859r474r001q326p485o689o070n589n175m732m037l033k155
54723E7921j851j822j305k10O45O19l9p05j082j132q56m13q7K7ol32j095j807
54705D6470j594l06J134J735J404P18K25R0O0l51j219j857j599p81k75j78J78
54688D3854R40J417J259J007J107J285J230J170J316J451J412J364J308R99N63
54673F1682M46N41K98j05K38J321J796Q46m89o96L16J553K388K810K881K807L065
54656H1698L713M118M006M122N086O307O910P052P355P672P437O782O060M701
54642A63019J833k068n290o753o903o681o513o373o144n636m832m133l932m040
$$ plain form
54750 165411 170767 176054 181653 187120 191514 194328 195395 194094 189500 181526 171343 160471 149800
54737 149800 139546 129687 120213 111212 102886 95401 88712 82642 77053 71878 67146 63109 60076 57921
54723 57921 56070 54248 52943 52733 53378 53997 53958 53253 52171 51039 50183 49770 49683 49710 49704 49372 48277 46470
54705 46470 44876 44570 45704 47439 48843 49561 49786 49876 49936 49585 48366 46509 44910 44129 43854 43676 43854
54688 43854 44794 46211 47470 48477 49584 50869 52099 53269 54585 56036 57448 58812 60120 61119 61682
54673 61682 62128 62669 62967 62862 63100 64421 66217 67063 66574 65878 66194 67747 70135 72945 75826 78633 81698
54656 81698 85411 89529 93535 97657 102743 109050 115960 123012 130367 138039 145476 152258 158318 163019
54642 163019 164852 162784 157494 150741 143838 137157 130644 124271 118127 112491 107659 103526 99594 95554
54628I5554l984l686l276k571j416l65k09q87j545j642j348j012q45j062j585
54613G0121j796j250n94r43k313l461l412k418j215j66O03Q41M33l14r26j089
54597E2101o79R0O10M12j85l98k7L47K43j60m35m05q0M05O26K00n66q53m49j13
54577E0684m71j045r35j30N11M65J41J24L12J84l34o71l77K56N70L72Q0R9M06
54558E0241Q00J164J333J051L47k66k95K26Q50J215J195Q57M75L71N94R46J438
54541F2542K298L398M127M181M029M119M123L454K216J024J29o62j440k116k778
54526H8644l536m169m379m282m118l684k672j453q14r05j126j110j165j549j919
54511E1763j809j262o89l22l0M18J042J480J340P91N25Q04R87M72l09m81k6K94
$$ plain form
54628 95554 91570 87884 84608 82037 80621 80256 80047 79160 77615 75973 74625 73613 72768 71706 70121
54613 70121 68325 67075 66481 65538 63225 59764 56352 53934 52719 52553 53156 53997 54430 54116 53190 52101
54597 52101 51422 51512 52122 52534 52349 51951 51924 52271 52514 52354 51919 51514 51434 51839 52465 52665 52099 51246 50797 50684
54577 50684 50213 49168 48233 48103 48614 49079 49220 49344 49656 49840 49506 48835 48458 48714 49284 49656 49736 49835 50241
54558 50241 51041 52205 53538 54589 54936 54670 54375 54601 55451 56666 57861 58718 59193 59564 60158 61104 62542
54541 62542 64840 68238 72365 76546 80575 84694 88817 92271 94487 95511 95640 94978 93538 91422 88644
54526 88644 85108 80939 76560 72278 68160 64476 61804 60351 59537 58632 57506 56396 55231 53682 51763
54511 51763 49954 48692 48003 47681 47651 48069 49111 50591 51931 52722 53247 54051 55038 55510 55201 54720 54694 54988
54493E4988K05J41K89K61MN9N88R64P54M13M41N41J99m05p07o44n52m71k11R9
54473E6956Q6j93k75K1L23K69m8k62k21r7j60n03r20j092r46p54p50p91n25J75
54453E0293J052J690J767J249M67j24l62m69n89m77P4P29R73Q68R33J237J150
54436F0461L34n98q03l18N5j96q80j542j774j249m4R97R87J89k12K61Q29Q70Q87
54417E8254J348J592R60K29N77J557J649O80N1M46R48R18J122K097K793K089O35
54400G7945p7K11O00O59O68N95K2r10j488j414j036o81m43n38j079j647j730j497
54382F8160j334r41K16J620K010J096j7l91l50o26j197j521j374r21l50J41K87
54365F4508J10M4L87Q11P84L43J15N44J274J499R12J34l0M28Q29Q66R14J129R81
$$ plain form
54493 54988 55193 55334 55623 55884 55888 55947 56535 57499 58253 58666 59107 59648 59847 59442 58735 58091 57539 57068 56857 56956
54473 56956 57042 56849 56574 56595 56918 57187 57139 56877 56656 56559 56399 55896 54976 53884 52938 52184 51434 50643 50118 50293
54453 50293 51345 53035 54802 56051 56518 56394 56032 55563 54974 54497 54571 55300 56273 57141 58074 59311 60461
54436 60461 60795 60197 59394 59076 59131 58935 58055 56513 54739 53490 53446 54443 55430 55619 55407 55668 56497 57367 58254
54417 58254 59602 61194 62154 62383 62960 64517 66166 66846 66897 67343 68291 69209 70331 72428 75221 77310 77945
54400 77945 77868 78079 78679 79338 80006 80601 80623 79713 78225 76811 75775 75094 74651 74113 73034 71387 69657 68160
54382 68160 66826 65885 66101 67721 69731 70827 70810 70419 70069 69443 68246 66725 65351 64430 64080 64221 64508
54365 64508 64618 64662 65049 65860 66644 66987 67102 67646 68920 70419 71331 71465 71435 71863 72692 73558 74472 75601 76582
54346G6582J67o80q65o97q72j241j103n34l93r94j659j729j302q05n26o51j127
54329F1571j396r29j18kq77j864k050j475p64l10j44j23n1P9j14r00j804j947
54311D6782j180k29K66L69L47K57J48J47J09k61q20j010o26k4N44J173J764J943
54293D9699J665J289Q51L2r93j426r83l92l75q30j368j918k232j593J88K045K681
54276D6340K014R42J33k59l6Q90J890J968R47k04m34L07J174J330P04o9l51j82
54258E7104j45n42j009j082q05n55m23j42M61J180J629J623J310R14M31j91o47
54241E9111m45L12Q15O17L28N86Q89L32p99j235n15N57J246J603J569O60r40k057
54223F2634j947j221p75o19m80o05j139j468j151q16j150j589j103J11Q90P88
$$ plain form
54346 76582 76749 76069 75204 74507 73635 72394 71291 70757 70364 69370 67711 65982 64680 63875 63349 62698 61571
54329 61571 60175 59246 59128 59126 58249 56385 54335 52860 52096 51786 51642 51519 51468 51547 51433 50533 48729 46782
54311 46782 45602 45373 45639 46008 46355 46612 46760 46907 47016 46755 45935 44925 44299 44275 44819 45992 47756 49699
54293 49699 51364 52653 53504 53536 52543 51117 50134 49742 49367 48537 47169 45251 43019 41426 41614 43659 46340
54276 46340 48354 49296 49429 49170 49134 50024 51914 53882 54829 54625 54191 54498 55672 57002 57706 57637 57286 57104
54258 57104 56959 56417 55408 54326 53521 52966 52543 52401 52862 54042 55671 57294 58604 59518 59949 59758 59111
54241 59111 58666 58978 59793 60410 60738 61324 62213 62545 61746 60511 59996 60553 61799 63402 64971 65631 64691 62634
54223 62634 60687 59466 58691 58072 57592 56987 55848 54380 53229 52413 51263 49674 48571 48682 49572 50360
54207E0360M51L45K15p2j63P7K45J07N7M93J212J650J461O51n43j686k260j979
54189E0621j010P7O30L78k63n75l19O5J78J71K72K63j75q47j296j407j434j546
54171D3783j689j740j528r53k85Jm9J89Q75J167L82p39p91L99J537J481M93l78
54153D2155m99m3M52N99M23K03N8k17p25j116r75l70K66O31O40K73k85o04m76
54134D0390k80m54q03p42j45M83O23J85n01q87n62K21N89J8r47j375j084n82j49
54115C3998L54Q93J155J110J074J074P62J13l30k49q1l59q30p17J87J124J312
54098D0590Q96O58Q16O66k36j045n22J189K478K160P97k29k38M69J216J349N96
54081E1610m12n04N61J535J247K05k29K46O91M56r6l66j66M18J100J330Q12N0
$$ plain form
54207 50360 50811 51156 51371 51299 51136 51213 51458 51565 51622 52115 53327 54977 56438 57089 56546 54860 52600 50621
54189 50621 49611 49688 50318 50696 50433 49858 49539 49604 49782 49953 50225 50488 50313 49466 48170 46763 45329 43783
54171 43783 42094 40354 38826 37873 37588 37589 37540 37729 38604 39771 40153 39414 38623 39022 40559 42040 42533 42155
54153 42155 41656 41613 42065 42664 43087 43290 43348 43131 42406 41290 40315 39945 40211 40842 41482 41755 41470 40866 40390
54134 40390 40110 39656 38853 38111 37966 38449 39072 39257 38756 37869 37307 37528 38117 38135 37188 35813 34729 34147 33998
54115 33998 34352 35245 36400 37510 38584 39658 40420 40533 40203 39954 39873 39514 38684 37967 38154 39278 40590
54098 40590 41486 42144 42960 43626 43390 42345 41823 43012 45490 47650 48447 48218 47980 48449 49665 51014 51610
54081 51610 51198 50694 51255 52790 54037 54242 54013 54259 54950 55406 55310 54944 54778 55196 56296 57626 58438 58488
54063E8488k15j2P4m3P7M37N26K89K88P24J120J171J164J249J118P63Q07J587
54045F9612K472K646K166J744J813K223K614K728K535K349K617L435M428N203
54031A08585N620N580M959L970L196K973L021K884K458J896J280O60K40K07M59
54016A47988O52N06qp64j672k722l753m337m172l633l472l805l917l353k643k442
54000A08453k516k290j949k137k811l321l444l428l128k136p86PP5J41L95M5j247
53983G9923k491k659j992j304p19Q3Q41R16K86m07p02o75n23l37k38k87k67M4
53965F9492M60N19R0m14m86J0P37J253J432J509J658J722J560J426J642K038K178
53948H6826K082K175K604L112L574M090M554M702M657M781M952M729M286M363
$$ plain form
54063 58488 58273 58261 58335 58292 58369 58806 59332 59621 59909 60633 61753 62924 64088 65337 66455 67218 68025 69612
54045 69612 72084 74730 76896 78640 80453 82676 85290 88018 90553 92902 95519 98954 103382 108585
54031 108585 114205 119785 124744 128714 131910 134883 137904 140788 143246 145142 146422 147082 147322 147529 147988
54016 147988 148640 149146 149138 148374 146702 143980 140227 135890 131718 128085 124613 120808 116891 113538 110895 108453
54000 108453 105937 103647 101698 99561 96750 93429 89985 86557 83429 81293 80507 80514 80589 80730 81125 81170 79923
53983 79923 77432 74773 72781 71477 70758 70841 71682 72598 72884 72477 71775 71100 70577 70240 70002 69715 69448 69492
53965 69492 69952 70471 70561 70147 69661 69671 70408 71661 73093 74602 76260 77982 79542 80968 82610 84648 86826
53948 86826 88908 91083 93687 96799 100373 104463 109017 113719 118376 123157 128109 132838 137124 141487
53934A41487N029N396M909M115L729L639L395K931K275J284K33n1O51J340J180
53919A81542P78J189K192K634K217J809K050K623L052L431M042M794N287N164
53905B22804M336L124K000J005k47j730k639k449j874j984k680k924k362j795
53891B12585j986k812l728m397m660m481m223m461n298o194o531o024m683k964
53877A50143j913k370l858m907m697l825l212k955k635k177j840j746j833k023
53863A10152k117j835j366j504k707m200m550l160r31O22P10j98r96j023o15n16
53847H5766q97j275j355j421j633j506o26N12R93P22M49O05P68M99N6j50k77o61
53829H0569j025p77j7M04No22n67L34J432J992J706P89k8J09J285K409K263R91
$$ plain form
53934 141487 146516 151912 156821 160936 164665 168304 171699 174630 176905 178189 178422 178371 179022 180362 181542
53919 181542 182320 183509 185701 188335 190552 192361 194411 197034 200086 203517 207559 212353 217640 222804
53905 222804 227140 230264 232264 233269 233022 231292 228653 226204 224330 222346 219666 216742 214380 212585
53891 212585 210599 207787 204059 199662 195002 190521 186298 181837 176539 170345 163814 157790 153107 150143
53877 150143 148230 145860 142002 137095 132398 128573 125361 122406 119771 117594 115754 114008 112175 110152
53863 110152 108035 106200 104834 103330 100623 96423 91873 88713 87782 88404 89114 88916 87920 86897 86282 85766
53847 85766 84869 83594 82239 80818 79185 77679 77053 77565 78558 79280 79729 80334 81102 81601 81657 81507 81230 80569
53829 80569 79544 78767 78750 79154 79159 78537 77970 78304 79736 81728 83434 84223 84195 84304 85589 87998 90261 91252
53811I1252J5K91J272J878J938K107K687L245L358L173L020K929K794K723K907
53796A25589L249L392L154K785K650K749K645J962Q70m2l67k94l25p17j244j520
53780A44536j396j088r45j174j747k484l127l407l259k977k983l299l429k985
53766A10236k161j439r70o38n23q22j332j561j421j361j655k029k169k206k316
53751H7633k250j686p86r0M2l52r80j416j306p36k25r0o0K12N61O01L83K11K1
53732G9687m73j073j091l27M81N23p2m42q3N96Q93O29K64K09L69M14K81J38J6
53713H0939j64k87j34J19mn22p59k46N43Q22N44L22N02Q97J329J878K501K885
53695I1165K859K588K282K048K077K497K896K503J180k21q32q02q46j031o72N58
$$ plain form
53811 91252 91267 91558 92830 94708 96646 98753 101440 104685 108043 111216 114236 117165 119959 122682 125589
53796 125589 128838 132230 135384 138169 140819 143568 146213 148175 149045 149003 148636 148342 148017 147300 146056 144536
53780 144536 143140 142052 141107 139933 138186 135702 132575 129168 125909 122932 119949 116650 113221 110236
53766 110236 108075 106636 105666 105028 104505 103683 102351 100790 99369 98008 96353 94324 92155 89949 87633
53751 87633 85383 83697 82911 82821 82863 82511 81531 80115 78809 78073 77848 77758 77698 77910 78471 79072 79455 79666 79687
53732 79687 79214 78141 77050 76723 77204 77727 77655 77213 77130 77726 78619 79248 79512 79721 80090 80504 80785 80923 80939
53713 80939 80775 80488 80354 80473 80469 79947 79188 78942 79485 80307 80851 81173 81675 82572 83901 85779 88280 91165
53695 91165 94024 96612 98894 100942 103019 105516 108412 110915 112095 111874 111042 110240 109394 108363 107691 108249
53679A08249K002K773K726K369K103J910J664J320Q56K82k09l83k53l3J63L23
53663A25862K64k40r03j062n35N8J99K29O62J229J233O42M9l26p77j250j177m18
53645A23739L63O05N26N11M84L10K68N55P80M57k18o06m66q5J88K05k5k29J8P53
53625A28133J443J640J535J504J455J110O07L19K73K25J99M07P72R69R08Q01Q08
53608A43108R56J229J450J302Q82Q79J765K996L641L514L154K867K493K031J765
53593A74032J739J727J773K128K592K586K015J433J255J265J167R91Q00O04O67
53578A96774J374K437K850K039N97m51p27n02j15J75J06l24p47r01r39r66p03
53561A99977p6K39m35j667k257j718q22n17q75j327j478j304q69k66K34M07L77
$$ plain form
53679 108249 110251 113024 115750 118119 120222 122132 123796 125116 125972 126254 126045 125662 125409 125376 125539 125862
53663 125862 126126 125886 124983 123921 123386 123444 123643 123872 124534 125763 126996 127638 127687 127361 126584 125334 124157 123739
53645 123739 124102 124707 125233 125744 126228 126538 126806 127361 128141 128598 128380 127774 127308 127223 127411 127616 127591 127362 127380 128133
53625 128133 129576 131216 132751 134255 135710 136820 137427 137746 138019 138244 138443 138850 139622 140591 141499 142300 143108
53608 143108 144064 145293 146743 148045 148927 149806 151571 154567 158208 161722 164876 167743 170236 172267 174032
53593 174032 175771 177498 179271 181399 183991 186577 188592 190025 191280 192545 193712 194703 195503 196107 196774
53578 196774 198148 200585 203435 205474 206071 205620 204893 204391 204276 204451 204557 204233 203486 202585 201646 200680 199977
53561 199977 199901 200140 199705 198038 195781 194063 193241 192724 191849 190522 189044 187740 186871 186605 186839 187246 187623
53544A87623M47N98M93J02n7M38J231J569J260Q46Q39J203J677K157K508K442
53528B05376J969J620J805K194K214J918J854K149K412K551L055M165N340N948
53514B44570O079O257O594O720O465O192O412P282Q577R871J0723J0891J0556
53501C47189J0266J0498J1252J2174J3044J4023J5314J6765J7866J8142J7435
53490E03968J6068J4831J4515J5218J6178J6672J6810J7075J7308J6928J6022
53479F81593J5404J5447J5694J5881J6409J7245J7344J5994J4049J2857J2504
53468H50421J2165J1726J1849J2589J3185J3308J3365J3401J2736J1129R366Q177
53456I93417P325O170M597K855J044q24k684m614o711q544r326q992q496q707
$$ plain form
53544 187623 188070 188668 189161 189263 189206 189644 190875 192444 193704 194550 195389 196592 198269 200426 202934 205376
53528 205376 207345 208965 210770 212964 215178 217096 218950 221099 223511 226062 229117 233282 238622 244570
53514 244570 250649 256906 263500 270220 276685 282877 289289 296571 305148 315019 325742 336633 347189
53501 347189 357455 367953 379205 391379 404423 418446 433760 450525 468391 486533 503968
53490 503968 520036 534867 549382 564600 580778 597450 614260 631335 648643 665571 681593
53479 681593 696997 712444 728138 744019 760428 777673 795017 811011 825060 837917 850421
53468 850421 862586 874312 886161 898750 911935 925243 938608 952009 964745 975874 985240 993417
53456 993417 1000742 1006912 1011509 1014364 1015408 1014584 1011900 1007286 1000575 992031 982705 973713 965217 956510
53442I56510r509j0392j1233j2005j2348j2123j1946j2365j2946j2888j2321j2143
53430H14291j2659j3168j3003j2322j1635j1091j0509r711q622p271n863m670
53418F93767l715k770j783j104j033j318j279m58J031K737M313N533O220O457
53404G06598O855Q123J0135J1804J2266J1994J2217J3413J4921J6057J7020J8354
53392H59757K0081K1696K2869K3752K4696K5916K7345K8779L0088L1349L2609
53381A148937L3721L4574L5364L6296L7146L7512L7505L7645L8034L8142L7614
53370A552490L6799L6165L5586L4588L2935L0749K8255K5792K3795K2408K1242
53359A880804J9767J7844J5662J3290J0544P284L610k41m180q383j2989j7686
$$ plain form
53442 956510 947001 936609 925376 913371 901023 888900 876954 864589 851643 838755 826434 814291
53430 814291 801632 788464 775461 763139 751504 740413 729904 720193 711571 704300 698437 693767
53418 693767 690052 687282 685499 684395 683362 682044 680765 680307 681338 684075 688388 693921 700141 706598
53404 706598 713453 721576 731711 743515 755781 767775 779992 793405 808326 824383 841403 859757
53392 859757 879838 901534 924403 948155 972851 998767 1026112 1054891 1084979 1116328 1148937
53381 1148937 1182658 1217232 1252596 1288892 1326038 1363550 1401055 1438700 1476734 1514876 1552490
53370 1552490 1589289 1625454 1661040 1695628 1728563 1759312 1787567 1813359 1837154 1859562 1880804
53359 1880804 1900571 1918415 1934077 1947367 1957911 1965195 1968805 1968564 1964384 1956001 1943012 1925326
53347A925326k1882k5400k8618l1600l3613l4138l3977l4396l5306l5375l4108
53336A576913l2647l2079l1959l1221k9823k8615k8093k8164k8625k9161k9199
53325A247327k8519k7773k7637k7649k6692k4508k2032k0185j9031j8125j7073
53314I88103j5590j3639j1732j0630j0501j0787j0981j1207j1730j2284j2223
53303H56799j1282r877q704q077p750p312o664o027n463m718l528j981l76J021
53289G76061J983K358K373K679L780N489P165Q425R446J0623J2081J3543J4607
53276H70613J5156J5508J6014J6572J6767J6436J5809J5153J4586J4200J3969
53265A040783J3449J2063R864P561N694M237L086K374K000J380N0j887m127o546
$$ plain form
53347 1925326 1903444 1878044 1849426 1817826 1784213 1750075 1716098 1681702 1646396 1611021 1576913
53336 1576913 1544266 1512187 1480228 1449007 1419184 1390569 1362476 1334312 1305687 1276526 1247327
53325 1247327 1218808 1191035 1163398 1135749 1109057 1084549 1062517 1042332 1023301 1005176 988103
53314 988103 972513 958874 947142 936512 926011 915224 904243 893036 881306 869022 856799
53303 856799 845517 835640 826936 818859 811109 803797 797133 791106 785643 780925 777397 775416 775040 776061
53289 776061 778044 780402 782775 785454 789234 794723 801888 810313 819759 830382 842463 856006 870613
53276 870613 885769 901277 917291 933863 950630 967066 982875 998028 1012614 1026814 1040783
53265 1040783 1054232 1066295 1076159 1083720 1089414 1093651 1096737 1099111 1101111 1102491 1102541 1100654 1096527 1089981
53251A089981q957j1046j2824j4596j6245j7213j7500j7996j9233k0565k1188
53240I12618k1250k1207k0751j9370j7464j6009j5310j4981j4795j4763j4644
53229G22074j4341j4490j5705j7341j8061j7534j6664j6150j5770j5165j4380
53218E46473j3383j1964j0384r352r063q888q333p604o992o364n628n150n327
53205D38041o104p208q477r786j0971j1920j2430j2149j1057r884r388r296q763
53192C10608p780p210p303p212o423n661n710o178o206n807n671n960o193o185
53178B21109o255o487o396n682m799m457m709m844m269l212k421k237k330k370
53164A60641k456k636k544j970j398j374j638j581j297j417j960k217j868j361
$$ plain form
53251 1089981 1081024 1069978 1057154 1042558 1026313 1009100 991600 973604 954371 933806 912618
53240 912618 891368 870161 849410 830040 812576 796567 781257 766276 751481 736718 722074
53229 722074 707733 693243 677538 660197 642136 624602 607938 591788 576018 560853 546473
53218 546473 533090 521126 510742 501390 492327 483439 475106 467502 460510 454146 448518 443368 438041
53205 438041 431937 424729 416252 406466 395495 383575 371145 358996 347939 338055 328667 319371 310608
53192 310608 302828 295618 288315 281103 274680 269019 263309 257131 250925 245118 239447 233487 227294 221109
53178 221109 214854 208367 201971 196289 191490 187033 182324 177480 173211 169999 167578 165341 163011 160641
53164 160641 158185 155549 153005 151035 149637 148263 146625 145044 143747 142330 140370 138153 136285 134924
53150A34924j033o04Q5N65L44m23j151j334p89J25N45m3r80j171o39m25q89j207
53132A25900r21p75j315j790j320l95j09m80o17j73L61N86N72L85qm59q08j217
53114A17417j724j799j040l1L31J92M90J352J742R68k55p36k83K66J37o42j450
53097A14935j677j251o46l56l68l25j05M0j18n19r81j344j375q46Q8Q21Q49L24
53079A07146j46k42k45m87p11l11P47J613J472N10l99p85q65q88p78n56m57m19
53061A04199J4R18J602J419O28Qk6M36J227K120K612K233J132N7l31J00J023J950
53043A21321K487K522K213J776J412J357J656J870J460N07l40p82j167j659j745
53028A32888j007R7P54P34L64p8m55n71l64o6J51L62M98K84r8L0O94Q67q6j218
$$ plain form
53150 134924 133891 133287 133372 133937 134281 133858 132707 131373 130584 130709 131254 131211 130231 129060 128421 127996 127107 125900
53132 125900 124979 124204 122889 121099 119779 119384 119275 118795 118178 118005 118366 118952 119524 119909 119901 119442 118634 117417
53114 117417 115693 113894 112854 112823 113154 113346 113836 115188 116930 117898 117643 116907 116624 116890 117027 116385 114935
53097 114935 113258 112007 111361 111005 110637 110312 110207 110247 110129 109610 108629 107285 105910 105064 105152 105973 106822 107146
53079 107146 107000 106758 106513 106026 105315 105004 105751 107364 108836 109346 108947 108162 107297 106409 105631 105075 104618 104199
53061 104199 104213 105131 106733 108152 108780 108788 108762 109198 110425 112545 115157 117390 118522 118579 118248 118348 119371 121321
53043 121321 123808 126330 128543 130319 131731 133088 134744 136614 138074 138581 138241 137459 136292 134633 132888
53028 132888 131881 131978 132732 133466 133830 133752 133297 132726 132362 132296 132447 132809 133307 133591 133493 133523 134217 135084 134998 133780
53008A33780j301o22l29m44K3J153J781J362P77P99R71O57K34M40J190J817J982
52991A44270J686R23q6o73m61O4K45K44O98J597K183J945J107J25p81j426j493
52974A50167q98n4M80N90N72O43O85N89N82R35J443J597J308J096J355J723J565
52957A64378Q13N2j26N01J700K699K480P74j288k128j382j72L39R4k11r0L70P60
52939A69563O92J43m46o23m46k52q9J49J38o53k049l049k825j478K60J524J621
52922A62180N69n88o99M0L58k51q64p49n23r74j632j518o93rK14K72J77k49n33
52903A54528L9J147J570Q87R8J97R45J492J582J553J564J454J135P28L44Lk41
52886A69025k96j27J30J62k48q38j016o52m55j087k130k509j865p97J58R86J497
$$ plain form
53008 133780 132479 131857 131528 131084 131107 132260 134041 135403 136180 136979 137950 138607 138841 139281 140471 142288 144270
52991 144270 145956 146879 146793 146120 145659 145723 145968 146212 146910 148507 150690 152635 153742 153867 153086 151660 150167
52974 150167 149269 149215 149695 150285 150857 151500 152185 152774 153356 154291 155734 157331 158639 159735 161090 162813 164378
52957 164378 165191 165243 165117 165618 167318 170017 172497 173271 171983 169855 168473 168301 168640 168734 168523 168433 168803 169563
52939 169563 170255 170398 169952 169329 168883 168631 168542 168691 168829 168176 166127 163078 160253 158775 159035 160559 162180
52922 162180 162749 162161 161462 161502 161860 161609 160745 159996 159473 158499 156867 155349 154656 154647 154861 155133 155310 155061 154528
52903 154528 154567 155714 157284 158171 158269 158466 159411 160903 162485 164038 165602 167056 168191 168919 169263 169266 169025
52886 169025 168729 168602 168732 168894 168646 167808 166792 166140 165685 164598 162468 159959 158094 157297 157455 158441 159938
52869A59938J117q9j018q31j35j29r35j679j962k346l242m112m196l477k567j935
52853A32402j625j545j622j762j855j843j692j316o83K7M26J90n94j383j626j321
52837A14178j014j147j514j539r96k24K48J55l53q30q99p07q28j496k142k095
52821I8797j505j005o65m0P02O79k92j027m32R75J825J738J488J566J606J345
52805A05755J125J211J287J045O89M98L75K51L84Q54J174Q89K10l55p02j007j204
52788A12479j124q98p11l74L25J066J365J407J835K696L268L116K691K577K652
52773A32370K370J583P00K28L47Q23J122Q05Oo76q32o53n64p67j314k232l261
52756A30055l719l119j887j001r06j132j114r39r64r86l97Q16J725J478M09l05
$$ plain form
52869 159938 161055 160966 159948 159117 158982 158853 157918 156239 154277 151931 148689 144577 140381 136904 134337 132402
52853 132402 130777 129232 127610 125848 123993 122150 120458 119142 118459 118486 118912 119102 118508 117125 115499 114178
52837 114178 113164 112017 110503 108964 107968 107744 107992 108147 107794 106964 106065 105358 104530 103034 100892 98797
52821 98797 97292 96287 95622 95582 96284 96963 96671 95644 95212 96187 98012 99750 101238 102804 104410 105755
52805 105755 106880 108091 109378 110423 111112 111610 111985 112236 112620 113474 114648 115537 115747 115392 114690 113683 112479
52788 112479 111355 110457 109746 109372 109697 110763 112128 113535 115370 118066 121334 124450 127141 129718 132370
52773 132370 134740 136323 137023 137251 137598 138421 139543 140348 140354 139678 138846 138193 137629 136862 135548 133316 130055
52756 130055 126336 123217 121330 120329 119423 118291 117177 116238 115274 114288 113891 114707 116432 117910 118319 118014
52740A18014j7P82J242J053M63j51m03L0R65J653J576J147J077J331J321J011
52724A31094J059J698K282K230J802J510J351J111R53J129J411J474J543K068
52710A52715K802K931K126J005L08J23M7k02n91r11r91q35p01q21j117j246r49
52693A53693k08P82J554J488M75o82r84m08J93L89O70J369J800J147k40j181j149
52676A58708p15n28n75o17p54j169j687j984j992j872j686j445j278j330j508
52661A39568j582j484j355j336j424j532j504j248r46r63j374j720j532r39l76
52646A20253J47J011K158K878K703K088J777J773J479P15Q6J94Q55J345J244P99
52630A41505M86M16L35J63K22P50J324J232M94K8M78J254J233K40q10j151j011
$$ plain form
52740 118014 117997 118779 120021 121074 121537 121386 120983 121013 121978 123631 125207 126354 127431 128762 130083 131094
52724 131094 132153 133851 136133 138363 140165 141675 143026 144137 145090 146219 147630 149104 150647 152715
52710 152715 155517 158448 160574 161579 161887 162010 162057 161855 161264 160353 159362 158527 157826 157005 155888 154642 153693
52693 153693 153485 154267 155821 157309 157784 157102 156118 155710 155903 156292 156962 158331 160131 161278 161038 159857 158708
52676 158708 157993 157465 156890 156273 155519 154350 152663 150679 148687 146815 145129 143684 142406 141076 139568
52661 139568 137986 136502 135147 133811 132387 130855 129351 128103 127157 126194 124820 123100 121568 120629 120253
52646 120253 120400 121411 123569 126447 129150 131238 133015 134788 136267 136982 137068 137262 138117 139462 140706 141505
52630 141505 141991 142407 142742 142905 143127 143877 145201 146433 146927 146955 147433 148687 149920 150160 149350 148199 147188
52613A47188j006j252j423j380j287j209r86n56j49l2j81l11k06rr1n73j111j238
52595A34188q86l67L5K76L43J88j18l60m52n27o74q06q65r50j055r99p19m24k97
52576A25531l11m48p98j173j099m93l4k92q05o54K21R60J036P97O19K73m32j043
52558A21855j037o59n43p68q56n72j93k1q6l57p96j197j310j168r80p33k92J19
52540A10406N8m28p74o96m94l82j35K60K16n58j252q55M18J300J055J65n63q37
52522A06904o96k54Q8k55j226j863j294K01J455J614P89j82m51J52Q95Q18j87
52505A06508j264j668j562j434j257o81J90Q08Q44L79l78j178j625j488j013n90
52489I4591k24K31N54L78j79n91n97k71L42J081J346O92k74m68J41M87J25q8M75
$$ plain form
52613 147188 146182 144930 143507 142127 140840 139631 138645 138089 137940 137908 137727 137416 137210 137201 137110 136537 135426 134188
52595 134188 133302 132935 132970 133246 133589 133777 133659 133299 132847 132320 131646 130840 129975 129025 127970 126971 126252 125828 125531
52576 125531 125220 124772 123974 122801 121702 121209 121175 120883 120078 119424 119645 120605 121641 122438 123057 123330 122898 121855
52558 121855 120818 120159 119616 118848 117992 117420 117227 117206 117120 116763 115967 114770 113460 112292 111312 110579 110287 110406
52540 110406 110464 110036 109262 108566 108072 107690 107555 107815 108031 107473 106221 105366 105784 107084 108139 108304 107741 106904
52522 106904 106208 105954 106042 105787 104561 102698 101404 101605 103060 104674 105463 105281 104830 104982 105877 106695 106508
52505 106508 105244 103576 102014 100580 99323 98642 98832 99640 100484 100863 100485 99307 97682 96194 95181 94591
52489 94591 94367 94598 95152 95530 95351 94760 94163 93892 94234 95315 96661 97353 97079 96611 96752 97239 97364 97276 97751
52470I7751J004M86o43j048l37O28J003O98jo93p86MR77J057K04m62j42P23J220
52451A01643J052M70k00o16m78J9J97j84m93j15N85Q43O11M62N72N75L51K12K36
52432A05742N4m01o11k51K48L47J72K09M78N54K69r2k84l83n72q81j184j228p50
52413A01436J96J083J405J234J035R69Q03M76L29N80R94J241J328J440J550J524
52397A17623J351J106P59K15m50r70j058o50q2R2k74n50K1J259K125J977J226
52380A23720N63P8l99o48l73J58M40M79O39Q68P56L32J60N11R94J168J102J132
52362A31680J329J448J217O31J25L28J377K552K957K432J487N37l09q22o37J89
52346A46521J136J832K266K423K163J635J278J268J339J237R99P46O74J163K230
$$ plain form
52470 97751 98755 99241 98598 97550 97213 97841 98844 99542 99541 98848 98062 98066 99043 100100 100304 99842 99700 100423 101643
52451 101643 102695 103165 102965 102349 101871 101890 102087 101903 101410 101295 101880 102723 103334 103796 104368 104943 105294 105506 105742
52432 105742 105796 105395 104784 104533 104781 105128 105300 105509 105987 106541 106810 106718 106434 106051 105479 104598 103414 102186 101436
52413 101436 101632 102715 104120 105354 106389 107358 108161 108637 108966 109546 110540 111781 113109 114549 116099 117623
52397 117623 118974 120080 120839 121054 120604 119634 118576 117926 117844 117936 117662 117112 117133 118392 120517 122494 123720
52380 123720 124283 124361 123962 123314 122941 123099 123539 124018 124657 125525 126281 126613 126773 127284 128278 129446 130548 131680
52362 131680 133009 134457 135674 136305 136430 136758 138135 140687 143644 146076 147563 148100 147791 146969 146332 146521
52346 146521 147657 149489 151755 154178 156341 157976 159254 160522 161861 163098 164097 164843 165517 166680 168910
52331A68910L009K601J489J154K004K802K602K145K559L590M254M475M890N446
52317B11930N515N187N314O129O969P440P927Q640R149R243R389R893J0312J0253
52303C23290J0084J0309J0729J0864J0748J0744J0845J0890J1140J2015J3239
52292D44897J4042J4162J4116J4246J4246J3865J3476J3428J3320J2557J1389
52281E93744J0623J0374R814Q399O690N552N101M859M579M284L800K836J490J95
52267F72340q12j478j558q61J62O66L91j53n01o41n12J34J143J902K246K786L899
52250F79153N063N686O076O857P861Q422Q454Q557R148J0096J1177J2294J3209
52237G92053J3545J3152J2220J1073J0044R376Q969Q406P519O622N974N397M790
$$ plain form
52331 168910 171919 174520 176009 177163 179167 181969 184571 186716 189275 192865 197119 201594 206484 211930
52317 211930 217445 222632 227946 234075 241044 248484 256411 265051 274200 283443 292832 302725 313037 323290
52303 323290 333374 343683 354412 365276 376024 386768 397613 408503 419643 431658 444897
52292 444897 458939 473101 487217 501463 515709 529574 543050 556478 569798 582355 593744
52281 593744 604367 614741 624555 632954 639644 645196 650297 655156 659735 664019 667819 670655 672145 672340
52267 672340 671528 670050 668492 667631 667793 668459 668850 668697 668196 667555 667043 667177 668320 670222 672468 675254 679153
52250 679153 684216 689902 695978 702835 710696 719118 727572 736129 745277 755373 766550 778844 792053
52237 792053 805598 818750 830970 842043 852087 861463 870432 878838 886357 892979 898953 904350 909140
52224I09140M451M445M115K928J312k6j137k333l148k961k299k328l046l364l056
52209I02693l259m627o235p038p278p603p751p103n973n250n108m973m538m019
52195H21938l561l066k571k171j691r16j22J77j12o64j242j727j900j709j657
52180G99006k232l083l394l080k867l140l404l184k744k496k330k137k428l637
52166G58850n074n503m761l986l953m042l356k221j696k009k422k598l074m066
52152G10089m686m088k766j957k088k552k833l021l203l147k792k426k166j806
52138F70558j392j440k201l166l618l394k769k068j619j785k541l276l348k711
52124F35230j778r02k69M9K28O32J298J723J563J251J475K306L299M235N230O220
$$ plain form
52224 909140 913591 918036 922151 925079 926391 926365 925228 922895 919747 916786 914487 912159 909113 905749 902693
52209 902693 899434 894807 888572 881534 874256 866653 858902 851799 845826 840576 835468 830495 825957 821938
52195 821938 818377 815311 812740 810569 808878 807962 807840 808017 807905 807241 805999 804272 802372 800663 799006
52180 799006 796774 793691 790297 787217 784350 781210 777806 774622 771878 769382 767052 764915 762487 758850
52166 758850 753776 748273 743512 739526 735573 731531 728175 725954 724258 722249 719827 717229 714155 710089
52152 710089 705403 701315 698549 696592 694504 691952 689119 686098 682895 679748 676956 674530 672364 670558
52138 670558 669166 667726 665525 662359 658741 655347 652578 650510 648891 647106 644565 641289 637941 635230
52124 635230 633452 632550 632281 632330 632558 633190 634488 636211 637774 639025 640500 642806 646105 650340 655570 661790
52108F61790P008P765Q943J0502J1746J2205J2230J2542J3481J4910J6417J7436
52096H06975J7533J6966J6658J7229J8294J9000J9084J8874J8439J7345J5412
52085A001809J3159J1253R833Q684P754P070O345N143L471J821N31n38j610k595
52071A072130l350m025m827n614o021o000n908o071o389o456n981n042m049l412
52057I98985l212l184l099k960k802k456j742p59K10J036J815K611L308L678L557
52042I94986L035K546K544K937L107K701K116J903J945J717J107M35k24j135k241
52027A017479k989l070k903l123l871m786n514o036o631p571q773r793j0364j0757
52013I31298j1363j2108j2695j3234j4027j4931j5540j5969j6670j7515j7867
$$ plain form
52108 661790 668798 676563 685506 696008 707754 719959 732189 744731 758212 773122 789539 806975
52096 806975 824508 841474 858132 875361 893655 912655 931739 950613 969052 986397 1001809
52085 1001809 1014968 1026221 1036054 1044738 1052492 1059562 1065907 1071050 1074521 1076342 1076873 1076335 1074725 1072130
52071 1072130 1068780 1064755 1059928 1054314 1048293 1042293 1036385 1030314 1023925 1017469 1011488 1006446 1002397 998985
52057 998985 995773 992589 989490 986530 983728 981272 979530 978771 978981 980017 981832 984443 987751 991429 994986
52042 994986 998021 1000567 1003111 1006048 1009155 1011856 1013972 1015875 1017820 1019537 1020644 1021079 1020855 1019720 1017479
52027 1017479 1014490 1011420 1008517 1005394 1001523 996737 991223 985187 978556 970985 962212 952419 942055 931298
52013 931298 919935 907827 895132 881898 867871 852940 837400 821431 804761 787246 769379
52002G69379j7747j8012j8987j9782j9627j9085j9183j9875k0232j9825j9057
$$ plain form
52002 769379 751632 733620 714633 694851 675224 656139 636956 617081 596849 577024 557967
$$ [...]
##END NTUPLES=NMR SPECTRUM
##END=
