##TITLE=NES1041_872015081_9242725_9DfBnm12dO
##JCAMPDX= 6.0         $$ Bruker NMR JCAMP-DX V2.0
##DATA TYPE= NMR SPECTRUM
##DATA CLASS= NTUPLES
##ORIGIN= BRUKER
##OWNER= Administrator
$$ 1.72 TOPSPIN		Version 2.1
$$ 2015-07-01 20:52:41.602 -0700  Administrator@X
$$ Compression mode = diff/dup
##.OBSERVE FREQUENCY= 400.02188249412
##.OBSERVE NUCLEUS= ^1H
##.ACQUISITION MODE= SIMULTANEOUS (DQD)
##.ACQUISITION SCHEME= undefined
##.AVERAGES= 8
##.DIGITISER RES= 22
##SPECTROMETER/DATA SYSTEM= spect
##.PULSE SEQUENCE= zg30
##.SOLVENT NAME= COFFEE_meoh
##.SHIFT REFERENCE= INTERNAL, COFFEE_meoh, 1, 14.98509
##AUDIT TRAIL= $$ (NUMBER, WHEN, WHO, WHERE, PROCESS, VERSION, WHAT)
$$ ##TITLE= Audit trail, TOPSPIN		Version 2.1
$$ ##JCAMPDX= 5.01
$$ ##ORIGIN= Bruker BioSpin GmbH
$$ ##OWNER= Administrator
$$ $$ E:\/data/COFFEE/nmr/NES1041_872015081_9242725_9DfBnm12dO/30/pdata/1/auditp.txt
$$ ##AUDIT TRAIL=  $$ (NUMBER, WHEN, WHO, WHERE, PROCESS, VERSION, WHAT)
(   1,<2015-07-01 20:52:34.320 -0700>,<Administrator>,<X>,<go>,<TOPSPIN 2.1>,
      <created by zg
	started at 2015-07-01 20:51:28.414 -0700,
	POWCHK enabled, PULCHK disabled,
       configuration hash MD5:
       21 0F 79 D6 B3 7B B4 F6 88 20 88 DB 03 48 BD 9F
       data hash MD5: 64K
       46 7C A9 18 DF 19 85 49 22 34 67 0A 80 A8 9E CD>)
(   2,<2015-07-01 20:52:37.508 -0700>,<Administrator>,<X>,<proc1d>,<TOPSPIN 2.1>,
      <Start of raw data processing
       efp LB = 0 FT_mod = 6 PKNL = 1 PHC0 = 0 PHC1 = 0 SI = 32K 
       data hash MD5: 32K
       74 79 75 A8 F9 F6 05 A3 EA D8 42 68 7B B6 AD 93>)
(   3,<2015-07-01 20:52:37.774 -0700>,<Administrator>,<X>,<proc1d>,<TOPSPIN 2.1>,
      <pk PHC0 = 94.01001 PHC1 = 0 
       data hash MD5: 32K
       65 A3 85 7F 6B 62 8F 1B 4D 3C 18 34 41 B0 B1 74>)
(   4,<2015-07-01 20:52:37.899 -0700>,<Administrator>,<X>,<proc1d>,<TOPSPIN 2.1>,
      <abs ABSG = 1 
       data hash MD5: 32K
       D8 CD 3E 17 29 D9 4F F1 54 9B 65 4D 46 DF 16 DB>)
(   5,<2015-07-01 20:52:37.961 -0700>,<Administrator>,<X>,<proc1d>,<TOPSPIN 2.1>,
      <abs ABSG = 2 
       data hash MD5: 32K
       BA E6 C8 FC D9 E5 F2 AF 83 0D 3B D0 93 83 44 38>)
(   6,<2015-07-01 20:52:38.008 -0700>,<Administrator>,<X>,<proc1d>,<TOPSPIN 2.1>,
      <abs ABSG = 3 
       data hash MD5: 32K
       89 CD 14 85 A1 B2 52 E2 9A EC D5 C5 41 0A 48 A3>)
(   7,<2015-07-01 20:52:38.070 -0700>,<Administrator>,<X>,<proc1d>,<TOPSPIN 2.1>,
      <abs ABSG = 4 
       data hash MD5: 32K
       4C 09 79 5A 32 72 5B 8E E8 C3 CD 80 B0 A3 BD 5F>)
(   8,<2015-07-01 20:52:38.133 -0700>,<Administrator>,<X>,<proc1d>,<TOPSPIN 2.1>,
      <abs ABSG = 5 
       data hash MD5: 32K
       B1 9F C0 CE 59 E7 27 ED 3E D2 DD 5E DA 19 33 7F>)
$$ ##END=
$$ 
$$ $$ hash MD5
$$ $$ 05 79 C3 F8 D0 99 44 03 E2 FC 71 44 16 D7 5A AE
##$RELAX= 
##$RELAX= 
##$RELAX= 
##$RELAX= 
##$RELAX= 
##$RELAX= 
##$RELAX= 
$$ Bruker specific parameters
$$ --------------------------
##$DU= <E:\>
##$EXPNO= 30
##$NAME= <NES1041_872015081_9242725_9DfBnm12dO>
$$ [...]
##$TP= (0..7)
150 150 150 150 150 150 150 150
##$TP07= 0
##$TPNAME0= <>
##$TPNAME1= <>
##$TPNAME2= <>
##$TPNAME3= <>
##$TPNAME4= <>
##$TPNAME5= <>
##$TPNAME6= <>
##$TPNAME7= <>
##$TPOAL= (0..7)
0.5 0.5 0.5 0.5 0.5 0.5 0.5 0.5
##$TPOFFS= (0..7)
0 0 0 0 0 0 0 0
##$TUNHIN= 0
##$TUNHOUT= 0
##$TUNXOUT= 0
##$USERA1= <user>
##$USERA2= <user>
##$USERA3= <user>
##$USERA4= <user>
##$USERA5= <user>
##$V9= 5
##$VALIST= <valist>
##$VCLIST= <CCCCCCCCCCCCCCC>
##$VD= 0
##$VDLIST= <DDDDDDDDDDDDDDD>
##$VPLIST= <PPPPPPPPPPPPPPP>
##$VTLIST= <TTTTTTTTTTTTTTT>
##$WBST= 2048
##$WBSW= 25
##$XGAIN= (0..3)
0 0 0 0
##$XL= 0
##$YL= 0
##$YMAX_a= 621497
##$YMIN_a= -520805
##$ZGOPTNS= <>
##$ZL1= 120
##$ZL2= 120
##$ZL3= 120
##$ZL4= 120
##$ABSF1= 14.98509
##$ABSF2= -5.573092
##$ABSG= 5
##$ABSL= 3
##$ALPHA= 0
##$AQORDER= 0
##$ASSFAC= 0
##$ASSFACI= 0
##$ASSFACX= 0
##$ASSWID= 0
##$AUNMP= <proc_prof1d_extract_pilot.lims>
##$AXLEFT= 0
##$AXNAME= <>
##$AXNUC= <1H>
##$AXRIGHT= 0
##$AXTYPE= 0
##$AXUNIT= <>
##$AZFE= 0.1
##$AZFW= 0.1
##$BCFW= 0
##$BC_mod= 0
##$BYTORDP= 0
##$COROFFS= 0
##$CY= 15
##$DATMOD= 1
##$DC= 0
##$DFILT= <>
##$DTYPP= 0
##$F1P= 0
##$F2P= 0
##$FCOR= 0.5
##$FTSIZE= 32768
##$FT_mod= 6
##$GAMMA= 0
##$GB= 0
##$INTBC= 1
##$INTSCL= 1
##$ISEN= 128
##$LB= 0
##$LEV0= 0
##$LPBIN= 0
##$MAXI= 10000
##$MC2= 0
##$MEAN= 0
##$ME_mod= 0
##$MI= 0
##$NCOEF= 0
##$NC_proc= -8
##$NLEV= 6
##$NOISF1= 0
##$NOISF2= 0
##$NSP= 0
##$NTH_PI= 0
##$NZP= 0
##$OFFSET= 14.98509
##$PC= 1
##$PHC0= 94.01001
##$PHC1= 0
##$PH_mod= 1
##$PKNL= yes
##$PPARMOD= 0
##$PPDIAG= 0
##$PPIPTYP= 0
##$PPMPNUM= 2147483647
##$PPRESOL= 1
##$PSCAL= 4
##$PSIGN= 0
##$PYNMP= <proc.py>
##$REVERSE= no
##$SF= 400.02
##$SI= 32768
##$SIGF1= 0
##$SIGF2= 0
##$SINO= 400
##$SIOLD= 32768
##$SPECTYP= <>
##$SREGLST= <1H.CDCl3>
##$SSB= 0
##$STSI= 32768
##$STSR= 0
##$SW_p= 8223.68421052631
##$SYMM= 0
##$S_DEV= 0
##$TDeff= 65536
##$TDoff= 0
##$TI= <>
##$TILT= no
##$TM1= 0
##$TM2= 0
##$TOPLEV= 0
##$USERP1= <user>
##$USERP2= <user>
##$USERP3= <user>
##$USERP4= <user>
##$USERP5= <user>
##$WDW= 1
##$XDIM= 32768
##$YMAX_p= 443873947
##$YMIN_p= -663189
##$CURPLOT= <Network HP LaserJet P1505>
##$CURPRIN= <$Network HP LaserJet P1505>
##$DFORMAT= <normdp>
##$LAYOUT= <+/1D_H.xwp>
##$LFORMAT= <normlp>
##$PFORMAT= <normpl>
##$SURQMSG= 1
$$ End of Bruker specific parameters
$$ ---------------------------------
##NTUPLES= NMR SPECTRUM
##VAR_NAME=  FREQUENCY,     SPECTRUM/REAL,   SPECTRUM/IMAG
##SYMBOL=    X,             R,               I
##VAR_TYPE=  INDEPENDENT,   DEPENDENT,       DEPENDENT
##VAR_FORM=  AFFN,          ASDF,            ASDF
##VAR_DIM=   32768,         32768,           32768
##UNITS=     HZ,            ARBITRARY UNITS, ARBITRARY UNITS
##FACTOR=    0.250966925370066, 1,           1
##FIRST=     8223.43324360094, 15810,        -62846
##LAST=      0,             -133192,         47660
##MIN=       0,             -663189,         0
##MAX=       8223.43324360094, 443873947,    0
$$ Real data points
##PAGE= N=1
##DATA TABLE= (X++(R..R)), XYDATA
$$ [...]
19483c20405F3637J9798d670j94738J5036k13566I5814b03444B33341c06867E8819
19471C4553b42542f6792C6235E038K1646a49241D7109e92183a52886j88870a5737
19459H2711J63247A1822o80a72219D1596a6074n22240J61431B37107a21458k65255
19448c86713J28906B64626H1729b26969O022a7631r9477I4188b38822J07729k403
19437a33496B5810b7068A17622d6165k0175k7037o5910A52415k1134M6616c36207
19425e11920O6334d0845k817k440k8465k97729d2707j19343M4633B67359b37820
19413B68128b4641k82921A02753c00479I2103C1464A4768a7994k37346a01901
19402B19247a16432k13918A72406A5911b8036k99042J10054e4464C374a65368
$$ plain form
19483 -320405 63637 83435 -4670 -199408 -184372 -397938 95814 -203444 233341 -306867 58819
19471 34553 -242542 -66792 36235 5038 26684 -149241 47109 -592183 -152886 -341756 -15737
19459 82711 245958 11822 11142 -172219 41596 -16074 -538314 -376883 237107 -121458 -386713
19448 -386713 -257807 264626 81729 -226969 -220947 -17631 -117108 94188 -238822 -131093 -133496
19437 -133496 25810 -27068 117622 -46165 -66340 -93377 -159287 152415 131281 177897 -336207
19425 -511920 -445586 -40845 -43662 -46102 -74567 -372296 -42707 -162050 -117417 267359 -237820
19413 268128 -24641 -307562 102753 -300479 92103 31464 14768 -17994 -255340 -101901
19402 219247 -116432 -330350 172406 15911 -28036 -327078 -217024 -54464 3374 -165368
19391g4148j67307a991n6006H6521L23940C2321g7470l36092I0626a57516O1347
19380i6169K1404o3262l7874J7263q1721c5468p3998k03156j25474c0995k9424
19369f0419q9562m235b2153A75371E4694R2753a39843j98787M2005b9969k30762
19358b60731j36981A80596E944a81012F763c3715j84305k31630i8715B6322L634
19347B9956b09706N451B6516h6959A9178R0382b19681M0962A89093A0953a67464
19335c6817G1919a21872j96310a26187K7314d0994n9336E2874c27129A83145a02063
19323b43375b1635A3146i7728m82660b52928A68787B6415d0851B6249M6752b80052
19311I7669C7907c83742C3589a02649l6410A14867b48057a00672j24644b0791
$$ plain form
19391 -74148 -241455 -1991 -57997 86521 410461 32321 -77470 -413562 90626 -157516 -96169
19380 -96169 -74765 -138027 -175901 -158638 -240359 -35468 -109466 -312622 -438096 -30995 -60419
19369 -60419 -149981 -154216 -22153 175371 54694 147447 -139843 -338630 -296625 -29969 -260731
19358 -260731 -397712 180596 5944 -181012 6763 -33715 -218020 -449650 -98715 26322 29956
19347 29956 -209706 -204255 26516 -86959 19178 109560 -219681 -178719 189093 10953 -167464
19335 -36817 71919 -121872 -318182 -126187 -98873 -40994 -100330 52874 -327129 183145 -102063
19323 -243375 -21635 13146 -97728 -580388 -252928 168787 26415 -40851 26249 73001 -280052
19311 97669 37907 -383742 33589 -102649 -139059 114867 -248057 -100672 -225316 -20791
19300i9022q4235m4398h7470r8747M7898A34519c0043j82840k2927A41478c15506
19288a03112j512c1633k16374a03567J3664A16257i4175H6112c34522f1877k9176
19277i1053l7011A0339b24300f4294l39140J72061C55872g5150q6960b4814A02136
19265a03504A24770a55284b4462j13333H6641A7185J16270C419L97117a21503
19254c06895a19198L2568r5703k3373A45543c44190a1713B24800b73700B09509
19243a2407j48534P4816r2643B30678i9281D7817i0804k56947A00095h4068H2641
19231D9810R757I355g5810l343n0423o2197e4877j12783g1837j67431r6039A79554
19218A45013l6735a35139D1530b25732m4755N3212A01529f8618A89002a94393
$$ plain form
19300 -99022 -183257 -227655 -87470 -186217 -138319 134519 -30043 -212883 -235810 141478 -315506
19288 -103112 -104624 -31633 -248007 -103567 -89903 116257 -94175 86112 -334522 -61877 -91053
19277 -91053 -128064 10339 -224300 -64294 -403434 -231373 355872 -75150 -162110 -24814 102136
19265 -103504 124770 -155284 -24462 -137795 86641 17185 133455 3419 400536 -121503
19254 -306895 -119198 -86630 -182333 -205706 145543 -344190 -11713 224800 -273700 209509
19243 -12407 -160941 -86125 -178768 230678 -99281 47817 -90804 -347751 100095 -84068 82641
19231 49810 59567 9355 -75810 -79153 -129576 -191773 -54877 -167660 -71837 -239268 -335307 179554
19218 145013 108278 -135139 41530 -225732 -270487 -217275 101529 -68618 189002 -194393
19207e3728A7120c50636N4816P6665f0922D70659a4587D043a71339C1418g8634
19195a33767H8029c31792A50838J7213g5138C06760d64248a66643O4525J8257
19185h3861n5146K1200j7941N7089j17161A0179a4447H982J927d22097a58779
19173a7732h179C17104a8736l780A11661b64920r0976l3474A5256c09289h4997
19161F1485a35309r3935d2131J4279j25191O8467K3228D4147c60927A13343d6458
19149b30403J01712j3569r018g5532A7049M2689b34115k29808A73236q1992b49024
19137e7167o0298C78915a10670A36855a15339j18273A41580h0804B18777c59997
19126h4451n6234j66736o2670f4358D0597a93989E0684a77082A49503J52395j05943
$$ plain form
19207 -53728 17120 -350636 -295820 -219155 -60922 470659 -14587 4043 -171339 31418 -78634
19195 -133767 88029 -331792 150838 168051 -75138 306760 -464248 -166643 -102118 -83861
19185 -83861 -139007 -117807 -135748 -78659 -195820 10179 -14447 8982 10909 -422097 -158779
19173 -17732 -8179 317104 -18736 -22516 111661 -264920 -355896 -389370 15256 -309289 -84997
19161 61485 -135309 -229244 -42131 -27852 -153043 -84576 -61348 44147 -360927 113343 -46458
19149 -230403 -128691 -142260 -151278 -75532 17049 59738 -234115 -463923 173236 91244 -249024
19137 -57167 -117465 378915 -110670 136855 -115339 -233612 141580 -80804 218777 -359997
19126 -84451 -140685 -307421 -370091 -64358 40597 -193989 50684 -177082 149503 301898 195955
19115A95955r5914b990A02798a87168e567B2298f3550k24935h9411o7177c4657
19103a1601F0906a34866F1758L15840c82218g8084J7098B7253c72105A0854D2
19091c51333C10453c03940c7823p9927B57905c0203k04793Q0549A14903a02959
19080A19161b9647j58154A27383c0738B3137O7482b11563B30685n9007f3666A44127
19068f4607n3123N5573H2963a27279k1148M6147A00239D6336b08110n0482A07666
19056a48274A55707L113a60849r1567e2963A7223a65748r2458N2511L5708m6079
19045b16066e4187E5759a82674f237j32904m4488B787c34747J48366o9328F2198
19033c2116L128A13065M7007a2813A57340B1590c36172c3899C19397a55793D4792
$$ plain form
19115 195955 100041 -2990 102798 -187168 -5567 22298 -63550 -288485 -89411 -156588 -34657
19103 -11601 60906 -134866 61758 377598 -382218 -78084 -60986 27253 -372105 10854 42
19091 -351333 310453 -303940 -37823 -117750 257905 -30203 -234996 -154447 114903 -102959
19080 119161 -29647 -187801 127383 -30738 23137 90619 -211563 230685 171678 -63666 144127
19068 -64607 -117730 -62157 82963 -127279 -148427 -102280 100239 46336 -208110 -258592 107666
19056 -148274 155707 158820 -160849 -252416 -52963 17223 -165748 -258206 -205695 -169987 -216066
19045 -216066 -54187 55759 -182674 -6237 -139141 -183629 2787 -334747 -186381 -255709 62198
19033 -32116 -28988 113065 160072 -12813 157340 21590 -336172 -33899 319397 -155793 44792
19021b19810B06114E8241i0615j21496a0258j89710k8861A43148m9391m6480a28208
19009b51584J705d2794A78236n6900b6997A37705e3091A28940a32229N8608k21832
18998b95453A01971J38299C7188K4603c36565a51189P1995l36387J18514i7838
18987A80725b93755l4620J34339r3510H09h3155F7198d3115I393O7887e3669G2001
18974a39789f6092j01989C2894a17309F486K23631M9862j05892D9167K41205b59996
18962a12257h694j28426f5162A38245b71335A36856a24739D7353R7282C9461c2462
18950A98175a4292j18009J8074B9570N2341e4814A49294b7353l4649j15530A70363
18938b43939A09714a21909I2938i7675D4281o578c00994k1774f5962j20467A09111
$$ plain form
19021 -219810 206114 58241 -90615 -212111 -10258 -199968 -228829 143148 93757 47277 -128208
19009 -251584 -249879 -42794 178236 121336 -26997 137705 -53091 128940 -132229 -73621 -295453
18998 -295453 101971 240270 37188 61791 -336565 -151189 -79194 -415581 -297067 -97838
18987 180725 -293755 -328375 -194036 -287546 809 -83155 67198 -43115 9393 77280 -53669 72001
18974 -139789 -66092 -168081 32894 -117309 6486 230117 279979 174087 49167 290372 -259996
18962 -112257 -8694 -137120 -65162 138245 -271335 136856 -124739 47353 144635 39461 -32462
18950 198175 -14292 -132301 -114227 29570 81911 -54814 149294 -27353 -62002 -177532 170363
18938 -243939 109714 -121909 92938 -97675 44281 37703 -300994 -322768 -65962 -186429 109111
18926b11855B93014B030L194K63880A17631a25142j28965P4664A07232a40209
18915b46442b0609A021O3397b26072B8030J5050a16100m7622A71117G7031d888
18903A70945k9263L05468D3693c27069A53229c1496r251j12612B6002c24104a54700
18891A75384a95821B0278i9952H0813K6270Q0651p5471d0480A15473g9850j30769
18880b10619p5437O7053e0912r7706j0875d1183k12589j05995B3166c4692p8129
18869a12821e4772k20668J37694n7709h4497A25269b10251J5445q2412l29255
18859f06473e1689k01122a11405N4028j89716k0106A35409B2495b12036m334J5820
18848b00550C9876e478A50164R7381a30819d8372j85437b86k66793g6245j72275
$$ plain form
18926 -211855 293014 2030 5224 269104 117631 -125142 -254107 -179443 107232 -140209
18915 -246442 -20609 1021 64418 -226072 28030 43080 -116100 -163722 171117 77031 -4888
18903 170945 141682 447150 43693 -327069 153229 -31496 -40747 -153359 26002 -324104 -154700
18891 175384 -195821 20278 -99952 80813 107083 187734 112263 -40480 115473 -79850 -210619
18880 -210619 -286056 -219003 -50912 -148618 -159493 -41183 -253772 -359767 23166 -34692 -112821
18869 -112821 -54772 -275440 -137746 -195455 -84497 125269 -210251 -194806 -277218 -606473
18859 -606473 -51689 -252811 -111405 -57377 -247093 -267199 135409 22495 -212036 -216370 -200550
18848 -200550 39876 -5478 150164 247545 -130819 -48372 -233809 -286 -267079 -76245 -248520
18837b48520c4690j3930k76229O0631j2703J19137A36340d22455C3107h8368A62132
18825I1553J02660B1094J05437b8341j80275A04557K10819c06791C499e1789m6686
18814i8475B50757c15311f9429C09293N9713G6152a72446B45492C9052a23056
18803h0109j41606g7438p6515N2700j47540A45784f0384A18854b90401a3137C04353
18791c49j97666j45060k91889B14186G4318c02866g5057B31944F0618a08196A12890
18779b19457j11375N0214A21273i0293B01790n8218k7216f9656l34204R6091J41089
18768a66680J9871J5085a9844R779k9286j1446P883l5155H1371a20114L8661B44644
18755B55153K1274a39424B474a50161A1946b13405b9209I1747B995a99592a2579
$$ plain form
18837 -248520 -34690 -48620 -324849 -264218 -276921 -157784 136340 -422455 33107 -88368 162132
18825 91553 194213 21094 126531 -28341 -208616 104557 315376 -306791 3499 -51789 -98475
18814 -98475 250757 -315311 -69429 309293 369006 76152 -172446 245492 39052 -123056
18803 -80109 -221715 -77438 -153953 -101253 -248793 145784 -60384 118854 -290401 -13137 304353
18791 -349 -198015 -343075 -634964 214186 74318 -302866 -75057 231944 60618 -108196 112890
18779 -219457 -330832 -280618 121273 -90293 201790 143572 116356 -69656 -403860 -307769 -166680
18768 -166680 -146809 -131724 -19844 -10065 -39351 -50797 -42914 -78069 81371 -120114 -81453 244644
18755 255153 276427 -139424 2474 -150161 11946 -213405 -29209 91747 2995 -199592 -12579
18743b97241A75910a69851k3942A76409e4351B180c36112P2635d2184q2844j37902
18732b62930B8470a32647o2336j50315A48995k9263b3557k85357G1326j7167a36259
18720A45172b63301F0721O6442d8821a403j90158r1584L3414j9989A34833e8156
18708B69023g441D77081b29807P5842g3610l1244A31533B0055a593j43357l4387
18697a79337A24797b69190f9311j38342O5079B12478c70491f0842K5915C29346
18686a85538B81500G8003C4595a98313j10938J46380j1270O8653A99971H7274
18675a63119l9769l9769C19463b16493B24941A9055a66533A07041b87299A66485
18664A38386a49983l9914e0358o9790c6787a1573A51989B6325a1400B03989D8820
$$ plain form
18743 -297241 175910 -169851 -193793 176409 -54351 2180 -336112 -263477 -42184 -125028 -262930
18732 -262930 28470 -132647 -194983 -345298 148995 119732 -23557 -308914 71326 54159 -136259
18720 145172 -263301 60721 127163 -48821 -1403 -191561 -283145 -249731 -269720 134833 -58156
18708 269023 -7441 477081 -229807 -153965 -73610 -104854 131533 20055 -1593 -144950 -179337
18697 -179337 124797 -269190 -69311 -207653 -142574 212478 -370491 -60842 -34927 329346
18686 -185538 281500 78003 34595 -198313 -309251 -162871 -174141 -105488 199971 87274
18675 -163119 -202888 -242657 319463 -216493 224941 19055 -166533 107041 -287299 166485
18664 138386 -149983 -189897 -50358 -120148 -36787 -11573 151989 26325 -11400 203989 48820
18652A22538a50208I0549a39785A84433c5025A91618b28466i611H4340c9482A49419
18640C91233c38145h5175k8963j2071j77028a14960L5140o9526L0131F3172a73589
18628B69153a37404a0964B31779h6825A15043i8421j16197l5570M4037A67928
18617B15352a05707d8661r1938K2472b0500G9835d7771l94453B01989D0353r008
18606C1345a80744A68185h7871A86887O8826C6988J58727k4030h5406K7572m3986
18595a01820d2422D4191c54310Q3084J16215B5864b38710A90135b9660A01304
18584b26383A99440g2242e072l690j77106M101A3003J84565c3748l17377a2562
18572a36283A52605I296a87821B67938a26749H7545f8491n5700H6894a02531F8142
$$ plain form
18652 122538 -150208 90549 -139785 184433 -35025 191618 -228466 -9611 84340 -39482 149419
18640 391233 -338145 -85175 -114138 -126209 -303237 -114960 -79820 -149346 -119215 63172 -173589
18628 269153 -137404 -10964 231779 -86825 115043 -98421 -214618 -250188 -206151 167928
18617 215352 -105707 -48661 -140599 -118127 -20500 79835 -47771 -442224 201989 40353 31345
18606 31345 -180744 168185 -87871 186887 255713 36988 195715 171685 -85406 -57834 -101820
18595 -101820 -42422 44191 -354310 -271226 -155011 25864 -238710 190135 -29660 101304
18584 -226383 199440 -72242 -5072 -8762 -185868 -181767 13003 197568 -33748 -351125 -12562
18572 -136283 152605 9296 -187821 267938 -126749 87545 -68491 -124191 86894 -102531 68142
18560A23664N7768a3746j03527H5058C5066K0790e6785O438b3621r8469K1457
18549a00633B39659e9461q6834D3376b39979Q5347I8635b5547d310n1150E0403
18537d22205J38893A25630c33328I1300d0125j49654j42534b081j03854j33073
18527b39008p1211A1964d21297A68275K9387p5461a72551F4499J8287a49970A1305
18515I1720i4152J3478k84430A43292B5641c6493r915r3901D30465p487E0716
18503b39958B7210c15838J50237j57739J42311P9828k50025B86879b86151J09365
18493a76786j55750d786j21533C46252D9284b88397a10602A64410f9831p4038
18483a43869k51068I6254b60290b6711k62419I8570c8661a9046a097G2521J17009
$$ plain form
18560 123664 181432 -13746 -117273 85058 35066 55856 -56785 -50347 -23621 -122090 -100633
18549 -100633 239659 -59461 -146295 43376 -239979 -154632 98635 -25547 -4310 -55460 50403
18537 -422205 -283312 125630 -333328 91300 -40125 -189779 -332313 -2081 -105935 -239008
18527 -239008 -310219 11964 -421297 168275 197662 122201 -172551 64499 82786 -149970 11305
18515 91720 -94152 -80674 -365104 143292 25641 -36493 -46408 -140309 430465 422978 50716
18503 -239958 27210 -315838 -165601 -323340 -181029 -101201 -351226 286879 -286151 -176786
18493 -176786 -332536 -4786 -126319 346252 49284 -288397 -110602 164410 -69831 -143869
18483 -143869 -394937 96254 -260290 -26711 -289130 98570 -38661 -19046 -1097 72521 189530
18472A89530a9052j15546e1462D530K3096R8607J88549b42785C9527J36944h1812
18460B24Q5853a72649I7266M4489A044a79313b5888C02687d5874j01775j57877
18449c05526a034j0370n4341J9828l0354q3173M4973C023K30524g0484A18513
18437A20222b50767A54423g4422J2069A79819b00438b7336B44214D8824b27509
18426A27380b66230o1667A06136K3136f5588A35883a89317E2737g4408c2649j25267
18415a57916g2278A57175J33177i2227k4195H9076a47338A28203n207F0225J11509
18404A71734c5636q8462C15180a53843B79068c28568e1067A37502b9446k3267
18394e2713M285j01035j0574k9801f2126A24728b06948j51306E3525J59128q0574
$$ plain form
18472 189530 -19052 -134598 -51462 4530 27626 126233 314782 -242785 39527 176471 -81812
18460 224 86077 -172649 97266 141755 1044 -179313 -25888 302687 -45874 -147649 -305526
18449 -305526 -1034 -11404 -65745 -45917 -76271 -159444 -114471 3023 233547 -70484 118513
18437 120222 -250767 154423 -74422 -62353 179819 -200438 -27336 244214 48824 -227509
18426 127380 -266230 -327897 106136 129272 -65588 135883 -189317 52737 -74408 -32649 -157916
18415 -157916 -72278 157175 290352 -92227 -116422 89076 -147338 128203 122996 60225 171734
18404 171734 -35636 -124098 315180 -153843 279068 -328568 -51067 137502 -29446 -52713
18394 -52713 -48428 -149463 -160037 -189838 -62126 124728 -206948 -358254 53525 212653 132079
18383A32079e8540I3786L32812b0578A231K08999m4589D6900K8866J30905h4971
18371A37112A7650a94041F6835C2905a30293A72103a39995A94482K21396H2015
18360b19625A81862b6775A1149b56127A5704J07848a99462D9996d1383r337c96
18348A26673i9764n3305d5957j07713j91397a10460o8b8304N017r9454q4638R1423
18336a15956j5489D14396A48040G0423b14122a7175A6627f6498C9997R5669n8779
18325G6887c2545j91689e7062H3505C3455h5925M1377A07248i1652A98234e4402
18313a99138B70642M862b73104f788a727A13518D509K20813C8138a97607B21274
18301B60117P7317B2984J06269J01712C2624Q5916b53053B18565E8401J78944
$$ plain form
18383 132079 -58540 93786 426598 -20578 1231 210230 165641 46900 75766 206671 -84971
18371 137112 17650 -194041 66835 32905 -130293 172103 -139995 194482 415878 82015
18360 -219625 181862 -26775 11149 -256127 15704 123552 -199462 49996 -41383 -50720 -396
18348 126673 -99764 -153069 -45957 -153670 -345067 -110460 -110528 -28304 -23287 -122741 -207379 -115956
18336 -115956 -131445 414396 148040 70423 -214122 -17175 16627 -66498 39997 135666 76887
18325 76887 -32545 -224234 -57062 83505 33455 -85925 -44548 107248 -91652 198234 -54402
18313 -199138 270642 275504 -273104 -6788 -1727 113518 4509 225322 38138 -197607 221274
18301 260117 337434 22984 129253 230965 32624 118540 -253053 218565 58401 237345
18291B37345a44155a8118B66298B7246b71098b1156o8181k68304C61142a45523
18280B06143b9326B5078a34696A30067h3882J3517A6144J9896i8785F7278c05467
18268h6555j58125d3187C5076J21187D3399L3671C5711c59724d6548I2595P9616
18257A72211a47721j2236I2688e2060k7991g78G8918N5061d1556B41676E3379
18245a28585i002G1048c24513I9834f0112A80803c18210D8626c65009D7712f2098
18233H0252a7308H7058b69918o5513O6496C27798a74233b2537j4023C6809K9263
18222F6072N8896b24655h8813k76731c4450B13874E8322g1556A1018a19606b3249
18210d2330p5530D0923a63092j73171J61347j32146D4391B693a99058R3586A26166
$$ plain form
18291 237345 -144155 -18118 266298 27246 -271098 -21156 -89337 -357641 361142 -145523
18280 206143 -29326 25078 -134696 130067 -83882 -70365 16144 36040 -98785 67278 -305467
18268 -86555 -244680 -43187 35076 156263 43399 77070 35711 -359724 -46548 92595 172211
18257 172211 -147721 -159957 92688 -52060 -80051 -778 78918 133979 -41556 241676 53379
18245 -128585 -9002 71048 -324513 99834 -60112 180803 -318210 48626 -365009 47712 -62098
18233 80252 -17308 87058 -269918 -335431 -268935 327798 -174233 -22537 -36560 36809 66072
18222 66072 124968 -224655 -88813 -365544 -34450 213874 58322 -71556 11018 -119606 -23249
18210 -42330 -117860 40923 -163092 -336263 -174916 -307062 44391 2693 -199058 -105472 126166
18198A64676C1398b58229O5910A11698J62305i8o2675j74743A35650B1330J44591
18187A65921P0957J06381j71584R8456g2377j69166a3159k0989D2217a05172D2294
18175A25862B2849c09940j31012H3213R9027e14492e2533A8825c97685B17654
18164a44659O9319A8293J438N42601B51899c57940A73012R8373G1748l3311J89846
18153B28283b57367a03722d1211B776L9865J96722a05816q9387A58174F6804A3298
18141b15836B04836a08760e0345a8323A17609L3550a32571J9176G8383c8969j90568
18130b29537D4538b36349l17278f9216j01040b614A07005a93425f881B0848d7385
18118B79680A7118a38084a0127C4524K21815A620a36635A21270a29969K1219A17932
$$ plain form
18198 164676 31398 -258229 -192319 111698 274003 -98 -62773 -237516 135650 21330 165921
18187 165921 236878 343259 171675 270131 -72377 -241543 -13159 -34148 42217 -105172 42294
18175 125862 22849 -309940 -440952 83213 182240 -514492 -52533 18825 -397685 217654
18164 -144659 -75340 18293 19731 562332 251899 -357940 173012 271385 71748 38437 228283
18153 228283 -257367 -103722 -41211 2776 42641 239363 -105816 -195203 158174 66804 13298
18141 -215836 204836 -108760 -50345 -18323 117609 151159 -132571 -113395 78383 -38969 -229537
18130 -229537 44538 -236349 -553627 -69216 -170256 -2614 107005 -193425 -6881 20848 -47385
18118 279680 17118 -138084 -10127 34524 256339 1620 -136635 121270 -129969 -108750 117932
18106b60454H5832j0517e331j63815M3747d1418l16409q6764B96917p3482a50832
18094a22785A1454a6763n8973B23582p1737i7534b730j71165c6610B9814K66607
18083B96421a08100j50088C70790A34924e0563l54427B18823N3745r5811A2234
18072I2094k0947L8308P4477a76044o9242a00745j31107C75109b17584B06104
18061A97278a49979j65748G6356b58102A55335D1011c36493f8219k9589F1557
18050i607k13363b2511A0388K89815j27078a8749j32012g1914j39886d9847m9782
18039i9629C31807I0117e33805B57614I2208d44923B09728E3319J35218c14910
18028e1445n7964A45224j784c3062J1877H0531b99253A69578C9431K0262h63j00940
$$ plain form
18106 -260454 85832 75315 -5331 -169146 -125399 -41418 -357827 -444591 296917 223435 -150832
18094 -122785 11454 -16763 -75736 223582 151845 -97534 -2730 -173895 -36610 29814 296421
18083 296421 -108100 -258188 370790 134924 -50563 -404990 218823 272568 176757 12234
18072 92094 71147 109455 183932 -176044 -245286 -100745 -231852 375109 -217584 206104
18061 197278 -149979 -315727 76356 -258102 155335 41011 -336493 -68219 -97808 61557
18050 -9607 -222970 -22511 10388 300203 173125 -18749 -150761 -71914 -211800 -49847 -99629
18039 -99629 331807 90117 -533805 257614 92208 -444923 209728 53319 188537 -314910
18028 -51445 -109409 145224 143440 -33062 -21185 80531 -299253 169578 39431 59693 -863 -101803
18016a01803I6326e7707B27118G8737d92840A4396K72232d69299B34199K2415
18006B56614H8785i5113P280j3868F5034d7937B35815k338a04922A4204J26050
17995A40254R0415a64682o9736d0786B38382A7219a75210D1758a90165a5250A46128
17983C20047I9009r007O0249C9149a09697B1433a36326M6388g391j47244D3771
17971b70973R6999E2178a18870p654D0608P2691c7760C451a78161L3565A98128
17959B89071A03645l8608c1624B659a11957d477B19968e8616A29393E3766b14732
17947c17900B341a39333F9372d5198j75165B07737E3414f4713A42659a08391F8536
17935a08643G1060P8502i0895F2868J17807a47613c0636l04739A26735b39119
$$ plain form
18016 -101803 96326 -57707 227118 78737 -492840 14396 286628 -469299 234199 256614
18006 256614 88785 -95113 -87833 -101701 65034 -47937 235815 233477 -104922 14204 140254
17995 140254 230669 -164682 -234418 -40786 238382 17219 -175210 41758 -190165 -15250 146128
17983 320047 99009 90002 150251 39149 -109697 21433 -136326 -89938 -7391 -154635 43771
17971 -270973 -173974 52178 -118870 -126524 40608 113299 -37760 3451 -178161 -144596 198128
17959 289071 103645 65037 -31624 2659 -111957 -4477 219968 -58616 129393 53766 -214732
17947 -317900 2341 -139333 69372 -45198 -220363 207737 53414 -64713 142659 -108391 68536
17935 -108643 71060 149562 -90895 62868 180675 -147613 -30636 -335375 126735 -239119
17924C3108J58482g7623B49601j03275C9091a62424a246n6825l37542a57589o7026
17913b24615J04333I5440a17644A06888k5231A5182K15712q0578B8844h4364c1311
17901A78524J0376E1110b57996R3979e2534A86735a13277o324B08456f3002A84754
17889A44839a60275e5004H6660L209a65297D7894A0559J0613a94018L9922M9179
17878a04917M5219p0749K0960j10863e6471c823C02078g9406c9438k73412F953
17866a555C6737c65065h4606j24168A87505r774B0841K63499b16870A6678C107
17854A9738L2500c1828A64521a27452I2724a00591B52866b43326i1557b7951n8162
17843h6113D5743b118j337G8349J22821a70310C7737K17649E3646J89999f5675
$$ plain form
17924 33108 191590 -77623 249601 146326 39091 -162424 -1246 -58071 -395613 -157589 -224615
17913 -224615 -120282 95440 -117644 106888 81657 15182 230894 150316 28844 -84364 -31311
17901 178524 188900 51110 -257996 -164017 -52534 186735 -113277 -119601 208456 -63002 184754
17889 144839 -160275 -55004 86660 89869 -165297 47894 10559 21172 -194018 -154096 -104917
17878 -104917 -59698 -130447 -109487 -220350 -56471 -3823 302078 -79406 -39438 -312850 6953
17866 -1555 36737 -365065 -84606 -208774 187505 177731 20841 284340 -216870 16678 3107
17854 19738 52238 -31828 164521 -127452 92724 -100591 252866 -243326 -91557 -27951 -86113
17843 -86113 45743 -2118 -3455 78349 201170 -170310 37737 255386 53646 243645 -65675
17831C4333c1548A43609n2809f0253D5157N160a54923e552H0518A8703N7390J81417
17819B57510a00483k18824J17360P2403A53171b27867A60189b8678B68426a34556
17808h5911b4707D2409J66821I9796j4486J69735j25680a3067A74964o2404a157
17796A41958a1644j57492O7349N0199k1052I8325L3550b45o350A93895a20877
17784b53263B15309a13764L8604c2586c364B39811h4833B0812a54157B49404E1908
17772B71822b12595C5877a39960A01083a56687A61530a50559k83312A2359K09448
17762B21807E4464J14776f3835A19724C282M6798f4678A26057J08743A03627K7067
17751A30694e9130A93157e7356D7425J76613k17a52716N9560I3491a33513f803
$$ plain form
17831 34333 -31548 143609 90800 -60253 45157 50317 -154923 -5552 80518 18703 76093 257510
17819 257510 -100483 -319307 -201947 -129544 153171 -227867 160189 -28678 268426 -134556
17808 -85911 -24707 42409 209230 99796 85310 255045 129365 -13067 174964 112560 -1157
17796 141958 -11644 -169136 -101787 -51588 -72640 98325 131875 -245 -6595 193895 -120877
17784 -253263 215309 -113764 -75160 -32586 -3364 239811 -84833 20812 -154157 249404 51908
17772 271822 -212595 35877 -139960 101083 -156687 161530 -150559 -433871 12359 221807
17762 221807 54464 169240 -63835 119724 3282 50080 -64678 126057 234800 103627 130694
17751 130694 -59130 193157 -57356 47425 224038 223821 -152716 -93156 93491 -133513 -6803
17739b63946B73938n5023j00497K21339a53456j4226B67485a51461p6157A3492
17728H5011a22219p8404R1857A39249n1234J6853g6636A80011b293j70626A00490
17716b32717j60898H4311b70482A97891i2148A89149j349J45726A26606d76198
17705B53798E8203b4520C54679A29924d3275D35120e5132o6907A35032a35458
17694D6787O2033h2386A09633G116N1572L57673H0496J29195j6818e0582j75521
17683b26103C09949G4668a97659F5177M515M7170E5927K36763B4905N0244M6321
17672A21470J94505H7870h9839J5329C16086O5401j27830e0943k7830k57102b9478
17660C583K35643G2195R0023f7798B40850A901M0386K82608j16090A4869L89621
$$ plain form
17739 -263946 273938 218915 118418 339757 -153456 -167682 267485 -151461 -227618 13492
17728 85011 -122219 -200623 -108766 139249 88015 104868 -76636 180011 -2293 -172919 100490
17716 -232717 -393615 84311 -270482 197891 -92148 189149 187800 333526 126606 -476198
17705 253798 58203 -24520 354679 129924 -43275 435120 -55132 -122039 135032 -135458
17694 46787 108820 -82386 109633 7116 58688 416361 80496 209691 192873 -50582 -226103
17683 -226103 309949 74668 -197659 65177 69692 116862 55927 292690 24905 75149 121470
17672 121470 315975 87870 -89839 -74510 316086 381487 253657 -50943 -78773 -335875 -29478
17660 3583 239226 72195 162218 -67798 240850 1901 42287 324895 208805 14869 404490
17649D04490A46426Q5047l104l4805a17281C40290l2329n0271b82337q9424A85942
17637B32042H7349f4983A95547q6826D5434L11355a30941K4592B29815a76367
17626G7988h3664I9363i13F9883J62832n0096a4491C10614R2489k6828j2092A64299
17613B5600K76884L1323K2224g5427H8010M6732q110O8230D8825b9581k50389
17602b79970A54794J23354b7222D9939N9195e6213G4667J45004n7384E1797L2726
17591H4523c84372I0099e6333A6462K90659j45567b637k11719R4122B21278n9781
17580A61497F0337k4436K27512p9702e8586b3077j09243D1985a07785D06065n6595
17569C49470j30246o5212b17346c5865D27316A75753P9588J12045A81576a29060
$$ plain form
17649 404490 146426 231473 228369 193564 -117281 340290 307961 257690 -282337 -371761 185942
17637 232042 87349 -64983 195547 108721 45434 356789 -130941 -106349 229815 -176367
17626 77988 -83664 99363 -913 69883 232715 182619 -14491 310614 403103 376275 364183 164299
17613 25600 302484 333807 356031 -75427 88010 134742 126632 194862 48825 -29581 -279970
17602 -279970 154794 278148 -27222 49939 109134 -56213 74667 219671 162287 51797 84523
17591 84523 -384372 90099 -56333 16462 307121 161554 -2637 -214356 -120234 221278 161497
17580 161497 60337 35901 263413 183711 -58586 -23077 -132320 41985 -107785 406065 349470
17569 349470 219224 154012 -217346 -35865 427316 175753 255341 367386 181576 -129060
17558c8997B15799K79401j93369i266A32734J28252r2882L20260d2309A52898
17547d6302A44625J46767h141A54569k231J12754I1364O5396d8205I4181N5293
17536A49474n1884J6189b566H4702J90092J12130j06555J93502k21756A15422
17525A18678m136J43634P262J87704j41394J58337A69240R112L87947r8093j83149
17514B85057G8171J75079J25887J60436A91327p9414J64900O68719C69833J20377
17504D90210J83563B10789K85023j82318q0805a24028B70800c2094C34116K7490
17494C61606h5453C08765f8099A76392G3964J18499b47391a20535B85226a77429
17483A71763b58209A82678l8420E4910M3285a08302o3870L5395A98335p9250O5109
$$ plain form
17558 -38997 215799 495200 301831 -9266 132734 260986 168104 488364 -42309 152898
17547 -46302 144625 291392 -8141 154569 152338 265092 91364 156760 -48205 94181 149474
17536 149474 97590 113779 -2566 84702 274794 386924 280369 473871 252115 115422
17525 118678 114542 258176 265438 453142 311748 470085 169240 178352 566299 468206 285057
17514 285057 78171 253250 379137 539573 191327 111913 276813 945532 369833 490210
17504 490210 673773 210789 495812 313494 232689 -124028 270800 -32094 334116 361606
17494 361606 -85453 308765 -68099 176392 73964 192463 -247391 -120535 285226 -177429
17483 171763 -258209 182678 144258 54910 98195 -108302 -172172 -136777 198335 119085 184194
17472A84194P893M9478J70542j74641d0891D45264A4201K02274b8273B55091A1191
17460D98793A80362b5302A45440c6932A78147K95660A68234E6257J19706K14243
17450C90206j86594B0007O0656O5556J37518n6571J26532A58768K38529j22641
17440B74656m2407q9829J30373B6509K34259j12065L4425D8089M16963D349M29390
17429D33739b27892A67506o3172L92459j88871A20049a79764B90278B7350L01324
17419C28674O3146A05896K85113J24159J05539A16453L05847n6662H0371J52298
17409B32669I5836L29488j7866m0842J21670k29746a9469D92686B3572p497h3524
17397A63918J66271h089B10495I6848a45110A51173A5678L66419m0667B4534J06874
$$ plain form
17472 184194 192087 241565 412107 237466 -40891 445264 14201 216475 -28273 255091 11191
17460 498793 180362 -25302 145440 -36932 178147 473807 168234 56257 175963 390206
17450 390206 203612 20007 80663 146219 283737 227166 353698 158768 397297 274656
17440 274656 232249 142420 272793 26509 260768 148703 183128 48089 465052 4349 433739
17429 433739 -227892 167506 104334 496793 307922 120049 -179764 290278 27350 328674
17419 328674 391820 105896 391009 515168 620707 116453 422300 365638 80371 232669
17409 232669 95836 425324 407458 366616 488286 258540 -19469 492686 23572 16075 -83524
17397 163918 330189 -8089 210495 96848 -145110 151173 15678 382097 341430 24534 131408
17386A31408K1881J48179J0452a62297B98658j32740J04124L5076J52691B4815
17375I2992K44255N189A69185J50947J99052k47137J27195Q1313G5742a37899
17364A98868p2973K76119A39037J78769b831A45142M48547k69406I7274L80058
17354D77332c0823A07326a3244C48006j45055o3519L3606J49040J14426k04186
17344B32318H1611J0032K67489A26707l150E2041g3129A81017Q2598J23032j36712
17333B49935a42059c3336D71345j43072o3910r0211n2152J70906B2247L60505
17323C82752j05608A03480P0289K16601j36225l8789J20256A17620K92272j81835
17313B28057G3632R169C5149O00979k98010A64426k7551J21097J44153j4984A33648
$$ plain form
17386 131408 153289 301468 311920 -162297 298658 165918 270042 305118 457809 24815
17375 92992 337247 342436 169185 320132 519184 272047 399242 480555 75742 -137899
17364 198868 125895 402014 139037 317806 -2831 145142 593689 324283 97274 477332
17354 477332 -30823 107326 -13244 348006 202951 139432 173038 322078 436504 232318
17344 232318 81611 91643 359132 126707 123557 52041 -73129 181017 263615 386647 249935
17333 249935 -142059 -33336 471345 328273 264363 174152 122000 292906 22247 382752
17323 382752 277144 103480 173769 390370 254145 215356 335612 117620 409892 228057
17313 228057 73632 82801 35149 636128 338118 164426 136875 257972 402125 387141 133648
17301B78670j16120J29561a41490E21217L2102A06850K62312j19232P5002o3485
17291B61447a5033E08084k39195K3720k8041C5406J45814J42605J03439g4935
17280C72846L4831e7197r0100E1272a9356B75004J47766J53855k41787o9388Q370
17269B73820n1514K74212A8539J37943a75216A99002b3284j38553B08031N7404
17259B65435L12345B06432R7323k0351j18398O7458K61301A62189M2326B1179
17248H770K66850o2799K13972j85437g5181E75436k35647J46804K6737B14882
17237B63653J27592J37703j73223R3484C1261K60959M42Q9727J43217j72259j16466
17226B36881h7130D37194j00848j36494G4947K38571j17804K10580M2930A95422
$$ plain form
17301 278670 162550 292111 -141490 521217 553319 106850 369162 249930 324932 261447
17291 261447 -15033 508084 268889 292609 264568 35406 181220 323825 427264 -74935
17280 372846 407677 -57197 -147297 51272 -19356 275004 422770 576625 334838 265450 273820
17269 273820 222306 496518 18539 156482 -175216 199002 -23284 -161837 208031 265435
17259 265435 577780 206432 303755 283404 165006 232464 493765 162189 204515 21179
17248 8770 275620 212821 426793 241356 -75181 575436 339789 486593 513330 214882
17237 263653 391245 528948 355725 449209 31261 292220 292662 382389 525606 353347 236881
17226 236881 -87130 437194 336346 199852 74947 313518 195714 406294 449224 195422
17215A97726K08428N4454O601l8277N5364p8395j10691j2175L1005K54561A56188
17203B82332a0503C11546J63269j41346j2586J69893B25534P3231K45304k472
17193E41597k09470R1300J48217q4318j90363K56184j92571K27214B48690J57126
17183D05816p1914M1291r7671L90122k92763j29771J32463H8557k6283P27437
17173G89711B11504L20434o8430O7414B56252L09695g50C43719J87669p664K5962
17162E49686k35086j46180L84515B09920J24185J13405j29445R7917L23689C59286
17151C71151j40667J28889K01768k57169K91057K5884q7554k51340K98561j45685
17141D34895N3390J0466N8803j32853j77971l6011K95938J6373j48874o6602O06695
$$ plain form
17215 197726 406154 460608 467209 428932 484296 405901 295210 283035 314040 568601 156188
17203 282332 -10503 311546 474815 333469 320883 490776 225534 298765 544069 541597
17193 541597 332127 423427 571644 487326 296963 553147 360576 587790 248690 405816
17183 405816 333902 375193 277522 667644 374881 245110 377573 88557 62274 789711
17173 789711 211504 531938 463508 530922 256252 565947 -750 343719 531388 523724 549686
17162 549686 314600 168420 552935 209920 334105 447510 318065 415982 739671 359286
17151 371151 230484 359373 561141 303972 595029 620913 533359 282019 580580 434895
17141 434895 488285 498751 557554 424701 246730 210719 506657 523030 374156 307554 914249
17130I14249A98730M63684k2288L5316C25130M66582C14842K9679J99653m0817
17120E03357o2527J01150j88550N29659C39278m799q1719K30153J79204r5819
17110E66298o8398K7379K27146C27274K41567j23803J34346K8557K88596B92968
17099D29182K4845L6457L24850k21410j80920L94108l8923P7502k62208L9067
17089F22550j50997A95839L61773J00032J36107j33686J939M8532k89030N29037
17079I50543D31063L01368l16588K44861j24379M23242k99668K69719k23281Q6385
17069G92722j71433k67656L61610Q2098j17501K32317l46666K22175J28613k86167
17059F30112K78463k12630J26416D01679L44197J77937j0906n5937J9525M4199
$$ plain form
17130 914249 198730 662414 640126 675442 325130 791712 314842 344521 544174 503357
17120 503357 440830 541980 353430 883089 339278 334479 252760 482913 662117 566298
17110 566298 497900 525279 752425 327274 568841 445038 579384 607941 896537 292968
17099 429182 454027 490484 815334 593924 413004 807112 768189 845691 583483 622550
17089 622550 471553 195839 557612 657644 793751 660065 662004 710536 421506 950543
17079 950543 431063 732431 415843 660704 536325 959567 659899 929618 706337 792722
17069 792722 621289 353633 715243 797341 679840 912157 565491 787666 916279 630112
17059 630112 908575 695945 822361 401679 745876 923813 912907 856970 876495 920694
17049I20694M0937k06810K6898K52421m5327j68243n2216P9803Q6442K3037j92925
17038G64711J31137N2941R4457R8920m36375L49726j70200q307j14211K02439
17028I65238J51466m8139J77288m37471N3076m6346L86810m4516j18168K42230
17018A281468m9115P9209E53287L76938j85986L45256L6427J16460k31105p6412
17008I34865J63253R5699J11020l06137l8923L36459l99314K21931k71155K08762
16998A056460L84840l01904L64013l49538k0871j27952L35172O2041l38569J07842
16988A171534j22549L30121k35202J18073M0299O04465o76744J34322l51817J78081
16978A190583J96574K21614l20094M4392k20646P47270k37499k94165Q6294j8068
$$ plain form
17049 920694 961631 754821 781719 1034140 988813 820570 768354 848157 934599 957636 764711
17038 764711 895848 948789 1043246 1142166 705791 1055517 885317 877010 762799 965238
17028 965238 1116704 1068565 1245853 808382 861458 815112 1201922 1157406 1039238 1281468
17018 1281468 1232353 1311562 553287 930225 744239 1089495 1125922 1242382 1011277 934865
17008 934865 1098118 1193817 1304837 998700 959777 1296236 896922 1118853 847698 1056460
16998 1056460 1441300 1139396 1503409 1153871 1133000 1005048 1340220 1402261 1063692 1171534
16988 1171534 1048985 1379106 1143904 1261977 1302276 1906741 1229997 1364319 1012502 1190583
16978 1190583 1387157 1608771 1288677 1333069 1112423 1859693 1622194 1328029 1414323 1396255
16968A396255k12116J59806K91835P8460k59776L56222j25466n1685r2645l62953
16958A177937O19523J2288k5398j0464l21620J30971K49887p0167k13723J61571
16948A710805K85279k20339j08995N40137l27186k29311M07089k86638L95485
16939B166326k52400P3534o728J12500K27283k74815L51578k69924J52309n92343
16929A687320N78851n5402j80955N31141k55202k57178M11176k59032K86661R3030
16919B580410m969R2456r7856q6092K33782k24271K95566m00096K5925J60197
16909B575052J39274R5875o346J41009k67384L08645J3717n1591Q8236m6615n5914
16898B933958N78356j70118o1208r7492L69913M9894j80933L40683j68918L12631
$$ plain form
16968 1396255 1184139 1343945 1635780 1714240 1454464 1810686 1685220 1633535 1540890 1177937
16958 1177937 1797460 1809748 1784350 1773886 1452266 1583237 1833124 1762957 1549234 1710805
16948 1710805 1996084 1775745 1666750 2206887 1879701 1650390 2057479 1770841 2166326
16939 2166326 1913926 1987460 1980732 2093232 2320515 2045700 2397278 2127354 2279663 1687320
16929 1687320 2266171 2210769 2029814 2560955 2305753 2048575 2459751 2200719 2487380 2580410
16919 2580410 2575441 2667897 2570041 2483949 2717731 2493460 2789026 2388930 2414855 2575052
16909 2575052 2714326 2810201 2803855 2944864 2677480 2986125 2999842 2948251 3036487 2989872 2933958
16898 2933958 3512314 3342196 3280988 3183496 3553409 3603303 3422370 3763053 3594135 3906766
16888C906766q2272k98694J25984N7828M4605l26204M20869m6197Q6574J12899
16878D002158J59239l19421L77603L88578l20434j09790K53163K02931k20843
16869D413184r4321L63458J70496m36472M84548j36106K68626K44247l52082M72146
16859E397724J18071k79978M06322P1234J20022j08642K16444J20303o0906K91969
16849F292563L36608k05836M411N38236p0050j40660J81159J58084J47004O2408
16839G303927N7265L11135L37047M1417J60441k69684K86214N72989l83443P88342
16829I205650k65928K25973r3145O57851j95785O2068L42317K16395L88415L37195
16819A0881006L30873j05283L54176o9L36790K97652K52811N51228J91081J40510
$$ plain form
16888 3906766 3824494 3525800 3651784 3709612 3754217 3428013 3848882 3802685 3889259 4002158
16878 4002158 4161397 3841976 4219579 4608157 4287723 4177933 4431096 4634027 4413184
16869 4413184 4318863 4682321 4852817 4416345 4900893 4764787 5033413 5277660 4925578 5397724
16859 5397724 5515795 5235817 5642139 5713373 5833395 5724753 5941197 6061500 6000594 6292563
16849 6292563 6629171 6423335 6427746 6965982 6895932 6755272 6936431 7094515 7241519 7303927
16839 7303927 7361192 7672327 8009374 8050791 8211232 7941548 8227762 8800751 8417308 9205650
16829 9205650 8939722 9165695 9072550 9730401 9534616 9596684 9939001 10155396 10543811 10881006
16819 10881006 11211879 11106596 11460772 11460703 11797493 12095145 12347956 12899184 13090265 13230775
16809A3230775K87689K42340L09372O10817o9516K15153N76046J81419L47002
16800A5931097M28920O72059j50886Q73121L90639Q56181L27770K17604N94273
16791B0140778O73220O50548J63976J060933K67512P07216Q47993M93616M76148
16782B5481940O04438P93855P15244Q31903Q06582M60961R15947J371837R33663
16773C2916370J260800O72657J062114J071000Q58142J608669J211456J045597
16765D1706805J123313J422368J267104J786059J253216J376186J456019J810271
16757E3201341J483743J445992J881249J762598J454228K151874J577892J804728
16749F6763645J875005J935039K020684K016910J732243J631842J986209J883453
$$ plain form
16809 13230775 13518464 13760804 14070176 14680993 14611477 14826630 15402676 15584095 15931097
16800 15931097 16360017 17032076 16881190 17754311 18144950 19001131 19328901 19546505 20140778
16791 20140778 20813998 21464546 21628522 22689455 22956967 23664183 24512176 25005792 25481940
16782 25481940 26086378 26880233 27595477 28427380 29233962 29694923 30610870 31982707 32916370
16773 32916370 34177170 34849827 35911941 36982941 37841083 39449752 40661208 41706805
16765 41706805 42830118 44252486 45519590 47305649 48558865 49935051 51391070 53201341
16757 53201341 54685084 56131076 58012325 59774923 61229151 63381025 64958917 66763645
16749 66763645 68638650 70573689 72594373 74611283 76343526 77975368 79961577 81845030
16741H1845030J683863J842329J687871J435998J473326J271701J394092J083183
16733I3717393J010610Q87732J291579K67005O62401K7972J34750M2935m36118
16724I7606259j32333l13167j003211r17065q96804j307444j283070j286272j547327
16715H8919566j525783j854663j572559j356417k041560j849796k106125j691995
16707G4920668j940959j876800j666871k096347j514461j961748j459773j610263
16699F0793446k194154j585078j658905j457631j444897j706853j146183j622145
16691D7977600j393741j297378j283545j432127q32033j336794j559021q37327
16683C8005634j010697p62606r95136j342151n96771j051313n82781j109096p94108
$$ plain form
16741 81845030 83528893 85371222 87059093 88495091 89968417 91240118 92634210 93717393
16733 93717393 94728003 95615735 96907314 97174319 97836720 97864692 97999442 98042377 97606259
16724 97606259 97473926 97160759 96157548 95240483 94343679 93036235 91753165 90466893 88919566
16715 88919566 87393783 85539120 83966561 82610144 80568584 78718788 76612663 74920668
16707 74920668 72979709 71102909 69436038 67339691 65825230 63863482 62403709 60793446
16699 60793446 58599292 57014214 55355309 53897678 52452781 50745928 49599745 47977600
16691 47977600 46583859 45286481 44002936 42570809 41738776 40401982 38842961 38005634
16683 38005634 36994937 36232331 35237195 33895044 33298273 32246960 31664179 30555083 29760975
16674B9760975n92272q46018q96234p02211n43006l05323q17721q59791m65123
16665B3733276n30153n27007k10728j253097J94413r54923l45666k78790p04553
16656A9122772j14032p24270r0825k88604n16943n28347k92803j92049n12864
16647A5862035k11259o74596K83446p74602o0327j77517j87772l81814k83934
16638A3393660k54348R2419p95713P3485j57318l31093j04620l39991k53311j77331
16628A1145839j92955j03055l97193J60305k80750k36952K00157n86857l51523
16619I357016M20759m79397k14764J52340o62102M5316o8587l9065j52145j95953
16609H163418l12607K44330j49029K3103k06849N5650k06129k83962L922j6424
$$ plain form
16674 29760975 29168703 28322685 27426451 26724240 26181234 25875911 25058190 24198399 23733276
16665 23733276 23203123 22676116 22465388 21212291 21406704 20451781 20106115 19827325 19122772
16656 19122772 19008740 18284470 18193645 17905041 17388098 16859751 16566948 16374899 15862035
16647 15862035 15650776 14976180 15259626 14485024 14424697 14247180 14059408 13677594 13393660
16638 13393660 13139312 13231731 12436018 12509503 12352185 12021092 11916472 11576481 11323170 11145839
16628 11145839 10952884 10849829 10452636 10612941 10332191 10095239 10295396 9708539 9357016
16619 9357016 9777775 9298378 9083614 9235954 8573852 8619168 8550581 8511516 8359371 8163418
16609 8163418 7850811 8095141 7946112 7969215 7762366 7818016 7611887 7327925 7331847 7315423
16599G315423m74891M71537k72206k56296l2434l79599j85702J6675L35007O9700
16589F607214m8038m97720J54206j73758j20504k8806j73107p9090O8046j64254
16579E544189P5033r370j53711m5244k67752l259p7699j9921k82408J17054q40
16568D876072J47959K28454m10502l18020K42900J51645k54649l53866K06472
16559D516465k52545J29059k47220O3345j26244J01815r1024k17370K18663N8827
16549D153771j48262K11722Q279k66966j12972J12222n29653L82344J58098l87839
16539C580744K55390m64016O61021o63323J17773r0124J63647M525J08415n81600
16529C092452K42047K76962k57722p5872p9796J41522k85314Q5910Q6011k23954
$$ plain form
16599 7315423 6840532 7312069 7039863 6783567 6751133 6371534 6185832 6202507 6537514 6607214
16589 6607214 6559176 6061456 6215662 6041904 5921400 5892594 5719487 5640397 5708443 5544189
16579 5544189 5619222 5609852 5456141 5410897 5143145 5139886 5062187 5042266 4759858 4876912 4876072
16568 4876072 5024031 5252485 4841983 4523963 4766863 4918508 4663859 4309993 4516465
16559 4516465 4263920 4392979 4145759 4209104 4082860 4184675 4093651 3876281 4094944 4153771
16549 4153771 4005509 4217231 4225510 3958544 3845572 3957794 3428141 3810485 3968583 3580744
16539 3580744 3836134 3372118 4033139 3369816 3487589 3397465 3561112 3565637 3674052 3092452
16529 3092452 3334499 3611461 3353739 3277867 3198071 3339593 3054279 3140189 3226200 3002246
16519C002246N15220j52172m33808J2004p1164k22531J84439k51495K07817j7586
16509B772970J67109J46822j73655j77603l0581J01910J0079n8719j1568L48435
16499C095199o28233K78462J01201K597K9944l78363L47723n89602L21607k98523
16489B282012K08742J07137n14179L66899P0724N0329r7231m8347q4328j04989
16479B236769K36304J6085q049K37064n24024R7022l10167K61877p5213J57186
16469B324854j09864o7031p0083n6518M35888n74874L43477j23066q6158p9825
16459A936800m1922p2494O58362r27295L94502Q6392k51871K5378L19542J32176
16449B259570n35379K86001k55996o4955R2571q1778L74177L1432n84857L73273
$$ plain form
16519 3002246 3517466 3365294 2931486 2943490 2872326 2649795 2834234 2582739 2790556 2772970
16509 2772970 2940079 3086901 2913246 2735643 2705062 2806972 2817051 2758332 2746764 3095199
16499 3095199 2466966 2745428 2846629 2849226 2879170 2500807 2848530 2258928 2580535 2282012
16489 2282012 2490754 2597891 2083712 2450611 2521335 2571664 2474433 2426086 2341758 2236769
16479 2236769 2473073 2489158 2481109 2718173 2194149 2291171 1981004 2242881 2167668 2324854
16469 2324854 2214990 2147959 2077876 2021358 2457246 1882372 2225849 2102783 2016625 1936800
16459 1936800 1894878 1822384 2480746 1553451 1947953 2034345 1782474 1807852 2127394 2259570
16449 2259570 1724191 2010192 1754196 1689241 1781812 1700034 2074211 2105643 1520786 1894059
16439A894059j13068N3838R0870K14247j71246l0301j77284K0760j22006O2071
16429A721940N5016k97520K40395P9453k48417L58478j98354K51549k27535j2217
16419A722788q1419J8162k76991K95837O5381j70976K61434n13719K84377N9837
16409A664711n23061M07961l26418M78483l86342K05147J68138j21195N0017J34832
16399A752273l61576J47424j21373j36307L77339k50467n9262J67305j74683N2315
16389A392988j14262K55667K4531m69331M85010j01040r1955J00221k07467M3118
16379A317480j07603J83608j45379l5904K38511j66918R8523l7210k26724l1103
16369A087281L50444k43936K50484m9564j77513Q5796r3305j92547L47508l46069
$$ plain form
16439 1894059 1780991 1834829 1925699 2139946 1968700 1938399 1761115 1781875 1659869 1721940
16429 1721940 1776956 1479436 1719831 1799284 1550867 1909345 1710991 1962540 1735005 1722788
16419 1722788 1641369 1659531 1382540 1678377 1743758 1572782 1834216 1320497 1604874 1664711
16409 1664711 1141650 1549611 1223193 1701676 1315334 1520481 1688619 1567424 1617441 1752273
16399 1752273 1390697 1538121 1416748 1280441 1657780 1407313 1348051 1515356 1340673 1392988
16389 1392988 1278726 1534393 1558924 1089593 1574603 1473563 1381608 1481829 1274362 1317480
16379 1317480 1209877 1393485 1248106 1212202 1450713 1283795 1382318 1345108 1118384 1087281
16369 1087281 1437725 1193789 1444273 1394709 1217196 1302992 1209687 1017140 1364648 1018579
16359A018579L79415l69692K18389q2354j47253k919j31413K52899l720J7837
16349A149768p4774m5594J4410l0146o3535k1535K69972k56245q413K16656Q1324
16338A231888l7255K49445k363n76183L03236r4379q4315Q4221r7367J93738j96223
16327I74443k40158O668O55582m94757J66507k21279J01223q352K45964P8647
16317A264488j46237j01726K9629J6969k12576m900p5457R4350N15672m66248
16307I13964J50721K860k62953L4770J39737j83310L95095m07009L12817j10972
16297I85720J22098r4341J2608j31592K56208k33559J15739j44923J18233q2819
16287I23372k03813M7745k44902L18188j8968K78198k00051q7894m1877r1337
$$ plain form
16359 1018579 1397994 1028302 1246691 1164337 1017084 1014165 882752 1135651 1131931 1149768
16349 1149768 1074994 1029400 1043810 1013664 950129 928594 1198566 942321 933908 1150564 1231888
16338 1231888 1194633 1444078 1441715 865532 1168768 1074389 990074 1074295 976928 1170666 974443
16327 974443 734285 740953 1396535 901778 1068285 847006 948229 939877 1185841 1264488
16317 1264488 1118251 1016525 1046154 1063123 850547 845647 770190 864540 1380212 913964
16307 913964 1064685 1067545 804592 839362 979099 795789 1190884 783875 1096692 985720
16297 985720 1107818 1013477 1026085 894493 1150701 917142 1032881 887958 1006191 923372
16287 923372 719559 767304 522402 840590 821622 1099820 899769 811875 769998 678661
16277F78661K28517r7169j87200M6917L02682j36538k65648J1652O12319E24699
16266H05177J62350q4002J42789K02829n25461N6179q0503l6905J36514R7341
16256H76308l05089L68981k81789J1266K82519j38998K84097D84272K43699J2699
16246G40670J97242A78167N46253R6389q7896j08402P689J95960J21368l60602
16236E88926J52986P9405k73837K19984N7489j40371J21057j11531R6289k95306
16226D95091K39748N2726j77737J73112k85336L07961N9092l73318J19016J05310
16216G15665j8681l20091K85088J8175C14484L60395o5505o0507J95898J1178
16206G55943k41586p8572K80181J23837A03041L84974l531J22531j16509j44751
$$ plain form
16277 678661 907178 810009 622809 669726 972408 835870 570222 581874 1194193 524699
16266 805177 967527 883525 1026314 1229143 703682 759861 679358 642453 778967 876308
16256 876308 571219 940200 658411 669677 952196 813198 1097295 484272 727971 740670
16246 740670 937912 178167 724420 820809 732913 624511 632200 828160 949528 588926
16236 588926 741912 821317 547480 767464 824953 684582 805639 694108 790397 495091
16226 495091 734839 787565 609828 782940 497604 805565 864657 491339 610355 715665
16216 715665 696984 376893 661981 680156 314484 674879 609374 548867 744765 755943
16206 755943 514357 435785 715966 839803 103041 488015 484484 607015 490506 345755
16196C45755n0970K90791B50393L61867k1699K05516B33837J88631L7510j14865
16186C45113K68854j72084j79695L9182L43952j05355N0188j30274J34198j92223
16176D01856K04546A68670N98944l00163j14119K92665j00008r0792L10414B07105
16165C62185M33205B68935K27676k38767m9995J36572A72057j3629M52617H1181
16154B86744q8375r0976N43145j30043j94393L20864l8087n3564k20946K72542
16144F06911Q636M4612j64648j31055r9942J12062M17418G2714J92333r8173M13595
16133E80469A14115N34920k20486k09172K4549r6485M74185k16012A95507L74089
16123E69596k18993o2572L71314A77510P0791K3650j19275R5937q6892M64190
$$ plain form
16196 345755 294785 585576 250393 612260 590561 796077 233837 422468 459978 345113
16186 345113 613967 441883 262188 301370 645322 539967 590155 459881 594079 401856
16176 401856 606402 168670 767614 467451 353332 645997 545989 455197 765611 207105
16165 362185 795390 268935 496611 257844 207849 344421 172057 158428 611045 81181
16154 286744 198369 107393 650538 520495 326102 646966 608879 555315 334369 606911
16144 606911 615547 660159 495511 364456 264514 376576 793994 72714 265047 166874 580469
16133 580469 114115 649035 428549 219377 243926 147441 621626 405614 195507 569596
16123 569596 350603 288031 659345 177510 248301 271951 152676 248613 161721 625911
16113F25911C03671L1741A4878J82072L19639B08402J7351J42204A83077R4489
16103B77566K8520M8110j41889M5041J34025A82307J42084J21007Q4489A19817
16092g4420B20947p6025h286C99285p9199A48805M41685k48708j12690L48781
16082E77873j31650k10974I5011L06934c7311C55194A64077D860M09445j20343
16072B93962j26343J22590I6488Q6516L0000J2974a01988A36755K6262k5745J04519
16061B41791E1749h5889A21047B2679K05872K56371B07071r6659b0544A54318
16050C6688L42944N5344j63183K95052b21215A72034M4359M3439J25710j02982
16040B82560A2026N1857R7876J01381P5560J6258j04272g2678D14066I1696m81
$$ plain form
16113 625911 303671 335412 14878 196950 516589 208402 225753 367957 183077 277566
16103 277566 306086 354196 212307 257348 391373 182307 324391 445398 529887 119817
16092 -74420 220947 144922 -8286 399285 320086 148805 590490 341782 229092 577873
16082 577873 446223 235249 95011 401945 -37311 355194 164077 4860 414305 293962
16072 293962 167619 290209 96488 183004 213004 225978 -101988 136755 163017 137272 241791
16061 241791 51749 -85889 121047 22679 228551 484922 207071 110412 -20544 154318
16050 36688 379632 434976 271793 566845 -221215 172034 216393 259832 385542 282560
16040 282560 12026 63883 161759 263140 338700 354958 250686 -72678 414066 91696 91215
16029I1215K12142n0225q7196M29130k26071A41614J6436F0085K10344n528q3568
16018A81333J92972A21308L12573r9788C2894K03695d2971C19161a7744A32358
16007B37827j0861q7097K63802A55500p2732J45517J84568d7960E547K55338D0225
15995D11848E507L15727q5771Q6367j51245J45319J57606O1294K59921M5957l4498
15984H06184l28569J55458A14440J53146J13430A33422J9354k2652J97436b8637
15973B3623B899c9485I7888A0485J19444O2013F2757j0184J99670d7351p4280
15962a21631A94989E8677N566J38073p4693b47424B78713O9120F0401d2767C242
15950A91820E8297K70369j33625D164d5475j15613B81315r4060b31784A67305
$$ plain form
16029 91215 303357 253132 165936 595066 368995 141614 158050 60085 270429 264901 181333
16018 181333 374305 121308 433881 334093 32894 236589 -42971 319161 -17744 132358
16007 237827 226966 139869 403671 155500 82768 228285 412853 -47960 5547 260885 40225
15995 411848 5507 321234 235463 321830 170585 315904 473510 534804 794725 840682 806184
15984 806184 477615 633073 114440 267586 381016 133422 152776 130124 327560 -28637
15973 23623 2899 -39485 97888 10485 129929 191942 62757 52573 252243 -47351 -121631
15962 -121631 194989 58677 64243 202316 127623 -247424 278713 347833 60401 -42767 3242
15950 191820 58297 328666 195041 4164 -45475 -161088 281315 187255 -231784 167305
15939A44489g3915B72171a19301E7909e7031A67137o0557i4195A69960D4928d6097
15927a0368B20020b8631p6695B73756B2404Q073J56451o5450A5534d5801A36831
15915B66858b19974A40553e1935p2738N3290B16009a16220A77407i6227e973E7521
15903A53957L4739J7618N9063i005m9785j97268A80279J13028j16582a28225j28689
15892b56914J14361e1933A18696B4750a6165l7182B15765a09035A9845h7626d0455
15880e3488B04783E5157a01571G1609f4893k33580N605A49003m0697h4073A62943
15868c41954C73023I07J59933l0606A7597L3020R9247f1272A93990l7281B5447
15856A13470a08436B23230o5933G0756c46598a01466D4650c04129j36005I2982
$$ plain form
15939 144489 -73915 272171 -119301 57909 -57031 167137 106580 -94195 169960 44928 -46097
15927 -10368 220020 -28631 -105326 273756 22404 30477 186928 121478 15534 -45801 136831
15915 266858 -219974 140553 -51935 -124673 -71383 216009 -116220 177407 -96227 -5973 57521
15903 153957 188696 206314 265377 -9005 -58790 -256058 180279 293307 176725 -128225 -256914
15892 -256914 -142553 -51933 118696 24750 -16165 -53347 215765 -109035 19845 -87626 -40455
15880 -53488 204783 55157 -101571 71609 -64893 -298473 -292868 149003 108306 -84073 162943
15868 -341954 373023 907 160840 130234 17597 50617 149864 -61272 193990 156709 25447
15856 113470 -108436 223230 157297 70756 -346598 -101466 44650 -304129 -440134 92982
15845a54660C08937f2608B11936Q6460a75875K0571B00799A2546J40905P3320
15835B26771b85721i3435F5722B6227K69734j10480L6953C1986g8468B14840j6836
15824A98004C8994K62464l8265b06644E709a06460M0595j369I2983a11904k40980
15813c52884g7464H454e9243A69234G1593N0538a55321D0707b48033i896A14754
15801e2890A64312d05493A2006N2530A0123a52395o5920M7372E3717O2626D6428
15789A16683a39445B19936d3163A60879b2946B62658C2410b61711g2450C38369
15778F3913q77O0188E8670g0995B5673f7462J5934j44840C01911E7346L1746h4207
15765A66456e3375j06695F5624i346H2870L8553O1153a83197B53058L9754j02509
$$ plain form
15845 -154660 308937 -62608 211936 298396 -175875 -155304 200799 12546 153451 226771
15835 226771 -285721 -93435 65722 26227 295961 185481 222434 31986 -78468 214840 198004
15824 198004 38994 301458 263193 -206644 5709 -106460 -65865 -67234 92983 -111904 -352884
15813 -352884 -77464 8454 -59243 169234 71593 122131 -155321 40707 -248033 -9896 114754
15801 -52890 164312 -405493 12006 64536 10123 -152395 -218315 -170943 53717 116343 46428
15789 116683 -139445 219936 -43163 160879 -22946 262658 32410 -261711 -72450 338369
15778 63913 63036 123224 58670 -70995 25673 -67462 -51528 -196368 301911 57346 89092 -84207
15765 166456 -53375 -160070 65624 -9346 82870 121423 182576 -183197 253058 292812 190303
15754A90303D6628L9626a28404Q527A69052f6832F2637M7036Q3648m4364F8986
15742G653J42398f5848N557A45614a85037R352O0506D362a59690G908J37113c6240
15729A38316m857a8562o5820j24443O4526c5632A24334e8502j20113C03570e7359
15717H8585A379a35162C22211a12900E2125k46J47838a70255j67228A27249B2255
15705h012B4709a076j78040A38724D4329P7721D0697a02456d9783r9179K4892
15694a24070a1224A45216f7556F3069a17032A95599a66827B8050c696E6259b59254
15682A42248a90907d9799C0653b02180A24544K1338c21819F946N3582J56748A1536
15670d4258F4938L6714a73699J0336J1823D3240d3844E8657c6365A30361C0068
$$ plain form
15754 190303 46628 86254 -128404 -119877 169052 -66832 62637 109673 193321 148957 68986
15742 7653 150051 -65848 -60291 145614 -185037 -175685 -115179 4362 -159690 7908 145021 -36240
15729 138316 133459 -18562 -84382 -208825 -144299 -35632 124334 -58502 -178615 303570 -57359
15717 88585 1379 -135162 322211 -112900 52125 51879 199717 -170255 -337483 127249 22255
15705 -8012 24709 -1076 -179116 138724 44329 122050 40697 -102456 -49783 -148962 -124070
15694 -124070 -11224 145216 -67556 63069 -117032 195599 -166827 28050 -3696 56259 -259254
15682 142248 -190907 -49799 30653 -202180 124544 145882 -321819 6946 60528 217276 11536
15670 -44258 64938 101652 -173699 -163363 -151540 43240 -43844 58657 -36365 130361 30068
15658C8153B814c6279A51198a94109g4245j10307n1781J07726H9394A4906L06420
15647C21326a05972Q936B3340b71188B61097a82078l50333e1222J5812A87422
15636b08078L6127A45280K35468a12501c3417j24827c2174A13094a29229A67020
15625A47328B2321Q5372J17843a24603F1185A0699K07203f9365f272j81642G0825
15613B91939A38718d63853A59816c08018A39964i2647k4726F4739i6113B37199
15602C41570a63642E7897g6583b8438A217b00410B39452H3823l0171L2107O7623
15591A53382a73857N8606c3142H9061O8043B7363d8705k07930J6427c5270A0095
15579b2409m05515e2934B43562a94508B98350a58350E0902H057R7997a05628F9933
$$ plain form
15658 38153 2814 -36279 151198 -194109 -74245 -184552 -236333 -128607 89394 14906 321326
15647 321326 -105972 -97036 23340 -271188 261097 -182078 -532411 -51222 -35410 187422
15636 -208078 -171951 145280 380748 -112501 -33417 -158244 -32174 113094 -129229 167020
15625 147328 22321 107693 225536 -124603 61185 10699 217902 -69365 -6272 -187914 70825
15613 291939 138718 -463853 159816 -308018 139964 -92647 -117373 64739 -96113 237199
15602 341570 -163642 57897 -76583 -28438 1217 -200410 239452 83823 53652 85759 153382
15591 153382 -173857 -115251 -33142 89061 157104 27363 -48705 -256635 -240208 -35270 10095
15579 -22409 -427924 -52934 243562 -194508 298350 -158350 50902 8057 106054 -105628 69933
15567B09071o1960L3712A58J64606E092a89741i1031k92874A83271a72642M0794
15556a31848F7711N8297m6879b46245B82779c24091A47334a26019B2283J2534
15546C4817J37865a58431P3050j05453A85209c44062A50924D1216a85682Q4554
15536a01128c9100m7124A218a44053O4020D5879J08705b35152A8743L8228J7206
15525G4177a23523j52997I6441Q6733f0565k4336B37380b73753A25914m4953b27725
15513c14739a44147D1846P2892O7129e2669k44027J47418j48650D32400C6980
15502a63708c7303p914B80871d9162F803b03961h6406k21235J25484K9384E5396
15490D6037J7106b30560E232K33730A07774e7265j55287R8456E9940A5932J50385
$$ plain form
15567 209071 147111 180823 158 164764 5092 -189741 -91031 -383905 183271 -172642 -131848
15556 -131848 67711 126008 79129 -246245 282779 -324091 147334 -126019 22283 34817
15546 34817 172682 -158431 -85381 -190834 185209 -344062 150924 41216 -185682 -101128
15536 -101128 -39100 -86224 1218 -144053 -80033 45879 154584 -235152 18743 56971 74177
15525 74177 -123523 -276520 96441 183174 -60565 -84901 237380 -273753 125914 80961 -227725
15513 -314739 -144147 41846 114738 181867 -52669 -296696 -149278 -297928 432400 36980
15502 -163708 -37303 -45217 280871 -49162 6803 -203961 -86406 -307641 -182157 -152773 55396
15490 46037 63143 -230560 5232 238962 107774 -57265 -212552 -114096 59940 15932 166317
15479A66317a06708B15143J35286c1695B58750J60118j66339M0988A01853h7365
15468c3090j0520A4146J13997j579J84330n1161a00986k80863B08445b65343A05769
15456I1346l1132J28950a13657D12059A10679a43395O4969B17181h5840A18922
15445a84664A76143L33493k43510G9032J05666M8020p6540J56584G23J37584a3352
15433A58809f2201K1504A51598a40799J755B10220f5787j40260B21461A3962b2716
15421I2396a1709j9639F6568a46837j1147P0612p1323H5908c9234j16697M7610
15410a08321J7739a8015k249D5644J77775E2019a33486O0227C1119J62637F4747
15398A26325a83498A9027a34683B20391a91419g4175B34168A7817J63694C3755
$$ plain form
15479 166317 -106708 215143 350429 -31695 258750 418868 252529 293517 101853 -87365
15468 -33090 -43610 14146 128143 126564 310894 259733 -100986 -381849 208445 -265343 105769
15456 91346 60214 189164 -113657 412059 110679 -143395 -78426 217181 -85840 118922
15445 -184664 176143 509636 266126 79032 184698 232718 156178 312762 723 138307 -13352
15433 158809 -62201 -40697 151598 -140799 -139044 210220 -65787 -206047 221461 13962 -22716
15421 92396 -11709 -31348 66568 -146837 -157984 -87372 -158695 85908 -39234 -155931 -108321
15410 -108321 -90582 -18015 -20264 45644 223419 52019 -133486 -73259 31119 193756 64747
15398 126325 -183498 19027 -134683 220391 -191419 -74175 234168 17817 181511 33755
15387a19485I312L4787A2201J93177k2898c32967C0227P2904D8603j0315J7993
15376E6281M9311n919k2043P8533J10319A19619g6393B52283l8901H2720i7906
15364I2171J65134o2396a2764j74294l7843A45603D8489K03108p39K01154a01851
15352B67691a50285a9131j29595c6802a1508C0091P0831A9882d5315B59291K73737
15341E33028A56532m3381b0287n4547A33552R3122r7790l3619a1844j33120l46368
15330d91332A57280n9643b6997A15101J58382j22652l0222a0223k12577B36797
15319E2965M9237K68342l944a17209R920k5709I0375J54826F4813P184f7541B41835
15306I4169O8478L07369h6104E0367b76456C2247K65240a66461j49306C45797
$$ plain form
15387 -119485 9312 44099 12201 205378 182480 -332967 30227 103131 48603 38288 56281
15376 56281 105592 99673 77630 156163 266482 119619 -76393 252283 213382 82720 -97906
15364 92171 257305 194909 -12764 -187058 -224901 145603 48489 251597 250858 452012 -101851
15352 267691 -150285 -19131 -148726 -36802 -11508 30091 100922 19882 -45315 259291 533028
15341 533028 156532 113151 -20287 -74834 133552 226674 128884 95265 -11844 -144964 -491332
15330 -491332 157280 97637 -26997 115101 273483 150831 120609 -10223 -222800 236797
15319 52965 102202 370544 366600 -117209 -107289 -132998 90375 245201 64813 71997 -67541 241835
15306 94169 162647 470016 -86104 50367 -276456 32247 297487 -166461 -315767 345797
15295a32233c4282E2068K21413B6878K08412m5710a39379A175N6004G003i4230
15283a84374e8041C1627a04156j60174k30360A40322P9549J04339g5090a1364
15272a29819O1042C50257j44976b96695C97939A71030l2184b50269C65401h4235
15261d4762A67731A0196L66527j72690a20057e5595j96349C50454j00526j12955
15251A36973J90706J29699K96086R48708l1659j17928O10174G90161j88069a70184
15240A26499K54181l1745C0455O6219J53245E2745J64185R358n5346a13657A71105
15228i4803C38036F815K06012p1332l6896e710B528J6735a93422e3491A31743
15216b09413f0858K421E7776J19063a74576B06579A2217J33220a33109G8462L19570
$$ plain form
15295 -132233 -34282 52068 273481 26878 235290 189580 -139379 1175 57179 7003 -94230
15283 -184374 -58041 31627 -104156 -264330 -494690 140322 219871 324210 -75090 -11364
15272 -129819 -68777 350257 205281 -296695 397939 171030 138846 -250269 365401 -84235
15261 -44762 167731 10196 376723 204033 -120057 -55595 -251944 350454 249928 136973
15251 136973 327679 457378 753464 1702172 1670513 1552585 2162759 790161 602092 -170184
15240 126499 380680 348935 30455 96674 249919 52745 216930 226288 170942 -113657 171105
15228 -94803 338036 6815 212827 141495 104599 -5710 2528 19263 -193422 -53491 131743
15216 -209413 -60858 -58437 57776 176839 -174576 206579 12217 145437 -133109 78462 398032
15205C98032b25059A60801O0743d2260q3776E0471L0046K8577a94126D83535b35879
15193A02373A4388h0852C26965H5875e1110A2407a35815B41496q9998c5959H1642
15181b44474D68339F7828J38412C5424b63379e7595j33894H9800L0004L15199
15171D35003a09567I3549b19598A58403c4030k58208B29536F0521B5439Q6303
15161A11742M75115A5393K33309a37774C38967A34267C1539R391K62141A01752
15150A55085a8179B29970D4177b3898B95757b00138D26410k02881i3915A6044
15139D18223a1869n3993C49623A2168b69339G3539a67651B24623a64253g4872
15128I1700a80539A47256K22819G3976K31197P30j29503H5685i7004b7975A92395
$$ plain form
15205 398032 -225059 160801 221544 -42260 -126036 50471 80517 109094 -194126 483535 -235879
15193 102373 14388 -80852 326965 85875 -51110 12407 -135815 241496 151498 -35959 81642
15181 -244474 468339 67828 206240 35424 -263379 -57595 -191489 89800 119804 435003
15171 435003 -109567 93549 -219598 158403 -34030 -292238 229536 60521 25439 111742
15161 111742 586857 15393 248702 -137774 338967 134267 31539 40930 303071 101752
15150 155085 -18179 229970 44177 -23898 295757 -200138 426410 223529 -93915 16044
15139 418223 -11869 -65862 349623 12168 -269339 73539 -167651 224623 -164253 -74872
15128 91700 -180539 147256 370075 73976 305173 305903 176400 85685 -97004 -27975 192395
15116C23248c16117I4891L2002a5151C2985J197M50216j26528A20440K46641c9696
15104B48201g2773C71766j0385A01737c8743B89493A39691A3711O9669K38382
15094C21762a78904J6415B50619j1707k1567A1863K09723F0471a28501k2342B32979
15082A68019p2419Q4748o3948Q2400O9489a62591D6059P1269J43515a74378A43609
15070a09845J9691b8763E7563J38673J18716J74211r8274r8548A11788O6411a90716
15058F4932K11640B8135F296O672L03366O3231j64746I5728K15628J55380i7142
15046G5854K90309D2879J17531O2130K3182J43999A63636J96283D9990K96831
15036C46821j63179K41010A523K36385Q8666O8357A95991Q8670F6988J91320K5161
$$ plain form
15116 323248 -316117 94891 126893 -15151 32985 34182 484398 357870 120440 367081 -39696
15104 248201 -72773 371766 361381 101737 -38743 289493 139691 13711 83380 321762
15094 321762 -178904 -162489 250619 238912 217345 11863 221586 60471 -128501 -150843 232979
15082 168019 95600 180348 116400 198800 268289 -162591 46059 117328 260843 -174378 143609
15070 -109845 -90154 -28763 57563 196236 314952 489163 390889 292341 111788 178199 -190716
15058 64932 276572 28135 6296 12968 316334 379565 214819 95728 311356 466736 -97142
15046 75854 366163 42879 160410 222540 245722 389721 163636 359919 49990 346821
15036 346821 183642 424652 1523 237908 326574 394931 195991 284661 66988 258308 283469
15025B83469J41904J42239J31588l23599e3928C06965q1761Q4419F6220K69950
15015C36170k3025n0739J5708J12587j45610I6253P1600m380L80245B16399L35636
15004E52035j88552O0074B04304l0685n4010M4308j9666k9384K36230p9672M9516
14993C20941A29289J03653H5856f6087B19049M15873l11633j26313J0787j2271
14983A95492Q7342m2409a507D41052o4885J45130k08681j4504J10773n9300M4886
14972C94471M4094j85781N0057K75120L7674j93100K52173j34623o7690K77378
14962G49773k84469j20169Q0593J69546j08779j24015M14249A83856R8896k7079
14952B55673p1053L17125k15078J6701n2644M9718j03000K75129k8803M3160l1109
$$ plain form
15025 283469 425373 567612 699200 375601 -53928 306965 225204 309623 66220 336170
15015 336170 313145 262406 278114 390701 245091 96253 167853 163473 543718 216399 552035
15004 552035 363483 423557 204304 173619 119609 163917 144251 114867 351097 271425 320941
14993 320941 129289 232942 85856 -66087 219049 634922 323289 196976 207763 195492
14983 195492 282834 240425 -1507 441052 376167 521297 312616 298112 408885 349585 394471
14972 394471 438565 252784 302841 577961 615635 422535 674708 540085 472395 749773
14962 749773 465304 345135 425728 595274 486495 362480 776729 183856 282752 255673
14952 255673 184620 501745 286667 303368 250724 300442 197442 472571 443768 486928 455819
14941D55819k23622N452Q8014q9442K38451B16143M1794K06445J1195J04965j30120
14930D50422K59697j6501l598j1645M30253K095m88394K1913J06779Q0312L6759
14919H68092j19744O5446J52234J61210l21781L3269q7732P0311k37716j51730
14909D31859n4510N2270j39946O9680j40759J113L53443j51153j72842J15153
14899C64308A20957L67319O3700B07985K77124k33979L72797A80423N31835B50339
14888A97369R8870I1925M57703O747l3204j07535J2829M03964k89051K2578J99870
14877G65826k86193m9828j73195K21905Q1421m0597P1976j37977k20449J34375
14867C67264K98009B72801J16810K62326l15520M18134l09919j45978K76395k58052
$$ plain form
14941 455819 232197 237649 325663 236221 474672 216143 257937 464382 475577 580542 450422
14930 450422 710119 693618 690020 678375 1108628 1110723 622329 644242 751021 831333 868092
14919 868092 748348 813794 966028 1127238 805457 838726 750994 821305 583589 431859
14909 431859 377349 429619 289673 359353 218594 219707 573150 421997 249155 364308
14899 364308 120957 488276 551976 207985 485109 251130 623927 180423 712258 250339
14888 197369 296239 91925 549628 556375 523171 415636 428465 832429 543378 565956 765826
14877 765826 479633 429805 256610 478515 559936 519339 591315 453338 232889 367264
14867 367264 665273 272801 389611 651937 336417 754551 444632 298654 575049 316997
14857C16997J14112J60588k02201o7374P82A33910N22685L6561l7886l15117M42903
14846G83056k75339P8579Q6550C29270K1666O72462l65722r8297J87837n1018
14836F96198q9834n1649J17769J04778k95237J68353j18807k27872J55451r5901
14826C63249J57055j88010o0551K82645J4341j25338j58898O45548q5465l08502
14816E36074j28621n3790m8622J1177J13256M3992J2896j18880K72114B70959
14805B41936K99738m5795K35796j36876j72110j23349J52316K18470j68875R0018
14795E91269J16801j06877m9946k59214L06818B39881L08521m8280j76939J97353
14785E20536j70509K2997l9399K69652j70151L06056k71506J38760m6035q016
$$ plain form
14857 316997 431109 591697 389496 322122 322904 133910 656595 693156 655270 340153 783056
14846 783056 507717 586296 672846 329270 350936 1023398 657676 559379 747216 696198
14836 696198 606364 554715 672484 777262 482025 650378 531571 303699 459150 363249
14826 363249 520304 332294 271743 554388 568729 443391 284493 930041 844576 536074
14816 536074 407453 353663 305041 316218 429474 473466 486362 367482 639596 270959
14805 241936 541674 495879 731675 594799 422689 299340 451656 670126 501251 591269
14795 591269 708070 601193 551247 292033 598851 239881 548402 500122 323183 520536
14785 520536 350027 373024 333625 603277 433126 739182 467676 606436 560401 552385
14775E52385j90927N5285Q9787J5815J25734J51663j75333k60953J71143j67456
14765C67143J2071r5210K6141K72398K65480k33895J3743p2183K0549L8836K29364
14754H44437K3628j66481O6671j40248J72253j51537k4307P5690B68324M42750
14744G11074J57871k13135j19640K40189C55944L0104L37281j22698J04655l31281
14734C74005K64479j48769L28340k27826L51357D66834J99381j4668K16790N5156
14724I23493k1065J72114L75271k54916j83320J65220l87724J37656R2798q2173
14714I37354L29563F00617K68465j80638m6654K06807L41915k45614O3956j06009
14704I02845l5417o4598O03012n88984K95033L37891l55259p7002K31325l01952
$$ plain form
14775 552385 361458 416743 506530 522345 648079 799742 624409 363456 534599 367143
14765 367143 379214 284004 310145 582543 848023 614128 627871 555688 576237 615073 844437
14754 844437 868065 701584 768255 628007 800260 648723 624416 700106 268324 711074
14744 711074 868945 655810 536170 776359 355944 386048 723329 600631 705286 374005
14734 374005 638484 489715 818055 590229 941586 466834 666215 651547 868337 923493
14724 923493 902428 1074542 1449813 1194897 1011577 1176797 789073 926729 1019527 937354
14714 937354 1266917 600617 869082 688444 641790 848597 1190512 944898 1008854 902845
14704 902845 867428 802830 1405842 816858 1111891 1449782 1094523 1017521 1248846 946894
14694I46894J03320J4605J53014l55412P3244J02420l50741L7479p1060L55266
14684A009029k32686J81273j68407N8624J54923k32733j12432J87788J2892L0076
14674H88347Q9280j31129K01019k16104L21429n50397J97752M75862k11152K05749
14664A270656m37901l7674K01532l61281L60724J08153P5065m53876L6531L25061
14654A086990j60361N29363n75286K77764l17223N39304j17403k39019P8634N3723
14644A156486p4565K31055l66465j5437R4040J66001l00427M37440k54702J43000
14634A216426J1889l32630Q1129K6417L94326J07905k15000r9826k6438R688j57942
14623A015944M06089m03267K38078M9193j18287P9000l10187M17145l17212K05529
$$ plain form
14694 946894 1050214 1064819 1217833 862421 935665 1038085 687344 724823 653763 1009029
14684 1009029 776343 957616 789209 847833 1002756 770023 657591 845379 858271 888347
14674 888347 977627 846498 1047517 831413 1152842 602445 800197 1276059 1064907 1270656
14664 1270656 832755 795081 996613 635332 996056 1104209 1179274 725398 761929 1086990
14654 1086990 926629 1455992 880706 1158470 841247 1380551 1263148 1024129 1102763 1156486
14644 1156486 1081921 1312976 946511 931074 1025114 1191115 890688 1328128 1073426 1216426
14634 1216426 1228315 895685 976814 1003231 1397557 1505462 1290462 1190636 1164198 1173886 1015944
14623 1015944 1422033 1018766 1256844 1306037 1187750 1266750 956563 1373708 1056496 1262025
14613A262025j02234J60039J73873j02213J08186l7329J40172l84778J04800k7094
14603A295447Q50J84322j33253m1525m5215K63609r6599o1883j47291N89130l15468
14592A492124K50158Q3583j30801j41466m4839L4049N5160K13376J09479j03705
14582A817118p1820K79957l03586L5635K28902k26676K60284R0306J3816j04245
14572B019691J26410k23261O5021L95281q1246J3341j02556K67752m9153J61126
14562B592406j59445J95567K62584l68387M86893L8384j14672K26589L64579M96021
14552D020519M66517K36000J691234J408381L875764O490568J1762223Q129931
14544C8081137j4815364j1342270E189252j956100o73529o03953K70230j46650
$$ plain form
14613 1262025 1159791 1319830 1493703 1391490 1499676 1462347 1602519 1217741 1322541 1295447
14603 1295447 1296297 1480619 1347366 1305841 1260626 1524235 1427636 1365753 1218462 1807592 1492124
14592 1492124 1742282 1825865 1695064 1553598 1508759 1542808 1597968 1811344 1920823 1817118
14582 1817118 1745298 2025255 1721669 1757304 1986206 1759530 2019814 2110120 2123936 2019691
14572 2019691 2146101 1922840 1987861 2383142 2301896 2315237 2212681 2480433 2431280 2592406
14562 2592406 2432961 2628528 2891112 2522725 3009618 3048002 2933330 3159919 3524498 4020519
14552 4020519 4487036 4723036 6414270 7822651 11698415 18188983 29951206 38081137
14544 38081137 23265773 11923503 5189252 3233152 2559623 1955670 2225900 2079250
14536B079250l10384L31826j34057L44733j59676J17193k15096K14290O7238L4444
14526B369761l82572Q6906k37969J91890j84797M90925J36394k19586N55506l91043
14516B415415j59906j69151O26010m0920O8169l41624J51041P7646l3903j37543
14506B455234M54076l60226J90808K57607k55665K09520j86468J99592J98025
14497C162503l96910M20086l30208J53128K21068j93121N08753o49695L57658
14488C253262J15664j21758M20979K93896m56281l01508M33327j50865j09155
14479C377561K27698J38366J15465j87151j37067J45465L69523j71083K2202M85768
14469D386747k94754O805o9159J38825l37271L66926J42348j19568j06402K33659
$$ plain form
14536 2079250 1768866 2100692 1966635 2311368 2151692 2268885 2053789 2268079 2335317 2369761
14526 2369761 1987189 2074095 1836126 2028016 1843219 2334144 2470538 2250952 2806458 2415415
14516 2415415 2255509 2086358 2712368 2671448 2739617 2397993 2549034 2626680 2592777 2455234
14506 2455234 2909310 2549084 2739892 2997499 2741834 2951354 2764886 2964478 3162503
14497 3162503 2765593 3185679 2855471 3008599 3229667 3036546 3545299 2895604 3253262
14488 3253262 3368926 3247168 3668147 3962043 3505762 3204254 3637581 3486716 3377561
14479 3377561 3605259 3743625 3859090 3671939 3534872 3680337 4049860 3878777 3900979 4386747
14469 4386747 4091993 4098798 4029639 4168464 3831193 4198119 4340467 4220899 4114497 4348156
14459D348156J79082J28603l76219L38083q6991J05220N02648m33098L79935R2741
14449E178160k61186R364M24056L1460n8434J14355j51080K34853K63403k27787
14439E557164K43468r5055L06470M5018q2346K92675l367l747N9073K6156J65993
14428F511502J24604J94744L5320K18436k09056Q704M90790K6659J77852n6290
14418G523265K34636K67152K60982k37752L50145l12521q1356N4681M97273K84557
14408H841062K37582m52116N38096O5912K5945N02400J14421p6865M19977j31269
14398A0085145O50457j63234l37265N50063K39878K0677L15796M03361J17228
14389A1882106K44223L35990j04882M23141m5868L16922N34378K59121o9328K98411
$$ plain form
14459 4348156 4527238 4655841 4279622 4617705 4530714 4635934 5138582 4705484 5085419 5178160
14449 5178160 4916974 4926338 5350394 5381854 5323420 5437775 5286695 5521548 5784951 5557164
14439 5557164 5800632 5705577 6012047 6057065 5974719 6267394 6264027 6260280 6319353 6345509 6511502
14428 6511502 6636106 6830850 6866170 7084606 6875550 6884254 7375044 7401703 7579555 7523265
14418 7523265 7757901 8025053 8286035 8048283 8398428 8085907 8004551 8059232 8556505 8841062
14408 8841062 9078644 8626528 9164624 9230536 9256481 9758881 9873302 9796437 10216414 10085145
14398 10085145 10735602 10572368 10235103 10785166 11025044 11045721 11361517 11764878 11882106
14389 11882106 12126329 12462319 12357437 12780578 12734710 13051632 13586010 13845131 13775803 14074214
14379A4074214M41447J60284J86219M27733M09678K72533K0131M95916J98903
14370A6687058N81213P2050M12757P18429k05502Q37925N52434K14403K32526
14361B0103293L79733N61471N68172j18163Q99147M77201P44585O01904M54200
14352B4671543P11440L32227M77061Q76965L73737J220443M75944P89700O60818
14343C0589878R27553Q23750Q45925J192472P90278J299135P11518J013385P92130
14334C8986024J240964J437166J132608J158686J489045J456575J581056J724435
14326E0206559J329071J657153J893552K233180J613601K222248K020573K276513
14318F5452450K687357K193717K468116L170865K947083L102877L213922L608655
$$ plain form
14379 14074214 14515661 14675945 14862164 15289897 15699575 15972108 15992239 16488155 16687058
14370 16687058 17268271 17340321 17753078 18471507 18266005 19103930 19656364 19870767 20103293
14361 20103293 20483026 21044497 21612669 21494506 22393653 22870854 23615439 24217343 24671543
14352 24671543 25382983 25715210 26192271 27069236 27442973 28663416 29139360 29929060 30589878
14343 30589878 31517431 32341181 33187106 34379578 35169856 36468991 37180509 38193894 38986024
14334 38986024 40226988 41664154 42796762 43955448 45444493 46901068 48482124 50206559
14326 50206559 51535630 53192783 55086335 57319515 58933116 61155364 63175937 65452450
14318 65452450 68139807 70333524 72801640 75972505 78919588 82022465 85236387 88845042
14310H8845042L690296L695327M318703M120617M560575M712937M674929N067704
14302A23686130N806978N314330O369123O325617P087992O931538P865957P834930
14294A77222595Q607207R255943R151503J0469844J0105421J1369134J1187916
14287B47369563J1919956J2098182J2437324J3176283J3565140J3916456J4124638
14280C38607542J4061727J4065635J3819955J3214123J2500489J1417525R739951
14273D27426947P070862K938857K115380K473635J848266m8812l063391l965721
14265D36796023p533529j0683195j2567287j3933429j4882546j5061277j5735244
14258C46399516j5799424j5429122j5109682j4971548j3527749j3125750j3311088
$$ plain form
14310 88845042 92535338 96230665 100549368 104669985 109230560 113943497 118618426 123686130
14302 123686130 129493108 134807438 141176561 147502178 154590170 161521708 169387665 177222595
14294 177222595 185829802 195085745 204237248 214707092 224812513 236181647 247369563
14287 247369563 259289519 271387701 283825025 297001308 310566448 324482904 338607542
14280 338607542 352669269 366734904 380554859 393768982 406269471 417686996 427426947
14273 427426947 434497809 437436666 439552046 442025681 443873947 443825135 440761744 436796023
14265 436796023 429262494 418579299 406012012 392078583 377196037 362134760 346399516
14258 346399516 330600092 315170970 300061288 285089740 271561991 258436241 245125153
14251B45125153j2394998j2151169j1030114j0618578j0001690r835375q538885
14244A70554344q045966p533256p899821o829102o604229o489704n463547n094152
14236A16594567n202565m697959m571537m321053m043444l807871l575727l447957
14228H2926454l016145l132542l078803k794864k330691k752396k022434k619290
14220F1179289j740591k347750j492689k169970j623266j455160j547990j453334
14212D7348539j647230j191035j632744j277910q72067r70551j130780j003716
14204C7622506j551065r60796o07836j025331m25326j705513l65242j104270m72666
14195B9404461q15633n60216j041700l96886m11983j038408n83015n19980o36356
$$ plain form
14251 245125153 232730155 220578986 209548872 198930294 188928604 179093229 170554344
14244 170554344 162508378 154975122 147075301 140246199 133641970 127152266 121688719 116594567
14236 116594567 111392002 106694043 102122506 97801453 93758009 89950138 86374411 82926454
14228 82926454 79910309 76777767 73698964 70904100 68573409 65821013 63798579 61179289
14220 61179289 59438698 57090948 55598259 53428289 51805023 50349863 48801873 47348539
14212 47348539 45701309 44510274 42877530 41599620 40727553 39757002 38626222 37622506
14204 37622506 36071441 35110645 34502809 33477478 33052152 31346639 30981397 29877127 29404461
14195 29404461 28588828 28028612 26986912 26590026 26178043 25139635 24556620 24036640 23400284
14186B3400284o11722n68347j90964p20875m42574k41270n07669k99462o53045
14177A9164356m18109j36002l86357k54300n39122m92775j11053o08821L1426
14168A6249243l80354n08365m86716k32579J40784k41682k45138k58431m48448
14159A3588314m01138J21934l83838k08882k25439k52317J12357l72105k98038
14150A1680848J13536o27741p7797J56497n10649j40683k31151j55826K1374J26566
14140A0354974l50664m16519j92022K15985k06365k317k87119J3368n00895K57817
14130H886243m17958l60416J91053k248l06533K44072m55928r5567J37446o3967
14120G756197j82883j49031j2089j06752k58178k09972J09319n03972L9219J07829
$$ plain form
14186 23400284 22788562 22220215 22029251 21308376 20865802 20624532 20116863 19817401 19164356
14177 19164356 18746247 18610245 18223888 17969588 17430466 16937691 16826638 16217817 16249243
14168 16249243 15868889 15360524 14873808 14641229 14782013 14540331 14295193 14036762 13588314
14159 13588314 13187176 13309110 12925272 12716390 12490951 12238634 12350991 11978886 11680848
14150 11680848 11794384 11166643 11088846 11245343 10734694 10594011 10362860 10207034 10228408 10354974
14140 10354974 10004310 9587791 9395769 9611754 9405389 9403072 9115953 9129321 8628426 8886243
14130 8886243 8468285 8107869 8298922 8296674 7990141 8234213 7778285 7682718 7820164 7756197
14120 7756197 7573314 7424283 7412194 7305442 7047264 6837292 6946611 6442639 6481858 6589687
14110F589687j46937o99k67282K10195r2762m84022M47828l17107J79978k74739
14100E844140k8825j81456K3176O4752j76266q0327j88621K01721l59610J81245
14090E299929k27104p559K63320l04237l43885L34078Q7621m91089J87848m19970
14080D378952N66238m20551J03093p7206j1937k69007q4857M09258m23833p06
14070D169444J37083l39856m28241O62316l39296q0710M02548l09165J26772l41802
14060C659093M87574k90562M3651n87461M413K20246O8497l10493K40168J14946
14050C650072l74992J61884k32985K39994j12204k35963J05027J29414L7476j85263
14040C182460r0269k3651J21603l08488K65025j39541m6347j85087K85055J44219
$$ plain form
14110 6589687 6442750 6442051 6174769 6384964 6292202 5808180 6256008 5938901 6118879 5844140
14100 5844140 5815315 5633859 5657035 5721787 5545521 5465194 5276573 5478294 5118684 5299929
14090 5299929 5072825 5065266 5328586 5024349 4680464 5014542 5102163 4611074 4798922 4378952
14080 4378952 4945190 4524639 4627732 4550526 4538589 4269582 4184725 4593983 4170150 4169444
14070 4169444 4306527 3966671 3538430 4200746 3861450 3780740 4183288 3874123 4000895 3659093
14060 3659093 4146667 3856105 3899756 3312295 3316708 3536954 3605451 3294958 3535126 3650072
14050 3650072 3275080 3436964 3203979 3443973 3331769 3095806 3200833 3330247 3367723 3182460
14040 3182460 3092191 3068540 3190143 2881655 3146680 3007139 2960792 2775705 3060760 3204979
14030C204979m84176K84293o97486L96487j15317J20801L2802K09120m99017J89289
14020B641775o1510j9374R6543k13597J53206j10561j45517j03265K03325l47016
14010B094009j7114L09126j36078p581J07189k78472L70196J1892k93986n0167
14000B109014J50389j36368L5014j62893L45900k07651J42261K95722q0973L91448
13990B881863N11181J202567K658151M534609J0438546J3868524p000123j3612139
13982A5483179o149847l484593j182088o07206n90611k49133o3041l65119j33711
13973B657830K209m07590K32782k13657M31318m42228j7657N6046J63078k66130
13963B196001j68648j84275J93217K39847l09487N7525M3476j55826p4199K01551
$$ plain form
14030 3204979 2720803 3005096 2307610 2704097 2588780 2709581 2742383 2951503 2452486 2641775
14020 2641775 2580265 2560891 2657434 2443837 2597043 2486482 2340965 2237700 2441025 2094009
14010 2094009 2076895 2386021 2249943 2242362 2349551 2071079 2441275 2453167 2159181 2109014
14000 2109014 2259403 2123035 2158049 1995156 2341056 2133405 2275666 2571388 2490415 2881863
13990 2881863 3393044 4595611 7253762 11788371 22226917 36095441 29095318 15483179
13982 15483179 9333332 5848739 4666651 4059445 3468834 3219701 3156660 2791541 2657830
13973 2657830 2660039 2252449 2485231 2271574 2702892 2260664 2243007 2299053 2462131 2196001
13963 2196001 2027353 1843078 2036295 2276142 1966655 2024180 2067656 1911830 1837631 2039182
13953B039182l24399K97528n08296K51785O4641k63761R1551K94030k38992j40190
13943A563079O29665n87506L97998l27068K62940l50106J33107n57744N55997
13934A720362k09280p5845L95598l41890j06597L02724l74347M47274k87209J88481
13924A659271n99138L68554j85774J9688K2625O04324k16437k04201R3543j57816
13914A404639l8292J43924q3235j80836L82494j98793k5401k21944O6089K52828
13904A501473m42597K21642m3694J39331P9105L1749k48340J42427j59347L2196
13894A253945j84132J68598k55988K4884L18841k24703k06450M01125O3645l93471
13884I66294K05278L9060j64633P4597q2379K44431l11706K32573P7895l60795
$$ plain form
13953 2039182 1714783 2012311 1504015 1755800 1820441 1556680 1648231 1942261 1703269 1563079
13943 1563079 2192744 1605238 2003236 1676168 1939108 1589002 1722109 1164365 1720362
13934 1720362 1511082 1435237 1830835 1488945 1382348 1685072 1310725 1757999 1470790 1659271
13924 1659271 1060133 1428687 1242913 1262601 1285226 1889550 1673113 1468912 1562455 1404639
13914 1404639 1366347 1510271 1427036 1246200 1628694 1429901 1404500 1182556 1248645 1501473
13904 1501473 1058876 1280518 1236824 1376155 1455260 1487009 1238669 1381096 1221749 1253945
13894 1253945 1069813 1238411 982423 1007307 1326148 1101445 894995 1296120 1359765 966294
13884 966294 1171572 1210632 1045999 1120596 1038217 1282648 970942 1203515 1281410 920615
13874I20615K48166k176j09649K13247l51070J57669J30287k03252J32255K66889
13864A402981m95295J57326K41881l18160J80752J83125k11811J93366k92892
13855A041273k37923K66905k51868K28360K0083n1925J0909J94843J13724n55976
13845G78405J6786K88124j47772l19290M99640q4223m46140M24142k52514J99231
13835I56389k09869M16523l84606O9147J31918m13946L26705J68473j99355L3886
13825H95265j85985K26235k30397J67948R6470j14657C90864L19688q249l01070
13815D01233K61491p1246L6418n621J9796K32849K5803r001l09051k2406L55469
13804I15734J3243m7946j11672j16191O1491J84377l00801P4903L04181n9075
$$ plain form
13874 920615 1168781 1166605 1056956 1270203 919133 1076802 1207089 1003837 1136092 1402981
13864 1402981 907686 1065012 1306893 988733 1169485 1352610 1140799 1334165 1041273
13855 1041273 803350 1070255 818387 1046747 1066830 1014905 1025814 1220657 1334381 778405
13845 778405 795191 1083315 935543 616253 1115893 1031670 585530 1009672 757158 956389
13835 956389 746520 1163043 778437 847584 979502 565556 892261 1060734 861379 895265
13825 895265 709280 935515 705118 873066 969536 854879 390864 710552 702303 401233
13815 401233 662724 591478 627896 622275 642071 874920 900723 891722 582671 560265 915734
13804 915734 928977 881031 769359 653168 714659 899036 598235 673138 977319 918244
13794I18244N6022j96811N8894k2586k22094P6190J78287j02162O0999k02430
13784F02553l3670J52242L35100C28332L79829l4359M2744k15575M58445m74097
13774D85319K19401J01502l34274Q5771K18134j50693l8410J32468k7424K09621
13764I01415j90973P0506j31813K51751l05828j13614q522M0428P8451j80973
13754D10828K57988B11274N79092l49378j51180O00934j57201N2150j43556K52071
13744H94206l57666J52941p6960B87725L60966p5949n791n8598K62197A95493
13733C84806j84908N72698H8470M17825J09187k6159Q037m5596A21726O99646
13723H21372A25383M63503J7826k43295L17690n2499j09300K20540k23526K1609
$$ plain form
13794 918244 974266 777455 836349 813763 591669 667859 846146 743984 804983 602553
13784 602553 568883 721125 1056225 328332 708161 673802 716546 500971 959416 485319
13774 485319 704720 806222 471948 557719 775853 625160 586750 719218 691794 901415
13764 901415 710442 780948 649135 900886 595058 481444 472922 513350 591801 410828
13754 410828 668816 211274 790366 440988 289808 890742 733541 785691 642135 894206
13744 894206 536540 689481 612521 287725 648691 572742 566951 508353 770550 195493
13733 384806 199898 772596 88470 506295 615482 589323 597360 551764 121726 821372
13723 821372 125383 588886 606712 363417 681107 628608 519308 739848 516322 537931
13713E37931j21509K03318j64260K22q1702L22555k03882K29784j85613j37123
13703C99721J92970k79292K74799B68605J62659K14292M9851k60046R1045J21806
13693F48212B34309P10264D14022n6114J44015q9399k02711J58711j30731M6307
13683B84100J73894j77610J21667J07048n0031O6918A21113J42095J02306J57834
13673E23348p6175J07471k4506k16273K27820J48088J5943l21894M7806j03516
13663C28112K1392K53283k73535A14558M22272n9738K58780k25210J38279B14380
13652E88501o9587N3107k18794A66331m5479K48569J47305K02500C13143R55o4164
13641B49934R5817L73330l06742o5759C4986L85910L05843C38419q1846d1702
$$ plain form
13713 537931 416422 619740 455480 455702 374000 696555 492673 722457 536844 399721
13703 399721 592691 313399 588198 268605 431264 645556 695407 435361 526406 648212
13693 648212 234309 944573 414022 357908 501923 412524 209813 368524 237793 284100
13683 284100 457994 280384 402051 509099 459068 525986 121113 263208 365514 523348
13673 523348 447173 554644 530138 313865 541685 689773 705716 383822 431628 328112
13663 328112 349504 602787 329252 114558 536830 477092 735872 510662 648941 214380
13652 588501 518914 572021 353227 166331 120852 369421 516726 719226 313143 314098 249934
13641 249934 345751 719081 412339 346580 34986 420896 726739 338419 256573 -41702
13630A34979n8121K12286J54709j00829m5265A30527m3435K17112r0125K79850
13620D93929j68081K3371e1363I6840O41113A17784M53799B76777m9466K47892
13610D75203j46161Q451j66693Q8892j00782K69147j70577J26588C2838J47403
13600A80241J74787D6826L84091A32823K70820O0731j23234J3276d308C92433
13589F57313k67825N9755n7630k5757j73612M20016A58592L01468L4816O8842
13579E63718E3857J52388L2825n3877o3642L09372J02268E6134K34958n4882j5180
13568B21030q331J59515j16667K0544K02742B25153r0601K06069A60998R1050
13558B52048N5827J38102p1320A78010J94265A81650H7929L10714L461J01306
$$ plain form
13630 134979 76858 289144 443853 343024 297759 130527 87092 304204 214079 493929
13620 493929 325848 349219 -51363 96840 737953 117784 571583 276777 227311 475203
13610 475203 329042 337493 170800 259692 158910 428057 257480 384068 32838 180241
13600 180241 355028 46826 430917 132823 403643 464374 341140 354416 -4308 392433
13589 657313 389488 449243 391613 365856 192244 612260 158592 460060 494876 563718
13579 563718 53857 206245 239070 185193 121551 430923 533191 56134 291092 236210 221030
13568 221030 212699 372214 255547 276091 478833 225153 134552 340621 160998 252048
13558 252048 307875 445977 374657 178010 372275 181650 87929 398643 402104 503410
13548E03410L1459j65048j55632J26858A61202J22119j11061J46004o5202O2656
13538C15718K53897A93185J14434F8186M19294O8356B57430A20673J05307A07736
13527A32608K71387A00232J81007A04319N3394M1165G6082L33087j53913J20957
13517C76213A12279J3454h6030E53384H6046L42500A54698M0784G1916k5253J46662
13506A93325K1648J105J31385J68667A18854a25070E23882I0056K60321j67096
13496A83281J42457A47515D0348J23607J84368j72419M43078e8031F2378J57745
13486B20123q6439I799M01628j83577J25381L5870q6320a3976A33848o824K04330
13475C31354N6342j01912c9724j26467C44368H4895J85745A22161L0009J93555
$$ plain form
13548 503410 534869 369821 214189 341047 161202 283321 172260 318264 253062 315718
13538 315718 569615 193185 307619 68186 487480 555836 257430 120673 225980 107736
13527 132608 403995 100232 281239 104319 157713 198878 76082 409169 255256 376213
13517 376213 112279 125733 -86030 553384 86046 428546 154698 195482 71916 46663 193325
13506 193325 214973 216078 347463 516130 118854 -125070 523882 90056 350377 183281
13496 183281 325738 147515 40348 163955 348323 175904 618982 -58031 62378 220123
13486 220123 133684 9799 411427 227850 353231 389101 302781 -13976 133848 127024 331354
13475 331354 387696 285784 -39724 -166191 344368 84895 270640 122161 152170 345725
13465C45725m3939K64179h1202C04618k192Q9733p9484A6484J20782G448c9716
13453A71394k2422J09251j04982J75349J3345A55169G3160J68412K4045A30648
13442A14719K26673K31901k22684J9879k6519A51133K50762l947f8744A43647
13431D37994j78113F874M67773k09890F5778c8055D31573j49437k3915O6227j2669
13420C11779M7145A68954R557O3873K26401B1216K10653k0398H7865D1723A2279
13408f538B24076p0524K02336B0356a2938A95994G4309a49483A14353b1908A41029
13396H3768B6156J11165G923K31160A10812J39444P5905c0790k51780A27143L4916
13385A62059a52345G7013L8460h2557D10843J32024B60967A26803J01756J0001
$$ plain form
13465 345725 301786 565965 -81202 304618 302426 392159 312675 16484 137266 7448 -39716
13453 171394 148972 258223 153241 328590 341935 155169 73160 241572 265617 130648
13442 114719 341392 573293 350609 370488 343969 151133 401895 397948 -68744 143647
13431 437994 259881 6874 474647 264757 65778 -38055 431573 282136 258221 324448 311779
13420 311779 358924 168954 178511 242384 468785 21216 231869 211471 87865 41723 12279
13408 -6538 224076 153552 355888 20356 -12938 195994 74309 -149483 114353 -21908 141029
13396 83768 26156 137321 7923 239083 110812 250256 326161 -30790 -282570 127143 162059
13385 162059 -152345 77013 115473 -82557 410843 542867 260967 126803 228559 238560
13375B38560A00754K91105e8777C88507I2950b01104C47246r3623C0914J92389
13365B23303F5608L60531j03285j22226O6686n2859j01320l5921R9041E1971L30249
13354C82220C4357K39294j14511o5742M1792J03673R7146g369C06645i6949B99463
13342B83408G2042K02963C4832L66620o2807J36510A17326J9541D6772L90859
13332D37631D0219a20929A52466P1941b49C96027d6969o0583F0880P4834K556
13321A38270l1331J57018a8311C32500j61506a76126B41450p6254N1642k3951
13311A92887g5817C60113b54392A17025E7666N4701P5428l1182d3243B13589D7360
13299B70712A21726M7439j7068C4418e8540n4042J3646l00042a37700B32224f104
$$ plain form
13375 238560 100754 391859 -58777 388507 92950 -201104 347246 253623 30914 223303
13365 223303 65608 426139 322854 200628 267314 214455 113135 77214 176255 51971 382220
13354 382220 34357 273651 159140 93398 135190 238863 336009 -7369 306645 -96949 299463
13342 283408 72042 275005 34832 401452 338645 475155 117326 136867 46772 437631
13332 437631 40219 -120929 152466 224407 -249 396027 -46969 -107552 60880 135714 138270
13321 138270 106939 263957 -18311 332500 170994 -176126 241450 165196 216838 192887
13311 192887 -75817 360113 -254392 117025 57666 112367 187795 156613 -43243 213589 47360
13299 270712 121726 169165 152097 34418 -58540 -112582 -98936 -398978 -137700 232224 -6104
13287C38484A2862b25488C08764j12344a98979C3875M03231C6273J52345q509
13277A80109Q0170n3536J99165C0343J93332n4367p229d2427B30594h8095B05114
13265B16809B5549a42425c7060A90304e2675B19744D5300B057b6709C081a3542
13253A23513R3890o8758b1259F2136K1011K251J05055p32b95518a13699B83205
13241a74180B96981m5500A00445L07877F5330J76756E3659L28445A83707K42956
13231D26663q2765a55519B57557N6739J3499A58188a29774B61693K38044c9651
13220B2713J26663b51726D4975J31808d2839j88748h4116C58107A57255a47891
13209C77094r7030o7922k3267O4701F86K38147o7889C1877f2045B99364a84614
$$ plain form
13287 338484 12862 -225488 308764 196420 -198979 33875 437106 36273 188618 180109
13277 180109 260279 206743 405908 30343 223675 169308 162079 -42427 230594 -88095 205114
13265 216809 25549 -142425 -37060 190304 -52675 219744 45300 2057 -26709 3081 -13542
13253 123513 217403 148645 -21259 62136 83147 85398 190453 189721 -295518 -113699 283205
13241 -174180 296981 251481 100445 408322 65330 242086 53659 382104 183707 426663
13231 426663 343898 -155519 257557 314296 327795 158188 -129774 261693 499737 -39651
13220 22713 149376 -251726 44975 176783 -42839 -231587 -84116 358107 157255 -147891
13209 377094 280064 212142 188875 253576 686 238833 170944 31877 -62045 299364 -184614
13197b5268a449A55460C2678L28329j73328c4494a3735C9248a7789j64709B18386
13185I9465h4844j11965k9086G418J77382a2041J865D1930L19445A16957K80862
13174C97819q2142I1691L0462b22862C43933b3723B36093J63718G8485L1795a3534
13162D8690A9738J8675J06685J60303q3077b5136A9783c580D6857K11511A06159
13150B17309r4446J61629F8889K68329j34934a90605C01276J23229A84740a48412
13139C8261j3492j333c27619D17298A96858c3073j16486A83294G3868e0894A28185
13127g6712j0703J3509B4106K77904j45439J1353g6658o2513A85778a3925A42452
13115A76497k9340J22969R626p4497c16093G6779M2524K0819a43930C77711c24253
$$ plain form
13197 -25268 -1449 155460 32678 361007 187679 -34494 -13735 39248 -17789 -182498 218386
13185 99465 -84844 -196809 -225895 7418 184800 -12041 -10176 41930 361375 116957 397819
13174 397819 315677 91691 122153 -222862 343933 -23723 236093 399811 78485 110280 -13534
13162 48690 19738 38413 145098 305401 222324 -25136 19783 -3580 46857 258368 106159
13150 217309 122863 284492 68889 337218 202284 -190605 301276 424505 184740 -148412
13139 38261 24769 23436 -327619 417298 196858 -33073 -149559 183294 73868 -50894 128185
13127 -76712 -87415 -73906 24106 302010 156571 167924 -76658 -139171 185778 -13925 142452
13115 176497 147157 270126 279752 205255 -316093 76779 119303 140122 -143930 377711 -324253
13103a0504o449F323h5704E5722K05483j30507J44194A12223d15445c1792o6769
13092i8561I513J04893b8862C36888A49525c23361G5490P9568F5157a93583N9226
13081a34357G8460a96794E9257J25008a95243D06733H9929J3483b6952D3424b14340
13069a27493G5977J18046a3487j79387G862K8782J82036k7868B8938P8435D7293
13057E5909d0644B32812E7181J42838E0400i4654b5547F9297a94136C04625i8252
13045a54131D9658a85697C21574j55325b4515p4637b3619a249B04575C163a6131
13033I8228A0796a25551A95212h2130H8806b34183a4309B08519C4446b53521e9671
13021a54469A38077J50951f1581D8189B2400L39564A34290g4289C43780j41932
$$ plain form
13103 -10504 -16953 6323 -85704 55722 261205 130698 274892 112223 -415445 -31792 -98561
13092 -98561 9513 114406 -28862 336888 149525 -323361 75490 155058 65157 -193583 -134357
13081 -134357 78460 -196794 59257 184265 -195243 406733 89929 103412 -26952 43424 -214340
13069 -127493 75977 194023 -13487 -192874 7862 36644 218680 190812 28938 107373 47293
13057 55909 -40644 232812 57181 200019 50400 -94654 -25547 69297 -194136 304625 -98252
13045 -154131 49658 -185697 321574 166249 -24515 -99152 -23619 -1249 204575 3163 -16131
13033 98228 10796 -125551 195212 -82130 88806 -234183 -14309 208519 34446 -253521 -59671
13021 -154469 138077 289028 -61581 48189 22400 361964 134290 -74289 343780 201848
13011B01848Q567a00263B22587L2776b61504B67593N5434j45345a50189f1140
13000C71018A01968a23202j33630B2286L65162q9576C8480a87661d5137F026g7605
12988F3486Q9390m7980N4424a52889C1084J7387b4515C1644J40756B4682K81375
12977C06057a24166j92376J39569B921a38082d4461B0279J31312p2054b27079
12966A38868E7304J0500a63754C41916D6885a30374E18600b20842D0578a67117
12955G2496b9201E3625h8481A97851D0941K52597a95266A9360c38274A10622P233
12944A17855L5602b0919p1712C02363E4367a58669B58097K05495c34617A5492
12933g3474A92525D7751a2403A90938E3955L06293A33281i2108j01090F3853K43920
$$ plain form
13011 201848 210415 -100263 222587 255363 -261504 267593 323027 177682 -150189 -61140
13000 371018 101968 -123202 -256832 22286 387448 297872 38480 -187661 -45137 6026 -77605
12988 63486 152876 104896 159320 -152889 31084 48471 -24515 31644 172400 24682 306057
12977 306057 -124166 -316542 -176973 2921 -138082 -44461 20279 151591 79537 -227079
12966 138868 57304 67804 -163754 341916 46885 -130374 518600 -220842 40578 -167117
12955 72496 -29201 53625 -88481 197851 40941 293538 -195266 19360 -338274 110622 117855
12944 117855 153457 -20919 -92631 302363 54367 -158669 258097 463592 -334617 15492
12933 -73474 192525 47751 -12403 190938 53955 360248 133281 -92108 -193198 63853 307773
12922C07773g1940j05230Q5145A32294B3003J54182l8021i027D99427a99573A36201
12910a86670D7973d0725j84776C426a31683B35210D7150R5249L7088a2725C5337
12898a13087B5821L5571A6825c08593K3381b2694m2431B77768A10864O6264n9757
12887A17371B040L19870e2457k3720B9748a54816C58752H1969k9422J03754J91670
12876C47971E3094J34356m1942a33673p8240C39964r2184b15408c921B5652a07687
12864h4266D0571K8882b2961A54768O5844i9778b1530I9826f3557h63j51645B32164
12851g3784r6437E6555A5596a5070F036k74J63622H097a81809b4924E0555b21047
12838a92473g4943j25911N6910K4978K2200j01536a3550F3303b4400E0628Q9738
$$ plain form
12922 307773 -71940 -177170 -92025 132294 23003 177185 139164 -9027 499427 -199573 136201
12910 -186670 47973 -40725 -225501 3426 -131683 235210 47150 142399 179487 -12725 35337
12898 -113087 25821 61392 16825 -308593 -285212 -22694 -65125 277768 110864 177128 117371
12887 117371 2040 321910 -52457 -76177 29748 -154816 358752 81969 52547 156301 347971
12876 347971 53094 187450 145508 -133673 -211913 339964 247780 -215408 -3921 25652 -107687
12864 -84266 40571 69453 -22961 154768 220612 -99778 -21530 99826 -63557 -863 -152508 232164
12851 -73784 -170221 56555 15596 -15070 6036 5762 169384 8097 -181809 -24924 50555 -221047
12838 -192473 -74943 -200854 -143944 -118966 -96766 -198302 -13550 63303 -24400 50628 140366
12827A40366k7858J91668G6958k4973J75494a8250C5655c86685J34537J5669e7122
12815b93387b3699j10328F1197K23172i802F8261f5366B57757i6605q2510e3392
12803A83538a94734A69896D7056J53327g1704L092p6883H606M3922h5400E9576
12791F2140k0185e4061F0675c68360H8472e6293C8815J60188c04780F6854d2470
12779a72397D5653a12483i516k42878C20996g033k40434A6256P649J1161A6945
12767B16548G9668a99537A9825K05170r2120a60297J3703a2416B33936F8855R2115
12756A60970a92521A88491a13163A13395l824K13237b7466A68839d7820q3886
12746a31706A26136a71760j0595A26797B1869O1503d9042j2968K4430J7613k60053
$$ plain form
12827 140366 112508 304176 76958 51985 227479 -18250 35655 -386685 -252148 -236479 -57122
12815 -293387 -23699 -134027 61197 284369 -9802 68261 -65366 257757 -96605 -179115 -53392
12803 183538 -194734 169896 47056 200383 -71704 -68612 -145495 8606 52528 -85400 59576
12791 62140 41955 -54061 60675 -368360 88472 -56293 38815 199003 -304780 66854 -42470
12779 -172397 45653 -112483 -9516 -252394 320996 -7033 -247467 16256 23905 35066 16945
12767 216548 79668 -199537 19825 224995 132875 -160297 -146594 -12416 233936 68855 160970
12756 160970 -192521 188491 -113163 113395 109571 322808 -27466 168839 -47820 -131706
12746 -131706 126136 -171760 -182355 126797 21869 83372 -49042 -62010 -37580 -19967 -280020
12735b80020B44820R2448e2586E5728a11974I814h2687j62007G1249a38302k57884
12724c96186C15264A38993D886J25725J14559a76765A54188g090B79370C603j412
12713B191a8988H2083a0260o8343I2544K65559D7097M13542C1453i1237j866C87869
12700f6433a0104j78413j10673L8542A52687E9583R2473c01792a8902A48833i3473
12688a25364A42829o9273B1678K45572o9456a78744B47048q9370p7378N6283K90512
12677D27095H2841J11777j1835b92789A67552a23662A72816a66745E2066a68501
12666G7157c09807D9256a44861F9894a6942B19726m5854P1203f9279H5468J33547
12655B19015h2446k7948B36012H9935N3164a7126E2104a51481r0717A01484L8713
$$ plain form
12735 -280020 244820 337268 -52586 55728 -111974 9814 -82687 -244694 71249 -138302 -396186
12724 -396186 315264 138993 4886 130611 245170 -176765 154188 -7090 279370 3603 2191
12713 2191 -18988 82083 -10260 -78603 92544 358103 47097 460639 31453 -91237 -93103 387869
12700 -66433 -10104 -188517 -299190 -260648 152687 59583 152056 -301792 -18902 148833 -93473
12688 -125364 142829 73556 21678 267250 197794 -178744 247048 157678 80300 136583 427095
12677 427095 82841 194618 182783 -292789 167552 -123662 172816 -166745 52066 -168501
12666 77157 -309807 49256 -144861 69894 -16942 219726 173872 245075 -69279 85468 219015
12655 219015 -82446 -110394 236012 89935 143099 -17126 52104 -151481 -242198 101484 140197
12644A40197a89340b8809C18230o3515c4565l23340H169J74650b32710B08270
12633C53108h8235A57773L87772A42377B7184m430J34869E0916Q336a35515a7352
12621A37100a4134A98336b0261G9107c53584B06232J70852d13864A09165c89340
12610H2855K54412H9236a4297D6359A9833a28158D44793d7591G8717K68965j59036
12599A88646D687g6146A47499E3439a05373m9074A48077b41373d4739A55614Q3825
12588B39439a65240E9029k1014N19990A42895N3951I785b00628B39206C956e5618
12576A42053a44072A89919c7853A53399f2892E6431M13A0954J43356a52930p997
12565a60927a4597A64315f1796A47241Q1789e5157A9470e2373C08067H2237C8362
$$ plain form
12644 140197 -189340 -28809 318230 254715 -34565 -357905 8169 182819 -232710 208270
12633 353108 -88235 157773 545545 142377 27184 22754 157623 50916 59252 -135515 -17352
12621 137100 -14134 198336 -20261 79107 -353584 206232 377084 -413864 109165 -389340
12610 82855 337267 89236 -14297 46359 19833 -128158 444793 -47591 78717 347682 188646
12599 188646 4687 -76146 147499 53439 -105373 -154447 148077 -241373 -44739 155614 239439
12588 239439 -165240 59029 38015 558005 142895 196846 9785 -200628 239206 3956 -55618
12576 142053 -144072 189919 -37853 153399 -62892 56431 56844 10954 154310 -152930 -160927
12565 -160927 -14597 164315 -61796 147241 229030 -55157 19470 -52373 308067 82237 38362
12553e7574F1381j5958a49073L7136C2375P9160J17656I3589f63189c30316c7216
12541b56960C8806b2379k10640A48555c1451A61039F1844b65485A21032m0749
12531H0283a54624H6227a66203m6699g7C22022i84A609d7636B36617f7980j5115
12519h3095A30863n5976A4982e0216C4599J35092k2792c27987d0289j17905C02913
12507i2285n8091I5437a90030Q8948m6666B52261A8517d9789G2031a95214A66446
12495A09344a17723I6531L8675a53385A6024a33363H8750a26832n1954G0194J85747
12484B55941c05905A11575R1989d0977l6239B49290j15232D6831j9639a0081A25688
12472B11460f3260j17000f4879m6846H954d3634j15355A71751J79880A20895m495
$$ plain form
12553 -57574 61381 45423 -149073 -111937 32375 111535 229191 93589 -663189 -330316 -37216
12541 -256960 38806 -22379 -233019 148555 -31451 161039 61844 -265485 121032 80283
12531 80283 -154624 86227 -166203 -212902 -77 322022 -984 1609 -47636 236617 -67980 -83095
12519 -83095 130863 74887 14982 -50216 34599 169691 146899 -327987 -40289 -158194 302913
12507 -92285 -150376 95437 -190030 -101082 -147748 252261 18517 -49789 72031 -195214 166446
12495 109344 -117723 96531 135206 -153385 16024 -133363 88750 -126832 -178786 70194 255941
12484 255941 -305905 111575 203564 -40977 -77216 249290 134058 46831 27192 -10081 125688
12472 211460 -63260 -180260 -64879 -111725 8954 -43634 -158989 171751 351631 120895 116400
12461A16400B317O3126O0606d80219A15809L6564i7133D9645J1766h0901A10899
12449A44988J43308j35193p3472i7632B20477a62308P8345d0981q0372M0051J4300
12438f7002F4543a00872B42128r4510a69580j00768A35892g6023F0394A7379a09631
12426a6175G3912d6901j79012j71104f1246A08763a559C1755K2346e6337m2203
12415i8540H0078J17741a46519j1227j31452B19718D1387J1270A1692a28032o4066
12404a92098I0658b32985C15537G387N7269Q6976o2525a04214D4981N1334K2615
12393A18930C6545i6403l0148a2980F6562M8170B5427n042J6677b41832j88541
12382d30373B59076b11220A15811O2370a78636B25260c48683e5439F7305k8624
$$ plain form
12461 116400 2317 65443 126049 -480219 115809 152373 -97133 49645 61411 -80901 110899
12449 144988 288296 153103 79631 -97632 220477 -162308 -83963 -40981 -121353 -81302 -67002
12438 -67002 64543 -100872 242128 147618 -169580 -270348 135892 -76023 60394 17379 -109631
12426 -16175 73912 -46901 -225913 -397017 -61246 108763 -1559 31755 54101 -56337 -98540
12415 -98540 80078 197819 -146519 -157746 -289198 219718 41387 52657 11692 -128032 -192098
12404 -192098 90658 -232985 315537 7387 64656 151632 89107 -104214 44981 96315 118930
12393 118930 36545 -96403 -126551 -12980 66562 114732 25427 20385 37062 -241832 -430373
12382 -430373 259076 -211220 115811 178181 -178636 225260 -348683 -55439 67305 38681
12372C8681a69749A92009p8614j6274d6645B40758i4110k18656g7329j38172K8035
12361a87466A09558a35634E058b43308B98913i8027E5689k6900b25139c9534k57499
12350b97033G4880d15896b4534D2819f8752G9024a09820B23790d35142A53299
12339e7540A35349B7813i9781C02508A45997C2407R4065L71765a07988B93358
12328a75360A05474b61959J11772J2107B60011a61919E1542e0347k63994B27366
12317f6126A7781J10177J2021f7731B3554a49158L8853k8145e2790B61398g83
12305a14710N4942k64610M5685c3212G819J11223e3050b1299j76803A56970Q5633
12294B42603d5116A13714k4142A4080b75197B13823p2399J73459j52419E6701
$$ plain form
12372 38681 -169749 192009 113395 97121 -46645 240758 -94110 -312766 -77329 -215501 -187466
12361 -187466 109558 -135634 5058 -243308 298913 -98027 55689 28789 -225139 -39534 -297033
12350 -297033 74880 -415896 -24534 42819 -68752 79024 -109820 223790 -435142 153299
12339 -57540 135349 27813 -99781 302508 145997 32407 126472 498237 -107988 293358
12328 -175360 105474 -261959 -150187 -138080 260011 -161919 51542 -50347 -314341 227366
12317 -66126 17781 127958 139979 -67731 23554 -149158 -110305 -138450 -52790 261398 -783
12305 -114710 -59768 -324378 -278693 -33212 7819 119042 -53050 -21299 -198102 156970 242603
12294 242603 -45116 113714 89572 14080 -275197 213823 141424 314883 162464 56701
12283E0704b37761A34248Q4473e4804j35258j422D11088j54691d4703E2427j9246
12272C3181K12862b45713f3159C07240a52904D54374b13008N8682A18623b67115
12261e4667E1313E510a64098M5611C90634A63627c68508a3698B85813E4771L4347
12250H9118Q7386p2946I429L4310e2047o5195j47028B66109r5232D9490L67889
12239D17379j42242a31834C43522j45066o3925J33494A4014M021J846J06639N305
12228A31825g224C0793N11160A51805O3999C462J80880g8071C84210D5337d23953
12216F0692J15011a22683h714B91374A37421J31510J86214a77323D98436A72861
12205B07061a25469B7801K77320n8022R0933h4969b0714B05802J50j6874b6986
$$ plain form
12283 50704 -237761 134248 218721 -54804 -190062 -191484 411088 256397 -44703 52427 33181
12272 33181 246043 -245713 -63159 307240 -152904 454374 -213008 -154326 118623 -267115
12261 -54667 51313 5510 -164098 -118487 390634 163627 -368508 -13698 285813 54771 89118
12250 89118 176504 103558 9429 43739 -52047 -117242 -264270 266109 170877 49490 417379
12239 417379 275137 -131834 343522 198456 134531 268025 14014 18035 19881 126520 131825
12228 131825 -7224 30793 541953 151805 215804 3462 184342 -78071 384210 45337 -423953
12216 60692 175703 -122683 -8714 291374 137421 268931 455145 -177323 498436 172861
12205 207061 -125469 27801 305121 247099 338032 -84969 -20714 205802 205952 189078 -26986
12193C96154r3387b0631B26359B3145a01648d1348B89736e994A11844K9590J20055
12182B61489f4055F8144a4256A05736a01918H8468i0279A23637M2251M7936b6558
12170C63463h8176A5273J00991J59660B8947Q3398J40540j14738M7839d7506F5613
12158a75581B65657P1891b29495E0942f6675k6230B40856A04668l4469a88806
12147A51241K51757p6667j03567A3928J747R0678l1J25459l0698J15065b04435
12135B20339a13272I0961J23399O5592a04083A76984J28738h3119H1198K45204
12125C26402i9399A19222a02300a5156A29493D1763P5786a6186A04471a65603
12114b3942o1078J92k654B023a00758B6968P5452l106J10743f0967j16066e462
$$ plain form
12193 396154 302767 -20631 226359 23145 -101648 -41348 289736 -5994 111844 141434 261489
12182 261489 -64055 68144 -14256 105736 -101918 88468 -90279 123637 165888 213824 -26558
12170 363463 -88176 15273 116264 275924 28947 112345 252885 138147 185986 -47506 65613
12158 -175581 265657 337548 -229495 50942 -66675 -92905 240856 104668 70199 -188806
12147 151241 402998 326331 222764 13928 15675 106353 106322 231781 201083 316148 -204435
12135 220339 -113272 90961 214360 279952 -104083 176984 305722 -83119 81198 326402
12125 326402 -99399 119222 -102300 -15156 129493 41763 117549 -16186 104471 -165603
12114 -23942 -85020 -84828 -87482 2023 -100758 26968 102420 99314 210057 -60967 -177033 -5462
12101e14093F0002Q630A348d5494E6646a34826B37359b07306F0117a14921N5726
12090e9195F7261B355a35554E5394J1383K37846B4858b35594G0234a50628F2862
12078A7338J19574M5284j2407a35605d5036A47306C6412A2841a31871M5499m2137
12067a28509D2577b5017B40511J6978j9708J41434K31660k00751j85072B7937
12056B28182q9919D2318a299o6630C05242O4041b5536B44057C0973b73389f3633
12044C4832b2644l77D638d4555n2487B11289a86484C10783j44920g6841n6970
12033a33811D7496J30080p3156q286J85127I1558a45845o7047i742k6018B25484
12021i256k90467C5728g6101k11470A50618a33464A01096l7983J06174i9535B34794
$$ plain form
12101 -514093 60002 68632 1348 -45494 56646 -134826 237359 -207306 60117 -114921 -59195
12090 -59195 67261 2355 -135554 55394 66777 304623 24858 -235594 70234 -150628 62862
12078 17338 136912 182196 169789 -135605 -45036 147306 36412 12841 -131871 -86372 -128509
12067 -128509 42577 -25017 240511 257489 237781 379215 610875 410124 225052 27937
12056 228182 138263 42318 -1299 -67929 305242 369283 -25536 244057 30973 -273389 -63633
12044 34832 -22644 -23021 4638 -44555 -97042 211289 -186484 310783 165863 -76841 -133811
12033 -133811 47496 177576 104420 96134 281261 91558 -145845 -212892 -9742 -35760 225484
12021 -9256 -299723 35728 -76101 -287571 150618 -133464 101096 63113 169287 -99535 234794
12009D6673J98765A04234M494b59252B6754h7791B89028b15834F2158a31365r0194
11998b21559P2598j14675B29709d6774F8550d5031j83464q6052L4963A16020b08696
11986B38206C7629a39519F318f2766o0482j59773a17550j37717A1858a45085A02221
11974B00020A7371f544A66582a85662A88657b09373b7425j33591a1254l19687
11964c30941J20636e3590k96986Q3817A61467c01767B6589g9267j8687B34939
11953A64798b78223A33198J39352G1843J40377a40759o980L2018g957p5666p0021
11942a53644g1690k5103K1688j20507d8591A00328c39441a05779B62450e6234
11931C1297b31128B60115G64O2950d0623o7342j6060G3588B074a79372A98894
$$ plain form
12009 46673 245438 104234 108728 -259252 26754 -87791 289028 -215834 62158 -131365 -221559
11998 -221559 -148961 -263636 229709 -46774 68550 -45031 -228495 -314547 -279584 116020 -208696
11986 238206 37629 -139519 6318 -62766 -123248 -283021 -117550 -255267 11858 -145085 102221
11974 200020 17371 -6544 166582 -185662 188657 -209373 -27425 -161016 -11254 -330941
11964 -330941 -210305 -53590 -350576 -266759 161467 -301767 26589 -79267 -97954 234939
11953 164798 -278223 133198 272550 71843 212220 -140759 -147739 -115721 -7957 -83623 -153644
11942 -153644 -71690 -96793 -75105 -195612 -48591 100328 -339441 -105779 262450 -56234
11931 31297 -231128 260115 764 63714 -40623 -107965 -124025 73588 2074 -179372 198894
11919A97678M0916B7040a71292g7760k7258A27171g9544j63297j96954C0968a24406
11907B50797b21346J0777F5256a58335A125b62452c3302G3290B4558K68462H6033
11895G3149j5567J37891k9949j4840a49624N9139E6060L5297e8593A54893A4328
11883g1833j19825k23912b3282q1772L3741G6412b47827i9523d1694D1698c15015
11871b08159P8930K3618l6579b8076m3847p5175C0015a69567J2125D5841e4175
11859a7081j46150F0049J8717c40014A57900j1445D6091b04249P9254B3643c8028
11847B75253r2293i1122n3943e1584j47199A91725r4833L012l7820e45475A75225
11835b6630j97190h376l662j83444j5792d717E7041h8663A26608a76424f1447
$$ plain form
11919 197678 238594 27040 -171292 -77760 -105018 127171 -79544 -242841 -439795 30968 -124406
11907 250797 -221346 -210569 65256 -158335 1125 -262452 -33302 73290 24558 293020 86033
11895 73149 57582 195473 165524 150684 -149624 -90485 56060 91357 -58593 154893 14328
11883 -71833 -191658 -415570 -23282 -105054 -71313 76412 -247827 -99523 -41694 41698 -315015
11871 -208159 -129229 -105611 -142190 -28076 -71923 -147098 30015 -169567 -157442 45841 -54175
11859 -17081 -163231 60049 78766 -340014 157900 146455 46091 -204249 -124995 23643 -38028
11847 275253 182960 -91122 -145065 -51584 -198783 191725 96892 99904 62084 -545475 175225
11835 -26630 -223820 -8376 -12038 -195482 -211274 -4717 57041 -88663 126608 -176424 -61447
11823A51116R8930b3362A14243a97887j14902A44453n9881A3574i9756A98812
11812a3268D8362L9739Q4941g1234B923J86147F817M1360J29084P0616c80667
11800c05127f5070r6969F7765R2201d52686C8332b56433B5346J2043a87041E2664
11788f6329m7602q6387A23251e4384K4821H9289a91499F9072b30595C34354A19006
11776a45676f672n0395B20948b39528l4944A15014a55816A65382b74460B54690
11765a6547j6684j69841a0677A8779K8580a13088M4263m1536b1619L581j68654
11754a86692Q8708F5508c41227a1053l0813G0228a02959j23456a01409d4321J0812
11743c3509l17783A1180b64242H4662h8516c5201J0002Q503j84314b7690j13986
$$ plain form
11823 151116 250046 -23362 114243 -197887 -312789 144453 84572 13574 -99756 198812
11812 -13268 48362 88101 173042 -71234 2923 189070 6817 48177 177261 247877 -380667
11800 -305127 -65070 -162039 67765 159966 -452686 38332 -256433 25346 37389 -187041 52664
11788 -66329 -113931 -200318 123251 -54384 -29563 89289 -191499 69072 -230595 334354 119006
11776 -145676 -6672 -57067 220948 -239528 -274472 115014 -155816 165382 -274460 254690
11765 -16547 -33231 -203072 -10677 18779 47359 -113088 -68825 -110361 -21619 -18038 -186692
11754 -186692 -97984 65508 -341227 -11053 -41866 70228 -102959 -226415 -101409 -44321 -33509
11743 -33509 -351292 11180 -264242 84662 -88516 -35201 -25199 -16696 -201010 -27690 -141676
11732a41676B78482e2899r9012d6664e669C15269H323L8631j8437b59565M8497
11721b11068N1486B2767c9765j13282j97088a44802L4724A59848A4372O2323a69234
11709e81920A71622Q5454i2387j8065k02338A44170c25575g2396A66444E0899
11698A16506J38245J13423a14084A44485l4010k8812Q8574O1486a97813q9808
11688b87621F6150a52957e3914B51255b39764A74025b0171F8517A0261a66512
11677B10160l6774q5600L13135c7732a062A61361a68152l63972A02311i4213J4726
11666g9487q3428e7459B46350c09019h6681B66204a81603h9767C6191M7024d7348
11654F7878P1887b6859D24578a00615j76456J15693m6575A36856a40545G0657
$$ plain form
11732 -141676 278482 -52899 -151911 -46664 -5669 315269 8323 46954 28517 -259565 -211068
11721 -211068 -159582 22767 -39765 -153047 -350135 -144802 -110078 159848 14372 76695 -169234
11709 -581920 171622 257076 -92387 -110452 -312790 144170 -325575 -72396 166444 50899
11698 116506 254751 368174 -114084 144485 110475 81663 170237 231723 -197813 -287621
11688 -287621 66150 -152957 -53914 251255 -239764 174025 -20171 68517 10261 -166512
11677 210160 173386 87786 400921 -37732 -1062 161361 -168152 -532124 102311 -94213 -79487
11666 -79487 -162915 -57459 246350 -309019 -86681 266204 -181603 -89767 36191 83215 -47348
11654 67878 139765 -26859 424578 -100615 -277071 -161378 -207953 136856 -140545 70657
11643i1049A86710a24589E9864j5648b6077j47593Q4491c3191I358b8920q7570
11632a16490j05434A85365G6549a46406F5005M9487b94946D2589J88736m5516
11622A85809j0715b19959A30147o2540N2979M03589a20317A64915C0300L27436
11612C57736a54921A35087b56417K9111f1363A8375a36575e3679o860n5840j98113
11601c14492a00738j7301N7973B17565G424K06354m7879h7706l9842d0502k78685
11590c19187A16301B2022b0957B83607D0166A4391a48020B30319J53384c082B53316
11578A10142a11747A28047F1997a41136A98049b17075A37827j3406b9156H957
11567B04407r4369b9310A92717b56422J02252D695b83407f8862B59425a32427
$$ plain form
11643 -91049 186710 -124589 59864 44216 -26077 -173670 -89179 -33191 9358 -28920 -116490
11632 -116490 -221924 185365 76549 -146406 65005 114492 -294946 42589 231325 185809
11622 185809 175094 -219959 130147 67607 120586 524175 -120317 164915 30300 357736
11612 357736 -154921 135087 -256417 -227306 -61363 18375 -136575 -53679 -60539 -116379 -314492
11601 -314492 -100738 -118039 -60066 217565 7424 213778 165899 -87706 -127548 -40502 -319187
11590 -319187 116301 22022 -20957 283607 40166 14391 -148020 230319 383703 -3082 253316
11578 110142 -111747 128047 61997 -141136 198049 -217075 137827 124421 -29156 8957
11567 204407 110038 -29310 192717 -256422 -154170 4695 -283407 -68862 259425 -132427
11556H7826L51786d6314H7837Q1340f5105A61884p1619a0190p0894L3429F4210
11544C21373A5078K53727A03700l864a911A9599N5359L30869r3176m499b1519
11532b58197L7378A94673A8937R2369a26496o4710B70958h2240B41161l4735b1713
11520a69632n7497A5365J07639C8221D578a39303A64438M65965A52291b88488
11509A47521e0511F2402L6938l5922a04160B21613P082a4791D06696h4377A22021
11497E3867O3974a14244J7053A11483l8928a64145I188K7462K99468A25154A8232
11485F9673a76597B28415r1284A8600K51259m9490J14105a33615A87646Q208a73263
11473A3268J43539a01189H000c47811a73708B51650I3986f4048A11910Q828K32403
$$ plain form
11556 87826 439612 -46314 87837 169177 -65105 161884 90265 -10190 -81084 -47655 64210
11544 321373 15078 268805 103700 99836 -1911 19599 74958 405827 312651 308152 -21519
11532 -258197 -220819 194673 18937 111306 -126496 -191206 270958 -82240 241161 206426 -21713
11520 -169632 -227129 15365 123004 38221 4578 -139303 164438 630403 152291 -288488
11509 147521 -50511 62402 99340 63418 -104160 221613 228695 -14791 406696 -84377 122021
11497 53867 117841 -114244 -97191 111483 72555 -164145 9188 36650 336118 125154 18232
11485 69673 -176597 228415 137131 18600 269859 220369 334474 -133615 187646 195854 -173263
11473 13268 156807 -101189 8000 -347811 -173708 251650 93986 -64048 111910 120738 353141
11462C53141A13784J50887a03783m35812A22202m0736b54555b6922C10109c5474
11451B12140j00904K81649D675K8142a40063M2622A08760h6278A327K5349K34841
11440B61517a22115A21502l6573c8251q6721N9340j96634b130k768r3090a9240
11428A85230p0337a67589L513L6613j09048E5444c49511d1044A19881K46106a80315
11416A26094a54057B03488c55595J15325j13596f2020N951A21879D3436K84567
11406C28003a76696B24329N4319J7134A34057b40582B34584G2418K37219A33150
11395d3468m2361B03400C4461J07217b08286C637b18971M5156N3711a497q2854
11384h4351B01303a19151l47430B09699C4045h3421H1345c8306q1732F699N9453
$$ plain form
11462 353141 113784 264671 -103783 -539595 122202 81466 -254555 -26922 310109 -35474
11451 212140 111236 392885 4675 32817 -140063 -97441 108760 -86278 1327 26676 261517
11440 261517 -122115 121502 84929 -38251 -124972 -65632 -262266 -2130 -4898 -97988 -19240
11428 185230 114893 -167589 -164076 -127463 -236511 55444 -349511 -41044 119881 365987 -180315
11416 126094 -154057 203488 -355595 -240270 -353866 -62020 -56069 121879 43436 328003
11406 328003 -176696 224329 278648 295782 134057 -240582 234584 72418 309637 133150
11395 -43468 -85829 203400 34461 141678 -208286 3637 -218971 -173815 -120104 -1497 -84351
11384 -84351 201303 -119151 -466581 209699 34045 -83421 81345 -38306 -120038 6699 66152
11373F6152O1650a16329A68325O3970J07619e6916K02c257m1681i669A84408B0943
11360d7796D5344j3659j2010a2137p419j94470j55494q0346C2171A5127Q4134
11349I9261B4810a76873k6847l3251H3137K48269l8187c20714a08614o9484A39520
11337i7449b1623B9243b57662A10644J6893R1222j06812d3584l7558J034j4233
11326i4341j3586E3034g9572G6619h5016b7352A17293n8612e8462I1412b01852
11314d6797D940R4629h9637l8672d1751k06214g0168b1864p4524M5491C1558c25107
11301a83960D4812J32992K21350q4003H425a45009N9449A2894f1457A71293q4227
11290H7066c68399G9253J08794h0130A36886M7643b26658B32397F7834d40367
$$ plain form
11373 66152 127802 -116329 168325 232295 339914 -56916 -56714 -3257 -44938 -9669 184408 20943
11360 -47796 45344 31685 19675 -12137 -19556 -214026 -369520 -449866 32171 15127 99261
11349 99261 24810 -176873 -203720 -236971 83137 331406 293219 -320714 -108614 -178098 139520
11337 -97449 -21623 29243 -257662 110644 127537 218759 111947 -43584 -81142 -80108 -94341
11326 -94341 -107927 53034 -79572 76619 -85016 -27352 117293 58681 -58462 91412 -201852
11314 -46797 4940 99569 -89637 -128309 -41751 -247965 -70168 -21864 -96388 -50897 31558 -325107
11301 -183960 44812 177804 399154 315151 8425 -145009 -85560 12894 -61457 171293 87066
11290 87066 -368399 79253 188047 -80130 136886 184529 -226658 232397 67834 -440367
11279c4001E2065o735a95600O5204k721j61917J35197b5349j89797A34072A121
11267A04766b81990e0240B65594c19180J58821D3709g5193B78471d4079m023k60326
11256c08428A31309b28887d312j45872j5984a7687j1088k76213b5192r9603D3951
11244B48592d8894a5446k54238G6261h773k2229j8144A80926E5728K92709E1150
11232b2001H2633N7660b93009b4950B22582a75405l2229g9779L2608n8547C58741
11220H1272J12296c6989j60698L0478e7319j97511I0038g3650K1635m5171m306
11209a01492c0945k15594c3294B28670b81031a19396l4149j34075D4040b25003
11198g8854L8344j84621b2602L713B48544l8562b53235A6713c35112J67403L3761
$$ plain form
11279 -34001 52065 45330 -195600 -130396 -133117 -295034 -159837 -25349 -215146 134072 1121
11267 104766 -281990 -50240 265594 -319180 -160359 43709 -75193 278471 -44079 -48102 -308428
11256 -308428 131309 -228887 -4312 -150184 -166168 -17687 -28775 -304988 -25192 -124795 43951
11244 248592 -48894 -15446 -269684 76261 -8773 -31002 -49146 180926 55728 348437 51150
11232 -22001 82633 140293 -293009 -24950 222582 -175405 -207634 -79779 -47171 -105718 358741
11220 81272 193568 -36989 -197687 -167209 -57319 -254830 90038 -73650 -52015 -97186 -101492
11209 -101492 -30945 -246539 -33294 228670 -281031 -119396 -153545 -287620 44040 -225003
11198 -78854 -40510 -225131 -22602 -18889 248544 209982 -253235 16713 -335112 -167709 -133948
11187a33948m1949f4073F0863J74678j6495c7790j7619A17066J08774a86025g4521
11175b5545B42391E1773j4101a11111d9947E2474g0958A1256N9740K68288d032
11163d78280b09966q9667G9265C0919J61875C5163d67859g0882a5770q7119A0074
11151e8025n3079q675l19225a38473c8846C14233A4988h9227a9436D8663M9421
11140I8084K34434F091a97609j53635A86831L5534C3195n663a43984B30204A4062
11128B6940o66h6105k0039E2750G703d04697a51245j17416A07584M4300d7287
11116A87080e674j85853N1408A25056C3043b20993A09586M3565A4381a21389B54258
11104a28579c3396k6764C22284g6124B12165d8737j98026A17554k0483Q4665J31921
$$ plain form
11187 -133948 -175897 -64073 60863 235541 219046 -37790 -55409 117066 225840 -186025 -74521
11175 -25545 242391 51773 37672 -111111 -49947 52474 -70958 11256 70996 339284 -4032
11163 -478280 -209966 -299633 79265 30919 192794 35163 -467859 -70882 -15770 -102889 10074
11151 -58025 -111104 -119779 -439004 -138473 -38846 314233 14988 -89227 -19436 48663 98084
11140 98084 332518 6091 -197609 -351244 186831 222365 33195 27532 -143984 230204 14062
11128 26940 26274 -86105 -106144 52750 7703 -404697 -151245 -268661 107584 151884 -47287
11116 187080 -5674 -191527 -140119 125056 33043 -220993 109586 153151 14381 -121389 254258
11104 -128579 -33396 -60160 322284 -76124 212165 -48737 -246763 117554 97071 181736 313657
11093C13657A35594b61136C72202b62743A56654a54193A2092e7881D20541G7968
11082F4329J63147I0553C7328K55101N8916A31927e4348B56081n1842J8944h7698
11070I7913P142K74242K49773B77355G8813K14188I0771L5052m4789K03475j9616
11059B64893n0981J01261n0911J83657F3001J64828K18464k9926m7751j37955
11049B30661K67192l4951N7201k09121L44176j07256B20303k0924J57853J92337
11039E49569j80523m6984J96307A24049J32604M80241j02644B02652K77210k1366
11029D58496j17267q3841K40930Q4862j92640A72567N98449j68127B85042I3815
11018C64625F8123M23845o4068k2087A20119K91894a52295C16599J46452A95212
$$ plain form
11093 313657 135594 -261136 372202 -262743 156654 -154193 12092 -57881 420541 77968
11082 64329 227476 90553 37328 292429 351345 131927 -54348 256081 204239 223183 -87698
11070 97913 105055 379297 629070 277355 78813 293001 90771 125823 81034 284509 264893
11059 264893 213912 315173 264262 447919 63001 227829 446293 416367 368616 230661
11049 230661 497853 462902 520103 310982 655158 547902 220303 199379 357232 549569
11039 549569 369046 322062 518369 124049 256653 736894 634250 202652 479862 458496
11029 458496 341229 257388 498318 583180 390540 172567 771016 602889 285042 93815
11018 364625 68123 491968 427900 405813 120119 412013 -152295 316599 463051 195212
11007C67872L09790k9176A93845R4714K30822j69569A32011J94343J6817K26067
10997E69238J1634j68561M2659L73899B30211Q0499l1768j28499J61436J47185
10987D59064K9494M6923J66901L7020C34507L37923o9659K51029n7397q7046l0233
10976F79124k53540O26693N1409j17942J39791R7121L9193K08358J49492Q1778
10966A701477L0942j51170k6849J09073m36973J93518j07711n7292m98672J24832
10956H81175L08646J88878k0037l48910P538K96907j64992l91932J60633l1784
10946H86122k73602A64329O78070D15046A64957J4556B8566J68688r8474J79920
10936B78700G9484R867D0055P9889K8591r389J9693f8222j14207B00907I2431
$$ plain form
11007 367872 677662 648486 193845 288559 519381 349812 132011 326354 343171 569238
10997 569238 580872 412311 454970 828869 230211 310710 278942 150443 311879 459064
10987 459064 488558 535481 702382 739402 334507 672430 602771 853800 796403 709357 679124
10976 679124 425584 1052277 1103686 985744 1125535 1222656 1261849 1470207 1619699 1701477
10966 1701477 1732419 1581249 1554400 1663473 1226500 1420018 1312307 1255015 756343 881175
10956 881175 1189821 1378699 1358662 1009752 1017290 1314197 1149205 757273 917906 886122
10946 886122 612520 164329 842399 415046 164957 179513 28566 197254 98780 278700
10936 278700 79484 89351 40055 119944 148535 139146 158839 -68222 -182429 200907 92431
10924C78193I4081a68932B15213r0289a1013A73578f0903e300l81537A9711e0801
10912d5918J5636n2476B43764a7045o7317E3017A693a55362C875a26703C0947
10900a37017C6678O294Q382a18018C1906L4852K5414a11169N3823r8543d5922
10888G6518a43826I6890b38230A32233b70087J7773J3285E3767J60145c33400
10877g7873a1863r3349a5013k26697q8203e6468A18832a15962m1237B4075c8736
10865D8317L3700M6004o2594d309B77661A2602a01379H281b32811A73379G9706
10853A96726e3925j8500m3564j33618F9560d8089k75085a09632j82690N6694a02844
10841I4541a30514k05598B0421N9227B8071m294a07145k0550A30444b1884K232
$$ plain form
10924 378193 94081 -168932 215213 124924 -11013 173578 -60903 -5300 -386837 19711 -50801
10912 -45918 -30282 -82758 243764 -17045 -84362 53017 1693 -155362 3875 -126703 30947
10900 -137017 36678 42972 51354 -118018 31906 66758 92172 -111169 -57346 -155889 -45922
10888 76518 -143826 96890 -238230 132233 -270087 -252314 -239029 53767 213912 -333400
10877 -77873 -11863 -105212 -15013 -241710 -329913 -56468 118832 -115962 -157199 24075 -38736
10865 48317 82017 128021 65427 -4309 277661 12602 -101379 8281 -232811 173379 79706
10853 196726 -53925 -72425 -115989 -249607 69560 -48089 -323174 -109632 -292322 -235628 -102844
10841 94541 -130514 -336112 20421 79648 28071 23777 -107145 -127695 130444 -21884 -19652
10830a9652A24547m8982h6858l8509b3917E2586i4935l5158j86073f1366E1896
10818D3042b82821A57775n5070l7859c02906M4163j16757a66799j72527A33003
10807i2323d1761g936q1307A81564i0753j34940j36427B65985p594c4160F4665
10795E9456J80046A6287K5304a82118q8908G3797Q3499M2325N2792c9047C5539
10783a70161E3101h3724I2696D1058J12644a8229A77329q013J05907F432g6519
10771C8754J06774K16916A43436a41440A00000g482j83927C1770c2842r7090b1078
10759b69524h1889k81785J46015O1442n6379e2053A91856I3960c85125J92340
10749a92785f5213k61743P1484a13998N4082B33751a99653l0989i0940J1520E7833
$$ plain form
10830 -19652 124547 75565 -86858 -125367 -23917 52586 -94935 -130093 -316166 -61366 51896
10818 43042 -282821 157775 102705 64846 -302906 -258743 -375500 -166799 -339326 133003
10807 -92323 -41761 -7936 -89243 181564 -90753 -225693 -362120 265985 258391 -34160 64665
10795 59456 239502 16287 41591 -182118 -271026 73797 157296 199621 252413 -39047 35539
10783 -170161 53101 -83724 92696 41058 153702 -18229 177329 169316 275223 6432 -76519
10771 38754 145528 362444 143436 -141440 100000 -7482 -191409 31770 -32842 -129932 -21078
10759 -269524 -81889 -363674 -217659 -156217 -212596 -52053 191856 93960 -385125 -192785
10749 -192785 -65213 -326956 -255472 -113998 -59916 233751 -199653 -230642 -90940 -79420 57833
10737b65814a14449j45036f1398F7832a36276d0556A57549C5321a89008n1572
10727b40580Q3889f2155j08529H6625J10746A929b87610a20894p168j97677A57552
10715a66301A68095b37978k30446D5102a94316C05198c6614m02288c4677G3106
10704A26876g9794l0009j82451B2012b8106I45K3590L20272C5649P1522c1334
10692A67914a44937O9609o0276A59237c53819J65590N847f5818l6280j376a4699
10680e23900K47606B2313f841D946b47I5798c49645A23645a11682j19021P6500
10669a54203j2368L8726r7973b0032k0412k08976Q5351A64627a07235I511J09343
10658A18854c04866A28631P9365a61748B47409A20930c5854J3961B03809a31759
$$ plain form
10737 -265814 -114449 -259485 -61398 67832 -136276 -40556 157549 35321 -189008 -240580
10727 -240580 -156691 -62155 -170684 86625 197371 1929 -287610 -120894 -128062 -325739 157552
10715 -166301 168095 -237978 -468424 45102 -194316 305198 -36614 -438902 -34677 73106
10704 126876 -79794 -109803 -292254 22012 -28106 945 24535 344807 35649 107171 -31334
10692 167914 -144937 -75328 -135604 159237 -353819 -188229 -182382 -65818 -102098 -103474 -14699
10680 -523900 -276294 22313 -6841 4946 -247 95798 -349645 123645 -111682 -230703 -154203
10669 -154203 -166571 -127845 -225818 -20032 -40444 -249420 -164069 164627 -107235 9511 118854
10658 118854 -304866 128631 207996 -161748 247409 120930 -35854 -21893 203809 -131759
10647c9528I2577b08523R164A5577N5982a07927a1425A89671b27162J06109o9800
10636a90853L4307D0929d839C14908a55373c9094B1021a70646j8704h581l90580
10625c99161J50943L4868F5482M7486m168m9931b2724k91621i1072k57988B9681
10613a06094A94174n7045C4729J84777a55776R231B92565g3400A0407a60692j33967
10602b94659a6307j07316A83237c3315A58746l6219l6084L6803l9438a53618j25737
10591b79355B01152a19962A25977d5276l8748b836G8431b65689B35681E9336O7489
10580A26825K08299a284k0243C3979q587J51845M6673d54959K18750b8653A23297
10568e6550A01676A186J23990i1604O763a369l26954a29564H9503a41431I1350
$$ plain form
10647 -39528 92577 -208523 -199359 15577 71559 -107927 -11425 189671 -227162 -121053 -190853
10636 -190853 -156546 40929 -4839 314908 -155373 -39094 21021 -170646 -189350 -8581 -399161
10625 -399161 -248218 -213350 65482 112968 108800 58869 -22724 -314345 -91072 -349060 29681
10613 -106094 194174 137129 34729 219506 -155776 -146545 292565 -73400 10407 -160692 -294659
10602 -294659 -16307 -123623 183237 -33315 158746 122527 86443 123246 83808 -153618 -279355
10591 -279355 201152 -119962 125977 -45276 -84024 -2836 78431 -265689 235681 59336 126825
10580 126825 335124 -1284 -21527 33979 25392 177237 223910 -454959 -236209 -28653 123297
10568 -56550 101676 1186 125176 -91604 -84841 -1369 -328323 -129564 89503 -141431 91350
10556I616J39259f5352F3361Q2852O4294p6943a28759j30759d3721E2279A5973
10544B18416a42957D7028a85653Q0756m20G8596b56090G3019L2274a78620b3983
10532c4129F1636A973K57419a68027B56152o0265b6807A90994F0728e2421A30772
10520a04707k51688A43270a33169A33807O7073a1459j3963B5964Q2623a62079
10509F14e50825A17047e7259j05671d5195A51920a50438p7737i7820l7941H7304
10497a49539b9014l25872i6776M4478p7628j85233J10132l42968a05832B08178
10486f4516I2240C5557f2559a37l06241a21876A90669p0412J58319A04158M00085
10475E04243N9510B6982P7722J02335A01716a13367L3518j6313F7307a06702j35659
$$ plain form
10556 9616 148875 -65352 63361 146213 210507 133564 -128759 -259518 -43721 52279 15973
10544 218416 -142957 47028 -185653 -104897 -105317 78596 -256090 73019 105293 -178620 -23983
10532 -34129 61636 1973 259392 -168027 256152 195887 -26807 190994 60728 -52421 130772
10520 -104707 -356395 143270 -133169 133807 200880 -11459 -25422 25964 108587 -162079
10509 614 -550825 117047 -57259 -162930 -45195 151920 -150438 -228175 -97820 -135761 87304
10497 -149539 -29014 -354886 -96776 -52298 -129926 -315159 -205027 -547995 -105832 208178
10486 -64516 92240 35557 -62559 -137 -306378 -121876 190669 120257 278576 104158 504243
10475 504243 563753 26982 104704 207039 101716 -113367 -79849 -96162 67307 -106702 -242361
10464b42361R9732A09906d480j46501C39592a55628O3596j67163a3383q8143A38227
10452h0293n7283A6766K30699g7513B62006H205i5208C2546d695k56968Q8409
10441a73254E7108b20998O97A35740c1358A03704c51383a21743j5856k35158A09887
10429f7693A08489P4505c2284A24038a33347A33658b41178j16767A1226O1210
10419G2436f8481a7758p6557k11750C7154a37507E2751i0805A78114e074k11617
10408b16691A00947a18852M5060B18274H5028A5075a10185B47457b87073D0346
10397F0035i3179d847k5852Q128f208n0298k6096j97899L3027B37782d3963A97013
10384D4928K57076a59041D6141J1507f8065B90039a48809M17A18413b12611O6259
$$ plain form
10464 -242361 -142629 109906 -4480 -150981 339592 -155628 -92032 -259195 -13383 -101526 138227
10452 -80293 -137576 16766 247465 -77513 262006 8205 -95208 32546 -4695 -261663 -173254
10441 -173254 57108 -220998 -220301 135740 -31358 103704 -351383 -121743 -137599 -372757 109887
10429 -67693 108489 182994 -32284 124038 -133347 133658 -241178 -357945 11226 72436
10419 72436 -68481 -17758 -94315 -306065 37154 -137507 52751 -90805 178114 -5074 -216691
10408 -216691 100947 -118852 -73792 218274 85028 15075 -110185 247457 -287073 40346
10397 60035 -93179 -4847 -30699 -22571 -6208 -56506 -82602 -280501 -247474 237782 -43963 197013
10384 44928 302004 -159041 46141 57648 -68065 290039 -148809 -148392 118413 -212611 -146352
10373a46352B58844J45789A23595b52036A01205O0155J47220J1025q4756O4511
10363B99360j23195J05139L07025k31903J21409k36262b1394A4289M9553A3600
10352h1753c8843D7009H358K85124l8423K8084J53353j66724H8530K91390F2661
10340A12865O7416J1271J61004H5216J03747P1327l3179I5894K67397n5295j15319
10329A92677b5888B00450l8201R4402F4921J65743b16357O8851D4817a46673f2806
10317a04298E4066b15422D6543J57355N4761K49841k02295F9931a0658F2030h4557
10305I8701a46314H8607k1390a6251o531C14975a24440j67437N8147A16901e2836
10293i9187C36587c22865e6663a8351C6020J15254o6760a52640D61417c4663k42614
$$ plain form
10373 -146352 258844 404633 123595 -252036 101205 161360 308580 319605 234849 299360
10363 299360 176165 281304 588329 356426 477835 241573 -21394 14289 63842 13600
10352 -81753 -38843 47009 8358 293482 255059 283143 436496 269772 88530 379920 62661
10340 112865 180281 191552 352556 85216 188963 260290 227111 95894 363291 307996 192677
10329 192677 -25888 200450 162249 256651 64921 230664 -216357 -147506 44817 -146673 -62806
10317 -104298 54066 -215422 46543 203898 258659 508500 306205 69931 -10658 62030 -84557
10305 98701 -146314 88607 67217 -16251 -22782 314975 -124440 -291877 -233730 116901 -52836
10293 -99187 336587 -322865 -56663 -18351 36020 151274 84514 -152640 461417 -34663 -277277
10282b77277b2724B03603a30646b1750O450j78586A64646c33076J28143B5692
10271c30255c9821j20295c4176k5273b5707B07831H0180J76291b66884a15226
10260b33161O1331H2048J97482j26482l949R4920k5529J75866J47467A78093h7827
10248g2327B83478L4128B8257O665K17467a48768c8471o662D2604a67345N9125
10237a08220A62668B8329b43052B9277R8511a34494f5867I5414a51415l4163j81094
10226c66672c6698k18349B51937a05075n4300E277J98508a19743B45297c177j90813
10215a93990k25292M8654a27541e6755m82392b60521P7873c3565j5110r4988a6324
10203a01460E2024i2428k05986D2384j6163L48428b15401m7h7398l3255G8524
$$ plain form
10282 -277277 -22724 203603 -130646 -21750 -15300 -193886 164646 -333076 -204933 25692
10271 -330255 -39821 -160116 -34176 -59449 -25707 207831 80180 256471 -266884 -115226
10260 -233161 -171830 82048 279530 153048 149099 244019 218490 394356 541823 178093 -87827
10248 -72327 283478 317606 28257 34922 252389 -148768 -38471 -45133 42604 -167345 -108220
10237 -108220 162668 28329 -243052 29277 127788 -134494 -65867 95414 -151415 -185578 -366672
10226 -366672 -36698 -255047 251937 -105075 -159375 5277 203785 -119743 245297 -3177 -193990
10215 -193990 -419282 -370628 -127541 -56755 -539147 -260521 -182648 -33565 -48675 -143663 -16324
10203 -101460 52024 -92428 -298414 42384 26221 374649 -215401 -215448 -87398 -120653 78524
10191a17377c4177j12042C6812b72722b9176n2469j59255f4912j06240k25210
10181c96362A7972L4353a68978N7369d4006F913c4519j84039i5012k80991A48950
10169a05866B15355a64194a0902j76167C1295c07192n3379c2631B50466K0363
10159B70829f5913A63322D1005J06248c75491J2106d2283J625C4811b77546A223
10147b59801A40250a54910P2757l36722B82082a24041A38948G985b5979j10911
10137a36890j31399F1469J7359Q5060c5637k90561e2434i315j99376O2057B0706
10125b96749J07369d3969m1816l1462j0615j01706i9634B62136b62542H6325a77575
10113B1240b98229J9670N7120a06025a3918n9416j23287B09147g9680q3739A73562
$$ plain form
10191 -117377 -34177 -146219 36812 -272722 -29176 -81645 -240900 -64912 -171152 -396362
10181 -396362 17972 52325 -168978 -111609 -44006 6913 -34519 -218558 -95012 -376003 148950
10169 -105866 215355 -164194 -10902 -187069 31295 -307192 -360571 -32631 250466 270829
10159 270829 -65913 163322 41005 147253 -375491 -363385 -42283 -40658 34811 -277546 1223
10147 -259801 140250 -154910 -82153 -418875 282082 -124041 138948 7985 -25979 -136890
10137 -136890 -268289 61469 78828 163888 -35637 -326198 -52434 -9315 -208691 -146634 20706
10125 -296749 -189380 -43969 -85785 -117247 -127862 -229568 -99634 262136 -262542 86325 -177575
10113 21240 -298229 -278559 -221439 -106025 -13918 -73334 -196621 209147 -79680 -163419 173562
10101a87608A74559b27302F1667A4141a93457j18243k2273c6927l38522I847a60024
10089A1938f9902L4130P63B41858c1362G7300d56197J52549C2112a4690l03l15818
10077c30811K9661E6400a6044F0163h9054q1947e917j69630n0926B27242C1692
10065B65146o6257c5476p1721l05057a73670l75875D31671a2149E859L3013a5102
10053a69228h3925C4394h5525c2642k91059a27762m6887C50385f2161A0454Q0598
10042I1052J6469A8553f7354j84625J25107b2828l3909j24582A13604e27729a1092
10030a86519j43652D8014a1954k59305J08562B13549r5854C261e5631E8576a88163
10018A9400b67553A45969b41263M5972R4818n1475C54492F1340c78029q0356a39476
$$ plain form
10101 -187608 174559 -227302 61667 14141 -193457 -311700 -333973 -36927 -375449 9847 -160024
10089 11938 -69902 -35772 -35009 241858 -31362 77300 -456197 -303648 32112 -14690 -14993 -330811
10077 -330811 -301150 56400 -16044 60163 -89054 -171001 -5917 -175547 -226473 227242 31692
10065 265146 198889 -35476 -107197 -412254 -173670 -549545 431671 -12149 5859 38872 -15102
10053 -169228 -83925 34394 -85525 -32642 -323701 -127762 -174649 350385 -62161 10454 91052
10042 91052 107521 18553 -67354 -251979 -126872 -22828 -56737 -181319 113604 -527729 -11092
10030 -186519 -330171 48014 -11954 -271259 -162697 213549 117695 3261 -55631 58576 -188163
10018 19400 -267553 145969 -241263 -195291 -100473 -151948 354492 61340 -378029 -458385 -139476
10006b71127A67338J8242l1113b19426J09068a2020A06860b4402j68606a5363
9995H0090l2152A6622a12657M8682F8823b15281J03427a148m4896j66199J2007
9984b00236j81886A0757a82785B37846a44511h947n4390C0831n248h6135a718
9972a6854A41012d02699A45650e5373l26086F5130b2013k70303J46078B3633c50321
9960g5598C68903b1777A16992d57284K08161B11832c38700B51554p5663g3772
9949B89712J01674G6920L088f2708n1704G2755N4355b46592a7215E0683G343g6674
9936H5233e9019j52287e3384m9673D2442c56085A57759e7122A13622l3699e3693
9924b6455m16709B316a75568b3373k00763J01942k87548C39b13519D6337b06449
$$ plain form
10006 -271127 167338 185580 154467 -219426 -110358 -12020 106860 -24402 -193008 -15363
9995 80090 47938 16622 -112657 -63975 68823 -215281 -111854 -1148 -46044 -212243 -200236
9984 -200236 -382122 10757 -182785 237846 -144511 -8947 -63337 30831 25583 -86135 -1718
9972 -16854 141012 -402699 145650 -55373 -381459 65130 -22013 -292316 -146238 23633 -350321
9960 -75598 368903 -21777 116992 -457284 -249123 211832 -338700 251554 175891 -73772
9949 289712 391386 76920 80008 -62708 -114412 72755 127110 -246592 -17215 50683 7343 -76674
9936 85233 -59019 -211306 -53384 -103057 42442 -356085 157759 -57122 113622 79923 -53693
9924 -26455 -443164 2316 -175568 -23373 -224136 -122194 -409742 339 -213519 46337 -206449
9912E8707a63179G5340a71682j00597m0652a09865N108f242l21839d7998n594
9901e3592A01337C73J03149a91573B10437j8989a93298I2667K6327g94D63355
9889a51366j56188B63822h1386k6063j57121A51664b9570j45085c7410C29792
9878E1921a56890O9822G9976f6332k1702i271A75318A9022a65971F3660k0957
9867D2703b21926j3372A88342F3135a80900e3638B65412b15913A6433b25431I4781
9855b75613r3438q0648B237b58772L4266M3417b5587B28129a23417L0647k3352
9844a16122B1709c67583B03809D7054h1937a1081m7974l46123f4386k28598h2850
9832B96434C5482e736B13545i2329A16460a44509H7078L1735J0694a55758K4289
$$ plain form
9912 58707 -163179 75340 -171682 -272279 -312931 -109865 -104757 -6242 -328081 -47998 -53592
9901 -53592 101337 373 103522 -191573 210437 191448 -193298 92667 118994 -794 463355
9889 -151366 -307554 263822 -81386 -107449 -264570 151664 -29570 -174655 -37410 329792
9878 51921 -156890 -87068 79976 -66332 -88034 -9271 175318 19022 -165971 63660 42703
9867 42703 -221926 -235298 188342 63135 -180900 -53638 265412 -215913 16433 -225431 94781
9855 -275613 -369051 -449699 2237 -258772 -224506 -181089 -25587 228129 -123417 -92770 -116122
9844 -116122 21709 -367583 203809 47054 -81937 -11081 -59055 -405178 -64386 -292984 -82850
9832 296434 35482 -5736 213545 -92329 116460 -144509 87078 118813 129507 -155758 -131469
9821a31469k9941f0552A35105a4370E208O4724d9521j13926H9804R6773b11972
9809a63443g2123n8141E3216O6697k3885e5978F4935p991J65428b40128J15959
9798a24169a8470D749b03074A97416a77323n0089H7884e9563l498A02894h1605
9786A3974a23064a8341l29789a1496j19431d0812k03656E516a70863P182B19802
9774B0002K31239b56403j87498K08822c8756d563r2692j43023A44252E4127k957
9763E1170a40995C76536C229c77311Q852f9044A77688L6560a70249C9363a18331
9751f7671D1182a54036j7279O9988j84078b7071m96652e3714A6075N6603a84840
9739A07372k0087B833i6309I302c71444j05478a55899j00492A00685b07255A8128
$$ plain form
9821 -131469 -161410 -60552 135105 -14370 5208 69932 -49521 -163447 89804 186577 -211972
9809 -163443 -72123 -130264 53216 119913 96028 -55978 64935 56944 222372 -240128 -124169
9798 -124169 -18470 4749 -203074 197416 -177323 -227412 87884 -59563 -63061 102894 -81605
9786 13974 -123064 -18341 -348130 -11496 -130927 -40812 -244468 5516 -170863 -163681 219802
9774 20002 251241 -256403 -443901 -235079 -38756 -4563 -97255 -240278 144252 54127 51170
9763 51170 -140995 376536 3229 -377311 -368459 -69044 177688 214248 -170249 39363 -118331
9751 -67671 41182 -154036 -171315 -101327 -285405 -27071 -523723 -53714 16075 72678 -184840
9739 107372 87285 2833 -96309 9302 -371444 -476922 -155899 -256391 100685 -207255 18128
9727b05700A49656c27068c564A50952b04774A75514f4486A45319d1336J4130L383
9716b3823k61535d6680k70220A37297B895J65456b63206D5896d38322A68825A637
9704h2921E0294J25548B3697J63194b30275L0136j05272e8668j15457c2936j22291
9693a55227n1003p9947A66897C648J7119a16670A45634b76008A11443J42172Q9456
9682C43071e8670C1388a47483l8255A07094i3521j05360q0620b0995q1193o9330
9671a71518c3796G2821L6288G358J19610B5195d49041a18108k16746d4848j69474
9660b14322M874b5526K942F7052G774a50474l0453e4975j67616b3985I7354a11075
9647D0404a57709j7016e2017A21876a15467d3954I8015B2712a86495A67599j3565
$$ plain form
9727 -205700 149656 -327068 -3564 150952 -204774 175514 -64486 145319 -41336 -27206 -23823
9716 -23823 -285358 -46680 -316900 137297 2895 168351 -263206 45896 -438322 168825 1637
9704 -82921 50294 175842 23697 186891 -230275 -200139 -305411 -58668 -174125 -32936 -155227
9693 -155227 -206230 -286177 166897 3648 20767 -116670 145634 -276008 111443 253615 343071
9682 343071 -58670 31388 -147483 -185738 107094 -93521 -198881 -279501 -20995 -102188 -171518
9671 -171518 -33796 72821 109109 7358 126968 25195 -449041 -118108 -334854 -44848 -214322
9660 -214322 -209448 -25526 -22584 67052 7774 -150474 -180927 -54975 -222591 -23985 97354 -111075
9647 40404 -157709 -174725 -52017 121876 -115467 -43954 98015 22712 -186495 167599 154034
9636A54034a13064d9115j11641P087l3057L130F9795a78856c449k34778F9901
9624a85305Q5404k64249L2363A36792F3977A3440a42726F1236a58036k8645D4631
9612A50740a33492A89865b81762G0370a22274H7582e1682k9491a5408D46537f7339
9600D4681J27903a38923o3040j59869a19422a7061H7754D2866b76526k1968B54354
9588e4917A56336a59988A2240a39947A3251a80061B51881b00648B06754b01394
9577a00257q8002O6219A04223f807m1158B28782a38931N9777l5520F8661c14752
9565A77164h1601p9104B22521a35398A73468g4706B25474b22689O7666B8443M3588
9554G2031N5170D2567d36263a35181D35615A32132J43376B1915a73716j3962N3330
$$ plain form
9636 154034 -113064 -49115 -160756 -153669 -186726 -183596 69795 -178856 -3449 -238227 69901
9624 -185305 -99901 -364150 -331787 136792 63977 13440 -142726 61236 -158036 -186681 44631
9612 150740 -133492 189865 -281762 70370 -122274 87582 -51682 -81173 -15408 446537 -67339
9600 44681 172584 -138923 -201963 -361832 -119422 -17061 87754 42866 -276526 -298494 254354
9588 -54917 156336 -159988 12240 -139947 13251 -180061 251881 -200648 206754 -201394
9577 -100257 -188259 -122040 104223 -6807 -47965 228782 -138931 -79154 -114674 68661 -314752
9565 177164 -81601 -160705 222521 -135398 173468 -74706 225474 -222689 -155023 28443 72031
9554 72031 127201 42567 -436263 -135181 435615 132132 275508 21915 -173716 -187678 -134348
9543a34348A31661b30774A3616a59808K3075K8835B37360a84783A8002d4726A24945
9531E6979K27726o8400K933b21480J09129J4871A20389c6622q4277I6624c14510
9519b32238b9272r513j08060k2036A29502N6360e1507k57876B11445a49842F260
9507b25927A93029b07624b9454A892J30273B9781C126a56892l7699L3501j66574
9496c27664h3879A2193H98N8502c7804k51655A20548N384b06212i2871E5293f4194
9483b34670F9299J21637F5455e4234C2343a94472j97752B37570A5879a82623P068
9472a75555Q304B04013A6805J21190P2604i8697k6045L2046p7243b6302D68115
9460h9427d70j28051j5735A48917o858a35426M6705j80755d6604H4015P6155M4705
$$ plain form
9543 -134348 131661 -230774 13616 -159808 -136733 -107898 237360 -184783 18002 -44726 124945
9531 56979 284705 216305 219238 -221480 -112351 -97480 120389 -36622 -120899 96624 -314510
9519 -232238 -29272 -38785 -146845 -168881 129502 185862 -51507 -309383 211445 -149842 6260
9507 -225927 193029 -207624 -29454 1892 132165 29781 3126 -156892 -194591 -161090 -327664
9496 -327664 -83879 12193 898 59400 -37804 -289459 120548 125932 -206212 -92871 55293 -64194
9483 -234670 69299 190936 65455 -54234 32343 -194472 -392224 237570 15879 -182623 -175555
9472 -175555 -167251 204013 16805 137995 210599 -98697 -124742 -92696 -169939 -26302 468115
9460 -89427 -470 -128521 -144256 148917 142059 -135426 -88721 -269476 -46604 84015 160170 204875
9448B04875f177j65413j38508j4047J56073b1081l3684j6436k4086d6113E9769
9436a33635j20211b0156p1527k7297j9759a2799A63708H0856g5293j26284L8298
9425a63279A56270a11329l4317M1811j60502G2826o547N0330a71260d9525A37542
9413F5422a0751r0043j6995j87780J02098c4536n2134l3679b2661j37501m7819
9402b07981G1647a72795j8659Q1103A93475c33556J41996B0312K52684b2894p3981
9391i6875j41065a05085E8734c18894K4152a8225B53074a2709l29173J25776A27792
9379A79349b61942B88080F0593a48943c5412I9130g7520L6999I3941a42619q345
9368a50964A45355h5085A32068E3076a40638k38912G4440a18864j04335Q4297
$$ plain form
9448 204875 -6177 -171590 -310098 -324145 -168072 -21081 -54765 -71201 -95287 -46113 59769
9436 -133635 -253846 -20156 -91683 -118980 -138739 -12799 163708 80856 -75293 -201577 -163279
9425 -163279 156270 -111329 -145646 -103835 -264337 72826 66279 116609 -171260 -49525 137542
9413 65422 -10751 -100794 -117789 -305569 -203471 -34536 -86670 -120349 -22661 -160162 -207981
9402 -207981 71647 -172795 -191454 -110351 193475 -333556 -191560 20312 272996 -22894 -96875
9391 -96875 -237940 -105085 58734 -318894 -294742 -18225 253074 -12709 -341882 -216106 127792
9379 179349 -261942 288080 60593 -148943 -35412 99130 -77520 -40521 93941 -142619 -150964
9368 -150964 145355 -85085 132068 53076 -140638 -379550 74440 -118864 -223199 -138902
9358a38902D1208l891L06078n7639A07717J04880h982B44325a46685A16367f3978
9346c57734h8981O852m93348a60352j58660A2271d07417a33600j261A86713a51747
9334B1438c56303A11874b23011F6086J20529a80081D6304a46314j25278K523H1205
9322a65210l58102c8175o5236d831j24028n6257d3544G6400a30247H1938b55074
9310a27369n4868j52961A67487D327e6228k10103F8590k7289K9231a77979C6463
9298a35289c211B53466a93433A18845f1472E5006a13853B78313b86446E4085b15229
9286B08617i9416b00D4252j7512c76640d2775K0649B43868a32868L5941j15306
9275b12233o9157d0016a6435j75262j565H8227b94187b4846C7458b41931J04824
$$ plain form
9358 -138902 41208 37317 343395 285756 107717 212597 -8982 244325 -146685 116367 -63978
9346 -357734 -88981 -82129 -575477 -160352 -319012 12271 -407417 -133600 -134861 186713 -151747
9334 21438 -356303 111874 -223011 66086 186615 -180081 46304 -146314 -271592 -269069 81205
9322 -165210 -523312 -38175 -103411 -4831 -128859 -185116 -43544 76400 -130247 81938 -255074
9310 -127369 -182237 -335198 167487 4327 -56228 -266331 68590 41301 70532 -177979 36463
9298 -135289 -3211 253466 -193433 118845 -61472 55006 -113853 278313 -286446 54085 -215229
9286 208617 -99416 -200 44252 26740 -376640 -42775 -22126 243868 -132868 -96927 -212233
9275 -212233 -281390 -40016 -16435 -191697 -193262 88227 -294187 -24846 37458 -241931 -137107
9264a37107J280B83015c0465B94290A6268c37682e1919j34823e5997k499m46286
9253e04782K43844D8292c70250l9851f8182p0608r5786a15492p5550M7733A30528
9241f4694C27831j55088I557J02635J55736f6312j11280M4264B7227a07383j52266
9230b59649J21376l8121n291A4807b36210O8215A6264J26643b33472j9283N7806
9219a94949F7483b7438A82293i3972m7752j03356g9970C2694a22587L8784c128
9207C08057E5974A2845J26711l9497G183P779a62085E7904c8227A45858a84020
9195a88674A9131d0908B22158L275c45091B1309a06382a8475j61041D2863Q7804
9184A30667b74051l5580N1326Q6034m4025i0559B35802d37898R9484J325A55639
$$ plain form
9264 -137107 -135827 283015 -30465 294290 16268 -337682 -51919 -186742 -55997 -58496 -504782
9253 -504782 -260938 48292 -370250 -410101 -68182 -138790 -234576 -115492 -191042 -143309 130528
9241 -64694 327831 172743 9557 112192 267928 -66312 -177592 -133328 27227 -107383 -259649
9230 -259649 -138273 -176394 -181685 14807 -236210 -167995 16264 142907 -233472 -252755 -194949
9219 -194949 67483 -27438 182293 -93972 -141724 -245080 -79970 32694 -122587 -83803 -3128
9207 308057 55974 12845 139556 100059 7183 14962 -162085 57904 -38227 145858 -184020
9195 -188674 19131 -40908 222158 225433 -345091 21309 -106382 -18475 -179516 42863 130667
9184 130667 -274051 -309631 -258305 -172271 -216296 -90559 235802 -437898 -338414 -337089 155639
9172a91626J389B12818b46681a00083F7309b85429A82673G3979h7066j7036l3464
9161a37566K0380A71200b16235J02859d2215C27118j36517m4028d53408J34181
9151c19227A16772g7264B11381b86278A22444A4765b17362C05396A29477i5753
9140A3661a83415B49034q636K38413c60870b6309j3637j38862o9900R1810G0979
9128C93783j34179c47459e833k17661G5336K27381b61244a10787q07o8280f2084
9116a16787j24287B6726M52202a459F5398L9023i4133k1318j7640B57978b20879
9104A06948c3581J0503A27921B272b58046J25645A31957a46714I129a37839l8497
9093a76336I1873c29936E9345b83856h7260G4863a07899E2755b73611q1977n2531
$$ plain form
9172 -191626 -190237 212818 -246681 -100083 67309 -285429 182673 73979 -87066 -104102 -137566
9161 -137566 -117186 171200 -216235 -113376 -42215 327118 190601 146573 -453408 -319227
9151 -319227 116772 -77264 211381 -286278 122444 14765 -217362 305396 129477 -95753
9140 13661 -183415 249034 240398 478811 -360870 -26309 -39946 -178808 -248708 -156898 70979
9128 393783 259604 -347459 -5833 -223494 75336 302717 -261244 -110787 -111594 -179874 -62084
9116 -116787 -241074 26726 478928 -1459 65398 104421 -94133 -115451 -133091 257978 -220879
9104 106948 -33581 -23078 127921 2272 -258046 -132401 131957 -146714 9129 -137839 -176336
9093 -176336 91873 -329936 59345 -283856 -87260 74863 -107899 52755 -273611 -355588 -408119
9082d08119E487a11834A74509k5914o1639l0448d8855B08634a45770k69909J73565
9071b42114C621a58176B9290a11481a8447k27209k16207a07198A3637a43354b5805
9059A40767m9049C0254b03777j65868A09551b24047c4768I9430b40538H6842c87677
9047a17377e5662H9266J04436c2900l5697e816r1465j48910P5633q6422e1649
9035C1106c29535e2686k85989g1056n1731B13279q253a49158c8098F7038C0402
9023d3793H7054f3847l3563A88306a03338M6947E3645i8712A34102C0731J71117
9012B01848c41873l847A93462c66231J53754j20183B36048J54859A13754c24455
9001a37466r2417A91995b375l28290a52013o2719d7566j41506g8399l5593q6313
$$ plain form
9082 -408119 5487 -111834 174509 148595 86956 56508 -48855 208634 -145770 -415679 -242114
9071 -242114 3621 -158176 29290 -111481 -18447 -245656 -461863 -107198 13637 -143354 -25805
9059 140767 91718 30254 -203777 -369645 109551 -224047 -34768 99430 -240538 86842 -387677
9047 -117377 -55662 89266 193702 -32900 -68597 -5816 -97281 -246191 -170558 -256980 -51649
9035 31106 -329535 -52686 -338675 -71056 -122787 213279 205026 -149158 -38098 67038 30402
9023 -43793 87054 -63847 -97410 188306 -103338 -56391 53645 -98712 134102 30731 201848
9012 201848 -341873 -345720 193462 -366231 -212477 -332660 236048 390907 113754 -324455
9001 -137466 -229883 191995 -2375 -330665 -152013 -214732 -47566 -189072 -78399 -113992 -200305
8990b00305B47405G1157c18599i7234I4089c16851d8232J2210k6807Q261j76522
8979b31090A86691b85418j94860A0717K3495i8236E1352c77877a43435m3280B18207
8967e6878k74921B06846b6565B3860a50056N2077C2180c6880k43105l01926H8875
8955i1127E4089J453b33188K1212A7253K9222J0402N9482a15122e6367F0089a34625
8942A7281n190P7226O7361L6249I3157i7453m7742b6789I2836f5850k00258J23048
8930a43060E0546d7015m4702H8249a62738k82284A6482M298g0704H9962D1426
8918I60199j21122A56746L2040B2193J56919b08998B57440G7379O7665R352J79074
8907C33470F9440a88186a5086j4258A52820d8195k47422J05684B0823J85053f7896
$$ plain form
8990 -200305 247405 71157 -318599 -97234 94089 -316851 -48232 -36022 -62829 -54568 -231090
8979 -231090 186691 -285418 -480278 10717 34212 -98236 51352 -377877 -143435 -186715 218207
8967 -56878 -331799 206846 -26565 23860 -150056 -97979 32180 -36880 -279985 -581911 88875
8955 -91127 54089 55542 -233188 -211976 17253 46475 56877 116359 -115122 -56367 60089 -134625
8942 17281 12091 89317 156678 192927 93157 -97453 -145195 -26789 92836 -65850 -266108 -143060
8930 -143060 50546 -47015 -91717 88249 -162738 -445022 16482 20780 -70704 89962 41426
8918 960199 839077 156746 188786 22193 179112 -208998 257440 77379 145044 154396 333470
8907 333470 69440 -188186 -15086 -29344 152820 -48195 -295617 -189933 20823 205876 -67896
8895a72954L9176l5436A40684d7018A3163J61321A6764K68843e0672l1780j75925
8884b58377a18480r4259C4251a58543A20536f9317j45378A99543o4231J50859
8874B86171b64191a24878K05p3417H5499c2442k21484F0053g2980P824j48991
8863b14147g1031J1465F4411h3930b1325k0619j70620P2557F1115b12877A8873
8851B69601b9256k09559A06823J0546b10134A60817b21006G2333b45211Q3677
$$ plain form
8895 -172954 -133778 -169214 140684 -47018 13163 174484 16764 285607 -50672 -82452 -258377
8884 -258377 -118480 -212739 34251 -158543 120536 -69317 -214695 199543 135312 286171
8874 286171 -264191 -124878 -124673 -198090 85499 -32442 -253926 60053 -72980 -65156 -214147
8863 -214147 -71031 -59566 64411 -83930 -21325 -41944 -212564 -140007 61115 -212877 18873
8851 269601 -29256 -238815 106823 117369 -210134 160817 -221006 72333 -245211 -161534
$$ [...]
##END NTUPLES=NMR SPECTRUM
##END=
