##TITLE=NES1041_872015081_9242725_9DfBnm12dO
##JCAMPDX= 6.0         $$ Bruker NMR JCAMP-DX V2.0
##DATA TYPE= NMR SPECTRUM
##DATA CLASS= NTUPLES
##ORIGIN= BRUKER
##OWNER= Administrator
$$ 1.72 TOPSPIN		Version 2.1
$$ 2015-07-01 21:05:44.820 -0700  Administrator@X
$$ Compression mode = diff/dup
##.OBSERVE FREQUENCY= 400.02188249412
##.OBSERVE NUCLEUS= ^1H
##.ACQUISITION MODE= SIMULTANEOUS (DQD)
##.ACQUISITION SCHEME= undefined
##.AVERAGES= 64
##.DIGITISER RES= 22
##SPECTROMETER/DATA SYSTEM= spect
##.PULSE SEQUENCE= noesygpps1d.comp
##.SOLVENT NAME= COFFEE_meoh
##.SHIFT REFERENCE= INTERNAL, COFFEE_meoh, 1, 14.96288
##AUDIT TRAIL= $$ (NUMBER, WHEN, WHO, WHERE, PROCESS, VERSION, WHAT)
$$ ##TITLE= Audit trail, TOPSPIN		Version 2.1
$$ ##JCAMPDX= 5.01
$$ ##ORIGIN= Bruker BioSpin GmbH
$$ ##OWNER= Administrator
$$ $$ E:\/data/COFFEE/nmr/NES1041_872015081_9242725_9DfBnm12dO/32/pdata/1/auditp.txt
$$ ##AUDIT TRAIL=  $$ (NUMBER, WHEN, WHO, WHERE, PROCESS, VERSION, WHAT)
(   1,<2015-07-01 21:05:39.492 -0700>,<Administrator>,<X>,<go>,<TOPSPIN 2.1>,
      <created by zg
	started at 2015-07-01 20:54:09.914 -0700,
	POWCHK enabled, PULCHK disabled,
       configuration hash MD5:
       21 0F 79 D6 B3 7B B4 F6 88 20 88 DB 03 48 BD 9F
       data hash MD5: 64K
       1E E3 C5 FF 7B 60 10 9D 10 80 5D 05 E2 CA 89 F9>)
(   2,<2015-07-01 21:05:42.742 -0700>,<Administrator>,<X>,<proc1d>,<TOPSPIN 2.1>,
      <Start of raw data processing
       efp LB = 0.3 FT_mod = 6 PKNL = 1 PHC0 = 0 PHC1 = 0 SI = 128K 
       data hash MD5: 128K
       6B 5C 1F 78 6A 69 39 6F 71 C6 8B 70 6B DF A7 7E>)
(   3,<2015-07-01 21:05:43.602 -0700>,<Administrator>,<X>,<proc1d>,<TOPSPIN 2.1>,
      <pk PHC0 = -82.07336 PHC1 = 0 
       data hash MD5: 128K
       50 DF 8B 5E A5 08 BC D8 D2 25 F2 4F 3B 88 17 D6>)
(   4,<2015-07-01 21:05:43.992 -0700>,<Administrator>,<X>,<proc1d>,<TOPSPIN 2.1>,
      <abs ABSG = 1 
       data hash MD5: 128K
       98 D9 72 4F 5A 2D CD 8F 20 00 BF D2 56 48 BF F9>)
(   5,<2015-07-01 21:05:44.102 -0700>,<Administrator>,<X>,<proc1d>,<TOPSPIN 2.1>,
      <abs ABSG = 2 
       data hash MD5: 128K
       4C 86 06 C9 4E FA 4B 2B ED C7 40 C2 DF 37 EA BE>)
(   6,<2015-07-01 21:05:44.180 -0700>,<Administrator>,<X>,<proc1d>,<TOPSPIN 2.1>,
      <abs ABSG = 3 
       data hash MD5: 128K
       65 88 E2 D0 F1 A9 E2 02 9A 0D 5B 20 66 C3 5F 09>)
(   7,<2015-07-01 21:05:44.274 -0700>,<Administrator>,<X>,<proc1d>,<TOPSPIN 2.1>,
      <abs ABSG = 4 
       data hash MD5: 128K
       2F 61 25 A2 10 1E C5 83 39 17 95 0F 13 F4 08 29>)
(   8,<2015-07-01 21:05:44.399 -0700>,<Administrator>,<X>,<proc1d>,<TOPSPIN 2.1>,
      <abs ABSG = 5 
       data hash MD5: 128K
       8C 55 05 1B 03 98 1E 40 58 71 9C 01 C1 97 9E 9C>)
$$ ##END=
$$ 
$$ $$ hash MD5
$$ $$ F7 B4 25 36 06 65 4E 2A 47 F6 F7 0C 97 54 F4 5F
##$RELAX= 
##$RELAX= 
##$RELAX= 
##$RELAX= 
##$RELAX= 
##$RELAX= 
##$RELAX= 
##$RELAX= 
$$ Bruker specific parameters
$$ --------------------------
##$DU= <E:\>
##$EXPNO= 32
$$ [...]
##$TP07= 0
##$TPNAME0= <>
##$TPNAME1= <>
##$TPNAME2= <>
##$TPNAME3= <>
##$TPNAME4= <>
##$TPNAME5= <>
##$TPNAME6= <>
##$TPNAME7= <>
##$TPOAL= (0..7)
0.5 0.5 0.5 0.5 0.5 0.5 0.5 0.5
##$TPOFFS= (0..7)
0 0 0 0 0 0 0 0
##$TUNHIN= 0
##$TUNHOUT= 0
##$TUNXOUT= 0
##$USERA1= <user>
##$USERA2= <user>
##$USERA3= <user>
##$USERA4= <user>
##$USERA5= <user>
##$V9= 5
##$VALIST= <valist>
##$VCLIST= <CCCCCCCCCCCCCCC>
##$VD= 0
##$VDLIST= <DDDDDDDDDDDDDDD>
##$VPLIST= <PPPPPPPPPPPPPPP>
##$VTLIST= <TTTTTTTTTTTTTTT>
##$WBST= 2048
##$WBSW= 25
##$XGAIN= (0..3)
0 0 0 0
##$XL= 0
##$YL= 0
##$YMAX_a= 6703740
##$YMIN_a= -13196173
##$ZGOPTNS= <>
##$ZL1= 120
##$ZL2= 120
##$ZL3= 120
##$ZL4= 120
##$ABSF1= 14.96288
##$ABSF2= -5.595302
##$ABSG= 5
##$ABSL= 3
##$ALPHA= 0
##$AQORDER= 0
##$ASSFAC= 0
##$ASSFACI= 0
##$ASSFACX= 0
##$ASSWID= 0
##$AUNMP= <proc_prof1d_extract.lims>
##$AXLEFT= 0
##$AXNAME= <>
##$AXNUC= <1H>
##$AXRIGHT= 0
##$AXTYPE= 0
##$AXUNIT= <>
##$AZFE= 0.1
##$AZFW= 0.1
##$BCFW= 0
##$BC_mod= 0
##$BYTORDP= 0
##$COROFFS= 0
##$CY= 15
##$DATMOD= 1
##$DC= 0
##$DFILT= <>
##$DTYPP= 0
##$F1P= 0
##$F2P= 0
##$FCOR= 0.5
##$FTSIZE= 131072
##$FT_mod= 6
##$GAMMA= 0
##$GB= 0
##$INTBC= 1
##$INTSCL= 1
##$ISEN= 128
##$LB= 0.3
##$LEV0= 0
##$LPBIN= 0
##$MAXI= 10000
##$MC2= 0
##$MEAN= 0
##$ME_mod= 0
##$MI= 0
##$NCOEF= 0
##$NC_proc= -2
##$NLEV= 6
##$NOISF1= 0
##$NOISF2= 0
##$NSP= 0
##$NTH_PI= 0
##$NZP= 0
##$OFFSET= 14.96288
##$PC= 1
##$PHC0= -82.07336
##$PHC1= 0
##$PH_mod= 1
##$PKNL= yes
##$PPARMOD= 0
##$PPDIAG= 0
##$PPIPTYP= 0
##$PPMPNUM= 2147483647
##$PPRESOL= 1
##$PSCAL= 4
##$PSIGN= 0
##$PYNMP= <proc.py>
##$REVERSE= no
##$SF= 400.020008885794
##$SI= 131072
##$SIGF1= 0
##$SIGF2= 0
##$SINO= 400
##$SIOLD= 131072
##$SPECTYP= <>
##$SREGLST= <1H.CDCl3>
##$SSB= 0
##$STSI= 131072
##$STSR= 0
##$SW_p= 8223.68421052631
##$SYMM= 0
##$S_DEV= 0
##$TDeff= 65536
##$TDoff= 0
##$TI= <>
##$TILT= no
##$TM1= 0
##$TM2= 0
##$TOPLEV= 0
##$USERP1= <user>
##$USERP2= <user>
##$USERP3= <user>
##$USERP4= <user>
##$USERP5= <user>
##$WDW= 1
##$XDIM= 131072
##$YMAX_p= 370190438
##$YMIN_p= -13010
##$CURPLOT= <Network HP LaserJet P1505>
##$CURPRIN= <$Network HP LaserJet P1505>
##$DFORMAT= <normdp>
##$LAYOUT= <+/1D_H.xwp>
##$LFORMAT= <normlp>
##$PFORMAT= <normpl>
##$SURQMSG= 1
$$ End of Bruker specific parameters
$$ ---------------------------------
##NTUPLES= NMR SPECTRUM
##VAR_NAME=  FREQUENCY,     SPECTRUM/REAL,   SPECTRUM/IMAG
##SYMBOL=    X,             R,               I
##VAR_TYPE=  INDEPENDENT,   DEPENDENT,       DEPENDENT
##VAR_FORM=  AFFN,          ASDF,            ASDF
##VAR_DIM=   131072,        131072,          131072
##UNITS=     HZ,            ARBITRARY UNITS, ARBITRARY UNITS
##FACTOR=    0.0627417313425164, 1,          1
##FIRST=     8223.62146879497, 284,          -45685
##LAST=      0,             1804,            -45141
##MIN=       0,             -13010,          0
##MAX=       8223.62146879497, 370190438,    0
$$ Real data points
##PAGE= N=1
##DATA TABLE= (X++(R..R)), XYDATA
$$ [...]
61028A337444N1906N7108O2771O7689P1644P5000P7486P9072Q1622Q7712R7780
61017B147234J10177J23947J39520J56600J73764J90964K10691K36141K70104
61008C759142L15628L74968M46800N27218O14887P12923Q25321R55937J113661
60999I646485J314076J570650J884407K239140K590094K840036K838043K448475
60991B7371406J669300O93899j69454o72450p47942m89756n5167L89312O59001
60982B8648149N69358L4523q35782j764919k466885k799861k795613k577100k264817
60973A3747053j937750j637291j378763j160314r73614q12768o75138n58286m59945
60964D153184l79501l16531k68357k30891k01116j77289j57756j41137j27121
$$ plain form
61028 1337444 1389350 1446458 1509229 1576918 1648562 1723562 1801048 1880120 1961742 2049454 2147234
61017 2147234 2257411 2381358 2520878 2677478 2851242 3042206 3252897 3489038 3759142
61008 3759142 4074770 4449738 4896538 5423756 6038643 6751566 7576887 8532824 9646485
60999 9646485 10960561 12531211 14415618 16654758 19244852 22084888 24922931 27371406
60991 27371406 29040706 29734605 29565151 28892701 28144759 27655003 27599836 27989148 28648149
60982 28648149 29217507 29252030 28416248 26651329 24184444 21384583 18588970 16011870 13747053
60973 13747053 11809303 10172012 8793249 7632935 6659321 5846553 5171415 4613129 4153184
60964 4153184 3773683 3457152 3188795 2957904 2756788 2579499 2421743 2280606 2153485
60955B153485j15578j05391r5231q5069p5845o8127o1983n7666n5376n4573n4217
60944A324429n3413n1449m7816m2840l7729l3301k9154k4720k0413j7054j4721
60933I51819j3040j2071j1915j1924j1277j0244r791j0043j0051r182p917p005
60921H27359o525o170n938o135o842p715q343q652q950r454r859r569q420o949
60907G17838n837n285n072m954m877m948n350o100o822p002o564n877n204m491
60893F39455l834l601l856m061l697k914k271k000j842j399m47Q90K107K622K324
60878F17476J709J332J362J610J749J406L97r38j867j937j371p86o37q74r27j36
60862F17568J482L106M045M467M699M318K761N71j001j553j642j374j92J592K372
$$ plain form
60955 2153485 2037907 1932516 1837285 1752216 1676371 1608244 1546261 1488595 1433219 1378646 1324429
60944 1324429 1271016 1219567 1171751 1128911 1091182 1057881 1028727 1004007 983594 966540 951819
60933 951819 938779 926708 914793 902869 891592 881348 871557 861514 851463 842281 834364 827359
60921 827359 820834 814664 808726 802591 795749 788034 779691 771039 762089 752635 742776 733207 724787 717838
60907 717838 712001 706716 701644 696690 691813 686865 681515 675415 668593 661591 655027 649150 643946 639455
60893 639455 635621 632020 628164 624103 620406 617492 615221 613221 611379 609980 609533 610423 612530 615152 617476
60878 617476 619185 620517 621879 623489 625238 626644 627041 626103 624236 622299 620928 620142 619505 618631 617704 617568
60862 617568 619050 622156 626201 630668 635367 639685 642446 643017 642016 640463 638821 637447 637255 638847 641219
60847F41219J046j733m701p396r724j1222j1727j1962j2435j2411j1009q704o739
60834E32502n457m332l190k370j906j544j387j623j852j576j113j101j316j045
60820E02690l24J75M23R61J627J608R36O92J317J887J613J064J147J683J796J218
60804E20513M47p4k94k83p8J94L35J85l12r47j225r24n53p84j384j457q38n44
60786E11977j389k797l478k943j862j180j270j813k237k329k465k961l308k624
60772D79321j026J21k19j473k250k002j330q68n86k06K33M44K81q5l18k22J25
60755D69940N22R26J378J722J687J274Q70P96R94J139R04J13j078k147k633k620
60739D73787k499k358k055j769j890k231k052j185m63o62j464k010k021j920k094
$$ plain form
60847 641219 642265 640532 635831 628435 618711 607489 595762 583800 571365 558954 547945 539241 532502
60834 532502 527045 522713 519523 517153 515247 513703 512316 510693 508841 507265 506152 505051 503735 502690
60820 502690 502366 502541 502964 503925 505552 507160 508096 508788 510105 511992 513605 514669 515816 517499 519295 520513
60804 520513 520960 520886 520592 520309 520231 520425 520760 520945 520633 519686 518461 517537 516984 516200 514816 513359 512521 511977
60786 511977 510588 507791 504313 501370 499508 498328 497058 495245 493008 490679 488214 485253 481945 479321
60772 479321 478295 478416 478197 476724 474474 472472 471142 470274 469688 469482 469715 470159 470440 470355 470037 469815 469940
60755 469940 470462 471388 472766 474488 476175 477449 478319 479115 480109 481248 482152 482265 481187 479040 476407 473787
60739 473787 471288 468930 466875 465106 463216 460985 458933 457748 457285 456623 455159 453149 451128 449208 447114
60724D47114k545l035l256k984k450k256k635l159l430l691m210m557m158l226
60710D01522k489k105j642j035p89j140j646j892j970j997j685p82M08J307J680
60695C85745J763J861K089K341K427K333K324K635L061L171K915K691K731K764
60681D20851K505K157K148K563L100L476L641L680L639L478L057K340J617J334
60667D59586J508J559R99J68q2N74J551K076K040J875J853J811J514J034O66O47
60651D79379J031J606J831J081p74l067m845n636n581n024m294l786l809m127
60637D43985m073l335k356j759j655j777j941k001j671r25l60o51j575k204k119
60622D15583j912k260k979l321k899j988j146p97j019j427j429q11K1N73Q30J095
$$ plain form
60724 447114 444569 441534 438278 435294 432844 430588 427953 424794 421364 417673 413463 408906 404748 401522
60710 401522 399033 396928 395286 394251 393462 392322 390676 388784 386814 384817 383132 382350 382758 384065 385745
60695 385745 387508 389369 391458 393799 396226 398559 400883 403518 406579 409750 412665 415356 418087 420851
60681 420851 423356 425513 427661 430224 433324 436800 440441 444121 447760 451238 454295 456635 458252 459586
60667 459586 461094 462653 463652 463820 463738 464312 465863 467939 469979 471854 473707 475518 477032 478066 478732 479379
60651 479379 480410 482016 483847 484928 484154 481087 476242 470606 465025 460001 455707 451921 448112 443985
60637 443985 439912 436577 434221 432462 430807 429030 427089 425088 423417 422492 422132 421481 419906 417702 415583
60622 415583 413671 411411 408432 405111 402212 400224 399078 398281 397262 395835 394406 393595 393616 394189 395019 396114
60606C96114J434J612J485J124O84M01O40J478K290K182R80m85j280j246q61n03
60590D06049j88J44M24N77O53P76R93J195J194J020J034J469J877J485L57k93
60574D18766N47K259L185K624J610J476K246K916K907K648K796L336L680L347
60560D54343K469J626J324J594K140K721L236L478L305L172L975N959Q089R173
60546E06604R444J0336J2676J5777J8627K1266K4495K8618L3087L7290M1123M4826
60534H04169M8621N2533N6062N7820N5940M9283L8321K4580R422o405k2020l5715
60522A132611m5560n0721n1971n0763m7975m3736l8224l2182k6509k1518j6835
60511G06617j1981p012k489J149M154P259J0865J4763J8713K2957K7750L2694
$$ plain form
60606 396114 397548 399160 400645 401769 402453 402854 403494 404972 407262 409444 410424 409939 408659 407413 406552 406049
60590 406049 405861 406005 406429 407006 407659 408435 409428 410623 411817 412837 413871 415340 417217 418702 419059 418766
60574 418766 419313 421572 424757 427381 428991 430467 432713 435629 438536 441184 443980 447316 450996 454343
60560 454343 456812 458438 459762 461356 463496 466217 469453 472931 476236 479408 483383 489342 497431 506604
60546 506604 516048 526384 539060 554837 573464 594730 619225 647843 680930 718220 759343 804169
60534 804169 852790 905323 961385 1019205 1075145 1124428 1162749 1187329 1196751 1190346 1168326 1132611
60522 1132611 1087051 1036330 984359 933596 885621 841885 803661 771479 744970 723452 706617
60511 706617 694636 687624 685135 686284 690438 697697 708562 723325 742038 764995 792745 825439
60499H25439L7213M1531M6390N1501N4981N4824N0497M2678L2105J9421N873o811
60487A255642j7240k4554k7880k6538k1032j3086m247N132J5230K5656L5620M4836
60475A247539N3554O1611O7879P0644O8261N9605M4512K4082L88k4264m7780o8196
60463A557835q3717r3222r6714r5182r0066q2830p4720o6508n8461n0712m3693
60452G22010l7968l3594k9886k6089k2193j8766j6055j3605j1001q571o927n921
60440D91434m687k787q77J29K25K13O48J339J831J964J755J145J25r86j739k042
60424D87690k257k701l177l157k451j484p76l19K49R63J492J814K459L721N014
60409D87080N503N229N046N568O669P952R166J0116J0730J1447J2881J4835J6230
$$ plain form
60499 825439 862652 904183 950573 1002074 1057055 1111879 1162376 1205054 1237159 1256580 1262453 1255642
60487 1255642 1238402 1213848 1185968 1159430 1138398 1125312 1121065 1126197 1141427 1167083 1202703 1247539
60475 1247539 1301093 1362704 1430583 1501227 1569488 1629093 1673605 1697687 1698075 1673811 1626031 1557835
60463 1557835 1474118 1380896 1284182 1189000 1098934 1016104 941384 874876 816415 765703 722010
60452 722010 684042 650448 620562 594473 572280 553514 537459 523854 512853 504282 497355 491434
60440 491434 486747 483960 483083 483212 483437 483650 484298 485637 487468 489432 491187 492332 492457 491471 489732 487690
60424 487690 485433 482732 479555 476398 473947 472463 471687 471368 471617 472580 474072 475886 478345 482066 487080
60409 487080 492583 497812 502858 508426 515095 523047 532213 542329 553059 564506 577387 592222 608452
60396F08452J6415J5990J5770J5451J4106J1747R510Q275P775P243O333N166L996
60383G46229L108K714K718K791K752K568K045R72l18j113j276j484k184k849k726
60368G53947j964j396j434j763j998k091k073j823j289o60k44k78q06j535j931
60353G32662j730j283j076j072q67m58l70r50j888k686l251l801m415m963n370
60338F98482n652n711n325m507l660l206l076k915k772l205m413n676o136n989
60324F36239o160o841p185o601n591m832m223l496l021l154l305k706j772j583
60310E75769k079j988o85R52J912K354K982L970N130O556Q347J0094J1184J1396
60296F35894J0743R139O663L773P90k518o308r869j2138j2821j2466j1533j0017
$$ plain form
60396 608452 624867 640857 656627 672078 686184 697931 707441 715716 723491 730734 737067 742233 746229
60383 746229 749337 752051 754769 757560 760312 762880 764925 765897 765579 764466 763190 761706 759522 756673 753947
60368 753947 751983 750587 749153 747390 745392 743301 741228 739405 738116 737456 737212 736934 736128 734593 732662
60353 732662 730932 729649 728573 727501 726634 726176 725806 724856 722968 720282 717031 713230 708815 703852 698482
60338 698482 692830 687119 681794 677287 673627 670421 667345 664430 661658 658453 654040 648364 642228 636239
60324 636239 630079 623238 616053 609452 603861 599029 594806 591310 588289 585135 581830 579124 577352 575769
60310 575769 573690 571702 571017 571969 573881 576235 579217 583187 588317 594873 603220 613314 624498 635894
60296 635894 646637 655776 662439 666212 667002 664484 658176 648307 636169 623348 610882 599349 589332
60283E89332p993n928m194k650r29R85K722L894M457M713M918M956M580M020M064
60268F06947N246P159Q776R396R117Q528Q237Q579R519J0722J1803J2536J2856
60255G29421J2814J2566J2292J2085J2051J2317J2747J2863J2511J2372J3165
60244H67204J4441J5047J4935J5520J7765K0863K3488K5489K7458K9422L1124
60233A102756L3158L6494M0983M5543M9775N4305N9337O4035O7770P0956P4115
60222A699227P6816P8211P7961P6143P2811O8284O3369N8604N3513M7265L9863
60211B412067L2148K4671J7196R341J403n710j1204j4884j7016j7806j7228j5401
60199B397577j2873j0178p248l609Q70N956J1581J7885K4637L1253L7629M4288
$$ plain form
60283 589332 581339 575411 571217 568567 567638 568623 571345 575239 579696 584409 589327 594283 598863 602883 606947
60268 606947 612193 619352 628128 637524 646641 655169 663406 671985 681504 692226 704029 716565 729421
60255 729421 742235 754801 767093 779178 791229 803546 816293 829156 841667 854039 867204
60244 867204 881645 896692 911627 927147 944912 965775 989263 1014752 1042210 1071632 1102756
60233 1102756 1135914 1172408 1213391 1258934 1308709 1363014 1422351 1486386 1554156 1625112 1699227
60222 1699227 1776043 1854254 1932215 2008358 2081169 2149453 2212822 2271426 2324939 2372204 2412067
60211 2412067 2444215 2468886 2486082 2495423 2496826 2491116 2479912 2465028 2448012 2430206 2412978 2397577
60199 2397577 2384704 2374526 2367278 2363669 2364539 2370495 2382076 2399961 2424598 2455851 2493480 2537768
60187B537768N1341N7885O2895O6284O8523O9509O8516O5030N9173N1397M2260
60176C200581L2391K2136J1205q86j3953k7035l9160m9967n9540o7946p4921p9736
60164B853169q1449p9705p5318o9673o3432n6129m7184l6951k6485j6551p176
60153B293116J867J0538J8495K5341L0720L4240L5494L4232L0523K4763J7571
60142B556900R694J935n086j1209j6740k2018k6869l0578l2425l2228l0262k6779
60130B334335k1828j5593q544j033P186J6631K7346L8743N0216O1635P3167Q5055
60118B647316R7629J11052J24823J37873J49500J59801J68829J75766J79583J80167
60108D132339J78137J73658J66133J54982J40132J21790J00457P7168N3003K8181
$$ plain form
60187 2537768 2589109 2646994 2709889 2776173 2844696 2914205 2982721 3047751 3106924 3158321 3200581
60176 3200581 3232972 3255108 3266313 3265427 3251474 3224439 3185279 3135312 3075772 3007826 2932905 2853169
60164 2853169 2771720 2692015 2616697 2547024 2483592 2427463 2380279 2343328 2316843 2300292 2293116
60153 2293116 2294983 2305521 2324016 2349357 2380077 2414317 2449811 2484043 2514566 2539329 2556900
60142 2556900 2566594 2568529 2563443 2552234 2535494 2513476 2486607 2456029 2423604 2391376 2361114 2334335
60130 2334335 2312507 2296914 2288370 2287337 2294523 2311154 2338500 2377243 2427459 2489094 2562261 2647316
60118 2647316 2744945 2855997 2980820 3118693 3268193 3427994 3596823 3772589 3952172 4132339
60108 4132339 4310476 4484134 4650267 4805249 4945381 5067171 5167628 5244796 5297799 5325980
60098E325980K404k3821m8964p1879r2574j11188j26993j39119j47609j52972
60088D413265j55162j53759j48938j41504j32146j21241j09199r6319q2461o7514
60078C205022n2132l7385k3592j0196L136J5785K6853L5939M3018M7904N0261
60067C304613M9919M6922M1371L3530K4055J3781L209p698j9027l0272m0508m9261
60055C370634n7007o4414p1390p7248q1625q4600q5896q4888q1641p7168p2069
60044B532688o5632n7094m7199l7508k8457j9068q577K634J3839K4749L5215M4922
60032B390512N3838O2400P0737P8054Q3172Q5395Q4570Q0625P3522O3517N1184
60021C177526L7284K2727Q438n078j7960l0550m2767n4020o3599p1065p6273p9204
$$ plain form
60098 5325980 5328384 5304563 5255599 5183720 5091146 4979958 4852965 4713846 4566237 4413265
60088 4413265 4258103 4104344 3955406 3813902 3681756 3560515 3451316 3354997 3272536 3205022
60078 3205022 3152890 3115505 3091913 3081717 3084853 3100638 3127491 3163430 3206448 3254352 3304613
60067 3304613 3354532 3401454 3442825 3476355 3500410 3514191 3517400 3509702 3490675 3460403 3419895 3370634
60055 3370634 3313627 3249213 3177823 3100575 3018950 2934350 2848454 2763566 2681925 2604757 2532688
60044 2532688 2467056 2409962 2362763 2325255 2296798 2277730 2269153 2271787 2285626 2310375 2345590 2390512
60032 2390512 2444350 2506750 2577487 2655541 2738713 2824108 2908678 2989303 3062825 3126342 3177526
60021 3177526 3214810 3237537 3245975 3240897 3222937 3192387 3149620 3095600 3032001 2960936 2884663 2805459
60009B805459p9851p8258p4615o9167o2052n3423m3815l4069k4601j5097n202
59998B265309M730J4085K2956L2001M1442N0842N9938O9029P8275Q7193R5094
59987B820894J01487J05740J06951J04686R9434R1893Q1992O9239N3830L7006
59977C673152K0252M434j0397k4663l8682n2198o4443p4717q2627q7686q9155
59966C173270q6716q1168p3819o5350n5678m4894l3669k2601j1683p60R924K0037
59954B726893K9722L9278M8410N6293O2524O7498P1561P4142P4230P1599O7121
59943C389271O1786N5811M8920M1123L2896K4743J7000J0048M393L32k325l980
59931C680018m666l757l63N903J4626K5143L7263N1089O6300Q2075R7912J13951
$$ plain form
60009 2805459 2725608 2647350 2572735 2503568 2441516 2388093 2344278 2310209 2285608 2270511 2265309
59998 2265309 2270039 2284124 2307080 2339081 2380523 2431365 2491303 2560332 2638607 2725800 2820894
59987 2820894 2922381 3028121 3135072 3239758 3339192 3431085 3513077 3582316 3636146 3673152
59977 3673152 3693404 3697838 3687441 3662778 3624096 3571898 3507455 3432738 3350111 3262425 3173270
59966 3173270 3086554 3005386 2931567 2866217 2810539 2765645 2731976 2709375 2697692 2696932 2706856 2726893
59954 2726893 2756615 2795893 2844303 2900596 2963120 3030618 3102179 3176321 3250551 3322150 3389271
59943 3389271 3451057 3506868 3555788 3596911 3629807 3654550 3671550 3681598 3685991 3686323 3683998 3680018
59931 3680018 3675352 3671595 3671232 3677135 3691761 3716904 3754167 3805256 3871556 3953631 4051543 4165494
59919D165494J30162J45681J59389J70726J79374J84435J84550J78720J66485
59910E665016J47621J22407R2104N8403K2410j5060n2139q5855j13855j35544
59900E705508j51195j60738j64054j61827j55324j45548j33190j19138j04377
59891D410117q9366p3925n7734m0765k3303n808J1321K7934M3960N9101P3139
59880D334671Q6564J00190J13721J25252J32665J35111J32582J24581J10028Q8347
59870E483712O0056K6574r753m5579p7544j03761j23995j38497j47343j51104
59860D772766j51186j48853j44315j37305j28324j18629j08991r8937q7497p4482
59850C574247o0754m7347l4546k1956r296L074J4315K3547L0178L4237L6602L8765
$$ plain form
59919 4165494 4295656 4441337 4600726 4771452 4950826 5135261 5319811 5498531 5665016
59910 5665016 5812637 5935044 6027148 6085551 6107961 6092901 6040762 5954907 5841052 5705508
59900 5705508 5554313 5393575 5229521 5067694 4912370 4766822 4633632 4514494 4410117
59891 4410117 4320751 4246826 4189092 4148327 4125024 4119216 4130537 4158471 4202431 4261532 4334671
59880 4334671 4421235 4521425 4635146 4760398 4893063 5028174 5160756 5285337 5395365 5483712
59870 5483712 5543768 5570342 5560589 5515010 5437466 5333705 5209710 5071213 4923870 4772766
59860 4772766 4621580 4472727 4328412 4191107 4062783 3944154 3835163 3736226 3648729 3574247
59850 3574247 3513493 3466146 3431600 3409644 3400348 3403422 3417737 3441284 3471462 3505699 3542301 3581066
59838C581066M2067M7114N3615O0436O5638O7083O3403N4395M0572K2918L285
59827D101592j5701l1931m4835n4736o1595o5104o5781o5070o4193o3463o2843
59816C506340o2521o2653o2916o2711o1576n9327n6053n2111m7965m3905m0068
59805B894534l6628l3773l1522k9824k8760k8370k8362k8274k7840k6849k4833
59794B569499k1317j6291j0018k534O164J5619K5269L5333M6616N9293P2656Q6297
59782B866586J00801J16849J34137J51622J68262J82898J93632J97740J91949
59773D304476J72861J38123Q8555K9376l1254q5467j28061j56870j72043j75345
59763C984351j69497j57461j41838j24486j06446q8281p0646n4441m0384k8592
$$ plain form
59838 3581066 3623133 3670247 3723862 3784298 3849936 3917019 3980422 4034817 4075389 4098307 4101592
59827 4101592 4085891 4053960 4009125 3954389 3892794 3827690 3761909 3696839 3632646 3569183 3506340
59816 3506340 3443819 3381166 3318250 3255539 3193963 3134636 3078583 3026472 2978507 2934602 2894534
59805 2894534 2857906 2824133 2792611 2762787 2734027 2705657 2677295 2649021 2621181 2594332 2569499
59794 2569499 2548182 2531891 2521873 2519339 2525503 2541122 2566391 2601724 2648340 2707633 2780289 2866586
59782 2866586 2967387 3084236 3218373 3369995 3538257 3721155 3914787 4112527 4304476
59773 4304476 4477337 4615460 4704015 4733391 4702137 4616670 4488609 4331739 4159696 3984351
59763 3984351 3814854 3657393 3515555 3391069 3284623 3196342 3125696 3071255 3030871 3002279
59753C002279j8731j0344k949L899J0375J6429K2253K8361L5069M2139M9242N6436
59741C234458O3908P1557P9295Q7533R6888J07484J18891J30704J42874J55671
59731D289263J69597J85121K02101K19647K36920K53833K70611K86806L01301
59722F415200L13071L21293L24844L22446L13534K98483K78057K53411K26941
59713I067280K02217J82301J68211J59366J55048J54774J57499J61268J64077
59704A0572041J64821J63226J59011J51423J39676J23808J04922Q4492O3553M2746
59694A1769719K2981N513q633j9019k5375k7246k4331j6708m416J2912L5391O2120
59682A1782908R1603J22943J56053J90566K25103K58007K88369L15807L39343
$$ plain form
59753 3002279 2983548 2973204 2970255 2974154 2984529 3000958 3023211 3051572 3086641 3128780 3178022 3234458
59741 3234458 3298366 3369923 3449218 3536751 3633639 3741123 3860014 3990718 4133592 4289263
59731 4289263 4458860 4643981 4846082 5065729 5302649 5556482 5827093 6113899 6415200
59722 6415200 6728271 7049564 7374408 7696854 8010388 8308871 8586928 8840339 9067280
59713 9067280 9269497 9451798 9620009 9779375 9934423 10089197 10246696 10407964 10572041
59704 10572041 10736862 10900088 11059099 11210522 11350198 11474006 11578928 11663420 11726973 11769719
59694 11769719 11792700 11798213 11789580 11770561 11745186 11717940 11693609 11676901 11672485 11685397 11720788 11782908
59682 11782908 11874511 11997454 12153507 12344073 12569176 12827183 13115552 13431359 13770702
59673A3770702L57000L66572L66446L55533L32661K96421K45745J80758J03331
59664A6375169J7085p3250j62717k46745l21301l82927m29169m59046m73088m72811
59654A3371200m60395m38920m12662l86872l67008l57802l62168l79991m07384
59645I797998m37398m62281m76242m77159m66388m47046m22140l93785l63589
59636E851970l33141l03798k76201k50341k26076k03411j82402j63090j45585
59627C767925j29855j15426j01634q8332p6143o5743n7138m9835m3610l8703l5309
59616B966197l3101l1385k9659k7939k6597k5905k5731k5766k5985k6722k8263
59605B659144l0476l2921l5192l7005l8098l8217l7260l5352l2866l0328k8142
$$ plain form
59673 13770702 14127702 14494274 14860720 15216253 15548914 15845335 16091080 16271838 16375169
59664 16375169 16392254 16319004 16156287 15909542 15588241 15205314 14776145 14317099 13844011 13371200
59654 13371200 12910805 12471885 12059223 11672351 11305343 10947541 10585373 10205382 9797998
59645 9797998 9360600 8898319 8422077 7944918 7478530 7031484 6609344 6215559 5851970
59636 5851970 5518829 5215031 4938830 4688489 4462413 4259002 4076600 3913510 3767925
59627 3767925 3638070 3522644 3421010 3332678 3256535 3190792 3133654 3083819 3040209 3001506 2966197
59616 2966197 2933096 2901711 2872052 2844113 2817516 2791611 2765880 2740114 2714129 2687407 2659144
59605 2659144 2628668 2595747 2560555 2523550 2485452 2447235 2409975 2374623 2341757 2311429 2283287
59594B283287k6262k4339k2314k0648j9722j9192j8270j6567j4285j1629q512
59583B081547m962j467J453L825O191R015J2242J5335J7694J9191K0356K1922
59571B202342K4139K6757K9642L3063L7095M1202M4839M8260N2229N6949O1758
59560B658275O6028O9959P4165P8825Q3558Q8109R2723R7674J02695J07131J10766
59549C629908J14091J17480J20318J21450J20437J17669J12773J03726Q8546O7955
59539D714353M5497K4796P213p795k1000l2819m3765n4376o4552p3520q0581q5585
59527D327866q8626q9651q8517q5153p9627p2102o2741n1510l8191k2901o415
59516C642432J0395K7345M4814O2877Q1039R8845J16096J32108J45305J54010
$$ plain form
59594 2283287 2257025 2232686 2210372 2189724 2170002 2150810 2132540 2115973 2101688 2090059 2081547
59583 2081547 2076585 2075118 2076571 2080396 2086587 2095602 2107844 2123179 2140873 2160064 2180420 2202342
59571 2202342 2226481 2253238 2282880 2315943 2353038 2394240 2439079 2487339 2539568 2596517 2658275
59560 2658275 2724303 2794262 2868427 2947252 3030810 3118919 3211642 3309316 3412011 3519142 3629908
59549 3629908 3743999 3861479 3981797 4103247 4223684 4341353 4454126 4557852 4646398 4714353
59539 4714353 4759850 4784646 4791859 4784064 4763064 4730245 4686480 4632104 4567552 4494032 4413451 4327866
59527 4327866 4239240 4149589 4061072 3975919 3896292 3824190 3761449 3709939 3671748 3648847 3642432
59516 3642432 3652827 3680172 3724986 3787863 3868902 3967747 4083843 4215951 4361256 4515266
59506D515266J57426J55369J47351J32529J10675Q2700N0193J4784k1841n7759
59496E286693r1030j20114j44000j62018j73836j79533j79539j74451j64999j52104
59486C745069j36837j20154j02803q5394o8419n2097l6332k1019o264P755K1113
59475C144618L3991M6131N6658O4665P0000P3250P4896P4731P2055O6349N7528
59464C834872M5717L1090J3996m879k4604m4157o2523p8856r2813j04527j14001
59453C399315j20700j24158j24885j24123j22505j19532j14647j08276j01348
59444B339141r4265q7061q0099p3817o7879o1612n5208m9596m4924m0263l5185
59433A649232l0570k7113k4011k0077j5483j1288p670l838M67M495P666J0395
$$ plain form
59506 4515266 4672692 4828061 4975412 5107941 5218616 5301316 5351509 5366293 5344452 5286693
59496 5286693 5195663 5075549 4931549 4769531 4595695 4416162 4236623 4062172 3897173 3745069
59486 3745069 3608232 3488078 3385275 3299881 3231462 3179365 3143033 3122014 3115750 3123505 3144618
59475 3144618 3178609 3224740 3281398 3346063 3416063 3489313 3564209 3638940 3710995 3777344 3834872
59464 3834872 3880589 3911679 3925675 3920796 3896192 3852035 3789512 3710656 3617843 3513316 3399315
59453 3399315 3278615 3154457 3029572 2905449 2782944 2663412 2548765 2440489 2339141
59444 2339141 2244876 2157815 2077716 2003899 1936020 1874408 1819200 1769604 1724680 1684417 1649232
59433 1649232 1618662 1591549 1567538 1547461 1531978 1520690 1513020 1509182 1509649 1514144 1521810 1532205
59421A532205J3458J7047K0457K2080J9955J3424M580k736n866n007k028J607
59409A629176N532R985J5063K0058K3209K2773J8777J3373R187P659R003J2803
59397A796598J8111K3676K8811L3835L9171M4514M9359N3917N8870O4476P0474
59386B281812P6589Q2649Q8425R3905R9598J05973J12624J18515J23033J26526
59376C309649J29883J34001J39626J47392J57762J70851J86243K03167K21210
59367D799784K40614K61284K81580K98819L11186L18370L20193L15764L04633
59358G452227K87890K67288K43907K18435J91855J64956J37652J09775Q1785N3638
59348I209408K3676r949m7130q6418j27337j70302k14251k56082k92926l23545
$$ plain form
59421 1532205 1545663 1562710 1583167 1605247 1625202 1638626 1643206 1640470 1634604 1629597 1627569 1629176
59409 1629176 1634708 1644693 1659756 1679814 1703023 1725796 1744573 1757946 1767133 1774792 1783795 1796598
59397 1796598 1814709 1838385 1867196 1901031 1940202 1984716 2034075 2087992 2146862 2211338 2281812
59386 2281812 2358401 2441050 2529475 2623380 2722978 2828951 2941575 3060090 3183123 3309649
59376 3309649 3439532 3573533 3713159 3860551 4018313 4189164 4375407 4578574 4799784
59367 4799784 5040398 5301682 5583262 5882081 6193267 6511637 6831830 7147594 7452227
59358 7452227 7740117 8007405 8251312 8469747 8661602 8826558 8964210 9073985 9155770 9209408
59348 9209408 9233084 9223135 9176005 9089587 8962250 8791948 8577697 8321615 8028689 7705144
59338G705144l47068l61943l67160l63553l53014l37113l17138k94666k71255
59329D692234k48054k26151k06645j89905j75334j62385j51046j41000j31196
59320C060518j21030j11112j02142r3781q5481p7647p0962o5066n9095n3115m7858
59309B173229m3239l8295l2721k7390k3041j9287j5332j1011o644k267K516Q005
59297A964523J3953J9592K3955K6166K5527K1741J5546R116N108M875P852J2802
59285B150756J8963K5721L2005L6999M1044M4958M8584N0778N0789M8918M5750
59274B595265M1367L5423K7548J7701O481m977j5862k6311l6648m6268n3933n9158
59262B480628o2587o4920o6177o6237o5407o4089o2289n9806n6604n2737m8199
$$ plain form
59338 7705144 7358076 6996133 6628973 6265420 5912406 5575293 5258155 4963489 4692234
59329 4692234 4444180 4218029 4011384 3821479 3646145 3483760 3332714 3191714 3060518
59320 3060518 2939488 2828376 2726234 2632453 2546972 2469325 2398363 2333297 2274202 2221087 2173229
59309 2173229 2129990 2091695 2058974 2031584 2008543 1989256 1973924 1962913 1956269 1954002 1956518 1964523
59297 1964523 1978476 1998068 2022023 2048189 2073716 2095457 2111003 2120119 2125227 2130102 2137954 2150756
59285 2150756 2169719 2195440 2227445 2264444 2305488 2350446 2399030 2449808 2500597 2549515 2595265
59274 2595265 2636632 2672055 2699603 2717304 2723785 2718808 2702946 2676635 2639987 2593719 2539786 2480628
59262 2480628 2418041 2353121 2286944 2220707 2155300 2091211 2028922 1969116 1912512 1859775 1811576
59251A811576m3123l7918l3031k8668k4744k0994j7094j2954q849n102j704J548
59239A578943M716P797J0955J4260J7350J9861K2084K4751K8192L2206L6626M1418
59227A839159M6273N0771N5144O0235O6538P3821Q1809R0611J00199J10172J20404
59216B695136J31442J43699J56725J69662J82047J93644K03654K10653K13208
59207D299870K10274K01054J84930J61619J31384R5175N4640J1760l1700p4317
59197E244689j14605j50664j80474k02513k16249k22309k22081k16852k07311
59188C511631j94128j78691j62670j46843j30996j15005r9393q4710p1115n8794
59178B269286m8054l8654k9770k1127j3460p318k160K640O553Q566Q537O942L616
$$ plain form
59251 1811576 1768453 1730535 1697504 1668836 1644092 1623098 1606004 1593050 1584201 1579099 1577395 1578943
59239 1578943 1583659 1591456 1602411 1616671 1634021 1653882 1675966 1700717 1728909 1761115 1797741 1839159
59227 1839159 1885432 1936203 1991347 2051582 2118120 2191941 2273750 2364361 2464560 2574732 2695136
59216 2695136 2826578 2970277 3127002 3296664 3478711 3672355 3876009 4086662 4299870
59207 4299870 4510144 4711198 4896128 5057747 5189131 5284306 5338946 5350706 5319006 5244689
59197 5244689 5130084 4979420 4798946 4596433 4380184 4157875 3935794 3718942 3511631
59188 3511631 3317503 3138812 2976142 2829299 2698303 2583298 2483905 2399195 2328080 2269286
59178 2269286 2221232 2182578 2152808 2131681 2118221 2110903 2108743 2111383 2117936 2126502 2135039 2141981 2145597
59165B145597k087r889j8462k6776l4696m2027m7895n1554n3171n3378n2549n0911
59153A702202m8790m6353m3429m0038l6634l3480l0196k6422k2651j9700j7530
59142A336979j5214j2160q762n675k943k51K339M391N726O627P369P968Q501R256
59128A344151J0221J0760J0237Q857P481O700O464O615P184Q059Q846R376R890
59115A454841J0481J0823J0792J0926J1715J2753J3178J2738J1938J1318J1143
59104A582646J1612J2721J3906J4478J4601J5208J6764J8643J9988K0768K1648
59093A762983K3184K5523K8644L2421L6464M0118M2752M4072M4210M3543M2296
59082B166210M0342L7372L3149K7426J9900J0690P24q821j7557k5940l4305m2318
$$ plain form
59165 2145597 2143510 2133621 2115159 2088383 2053687 2011660 1963765 1912211 1859040 1805662 1753113 1702202
59153 1702202 1653412 1607059 1563630 1523592 1486958 1453478 1423282 1396860 1374209 1354509 1336979
59142 1336979 1321765 1309605 1300843 1295168 1292225 1291974 1294313 1298704 1304430 1311057 1318426 1326394 1334895 1344151
59128 1344151 1354372 1365132 1375369 1384226 1391707 1398407 1404871 1411486 1418670 1426729 1435575 1444951 1454841
59115 1454841 1465322 1476145 1486937 1497863 1509578 1522331 1535509 1548247 1560185 1571503 1582646
59104 1582646 1594258 1606979 1620885 1635363 1649964 1665172 1681936 1700579 1720567 1741335 1762983
59093 1762983 1786167 1811690 1840334 1872755 1909219 1949337 1992089 2036161 2080371 2123914 2166210
59082 2166210 2206552 2243924 2277073 2304499 2324399 2335089 2335813 2326992 2309435 2283495 2249190 2206872
59070B206872m9386n5050n8846o0465o0319n9384n8068n5874n2577m9085m6399
59059A601419m4224m1582l8436l5718l3779l1905k9554k7200k5454k4151k2900
59048A246516k1842k1159k0281j8422j5750j3269j1576j0417r533r146r299r349
59036A076473q657p472o548o151n854n259m380l326k067o31P81K054L255M323
59022A036541N009N310N710O647P898Q789Q980Q825Q936R581J0513J1366J2123
59009A146228J3193J4885J6875J8496J9582K0687K2319K4341K6442K8817L1918
58998A383783L5714L9690M3424M6715M9213N0427N0169M8576M5654M1231L5399
58987A869995K8491K0634J1706J980p672j6335k3453k8637l1683l2954l3320l3364
$$ plain form
59070 2206872 2157486 2102436 2043590 1983125 1922806 1863422 1805354 1749480 1696903 1647818 1601419
59059 1601419 1557195 1515613 1477177 1441459 1407680 1375775 1346221 1319021 1293567 1269416 1246516
59048 1246516 1224674 1203515 1183234 1164812 1149062 1135793 1124217 1113800 1104267 1095121 1085822 1076473
59036 1076473 1067816 1060344 1053796 1047645 1041791 1036532 1032152 1028826 1026759 1026128 1026909 1028963 1032218 1036541
59022 1036541 1041550 1046860 1052570 1059217 1067115 1075904 1084884 1093709 1102645 1112226 1122739 1134105 1146228
59009 1146228 1159421 1174306 1191181 1209677 1229259 1249946 1272265 1296606 1323048 1351865 1383783
58998 1383783 1419497 1459187 1502611 1549326 1598539 1648966 1699135 1747711 1793365 1834596 1869995
58987 1869995 1898486 1919120 1930826 1932806 1925134 1908799 1885346 1856709 1825026 1792072 1758752 1725388
58975A725388l3071l2417l1696l0917k9446k6885k3816k1148j8977j6642j3698
58964A446675j0277o649l040K27K887M939O390O981O694O269O571P499Q119P957
58950A491242P541P634Q486R976J1983J4325J6709J8938K0913K2477K3625K4925
58938A678774K7191L0554L4311L7879M1459M5534N0149N5070O0348O6233P2559
58927B200061P8376Q2245Q2960Q0257P4860O7712N9330N0312M2250L7313L6620
58916B892296L9424M4163M9848N6257O3426P1457Q0474R0294J00370J10370J20531
58905C718910J31152J42034J52782J63369J74043J84949J96105K07459K18548
58896E289351K28387K35975K40635K41646K38135K29782K17294K01751J83940
$$ plain form
58975 1725388 1692317 1659900 1628204 1597287 1567841 1540956 1517140 1495992 1477015 1460373 1446675
58964 1446675 1436398 1429749 1426709 1426936 1429823 1434762 1441152 1448133 1454827 1461096 1467667 1475166 1483285 1491242
58950 1491242 1498783 1506417 1514903 1524879 1536862 1551187 1567896 1586834 1607747 1630224 1653849 1678774
58938 1678774 1705965 1736519 1770830 1808709 1850168 1895702 1945851 2000921 2061269 2127502 2200061
58927 2200061 2278437 2360682 2443642 2523899 2598759 2666471 2725801 2776113 2818363 2855676 2892296
58916 2892296 2931720 2975883 3025731 3081988 3145414 3216871 3297345 3387639 3488009 3598379 3718910
58905 3718910 3850062 3992096 4144878 4308247 4482290 4667239 4863344 5070803 5289351
58896 5289351 5517738 5753713 5994348 6235994 6474129 6703911 6921205 7122956 7306896
58887G306896J64701J45100J25356J04089P9745N2505K3894n229l5165o5892r6345
58876G799655j25452j52717j77327j97751k13028k23824k31503k36668k39173
58867F002212k38962k36185k30898k23438k14862k06245j97645j88380j78260
58858D087337j67909j57837j47818j37555j27416j18089j09684j01623r3499q5598
58848B840309p8335p1434o4183n6540m9424m3536l8394l3077k7571k2659j8607
58837B336549j4798j0758o784l256K6L362O619R594J2553J5950J9855K4048K8358
58824B421318L2667L6837M0902M4989M8910N2168N4625N6684N8558N9983O0973
58813B968614O2298O4686O8164P2746P9101Q7684R7667J07674J17383J27600J38847
$$ plain form
58887 7306896 7471597 7616697 7742053 7846142 7925887 7978392 8002286 7997057 7961892 7896000 7799655
58876 7799655 7674203 7521486 7344159 7146408 6933380 6709556 6478053 6241385 6002212
58867 6002212 5763250 5527065 5296167 5072729 4857867 4651622 4453977 4265597 4087337
58858 4087337 3919428 3761591 3613773 3476218 3348802 3230713 3121029 3019406 2925907 2840309
58848 2840309 2761974 2690540 2626357 2569817 2520393 2476857 2438463 2405386 2377815 2355156 2336549
58837 2336549 2321751 2310993 2304209 2300953 2300979 2304341 2310960 2320554 2333107 2349057 2368912 2392960 2421318
58824 2421318 2453985 2490822 2531724 2576713 2625623 2677791 2732416 2789100 2847658 2907641 2968614
58813 2968614 3030912 3095598 3163762 3236508 3315609 3403293 3500960 3608634 3726017 3853617 3992464
58802C992464J50740J62761J74776J86613J97781K07855K16657K23929K29186
58793E742762K31917K31601K27555K19181K06228J88523J65687J37734J05668
58784G456856P0867L4079m197m2590p9067j12340j42255j68785j91611k10779
58774F610178k26748k39393k47907k52076k52684k50234k44206k34450k22402
58765D440078k09981j97790j85376j72812j60956j50272j40399j30962j22072
58756B969458j13737j05409r6536q7359p8822p1710o5889o0446n4654m8710m3289
58745B142897l8517l3926k9382k5353k1968j8583j4759j1100q384o336l940o79
58733A929970L273P692J2348J6466J8972J9260J7106J1984L438p707j9300k9439
$$ plain form
58802 3992464 4143204 4305965 4480741 4667354 4865135 5072990 5289647 5513576 5742762
58793 5742762 5974679 6206280 6433835 6653016 6859244 7047767 7213454 7351188 7456856
58784 7456856 7527723 7561802 7557605 7515015 7435948 7323608 7181353 7012568 6820957 6610178
58774 6610178 6383430 6144037 5896130 5644054 5391370 5141136 4896930 4662480 4440078
58765 4440078 4230097 4032307 3846931 3674119 3513163 3362891 3222492 3091530 2969458
58756 2969458 2855721 2750312 2653776 2566417 2487595 2415885 2349996 2289550 2234896 2186186 2142897
58745 2142897 2104380 2070454 2041072 2015719 1993751 1975168 1960409 1949309 1940925 1934589 1930649 1929970
58733 1929970 1933243 1940935 1953283 1969749 1988721 2007981 2025087 2037071 2040509 2032802 2013502 1984063
58721A984063l7569m3909m8557n1589n3363n4211n4126n3209n1963n0591m8402
58710A436574m4559l9301l3752k8567k3389j7772j2014o692j891K675P020J0810
58698A249142J3615J4622J2309N390n456j7386k7460l4699l9675m2734m3453m1733
58686A042482l8364l4250k9702k4795j9892j5344j1109p047l300q0K611M837O588
58673H72635P930Q849Q882P447M908K671J758J749J622R81j71k302n982j0789
58659I00188j5412j8828k0788k1310k0476j8745j6776j4788j2636j0440q634p299
58647G14056o100m833l597k358r22O11J987L295M750N992O352N967N817O451P290
58632G44758P562P252O772O302N878N737O041O617P275Q145R419J1075J2944J4753
$$ plain form
58721 1984063 1946494 1902585 1854028 1802439 1749076 1694865 1640739 1587530 1535567 1484976 1436574
58710 1436574 1392015 1352714 1318962 1290395 1267006 1249234 1237220 1230528 1228637 1231312 1238332 1249142
58698 1249142 1262757 1277379 1289688 1295078 1289622 1272236 1244776 1210077 1170402 1127668 1084215 1042482
58686 1042482 1004118 969868 940166 915371 895479 880135 869026 861979 858679 858599 861210 866047 872635
58673 872635 880565 889414 898296 905743 910651 913322 915080 916829 918451 919432 919261 916959 910977 900188
58659 900188 884776 865948 845160 823850 803374 784629 767853 753065 740429 729989 721355 714056
58647 714056 707956 703123 699526 697168 696246 696857 698844 702139 706889 712881 719233 725200 731017 737468 744758
58632 744758 752320 759572 766344 772646 778524 784261 790302 796919 804194 812339 821758 832833 845777 860530
58618H60530J6030J6588J7174J8919K1869K4692K6297K7077K8101K9745L1781
58607A118803L4239L7244M0402M3155M5710M8864N2953N7504O1874O5662O8549
58596A674959P0283P0832P0129O7652O2769N5477M6413L6103K4610J2014j168
58585B190073j4096k5881l5799m3591m9546n4004n6797n7568n6521n4372n1503
58574A690395m7724m3103l8551l5135l3005l1334k9288k6782k4328k2321k0692
58563A338132j9233j7963j6973j6040j4895j3969j4363j6619j9849k2591k4370
58552A141267k5812k7413k8798k9373k9141k8561k7895k6959k5437k3293k1026
58541H47559j9351j8459j7738j6563j5202j4395j4147j3660j2590j1536j0928
$$ plain form
58618 860530 876560 893148 910322 929241 951110 975802 1002099 1029176 1057277 1087022 1118803
58607 1118803 1153042 1190286 1230688 1273843 1319553 1368417 1421370 1478874 1540748 1606410 1674959
58596 1674959 1745242 1816074 1886203 1953855 2016624 2072101 2118514 2154617 2179227 2191241 2190073
58585 2190073 2175977 2150096 2114297 2070706 2021160 1967156 1910359 1852791 1796270 1741898 1690395
58574 1690395 1642671 1599568 1561017 1525882 1492877 1461543 1432255 1405473 1381145 1358824 1338132
58563 1338132 1318899 1300936 1283963 1267923 1253028 1239059 1224696 1208077 1188228 1165637 1141267
58552 1141267 1115455 1088042 1059244 1029871 1000730 972169 944274 917315 891878 868585 847559
58541 847559 828208 809749 792011 775448 760246 745851 731704 718044 705454 693918 682990
58530F82990j0216q828p323o623o516n905m551l519l585m036l618k118m36O47
58516F16363J129J402J746K247K881L633M614N930P313Q159Q375Q810J0253J2157
58502F95012J3120J2674J1820J1485J1227J0013P675M873K095n28k681l923m380
58489G68482m663n052n307n327n401n681n980o230o581o894o754o213n937o240
58475F86222o506o038n066m390m428m983n689o145n969n197m466m330m533m420
58461F14062l864l321l094l052l035l019k913k590k180j864j404l25J331K807
58447E87539L414L241K958L131L792M472M523L606K030N81m6K93J118J705J679
58432F24036J368J358J649J644J113O97J020J770K227K403K815L389L441K883
$$ plain form
58530 682990 672774 663946 656623 650000 643484 637579 633028 629509 625924 621888 618270 616152 615716 616363
58516 616363 617492 618894 620640 622887 625768 629401 634015 639945 647258 655417 663792 672602 682855 695012
58502 695012 708132 720806 732626 744111 755338 765351 773026 777899 779994 779466 776785 772862 768482
58489 768482 763819 758767 753460 748133 742732 737051 731071 724841 718260 711366 704612 698399 692462 686222
58475 686222 679716 673678 668612 664222 659794 654811 649122 642977 637008 631811 627345 623015 618482 614062
58461 614062 610198 606877 603783 600731 597696 594677 591764 589174 586994 585130 583726 583401 584732 587539
58447 587539 590953 594194 597152 600283 604075 608547 613070 616676 618706 619287 619241 619534 620652 622357 624036
58432 624036 625404 626762 628411 630055 631168 631865 632885 634655 636882 639285 642100 645489 648930 651813
58418F51813K581L148M133M795N127N551O005O034N614N321N589O160O421O055
58404G24347N264M515M074L839L558L106K579K185K159K618L355L933M143M224
58390G73899M370M269L588K674K244K430K656K592K503K541K326J654J093J330
58376H10169K267L209L781M181M697N394O219P093P892Q556R159R696J0013J0109
58362I02435J0293J0707J0960J0598R827R352R492R845R940R808R830J0165J0545
58349A033797J0521R889Q915Q202Q197Q833R604R981R826R499R640J0606J2063
58336A159573J3279J3894J4172J4431J4550J4309J3955J4036J4814J6174J7919
58325A321106J9801K1360K2187K2417K2656K3322K4274K5104K5577K5775K5967
$$ plain form
58418 651813 654394 657542 661675 666470 671597 677148 683153 689187 694801 700122 705711 711871 718292 724347
58404 724347 729611 734126 738200 742039 745597 748703 751282 753467 755626 758244 761599 765532 769675 773899
58390 773899 778269 782538 786126 788800 791044 793474 796130 798722 801225 803766 806092 807746 808839 810169
58376 810169 812436 815645 819426 823607 828304 833698 839917 847010 854902 863458 872617 882313 892326 902435
58362 902435 912728 923435 934395 944993 954820 964172 973664 983509 993449 1003257 1013087 1023252 1033797
58349 1033797 1044318 1054207 1063122 1071324 1079521 1088354 1097958 1107939 1117765 1127264 1136904 1147510 1159573
58336 1159573 1172852 1186746 1200918 1215349 1229899 1244208 1258163 1272199 1287013 1303187 1321106
58325 1321106 1340907 1362267 1384454 1406871 1429527 1452849 1477123 1502227 1527804 1553579 1579546
58314A579546K6280K6358K5502K3485K1053J9135J7710J5995J3780J1943J1395
58303A792182J2017J3024J3947J4897J6157J7905K0096K2318K4045K5340K6928
58292A998856K9178L1345L2443L2573L2791L3757L5276L7067L9147M1240M2631
58281B386304M3117M3590M5114M7809N1062N4410N7592O0140O1703O2788O4378
58270B978007O6645O8638O9529O9680P0105P1234P2736P4302P5972P7721P9297
58259C773866Q0777Q2908Q6333R0616R4567R7589J00310J03660J07809J12425
58249D730860J17555J23528J30158J36788J43299J50366J58445J67048J75527
58240F033574J84034J93196K03146K13432K23715K34134K45154K57472K71772
$$ plain form
58314 1579546 1605826 1632184 1657686 1681171 1702224 1721359 1739069 1755064 1768844 1780787 1792182
58303 1792182 1804199 1817223 1831170 1846067 1862224 1880129 1900225 1922543 1946588 1971928 1998856
58292 1998856 2028034 2059379 2091822 2124395 2157186 2190943 2226219 2263286 2302433 2343673 2386304
58281 2386304 2429421 2473011 2518125 2565934 2616996 2671406 2728998 2789138 2850841 2913629 2978007
58270 2978007 3044652 3113290 3182819 3252499 3322604 3393838 3466574 3540876 3616848 3694569 3773866
58259 3773866 3854643 3937551 4023884 4114500 4209067 4306656 4406966 4510626 4618435 4730860
58249 4730860 4848415 4971943 5102101 5238889 5382188 5532554 5690999 5858047 6033574
58240 6033574 6217608 6410804 6613950 6827382 7051097 7285231 7530385 7787857 8059629
58231H059629K88161L05848L23947L42508L62544L85134M10874M39877M71845
58222A1390367N06231N42843N82303O25649O73693P27125P86977Q54350R29911
58213A7619449J014262J108784J215729J337638J477265J637974J823798K039372
58205B9274271K290614K585652K934743L349345L841893M426349N117638N928517
58197E9749022O865723P930332R125318J0466063J1984738J3725755J5738564
58190A35585515J8069282K0737640K3685611K6702769K9344790L0871143L0279195
58183C15275945K6569854J9285883R058756k335153j2673670k0359276k5056769
58176C09765570k7436144k8365520k8315747k7367589k5560834k3115906k0373605
$$ plain form
58231 8059629 8347790 8653638 8977585 9320093 9682637 10067771 10478645 10918522 11390367
58222 11390367 11896598 12439441 13021744 13647393 14321086 15048211 15835188 16689538 17619449
58213 17619449 18633711 19742495 20958224 22295862 23773127 25411101 27234899 29274271
58205 29274271 31564885 34150537 37085280 40434625 44276518 48702867 53820505 59749022
58197 59749022 66614745 74545077 83670395 94136458 106121196 119846951 135585515
58190 135585515 153654797 174392437 198078048 224780817 254125607 284996750 315275945
58183 315275945 341845799 361131682 370190438 367855285 355181615 334822339 309765570
58176 309765570 282329426 253963906 225648159 198280570 172719736 149603830 129230225
58169A29230225j7634625j5085542j2816694j0855290r186398p775074o586420
58162D9290182n590286m757092m058887l473791k984906k576444k234258j948213
58154B1666305j710689j513461j348084j208159j089431r88337r01465q25432
58146A2081247p56573o91991o31331n75953n26018m80022m37396l99285l65967
58137G216711l35678l07166k81581k60646k44643k33170k26004k21742k17205
58128D888876k09918k00096j89035j76957j63955j51605j41636j33633j25843
58119C396198j17743j10222j03670r7535r1714q6882q3309q0415p7633p4773p1502
58108B400800o7430o2885n8809n5650n2919m9949m6581m3037l9640l6772l4679
$$ plain form
58169 129230225 111595600 96510058 83693364 72838074 63651676 55876602 49290182
58162 49290182 43699896 38942804 34883917 31410126 28425220 25848776 23614518 21666305
58154 21666305 19955616 18442155 17094071 15885912 14796481 13808144 12906679 12081247
58146 12081247 11324674 10632683 10001352 9425399 8899381 8419359 7981963 7582678 7216711
58137 7216711 6881033 6573867 6292286 6031640 5786997 5553827 5327823 5106081 4888876
58128 4888876 4678958 4478862 4289827 4112870 3948915 3797310 3655674 3522041 3396198
58119 3396198 3278455 3168233 3064563 2967028 2875314 2788432 2705123 2624708 2547075 2472302 2400800
58108 2400800 2333370 2270485 2211676 2156026 2103107 2053158 2006577 1963540 1923900 1887128 1852449
58097A852449l3156l1704l0051k8322k6713k5333k4395k4247k5009k6261k7183
58086A550075k7138k6222k5148k4535k4380k4304k4091k3794k3571k3744k4590
58075A278558k5689k5915k4759k3268k2757k2911k2264k0553j9252j9407k0105
58064A031678j9789j8161j6112j4393j3200j2555j2354j2234j1891j1415j1052
58053H78522j0974j1350j2115j2554j1854j0304r193r097r130q356p153o498o552
58040G53392o818p068p232o853n552l842k674k339k392k507k729l081l543m228
58026F92534n048n380m675l271k094j658j810k181k331j670Q4K346M049M713M789
58011F78397N054N927P266Q536R329R899J0934J2625J4410J5878J7372J9255K1141
$$ plain form
58097 1852449 1819293 1787589 1757538 1729216 1702503 1677170 1652775 1628528 1603519 1577258 1550075
58086 1550075 1522937 1496715 1471567 1447032 1422652 1398348 1374257 1350463 1326892 1303148 1278558
58075 1278558 1252869 1226954 1202195 1178927 1156170 1133259 1110995 1090442 1071190 1051783 1031678
58064 1031678 1011889 993728 977616 963223 950023 937468 925114 912880 900989 889574 878522
58053 878522 867548 856198 844083 831529 819675 809371 800178 791081 781951 773595 766442 759944 753392
58040 753392 746574 739506 732274 725421 719869 716027 713353 711014 708622 706115 703386 700305 696762 692534
58026 692534 687486 682106 677431 674160 672066 670408 668598 666417 664086 662416 662500 664846 668895 673608 678397
58011 678397 683451 689378 696644 705180 714509 724408 735342 747967 762377 778255 795627 814882 836023
57998H36023K2525K3651K5093K6824K8456L0023L1777L3488L4780L5936L7449
57987A166025L8942L9482L8957L8236L7743L6758L4474L1116K7632K4710K2427
57976A536502K0438J8174J5103J0860N097k657j2580k4009l5684m6385n5060o0662
57964A369137o2617o1432n8306n4056m8952m3429l8204l3527k8931k4059j9282
57953H96342j5229j2104r639p467n397l512k106j265o59M8O98R99J071J157J051
57938H43988N19J45Q78K689M530N890P539J0311J3889J7277J9994K2192K3946
57925I73787K5011K5092K3953K1287J6765J0241J903p581j7059k5391l1994l6760
57913I79254l9494l9942l8345l5547l2347k9085k5886k2841j9915j7133j4906
$$ plain form
57998 836023 858548 882199 907292 934116 962572 992595 1024372 1057860 1092640 1128576 1166025
57987 1166025 1204967 1244449 1283406 1321642 1359385 1396143 1430617 1461733 1489365 1514075 1536502
57976 1536502 1556940 1575114 1590217 1601077 1606174 1603517 1590937 1566928 1531244 1484859 1429799 1369137
57964 1369137 1306520 1245088 1186782 1132726 1083774 1040345 1002141 968614 939683 915624 896342
57953 896342 881113 869009 859370 851903 846506 842994 840888 839623 838964 839012 839710 840709 841780 842937 843988
57938 843988 844507 844652 845530 848219 852749 858639 866178 876489 890378 907655 927649 949841 973787
57925 973787 998798 1023890 1047843 1069130 1085895 1096136 1098039 1090458 1073399 1048008 1016014 979254
57913 979254 939760 899818 861473 825926 793579 764494 738608 715767 695852 678719 663813
57902F63813j3612j2876j1922j0765j0314j0994j2024j2462j2267j1857j1248
57891E33472j0336r487r099q842q084o851n698m756l525j665M94K319L478M140
57877D75560M816N853O920P297O888O610P300Q551R225Q855P888O702N140L185
57863E70790J372J72o34j565k705l693m267m515m669m857n055n170n155n038m801
57848E20210m272l232j747k45Q22J397J819K343K839K986K773K538K431K190J647
57833E34499J207J298J517R19o93k305k818k215j298o14j51K42O74J504L208N830
57817E40804Q776J1361J3430J5282J7115J8540J8740J7191J4344J1557J0201J0806
57805G08147J2976J5977J9386K3190K7394L1506L4627L6155L6124L4567L0799
$$ plain form
57902 663813 650201 637325 625403 614638 604324 593330 581306 568844 556577 544720 533472
57891 533472 523136 513649 504550 495708 487624 480773 475075 470319 466794 465129 465623 467942 471420 475560
57877 475560 480376 486229 493149 500446 507334 513944 521244 529795 539020 547875 555763 562465 567605 570790
57863 570790 572162 572334 571700 570135 567430 563737 559470 554955 550286 545429 540374 535204 530049 525011 520210
57848 520210 515938 512706 510959 510714 511536 512933 514752 517095 519934 522920 525693 528231 530662 532852 534499
57833 534499 535706 537004 538521 539440 538747 536442 533624 531409 530111 529497 529346 529588 530262 531766 534974 540804
57817 540804 549580 560941 574371 589653 606768 625308 644048 661239 675583 687140 697341 708147
57805 708147 721123 737100 756486 779676 807070 838576 873203 909358 945482 980049 1010848
57794A010848K4026J4635M277n563j4475k2382k8737l3045l5647l7286l8168l8094
57782H00389l7170l5688l3568l0730k7846k5836k4563k2895k0305j7609j5663
57771E08516j4133j2164r760p729o512n728m883l991l282k678j852p22K69N21
57757D35872p0q28q78J4J284K278K847L187L439L656M036M832O071P470Q603R116
57741D90929Q934Q430Q244Q658R175Q922P520N451L552K319J660J181N85j12p41
57726E64707j203j502j549j179m50L11R21J615K603L523L823L681L953M986O004
57711E90244O110N571N504O465P944R304J0515J1737J2727J3138J3096J3085J3392
57698G18832J3977J4775J5743J6748J7739J9014K0965K3605K6635K9884L3312
$$ plain form
57794 1010848 1034874 1049509 1053786 1048223 1033748 1011366 982629 949584 913937 876651 838483 800389
57782 800389 763219 727531 693963 663233 635387 609551 584988 562093 541788 524179 508516
57771 508516 494383 482219 472459 464730 458218 452490 447607 443616 440334 437656 435804 435082 435351 435872
57757 435872 435802 434974 434096 434110 435394 437672 440519 443706 447145 450801 454837 459669 465740 473210 481813 490929
57741 490929 499863 508293 516537 525195 534370 543292 550812 556263 559815 562134 563794 564975 565560 565448 564707
57726 564707 563504 562002 560453 559274 558824 559135 560056 561671 564274 567797 571620 575301 579254 584240 590244
57711 590244 596354 601925 607429 613894 621838 631142 641657 653394 666121 679259 692355 705440 718832
57698 718832 732809 747584 763327 780075 797814 816828 837793 861398 888033 917917 951229
57687I51229L6662L9640M2562M6310N1381N7338O3476O9657P6173Q3042Q9870
57676A607340R6281J02107J07276J11897J16424J21358J26706J31946J36327J38399
57666B796061J34623J19006Q5632L3334l1226r5334j46187j76757j87457j83521
57656B348174j71103j54954j37960j21609j06608r3325q1835p1717o2287n3297
57646A293479m5129l8114l1932k6055k0541j5951j2532r878p434m952k376L33
57634A078918L147N990Q924J2088J5318J8172K0483K2643K5097K7797L0451L3114
57622A302142L6090L9341M2387M4942M7280M9726N2065N3750N4485N4267N2897
57611A829372M9931M5216L9005L1358K1865J0445j836j3371k3417l2438m0910
$$ plain form
57687 951229 987891 1027531 1070093 1116403 1167784 1225122 1288598 1358255 1434428 1517470 1607340
57676 1607340 1703621 1805728 1913004 2024901 2141325 2262683 2389389 2521335 2657662 2796061
57666 2796061 2930684 3049690 3135322 3168656 3137430 3042096 2895909 2719152 2531695 2348174
57656 2348174 2177071 2022117 1884157 1762548 1655940 1562615 1480780 1409063 1346776 1293479
57646 1293479 1248350 1210236 1178304 1152249 1131708 1115757 1103225 1093347 1085913 1080961 1078585 1078918
57634 1078918 1082065 1088055 1096979 1109067 1124385 1142557 1163040 1185683 1210780 1238577 1269028 1302142
57622 1302142 1338232 1377573 1419960 1464902 1512182 1561908 1613973 1667723 1722208 1776475 1829372
57611 1829372 1879303 1924519 1963524 1994882 2016747 2027192 2025356 2011985 1988568 1956130 1915220
57600A915220m8378n3984n7464n9217n9660n9017n7590n5692n3287n0087m6187
57589A314657m2289l9043l6378l3635l0372k6869k3852k1765k0358j8999j7334
57578A003763j5538j3869j2172j0105p734n640m295l585l094k645k328k098j720
57565I18940j168p33n42k21O18J739K542K968L595M629N385N206M587M696N890
57550I58131P345Q275Q844R573J0442J1038J1334J1740J2441J3147J3565J3906
57538A089781J4752J6454J8717K0816K2304K3470K4978K7092K9527L1988L4384
57527A354263L6561L8302L9873M1989M4769M7175M8127M7918M7802M8164M7844
57516A842787M5432M0707L4397K7079J8823R779M99q486j7010k4854l1286l5487
$$ plain form
57600 1915220 1866842 1812858 1755394 1696177 1636517 1577500 1519910 1464218 1410931 1360844 1314657
57589 1314657 1272368 1233325 1196947 1163312 1132940 1106071 1082219 1060454 1040096 1021097 1003763
57578 1003763 988225 974356 962184 952079 944345 938705 934410 930825 927731 925086 922758 920660 918940
57565 918940 917772 917039 916497 916276 916894 918633 921175 924143 927738 932367 937752 942958 947545 952241 958131
57550 958131 965476 973751 982595 992168 1002610 1013648 1024982 1036722 1049163 1062310 1075875 1089781
57538 1089781 1104533 1120987 1139704 1160520 1182824 1206294 1231272 1258364 1287891 1319879 1354263
57527 1354263 1390824 1429126 1468999 1510988 1555757 1602932 1651059 1698977 1746779 1794943 1842787
57516 1842787 1888219 1928926 1963323 1990402 2009225 2019004 2019503 2011017 1994007 1969153 1937867 1902380
57504A902380l7534l8485l9220l9548l8875l7317l5499l3419l0424k6498k2686
57493A522875j9812j7450j4748j1675q785o221l759j514K42J837L930O520Q919
57480A460359J0716J2148J3512J4847J6276J7967J9695K1034K2113K3540K5474
57469A657681K7463K9341L1508L4087L6575L8724M0978M3550M5776M7023M7640
57458B080346M8174M8161M6518M2883L7806L1748K4631J6392P344k020j1058j8887
57446B352038k4899k9423l3269l6579l8668l9146l8508l7347l5573l2914k9751
57435A975961k6858k4410k1807j8531j4862j1601r217p461n795m106k835k279
57423A826199j971j019Q58K945M317M845N193N914O879P602P948Q295R046J0106
$$ plain form
57504 1902380 1864846 1826361 1787141 1747593 1708718 1671401 1635902 1602483 1572059 1545561 1522875
57493 1522875 1503063 1485613 1470865 1459190 1450405 1444184 1440425 1438911 1439153 1440990 1444920 1451440 1460359
57480 1460359 1471075 1483223 1496735 1511582 1527858 1545825 1565520 1586554 1608667 1632207 1657681
57469 1657681 1685144 1714485 1745993 1780080 1816655 1855379 1896357 1939907 1985683 2032706 2080346
57458 2080346 2128520 2176681 2223199 2266082 2303888 2335636 2360267 2376659 2384003 2381983 2370925 2352038
57446 2352038 2327139 2297716 2264447 2227868 2189200 2150054 2111546 2074199 2038626 2005712 1975961
57435 1975961 1949103 1924693 1902886 1884355 1869493 1857892 1848675 1841214 1835419 1831313 1828478 1826199
57423 1826199 1824228 1823209 1824067 1827012 1831329 1836174 1841367 1847281 1854160 1861762 1869710 1878005 1887051 1897157
57409A897157J0956J1207J1050J1087J1730J2830J3891J4577J4909J5017J4926
57398B039337J4688J4596J4943J5561J5902J5745J5564J5888J6539J6884J6755
57387B212402J6695J7194J8173J9305K0436K1321K1493K0855K0093K0002K0480
57376B428449K0777K0653K0638K1039K1357K1059K0425K0074K0038J9904J9724
57365B654137K0063K1059K2047K2405K2335K2393K2668K2849K2926K3166K3465
57354B899513K3340K2752K2409K2901K3854K4495K4739K5175K5977K6408K5775
57343C167338K4504K3851K4526K5935K6936K7113K7072K7438K7988K8013K7380
57332C458094K6727K6666K7215K8145K9335L0469L0896L0400K9791L0112L1373
$$ plain form
57409 1897157 1908113 1919320 1930370 1941457 1953187 1966017 1979908 1994485 2009394 2024411 2039337
57398 2039337 2054025 2068621 2083564 2099125 2115027 2130772 2146336 2162224 2178763 2195647 2212402
57387 2212402 2229097 2246291 2264464 2283769 2304205 2325526 2347019 2367874 2387967 2407969 2428449
57376 2428449 2449226 2469879 2490517 2511556 2532913 2553972 2574397 2594471 2614509 2634413 2654137
57365 2654137 2674200 2695259 2717306 2739711 2762046 2784439 2807107 2829956 2852882 2876048 2899513
57354 2899513 2922853 2945605 2968014 2990915 3014769 3039264 3064003 3089178 3115155 3141563 3167338
57343 3167338 3191842 3215693 3240219 3266154 3293090 3320203 3347275 3374713 3402701 3430714 3458094
57332 3458094 3484821 3511487 3538702 3566847 3596182 3626651 3657547 3687947 3717738 3747850 3779223
57321C779223L2649L3333L3676L4096L4614L5085L5450L5541L5210L4818L5036
57310D158731L5921L6723L6935L6950L7348L8066L8748L9334L9789L9828L9502
57299D577875L9584M0619M1968M2633M2648M2745M2875M2207M0611L9047L8116
57288E030928L7273L5882L4189L2654L1055K9010K6908K5505K4999K5060K5559
57277E359022K6560K7816K8957L0098L1640L3490L5024L5915L6462L7053L7794
57266E719831L8739L9993M1347M2268M2525M2485M2597M2881M3162M3435M3700
57255F182963M3757M3564M3524M3989M4593M4619M4003M3482M3661M4377M5217
57244F667749M6272M7950N0279N2761N4959N6864N8684O0612O2876O5676O8714
$$ plain form
57321 3779223 3811872 3845205 3878881 3912977 3947591 3982676 4018126 4053667 4088877 4123695 4158731
57310 4158731 4194652 4231375 4268310 4305260 4342608 4380674 4419422 4458756 4498545 4538373 4577875
57299 4577875 4617459 4658078 4700046 4742679 4785327 4828072 4870947 4913154 4953765 4992812 5030928
57288 5030928 5068201 5104083 5138272 5170926 5201981 5230991 5257899 5283404 5308403 5333463 5359022
57277 5359022 5385582 5413398 5442355 5472453 5504093 5537583 5572607 5608522 5644984 5682037 5719831
57266 5719831 5758570 5798563 5839910 5882178 5924703 5967188 6009785 6052666 6095828 6139263 6182963
57255 6182963 6226720 6270284 6313808 6357797 6402390 6447009 6491012 6534494 6578155 6622532 6667749
57244 6667749 6714021 6761971 6812250 6865011 6919970 6976834 7035518 7096130 7159006 7224682 7293396
57233G293396P1025P1573P0079O7053O3095N8511N3606M8925M4756M0720L6241
57222G918980L1471K7273K4183K1724J9093J6238J3860J2421J1620J0958J0433
57211H118254J0417J1058J2063J2992J3535J3576J3279J3125J3554J4449J5175
57200H261477J5312J5139J5192J5499J5589J5205J4700J4490J4405J3793J2294
57189H423095J0245Q362P042O067M889L187J133r74l189n791q666j1163j2870
57176H421367j4188j5743j7388j8419j8727j9038j9707j9978j9042j7374j6259
57165H225504j6215j6522j6260j5121j3168j0610q022o125m953l692j821J2O92
57152H113699j88k301n487j0140j6838k5906l6833m7507n4474n5247n0858m5549
$$ plain form
57233 7293396 7364421 7435994 7506073 7573126 7636221 7694732 7748338 7797263 7842019 7882739 7918980
57222 7918980 7950451 7977724 8001907 8023631 8042724 8058962 8072822 8085243 8096863 8107821 8118254
57211 8118254 8128671 8139729 8151792 8164784 8178319 8191895 8205174 8218299 8231853 8246302 8261477
57200 8261477 8276789 8291928 8307120 8322619 8338208 8353413 8368113 8382603 8397008 8410801 8423095
57189 8423095 8433340 8441702 8448744 8454811 8459700 8462887 8464020 8463046 8459857 8454066 8445400 8434237 8421367
57176 8421367 8407179 8391436 8374048 8355629 8336902 8317864 8298157 8278179 8259137 8241763 8225504
57165 8225504 8209289 8192767 8176507 8161386 8148218 8137608 8129586 8123461 8118508 8114816 8112995 8113007 8113699
57152 8113699 8113511 8111210 8105723 8095583 8078745 8052839 8016006 7968499 7914025 7858778 7807920 7762371
57140G762371m3365m5283m9598n4328n8596o2186o4745o5765o4955o2448n8845
57129G132257n5150n2415n1205n1363n2297n3426n4339n4661n3933n1736m7943
57118F553789m2889l7178l1205k4825j7573r184J77J0386K1909L5624N2046P1088
57106F582165R2840J18359J49259J86663K31040K83216L45062M19023N07301O11882
57096I526810P34880Q78086J041837J224451J422877J633899J854880K083344
57088B0401064K315657K545722K764190K957592L107246L190335L185901L083287
57080D3550994K885195K600879K235604J787595J256065O52397M202o50219j271950
57071E3050762j829826k304125k685676k972497l166590l272182l295067l242381
$$ plain form
57140 7762371 7719006 7673723 7624125 7569797 7511201 7449015 7384270 7318505 7253550 7191102 7132257
57129 7132257 7077107 7024692 6973487 6922124 6869827 6816401 6762062 6707401 6653468 6601732 6553789
57118 6553789 6510900 6473722 6442517 6417692 6400119 6390935 6391112 6401498 6423407 6459031 6511077 6582165
57106 6582165 6675005 6793364 6942623 7129286 7360326 7643542 7988604 8407627 8914928 9526810
57096 9526810 10261690 11139776 12181613 13406064 14828941 16462840 18317720 20401064
57088 20401064 22716721 25262443 28026633 30984225 34091471 37281806 40467707 43550994
57080 43550994 46436189 49037068 51272672 53060267 54316332 54968729 54972931 54322712 53050762
57071 53050762 51220936 48916811 46231135 43258638 40092048 36819866 33524799 30282418
57063C0282418l123017k948468k732921k491801k239692j988890j748776j525599
57055A1483254j322881j142416r84905q49662p34336o35785n51406m79402m18048
57046D364413l65464l20285k81964k49865k22453j97929j75630j56198j40146
57037B254479j26758j14667j03101r2042q1481p1218o1279n1823m2490l2646k2256
57026A454718j1723o22J2337K7968M6444O8285R2343J10486J07246P0578N197
57015A983257o7201j23042j51840j57423j48926j33764j16754j00970q7464p5724
57005H20149o5280n6313m8852m2523l7166l2756k8816k4859k1341j9128j8090
56994D25025j7251j6224j5408j4722j3450j1487r538p757n340j883J890N314Q477
$$ plain form
57063 30282418 27159401 24210933 21478012 18986211 16746519 14757629 13008853 11483254
57055 11483254 10160373 9017957 8033052 7183390 6449054 5813269 5261863 4782461 4364413
57046 4364413 3998949 3678664 3396700 3146835 2924382 2726453 2550823 2394625 2254479
57037 2254479 2127721 2013054 1909953 1817911 1736430 1665212 1603933 1552110 1509620 1476974 1454718
57026 1454718 1442995 1442373 1454710 1482678 1529122 1597407 1689750 1800236 1907482 1978060 1983257
57015 1983257 1916056 1793014 1641174 1483751 1334825 1201061 1084307 983337 895873 820149
57005 820149 754869 698556 649704 607181 570015 537259 508443 483584 462243 443115 425025
56994 425025 407774 391550 376142 361420 347970 336483 326945 319188 313848 311965 313855 319169 327646
56981C27646J1158J2115J0486P063L364j4l197n841p252p448p095o490n391l854
56967C25250k420j334k31J144K513L590M654O201Q320J0629J2760J4582J5898
56954D01556J6074J4249J0022L890l108r993j5927j9887k0898j8893j5093j1252
56942C30740q509o883n581l670q30K378N053O938Q582J0597J3083J5901J8920
56929C86719K1603K2661K0691J5242P083k307j1274j8351k2712k4511k4540k3554
56917C46750k1941j9965j7887j5826j3692j1344q846o538m864m022l703l295k470
56904B12357j491q64p65q91q36n03j92k08l64J3J364L280M875N776O389P172Q105
56887B43217R082J0309J1951J3516J4042J2826R823N515P86l328o110p547q089
$$ plain form
56981 327646 338804 350919 361405 368468 371832 371818 368621 362780 355528 348080 340985 334495 329104 325250
56967 325250 322830 321496 321265 322409 324922 328512 333166 339367 347687 358316 371076 385658 401556
56954 401556 417630 431879 441901 445791 442683 432690 416763 396876 375978 357085 341992 330740
56942 330740 322231 315348 309767 306097 305267 307645 312698 319636 328218 338815 351898 367799 386719
56929 386719 408322 430983 451674 466916 473999 471692 460418 442067 419355 394844 370304 346750
56917 346750 324809 304844 286957 271131 257439 246095 237249 230711 225847 221825 218122 214827 212357
56904 212357 210866 210002 209237 208346 207510 207007 206815 206607 206243 206256 207620 210900 215775 221551 227940 235112 243217
56887 243217 252299 262608 274559 288075 302117 314943 324766 330281 331067 327739 321629 314082 305993
56874C05993q055p401n987l888j386J175L633O152Q997J2041J4779J7021J9347
56861C62421K2461K6217K9686L2042L2821L1235K6054J6839N111o352j5390k1326
56849E41819k4187k3955k1018j6714j2508q719m659r3M286Q023J1746J6311K1634
56836D91966K7056L2460L8151M3802M8221N0040M7858L9995K5438N752j4794l1778
56824H04167m3092m8818m9692m6652m1290l5400k9756k3965j7659j1268n381L6
56812D51230N336J0499J5239J9703K4543L0038L5291L8441L7651L1894K1138O432
56800G27435r956k4927l5864m1828m3443m1774l7783l2601k7498k3085j8976j4603
56788C75097j0057n821j956J880N821R614J3020J6012J8496K0080K0118J7873
$$ plain form
56874 305993 297938 290537 284550 280662 279276 280451 284084 290236 299233 311274 326053 343074 362421
56861 362421 384882 411099 440785 472827 505648 536883 562937 579776 584887 578535 563145 541819
56849 541819 517632 493677 472659 455945 443437 434718 430059 429966 434252 442275 454021 470332 491966
56836 491966 519022 551482 589633 633435 681656 731696 779554 819549 844987 850739 835945 804167
56824 804167 761075 712257 662565 615913 574623 539223 509467 485502 467843 456575 451194 451230
56812 451230 456566 467065 482304 502007 526550 556588 591879 630320 667971 699865 721003 727435
56800 727435 717479 692552 656688 614860 571417 529643 491860 459259 431761 408676 389700 375097
56788 375097 365040 359219 357263 359143 364964 374578 387598 403610 422106 442186 462304 480177
56776D80177J2784M936m583j3929k1265k5522k6766k6003k4440k2774k1125j9457
56764B92033j7819j6124j4178j2116j0391r156q048o890o090n906n786n046l868
56751A70615k941k344j553n07J32mm40n81m16j48K82Q67J179R87Q76J571K721
56734A70296L040J912K72m68l5O24O40Q7n12r74j349j447r48JP40P96L21k29n99
56715A72168p32n63p4N27R04Q39L70j87l40K48J306K084K113J810K066L283M882
56698A90704N842N698M984M641M933N170M620L484K531J992J353L00p91j460j742
56683B32259j791j424m86P01J618K070K095J797J520J813K681L275K829J613M53
56668B51023k99p48p35k2R22J192N80k67r51j823l123m303m707m462m171l998
$$ plain form
56776 480177 492961 497897 493314 479385 458120 432598 405832 379829 355389 332615 311490 292033
56764 292033 274214 258090 243912 231796 221405 212249 204201 197311 191221 185315 179529 174483 170615
56751 170615 167674 165330 163777 163270 163402 163398 162958 162377 161961 161813 162095 162962 164141 165128 166004 167575 170296
56734 170296 173336 175248 175520 175052 175017 175641 176281 176368 175856 174882 173533 172086 171138 171139 171879 172675 172996 172767 172168
56715 172168 171436 170873 170799 171326 172230 173069 173439 173252 172912 173160 174466 176550 178663 180473 182539 185822 190704
56698 190704 196546 202244 207228 211869 216802 221972 226592 230076 232607 234599 235952 236252 235461 234001 232259
56683 232259 230468 229044 228558 229259 230877 232947 235042 236839 238359 240172 242853 246128 248957 250570 251023
56668 251023 250724 249976 249241 249219 250141 251333 251913 251646 250695 248872 245749 241446 236739 232277 228106 224108
56652B24108l514k463j297q72j580k844l516k928j488k02K59j12q45j218o47O37
56636B01478J457Q55o40j483q72N67J807K437K476J917Q99j39q90j435j827j862
56620B04745j580j504j939k439k437k074j843j795j601j243r88q18m52O5L91N36
56604A85024Q79J471J913K098K496L307L894L568K553J613R96M51J15N59J730
56589B12667K629K486J745J336J352J136M80j8J13N25O30L89K23L80P17R63R75
56572B28728P82N45M14L88M84R42J992L318M166M085L393K720K351K127J680P20
56556B58835n76j387r73K39Q56R8j359k481l112l596l847l598l219l307l711l793
56540B25069l597l780m431m802m449l797l352l007k470j891j637j817k222k429
$$ plain form
56652 224108 220594 218131 216834 215962 214382 211538 208022 205094 203606 203404 203663 203551 202706 201488 200841 201478
56636 201478 202935 203790 203150 201667 200795 201362 203169 205606 208082 209999 210898 210759 209869 208434 206607 204745
56620 204745 203165 201661 199722 197283 194846 192772 190929 189134 187533 186290 185302 184484 184032 184097 184488 185024
56604 185024 185903 187374 189287 191385 193881 197188 201082 204650 207203 208816 209812 210263 210378 210937 212667
56589 212667 215296 217782 219527 220863 222215 223351 223831 223813 223926 224451 225081 225470 225693 226073 226790 227753 228728
56572 228728 229510 230055 230469 230857 231341 232283 234275 237593 241759 245844 249237 251957 254308 256435 258115 258835
56556 258835 258259 256872 255899 256138 256994 257092 255733 253252 250140 246544 242697 239099 235880 232573 228862 225069
56540 225069 221472 217692 213261 208459 204010 200213 196861 193854 191384 189493 187856 186039 183817 181388
56526A81388j905m99R81J308J73j349j980j490o05m3K3j16m0L38N75K43l70n88
56508A76044l78m39j053j531j198m00M4m6j97j49j27l34o01n76o4P71J441J526
56490A72733J113O73M63L56L05M71P37O77L39M23J238J930J533L47m28k61K77
56473A82926O26Q93J242J334Q75K68K02P79J441J705J584J269P21j48j030j257
56457A93430m86P75J535J302N17kN6L38L87J79N7J98L29P2n06r12q50n98n94q87
56437A94340j201j327j191p58k32r9n36r92q72m42m02p07o35m3L46J38j03J38
56419A85422N44P04Q74J340J616J173M72M23J066J648J784J696J449Q44J33k9
56403B01159N49J403K199K949L366K902J804J268J859K542K043O16l90m96n52
$$ plain form
56526 181388 179483 178984 179965 181273 181446 180097 178117 176627 176022 175979 176002 175886 175846 176184 176759 177002 176632 176044
56508 176044 175666 175227 174174 172643 171445 171045 171089 171043 170846 170697 170570 170236 169635 169059 168995 169766 171207 172733
56490 172733 173846 174519 174982 175338 175643 176114 176851 177528 177867 178290 179528 181458 182991 183338 182910 182649 182926
56473 182926 183552 184445 185687 187021 187896 188164 188366 189145 190586 192291 193875 195144 195865 195717 194687 193430
56457 193430 192944 193719 195254 196556 197073 197071 197127 197465 197852 198031 198088 198286 198615 198687 198181 197269 196419 195821 195227 194340
56437 194340 193139 191812 190621 189863 189631 189532 188996 188004 187132 186690 186288 185581 184946 184903 185249 185387 185284 185422
56419 185422 185966 186670 187544 188884 190500 191673 192145 192568 193634 195282 197066 198762 200211 201055 201188 201159
56403 201159 201708 203111 205310 208259 211625 214527 216331 217599 219458 222000 224043 224659 224269 223773 223221
56388B23221j276k252k702k516k059j504q46k00L68J011J639J653P23m27p01k
56372B14130P57R93J011J094R55N13M12J078J882K000J601J389J362R78L39K40
56356B30734R45J786K159K196K228K304K480K951L580L824L442K835K407K106
56342B65977J864J891K219K393K115J828K208L250M212M362L611K596K198K739
56328C03463L590L878L538L256L443L874M315M822N262N270M941M827M979M822
56314C64280M314M346N349O369O332N556N049M938M555L727K941K405J899J466
56300D23526J362J383J082O69Q42J691K551L152M034N478O843P474P723Q432R743
56285D85985J1013J1814J2440J3340J4443J5379J6195J7429J9337K1382K2909
$$ plain form
56388 223221 221945 219693 216991 214475 212416 210912 210066 209866 210234 211245 212884 214537 215260 214833 214132 214130
56372 214130 214887 215880 216891 217985 218940 219453 219865 220943 222825 224825 226426 227815 229177 230155 230494 230734
56356 230734 231679 233465 235624 237820 240048 242352 244832 247783 251363 255187 258629 261464 263871 265977
56342 265977 267841 269732 271951 274344 276459 278287 280495 283745 287957 292319 295930 298526 300724 303463
56328 303463 307053 310931 314469 317725 321168 325042 329357 334179 339441 344711 349652 354479 359458 364280
56314 364280 368594 372940 378289 384658 390990 396546 401595 406533 411088 414815 417756 420161 422060 423526
56300 423526 424888 426271 427353 428022 428864 430555 433106 436258 440292 445770 452613 460087 467810 476242 485985
56285 485985 496998 508812 521252 534592 549035 564414 580609 598038 617375 638757 661666
56274F61666K4161K6137K9362L3334L7356M1379M5689N0245N4899N9917O5766
56263A129911P2454P9480Q6341R2775R8676J04112J09236J13850J17170J18359
56253B122364J17103J13443J07287R8484Q7194P3872N9022M3232K7220J1552l479
56242B857294j7547l0161m1103n0637n8971o5940p1598p6604q1483q5824q8876
56231B188550r0636r1685r2179r1668q9981q7654q5270q2794p9696p5615p0825
56220A250547o6051o1701n7324n2242m6675m1664l7698l4135l0404k6897k4118
56209G71638k1712j9151j6754j5045j3602j1625r389p945p490p093o088m839l840
56196F27065k970j948r46k87L9L20P99J437J924K021J997K416L292L956M125M437
$$ plain form
56274 661666 685827 711964 741326 774660 812016 853395 899084 949329 1004228 1064145 1129911
56263 1129911 1202365 1281845 1368186 1460961 1559637 1663749 1772985 1886835 2004005 2122364
56253 2122364 2239467 2352910 2460197 2558681 2645875 2719747 2778769 2822001 2849221 2860773 2857294
56242 2857294 2839747 2809586 2768483 2717846 2658875 2592935 2521337 2444733 2363250 2277426 2188550
56231 2188550 2097914 2006229 1914050 1822382 1732401 1644747 1559477 1476683 1396987 1321372 1250547
56220 1250547 1184496 1122795 1065471 1013229 966554 924890 887192 853057 822653 795756 771638
56209 771638 749926 730775 714021 698976 685374 673749 664360 656415 648925 641832 635744 630905 627065
56196 627065 624095 622147 621201 620914 620953 621273 622072 623509 625433 627454 629451 631867 635159 639115 643240 647677
56180F47677N407O529P164P724Q922J0502J1691J2543J3628J4733J5210J5380
56168G77110J6281J7981J9457K0257K0967K1806K2155K1995K2527K4682K7936
56157A013154L1353L4910L9171M4375N0557N8048O7194P8002R0519J04991J21130
56146A733404J37507J52058J62739J67489J64273J52130J32351J08511Q5302O6940
56136C062704N5689N1063N0155M8786M2819K9685J0118j1512k9587m0681m5012
56125C224227m5456m6194n1791o5499q7195j13079j37754j56531j66479j66832
56115B187417j59041j45761j29266j11114r3003p6739o3024n1190m0563l1275
56105A286441k3539j7043j1564p300m101j177J902M577O279P355Q473R598J0205
$$ plain form
56180 647677 653084 659613 666777 674501 683423 693925 705616 718159 731787 746520 761730 777110
56168 777110 793391 811372 830829 851086 872053 893859 916014 938009 960536 985218 1013154
56157 1013154 1044507 1079417 1118588 1162963 1213520 1271568 1338762 1416764 1507283 1612274 1733404
56146 1733404 1870911 2022969 2185708 2353197 2517470 2669600 2801951 2910462 2995764 3062704
56136 3062704 3118393 3169456 3219611 3268397 3311216 3340901 3351019 3339507 3309920 3269239 3224227
56125 3224227 3178771 3132577 3080786 3015287 2928092 2815013 2677259 2520728 2354249 2187417
56115 2187417 2028376 1882615 1753349 1642235 1549232 1472493 1409469 1358279 1317716 1286441
56105 1286441 1262902 1245859 1234295 1226995 1222894 1221717 1223619 1228196 1234475 1241830 1250303 1259901 1270106
56092A270106J0054R289Q084O591N030L559K328J660J688J942J917J997K971M626
56078A331842N821O162O606P970R770J1168J2188J3390J4873J6273J7295J7826
56066A471184J7913J7984J8635J9944K1386K2579K3598K4461K4962K5196K5610
56055A713452K6365K7206K8065K9097L0116L0750L1186L1988L3073L3792L4078
56044B049168L4655L5907L7430L8807M0077M1265M2374M3801M5943M8395N0495
56033B508317N2436N4789N7210N8988O0647O3456O7334P0868P3524P6145P9135
56022C222849Q1923Q4555Q7953R2051R5444R7484R9006J00495J01349J01653J02841
56011D267603J05746J09636J13926J19096J25223J31346J37151J43607J51140
$$ plain form
56092 1270106 1280160 1289449 1297533 1304124 1309154 1312713 1315041 1316701 1318389 1320331 1322248 1324245 1327216 1331842
56078 1331842 1337663 1343825 1350431 1358401 1368171 1379339 1391527 1404917 1419790 1436063 1453358 1471184
56066 1471184 1489097 1507081 1525716 1545660 1567046 1589625 1613223 1637684 1662646 1687842 1713452
56055 1713452 1739817 1767023 1795088 1824185 1854301 1885051 1916237 1948225 1981298 2015090 2049168
56044 2049168 2083823 2119730 2157160 2195967 2236044 2277309 2319683 2363484 2409427 2457822 2508317
56033 2508317 2560753 2615542 2672752 2731740 2792387 2855843 2923177 2994045 3067569 3143714 3222849
56022 3222849 3304772 3389327 3477280 3569331 3664775 3762259 3861265 3961760 4063109 4164762 4267603
56011 4267603 4373349 4482985 4596911 4716007 4841230 4972576 5109727 5253334 5404474
56002E404474J58915J66557J74761J83502J91773J99778K09252K20723K32652
55993G142387K44293K56981K71620K87339L03855L22534L43803L66140L89085
55984I928037M14595M43896M75681N09094N45685N86649O31025O78655P31933
55975A4945250P92593Q59762R33370J016343J111279J218333J338874J477904
55967B3693708J640366J828737K046900K302838K605162K961691L384727L893276
55959D4357405M506423N237884O097664P091502Q216136R465406J0849101J2401426
55951A08222947J4169615J6204617J8560371K1267409K4260954K7294709K9867142
55944B59847764L1160918L0074350K5529581J7098014N579033p026045j8302610
$$ plain form
56002 5404474 5563389 5729946 5904707 6088209 6279982 6479760 6689012 6909735 7142387
55993 7142387 7386680 7643661 7915281 8202620 8506475 8829009 9172812 9538952 9928037
55984 9928037 10342632 10786528 11262209 11771303 12316988 12903637 13534662 14213317 14945250
55975 14945250 15737843 16597605 17530975 18547318 19658597 20876930 22215804 23693708
55967 23693708 25334074 27162811 29209711 31512549 34117711 37079402 40464129 44357405
55959 44357405 48863828 54101712 60199376 67290878 75507014 84972420 95821521 108222947
55951 108222947 122392562 138597179 157157550 178424959 202685913 229980622 259847764
55944 259847764 291008682 321083032 346612613 363710627 369289660 362263615 343961005
55937C43961005k6463418l0921136l2135352l1062148k8667283k5692161k2609465
55930A46410042j9667776j6971886j4557659j2431262j0580905q986126p626656
55923E5587772o480752n520065m714137m038690l474937l004059k608062k274132
55915B3472938j993277j756118j553750j380709j233257j106201r94488q96152
55907A2558986q10645p35841o69369o10947n60501n15654m73832m35293m01424
55898G345480l71498l43827l18724k97490k79318k61834k44124k27098k11426
55889D790141j97060j84168j72707j61626j49999j38414j27889j18268j08962
55880C431048j00306r2674q5398p8334p3574p3670p8398q4833r0178r3273r3781
$$ plain form
55937 343961005 317497587 286576451 254441099 223378951 194711668 169019507 146410042
55930 146410042 126742266 109770380 95212721 82781459 72200554 63214428 55587772
55923 55587772 49107020 43586955 38872818 34834128 31359191 28355132 25747070 23472938
55915 23472938 21479661 19723543 18169793 16789084 15555827 14449626 13455138 12558986
55907 12558986 11748341 11012500 10343131 9732184 9171683 8656029 8182197 7746904 7345480
55898 7345480 6973982 6630155 6311431 6013941 5734623 5472789 5228665 5001567 4790141
55889 4790141 4593081 4408913 4236206 4074580 3924581 3786167 3658278 3540010 3431048
55880 3431048 3330742 3238068 3152670 3074336 3000762 2927092 2848694 2763861 2673683 2580410 2486629
55869B486629r1726q7833q3177p8252p3036o7707o2576n7674n3030m8980m5703
55858A736935m2944m0530l8503l6408l3526l0295k8270k7935k7814k6686k5389
55847A378635k5229k5756k5666k4951k4537k4376k3460k1479j9135j6943j4888
55836A132215j3044j1438r581p160m987m256m953n944o463o678o941p379q233
55823A035158r734j1669j3592j5335j6910j8178j9215k0506k2135k3124k2448
55812H42312k0434j8400j7129j6397j5749j4927j3656j1763r555p552n927m546
55800F86277l307k030m47J190J991J562O99L01P0q23k303l716n189p522j0688
55785F56065j3624j5522j6388j6218j4678j1958r022o516m109j297J730M381O236
$$ plain form
55869 2486629 2394903 2307070 2223893 2145641 2072605 2004898 1942322 1884648 1831618 1782638 1736935
55858 1736935 1693991 1653461 1614958 1578550 1545024 1514729 1486459 1458524 1430710 1404024 1378635
55847 1378635 1353406 1327650 1301984 1277033 1252496 1228120 1204660 1183181 1164046 1147103 1132215
55836 1132215 1119171 1107733 1098152 1090992 1086005 1081749 1076796 1070852 1064389 1057711 1050770 1043391 1035158
55823 1035158 1025424 1013755 1000163 984828 967918 949740 930525 910019 887884 864760 842312
55812 842312 821878 803478 786349 769952 754203 739276 725620 713857 704302 696750 690823 686277
55800 686277 682970 680940 680493 681683 683674 685236 685935 686236 686306 685483 683180 679464 674275 666753 656065
55785 656065 642441 626919 610531 594313 579635 567677 558655 552139 548030 546733 548463 552844 559080
55772E59080O950O143L933J204j195l314n756q651j1449j3612j5026j5698j5517
55759D87092j4616j3637j3175j3040j2511j1467j0695j0783j1173j0947j0209
55748C54839r851j0040r932r072q172p924p829o981n493m321l928l885l727l465
55734B60219l143k527j522n70k82p57j437j685j499j481k002k636k711k267j919
55719B33781j814j431n92R6J11k18k93l0M11J138K186L082L425L579M185N225
55703B52841O141O695P037P114O674N817M969M270L542K887K782L412M283M709
55689C23173M386L502K541K075K402L286M098M306L728K471Q80n43j481k070k712
55674C50042l645m866o337q023r647j0603j0326q826o897n539n067m856m222l237
$$ plain form
55772 559080 566030 572173 576106 577310 576115 572801 567045 558394 546945 533333 518307 502609 487092
55759 487092 472476 458839 445664 432624 420113 408646 397951 387168 375995 365048 354839
55748 354839 344988 334948 325016 315944 307772 299848 292019 285038 279545 275224 271296 267411 263684 260219
55734 260219 257076 254549 253027 252457 252175 251418 249981 248296 246797 245316 243314 240678 237967 235700 233781
55719 233781 231967 230536 229944 230040 230151 229933 229640 229610 230021 231159 233345 236427 239852 243431 247616 252841
55703 252841 258982 265677 272714 279828 286502 292319 297288 301558 305100 307987 310769 314181 318464 323173
55689 323173 327559 331061 333602 335677 338079 341365 345463 349769 353497 355968 356848 356305 354824 352754 350042
55674 350042 346397 341531 335194 327171 317524 306921 296595 287769 280872 275333 270266 265410 261188 257951
55660B57951k359j535k77J473L295N040O897Q644R721J0263J1079J2223J2549
55647C34964J1372R560Q162O761M331J093j703l503m792n824o181n777n237m957
55633C38269m518l392j732j69P25P26K6r21j959l507n848q402j0301j1525j2735
55618B74737j4100j5030j5106j4499j3362j1667r782q511q103p900p319o520n811
55605A37027m996l902l001k862l266l414k920k148j626j524j686j851j858j772
55591A00201j771j811j588j005m86m92q48q13L5J236J915J782J440J603K166K363
55575A03927J886J368J562K362L119L639M327N357O246O377N586M136K466J089
55561A53447M01L63O24R81J398J557R35m01j492j442n05K01q6j168k396l343l833
$$ plain form
55660 257951 255592 254057 253780 255253 258548 263588 270485 279129 288850 299113 310192 322415 334964
55647 334964 346336 355896 364058 370819 375150 376243 374540 371037 366245 360421 354240 348463 343226 338269
55633 338269 333751 330359 328627 328458 329183 329909 329935 329014 327055 323548 317700 309298 298997 287472 274737
55618 274737 260637 245607 230501 216002 202640 190973 181191 172680 164577 156677 149358 142838 137027
55605 137027 132031 128129 125128 122266 119000 115586 112666 110518 108892 107368 105682 103831 101973 100201
55591 100201 98430 96619 95031 94026 93540 93048 92200 91387 91422 92658 94573 96355 97795 99398 101564 103927
55575 103927 105813 107181 108743 111105 114224 117863 122190 127547 133793 140170 145756 149892 152358 153447
55561 153447 153848 154211 154835 155816 157214 158771 159706 159305 157813 156371 155866 156067 155981 154813 152417 149074 145241
55544A45241l820l529l562m374n565o052n165l481k279k216k733k860k273j506
55530I5826j172j301j429j224q20m22K27J555L219M023L282J970J740K957M463
55515A12894N302N751O341O846O931P080P874Q870R134Q723Q597R016Q926P244
55501B19529M118N62k711n636q245j0292j1485j1932j2108j2324j2355j1838j0900
55488A14383j0016r224q072o520n257m764m618m237l789l666l580k942j875j031
55474D4792n97k80r3l58r35j312j425j616j782j397n23J23K66L80O50N16k51q82
55456C5276o33J23M64J55l22o03o73n40k39n0k38o44q35o29k15J66L95M12K28
55437C1598n8l84p25r87j026q25n26k40j7O1j8m9J17K57R2j83j43J85L64L05L87
$$ plain form
55544 145241 141421 137892 134330 129956 124391 118339 113174 109693 107414 105198 102465 99605 97332 95826
55530 95826 94654 93353 91924 90700 89880 89458 89685 91240 94459 98482 101764 103734 105474 108431 112894
55515 112894 118196 123947 130288 137134 144065 151145 159019 167889 177023 185746 194343 203359 212285 219529
55501 219529 223647 224209 221498 215862 207617 197325 185840 173908 161800 149476 137121 125283 114383
55488 114383 104367 95143 87071 80551 75294 70530 65912 61675 57886 54220 50640 47698 45823 44792
55474 44792 44195 43915 43822 43464 42529 41217 39792 38176 36394 34997 34474 34597 34863 35243 35893 36409 36158 35276
55456 35276 34643 34766 35230 35385 35063 34460 33787 33247 33008 32958 32720 32076 31241 30612 30397 30563 30958 31370 31598
55437 31598 31540 31156 30431 29444 28418 27593 27067 26827 26810 26871 26853 26804 26921 27178 27270 27087 26944 27129 27493 27798 28185
55416B8185P37J014J003Q58N60j55j093j507j128o92r03j390j324o04J71O22Q46
55399B5200R25P76L96o6m71o35l09M15R40P47M1m99m88o5L69M57J01l62m14p3
55379B6985J6n25j222j434j204r72q02n21l43o20j093j089n78l03p22j295j171
55362A3107k12Q70J284R11L76L85R15J193O29n07j521k077k141j515j36J284J661
55345A4506Q29k21n64l32j75k23j40J00P8l60o90k45R20J882J695L84r92j335
55327A5117m75R14K045K461K042J080K92K70P22P09j90j274j585j054m66m60r68
55310A9180j523j784j642j155m88J07M36M28K06P5L18P99R21K86o86j159r31o02
55292A2786n52l14N67J542J630Q75L25M94O70K22k61J35J110J449P07k40n31l72
$$ plain form
55416 28185 28922 29936 30939 31797 32357 32202 31109 29602 28474 27782 26879 25489 24165 23561 23732 24354 25200
55399 25200 26125 26901 27297 27231 26760 26125 25816 26231 27171 27918 27959 27460 26972 26907 27276 27733 27834 27472 27058 26985
55379 26985 27001 26476 25254 23820 22616 21644 20842 20321 19978 19358 18265 17176 16598 16295 15573 14278 13107
55362 13107 12895 13765 15049 15960 16336 16721 17636 18829 19458 18951 17430 15353 13212 11697 11561 12845 14506
55345 14506 15335 15114 14550 14218 14043 13820 13680 13780 13858 13498 12808 12563 13483 15365 17060 17444 16452 15117
55327 15117 14642 15556 17601 20062 22104 23184 23476 23746 24468 25177 24987 23713 22128 21074 20608 20148 19180
55310 19180 17657 15873 14231 13076 12588 12695 13131 13559 13765 13840 14158 14957 15878 16164 15478 14319 13388 12786
55292 12786 12234 11920 12487 14029 15659 16534 16859 17353 18023 18245 17984 18119 19229 20678 21385 21145 20614 20242
55274B0242m08o67o22n5O56J006P83J23o02r49o83l0M37K89k86n70p9P81J089
55255B0455N51r5j48J28O4k89l43q3j07n38p26l37O2o8l76k18L58P75P08K50l97
55234A9626r33r85m94J10M30N23N15K22l93q58p66m28l55m81m35l15m93q03o81
55215A3006j00L67M23L82N28P36Q79J028R86K36j274k667k877j693J04J486J862
55198A3412J291L57k73k69K44R39J505J659J266M92k74p12p26l30L36Q86Q72K17
55180B0892o57j220j244q21j54N40J004J015N66j6k24J59P72R78N16k52p83q32
55162B0239m77jK26K7k46m0N69Q15K48o24j022q50m91r6L52N79L03j54j65L25
55142A9517P67Q00M81q2p33r83m56L23L82l21p68l42L67O22O32R63J459J507J035
$$ plain form
55274 20242 19834 19167 18545 18490 19146 20152 20935 21058 20456 19507 18824 18794 19231 19520 19234 18664 18585 19366 20455
55255 20455 21006 20911 20763 20891 20955 20666 20323 20240 20133 19595 18869 18532 18594 18526 18150 17932 18290 19065 19773 20023 19626
55234 19626 18693 17708 17214 17324 17754 18277 18792 19014 18621 17763 16997 16569 16214 15733 15298 14983 14490 13687 13006
55215 13006 12906 13273 13696 14078 14606 15342 16221 17249 18235 18471 17197 14530 11653 9960 10064 11550 13412
55198 13412 14703 15060 14787 14518 14762 15701 17206 18865 20131 20623 20349 19637 18911 18581 18917 19803 20675 20892
55180 20892 20235 19015 17771 16950 16796 17336 18340 19355 19921 19905 19681 19840 20612 21590 22106 21854 21071 20239
55162 20239 19762 19761 19987 20014 19768 19728 20297 21112 21360 20736 19714 18864 18373 18277 18629 19208 19511 19357 19192 19517
55142 19517 20284 21084 21565 21483 20750 19767 19311 19634 20016 19695 18927 18585 18952 19574 20206 21169 22628 24135 25170
55123B5170N31K23m4j58L31J415K312K288J554R25P82P51N02L36O07R00M02q18
55105C8009j644j359o17m22o97o88l72l68o04k37Q17J393P06m05o20J24Q11Q27
55087C4654M73K28K18M13P04P97M55j77p11q83n94J48R60J173N80j41l37l48q76
55068C6736j713j930j307o77o31o84j72O76J039N81k84r31r81m96R0M41P83J575
55050C2115K553K730J642J22p65j006j223j377q58K18Q83P09M51Q41J506J704
55034D0245J493J423J485J194M98j53o38j178j510r43M74J540J283K03m11r0N28
55017D5443P87P06N78L98L9l39l08L39J237J698J428Q42M65J35p18j958k573j973
54999D6226q43k33k44l61n66j239k081k133j070K80J009J058Q85P55P55R31J087
$$ plain form
55123 25170 25701 25924 25880 25722 26053 27468 29780 32068 33622 34547 35329 36080 36582 36918 37525 38425 38827 38009
55105 38009 36365 35006 34389 33967 33270 32582 32210 31842 31238 31001 31818 33211 33917 33512 32892 33016 33827 34654
55087 34654 35127 35355 35573 35986 36690 37487 37942 37765 37054 36171 35577 35725 36685 37858 38438 38297 37960 37612 36736
55068 36736 35023 33093 31786 31109 30478 29794 29622 30298 31337 31918 31634 30703 29722 29226 29316 29757 30540 32115
55050 32115 34668 37398 39040 39162 38397 37391 36168 34791 33933 34151 35034 35743 36194 37035 38541 40245
55034 40245 41738 43161 44646 45840 46338 46185 45547 44369 42859 41916 42390 43930 45213 45416 45005 44915 45443
55017 45443 46230 46936 47514 47912 47951 47612 47304 47643 48880 50578 52006 52848 53313 53448 52730 50772 48199 46226
54999 46226 45383 45150 44906 44545 43979 42740 40659 38526 37456 37736 38745 39803 40688 41443 42198 43129 44216
54982D4216Q18J36l70l08k2M0Q1N99J582K496K903K670J887R60N54R65J693K102
54964F3002K290K828L739M347M256L920M079M928O157P453Q720R937J1059J2045
54950A48760J2887J3484J3486J2277R382N060L73l588o580r104j1482j3282j3807
54937A57866j2978j1547j0415r808r266q299o947n567m366l426k925k918k864
54924F6540k014m04J044J650J765K048K505K762K889L283L967M687N537O772Q112
54909A11143Q990R596J0741J2389J3137J1820Q990O124L702R18k839o976j0368
54896A77367j2446j3294j3110j2074j0662r567r065q674p731o199m639l457k567
54883F3882j906j789k301k742k275j036N7N04O23O66L62l20o92j98P01J138R40
$$ plain form
54982 44216 45034 45170 44800 44492 44470 44510 44591 45190 46772 49268 52171 54841 56728 57688 58242 59207 60900 63002
54964 63002 65292 68120 71859 76206 80462 84382 88461 93389 99546 106999 115719 125656 136715 148760
54950 148760 161647 175131 188617 200894 210276 215336 215709 212121 205541 196437 184955 171673 157866
54937 157866 144888 133341 122926 113118 103852 95553 88606 83039 78673 75247 72322 69404 66540
54924 66540 64526 64122 65166 66816 68581 70629 73134 75896 78785 82068 86035 90722 96259 103031 111143
54909 111143 120133 129729 140470 152859 165996 177816 186806 192930 196632 197550 194711 187735 177367
54896 177367 164921 151627 138517 126443 115781 106214 97149 88475 80744 74545 69906 66449 63882
54883 63882 61976 60187 57886 55144 52869 51833 51890 52394 53017 53683 54045 53725 53033 52835 53536 54674 55614
54866E5614N20K6o45j188j063m26j26o00j353j703j512j008m78l68j092k297k841
54849C9460k030o02J07l31j170j525j172m33K05L08k50j051j440j104k85M97Q29
54832C0013O59L81N51J192J689J550J094R38J084J049P61O74R81J277J222J007
54816D6122R25R07P64N61M97O60J076J721K416K953L405L977M609N107N702O869
54800H8271Q490R855J0711J1617J2816J3507J2858J1247R647Q141N857K294j998
54787B03313o008q993j0594j0816j0120r182q408p795p136o172m778l289k300
54774A07722j846j178J54J364J375M53J05J237L221M897N827O301O583O586O074
54759A48875N019L928L612M358N457N998N954N950O171O190N741M827L118J22
$$ plain form
54866 55614 56134 56160 55515 54327 53264 52838 52712 52112 50759 49056 47544 46536 46058 45690 44598 42301 39460
54849 39460 37430 36828 36935 36604 35434 33909 32737 32304 32509 32817 32567 31516 30076 28972 28687 29184 30013
54832 30013 30672 31053 31604 32796 34485 36035 37129 38067 39151 40200 40961 41635 42616 43893 45115 46122
54816 46122 47047 47954 48718 49279 49776 50436 51512 53233 55649 58602 62007 65984 70593 75700 81402 88271
54800 88271 96761 106616 117327 128944 141760 155267 168125 179372 189019 197160 203017 205311 203313
54787 203313 197305 188312 177718 166902 156782 147600 139192 131397 124261 118089 113311 110022 107722
54774 107722 105876 104698 104852 106216 107591 108044 108149 109386 112607 117504 123331 129632 136215 142801 148875
54759 148875 153894 157822 161434 165792 171249 177247 183201 189151 195322 201512 207253 212080 215198 215320
54745B15320l821p549j0368j2547j4267j4966j4255j2690j1036r409p739o431
54733I0242n818n437m630l514k731k461k448k580k808k616j526q6M30m29j555
54718E2033j506j44J247J386L74m81k48M82M33n57j248p78J46M10J79M37J240
54701E3405J519P34l08o36l86l30o20o68q4P64J246J167Q25N57M75N88Q97J250
54683F0395J315R93O86P79J005P61J24q2O35J722K307K181J737J335J084J012
54667G7989J073J180J417J898K351K292J889K016L080M335M948N115N480O008
54653A21071O278O508P279Q344Q698P879O358M526K128r54m088o456p854q515
54639A51202q592q151p443o839o492o169n506m454l504l209l377l192k328j449
$$ plain form
54745 215320 211499 203950 193582 181035 166768 151802 137547 124857 113821 104412 96673 90242
54733 90242 84424 78987 74357 70843 68112 65651 63203 60623 57815 55199 53673 53587 54017 53588 52033
54718 52033 50527 50383 51630 53016 53390 52909 52661 53143 53576 53019 51771 50993 51139 51549 51728 52165 53405
54701 53405 54924 55658 55350 54714 54328 53998 53378 52710 52626 53390 54636 55803 56628 57185 57660 58248 59145 60395
54683 60395 61710 62703 63389 64168 65173 65934 66058 65976 66611 68333 70640 72821 74558 75893 76977 77989
54667 77989 79062 80242 81659 83557 85908 88200 90089 92105 95185 99520 104468 109583 115063 121071
54653 121071 127349 133857 141136 149480 158178 166057 172415 176941 179069 178115 174027 167571 159717 151202
54639 151202 142610 134459 127016 120177 113685 107516 102010 97556 94052 90843 87466 84274 81946 80497
54625H0497j193j241j010p71j171j890j915j066l08l23o93q38r12j287j759j847
54609F2273j463r12m57j65K3J99L00Q3m00n72j29K52k81j328j650r58l00l51n43
54590E3621l10j18m62q08m72J42J64l78q00r15j025j021n51N3M2n42p78j59P89
54571D6472J368J497J385J054N65K24J78J40j28l95l28n7O9J04M65J261J954J915
54553E7743J111J43l44j40N14J247J796K196K764L739M841N384N044M277L704
54538I4019L328K776K054J499J003p1j937l878n004n163m836m507m382m396m249
54523F6256l614k549j464o37n7J81j00o31p09j04N35N37K6n06r21j266j366j130
54505E2481q85q30n73J09N74J33p17q03J14J102J480J531J655J666J295P72M53
$$ plain form
54625 80497 79304 78063 77053 76282 75111 73221 71306 70240 69932 69609 68916 68078 67166 65879 64120 62273
54609 62273 60810 59898 59441 59276 59299 59498 59798 59881 59481 58909 58780 59032 58751 57423 55773 54815 54515 54164 53621
54590 53621 53311 53193 52731 51923 51451 51593 51757 51379 50579 49664 48639 47618 47067 47120 47162 46620 45842 45683 46472
54571 46472 47840 49337 50722 51776 52341 52565 52743 52883 52755 52360 52032 51975 52044 52148 52613 53874 55828 57743
54553 57743 58854 58997 58653 58513 59027 60274 62070 64266 67030 70769 75610 80994 86038 90315 94019
54538 94019 97347 100123 102177 103676 104679 104608 102671 98793 93789 88626 83790 79283 74901 70505 66256
54523 66256 62642 60093 58629 57992 57935 58116 58016 57385 56676 56572 57107 57644 57670 57164 56243 54977 53611 52481
54505 52481 51596 50766 50193 50302 50876 51009 50292 49489 49603 50705 52185 53716 55371 57037 58332 59104 59557
54488E9557L61L63M09M10K47J09K89N36J69q97j774j726j098o72n55k58M17J160
54470E7047J672J852J621J006L33p5l22o76j026j106j056j221j389r23J89J026
54454E6952Q53P8l69k09M5l1k96l78j00M71J045J219P75J5m70l78R8N98Q60O94
54434F1472K2q78j377j001J48J402J980J507M06l24J1J064J842J817J326Q91N99
54417G0907L39J60J68L31O26J015J193Q23K78M83J630K609K326J103J73J29N51
54400H4844Q72P79N7j181k163k171j510j123j289j534j622j725j661r76KK15o02
54383F9212j416j309n70O9L93M08p9q35r09J72J503J781Q36m86j526k125k153
54366F2966j520n20L82R90J251J043N90N80J309K041J929J173O37O02O50N81O02
$$ plain form
54488 59557 59918 60281 60690 61100 61347 61456 61745 62281 62450 61553 59779 58053 56955 56283 55728 55470 55887 57047
54470 57047 58719 60571 62192 63198 63531 63456 63134 62458 61432 60326 59270 58049 56660 55737 55926 56952
54454 56952 57805 57883 57514 57305 57350 57319 57023 56645 56545 57016 58061 59280 60055 60070 59600 59222 59320 59918 60778 61472
54434 61472 61494 60616 59239 58238 58386 59788 61768 63275 63681 63357 63368 64432 66274 68091 69417 70308 70907
54417 70907 71246 71406 71574 71905 72531 73546 74739 75562 75840 76323 77953 80562 82888 83991 84164 84293 84844
54400 84844 85716 86495 86552 85371 83208 81037 79527 78404 77115 75581 73959 72234 70573 69597 69599 69814 69212
54383 69212 67796 66487 65917 65986 66379 66787 66708 65873 64964 65136 66639 68420 69256 68770 67244 65119 62966
54366 62966 61446 60926 61308 62298 63549 64592 65182 65762 67071 69112 71041 72214 72851 73453 74103 74684 75286
54349G5286P31O60K32m45j235j867j834r92n5R9m89j061j208j096q38l71O5L9
54331F5621m01p84q73p90n72j66J45k9o25j201j501j483j005j58L75K6p95j266
54313E4518j385j720k147j950j153o02m93RJ321K560K711J836O61l67j068j251
54297E1480j001p21n52k49N4k14j028j477j043l89k28j83M04J170J211N06p9k1
54279D7640M22R07J358J660J590J201Q48P41Q14Q96P65J95p02j321j153l75M18
54262E5904Q59R24O46K20J32O65J372J481Q49Q5k83l49m40o03o46n45n60q68j201
54243E7642j006j84N86O08J30O4P00J286J107L97j53l18l10k46j47j58l40m86
54225E9172m61m30l90K7Q16J156M29o98j023m64p0l73o67k44M64N31j52p51o14
$$ plain form
54349 75286 76017 76677 76909 76464 75229 73362 71528 70536 70481 70580 70091 69030 67822 66726 65888 65517 65582 65621
54331 65621 65220 64436 63563 62773 62201 62035 62180 62151 61526 60325 58824 57341 56336 56178 56553 56579 55784 54518
54313 54518 53133 51413 49266 47316 46163 45561 45068 45077 46398 48958 51669 53505 54166 53799 52731 51480
54297 51480 50479 49758 49206 48957 49011 48797 47769 46292 45249 44860 44632 44449 44853 46023 47234 47740 47661 47640
54279 47640 48062 48969 50327 51987 53577 54778 55626 56367 57181 58077 58842 59037 58335 57014 55861 55486 55904
54262 55904 56763 57687 58333 58553 58685 59350 60722 62203 63052 63137 62854 62505 62065 61462 60816 60271 59711 58843 57642
54243 57642 56636 56452 57038 57646 57776 57840 58540 59826 60933 61330 61177 60859 60549 60303 60156 59998 59658 59172
54225 59172 58711 58281 57891 57918 58734 59890 60319 59621 58598 58134 58064 57691 57024 56780 57244 57775 57623 56872 56258
54206E6258K7M71M24K15K20L41K05j98m80l75o4J81K69J33l22q64r83n88k19k62
54186E4389l73j18K51K43m5j84k32n32r26r15n90o42j283j833j648r26l47k53
54168D4036m81o92o58m11j90j28p1J26K86J97K6Kn0l57n68j10Q14J257O93l98
54148D3323j218j409r93j13Q65J484J597J349P18l83j475j684q02L12P63N37J18
54131D2989k36m61l85k0K71K35O8o1l31p11o39J48R10P85R5q6N03R84O38k16q47
54110D3633r38n84j0M58N39M08N68J065J297Q10n2o32p22m63J35J044J782J710
54092E0048Q53Nj24L69Q35P97L01k44m21r1M71P89N72n6p00r76p00pO71R08O45
54071E3945K31L6J09K21J41j24k70R2R57J711J743J241J006J271J289N37k45J7
$$ plain form
54206 56258 56285 56756 57180 57395 57615 57956 58161 57963 57483 57108 57044 57225 57494 57627 57305 56441 55458 54870 54651 54389
54186 54389 54016 53898 54149 54392 54347 54163 53931 53399 52473 51558 50968 50326 49043 47210 45562 44636 44289 44036
54168 44036 43555 42863 42205 41794 41604 41476 41405 41531 41817 42014 42040 42042 41992 41635 41067 40957 41771 43028 43721 43323
54148 43323 42105 40696 39703 39590 40455 41939 43536 44885 45603 45220 43745 42061 41259 41571 42334 42871 42989
54131 42989 42753 42292 41907 41887 42158 42393 42461 42400 42069 41358 40719 40867 41777 42562 42657 42571 43074 44058 44696 44480 43633
54110 43633 42695 42111 42101 42559 43098 43506 44074 45139 46436 47246 47194 46562 45840 45377 45512 46556 48338 50048
54092 50048 50901 50906 50782 51151 51986 52783 53084 52840 52419 52328 52799 53588 54160 54104 53404 52428 51728 51721 52392 53300 53945
54071 53945 54176 54212 54321 54542 54683 54559 54289 54381 55338 57049 58792 60033 61039 62310 63599 64136 63891 63908
54053F3908J065J468O31l30j12J096K053K130J813J772K091K413K434K086J562
54038H6080J184J151J433K023L013M233N090N169M783M520M413M030L308K690
54024A33120K429K227J807J308R21M76k35r97j382j309j063r05q15p01o38q22
54008A33421j368k158k849l150l095l019l209l543l599l117k337j770j638j634
53994I6935j365q78n61n73p16q41j064j412j621j494j212j080j137j288j544j860
53978G8289j970j639r79k50L78O85L89l22o65j92M49L49l41o12j19M16L70N0L7
53959G4323M22J026J810K606K856K215J193P27J144J874K149J805J423J769K977
53944A00319M298M835M546M286M824O060P266P788P403O323N016L852K812J729
$$ plain form
54053 63908 64973 66441 67072 66742 66630 67726 69779 71909 73722 75494 77585 79998 82432 84518 86080
54038 86080 87264 88415 89848 91871 94884 99117 104207 109376 114159 118679 123092 127122 130430 133120
54024 133120 135549 137776 139583 140891 141812 142288 142053 141056 139674 138365 137302 136397 135582 134881 134243 133421
54008 133421 132053 129895 127046 123896 120801 117782 114573 111030 107431 104314 101977 100207 98569 96935
53994 96935 95570 94692 94131 93558 92842 92001 90937 89525 87904 86410 85198 84118 82981 81693 80149 78289
53978 78289 76319 74680 73701 73451 73829 74514 74903 74581 73916 73724 74173 74522 74181 73569 73450 73866 74236 74286 74323
53959 74323 74745 75771 77581 80187 83043 85258 86451 87178 88322 90196 92345 94150 95573 97342 100319
53944 100319 104617 109452 113998 118284 123108 129168 136434 144222 151625 157948 162964 166816 169628 171357
53930A71357P67L03L26L59J23j65k54k01q5K09O46R00Q68R91J694K756L527L637
53912A87758L271K910K948L396L851L972L898L944L898L188J792L38p73j694k348
53897B20349k132r00M45R26N33k84j450k919m081m454m545n142o054o488o391
53882A77413o361o409n944n018m431m363m029l095k394k597l065k796j888j303
53868A23720j559k399l348l950l710k560j266q15j390k380l228l709l608k764
53854H7034j594q80q61r50o46k43l03p71j075q85l75K20Q53J367J342N91m52j087
53836H1285j126r98j107j217p98J91J076J115L10n59p08j05O33R84J022J108J314
53819H2420J370J103P41O65J029J637K026J774R42J86K16J002J845K254K428K698
$$ plain form
53930 171357 172124 172427 172753 173112 173235 173070 172816 172615 172530 172739 173385 174285 175153 176144 177838 180594 184121 187758
53912 187758 191029 193939 196887 200283 204134 208106 212004 215948 219846 223034 224826 225164 224391 222697 220349
53897 220349 218217 217317 217762 218688 219221 218937 217487 214568 210487 206033 201488 196346 190292 183804 177413
53882 177413 171052 164643 158699 153681 149250 144887 140858 137763 135369 132772 129707 126911 125023 123720
53868 123720 122161 119762 116414 112464 108754 106194 104928 104113 102723 100343 97115 93406 89798 87034
53854 87034 85440 84560 83699 82749 82103 81860 81557 80786 79711 78826 78451 78671 79524 80891 82233 82824 82372 81285
53836 81285 80159 79161 78054 76837 76039 76230 77306 78421 78731 78172 77464 77359 77992 78976 79998 81106 82420
53819 82420 83790 84893 85634 86299 87328 88965 90991 92765 93707 93893 94109 95111 96956 99210 101638 104336
53803A04336K888K641K131J936K287K791L026L078L311L802M177L971L132K092
53789A45599J305Q06L71J3L0M70R01R34O27J34o70j827k859l244l171l297l775
53772A32347m042l682l048k777l031l372l285k684k036j918k372k766k538j873
53758I2923j360j161j014r04j162j767k136j854j187o47l79k53k01j63J8L90O90
53741G9833O24J85m69j179j669j510n96N36J102Q17R6m39n20l87m30o98q12n03
53723G3981j21j80m82j73J064K366K629J807Q07L38K66P6m94j293j934k001j356
53706G5300k76Q07J697K345K496J842O12l31k66O53J638K136K210K119J964J829
53690I6775J997K539K913K452J349N87O48Q04K26o77p40K72J294J375P59K70K65
$$ plain form
53803 104336 107224 109865 111996 113932 116219 119010 122036 125114 128425 132227 136404 140375 143507 145599
53789 145599 146904 147710 148081 148094 148124 148594 149495 150429 151056 151190 150520 148693 145834 142590 139419 136122 132347
53772 132347 128305 124623 121575 118798 115767 112395 109110 106426 104390 102472 100100 97334 94796 92923
53758 92923 91563 90402 89388 88484 87322 85555 83419 81565 80378 79731 79352 79099 78898 78735 78753 79143 79833
53741 79833 80457 80642 80173 78994 77325 75815 75219 75755 76857 77674 77770 77331 76811 76424 75994 75296 74484 73981
53723 73981 73860 73680 73198 73025 74089 76455 79084 80891 81698 82036 82302 82378 81884 80591 78657 76656 75300
53706 75300 75024 75831 77528 79873 82369 84211 84823 84492 84226 84879 86517 88653 90863 92982 94946 96775
53690 96775 98772 101311 104224 106676 108025 108612 109260 110064 110290 109613 108873 109145 110439 111814 112573 112843 113108
53673A13108N88J048J475J625J483J392J517J467Q40r4p40r35q98o43m0O32Q11
53656A22636M31O1J03K86J83j12j81N7K03o1m83m64J85Q73P73j97j187j318n54
53637A21234M45J068J143P93L20J0j65n22j066j179l86Q20J448J317J155J394
53621A27829J571J144L84k2J44N70R78J328J606J785J939K129K285K319K263K120
53605A50372J793J323R82R07R02Q10Q56J262J793K074K148K262K311K042J765
53590A73602K141L115L686L140J984J227J164J410J741K202K522K116R45k44p53
53575A99998o82n44n87p45r04q63l30O06J208Q29j58o83k53N41Q33L65n38j398
53557A96695j773j471q48n69p87r77q12o98r89j137l98Q44J424J045O67R27J133
$$ plain form
53673 113108 113696 114744 116219 117844 119327 120719 122236 123703 124543 124449 123709 122774 121876 121233 121193 121825 122636
53656 122636 123067 123128 123231 123517 123700 123588 123407 123464 123667 123606 123123 122659 122844 123717 124490 124293 123106 121788 121234
53637 121234 121679 122747 123890 124683 125003 125013 124848 124326 123260 122081 121695 122515 123963 125280 126435 127829
53621 127829 129400 130544 130928 130906 131050 131620 132598 133926 135532 137317 139256 141385 143670 145989 148252 150372
53605 150372 152165 153488 154470 155377 156279 157089 157945 159207 161000 163074 165222 167484 169795 171837 173602
53590 173602 175743 178858 182544 185684 187668 188895 190059 191469 193210 195412 197934 200050 200995 200751 199998
53575 199998 199316 198772 198185 197440 196536 195673 195343 195949 197157 197986 197828 197145 196892 197433 198266 198631 198093 196695
53557 196695 194922 193451 192603 192034 191247 190270 189458 188760 187771 186634 186236 187080 188504 189549 190216 191143 192276
53540A92276N12k70J46J802L168L082K037J141N98l1n35q4J343K471K196R84K69
53523B11105P55J905K831L098K719K068J899K766M215N108N107N177O199P692
53509B62644Q492Q270P610P014O636O814P867R289J0046R866R639J0274J1745
53496C76206J3476J4955J5731J5557J4937J4880J5636J6330J6261J5930J6063
53485E45962J6356J6089J5465J5277J5555J5646J5500J5754J6373J6446J5695
53474G20118J5103J5412J5896J5458J4283J3463J3378J3345J2783J1914J1210
53463H72363J0811J0605J0481J0312J0052R847R745R322Q034N997L976K468J167
53450I75180m31k271l917n209o442p817r085r745r639r207r090r427r745r713
$$ plain form
53540 192276 192788 192518 192664 194466 197634 200716 202753 203894 204492 204461 203926 203842 205185 207656 209852 210836 211105
53523 211105 211860 213765 216596 219694 222413 224481 226380 229146 233361 238469 243576 248753 254952 262644
53509 262644 271136 279406 287016 294030 300666 307480 315347 324636 334682 344548 354187 364461 376206
53496 376206 389682 404637 420368 435925 450862 465742 481378 497708 513969 529899 545962
53485 545962 562318 578407 593872 609149 624704 640350 655850 671604 687977 704423 720118
53474 720118 735221 750633 766529 781987 796270 809733 823111 836456 849239 861153 872363
53463 872363 883174 893779 904260 914572 924624 934471 944216 953538 961572 967569 971545 974013 975180
53450 975180 974749 972478 968561 963352 956910 949093 940008 930263 920624 911417 902327 892900 883155 873442
53436H73442r755j0494j1723j2511j2446j2169j2387j2880j2956j2554j2198j2110
53424G29259j1939j1379j0492r378q001o493n151m003k774j485o32m46l56M13
53410F57143J925L557M769N490N849N978O067O354O989Q040R547J1333J2905J3877
53396G59823J4498J5358J6546J7494J7836J8056J8935K0534K2058K2809K3051
53385I66998K3790K5704K8341L0497L1438L1619L2039L3024L3922L4096L3826
53374A305294L3962L4847L5928L6397L5980L4996L3878L2855L1950L1052K9931
53363A677070K8356K6353K4211K2123J9932J7472J5016J3064J1610J0035P861
53352A873103N173K041j943o948j2108j6280j9534k3029k7245l1151l3494l4280
$$ plain form
53436 873442 863687 853193 841470 828959 816513 804344 791957 779077 766121 753567 741369 729259
53424 729259 717320 705941 695449 686071 678070 671577 666426 662423 659649 658164 657532 657086 656730 657143
53410 657143 659068 662625 667394 672884 678733 684711 690778 697132 704121 712161 721708 733041 745946 759823
53396 759823 774321 789679 806225 823719 841555 859611 878546 899080 921138 943947 966998
53385 966998 990788 1016492 1044833 1075330 1106768 1138387 1170426 1203450 1237372 1271468 1305294
53374 1305294 1339256 1374103 1410031 1446428 1482408 1517404 1551282 1584137 1616087 1647139 1677070
53363 1677070 1705426 1731779 1755990 1778113 1798045 1815517 1830533 1843597 1855207 1865242 1873103
53352 1873103 1878276 1880317 1878374 1871426 1859318 1843038 1823504 1800475 1773230 1742079 1708585 1674305
53340A674305l4361l4175l3594l2696l1876l1265l0585k9684k8683k7670k6663
53329A333053k5907k5726k6057k6529k7001k7553k7956k7687k6563k4935k3100
53318A044039k1121j9312j8257j7927j7387j5900j3855j2115j0858r732q774q444
53306H70357q791r367r939j0628j1206j1012r832q384p466p045o552n760m897
53293G59478m084l137j902n07P63J620J956K011K310L246M723O389P981R320J0213
53278H00380J0697J1332J2686J4516J5854J6045J5435J4852J4723J4883J4901
53267I56304J4381J3165J1596J0437J0158J0384J0275R348P720N673L451J457
53255A064349R6p70j854l635n812p789r498j1380j3637j5880j7592j8652j9272
$$ plain form
53340 1674305 1639944 1605769 1572175 1539479 1507603 1476338 1445753 1416069 1387386 1359716 1333053
53329 1333053 1307146 1281420 1255363 1228834 1201833 1174280 1146324 1118637 1092074 1067139 1044039
53318 1044039 1022918 1003606 985349 967422 950035 934135 920280 908165 897307 887575 878801 870357
53306 870357 861566 852199 842260 831632 820426 809414 799582 791198 783732 776687 770135 764375 759478
53293 759478 755394 752257 750355 749848 750611 752231 754187 756198 758508 761754 766477 772866 780847 790167 800380
53278 800380 811077 822409 835095 849611 865465 881510 896945 911797 926520 941403 956304
53267 956304 970685 983850 995446 1005883 1016041 1026425 1036700 1046048 1053768 1059441 1062892 1064349
53255 1064349 1064445 1063675 1061821 1058186 1052374 1044585 1035087 1023707 1010070 994190 976598 957946 938674
53242I38674j9543j9315j8609j7997j8167j9041j9549j8785j7188j6026j5682
53231G38772j5214j3896j2460j2145j3077j4421j5720j7049j7993j7703j6260
53220E72834j4919j4432j4007j2592j0533r068q626q514q074p328o547n957n868
53207D46369o466p369p885p821p646p779q193q646q916q829q509q523r215j0016
53193C30556j0038r290q592q277p852p094o549o550o586o178n695n656n890o019
53179B30290o209o650o842o224n149m431m170l905l627l706l904l463k267j178
53165A68565r86j651k655l458l593l009k382k422k795k501j393m32j71J8P06J264
53149A43105P85m60j320j236o93l79m92q31j138j265j261j183q70j88M97N65N5
$$ plain form
53242 938674 919131 899816 881207 863210 845043 826002 806453 787668 770480 754454 738772
53231 738772 723558 709662 697202 685057 671980 657559 641839 624790 606797 589094 572834
53220 572834 557915 543483 529476 516884 506351 497283 488657 480143 472069 464741 458194 452237 446369
53207 446369 439903 432534 424649 416828 409182 401403 393210 384564 375648 366819 358310 349787 340572 330556
53193 330556 320518 311228 302636 294359 286507 279413 272864 266314 259728 253550 247855 242199 236309 230290
53179 230290 224081 217431 210589 204365 199216 194785 190615 186710 183083 179377 175473 172010 169743 168565
53165 168565 167579 165928 163273 159815 156222 153213 150831 148409 145614 143113 141720 141288 141117 141135 141841 143105
53149 143105 143890 143430 142110 140874 140181 139802 139310 138479 137341 136076 134815 133632 132762 132574 133071 133636 133691
53132A33691k52L2K78k28j241j972k013j431m54L61K65o92j356r43k62n43j511
53115A21729j794j011j91p3k25j46j43n39r25q25m84m50p76j037q76k33N51P96
53097A13348P7j045j495j018m38m17o52o05l12j0L56P00N88K4j51O13J557J491
53079A12611L60q06j262j097p17m60o05j087j280o65L40Q70P26L87R8k79n39j57
53061A06438P77J446J372J030J050J391J695J882K028J986J661J329J241J206
53047A26532Q93M30K15K57J47k80o41n24o7K27J67P7K62N44N75M43N36Q00O42
53028A31235j57q68o19N29J730K347K272J499R0j414k207k076j581j202p60O0
53012A28878J045J589J363O15l4o7M34Q43P20M05M48O92N49Q3N1O26J022P38M03
$$ plain form
53132 133691 133439 133471 133749 133521 132280 130308 128295 126864 126410 126771 127036 126344 124988 124045 123783 123240 121729
53115 121729 119935 118924 118733 118660 118435 118289 118146 117607 116682 115857 115373 114923 114147 113110 112234 112001 112552 113348
53097 113348 113425 112380 110885 109867 109429 109012 108360 107755 107443 107433 107789 108489 109077 109101 108950 109563 111120 112611
53079 112611 112971 112165 110903 109806 109089 108629 108024 106937 105657 104992 105332 106202 106928 107315 107413 107134 106595 106438
53061 106438 107215 108661 110033 111063 112113 113504 115199 117081 119109 121095 122756 124085 125326 126532
53047 126532 127425 127855 128070 128327 128474 128194 127553 127029 126962 127189 127356 127433 127695 128239 128814 129257 129793 130593 131235
53028 131235 131078 130210 129591 130120 131850 134197 136469 137968 138058 136644 134437 132361 130780 129578 128818 128878
53012 128878 129923 131512 132875 133490 133456 133389 133823 134666 135386 135791 136239 136931 137480 137563 137614 138240 139262 140000 140403
52993A40403P49J394J460R21N23N79O75M67J56J06M71J160J716J436K48p78m53
52976A51233R78K089K119J761J848K100J797J078P81J170J535J198M33R9N65J259
52960A72043J324N97k26m57k04r2l74o91p01m48l8N99J384J824J486N46l79p98
52942A75395n43K97J237J468O01o44j058l98K39j82j336j994j570o04J80O81J124
52925A72893J439J368R07K73m06j042j338j034m31k10n84r87q15j81L37M02Q5
52908A70676m42j015j284p87O24K451L743L706K358O69k01o0J84l19j349k037
52892A76917k018j667j382j145q76o77n98n22n04p84j326j667j552j317j356j433
52876A58093r74K0Q39R30N32L03M82P10N77R7m55r19j338j690j865j890k005k408
$$ plain form
52993 140403 141152 142546 144006 144927 145450 146029 146704 147171 147327 147433 147904 149064 150780 152216 152464 151686 151233
52976 151233 152211 154300 156419 158180 160028 162128 163925 165003 165784 166954 168489 169687 170120 170219 170784 172043
52960 172043 173367 173964 173738 173281 173077 172985 172611 171920 171219 170771 170733 171332 172716 174540 176026 176572 176193 175395
52942 175395 174852 175149 176386 177854 178455 177811 176753 176355 176594 176412 175076 173082 171512 170908 171088 171769 172893
52925 172893 174332 175700 176607 176880 176474 175432 174094 173060 172629 172419 171835 170848 170033 169852 170189 170591 170676
52908 170676 170234 169219 167935 167148 167772 170223 173966 177672 180030 180699 180498 180438 180622 180303 178954 176917
52892 176917 174899 173232 171850 170705 169829 169152 168554 168032 167528 166744 165418 163751 162199 160882 159526 158093
52876 158093 157119 157139 157978 158908 159440 159743 160225 160935 161512 161609 161154 160235 158897 157207 155342 153452 151447 149039
52858A49039k998l455l469k876j774o06J37L29J61l53j395k681l303k676j283
52843A22797r7M43L89k44j263j825j220o0K52o00j458j433j105j411k186k543
52827A08436k210j647j218q73n42k30J42N59P50N64K61J09k9k47j44N92J452J619
52809A07344J112P20R19J410J716J634J123L47j34K03J057J516J135L60k35n02
52793A19725m31J25J066J885K220K186J949J380M93k14k67K15P96J320J789J951
52777A36188J477N41k71n84n05k25J93N59M46k87j064j105m01J59j13p99r92o07
52759A32610n31j314k320k518j707n39L32O21K52n59j223j316j096r69p10J43
52743A19156J243J639J112M31J16k39r59j452r95K11J329J868J880J536J150J235
$$ plain form
52858 149039 146041 142586 139117 136241 134467 133861 133998 134327 134488 134135 132740 130059 126756 124080 122797
52843 122797 122700 123143 123532 123288 122025 120200 118980 118920 119172 118572 117114 115681 114576 113165 110979 108436
52827 108436 106226 104579 103361 102488 101946 101716 101858 102417 103167 103731 103992 104101 104072 103825 103681 104273 105725 107344
52809 107344 108456 109176 110095 111505 113221 114855 115978 116325 116191 116394 117451 118967 120102 120462 120227 119725
52793 119725 119294 119419 120485 122370 124590 126776 128725 130105 130598 130384 130117 130332 131128 132448 134237 136188
52777 136188 137665 138206 137935 137351 136846 136621 136814 137373 137819 137532 136468 135363 134962 135121 135008 134209 133217 132610
52759 132610 132079 130765 128445 125927 124220 123681 124013 124634 124886 124327 123104 121788 120692 119723 119013 119156
52743 119156 120399 122038 123150 123581 123697 123458 122499 121047 120052 120263 121592 123460 125340 126876 128026 129261
52727A29261J962K723K779K178J596J424J490J578J737K015K281K385K291K108
52713A57808K091K400K764K551J498P8j012j502j458r82l27M7M%M03Q56P88L13
52695A66320L8K00M57M74K70N4J35P05J442J624J088N91P52J081Q25K33K5J9n54
52676A75779j556k003j684j496j872k098j687j343j862k923l619l560k849j686
52662A45541n89l64j138j972k016j519j129q74n59n12j038j544j222k50M83O78
52646A31976Q24J260J848K457K958K941K159J194P85P08K22m46j57J331K705K727
52630A55492J676O34L2m10q32j038r15n95k99l41r38j791k197j862j249q62o54
52613A43851m87o48j326j946j689n79N43J024R15N85L35L40N25M79n7o32n11K60
$$ plain form
52727 129261 131223 133946 136725 138903 140499 141923 143413 144991 146728 148743 151024 153409 155700 157808
52713 157808 159899 162299 165063 167614 169112 169190 168178 166676 165218 164236 163909 163956 163960 163960 164363 165219 166007 166320
52695 166320 166358 166558 167015 167489 167759 167813 167948 168653 170095 171719 172807 173398 174150 175231 176056 176289 176314 176333 175779
52676 175779 174223 172220 170536 169040 167168 165070 163383 162040 160178 157255 153636 150076 147227 145541
52662 145541 144952 144588 143450 141478 139462 137943 136814 135940 135381 134869 133831 132287 131065 130815 131298 131976
52646 131976 132800 134060 135908 138365 141323 144264 146423 147617 148402 149110 149332 148886 148729 150060 152765 155492
52630 155492 157168 157802 157834 157424 156592 155554 154639 154044 153745 153404 152466 150675 148478 146616 145367 144505 143851
52613 143851 143364 142716 141390 139444 137755 137176 137719 138743 139658 140243 140578 140918 141443 141922 141865 141233 140722 140982
52595A40982P63L88m39r41j013j031j079r04n39l70n44p15o08m09m03n58p12r47
52577A30921j355j630j326n09K65O34P20O24J78n92j147j038n44k39k18k23l25
52560A24196p91j355j324o38j59n24j220j325p78l70n70r56p90J19J159J402L81
52543A16457j337k465k129p28M79O13j53r76j147n82K18O60N48J35l11p00q66
52526A07716n16K25O16J75n06m39L47P93K90n36p80m57j82j49l8K10J76l52r48
52507A05645j047o26j93j35l43m99n48o63p88n20L10J172J259M28o43j214j154
52490A00441q30o01o08o98n18J13P92R16M94K06L98N44J47l89l10L29P44N50P9
52471A01799l07n72o18k53K63K54m38j123j174p99m67j11N91J412J741J378P15
$$ plain form
52595 140982 141745 142133 141694 140753 139740 138709 137630 136726 136187 135817 135273 134558 133950 133541 133138 132580 131868 130921
52577 130921 129566 127936 126610 126101 126366 127000 127720 128344 128522 127930 126783 125745 125201 124962 124744 124521 124196
52560 124196 123405 122050 120726 120088 119929 119405 118185 116860 116082 115712 115142 114186 113396 113515 114674 116076 116457
52543 116457 115120 112655 110526 109798 110277 110890 110737 109761 108614 108032 108250 108910 109458 109593 109282 108582 107716
52526 107716 107200 107425 108041 108216 107710 107271 107618 108411 108701 108165 107385 106928 106746 106597 106559 106769 106945 106593 105645
52507 105645 104598 103972 103779 103644 103301 102802 102254 101591 100803 100283 100593 101765 103024 103452 102809 101595 100441
52490 100441 99611 99010 98402 97704 97186 97299 98091 99007 99501 99707 100105 100649 100796 100407 100097 100426 101170 101720 101799
52471 101799 101492 100920 100302 100049 100312 100566 100128 99005 97831 97032 96565 96454 97045 98457 100198 101576 102291
52454A02291R7m38q44r18o17k08O7K20L05K44m2l68l36L07J339K046J821Q50P6
52435A05892J31N56L99m41j043o59L37R58P76J69l34o15p76p51l89J70M90L44
52417A05214R9K44O35O12j3n26k29N80J098J158J245J493J501J217J134J311R88
52400A17761k35j494j738j188r06j089q00M96J955K308J262l65j539j714r67J86
52384A11933J158J648J637J121K03o41q15l12K60N55Q80J456J801J393N90J95
52368A23062L35M71M72R03J989K965K943K018J036N29L35J54%O2M98J388K606
52351A41766L602L689K745J465P35P96J140J121N60j69n17k35M22R31R85P70P13
52334A60519J023J530J932K134K300K579K846K765K212J561J378J844K626L357
$$ plain form
52454 102291 102388 101950 101106 100188 99571 99363 99430 99650 99955 100199 100157 99789 99453 99760 101099 103145 104966 105816 105892
52435 105892 106023 106579 106978 106537 105494 104835 105172 106130 106906 107075 106741 106126 105350 104599 104210 104380 104870 105214
52417 105214 105313 105557 106192 106804 106791 106265 106036 106616 107714 108872 110117 111610 113111 114328 115462 116773 117761
52400 117761 117526 116032 114294 113106 112200 111111 110311 110807 112762 115070 116332 115967 114428 112714 111747 111933
52384 111933 113091 114739 116376 117497 117700 117059 116244 115932 116192 116747 117627 119083 120884 122277 122867 123062
52368 123062 123397 123868 124340 125243 127232 130197 133140 135158 136194 136723 137058 137212 137212 137274 137772 139160 141766
52351 141766 145368 149057 151802 153267 154002 154798 155938 157059 157619 157450 156933 156698 157120 158051 159036 159806 160519
52334 160519 161542 163072 165004 167138 169438 172017 174863 177628 179840 181401 182779 184623 187249 190606
52320A90606M024M739N349N544N283M939M970N606O693P753Q238P980P400P053
52306B76177P066P199P416P981Q927R827J0307J0484J0644J0761J0676J0503J0485
52293C98453J0562J0524J0539J1038J1964J2653J2652J2274J2023J1827J1293
52282E25802J0514J0066J0217J0585J0703J0477R914Q775O953M985L742L575M023
52269F30331M340M122L459K754K421K448K285J503M70L5L67O95M14k0J74Q92J332
52252F58022J203J029J259J713K117K605L336M132M881N915P526R337J0632J1167
52238G24874J1313J1445J1581J1586J1409J1008J0363R659R246R263R421R292
52226H50460Q749P996P275O582N772M782L692K589J600J040J187J699J615L60
$$ plain form
52320 190606 194630 199369 204718 210262 215545 220484 225454 231060 237753 245506 253744 261724 269124 276177
52306 276177 283243 290442 297858 305839 314766 324593 334900 345384 356028 366789 377465 387968 398453
52293 398453 409015 419539 430078 441116 453080 465733 478385 490659 502682 514509 525802
52282 525802 536316 546382 556599 567184 577887 588364 598278 607053 614006 618991 622733 626308 630331
52269 630331 634671 638793 642252 645006 647427 649875 652160 653663 654133 654168 654535 655230 655644 655624 655798 656690 658022
52252 658022 659225 660254 661513 663226 665343 667948 671284 675416 680297 686212 693738 703075 713707 724874
52238 724874 736187 747632 759213 770799 782208 793216 803579 813238 822484 831747 841168 850460
52226 850460 859209 867205 874480 881062 886834 891616 895308 897897 899497 900537 901724 903423 905038 905398
52212I05398j460k764l414m243n668p011p550p515p594p940q256q383q206p415
52198H17979o043m939m862n323n099l871k530j814j577j488j628j980k130j973
52184G72722k002k421k600k068j472j732k607k986k490j977k275l097l519l150
52170G38326k535k498l309m383m856m479l835l544l540l370k934k430j786p50
52156F94077L57O36l43j909l050l461l474l291k851k362k359k988l615l479k616
52141F59272j831j793k351k835k817k485k264k300k333k065j523j131j309k071
52127F30164k954l413l289k863k483k237j977j560r73l26K06M65M70N24J012K036
52111F12802L281M353N137N825O628P532Q285Q544Q189P687P992R677J2085J3780
$$ plain form
52212 905398 903938 901174 897760 893517 887849 880838 873288 865773 858179 850239 841983 833600 825394 817979
52198 817979 811936 806997 802135 796812 791713 787842 785312 783498 781921 780433 778805 776825 774695 772722
52184 772722 770720 768299 765699 763631 762159 760427 757820 754834 752344 750367 748092 744995 741476 738326
52170 738326 735791 733293 729984 725601 720745 716266 712431 708887 705347 701977 699043 696613 694827 694077
52156 694077 694434 695070 694727 692818 689768 686307 682833 679542 676691 674329 671970 668982 665367 661888 659272
52141 659272 657441 655648 653297 650462 647645 645160 642896 640596 638263 636198 634675 633544 632235 630164
52127 630164 627210 623797 620508 617645 615162 612925 610948 609388 608415 608089 608295 608760 609230 609754 610766 612802
52111 612802 616083 620436 625573 631398 638026 645558 653843 662387 670576 678263 686255 695932 708017 721797
52097G21797J4089J3868J4333J5547J6613J7123J7551J8135J8275J7512J6372
52086I01215J5647J5303J4707J3677J2578J1636J0753R913R126Q066O388M411
52074A033420K864J914J010k28j577k769l839m739n188n221n346n831o330o527
52060I91613o621o788o644n786m476l343k670k407k554k986l162k592j484m99
52046I39601M8L43N76P71J039J553K190K543K375J888J516J561J914K038J512
52031I61468O18J19K63M21N1n30p99r52j472k100k126j618j581k691m559o397
52015I38115p841q916r739j0520j1444j2310j2667j2518j2487j3044j3950j4746
52003G97933j5458j6452j7744j8846j9266j9036j8677j8727j9185j9526j9319
$$ plain form
52097 721797 735886 749754 764087 779634 796247 813370 830921 849056 867331 884843 901215
52086 901215 916862 932165 946872 960549 973127 984763 995516 1005429 1014555 1022621 1029009 1033420
52074 1033420 1036284 1038198 1039208 1038980 1037403 1034634 1030795 1026056 1020868 1015647 1010301 1004470 998140 991613
52060 991613 984992 978204 971560 965774 961298 957955 955285 952878 950324 947338 944176 941584 940100 939601
52046 939601 939649 939992 940568 941339 942378 943931 946121 948664 951039 952927 954443 956004 957918 959956 961468
52031 961468 962086 962205 962468 962889 962940 962410 961611 960659 959187 957087 954961 953343 951762 949071 944512 938115
52015 938115 930274 921358 911619 901099 889655 877345 864678 852160 839673 826629 812679 797933
52003 797933 782475 766023 748279 729433 710167 691131 672454 653727 634542 615016 595697
51992E95697j8753j8297j7987j7378j6205j4775j3656j3201j3397j3952j4488
51981D23608j4840j5082j5172j4810j3989j3297j3181j3185j2504j1201j0075
51970B76272r402q612p380o182n453m986m552m447m836n211n009m358l714l140
51956A98990k575k296k483k647k234j538j350j800k248k246j968j588r60j72J03
51941A72988p09k246l423l493k692j835j430j340j296j345j588j752j536j176
51927A47127j110j144p27j8J57k95m18K30P04K14m43j45O19M54o66j369j114r17
51909A41139j483k003j524m20K66K47l3j97o0N66J450J775J038j81q72q11n35
51892A38362l78j52L53R98J505J683J562J481J866K656L203L025K453K291K989
$$ plain form
51992 595697 576944 558647 540660 523282 507077 492302 478646 465445 452048 438096 423608
51981 423608 408768 393686 378514 363704 349715 336418 323237 310052 297548 286347 276272
51970 276272 266870 258258 250878 244696 239243 234257 229705 225258 220422 215211 210202 205844 202130 198990
51956 198990 196415 194119 191636 188989 186755 185217 183867 182067 179819 177573 175605 174017 173057 172885 172988
51941 172988 172279 170033 166610 163117 160425 158590 157160 155820 154524 153179 151591 149839 148303 147127
51927 147127 146017 144873 144146 144128 144285 143990 143572 143802 144506 144720 144277 144132 144751 145205 144539 143170 142056 141139
51909 141139 139656 137653 136129 135709 135975 136222 136189 135992 135932 136498 137948 139723 140761 140580 139708 138897 138362
51892 138362 137984 137832 138185 139183 140688 142371 143933 145414 147280 149936 153139 156164 158617 160908 163897
51877A63897M386N848O527N974M948N013O819R270J1045J2307J4015J6035J7252
51864B83336J7445J7640J8299J8305J6277J2043O214o90p976j4308j8507k0488
51852C27590k0797j9775j7790j5754j4393j3348j1833j0007q717q046p141n645
51840A74344m243l554l362l271l297l343k953k125j650j928k108j252J27O79Q7
51825A42151o39p43n80p12r73q67l48K26O09P87Q17P72O87M74R7j99q1L78P26
51806A42582P43O08M28P4l88n70l65j91k59r5O74J449J342N11J19P63J642J658
51788A50725Q35J67K42N40K33o85j418j375q35m19l03k40j86l51o32n22J19O73
51770A46568M91k39p57o92l46j32j01m4K56Q86J655K110J902J174M09q1l38m77
$$ plain form
51877 163897 168283 174131 180658 186632 191580 196593 203412 212682 223727 236034 250049 266084 283336
51864 283336 300781 318421 336720 355025 371302 383345 389559 388869 380893 366585 348078 327590
51852 327590 306793 287018 269228 253474 239081 225733 213900 203893 195176 187130 179989 174344
51840 174344 170101 166547 163185 159914 156617 153274 150321 148196 146546 144618 142510 141258 141385 142064 142151
51825 142151 141512 140769 140189 139477 138504 137637 137289 137515 138124 138911 139728 140500 141187 141661 141758 141559 141478 141856 142582
51806 142582 143325 143933 144361 144435 144047 143477 143112 142921 142662 142567 143241 144690 146032 146543 146662 147425 149067 150725
51788 150725 151560 151727 151969 152509 152742 152057 150639 149264 148429 148010 147707 147467 147281 146930 146298 145776 145895 146568
51770 146568 147059 146820 146063 145371 145025 144893 144792 144748 145004 145890 147545 149655 151557 152731 153140 153059 152721 152244
51752A52244m75k61J68O88J073J110P69K15l96r32j142q27l03k38p78j246j129
51735A48540q73j112j594j586j113q53r19o62J02O31L72k17l96r8L05O81J037
51718A42245J174R75P25P16P68N45O6m33q53j072q25j66K89O0n37r07j002j139
51700A40629j304j287j207j237j038j88R53J561J510J435J619J669J377J037O80
51685A46209j73j539k544k520j954j653j601j271o56k12m7J00K57K81L86Q41J271
51668A35175R94J60k86R4O39O53L42K65M00M30M85Q77J276R57o8q38n70M14J205
51649A42604J350J043N71M4l71m29j62nl30j032j699k044k018j625j008n92q21
51632A33476j556k036j675o90K28P02Q09O77L19j10l29k39P0O40J585K560K856
$$ plain form
51752 152244 151769 151508 151676 152364 153437 154547 155316 155531 155135 154203 153061 152234 151931 151693 150915 149669 148540
51735 148540 147667 146555 144961 143375 142262 141409 140490 139828 139930 140561 140933 140716 140320 140222 140527 141208 142245
51718 142245 143419 144394 145119 145835 146603 147148 147214 146781 145928 144856 144031 143865 144154 144214 143677 142770 141768 140629
51700 140629 139325 138038 136831 135594 134556 134368 135321 136882 138392 139827 141446 143115 144492 145529 146209
51685 146209 146036 144497 141953 139433 137479 135826 134225 132954 132298 132086 132039 132139 132396 132677 133063 133904 135175
51668 135175 136169 136329 136043 136137 136776 137429 137771 138036 138436 138866 139351 140228 141504 142461 142393 141555 140985 141399 142604
51649 142604 143954 144997 145568 145612 145241 144812 144650 144645 144315 143283 141584 139540 137522 135897 134889 134297 133476
51632 133476 131920 129884 128209 127519 127747 128449 129258 129935 130254 130144 129815 129576 129646 130286 131871 134431 137287
51615A37287K269J462J083Q81K49o52r79m23L33N31K03j38j53J84P88J388J484
51598A45797Q75O2k18J57O41P73O84P65J095J362J278R49Q08J143J716J935J539
51581A61361R07N97O53O48L54N0J15N51J133J752K380K767K559J766R31O09Q28
51564A79961J124J078O37O8k22N6P53J177P66j03l84L08J146J224P55N42O57M69
51546A90012j06l90j24O7k34m90j57L20K13k82m06r6j5m91j216j943k695l251
51528A78716l122k321j504j156j062q72o76p66j143j576j853j862j599j260j043
51513A56901q85o28m42o10r18q25k93P9n4l54m96o38q56p47j52L08O5m71m98k7
51493A48459K07j16o25r69j201j298j039n02j84l80q30j137j162q88k90M35Q94
$$ plain form
51615 137287 139556 141018 142101 142982 143231 142579 141600 141177 141510 142041 142244 142106 141953 142137 142925 144313 145797
51598 145797 146672 146734 146516 146673 147314 148087 148771 149536 150631 151993 153271 154220 155028 156171 157887 159822 161361
51581 161361 162268 162865 163518 164166 164520 164570 164685 165236 166369 168121 170501 173268 175827 177593 178524 179133 179961
51564 179961 181085 182163 182800 182868 182646 182702 183455 184632 185398 185295 184911 185219 186365 187589 188344 188886 189543 190012
51546 190012 189906 189516 189392 189459 189225 188735 188578 188898 189111 188829 188423 188327 188312 187821 186605 184662 181967 178716
51528 178716 175594 173273 171769 170613 169551 168679 168003 167237 166094 164518 162665 160803 159204 157944 156901
51513 156901 156016 155388 154946 154336 153418 152593 152300 152379 152325 151971 151475 150837 149981 149234 149082 149390 149455 148984 148486 148459
51493 148459 148666 148550 147925 146956 145755 144457 143418 142916 142732 142352 141522 140385 139223 138335 138045 138480 139374
51476A39374J036J315K049K805K842K085J245R55J058R34L60k09k59J21M34M72
51460A56617M82N90M38l31j514k583l306l785m031l950l711l620l528k874j564
51445A23330m38l54j080j550j224o42m98o38m25J68M51Q4l18l1P04J028O46Q7
51427A19300k69o95j380j772j194J42J307J627J173M22j43k28K2k1p92j849k289
51410A13361j926j588k014k917l374k906j874r76o73r95j598j961j715r20n6L29
51394H8197O8m63o58k71L52P72J024J453K056K325J886J001K36j81m30o35o29
51377I6103k33M43J088J540J818J899J630J044N00K79J59l07j075j576j449q88
51361A00975j73O44J344J378O35j00q8K41j36j256k008j738j170j330k096k469
$$ plain form
51476 139374 140410 141725 143774 146579 149421 151506 152751 153706 154764 155698 156058 155849 155590 155711 156145 156617
51460 156617 157099 157689 158127 157796 156282 153699 150393 146608 142577 138627 134916 131296 127768 124894 123330
51445 123330 122892 122538 121458 119908 118684 118042 117544 116906 116481 116649 117100 117184 116866 116835 117539 118567 119213 119300
51427 119300 119031 118336 116956 115184 113990 114132 115439 117066 118239 118661 118518 118290 118312 118291 117499 115650 113361
51410 113361 111435 109847 107833 104916 101542 98636 96762 95786 95113 94118 92520 90559 88844 87924 87868 88197
51394 88197 88265 87802 87144 86873 87225 87997 89021 90474 92530 94855 96741 97742 97978 97797 97367 96732 96103
51377 96103 95870 96313 97401 98941 100759 102658 104288 105332 105832 106111 106270 105963 104888 103312 101863 100975
51361 100975 100802 101446 102790 104168 104803 104703 104615 104856 104720 103464 101456 99718 98548 97218 95122 92653
51345I2653j950j066n40m05j65M11R13P91Q5n38n09J20R39J686K233K329J818
51328I8805R57J72l69o52m67K74J089J367J202J149J252R92L08j40k8J05k47p96
51310A04973j051j115j332j607j652j492j260q78l91k68p57j337j358r24n31j99
51294H8821L44R17J063Q93R38J221J202P27L02L24N90Q25J091J514K046K654L276
51277A08748L557L141K369K063K397K562J866O14n12j366k105k532k341j824j662
51262A14975k019k368k245j812j452j270j081p88n01l93m53l74J66J120J975K268
51246A05748K080J833J678J357P28J15o8R7J01k74n83j93Q98J965K310J924J303
51229A21019Q07M11J4k92l41j29J77M08M98N04N16N58N79N69O07P17P88P26N82
$$ plain form
51345 92653 90703 89637 89097 88692 88527 88938 89851 90642 90727 90189 89680 89800 90739 92425 94658 96987 98805
51328 98805 99762 99934 99565 98913 98446 98720 99809 101176 102378 103527 104779 105771 106079 105939 105911 106016 105769 104973
51310 104973 103922 102807 101475 99868 98216 96724 95464 94586 94195 93927 93170 91833 90475 89551 89020 88821
51294 88821 89165 90082 91145 92038 92976 94197 95399 96126 96428 96752 97342 98167 99258 100772 102818 105472 108748
51277 108748 112305 115446 117815 119878 122275 124837 126703 127317 126805 125439 123334 120802 118461 116637 114975
51262 114975 112956 110588 108343 106531 105079 103809 102728 101940 101439 101046 100593 100219 100385 101505 103480 105748
51246 105748 107828 109661 111339 112696 113424 113539 113471 113568 113669 113395 112812 112619 113517 115482 117792 119716 121019
51229 121019 121826 122237 122251 121959 121618 121489 121666 122074 122572 123076 123592 124150 124729 125298 125905 126622 127410 128136 128718
51210A28718L85j5p35j547k034k025j714j399j281j396j460r53K06J208J081q6
51194A16953j138j255p66l49j9N09R84Q50J01p17j257j461j057K46J851K421J366
51177A17262l35j252j092n49r7L75Q29Q42L17k33m00m66q44j372j540j232p71
51160A09442m49l75o02r87j013l08O69R64L25m23l92L74J200J643J737J628J409
51143A14842J212J135J156J271J546J820J624P40l18p94n13L4L73M34L91M30P00
51126A26083J141J435J362J153J187J455J631J565J339R98O40O14J002J067m4
51111A42628j894k912k262r07l15o88j087q96m47k60l80m82l00J64O43P83N38
51094A31926K51K21L54M38N78R31J296J329J108J060J261J260P54J44J20Q22J662
$$ plain form
51210 128718 129103 129088 128353 126806 124772 122747 121033 119634 118353 116957 115497 114544 114750 115958 117039 116953
51194 116953 115815 114560 113794 113445 113426 113935 114919 115769 115870 115153 113896 112435 111378 111624 113475 115896 117262
51177 117262 116927 115675 114583 114034 113937 114312 115141 115983 116300 116067 115667 115201 114357 112985 111445 110213 109442
51160 109442 108993 108618 108016 107029 106016 105708 106377 107341 107666 107243 106851 107225 108425 110068 111805 113433 114842
51143 114842 116054 117189 118345 119616 121162 122982 124606 125346 125028 124234 123721 123755 124128 124562 124953 125383 126083
51126 126083 127224 128659 130021 131174 132361 133816 135447 137012 138351 139349 139989 140603 141605 142672 142628
51111 142628 140734 137822 135560 134653 134338 133650 132563 131667 131220 130960 130580 130098 129798 129962 130605 131388 131926
51094 131926 132177 132398 132752 133190 133768 134699 135995 137324 138432 139492 140753 142013 142767 142911 143031 143853 145515
51077A45515J990J734J255P71J56n96j096j020o77o81j120j467j291o52K30J176
51061A44227J837J754R54M9n29r24j266j269q33m94o47p68j64Q56J371J230J165
51044A46549J558J930J880J698J735J753J388Q19N12N75P68R57J302J935K678
51029A68037K998K403J064j0J63J428K619K905K613K544K888L214L203K955K650
51014B01674K310J983J868K102K506K711K620K656L315M461N358N611N702O311
51000B51188P328Q098Q455Q886R647J0347J0706J1174J2337J4090J5762J6844
50988C84862J7284J7250J6993J6950J7552J8877K0565K2174K3689K5585K8330
50977F10111L1774L5203L8068M0391M2317M3690M4526M5442M6890M8182M8129
$$ plain form
51077 145515 147505 149239 150494 151265 151421 150825 149729 148709 148032 147351 146231 144764 143473 142821 143051 144227
51061 144227 146064 147818 148772 148821 148292 147368 146102 144833 144000 143506 142859 142091 141927 142783 144154 145384 146549
51044 146549 148107 150037 151917 153615 155350 157103 158491 159310 159822 160397 161165 162122 163424 165359 168037
51029 168037 171035 173438 174502 174492 174655 176083 178702 181607 184220 186764 189652 192866 196069 199024 201674
51014 201674 203984 205967 207835 209937 212443 215154 217774 220430 223745 228206 233564 239175 244877 251188
51000 251188 258516 266614 275069 283955 293602 303949 314655 325829 338166 352256 368018 384862
50988 384862 402146 419396 436389 453339 470891 489768 510333 532507 556196 581781 610111
50977 610111 641885 677088 715156 755547 797864 841554 886080 931522 978412 1026594 1074723
50966A074723M6588M4439M1938L8239L3027K7544K3129J9445J5235J0358O114
50955A380779L525K241J224j5j083j264k84J293K501K878K692K113O52k241o410
50940A388601j1319j6653k2139k7180l1386l5171l9131m3105m6529m9369n1816
50929A014803n3254n2583m9775m6219m3282m1117l9059l6532l3338k9697k6237
50918E63710k3467k1145j8607j5780j3169j0995r062p540o820o436n237l164j698
50905D20590j784k321j726k55N58K49m0O05J737K503K815L062L321L329L024K751
50889D38418L001L989N406O660P503Q284R370J0592J1594J2461J3543J4803J5815
50876E61439J6433J7083J8295K0265K2844K5674K8433L1149L4195L7733M1443
$$ plain form
50966 1074723 1121311 1165750 1207688 1245927 1278954 1306498 1329627 1349072 1364307 1374665 1380779
50955 1380779 1384304 1386545 1387769 1387754 1386671 1385407 1385123 1386416 1388917 1391795 1394487 1396600 1397252 1395011 1388601
50940 1388601 1377282 1360629 1338490 1311310 1279924 1244753 1205622 1162517 1115988 1066619 1014803
50929 1014803 961549 908966 859191 812972 769690 728573 689514 652982 619644 589947 563710
50918 563710 540243 519098 500491 484711 471542 460547 451485 443945 437125 430689 425452 422288 420590
50905 420590 418806 416485 414759 414504 415062 415311 415271 415876 417613 420116 422931 425993 429314 432643 435667 438418
50889 438418 441419 445408 450814 457474 464977 473261 482631 493223 504817 517278 530821 545624 561439
50876 561439 577872 594955 613250 633515 656359 682033 710466 741615 775810 813543 854986
50865H54986M5118M9248N4442O0494O6619P2511P8534Q4866R1148R7021J02437
50854A657424J07211J10859J13105J14007J13309J10243J04248R5492Q4334P0974
50844B681206N6079M1243K8035J6743O609k722j0498j5619j7652j6970j4165r566
50832B742723l344L928J0911J5966J8032J6904J2673N418m474j6265k9472m4047
50820B728953n9419p3983q6354r6789j06406j15049j21047j23289j22503j19910
50810A704204j15532j08769j00134r1185q2837p4653o6106n7685n0310m4121l8426
50799H74446l2632k6765k1203j6313j2375r467p333n548l959k850k595l192m156
50786G26058m770m546l675l023l375m541n426n210m230l505l567m169m898n625
$$ plain form
50865 854986 900104 949352 1003794 1064288 1130907 1203418 1281952 1366818 1457966 1554987 1657424
50854 1657424 1764635 1875494 1988599 2102606 2215915 2326158 2430406 2525898 2610232 2681206
50844 2681206 2737285 2778528 2806563 2823306 2829915 2827193 2816695 2801076 2783424 2766454 2752289 2742723
50832 2742723 2739379 2743307 2754218 2770184 2788216 2805120 2817793 2823211 2818737 2802472 2773000 2728953
50820 2728953 2669534 2595551 2509197 2412408 2306002 2190953 2069906 1946617 1824114 1704204
50810 1704204 1588672 1479903 1379769 1288584 1205747 1131094 1064988 1007303 956993 912872 874446
50799 874446 841814 815049 793846 777533 765158 755691 748358 742810 738851 736001 733406 730214 726058
50786 726058 721288 716742 713067 710044 706669 702128 696702 691492 687262 683757 680190 676021 671123 665498
50772F65498o184o163n353m110k979k090j212k19Q67K176L891N868P677R140J0447
50757F77254J1595J2157J1997J1909J3039J5651J8891K1716K3793K5436K7187
50746H70625K9595L3041L7351M1830M5991N0071N4501N9049O2886O5461O6857
50735A417258O7246O6545O4681O1771N7660N1714M3535L3667K3111J2377J478
50724A901043r099j8120k4521k8206k9556k8591k5140j9727j3651q025l057J473
50712A694823N355P900Q567P174L579k307j0091j8897k8098l7699m7580n6791
50700A525935o4103o9035p1767p2150o9700o4753n8841n3381m8456m3402l8132
50689H72215l3222k8984k5138k1396j7746j4150j0406o506k720P51L921O794R244
$$ plain form
50772 665498 659314 653151 647798 643688 640709 638619 637407 637188 638055 640231 644122 649990 657667 666807 677254
50757 677254 688849 701006 713003 724912 737951 753602 772493 794209 818002 843438 870625
50746 870625 900220 933261 970612 1012442 1058433 1108504 1163005 1222054 1284940 1350401 1417258
50735 1417258 1484504 1551049 1615730 1677501 1735161 1786875 1830410 1864077 1887188 1899565 1901043
50724 1901043 1891944 1873824 1849303 1821097 1791541 1762950 1737810 1718083 1704432 1696407 1693350 1694823
50712 1694823 1700178 1708078 1716645 1723819 1727398 1725091 1715000 1696103 1668005 1630306 1582726 1525935
50700 1525935 1461832 1392797 1321030 1248880 1179180 1114427 1055586 1002205 953749 910347 872215
50689 872215 838993 810009 784871 763475 745729 731579 721173 714667 711947 712698 716619 723413 732657
50676G32657J1239J2913J4319J5284J5540J4886J3352J1446R998R355Q912P888
50664H77789O463N584N671O151O410O596P159Q094R071R978J0976J2243J3932
50651I86117J6063J8284J9958K0820K1308K2042K3171K4421K5467K6039K5931
50640A229621K5113K3714K1678J8845J5478J2272R556O865L729M10k509m967p241
50627A352564r282j0845j2069j3280j4271j4413j3617j2664j2278j2230j1625
50616A215990r974p821o245n743n632m788k979j127k09l92j479l573o705j0296
50602A149027j3740j7212k1244k5586k9307l1901l3621l4714l5011l4432l3197
50591H39062l1389k8910k5956k2965k0015j6816j3430j0345p691n125k630p40
$$ plain form
50676 732657 743896 756809 771128 786412 801952 816838 830190 841636 851634 860989 869901 877789
50664 877789 884252 889836 895507 901658 908068 914664 921823 929917 938988 948966 959942 972185 986117
50651 986117 1002180 1020464 1040422 1061242 1082550 1104592 1127763 1152184 1177651 1203690 1229621
50640 1229621 1254734 1278448 1300126 1318971 1334449 1346721 1356277 1363142 1366871 1367281 1364772 1359805 1352564
50627 1352564 1343282 1332437 1320368 1307088 1292817 1278404 1264787 1252123 1239845 1227615 1215990
50616 1215990 1206016 1198195 1191950 1186207 1180575 1175787 1172808 1171681 1171472 1171080 1169601 1166028 1159323 1149027
50602 1149027 1135287 1118075 1096831 1071245 1041938 1010037 976416 941702 906691 872259 839062
50591 839062 807673 778763 752807 729842 709827 693011 679581 669236 661545 656420 653790 653050
50579F53050L02R08J369J485J347J562K238K493J866J407K465M813P005Q324R390
50564G00024J0918J2769J4394J5515J6265J7095J8524K0403K1610K1129J9418
50553H88064J8025J7757J7996J7867J7316J6789J6626J7153J8720K1162K3699
50542A091174K5884K8143L0966L4052L6855L9532M2630M6083M9387N2669N6685
50531A534060O1515O5938O8621O9465O9302O8565O6719O2907N6684M8182L8022
50520B209980K7153J6366N741n195j6517k7410l6946m5112n2556n9363o4626o7453
50508A884062o7973o6945o4717o1043n5846m9590m2839l5815k8677k1863j5740
50497A373014j0001l840L071R996J5785K0018K3155K5458K6167K4094J8927J1434
$$ plain form
50579 653050 653352 654260 655629 657114 658461 660023 662261 664754 666620 668027 670492 675305 682310 690634 700024
50564 700024 710942 723711 738105 753620 769885 786980 805504 825907 847517 868646 888064
50553 888064 906089 923846 941842 959709 977025 993814 1010440 1027593 1046313 1067475 1091174
50542 1091174 1117058 1145201 1176167 1210219 1247074 1286606 1329236 1375319 1424706 1477375 1534060
50531 1534060 1595575 1661513 1730134 1799599 1868901 1937466 2004185 2067092 2123776 2171958 2209980
50520 2209980 2237133 2253499 2259240 2254045 2237528 2210118 2173172 2128060 2075504 2016141 1951515 1884062
50508 1884062 1816089 1749144 1684427 1623384 1567538 1517948 1475109 1439294 1410617 1388754 1373014
50497 1373014 1363013 1359173 1362244 1372240 1388025 1408043 1431198 1456656 1482823 1506917 1525844 1537278
50485A537278K402q001j9544l1157m1389m9459n5401n9378o1438o1851o1077n9225
50473A031760n6115n2059m8009m4489m0808l5911k9887k4112j9845j7048j4700
50462F48777j1952q806n861l593j872j70J860M046N987P549Q928J0320J1713J3009
50448F79935J4102J4877J5294J5488J5555J5199J3967J2007J0215R358R155Q795
50436H33947Q135P878Q448R312R773R936J0356J1066J1619J2029J2962J4842J7291
50423I77594J9726K2045K4372K6578K8410K9875L1056L1844L2304L2970L4180
50412A290954L5175L4551L1790K7870K4119K0847J7341J2855P238Q48n848j2566
50400A485174j9334k6225l2951l8970m4077m8545n2332n4554n4295n1931m8981
$$ plain form
50485 1537278 1539680 1531679 1512135 1480978 1439589 1390130 1334729 1275351 1213913 1152062 1090985 1031760
50473 1031760 975645 923586 875577 831088 790280 754369 724482 700370 680525 663477 648777
50462 648777 636825 628019 622158 618565 616693 616523 618383 622429 628416 635965 644893 655213 666926 679935
50448 679935 694037 708914 724208 739696 755251 770450 784417 796424 806639 815997 825152 833947
50436 833947 842082 849960 858408 867720 877493 887429 897785 908851 920470 932499 945461 960303 977594
50423 977594 997320 1019365 1043737 1070315 1098725 1128600 1159656 1191500 1223804 1256774 1290954
50412 1290954 1326129 1360680 1392470 1420340 1444459 1465306 1482647 1495502 1502740 1503588 1497740 1485174
50400 1485174 1465840 1439615 1406664 1367694 1323617 1275072 1222740 1168186 1113891 1061960 1012979
50389A012979m6425m3623l9339l3525k7535k2561j8412j4110r248m285L34M663
50377G58913Q760J2200J4527J5853J6613J6711J5465J2444Q031K996k154p246
50365H73113j2111j6511k0338k3639k6368k8251k8959k8442k7075k5406k3765
50354F12248k2169k0610j9155j7679j5820j3550j1492j0161r085p307m781k485
50342D57954j002J85J564K596K623K188K467L637M777N387O000P075Q086Q255
50328E11792P635O965O810P101P368P088O176N238N035N503N697N063M180L888
50314E95539M107M127L788L643M131N158O525Q155R819J1199J2337J3644J5331
50301F97503J7298J9550K1982K3405K1464J4382K890r890k0409k6588k8349k7054
$$ plain form
50389 1012979 966554 922931 883592 850067 822532 799971 781559 767449 758201 753916 754250 758913
50377 758913 767673 779873 794400 810253 826866 843577 859042 871486 879517 882513 880359 873113
50365 873113 861002 844491 824153 800514 774146 745895 716936 688494 661419 636013 612248
50354 612248 590079 569469 550314 532635 516815 503265 491773 481612 472527 465220 460439 457954
50342 457954 456952 457137 458701 461297 463920 466108 468575 472212 476989 482376 488376 495451 503537 511792
50328 511792 519427 526392 533202 540303 547671 554759 560935 566173 571208 576711 582408 587471 591651 595539
50314 595539 599646 603773 607561 611204 615335 620493 627018 635173 644992 656191 668528 682172 697503
50301 697503 714801 734351 756333 779738 801202 815584 818474 808584 788175 761587 733238 706184
50289G06184k4470k1834j9505j7366j5370j3587j1930j0256q679p494o771o245
50277E42677n617m811l860k821j856j196q45l56Q86L020N342O721O633N785N496
50262E55198O360P737Q612Q642Q127P288O128M867L959L533L222K703K050J443
50248F29869P85r4j126k092k945l781m616n291n582n295m446l437k876l017l444
50233E82612l483k865j913j071n02p1L77R15J640K747M305N991P270Q021Q719
50218F12692R854J1258J2400J3129J3815J4713J5684J6603J7642J8901K0103K0868
50206G97662K1136K1089K0982K1084K1498K1758K0952J8568J5014J1138P485M308
50194A002674J927O00J10k55j266l417o756j0866j5206j9648k4385k9142l2940
$$ plain form
50289 706184 681714 659880 640375 623009 607639 594052 582122 571866 563187 555693 548922 542677
50277 542677 537060 532249 528389 525568 523712 522516 521671 521315 522201 525221 530563 537284 543917 549702 555198
50262 555198 561558 569295 577907 586549 594676 601964 608092 612959 616918 620451 623673 626376 628426 629869
50248 629869 630654 630560 629434 627342 624397 620616 616000 610709 605127 599832 595386 591949 589073 586056 582612
50233 582612 579129 576264 574351 573280 572778 572707 573084 573999 575639 578386 582691 588682 595952 603973 612692
50218 612692 622546 633804 646204 659333 673148 687861 703545 720148 737790 756691 776794 797662
50206 797662 818798 839887 860869 881953 903451 925209 946161 964729 979743 990881 998366 1002674
50194 1002674 1004601 1005201 1005311 1005056 1003790 1000373 993617 982751 967545 947897 923512 894370 861430
50181H61430l4983l5427l4933l3859l2358l0718k8997k6678k3472k0128j7682
50170E42195j6037j4247j2099j0457r859r701r164q168p082o172n675n760o034
50157D21740n742m737l726l195k842k536k887m154n351n347m430l795l805l731
50143C65462l041k072j374j198j593k348k840k640k221k341k756k455j237q0L47
50128C37613N72J191J860K129K523L799N516O361N851M854M348M411M595M735
50114C90358N049N771O922Q221R218R771J0320J1323J2466J3008J2961J3235J4324
50101E22947J5506J5889J5765J6236J7780J9908K2155K4599K7337L0169L2984
50090G61275L5962L9051M1877M4386M6961M9473N0773M9843M7096M3843M0747
$$ plain form
50181 861430 826447 791020 756087 722228 689870 659152 630155 603477 580005 559877 542195
50170 542195 526158 511911 499812 489355 479496 469795 460631 452463 445381 439209 433534 427774 421740
50157 421740 415998 411261 407535 404340 401498 398962 396075 391921 386570 381223 376793 372998 369193 365462
50143 365462 362421 360349 358975 357777 356184 353836 350996 348356 346135 343794 341038 338583 337346 337266 337613
50128 337613 338185 339376 341236 343365 345888 349687 355203 361564 367415 372269 376617 381028 385623 390358
50114 390358 395407 401178 408100 416321 425539 435310 445630 456953 469419 482427 495388 508623 522947
50101 522947 538453 554342 570107 586343 604123 624031 646186 670785 698122 728291 761275
50090 761275 797237 836288 878165 922551 969512 1018985 1069758 1119601 1166697 1210540 1251287
50079A251287L7523L3994L0666K8080K6192K4499K2286J8654J2983N505k921j1674
50067A477074k0449k8521l4822l9130m2334m4971m6201m5086m2268l9459l7373
50056A056460l5151l1913k8053k4635k2048j9808j7429j5111j3421j2479j1711
50045H24701j0627r630r568j0448j1199j1036j0444j0277j0395r999r006q209
50033G03863q132q483q809q927q552p295n406l859l265l114k471j033Q50K721
50019F38088M194M898M742M046L106J852L04r59j318j024j004j668k342k192j388
50004F49335r96j679k909l669l809m190n411o864p548p466p593q444r374r496
49990E69887q761p812p127o695o266n565m445l057j760p16K32J241K300L532N231
$$ plain form
50079 1251287 1288810 1322804 1353470 1381550 1407742 1432241 1454527 1473181 1486164 1491669 1488748 1477074
50067 1477074 1456625 1428104 1393282 1354152 1311818 1266847 1220646 1175560 1133292 1093833 1056460
50056 1056460 1021309 989396 961343 936708 914660 894852 877423 862312 848891 836412 824701
50045 824701 814074 804444 794876 784428 773229 762193 751749 741472 731077 721078 712072 703863
50033 703863 695731 687248 678439 669512 660960 653665 648259 644400 641135 638021 635550 634517 635367 638088
50019 638088 642282 647180 651922 655968 659074 660926 661230 660271 658953 657929 656925 655257 652915 650723 649335
50004 649335 648339 646660 643751 640082 636273 632083 626672 619808 612260 604794 597201 588757 579383 569887
49990 569887 561126 553314 546187 539492 533226 527661 523216 520159 518399 517683 517915 519156 521456 524988 530219
49975E30219P364R458J1270J3190J5611J8247K0566K2511K4322K5884K6788K6933
49963G52363K6504K5498K3740K1333J8555J5440J1938Q487N920M649M300L964
49951I22691K509j103p029j4099k0813k6730l2200l6821l9334l9321l7851l5937
49939F33962l3361k9871k6422k4031k2091j9303j5977j3814j3312j2890j1182
49928D11708q873p406o894o393n587n006m796m432l769l384l582l868l830l864
49914C40024m452n130m852l342j526n29o07j221j788k102k187k049j734j412j260
49899C05833j276j256j039o67k83K3J96P9m96j387k111k187j545n06M60R46P24
49882B95508j9o98q48o14n06o08m72M3K62m52j595j974j239l06j2j0M17J079J283
$$ plain form
49975 530219 537583 547041 558311 571501 587112 605359 625925 648436 672758 698642 725430 752363
49963 752363 778867 804365 828105 849438 867993 883433 895371 903858 909778 914427 918727 922691
49951 922691 925200 924097 917068 902969 882156 855426 823226 786405 747071 707750 669899 633962
49939 633962 600601 570730 544308 520277 498186 478883 462906 449092 435780 422890 411708
49928 411708 402835 395429 388535 382142 376555 371549 366753 362321 358552 355168 351586 347718 343888 340024
49914 340024 335572 330442 325590 322248 320722 320193 319586 318365 316577 314475 312288 310239 308505 307093 305833
49899 305833 304557 303301 302262 301595 301312 301335 301531 301610 301114 299727 297616 295429 293884 293378 293838 294784 295508
49882 295508 295489 294791 293943 293329 292823 292215 291743 291786 292048 291596 290001 288027 286788 286482 286470 286460 286877 287956 289239
49863B89239J240J926L377M190L366J810J141J472J500O25j99K7R08J360J133
49848C13115R18J212J717J856J378M62m33q23n29J06N32M64l0p62j500j911j816
49831C13956j447j231j211r83l06N23J025J128J137J207J111O77K70N33J506K331
49815C20226K200J380Q68R42P45m42k055k923k729k176j850j624j199o80l83m54
49799C09846q64j439j853j843j590j557j893k257k277j861j066r2N30K65o99j482
49783B89868j523j171r57p82k45N00Q65O49K62Q8M3q1j48K40J226K342K820K368
49765B96364J546J224J616K262K880L773N087O205O272N107L157Q93j357l151
49751C31878m121m346m158l658k816j905j334j053o46o5K05j28p02r56p67m04
$$ plain form
49863 289239 290479 292405 295782 299972 303338 305148 306289 307761 309261 309886 309687 309714 310622 311982 313115
49848 313115 314033 315245 316962 318818 320196 320658 320225 319402 318873 318979 319511 319975 319945 319183 317683 315772 313956
49831 313956 312509 311278 310067 309084 308778 309301 310326 311454 312591 313798 314909 315586 315856 316389 317895 320226
49815 320226 322426 323806 324674 325616 326361 325919 323864 320941 318212 316036 314186 312562 311363 310683 310300 309846
49799 309846 308982 307543 305690 303847 302257 300700 298807 296550 294273 292412 291346 291254 291784 292049 291350 289868
49783 289868 288345 287174 286217 285435 285190 285690 286555 287204 287466 287554 287597 287516 287368 287608 288834 291176 293996 296364
49765 296364 297910 299134 300750 303012 305892 309665 314752 320957 327229 332336 335493 336386 335029 331878
49751 331878 327757 323411 319253 315595 312779 310874 309540 308487 307841 307776 307981 307853 307151 306195 305428 305024
49735C05024j46p8p1J36O72J287J603J623J710J995K106J661P11l62j147j347
49719C15377r21k58J30K52O51J542K367K503K051J537J088M48l48q48p91m13l7
49702C24330K77N82Q21R44J073J338J701K025K219K250K172K142K277K480K580
49687C49211K672L045L620L775L023J684N75J55K67O74J352K170K667K509J960
49672C79359J610J721K071K278K058J228q6j331j922j920j875j918j413J35K175
49657C82170L604M006L937M070M612N600P185R298J1306J2314J1657R042M637
49644D73438o08n045p385p739p300o973o677n935m699l360k288j651j425j329
49630D11024r01oQ73J179R91Q64R63Q86M20P7N23J733K998L629L435K686J936
$$ plain form
49735 305024 304878 304800 304729 304865 305537 306824 308427 310050 311760 313755 315861 317522 318233 317871 316724 315377
49719 315377 314456 314198 314328 314580 315231 316773 319140 321643 323694 325231 326319 326767 326419 325571 324780 324367 324330
49702 324330 324607 325189 326010 326954 328027 329365 331066 333091 335310 337560 339732 341874 344151 346631 349211
49687 349211 351883 354928 358548 362323 365346 367030 367605 367760 368027 368701 370053 372223 374890 377399 379359
49672 379359 380969 382690 384761 387039 389097 390325 390239 388908 386986 385066 383191 381273 379860 379995 382170
49657 382170 385774 389780 393717 397787 402399 407999 415184 424482 435788 448102 459759 468801 473438
49644 473438 472830 467785 460400 452661 445361 438388 431711 425776 421077 417717 415429 413778 412353 411024
49630 411024 410123 410117 410990 412169 413160 414024 414987 415873 416293 416370 416893 418626 421624 425253 428688 431374 433310
49613D33310J781K408L340L881L842L618L573L603L467L254L302L720M151M120
49599D81370L590L102L229L892M420M330L822L330L020K964L496M714N852N848
49585E36979M665L443L095L316L284K917K913L754N053N927N868N237M858N015
49571E96324N074M441L588L474M079M362L862L327L395L583L261K787K778K920
49557F47255K527J828J689K236K742K769K579K394K189K056K058J823J113O97
49543F75955J550L171L892L088J993J952K889L935M576M552L622K212J461J850
49529G16698K466K440K371L336N068O286O482O259O018N429M342L274K629K162
49515G75260J537Q96N10L10Rm81j032j548k069k714l509m269m744m928n036n102
$$ plain form
49613 433310 435091 437499 440839 444720 448562 452180 455753 459356 462823 466077 469379 473099 477250 481370
49599 481370 484960 488062 491291 495183 499603 503933 507755 511085 514105 517069 520565 525279 531131 536979
49585 536979 541644 545087 548182 551498 554782 557699 560612 564366 569419 575346 581214 586451 591309 596324
49571 596324 601398 605839 609427 612901 616980 621342 625204 628531 631926 635509 638770 641557 644335 647255
49557 647255 649782 651610 653299 655535 658277 661046 663625 666019 668208 670264 672322 674145 675258 675955
49543 675955 677505 680676 684568 687656 689649 691601 694490 698425 703001 707553 711175 713387 714848 716698
49529 716698 719164 721604 723975 727311 732379 738665 745147 751406 757424 762853 767195 770469 773098 775260
49515 775260 776797 777693 778203 778513 778522 778041 777009 775461 773392 770678 767169 762900 758156 753228 748192 743090
49499G43090n033n076n755o990p897p879p393p019o435n178l875l598m158m299
49485F62505l646l243l791m467m202l195k463k431k782l217l601l616l070k430
$$ plain form
49499 743090 738057 732981 727226 720236 712339 704460 697067 690048 683613 678435 674560 670962 666804 662505
49485 662505 658859 655616 651825 647358 643156 639961 637498 635067 632285 629068 625467 621851 618781 616351
$$ [...]
##END NTUPLES=NMR SPECTRUM
##END=
