##TITLE=NES1042_878015014_9242965_O5LvIJuU8l
##JCAMPDX= 6.0         $$ Bruker NMR JCAMP-DX V2.0
##DATA TYPE= NMR SPECTRUM
##DATA CLASS= NTUPLES
##ORIGIN= BRUKER
##OWNER= Administrator
$$ 1.72 TOPSPIN		Version 2.1
$$ 2015-06-23 19:54:52.514 -0700  Administrator@X
$$ Compression mode = diff/dup
##.OBSERVE FREQUENCY= 400.02188249412
##.OBSERVE NUCLEUS= ^1H
##.ACQUISITION MODE= SIMULTANEOUS (DQD)
##.ACQUISITION SCHEME= undefined
##.AVERAGES= 8
##.DIGITISER RES= 22
##SPECTROMETER/DATA SYSTEM= spect
##.PULSE SEQUENCE= zg30
##.SOLVENT NAME= COFFEE_meoh
##.SHIFT REFERENCE= INTERNAL, COFFEE_meoh, 1, 14.98509
##AUDIT TRAIL= $$ (NUMBER, WHEN, WHO, WHERE, PROCESS, VERSION, WHAT)
$$ ##TITLE= Audit trail, TOPSPIN		Version 2.1
$$ ##JCAMPDX= 5.01
$$ ##ORIGIN= Bruker BioSpin GmbH
$$ ##OWNER= Administrator
$$ $$ E:\/data/COFFEE/nmr/NES1042_878015014_9242965_O5LvIJuU8l/10/pdata/1/auditp.txt
$$ ##AUDIT TRAIL=  $$ (NUMBER, WHEN, WHO, WHERE, PROCESS, VERSION, WHAT)
(   1,<2015-06-23 19:54:45.342 -0700>,<Administrator>,<X>,<go>,<TOPSPIN 2.1>,
      <created by zg
	started at 2015-06-23 19:53:39.561 -0700,
	POWCHK enabled, PULCHK disabled,
       configuration hash MD5:
       21 0F 79 D6 B3 7B B4 F6 88 20 88 DB 03 48 BD 9F
       data hash MD5: 64K
       CD 39 28 8B F8 B0 AF ED 94 9B 18 9F FF 09 55 5C>)
(   2,<2015-06-23 19:54:48.483 -0700>,<Administrator>,<X>,<proc1d>,<TOPSPIN 2.1>,
      <Start of raw data processing
       efp LB = 0 FT_mod = 6 PKNL = 1 PHC0 = 0 PHC1 = 0 SI = 32K 
       data hash MD5: 32K
       7E BA E6 29 23 47 92 CD 1B 6F D7 14 63 9C A2 1B>)
(   3,<2015-06-23 19:54:48.779 -0700>,<Administrator>,<X>,<proc1d>,<TOPSPIN 2.1>,
      <pk PHC0 = 89.50562 PHC1 = 0 
       data hash MD5: 32K
       A1 C6 2B EB 15 1E 00 65 53 4A 84 56 83 FA 15 C0>)
(   4,<2015-06-23 19:54:48.889 -0700>,<Administrator>,<X>,<proc1d>,<TOPSPIN 2.1>,
      <abs ABSG = 1 
       data hash MD5: 32K
       55 D7 08 47 A7 DE 69 FC 07 D9 C1 C6 21 EB 02 52>)
(   5,<2015-06-23 19:54:48.951 -0700>,<Administrator>,<X>,<proc1d>,<TOPSPIN 2.1>,
      <abs ABSG = 2 
       data hash MD5: 32K
       52 07 DC 52 12 E1 35 AA 33 E9 73 CA 7A 1B A8 C9>)
(   6,<2015-06-23 19:54:49.014 -0700>,<Administrator>,<X>,<proc1d>,<TOPSPIN 2.1>,
      <abs ABSG = 3 
       data hash MD5: 32K
       29 79 82 CF 69 5A 2B 68 7B F4 5C 95 9F B7 FE 27>)
(   7,<2015-06-23 19:54:49.061 -0700>,<Administrator>,<X>,<proc1d>,<TOPSPIN 2.1>,
      <abs ABSG = 4 
       data hash MD5: 32K
       9F 7E B1 66 DC C7 CF B9 94 53 A1 F5 8F EC 8C A4>)
(   8,<2015-06-23 19:54:49.123 -0700>,<Administrator>,<X>,<proc1d>,<TOPSPIN 2.1>,
      <abs ABSG = 5 
       data hash MD5: 32K
       C6 70 0D 65 16 C1 BE C8 DD 82 23 BC 19 F5 80 0E>)
$$ ##END=
$$ 
$$ $$ hash MD5
$$ $$ DF 1B 14 A7 97 28 9B 53 00 2A 16 4B FB 86 5A 93
##$RELAX= 
##$RELAX= 
##$RELAX= 
##$RELAX= 
##$RELAX= 
##$RELAX= 
##$RELAX= 
$$ Bruker specific parameters
$$ --------------------------
##$DU= <E:\>
##$EXPNO= 10
##$NAME= <NES1042_878015014_9242965_O5LvIJuU8l>
$$ [...]
150 150 150 150 150 150 150 150
##$TP07= 0
##$TPNAME0= <>
##$TPNAME1= <>
##$TPNAME2= <>
##$TPNAME3= <>
##$TPNAME4= <>
##$TPNAME5= <>
##$TPNAME6= <>
##$TPNAME7= <>
##$TPOAL= (0..7)
0.5 0.5 0.5 0.5 0.5 0.5 0.5 0.5
##$TPOFFS= (0..7)
0 0 0 0 0 0 0 0
##$TUNHIN= 0
##$TUNHOUT= 0
##$TUNXOUT= 0
##$USERA1= <user>
##$USERA2= <user>
##$USERA3= <user>
##$USERA4= <user>
##$USERA5= <user>
##$V9= 5
##$VALIST= <valist>
##$VCLIST= <CCCCCCCCCCCCCCC>
##$VD= 0
##$VDLIST= <DDDDDDDDDDDDDDD>
##$VPLIST= <PPPPPPPPPPPPPPP>
##$VTLIST= <TTTTTTTTTTTTTTT>
##$WBST= 2048
##$WBSW= 25
##$XGAIN= (0..3)
0 0 0 0
##$XL= 0
##$YL= 0
##$YMAX_a= 630435
##$YMIN_a= -526467
##$ZGOPTNS= <>
##$ZL1= 120
##$ZL2= 120
##$ZL3= 120
##$ZL4= 120
##$ABSF1= 14.98509
##$ABSF2= -5.573092
##$ABSG= 5
##$ABSL= 3
##$ALPHA= 0
##$AQORDER= 0
##$ASSFAC= 0
##$ASSFACI= 0
##$ASSFACX= 0
##$ASSWID= 0
##$AUNMP= <proc_prof1d_extract_pilot.lims>
##$AXLEFT= 0
##$AXNAME= <>
##$AXNUC= <1H>
##$AXRIGHT= 0
##$AXTYPE= 0
##$AXUNIT= <>
##$AZFE= 0.1
##$AZFW= 0.1
##$BCFW= 0
##$BC_mod= 0
##$BYTORDP= 0
##$COROFFS= 0
##$CY= 15
##$DATMOD= 1
##$DC= 0
##$DFILT= <>
##$DTYPP= 0
##$F1P= 0
##$F2P= 0
##$FCOR= 0.5
##$FTSIZE= 32768
##$FT_mod= 6
##$GAMMA= 0
##$GB= 0
##$INTBC= 1
##$INTSCL= 1
##$ISEN= 128
##$LB= 0
##$LEV0= 0
##$LPBIN= 0
##$MAXI= 10000
##$MC2= 0
##$MEAN= 0
##$ME_mod= 0
##$MI= 0
##$NCOEF= 0
##$NC_proc= -8
##$NLEV= 6
##$NOISF1= 0
##$NOISF2= 0
##$NSP= 0
##$NTH_PI= 0
##$NZP= 0
##$OFFSET= 14.98509
##$PC= 1
##$PHC0= 89.50562
##$PHC1= 0
##$PH_mod= 1
##$PKNL= yes
##$PPARMOD= 0
##$PPDIAG= 0
##$PPIPTYP= 0
##$PPMPNUM= 2147483647
##$PPRESOL= 1
##$PSCAL= 4
##$PSIGN= 0
##$PYNMP= <proc.py>
##$REVERSE= no
##$SF= 400.02
##$SI= 32768
##$SIGF1= 0
##$SIGF2= 0
##$SINO= 400
##$SIOLD= 32768
##$SPECTYP= <>
##$SREGLST= <1H.CDCl3>
##$SSB= 0
##$STSI= 32768
##$STSR= 0
##$SW_p= 8223.68421052631
##$SYMM= 0
##$S_DEV= 0
##$TDeff= 65536
##$TDoff= 0
##$TI= <>
##$TILT= no
##$TM1= 0
##$TM2= 0
##$TOPLEV= 0
##$USERP1= <user>
##$USERP2= <user>
##$USERP3= <user>
##$USERP4= <user>
##$USERP5= <user>
##$WDW= 1
##$XDIM= 32768
##$YMAX_p= 434995054
##$YMIN_p= -794367
##$CURPLOT= <Network HP LaserJet P1505>
##$CURPRIN= <$Network HP LaserJet P1505>
##$DFORMAT= <normdp>
##$LAYOUT= <+/1D_H.xwp>
##$LFORMAT= <normlp>
##$PFORMAT= <normpl>
##$SURQMSG= 1
$$ End of Bruker specific parameters
$$ ---------------------------------
##NTUPLES= NMR SPECTRUM
##VAR_NAME=  FREQUENCY,     SPECTRUM/REAL,   SPECTRUM/IMAG
##SYMBOL=    X,             R,               I
##VAR_TYPE=  INDEPENDENT,   DEPENDENT,       DEPENDENT
##VAR_FORM=  AFFN,          ASDF,            ASDF
##VAR_DIM=   32768,         32768,           32768
##UNITS=     HZ,            ARBITRARY UNITS, ARBITRARY UNITS
##FACTOR=    0.250966925370066, 1,           1
##FIRST=     8223.43324360094, -59750,       -74287
##LAST=      0,             -102325,         -114175
##MIN=       0,             -794367,         0
##MAX=       8223.43324360094, 434995054,    0
$$ Real data points
##PAGE= N=1
##DATA TABLE= (X++(R..R)), XYDATA
$$ [...]
19444A17967b58510e4171F1717E03M31055A40374a81012p5711A73175b41753A9781
$$ 117967 -258510 -54171 61717 503 431558 140374 -181012 -256723 173175 -241753 19781
19432c14466I7834B9322a18551l2207e5895B6992a46131N5910c4090A04391f8988
$$ -314466 97834 29322 -118551 -150758 -55895 26992 -146131 -90221 -34090 104391 -68988
19420b58544c7411A29770N5986e5826l0605D7062g1116k75026a34531G1039b99005
$$ -258544 -37411 129770 185756 -55826 -86431 47062 -71116 -346142 -134531 71039 -299005
19408a11974j03521A2246a32932K5476B07325i5476K0253J3491A1513a01397b0194
$$ -111974 -215495 12246 -132932 -107456 207325 -95476 -75223 -61732 11513 -101397 -20194
19396a01028j98214R9013i7924B9404b58980k130J19970G9257g7644B846c9959
$$ -101028 -299242 -200229 -97924 29404 -258980 -261110 -141140 79257 -77644 2846 -39959
19384D4178a02827k1257P513m3528b8182p3394M2157l0347E3213b6714k0848G5365
$$ 44178 -102827 -124084 -116571 -160099 -28182 -101576 -59419 -89766 53213 -26714 -47562 75365
19371a3280k50913d6476j23657a4909k01844a04862d6633B72595c36804c1107
$$ -13280 -264193 -46476 -170133 -14909 -216753 -104862 -46633 272595 -336804 -31107
19360H0309b56852J12900o6391j72988a12287l30827c5218j97546N5882f0908
$$ 80309 -256852 -143952 -210343 -383331 -112287 -443114 -35218 -232764 -176882 -60908
19349a5534q9956l8511o6114L2530B6360K3466a41361k44719B11924g0414j24121
$$ -15534 -105490 -144001 -210115 -177585 26360 49826 -141361 -386080 211924 -70414 -194535
19338a94535A03597J04756D7762a65986g0185B81270b46212D1167f6163F8057
$$ -194535 103597 208353 47762 -165986 -70185 281270 -246212 41167 -66163 68057
19327A93817G0573c67710f8811a6299m2979k52461c5028r9757C52525d86545a10083
$$ 193817 70573 -367710 -68811 -16299 -59278 -311739 -35028 -134785 352525 -486545 -110083
19315b25548A92688g1191B30847j04734c90897A63723j0593a3748F2858P0855
$$ -225548 192688 -71191 230847 126113 -390897 163723 153130 -13748 62858 133713
19305A33713a92967i1486E6338a7379p2186D119b78292h0404o6147M0890A05670
$$ 133713 -192967 -91486 56338 -17379 -89565 4119 -278292 -80404 -146551 -105661 105670
19293b3494o7622a1663j67275b5094j37918q1636B35063g9802J9499J7267n4334
$$ -23494 -91116 -11663 -178938 -25094 -163012 -244648 235063 -79802 -60303 -43036 -97370
19282i7370j30720D2888g7601A59820D5002a46360a4919G9699a7074A39202b57961
$$ -97370 -228090 42888 -77601 159820 45002 -146360 -14919 79699 -17074 139202 -257961
19270I3913K04903A0682e4592d705I4362a5323B26942H9528e36909a58246B23637
$$ 93913 298816 10682 -54592 -4705 94362 -15323 226942 89528 -536909 -158246 223637
19258a71572k67507i1966Q594G8144Q3512a71383N9531q9656D4684a34382D3843
$$ -171572 -439079 -91966 -83372 78144 161656 -171383 -111852 -201508 44684 -134382 43843
19246B84497a2903C1312b38563F5694a85362h3394D1142E326J95717g7139k78197
$$ 284497 -12903 31312 -238563 65694 -185362 -83394 41142 5326 201043 -77139 -355336
19235c55336J53161H8538c7408k8238j91360D39130b4094A75977c2096a861E2575
$$ -355336 -202175 88538 -37408 -65646 -257006 439130 -24094 175977 -32096 -1861 52575
19223c45879F8269N1449d290r0031j19008a2534C55923c14413a26758K7249r5099
$$ -345879 68269 119718 -4290 -94321 -213329 -12534 355923 -314413 -126758 -99509 -194608
19212a94608A18463a32375B39375a34128A47182b7745A25665a26558k25059E752
$$ -194608 118463 -132375 239375 -134128 147182 -27745 125665 -126558 -351617 5752
19201F2592r288K06467g9070j62372P4601A36407b01823f0775J5659h734j94092
$$ 62592 53304 259771 -79070 -241442 -166841 136407 -201823 -60775 -45116 -8734 -202826
19190b02826k3863J06501N9929C7409A6000b08555o2076B39340c33679i3156H7873
$$ -202826 -226689 -120188 -60259 37409 16000 -208555 -270631 239340 -333679 -93156 87873
19178g3143K0611j91595h5404C03488p2449f4198j63105A04668C3859a17789C0737
$$ -73143 -52532 -244127 -85404 303488 231039 -64198 -227303 104668 33859 -117789 30737
19166F561i6142m5766G5948b15691b2053g57n1306A27625e560j55493g8217j29207
$$ 6561 -96142 -141908 75948 -215691 -22053 -757 -52063 127625 -5560 -161053 -78217 -207424
19154b07424n7096a02211B5865J6205A7948a65717e9344k2911l15449A42313d8256
$$ -207424 -264520 -102211 25865 42070 17948 -165717 -59344 -82255 -397704 142313 -48256
19142C7727f1277B63892B7359C787O1677A7323J72919g0067j87266O6001B96300
$$ 37727 -61277 263892 27359 3787 65464 17323 190242 -70067 -257333 -191332 296300
19130b13655j04635G585a57576N9681K0489E5722b96329h5055G9207j7585c80859
$$ -213655 -318290 7585 -157576 -97895 -77406 55722 -296329 -85055 79207 61622 -380859
19118A7330b74934L9441g1009J8984E9600K7475a62952j45936J03199j08112B6770
$$ 17330 -274934 -235493 -71009 -52025 59600 87075 -162952 -308888 -205689 -313801 26770
19106a0407n5702a541C4010J93739G6432a88813A72415D5727c9800k40951O5457
$$ -10407 -66109 -1541 34010 227749 76432 -188813 172415 45727 -39800 -280751 -215294
19095b15294j23850i5129E2601O1276a71564N2467B13888a18121j09865C4786
$$ -215294 -339144 -95129 52601 113877 -171564 -119097 213888 -118121 -227986 34786
19084B57483a43991b4673q871j79952j67904a32034M2965r4371A1961b36039B5448
$$ 257483 -143991 -24673 -33544 -213496 -381400 -132034 -89069 -183440 11961 -236039 25448
19072F0439F656a03616L4971j40378E4708g9348j70051i374n2781k15461a5154
$$ 60439 6656 -103616 -68645 -209023 54708 -79348 -249399 -9374 -62155 -277616 -15154
19060A33661k5227b25291b6699l12835f8698j5129C0467a32525c052j9760F1002
$$ 133661 108434 -225291 -26699 -339534 -68698 -83827 30467 -132525 -3052 -22812 61002
19048F699a32808G3171K9432a13389M3546p3873a711j06129k1926k92j72290A52499
$$ 6699 -132808 73171 102603 -113389 -69843 -143716 -1711 -107840 -129766 -130058 -302348 152499
19035H3985D01L24211G875a02071B20241H7672m1247O4809g6260A66819a31122
$$ 83985 401 324612 7875 -102071 220241 87672 46425 111234 -76260 166819 -131122
19023A86033G4021a22734G3499B2988b4320G9604P5308i87B6488J63778K0497
$$ 186033 74021 -122734 73499 22988 -24320 79604 154912 -987 26488 190266 210763
19012B10763e81106C673b58939d9604j0367l23239E6476k5874c04727R6099p1443
$$ 210763 -581106 3673 -258939 -49604 -59971 -383210 56476 30602 -304727 -208628 -280071
19001b80071J06908J7399j14503E2122a74475b8231k96170a58786A5626K1045
$$ -280071 -173163 -155764 -270267 52122 -174475 -28231 -324401 -158786 15626 36671
18991C6671a29512r7458j90920A98082C8086e5574B87776G5176a26557N5286n6070
$$ 36671 -129512 -226970 -417890 198082 38086 -55574 287776 75176 -126557 -71271 -127341
18980a27341H5876k7690c57943A15440B6779c51166C30156p5766F8655J38984
$$ -127341 85876 58186 -357943 115440 26779 -351166 330156 254390 68655 207639
18970B07639H757J7357a21265n6560P7439A62910l0973d6906B73680b13971i9677
$$ 207639 8757 26114 -121265 -177825 -100386 162910 131937 -46906 273680 -213971 -99677
18958G1782g714l0197j95063D29775G3208b31190g7675K7212n7262a1492k24274
$$ 71782 -7714 -37911 -232974 429775 73208 -231190 -77675 -50463 -107725 -11492 -235766
18947b35766A89448b52952a09868G5711J46812j01398b13047Q7483b9067J3877
$$ -235766 189448 -252952 -109868 75711 222523 121125 -213047 -125564 -29067 -15190
18937a5190A77801d3283m6166B19810A1226O0153a32771j45786P5733F9961c45963
$$ -15190 177801 -43283 -89449 219810 11226 71379 -132771 -278557 -202824 69961 -345963
18925A21632J39926b99996A88567e133k39823I5773d32300a11847l31337b12249
$$ 121632 261558 -299996 188567 -5133 -244956 95773 -432300 -111847 -443184 -212249
18914b48486N9768A21686h202A43885K00627F7706d6676A62606Q03a71016L6039
$$ -248486 -188718 121686 -8202 143885 344512 67706 -46676 162606 163409 -171016 -134977
18903a34977P544j20438F6856J66391b36205D772c07928H743J46923a79303a2321
$$ -134977 -127433 -247871 66856 233247 -236205 4772 -307928 8743 155666 -179303 -12321
18891A99279r6895d6699B8620a38872B9313J20802c41675a34011k13251G1530
$$ 199279 102384 -46699 28620 -138872 29313 150115 -341675 -134011 -347262 71530
18880g8593o2652m844k45125a67646P8922p761k8183l7967E2561g8644k80924
$$ -78593 -141245 -146089 -391214 -167646 -88724 -96485 -124668 -162635 52561 -78644 -359568
18869c59568e8020J7680j21730H1249a08534A53956a84529j21518e924A51407
$$ -359568 -58020 -40340 -162070 81249 -108534 153956 -184529 -306047 -5924 151407
18858D7139c2694E6579R9477n1352F518h6745p9291G1457K8427a31736A07797
$$ 47139 -32694 56579 156056 104704 6518 -86745 -166036 71457 99884 -131736 107797
18846d8341a9436k62071B53681f7169A66578a40787B18174B6670K72454r5047
$$ -48341 -19436 -281507 253681 -67169 166578 -140787 218174 26670 299124 204077
18836B04077d0815l98962d4108E9800h0776B3526J05717a63170g6452R194k79000
$$ 204077 -40815 -439777 -44108 59800 -80776 23526 129243 -163170 -76452 -67258 -346258
18825c46258c5495k17140B7550a70466j06228A08328E1189A2845L3553J654A9653
$$ -346258 -35495 -252635 27550 -170466 -276694 108328 51189 12845 46398 48052 19653
18813C18029B7619c9861F172O6073a77128A8458K6243a74774c3931j78311A62730
$$ 318029 27619 -39861 6172 72245 -177128 18458 44701 -174774 -33931 -212242 162730
18801d0430l8527k00654j2016i0789I6248e5323E2927a59759B2006r214a10405
$$ -40430 -78957 -279611 -291627 -90789 96248 -55323 52927 -159759 22006 12792 -110405
18789a05521k7120K7671b6942m3401j39139M3576k6050A47674a82731B2419e4096
$$ -105521 -132641 -104970 -26942 -70343 -209482 -165906 -191956 147674 -182731 22419 -54096
18777d3258j35199h7008q6534J8011A75447a23499A72118G8060J44154a39772
$$ -43258 -178457 -87008 -173542 -155531 175447 -123499 172118 78060 222214 -139772
18766a76164f5979j0400B626P9984a01466b1706l5722j69515g5393F5707K2999
$$ -176164 -65979 -76379 2626 82610 -101466 -21706 -57428 -226943 -75393 65707 88706
18755H8706a46953b6049A35506d3099B75028H0064j7377j1234K47973a73853O1348
$$ 88706 -146953 -26049 135506 -43099 275028 80064 62687 51453 299426 -173853 -112505
18744a12505b5256j97282g4768J1056K0388o6062e1843A58113a74606e1867b2986
$$ -112505 -25256 -222538 -74768 -63712 -43324 -109386 -51843 158113 -174606 -51867 -22986
18732a14486e0683l8307o082F5622c0686o731k28785b0246j86144A36018a65362
$$ -114486 -50683 -88990 -95072 65622 -30686 -37417 -266202 -20246 -206390 136018 -165362
18720b027C37905A603d6842F4167J60246a67337p8033a14559a531l8262J2341
$$ -2027 337905 1603 -46842 64167 224413 -167337 -245370 -114559 -1531 -39793 -27452
18709b7452B09235P0270D4722K81014c62927f5750q7153A21684k8477i9791p639
$$ -27452 209235 279505 44722 325736 -362927 -65750 -152903 121684 93207 -99791 -107430
18698a07430j10878L7581e754j74997H1506q267J8182b5261H5704i9831l9380
$$ -107430 -218308 -180727 -5754 -180751 81506 73239 91421 -25261 85704 -99831 -139211
18687a39211C7422c82993A09662C8927J63953b40595o9460D5079f7105J2412j13137
$$ -139211 37422 -382993 109662 38927 202880 -240595 -310055 45079 -67105 -54693 -167830
18676a67830A11963b47247o5428k45037K20520O0497b0644r2676M2405r8839L5115
$$ -167830 111963 -247247 -312675 -557712 -337192 -276695 -20644 -113320 -70915 -169754 -134639
18665a34639B90903K7728h7850A90190q7364B2b49266a00161a5383C31316a26219
$$ -134639 290903 318631 -87850 190190 102826 22 -249266 -100161 -15383 331316 -126219
18653D7663a16823k39701a69029j01893c6271D32198d97416H8979a31276j21663
$$ 47663 -116823 -356524 -169029 -270922 -36271 432198 -497416 88979 -131276 -252939
18643b52939c694A9463c4036G4805b8773B41483h8305k5019j60192b9412n5533
$$ -252939 -3694 19463 -34036 74805 -28773 241483 -88305 -113324 -273516 -29412 -84945
18632h4945k87915a27210B43083a33609k22394J5972A95623a68503G018c06804
$$ -84945 -372860 -127210 243083 -133609 -356003 -340031 195623 -168503 7018 -306804
18621D01419I0372a6533m9211j0806m4255K1048q3031a7783l44240B7466b4979
$$ 401419 90372 -16533 -65744 -76550 -120805 -99757 -182788 -17783 -362023 27466 -24979
18609A1957Q1535b17936J1258j30741B3290a42725e9406K3152j92214j42695F6062
$$ 11957 93492 -217936 -206678 -337419 23290 -142725 -59406 -36254 -228468 -371163 66062
18597e112j07826E7314f1511j57015f9251l07400a12530q9993J0365I3550a33176
$$ -5112 -112938 57314 -61511 -218526 -69251 -376651 -112530 -202523 -192158 93550 -133176
18585a74749B39706J2164I8024h0132A04791J41035L7359B5599K44817a68753
$$ -174749 239706 251870 98024 -80132 104791 245826 283185 25599 270416 -168753
18574F849i6418j82013E0514O5285A7215a13059n8341m1173k9185E7941J06051
$$ 6849 -96418 -278431 50514 115799 17215 -113059 -171400 -212573 -241758 57941 163992
18563A63992a47852g0984j31421A01425I36a88621c7437p8972j74989a14530p9203
$$ 163992 -147852 -70984 -202405 101425 936 -188621 -37437 -116409 -291398 -114530 -193733
18552a93733H3567J73754a69922g916o8992B00215a0388j11709j56994C5044J18689
$$ -193733 83567 257321 -169922 -7916 -76908 200215 -10388 -122097 -279091 35044 153733
18541A53733l0822b26986h7727j23498J1764B863d1317E8891i0548n8293l9194
$$ 153733 122911 -226986 -87727 -211225 -199461 2863 -41317 58891 -90548 -148841 -188035
18530a88035l60073B25743a75224O9639A77843O6065O932g5059A51022M4073e53210
$$ -188035 -548108 225743 -175224 -105585 177843 243908 250840 -75059 151022 195095 -553210
18518A04630m9970c24701j68a46022A86969G4253a45621f3203j23692P9808k464
$$ 104630 54660 -324701 -324869 -146022 186969 74253 -145621 -63203 -186895 -107087 -109551
18507a09551q2024C993e525j46069a6755p8256B53256A8695J54958o8326l1401
$$ -109551 -191575 3993 -5525 -151594 -16755 -95011 253256 18695 173653 105327 73926
18496G3926g1668k7760C6714h1948n471j47405c6648j21756a1635k04803B2389
$$ 73926 -71668 -99428 36714 -81948 -87419 -234824 -36648 -158404 -11635 -216438 22389
18484B8673a02049A4666a44868I2014E187b81117j71415A5596d9119j04997k71071
$$ 28673 -102049 14666 -144868 92014 5187 -281117 -452532 15596 -49119 -154116 -425187
18473d25187e3895k01328H8828l9884f7449C34217a63126A51022a48612j96000
$$ -425187 -53895 -255223 88828 48944 -67449 334217 -163126 151022 -148612 -344612
18463c44612B62351c52690d2615j50458E5271c4284k86056L800b1297A7783L75123
$$ -344612 262351 -352690 -42615 -193073 55271 -34284 -320340 -316540 -21297 17783 392906
18452C92906c4811P80A57190h2476A39930L04300i536n8533k4354g897I2496h6092
$$ 392906 -34811 -34031 157190 -82476 139930 444230 -9536 -68069 -92423 -7897 92496 -86092
18439b74473b5245p6859Q157J3640l97854h7898H7558a73690A26927l683m1743
$$ -274473 -25245 -102104 -93947 -80307 -478161 -87898 87558 -173690 126927 123244 81501
18428H1501J77990o3642c51382a09286j81193A03638A450J08408b24394A27641
$$ 81501 259491 195849 -351382 -109286 -290479 103638 1450 109858 -224394 127641
18417a09442m4528f4598A98659a7634l577j28310A07717f2010A56220F529a41641
$$ -109442 -153970 -64598 198659 -17634 -21211 -149521 107717 -62010 156220 6529 -141641
18405a09500C31098c3599H1431a51552G1389I856b62286C58308A44442a8181A68384
$$ -109500 331098 -33599 81431 -151552 71389 9856 -262286 358308 144442 -18181 168384
18393B07405a53764A89906a5632H3453e232j3107F3073g9853E575b81132K8607
$$ 207405 -153764 189906 -15632 83453 -5232 -18339 63073 -79853 5575 -281132 -252525
18382b52525B94492d1553H97L01810a30441k01586A58161D5841g5971A28231a91148
$$ -252525 294492 -41553 897 302707 -130441 -332027 158161 45841 -75971 128231 -191148
18370b23609m0218C3478d06667C85442I8616a02594F5628J667M6846K00640A32606
$$ -223609 -263827 33478 -406667 385442 98616 -102594 65628 67295 114141 314781 132606
18358A49284J12401b33608a9764A44058d5947j78497I4443a37905j89099k53417
$$ 149284 261685 -233608 -19764 144058 -45947 -224444 94443 -137905 -327004 -580421
18348e80421K42915A99830b36580F5447B8824b43657b889m1483A92006a57104
$$ -580421 -337506 199830 -236580 65447 28824 -243657 -2889 -44372 192006 -157104
18337A31490a94468e9293o1638A97999a74789k3028A49926b54839f5038q9294
$$ 131490 -194468 -59293 -120931 197999 -174789 -197817 149926 -254839 -65038 -154332
18327a54332L8787n0818A19258E2582a02337P967j12941C9625E666J13088l698
$$ -154332 -115545 -166363 119258 52582 -102337 -94370 -207311 39625 5666 118754 115056
18316A15056d9965K1668k85434j6320c2682A01248a3880A83029G987m81a06568
$$ 115056 -49965 -28297 -313731 -330051 -32682 101248 -13880 183029 7987 7506 -106568
18304A0478L9011b22348g5875A86676l0506b07470P2947j3591k61981J63946M8469
$$ 10478 49489 -222348 -75875 186676 156170 -207470 -134523 -148114 -410095 -246149 -197680
18293a97680Q8466B5117L09200a8560C6500K3432a58128a0244j34699A94605a99058
$$ -197680 -109214 25117 334317 -18560 36500 59932 -158128 -10244 -144943 194605 -199058
18281f0054k75095R6376A78615m7639L0828a14440N2590B08048C9127c311j79172
$$ -60054 -335149 -238773 178615 130976 161804 -114440 -61850 208048 39127 -3311 -182483
18270a82483j39750c2690l26076J54441A39870c2971j1923A23386B3796d3628
$$ -182483 -322233 -32690 -358766 -204325 139870 -32971 -44894 123386 23796 -43628
18259B11009e8420j50168N6976e1896B0052a46493A53276C2808J51351d00824
$$ 211009 -58420 -208588 -151612 -51896 20052 -146493 153276 32808 184159 -400824
18248b57211f028j04495M9712A43722a99350B217a89797j09649J43128C28575
$$ -257211 -6028 -110523 -60811 143722 -199350 2217 -189797 -299446 -156318 328575
18237b84402d9422a9283k93555a35409m4292M6199A56464j2641b36574a8039k95699
$$ -284402 -49422 -19283 -312838 -135409 -179701 -133502 156464 143823 -236574 -18039 -313738
18226c13738O2516K4106f8563B6876L8950e3037A24323l9005a21239G3851Q3838
$$ -313738 -251222 -227116 -68563 26876 65826 -53037 124323 85318 -121239 73851 157689
18215A57689d372k21319F2774B7119J2928a89229A63223i5664O439C743J14184
$$ 157689 -4372 -225691 62774 27119 40047 -189229 163223 -95664 -89225 3743 117927
18204A17927K6465m4891J14428c73443C27819A14267e3559A07390b16451f0787
$$ 117927 144392 99501 213929 -373443 327819 114267 -53559 107390 -216451 -60787
18193A55196b83552P1894A50534e8665D07775a07893A12856C2278K7030Q0390
$$ 155196 -283552 -211658 150534 -58665 407775 -107893 112856 32278 59308 139698
18183A39698J6733b05050A37297D7252c89243B91136a0565j9215C06489c42806
$$ 139698 156431 -205050 137297 47252 -389243 291136 -10565 -29780 306489 -342806
18172B4771b61396A62935N6441C1514J55618E332N4294J10769d61293i7822C63102
$$ 24771 -261396 162935 219376 31514 187132 5332 59626 170395 -461293 -97822 363102
18160A13366E1240a01766C3613a09185j1596j89762B67675i6705b1458l32792
$$ 113366 51240 -101766 33613 -109185 -120781 -310543 267675 -96705 -21458 -354250
18150c54250a56293B9072h1420c4307n5178C5324a79733p6672f1436j63836j3556
$$ -354250 -156293 29072 -81420 -34307 -89485 35324 -179733 -256405 -61436 -225272 -238828
18139b38828f1280A91978o4469e4965C7634a83453j45834B4730J11801b80253
$$ -238828 -61280 191978 127509 -54965 37634 -183453 -329287 24730 136531 -280253
18128d00083A0613L29617A19418L0081i8881j04258A2213a88808b609l8295k02069
$$ -400083 10613 340230 119418 149499 -98881 -203139 12213 -188808 -2609 -40904 -242973
18117b42973g22A28982b16319A68857g7479A76740P0706a36213C45609f3743j35934
$$ -242973 -722 128982 -216319 168857 -77479 176740 247446 -136213 345609 -63743 -199677
18106a99677p721B83406a91023B28085b69384A15782d35871H4991L72159A75141
$$ -199677 -207398 283406 -191023 228085 -269384 115782 -435871 84991 457150 175141
18095d1312j95814N2743A36872F0589q013H363b22035l4058i3820b5668e042k08882
$$ -41312 -237126 -184383 136872 60589 52576 8363 -222035 -256093 -93820 -25668 -5042 -213924
18083b13924h4569E1061J25942f7524k60365J00123i939A13197B845b86A6102
$$ -213924 -84569 51061 177003 -67524 -327889 -227766 -9939 113197 2845 -286 16102
18071B986K04018r8600B2712K42998g0866B00214a60919e8898I6676a76869A01356
$$ 2986 207004 108404 22712 265710 -70866 200214 -160919 -58898 96676 -176869 101356
18059h5583c3702D7523L6162a44698H7085B0844a02446F8089J2694J7315g5294
$$ -85583 -33702 47523 83685 -144698 87085 20844 -102446 68089 80783 98098 -75294
18047C37106b66511L4346h2591k66495A36516a65475q460a3014j93536B30370
$$ 337106 -266511 -232165 -82591 -349086 136516 -165475 -173935 -13014 -206550 230370
18036H7098f3548k1188A65517m2710A6291b87476f7527D4173K27052h235G7740
$$ 87098 -63548 -84736 165517 122807 16291 -287476 -67527 44173 271225 -8235 77740
18024H8973b7074l31465A2533O1086J98314D3490L1164b69194A68485e32133A88081
$$ 88973 -27074 -358539 12533 73619 271933 43490 74654 -269194 168485 -532133 188081
18012A90332i477B4848N2721a25926j42978b0493n0837j79684B6029M3265K66372
$$ 190332 -9477 24848 77569 -125926 -268904 -20493 -71330 -251014 26029 69294 335666
18001C35666a61370O5044L1510B00032b12050A00519k9713B7094h9921C49770
$$ 335666 -161370 -96326 -64816 200032 -212050 100519 70806 27094 -89921 349770
17990b14308N2390A29301a24568a667j65151B2915O1116N2965B2709n711M24061
$$ -214308 -161918 129301 -124568 -1667 -166818 22915 84031 136996 22709 16998 441059
17979D41059c098A058J69432a87264M1658A19144J88236d8902B98851H3111J34605
$$ 441059 -3098 1058 170490 -187264 -145606 119144 307380 -48902 298851 83111 217716
17968B17716b84770I5764a34268j00102D1428J69271N0739f7731a9296B55806
$$ 217716 -284770 95764 -134268 -234370 41428 210699 261438 -67731 -19296 255806
17957B35227j15024Q5566N071c0440l71632f4840o1494k67135B14936C9547K81484
$$ 235227 120203 205769 210840 -30440 -402072 -64840 -126334 -393469 214936 39547 321031
17946C21031j25134G7580a9350A38919E645K48249e2734A11125a78095m0989h669
$$ 321031 195897 77580 -19350 138919 5645 253894 -52734 111125 -178095 -219084 -8669
17934C47552f3601A68817b28316i9735a9017F8130b31554c7401j35515A0526f320
$$ 347552 -63601 168817 -228316 -99735 -19017 68130 -231554 -37401 -172916 10526 -6320
17922d6641A7236a0446j04099L6220B12613A0770g1302J6915J7732P465e99F4561
$$ -46641 17236 -10446 -114545 -78325 212613 10770 -71302 -54387 -36655 -29190 -599 64561
17909d17010I7706f664A46643B0022L38952I5253k0815a16492E9832A3342R9601
$$ -417010 97706 -6664 146643 20022 358974 95253 74438 -116492 59832 13342 112943
17898A12943a16779M3823k14923A44231L72420b78394D8451b1632B64241A6317
$$ 112943 -116779 -72956 -287879 144231 516651 -278394 48451 -21632 264241 16317
17887B4264i4130L5316l404D40898b75498A14668J03173m6153c7749A9042a61015
$$ 24264 -94130 -58814 -62218 440898 -275498 114668 217841 171688 -37749 19042 -161015
17875D5088b06526P3363A34886c66003a26549j6546N7571L4045g282C230a28748
$$ 45088 -206526 -133163 134886 -366003 -126549 -143095 -85524 -51479 -7282 3230 -128748
17863F7072c32758A41389k0899n1669a79395A22217b40364H4505J29682b07163
$$ 67072 -332758 141389 120490 68821 -179395 122217 -240364 84505 214187 -207163
17852B04202c56817A27968a38669A32611N5054i7443A70663F1571K84166A06331
$$ 204202 -356817 127968 -138669 132611 187665 -97443 170663 61571 345737 106331
17841A53546R6966a458j28666A60477J06517A07672c5299A1045K51478f9283q3474
$$ 153546 250512 -1458 -130124 160477 266994 107672 -35299 11045 262523 -69283 -152757
17830a52757c6788A89047E1847a30941A39455d2318l86798f2084A3366R5887a48326
$$ -152757 -36788 189047 51847 -130941 139455 -42318 -429116 -62084 13366 109253 -148326
17818A6329a17186A20593N7562M0437a5983k11847A51617G2704c47392F4439K3070
$$ 16329 -117186 120593 178155 218592 -15983 -227830 151617 72704 -347392 64439 87509
17807H7509L7422a53033C0577b86289h1413k29923B11995f7735E4843J27022d6413
$$ 87509 124931 -153033 30577 -286289 -81413 -311336 211995 -67735 54843 181865 -46413
17795C68548b85205h9248A68430b04411F7548A8138K17506a22917A97549K0843
$$ 368548 -285205 -89248 168430 -204411 67548 18138 235644 -122917 197549 218392
17785B18392c3177C40042a0200B08789Q8431D6722a66631k9543c4088g65l5141
$$ 218392 -33177 340042 -10200 208789 297220 46722 -166631 -196174 -34088 -765 -35906
17774c5906G0839d08235J60739D7139M4469h8953k6383q1059O2624F4158L9433
$$ -35906 70839 -408235 -247496 47139 91608 -88953 -115336 -196395 -133771 64158 103591
17763A03591J82514O8024A32809n3414c420C43500A49161F5337j4514J42591p2836
$$ 103591 286105 354129 132809 79395 -3420 343500 149161 65337 50823 193414 120578
17752A20578k4622J75251j21003J584E6591a58773A11212c7875j79342J05398
$$ 120578 95956 271207 150204 151788 56591 -158773 111212 -37875 -217217 -111819
17742a11819C4736f8175n2492B48106a86204A08918J03657g0717B17343j02969
$$ -111819 34736 -68175 -120667 248106 -186204 108918 212575 -70717 217343 114374
17732A14374K67554g9073B23368f051B8054P1551e13046a26525B2499J30894b978
$$ 114374 381928 -79073 223368 -6051 28054 99605 -513046 -126525 22499 153393 -2978
17720D8779K61638Q138b35372B14046D6563B1234P5225m7388M67572c096A67632
$$ 48779 310417 318555 -235372 214046 46563 21234 96459 49071 516643 -3096 167632
17708c0951A42825l1851C4418J44538a91249d4029E4866P7456f7516j07112f097
$$ -30951 142825 110974 34418 178956 -191249 -44029 54866 132322 -67516 -174628 -6097
17696C48540j26744m0988q3560L2434A3563l277J3995a97105f8249l23707d5803
$$ 348540 221796 180808 97248 129682 13563 10286 24281 -197105 -68249 -391956 -45803
17684A70685J4148a10683C42965e9030o2731D35894A24063K15299a17024l19535
$$ 170685 184833 -110683 342965 -59030 -121761 435894 124063 339362 -117024 -436559
17674d36559a25382D47613H1649a49320e6532k8612A39310B2285J3854J73011
$$ -436559 -125382 447613 81649 -149320 -56532 -85144 139310 22285 36139 209150
17664B09150J72557A09972J68927J0029g667C1574b22216f7004q7844r7261J24830
$$ 209150 381707 109972 278899 288928 -7667 31574 -222216 -67004 -154848 -252109 -127279
17653a27279B95973m822O8431A6427i4789A11249D3868K77030J43388A01306j931
$$ -127279 295973 291151 359582 16427 -94789 111249 43868 320898 464286 101306 99375
17642I9375a5781A01242M6950J14887e6588g04A08052b50050A04975P9888b67535
$$ 99375 -15781 101242 148192 263079 -56588 -704 108052 -250050 104975 184863 -267535
17630C0601J78013K03240j20214j24282l6236M4157O5383K703r2212D0096O3361
$$ 30601 208614 411854 291640 167358 131122 175279 240662 243365 151153 40096 103457
17619A03457L3089K66064a48044B00687a29405A90807J7577J04248p7063l7753
$$ 103457 136546 402610 -148044 200687 -129405 190807 208384 312632 235569 197816
17609A97816K51010A0027K24953j11996l381K84127A76431O9061f6809C06770
$$ 197816 448826 10027 234980 122984 119603 403730 176431 245492 -66809 306770
17598B06109i8293A65042K28906D5663K39775g6324A7241M23946a93843B21278
$$ 206109 -98293 165042 393948 45663 285438 -76324 17241 441187 -193843 221278
17587C3172J62115p0516D8926J96380J5967k905J2112b1066E78J71278k0853a3777
$$ 33172 195287 124771 48926 245306 261273 258368 270480 -21066 578 171856 151003 -13777
17574A18147f401I0346e7929G1986J63916C5408K05872B6372a85343I1987J6812
$$ 118147 -6401 90346 -57929 71986 235902 35408 241280 26372 -185343 91987 108799
17563A08799a16161C44340j62023a48671A32341B4320L5446J20435m586L17583
$$ 108799 -116161 344340 182317 -148671 132341 24320 59766 180201 175615 493198
17553D93198B1667M36512A55343g0449A07650J3988n0244Q4945e4250j59452A04663
$$ 493198 21667 458179 155343 -70449 107650 121638 71394 156339 -54250 -213702 104663
17541A41149o6773b5912A07173C9677c4494B10849K34673k09840m5904o23J31432
$$ 141149 74376 -25912 107173 39677 -34494 210849 445522 235682 189778 189155 320587
17530C20587A6376d3690A03573m6637J66519Q251J17926p315L33349j92873j1832
$$ 320587 16376 -43690 103573 56936 223455 231706 349632 342317 675666 482793 470961
17519D70961K29733l18593R4689A53142K7601J6865D7845K55986k6664F2426L57693
$$ 470961 700694 382101 476790 153142 180743 197608 47845 303831 277167 62426 420119
17508D20119K4736n6421J13597L7282J60295p1288j03247A37572o7851L5991a7233
$$ 420119 444855 388434 502031 539313 699608 628320 525073 137572 69721 105712 -17233
17496E48144B18588b2348o0685K8345A13823L53751B07368H2418b378q8042B43611
$$ 548144 218588 -22348 -83033 -54688 113823 467574 207368 82418 -2378 -90420 243611
17484A31585m8977M9468J84765A09713K33107A56152Q8088I0550J81454I5179
$$ 131585 82608 132076 316841 109713 342820 156152 244240 90550 272004 95179
17473A41774L0057K02958C228L36133n469A14742J47674j02549J016P3684K9498
$$ 141774 171831 374789 3228 339361 333892 114742 262416 159867 160883 234567 264065
17462B64065l8360K2119a79702A92875J71P8016b7253A84697J76254A37561K10747
$$ 264065 225705 247824 -179702 192875 193046 271062 -27253 184697 360951 137561 348308
17451C48308O825n943J2579p8972L9721K40356i1050F9634M6810L1307M364R1020
$$ 348308 355133 349190 361769 282797 322518 562874 -91050 69634 116444 147751 152115 243135
17439B43135j00687J80278a0017G2389M61263a03168B40787J25877l2194K731
$$ 243135 142448 322726 -10017 72389 533652 -103168 240787 366664 334470 337201
17429C37201j4398n7788R2282r8344A05049K6984D8823M90556j05904j77103J295
$$ 337201 322803 265015 357297 258953 105049 132033 48823 539379 433475 256372 257667
17418B57667j15893P278N5527K13987j70627J45744O9280B03785F7436J40843
$$ 257667 141774 149052 204579 418566 247939 393683 462963 203785 67436 208279
17408B08279i3532D27404A72831R7884Q6943F4711J12277B5535L70007j07563
$$ 208279 -93532 427404 172831 270715 357658 64711 176988 25535 395542 287979
17398B87979b26287B57271J15772j45653p8339D6956J87887P2884M2849A67857
$$ 287979 -226287 257271 373043 227390 149051 46956 234843 307727 350576 167857
17387A90563k814E6232O3579K08473A33962h5083A32942G955K89374j10184K34372
$$ 190563 187749 56232 119811 328284 133962 -85083 132942 7955 297329 187145 421517
17376D21517q5325A15070R6081F4340J90285a11052D0990a23435A31900K41108
$$ 421517 336192 115070 211151 64340 254625 -111052 40990 -123435 131900 373008
17366C73008j71841R376J55176j71353D9190f5563D0967K58459a38777E5376a28245
$$ 373008 201167 210543 365719 194366 49190 -65563 40967 299426 -138777 55376 -128245
17354C92378k6733A58749o7765K56846l9166G0717K68964j11361h178A98243O9249
$$ 392378 365645 158749 90984 347830 308664 70717 339681 228320 -8178 198243 267492
17343B67492M8011N6406G2303K27088Q6345C2414L5775b9723D51282E5544J66234
$$ 267492 315503 371909 72303 299391 385736 32414 68189 -29723 451282 55544 221778
17332B21778l8837M9860M0276B6699J89735i2215A33432K5597C8734M2090J16673
$$ 221778 182941 232801 273077 26699 216434 -92215 133432 159029 38734 80824 197497
17321A97497K4062k5318m4516P0248n2727F7843M9663a14131B66494l211I4841
$$ 197497 221559 196241 151725 221973 169246 67843 117506 -114131 266494 263283 94841
17309A410P2828N6116n1217b37365A19965J52336G7916J57160Q4961C6802J25348
$$ 1410 74238 130354 79137 -237365 119965 272301 77916 235076 320037 36802 162150
17298A62150L40612A33755a29019B80535l9820q7024L39281H3605K97820p3403
$$ 162150 502762 133755 -129019 280535 240715 153691 492972 83605 381425 308022
17288C08022r2634N2259m4212H1174M56869B33846K24169j50406j08333j8205
$$ 308022 215388 267647 223435 81174 538043 233846 458015 307609 199276 181071
17278A81071R940D5624K87159L4705K0851M15348l91143A76740J24113L3794a6006
$$ 181071 191011 45624 332783 367488 388339 803687 412544 176740 300853 334647 -16006
17266A93138Q9863J83640k05844Q5011j29422L4244K5108k0616A17565Q0637b4361
$$ 193138 283001 466641 260797 345808 216386 250630 275738 255122 117565 198202 -24361
17254B23231k9634K71901P451m968A56765J81456j41119n9845L55135k17841M02414
$$ 223231 193597 465498 472949 467981 156765 338221 197102 137257 492392 274551 676965
17243F76965A55293K6547J37787r4818A11728o215M32433j43565A39276J34478
$$ 676965 155293 181840 319627 224809 111728 105513 537946 394381 139276 273754
17233B73754Q7942b4586B95406A24181J62254K65589j61158j51998j6866J86687
$$ 273754 361696 -24586 295406 124181 286435 552024 390866 238868 222002 408689
17223D08689D5006L59368B01915J30343j27916Q4304K60807j49095J66951j60950
$$ 408689 45006 404374 201915 332258 204342 288646 549453 400358 567309 406359
17213D06359j28103J23330A45830d5507C83986j49787J16143L3858J63562e0182
$$ 406359 278256 401586 145830 -45507 383986 234199 350342 384200 547762 -50182
17202C07473j31459K98898b7447C62183J80840A54231K61390J40142A84294J10165
$$ 307473 176014 474912 -27447 362183 543023 154231 415621 555763 184294 294459
17192B94459j15907J39552L68285k73165I1565K09893P8261J64304j78335O357
$$ 294459 178552 318104 686389 413224 91565 301458 379719 544023 365688 372045
17182C72045A37624j6715K54074j59971J53986j02584L1596K02189k34496j7796
$$ 372045 137624 120909 374983 215012 368998 266414 298010 500199 265703 247907
17172B47907J75792K9924m622Q5424B26898R771M49618m4938B95395M26165B66135
$$ 247907 423699 453623 449001 534425 226898 236669 686287 641349 295395 721560 266135
17160D57838J8141J09435B57459K93021j90319r1792J57115p6616L97506B95523
$$ 457838 475979 585414 257459 550480 360161 268369 425484 348868 746374 295523
17149D84876q0648N2867K32774k91101O3545j82090J40194L46208l49089E3937
$$ 484876 404228 457095 689869 398768 462313 280223 420417 766625 417536 53937
17138D73646r4405j61574L39055q9777L09138j90038q0601q9754J31289o2737
$$ 473646 379241 217667 556722 466945 776083 586045 505444 415690 546979 484242
17128D84242K0208M5511j2206n2723l2941P4473J57520j86725n3882q7116q8908
$$ 484242 504450 549961 537755 485032 452091 526564 684084 497359 443477 356361 267453
17117B67453J58076J81308R6756l51502p8715K19126K46854J757n3873P036j65677
$$ 267453 425529 606837 703593 352091 273376 492502 739356 741113 687240 694276 528599
17106E28599k4601j60855K67485L38380l66823j08943o7022K81828j01853B48050
$$ 528599 503998 343143 610628 949008 582185 473242 406220 688048 586195 248050
17095I46510k14927n6533o1411C01474K00708R19l8273L04663l30378L23843k29081
$$ 946510 731583 675050 613639 301474 502182 503101 464828 769491 439113 762956 533875
17084E33875K91027j51800j62671K88598k25578M93029l20116J2000q8997M1362
$$ 533875 824902 673102 510431 799029 573451 1066480 746364 758364 669367 710729
17074G10729j97056L00224M1242k24608P4805N7239q61k66234K89638l16577M11188
$$ 710729 513673 813897 855139 630531 705336 762575 761714 495480 785118 468541 879729
17063H79729m13962j8664K91541k6655j0451J93851p7749K30503l20172L30168
$$ 879729 465767 447103 738644 711989 701538 895389 817640 1048143 727971 1058139
17053A058139m92249K45738C80674N69499l16682N25277n57166Q9717k1218J00223
$$ 1058139 565890 811628 380674 950173 633491 1158768 601602 691319 670101 770324
17043G70324l64563K44401N14535l90407l130K28081j56071l1758j50130L71085
$$ 770324 405761 650162 1164697 774290 771160 999241 843170 811412 661282 1032367
17033A032367l08845K33096k1429k67970L51609j81401l2365m6744J79522J78563
$$ 1032367 723522 956618 935189 667219 1018828 837427 805062 758318 937840 1116403
17023A116403j76799K60849K1863Q7606l46596J46523k57909n045O2320J76208
$$ 1116403 939604 1200453 1222316 1309922 963326 1109849 851940 846895 909215 1085423
17013A085423J78094k990m76963L9095N34175k84289k31955L57588K19304n69997
$$ 1085423 1263517 1260527 783564 822659 1356834 1072545 840590 1198178 1417482 847485
17003H47485J13207L70996m70836M60518m47083L42697m7074K8717k63456K13693
$$ 847485 960692 1331688 860852 1321370 874287 1216984 1169910 1198627 935171 1148864
16993A148864L67252m80685O3571J25975K4113j83212J95957J09722K65510o31710
$$ 1148864 1516116 1035431 1099002 1224977 1249090 1065878 1261835 1371557 1637067 1005357
16983A005357R9236L76936p0545l65540N98362m68129P4855q8256J59000K84771
$$ 1005357 1104593 1481529 1410984 1045444 1643806 1175677 1250532 1162276 1321276 1606047
16973A606047j99146m8515K24124k60566L8272M05160n82853K72259J83041K3983
$$ 1606047 1406901 1358386 1582510 1321944 1360216 1765376 1182523 1454782 1637823 1661806
16963A661806j92214k3550N8509K47608p0816J25859l31966L43956o3013L01147
$$ 1661806 1469592 1446042 1504551 1752159 1681343 1807202 1475236 1819192 1756179 2057326
16953B057326k48200m6888j51057J08305M11203k15494n8863j13712k7211N23412
$$ 2057326 1809126 1762238 1611181 1719486 2130689 1915195 1856332 1742620 1715409 2238821
16943B238821j70443k06860K81920L62529k82498k01625L27051k71503J80067
$$ 2238821 2068378 1861518 2143438 2505967 2223469 2021844 2348895 2077392 2257459
16934B257459m27355J89438K01943J77838j06507J22563Q8704k23319n9101J8106
$$ 2257459 1830104 2019542 2221485 2399323 2292816 2415379 2504083 2280764 2221663 2239769
16924B239769j9641N12137j89517n5645K68871l59234J05480J70833P1451Q5621
$$ 2239769 2220128 2732265 2542748 2487103 2755974 2396740 2502220 2673053 2744504 2830125
16914B830125N9549l25110O9332L41140k10705N5737P4476K69165J0665P42m616
$$ 2830125 2889674 2564564 2633896 2975036 2764331 2820068 2894544 3163709 3174374 3175116 3170500
16903C170500m105P4459K15287M5005l47226P33391k09453j06383j91248J9133
$$ 3170500 3166395 3240854 3456141 3501146 3153920 3887311 3677858 3571475 3380227 3399360
16893C399360j56924N39016j62159J56762R8654l30496L20999J63422J55517l2626
$$ 3399360 3242436 3781452 3619293 3776055 3874709 3544213 3865212 4028634 4184151 4151525
16883D151525M3779k25287K10436K79979j25517J33679k58305O58119l34710M40872
$$ 4151525 4195304 3970017 4180453 4460432 4334915 4468594 4210289 4868408 4533698 4974570
16873D974570r2820j9651J11537N1975L07523l14671M16228O6332m1848K57097
$$ 4974570 4881750 4862099 4973636 5025611 5333134 5018463 5434691 5501023 5459175 5716272
16863E716272j59607M14471P8086j24939L5383J54825J63747N4966J86520J79996
$$ 5716272 5556665 5971136 6049222 5924283 5959666 6114491 6278238 6333204 6519724 6699720
16853F699720J57667P547K39413J09589L77026j68464j02021L47356R2668j8055
$$ 6699720 6857387 6864934 7104347 7213936 7590962 7422498 7320477 7667833 7760501 7742446
16843G742446L52651K01926K66690J16911K44346k77509R4270N18554L72950K45291
$$ 7742446 8095097 8297023 8563713 8680624 8924970 8647461 8741731 9260285 9633235 9878526
16833I878526J61629l8645L62479J88649L62544L18269j05940L97731K55558M56161
$$ 9878526 10040155 10001510 10363989 10552638 10915182 11233451 11127511 11525242 11780800 12236961
16823A2236961R463N42705L35894K59160L71688r80N55635J90324J182O61956
$$ 12236961 12246424 12789129 13125023 13384183 13755871 13754891 14310526 14500850 14502032 15163988
16813A5163988L34928M95687M50983J53907P56038N68735L10159N72391K32911
$$ 15163988 15498916 15994603 16445586 16599493 17355531 17924266 18234425 18806816 19039727
16804A9039727P32727N99675L31153O59901O06190O99577N68884Q49805N45450
$$ 19039727 19772454 20372129 20703282 21363183 21969373 22668950 23237834 24087639 24633089
16795B4633089O38944J273309n9289J120531Q69637N34620J207011J019216P32140
$$ 24633089 25272033 26545342 26486053 27606584 28476221 29010841 30217852 31237068 31969208
16786C1969208J176992Q27041J459408R03206J039636J394077R10272J750944
$$ 31969208 33146200 33973241 35432649 36335855 37375491 38769568 39679840 41430784
16778D1430784J328557J181256J384663J456411J428113J499140J745903J870203
$$ 41430784 42759341 43940597 45325260 46781671 48209784 49708924 51454827 53325030
16770E3325030J670108J776470J760744K037729K231355J992006J717121K269077
$$ 53325030 54995138 56771608 58532352 60570081 62801436 64793442 66510563 68779640
16762F8779640K334777K056396K007808K411466J916096K120802K265579K413712
$$ 68779640 71114417 73170813 75178621 77590087 79506183 81626985 83892564 86306276
16754H6306276K154328J829871K132186K121438J971871J513810J387389J617563
$$ 86306276 88460604 90290475 92422661 94544099 96515970 98029780 99417169 101034732
16746A01034732J458149R02079J062698R27688J78978N17878K19102j25313r0392
$$ 101034732 102492881 103394960 104457658 105385346 105564324 106082202 106301304 106175991 106085599
16737A06085599n51365m94596j048455q45887j451790j148345j815545j801316
$$ 106085599 105534234 105039638 103991183 103145296 101693506 100545161 98729616 96928300
16729I6928300j667221j764523k018300j735465k570192j504959k725474j948325
$$ 96928300 95261079 93496556 91478256 89742791 87172599 85667640 82942166 80993841
16721H0993841j888450k322091j956215k252911k179357j902148j938021j751260
$$ 80993841 79105391 76783300 74827085 72574174 70394817 68492669 66554648 64803388
16713F4803388k086599k153415j665428j909612j461589j946064j484643j638063
$$ 64803388 62716789 60563374 58897946 56988334 55526745 53580681 52096038 50457975
16705E0457975j231305j593184j417666j438427j388516j163192j250200j123833
$$ 50457975 49226670 47633486 46215820 44777393 43388877 42225685 40975485 39851652
16697C9851652j475666j486027k69055j029092j046539j365554l78791j297902
$$ 39851652 38375986 36889959 36620904 35591812 34545273 33179719 32800928 31503026
16689C1503026m85772j146809p89865q40637p61428o21372o33978n32688r31523
$$ 31503026 31017254 29870445 29080580 28239943 27478515 26857143 26223165 25690477 24758954
16680B4758954p61794k02176k65753p75944r09401l16006l84154p50558l98670
$$ 24758954 23997160 23794984 23529231 22753287 21843886 21527880 21143726 20393168 19994498
16671A9994498k66267m47013l40211o07205n22609k8751p71604j26472m43179
$$ 19994498 19728231 19281218 18941007 18333802 17811193 17782442 17010838 16884366 16441187
16662A6441187l69269j87166o03655k14297j63774m36575J04718m59151j64691
$$ 16441187 16071918 15884752 15281097 15066800 14903026 14466451 14571169 14112018 13947327
16653A3947327m24326J43349o14531k72734n81258O9915J84615l24271k82748
$$ 13947327 13523001 13666350 13051819 12779085 12197827 12267742 12452357 12128086 11845338
16644A1845338m04921j54802J85890m49138j52950l63166j35245L230l99641o2055
$$ 11845338 11440417 11285615 11471505 11022367 10869417 10506251 10371006 10374236 9974595 9912540
16634I912540k20355l98383j942k30388N224k353j54368l8967j30543l60041M9511
$$ 9912540 9692185 9293802 9291860 9061472 9066696 9064343 8909975 8871008 8740465 8380424 8429935
16623H429935j91490k67116k89939K22713m10828L4838J77201n21036K28315l94904
$$ 8429935 8238445 7971329 7681390 7904103 7493275 7528113 7705314 7184278 7412593 7017689
16613G017689J11032k61533K20596j98270p1763J8216n26409K14663M5614l69716
$$ 7017689 7128721 6867188 7087784 6889514 6817751 6835967 6309558 6524221 6569835 6200119
16603F200119J00046N6452j11281k67062l1707L4478j17945j58548K03123j26904
$$ 6200119 6300165 6356617 6245336 5978274 5946567 5981045 5863100 5704552 5907675 5780771
16593E780771j46514j21334K0733l23305K98187k56221R6686j9433l19797r4757
$$ 5780771 5634257 5512923 5533656 5210351 5508538 5252317 5349003 5329570 5009773 4915016
16583D915016M2245k76919L81956k19192p4825n3541J30513l67700Q3680Q335
$$ 4915016 4957261 4680342 5062298 4843106 4768281 4714740 4845253 4477553 4561233 4569568
16573D569568p0884P8543l22877J90071J8904Q2895j00114j13099J7716l504l09480
$$ 4569568 4498684 4577227 4254350 4444421 4463325 4546220 4446106 4333007 4350723 4347219 4037739
16562D037739J39507k31392L97764k47770j61716J3880l06690P8443p1960K62894
$$ 4037739 4177246 3945854 4343618 4095848 3934132 3948012 3641322 3719765 3647805 3910699
16552C910699o1899R0987j25735m5876l5319m01392K56318K60989m81808J99191
$$ 3910699 3848800 3939787 3814052 3768176 3732857 3331465 3587783 3848772 3366964 3566155
16542C566155Q84l27212O9597J36755l67133L15841k81856K40579o9950O5590
$$ 3566155 3567039 3239827 3309424 3446179 3079046 3394887 3113031 3353610 3283660 3349250
16532C349250J93650j53363l45468L61880J1003n23927L89264l59508L6866Q9347
$$ 3349250 3542900 3389537 3044069 3405949 3416952 2893025 3282289 2922781 2959647 3048994
16522C048994k6506j40806j4934l5116J24201k0743j29786j95659M19889n34751
$$ 3048994 3022488 2881682 2866748 2831632 2955833 2935090 2805304 2609645 3029534 2494783
16512B494783N24866j30309j98783K35944k47138M29673l06622J2923O4840k34169
$$ 2494783 3019649 2889340 2690557 2926501 2679363 3109036 2802414 2815337 2880177 2646008
16502B646008q3720J25391Q6134Q0532m9448j041j98689J98109K18588m78298
$$ 2646008 2562288 2687679 2773813 2854345 2804897 2803856 2605167 2803276 3021864 2543566
16492B543566j37313l2493J91082M54212p63580N0244L21433j33622J59712K67088
$$ 2543566 2406253 2373760 2564842 3019054 2255474 2305718 2627151 2493529 2653241 2920329
16482B920329p61309J68057K94958j59138q0857N7922R3004J11655j552k37942
$$ 2920329 2159020 2327077 2622035 2462897 2382040 2439962 2532966 2644621 2643069 2405127
16472B405127N0288m9676j47411K84064j94487k63379L10076o1761j93549J15850
$$ 2405127 2455415 2405739 2258328 2542392 2347905 2084526 2394602 2332841 2139292 2255142
16462B255142m0682J93283m18271L36842k34574J34719k98471J59835J08887O7857
$$ 2255142 2214460 2407743 1989472 2326314 2091740 2226459 1927988 2087823 2196710 2264567
16452B264567K3013j36688J04984J00875J29815k50129r5724L97434l80321n6654
$$ 2264567 2287580 2150892 2255876 2356751 2486566 2236437 2140713 2538147 2157826 2101172
16442B101172J17535o8363j84476K93372l08474K83944k54147J02419J34023R5
$$ 2101172 2218707 2150344 1965868 2259240 1950766 2234710 1980563 2082982 2217005 2217100
16432B217100N5448l35417J82302n2811j2291Q7014M9627p8178j72154J57758
$$ 2217100 2272548 1937131 2119433 2066622 2054331 2141345 2190972 2112794 1940640 2098398
16422B098398l66786J45851J81159J8437k9402K97596j02081j07885N2844R5910
$$ 2098398 1731612 1877463 2058622 2077059 2047657 2345253 2243172 2135287 2188131 2284041
16412B284041j50462j4575k85075J71474R0823k66386J17040n8837P9467J73823
$$ 2284041 2133579 2119004 1833929 2005403 2096226 1829840 1946880 1888043 1967510 2141333
16402B141333k14152o8150J94644J88044j96806m00538J81735M33419l51331J84894
$$ 2141333 1927181 1859031 2053675 2241719 2044913 1644375 1826110 2259529 1908198 2093092
16392B093092n76356J29098L28114k27335J48906J09327J89859j0115k68134M1051
$$ 2093092 1516736 1645834 1973948 1746613 1895519 2004846 2194705 2184590 1916456 1957507
16382A957507K14440k66685n2273o6854j8020l0084L76068m64456J33252K03913
$$ 1957507 2171947 1905262 1852989 1786135 1768115 1738031 2114099 1649643 1782895 1986808
16372A986808l67611M09588k99574K57303m02887J07647O6887K87113q2256q7297
$$ 1986808 1619197 2028785 1729211 1986514 1583627 1691274 1758161 2045274 1963018 1875721
16362A875721J94441k42382q4248K02494j32547l9448J21599J66084n25547L76596
$$ 1875721 2070162 1827780 1743532 1946026 1813479 1774031 1895630 2061714 1536167 1912763
16352A912763j23281J00830j65150K8400J03390J48251P8054k94431N3388j16523
$$ 1912763 1789482 1890312 1725162 1753562 1856952 2005203 2083257 1788826 1842214 1725691
16342A725691k37043L39963L18615l54588N4211j71122R2346O5846j90411J56431
$$ 1725691 1488648 1828611 2147226 1792638 1846849 1675727 1768073 1833919 1643508 1799939
16332A799939k33660R278L04100j87173K44102j15820k81837L3681L35415n24257
$$ 1799939 1566279 1575557 1879657 1692484 1936586 1820766 1538929 1572610 1908025 1383768
16322A383768J70225K26255P7137k33819j25091J42J43915j21164q1453J24318
$$ 1383768 1553993 1780248 1857385 1623566 1498475 1498617 1642532 1521368 1439915 1564233
16312A564233j1120J07682J39873j80233O12266m39954l5018n65077L41796J3121
$$ 1564233 1553113 1660795 1800668 1620435 2232701 1792747 1757729 1192652 1534448 1547569
16302A547569K09559p9434k6205j59355J29376j16272L19815j91982K30879j86031
$$ 1547569 1757128 1677694 1651489 1492134 1621510 1505238 1825053 1633071 1863950 1677919
16292A677919M862j15356J56587r4616l69132M00810j87103j20080J26806J81799
$$ 1677919 1682781 1567425 1724012 1629396 1260264 1661074 1473971 1353891 1480697 1662496
16282A662496j50814r7990K86798L1080l90519R4715M20041l16203m7164J35374
$$ 1662496 1511682 1413692 1700490 1731570 1341051 1435766 1855807 1539604 1492440 1627814
16272A627814j13180j37950j58180L20415l74527L10020k57036O7694j7173Q6289
$$ 1627814 1514634 1376684 1218504 1538919 1164392 1474412 1217376 1285070 1267897 1354186
16262A354186K44879k28058L9628j41485J67148q579J34481n77900K41359K79166
$$ 1354186 1599065 1371007 1410635 1269150 1436298 1427719 1562200 984300 1225659 1504825
16252A504825l83302J2801K75628n04439M60402M7478L8615K37952k37490j42289
$$ 1504825 1121523 1134324 1409952 905513 1365915 1413393 1452008 1689960 1452470 1310181
16242A310181J45948l69804K39825j47952K19264l29009K41588j63882J91162
$$ 1310181 1456129 1086325 1326150 1178198 1397462 1068453 1310041 1146159 1337321
16233A337321j49934L0106J40564l09618O07035l75294J12455k78042p8500K42864
$$ 1337321 1187387 1217493 1358057 1048439 1655474 1280180 1392635 1114593 1036093 1278957
16223A278957j47056J29189r4912Q9285K51887k98243l64616N08121l69526J89985
$$ 1278957 1131901 1261090 1166178 1255463 1507350 1209107 844491 1352612 983086 1173071
16213A173071j80137k67648M13114q1974J0165l34605J86646J77810M2618l39017
$$ 1173071 992934 725286 1138400 1056426 1066591 731986 918632 1096442 1139060 800043
16203H00043O14722l54270j27156J13563K4164R3712l66997k47689K80830O7713
$$ 800043 1414765 1060495 933339 1046902 1071066 1164778 797781 550092 830922 898635
16193H98635O8444P249j23628J73622l38003K08907k50695K98294L24363m26314
$$ 898635 967079 974328 850700 1024322 686319 895226 644531 942825 1267188 840874
16183H40874J83681l28850J05245J59648J18742l13259J60604K12707D13526P51924
$$ 840874 1024555 695705 800950 960598 1079340 766081 926685 1139392 413526 1165450
16173A165450l27082K19640k49060k20166j05307R8842M11647l04105p0679J37088
$$ 1165450 838368 1058008 808948 588782 483475 582317 993964 689859 619180 756268
16163G56268k46801L03267N0705q5483K2892j70080r9591k7765L08713k02638
$$ 756268 509467 812734 863439 777956 800848 630768 531177 503412 812125 609487
16153F09487K37605l90670J17411M36062m11591J66128k41891K96486O1706K1712
$$ 609487 847092 456422 573833 1009895 598304 764432 522541 819027 880733 902445
16143I02445k47968k6090K30084k58208N6351C17681M47864J72438l99991J38068
$$ 902445 654477 628387 858471 600263 656614 317681 765545 937983 537992 676060
16133F76060J15148C95143L65031B75179K42368j57191Q4286J45625L31047k10966
$$ 676060 791208 395143 760174 275179 517547 360356 444642 590267 921314 710348
16123G10348j27649J2154O5520J90947k09992n1336J83693l12450K11303n5400
$$ 710348 582699 594853 660373 851320 641328 589992 773685 461235 672538 617138
16113F17138n6375B64373Q567J5107J66424A86180J11363N6249K1801j16179j6705
$$ 617138 560763 264373 272940 288047 454471 186180 297543 353792 375593 259414 242709
16102B42709M16098j89293J35314N8251k25369J79088C01572J2261J33146B17550
$$ 242709 658807 469514 604828 663079 437710 616798 301572 313833 446979 217550
16091C67428K71730m3596k75130j5469L98120A69289M2041M60038k42262l8418
$$ 367428 639158 595562 320432 304963 703083 169289 211330 671368 429106 390688
16081C90688j21740J84078B09531a13873C49729j62714k4538M07906J3861j8768
$$ 390688 268948 453026 209531 -113873 349729 187015 162477 570383 584244 565476
16071E65476o4064q3269J01000A16333J81720j9400J13677a43354C27358J44613
$$ 565476 501412 418143 519143 116333 298053 278653 392330 -143354 327358 471971
16061D71971B07827e6814A76771J09317O6914J60376j48037J50820A21214K9352
$$ 471971 207827 -56814 176771 286088 353002 513378 365341 516161 121214 150566
16051A50566R6913C3180M82195j80643J03117A46371F3617L21837A20427M3106
$$ 150566 247479 33180 515375 334732 437849 146371 63617 385454 120427 163533
16041A63533O567L33478E6858K3065A7860L81658A76551M4684K53917A84514a05545
$$ 163533 170100 503578 56858 79923 17860 399518 176551 221235 475152 184514 -105545
16029C80632j17559m3373J17704e7882B16880a9201D76605A44392J32122p806
$$ 380632 263073 219700 337404 -57882 216880 -19201 476605 144392 276514 268708
16019B68708m4038J46382A45432E3857M25211A62687J79478L844j19708a97207
$$ 268708 224670 371052 145432 53857 479068 162687 342165 346009 226301 -197207
16008A32174a22123D05321j58680r2067c0047B15520j6929m1184E2939c5320D4944
$$ 132174 -122123 405321 246641 154574 -30047 215520 198591 157407 52939 -35320 44944
15996A37923J86508j00118E4729K01381I5031m5063J93135J10292L96469n2405
$$ 137923 324431 224313 54729 256110 95031 49968 243103 353395 749864 697459
15986F97459R7275R1038k53404j90881J19804A54987a8601E02036G7296L546K07767
$$ 697459 794734 885772 632368 441487 561291 154987 -18601 502036 77296 80842 288609
15975B88609E765K65465M6852a26784B79751q9900c8471m6566A83682a4282j9067
$$ 288609 5765 271230 318082 -126784 279751 189851 -38471 -85037 183682 -14282 -33349
15964c3349J0131l8104D49800B14713q2659J92568e7234D61189e8389B7980P3544
$$ -33349 -23218 -61322 449800 214713 132054 324622 -57234 461189 -58389 27980 101524
15953A01524l868a36729A84850m0050J38137n7969K8456M686L6420A08175J49598
$$ 101524 97656 -136729 184850 144800 282937 224968 253424 258110 294530 108175 257773
15942B57773j00223J2773k605e0980A33266h8510D4245B450J10667l954J30644
$$ 257773 157550 170323 167718 -50980 133266 -88510 44245 2450 113117 109163 239807
15931B39807b06768R9376H0348i0277D66679d7806A69677G0038K13610h6509A74440
$$ 239807 -206768 -107392 80348 -90277 466679 -47806 169677 70038 283648 -86509 174440
15919F7176N5137n4585b82258A25123O1675F9968K08560H2321J79079d8987P435
$$ 67176 122313 67728 -282258 125123 186798 69968 278528 82321 261400 -48987 -41552
15908d1552j2131p9100O5246H9243b05347C98840A9379Q2760J1749J4131A1845
$$ -41552 -53683 -132783 -67537 89243 -205347 398840 19379 102139 113888 128019 11845
15896a10527l9651j03278A64144a12238N3577G9716a44113A10678O4397D1345
$$ -110527 -150178 -253456 164144 -112238 -58661 79716 -144113 110678 175075 41345
15885A42311P9358a92578A07237m5019b25559c9497A6720K58635B8335K34930
$$ 142311 221669 -192578 107237 62218 -225559 -39497 16720 275355 28335 263265
15875B63265F5170M7445J8271b32037A43605d1374B59548b0712B06945A5243L3319
$$ 263265 65170 112615 130886 -232037 143605 -41374 259548 -20712 206945 15243 48562
15864D8562A0743a03604C811b1395A6614a48786B93852n8503k5353i0875K3837
$$ 48562 10743 -103604 3811 -21395 16614 -148786 293852 235349 209996 -90875 -67038
15853f7038j30958q0530J23694A65970J5526p676a64207k9904d9012J1808k1609
$$ -67038 -197996 -278526 -154832 165970 181496 173820 -164207 -194111 -49012 -37204 -58813
15842e8813E1211g5344j54673m38295A4916P6578J44739a1484A87532H2385b23803
$$ -58813 51211 -75344 -230017 -668312 14916 91494 236233 -11484 187532 82385 -223803
15830B56535C5486J49381A0340b97151E5531M6508L73205k33371O6412a20042
$$ 256535 35486 184867 10340 -297151 55531 102039 475244 241873 308285 -120042
15819a24197A60805m5213D1202a02619A91164b66753D5991a25938B23064g1590
$$ -124197 160805 115592 41202 -102619 191164 -266753 45991 -125938 223064 -71590
15808a92461B13530a23459k2337d2783l4850B10852b7391A85890O7486d35940
$$ -192461 213530 -123459 -145796 -42783 -77633 210852 -27391 185890 253376 -435940
15797A24119d4495i579j39977A87903M5055b3318l31530D3209J13241n1905k0950
$$ 124119 -44495 -9579 -149556 187903 232958 -23318 -354848 43209 156450 104545 83595
15786H3595K9417d12141A51593a55773j44777b0148m5589j69714C8819M0991a02052
$$ 83595 113012 -412141 151593 -155773 -300550 -20148 -65737 -235451 38819 79810 -102052
15774b4l21954N0423R236g6972j21678j58782a22705n3670A97983q8706h3596
$$ -24 -321978 -271555 -262319 -76972 -198650 -357432 -122705 -176375 197983 109277 -83596
15762a51018N9994E0753Q769a63793C370J15442J3755a01736H1990a72552B26875
$$ -151018 -91024 50753 59522 -163793 3370 118812 132567 -101736 81990 -172552 226875
15750c3312A77804c72762B37225C5867a25091a0547H4475I577i7888r854q0679
$$ -33312 177804 -372762 237225 35867 -125091 -10547 84475 9577 -97888 -107742 -188421
15739a88421G8787K36448b36755a2473k7047j32369A0440J80234j7312a32812
$$ -188421 78787 315235 -236755 -12473 -39520 -171889 10440 190674 173362 -132812
15728F3817h3735A39278M7737b30568F4051a20194L5068K3156l2049q1741E2032
$$ 63817 -83735 139278 187015 -230568 64051 -120194 -85126 -61970 -94019 -175760 52032
15716I6048A7276K2015a31099p1152G3580h3887B19721C5007K94333a8767I6055
$$ 96048 17276 39291 -131099 -202251 73580 -83887 219721 35007 329340 -18767 96055
15704h5440D14147b37303B06394J80406a35591d673j20621j28851e1142C04948
$$ -85440 414147 -237303 206394 386800 -135591 -4673 -125294 -254145 -51142 304948
15693b88487f8916B53187d1211k2538o5798n6410f6094a8409l7733A42865g1262
$$ -288487 -68916 253187 -41211 -63749 -129547 -185957 -66094 -18409 -56142 142865 -71262
15681b5630C09228a34050j94582C7802i9676B38326I8885m1960J64946j00036
$$ -25630 309228 -134050 -328632 37802 -99676 238326 98885 56925 221871 121835
15671A21835l1135d4855l9481A32751B7800J61361h6482C57343m7447k9396d7630
$$ 121835 90700 -44855 -84336 132751 27800 189161 -86482 357343 309896 280500 -47630
15659c57791J76350c4984G9668g5566j38038g1803k7800A92140d4623Q292C7979
$$ -357791 -181441 -34984 79668 -75566 -213604 -71803 -99603 192140 -44623 -36331 37979
15647h9212B52496a28961N9683C4316J93484N5998a26127B08061E4623a74079
$$ -89212 252496 -128961 -69278 34316 227800 283798 -126127 208061 54623 -174079
15636a56984o4781c9676m2h952B76724a35047e9515q1886q6487B49324E3165h9560
$$ -156984 -221765 -39676 -39718 -8952 276724 -135047 -59515 -141401 -227888 249324 53165 -89560
15623C8212b23243a2994j49835c588l19857D9817r329J76875b60580j8812D88
$$ 38212 -223243 -12994 -162829 -3588 -323445 49817 40488 217363 -260580 -279392 488
15611b8184n5111E5909a81913N0645c8687A11219k1515a81620E1197R6280h1481
$$ -28184 -83295 55909 -181913 -131268 -38687 111219 89704 -181620 51197 147477 -81481
15599A29843b65189J18469p571B6707f0768K9725j13191B18273I515c34805G149
$$ 129843 -265189 -146720 -154291 26707 -60768 -31043 -144234 218273 9515 -334805 7149
15587D67895j47780A01812K05043b20893j4878a1012l4168A2337b24299o9012
$$ 467895 320115 101812 306855 -220893 -235771 -11012 -45180 12337 -224299 -293311
15577b93311B59033a04594H4525d044A50657A1556b91813P8848d1191I1646L2365
$$ -293311 259033 -104594 84525 -4044 150657 11556 -291813 -212965 -41191 91646 124011
15566A24011J58743a84168C66832c90198B88627E1678b55949A93867b6551k53524
$$ 124011 282754 -184168 366832 -390198 288627 51678 -255949 193867 -26551 -280075
15556b80075B87901r8661H4535J44060c14985P9163i3445B4484P7779K1777K0173
$$ -280075 287901 189240 84535 228595 -314985 -235822 -93445 24484 102263 124040 144213
15545A44213M8445E7965J30430a0787A67479E7228J64040K06256g335l15963g4984
$$ 144213 192658 57965 188395 -10787 167479 57228 221268 427524 -7335 -323298 -74984
15533a93996f8012C61409a3347B37441a63965b2254l1557A68106b92342B84744
$$ -193996 -68012 361409 -13347 237441 -163965 -22254 -53811 168106 -292342 284744
15522A01600M8082k967a98623g0767A75843b50943O7988j91610h452j9228j50446
$$ 101600 149682 146715 -198623 -70767 175843 -250943 -182955 -374565 -8452 -27680 -178126
15511a78126b7421j10846r347B78385E4595A5151P2849b79635C9328a04739l33045
$$ -178126 -27421 -138267 -147614 278385 54595 15151 88000 -279635 39328 -104739 -437784
15500d37784a95059R7319k76662I8422K73813G6102l2008a92719A12907D7951
$$ -437784 -195059 -97740 -374402 98422 372235 76102 44094 -192719 112907 47951
15489d5367n3767K5351k11648C266K8939a32058b2038J0915A8826e3687C8696
$$ -45367 -99134 -73783 -285431 3266 32205 -132058 -22038 -11123 18826 -53687 38696
15477H4019O5103J8394N9276J87459A66264n3855n1625f5187a0901l19847J21633
$$ 84019 149122 167516 226792 414251 166264 112409 60784 -65187 -10901 -330748 -209115
15466b09115M3273j05625B33533B718d63528a65896a4485A53447m6741b36218
$$ -209115 -165842 -271467 233533 2718 -463528 -165896 -14485 153447 106706 -236218
15455A22029b2039C05754B6246b42221C87398a37607I5446B2885g774B21533L34487
$$ 122029 -22039 305754 26246 -242221 387398 -137607 95446 22885 -7774 221533 556020
15444E56020A98313L60871k66581k2798J25147j7180A19704M4302L4897l9058
$$ 556020 198313 559184 292603 269805 394952 377772 119704 164006 198903 159845
15434A59845m7234K2437a42639B72153g1018H426c7070A01196J87801I2302l2843
$$ 159845 112611 135048 -142639 272153 -71018 8426 -37070 101196 288997 92302 59459
15423E9459a03726C06831b2275B5984a08901B68390A09425L6009D7400K36273
$$ 59459 -103726 306831 -22275 25984 -108901 268390 109425 145434 47400 283673
15413B83673d0742a0425A304Q1899J8679D9926g4544l52436B69129H1154c17468
$$ 283673 -40742 -10425 1304 83203 101882 49926 -74544 -426980 269129 81154 -317468
15401G1499b08379B2572L32125d824E6962b671A16943J9629o7874a04454m8642
$$ 71499 -208379 22572 354697 -4824 56962 -2671 116943 136572 68698 -104454 -153096
15390a53096B68427c6006D38151d4398j06870A88524n6714P3382p7726a30790
$$ -153096 268427 -36006 438151 -44398 -151268 188524 131810 205192 127466 -130790
15379C24566a56434A3587a28501C96353H7320J33568F3685K96642e5817A86052
$$ 324566 -156434 13587 -128501 396353 87320 220888 63685 360327 -55817 186052
15368d1315A90819e5312r8987A78357A1134J64486g2240A52023e3813o9647D9002
$$ -41315 190819 -55312 -154299 178357 11134 175620 -72240 152023 -53813 -123460 49002
15356a04441B62264n6308n5116A5706e1215J158A35504B8267c2443G3549J85685
$$ -104441 262264 205956 150840 15706 -51215 -50057 135504 28267 -32443 73549 259234
15345B59234a63036C94852J5181A11700Q7040J08777q8620a39196C75016A39479
$$ 259234 -163036 394852 410033 111700 198740 307517 218897 -139196 375016 139479
15334d7493q4619B14841F4792Q3111E8228J35176m1451L2127f816A9916a00178
$$ -47493 -132112 214841 64792 147903 58228 193404 151953 184080 -6816 19916 -100178
15322b21648J6196H8122P2214e3120E5216B2268J62561B552b0666A61387g9523
$$ -221648 -205452 88122 160336 -53120 55216 22268 184829 2552 -20666 161387 -79523
15310B78414I4803K59255I2557R6319i4965d6795p9022B26346I5338J93559p9251
$$ 278414 94803 354058 92557 188876 -94965 -46795 -125817 226346 95338 288897 209646
15299B09646a64821C56817p5103b4730I1719M084a21088B6243e0525j63637B16147
$$ 209646 -164821 356817 281714 -24730 91719 95803 -121088 26243 -50525 -214162 216147
15287i9546C5856g8331F6971a77797A3367f518E4553e9381A02705J68375a38031
$$ -99546 35856 -78331 66971 -177797 13367 -6518 54553 -59381 102705 271080 -138031
15275a75403j52499J36219B12861N1701h8304a8815B47735B6793a97010f8171
$$ -175403 -327902 -191683 212861 264562 -88304 -18815 247735 26793 -197010 -68171
15264B01617E6332a7133A84922l0822e0879A91364a36814A10031r274J86215H427
$$ 201617 56332 -17133 184922 154100 -50879 191364 -136814 110031 100757 286972 8427
15252g7579o4766O046M1868A77530G7219a77476n3811B894a76047A4806J5852
$$ -77579 -142345 -136299 -94431 177530 77219 -177476 -231287 2894 -176047 14806 30658
15241C0658K20252D5317M4164J4756N9990n9540e899j36141A08113b44510I4718
$$ 30658 250910 45317 89481 104237 164227 104687 -5899 -142040 108113 -244510 94718
15229a85493M1650C43957f7048A13593B9572a76552B3747K56561H9199A0671a15723
$$ -185493 -143843 343957 -67048 113593 29572 -176552 23747 280308 89199 10671 -115723
15217i517l7002G6922a17003C0197f4370l46908A39067F4946J43730G2487L5277
$$ -9517 -46519 76922 -117003 30197 -64370 -411278 139067 64946 208676 72487 107764
15206A07764q959K2309a6858n8782m5725a9248o551D43143j40571c7463B24092
$$ 107764 98805 121114 -16858 -75640 -121365 -19248 -25799 443143 302572 -37463 224092
15194a34549O6429r1588P8998b7373D5236K2941d07214C0758a55187D6854Q2742
$$ -134549 -68120 -159708 -80710 -27373 45236 68177 -407214 30758 -155187 46854 129596
15183A29596b79656a3096A97576b2764B47404a26688a3253r1880N652k00990C4921
$$ 129596 -279656 -13096 197576 -22764 247404 -126688 -13253 -105133 -99481 -300471 34921
15171A37813C7927a73810A17322J33558C9597J25270D9748M0917a17073m0681
$$ 137813 37927 -173810 117322 250880 39597 164867 49748 90665 -117073 -157754
15161a57754A45727L06101b23474B02964p4568a74842R853A21290J32339N6292
$$ -157754 145727 451828 -223474 202964 128396 -174842 -164989 121290 253629 309921
15151C09921j51238J5360b8095A90588a10863d3864C65028j44035a08754A60686
$$ 309921 158683 174043 -28095 190588 -110863 -43864 365028 220993 -108754 160686
15140i4885A09753n2358L31497n4577A51522m9117C6964b8226A9607g6453A82264
$$ -94885 109753 57395 388892 334315 151522 102405 36964 -28226 19607 -76453 182264
15128A83721L5713n8393N788B0268J87993P875a23332A70895g7527B32250K50336
$$ 183721 219434 161041 166829 20268 208261 216136 -123332 170895 -77527 232250 482586
15117D82586E6018J22929K65730j33350E2107e2916B40370E4776J14943o5051
$$ 482586 56018 178947 444677 311327 52107 -52916 240370 54776 169719 104668
15107A04668K16245a06232h087n4905D00647A51894B7281L53797A40968i338B29903
$$ 104668 320913 -106232 -8087 -62992 400647 151894 27281 381078 140968 -9338 229903
15095B14587o5864K56997j47329a40188B94892p9870k5575O9268o3597l7784K16488
$$ 214587 148723 405720 258391 -140188 294892 215022 189447 258715 195118 157334 373822
15084C73822A16251K28360A07563i0710A83331C4371J48817N7682p0666q2514
$$ 373822 116251 344611 107563 -90710 183331 34371 183188 240870 170204 87690
15074H7690M46341D3804M71798b0873A70448b11930A12657n5955J72111J29883
$$ 87690 534031 43804 515602 -20873 170448 -211930 112657 56702 228813 358696
15064C58696J15207g6991H1096J60059Q7508J11556A42973n0630M42866A25806
$$ 358696 473903 -76991 81096 241155 328663 440219 142973 92343 535209 125806
15053A93436J72486q9005b8125A34271K26950L45856a70532f9451A37709A5729
$$ 193436 365922 276917 -28125 134271 361221 707077 -170532 -69451 137709 15729
15042A39120J8312L12455p2008j62413p2931Q5473n9267J43385j21837I9424J15054
$$ 139120 157432 469887 397879 235466 162535 248008 188741 332126 210289 99424 214478
15031B14478m7317l541M05989m9317j29168K78916l12343M8886j14873k1181A26547
$$ 214478 167161 163620 569609 520292 391124 670040 357697 406583 291710 270529 126547
15019A66793N6900L7201m9055J85567j30918N8275J92560B58432M2149J76884
$$ 166793 223693 260894 211839 397406 266488 324763 517323 258432 300581 477465
15009D77465A45436K6592J72976A41422J65205L59612k59894m984j02686D5989
$$ 477465 145436 172028 345004 141422 306627 666239 406345 401361 298675 45989
14998C13194A44616A4601J19867n4210M57562L3614k55994J2188K91744B16368
$$ 313194 144616 14601 134468 80258 537820 571434 315440 327628 619372 216368
14987A81375J77194r9794O6236l2336m6187J55246K20004J39398k85594n0050
$$ 181375 358569 258775 325011 292675 246488 401734 621738 761136 475542 425492
14977D25492p887j1365n6434j08189M61722B38785J27634K73344B62896K118j26722
$$ 425492 417605 406240 349806 241617 703339 238785 366419 639763 262896 265014 138292
14966A38292J51569K08190j00454A53761K00637O6992M1404a13234D05501M4347
$$ 138292 289861 498051 397597 153761 354398 421390 462794 -113234 405501 449848
14956D49848A96256m5513L9712J70048L1212q9791j34792F4534M22077l2011H0240
$$ 449848 196256 150743 190455 360503 391715 301924 167132 64534 486611 454600 80240
14944B97213K09974B26546L42204J24478A76716K92392j07613L24092C14469j328
$$ 297213 507187 226546 568750 693228 176716 469108 361495 685587 314469 313141
14934C13141K65262L5683r8351J69701M73029C85870L96041k28225L80427j65995
$$ 313141 578403 614086 515735 685436 1158465 385870 781911 553686 934113 768118
14924G68118k22537L88985L7436l36367J44329R4608J27774K77180j53099j4564
$$ 768118 545581 934566 972002 635635 779964 874572 1002346 1279526 1126427 1111863
14914A111863k0507k41644k6777j61431k27856l5119j2955k2155j75021j1950
$$ 1111863 1091356 849712 822935 661504 433648 398529 385574 363419 188398 176448
14904A76448J97755L12696C02193J89806j76479a23368D05448r1550K32477n4819
$$ 176448 374203 686899 302193 491999 315520 -123368 405448 313898 546375 491556
14894D91556j96600k505K60240A51847L31167r6473J5257k9340K59100j78975
$$ 491556 294956 292451 552691 151847 483014 386541 401798 372458 631558 452583
14884D52583K87375k08214q8675O6631N7772J05020j20854O121l1166K97194j34904
$$ 452583 739958 531744 443069 509700 567472 672492 551638 557759 526593 823787 688883
14873F88883m8397l3240A91408O69625B38828M82047p8633J71207j67786j7322
$$ 688883 640486 607246 191408 861033 238828 720875 642242 813449 645663 628341
14863F28341C12797p5020K30687l9399Q2483A17344M02936l9683K01287k59831
$$ 628341 312797 237777 468464 429065 511548 117344 520280 480597 681884 422053
14853D22053A71155L70319j02352k1371m3121j82957O2198k358L09926k46k29317
$$ 422053 171155 541474 439122 417751 374630 191673 253871 251513 561439 561193 331876
14842C31876J48741M5098J07283j58532L01839j05317o2182j2274n6646p092K9189
$$ 331876 480617 525715 632998 474466 776305 670988 608806 596532 539886 532794 561983
14831E61983M0920m0059o9071K6484J01834m1481r2539N1720J50169j77031K68046
$$ 561983 602903 562844 493773 520257 622091 580610 488071 539791 689960 512929 780975
14820G80975k11318A14625N04306j14509J07256j34266K17486l08136O8148K72168
$$ 780975 569657 114625 618931 504422 611678 477412 694898 386762 454910 727078
14810G27078j22050L5025j81390j57427n8986K92260M07435l17059N0078k3628
$$ 727078 605028 640053 458663 301236 242250 534510 941945 624886 674964 651336
14800F51336K54544l64458J40570r4083j28184J47233j74584K20600J16164j66097
$$ 651336 905880 541422 681992 587909 459725 606958 432374 652974 769138 603041
14790F03041K30562N1133l12206j14805k7960M04311l54518K92823l34904N5050
$$ 603041 833603 884736 572530 457725 429765 834076 479558 772381 437477 492527
14780D92527j35838M93154l51863L03800l00921L7908K06736l30999J39643n9148
$$ 492527 356689 849843 497980 801780 500859 538767 745503 414504 554147 494999
14770D94999K71279l57349L69336B79704N75226J8623j22920k0951j91764K80197
$$ 494999 766278 408929 778265 279704 854930 873553 750633 729682 537918 818115
14760H18115C30031J15063m4700K42109j70057J93006j65606J40670j25153J38397
$$ 818115 330031 445094 400394 642503 472446 665452 499846 640516 515363 653760
14750F53760J5785J99386k03098j78398J37565r1791J65275P3267j67651M8673
$$ 653760 669545 868931 665833 487435 625000 533209 698484 771751 604100 652773
14740F52773n3848q2410L25914k07904J43913L10328l99229K0472J33566K9409
$$ 652773 598925 516515 842429 634525 778438 1088766 689537 710009 843575 872984
14730H72984l53137K32932J24475j4003j3934J18285J82889k23687J49147k56140
$$ 872984 519847 752779 877254 863251 849317 967602 1150491 926804 1075951 819811
14720H19811L54609j0373k56270J28096j47506P1361k19789j13240L70938Q0356
$$ 819811 1174420 1164047 907777 1035873 888367 959728 739939 626699 997637 1077993
14710A077993l26095M14361l219l22563o034L73248m26496n8458K68686P271j3914
$$ 1077993 751898 1166259 1163040 840477 834443 1207691 781195 722737 991423 998694 984780
14699I84780J30168J99313l2848K50298r2888l5877r3871l44033j41886o1272
$$ 984780 1114948 1314261 1281413 1531711 1438823 1402946 1309075 965042 823156 761884
14689G61884N24399l76356n5736L14404k29448J40107l55643k1432M89624K09023
$$ 761884 1286283 909927 854191 1168595 939147 1079254 723611 702179 1191803 1400826
14679A400826k19743j84964j8898J76412m98379O45700j61645k95397J01440N9928
$$ 1400826 1181083 996119 977221 1153633 655254 1300954 1139309 843912 945352 1005280
14669A005280m81458M49439k0384J01160j55899J89030J59541k37721M74K82301
$$ 1005280 523822 973261 952877 1054037 898138 1087168 1246709 1008988 1009462 1291763
14659A291763l66715K58287P4453J26194P5299r7780n1276R3892p7991p3843J959
$$ 1291763 925048 1183335 1257788 1383982 1459281 1361501 1310225 1404117 1326126 1252283 1254242
14648A254242j85293o1731M8711N56969l45970j37484J27860k44759O71865k61817
$$ 1254242 1068949 1007218 1055929 1612898 1266928 1129444 1257304 1012545 1684410 1422593
14638A422593J01715k74079n4762J24521k24211M27361k52893J86606j41354k23481
$$ 1422593 1524308 1250229 1195467 1319988 1095777 1523138 1270245 1456851 1315497 1092016
14628A092016J88790K33338m78907L58151L2855J71344l31157P3892J54694j01339
$$ 1092016 1280806 1514144 1035237 1393388 1426243 1597587 1266430 1340322 1495016 1393677
14618A393677o4341L58009m6057k38278K8157k07297J28901L02841R6659l47753
$$ 1393677 1329336 1687345 1641288 1403010 1431167 1223870 1352771 1655612 1752271 1404518
14608A404518j64473J59132M39041l12618n0856K50641l15364M10811o0600r5201
$$ 1404518 1240045 1399177 1838218 1525600 1474744 1725385 1410021 1820832 1760232 1665031
14598A665031R7505L24607o00416P5689j8139q0252J28510L22231n08970M29325
$$ 1665031 1762536 2087143 1486727 1562416 1544277 1464025 1592535 1914766 1405796 1835121
14588A835121l09949L70293L47033n29646K11085R2304k11567L14803j86789l19110
$$ 1835121 1525172 1895465 2242498 1712852 1923937 2016241 1804674 2119477 1932688 1613578
14578A613578P41751k51364K0787J6851J30614p8190j28808J99895j56508N87659
$$ 1613578 2355329 2103965 2124752 2141603 2272217 2194027 2065219 2265114 2108606 2696265
14568B696265m33158l9398L3854K69268n4903M84789k97344L4260J243J53797
$$ 2696265 2263107 2223709 2257563 2526831 2471928 2956717 2659373 2693633 2694876 2848673
14558B848673M9254O5286O42359p1773n2697M88076O16203O90389J302788J948840
$$ 2848673 2897927 2963213 3605572 3533799 3481102 3969178 4585381 5275770 6578558 8527398
14548H527398M522474O440492J0884307J056035j2885875p848494l970586k206936
$$ 8527398 13049872 19490364 30374671 31430706 18544831 10696337 6725751 4518815
14540D518815j047239n89825j03100k13514k6856l48981K75988l79455J49493
$$ 4518815 3471576 2881751 2778651 2565137 2538281 2189300 2465288 2085833 2235326
14531B235326j88166L84004j36707J67636K72044k41817k15843L16687j17461
$$ 2235326 2047160 2431164 2294457 2462093 2734137 2492320 2276477 2593164 2475703
14522B475703K30641j49516P4568M4041N5530j54760M6398J9122P57394p07123
$$ 2475703 2706344 2556828 2631396 2675437 2730967 2576207 2622605 2641727 3399121 2691998
14512B691998J3457J87441j31535J30977P8706K48906r5168r6958j47004Q6137
$$ 2691998 2705455 2892896 2761361 2892338 2971044 3219950 3124782 3027824 2880820 2966957
14502B966957L57342n17153N52527l41215O10608k57898o8444J06454j20110N69278
$$ 2966957 3324299 2807146 3359673 3018458 3629066 3371168 3302724 3409178 3289068 3858346
14492C858346l95601M83928o81710J87149K6837M97793n7682l11211R3790p5792
$$ 3858346 3462745 3946673 3264963 3452112 3478949 3976742 3919060 3607849 3701639 3625847
14482C625847L02103O3518j51394J56240K37234j47397Q9460P1977j76678K70268
$$ 3625847 3927950 3991468 3840074 3996314 4233548 4086151 4175611 4247588 4070910 4341178
14472D341178O6001K08547J5653j18216J02114o5880k68029K68589J22399M0209
$$ 4341178 4407179 4615726 4631379 4513163 4615277 4549397 4281368 4549957 4672356 4712565
14462D712565P4724P4105J89080J51694J41763k88444J63839O7978n6665K13686
$$ 4712565 4787289 4861394 5050474 5202168 5343931 5055487 5219326 5287304 5230639 5444325
14452E444325k67993J60261M27670m5468R1325j74887L16065o0293j41179L74447
$$ 5444325 5176332 5336593 5764263 5718795 5810120 5635233 5951298 5891005 5749826 6124273
14442F124273K7578J6132o1044N76048j25545L63579l87214K61968k27122L32918
$$ 6124273 6151851 6167983 6106939 6682987 6557442 6921021 6533807 6795775 6568653 6901571
14432F901571J57559j99464J78309N0523K72172l52213M69950K35475J83872J37825
$$ 6901571 7059130 6859666 7037975 7088498 7360670 7008457 7478407 7713882 7897754 8035579
14422H035579L09748j43305J59656J56109K64875J59229J01803L56541l23040
$$ 8035579 8345327 8202022 8361678 8517787 8782662 8941891 9043694 9400235 9077195
14413I077195R0562M39745l58259L92195K787J68516J40368K72249J53155J08878
$$ 9077195 9167757 9607502 9249243 9641438 9644225 9812741 9953109 10225358 10378513 10487391
14403A0487391N27326J12263l10466N84188j49931M7167L99228P2202J83800J32670
$$ 10487391 11014717 11126980 10816514 11400702 11250771 11297938 11697166 11769368 11953168 12085838
14393A2085838M33385N30337n5090K54037j90380L03981O15130O2446Q7343N17044
$$ 12085838 12519223 13049560 12994470 13248507 13058127 13362108 13977238 14039684 14127027 14644071
14383A4644071P4824L49541L72455J00285M38923K00334L54286M92546J84842
$$ 14644071 14718895 15068436 15440891 15541176 15980099 16180433 16534719 17027265 17212107
14374A7212107N33739K56198J67218M70921L50087M00772L55898K96457M99585
$$ 17212107 17745846 18002044 18169262 18640183 18990270 19391042 19746940 20043397 20542982
14365B0542982O32918J11306N10438M71693M80625O77440K91341M88212N67022
$$ 20542982 21175900 21287206 21797644 22269337 22749962 23427402 23718743 24206955 24773977
14356B4773977N02098O72827O16294N49764P35506P22553N30484J054418M22076
$$ 24773977 25276075 25948902 26565196 27114960 27850466 28573019 29103503 30157921 30579997
14347C0579997O56154R27290O42584J295011O64728J058693P47785J103826J265142
$$ 30579997 31236151 32163441 32806025 34101036 34765764 35824457 36572242 37676068 38941210
14338C8941210Q47046J307461P32332J146795J649085J023801J740917J192451
$$ 38941210 39788256 41095717 41828049 42974844 44623929 45647730 47388647 48581098
14330D8581098J403354J594481J651589J553789J851383J746635J658459K525740
$$ 48581098 49984452 51578933 53230522 54784311 56635694 58382329 60040788 62566528
14322F2566528J878873K142930K553104K136331K463156K860938K723336K640372
$$ 62566528 64445401 66588331 69141435 71277766 73740922 76601860 79325196 81965568
14314H1965568L364368K995287L155771L531670M125739L907892L971818M656917
$$ 81965568 85329936 88325223 91480994 95012664 99138403 103046295 107018113 111675030
14306A11675030M615767M826067N109843N613961N641744N832565O746458O811543
$$ 111675030 116290797 121116864 126226707 131840668 137482412 143314977 150061435 156872978
14298A56872978P180636P548399Q035830Q339938R197006R331045R943251R961554
$$ 156872978 164053614 171602013 179637843 187977781 197174787 206505832 216449083 226410637
14290B26410637J0613575J1446306J1438027J2227098J2442067J2701053J3044793
$$ 226410637 237024212 248470518 259908545 272135643 284577710 297278763 310323556
14283C10323556J3033743J3675204J3728536J3459830J2814863J2326366J2073537
$$ 310323556 323357299 337032503 350761039 364220869 377035732 389362098 401435635
14276D01435635J0463847R464614P316760M080031J370223M67444L96500j751627
$$ 401435635 411899482 421364096 428680856 432760887 434131110 434598554 434995054 433243427
14268D33243427m744584n198983n547511p400888q497263j0447227j2071328j3034451
$$ 433243427 428498843 423299860 417752349 410351461 401854198 391406971 379335643 366301192
14260C66301192j3647302j3898599j4307974j3957375j4017842j3606508j3421326
$$ 366301192 352653890 338755291 324447317 310489942 296472100 282865592 269444266
14253B69444266j2664071j2225845j1855629j1220237j0644422j0066257r509850
$$ 269444266 256780195 244554350 232698721 221478484 210834062 200767805 191257955
14246A91257955r317739q205478q176566p507730p300462o635052o658762o085884
$$ 191257955 181940216 173734738 165558172 158050442 150749980 144114928 137456166 131370282
14238A31370282n562636m994832n361246m799767m391596m501684l964138l808254
$$ 131370282 125807646 120812814 115451568 110651801 106260205 101758521 97794383 93986129
14230I3986129l851055l335544l259441l511605k779090k878944k274699l099080
$$ 93986129 90135074 86799530 83540089 80028484 77249394 74370450 72095751 68996671
14222F8996671j971941k261065j927073k294797k109518j853847j830598j616477
$$ 68996671 67024730 64763665 62836592 60541795 58432277 56578430 54747832 53131355
14214E3131355j749189j337409j531650j282039j557434j507415j252803r80062
$$ 53131355 51382166 50044757 48513107 47231068 45673634 44166219 42913416 41933354
14206D1933354j096417j246147r35161j215236p73031j033151o91032r05289q83785
$$ 41933354 40836937 39590790 38655629 37440393 36667362 35634211 34943179 34037890 33154105
14197C3154105r15749j161630p15362k99764r29682o12079o14670q17928r85997
$$ 33154105 32238356 31076726 30361364 30061600 29131918 28519839 27905169 27087241 26101244
14188B6101244j42179p01855l00366o31706o98573m09543n86766o06496q2833
$$ 26101244 25959065 25257210 24956844 24325138 23626565 23217022 22630256 22023760 21940927
14179B1940927r50172j12779m33891r04027k55328n0013l52078l66948l90682
$$ 21940927 20990755 20877976 20444085 19540058 19284730 19234717 18882639 18515691 18125009
14170A8125009l17951k88597o77994k07809l85923j57135l48058k19761R538o03990
$$ 18125009 17807058 17518461 16840467 16632658 16246735 16089600 15741542 15521781 15531319 14927329
14160A4927329k55577l43653n7684k63911k12392j82215m28915P2517m08609k32275
$$ 14927329 14671752 14328099 14270415 14006504 13794112 13611897 13182982 13255499 12846890 12614615
14150A2614615j90363j33408r9374l97800o1299q0044o17428o8581J95482l89387
$$ 12614615 12424252 12290844 12191470 11793670 11732371 11652327 11034899 10966318 11161800 10772413
14140A0772413j68052j10204k3503l73533k24749m00411L48179l47718K3873l67923
$$ 10772413 10604361 10494157 10470654 10097121 9872372 9471961 9820140 9472422 9496295 9128372
14130I128372j7383J86692l33095k94346j44728k2057k52262O220L6905r8459
$$ 9128372 9110989 9297681 8964586 8670240 8525512 8503455 8251193 8257413 8294318 8195859
14120H195859l50351j47079K10320K85213n38950j68330k01213K28217k47785
$$ 8195859 7845508 7698429 7908749 8193962 7655012 7486682 7285469 7513686 7265901
14111G265901j61965m05127K75591J68893m7243m65437J54903n04522J61613M2927
$$ 7265901 7103936 6698809 6974400 7143293 7096050 6630613 6785516 6280994 6442607 6485534
14101F485534n0424k60028R9343k48275J64459j72181K18877m36218j24280p481
$$ 6485534 6435110 6175082 6274425 6026150 6190609 6018428 6237305 5801087 5676807 5669326
14091E669326P676K78154l96155J37959p3550l86459j13986K60175k58832L3560
$$ 5669326 5677002 5955156 5559001 5696960 5623410 5236951 5122965 5383140 5124308 5157868
14081E157868j42028j46759J16929p7639j47518J36572k31711J4170j21649j39103
$$ 5157868 5015840 4869081 4986010 4908371 4760853 4897425 4665714 4679884 4558235 4419132
14071D419132p244r9138L94646l25882K9918r7575j83068k9930J25422L5266K39421
$$ 4419132 4411888 4312750 4707396 4381514 4411432 4313857 4130789 4100859 4226281 4261547 4500968
14060D500968q1290j38898m47344J44215J24496J07898k76638o0941j20968m4800
$$ 4500968 4419678 4280780 3833436 3977651 4102147 4210045 3933407 3872466 3751498 3706698
14050C706698j53035K96161p9462j4185l16661K37905r7539n22342M80941M4156
$$ 3706698 3553663 3849824 3770362 3756177 3439516 3677421 3579882 3057540 3538481 3582637
14040C582637k50012l22045M57336j00694j59069J41903J74252N0238m05556K24170
$$ 3582637 3332625 3010580 3467916 3367222 3208153 3350056 3524308 3574546 3168990 3393160
14030C393160l27614J87441j69844l25761K83535L2902J04614J8040l6506n02051
$$ 3393160 3065546 3252987 3083143 2757382 3040917 3073819 3178433 3196473 3159967 2657916
14020B657916M94990l37089j67614L35602k59992J7631o2088m36995N46574j95158
$$ 2657916 3152906 2815817 2648203 2983805 2723813 2741444 2679356 2242361 2788935 2593777
14010B593777j22543k791J30438j3469k54743J52308o9695J14025k36350P5301
$$ 2593777 2471234 2468443 2598881 2585412 2330669 2482977 2413282 2527307 2290957 2366258
14000B366258L1445n6030J49095j78785K02229P2221o6815K32562K5179L56969
$$ 2366258 2397703 2341673 2490768 2311983 2514212 2586433 2519618 2752180 2777359 3134328
13990C134328O30338J697609K437255N687626J0685937R008478q636452q960283
$$ 3134328 3764666 5462275 7899530 13587156 24273093 33281571 24645119 15684836
13982A5684836m856244l084434k014137j184401n76985J18895m70728n21045O2050
$$ 15684836 10828592 7744158 5730021 4545620 3968635 4087530 3616802 3095757 3157807
13973C157807k38510J56041l13972q7782l9443p324p6526j64490j56248L14944
$$ 3157807 2919297 3075338 2761366 2673584 2634141 2626817 2550291 2385801 2229553 2544497
13963B544497m25932j00487L35016j11509r3085o5892l7336N1813k05495n8939
$$ 2544497 2118565 2018078 2353094 2241585 2148500 2082608 2045272 2097085 1891590 1832651
13953A832651J65558N52492o89111L79198j55056k73083p1081L40436j82120Q8202
$$ 1832651 1998209 2550701 1861590 2240788 2085732 1812649 1741568 2082004 1899884 1988086
13943A988086l14055J9098M7381L30076j86286j78110J6812o4599K68544q758
$$ 1988086 1674031 1693129 1740510 2070586 1884300 1706190 1723002 1658403 1926947 1918189
13933A918189m79767L66261p6193J25137k57888J17136L0115j04348K6362M8134
$$ 1918189 1438422 1804683 1728490 1853627 1595739 1712875 1742990 1638642 1665004 1713138
13923A713138l01144Q4968K21815j36847J19432L2727n76007N68786r1153l41903
$$ 1713138 1411994 1496962 1718777 1581930 1701362 1734089 1158082 1726868 1635715 1293812
13913A293812n6032N39639j68304O4898j89648M5405K55884n81007K79887p1985
$$ 1293812 1237780 1777419 1609115 1674013 1484365 1529770 1785654 1204647 1484534 1412549
13903A412549J57159j13789j79850J30141p4861l33221N39944r4566k96599J92961
$$ 1412549 1569708 1455919 1276069 1406210 1331349 998128 1538072 1443506 1146907 1339868
13893A339868J65600l02157M89474j86189j97923J92859j09490o8188J63909k03654
$$ 1339868 1505468 1203311 1692785 1506596 1308673 1501532 1392042 1323854 1487763 1284109
13883A284109J90490m10239K88694J00304l7537l61000j19299L31638J41465k89971
$$ 1284109 1474599 1064360 1353054 1453358 1415821 1054821 935522 1267160 1408625 1118654
13873A118654J0398J18633k26031M3697K15614p9692P1799k9242k78195K95185
$$ 1118654 1129052 1247685 1021654 1065351 1280965 1201273 1273072 1243830 965635 1260820
13863A260820k63908J25343R3999r2719J04251r7739K16651J55161m59008J13730
$$ 1260820 996912 1122255 1216254 1123535 1227786 1130047 1346698 1501859 1042851 1156581
13853A156581k55500J01625K36837j44783k00514L17522K720k94429J82124l67453
$$ 1156581 901081 1002706 1239543 1094760 894246 1211768 1214488 920059 1102183 734730
13843G34730k70920M60871J06345L1264k17565N7332l0148M10447l21982j68451
$$ 734730 463810 924681 1031026 1062290 844725 902057 871909 1282356 960374 791923
13833G91923J92767P3761L8390l83197L94422j59000j18569J67743k76293N0389
$$ 791923 984690 1058451 1096841 713644 1108066 949066 830497 998240 721947 772336
13823G72336K63848l3555k33939M17083n71700K29679J93390J64821m85214L12831
$$ 772336 1036184 1002629 768690 1185773 614073 843752 1037142 1201963 716749 1029580
13813A029580k42515K43336p9282l2050N8013l70032M59642l81990m1642L0727
$$ 1029580 787065 1030401 951119 919069 977082 607050 1066692 684702 643060 673787
13803F73787J65621j25542K24905J60026j99344m00965L57908k44919K78134k47822
$$ 673787 839408 713866 938771 1098797 899453 498488 856396 611477 889611 641789
13793F41789L46391J01705k89690R7974j02470Q1689r8232K90053l41343J51191
$$ 641789 988180 1089885 800195 898169 795699 877388 779156 1069209 727866 879057
13783H79057l16091L03980j96706j13541L56630n9177l4350l81531L10643q6863
$$ 879057 562966 866946 670240 556699 913329 854152 819802 438271 748914 662051
13773F62051K77381l92051J99507p0497P4901J06266j23177K58121j37789j08663
$$ 662051 939432 547381 746888 676391 751292 857558 734381 992502 854713 746050
13763G46050J39513k70418J04824m5583j6063K24540m06275M26104j44258P531
$$ 746050 885563 615145 719969 674386 658323 882863 476588 902692 758434 765965
13753G65965J15598k69320J79545j2481r2190k25799L31890J4748k31235J3127
$$ 765965 881563 612243 791788 779307 687117 461318 793208 807956 576721 589848
13743E89848K8365j35537N04195k18807J46989j09174j32673P026k21273L88262
$$ 589848 618213 482676 986871 768064 915053 805879 673206 680232 458959 847221
13733H47221k48439K27472k45704J01128k44778K48399J57674j78650j36448J19076
$$ 847221 598782 826254 580550 681678 436900 685299 842973 664323 527875 646951
13723F46951J6406A04199J77692L72846N9204B74394N38103j68245K83089l03502
$$ 646951 663357 104199 281891 654737 713941 274394 812497 644252 927341 623839
13713F23839J40886j56979j24168j11357K61551J82691j92446k36475K42506L3045
$$ 623839 764725 607746 483578 372221 633772 816463 624017 387542 630048 663093
13703F63093p152k06742B17382M07112J07523k16851K03329K8733k42249K71285
$$ 663093 655941 449199 217382 624494 732017 515166 718495 747228 504979 776264
13693G76264k43510r7371P6699J93772k99006J60915j2930Q1086j68337A90286
$$ 776264 532754 435383 512082 705854 406848 567763 554833 635919 467582 190286
13682C19910J64968K89178j99710A69192K34481L27123B86753J20505J61549k55234
$$ 319910 484878 774056 574346 169192 403673 730796 286753 407258 568807 313573
13672C13573J1218J50738K11706j50682o4747j89764M13553B53267L67979k82498
$$ 313573 324791 475529 687235 536553 471806 282042 695595 253267 621246 338748
13662C38748N60991l42010J17406l03449q7249K65996k47281J7095K86878j65832
$$ 338748 899739 557729 675135 371686 284437 550433 303152 320247 607125 441293
13652D41293F6445L32351J94046k61073L58889k46554O8545j11315A62215L50398
$$ 441293 66445 398796 592842 331769 690658 444104 512649 401334 162215 512613
13642E12613l5905q8890J1910J29363L5699j65978J591K96662B95358N8885o2514
$$ 512613 476708 387818 399728 529091 564790 398812 400403 697065 295358 354243 291729
13631B91729K72758j88419l4285J45343K36151B83644L14286J98770l09037j65669
$$ 291729 564487 376068 341783 487126 723277 283644 597930 796700 487663 321994
13621C21994R5283K2500l1358M1386l8695J58434A04625K68825J45833A84107
$$ 321994 417277 439777 408419 449805 411110 569544 104625 373450 519283 184107
13610C24851l3098H5310M08871j88103J8192o444A46090K34507p1984K37307A39489
$$ 324851 291753 85310 494181 306078 324270 317826 146090 380597 308613 545920 139489
13598D22704j97050K99834J95159B20561L00346J1344j50418Q540j83787Q5691
$$ 422704 225654 525488 720647 220561 520907 532251 381833 390373 206586 292277
13588B92277J24663J85766Q6555C38950K27664k52840j45749J65306M11280l53448
$$ 292277 416940 602706 689261 338950 566614 313774 168025 333331 744611 391163
13578C91163A64986O27716B85143K79020B60568m0500M9300K41920B46433L42841
$$ 391163 164986 792702 285143 564163 260568 220068 269368 511288 246433 589274
13568E89274j62048j12423H2376A6130L82235J9405K89265B92925M25663c8345
$$ 589274 427226 314803 82376 16130 398365 417770 707035 292925 718588 -38345
13557D91979k32207M22415k08121e8359B71546J2894R8005J6444j89541j4872
$$ 491979 259772 682187 474066 -58359 271546 284440 382445 398889 209348 194476
13547A94476N6338I1018J77622K25213q9246A45251j9667K95328K4717K4222h6874
$$ 194476 250814 91018 268640 493853 404607 145251 125584 420912 445629 469851 -86874
13535H6342J19780J35012F3923J67619O1898p3494P2154A12903J95758k6832K82682
$$ 86342 206122 341134 63923 231542 293440 219946 292100 112903 308661 281829 564511
13524E64511F8532J95842l7057L2785q5725J72909o1323Q1787G8939j1671K90314
$$ 564511 68532 264374 227317 260102 174377 347286 285963 367750 78939 67268 357582
13513C57582r8524A03863M713M07457K46611l23967H8836K45347j24706J98332
$$ 357582 259058 103863 108576 516033 762644 438677 88836 334183 209477 407809
13503D07809J40417A65901L60598B47492R7843J01731A77916J58939J94623A44902
$$ 407809 548226 165901 526499 247492 345335 447066 177916 336855 531478 144902
13492I8924c750A62137J99839C5720M9437J18533q0976L63913j99679J46517j224
$$ 98924 -3750 162137 361976 35720 85157 203690 122714 486627 286948 433465 432241
13481D32241L9999k29308D9973M98063B53593r190G3792L08848A51203K83843
$$ 432241 472240 242932 49973 548036 253593 244403 73792 382640 151203 435046
13471D35046j35278j00998P2893n5926f5951B85619Q5535J92662k44547p3966
$$ 435046 299768 198770 271663 215737 -65951 285619 371154 563816 319269 245303
13461B45303K37780J85509I2092R2849J489J85861j42535d3323f685B25224J13427
$$ 245303 483083 668592 92092 184941 186430 372291 229756 -43323 -6685 225224 338651
13450C38651r5669F0474L39678J2342A51188d7924C31710H3933J22630g3978B76277
$$ 338651 242982 60474 400152 412494 151188 -47924 331710 83933 206563 -73978 276277
13438D10347r8634k9293L92494B27898L98445A75548E6139K30694J67767G8356
$$ 410347 311713 282420 674914 227898 626343 175548 56139 286833 454600 78356
13427F60441k22876A74571m6053L8017J84277e3816B63318F8335K8562J68733
$$ 660441 437565 174571 128518 166535 350812 -53816 263318 68335 96897 265630
13417B65630e6447B60565K53211A15355f148A62746F3576O3043J00263J59259
$$ 265630 -56447 260565 513776 115355 -6148 162746 63576 126619 226882 386141
13407C86141l7913A40317n4763M6481R5998r8582L1674K40704J22279A17393J90537
$$ 386141 348228 140317 85554 132035 228033 129451 161125 401829 524108 117393 307930
13396C07930a29938C7396K10612a37142A23189Q0684K61447A51696J41642k3166
$$ 307930 -129938 37396 248008 -137142 123189 203873 465320 151696 293338 270172
13386B70172q0259j0496J50925a13269C06038j08616B2383J64126e5575C21834
$$ 270172 189913 179417 330342 -113269 306038 197422 22383 186509 -55575 321834
13375A57060b2847B76109K49549C230K61796D4682A9564K72473J8281J99002A78168
$$ 157060 -22847 276109 525658 3230 265026 44682 19564 292037 310318 509320 178168
13363D56607q3789A55136k5451J32172a9895C48215j11523J3181g813D2633a31854
$$ 456607 372818 155136 129685 261857 -19895 348215 236692 249873 -7813 42633 -131854
13351B42896k8166b9629B90293b98397A99322K2327p0206L74804A6071a55595
$$ 242896 214730 -29629 290293 -298397 199322 221649 151443 526247 16071 -155595
13340A03226K54812j29602B8885J63632J89454A55320J00674L5757f1128C36709
$$ 103226 358038 228436 28885 192517 381971 155320 255994 291751 -61128 336709
13329C71287C8829c6656A51600R4966A09411B7832J90236q1173J47113r4442m5211
$$ 371287 38829 -36656 151600 246566 109411 27832 218068 136895 284008 189566 144355
13318A44355E9046J66487r4235J94101j51096e9184B17642L8619C1676J78958
$$ 144355 59046 225533 131298 325399 174303 -59184 217642 256261 31676 210634
13308B10634J00172A990K04340O4336K9484A38865j3176D2270Q4495a8708A13266
$$ 210634 310806 1990 206330 270666 300150 138865 125689 42270 126765 -18708 113266
13296e7740C48121C5046R1230n9033A921K82809i34C75692j58608C866O0547J9627
$$ -57740 348121 35046 126276 67243 1921 284730 -934 375692 217084 3866 64413 84040
13284H4040L5556N9541K7449O7552A02404J14231J09767J22573b0495F1164R5571
$$ 84040 119596 179137 206586 274138 102404 216635 326402 448975 -20495 61164 156735
13273A56735o5126J9067J45874L28710A94589j4758G7039i6263A03124L68364
$$ 156735 91609 110676 256550 585260 194589 179831 77039 -96263 103124 471488
13263D71488A45994a9254j29010D65115i9254a7192j9470p1999d230G5256M4984
$$ 471488 145994 -19254 -148264 465115 -99254 -17192 -36662 -108661 -4230 75256 120240
13252A20240L63043A07517J06390a6254D89062B25132a80669A27871a5834H17450
$$ 120240 483283 107517 213907 -16254 489062 225132 -180669 127871 -15834 817450
13241A72037K07947j17622F3100h972n1445B91290C0670K29039b9888C2566F569
$$ 172037 379984 262362 63100 -8972 -60417 291290 30670 259709 -29888 32566 6569
13229a5218A24309L8162n9772K32511j55726e3535A71226d5586F7766Q7967a0347
$$ -15218 124309 162471 102699 335210 179484 -53535 171226 -45586 67766 155733 -10347
13217b2156l2536a4667C28327a65826K57d6223n5917d0971C29064G6727B8447
$$ -22156 -54692 -14667 328327 -165826 -165569 -46223 -102140 -40971 329064 76727 28447
13205A11384k3364I130N29782A42544K8034o0132l1796J22733L55167k37571j06089
$$ 111384 88020 9130 538912 142544 170578 110446 78650 201383 556550 318979 212890
13194B12890L403o2086Q5959M7570B455J9411J16455K29662E1649J56641f6960
$$ 212890 216293 154207 240166 287736 2455 21866 138321 367983 51649 208290 -66960
13182a14426J1995H9546L4143J32375M3821q9181q6535d9119Q581E5177K24398
$$ -114426 -102431 89546 123689 256064 299885 210704 124169 -49119 -40538 55177 279575
13171B79575A00844d2974B15932c04946A8243b52790C6961d311o0726A32442j2083
$$ 279575 100844 -42974 215932 -304946 18243 -252790 36961 -4311 -65037 132442 120359
13160A20359J02081n7207n3745P0812K38717a79511A13974K11932d3914j5105
$$ 120359 222440 165233 111488 182300 421017 -179511 113974 325906 -43914 -59019
13150e9019q7251B58478J8484g126n200m0636B2422J59273a20521A9783M17672
$$ -59019 -146270 258478 276962 -7126 -12326 -52962 22422 181695 -120521 19783 437455
13139D37455B09243b9595f898A05826A2742a45586F4142J39954h3902E6526J06373
$$ 437455 209243 -29595 -6898 105826 12742 -145586 64142 204096 -83902 56526 162899
13128A62899Q4056c20986J05829P913I338f7150o038B940M0154J97767K21327
$$ 162899 246955 -320986 -215157 -207244 9338 -67150 -73188 2940 43094 240861 462188
13117D62188A85685J4023b60590A28325n5458g8487k3185n6984A74116N6628j0010
$$ 462188 185685 199708 -260590 128325 72867 -78487 -101672 -158656 174116 230744 220734
13106B20734G8747K26482r8584R8805b94199a2503j51138C5913K88218E9653h8836
$$ 220734 78747 305229 206645 305450 -294199 -12503 -163641 35913 324131 59653 -88836
13094c837A54431k1116P1586o1598P5697a55644D9230K31250B8716K95411F156
$$ -3837 154431 133315 204901 143303 219000 -155644 49230 280480 28716 324127 6156
13082I0798A4222K36128A847J16520J21594J98231a7017A27716f8212A33592k2868
$$ 90798 14222 250350 1847 118367 239961 438192 -17017 127716 -68212 133592 110724
13071A10724J73771d5667B33813a74410j77527a0551d887A66652L00082C6340
$$ 110724 284495 -45667 233813 -174410 -351937 -10551 -4887 166652 466734 36340
13060A02265a5237j5825o1799c3605J4719H0145J94696O3479q0803k4496o0405
$$ 102265 -15237 -31062 -92861 -33605 -18886 80145 274841 338320 257517 233021 172616
13049A72616a19926e96C6672K27328h4658n8222I9767D252K46153j5697a08328
$$ 172616 -119926 -596 36672 264000 -84658 -142880 99767 4252 250405 234708 -108328
13037A09363b50699B71653c5520A39708k3504a82610I1484J20709A02788J08963
$$ 109363 -250699 271653 -35520 139708 116204 -182610 91484 212193 102788 211751
13027B11751o1893F8606g2876A03444J09812L19179B16412b24746d7186D1597
$$ 211751 149858 68606 -72876 103444 213256 532435 216412 -224746 -47186 41597
13016b57655J25844b7897E6157K04685A17847D9102K5588b34041g3017C79576
$$ -257655 -131811 -27897 56157 260842 117847 49102 74690 -234041 -73017 379576
13005D5541J49997d2333A72165d3541A08007N4266E8342e5369B97959j03495a90583
$$ 45541 195538 -42333 172165 -43541 108007 162273 58342 -55369 297959 194464 -190583
12993B09265J4830e4582I5346J9105Q5408H9154q918J46859g9495B69297m6206
$$ 209265 224095 -54582 95346 114451 199859 89154 80236 227095 -79495 269297 223091
12982B23091F5880a92100A06444a1719k88191e5324j99395B44853c1770I0437
$$ 223091 65880 -192100 106444 -11719 -299910 -55324 -254719 244853 -31770 90437
12971a1964E2546j8913i9366B54679A7928J6108d57754K03068B15428c2359r5767
$$ -11964 52546 33633 -99366 254679 17928 34036 -457754 -254686 215428 -32359 -128126
12960a28126E9812h5542L0065j8708C8717K97385h5055B33408J6333q9329N8182
$$ -128126 59812 -85542 -55477 -74185 38717 336102 -85055 233408 249741 160412 218594
12949B18594e2655p2439L1042c5149j20742A5035K37044J6281a7796D39045A08018
$$ 218594 -52655 -125094 -94052 -35149 -155891 15035 252079 268360 -17796 439045 108018
12937c7401l5265a560B35259b20589H6942J34692H7822J446A7897c9038B56888
$$ -37401 -72666 -1560 235259 -220589 86942 221634 87822 89268 17897 -39038 256888
12925A44678h1421B14644c1560p5965q9923F8293O9782b71871d8820B03585B331
$$ 144678 -81421 214644 -31560 -107525 -197448 68293 138075 -271871 -48820 203585 2331
12913C3299f260l47632A28002K0151i8913m308C94399b43404b6055G876K94479
$$ 33299 -6260 -353892 128002 148153 -98913 -103221 394399 -243404 -26055 7876 302355
12902C02355J20854G604J06997a34330A39433b23121F4054J88034A2073a60275
$$ 302355 423209 7604 114601 -134330 139433 -223121 64054 252088 12073 -160275
12891B63271a93320r9271M6006B02537l0462N7553b07434B95739b52918h1721
$$ 263271 -193320 -292591 -246585 202537 172075 229628 -207434 295739 -252918 -81721
12880D3873J76589e126r1729A36025b39439G9038a60524F2166O9041J62257A24194
$$ 43873 220462 -5126 -96855 136025 -239439 79038 -160524 62166 131207 293464 124194
12868a3220j39817j8015B16492b73595B48346o3023a88647j81272A3076J02988
$$ -13220 -153037 -171052 216492 -273595 248346 185323 -188647 -369919 13076 116064
12858A16064i7511G5938J66109g560k92368a00880B58545B1251J21398J7668b74913
$$ 116064 -97511 75938 242047 -7560 -299928 -100880 258545 21251 142649 160317 -274913
12846c5355k48336A85700a08502C81145A47441I242e0134j55608A22J8715d225
$$ -35355 -283691 185700 -108502 381145 147441 9242 -50134 -205742 122 18837 -4225
12834B51100e1088B97153e3116B47639q4172a72122r4878B63893J35479A17538
$$ 251100 -51088 297153 -53116 247639 163467 -172122 -267000 263893 399372 117538
12823A04623b04852A70211N0626b3720j55766c9540l19702E1671F679e3296D57912
$$ 104623 -204852 170211 220837 -23720 -179486 -39540 -359242 51671 6679 -53296 457912
12811c5861n7244l580C44991D8565M129h0013B56093j27515e3980q2735I9309
$$ -35861 -93105 -96685 344991 48565 52694 -80013 256093 128578 -53980 -136715 99309
12799B28483c4335m60320e8182C67251b13689a203A36912g1841q2378B0879b04573
$$ 228483 -34335 -494655 -58182 367251 -213689 -1203 136912 -71841 -154219 20879 -204573
12787A08929d0163a2685m3328b7400o7664B85664j22524o1932J13177m1005K9524
$$ 108929 -40163 -12685 -56013 -27400 -95064 285664 163140 101208 214385 173380 202904
12776B02904N9889l7701a61891A44228o5435A8951P861E777a92545M1543I9366
$$ 202904 262793 225092 -161891 144228 78793 18951 26812 5777 -192545 -151002 99366
12764B56892b4139G0726Q690a56549e8172E70500a71663L6417F1639f9378D1869
$$ 256892 -24139 70726 79416 -156549 -58172 570500 -171663 -135246 61639 -69378 41869
12752a11072m0509j44780f3030a3369B15319m3762n4451f7849b5288B341Q5250
$$ -111072 -151581 -296361 -63030 -13369 215319 171557 117106 -67849 -25288 2341 87591
12741H7591Q2187J752c30227a27689D29875b27180G5307l1576j341K97735A11701
$$ 87591 169778 171530 -330227 -127689 429875 -227180 75307 43731 42390 340125 111701
12729B34404E7599k4803a53135r5385J3611C27377C7645h8308k17362B05240K23181
$$ 234404 57599 32796 -153135 -248520 -234909 327377 37645 -88308 -305670 205240 428421
12718D28421A38383E8094c9773D14021j16004I9952L16053a45629A73159J95052
$$ 428421 138383 58094 -39773 414021 298017 99952 416005 -145629 173159 368211
12708C68211f5618D45742k7182F9900J95309C0273M54615A8710M9614R7980E8541
$$ 368211 -65618 445742 418560 69900 265209 30273 484888 18710 68324 166304 58541
12696d365k3169A84608k3474d7994D16807d0428l5506A92364c96107C5523c5179
$$ -4365 -27534 184608 161134 -47994 416807 -40428 -75934 192364 -396107 35523 -35179
12684a16753A09420i7179C90779A61915J4334F6926K57677b26913b0508C88311
$$ -116753 109420 -97179 390779 161915 176249 66926 324603 -226913 -20508 388311
12673H1196A7676K19673q8682C6002L7428J35672D7022a73100A76313c96016C65223
$$ 81196 17676 237349 148667 36002 73430 209102 47022 -173100 176313 -396016 365223
12661B29486h7A89291f8142j23000Q7798A22353a57244d6278p0240m401B8820
$$ 229486 -87 189291 -68142 -191142 -103344 122353 -157244 -46278 -116518 -120919 28820
12649A25219i8581A87984M5701J09253G3002C2979f1901H2411c24934R8381B16243
$$ 125219 -98581 187984 233685 342938 73002 32979 -61901 82411 -324934 -226553 216243
12637B7566e2640C40726O0085A66812b26340A40156F0788L61066j35210c3081
$$ 27566 -52640 340726 400811 166812 -226340 140156 60788 421854 286644 -33081
12626A24442m5631c5664E533J59372G1050a36306C53096j18368j1648e3587l11683
$$ 124442 78811 -35664 5533 164905 71050 -136306 353096 234728 223080 -53587 -365270
12615c65270L6503B63384h8j00900A11935H296a18073L4717F1945d1154j7645
$$ -365270 -328767 263384 -88 -100988 111935 8296 -118073 -83356 61945 -41154 -58799
12604e8799A87989g537B46832A09881a7406j13253k7084B67346J14901j32483
$$ -58799 187989 -7537 246832 109881 -17406 -130659 -157743 267346 382247 249764
12594B49764b8681A07785K69717a8385E7442a46216l6627B06588c9143m3323j96187
$$ 249764 -28681 107785 377502 -18385 57442 -146216 -182843 206588 -39143 -82466 -278653
12583b78653B86644I2632g4741q4766a0025C2593J29798e3990F7410a10586E9374
$$ -278653 286644 92632 -74741 -159507 -10025 32593 162391 -53990 67410 -110586 59374
12571a06230k41183e1834k24732c4217B27050B988J62807B8529R4926i1923A97583
$$ -106230 -347413 -51834 -276566 -34217 227050 2988 165795 28529 123455 -91923 197583
12559B43395B9712J2094J92179a90249N0836a9760k45307d1110B07076e6955j23586
$$ 243395 29712 41806 233985 -190249 -139413 -19760 -265067 -41110 207076 -56955 -180541
12548a80541g7785l13643a48438c3301l4432D3104j9165J23609J0446b24944A11502
$$ -180541 -77785 -391428 -148438 -33301 -67733 43104 23939 147548 157994 -224944 111502
12536c1809k90537a2150j78372E9088M1548D9267N7659Q2405o7983b28411M1450
$$ -31809 -322346 -12150 -190522 59088 100636 49267 106926 189331 121348 -228411 -186961
12525a86961P6780C90336B1140q698L2578a94351a5577A13937A4752K71783b60979
$$ -186961 -110181 390336 21140 12442 45020 -194351 -15577 113937 14752 286535 -260979
12513c74775E09996a40305C1920K17794b9556A05088M6162Q1593b07739O5451
$$ -374775 509996 -140305 31920 249714 -29556 105088 151250 232843 -207739 -142288
12503a42288C7860g5527D2396K30237A34083F6171k3982a91370C5895a97450D9369
$$ -142288 37860 -75527 42396 272633 134083 66171 42189 -191370 35895 -197450 49369
12491A07764D2025b70571P5925C30772d8696J3840A99422J12636I2828M0771L0356
$$ 107764 42025 -270571 -194646 330772 -48696 -34856 199422 312058 92828 133599 163955
12480A63955Q9166a32642H866a16856A01056N5977a32277A984J2363J23542L23289
$$ 163955 253121 -132642 8866 -116856 101056 157033 -132277 1984 14347 137889 461178
12469D61178g3827A32594j8951n2230a4783n4441k6524c9812r2231K9032c5085
$$ 461178 -73827 132594 113643 61413 -14783 -69224 -95748 -39812 -132043 -103011 -35085
12457A80170j0098m323a61049B9737N1130A212a39626C4736J38524E0222K13630
$$ 180170 170072 165749 -161049 29737 80867 1212 -139626 34736 173260 50222 263852
12446B63852j07212a18810k7966n8687f8312B03569D881O2308Q4491a7723j96246
$$ 263852 156640 -118810 -146776 -205463 -68312 203569 4881 67189 151680 -17723 -213969
12435b13969L8516J0656K8855k9501O0983C82255C9178Q2601j6304a27351j3974
$$ -213969 -175453 -164797 -135942 -165443 -104460 382255 39178 121779 105475 -127351 -141325
12424a41325B12707b99992A37960a80884l8455Q1650G3174M3274c09060J53343
$$ -141325 212707 -299992 137960 -180884 -219339 -137689 73174 116448 -309060 -155717
12414a55717H5469B3808c0866F5479b69744F2783a82029A25108c01694E2427J6373
$$ -155717 85469 23808 -30866 65479 -269744 62783 -182029 125108 -301694 52427 68800
12403F8800n054N3071b28418J3212A77919c75310i9854e594o5103o6045B01826
$$ 68800 63746 116817 -228418 -215206 177919 -375310 -99854 -5594 -70697 -136742 201826
12391G3719c35546C23922e0396B04258C595J18466K74061d9626j9897b0751A41498
$$ 73719 -335546 323922 -50396 204258 3595 122061 396122 -49626 -69523 -20751 141498
12379E3339j8346J08554c376p4611A7659J38339c2245D81221a4841B07257h2857
$$ 53339 34993 143547 -3376 -77987 17659 155998 -32245 481221 -14841 207257 -82857
12367f2901k7314G6753L64574a43531I4382d2538j42469A1720h8887B31214Q618
$$ -62901 -90215 76753 441327 -143531 94382 -42538 -185007 11720 -88887 231214 239832
12356B39832E3993c1877A43101O988a5986D8474e11585A11156g3700b9407A48851
$$ 239832 53993 -31877 143101 150089 -15986 48474 -511585 111156 -73700 -29407 148851
12344a5733r2279I1282K60475a38037A01952N2404a48394e8270A37151a18994
$$ -15733 -108012 91282 351757 -138037 101952 154356 -148394 -58270 137151 -118994
12333d06891a33053B05292b68426a05566M4491C67026j1638a37630C05949c81138
$$ -406891 -133053 205292 -268426 -105566 -61075 367026 355388 -137630 305949 -381138
12322C646K40572C3908c48846B55865A11389F496b55772R6805A56519P1356J63453
$$ 3646 244218 33908 -348846 255865 111389 6496 -255772 -158967 156519 227875 391328
12311C91328b75827B53556F8638O1501B9396j4647K32821e5622H526R7088J00303
$$ 391328 -275827 253556 68638 130139 29396 14749 247570 -55622 8526 105614 205917
12300B05917F4497j5792e5388n6336n4083F8834k9803L2142J39897A5562h4619
$$ 205917 64497 48705 -55388 -111724 -165807 68834 39031 71173 211070 15562 -84619
12288A85860K7660b5867k96945J0484B4866M9339d7188j91366A78190F5111J07981
$$ 185860 213520 -25867 -322812 -312328 24866 74205 -47188 -238554 178190 65111 173092
12277A73092a18002B46618p6669l2241l1355a93929B30473b03567b8094B01654
$$ 173092 -118002 246618 169949 137708 106353 -193929 230473 -203567 -28094 201654
12266d13759E3150J91370F0331a18551B63175j14447J5903P9892l5017a51272
$$ -413759 53150 244520 60331 -118551 263175 148728 164631 244523 209506 -151272
12255b2595A60945b52600e8435o6367A33542n2665L6311O6429I1415a00021r1886
$$ -22595 160945 -252600 -58435 -124802 133542 80877 117188 183617 91415 -100021 -191907
12244a91907B3870P2098J56417K4601F987b01784N8984H7657K89198g0732B2796
$$ -191907 23870 95968 252385 276986 6987 -201784 -142800 87657 376855 -70732 22796
12232B36626B2972M7312h9942j61150C06616A05805B1392J98038j02150D8043
$$ 236626 22972 70284 -89942 -251092 306616 105805 21392 219430 117280 48043
12221A31063K61398j25375L28966a82303B99220a28324C67575E2850R923B1210
$$ 131063 392461 267086 596052 -182303 299220 -128324 367575 52850 62773 21210
12210B79585N4597m6775j34386L47605A79318a8486A23339B3818K39863A11765
$$ 279585 334182 287407 153021 500626 179318 -18486 123339 23818 263681 111765
12199B78731p4661D3094L90930b0382r3898C1102M62278A69136D8681K25468n678
$$ 278731 204070 43094 434024 -20382 -114280 31102 493380 169136 48681 274149 268471
12188B68471q3360H4692a44340E3403e0730A34532k6363C9638J33587a26685D9713
$$ 268471 185111 84692 -144340 53403 -50730 134532 108169 39638 173225 -126685 49713
12176B3879J64085J6246a08889C07009b9152C31172j04767D7269J59280i6978
$$ 23879 187964 204210 -108889 307009 -29152 331172 226405 47269 206549 -96978
12165B92633i2035J2866F3347Q64a72129f932C1694N4176h9850C27842A39690
$$ 292633 -92035 -79169 63347 64211 -172129 -6932 31694 85870 -89850 327842 139690
12153A05370l8275J95669J3987j30475c4443k86748K3685A53011E7786a05481
$$ 105370 67095 262764 276751 146276 -34443 -321191 -297506 153011 57786 -105481
12142A75138a3414j23130L1303J4410o9650b3895j91418g4915q3759d3579D61433
$$ 175138 -13414 -136544 -105241 -90831 -160481 -23895 -215313 -74915 -158674 -43579 461433
12130E9125K67906m0456b57108A52486K4160b33367A09798h1911f766A19899m9589
$$ 59125 327031 286575 -257108 152486 176646 -233367 109798 -81911 -6766 119899 70310
12119G0310J86500K01682A49944k0337a44364A0011b83642F4189a51738B18723
$$ 70310 256810 458492 149944 129607 -144364 10011 -283642 64189 -151738 218723
12108D9167K73552i0090C4880J81807C8139a95692q4775A76030a98866j14537
$$ 49167 322719 -90090 34880 216687 38139 -195692 -280467 176030 -198866 -313403
12098c13403C4214a37640A20721D4036c16612P6266F423P8170N2575f2633l08453
$$ -313403 34214 -137640 120721 44036 -316612 -240346 6423 84593 137168 -62633 -371086
12087c71086B947L11651D9317a7284j19404g875B58154J26957j43928j10058l0251
$$ -371086 2947 314598 49317 -17284 -136688 -7875 258154 385111 241183 131125 100874
12076A00874c934A76268Q6907E862a55341j80106g2030o1343A4673l107J7882
$$ 100874 -3934 176268 263175 5862 -155341 -335447 -72030 -133373 14673 11566 29448
12065B9448h591k18172B96366a7462A83234J73323c4143j46182B14886I6032a72256
$$ 29448 -8591 -226763 296366 -17462 183234 356557 -34143 -180325 214886 96032 -172256
12053A42323B0406J05600P7447F0257M6401a7963A17343a99146O1981a3508j11951
$$ 142323 20406 126006 203453 60257 106658 -17963 117343 -199146 -137165 -13508 -125459
12042a25459B1127K89070d7973B05936B6858K5597N51J1008J33723a57464H092
$$ -125459 21127 310197 -47973 205936 26858 52455 53006 64014 197737 -157464 8092
12030I9241M3922a196F8690a89999k4045J354o4690a07969D5546b03535f5972
$$ 99241 143163 -1196 68690 -189999 -214044 -212690 -277380 -107969 45546 -203535 -65972
12018a98509B39328b40755J00840Q005B46145A5473a4786m3667F4605L7430h7905
$$ -198509 239328 -240755 -139915 -131910 246145 15473 -14786 -58453 64605 102035 -87905
12006C16820b46344j299B09617k5723h3957D3496a11316B24701C2473a08957P66
$$ 316820 -246344 -247643 209617 183894 -83957 43496 -111316 224701 32473 -108957 -108191
11995a08191C9755a44258A01491R0696b42581C4815a61669I2090K5899a46753
$$ -108191 39755 -144258 101491 192187 -242581 34815 -161669 92090 117989 -146753
11984f4216A08655a09162j07684A44124d876l21273F7127L10922j71233a29149
$$ -64216 108655 -109162 -216846 144124 -4876 -326149 67127 378049 206816 -129149
11973b09112A35805c57207J45658i2226A06074c34358e0458A56702a9977B75035
$$ -209112 135805 -357207 -211549 -92226 106074 -334358 -50458 156702 -19977 275035
11962b79424j4399A40572k8651i2092F1812R80J01189e8700G6186a32718E964
$$ -279424 -293823 140572 111921 -92092 61812 62792 163981 -58700 76186 -132718 5964
11950b89359c5605C3215b55344C6161a68040A6100c06651a20522j01256r124a14168
$$ -289359 -35605 33215 -255344 36161 -168040 16100 -306651 -120522 -221778 -230902 -114168
11938a2915j64578E9715K64539a04688c7782j40425j61320C9648a1077j17779
$$ -12915 -177493 59715 324254 -104688 -37782 -178207 -339527 39648 -11077 -128856
11928a28856A7021J82463a88990l23373a85289E0452a18236A1812c58393B30809
$$ -128856 17021 199484 -188990 -512363 -185289 50452 -118236 11812 -358393 230809
11917C02649b04397c975G886M7603b09419A54500b94731A05502m602J61889a54682
$$ 302649 -204397 -3975 7886 55489 -209419 154500 -294731 105502 100900 262789 -154682
11905H9793b54384D9364b02253P7362A09741a26963m9855m9451R4091j78004a27012
$$ 89793 -254384 49364 -202253 -124891 109741 -126963 -176818 -226269 -132178 -310182 -127012
11893D0100a49679o436C860a45415a860k45634e3578n6216A79780A7319a02462
$$ 40100 -149679 -156115 3860 -145415 -1860 -247494 -53578 -109794 179780 17319 -102462
11881a03351B70c28964E6355Q4781k4421j4174a69679B4676J50708M8320b74001
$$ -103351 270 -328964 56355 141136 116715 102541 -169679 24676 175384 223704 -274001
11869B10077b66605o0082N8422B01254L9231j12646b1829A1504L5975f7744A17422
$$ 210077 -266605 -326687 -268265 201254 240485 127839 -21829 11504 47479 -67744 117422
11857a21361B05271r9507k565c36931C9854b8652j4324p9976j0949k1671j58263
$$ -121361 205271 105764 103199 -336931 39854 -28652 -42976 -122952 -133901 -155572 -313835
11846c13835h6529j23423J04732k16441A70240B1265b7274D1831M3093b30774
$$ -313835 -86529 -209952 -105220 -321661 170240 21265 -27274 41831 84924 -230774
11835f4637F3206I991b7070j25254j35174A20752e3966j30228P9075E520a55197
$$ -64637 63206 9991 -27070 -152324 -287498 120752 -53966 -184194 -105119 5520 -155197
11823F8098C3284c30982a18889L6343A05946j0793B4270Q2975l6756b21135O8534
$$ 68098 33284 -330982 -118889 -82546 105946 95153 24270 107245 70489 -221135 -152601
11812a52601E864a22824M9793b1156B85079a99317f8306l01272K4887J23339E064
$$ -152601 5864 -122824 -73031 -21156 285079 -199317 -68306 -369578 -344691 -221352 5064
11800c88402J71960B39388b17879A7433K67507b26251C1551d61744a66837C59293
$$ -388402 -216442 239388 -217879 17433 284940 -226251 31551 -461744 -166837 359293
11789A19640P2329g638m5659j08567r3391I5182J98038E6495c0758D8956f2190
$$ 119640 191969 -7638 -53297 -161864 -255255 95182 293220 56495 -30758 48956 -62190
11777a10664a1902k9308r5064g455p6087j13075e6402r5953A33884b79706D83653
$$ -110664 -11902 -41210 -136274 -7455 -83542 -196617 -56402 -152355 133884 -279706 483653
11765A73959C3286b0312n41171b1649C18644a36008r0385P7679A3106J58778b84192
$$ 173959 33286 -20312 -561483 -21649 318644 -136008 -226393 -148714 13106 171884 -284192
11753B64994a69837Q3428l9910p0783d6346b1325C10282K8917b03332o292b4378
$$ 264994 -169837 -86409 -126319 -197102 -46346 -21325 310282 339199 -203332 -209624 -24378
11741B01085c4496m7387A56430a08465K4970M0336A86369c16753e6815l1873B9715
$$ 201085 -34496 -81883 156430 -108465 -83495 -43159 186369 -316753 -56815 -88688 29715
11729D7112b3647Q975j82148A26519f06366B06036a14239k61543G0576M3210m4633
$$ 47112 -23647 -14672 -196820 126519 -606366 206036 -114239 -375782 70576 113786 69153
11718F9153a06787A29727i1975A07324a49402A04073N4926J52423H6417j8717
$$ 69153 -106787 129727 -91975 107324 -149402 104073 158999 311422 86417 67700
11708F7700e6431B26571D2907a59712A60046b03466E2242Q8258A7127O2525R2586
$$ 67700 -56431 226571 42907 -159712 160046 -203466 52242 140500 17127 79652 172238
11697A72238c7762A32987J0743b41746J13637o5830C6214r133i9642A36919J26396
$$ 172238 -37762 132987 143730 -241746 -128109 -193939 36214 27081 -99642 136919 263315
11686B63315i431o7640H564K05728a77106N9228h615B4397M8891f6995L855j06587
$$ 263315 -9431 -77071 8564 214292 -177106 -117878 -8615 24397 73288 -66995 -63140 -169727
11674a69727C70421F7118L253O4819j4086P4721f8169l01706A94738f4984B6048
$$ -169727 370421 67118 70371 135190 121104 195825 -68169 -369875 194738 -64984 26048
11662a33433A99420b05069K639p819f5451D35057a79697k6958J02418B91169a84904
$$ -133433 199420 -205069 -202430 -210249 -65451 435057 -179697 -206655 -104237 291169 -184904
11650A168h1775E2392J15933C5662a33210H1215J00766a36565B19247f0730A01496
$$ 1168 -81775 52392 168325 35662 -133210 81215 181981 -136565 219247 -60730 101496
11638b47500R1084j48905a3692A04224m0435O4451a9335C31027a9096q3723A06142
$$ -247500 -156416 -305321 -13692 104224 63789 128240 -19335 331027 -19096 -102819 106142
11626D361a23971F0459d8591J1989B79573b83007J14474B5674J1507J27334K33774
$$ 4361 -123971 60459 -48591 -36602 279573 -283007 -168533 25674 37181 164515 398289
11615C98289A92355i6012n0328B12232a42650c11j564n2464K5990B03335a36413
$$ 398289 192355 -96012 -146340 212232 -142650 -311 -1875 -54339 -28349 203335 -136413
11603b8129f53C3072K35348L1496a8187k388B54818c26233A46227a28891A38938
$$ -28129 -653 33072 268420 299916 -18187 -20575 254818 -326233 146227 -128891 138938
11591D36527b44367a3759A16197D4692a03374C06248l0700A01686i8554B07495
$$ 436527 -244367 -13759 116197 44692 -103374 306248 275548 101686 -98554 207495
11580G7806C1028c01726b6019A6082J7269b48327A65023q028i2947j11491C37419
$$ 77806 31028 -301726 -26019 16082 33351 -248327 165023 156995 -92947 -204438 337419
11568a943B67983f2414b4420C35498j53529d85514A61260R0392H7447a71382A82953
$$ -1943 267983 -62414 -24420 335498 181969 -485514 161260 251652 87447 -171382 182953
11556A41317D1633M9893J45919K2425R230C3227M7590b23887L9654I1431J62232
$$ 141317 41633 91526 237445 259870 269100 33227 80817 -223887 -184233 91431 253663
11545B53663k2079r2639a07931D5943c1772F5358J36505J79915A05767A7204b31275
$$ 253663 231584 138945 -107931 45943 -31772 65358 201863 381778 105767 17204 -231275
11533a81054a306A33188E1011J15577a76130I5453a45030f4712F1471a20565a8920
$$ -181054 -1306 133188 51011 166588 -176130 95453 -145030 -64712 61471 -120565 -18920
11521g297F2827a53k22545D0545a25762n0602C42743H7456Q1508O5978a50016
$$ -7297 62827 -153 -222698 40545 -125762 -176364 342743 87456 168964 234942 -150016
11509a61977L6732j46173B06888G2734k7580a48096B76436B0631J6793J85884
$$ -161977 -125245 -271418 206888 72734 45154 -148096 276436 20631 37424 223308
11499B23308a14060B43291G1971K12621A36368b58969A61566i4661A3027b67668
$$ 223308 -114060 243291 71971 284592 136368 -258969 161566 -94661 13027 -267668
11488A45713a87830l6495c3447D9529J36792N2459K6697H0176b1232A48445J41635
$$ 145713 -187830 -224325 -33447 49529 186321 238780 265477 80176 -21232 148445 290080
11477B90080A15141g7606A30927m8460J12445H4612g0135H2208C5895L7224K05401
$$ 290080 115141 -77606 130927 82467 194912 84612 -70135 82208 35895 73119 278520
11466B78520a80836k24717A96345p4692b63651j7861A27773L0376L8015q5171
$$ 278520 -180836 -405553 196345 121653 -263651 -281512 127773 158149 196164 110993
11456A10993L0521k0977j2563b07861B03038B1677K31466i4121d5814H882K05587
$$ 110993 141514 120537 107974 -207861 203038 21677 253143 -94121 -45814 8882 214469
11445B14469d35295E999P1860e1497H4812e1079o3724B89715H6099g0543F4400
$$ 214469 -435295 5999 77859 -51497 84812 -51079 -114803 289715 86099 -70543 64400
11433A29625K05973I3429e2384j76172F38b60649B48855a91381a3734j4839F5563
$$ 129625 335598 93429 -52384 -228556 638 -260649 248855 -191381 -13734 -28573 65563
11421D4759f4412k34632B74281B5871R4056F437f0911C2924J99369a1123B97631
$$ 44759 -64412 -299044 274281 25871 119927 6437 -60911 32924 232293 -11123 297631
11409B45275d4024J7796r1799G8216O8047a05545A3587O8491a11848C95956G7719
$$ 245275 -44024 -26228 -118027 78216 146263 -105545 13587 82078 -111848 395956 77719
11397h3973j68532C49156b58180d9286A75959b4227B13827e0095F3802k9144J3150
$$ -83973 -252505 349156 -258180 -49286 175959 -24227 213827 -50095 63802 34658 47808
11386D7808a15077p6130J2999F7937d7070B51296l8100R3743a50641O7750p836
$$ 47808 -115077 -191207 -178208 67937 -47070 251296 213196 306939 -150641 -82891 -90727
11375i0727D4481a53840O3967B95768E6618N6863J4937m8894l012j8725d5180
$$ -90727 44481 -153840 -89873 295768 56618 113481 128418 79524 76512 57787 -45180
11363a73101k89309A9001b21078F3438J65252b06323D7341b3907k70104J26590
$$ -173101 -462410 19001 -221078 63438 228690 -206323 47341 -23907 -294011 -167421
11353a67421o9181B06513a81369P960L8056q5534d6651A63324a59878o839m6373
$$ -167421 -236602 206513 -181369 -173409 -135353 -220887 -46651 163324 -159878 -166717 -213090
11342b13090D489J85659R50a70123E0371J71389b35140B47803f2804o5896k1053
$$ -213090 4489 190148 191098 -170123 50371 221760 -235140 247803 -62804 -128700 -149753
11331a49753B45516A15521O400C4199a40813A39706i9605A2584O3755J96325H9221
$$ -149753 245516 115521 121921 34199 -140813 139706 -99605 12584 76339 272664 89221
11319h461A68753q1341Q6528b65334J18256j57682a48804A26935e8757b2039j22911
$$ -8461 168753 87412 173940 -265334 -147078 -304760 -148804 126935 -58757 -22039 -144950
11308a44950F7961a43556M1843p0671e7794E6572b88303a36122E0256d1393A76982
$$ -144950 67961 -143556 -101713 -172384 -57794 56572 -288303 -136122 50256 -41393 176982
11296E1535a41868n3310A14182b90083O0929Q3108r1707i7033A89172b02957d1475
$$ 51535 -141868 -195178 114182 -290083 -229154 -146046 -237753 -97033 189172 -202957 -41475
11284C56180a87434g8958A21242d918A45845e43176a49202B92272D4034b07308
$$ 356180 -187434 -78958 121242 -4918 145845 -543176 -149202 292272 44034 -207308
11273B59152l7118J19987i4622k69066A13497d79126A53436h5519k21690a11697
$$ 259152 222034 342021 -94622 -363688 113497 -479126 153436 -85519 -307209 -111697
11262A30118b22025O0374D2774a06024j74132A68953j1004b72293C9773d7548
$$ 130118 -222025 -161651 42774 -106024 -280156 168953 157949 -272293 39773 -47548
11251B9487b95109I4670a39867D501a71661m9647J05976A36874b6927C29406b0478
$$ 29487 -295109 94670 -139867 4501 -171661 -221308 -115332 136874 -26927 329406 -20478
11239B09145c0802m2802A36458a71527P3213a6219A29817e656j57167D2394b70341
$$ 209145 -30802 -73604 136458 -171527 -98314 -16219 129817 -5656 -162823 42394 -270341
11227b6635j9158j95897K3312f1553m9370G1068b5534k48540k636i9508l3992
$$ -26635 -45793 -241690 -218378 -61553 -110923 71068 -25534 -274074 -276710 -99508 -133500
11216a33500D1624a78064J9589A10468d5199B26385D6918b26411H5465c8987k41768
$$ -133500 41624 -178064 -158475 110468 -45199 226385 46918 -226411 85465 -38987 -280755
11205b80755B01291o1926M8582C6487K48650b7462k6307B02452J51507a14230
$$ -280755 201291 139365 187947 36487 285137 -27462 -53769 202452 353959 -114230
11194B3864K09272C0760K47884c66592a13899n9648C480N497Q3183d8223m2371
$$ 23864 233136 30760 278644 -366592 -113899 -173547 3480 8977 92160 -48223 -90594
11183i0594C1128a52292g2263j23491i6116A21650c0061A90195q1162a78507B8102
$$ -90594 31128 -152292 -72263 -195754 -96116 121650 -30061 190195 109033 -178507 28102
11171b75015D7226f1619C7812g6395A82548a5128I4277J70409C3554O5194a93308
$$ -275015 47226 -61619 37812 -76395 182548 -15128 94277 264686 33554 98748 -193308
11159c264j76380j9814b6433j97805e2617C26413i7760p4840b3287C1467d5974
$$ -3264 -179644 -199458 -26433 -224238 -52617 326413 -97760 -172600 -23287 31467 -45974
11147a76722g2490K3028A49018o5811b99600A59335f7820m7159A13380I581L6851
$$ -176722 -72490 -49462 149018 83207 -299600 159335 -67820 -114979 113380 9581 46432
11136D6432a82013f8710j54656M2052D3853K64702c69227b1914p5951D083c44556
$$ 46432 -182013 -68710 -223366 -181314 43853 308555 -369227 -21914 -97865 4083 -344556
11124F3203K55400c4649o0240A81757Q4578c9449B28781q4725H467b82904h8059
$$ 63203 318603 -34649 -94889 181757 266335 -39449 228781 144056 8467 -282904 -88059
11112b19737b1613B34879E0283L04157D8140M37837C9524N8347m1754J38772b8268
$$ -219737 -21613 234879 50283 354440 48140 485977 39524 97871 56117 194889 -28268
11100B2697K90951j41775D0826K28106c85403D07992j5094b07919M1175B06622
$$ 22697 313648 171873 40826 268932 -385403 407992 392898 -207919 -166744 206622
11089D7047J91163A17303k0871l7538J32294e7023K0533a2044B92601D0345K51066
$$ 47047 238210 117303 96432 58894 191188 -57023 -36490 -12044 292601 40345 291411
11078B91411r1077m0328J8885g5224I818g8521B34798m236m2122K5069B7900J4344
$$ 291411 200334 160006 178891 -75224 9818 -78521 234798 230562 188440 213509 27900 42244
11066D2244J16462A1159a96073M3685B4274L49416b6947B80800A17520K10043
$$ 42244 158706 11159 -196073 -152388 24274 373690 -26947 280800 117520 327563
11056C27563r0169K6071J57998O7622A24429L04798p9534J84230J27877p3308
$$ 327563 237394 263465 421463 489085 124429 429227 349693 533923 661800 588492
11046E88492j04477I1096J48048K13385M0715b6897B61650Q0338n7802K84685
$$ 588492 484015 91096 239144 452529 493244 -26897 261650 341988 284186 568871
11036E68871k44377J54273k32241L05574j12022E9657L27577M00711k97727O7091
$$ 568871 324494 478767 246526 552100 440078 59657 387234 787945 490218 557309
11026E57309p9492A50307M66600j18245R6803k2258j62466A72212a14360C49346
$$ 557309 477817 150307 616907 498662 595465 573207 410741 172212 -114360 349346
11015E07392j74655j3933R8938A1845L37134O6512A81896K48103E0392K54545
$$ 507392 332737 318804 417742 11845 348979 415491 181896 429999 50392 304937
11005C04937P3281j71450M02249A92366K27442N4585N9841M8983P5610A81686
$$ 304937 378218 206768 609017 192366 419808 474393 534234 583217 658827 181686
10994B25898K21113j58025K72843j14598l8246K67054A48807J16408N32276k47193
$$ 225898 447011 288986 561829 447231 408985 676039 148807 265215 797491 550298
10984E50298n1305K69115k20741N3528j29141J70874j19227L14723N9233k4969
$$ 550298 498993 768108 547367 600895 471754 642628 523401 838124 897357 872388
10974H72388K53721k2522k34558M32214J66994J82737m3131j70698r4214K72812
$$ 872388 1126109 1103587 869029 1301243 1468237 1650974 1607843 1437145 1342931 1615743
10964A615743j3218j05973l70946r7849k17758K38665LR503J91708q4085j10888
$$ 1615743 1602525 1496552 1125606 1027757 809999 1048664 1048667 1058170 1249878 1165793 1054905
10953A054905L39096k49162l19808K24683j27807j39358k63826K2837o1466n5166
$$ 1054905 1394001 1144839 825031 1049714 921907 782549 518723 541560 480094 424928
10943D24928J75760k01071A27435J96844j62098B3197K24819o1467b76729o8666
$$ 424928 600688 399617 127435 324279 162181 23197 248016 186549 -276729 -345395
10933c45395H6013j5205M36604G8456b86047f965D1518M11276g9526o0711K7296
$$ -345395 86013 70808 507412 78456 -286047 -6965 41518 452794 -79526 -140237 -112941
10922a12941j41985C82796e8953I6316b31479A24197N7712J29893o3430f0787
$$ -112941 -254926 382796 -58953 96316 -231479 124197 181909 311802 248372 -60787
10911i3998F4118B5961A2788c09173G5861J147b94826I4851N1821i5090m0571
$$ -93998 64118 25961 12788 -309173 75861 77008 -294826 94851 146672 -95090 -135661
10900a35661F0936f6846B74629d01922M4315A95443C9658O1786m7826J14692b49396
$$ -135661 60936 -66846 274629 -401922 -357607 195443 39658 101444 53618 168310 -249396
10888A55146G6194a0260A17156j7289b36311R8156j51924i3512A21774n4466a94416
$$ 155146 76194 -10260 117156 99867 -236311 -138155 -290079 -93512 121774 67308 -194416
10876F9341J66720a71335k66896J96203A0887g2061E8574k310J6717a8192A18774
$$ 69341 236061 -171335 -438231 -242028 10887 -72061 58574 56264 72981 -18192 118774
10864C15419a77818e6945B26023f4532p3757A76299a56124B40097q9453l9074
$$ 315419 -177818 -56945 226023 -64532 -138289 176299 -156124 240097 150644 111570
10854A11570i177A31729e5604B2390b94399f8775j35105C608i3835A06159j8418
$$ 111570 -9177 131729 -55604 22390 -294399 -68775 -203880 3608 -93835 106159 87741
10843H7741J9524J22303C3336J03559d13954A82215b94775B238K02847A948K62732
$$ 87741 107265 229568 33336 136895 -413954 182215 -294775 2238 205085 1948 264680
10832B64680G954a18045I759c6714D6796d9363p7315A68364F9279D901a33239
$$ 264680 7954 -118045 9759 -36714 46796 -49363 -126678 168364 69279 4901 -133239
10820F2595j3060A3754a803j29019A31337l2639J4114a85712e1484i081l5243
$$ 62595 49535 13754 -1803 -130822 131337 98698 112812 -185712 -51484 -9081 -44324
10809d4324o2790A29385J9747Q360J21963c82873J75970A1696Q3176D0920a21704
$$ -44324 -107114 129385 149132 157492 279455 -382873 -206903 11696 94872 40920 -121704
10797B4352R2306l5477b13513B13015A2501e5476A03829P016h5084j56787a12755
$$ 24352 116658 81181 -213513 213015 12501 -55476 103829 110845 -85084 -241871 -112755
10785a90768H6764o551a1971n69491K06645A6188b95423J46517a9490A67476g4141
$$ -190768 86764 80213 -11971 -581462 -374817 16188 -295423 -148906 -19490 167476 -74141
10773F836b20024B54800r5316J04686A9358d8883l6433j65964o8908H6457c59607
$$ 6836 -220024 254800 159484 264170 19358 -48883 -85316 -251280 -320188 86457 -359607
10761h5903K6328b4138G9053A3396K62382a05875A48545g8859B27193m0711q185
$$ -85903 -59575 -24138 79053 13396 275778 -105875 148545 -78859 227193 186482 178297
10750A78297p5691O4341a1423B91126A17878m0978a24537A62251I740a47221k9789
$$ 178297 102606 166947 -11423 291126 117878 76900 -124537 162251 9740 -147221 -177010
10739a77010k2768i9777L3978j04987F692J06092a46708e334l01277A54650o0422
$$ -177010 -199778 -99777 -65799 -170786 6692 112784 -146708 -5334 -306611 154650 94228
10728I4228f6895C0821a70571A73323c6537n2816G6286J01903a88402p3347h5187
$$ 94228 -66895 30821 -170571 173323 -36537 -89353 76286 178189 -188402 -261749 -85187
10716A3013g9874E2350b35886a9071l5448l99544A19507c83606J79692i2795c9143
$$ 13013 -79874 52350 -235886 -19071 -54519 -454063 119507 -383606 -203914 -92795 -39143
10704e5792j08753f69j67061f1923B754b584j18129a3050r3772A2247J61244a49512
$$ -55792 -164545 -669 -167730 -61923 2754 -2584 -120713 -13050 -106822 12247 173491 -149512
10691F8544a21197I3981d92670K37059P1116m802Q6176c5006D44162c90200d9299
$$ 68544 -121197 93981 -492670 -255611 -184495 -189297 -103121 -35006 444162 -390200 -49299
10679C5244K18136a66567M5195J7249A05936a14068G4309b32639l2065G7160J21410
$$ 35244 253380 -166567 -121372 -104123 105936 -114068 74309 -232639 -264704 77160 198570
10668A98570J33475b65074j4823d6426I5763c40830N8493A10905a61941d3055
$$ 198570 332045 -265074 -279897 -46426 95763 -340830 -282337 110905 -161941 -43055
10657b75213K8964A74512a78978g1265J7321F8413b07293j84787a54484d4504
$$ -275213 -246249 174512 -178978 -71265 -53944 68413 -207293 -392080 -154484 -44504
10646a6394F079J497h6826F8987a82230P0144N3029l12655A05013h8133c4520
$$ -16394 6079 7576 -86826 68987 -182230 -112086 -59057 -371712 105013 -88133 -34520
10634f7808a7730A76538F9267J93751A25665c5476l01386N1234c6115C75173c91476
$$ -67808 -17730 176538 69267 263018 125665 -35476 -336862 -285628 -36115 375173 -391476
10622B53451e9420n9947H3962R1733B2342i2267A24472J36805b53776a26031j12514
$$ 253451 -59420 -119367 83962 175695 22342 -92267 124472 261277 -253776 -126031 -238545
10611b38545l48545h3076J1405I2067a88747k1900D6140a59887L243j26088D83534
$$ -238545 -587090 -83076 -71671 92067 -188747 -210647 46140 -159887 -156644 -282732 483534
10599a75302K3291k97728A50331a95946A41393b8581m1640J2359A001h7813j47090
$$ -175302 -152011 -449739 150331 -195946 141393 -28581 -70221 -57862 1001 -87813 -234903
10588b34903K6872G4378c8371F441J01819R8092e4804A11153J87210a63664g7455
$$ -234903 -208031 74378 -38371 6441 108260 206352 -54804 111153 298363 -163664 -77455
10576D0759J73224a34913D4721Q2060E6130a08653A0240K60081c56923L4239i6329
$$ 40759 213983 -134913 44721 126781 56130 -108653 10240 270321 -356923 -322684 -96329
10564a12260L1694B01917q3270c34070J03707a8944j68400A08494c27641N7188
$$ -112260 -80566 201917 118647 -334070 -230363 -18944 -187344 108494 -327641 -270453
10554b70453B2187a88852I9162R8205d83796C42701b8641k447j98001E970a16767
$$ -270453 22187 -188852 99162 197367 -483796 342701 -28641 -31088 -229089 5970 -116767
10542C90297b9829k16179R3869A64951a15098K2570M2081B37369a39072B09471
$$ 390297 -29829 -246008 -152139 164951 -115098 -92528 -50447 237369 -139072 209471
10531I0394J51864Q385a67088j84989N8804D1577L5111B8255N5086A5272b89112
$$ 90394 242258 250643 -167088 -352077 -293273 41577 76688 28255 83341 15272 -289112
10519f4862r5098A00633M681J47273i7353A10947e2546B42833G8591a06682j47010
$$ -64862 -159960 100633 105314 252587 -97353 110947 -52546 242833 78591 -106682 -253692
10508b53692R6606D1969d07368a47726n3194C81684a61851j04340A3639K30590
$$ -253692 -157086 41969 -407368 -147726 -200920 381684 -161851 -266191 13639 244229
10498B44229a08401D7759f4809A56574b71477C26536E6424i0891F6811a26804
$$ 244229 -108401 47759 -64809 156574 -271477 326536 56424 -90891 66811 -126804
10487c206C29492c3957k96953G2235Q2605M2934K3363J03302A61231J74959Q0469
$$ -3206 329492 -33957 -330910 72235 154840 197774 221137 324439 161231 336190 416659
10476D16659C174J18565c23252I174Q4577i5908M3703m7146k09947Q7361g9910
$$ 416659 3174 121739 -323252 9174 93751 -95908 -52205 -99351 -309298 -221937 -79910
10464a12828o774k15496a12348a4935D1148N7740a63604A29464E3187J04462b56172
$$ -112828 -119602 -335098 -112348 -14935 41148 98888 -163604 129464 53187 157649 -256172
10452H4295i5968b709E916J13842i8385k681F6140C2954b02266A96045B1395H9
$$ 84295 -95968 -2709 5916 119758 -98385 -101066 66140 32954 -202266 196045 21395 89
10439e6826C02964b09125L3600B28753a29135j07650A77207p6104a46101C17206
$$ -56826 302964 -209125 -175525 228753 -129135 -236785 177207 101103 -146101 317206
10428A96327f4411j43149k3567e407B12877l3325a3052j02682N2489j44597p3949
$$ 196327 -64411 -207560 -231127 -5407 212877 179552 -13052 -115734 -63245 -207842 -281791
10417b81791M315h7171D7402b43541A85775a74427e6706k3470A9324a19111M8014
$$ -281791 -277476 -87171 47402 -243541 185775 -174427 -56706 -80176 19324 -119111 -71097
10406g1097n14635A26181h5195l0764l20202A30013B4717J77340b12475Q3663
$$ -71097 -585732 126181 -85195 -115959 -436161 130013 24717 202057 -212475 -128812
10396a28812A52074E480d4896A39628a0377A12599P3978i5922B79641H3684b07101
$$ -128812 152074 5480 -44896 139628 -10377 112599 186577 -95922 279641 83684 -207101
10384C43487r1510e0853F6474i4732A11115Q2744b24356D1223i3352B02158G7641
$$ 343487 251977 -50853 66474 -94732 111115 193859 -224356 41223 -93352 202158 77641
10372a07425B70703p0484k9077n3297g1840C6972b8954B04053J09278e515C59160
$$ -107425 270703 200219 171142 117845 -71840 36972 -28954 204053 313331 -5515 359160
10360B99662L0428O1928j62036a77236B04196a10812A77426K1534d58163D2620
$$ 299662 330090 392018 229982 -177236 204196 -110812 177426 198960 -458163 42620
10349a33706B34929J0460j22552J45845j19936J18380a37761B89187J9412A2015
$$ -133706 234929 245389 122837 268682 148746 267126 -137761 289187 308599 12015
10338B54663A18470K13317a51559A38176a60955B97391q0594g5647m7688C703
$$ 254663 118470 331787 -151559 138176 -160955 297391 216797 -75647 -123335 3703
10327A38411R4461C6880N6113l6048a8866B71206I1950K31434d3068o1600I2945
$$ 138411 232872 36880 92993 56945 -18866 271206 91950 323384 -43068 -104668 92945
10315c4116A75855A0958b17154d4826E3610a74158d7307k67828a02082a6448A01145
$$ -34116 175855 10958 -217154 -44826 53610 -174158 -47307 -315135 -102082 -16448 101145
10303c9839j23104I4320a70747C9656o969J08226J47810c52917N401C9370K3530
$$ -39839 -162943 94320 -170747 39656 32687 140913 288723 -352917 -347516 39370 62900
10292F2900M0529b40488a7282k2406A08420g1950j76421a09176k3366L9859l0174
$$ 62900 103429 -240488 -17282 -39688 108420 -71950 -248371 -109176 -132542 -92683 -122857
10281a22857e9940p6847b9593H6182a99928A06758a53940k7271k51262a0443n5334
$$ -122857 -59940 -136787 -29593 86182 -199928 106758 -153940 -181211 -432473 -10443 -65777
10270f5777A4000M5731k0887L7887d32673d5676n8823a2914C3130f5444A0422
$$ -65777 14000 59731 38844 76731 -432673 -45676 -104499 -12914 33130 -65444 10422
10258d3977C8385J90166r9585M44145A34250a18518A78988a14551E1194b84A54449
$$ -43977 38385 228551 128966 573111 134250 -118518 178988 -114551 51194 -284 154449
10246C0742J11081n6600J45474a55816H3729j1732g9581j5573G7645b87401B19176
$$ 30742 141823 85223 230697 -155816 83729 71997 -79581 -95154 77645 -287401 219176
10234c3392j92667E2162J11756G6186f3364l2744p7913O1509C05487b1163p2252
$$ -33392 -226059 52162 163918 76186 -63364 -96108 -174021 -112512 305487 -21163 -93415
10223i3415I09g3127A35651b24679F9933a59369J1773L4420c3415k6530A02663
$$ -93415 909 -73127 135651 -224679 69933 -159369 -147596 -113176 -33415 -59945 102663
10211h4976B71617d06721I3234a36930b2513k07621P8733D7804g1015I8280b05920
$$ -84976 271617 -406721 93234 -136930 -22513 -230134 -151401 47804 -71015 98280 -205920
10199e9646E0866K50545B574K4526c36871B17377I9494h9160a6897Q148E2840
$$ -59646 50866 301411 2574 27100 -336871 217377 99494 -89160 -16897 -8749 52840
10187a16486J0873l1394j69420M5324B0866b34662J09638A57064B5820a35947
$$ -116486 -105613 -137007 -306427 -261103 20866 -234662 -125024 157064 25820 -135947
10176a34949c0714m1887A5534a69984n639O0142H4388J0586e01762b4645A08900
$$ -134949 -30714 -72601 15534 -169984 -175623 -115481 84388 94974 -501762 -24645 108900
10164b33413g6608J670j05696c7242A03558A742a94232M7600I0035K1350g6161
$$ -233413 -76608 -74938 -180634 -37242 103558 1742 -194232 -146632 90035 111385 -76161
10152E0717b36259B52442A722e48478c2908q451A76876c0049k19259B37768c0737
$$ 50717 -236259 252442 1722 -548478 -32908 -41359 176876 -30049 -249308 237768 -30737
10140b58585g0283A25059f6943J9757F5319a39094D6977b3337k87954A7859L8655
$$ -258585 -70283 125059 -66943 -47186 65319 -139094 46977 -23337 -311291 17859 56514
10129E6514L2253d1060q3769N9320I1336J19908A05307c29398a30889f890j37069
$$ 56514 88767 -41060 -124829 -65509 91336 211244 105307 -329398 -130889 -6890 -143959
10118a43959C1663c8318k19056H1875N5491a41923a1458G9339L9268E5570c2958
$$ -143959 31663 -38318 -257374 81875 137366 -141923 -11458 79339 118607 55570 -32958
10106g6363b2234R385j29557E0837a44598g891k45924A04052C6099a24331H1125
$$ -76363 -22234 -12849 -142406 50837 -144598 -7891 -253815 104052 36099 -124331 81125
10094e0314a1333j90991M3079C18228a49363e9044A65451e3339r4971A14206f0022
$$ -50314 -11333 -202324 -159245 318228 -149363 -59044 165451 -53339 -148310 114206 -60022
10082a03833n951b6016C9540L9393a82728k9580F4409K55563c8391r3165j00732
$$ -103833 -109784 -26016 39540 78933 -182728 -212308 64409 319972 -38391 -131556 -232288
10071b32288A22047a6307D6715h0454r7022N3057l8123r1806A80361q9032J3884
$$ -232288 122047 -16307 46715 -80454 -177476 -124419 -162542 -254348 180361 91329 105213
10060A05213a78937k21021H6545B4826N3533a46042A29606a45225A54112d2790
$$ 105213 -178937 -399958 86545 24826 78359 -146042 129606 -145225 154112 -42790
10049a57443j38174b6910j78042b6441A14565a66861A43054A8015c99968I1797
$$ -157443 -295617 -26910 -204952 -26441 114565 -166861 143054 18015 -399968 91797
10038a14453A49179R9767A10524A8918a69403B85718f5081D0419i2693n6563e5016
$$ -114453 149179 248946 110524 18918 -169403 285718 -65081 40419 -92693 -149256 -55016
10026B6598J81941C2932N0518h0815l13752A55933a16195r9377F7326b43010d3634
$$ 26598 208539 32932 83450 -80815 -394567 155933 -116195 -215572 67326 -243010 -43634
10014c58314B02611h5295a2550k43219f886o9931D4578A0616c66030B3692c71005
$$ -358314 202611 -85295 -12550 -255769 -6886 -76817 44578 10616 -366030 23692 -371005
10002B37458A3831b74012D05930d9278k16332K1269g7235l8634I7922E126R9820
$$ 237458 13831 -274012 405930 -49278 -265610 -244341 -77235 -115869 97922 5126 104946
9991A04946j2671p862c61373J53529H7970m3310a54438K4030j31209F6908a44049
$$ 104946 92275 84413 -361373 -207844 87970 44660 -154438 -130408 -261617 66908 -144049
9979d11048J20214D48110a50886N9836C13821D6218c51416h5868A6550e603o4945
$$ -411048 -290834 448110 -150886 -91050 313821 46218 -351416 -85868 16550 -5603 -70548
9968g0548I1796b49427L7916A08489A2877b93639R264k7703e7853D0016Q7194
$$ -70548 91796 -249427 -211511 108489 12877 -293639 -284375 -312078 -57853 40016 127210
9957A27210e9337B2123h7686d3019A06408O2950b6521A89141a43678k9161M1011
$$ 127210 -59337 22123 -87686 -43019 106408 169358 -26521 189141 -143678 -172839 -131828
9946a31828M9256J3801j2967B24553I453L5686b462A66474b77719B9295R0742
$$ -131828 -82572 -68771 -81738 224553 9453 45139 -2462 166474 -277719 29295 120037
9935A20037b34012A69656a25066M0144h992I5400K2513a46629C0144M3090d7542
$$ 120037 -234012 169656 -125066 -84922 -8992 95400 117913 -146629 30144 73234 -47542
9923a91239M6470C03739h0054E5242a80995G5525b40547n2371E1141a89105L4282
$$ -191239 -144769 303739 -80054 55242 -180995 75525 -240547 -292918 51141 -189105 -154823
9912a54823d2102A95602E3836J33371J3993h5230C2064d9184j30199A97809h4274
$$ -154823 -42102 195602 53836 187207 201200 -85230 32064 -49184 -179383 197809 -84274
9900A9350L5114b23836g2737k70228A30132C5265h0179A49705R0618h3492l79332
$$ 19350 54464 -223836 -72737 -342965 130132 35265 -80179 149705 240323 -83492 -462824
9889d62824a64110A55150a61702A37078c3478C8517g9453A67963C0606A3020N085
$$ -462824 -164110 155150 -161702 137078 -33478 38517 -79453 167963 30606 13020 18105
9878A8105J18366h8412l29123a60036j80795c0332k10043R5317m9094A841P1129
$$ 18105 136471 -88412 -417535 -160036 -340831 -30332 -240375 -145058 -194152 1841 72970
9867G2970L15042a62022k01866a54622E6318a34732o7331I7932a09732m01559
$$ 72970 388012 -162022 -363888 -154622 56318 -134732 -202063 97932 -109732 -511291
9857e11291f2106j55128e376A42810b84288a26630j24349B5830d06033L0054a37104
$$ -511291 -62106 -217234 -5376 142810 -284288 -126630 -250979 25830 -406033 -375979 -137104
9845H5525b17999M1736h3302A72470c4660a6545j2787j63275j00730i4955j43045
$$ 85525 -217999 -176263 -83302 172470 -34660 -16545 -29332 -192607 -293337 -94955 -238000
9834b38000e2641F5549K4211O5436K57562a67110A34398K7308c7289j28780a3600
$$ -238000 -52641 65549 89760 155196 412758 -167110 134398 161706 -37289 -166069 -13600
9822D7777b0478j12691A54660i5120p1207j74786A25750E9270J33450b08287d8413
$$ 47777 -20478 -133169 154660 -95120 -166327 -341113 125750 59270 192720 -208287 -48413
9810b6517k7519k40570f7470j25494C40777j21596E0253a65232b8612D1746P7366
$$ -26517 -54036 -294606 -67470 -192964 340777 219181 50253 -165232 -28612 41746 119112
9799A19112f4211p7205A38939Q031a76175n0282Q6816b3281k27411C9568J52867
$$ 119112 -64211 -141416 138939 146970 -176175 -226457 -139641 -23281 -250692 39568 192435
9788A92435C6371b07012F3545m319c1514A79983E7628K04989a25320C19578a36466
$$ 192435 36371 -207012 63545 59226 -31514 179983 57628 262617 -125320 319578 -136466
9776B57738G632J60370a82644M503J2954C1607J21201J1804g0013b8072n10290
$$ 257738 7632 168002 -182644 -178141 -165187 31607 152808 164612 -70013 -28072 -538362
9765e38362A74292h6044l03989a25079L7696j27813D1900J17658o947l7597l2360
$$ -538362 174292 -86044 -390033 -125079 -87383 -215196 41900 159558 152611 115014 82654
9754H2654b04075A2443a81047P3666g12r8155l60384i6629J036a9400k1347J2213
$$ 82654 -204075 12443 -181047 -107381 -712 -98867 -459251 -96629 -95593 -19400 -40747 -28534
9742b8534E2264b80569k8359A45901L6441R72b44720a12105k35131J51492M1926
$$ -28534 52264 -280569 -308928 145901 182342 183314 -244720 -112105 -347236 -195744 -153818
9731a53818b4927C5870b15491E0341C619i6966l4275k95531a36177I1183a30739
$$ -153818 -24927 35870 -215491 50341 3619 -96966 -131241 -426772 -136177 91183 -130739
9719a75278D21218A57796p6036d4482j84371A68217p5474a75562j12631a878l34765
$$ -175278 421218 157796 81760 -44482 -228853 168217 92743 -175562 -288193 -1878 -336643
9708c36643a8991G4287b4619A13422M8134d6144j31142m4996L7212m8078a9319
$$ -336643 -18991 74287 -24619 113422 161556 -46144 -177286 -222282 -185070 -233148 -19319
9696a13954b6196n1397n5612G8362J07515a45021p006j67149L3966J22456G899
$$ -113954 -26196 -77593 -133205 78362 185877 -145021 -152027 -319176 -285210 -162754 7899
9684e2805j78201L4597f2327e486j9628C62662j57734b58180o7520a47888G9192
$$ -52805 -231006 -196409 -62327 -5486 -25114 362662 204928 -258180 -325700 -147888 79192
9672c04727A6215a31434E7036a89225A49252a61621N6031A37539d0924k67463
$$ -304727 16215 -131434 57036 -189225 149252 -161621 -105590 137539 -40924 -308387
9662c08387P3630f2416k3276B1540J67464a13947D9169a9824k03953A15797d63838
$$ -308387 -234757 -62416 -85692 21540 189004 -113947 49169 -19824 -223777 115797 -463838
9650e6406b02k15039C3114e09223G0320d19882A72238K5083c34218a46355B43597
$$ -56406 -202 -215241 33114 -509223 70320 -419882 172238 197321 -334218 -146355 243597
9638a1416k11279P7970E3641g4078B4429J44502a44242d0985l8501K2773k93045
$$ -11416 -222695 -144725 53641 -74078 24429 168931 -144242 -40985 -79486 -56713 -349758
9627c49758A84078o5781L4929e5535o2719c3700I0620I098N4199e9004A33902
$$ -349758 184078 118297 153226 -55535 -118254 -33700 90620 9098 63297 -59004 133902
9615D665M3485i5908B81722i2994k30309g2516k13878A3976P1435g1978k9509
$$ 4665 48150 -95908 281722 -92994 -323303 -72516 -286394 13976 85411 -71978 -101487
9604a01487n5105L5691k10558k01001g0295k93751A00780a28789j45839P5029
$$ -101487 -156592 -120901 -331459 -532460 -70295 -364046 100780 -128789 -274628 -199599
9594a99599A19110b70187I7260J86669a18682G5191b25091J03835k55911B74300
$$ -199599 119110 -270187 97260 283929 -118682 75191 -225091 -121256 -377167 274300
9583a50315D4047P3030f7030q1490l4052J7076A26559K9130O845c55736H1841
$$ -150315 44047 117077 -67030 -148520 -182572 -165496 126559 155689 162534 -355736 81841
9571c8088M708j04859r737D6089R8074J65341g1444E2585K10283k2748b03950
$$ -38088 -33380 -138239 -147976 46089 144163 309504 -71444 52585 262868 240120 -203950
9559b04425A35237b38360d7530C4295b52508F980b54665r6413R9760e8641J3995
$$ -204425 135237 -238360 -47530 34295 -252508 6980 -254665 -351078 -251318 -58641 -44646
9548d4646A29193b58506Q0720h68r5817G456a19138A1683h7181a3073k21195j89205
$$ -44646 129193 -258506 -177786 -868 -96685 7456 -119138 11683 -87181 -13073 -234268 -423473
9536d23473e8968j94662j62420Q2104M4254R7811f1539a195H7500R283b04192
$$ -423473 -58968 -253630 -416050 -333946 -289692 -191881 -61539 -1195 87500 96783 -204192
9524a56158l965A25302d1361b014B3989d9866j74638C7435a225j84490d9952p9780
$$ -156158 -160123 125302 -41361 -2014 23989 -49866 -224504 37435 -1225 -185715 -49952 -129732
9512a29732M3892p774j78522J32465k0036j77321B89032C620K155L4567a43250
$$ -129732 -85840 -93614 -272136 -139671 -159707 -337028 289032 3620 5775 40342 -143250
9500b22445A15948a20058e9221A99568b23253A00713K86566A84668a49724B60856
$$ -222445 115948 -120058 -59221 199568 -223253 100713 387279 184668 -149724 260856
9489c02165l234M7239B37866d6122E5268a3168G530d27142B5136c58400A12017
$$ -302165 -305399 -258160 237866 -46122 55268 -13168 7530 -427142 25136 -358400 112017
9477e5416B1210c14988A8542I092d5386m0266F7297c4869j62014f4138A22637
$$ -55416 21210 -314988 18542 9092 -45386 -85652 67297 -34869 -196883 -64138 122637
9465A8554a27886G6727M0732H135K8347a425p2262j37832g811j69982A2827K66895
$$ 18554 -127886 76727 117459 8135 36482 -1425 -73687 -211519 -7811 -177793 12827 279722
9453B79722a25297G3353h0182G3659R7046b41406a8496j65327n2084A17371a99496
$$ 279722 -125297 73353 -80182 73659 170705 -241406 -18496 -183823 -235907 117371 -199496
9441c39406j36189a69087j00443i7911b7704j73472I9063M6611l9971a72708A75517
$$ -339406 -475595 -169087 -269530 -97911 -27704 -201176 99063 145674 105703 -172708 175517
9429g6307n1115I3879b82400f2555k02900c3872k18682R556G4021L7866l7514
$$ -76307 -127422 93879 -282400 -62555 -265455 -33872 -252554 -242998 74021 111887 74373
9418G4373b83602j43025B36001b75982J36447a0474k69125c2498j02862G9784
$$ 74373 -283602 -426627 236001 -275982 -139535 -10474 -279599 -32498 -135360 79784
9407b50947m0810J36139A30403J7439o5029a66706d8190A54368J39464b6161j52694
$$ -250947 -291757 -155618 130403 147842 82813 -166706 -48190 154368 293832 -26161 -178855
9396a78855b553j55163F2484e1052p5442k44068D93900b4964I9798a67265f603
$$ -178855 -2553 -157716 62484 -51052 -126494 -370562 493900 -24964 99798 -167265 -6603
9384B77393j19557B1655N862b83747q9875J60236B1454a10273I351a13963A37301
$$ 277393 157836 21655 27517 -283747 -373622 -213386 21454 -110273 9351 -113963 137301
9372E3604a02047A37681e6019J2804E0025a3541k3822F4495a91490a9104r4275
$$ 53604 -102047 137681 -56019 -43215 50025 -13541 -37363 64495 -191490 -19104 -113379
9361a13379A30608b6110C69456a7707o1659A17192a74778j99939J34299F9226
$$ -113379 130608 -26110 369456 -17707 -79366 117192 -174778 -374717 -240418 69226
9350A55674j7108a24348B56484a85899H3072a371j28054j27867b1971k22143d7178
$$ 155674 138566 -124348 256484 -185899 83072 -1371 -129425 -257292 -21971 -244114 -47178
9338a15988A25626N9728d2674o5571R690b0109o3014C3720a59364f0737H5294
$$ -115988 125626 185354 -42674 -108245 -98555 -20109 -83123 33720 -159364 -60737 85294
9326A03900E1470B5545a05000E7140N9570a10510k13542A53169a49058A78887
$$ 103900 51470 25545 -105000 57140 116710 -110510 -324052 153169 -149058 178887
9315a59237J3658E7461q412g4561F8429i7538j22809A66518p9217Q0339a69946
$$ -159237 -145579 57461 49049 -74561 68429 -97538 -220347 166518 87301 167640 -169946
9303a83031j99644C3066a05097l76668g2854E1600c63946h1644J048A2048J03046
$$ -183031 -382675 33066 -105097 -481765 -72854 51600 -363946 -81644 -80596 12048 115094
9292A15094i3658b2934j19467C6728A513a46203j26093M7916B08529A1085Q6886
$$ 115094 -93658 -22934 -142401 36728 1513 -146203 -272296 -224380 208529 11085 97971
9281I7971J6245c21484D357b44935A70272a24164d7962A96540E0627F433e4603
$$ 97971 114216 -321484 4357 -244935 170272 -124164 -47962 196540 50627 6433 -54603
9269b49290O3083Q0807q6315f8325C7813K13358d07897a06279p9767H8493B7753
$$ -249290 -186207 -105400 -191715 -68325 37813 251171 -407897 -106279 -186046 88493 27753
9257C08722e8915j39380A12859K5477j6556D9343b33613C33532a42363J8449a868
$$ 308722 -58915 -198295 112859 138336 121780 49343 -233613 333532 -142363 -123914 -1868
9245a47533o6385A52498a91320h0300n2620I6920a73411a6987r5671A16285b73921
$$ -147533 -213918 152498 -191320 -80300 -132920 96920 -173411 -16987 -112658 116285 -273921
9233b07736A54408A4969K61304H8121a63891K0958J2858O3817R752A6551b45271
$$ -207736 154408 14969 276273 88121 -163891 -142933 -130075 -66258 -56506 16551 -245271
9221I2566a08383j36757B70667e1230k3603B3933d3343l9155j69903M3163B3630
$$ 92566 -108383 -245140 270667 -51230 -74833 23933 -43343 -82498 -252401 -209238 23630
9209C2106d10915a26064A7558K16814i836A81435A4242b93055M1561f4870j69843
$$ 32106 -410915 -126064 17558 234372 -9836 181435 14242 -293055 -251494 -64870 -234713
9198b34713a6476k30215P3845E4398L02844a76410A42357A5100K7640h9528j36864
$$ -234713 -16476 -246691 -172846 54398 357242 -176410 142357 15100 42740 -89528 -226392
9187b26392j4676A47886k0678a17708d0040b867n4976k30064C6371N2834f7308
$$ -226392 -241068 147886 127208 -117708 -40040 -2867 -57843 -287907 36371 89205 -67308
9175g7793E0237b14696A90143g6415K7008k13328C60156a14750n7525k04202d8847
$$ -77793 50237 -214696 190143 -76415 -49407 -262735 360156 -114750 -172275 -376477 -48847
9163B34485H7015d37471A3388a81934k6297n6387K4656E0768a8396B39945b25510
$$ 234485 87015 -437471 13388 -181934 -208231 -264618 -239962 50768 -18396 239945 -225510
9151A2550g5027a9254n2736I7935k8358a04893r5779B40319l0574a96559D7398
$$ 12550 -75027 -19254 -71990 97935 69577 -104893 -200672 240319 209745 -196559 47398
9139b50935J14890b2616D54f4481B12814e3033C5370K06958F4819a71656P6378
$$ -250935 -136045 -22616 454 -64481 212814 -53033 35370 242328 64819 -171656 -95278
9128i5278j27351A8159L0654K575a72238p8720F8332d3240A44789a77253d4470
$$ -95278 -222629 18159 48813 51388 -172238 -250958 68332 -43240 144789 -177253 -44470
9116a05672o6690k65801A72770b8394j44293B40292L722b26396o1354a18612M7166
$$ -105672 -172362 -438163 172770 -28394 -172687 240292 244014 -226396 -287750 -118612 -71446
9105g1446r8666j32587A43717a39358M4088b7091H198N5365P664a11152n5542
$$ -71446 -170112 -302699 143717 -139358 -95270 -27091 8198 63563 71227 -111152 -166694
9094a66694E665h2732B42752b02219o4381b7338l5595j02246c6331n5976j69029
$$ -166694 5665 -82732 242752 -202219 -266600 -27338 -62933 -165179 -36331 -92307 -261336
9083b61336a30604j36459h3818k9341N5082F7163i3289G2963j561d1646m3943
$$ -261336 -130604 -267063 -83818 -113159 -58077 67163 -93289 72963 71402 -41646 -85589
9072h5589M1181B0744a2428j50707k3368N3554A7466h4842j55653k7930c94G7479
$$ -85589 -44408 20744 -12428 -163135 -186503 -132949 17466 -84842 -240495 -268425 -394 77479
9059H6068B7234D034J16329N0762A6132b55130A09083b31170a3728j39031Q055
$$ 86068 27234 4034 120363 171125 16132 -255130 109083 -231170 -13728 -152759 -144704
9048a44704l6237j7384e7709G7810b9800A10213J72567H3901d72495g1527L0535
$$ -144704 -180941 -198325 -57709 77810 -29800 110213 282780 83901 -472495 -71527 -40992
9037d0992b0471k52863a22239A34170b05635e7583B19794r4749P3983g0783K8105
$$ -40992 -20471 -273334 -122239 134170 -205635 -57583 219794 125045 199028 -70783 -42678
9026d2678j04131C7705Q7715D8939b13429A35495b41843g3484k75248f4238j498
$$ -42678 -146809 37705 125420 48939 -213429 135495 -241843 -73484 -348732 -64238 -65736
9015f5736j09583A0119a38495J7584L8280J2458G773d9750A13628a04778L4067
$$ -65736 -175319 10119 -138495 -120911 -82631 -70173 7773 -49750 113628 -104778 -70711
9004g0711j8979q5375m40306A19529e5158k48036J03365A17930c52499B3655a2690
$$ -70711 -89690 -175065 -615371 119529 -55158 -303194 -199829 117930 -352499 23655 -12690
8992A03867c38971A34603d28979B28940a0770N100q1963r9886M6853H4337J5752
$$ 103867 -338971 134603 -428979 228940 -10770 -5670 -87633 -187519 -140666 84337 100089
8981A00089b9041g382k22281i3242m12353f7482a8511j17271E3785a44814A11110
$$ 100089 -29041 -7382 -229663 -93242 -505595 -67482 -18511 -135782 53785 -144814 111110
8969I882c7390B07815G8550a36162e9225p0058A9424O2732a85578A7715N2812
$$ 9882 -37390 207815 78550 -136162 -59225 -129283 19424 82156 -185578 17715 70527
8958G0527J40524c21665a49911P2101A6488R1925a7462j90744H575K8759R395
$$ 70527 211051 -321665 -149911 -77810 16488 108413 -17462 -208206 8575 37334 46729
8947D6729K73118b3666I4154a26033B75336a47135A18058a61074O6954o6447B15173
$$ 46729 319847 -23666 94154 -126033 275336 -147135 118058 -161074 -94120 -160567 215173
8935b9540E8801Q6590h4987m8983M4535C27552a9429A05473j8797o350d4282p6687
$$ -29540 58801 145391 -84987 -133970 -89435 327552 -19429 105473 86676 80326 -44282 -120969
8923a20969B42579a33904C71733A77107R97039n45966A10901N7480j2067a9184
$$ -120969 242579 -133904 371733 177107 1174146 628180 110901 168381 156314 -19184
8912b00355K6335M9203k25e3451j07821f6059c0764A08382a92197f1487k12770
$$ -200355 -174020 -124817 -125042 -53451 -161272 -66059 -30764 108382 -192197 -61487 -274257
8901b74257J2103c7822j20269C5803j4268c1823E6255A9282c7404N759k05750
$$ -274257 -262154 -37822 -158091 35803 21535 -31823 56255 19282 -37404 -31645 -237395
8890b37395N4790f045j90535A19803Q714g3125d013A34122c81919D8984J7183
$$ -237395 -182605 -6045 -196580 119803 128517 -73125 -4013 134122 -381919 48984 66167
8879F6167b42699L4367A49348a56535N8808H1701B2216a31753E5711b60355B64126
$$ 66167 -242699 -208332 149348 -156535 -97727 81701 22216 -131753 55711 -260355 264126
8867I694N0648b36831e5332o1294A07758c66393n558B89987a1746j23438d8983
$$ 9694 60342 -236831 -55332 -116626 107758 -366393 -371951 289987 -11746 -135184 -48983
$$ [...]
##END NTUPLES=NMR SPECTRUM
##END=
